##TITLE=XTC-1153_3
##JCAMPDX= 6.0         $$ Bruker NMR JCAMP-DX V2.0
##DATA TYPE= NMR SPECTRUM
##DATA CLASS= NTUPLES
##ORIGIN= BRUKER
##OWNER= patiny
$$ 1.79 TOPSPIN		Version 3.0
$$ 2012-05-20 02:15:19.941 +0200  patiny@icmbsg005
$$ Compression mode = diff/dup
##.OBSERVE FREQUENCY= 400.13188181139
##.OBSERVE NUCLEUS= ^1H
##.ACQUISITION MODE= SIMULTANEOUS (DQD)
##.ACQUISITION SCHEME= undefined
##.AVERAGES= 16
##.DIGITISER RES= 23
##SPECTROMETER/DATA SYSTEM= spect
##.PULSE SEQUENCE= zg30
##.SOLVENT NAME= D2O
##.SHIFT REFERENCE= INTERNAL, D2O, 1, 11.697
##AUDIT TRAIL= $$ (NUMBER, WHEN, WHO, WHERE, PROCESS, VERSION, WHAT)
$$ ##TITLE= Audit trail, TOPSPIN		Version 3.0
$$ ##JCAMPDX= 5.01
$$ ##ORIGIN= Bruker BioSpin GmbH
$$ ##OWNER= patiny
$$ $$ /opt/data/patiny/nmr/XTC-1153_3/10/pdata/1/auditp.txt
$$ ##AUDIT TRAIL=  $$ (NUMBER, WHEN, WHO, WHERE, PROCESS, VERSION, WHAT)
(   1,<2012-05-20 02:15:18.078 +0200>,<patiny>,<icmbsg005>,<go>,<TOPSPIN 3.0>,
      <created by zg
	started at 2012-05-20 02:13:13.228 +0200,
	POWCHK enabled, PULCHK disabled,
       configuration hash MD5:
       77 C7 B7 C4 10 F4 BA 30 64 2E BB 52 82 F2 DA 41
       data hash MD5: 64K
       C8 F2 2A EC 68 B5 A4 38 80 6C E2 A3 DA 95 B9 F6>)
(   2,<2012-05-20 02:15:18.610 +0200>,<patiny>,<icmbsg005>,<audit>,<TOPSPIN 3.0>,
      <user comment:
       ICON-NMR User ID: patiny
       data hash MD5: 64K
       C8 F2 2A EC 68 B5 A4 38 80 6C E2 A3 DA 95 B9 F6>)
(   3,<2012-05-20 02:15:19.211 +0200>,<patiny>,<icmbsg005>,<proc1d>,<TOPSPIN 3.0>,
      <Start of raw data processing
       ef LB = 0.3 FT_mod = 6 PKNL = 1 SI = 64K 
       data hash MD5: 64K
       7B 18 38 F1 B2 2F 5A 7B AF 96 2B 28 BB C8 56 F8>)
(   4,<2012-05-20 02:15:19.586 +0200>,<patiny>,<icmbsg005>,<proc1d>,<TOPSPIN 3.0>,
      <apk 
       data hash MD5: 64K
       1C D2 5C F3 BA A8 47 E9 61 A1 3D 23 0A B0 B0 3B>)
(   5,<2012-05-20 02:15:19.626 +0200>,<patiny>,<icmbsg005>,<proc1d>,<TOPSPIN 3.0>,
      <abs ABSG = 5 
       data hash MD5: 64K
       C7 13 B3 ED 6F 36 E0 E9 53 82 C2 E1 14 96 33 A7>)
$$ ##END=
$$ 
$$ $$ hash MD5
$$ $$ AD 48 99 09 4D A9 D1 B5 9A A4 C9 89 6C 35 3F FE
##$RELAX= 
##$RELAX= 
##$RELAX= 
##$RELAX= 
##$RELAX= 
##$RELAX= 
##$RELAX= 
##$RELAX= 
##$RELAX= 
##$RELAX= 
##$RELAX= 
##$RELAX= 
##$RELAX= 
$$ Bruker specific parameters
$$ --------------------------
##$DATPATH= </opt/data/patiny/nmr>
##$EXPNO= 10
##$NAME= <XTC-1153_3>
##$PROCNO= 1
##$ACQT0= -3.02521000389291
##$AMP= (0..31)
100 100 100 100 100 100 100 100 100 100 100 100 100 100 100 100 100 100
100 100 100 100 100 100 100 100 100 100 100 100 100 100
##$ANAVPT= -1
##$AQSEQ= 0
##$AQ_mod= 3
##$AUNM= <au_zg>
##$AUTOPOS= <33 >
##$BF1= 400.13
##$BF2= 400.13
##$BF3= 400.13
##$BF4= 400.13
##$BF5= 400.13
##$BF6= 400.13
##$BF7= 400.13
##$BF8= 400.13
##$BYTORDA= 0
##$CAGPARS= (0..11)
0 0 0 0 0 0 0 0 0 0 0 0
##$CFDGTYP= 0
##$CFRGTYP= 9
##$CHEMSTR= <none>
##$CNST= (0..63)
1 1 145 1 1 1 1 1 1 1 1 1 1 1 1 1 1 1 1 1 1 1 1 1 1 1 1 1 1 1 1 1 1 1 1
$$ [...]
##$TE1= 298.3802
##$TE2= 0
##$TE3= 0
##$TE4= 0
##$TEG= 300
##$TE_PIDX= 1
##$TE_STAB= (0..8)
2 2 0 0 0 0 0 0 0
##$TL= (0..7)
0 120 120 120 120 120 120 120
##$TP= (0..7)
150 150 150 150 150 150 150 150
##$TPNAME0= <>
##$TPNAME1= <>
##$TPNAME2= <>
##$TPNAME3= <>
##$TPNAME4= <>
##$TPNAME5= <>
##$TPNAME6= <>
##$TPNAME7= <>
##$TPOAL= (0..7)
0.5 0.5 0.5 0.5 0.5 0.5 0.5 0.5
##$TPOFFS= (0..7)
0 0 0 0 0 0 0 0
##$TUNHIN= 0
##$TUNHOUT= 0
##$TUNXOUT= 0
##$USERA1= <>
##$USERA2= <>
##$USERA3= <>
##$USERA4= <>
##$USERA5= <>
##$V9= 5
##$VALIST= <>
##$VCLIST= <>
##$VD= 0
##$VDLIST= <>
##$VPLIST= <>
##$VTLIST= <>
##$WBST= 1024
##$WBSW= 9
##$XGAIN= (0..3)
0 0 0 0
##$XL= 0
##$YL= 0
##$YMAX_a= 8946540
##$YMIN_a= -3189542
##$ZGOPTNS= <>
##$ZL1= 120
##$ZL2= 120
##$ZL3= 120
##$ZL4= 120
##$ABSF1= 11.697
##$ABSF2= -2.290992
##$ABSG= 5
##$ABSL= 3
##$ALPHA= 0
##$AQORDER= 0
##$ASSFAC= 0
##$ASSFACI= 0
##$ASSFACX= 0
##$ASSWID= 0
##$AUNMP= <save_auto_nonLDAP.pm>
##$AXLEFT= 0
##$AXNAME= <>
##$AXNUC= <1H>
##$AXRIGHT= 0
##$AXTYPE= 0
##$AXUNIT= <>
##$AZFE= 0.1
##$AZFW= 0.1
##$BCFW= 0
##$BC_mod= 0
##$BYTORDP= 0
##$COROFFS= 0
##$CY= 15
##$DATMOD= 1
##$DC= 0
##$DFILT= <>
##$DTYPP= 0
##$ERETIC= no
##$F1P= 0
##$F2P= 0
##$FCOR= 0.5
##$FTSIZE= 65536
##$FT_mod= 6
##$GAMMA= 0
##$GB= 0
##$INTBC= 1
##$INTSCL= 1
##$ISEN= 128
##$LB= 0.3
##$LEV0= 0
##$LPBIN= 0
##$MAXI= 10000
##$MC2= 0
##$MEAN= 0
##$ME_mod= 0
##$MI= 0
##$NCOEF= 0
##$NC_proc= -3
##$NLEV= 6
##$NOISF1= 0
##$NOISF2= 0
##$NSP= 0
##$NTH_PI= 0
##$NZP= 0
##$OFFSET= 11.697
##$PC= 1
##$PHC0= 120.0795
##$PHC1= -10.71488
##$PH_mod= 1
##$PKNL= yes
##$PPARMOD= 0
##$PPDIAG= 0
##$PPIPTYP= 0
##$PPMPNUM= 2147483647
##$PPRESOL= 1
##$PSCAL= 4
##$PSIGN= 0
##$PYNMP= <proc.py>
##$REVERSE= no
##$SF= 400.13
##$SI= 65536
##$SIGF1= 0
##$SIGF2= 0
##$SINO= 0
##$SIOLD= 65536
##$SPECTYP= <>
##$SREGLST= <1H.D2O>
##$SSB= 0
##$STSI= 65536
##$STSR= 0
##$SW_p= 5597.01492537316
##$SYMM= 0
##$S_DEV= 0
##$TDeff= 65536
##$TDoff= 0
##$TI= <>
##$TILT= no
##$TM1= 0
##$TM2= 0
##$TOPLEV= 0
##$USERP1= <>
##$USERP2= <>
##$USERP3= <>
##$USERP4= <>
##$USERP5= <>
##$WDW= 1
##$XDIM= 65536
##$YMAX_p= 331784072
##$YMIN_p= -30723
##$CURPLOT= <Cups-PDF>
##$CURPRIN= <$Cups-PDF>
##$DFORMAT= <normdp>
##$LAYOUT= <+/1D_H.xwp>
##$LFORMAT= <normlp>
##$PFORMAT= <normpl>
$$ End of Bruker specific parameters
$$ ---------------------------------
##NTUPLES= NMR SPECTRUM
##VAR_NAME=  FREQUENCY,     SPECTRUM/REAL,   SPECTRUM/IMAG
##SYMBOL=    X,             R,               I
##VAR_TYPE=  INDEPENDENT,   DEPENDENT,       DEPENDENT
##VAR_FORM=  AFFN,          ASDF,            ASDF
##VAR_DIM=   65536,         65536,           65536
##UNITS=     HZ,            ARBITRARY UNITS, ARBITRARY UNITS
##FACTOR=    0.0854036701259332, 1,          1
##FIRST=     5596.92952170303, -7895,        -7919
##LAST=      0,             -556,            -24236
##MIN=       0,             -30723,          0
##MAX=       5596.92952170303, 331784072,    0
$$ Real data points
##PAGE= N=1
##DATA TABLE= (X++(R..R)), XYDATA
$$ [...]
39875f39m355n635l055k65J175k156k486J442K810L512K568c487f27F56I4b320
39858b760m50l664l721k771p8J930J549r90j776L404a785C627M026L984K265k513
39842A1389B816d918m407l483k654q91L56K07R50J527K504K644J805Q16b225C042
39825E184r44m31j194b74m855o706j891K456K168j47j693P16K653K463L10j331
39809f131j858l9r2j597J787c197e81M3r89r18A789L413A675c048l637k483o64
39792i832l4J05j205l51K236K132J260J798P31j07l06j690j010K033a601H9J183
39775A272m72B96a619l264k004J801i47B7f76j497l030l155j335N52L062a88D260
39757E934J216r95B676a006j854k86l11l327l874m071J37M046M202b269P07n99
$$ plain form
39875 -639 -4994 -10629 -13684 -13949 -12774 -14930 -17416 -15974 -13164 -9652 -7084 -3487 -627 656 94 -2320
39858 -2760 -3210 -6874 -10595 -13366 -13444 -11514 -9965 -10955 -12731 -9327 -1785 3627 7653 11637 13902 11389
39842 11389 2816 -4918 -9325 -12808 -15462 -16353 -15997 -15790 -14840 -13313 -10809 -8165 -6360 -5544 -2225 3042
39825 5184 4240 3809 2615 -274 -5129 -11835 -13726 -11270 -9102 -9249 -10942 -10226 -7573 -5110 -4800 -6131
39809 -6131 -7989 -8028 -8120 -9717 -7930 -3197 -581 -538 -1527 -2445 1789 5202 1675 -3048 -6685 -9168 -9832
39792 -9832 -9866 -9761 -10966 -11317 -9081 -6949 -5689 -3891 -3160 -3267 -3573 -5263 -6273 -4240 -1601 89 1272
39775 1272 800 296 -1619 -4883 -6887 -5086 -947 27 -676 -2173 -5203 -8358 -9693 -9141 -6079 -188 4260
39757 5934 7150 6155 2676 -1006 -2860 -3146 -3457 -6784 -10658 -14729 -14592 -10546 -6344 -2269 -1562 -2161
39741b161d36fB51e37k328k025j098j62m44J984F10J389B08a13q05j246O91d53
39722a644j506k52j291q17J989J026m62a114H33R28B41c37C57J24J252O2J66B42
39703c623k886k5J545p00N3b061b50j928k656J570H70R76H90c10j203j452j480
39686d445r60K24l174l188J64J602c807H98l80b215j634L08O90j37J113A019K230
39669C249P93J093j024B21a813l87O66a28j68j231K7l0o3j919k889j398k339k658
39651a2796n80J830J47j019L268d563b139K94j144J002D43J963J096J160J383
39636F045J338n74k110A730r3J977A201c983j198a936C40J90K136R28j770a655
39619d842R03f36A307M70F56e92A20g87l219k174J935Q13j995N45J359f51C522
$$ plain form
39741 -2161 -436 -6 251 -537 -2865 -4890 -5988 -6150 -6594 -4610 610 1999 208 -113 -918 -2164 -1473 -453
39722 -1644 -3150 -3402 -4693 -5510 -3521 -2495 -2957 -1114 833 1761 241 -337 357 481 1733 1795 1961 242
39703 -3623 -6509 -6534 -4989 -5689 -5636 -2061 -250 -2178 -4834 -3264 870 1846 890 -310 -1513 -2965 -4445
39686 -4445 -5405 -5181 -8355 -11543 -11379 -9777 -3807 898 518 -2215 -3849 -3541 -2851 -2988 -1875 1019 3249
39669 3249 4042 5135 4111 221 -1813 -2200 -1534 -128 -296 -1527 -1500 -1530 -1593 -3512 -6401 -7799 -10138 -12796
39651 -12796 -13376 -11546 -11399 -12418 -9150 -4563 -2139 -1845 -2989 -1987 443 2406 3502 4662 6045
39636 6045 7383 6809 4699 1730 1637 3614 1201 -3983 -5181 -1936 340 530 2666 3594 1824 -1655
39619 -4842 -3939 -636 1307 1777 656 -592 120 -787 -4006 -6180 -4245 -3432 -5427 -4882 -3523 -651 3522
39601C104b949m438P81K908a758qE8L212O29j322m0Q01F1b633o72k128J4J819
39583c600M14k46J284j7k562k634j412l420o091l080j07J425K955p84l054k01
39567b1130K195M067K899L01j798j812k647j615L091Q221a890a66j597k855j125
39552e743J24J412a997G15J331F08a961j657o18k41j016k131o77J255o43j988
39536i677M53J199q47p01J829K881L9n65M64K83j042j421p44J059J744a395B339
39518B702c23l467l010M23a913B001J977I94b659o2p84l252j012R84O37o29j61
39501f938P11J260J606n04k866k041J803b690B604K065k285p81J505M53A554n34
39485A020L38m18a304k726N68a261k51k83O30E82M001N761L970j386j143N18l79
$$ plain form
39601 3104 -2949 -7387 -6606 -3698 -1758 -1766 58 3270 3899 2577 2537 3338 61 -2633 -3305 -5433 -5419 -3600
39583 -3600 -3186 -3432 -2148 -2165 -4727 -7361 -8773 -12193 -18284 -21364 -21471 -20046 -17091 -17875 -20929 -21130
39567 -21130 -18935 -14868 -11969 -11668 -13466 -15278 -17925 -19540 -16449 -8228 -1890 -166 -1763 -4618 -5743
39552 -5743 -5619 -4207 -1997 715 2046 608 -1961 -3618 -4236 -4477 -5493 -7624 -8301 -7046 -7689 -9677
39536 -9677 -9224 -8025 -8872 -9573 -7744 -4863 -4824 -5389 -4925 -4642 -5684 -7105 -7849 -6790 -5046 -1395 2339
39518 2702 -323 -3790 -6800 -6377 -1913 2001 3978 994 -2659 -2721 -3505 -6757 -7769 -6785 -6148 -6777 -6938
39501 -6938 -6227 -4967 -3361 -3865 -6731 -8772 -6969 -2690 2604 4669 2384 1603 3108 3561 1554 1020
39485 1020 1358 940 -1304 -4030 -3462 -1261 -1512 -1795 -1165 582 4583 10344 14314 12928 11785 12303 11924
39468A1924j338o54N68n74k428l483H21N70Q93m64L0O1P23pN10K258J241k076
39450D560a815k020F67O031M215L58j898j850k843A197a644j482j173k585l445
39435a0329k443J179K334k67k112J698c859fA165J66A77b275j165L79c99D115
39418F731N53p2l64r74j899r58P9H13b540j345O18i12c69j231M06e54A006K819
39400C825P14n65q60m51R06J780J138K088L684J073l057k265J204M105N187N352
39384B3858O753J0740J1111J0209J1684J2189R924N495N806Q957R391J3283J7187
39371A56587J2514N670L270J282m440j1533j4205j2002j2512j5400j5131j3421
39359H0679j3353j1190q471q001m556k749m415m046j734R14M87L22Q20Q5j533
$$ plain form
39468 11924 10586 9932 10500 9926 7498 4015 821 1391 2284 1820 1850 1911 2634 2627 3137 5395 6636 4560
39450 4560 -1815 -3835 667 6698 10913 11271 9373 7523 4680 1197 -1644 -3126 -4299 -6884 -10329
39435 -10329 -12772 -11593 -9259 -9526 -11638 -9940 -3859 -6 1165 1331 177 -2275 -3440 -3061 -399 4115
39418 6731 7284 7212 6848 5874 3975 3017 3096 813 -2540 -3885 -3267 -912 -369 -1600 -1194 -554 1006 3825
39400 3825 4539 3974 3114 2663 3569 5349 6487 8575 12259 13332 10275 8010 9214 13319 18506 23858
39384 23858 30611 41351 52462 62671 74355 86544 96468 101963 107769 116726 126117 139400 156587
39371 156587 169101 174771 178041 179323 174883 163350 149145 137143 124631 109231 94100 80679
39359 80679 67326 56136 47665 39664 35108 32359 27944 23898 22164 23078 23565 23887 24707 24792 23259
39344B3259l385n215l151n2j027k443K491O237M463l13n680n717k598j973k328
39329B568j003J195J250q54A288a98j837o24B39L323K432J022r78k825a380l897
39313e277j075J181j596k188k291l455m43N673a852B449J077J055J326L167J054
39298A0128k718l362j322A066a701N40I58O59M27K547L412K504J363p28k964D056
39281A672B95b533k174L86J855J049j495j957j522J775g78F24J310J050A132a585
39264c270n25R9j197k389k42O26J6J15K525f52C386L899P90j0j274j639J86m2
39246E296A935I6K234J940A291c167k393k231k469J473c723a92p19l495j664Q57
39230e213j445l930k343K464L313K252J815h46n92l085r74K414A205J869m45A214
$$ plain form
39344 23259 19874 14659 11508 11456 10429 7986 10477 16714 21177 20864 15184 9467 6869 4896 2568
39329 2568 1565 2760 4010 3156 1288 -198 -2035 -2659 239 3562 5994 7016 6038 3213 -1380 -5277
39313 -5277 -6352 -5171 -6767 -8955 -11246 -14701 -15144 -9471 -1852 2449 3526 4581 5907 9074 10128
39298 10128 7410 4048 2726 1066 -1701 -1161 958 1617 2044 4591 8003 10507 11870 11142 8178 4056
39281 1672 295 -2533 -4707 -4321 -2466 -1417 -2912 -4869 -6391 -4616 -778 624 1934 2984 1132 -1585
39264 -3270 -3795 -3696 -4893 -7282 -7524 -6898 -6882 -6767 -4242 -652 3386 7285 8075 8065 6791 5152 5338 5296
39246 5296 1935 96 2330 4270 1291 -3167 -5560 -7791 -10260 -8787 -3723 -192 -911 -4406 -6070 -5213
39230 -5213 -6658 -10588 -12931 -10467 -7154 -4902 -3087 -846 -1438 -4523 -5497 -3083 1205 3074 2629 1214
39213a614k743o39a768d26k679k801n07l22k445j376K6k067j146J723M073b591
39196B653M320L981J772l40k540B593c564j559J074Q18O61B099L819J89P86O18
39180G511J286J167p77j690k274j667j264B27a482j672n98k862m678L96L600L095
39164d201L8l062j780J182Q70j814j869j019m67K807J852j823j551q97J532M770
39148e432b085j34q72a413Ib01B944N413J299m209A553b22D11J988j161b584l103
39131e687r19j705m336l743L94J611K95L537L814J109O78L28L79pk4R59J362f92
39112b718m412R06i16B541A006a495j545m81a590H6a211r57f58Rj957j783k455
39095f844O5c222J62j237q27j731j398R89J948Q85o87l87J846a355C34M02O33
$$ plain form
39213 -1614 -4357 -4996 -1768 -426 -3105 -5906 -6413 -6735 -9180 -10556 -10530 -12597 -13743 -12020 -7947 -2591
39196 2653 6973 10954 12726 12386 9846 2593 -3564 -5123 -4049 -3231 -2570 2099 5918 6107 6893 7511
39180 7511 8797 9964 9187 7497 5223 3556 2292 227 -1482 -3154 -3752 -6614 -11292 -10896 -7296 -4201
39164 -4201 -4163 -7225 -9005 -7823 -6953 -8767 -10636 -11655 -12122 -9315 -7463 -9286 -10837 -11734 -10202 -5432
39148 -5432 -2085 -2219 -3091 -1413 9 -201 2944 8357 9656 5447 1553 -222 411 2399 1238 -2584 -5687
39131 -5687 -6606 -8311 -12647 -16390 -15996 -14385 -14090 -10553 -6739 -5630 -4952 -4624 -4245 -4252 -4276 -3317 -1955 -692
39112 -2718 -7130 -6224 -916 2541 1006 -1495 -3040 -3521 -1590 86 -1211 -2168 -658 -649 -2606 -4389 -6844
39095 -6844 -6779 -3222 -3060 -4297 -5124 -6855 -8253 -7264 -5316 -4431 -5118 -5505 -3659 -1355 334 736 1369
39078A369N18q52j12J066Q87R72K368J456J197K166J759q16l475l539k350H63
39061A38g83C73i67l938j266J30R50a927C31a056k558Q8N00k0P91A43L826P22
39043D691E92c521a630B595L033R78k213F19b850l374k194K043L095a240K86R1
39027h63H7e64A89L765L886L695J712k553j944j710B548e087o277N70J475p53
39011a0072o35M93R51R13N02L378g25n19p68H18K589J610J284J032k79C278A209
38993A574J785p0B5c278j113N69j022j219O22J471O2R23A356N950N483J364j736
38976A2417l257m291k137A142i44j067k1O74a37C000N515K916l985B14c379a687
38959B34j00g20j385j198m25j55J16J036A46J634o8j98d4k216l75m49j07k56f67
$$ plain form
39078 1369 1887 1035 923 1989 2876 3848 6216 7672 8869 11035 12794 11978 8503 4964 2614 863
39061 138 -783 373 -967 -4905 -6171 -6041 -5091 -1927 331 -1056 -3614 -3526 -3026 -3046 -2255 143 3969 4691
39043 4691 592 -3521 -1630 2595 5628 6606 4393 619 -2850 -6224 -8418 -6375 -3280 -1240 -954 -863
39027 -863 87 -564 189 3954 7840 11535 13247 10694 8750 7040 2548 -5087 -11364 -10794 -9319 -10072
39011 -10072 -10707 -10214 -9263 -8350 -7848 -4470 -725 -1244 -2012 818 3407 5017 6301 7333 7054 3278 1209
38993 1574 3359 3289 25 -3278 -4391 -3822 -4844 -6063 -5441 -3970 -3908 -2985 1356 7306 12789 14153 12417
38976 12417 9160 4869 2732 1142 -944 -2011 -2032 -1358 -137 3000 8515 11431 7446 214 -3379 -1687
38959 234 134 -720 -2105 -3303 -3728 -3883 -3767 -2731 146 1780 1712 1514 -44 -2260 -2635 -3084 -3191 -3447 -667
38939F665N909J552n29m55n99j7k014m477j676L292L827j337l198n06l28r78A792
38921c194j959K468h1I31J330M71o78k23K21M89k45B74b220r62P9k236l464k241
38903a1044m40m65M7k80M43K582K148K472J296k032m606l341J78J820J471j254
38887a1005q54K463L330J762k264m040o01M906b016o32q73f77D667L519P78l756
38871E208b967m639J395K680Q34r47k855l118j297K394c322C60J928J829P79l95
38855D501N55q93g19m428k901K38a854D003K044l020a246j744P02Q3j707j829
38839e741r75M51M18o49j306J054L180e07A157E15a607k208r57k539j951Q40J226
38822g196K96j481p06J801J649M2pK781E52R7B76K741L146K353J044j239k208
$$ plain form
38939 6665 12574 14126 13597 13142 12543 12526 10512 6035 4359 7651 11478 10141 6943 6437 6109 5131 1792
38921 -3194 -5153 -2685 -81 931 2261 2732 2054 1831 2052 2541 2296 274 -2220 -3182 -3103 -5339 -8803 -11044
38903 -11044 -11484 -11949 -11902 -12182 -11739 -9157 -7009 -4537 -3241 -5273 -9879 -13220 -13042 -11222 -9751 -11005
38887 -11005 -11859 -9396 -6066 -4304 -6568 -10608 -11209 -6303 -2016 -2648 -3521 -677 4667 8186 8964 5208
38871 5208 -2967 -7606 -6211 -3531 -2697 -3644 -6499 -9617 -10914 -8520 -3322 360 2288 4117 4896 4501
38855 4501 5056 4163 -719 -5147 -8048 -7810 -1854 4003 6047 3027 -1246 -2990 -2288 -2205 -3912 -5741
38839 -5741 -6716 -6265 -5847 -6496 -7802 -6748 -3568 -507 1157 515 -1607 -3815 -4772 -7311 -9262 -8422 -7196
38822 -7196 -6900 -8381 -9087 -7286 -5637 -5595 -5602 -2821 552 649 276 3017 6163 8516 9560 8321 6113
38805F113k011j304M04k2Q10K119J553j213j279j023j194F40f84l56k282k005
38789e327m45l72j117n61J138b251A065b63k205j33a20A743D24K96K191L496K513
38772H920J594L996K481k490l87L56K40L79k78j070k899n001B838J263L155L052
38756A0308O59j637o88m24k872j375O69o68j004j034P67J135r7m76k0j581b08
38738a496k59A002M870K946k81j27P78J89r54K530R27j803K31L282L015O38p23
38721A6520k060j207Jk72q48k371m409F44e131m802r18J369L53P51L101b087f73
38703h73l6I99N660M521j148j103J116L18j145j615k102m58n34o98K025J196M27
38686G459J153j255l488A871c3B43K995J771O93j380j904K128K946j37j24j472
$$ plain form
38805 6113 4102 2798 3202 3180 3990 6109 7662 6449 5170 4147 2953 640 -684 -1040 -3322 -5327
38789 -5327 -5772 -6144 -7261 -7822 -6684 -2251 1065 -263 -2468 -2601 -120 1743 424 720 2911 6407 8920
38772 8920 10514 14510 16991 14501 14114 14470 14710 15089 14811 13741 10842 5841 2838 4101 7256 10308
38756 10308 10967 9330 8642 8218 5346 3971 4640 3972 2968 1934 2701 3836 3739 3263 3243 1662 -208
38738 -1496 -1755 1002 5872 8818 8537 8410 9188 9377 8423 10953 11880 10077 10308 13590 16605 17243 16520
38721 16520 14460 13253 13254 12982 12134 9763 5354 644 -5131 -9933 -10851 -9482 -9129 -8378 -5277 -2087 -673
38703 -873 -909 999 6659 11180 10032 8929 10045 10363 9218 7603 5501 5043 4509 3811 5836 7032 7459
38686 7459 8612 7357 3869 1871 -33 243 3238 5009 5702 4322 2418 4546 7492 7355 7231 5759
38670E759k546A290e5B85K73P24q9K173N678L593J050L63k690k075K85K474L524
38653A5568J248J786J919j696m209j878q68j439m24K201L638K62j165l346E492
38637B34c800l529o04K157b531A662N275J461l129n04O329N158R7j64J921M238
38621B2344K455o94m343o245j508J934L368J697R4p48L73J978m36k312k412k231
38605A3314j160L480M032K22L05J393k117m467j395J408J222j74q36P2Q37j723
38589A4413k028Q17R40M86j58J633L052P73j603j211j331J412M458L096j486j954
38573B1309m57N18K66M85J202M48j214k706k012K18J900J772n34j759M10q12j038
38556A7996j4P26K93j357KK637J557n53j165N55J904J4j912m89L161M954N914
$$ plain form
38670 5759 3213 1290 -55 285 558 1282 1193 3366 9044 12637 13687 14050 11360 9285 9570 12044 15568
38653 15568 16816 18602 20521 18825 14616 12738 11870 10431 10007 12208 15846 16108 14943 11597 5492
38637 234 -3800 -7329 -7933 -5776 -2531 1662 6937 8398 5269 4765 11094 16252 16349 16185 18106 22344
38621 22344 24799 24105 19762 13517 12009 13943 17311 19008 19102 18354 18727 20705 20269 17957 15545 13314
38605 13314 12154 15634 19666 19888 20193 21586 19469 15002 13607 15015 16237 16063 15227 15299 16136 14413
38589 14413 12385 13202 14142 14628 14470 16103 19155 19928 18325 17114 15783 17195 21653 24749 23263 21309
38573 21309 20852 21370 21636 22121 23323 23771 22557 19851 17839 18057 19957 21729 21195 19436 19846 19034 17996
38556 17996 17982 18708 19001 17644 17646 20283 21840 21287 20122 20677 22581 22595 20683 20194 23355 28309 34223
38539C4223N065K332L14q53p37j92N53j394k597j929q16j33J246J554Q19J000
38523C8455M39J496k04l056j632jo26k449k690N29K234K469K566K489J754M45
38507D2218k056j127J795J866N60j696n58J034J165J002j920K8K748K318J246
38492D8623R86K68j691q04J951K014M293N902J928J833L661O96K85L074R30l792
38476G0157k625K025N166K961K330J960K342L800J486J010J910p4k199l442l341
38461H3466p05L262L864J01Q95M832M893L447M547N042K451J049N49K334L266
38446A23293K373J968J977J947K608M423N065N148P749J0419N558J285J794N570
38432A81177J0966J2534J0498L619K15M315P925R205J0355Q815P100R351J1503
$$ plain form
38539 34223 39288 41620 41934 41081 40344 40152 40705 39311 36714 34785 33969 33836 35082 36636 37455 38455
38523 38455 38894 40390 40186 37130 35498 35497 34871 32422 29732 30261 32495 34964 37530 40019 41773 42218
38507 42218 40162 39035 40830 42696 43256 41560 41002 42036 43201 44203 42283 42311 45059 47377 48623
38492 48623 49609 49877 48186 47382 49333 51347 55640 61542 63470 65303 68964 69660 69945 73019 73949 70157
38476 70157 67532 69557 74723 77684 80014 81974 84316 88116 89602 90612 92522 92448 90249 86807 83466
38461 83466 82761 86023 89887 89988 90883 95715 100608 104055 108602 113644 116095 117144 117693 120027 123293
38446 123293 125666 127634 129611 131558 134166 138589 143654 148802 156551 166970 172528 173813 175607 181177
38432 181177 192143 204677 215175 218794 219009 223324 231249 240454 250809 259624 266724 276075 287578
38419B87578J1496J0885J1250J4815J6964J6139J4503J4378J5216J8205J9306
38408D50735J8917K1843K5004K6480K6149K6827K9395L1494L3239L5538L9660
38397G65281M5376N0064N2221N5601N9013O2507O8059P4319P8908Q4078R1225
38386A486652J03254J15280J24846J35173J48783J70396J94983K21239K49901
38377B950507K85557L26448L64452M07631M63868N31692O15724P17659Q44230
38368G507768J007001J223563J498856J803622K092553K339310K551207K724653
38360B2748533K847027K900810K816341K471984J800268R13816L41r03096j841964
38351C3754060k725727l313889l455721l233752k828945k392658k006586j693288
$$ plain form
38419 287578 299074 309959 321209 336024 352988 369127 383630 398008 413224 431429 450735
38408 450735 469652 491495 516499 542979 569128 595955 625350 656844 690083 725621 765281
38397 765281 810657 860721 912942 968543 1027556 1090063 1158122 1232441 1311349 1395427 1486652
38386 1486652 1589906 1705186 1830032 1965205 2113988 2284384 2479367 2700606 2950507
38377 2950507 3236064 3562512 3926964 4334595 4798463 5330155 5945879 6663538 7507768
38368 7507768 8514769 9738332 11237188 13040810 15133363 17472673 20023880 22748533
38360 22748533 25595560 28496370 31312711 33784695 35584963 36498779 36499120 35596024 33754060
38351 33754060 31028333 27714444 24258723 21024971 18196026 15803368 13796782 12103494
38343A2103494j444784j237708j055459r03065p82009o86579o05493n28226m57650
38334D402521l98682l48967l04017k68857k42216k17947j95422j73406j54679
38325B098328j41985j29149j16187j07575r8484q8296q1389p4848p0251o6833
38315A123331o2061n6570n3383n2097m8516m3947l9129l4670l2495l2318l2142
38304F36003l1338l0441k5851k1010k0452j9159j9392k2021k1725j8799j7593
38293C88222j6031j3116j2102j0660r165j2125j6710j6113j1479q356p521p828
38281B47016o560n506l101k559l671k265l755m429m067m743n497o005n231n448
38267A84179m321m636o738o900o018q581o204j616k37j58p61R96K795l37l701
$$ plain form
38343 12103494 10658710 9421002 8365543 7462478 6680469 5993890 5388397 4860171 4402521
38334 4402521 4003839 3654872 3350855 3081998 2839782 2621835 2426413 2253007 2098328
38325 2098328 1956343 1827194 1711007 1603432 1504948 1416652 1335263 1260415 1190164 1123331
38315 1123331 1061270 1004700 951317 899220 850704 806757 767628 732958 700463 668145 636003
38304 636003 604665 574224 548373 527363 506911 487752 468360 446339 424614 405815 388222
38293 388222 372191 359075 346973 336313 327148 315023 298313 282200 270721 262365 254844 247016
38281 247016 240456 234950 231849 229290 225619 223354 219599 215170 211103 206360 200863 194858 189627 184179
38267 184179 179858 175222 168484 161584 155566 146985 140781 139165 138928 138770 138009 139005 141800 141463 137762
38252A37762m555n382p195m775j7j264k968n558p245l577M13J842R2j202j620
38237I4751j750l387n181l652l529l287j34p02l113j846k15kJ458k323n169j598
38221F0321N52N81P54j032j006k681l558m47R39K851J902j477k021k155j873r33
38205E0717J125L335L878R60l067m204m330k464q89k052k131j81o98m453m239
38190C1307j743J664K156J856L843L995J345J22J26r04k470m209m569l165j162
38175B8192j471m41J602K061L270L441K103N55L0J218O54j773P1J539k417l322
38159C5312J645L960K766P44r36l959m408k996l224l341k509j667o83J381K231
38144B4316J285K539J748K94J338J662j471m824m769o06N34l184k330Q10J918
$$ plain form
38252 137762 133207 127825 120630 115855 115838 114574 111606 106048 98803 95226 95639 97481 97573 96371 94751
38237 94751 93001 89614 84433 80781 77252 73965 73831 73129 70016 68170 67955 67953 69411 67088 61919 60321
38221 60321 60873 61454 62208 61176 60170 57489 53931 53484 54423 57274 59176 57699 55678 53523 51650 50717
38205 50717 51842 55177 59055 60015 56948 52744 48414 45950 45061 43009 40878 40697 39999 35546 31307
38190 31307 29564 31228 33384 35240 39083 43078 44423 44545 44671 43767 41297 37088 32519 29354 28192
38175 28192 26721 26280 27882 29943 33213 36654 38757 39312 39342 40560 41214 39441 39512 41051 38634 35312
38159 35312 36957 40917 43683 44427 43491 39532 35124 32128 28904 25563 23054 21387 20704 22085 24316
38144 24316 25601 28140 29888 30182 31520 33182 31711 26887 22118 21512 22046 18862 16532 17342 19260
38129A9260K354L729K379N42l26k791m133k740m85K11j443k387j638j852j733
38114H947j959n91R94j724B456P79M303L056J117o67q21k436k785P81N528L903
38098A5214J160j063j596k24L61p27k918l442j925L853M007L49n45o98k067l826
38082E913B340B35b37r70j205C68L705j157a949n565k582P27K300K846c18A329
38065A35J407K087Q39j286A042P86J044J121J499k73j960o54K042J010k352j296
38049B009C96g45A551K732J350j00j977n06K991l62B581D43h53j722J05f2H60
38031B560O10a963p705m740q24m85p32O55K903M039J182M8K505K522R08O7m75
38014b095e44B189J658L69A666a830k428K94a118I21K634J278p42N88p97A120
$$ plain form
38129 19260 21614 25343 27722 28264 27938 25147 21014 18274 17789 18000 16557 14170 12532 10680 8947
38114 8947 6988 6397 7391 5667 2456 3235 7538 10594 11711 11044 10223 7787 5002 5783 11311 15214
38098 15214 16374 15311 13715 13491 13852 13125 10207 6765 4840 8693 12700 13049 12504 11806 9739 5913
38082 5913 2340 235 -237 -1207 -2412 368 4073 2916 -1949 -7514 -10096 -9369 -7069 -4223 -318 1329
38065 135 1542 3629 4468 3182 1042 1828 2872 3993 5492 5219 3259 2605 4647 5657 3305 2009
38049 2009 396 -745 1551 4283 5633 5533 3556 3050 6041 5679 2581 443 -853 -2575 -2470 -62 860
38031 2560 3170 -1963 -9668 -14408 -15232 -15717 -16449 -15794 -12891 -8852 -7670 -7622 -5117 -2595 -1687 -1620 -2095
38014 -2095 -544 2189 3847 4216 1666 -1830 -4258 -3964 -1118 921 3555 4833 4091 4679 3882 1120
37997b91j814h01A212C39b355k169r3J963A048M020K4B419f2j625J7L45d79G64
37978B05a283b27D02J51R57P90k36N12K388J639j073j870j064m09A35b744j402
37961d146j450k662j340k49J71r92O90K366c403I48L20C94M05J654K170o91j708
37944B224I90m50a875j730d80C123M68e38n180n293k173L212L074J475b588e96
37927b177l796j755J157Q96K003e39A562j25b956m611j381o3k74J704K697N47
37911d337k028k221l92L395a542A95a253m056l097j097J03o99p71o25J3q50j712
37894a4044Pj188j918k67K534N466d207a146G35R73J027J28C97a815r90j780m268
37877h853m644j388J228k1p35M44K612K362K346J402l244o112l805K37K219J321
$$ plain form
37997 -291 -2105 -801 1212 339 -2355 -4524 -4617 -2654 1048 5068 5092 2419 -62 -1687 -1670 -1325 -479 764
37978 205 -1283 -227 402 553 1510 2300 2064 2576 4964 6603 5530 3660 2596 2187 135 -2744 -4146
37961 -4146 -5596 -8258 -9598 -9847 -9676 -10668 -9978 -7612 -3403 948 1268 394 799 2453 4623 3932 2224
37944 2224 990 540 -1875 -3605 -480 3123 3591 -538 -5718 -11011 -13184 -9972 -6898 -5423 -2588 -596
37927 -2177 -5973 -7728 -6571 -5675 -3672 -539 1562 1437 -2956 -7567 -8948 -9011 -9285 -7581 -4884 -4337
37911 -4337 -6365 -8586 -8978 -5583 -1542 195 -1253 -5309 -8406 -9503 -9400 -10099 -10870 -11495 -11482 -12332 -14044
37894 -14044 -14037 -15225 -17143 -17410 -14876 -9410 -4207 -1146 735 1708 2735 2863 397 -1815 -2805 -4585 -8853
37877 -8853 -13497 -14885 -13657 -13678 -14413 -13969 -11357 -8995 -6649 -5247 -8491 -14603 -18408 -18171 -15952 -14631
37861a4631j196O44K853O01r66J04K62l78l487m913k754K657L490J695n28j777
37845a8324Q34M404N635K765r70k324j663J555J167m7J677a935B781L146O64J121
37829G712J377O00j35N75K56k256C580B97b47P3j292j871j343l537l800Q9K648
37812i280L141Q74n1Q98K026F10J898I58c683o244p079l591n36J183J596L897
37796a4457K537L78J759K893P19j176j716k765p78J912J854n5p05J496K33k719
37780a0590q10K289L175b903h49j873l675j863K2K069K505g8E728Q81B404a19
37763a547j674j00J470A164L094J745Q5p66k021c07k646l765n111n417L18O675
37747a0253N059K006q75l74i22B540M28l67r81b511m307j57b979ij984l731j527
$$ plain form
37861 -14631 -15827 -15183 -12330 -11729 -12695 -12591 -12329 -12707 -16194 -21107 -23861 -21204 -17714 -16019 -16547 -18324
37845 -18324 -17490 -13086 -7451 -4686 -5656 -7980 -9643 -8088 -6921 -6968 -5291 -1935 2781 5927 6591 7712
37829 7712 9089 9689 9554 10129 10385 8129 3580 297 -247 -174 -1466 -3337 -4680 -8217 -12017 -11928 -9280
37812 -9280 -6139 -5265 -5316 -4418 -2392 610 2508 958 -3683 -9927 -17006 -20597 -21133 -19950 -18354 -14457
37796 -14457 -11920 -11542 -9783 -6890 -6171 -7347 -9063 -11828 -12606 -10694 -8840 -8895 -9600 -8104 -7871 -10590
37780 -10590 -11400 -9111 -5936 -2903 -849 -2722 -6397 -8260 -8238 -6169 -3664 -78 5728 6609 2404 -119
37763 -1547 -3221 -3321 -1851 1164 4258 6003 6088 5322 3301 -307 -2953 -6718 -11829 -17246 -16928 -10253
37747 -10253 -5194 -3188 -4063 -4437 -922 2540 2968 2601 1620 -2511 -6818 -6975 -2979 -9 -1993 -5724 -7251
37730g251J01k826m501j898Q0L571L661J91j92J548J514or02J206P35k194k214
37713i377j694L16K324N98m16N58J010j467l987j223K103e564b072p02l063l083
37697h920J244K671j028K82J428K03k205l207j167J086K503b830A032K172J715
37682D919n90A637a399k036R86b25B04b34n1l18j635l233k845Q52c603C63K506
37665B869l75i53m818m355l495j904J386J030j445l472k295M38R40L830N600K303
37649g210L97N72j694l419j501N57K302c506E249O666L175o54k854m249B415c098
37632g483j319K841f17C325O93j443j103L62J42n31k2J017F23c678m197k085J902
37615h058L571b217B754O334J285k856k117k77o66A597a730j796l676j273J461
$$ plain form
37730 -7251 -7150 -9976 -14477 -16375 -16295 -12724 -9063 -8872 -9064 -7516 -6002 -6008 -6910 -5704 -4969 -7163 -9377
37713 -9377 -11071 -10755 -8431 -7833 -8249 -7691 -6681 -8148 -12135 -13358 -11255 -5564 -2072 -2774 -5837 -8920
37697 -8920 -7676 -5005 -6033 -5751 -4323 -4120 -6325 -9532 -10699 -9613 -7110 -2830 1032 3204 4919
37682 4919 4329 1637 -1399 -3435 -2449 -225 204 -234 -285 -603 -2238 -5471 -8316 -7464 -3603 363 2869
37665 2869 2494 -953 -5771 -10126 -13621 -15525 -14139 -13109 -14554 -18026 -20321 -19883 -18943 -15113 -9513 -7210
37649 -7210 -6813 -6241 -7935 -11354 -12855 -12298 -9996 -3506 5249 11915 15090 14436 11582 7333 2415 -3098
37632 -7483 -8802 -5961 -617 3325 4018 2575 1472 1834 1976 1445 1423 2440 623 -3678 -7875 -9960 -8058
37615 -8058 -4487 -2217 2754 9088 10373 7517 5400 5123 4457 1597 -1730 -3526 -7202 -8475 -7014
37600g014P81Q05j354m130k192L237L815m95j921R69L639J15j742J895J181l415
37584e826m259J130M277b162M33k9J06j021p16l46J215A343K625j119G14j64h20
37566c259j570O87J769L15j61k24k988l924m63K767b673B397J396q18j217C10
37549a61k033k928j274L88K221b91E191N242J561j381m196A275d546m970l238
37534a2754j300o99k92J300J899K456M530C210P815K778P62K445K622J478L38
37519B1448o32l227o004l908j924k142I85N14c77m920l757n28K071K742c7F384
37502G371B811d17m24k91r90k891j527L061B002K726k256c115m458p46K76j137
37486i180j994l647k127N32K905M532L318b647A189L292K177j2l057I37K60J502
$$ plain form
37600 -7014 -6233 -5428 -6782 -10912 -13104 -9867 -6052 -6547 -8468 -7499 -3860 -3745 -5487 -3592 -2411 -5826
37584 -5826 -10085 -8955 -4678 -2162 -1729 -1758 -1652 -2673 -3389 -3735 -2520 1343 3968 2849 714 550 -820
37566 -3259 -4829 -4142 -2373 -2058 -2219 -2443 -5431 -9355 -9818 -7051 -2673 2397 3793 2975 1758 310
37549 -161 -2194 -5122 -6396 -6008 -3787 -291 5191 10433 11994 10613 6417 1275 -4546 -9516 -12754
37534 -12754 -14054 -14753 -15045 -13745 -11846 -9390 -4860 3210 11025 13803 14565 17010 19632 21110 21448
37519 21448 20816 17589 11585 7677 5753 3611 985 1499 -377 -5297 -9054 -9582 -7511 -4769 -37 6384
37502 7371 2811 -417 -841 -1132 -2122 -5013 -6540 -3479 2002 4728 2472 -3115 -7573 -8319 -8043 -9180
37486 -9180 -11174 -14821 -16948 -16416 -13511 -8979 -5661 -2647 1189 4481 6658 6646 3589 937 1197 2699
37470B699l00n01l31Q33R27j329f39j108j337l729m211n64l59m07M540b349i40
37452f67c03B106L564K247k4j022N50R99j67k620k438H86b443l736k919P28K062
37435f308J515M96J437p46l675r90L375P54n569l400J620L912R95j836k301m64
37419a1185J337j201j545P42J847L329K817j529k614j333J761c090a394j069j190
37404c653n49J638Q70j071J7h55B92a93j326O07l5j182j132k885k690J809c367
37386c596k475j238j340l546l038N85L677N369b391A51L557L316J442j771k947
37371C748r03n75j85J194L45p64J69j18J426K250O87R37k307B686A300I9J919
37354B018K737J396K380J176O76K875L388J009m531F448B849l33N55q25K030L584
$$ plain form
37470 2699 2399 1898 1567 2400 3327 1998 -639 -1747 -3084 -6813 -11024 -11588 -11947 -12354 -7814 -2349 -940
37452 -667 -303 2106 5670 7917 7893 6871 7421 8420 8253 5633 3195 886 -2443 -6179 -9098 -8370 -6308
37435 -6308 -4793 -4297 -2860 -3606 -7281 -8271 -4896 -4142 -9711 -13111 -11491 -7579 -6584 -8420 -10721 -11185
37419 -11185 -9848 -11049 -12594 -11852 -10005 -6676 -3859 -5388 -8002 -9335 -7574 -3090 -1394 -2463 -3653
37404 -3653 -4202 -2564 -1694 -2765 -2748 -855 292 -193 -1519 -912 -947 -2129 -3261 -6146 -8836 -7027 -3367
37386 -3596 -6071 -7309 -8649 -12195 -15233 -14648 -10971 -5602 -2391 151 3708 7024 8466 6695 3748
37371 3748 2845 2270 2085 3279 3624 2860 3029 2911 4337 6587 7274 8211 5904 2686 1300 99 2018
37354 2018 4755 6151 8531 9707 10383 13258 16646 17655 13124 6448 2849 2516 3071 2246 4276 7860
37338G860K234J748L814N001q4l184O85M279M590O700R722J1353J2448R772Q110
37323H5048Q790J0161Q323P543J0319J0631Q228P876P174N523L002k646r840j3811
37309A46321j4939j5895j3038q829p949q902p365n992p124q947p036l090p92k812
37295C3611n773p369o874m960k009k42J054K432K195O5M0J919J882j195m786k691
37279G299K640J666J59j403k451j4L40C911a688l515j5b004B334J990L81p46I51
37261b732l604j286J076K549G10M114p88D44g83L55m90j861k688Q43b197k31j184
37244c612r91n70l14j41j16n06M88b685A691L381R99j896c50n583l071J679J599
37227e726L57k49Q05b266B06d81j843M79B79K08h93B97O74P28L530K395j968k422
$$ plain form
37338 7860 10094 11842 15656 20657 20573 17389 18074 22353 26943 33643 43365 54718 67166 76938 85048
37323 85048 93838 103999 112322 119865 130184 140815 149043 156919 164093 169616 172618 169972 160132 146321
37309 146321 131382 115487 102449 93620 85671 76769 69404 63412 56288 47341 40305 37215 36423 33611
37295 33611 27838 20469 13595 8635 6626 6384 7438 9870 12065 12130 12170 14089 15971 14776 9990 7299
37279 7299 9939 11605 11764 10361 7910 7896 8236 3911 -1688 -5203 -5218 -2004 2334 4324 4705 3959 951
37261 -2732 -6336 -7622 -6546 -3997 710 4824 4036 444 -783 -428 -918 -2779 -5467 -4624 -2197 -2428 -3612
37244 -3612 -4603 -5173 -5487 -5628 -5744 -6250 -5762 -2685 1691 5072 6071 4175 -350 -5933 -9004 -7325 -5726
37227 -5726 -5369 -5618 -4813 -2266 206 -481 -2324 -1845 279 487 -893 297 971 1699 5229 7624 5656 3234
37209C234K436L257J389LN23K346J8l431m755a269l205R53j65k43P70J148j818
37192c829l780k790j13J119k97j599J22J842K616J420j570l307j189L187L655
37177d513p9l143k378q84L58J906M194E23J240k90p1N43O39L14h9m072k600k606
37159i367k131q94L67J013K316K709j053n265k520L170L168K902K559c02C222
37143E356L57j099j866I67a179j911k564l051p47l06k180Q23J767J041J596J561
37127e150j213k278j079R01L245g74B402m65a321j818J106E69J618d23n167j827
37111g417J133j003j701P47J987r59j968j3L614A731N860o7B745G12r5d64j978
37094b442n51K77j129j554j19P10L17k483l647J147L342L41o75j84J363a760A230
$$ plain form
37209 3234 5670 8927 10316 10319 10842 13188 13206 9775 5020 -1269 -4474 -3521 -3686 -3929 -3159 -2011 -3829
37192 -3829 -7609 -10399 -10512 -9393 -9690 -11289 -11167 -9325 -6709 -5289 -6859 -10166 -11355 -8168 -4513
37177 -4513 -4592 -7735 -10113 -10997 -10639 -8733 -4539 523 1763 1473 1402 1945 2584 2898 -89 -4161 -6761 -9367
37159 -9367 -11498 -12392 -12025 -11012 -8696 -5987 -7040 -12305 -14825 -11655 -8487 -5585 -3026 -302 3222
37143 5356 5713 4614 2748 967 -1179 -3090 -5654 -8705 -9452 -9758 -11938 -11115 -9348 -8307 -6711 -5150
37127 -5150 -6363 -8641 -9720 -8819 -5574 -774 2402 1937 -1321 -3139 -2033 569 2187 -423 -5590 -7417
37111 -7417 -6284 -7287 -8988 -8241 -6254 -7213 -9181 -9194 -5580 1731 7591 7524 2745 712 617 -464 -2442
37094 -2442 -2993 -2716 -3845 -5399 -5518 -4808 -4491 -6974 -10621 -9474 -6132 -5791 -6466 -6650 -5287 -1760 1230
37076A438c177m850l68n94q05M53K539K619M49J121G14c8l310K60j52O9a518K1
37058a497q96k755k319J93j606l367j455N73L334d557A692K572o34N5r75H31a963
37040c939R23a84B061H01b416k076j545K006a87A710J088K14r27D84e33A212K251
37023C463l94A24a981p89j769K10a624f19k159l907k224k983n443j34L558J558
37007a2353P58K707K774b775B023R73F98a942b97B770k64A240a90l148j686J264
36991c760a446G33J802J127P21A380b455M46I22K708J533n5p72j391J86o24m68
36974B039J113j79j39J105R12k5j118M8J586J857L26j068j199j071j272j417a188
36956b703J148P17D24K985o08H01b03o09k661k760J077I90N436j518H09e64D9
$$ plain form
37076 1438 -3177 -8027 -8395 -8989 -9794 -9341 -6802 -4183 -3734 -2613 714 -38 -3348 -3088 -3240 -3171 -1518 -1497
37058 -1497 -2393 -5148 -7467 -7274 -8880 -12247 -13702 -13129 -9795 -4557 1692 4264 3630 3685 2710 831 -1963
37040 -3939 -3016 -184 2061 801 -2416 -4492 -6037 -4031 -187 1710 2798 3012 2085 484 -533 1212 3463
37023 3463 3069 124 -1981 -2770 -4539 -4329 -1624 -619 -2778 -6685 -8909 -11892 -17335 -17469 -13911 -12353
37007 -12353 -11595 -8888 -6114 -2775 2023 2996 698 -1942 -297 2770 2506 1240 -190 -3338 -5024 -3760
36991 -3760 -1446 733 2535 3662 4383 1380 -2455 -2009 922 3630 5163 5108 4336 2945 3131 2507 2039
36974 2039 3152 2973 2834 3939 4851 4826 3708 3756 5342 7199 7525 6457 5258 4187 2915 1498 -1188
36956 -2703 -1555 -838 424 3409 2801 801 -203 -812 -3473 -6233 -5156 990 6426 4908 809 -564 49
36938A715K387K508J242j397j047J897J421k605B244C66f80q89o5P31r9a74B915
36920E042Q91M99j8j307k368b665o794l228J676M619K591L26j138m437n646m230
36904a8926k233j660J324M090L563K571J106J09o65o23R36M383B52K271R18K019
36888E460j989f53k137a318G77R47i21m311l214O4K177J225P01J388L24l878l195
36871i640J85K025J089K147J123j143K26j273k869k219n63M134a897N40p63A810
36854F020O34j451M81J493j230o27Q8j532j694q49a110k208P5f71G25b919m271
36837g190j354K526O24k848j382L70k83Q53Q65O62K425f69D49a480m12N09j413
36820b796j817J052i7B960J961J452j309O95K599J174j230M48J126K171P23l000
$$ plain form
36938 1715 4102 6610 7852 6455 5408 7305 8726 6121 2244 366 -680 -1569 -1634 -903 -1002 -174 2915
36920 5042 5933 6432 6414 5107 2739 -2665 -9459 -12687 -11011 -6392 -3801 -3475 -4613 -9050 -14696 -18926
36904 -18926 -21159 -22819 -21495 -17405 -13842 -11271 -10165 -10056 -10721 -11344 -10408 -6025 252 2523 3441 5460
36888 5460 3471 -653 -2790 -1318 777 1724 -921 -5232 -8446 -8382 -6205 -4980 -4279 -2891 -2567 -6445 -9640
36871 -9640 -9455 -7430 -6341 -4194 -3071 -4214 -3988 -5261 -8130 -10349 -10912 -6778 -1897 -1357 -2120 1810
36854 6020 6654 5203 5684 7177 5947 5320 5408 3876 2182 1333 -1110 -3318 -3243 -671 725 -2919 -7190
36837 -7190 -8544 -6018 -5394 -8242 -9624 -9254 -9537 -8684 -7819 -7157 -4732 -669 449 -1480 -1892 -1383 -2796
36820 -2796 -4613 -3561 -97 2960 4921 6373 5064 5759 8358 9532 8302 8750 9876 12047 12770 9770
36804I770j491J661K114k80l103D083j855I21b456m468q30K890b336j550k181
36789f067l56L20n54l764j758J755J465k167l063J06M494d170A394O087J845l537
36773E789A382b27E1J95b43l90B16J83N16c22j273L3f67F31J72J353M745L260
36755A0161j081l858A290a127j780n7l27j899k734j558j039q74L973a775C231
36739E700j785G15c94k48k261k771n527n156K266e247D383N207n35k914j830N52
36723D863o99d46k139J152c32G10B59b63m53n3A104J480J024J536j454j784b193
36705f382k506Q67L433b051k932m893l165J170K495p04j766K814L323Pj72N55
36689e319m4p54j549j896o35M27R05J049j383k961k657k690m48L335M551L513
$$ plain form
36804 9770 8279 9940 12054 11774 8671 4083 2228 921 -2456 -6924 -7754 -4864 -2336 -3886 -6067
36789 -6067 -6423 -6103 -6657 -10421 -12179 -10424 -8959 -11126 -14189 -14083 -9589 -4170 1394 7481 9326 5789
36773 5789 1382 -227 51 246 -243 -633 216 399 915 -322 -1595 -1562 -667 631 803 2156 6901 10161
36755 10161 9080 5222 1290 -1127 -2907 -2964 -3291 -5190 -7924 -9482 -10521 -11395 -7422 -1775 3231
36739 5700 3915 715 -394 -642 -2903 -5674 -11201 -16357 -14091 -5247 4383 9590 9055 6141 4311 4863
36723 4863 4164 -446 -2585 -1433 -332 710 259 -263 -716 -769 1104 2584 3608 5144 3690 1906 -2193
36705 -6382 -8888 -8021 -4588 -2051 -4983 -9876 -13041 -11871 -9376 -10080 -11846 -9032 -5709 -5702 -5874 -5319
36689 -5319 -5363 -6117 -7666 -9562 -10197 -9770 -8865 -7816 -9199 -12160 -14817 -17507 -17955 -14620 -10069 -6556
36673f556c053g51B80K000K615L36j471n49q95a091m024o44b477F30L31a547n714
36656g261j088a775B293A036a721K95A435J0k70G3b044j777j481J558J518j59
36640b385l22O98c06A815J149k81D51c064k350P59K187O49e32C512K854O52j02
36623F916A988h207n962m88K862M618b778R69K83B636M674n95C338j404f57m047
36607d704r79f26E882l70A906l99F68a70A52k0K22f26j227q9l158k560j02n23
36589h285J606c072A766L135K21k245D90a735j669P48J237A187L849L246K349
36574A0631K41j327r73j895j956j498p49h46l067P95h58j490l128o44P77J611
36558c732J713P80r01l104m245j914R39N05k108k709k39K321M297c554a347e31
$$ plain form
36673 -6556 -3053 -751 280 2280 4895 5231 3760 3211 2316 -1091 -5115 -5759 -2477 630 961 -1547 -7261
36656 -7261 -8349 -1775 2293 1036 -1721 -1426 1435 1445 1175 73 -2044 -3821 -5302 -3744 -2226 -2385
36640 -2385 -2707 -2009 -306 1815 2964 2683 451 -3064 -5414 -4655 -2468 -1819 -532 3512 6366 7018 6916
36623 6916 1988 -8207 -14169 -14657 -11795 -7177 -2778 -1809 -1526 2636 7310 6715 3338 1934 -657 -4704
36607 -4704 -5683 -626 5882 5512 1906 1507 668 -170 152 132 354 -626 -1853 -1942 -5100 -7660 -7762 -8285
36589 -8285 -6679 -3072 1766 4901 5122 2877 490 -1735 -3404 -2656 -1419 1187 5036 8282 10631
36574 10631 10872 9545 8572 6677 4721 3223 2474 -846 -3913 -3118 -858 -2348 -5476 -6120 -5343 -3732
36558 -3732 -2019 -1239 -2140 -5244 -9489 -11403 -10464 -9959 -12067 -14776 -15015 -12694 -8397 -3554 -1347 -531
36541b565l519j450M17L89O96K0l55P96J803a428C34a521m192m493l041J56K465
36524a0626K887K078N88J545J485a54D026j717e924n084J086K356l21k656k415
36509a2958j777j316J375L493K506J405j462j086r11k88J970J927J567M53q72
36494e974l29P09a788B857B81f640j980J808J640J84O57R81K49k816k759J471
36478g205J698Q99a837A485A80c509J03a561A350e98n514o52a954C224J105D33
36461f912n097j191K116K377J276O13m03p21R70J129N09R15J954b88A991N70h36
36443c554M31R69p66k451p93N03m96k125r25N49J193K924a691j82j931j675J270
36426d209j014m825k178Q00L118J771m28O20c033H02O43h9m150k787l08l65o51
$$ plain form
36541 -2565 -6084 -7534 -7117 -6728 -6032 -6012 -6367 -5571 -3768 -1428 334 -1521 -5713 -10206 -13247 -13091 -10626
36524 -10626 -7739 -5661 -5073 -3528 -2043 -154 4026 2309 -5924 -11008 -9922 -7566 -7887 -10543 -12958
36509 -12958 -14735 -16051 -14676 -11183 -8677 -7272 -8734 -9820 -10731 -11019 -9049 -7122 -5555 -5102 -5974
36494 -5974 -6303 -5594 -1788 2857 281 -6640 -8620 -6812 -5172 -4988 -4331 -3350 -3101 -5917 -8676 -7205
36478 -7205 -5507 -4608 -1837 1485 180 -3509 -3406 -1561 1350 -598 -6112 -6764 -1954 3224 4329 433
36461 -6912 -12009 -13200 -11084 -8707 -7431 -6818 -7221 -7942 -6972 -5843 -5334 -4419 -2465 -288 1991 2561 -836
36443 -3554 -3123 -2154 -2920 -5371 -6164 -5661 -6157 -8282 -9207 -8658 -7465 -4541 -1691 -1873 -3804 -5479 -4209
36426 -4209 -5223 -10048 -12226 -11426 -8308 -6537 -6965 -6345 -3033 802 1445 -89 -4239 -7026 -7334 -7699 -8350
36409h350q78J299a852A717g01n128n207l399o02J830L035K430K044L8q14J933
36393d541K029A77Q12D19K403K602K082K681J988N95l06k384E040A693J060j71
36377B582C2d647l693q77n45k003j655j608j741Q93N083N323b259R05J16r57l75
36360b570k007j333K412J477j639m479l180K435L887a632A976K760Q46l12j84
36345E086j569A559A84l8c85l549l673j58J042M5j682j629l398m491O15M620K924
36328i719M46O78R13m40l536k307L600M462K925H94K808A728d89j613j014q9J474
36311a731B73g1n720p661m279J371M645N383A88K678G5c059j640l262l476P5J983
36294i379m92l039m296k571R64K196N19J145N2p37J172K734Q67L30N127G23L396
$$ plain form
36409 -8350 -9228 -7929 -1852 1717 -701 -5829 -11036 -14435 -15037 -13207 -10172 -7742 -5698 -5660 -6474 -4541
36393 -4541 -2512 177 989 419 2822 5424 7506 10187 12175 12770 12464 10080 5040 1693 2753 2582
36377 2582 32 -4647 -8340 -9217 -9762 -11765 -13420 -15028 -16769 -15876 -10793 -5470 -2259 -1354 -1238 -2195 -2570
36360 -2570 -4577 -5910 -3498 -2021 -3660 -8139 -11319 -8884 -4997 -1632 1976 4736 5582 5270 5086
36345 5086 3517 1559 184 146 -385 -3934 -7607 -7765 -6723 -6678 -8360 -9989 -13387 -17878 -17263 -12643 -9719
36328 -9719 -9273 -8595 -7682 -8122 -11658 -13965 -10365 -5903 -2978 894 3702 1728 -489 -2102 -3116 -3205 -1731
36311 -1731 273 -71 -5791 -13452 -17731 -16360 -11715 -6332 188 2866 75 -3059 -4699 -7961 -11437 -11362 -9379
36294 -9379 -9871 -12910 -17206 -19777 -18813 -16617 -16098 -14953 -14901 -15638 -14466 -11732 -10865 -10535 -5408 723 4119
36277D119L70r99n12m25Q0j133a080l494m177k019Q85M614A583J866e4k064n52
36260b670j827j616J962N37l795k510K719c306d94n44k033l059k680L35K833a984
36243b61k82k11p5k096l128j878j773k292J125e326a355D88K95a107j389L69G1
36225b103o793l058r18j316K563L310r55m628k552J335P85K18K319L058q1j626
36209a0442j3K92J590Q74P27J165K806A704L265J755J950j046j258n99B554e48
36192A000L905K088q64C009a016l906j196j986l004r20J034j145l724j773J99
36177a7437K753M298K941J833K537i88A114K626n3A421L18K488l47e46m459k012
36161g017J474J256k46J58J691j36p2C12L207J563B279b740m828j077K060K085
$$ plain form
36277 4119 4489 3490 2978 2553 2633 1500 -1080 -4574 -8751 -10770 -9885 -5271 1583 3449 -54 -2118 -2670
36260 -2670 -4497 -6113 -4151 -3614 -7409 -9919 -7200 -3306 -494 -1038 -3071 -6130 -8810 -8475 -5642 -1984
36243 -261 -543 -754 -829 -2925 -6053 -7931 -9704 -11996 -10871 -5326 -1355 488 783 -1107 -2496 -2127 71
36225 -2103 -8896 -11954 -12872 -14188 -11625 -8315 -9270 -13898 -16450 -15115 -14330 -14112 -11793 -8735 -8816 -10442
36209 -10442 -10455 -10163 -8573 -7699 -6972 -5807 -3001 1704 4969 6724 8674 7628 6370 5771 2554 -548
36192 1000 4905 6993 6129 3009 -1016 -4922 -6118 -8104 -11108 -12028 -10994 -12139 -15863 -17636 -17437
36177 -17437 -14684 -10386 -7445 -5612 -3075 -988 1114 3740 3687 1421 1739 4227 3880 -546 -5005 -7017
36161 -7017 -5543 -4287 -4533 -4375 -2684 -2820 -2892 312 3519 5082 2279 -2740 -7568 -8645 -6585 -4500
36145d500l39k069j198J175K135J456M37Q59j947m623j568L454K298l86m76r12
36129f204j653M95J076J344K455P22n88k480m103m869r64M706d509J619l650l826
36113a0366j214q8j841n55K751J976J472J928J226k406n541l043l08K689N713
36098g607c123a155c07J16F92a408o340o401j792J577K944K081L3M57J2Q6j259
36081a0010RQ93J217Q06J192b578A324K527PJ141J478J355K250J09P31J713P34
36064A3369j524m756I9h402n270M83J913k136k494J978L129J287N46O20L732h54
36047C28a658n606m403k577L274b878C602L805m03l066I41b342k44d38I12J869
36031B781M355K797k305C741A305K109M705K155o70m424A596J88L685M201K83
$$ plain form
36145 -4500 -4839 -6908 -8106 -6931 -4796 -3340 -2903 -2044 -3991 -8614 -10182 -6728 -4430 -4816 -5292 -6204
36129 -6204 -7857 -7362 -6286 -4942 -2487 -1765 -2353 -4833 -8936 -13805 -14769 -10063 -4509 -2890 -6540 -10366
36113 -10366 -11580 -11668 -13509 -14064 -11313 -9337 -7865 -5937 -4711 -7117 -12658 -15701 -16009 -13320 -7607
36098 -7607 -3123 -1155 -307 -191 692 -1408 -7748 -14149 -15941 -14364 -11420 -9339 -9306 -8849 -8837 -8751 -10010
36081 -10010 -10001 -9108 -7891 -7085 -5893 -2578 1324 3851 3858 4999 6477 7832 10082 10191 10922 12635 13369
36064 13369 11845 7089 99 -8402 -13672 -13189 -11276 -13412 -15906 -13928 -10799 -9512 -8966 -8346 -4614 -854
36047 328 -1658 -7264 -11667 -14244 -10970 -2878 3602 7407 7004 3938 941 -2342 -2586 -438 912 2781
36031 2781 7136 9933 7628 3741 1305 3414 8119 10274 9604 5180 1596 1784 5469 9670 9953
36016I953k222m26J489J72o33M90P80j442l324A195c334k450R50J528j75j795
36000e276k358Q44b792B043J313A058b977n616n664n211l693J446O714L985j237
35985a2253j328J643K894K797N40J78b763d07l921o374l568M77L937L984J931
35970c941J138h40D61a706k07f11p03J41B614J560m32o42a52l579r60r02RJ618
35952c966b56C646L27H73b470l63K63L95L07Q2K05E86J336o84b529o204m366n75
35934a3674K137L257c481a053b81B368K191K176l35B849A418Q07P26k24j213Q95
35918B409K020K48r11n85L76J024K88A712b824m224k959k949m95K484K938J905
35902f124K61j01j111k883m535k992o42n68j020K182L816M247L182k707k461L58
$$ plain form
36016 9953 7731 7305 8794 8966 8333 8823 9603 8161 4837 1195 -3334 -5784 -4834 -3306 -3481 -5276
36000 -5276 -7634 -6790 -2792 2043 3356 1058 -2977 -8593 -14257 -19468 -23161 -21715 -15001 -11016 -12253
35985 -12253 -13581 -11938 -9044 -6247 -5707 -5529 -2763 -407 -4328 -10702 -14270 -13793 -9856 -5872 -3941
35970 -3941 -2803 -840 461 -1706 -1913 -611 -1314 -1173 2614 4174 3742 3100 -152 -3731 -4691 -5593 -5584 -3966
35952 -3966 -256 3646 3973 873 -2470 -2833 -2570 -2175 -1868 -1786 -1581 586 1922 1238 -2529 -8733 -13099 -13674
35934 -13674 -11537 -8280 -3481 -1053 -281 2368 4559 6735 6400 2849 1418 2225 2951 2727 1514 2409
35918 2409 4429 4677 3766 3181 3557 4581 4869 1712 -2824 -7048 -10007 -12956 -13451 -10967 -8029 -6124
35902 -6124 -5863 -5964 -7075 -9958 -14493 -17485 -18127 -18695 -19715 -17533 -13717 -9470 -6288 -8995 -11456 -11098
35886a1098P71j122j628K552c874I05K21n44k68a335j573k58R0p99k626j429c409
35868B393N323L707J714K75O53m05j238k148k260n80J06r57k396e71m930m320
35852i821k065K175M188a553A774L758L051k536B032q19J065K385K635N38k437
35837E399K51L852K459K13k411m083B147b22j19a3j769q51J291k64q4c74B266
35819E831J806k092B90d711j153P06O69J162J324a36B259KD15a20A173Q06L03
35802B282A21a093A212E90c871j844K753G7R80L18l97C65K12a891l642k86J862
35785c957K02k491j934J735a736e37k995k783q0O93b655C756M018J288j822B615
35768A807L711K754j725A020f862n019j701J507L232J753j555J149a595B092a144
$$ plain form
35886 -11098 -10327 -11449 -13077 -10525 -3874 905 1126 582 314 -1335 -2908 -3166 -3076 -3875 -6501 -7930 -3409
35868 2393 7716 11423 13137 13412 14065 13660 12422 10274 8014 7434 7540 6583 4187 -571 -5501 -9821
35852 -9821 -11886 -9711 -5523 -1553 1774 5532 8583 6047 2032 1213 2278 4663 7298 7836 5399
35837 5399 5650 9502 11961 12174 9763 5680 2147 -222 -341 -13 -1782 -2633 -1342 -1606 -1690 -374 2266
35819 5831 7637 5545 290 -4711 -5864 -5158 -4489 -3327 -2003 -136 2259 2261 415 -120 1173 1979 2282
35802 2282 121 -1093 1212 590 -3871 -5715 -2962 77 1057 1375 978 365 577 -1891 -5533 -5819 -3957
35785 -3957 -3755 -6246 -8180 -6445 -1736 -537 -3532 -6315 -6395 -5702 -2655 3756 7774 9062 7240 2615
35768 1807 5518 8272 6547 1020 -6862 -11881 -13582 -12075 -8843 -7090 -8645 -7496 -1595 2092 -1144
35752f112l385l562k684k142j017J618J844J338J610K01P20K116N30n21J542P78
35736g126k579l282k753j452Q04m96l068k129J112M827M912L993J402J009a125
35720G44a207k895k376J32N54k17J58O70k36J380a965m35k592L34J362j521j924
35703f741J228b205E0J026a519m551k548j802J150M151K90m203j687K676c394
35687f2A197O10l7N59L9B53b694k590J31J74J103a152B93L102J825j427L93O90
35669D876M6R49J378J587q58j220m71k44J95j736A989G63b4B384M218K821L60
35652I783m505a222o876k485L282a078E652M269J661n1l001C062d53J07A420J056
35636B476r67a860k906k384j585J444J112M96j222j948l87J121K176j73j342m69
$$ plain form
35752 -6112 -9497 -13059 -15743 -17885 -18902 -17284 -15440 -14102 -12492 -12291 -11571 -9455 -8925 -9446 -7904 -7126
35736 -7126 -9705 -12987 -15740 -17192 -16388 -16884 -19952 -22081 -20969 -16142 -11230 -7237 -5835 -4826 -1125
35720 744 -1207 -4102 -6478 -6346 -5792 -6009 -5851 -5181 -5417 -4037 -1965 -2400 -4992 -4658 -3296 -4817 -6741
35703 -6741 -5513 -2205 50 1076 -1519 -6070 -8618 -10420 -9270 -5119 -4829 -9032 -10719 -8043 -3394
35687 -62 1197 1807 1770 2329 2368 253 -2694 -5284 -5153 -4979 -3876 -1152 293 3395 5220 3793 4186 4876
35669 4876 4922 5871 7249 8836 7978 6758 6287 6043 6238 4502 1989 763 -24 2384 6602 9423 9783
35652 9783 5278 -1222 -8098 -10583 -7301 -1078 5652 9921 11582 11531 8530 3062 -453 -346 1420 2476
35636 2476 1509 -1860 -4766 -7150 -8735 -7291 -6179 -5683 -6905 -8853 -9240 -8119 -5943 -6116 -7458 -7927
35620g927Rl29m20J84p2J09j037k486J064J972O62K665K587K1k851m721k562k989
35602a6121k398O29L275J426k56k73J348L453K541J800J039j412k752k854q2R11
35586i726L32J957L007P24j109j272m81Q0K784c92j86j062J93l13k228j492M71
35569e009J329a735H57K647J660P63k764c058l279j308q47M74J137J206K499a14
35552G70f64o66j736r19J797A01a47j271K80l120o587l641j3k66j705j465l73
35535a8308M22L676L429q96j769K179M316c310Q72Q62d64m64j414i20A322J606
35519B928M13j220r15e82l222m764j822J158R0j390j545N91M880b619L81j558
35503c796l182m003j622K191K835M29J195K393K90J526B45h31j574l48j657j741
$$ plain form
35620 -7927 -7918 -8247 -8667 -8483 -8555 -8446 -9483 -11969 -10905 -8933 -8271 -5606 -3019 -2998 -5849 -10570 -13132 -16121
35602 -16121 -18519 -17890 -14615 -13189 -13445 -13718 -12370 -8917 -6376 -4576 -3537 -4949 -7701 -10555 -10637 -9726
35586 -9726 -9394 -7437 -4430 -3706 -4815 -6087 -6568 -6488 -3704 -392 -578 -1640 -1447 -1760 -3988 -5480 -5009
35569 -5009 -3680 -1735 857 3504 5164 5927 3163 -3058 -6337 -7645 -8492 -8018 -6881 -5675 -3176 -114
35552 770 -664 -1330 -3066 -3985 -2188 101 -147 -1418 -1138 -4258 -10845 -14486 -14499 -14765 -16470 -17935 -18308
35535 -18308 -17886 -14210 -10781 -11677 -13446 -11267 -6951 -3310 -2438 -1576 -464 -928 -2342 -920 1322 2928
35519 2928 3341 2121 1206 -582 -3804 -8568 -10390 -9232 -9142 -10532 -12077 -11486 -6606 -2619 -2238 -3796
35503 -3796 -6978 -10981 -12603 -10412 -7577 -7148 -5953 -3560 -3270 -1744 245 -831 -2405 -2753 -4410 -6151
35487f151j924l069k68L122L476L18j717N62J529K48L3j367m031n619l613M195
35471a4276e305I93P8a09B738L683l3k504j845l1K089L568K318n82l337D45c823
35453d662o74J83J830j637l591k715q49L656b702B272M140J200l573A136r9q4
35437I53a87l164k237l25n7M60J215J958a154j508o56j573m305k610J868d798
35420A100L944L44j127J762K731P21Qj590P70K678J001j730m767H24d14A451K755
35403D206L21j212n15L09J879M44k404E84b401m593m348r71L635L925a827A225
35386B397K83d92o148l059k125j972K177d797a5B950L224K812N24C628c220l563
35370f783l5J979J870G64J339F9d90r58r68J071B020L438K751M519M051k160n843
$$ plain form
35487 -6151 -8075 -11144 -11412 -8290 -4814 -4496 -6213 -5651 -4122 -3874 -3841 -5208 -9239 -14858 -18471 -14276
35471 -14276 -5305 993 1071 -109 2738 6421 6388 3884 2039 2008 4097 7665 9983 9401 6064 445 -3823
35453 -4662 -5336 -5153 -3323 -4960 -8551 -11266 -12115 -8459 -2702 2272 6412 7612 4039 1136 1037 953
35437 953 -187 -3351 -5588 -5913 -5970 -5510 -4295 -2337 -1154 -2662 -3318 -4891 -9196 -11806 -9938 -4798
35420 1100 5044 5388 4261 6023 8754 9475 9483 7893 8663 11341 12342 10612 5845 824 -414 1451 4206
35403 4206 4527 3315 2800 3109 4988 5432 3028 584 -2401 -6994 -11342 -12313 -8678 -4753 -1827 1225
35386 2397 2680 -492 -6640 -9699 -11824 -13796 -11619 -4797 -15 2950 6174 8986 9510 3628 -3220 -6783
35370 -6783 -6818 -4839 -2969 764 2103 69 -490 -1448 -2416 -1345 2020 5458 8209 12728 16779 14619 8776
35353H776D337g7l902l093o33J683K261R21j649k76J391P04J68K77P29I31J346
35336B277E18b011j616J613B60h02l467j064K188i05G33R14J294J119q6J61j300
35319B835A211d27j708k580l960Q6L862J685K00j365j225J91K169A325L700J101
35303F126J1r59k193A047@A055L346K077j82k854dk667l661k561K041K253J460
35286c139a556m49r38L30J254M82l69l257l452Q8j00R6M33N31J466J359J381a305
35267a873k017j449j153j65k74M7J135M23j277j678K008R21k195P6K121R17j187
35250e620j005j054m28K324C93N500N89k366p28q92j43J151J866L1n83k219a269
35232c807a806A307J907O7p43n41J18O68m26P9M27Q16M94J626K232l65j561NK03
$$ plain form
35353 8776 4337 -77 -3979 -7072 -7705 -6022 -3761 -2840 -4489 -4765 -3374 -2670 -2502 -2225 -1496 931 2277
35336 2277 518 -2011 -3627 -2014 260 -802 -4269 -5333 -3145 -905 733 1647 2941 4060 3974 4135 2835
35319 2835 1211 -427 -2135 -4715 -8675 -8589 -4727 -3042 -2842 -4207 -5432 -5241 -3072 1325 5025 6126
35303 6126 6137 5178 2985 1047 0 1055 4401 6478 6296 3442 -4 -2671 -6332 -8893 -6852 -4599 -3139
35286 -3139 -1556 -2005 -2943 -2613 -1359 -877 -1246 -4503 -7955 -7867 -7967 -7871 -7438 -6907 -5441 -4082 -2701 -1305
35267 -1873 -3890 -5339 -6492 -6657 -6931 -6884 -5749 -5326 -6603 -8281 -6273 -5352 -7547 -7471 -5350 -4433 -5620
35250 -5620 -6625 -7679 -8107 -5783 393 5893 6482 4116 3388 2496 2353 3504 5370 5401 4818 2599 -1269
35232 -3807 -1806 1307 3214 3281 2538 1997 2115 2783 2357 2436 2863 3679 4173 5799 8031 7666 6105 6110 6313
35213F313r2L82p37B446j066J580K605J459k73p7J587J164M24J24l62J90q43k101
35195F857k874C64b832l255m51b859A092J741r70k5M478M527P53k936l789B346
35178H95J36K411M319K656O24K35j681j481j99J088o58D044f7l551j112b330A638
35160D445R77J502j690I67c451m082l500J174d783A374M243J702J028q61k713
35145D773A870F40P92J842K324J939J852K672L387L379k6l443j847k529D624a795
35128f706k808K684b551J089K2j360j193n4P95J11n19n48a213B808K684J029m08
35111F113A328c899j835P58J914a397F83L619N135K430P32o70l949l136j180n19
35095C145L096M565K923j498l576l491H8e662n121l456k48L670L525M40k078j058
$$ plain form
35213 6313 6221 6603 5866 2446 1380 2960 5565 7024 6751 6674 8261 9425 9849 9973 9611 9801 8958 6857
35195 6857 3983 364 -2832 -6087 -6538 -2859 1092 2833 1863 1838 6316 10843 11596 8660 4871 2346
35178 895 1031 3442 7761 10417 11041 11276 9595 8114 7915 9003 8345 4044 -67 -3618 -4730 -2330 1638
35160 4445 5422 6924 5234 967 -3451 -7533 -11033 -9859 -4783 1374 5617 7319 8347 7486 4773
35145 4773 1870 640 1432 3274 5598 7537 9389 12061 15448 18827 18801 15358 13511 10982 4624 -1795
35128 -6706 -9514 -6830 -2551 -1462 -1440 -2800 -3993 -4047 -3252 -3141 -3660 -4208 -1213 2808 5492 6521 6113
35111 6113 1328 -3899 -5734 -4976 -3062 -1397 683 4302 9437 11867 12599 11929 7980 4844 3664 3145
35095 3145 6241 10806 13729 12231 8655 5164 88 -5662 -10783 -14239 -14487 -10817 -7292 -6852 -8930 -9988
35079i988J500O04J303K027J163R72j688l452m314l322J167L934K041q48k32J258
35063g875K490M14j375K417B63L581J546O55P6m86M37j705h64l931k74J767A350
35045E159L44k68M80O81j79j24O62K186L724l86p08K535j593m087k359j662r87
35028C418G43b384l749k457K18J461J210M06b488A14k1a040r80j139R36j410m506
35011h139m42b697B971J026l44J379J162m4j791j531G04a944h38A741H63H3K343
34994B426J220m71j172H4a283f12c8B526K128q10P68J378K421P184P722M214j651
34977B5880o063o222k596K631M189K561j410m037m392j337J764K614J067j017
34963A3632j617l15K670L264K430L3m286o053m483B348A77a5A761M198N944M633
$$ plain form
35079 -9988 -8488 -7884 -6581 -4554 -3391 -2419 -4107 -7559 -11873 -15195 -14028 -10094 -8053 -8901 -9133 -7875
35063 -7875 -5385 -4971 -6346 -3929 263 3844 5390 6045 6121 5635 6072 4367 -864 -4795 -5069 -3302 1350
35045 5159 5503 5235 5715 6396 6217 6093 6755 8941 12665 12279 11571 14106 12513 8426 6067 4405 3418
35028 3418 743 -2384 -6133 -8590 -8372 -6911 -5701 -5295 -2488 114 93 -1040 -2020 -3159 -2223 -3633 -8139
35011 -8139 -8581 -2697 2971 3997 3653 5032 6194 6150 4359 2828 704 -1944 -838 1741 863 83 2426
34994 2426 3646 3175 2003 84 -1283 -612 -38 2526 4654 3844 4612 5990 8411 15595 23317 27531 25880
34977 25880 19817 13595 10999 13630 17819 20380 18970 14933 10541 9204 10968 13582 14649 13632
34963 13632 12015 11700 14370 17634 20064 20097 15811 9758 5275 2348 177 -15 1761 5959 11903 16536
34947A6536J510k382m163k609J03J024J593J620J911J901Q6l92n69k111j057J686
34931A4687L714L765K934J623J803L476L157L447J528P39nJ64J233K290L226K299
34915E0080J640L226L812K169K217K912K866N181P663Q049Q501O250M934O881
34901A16381Q432Q863M731K363K238P354J4150J3320J2154J2505J4036J5913J6929
34888B49369J8081K1932K6461L1872M0003M7056N2066N8934P1247Q3900R5120
34877G96041J08676J21648J30225J38823J45740J49285J46029J36838J22344J04264
34867B099913Q3846O0699L3774L946k3903n0116p6321r8866j14324j24980j29380
34856A664288j30141j31170j27588j18002j06353r3363q4416p6969o7413n2302
$$ plain form
34947 16536 18046 15664 11501 8892 8995 10019 11612 13232 15143 17044 17130 16738 16169 14058 13001 14687
34931 14687 18401 22166 25100 26723 28526 32002 35159 38606 40134 40873 40868 41032 42265 44555 47781 50080
34915 50080 51720 54946 58758 60927 63144 66056 68922 74103 81766 89815 98316 104566 109500 116381
34901 116381 124813 133676 138407 140770 143008 150362 164512 177832 189986 202491 216527 232440 249369
34888 249369 267450 289382 315843 347715 387718 434774 486840 545774 617021 700921 796041
34877 796041 904717 1026365 1156590 1295413 1441153 1590438 1736467 1873305 1995649 2099913
34867 2099913 2183759 2244458 2278232 2282178 2258275 2208159 2131838 2032972 1918648 1793668 1664288
34856 1664288 1534147 1402977 1275389 1157387 1051034 957671 873255 796286 728873 676571
34846F76571l6666k6087j6720o559J128O842J6401K6149L5678M6177N5900O6538
34834H45352P8150R0732J04169J14943J26634J37363J38948J35003J30916J21556
34824B023766J04593Q1400N6498L3576Q216j8470m6023p0686r5179j14902j29142
34813A833647j41642j47855j50254j43949j30810j22124j14383j02517q8920p1325
34803F19868n9946n6926m9023m2617l7364l0721k7204k3026k1293j8527j3555
34792B39666j0942j1498j2641j1300q973r511j0817j1957q682o956p827p415n723
34779A15424l491l884n410n500m760n646o454n206m501l997l796k41L269k91m560
34764F0956k382R69L84J42k154o691p137m835l337l489l003j934l528k606o02
$$ plain form
34846 676571 639905 613818 597098 590539 591667 598509 614910 641059 676737 722914 778814 845352
34834 845352 923502 1014234 1118403 1233346 1359980 1497343 1636291 1771294 1902210 2023766
34824 2023766 2128359 2209759 2266257 2299833 2308049 2289579 2243556 2172870 2077691 1962789 1833647
34813 1833647 1692005 1544150 1393896 1249947 1119137 997013 882630 780113 691193 619868
34803 619868 559922 502996 453973 411356 373992 343271 316067 293041 271748 253221 239666
34792 239666 228724 217226 204585 193285 184312 174801 163984 152027 143345 136389 128562 121147 115424
34779 115424 111933 108049 102639 97139 92379 86733 80279 75073 70572 66575 62779 62538 65807 65516 60956
34764 60956 58574 59543 59927 60069 57915 51224 44087 39252 35915 32426 29423 27489 23961 21355 20753
34749B0753k47P0n64o24K078m89l760k107n10l14n55j165K526K806Q07K195K344
34732B3244p16k409l91J904K226J319j060k769j843k329j229L476L171j274j043
34717B0277M63k015l199J761O010M506Q47l755k634P01r90m393m801n814k222
34702D742L087K940j86j397K21L617J766j496k759l743k803M58O55j431q10J023
34686C884J496P29J51J331K297N02k318C713j566J358O646O525N4k891j740K199
34670A4298J280k249m470C721A154J365L359M493L195P64n49r79L334L346j578
34655A7904m635k680J308J279K945L935J263k859n305n250F28f782m148J10L091
34640g729K51j553M91K566d53E885L674J320j81l86r67n96J830N92k402D059j135
$$ plain form
34749 20753 20506 20576 20012 19388 21466 20977 17217 15110 14600 14286 13731 12566 15092 17898 18705 20900 23244
34732 23244 22528 20119 19728 21632 23858 25177 24117 21348 19505 17176 15947 19423 22594 21320 20277
34717 20277 20740 18725 15526 17287 23297 27803 28650 24895 22261 22962 21972 17579 12778 6964 4742
34702 4742 7829 10769 10583 9186 9407 13024 14790 13294 10535 6792 3989 4447 5102 3671 2861 3884
34686 3884 5380 6109 6260 7591 9888 10390 8072 3713 2147 3505 10151 16676 16730 13839 12099 14298
34670 14298 15578 13329 8859 3721 1154 2519 5878 10371 13566 14330 13781 12802 16136 19482 17904
34655 17904 13269 10589 11897 13176 16121 20056 21319 18460 13155 7905 628 -6782 -10930 -10820 -7729
34640 -7729 -7478 -9031 -8540 -5974 -453 5885 9559 10879 10698 10312 9345 8749 10579 11171 8769 4059 2924
34623B924P89J178L117K095k278B985A99K132N672K744k304B487b289k804q44
34608e937m06j158k963p46L549K191k317k234j731j232P57K515J307O30K274i01
34591D814M467j37D169a792l476n81k782k982J971c582A461K777J373j113A690
34575a457j15n06l911j847K95l224k795k403j547K424K829K970K162J193j252
34560g184o35J554J048L05b007B326J989K57o29C67d679r11a070D099K256j419
34544D936k225r54J391K134j69p86J850J118k427I12a546j273L16P97n6G26K731
34527C457l63j455c7j366j424q71j337m11J371c32G26c850m056k346k627j607
34511a4486J408K335L499b356A129J091B57c56oj822q14J293A064J507J60J149
$$ plain form
34623 2924 3713 4891 8008 10103 7825 2985 199 2331 8003 10747 8443 2487 -2289 -5093 -5937
34608 -5937 -6343 -7501 -10464 -11210 -7661 -5470 -7787 -10021 -11752 -12984 -12227 -9712 -8405 -7775 -5501 -901
34591 4814 9281 9144 4169 -1792 -5268 -5849 -8631 -11613 -9642 -3582 1461 4238 5611 4498 1690
34575 -1457 -1572 -2078 -5989 -7836 -7541 -10765 -13560 -15963 -17510 -15086 -12257 -9287 -7125 -5932 -7184
34560 -7184 -7819 -6265 -5217 -4912 -2007 2326 4315 4572 3943 367 -4679 -5590 -1070 4099 6355 4936
34544 4936 2711 1757 3148 5282 5113 4327 6177 7295 4868 912 -1546 -2819 -2503 -1706 -1762 726 3457
34527 3457 3094 1639 -37 -1403 -2827 -3698 -5035 -5446 -4075 -332 726 -3850 -7906 -10252 -12879 -14486
34511 -14486 -13078 -10743 -7244 -2356 1129 2220 257 -356 -362 -2184 -2998 -1705 1064 2571 2731 3880
34495C880K78R31M274M629K532p62n091n003r59J146L36k404A151J080K922J951
34479G104J282P29j920C353d67k923j094K62a967b92l703m465j845Q7j714m59
34463a2391L543d287J669P70e1A720k21d47j388K56K42l816l512k62k31j003M12
34446i749N85j791j382K908c318B834K855m08o96J466K167J673q40D404E88E3
34429A234n1h25k383l285l877O02K298J443j92j798j825n214n069l26N581f628
34412a076H65g16j778q5a287J53j29O16B235N003K387k43j538q03k226A720h92
34394c320o62a717A95i9j829L79I24L091J831O16Q17J489J0k267r87P10Jj225
34376E010j604o63p27F67B08O90J268M323N541N52l390l504B332d6A850M053K20
$$ plain form
34495 3880 4158 5089 9363 13992 16524 15762 10671 5668 4709 5855 6191 3787 1151 2231 5153 7104
34479 7104 8386 9115 7195 3353 -467 -3390 -4484 -4222 -1967 -292 -3995 -8460 -10305 -10218 -11932 -12391
34463 -12391 -8848 -4287 -2618 -1848 -51 1720 1499 -447 -1835 -1579 -1337 -5153 -8665 -8927 -9158 -10161 -9749
34446 -9749 -9164 -10955 -12337 -9429 -3318 2834 5689 5281 4585 6051 8218 9891 9051 4404 588 53
34429 1234 1183 -825 -3208 -6493 -10370 -9768 -7470 -6027 -6219 -8017 -9842 -15056 -20125 -20451 -14870 -6628
34412 -1076 865 -716 -2494 -2579 -1287 -1134 -1263 -647 2235 7238 9625 9382 7844 7041 4815 1720 -892
34394 -3320 -3982 -1717 195 -99 -1928 -1549 924 4015 5846 6462 7279 8768 8778 6511 5524 6234 6235 5010
34376 5010 3406 2743 2016 667 208 898 2166 6489 12030 12582 9192 5688 2332 -46 1850 5903 6123
34359F123j646P4K005J346J05q61J197n6j739l85q72A633d179k800J858K144m68
34342c445n18M22J513j86k273k843k068K485c002H29J153a312k788j335l4K684
34326b785A479K935J228K658J151k548k393k078b584n673j784P94J271K420a803
34310B184L168J01k102A490@a550j198k037j805q64j351k86M449F97L59a851m55
34293b306P26N42j91o59A99J927K094M529K889j782j678j893o07K124M347M439
34277A6588J680r55k198j851m71k03k176l643j743j867b345o472j266L643b586
34261c25H51J483J058P14N87j569A365c15k53j110k385J486B956M911M429N140
34245A7436J122l9j762o939C536c04j823g28C249M408J795j622B799a700l097
$$ plain form
34359 6123 4477 4551 6556 7902 8007 7146 8343 8287 6548 6163 5291 1633 -4179 -6979 -5121 -2977 -3445
34342 -3445 -3963 -3541 -2028 -2214 -4487 -7330 -9398 -6913 -3002 829 1982 -1312 -4100 -5435 -5469 -2785
34326 -2785 1479 4414 5642 8300 9451 6903 4510 2432 -2584 -8257 -10041 -9247 -7976 -5556 -1803
34310 2184 5352 5453 3351 1490 0 -1550 -2748 -4785 -6590 -7454 -8805 -9091 -4642 697 1056 -1851 -2306
34293 -2306 -1580 -1038 -1229 -1888 199 2126 4220 8749 11638 9856 8178 6285 5678 7802 12149 16588
34277 16588 18268 17313 15115 13264 12793 12590 10414 6771 5028 3161 -2345 -8817 -10083 -6440 -2586
34261 -325 851 2334 3392 4106 4693 3124 1365 -315 -568 -1678 -4063 -2577 2956 7867 12296 17436
34245 17436 18558 18519 16757 9818 3536 -304 -2127 -728 3249 7657 9452 7830 2799 -1700 -4797
34230d797r42K601C6Q08B15b216l403k018O92b849B053K566N64j707Q97L807L0
34213H210l525A685h51k102o21M37j52r25q11M37a998I09K076J201M061O822M867
34196A9936l66n433n927l576j586r08m45C92g84l217l948N90L511J250j241j665
34180e504j473j021n30k19J237J392L45r42N34c64F765M67A955a58A372J082r26
34163A528g72k662j413J401C91K113j021K66l8h91m123l499n62J334r70j20q33
34146i664l797l591k883R69N129N742L386l91j182N75Q48j76o55m17K008i54c65
34128a12A245N47l86K39C30a795f04C369Q73A254d045l784k43K001a820A995K50
34111B245h10n545l754o98K818L956a646N83b29A452L56J674L063L88k297A874
$$ plain form
34230 -4797 -5739 -3138 36 844 215 -2216 -5619 -7637 -6945 -2849 2053 4619 5183 3476 4373 8180 8210
34213 8210 4685 1685 -851 -2953 -3574 -3137 -3289 -4214 -5025 -4588 -1998 909 2985 4186 8247 15069 19936
34196 19936 19570 14137 8210 4634 3048 2140 1695 392 -784 -4001 -7949 -7359 -3848 -2598 -3839 -5504
34180 -5504 -6977 -7998 -8528 -8747 -7510 -6118 -5773 -6715 -6181 -364 6765 7232 1955 -158 1372 2454 1528
34163 1528 -772 -3434 -4847 -3446 391 2504 1483 1749 1711 -891 -5014 -8513 -9075 -7741 -8711 -8831 -9664
34146 -9664 -13461 -17052 -19935 -18966 -13837 -8095 -4709 -5100 -6282 -5707 -4859 -5035 -5690 -6107 -4099 -954 -365
34128 -112 1245 1792 1406 1645 330 -1795 -604 3369 4242 1254 -4045 -7829 -8072 -6071 -1820 1995 2245
34111 2245 -810 -6355 -10109 -10807 -7989 -4033 -1646 -1063 -229 1452 1808 3482 6545 6933 4636 1874
34094F68ek228l420k433k380n68K171K298K589d7C945O44B236D01P00K718K133
34077E952j211B24c489J680A944J542j465a042j693N28P72j713k317q22N33K428
34061c326J139n97n12m65J441I00K069K453N119M185K200J91j636j658j141j636
34045A1046j351J63k10l189f99l580Q89l81o84l19O96J365L74j836p18a826B074
34027D452J157M10j295J161K379L143M367K45n380D492A286f35o62k911n488j248
34011a0944L366J906l784p106m290J618N402O319b226A487k68a891j524a020A524
33995C01h52p8J13j113l231l751k304k411k465L54J845K137M559b279G86L162
33979C948L145J607j858k864A465J792J422k73K111J836k376j897j44A207d29
$$ plain form
34094 668 -5 -2233 -5653 -8086 -10466 -11034 -8863 -6565 -3976 -47 3945 4589 2236 401 1101 3819 5952
34077 5952 4741 224 -3489 -1809 1944 3486 2021 -1042 -2735 -2207 -1435 -3148 -5465 -6287 -5754 -3326
34061 -3326 -2187 -2784 -3296 -3761 -2320 900 2969 5422 10541 14726 16926 17117 15481 13823 12682 11046
34045 11046 9695 9858 9648 6459 -699 -4279 -3390 -3771 -4455 -4774 -4078 -2713 -2339 -4175 -4893 -1826 2074
34027 4452 5609 6019 4724 5885 8264 11407 15774 16019 10639 4492 1286 -635 -1297 -4208 -9696 -10944
34011 -10944 -7578 -5672 -9456 -16562 -20852 -19234 -13832 -7513 -2226 1487 1219 -1891 -3415 -1020 1524
33995 301 -852 -930 -817 -1930 -5161 -8912 -11216 -13627 -16092 -15738 -13893 -11756 -7197 -2279 786 3948
33979 3948 7093 8700 6842 3978 1465 3257 4679 4406 6517 8353 5977 4080 3936 1207 -429
33963A442l46a31f3l47E29J331m14J486K063k34l71R06o63F12c341k374p52J868
33945d599e03B406P45C14b415g72C86Q78J51k05L89J310m38g08k775j051K078
33928b456B560J952j837J018K553J001L541M617O30k160j815j824k916k118j380
33913C822l61l7O69K093r55A361F10ph68D83N052N478K981L40k752l56K812Q47
33895A4885n684A396a396C537M445j361j665j12Q04Q46L05m79j334L21N98j154
33879D751j116m8j773b776L28D679M726j58k440L43N304M686j98m857n575k823
33863C687J90K422M313L679L110N79k996l636o43K588K859J345k030m709j672
33848I086K676K653J121k781E016a235l747k496p26k234j922l19J477J604r73
$$ plain form
33963 1442 1096 -131 -63 -410 529 1860 1446 2932 4995 4761 4390 5296 4633 612 -3341 -5715 -6467 -4599
33945 -4599 -503 2406 3151 314 -2415 -772 386 1264 1415 1210 1599 2909 2471 -708 -3483 -4534 -2456
33928 -2456 2560 4512 2675 3693 6246 7247 10788 15405 16035 13875 12060 10236 7320 5202 3822
33913 3822 3461 3424 4093 6186 5231 1361 610 603 -868 483 5535 11013 13994 14334 11582 11226 14038 14885
33895 14885 9201 1396 -1396 3537 7982 6621 4956 4844 5648 6494 6799 6320 4986 5307 5905 4751
33879 4751 3635 3587 1814 -2776 -2448 4679 9405 9247 6807 7150 12454 17140 16942 12085 6510 3687
33863 3687 3877 6299 10612 14291 17401 17980 14984 11348 10705 13293 16152 17497 15467 10758 9086
33848 9086 11762 14415 15536 12755 5016 -1235 -4982 -7478 -8204 -10438 -12360 -12679 -11202 -9598 -10571
33833a0571J259L820b543R66M27d33B115L531L121j346C334O33K749k97k865E20
33816b939k209l28K215A270K911J060n56n82K726L774P59k025k211l443c13l16
33800f29C306M610K086O14N02J738J110k838n072j841Q33J274J081J871j150j256
33784F868K963K925q31q63J777R94K785L238r99l344n108l255j032mK832M217
33768A3163L418j253m369l064k836p81N59l61J410K898K499K287J16l37L103M047
33752B0499j6k293J79J462q67j195k050k912k923k692j801j240j864m73J442Q74
33736D130L208L888R65j756k326j153j774n00K272K622L305K426k455l965J05
33721H992k28k464n50R97O4K129M769M129J640r04j450l71J809K666J83l365n510
$$ plain form
33833 -10571 -9312 -5492 -2543 -1577 -1150 -433 2115 5646 8767 7421 3334 3967 6716 6419 3554 520
33816 -2939 -5148 -5476 -3261 1270 4181 5241 4685 4103 6829 10603 11362 9337 7126 3683 -313 -629
33800 -629 3306 7916 10002 10616 11118 12856 13966 11128 6056 4215 5048 6322 7403 9274 8124 6868
33784 6868 9831 12756 11925 11062 12839 13833 16618 19856 18857 15513 10405 7150 6118 6114 8946 13163
33768 13163 16581 15328 10959 7895 5059 4278 4837 4476 5886 8784 11283 13570 13686 13349 16452 20499
33752 20499 20483 18190 18369 19831 18964 17769 15719 12807 9884 7192 5391 4151 2287 1814 3256 4130
33736 4130 7338 11226 12191 10435 8109 6956 5182 4682 6954 9576 12881 15307 12852 8887 8992
33721 8992 8764 6300 5750 6747 6811 8940 13709 17838 19478 18574 17124 16753 18562 21228 21411 18046 12536
33704A2536n010j041K502K286q9j242q46l953b373n647j363K980b489Q78O14C86
33687h87j563K60q17j413L53n01j342K89K250A42L455K149L167K850j045k048
33671H670l92j623C099A9N37M023J428A566d444n098j403L694L227N73a452A76
33654D28L123K857o1N33J087O25J72m35N98K506J489O11R08k91l217l937j858
33637E138n01j669C38c813j816O22J353c67B506q75C57J289k17C75R54R54l28
33620A955l82J813L364J904J180J438k45r92k82N46L74O26J395R9L11r05l732
33603H467A838d751k625K450c38B403N93J081O58j530b39l510j573Q53B51L334
33587C585a47p611l297L472L451R47E36O750M031M12J846J378Q68n75m017j615
$$ plain form
33704 12536 7526 6485 8987 11273 11184 9942 9096 5143 -2373 -8020 -9383 -6403 -2489 -1611 -997 386
33687 -887 -2450 -2190 -3007 -4420 -4067 -4568 -5910 -5621 -3371 142 3597 5746 8913 11763 10718 8670
33671 8670 8278 6655 3099 19 556 4579 6007 1566 -4444 -9542 -10945 -7251 -4024 -3451 -1452 176
33654 428 3551 6408 6347 6880 7967 8592 8764 8329 8927 11433 12922 13533 14441 14150 10933 6996 5138
33637 5138 4637 2968 338 -3813 -5629 -5007 -3654 -367 2506 1631 357 1646 1429 375 1329 2283 1955
33620 1955 1573 3386 6750 8654 9834 11272 11027 10035 9753 10299 10673 11299 12694 12793 13104 12199 8467
33603 8467 1838 -4751 -7376 -4926 -338 2403 2996 4077 4735 3205 -239 -3749 -5322 -4469 251 3585
33587 3585 -147 -7758 -11055 -7583 -4132 -3185 536 7286 11317 11729 13575 14953 15821 15246 11229 9614
33571I614L513J883r53k225m268C083j292K720K101L81K82j153j148L1q57j409
33555B739J502L162K509Q39j287k885C254A064j44K878K507Q75K36J229R82j098
33539H529n07J310O80j76p34l674B694L969M246M49k62j533m301E56c225J395
33523a830E505P238J834j616j795q69j757k869B330q11K324K571J313R60P38L34
33507I759M62M26r20l761k326L50J456L79j448q15O46J573J688L673L168J433
33491A5743J170j47j104j910l78J119J55J39L173L887L880L396o50m014l482m6
33475B0931q76k103q51P35J708J565M78L74J174j516j323k38K886K756k911m731
33459A8058l224l29J278j756k223J332J499j589l411l446j283O49J057J445K096
$$ plain form
33571 9614 13127 15010 14057 11832 7564 3083 1791 4511 6612 6993 7275 6122 4974 5005 4148 2739
33555 2739 4241 7403 9912 10751 9464 6579 3254 1064 920 3798 6305 7180 7416 8645 9627 8529
33539 8529 8022 9332 10012 9836 9102 5428 2694 6663 10909 11358 11096 9563 5262 556 -3225 -1830
33523 -1830 5505 12743 14577 12961 11166 10297 8540 5671 2330 1519 3843 6414 7727 8687 9425 9759
33507 9759 10221 10647 9727 5966 3640 3990 5446 5825 4377 3562 4208 5781 7469 11142 14310 15743
33491 15743 16913 16766 15662 13752 13374 14493 14648 14787 17960 21847 25727 29123 28473 24459 20977 20931
33475 20931 20055 17952 17101 17836 19544 21109 21587 21961 23135 21619 20296 20058 22944 25700 22789 18058
33459 18058 14834 14505 15783 14027 11804 13136 14635 13046 9635 6189 4906 5555 6612 8057 10153
33444A0153J301m4K282L324K879L546J935J133j241m160m883n556j095M710M098
33429A8382j11k419j365Q41O59J28o61p01J005J375n74j398Q42K010r29j053M47
33412A6478k45P70L81l283m515M16K496K295J857N95N96j5J48J463J583P87Q93
33395B2700J415n61l265l105o9J412J858L592J254P91K424J96m311k575J304N89
33379B3649m84o67N88K049Q26j219k944l170p92K054m5k681J899P338L135j880
33363B7656J25J497J13r00j638R00J580J31J002J615K786L134N80j758j804O37
33347C5656K943L813L090J355j311k148l032l119k574k631q77P65q11j824j146
33332B8149j163j642P99L721L392j573m769k125p37k124j21K156J044j97p77J25
$$ plain form
33444 10153 11454 11410 13692 17016 19895 23441 25376 26509 25268 21108 16225 10669 9574 14284 18382
33429 18382 18271 15852 14487 15328 15987 16115 15454 14753 15758 17133 16559 15161 16003 18013 17084 16031 16478
33412 16478 16233 17003 17384 14101 9586 10002 12498 14793 16650 17245 17841 17826 17974 19437 21020 21807 22700
33395 22700 24115 23554 20289 17184 17115 18527 20385 23977 25231 26022 28446 28642 24331 21756 23060 23649
33379 23649 23165 22498 23086 25135 25961 24742 21798 18628 17836 19890 19845 17164 19063 26401 29536 27656
33363 27656 27781 29278 29391 28491 26853 27753 29333 29464 30466 32081 34867 38001 38581 36823 35019 35656
33347 35656 38599 42412 45502 46857 45546 43398 40366 37247 34673 32042 31165 31930 31119 29295 28149
33332 28149 26986 25344 26143 29864 33256 31683 26914 24789 24052 21928 21807 23963 25007 24810 24033 24158
33316B4158L66j769k808k809k709k0K379M134K963J194L281M991N410J631k828
33301C7564l563j022P40l157o043n097l611J488J956J206M128O101N200M098l29
33286C9659l598l949l953k081N04K551L025j345m003j646j240R50M618O245N961
33271D1698N307J492k828m053l764l564k112k302k467L99L785K363N69J774L595
33256C9892J862l69Q45K66j238Q80M086K102k785m426l992k489J16J844K753J701
33240D1048K559J319K95K111K500M83l49R8k216m528l851j108q22k587l657k589
33224B8706p77L310P820N262j438k761J611L772K237J532J152J250k197n535l643
33209D0301O68K632N131O574M131r3j994K12L580K765r78m164k814J050K975J202
$$ plain form
33316 24158 24524 22755 19947 17138 14429 14409 16788 20922 23885 25079 28360 33351 38761 40392 37564
33301 37564 34001 32979 33719 30562 24519 19422 15811 17299 19255 20461 24589 30690 35890 39988 39659
33286 39659 36061 32112 28159 26078 26582 29133 32158 30813 26810 25164 23924 24874 29492 35737 41698
33271 41698 47005 48497 45669 41616 37852 34288 32176 29874 27407 27806 31591 33954 34523 36297 39892
33256 39892 41754 41385 42230 42496 41258 42138 46224 48326 45541 41115 37123 34634 34750 36594 39347 41048
33240 41048 43607 44926 45221 47332 49832 50315 49966 50064 47848 43320 39469 38361 37539 34952 31295 28706
33224 28706 27929 31239 39059 44321 42883 40122 41733 45505 47742 49274 50426 51676 49479 43944 40301
33209 40301 40969 43601 48732 55306 59437 59344 57350 57562 61142 63907 62929 58765 55951 57001 59976 61178
33193F1178J113M022L437J058R1M22j245j051J738L053J410l034p097o444k718
33178E5933K027L380P70J122K356l31l531k901j567j320O85L521L833J926m5j459
33162F4399m30K511J903N94J319N141M900Q49k292k948j283J819N441N360J651
33147H8934j176j641q79j744k616l692l458J353M408K812M08J324J687K940M621
33132I3281K114J173Q87k639l253k392j542J201K930L083M185M428L554l121n305
33117I8584m42L540P92k538k62J815L324K117k499m710j574p72k79K877L203J113
33101A04289j572k945l519p85J257J689K013J366J373J247J754K18N97K193J206
33086A10381k034K59K791J675m71k566k865l949k806J891N253L345K039M322N246
$$ plain form
33193 61178 62291 66313 69750 70808 70899 71321 70076 69025 70763 73816 75226 72192 65095 58651 55933
33178 55933 57960 61340 62110 63232 65588 65257 61726 58825 57258 55938 56623 60144 63977 65903 65858 64399
33162 64399 63969 66480 68383 68977 70296 75437 80337 81186 78894 75946 74663 76482 81923 87283 88934
33147 88934 87758 86117 85238 83494 80878 77186 73728 75081 79489 82301 82709 84033 85720 88660 93281
33132 93281 95395 96568 97455 94816 91563 89171 87629 88830 91760 94843 99028 103456 107010 103889 98584
33117 98584 98142 101682 102474 99936 99674 101489 104813 106930 104431 99721 98147 97375 97096 99973 103176 104289
33101 104289 102717 99772 96253 95468 96725 98414 100427 101793 103166 104413 106167 106385 106982 109175 110381
33086 110381 108347 108606 111397 113072 112601 110035 107170 103221 100415 102306 107559 110904 112943 117265 122511
33071A22511K884J98J158K300M955P936N694J835l047p870m871K92K818L098J066
33056A40957j31l137k115k22r44P77m79P71K201R03M770Q275N253o51j314J443
33040A56357L069L574K945L806J764j42k20k44o98l171k531L548N078K745K209
33025A78089J453J481N41P96K814K364K62P06N714N162K145K656L388L081J940
33010B12592K237R56j582m355n408n541k946L67M73M29J611R32o3J955J761J978
32994B05396L530O653M880j287j744J674K710J312N72J421J151J287N262O323
32980B39140K826K849M026K804J016l71l48j00L32O16K953L178L49J130J567K205
32964B64172L41k538j144K437O479N641J928o08k611j032K436L568N641Q472P823
$$ plain form
33071 122511 125395 125593 126751 129051 134006 141942 147636 149471 146424 138554 133683 133975 136793 139891 140957
33056 140957 140826 137689 135574 135352 134408 135185 134706 135477 137678 138581 143351 151626 156879 156228 154914 156357
33040 156357 159426 163000 165945 169751 171515 171373 171153 170909 170211 167040 164509 168057 173135 175880 178089
33025 178089 179542 181023 181564 182360 185174 187538 187800 188506 194220 199382 201527 204183 207571 210652 212592
33010 212592 214829 215785 214203 209848 204440 198899 195953 196320 196793 197222 198833 199765 199702 201657 203418 205396
32994 205396 208926 215579 220459 219172 217428 219102 221812 223124 223696 225117 226268 227555 232817 239140
32980 239140 241966 244815 248841 251645 252661 252290 251942 251842 252174 252790 255743 258921 259270 260400 261967 264172
32964 264172 264513 261975 260831 263268 269747 275388 277316 276708 274097 273065 275501 279069 284710 293182 301005
32949C01005N931M979N731P030Q841J1202J0874R713Q895J0517Q928N582O965
32936D06193R846R020Q744J1115J0953R303P898O183N190N320M648M910L020o53
32922E01690N95M482Q388Q807O653M796N001K655K506N570P133Q751J1855R037
32908E87919N396Q696R167O800Q445J2965J4124J0190Q088P748R793J2500J0758
32895G12589Q756J1087J2968J2518J4787J4759J2105J1219J6117K1823J9199J6072
32883H83999J8157J9578J7589J7572J9432J8170J6832J7494J4114J4409J7257
32872A074603J9590K1950K1752K6383L0938K8230K6882L1567L4494L5704L7539
32861A389632L6543L5603L7117L8344L9639L7437L8594M4639M9119M8857M6582
$$ plain form
32949 301005 306936 311915 317646 324676 333517 344719 355593 365306 374201 384718 393646 399228 406193
32936 406193 416039 425059 433803 444918 455871 465174 473072 479255 484445 489765 494413 499323 502343 501690
32922 501690 502285 506767 515155 523962 530615 535411 540412 543067 545573 551143 558276 567027 578882 587919
32908 587919 593315 602011 611178 617978 626423 639388 653512 663702 671790 679538 689331 701831 712589
32895 712589 721345 732432 745400 757918 772705 787464 799569 810788 826905 848728 867927 883999
32883 883999 902156 921734 939323 956895 976327 994497 1011329 1028823 1042937 1057346 1074603
32872 1074603 1094193 1116143 1137895 1164278 1195216 1223446 1250328 1281895 1316389 1352093 1389632
32861 1389632 1426175 1461778 1498895 1537239 1576878 1614315 1652909 1697548 1746667 1795524 1842106
32850A842106M6675M7331N0211N4464N8638O2794O4299O5883P0587P8356Q3437
32839B524781Q8021R3182R6079R7218R6788R9475J04364J08468J14373J20737
32829C543486J26897J34194J38222J43236J50139J58585J67711J75600J83621
32820D921691J95993K10021K22876K36424K49823K64279K82766L03396L23938
32811G211207L39562L56123L78278M01319M22095M44621M73406N06678N40297
32802A1073586N78234O19832O63741P11631P64896Q23673Q89214R59261J035504
32793A8119572J117896J208584J311173J423121J547607J687421J844908K021649
32785C0281931K221776K455008K726383L041747L412997L850070M368062M993070
$$ plain form
32850 1842106 1888781 1936112 1986323 2040787 2099425 2162219 2226518 2292401 2362988 2441344 2524781
32839 2524781 2612802 2705984 2802063 2899281 2996069 3095544 3199908 3308376 3422749 3543486
32829 3543486 3670383 3804577 3942799 4086035 4236174 4394759 4562470 4738070 4921691
32820 4921691 5117684 5327705 5550581 5787005 6036828 6301107 6583873 6887269 7211207
32811 7211207 7550769 7906892 8285170 8686489 9108584 9553205 10026611 10533289 11073586
32802 11073586 11651820 12271652 12935393 13647024 14411920 15235593 16124807 17084068 18119572
32793 18119572 19237468 20446052 21757225 23180346 24727953 26415374 28260282 30281931
32785 30281931 32503707 34958715 37685098 40726845 44139842 47989912 52357974 57351044
32777E7351044N749094O668544P795573R168697J0819060J2736322J4846275J6996876
32769A42131485J8990338K0636470K1798785K2398249K2390918K1695471K0124504
32762B90166220J7415689J3408857Q274563K518743l372528r173417j4672679
32755C04565448j9398652k2731446k4292196k4190258k2908863k0994692j8861565
32748A51187776j6747261j4758119j2929723j1262474r747990q392742p213296
32741G0136171o218277n395394m713722m150374l689109l303446k973423k687430
32733C7004996k436960k217774k024654j852871j702808j567989j445214j335397
32725B2421329j236100j144474j057279r80919r15412q55245q01122p51018p00836
$$ plain form
32777 57351044 63100138 69768682 77564255 86732952 97552012 110288334 125134609 142131485
32769 142131485 161121823 181758293 203557078 225955327 248346245 270041716 290166220
32762 290166220 307581909 320990766 329265329 331784072 328411544 319238127 304565448
32755 304565448 285166796 262435350 238143154 213952896 191044033 170049341 151187776
32748 151187776 134440515 119682396 106752673 95490199 85742209 77349467 70136171
32741 70136171 63917894 58522500 53808778 49658404 45969295 42665849 39692426 37004996
32733 37004996 34568036 32350262 30325608 28472737 26769929 25201940 23756726 22421329
32725 22421329 21185229 20040755 18983476 18002557 17087145 16231900 15430778 14679760 13978924
32716A3978924o54239o12313n73091n37869n09701m81040m51077m21864l96929
32707I340801l75335l54900l33829l13703k93355k78744k68031k58675k46711
32698F617518k31223k18358k09003k00445j93073j83913j75668j65242j55730
32689D884863j49709j41050j35599j33346j26127j12137j00233r6910r8380r5045
32679C696327q8899q3763p8650p6114p6524p8889p8004p4005p3144p4299p3040
32668B840996o8881o3528o2509o2302n7730n0851m6773m9321n1868n2122n1050
32657B224061m6476m2017l7899l2651k9711l0787l3974l4948l6510l8194l5323
32646A825571l4607l5642l2992l0248k9555l1191l2335l0516k7517k5466k5514
$$ plain form
32716 13978924 13324685 12712372 12139281 11601412 11091711 10610671 10159594 9737730 9340801
32707 9340801 8965466 8610566 8276737 7963034 7669679 7390935 7122904 6864229 6617518
32698 6617518 6386295 6167937 5958934 5758489 5565416 5381503 5205835 5040593 4884863
32689 4884863 4735154 4594104 4458505 4325159 4199032 4086895 3986662 3889752 3791372 3696327
32679 3696327 3607428 3523665 3445015 3368901 3292377 3213488 3135484 3061479 2988335 2914036 2840996
32668 2840996 2772115 2708587 2646078 2583776 2526046 2475195 2428422 2379101 2327233 2275111 2224061
32657 2224061 2177585 2135568 2097669 2065018 2035307 2004520 1970546 1935598 1899088 1860894 1825571
32646 1825571 1790964 1755322 1722330 1692082 1662527 1631336 1599001 1568485 1540968 1515502 1489988
32635A489988k4029k2627k0721j8375j9701k2133k4242k4425k2681j9528j6425
32624A255101j5008j4882j9052k0468j8060j6918j7290j9923k0012j8249j5800
32613A059439j5200j4731j2685j2506j5706j4445j3539j5401j7209j7311j3755
32602H96951j1653j2297j4870j5019j4229j4715j2232j2768j4149j3326r873q209
32590G43611p849p033n367m930p060q113n114m845m371m946n336l353n265m926
32576F65103j984l467m979q28L07k757m529o104p752p931p962q896q039n335o192
32561E88655j0368j0572o789m515j483j586m733q272r606j0169p693m147n120
32548E03602q324p645n422o727r116r219r140o926l806k840m750m450m354k871
$$ plain form
32635 1489988 1465959 1443332 1422611 1404236 1384535 1362402 1338160 1313735 1291054 1271526 1255101
32624 1255101 1240093 1225211 1206159 1185691 1167631 1150713 1133423 1113500 1093488 1075239 1059439
32613 1059439 1044239 1029508 1016823 1004317 988611 974166 960627 945226 928017 910706 896951
32602 896951 885298 873001 858131 843112 828883 814168 801936 789168 775019 761693 751820 743611
32590 743611 735762 728729 723362 718432 711372 703259 698145 693300 688929 683983 678647 675294 670029 665103
32576 665103 663119 659652 654673 653845 654152 651395 646866 640762 633010 625079 617117 608221 600182 594847 588655
32561 588655 578287 567715 560926 556411 554928 553342 548609 540337 530731 520562 512869 508722 503602
32548 503602 495278 487633 482211 475484 466368 457149 448009 441083 437277 434437 429687 425237 420883 418012
32534D18012k463m266n544p449n763l646l362m577j387O26k704p836j0020p686
32520C51935l460k167l088m327m225k481q77k398q359j0955q596o224p073o751
32506B80954m644l384k555l917k142N89K186K297k08k367j840k410k750q14k318
32491B56677n007l457k628m424l894k069j582j484j78j285l335j250L03M34j305
32476B25516m351n614o307l241m66L67p52j159k806m387m158m764n089m197m318
32461A74274l094k822q23L406M530K729K92l58J26J923J093l300k653M07K600
32446A78330M13j777j127j927k001l36j592l666l839k569k82K564K296j978k603
32431A59906n36j662k335j463O76M45j196j567k076o79j16r18r56m54J92L33m37
$$ plain form
32534 418012 415549 411283 405739 398290 392527 388881 385519 380942 379555 380181 377477 369641 359621 351935
32520 351935 348475 346308 343220 338893 334668 332187 331310 328912 320553 309598 301002 294778 287705 280954
32506 280954 276310 272926 270371 266454 264312 264901 267087 269384 269176 266809 264969 262559 259809 258995 256677
32491 256677 251670 248213 245585 241161 237267 235198 233616 232132 231954 230669 227334 226084 226387 226821 225516
32476 225516 221165 215551 209244 206003 205537 205904 205152 203993 201187 196800 192642 187878 182789 178592 174274
32461 174274 171180 168358 167535 170941 175471 178200 178492 178134 178260 180183 181276 177976 175323 175730 178330
32446 178330 178743 176966 175839 173912 171911 171575 169983 166317 162478 159909 159627 162191 164487 162509 159906
32431 159906 159370 157708 155373 153910 154586 155031 153835 152268 150192 149513 149397 148479 147523 147069 147261 147594 147157
32414A47157J16p92o89J490N12k508l143m119k201l20J191n16m468o073m040j98
32398A21399J375k67j080j083k919l000m041l332K39J506O75k958n739l719q23
32383I6233P24j185j559j43K058M872L726r64l939l362j522m30n33L096M844K649
32367A04565M33l149k631p28K672K682J167n75n60L116J537m395o101m122L86
32352I4297L048K887L94k23J643J782J824l74j032Nj911k494K07J821P24J162
32336A03760K661M129L064N07n86R0J929L325K715J693M694Q462Q685K614j835
32321A45907j66J589K541L210M487M192L444L661M050N843P387R353J1111J0932
32307B17541R348Q332J0855J1689J1784J2732J3921J5649J6164J5934J7174K3462
$$ plain form
32414 147157 147273 146481 145792 147282 147794 145286 142143 138024 135823 135503 136694 136178 131710 125637 121597 121399
32398 121399 122774 122507 121427 120344 117425 114425 110384 107052 107291 108797 109472 106514 100775 97056 96233
32383 96233 96957 95772 94213 94070 96128 101000 104726 103762 99823 96461 94939 94509 93976 97072 101916 104565
32367 104565 104998 101849 99218 98490 101162 103844 105011 104436 103876 106992 108529 104134 98033 93911 94297
32352 94297 97345 100232 100626 100403 102046 103828 105652 105278 104246 104251 102340 99846 100053 101874 102598 103760
32336 103760 106421 110550 113614 114121 113535 113625 115554 118879 121594 123287 127981 136443 145128 147742 145907
32321 145907 145741 147330 149871 153081 157568 161760 165204 168865 172915 178758 186145 195498 206609 217541
32307 217541 226889 235221 246076 257765 269549 282281 296202 311851 328015 343949 361123 384585
32295C84585K8381K8590K6013K7705L6862M6564N2192N7848P2193R0357J08644
32284I59934J32512J59459J87476K16953K48137K73209K92034L05112L09161L03502
32274C387489K82738K40183J76849R8143Q574q3898j72442k47373k98282l28264
32264C063717l33042l15436k87881k55402k23160j92006j63330j41810j20037
32255A031613r9075q5309p5432o3036n2662m5186m0862l9920l4040k7302k5151
32244D43638k5372k3248j8822j7204j6382j2078q365j0598j2319j2594r864p568
32232B69224m935k43j40m756m344M15L100Q0l322m32L040R57o01L277P379O281
32216B74980N082O438P788R776J1082J1896R675P485O284P806J3450J9415K0301
$$ plain form
32295 384585 412966 441556 467569 495274 532136 578700 630892 688740 760933 851290 959934
32284 959934 1092446 1251905 1439381 1656334 1904471 2177680 2469714 2774826 3083987 3387489
32274 3387489 3670227 3910410 4087259 4185402 4193976 4110078 3937636 3690263 3391981 3063717
32264 3063717 2730675 2415239 2127358 1871956 1648796 1456790 1293460 1151650 1031613
32255 1031613 932538 847229 771797 708761 656099 610913 570051 530131 496091 468789 443638
32244 443638 418266 395018 376196 358992 342610 330532 322167 311569 299250 286656 276792 269224
32232 269224 264289 264046 263906 259150 254806 255221 258321 258401 255079 254647 257687 258644 258043 261320 268699 274980
32216 274980 280062 286500 294288 304064 315146 327042 336717 344202 350486 358292 371742 391157 411458
32203D11458J6730J6212K0994K8005L3067L9565M4894N1263N8560O7936Q1298
32192H69982R7862J18957J49202J81570K10618K40627K69227K90666L07704L20652
32182C057067L21403L04204K66671K08686J32771M6893m6907j42910k28648k98734
32172C620496l42643l52129l37816l14149k82679k46934k11645j80686j54168
32163A197647j30574j10744r4685q0716p0670o2050n0489m2916m1746l8445l1655
32152D42957k8413k8578k4714j8186j6225j4300j2866j3990j4069j3343j3490
32141B44783j0106m921o797j2115j2161q875p732p998p828n878m668n296p507
32128A42901m290K610L256J544L16k948n033m298o32Q79k871n913n001k993l159
$$ plain form
32203 411458 428188 444400 465394 493399 526466 566031 610925 662188 720748 788684 869982
32192 869982 967844 1086801 1236003 1417573 1628191 1868818 2138045 2428711 2736415 3057067
32182 3057067 3378470 3682674 3949345 4158031 4290802 4337695 4290788 4147878 3919230 3620496
32172 3620496 3277853 2925724 2587908 2273759 1991080 1744146 1532501 1351815 1197647
32163 1197647 1067073 956329 861644 780928 710258 648208 597719 554803 513057 474612 442957
32152 442957 414544 385966 361252 343066 326841 312541 299675 285685 271616 258273 244783
32141 244783 234677 229756 222959 210844 198683 189808 182076 174078 166250 160372 155704 150408 142901
32128 142901 138611 141221 144477 146021 146337 143389 138356 134058 133426 134305 131434 125521 120520 117527 114368
32113A14368k941q35J400l24j148j661m311m987n431n011m376l116j452J135K21
32098H1531l19k897o124m273k864o44L363L125j673n276m185k493k837l672l054
32083D7708J866K989J794L701K863l71k510m098j796P27K20P38M48j025j319o82
32067E1253m42j155m419m740j12K652j42l260k065R94L481J541l239n814n976
32052B8557l193j904k537k315j59M807M436R14m1m2L180N312K651j668l054k369
32036C2575k647j639j831J617K339Q56J506O6n98n92r79k591l171q04J691P96
32020B6594J188L757N983M397P45j955L93Q01k676l630l111p19J08n3L075K760
32004C7657k429l922j943r13N72K379K647J033j641j387j102k754k860j940o19
$$ plain form
32113 114368 111427 110592 111992 111668 110520 108859 104548 99561 94130 89119 84743 81627 80175 81310 81531
32098 81531 81212 78315 72191 67918 65054 64410 67773 70898 69225 63949 59764 57271 54434 50762 47708
32083 47708 49574 52563 54357 58058 60921 60550 58040 53942 52146 52873 53093 53831 54279 53254 51935 51253
32067 51253 50811 49656 45237 40497 40385 43037 42895 39635 37570 38564 42045 43586 40347 34533 28557
32052 28557 25364 23460 20923 18608 18449 23256 27692 28606 28565 28523 31703 37015 39666 37998 34944 32575
32036 32575 29928 28289 26458 28075 30414 31270 32776 32842 32244 31652 30673 28082 24911 24107 25798 26594
32020 26594 27782 31539 37522 41919 42664 40709 41102 41903 39227 35597 32486 31767 31875 31822 34897 37657
32004 37657 35228 31306 29363 28450 29022 31401 34048 35081 33440 32053 30951 28197 25337 23397 22778
31989B2778j333l289m567q90L874L176O43j43k650k831K195L615K77k540n72K070
31973A9813J691Q74K124L430K969J645j133l249m434m415j521j882o50P33K325
31958A8320J300K601M426J608j584k227P73M57l324l576o36M293M175j057l248
31943B2301l206J142L590J096n62l90j112j430j490l097j886J042J554P36l34
31928A7954j157q15Q52J256K90p39k077l695j665L57j809j344o0J107J824M023
31912A4302K876J020O1q10j332n99K775M579l2m979m657j565J487J314j214l920
31896I306j677O27L31Q18N91J786K173J264l514n671B383J79L207L349K42j652
31880G708J576J090q55R21O19l63N47n18k878k722m94O26K577M435K397J114L378
$$ plain form
31989 22778 21445 18156 13589 12699 16573 19749 20392 20249 17599 14768 16963 20578 20855 18315 17743 19813
31973 19813 21504 22378 24502 27932 30901 32546 31413 28164 23730 19315 17794 15912 15262 15995 18320
31958 18320 19620 22221 26647 28255 26671 24444 25217 25674 22350 18774 18138 22431 26606 25549 22301
31943 22301 19095 20237 23827 24923 24361 23971 22859 21429 19939 16842 14956 15998 17552 18288 17954
31928 17954 16797 15982 16834 18090 18380 17641 15564 11869 10204 10561 8752 7408 7348 8455 10279 14302
31912 14302 17178 18198 18259 17449 16117 15518 18293 22872 22840 17861 13204 11639 13126 14440 13226 9306
31896 9306 7629 8256 8587 9405 9996 11782 13955 15219 11705 6034 2383 2562 5769 9118 9360 7708
31880 7708 9284 10374 9519 10440 11059 10696 11243 10725 7847 5125 4631 5257 7834 12269 14666 15780 19158
31863A9158M761K028j306k252j791k964l470k484k372j591J31N74K250J488j217
31848A0943k935l354B210G38M89P80j56J483J734J827N08J695L833K641M69k33
31832A5808m19Q0J89j785N23K560q26j564p38j000j167J032K620J959n55k848
31816A3869m87J984Q66l752m766k169J815J748l557j828K437J672K777O675M967
31801B2251J158k642m025m911n107k825r25n06q91a328l890Q60a767B71J633K58
31785B162K68L33A295b568l881j553J775c095B010L398J322M427L225o24r2L882
31769A7548L602j318m282m647L91N029J711r45M14j948l524n884b390p233m416
31754a4039J411e425B119L610J934J515p2n55k684A675d8F39J267Q39j228P66
$$ plain form
31863 19158 23919 25947 24641 22389 20598 17634 14164 11680 9308 7717 7848 8422 10672 12160 10943
31848 10943 8008 4654 2210 738 1227 2007 1851 3334 5068 6895 7403 9098 12931 15572 16041 15808
31832 15808 15389 15469 15658 13873 14396 16956 16130 14566 13828 12828 11661 12693 15313 17272 16717 13869
31816 13869 13382 15366 16232 12480 7714 5545 7360 9108 5551 3723 6160 7832 10609 17284 22251
31801 22251 23409 20767 16742 11831 6724 3899 2974 2468 1577 -1328 -5218 -4358 -1767 271 1904 2162
31785 2162 2430 2763 1295 -2568 -6449 -8002 -6227 -3095 2010 5408 6730 11157 14382 13758 13666 17548
31769 17548 21150 19832 15550 10903 11294 16323 18034 17089 17503 15555 12031 6147 -2390 -9623 -14039
31754 -14039 -12628 -5425 2119 5729 7663 9178 9106 8551 5867 1675 -48 639 1906 2745 1517 2283
31738B283R20j572g45j711m3c06A710M58J966K437K643K88j924l510j605Q83N97
31721C943P57K158K093P31k941j579K900K133N53n0k842k326K492J693n07L38
31705I546L253L821m34l047l756k256J700L194J938N37P26L290N047J380l971
31690B0968l876k623k358n108A881b14B471N816J415l922j776L865K877j388k099
31675G259k95q43k377j76M247O840L399j365j702k609l019P39K374K335J293k184
31659A3916j873n99j741n66n99l200j562J846K237L010K822J394l44j915M53J851
31643A5130K46j773k183k664k742L15K489j096B217b043m13D69L206O80p09n24
31627C122Q46J222K754J992j44P60J076j127k318p51M88M92J853K040M275N024
$$ plain form
31738 2283 3203 1631 -745 -2456 -2499 -306 1710 2168 4134 6571 9214 9502 7578 4068 2463 3346 3943
31721 3943 4700 6858 8951 9682 6741 5162 8062 10195 10748 10698 7856 5530 8022 9715 9208 9546
31705 9546 12799 16620 16186 13139 9383 7127 8827 12021 13959 14496 15222 18512 23559 24939 20968
31690 20968 17092 14469 12111 7003 1881 -214 2471 8287 9702 5780 4004 7869 10746 9358 7259
31675 7259 6964 6121 3744 3568 7815 14655 18054 16689 14987 12378 9359 10098 12472 14807 16100 13916
31659 13916 12043 11444 9703 9137 8538 5338 3776 5622 7859 10869 13691 15085 14741 12826 13279 15130
31643 15130 15376 13603 11420 8756 6014 6329 8818 7722 2217 -2043 -2456 469 3675 4355 3646 3122
31627 3122 3968 5190 7944 9936 9792 10552 11628 10501 8183 7432 7920 8412 10265 12305 16580 21604
31611B1604J516m217q631C634A028a610m645j107c561C312O688M960K946R10j397
31596A7419j675k226k267k9J426L553L690j342n461n341j469j732j990Q99J409
31581D864N77K66Q98J295K573J927j551l459k168P05K291J496L364K753M21O28
31565A6880K97L341L408j564k571j853l291j178J696J308J756K276J817r37l174
31550A8211j585J836l1l608m484k648J118L507L339r31l348k499k090p56j847
31535D184I55a236b14B155k75o12L126L144J934K061Nj20J343L209K354k6j681
31518A6617j841j141k006l136j213M80p80B983E54M6N9B12a060K79A917K620K094
31501F631K084P13l039B083a707j599J192A381M257J418j172k152j98J531k90
$$ plain form
31611 21604 23120 18903 10272 3634 1028 -1610 -6255 -7362 -3561 3312 10000 14960 17906 18816 17419
31596 17419 15744 13518 11251 11222 12648 16201 19891 18549 13088 7747 6278 4546 2556 3455 4864
31581 4864 5441 5707 6605 7900 10473 12400 10849 7390 5222 5927 8218 9714 13078 15831 16252 16880
31565 16880 17177 20518 23926 22362 19791 17938 14647 13469 15165 16473 18229 20505 22322 21385 18211
31550 18211 16626 18462 18431 14823 10339 7691 8809 12316 15655 14724 11376 8877 6787 6031 4184
31535 4184 955 -1236 -214 2155 1880 1268 4394 7538 9472 11533 11538 11418 12761 15970 18324 18298 16617
31518 16617 14776 13635 11629 8493 7280 7760 6980 2983 554 600 659 212 -1060 -781 1917 4537 6631
31501 6631 8715 9428 6389 2083 -1707 -3306 -2114 1381 5638 7056 5884 3732 3534 5065 4775
31486D775p18Q97J935R9q89L77N5P52Q32j34K96K16l48P3K03j862k645k53R93
31467D654L522M766K706J660K314K950L94j647l606l108j453q49j648j818j177
31452G660j264j53K871N079M261q29l763j403K992L381l76j059P38k229l810j213
31436A0883J481J974J716J741P71o24j948j359j965j320J750J150K56K059K134
31421A8699l41j900l134k017J047L877L054R40k724n158k970j871r55J729L460
31406A1736O03k101J432L197M422N177M37l751k200J192J492M76l88j129N9O15
31390B1269L18J450J024M76K753M556M105K480q17k571l577j313J140L18m56j124
31374C0031n8j343j056J852K805K946M650L169r7n21k426j036M143N943L392j382
$$ plain form
31486 4775 4057 4954 6889 6988 6099 6476 6531 7283 8115 7981 8277 8493 8145 8218 8421 6559 3914 3661 4654
31467 4654 8176 12942 15648 17308 19622 22572 22966 21319 17713 14605 13152 12303 10655 8837 7660
31452 7660 6396 6243 9114 14193 18454 17625 13862 12459 15451 18832 18456 17397 18135 15906 12096 10883
31436 10883 12364 14338 16054 17795 18566 17942 15994 14635 12670 11350 13100 14250 14506 16565 18699
31421 18699 18358 16458 13324 11307 12354 16231 19285 20225 17501 12343 9373 7502 6547 8276 11736
31406 11736 12339 10238 11670 14867 19289 24466 24903 21152 18952 20144 21636 22112 21724 20595 20654 21269
31390 21269 21587 23037 24061 24537 27290 31846 35951 38431 37614 35043 31466 30153 31293 31611 31155 30031
31374 30031 29973 28630 27574 29426 32231 35177 39827 42996 42899 42378 39952 38916 43059 49002 52394 51012
31358E1012j067K393K962o09k121P72K655K361L615L345J499J193j74N8n89j539
31342F5766J048M912P748M627J891K592L167K272J685L553N994M054O65J531M492
31327A15997L961K245L582M624N874O693P710R854J0788J1789J0885R489J1033
31314B14524J0665J2185J4738J4907J5330J4441J4122J7344K0430J9119J7131
31303C84936J9986K3815K7379L0130L3249L5897L9837M7859N6657O1490O7356
31292H28591P7396Q6957R7470J13544J34053J51223J70186J93932K17758K39644
31282B310754K60093K80533K95912L01271L02892K99255K82336K56849K19223
31273D809118J72880J27895Q0269K4459l6476r4439j50618k04921k52699k93214
$$ plain form
31358 51012 49945 52338 55300 54691 52570 53342 55997 58358 61973 65318 66817 68010 67836 67894 67305 65766
31342 65766 66814 71726 79474 84101 85992 88584 91751 94023 95708 99261 105255 109309 109974 111505 115997
31327 115997 119958 122203 125785 130409 136283 142976 150686 160540 171328 183117 194002 203491 214524
31314 214524 225189 237374 252112 267019 282349 296790 310912 328256 348686 367805 384936
31303 384936 404922 428737 456116 486246 519495 555392 595229 643088 699745 761235 828591
31292 828591 905987 992944 1090414 1203958 1338011 1489234 1659420 1853352 2071110 2310754
31282 2310754 2570847 2851380 3147292 3448563 3751455 4050710 4333046 4589895 4809118
31273 4809118 4981998 5109893 5190162 5214621 5178145 5083706 4933088 4728167 4475468 4182254
31263D182254l23310l36658l31360l14326k91204k63583k32022k05871j81341
31254A702579j57848j37816j21002j04972r1084q2241p2907n8889m7714m6313
31244G81793m8383m4796l7935l1954k8452k5683k3493k1256j7945j5923j3275
31233D72698j1419j0247j0933r885o959m406m538k640L30J414M119O180P376R414
31219D40504J1902J0392J1120J2028R199J0188J4114J6418J9664K3222K5900K9019
31207F33670L5804M3625M7757N0669N4132O3569P5745Q5277R8593J15473J35934
31196A440248J56555J73447J93917K16199K42341K67106K84780K99168L08981
31187C582742L10250L06477K93880K68026K30579J87514J43908R1797L4524k5698
$$ plain form
31263 4182254 3858944 3522286 3190926 2876600 2585396 2321813 2089791 1883920 1702579
31254 1702579 1544731 1406915 1285913 1180941 1089857 1007616 934709 875820 828106 781793
31244 781793 733410 688614 650679 618725 590273 564590 541097 519841 501896 485973 472698
31233 472698 461279 451032 440099 430214 423255 418849 414311 411671 412001 413415 417534 423714 431090 440504
31219 440504 452406 462798 473918 485946 495145 505333 519447 535865 555529 578751 604651 633670
31207 633670 669474 713099 760856 811525 865657 929226 1004971 1090248 1188841 1304314 1440248
31196 1440248 1596803 1770250 1964167 2180366 2422707 2689813 2974593 3273761 3582742
31187 3582742 3892992 4199469 4493349 4761375 4991954 5179468 5323376 5415173 5449697 5423999
31177E423999q7999j51335k07986k58075l02720l35734l50500l50001l36106l10250
31167B733293k81987k55049k26845k00750j73810j49120j32427j18930j01578
31158A092797q6947p4378o4049o1218n9396n1523m4801l9981l5880l3990l1985
31147E08649k6260k3591k2228k2499k4234k2293k0222k0035j7557j3131j2349
31136B84250j4714j6289j4938j2013p752o718r266j1673j0400p311n921l426j008
31123A62821j777m563o105p386q026n261j684l314o991m622k326k322l585m482
31109A00377l649o375p289k513J87k167l908j798J790n28m600n899l713J178M24
31094F1517k889K24R16l602l018o26P15K168J325j479j373K95J234J64r43J1n76
$$ plain form
31177 5423999 5336000 5184665 4976679 4718604 4415884 4080150 3729650 3379649 3043543 2733293
31167 2733293 2451306 2196257 1969412 1768662 1594852 1445732 1313305 1194375 1092797
31158 1092797 1005850 931472 867423 806205 746809 695286 650485 610504 574624 540634 508649
31147 508649 482389 458798 436570 414071 389837 367544 347322 327287 309730 296599 284250
31136 284250 269536 253247 238309 226296 218544 211826 202560 190887 180487 173176 167255 163829 162821
31123 162821 161044 156481 150376 142990 134964 129703 128019 124705 117714 113092 110766 108444 104859 100377
31109 100377 96728 90353 83064 80551 80738 78571 74663 72865 74655 74127 69527 63628 59915 61093 61517
31094 61517 58628 58852 59768 56166 53148 52522 53237 55405 56730 55251 53878 54173 55407 55571 54628 54639 54063
31077E4063K00J311p33j089J569Q57m485n742l287n71J037k18m186k581J809J205
31061C9159N01n88k270k585j545q75j202J381N779M236n34l177m767l070k941
31046B7502q60R13J842Q02j527k726j852R7N14P80O85n33j294L47K90j835j115
31029B2030K266L457J023n51L38q7l091n199m435l356k114O92L740O009M529R23
31013B6174k366m230j091K082J054o78m022l408J391L271L30k207k956j168J073
30998A3249J492M71P98N02k379k581M33J534J752P39k956n263k044K531L718J769
30982A3765J007K994L814J628k241m835l626L67J554K169J348q15o05J886L310
30967B1720L95l600j848J64p70k235j140j602k105j581j07M22J452L092J654o9
$$ plain form
31077 54063 54263 55574 54841 53752 55321 56178 51693 45951 42664 42093 43130 42912 38726 36145 37954 39159
31061 39159 39660 39072 36802 34217 32672 31797 30595 31976 37755 41991 41457 38280 33513 30443 27502
31046 27502 26642 27555 29397 30199 28672 25946 24094 24191 24705 25485 26170 25637 24343 24690 24980 23145 22030
31029 22030 24296 27753 28776 28225 28563 28476 25385 20186 15751 12395 10281 10973 14713 20722 25251 26174
31013 26174 23808 19578 18487 20569 21623 20945 16923 13515 14906 18177 18507 16300 13344 12176 13249
30998 13249 14741 15212 16010 16512 14133 11552 11985 13519 15271 16010 13054 7791 5747 8278 11996 13765
30982 13765 14772 17766 21580 23208 20967 16132 12506 12873 14427 16596 17944 17129 16524 18410 21720
30967 21720 22115 18515 16667 16831 16061 13826 12686 11084 8979 7398 7291 7713 9165 12257 13911 13842
30951A3842Q36K012J399K206K483M48j880l219m488j724J028K886J376k866k826
30936A1513k092k958j094L8j159j823J568K718Q49K726K579K376J153j498m329
30921A0567m759o74L496n56l654J051n77I44g06A300J777o47r88L704M509j154
30905H501l637p02J647J196L620N090J726j438k68J974l13l464m161k443j393
30890E935J460P99k710e26o483m22K946K222a044k386k499k93j671j256J020O19
30874g510k975j992K493M549K562Q3j773l088J936i51I98J60a22k801k758o32
30858f313J775a21B621L56q09I54a373l247o7a959i39k006j287O93j557l000O05
30841g491c640a238j69e2B826G48d602k316Q11J101J441a170E23K01K172K932
$$ plain form
30951 13842 14678 16690 18089 20295 22778 23226 21346 18127 13639 11915 12943 15829 17205 14339 11513
30936 11513 9421 6463 5369 5407 4248 2425 3993 6711 7560 10286 12865 15241 16394 14896 10567
30921 10567 5808 5134 8630 8074 4420 5471 4894 944 -706 1300 3077 2430 1442 5146 9655 8501
30905 8501 4864 4162 5809 7005 10625 15715 17441 16003 15735 17709 17396 13932 9771 7328 5935
30890 5935 7395 8194 5484 -526 -7009 -7431 -4485 -2263 -1044 -3430 -5929 -6222 -7893 -9149 -8129 -7510
30874 -7510 -10485 -12477 -9984 -5435 -2873 -2790 -4563 -7651 -5715 -951 998 1158 -122 -2923 -5681 -6313
30858 -6313 -4538 -121 2621 2977 2168 954 -1373 -4620 -4687 -1959 -939 -2945 -4232 -3539 -5096 -8096 -7491
30841 -7491 -3640 -1238 -1407 -52 2826 748 -4602 -6918 -6107 -5006 -3565 -1170 523 724 2896 5828
30825E828K513m11k069p92J168K767j176B031d382l711J123a733C206M305P40
30810H251C326b595k733O11K295H4a73B81R49J431L671M458L347j741j722N47
30794A1221j438D392b826l576o07r23N96J583J646f53Q3j488j119m55j191L35
30778d488K008l82k155k199j651L77J210N16n4q98J468b271A680K847N80J050
30762F157P54j581j329o32l92j173I3K091N090N662L372k21j621P96N86M30j54
30745A6124j785k638k386j849j231R13J955J21j662k160k538j345E97a025k760
30730c785K77J107k005j913o37K367f6B268J683J773k44k484c955o602K9L154
30714g374b383C661M825K070o51k102l158b073o587k745K13j057L76M026c108
$$ plain form
30825 5828 8341 7930 5861 5069 6237 9004 7828 2031 -4382 -8093 -6970 -1733 3206 7511 8251
30810 8251 3326 -2595 -5328 -4717 -2422 84 -173 281 1230 2661 6332 10790 14137 12396 10674 11221
30794 11221 9783 4392 -2826 -6402 -7009 -7932 -7336 -5753 -4107 -653 -570 -2058 -3177 -3632 -4823 -4488
30778 -4488 -2480 -2862 -5017 -7216 -8867 -8490 -7280 -6764 -6818 -7716 -6248 -2271 1680 4527 5107 6157
30762 6157 6911 5330 4001 3369 2977 1804 93 2184 7274 12936 16308 16087 14466 15262 15848 16278 16124
30745 16124 14339 11701 9315 7466 6235 7148 9103 9224 7562 5402 2864 1519 597 -1025 -3785
30730 -3785 -3508 -2401 -4406 -6319 -6956 -4589 -66 2268 3951 5724 5480 2996 -3955 -10557 -10528 -7374
30714 -7374 -2383 3661 8486 10556 9905 7803 4645 -2073 -8660 -11405 -11192 -12249 -11873 -7847 -3108
30698c101l412m022j115L328d041J777g46E31a669k072Q01A58L918K132l01J092
30682F999J734l73l115A876e28l231l74a415A587L054k62K03O606N648J787j058
30666A7565j812j582k414l21L464J025k279j891M31J394J168o42l143l657B980
30650d20j140K27a44B254J171J701K695L262J172l494A539d978j415J765M51k179
30634f356m324l157Q19L172L564R58l12J914c7B931m84A041J320K567Q67j417
30618D378m32j379j001J092n63d81k405j620r50l469m790n83K940K110K427L326
30602c495a193D07K308K828J34L97K431Q19k317j449n42q86n73n77A040i15j83
30585a098A488j3a333p22k78n60Q95q55k153J011J615L97M83l06d35B664o14K20
$$ plain form
30698 -3101 -6513 -10535 -11650 -8322 -4041 -2264 -746 531 -1669 -3741 -2940 158 4076 6208 5907 6999
30682 6999 8733 8360 5245 1876 -528 -3759 -4133 -1415 1587 4641 4379 4582 11188 16836 18623 17565
30666 17565 15753 14171 11757 11436 14900 15925 13646 11755 12186 13580 14748 14106 10963 7306 2980
30650 -420 -1560 -1333 -144 2254 3425 5126 7821 11083 12255 8761 1539 -4978 -6393 -4628 -4177 -6356
30634 -6356 -10680 -13837 -13018 -9846 -6282 -5324 -5636 -3722 -37 2931 2447 1041 2361 4928 5795 4378
30618 4378 3946 2567 1566 2658 2095 -481 -2886 -4506 -5456 -8925 -13715 -14298 -11358 -9248 -6821 -3495
30602 -3495 -1193 407 2715 5543 5677 6074 8505 9324 7007 5558 5016 4130 3557 2980 1040 -915 -1098
30585 -1098 1488 1475 -1333 -2055 -2333 -2893 -1998 -2853 -5006 -3995 -2380 -1983 -1500 -1806 -435 2664 2050 2270
30567B270K216M78B378f89j120n44i94A330Q60K563L249J708L28k483k158P52
30551F149l11k462b305m749k458N32L250K647O69P12J77r51k594k507j064j234
30535i875j55J335J669K63N36M46m48J929J345j232k160m40J704a675A272N94
30519A866a372n242l90c057E14J034a698m476j545J161K104N73j017J474a183
30503A120K555r66f33j922K61A29N027M635J78j781k531k413j048M77K97i19k559
30486c478K62J13l76M19h46H60J828J00j231b26m112o122m715J150N632d146b013
30468H36L205J009q02j713a276l424j34j30j471J884b105M95A53L602K603n03
30452E855B066a524k148l70l43j892M14K895a361L91A159O67I1e03H38K396o44
$$ plain form
30567 2270 4486 4964 2378 -689 -1809 -2353 -994 1330 2190 4753 8002 9710 10038 7555 5397 6149
30551 6149 5838 3376 -2305 -7054 -9512 -8980 -5730 -3083 -2414 -1702 -1525 -2476 -5070 -7577 -8641 -9875
30535 -9875 -10030 -8695 -7026 -6763 -6227 -5781 -6229 -4300 -2955 -4187 -6347 -6787 -5083 -1675 1272 1866
30519 1866 -1372 -6614 -7004 -3057 514 1548 -1698 -6174 -7719 -6558 -4454 -3881 -4898 -3424 -1183
30503 1120 3675 2709 -633 -2555 -2294 129 5156 9791 9969 8188 5657 3244 2196 2673 2970 -919 -3478
30486 -3478 -3216 -3103 -3479 -3060 -846 860 2688 2788 1557 -226 -4338 -10460 -15175 -14025 -8393 -4146 -2013
30468 836 4041 5050 4248 2535 -1276 -4700 -4834 -4964 -6435 -4551 -2105 -1610 153 3755 6358 5855
30452 5855 2066 -1524 -3672 -4042 -4385 -6277 -5863 -2968 -1361 -970 1159 1826 91 -503 838 3234 2590
30435B590I53Gi49q42p87o30a220A936O55j129b677q517o284j467L554N113K408
30418g870j670m415k972K61L625L938K571K134a637I27L67e83j643k494k717l42
30402g779j361j510j139n22L606c969c28H51A09a728k538N87J72j990r02J674
30386d725J842M64J121A78K566J595m72A128a156n21A215M639K788j516k814j625
30370B687q0J313A815c189m513R42i44C025j377p01N44N03J203O50j062D40d13
30352B199O16d20m459k905J15J288l10k791m181j250L643K867M88j04K248e98
30335E693O594M856R38q96j502j085M21R28k86L24m85k210j795j226J144L568
30319A4981L621J757j012j699p83K21L858M718R77k636j595k186l003k610k209
$$ plain form
30435 2590 953 7 -949 -1791 -2578 -3208 -1220 1936 2591 1462 -2677 -11194 -17478 -18945 -15391 -10278 -7870
30418 -7870 -9540 -13955 -16927 -16666 -13041 -9103 -6532 -4398 -1637 927 1294 -583 -2226 -4720 -7437 -7779
30402 -7779 -9140 -10650 -11789 -12311 -8705 -3969 -328 851 109 -1728 -4266 -3679 -3507 -5497 -6399 -4725
30386 -4725 -2883 -2419 -1298 178 2744 4339 3867 1128 -1156 -1677 1215 5854 8642 7126 4312 2687
30370 2687 2607 3920 1815 -3189 -7702 -6760 -944 3025 1648 947 1491 1994 3197 3847 2785 440 -413
30352 2199 2815 -420 -4879 -7784 -7669 -6381 -6691 -9482 -13663 -14913 -11270 -8403 -7915 -8019 -5771 -598
30335 5693 12287 17143 18081 17185 15683 14598 15019 15947 15661 15985 15500 13290 11495 10269 11413 14981
30319 14981 18602 20359 19347 17648 16865 17086 20944 25662 26639 24003 22408 20222 17219 14609 12400
30304A2400l470l257B510b318m687l271k452l66K142L683L626a120E02c8k275
30289b313j505l28O40L02j170k494j78c092b79l68k130k285j420J587A68N725
30273E893J915j252k245A556a500j020i67H52K036M00l46q6l83A220b737m791
30257g528r52L431d30A403b1j057m1o88r95Mg96H59b20o20k27p16O37c24qB93
30236B512K865K325L26n35K34J694K265j243k798o80j45L03K590L497Q35R53Q28
30219A5826j329q28k209l99M597M497J838p76k087q06M94l526G454A041c05B577
30202F036J695K112J629J101J778l00k392j102J561J80j515J45n44p42J740J46
30186A1528m639B963j088J587K212o0k454A28b573j364hE646K192Q65K71n69k96
$$ plain form
30304 12400 8930 5673 2510 -2318 -7005 -10276 -12728 -13094 -10952 -7269 -3643 -1120 502 -38 -2313
30289 -2313 -3818 -4146 -3506 -3204 -4374 -6868 -7046 -3092 -279 -647 -2777 -5062 -6482 -4895 168 5893
30273 5893 7808 6556 4311 1556 -1500 -2520 -967 852 2888 3288 2942 2856 2473 1220 -2737 -7528
30257 -7528 -8480 -5049 -430 1403 -21 -1078 -1119 -1807 -2802 -2798 -796 859 -220 -840 -1067 -1783 -1146 -324 -332 293
30236 2512 5377 7702 8028 7493 7727 9421 11686 10443 7645 6965 6820 7123 9713 13210 14045 14998 15826
30219 15826 14497 13669 11460 11061 15658 20155 21993 21217 19130 18324 18818 15292 7454 1041 -305 2577
30202 6036 7731 9843 11472 12573 14351 14051 11659 10557 12118 12298 10783 10928 10384 9642 11382 11528
30186 11528 6889 2963 1875 3462 5674 5614 3160 128 -2573 -3937 -8 5646 7838 8703 8974 8405 8109
30169H109m50m53j67j413A822a573n57f96K80a90F79K49N62J867K478O78P06K85
30151G504j977k606A447J975J932B240a783q48K23e78G06A2a519l148j103K522
30135c248J321j003J026A997J800A635a154K68A274O46k97m4B70c440k914k66
30119f620N64M04J772Q85j802L29D91M259R1j246J44M47o29A588a303l983l931
30102i217j707J364K338K721b056F91K658J431p73H80a824j594j842k595j038
30087h893J592J352l41J370J235k045l159o18Q63Q31l71O2J126K382f69C765L008
30070F773K91l89L34j095B547a364k956j062K64l99k337j780n90j487n92K361
30054i942L739a928E92J135k37d42l10B531M847J511k23K128L129p98k413J009
$$ plain form
30169 8109 7659 7206 7039 5626 1822 -1573 -2130 -696 -416 -190 679 928 1490 3357 5835 6513 7219 7504
30151 7504 5527 2921 1447 3422 5354 2240 -1783 -2631 -2408 -578 706 12 -1519 -4667 -5770 -3248
30135 -3248 -1927 -2930 -1904 1997 3797 1635 -1154 -886 1274 1920 1623 1579 270 -3440 -6354 -6620
30119 -6620 -6056 -5652 -3880 -2995 -4797 -4468 491 4750 4841 3595 3739 4186 3557 1588 -1303 -5286 -9217
30102 -9217 -10924 -9560 -7222 -4501 -2056 691 3349 4780 4007 880 -1824 -3418 -5260 -7855 -8893
30087 -8893 -7301 -5949 -6290 -4920 -3685 -5730 -8889 -9507 -8644 -7813 -8184 -8122 -6996 -4614 -669 3765 6773
30070 6773 7064 6675 7009 5914 2547 -1364 -4320 -5382 -5118 -5517 -7854 -9634 -10224 -11711 -12303 -9942
30054 -9942 -6203 -1928 592 1727 1490 -442 -752 2531 7378 8889 8666 10794 13923 13125 10712 11721
30038A1721K058m73K5L67K01j128m539B195b057m465l938M78J478L28K093b178
30021A290J077R98H08d848q86J890J675k27Q79a21r29k613k550j017K65M2J919
30004e004b292j739n667l188K13R81K043K690K031P56K84o69j185L5M71k710m017
29987a1963j575J259J627M24LJ239J238L98p80j584p29k19Q57K600L326E45L203
29970C748A682a307j688p43Q83m1j258p79j61j255j567K66J729K367a672b21A965
29952C883A400b744Q20A301m31c004m847l100K074L272J854E43L407P37R17K893
29936H497M612L742K324q10k745l550j507r90k256l356h31q10k06l257l094p5
29920h273L171J522J347d04P7j058n5N2J87N36K35D52K241O56J795J839o57B529
$$ plain form
30038 11721 13779 13306 13331 13698 13899 12771 8232 2195 -2057 -6522 -10460 -9982 -8504 -8176 -6083 -2178
30021 1290 2367 3365 808 -4848 -5734 -3844 -2169 -2396 -1517 -121 -1050 -3663 -6213 -7230 -6965 -6923 -5004
30004 -5004 -2292 -4031 -9698 -12886 -12673 -11692 -9649 -6959 -4928 -4172 -3888 -4557 -5742 -5707 -5236 -7946 -11963
29987 -11963 -13538 -12279 -10652 -10228 -10225 -8986 -7748 -7350 -8130 -9714 -10443 -10662 -9805 -7205 -3879 545 3748
29970 3748 1682 -1307 -2995 -3738 -2855 -2896 -4154 -4933 -5094 -6349 -7916 -7650 -5921 -3554 -1672 -221 1965
29952 3883 1400 -2744 -1924 1301 870 -3004 -7851 -10951 -8877 -5605 -3751 543 3950 4687 5604 8497
29936 8497 13109 16851 19175 18365 15620 12070 10563 9573 7317 3961 -831 -1641 -1847 -5104 -8198 -8273
29920 -8273 -5102 -3580 -2233 -404 -327 -1385 -1440 -1388 -1201 -665 -430 452 2693 3349 5144 6983 6326 2529
29901g0j155eC239o71c063o576k457J364R52J15J741L527i53l84k727K85J601
29884b178j74j358j379M45J040P69j272l540m376j852J449K767L900b567R00f67
29867a508k516p42J023J648G69K036K203M403o63D317A239b540o62J444j012l052
29851e822k031R04J519N75L6J971E94a09l155R27C078K685j763D44b443j685N63
29834c565C513R537M048k275n532l350k103A189A3d74j194g78C182M337K263k82
29818I500l29r33l131D50c230j105J341f64C06a796j828J588B229L787n52k377
29802C087L05K050N79j462k243p42j80J928J997n09k231b32B99P08a480L11B989
29784G487R91M72L13j326k397k05L367K976q10j867l91k972G63c419j185J729
$$ plain form
29901 -70 -1225 -5 3239 2568 -3063 -9639 -12096 -10732 -9780 -9665 -7924 -4397 -953 -1337 -4064 -3779 -2178
29884 -2178 -2352 -3710 -5089 -4644 -3604 -2835 -4107 -7647 -12023 -13875 -12426 -9659 -5759 -2567 -1667 -667
29867 -1508 -4024 -4766 -3743 -2095 769 2805 5008 9411 8748 4317 1239 -2540 -3202 -1758 -2770 -5822
29851 -5822 -7853 -6949 -5430 -4855 -4819 -2848 594 -109 -3264 -2337 3078 5763 4000 444 -2443 -4128 -3565
29834 -3565 3513 13050 17098 14823 9291 5941 3838 1189 13 -474 -1668 -778 3182 7519 9782 9500
29818 9500 9171 8238 5107 450 -3230 -4335 -2994 -664 306 -1796 -3624 -2036 2229 6016 5464 3087
29802 3087 3392 5442 6021 4559 2316 1574 1394 3322 5319 4810 2579 -232 299 1007 -1480 -1169 2989
29784 7487 8478 8950 9263 7937 5540 5335 8702 11678 10868 9001 8610 5638 763 -3419 -4604 -2875
29768b875a213J79L72m07m95d2I87J188K637K049L049J271j665l233j729J50k84
29751D420j700B55b243o81q83k81a750A921M344M894M829K948J060k776p238B610
29734a568F68L702K105K53J118J984J557j581l522j148l09o56n12j216j051J810
29718C202N192O178Q40j29K359K47k985n512D380A733E24J12R43n2N48M573L665
29701A0313M65m053d29k949n06K80Q20j732j844K240b69E12c60r86o23a79E675
29683I722L455M922q2l723o62K743J617q8N06K029K626R17j35o97p61k994k688
29666A6707j659l869l512r11J880L020M34l301n84L426J097J217J525R95J304
29651A7769J078j4P84P50j051k208j319r7L768N418L223M104K722L98q39l210
$$ plain form
29768 -2875 -1213 -1034 -662 -1069 -1564 -42 987 2175 4812 6861 9910 11181 9516 6283 4554 4704 4420
29751 4420 2720 255 -2243 -2924 -3807 -4088 -1750 1921 6265 11159 15988 18936 19996 17220 9982 2610
29734 -1568 668 4370 6475 6728 7846 9830 11387 9806 6284 5136 4827 4171 3659 2443 1392 3202
29718 3202 8394 14572 15412 15283 17642 17889 14904 9392 4380 1733 524 636 1579 1527 2075 6648 10313
29701 10313 10778 6725 -429 -3378 -3884 -3604 -2784 -4516 -6360 -4120 -269 512 -360 -1346 -1969 -179 5675
29683 9722 13177 18099 18017 14294 13632 16375 17992 17904 18410 20439 23065 23982 23847 23150 22389 19395 16707
29666 16707 15048 11179 7667 6756 8636 11656 12090 8789 8205 11631 12728 13945 15470 16465 17769
29651 17769 18847 18833 19617 20367 19316 17108 15789 15692 19460 24878 28101 32205 34927 35325 34486 31276
29635C1276m144j520N13l44j357j514P42J339j156m57O49k331l774r13N61o42
29619A6928k438k535M21Q00K24K914J464k264l285q33J789J130P58J1l452l443
29603H189Q62L530P57r62k23J739N030M634K994O42O77P86J57j735l848l330l078
29586A6821l157j982j698j275k5K097J417k630k149K33K7k554k053J507K346O86
29570G611l51l36J1k77p70R16j9j889j703A246b29A357J376g62n212k002J158
29553f818J150R47R24a665B135M040K64C056I4a902N75B775L981M92K26L550K085
29536A3109l174m585B153D84a026d24C774L125J77L35R76Q24j025k499k70l04
29520E113j28J698L6k407G6c656j572Q66l061o868m292q70M93L90K810P394b978
$$ plain form
29635 31276 27132 25612 26125 25781 24424 22910 23652 24991 23835 23378 24027 21696 17922 17009 17570 16928
29619 16928 14490 11955 12376 13176 13400 16314 17778 15514 12229 11396 13185 14315 15073 15084 11632 8189
29603 8189 9051 12581 13338 12376 12153 13892 18922 23556 26550 27192 27869 28655 28812 27077 23229 19899 16821
29586 16821 13664 11682 9984 8709 8684 10781 12198 9568 7419 7652 7679 5125 3072 4579 6925 7611
29570 7611 7260 6924 6935 6658 5888 6804 6785 4896 3193 1246 -229 1357 2733 -762 -5974 -7976 -6818
29553 -6818 -5668 -4721 -3797 -1665 2135 6175 6439 3056 94 -1902 -1327 2775 6756 7248 7474 11024 13109
29536 13109 9935 5350 2153 484 -1026 -424 3774 6899 7076 7411 8387 9211 8186 5687 5417 5113
29520 5113 4985 6683 6719 4312 76 -3656 -5228 -4362 -7423 -14291 -18583 -19453 -18960 -18570 -15760 -8366 -2978
29502d640k375j150J729c211D00N268L156j04k735B403E6P83K024A000b338k865
29486e203j979o96J193b857H96K216k05F72A4J458o47b822j325J180h80C04b9
29468E06L55l62N59k47k30J221J542m33j427p20g23j396l48K81o2j760k4Q78j14
29449c268k25R37M30L33O01L46j586k081H92O502Jk878G63c745k139K510a61j308
29431a469k772m96J572c13F29b982l634OK598M49k706k910k182l752l647K915
29415a5845g827A09M916J993J868P3m018a612o607l602J352K943K139K423N85
29400b379k001J454B428K886k180i25k81H52M093N358J943m699B88d569j737c113
29383A983K200j726r69n46b056j259O42J51j01j407k012p35L255A787K501j25
$$ plain form
29502 -4640 -7015 -8165 -6436 -3211 400 5668 8824 8720 5985 2403 56 839 2863 1000 -2338 -5203
29486 -5203 -7182 -7878 -6685 -2857 896 3112 2907 672 14 1472 825 -2822 -4147 -2967 -880 304 -29
29468 506 861 499 1058 811 581 1802 3344 2911 1484 764 -723 -2119 -2467 -2186 -2248 -4008 -4032 -3154 -3268
29449 -3268 -3493 -2556 -2126 -1793 -1192 -846 -2432 -4513 892 7394 7395 4517 763 -3745 -5884 -3374 -161 -1469
29431 -1469 -4241 -4737 -3165 -313 629 -2982 -6616 -6610 -4012 -3563 -6269 -9179 -11361 -15113 -18760 -15845
29415 -15845 -7827 109 5025 7018 8886 8959 4941 -1612 -8219 -11821 -10469 -7526 -5387 -2964 -2379
29400 -2379 -4380 -2926 2428 5314 3134 -925 -1206 852 4945 10303 12246 7547 288 -4569 -6306 -3113
29383 1983 4183 2457 1488 942 -2056 -3315 -2673 -2522 -2623 -4030 -6042 -6777 -3522 1787 4288 4163
29367D163q16R5K01J753K744O08j040l698b40j732b56D071L050j814k372O2j488
29350A509b197k354P00J207o12j032J20M62a298B392K932J688m73B365b107a90
29333B105J74K771L396j526C459j314R22K858N716N176J533j382l171l882k785
29318G130K085K930J319K52K111K633q35k768l130q77O26k429j708R34J286p03
29302H856n88r02r37J79k634j615K4p41J442K504J702O81O90J827m97o41K040
29285A1390K639M64l674m117K28J813J86p15j575k621j614O87J965J650R74R26
29269H606j490j625j669j562j63Q02p34e59l751n044l981j911m20J245J905j184
29253a3700l604p18M795N405J546j168J125a840B288L88H66b398j961K54Q87J444
$$ plain form
29367 4163 3347 3442 3643 5396 8140 8748 7708 4010 -240 -1972 -256 4071 7121 5307 2935 2997 1509
29350 1509 -2197 -4551 -3851 -2644 -3256 -4288 -4168 -3706 -1298 2392 5324 7012 6539 2365 -2107 -190
29333 2105 2279 5050 8446 6920 3459 2145 3067 5925 11641 16817 18350 16968 13797 9915 7130
29318 7130 9215 12145 13464 13716 15827 18460 17625 14857 11727 10850 11476 9047 7339 8273 9559 8856
29302 8856 8268 7366 6429 6608 3974 2359 2383 1642 3084 5588 7290 7971 8661 10488 9991 9350 11390
29285 11390 14029 14493 10819 6702 6930 8743 8929 8214 6639 4018 2404 3091 5056 6706 7680 8606
29269 8606 7116 5491 3822 2260 2097 2899 2165 -559 -4310 -9354 -13335 -15246 -15666 -14421 -12516 -13700
29253 -13700 -17304 -18022 -13227 -7822 -6276 -7444 -6319 -1840 2288 2676 866 -2398 -4359 -4105 -3218 -1774
29237a774e20C292L080j153k586j30K101J039B343a84A046K446R00l32j511r38
29221A611N25J128J050Q35J023Q96j264F76b240K06M24D02L886L71j973O80j052
29204B314a298m519m385q16l98K27K331L671b255R62j315l582k562K844e03D318
29187G334J133n72k897A522b44A820K029p61A161n04J571L013L270N014J642j763
29171A3404j192P09K8k319E109A266d33k901k091o50J044K267A274L113K83O80
29155E350J370m89j927J160L334o96k345j81K33l22j154j339L40J148J503J382
29139G367j113j774m45K174L306j83k62K861L967N12q14n73k855k732K284O383
29123A8103N266K109k280l667l332j189N75k28q23K354L290J074k459l414J103
$$ plain form
29237 -1774 -520 3292 6372 5219 2633 2503 4604 5643 2343 -184 1046 3492 4392 4060 2549 1611
29221 1611 2136 3264 4314 5149 6172 7068 5804 676 -2240 -2034 -1610 402 4288 4659 2686 3366 2314
29204 2314 -1298 -5817 -10202 -11018 -11416 -11189 -8858 -5187 -2255 -1293 -2608 -6190 -8752 -5908 -503 4318
29187 7334 8467 7895 4998 1522 -244 1820 3849 3088 1161 657 2228 5241 8511 13525 15167 13404
29171 13404 12212 12921 12949 10630 5109 1266 -433 -3334 -5425 -6075 -5031 -2764 1274 4387 4670 5350
29155 5350 6720 6231 4304 5464 8798 8102 5757 5576 5809 5487 4333 2994 3334 4482 5985 7367
29139 7367 6254 4480 4035 6209 9515 9332 9070 11931 15898 16410 15596 15023 12168 9436 11720 18103
29123 18103 23369 25478 23198 19531 16199 15010 15585 15357 14534 16888 20178 21252 18793 15379 16482
29108A6482K152r42k640k052N94N328O493j325n246k280k35M10j300j009O64K777
29092A7871N334N137J459j919k650k494n280n380J185N445P291J990k505R4Q58
29077B6436O90K428L685N33k509j448L043L171j80O08K311J995J460L65o80l26
29061D1582j116j581j212Q9J944M143L317j193m397k480M057L719J830K268J191
29046E2161q94m80K372M473L006J854L075M263M255M399L739J304k49q01K479
29031H4956O367O351N947N110K597L751O440O030O968J1471J0757P901P784O042
29017A78472M537P453J1710R725P558J1688J6859J8327J8550K0393K2573K2487
29005C50332K5501K9999L6324M0402M1573M5729N2688N9029O3563P1158Q3561
$$ plain form
29108 16482 18634 17692 15052 13000 13594 18922 25415 24090 18844 16564 16329 16739 15439 14430 15094 17871
29092 17871 23205 28342 29801 27882 25232 22738 17458 12078 13263 18708 25999 27989 25484 25578 26436
29077 26436 27126 29554 33239 33772 31263 29815 32858 36029 35849 36457 38768 40763 42223 42588 41908 41582
29061 41582 40466 38885 37673 37762 39706 43849 47166 45973 41576 39096 43153 46872 48702 50970 52161
29046 52161 51267 50787 53159 57632 60638 62492 65567 69830 74085 78484 82223 83527 83278 82477 84956
29031 84956 91323 97674 103621 108731 111328 115079 121519 127549 134517 145988 156745 164646 172430 178472
29017 178472 183009 190462 202172 211897 219455 231143 248002 266329 284879 305272 327845 350332
29005 350332 375833 405832 442156 482558 524131 569860 622548 681577 745140 816298 899859
28994H99859R2506R6789J01118J02447R9708R5555R2675Q4942P1116N5542L7670
28983A829927J7993N90j6254l1270m3834n1093n5396n7591n2926m0721k6990j6284
28971A456151k662J2211K8308M2057N2292O0466O9081P4710P5084P3119O5604
28960B006421N1409L4369J3574j0101l2435n5889p6293q6453r1044r4747r5214
28949A563597r4201r0187p9232o4832n3624m4880l2622k3680j7833j3553j1153
28938A037800q231n909q941j1649j5349j9866k1371k2189k8244l3888l5170l6254
28926G90739l5722l2635l1432k8533k1697j4383o889l323l405j468J923O540J0040
28913F29755J0901J1480J4066J6310J3848J1457J1527Q504M688k49n887j1361
$$ plain form
28994 899859 992365 1089154 1190272 1292719 1392427 1487982 1580657 1665599 1736715 1792257 1829927
28983 1829927 1847920 1848510 1832256 1800986 1757152 1706059 1650663 1593072 1540146 1499425 1472435 1456151
28971 1456151 1453489 1465700 1494008 1536065 1588357 1648823 1717904 1792614 1867698 1940817 2006421
28960 2006421 2057830 2092199 2105773 2095672 2063237 2007348 1931055 1844602 1753558 1658811 1563597
28949 1563597 1469396 1379209 1299977 1235145 1181521 1136641 1104019 1080339 1062506 1048953 1037800
28938 1037800 1029569 1023660 1014719 1003070 987721 967855 946484 924295 896051 862163 826993 790739
28926 790739 755017 722382 690950 662417 640720 626337 619448 616125 612720 611252 613175 619715 629755
28913 629755 640656 652136 666202 682512 696360 707817 719344 727848 732536 732287 726400 715039
28901G15039j5519j4765j3819j9856k3810k1170k0653k0711k1031k1067j6831
28890E05807j1227o850n714q466o987J14O014Q168J1597J5621J6819J9140K1730
28877E65766K2144K4500K8380L0926L0188L0552L0132K9829K9786K7486K4986
28866H74675K4034K3211K1908J7649J8609K3707K7277L5173M2935M9296N4234
28855A212708O2202P4214Q2956Q7581R8047J14556J27676J38139J47031J51681
28845B296791J51259J45266J34403J18381R4733O6342L9005J2791j2500l2920
28835C013551m7522n7749o3001o3620n7399m2106k2324m324J5140L7111N6131
28824B763888P3151R1255J01017J02589R9294R2184Q0381O3229L9559J5649m386
$$ plain form
28901 715039 699520 684755 670936 651080 627270 606100 585447 564736 543705 522638 505807
28890 505807 494580 487730 482016 473550 466563 466677 472691 480859 492456 508077 524896 544036 565766
28877 565766 587910 612410 640790 671716 701904 732456 762588 792417 822203 849689 874675
28866 874675 898709 921920 943828 961477 980086 1003793 1031070 1066243 1109178 1158474 1212708
28855 1212708 1274910 1349124 1432080 1519661 1617708 1732264 1859940 1998079 2145110 2296791
28845 2296791 2448050 2593316 2727719 2846100 2940833 3007175 3046180 3058971 3046471 3013551
28835 3013551 2966029 2908280 2845279 2781659 2724260 2682154 2659830 2655506 2670646 2707757 2763888
28824 2763888 2837039 2928294 3029311 3131900 3231194 3323378 3403759 3466988 3506547 3522196 3517810
28813C517810k4404m3919o2694p3534p4241o8656n4749l5265j1086J7874M7745
28802C134881Q2587J16811J49493J81776K08254K26808K39473K48885K53434K45301
28792E087703K26638J99343J65596J26994Q8213N0351Q904l0605o7624j04150
28782E751363j42123j73983j98410k21397k39574k49981k55759k53533k44021
28773C772582k29388k04680j75690j45431j13701q2059m8901j4004J7176M4395
28763B820299P4318J09402J41095J64279J83597K01254K17180K29100K30973K21395
28753D592892K03833J84298J57656J25794R3065N7694J9082j7926n7295r5431
28743E263662j29124j60330j88984k16565k39676k57930k71496k79243k80658
$$ plain form
28813 3517810 3493406 3449487 3386793 3313259 3239018 3170362 3115613 3080348 3069262 3087136 3134881
28802 3134881 3217468 3334279 3483772 3665548 3873802 4100610 4340083 4588968 4842402 5087703
28792 5087703 5314341 5513684 5679280 5806274 5894487 5944838 5953742 5923137 5855513 5751363
28782 5751363 5609240 5435257 5236847 5015450 4775876 4525895 4270136 4016603 3772582
28773 3772582 3543194 3338514 3162824 3017393 2903692 2821633 2772732 2758728 2775904 2820299
28763 2820299 2894617 3004019 3145114 3309393 3492990 3694244 3911424 4140524 4371497 4592892
28753 4592892 4796725 4981023 5138679 5264473 5357538 5415232 5434314 5416388 5359093 5263662
28743 5263662 5134538 4974208 4785224 4568659 4328983 4071053 3799557 3520314 3239656
28734C239656k74011k61012k43148k22438k00225j80859j63384j43485j20984
28725A430110j03894r4636q5892p5929o7576o0782n3063m7194m1969l7638l8042
28714G23495l7388l1348k7110k7355k5787k3710k5376k2832j6794j2723j0777
28703D62295o694n374q177r158n193r96p29K906Q170J0867J2312J1572J4732J5813
28689E02346J1568Q759P206N626J725k769l844p346j3598k0040k1778k3336k3882
28676D20637j9742j5730j2881j1544r176m790k963j95K508N259J0556J2099J0212
28663C84250J1638J3481J3216J4079J3587J2668J1193M940l942q970j0013j0364
28651D45763j4613j8751k0877k2629k4165k4370k2077k0354j7530j6989j5762
$$ plain form
28734 3239656 2965645 2704633 2461485 2239047 2038822 1857963 1694579 1551094 1430110
28725 1430110 1326216 1231580 1145688 1069759 1002183 941401 888338 841144 799175 761537 723495
28714 723495 686107 654759 627649 600294 574507 550797 525421 502589 485795 473072 462295
28703 462295 455601 450227 442050 432892 427699 426703 425974 428880 437050 447917 460229 471801 486533 502346
28689 502346 513914 522673 529879 535505 537230 534461 530617 523271 509673 489633 467855 444519 420637
28676 420637 400895 385165 372284 360740 351564 346774 343811 343616 346124 351383 361939 374038 384250
28663 384250 395888 409369 422585 436664 450251 462919 474112 479052 475110 466140 456127 445763
28651 445763 431150 412399 391522 368893 344728 320358 298281 277927 260397 243408 227646
28640B27646j2923j2679j1737r347p738r001r070p650n691l184j459k658m039
28627A30470j01M056J652j387j288j509o66k148m000l737k929j065J70J666J46
28612A19330j244j367j708K18O51K391O656O824r73n059m34K486L376J758K510
28597A35415K686J632J241K400M762M276M225J859r25K644N756N066M182P327
28583A82546J1017J0333Q256O434O652Q202P774R843J0120O020O886R551J1904
28570B95538J6185J9052J8271J9156K3622K6123K7074K8082K9095L1613L6635
28559E70446M1676N0223N7896O0821O8142P8424Q6482R1912R6334J00096J03753
28548A406205J07662J10050J06987R6028Q2391O7689N1073L1108P160j3471l2043
$$ plain form
28640 227646 214723 202044 190307 180960 173222 164221 155151 147501 141810 138626 137167 134509 130470
28627 130470 130369 134425 136077 134690 133402 131893 131227 129079 125079 121342 118413 117348 117518 119184 119330
28612 119330 118086 116719 115011 115229 115880 118271 124927 131751 130778 125719 125285 127771 131147 132905 135415
28597 135415 138101 139733 140974 143374 148136 152412 156637 158496 157571 160215 165971 171037 175219 182546
28583 182546 193563 203896 212152 218586 225238 233440 241214 251057 261177 267197 274083 283634 295538
28570 295538 311723 330775 349046 368202 391824 417947 445021 473103 502198 533811 570446
28559 570446 612122 662345 720241 781062 849204 927628 1014110 1106022 1202356 1302452 1406205
28548 1406205 1513867 1623917 1730904 1826932 1909323 1977012 2028085 2059193 2066353 2052882 2020839
28537B020839m9581o2343p1660p7920p7865o9525o1303n3207m2004k8485j6012
28526A410934l996P010J9265K9922M0412N0886N7171N9132O1512N8929N6460N1170
28514A898807M2055L2634K1195J2592N260n017j4530j9576j9051j6182j1632m130
28502A922425L468J0787K2683L3263L7207L8619L9375L9976L5995K4530P256q429
28490B207155k2242l7551n3400p1136q5231r2789r7762r8767r7160r4835r0373
28479A365909q3010p3839o5970o2489n7675m7039l6561l4745l4410k8108j8362
28468H23701j0928q024p583m076M589J7697K3816K5888L4802M7642O1976P0125
28456A079625P5632Q4574R4988J04801J12211J15413J14377J11529J05235R3902
$$ plain form
28537 2020839 1971258 1908915 1837255 1759335 1681470 1611945 1550642 1497435 1455431 1426946 1410934
28526 1410934 1406938 1413948 1433213 1463135 1503547 1554433 1611604 1670736 1732248 1791177 1847637 1898807
28514 1898807 1940862 1973496 1994691 2007283 2012543 2007526 1992996 1973420 1954369 1938187 1926555 1922425
28502 1922425 1925893 1936680 1959363 1992626 2029833 2068452 2107827 2147803 2183798 2208328 2215584 2207155
28490 2207155 2184913 2147362 2093962 2022826 1937595 1844806 1747044 1648277 1551117 1456282 1365909
28479 1365909 1282899 1209060 1143090 1080601 1022926 975887 939326 904581 870171 842063 823701
28468 823701 812773 804749 797166 793090 797679 815376 839192 865080 899882 947524 1009500 1079625
28456 1079625 1155257 1239831 1334819 1439620 1551831 1667244 1781621 1893150 1998385 2092287
28446B092287P9479O2398M2148K2020r79k3705m1114n7550p4365r0984j03478
28435A906157j13005j17334j16675j13651j09289j03119r4097q5267p9248p2326
28425I02146o5392o1375n6939n0829m3841m0115l7923l3320k8236k3865k2218
28414D38093k1570j7659j4883j5712j6383j4113j0556p076p593j0024q828n307
28402B88389l811p226r081o942o426m638j096O66N46o24k020k797l023l451j514
28387B36952K27k094N00M120L106L497K566J790N098O249N733K972K123P718J0826
28372B91383Q846Q496Q487J0150J3352J4880J6780J8508K1838K7206L1956L4310
28360E06192L9147M5504N1741O1419P1534Q3051R0022R6008J04685J14555J18505
$$ plain form
28446 2092287 2171766 2234164 2276312 2298332 2297353 2273648 2232534 2174984 2100619 2009635 1906157
28435 1906157 1793152 1675818 1559143 1445492 1336203 1233084 1138987 1053720 974472 902146
28425 902146 836754 775379 718440 667611 623770 583655 545732 512412 484176 460311 438093
28414 438093 416523 398864 383981 368269 351886 337773 327217 320141 312548 302524 293696 288389
28402 288389 284578 277352 268271 261329 254903 250265 249169 249835 250381 249757 247737 244940 241917 238466 236952
28387 236952 237179 235085 235585 239705 242811 246308 248874 250664 255762 262011 267744 270716 272839 280557 291383
28372 291383 300229 308725 317212 327362 340714 355594 372374 390882 412720 439926 471882 506192
28360 506192 545339 590843 642584 704003 775537 858588 948610 1044618 1149303 1263858 1382363
28349A382363J16289J11244J05666R7079Q9345P5166N8218M5239L0600J7927P570
28338B136706j448j2001k0984k4291k9230l3908l8066m5068n4250o3888p1536
28327A742036q0905r0686r6617r6366r0319q0093p0589o1856n2181l8108k8563
28316I55753k1752r704J114R473J5932J8968K3532L1073L6625M3902N1346N6459
28304A212721N9586O2194O5789O9277P0282P0786P2058P3688P5974P8731Q4067
28293A995153Q9755R2181R0455Q7346Q1428P0707N8668M3183K1179n908l2735
28282B591412n7698q0287j01333j19280j29422j33255j32774j29262j21373j12190
28272A474538j01558r2120q2487p2260o3840n2883m3938l9792l4432k7913k1655
$$ plain form
28349 1382363 1498652 1609896 1715562 1812641 1901986 1977152 2035370 2080609 2111209 2129136 2136706
28338 2136706 2135258 2123257 2102273 2077982 2048752 2014844 1976778 1931710 1877460 1813572 1742036
28327 1742036 1661131 1570445 1473828 1377462 1287143 1207050 1136461 1074605 1022424 984316 955753
28316 955753 934001 924297 925411 934884 950816 969784 993316 1024389 1061014 1104916 1156262 1212721
28304 1212721 1272307 1334501 1400290 1469567 1539849 1610635 1682693 1756381 1832355 1911086 1995153
28293 1995153 2084908 2177089 2267544 2354890 2436318 2507025 2565693 2608876 2630055 2624147 2591412
28282 2591412 2533714 2453427 2352094 2232814 2103392 1970137 1837363 1708101 1586728 1474538
28272 1474538 1372980 1280860 1198373 1126113 1062273 1009390 965452 925660 891228 863315 841660
28261H41660j5947j1944q550l841j391n61J032M551P708J0194J3761K0493K8121
28248H85286L6982M4616N2378O0231O9752Q1540R4125J08992J30001J50451J64631
28237A878985J77236J91178K05253K15819K18843K10387J92947J66196J33724
28228C590568R3769M6292o208n9640j06779j46362j76778j95601k02260j95742
28218B641259j82132j65069j43487j22594j04006q7590p0689n4108m2401l6003
28208A633180l3146l3318l2733l5696m3746m6681m4257m0938l4155k5506j3678
28197A249326K510J3231K0156K6436L3239L7049L8166L5081K9773K4304J5102
28186A524373K494r206j9466k4873k2716j8089j4700m271J0473K1648K9967M0811
$$ plain form
28261 841660 825713 813769 805219 801378 799987 799426 800458 805009 812717 822911 836672 857165 885286
28248 885286 922268 966884 1019262 1079493 1149245 1230785 1324910 1433902 1563903 1714354 1878985
28237 1878985 2056221 2247399 2452652 2668471 2887314 3097701 3290648 3456844 3590568
28228 3590568 3684337 3730629 3724421 3664781 3558002 3411640 3234862 3039261 2837001 2641259
28218 2641259 2459127 2294058 2150571 2027977 1923971 1836381 1765692 1711584 1669183 1633180
28208 1633180 1600034 1566716 1533983 1498287 1454541 1407860 1363603 1322665 1288510 1263004 1249326
28197 1249326 1251836 1265067 1285223 1311659 1344898 1381947 1420113 1455194 1484967 1509271 1524373
28186 1524373 1526867 1517661 1498195 1473322 1450606 1432517 1417817 1413546 1424019 1445667 1475634 1516445
28174A516445M9565N4002N9824O2722N7968M8310L9673K8144J9127R784q50o910
28162A937804p087R15J2736K9726M6443O1341P7481R2597J07283J19270J26934
28151B605443J27994J23248J14430R5911O7563L8211Q540k3879n5243q3514j09160
28140B909544j28458j39641j46293j51795j55042j52745j46113j38523j26101
28131A624833j11054r8846q8232p8157p3747o8211n6912m7991m0508l4247k8768
28120H98160k3964j8933j5134j3934j0483n395n261o152j513M205P064J0559J5031
28107H34250J8713K3331K8775L2162L4296L9333M4569N0186N4887O6019P8570
28096A305091Q6753R4092J00236J10580J23318J32868J39304J43387J46697J48056
$$ plain form
28174 1516445 1566010 1620012 1679836 1742558 1800526 1848836 1888509 1916653 1935780 1945564 1944714 1937804
28162 1937804 1930717 1931632 1944368 1974094 2020537 2081878 2159359 2251956 2359239 2478509 2605443
28151 2605443 2733437 2856685 2971115 3067026 3134589 3172800 3181340 3157461 3102218 3018704 2909544
28140 2909544 2781086 2641445 2495152 2343357 2188315 2035570 1889457 1750934 1624833
28131 1624833 1513779 1414933 1326701 1248544 1174797 1106586 1049674 1001683 961175 926928 898160
28120 898160 874196 855263 840129 826195 815712 810317 805056 798904 797391 801596 808660 819219 834250
28107 834250 852963 876294 905069 937231 971527 1010860 1055429 1105615 1160502 1226521 1305091
28096 1305091 1391844 1485936 1586172 1696752 1820070 1952938 2092242 2235629 2382326 2530382
28086B530382J44640J34278J23682J14223J01001Q6106P2910O0114M7189L7525
28076C452050K7789J3404k512j4170k0590k6503l3428l0724j9441j243K2263M7919
28064C414814P4736R8368J19990J38782J52413J61401J64674J59478J44596J19277
28054D748529Q9173N6878J9977j7822n0746p4160q7364r5531r3081p9602o2785
28043D353466l8015j1965P177K0844K8665K8857K5456J9609O276p678k2069m3530
28031D367093o8072r1137j10415j29262j49194j66691j76786j80219j79577j74436
28021B941304j63222j46077j29970j16336j00375q0232n9573m3919l3752k1959
28011B045889m079J7734L9478N9694P6638R2227J11491J32580J54530J72646J86643
$$ plain form
28086 2530382 2675022 2809300 2932982 3047205 3148206 3234312 3307222 3367336 3414525 3452050
28076 3452050 3479839 3493243 3490731 3476561 3455971 3429468 3396040 3365316 3345875 3344632 3366895 3414814
28064 3414814 3489550 3587918 3707908 3846690 3999103 4160504 4325178 4484656 4629252 4748529
28054 4748529 4837702 4894580 4914557 4896735 4845989 4771829 4684465 4588934 4495853 4416251 4353466
28043 4353466 4315451 4303486 4310663 4331507 4360172 4389029 4414485 4434094 4440370 4432692 4410623 4367093
28031 4367093 4299021 4207884 4097469 3968207 3819013 3652322 3475536 3295317 3115740 2941304
28021 2941304 2778082 2632005 2502035 2385699 2285324 2205092 2145519 2101600 2067848 2045889
28011 2045889 2041810 2059544 2099022 2158716 2235354 2327581 2439072 2571652 2726182 2898828 3085471
28000C085471K03134K18360K24142K20400K14215K04182J88747J69119J41900
27991D869670J08255P4490M1097M658l3989p7327j24352j70718k11493k45309
27981D234982k68564k80159k83028k74463k61476k43058k19640j98044j79065
27972B027485j63069j44944j26578j09717r9480r4565q4692p2892o6975o1012
27962A003561n2338m6125m5610m3016l7024l3299l0673k6234k2650k2498k1235
27951F22859k0203j9126j6709j3646r592j0041j1685j0103j3095j1495n070m807
27939D77287o945o715m374k641k841o522o440j522L089M588L966N449O577Q711
27925D71667J1209J0655J2015J5492J3226R131R831J1685J2531J5279K2189K2721
$$ plain form
28000 3085471 3288605 3506965 3731107 3951507 4165722 4369904 4558651 4727770 4869670
27991 4869670 4977925 5052415 5093512 5098170 5064181 4986854 4862502 4691784 4480291 4234982
27981 4234982 3966418 3686259 3403231 3128768 2867292 2624234 2404594 2206550 2027485
27972 2027485 1864416 1719472 1592894 1483177 1383697 1289132 1204440 1131548 1064573 1003561
27962 1003561 951223 905098 859488 816472 779448 746149 715476 689242 666592 644094 622859
27951 622859 602656 583530 566821 553175 543583 533542 521857 511754 498659 487164 482094 477287
27939 477287 470342 463627 459253 456612 453771 447249 440809 439287 442376 446964 450930 456379 462956 471667
27925 471667 482876 493531 505546 521038 534264 543395 553226 564911 577442 592721 614910 637631
27913F37631K4155K9613L2238L4012L6780M1701M5406M9788N8160O6273P3981
27902A129738Q3010R1091J00098J10186J21850J36912J47509J57595J66588J72956
27892B417533J78638J83963J86409J83869J76547J69194J64401J56249J45662
27883C962465J35509J22097J04266Q6013O4124M1584K2401M637r938j7345k1653
27872D494160k3147k6793l1177l1189l0462k9302k9691l0129l4415m3054m3878
27861D140923m0370m1313m4662m9368n2652n4041n7539o8144p8431q3643r0097
27850C480663j02433j18510j31210j37408j37307j32075j20423j05740r2980q0384
27840B322193o9350n8340m8464m1824l9244m0456m0606m0459m2297m2127m2364
$$ plain form
27913 637631 661786 691399 723637 757649 794429 836130 881536 931324 989484 1055757 1129738
27902 1129738 1212748 1303839 1403937 1514123 1635973 1772885 1920394 2077989 2244577 2417533
27892 2417533 2596171 2780134 2966543 3150412 3326959 3496153 3660554 3816803 3962465
27883 3962465 4097974 4220071 4324337 4410350 4474474 4516058 4538459 4543096 4533158 4515813 4494160
27872 4494160 4471013 4444220 4413043 4381854 4351392 4322090 4292399 4262270 4227855 4184801 4140923
27861 4140923 4100553 4059240 4014578 3965210 3912558 3858517 3800978 3732834 3654403 3570760 3480663
27850 3480663 3378230 3259720 3128510 2991102 2853795 2721720 2601297 2495557 2402577 2322193
27840 2322193 2252843 2194503 2146039 2104215 2064971 2024515 1983909 1943450 1901153 1859026 1816662
27829A816662m3626m5003m8132n2423n4358n4989n6289n8675o1279o1913n9330
27818A220645n7840n3958m4551l7266k9529j9761j1661m623rJ778R639J9254K3702
27805A015820K5329L0952L8342M1753M4448M5477M7391N3671N5064N0110M9406
27794A497763N0902M7866M6338M8557N0103M6233M0119L3726K2384O433n389j4268
27782A870767k2175k7492k9195k8978k9222l1728l7034m2597m5772m8688n4346
27771A473540n7843n9631n9826n4093m8861m5049l9554l1399k3109j8240j4134
27760A021801r372n112J721Q846J4364J3120J0722J1776J6209K0319K0068J9862
27748A144324J9772J8448J6679J2768P554O984O340J902p575j7725k3648k4187
$$ plain form
27829 1816662 1773036 1728033 1679901 1627478 1573120 1518131 1461842 1403167 1341888 1279975 1220645
27818 1220645 1162805 1108847 1064296 1027030 997501 977740 966079 961456 961447 963225 972864 992118 1015820
27805 1015820 1041149 1072101 1110443 1152196 1196644 1242121 1289512 1343183 1398247 1448357 1497763
27794 1497763 1548665 1596531 1642869 1691426 1741529 1787762 1827881 1861607 1883991 1890424 1885035 1870767
27782 1870767 1848592 1821100 1791905 1762927 1733705 1701977 1664943 1622346 1576574 1527886 1473540
27771 1473540 1415697 1356066 1296240 1242147 1193286 1148237 1108683 1077284 1054175 1035935 1021801
27760 1021801 1012429 1007317 1009038 1017884 1032248 1045368 1056090 1067866 1084075 1104394 1124462 1144324
27748 1144324 1164096 1182544 1199223 1211991 1219545 1226529 1232869 1234771 1227196 1209471 1185823 1161636
27736A161636k4479k9324l2707l1443k8958l2466l4449l7389m0943m3281m3911
27725G82286m5973m6522m4991m3028l8275l3895l0843k6944k5081k5474k2471
27714C98789k1029j9716j5853j5949j7296j5366j1621p402j478k80k921l814m542
27701B61522o155m746k236l629j174K046K076J239M57J867L167M577O368R642
27687B75021J1979J2291J4251J4782J8942K5334K5035K2502K3480K6873K7934
27676D98424K8339K5318K0214J7394J5082J1274M743J581q96l784n524q544j1401
27663E92220j5370j6813j7214j8818j9731j5772j1439r562o582l210J455M575
27651D63739O779P824J1333J8729K6481L4499M1077M4325M9318N4953O2262P4162
$$ plain form
27736 1161636 1137157 1107833 1075126 1043683 1014725 982259 947810 910421 869478 826197 782286
27725 782286 736313 689791 644800 601772 563497 529602 498759 471815 446734 421260 398789
27714 398789 377760 358044 342191 326242 308946 293580 281959 274557 273079 272799 269878 266064 261522
27701 261522 255367 250621 248385 244756 243582 245628 247704 248943 249400 251267 254434 259011 265379 275021
27687 275021 287000 299291 313542 328324 347266 372600 397635 420137 443617 470490 498424
27676 498424 526763 552081 572295 589689 604771 616045 620788 622369 621473 617689 612165 603621 592220
27663 592220 576850 560037 542823 524005 504274 488502 477063 467501 460919 457709 459164 463739
27651 463739 470518 478342 489675 508404 534885 569384 610461 654786 704104 759057 821319 895481
27639H95481Q4362R0779R6000J00441R8970R0119Q4031P6185O1847N1121M3524
27628A772860L5803L2195L3772M0661M9753O0974P4565Q1757P9032P2830O0661
27617B394863L8734J1973j4285l9331o1451p6401p8923o6912m5712k5442m052
27606B033061K0089M1989O0406P9715R7207J06308J12386J14170J05064R0667
27596B861062P5204O0302M4498K5895N755j1663k0298k5976k3795j2780J949J8451
27584B998604L9720O6593Q6712R6208R9468R6025Q2996O2387L3616l888m6289
27573C612152q3445j07646j25263j39170j42812j39050j35338j32485j27889j21880
27563B357174j17562j13412j06158j00741r4352q6936q2920q0371p6808o9788
$$ plain form
27639 895481 979843 1070622 1166622 1267063 1366033 1456152 1540183 1616368 1678215 1729336 1772860
27628 1772860 1808663 1840858 1874630 1915291 1965044 2026018 2100583 2182340 2261372 2334202 2394863
27617 2394863 2433597 2445570 2431285 2391954 2330503 2254102 2175179 2108267 2062555 2037113 2033061
27606 2033061 2053150 2095139 2155545 2235260 2332467 2438775 2551161 2665331 2770395 2861062
27596 2861062 2936266 2996568 3041066 3066961 3072716 3061053 3040755 3014779 2990984 2978204 2980153 2998604
27584 2998604 3038324 3104917 3191629 3287837 3387305 3483330 3566326 3628713 3662329 3658441 3612152
27573 3612152 3528707 3421061 3295798 3156628 3013816 2874766 2739428 2606943 2479054 2357174
27563 2357174 2239612 2126200 2020042 1919301 1824949 1738013 1655093 1574722 1497914 1428126
27553A428126o5914o4281n9105n3333m8198m2623l6225k8950k2467j6839j2842
27542I77349j0803l621N624R894J4518J9861K5849L1240M0330M7123N3374O3341
27530A274079P2810Q7625J07630J30592J54863J77775J96252K13358K29875K38041
27520B882900K40169K41115K30932K09348J85410J56006J21391Q3914N0260K6865
27510D428310J7436K4343M7986P7812J08872J41803J69340J89465J97091J95713
27500E598171J90674J80905J67957J53431J44439J44316J48970J57775J68565
27491G055203J71594J67415J53540J24773Q2933K8896k7041q0593j30650j70809
27481G375261j97825k14379k13792k02561j93883j87516j78194j66718j56161
$$ plain form
27553 1428126 1362212 1297931 1238826 1185493 1137295 1094672 1058447 1029497 1007030 990191 977349
27542 977349 966546 962925 968549 978443 992961 1012822 1038671 1069911 1110241 1157364 1210738 1274079
27530 1274079 1346889 1434514 1542144 1672736 1827599 2005374 2201626 2414984 2644859 2882900
27520 2882900 3123069 3364184 3595116 3804464 3989874 4145880 4267271 4351185 4401445 4428310
27510 4428310 4445746 4470089 4518075 4595887 4704759 4846562 5015902 5205367 5402458 5598171
27500 5598171 5788845 5969750 6137707 6291138 6435577 6579893 6728863 6886638 7055203
27491 7055203 7226797 7394212 7547752 7672525 7755458 7784354 7757313 7676720 7546070 7375261
27481 7375261 7177436 6963057 6749265 6546704 6352821 6165305 5987111 5820393 5664232
27472E664232j45055j27242r8254n8361j3974K7470O0221Q4191R8670R4795O9894
27461E656587K9366k3572q4712j49940k11721k66026l09217l33204l34107l24634
27451C648820l08777k85288k58365k35145k11265j82934j58166j33426j12909
27442A762545r7048q2701p2281o2531n1095m2771l8092k9039j7840r507n705M71
27430A254406Q511J9856L3267L9189M4899N9380P5870Q9924J04179J20367J34286
27419A984134J43498J49472J51725J51786J50322J45181J33914J19204J02640
27410C231876Q4587O2899L8591J3557j0794l4885o3425r0617j15329j39040j59363
27399B818057j74070j77588j77228j73813j60738j42355j20709j02172q5768o8771
$$ plain form
27472 5664232 5519177 5391935 5293681 5235320 5221346 5248816 5309037 5393228 5491898 5586693 5656587
27461 5656587 5685953 5662381 5577669 5427729 5216008 4949982 4640765 4307561 3973454 3648820
27451 3648820 3340043 3054755 2796390 2561245 2349980 2167046 2008880 1875454 1762545
27442 1762545 1665497 1582796 1510515 1447984 1396889 1354118 1316026 1286987 1269147 1259640 1253935 1254406
27430 1254406 1262917 1282773 1316040 1355229 1400128 1459508 1535378 1625302 1729481 1849848 1984134
27419 1984134 2127632 2277104 2428829 2580615 2730937 2876118 3010032 3129236 3231876
27410 3231876 3316463 3379362 3417953 3431510 3420716 3385831 3322406 3231789 3116460 2977420 2818057
27399 2818057 2643987 2466399 2289171 2115358 1954620 1812265 1691556 1589384 1503616 1434845
27389A434845n3674l7697j9217m244N563J2564J8657K5108K8790K6598K3835J7855
27377A478983N145p798j8424k6445l6867m9489o1710o9264p1386o8746o6759o3349
27365I43891n8919n1118m2252l7688l4466l0659k5744j9688j3766r407m147K457
27353F18494M499R776J4981J4269J2916J1185J1825J7152K2784K5230K4530K6389
27341H14030K9794L4126M0274M3818M4885M6793M6544M3043M2885M3022L9774
27330A268988L5197L2415L0626K7018K7285L3444L9746M3902M4813M6952N0685
27319A681071N4215N7658O0183O0241N8643N3330M4224L3441K5252J6379L588
27308B148225r244j9829k7820l7234m7773n5627o1892o7090p0739p1395p0708
$$ plain form
27389 1434845 1381171 1343474 1324257 1320013 1325576 1338140 1356797 1381905 1410695 1437293 1461128 1478983
27377 1478983 1484128 1476330 1457906 1431461 1394594 1345105 1283395 1214131 1142745 1073999 1007240 943891
27365 943891 884972 833854 791602 753914 719448 688789 663045 643357 629591 620184 616037 618494
27353 618494 622993 632769 647750 662019 674935 686120 697945 715097 737881 763111 787641 814030
27341 814030 843824 877950 918224 962042 1006927 1053720 1100264 1143307 1186192 1229214 1268988
27330 1268988 1304185 1336600 1367226 1394244 1421529 1454973 1494719 1538621 1583434 1630386 1681071
27319 1681071 1735286 1792944 1853127 1913368 1972011 2025341 2069565 2103006 2128258 2144637 2148225
27308 2148225 2138981 2119152 2091332 2054098 2006325 1950698 1888806 1821716 1750977 1679582 1608874
27297A608874o9460o6668o0912n6673n2098m5421m2006m0894l1967j9132j0639
27286A113004o070L128J0016J3136J7717K2355K7188K9411K8960K8396L1561L0969
27274A349771K1940J0775L722J897k253j0020j8300k3713k8445l1718l0540k5528
27262A217588k1356j8044j2469o846j833L512J0144J5712J8011K0181K7319L3805
27250A285724L9043M1229M1621M1671M1230M3299M4079M5479N1270N7897O0573
27239A793115O3010O9471P3155P7874Q3154P9992O9026N1057K3081p418l6771
27228B338746o5681r4116j14852j21473j17761j06932r1351p9004o8958n9609
27218A419009n1653m4054l7859l5522l0878k4797k4978k6244k0883j5596j5199
$$ plain form
27297 1608874 1539414 1472746 1411834 1355161 1303063 1257642 1215636 1174742 1142775 1123643 1113004
27286 1113004 1106934 1110062 1120078 1133214 1150931 1173286 1200474 1229885 1258845 1287241 1318802 1349771
27274 1349771 1371711 1382486 1386208 1388105 1385852 1375832 1357532 1333819 1305374 1273656 1243116 1217588
27262 1217588 1196232 1178188 1165719 1158873 1157040 1160552 1170696 1186408 1204419 1224600 1251919 1285724
27250 1285724 1324767 1365996 1407617 1449288 1490518 1533817 1577896 1623375 1674645 1732542 1793115
27239 1793115 1856125 1925596 1998751 2076625 2159779 2239771 2308797 2359854 2382935 2375517 2338746
27228 2338746 2273065 2178949 2064097 1942624 1824863 1717931 1626580 1547576 1478618 1419009
27218 1419009 1367356 1323302 1285443 1249921 1219043 1194246 1169268 1143024 1122141 1106545 1091346
27207A091346j3730r643m876K2N099Q602J4061K7071M1986N3591O5060P9424Q9818
27194A447831R8288J08039J14134J12607J06029R3569P3336M8805J9135j6361
27184B205412n2841q4856j10483j28808j35941j31253j21934j10124r9076q6379
27174A143717p1709n9788m9003l7132k4174j6414j4438j0978p617l827j324K019
27162H49332N555P450O791K529k210m445p681j2552j3912j2506j0658j1698j4461
27149G81534j3798r608o103m328k678k887p77N008R802J4057J5520J6670J7191
27136H19603J7420J9667K5992K9976L2940L3590L7335M5565O0389P5811Q9317
27125A287605J05033J21486J35957J46868J59249J72973J81159J76487J57908
$$ plain form
27207 1091346 1077616 1067973 1063097 1063119 1068218 1076820 1090881 1117952 1159938 1213529 1278589 1358013 1447831
27194 1447831 1546119 1654158 1768292 1880899 1986928 2080497 2153833 2202638 2221773 2205412
27184 2205412 2152571 2067715 1957232 1828424 1692483 1561230 1439296 1329172 1230096 1143717
27174 1143717 1072008 1012220 963217 926085 901911 885497 871059 860081 852464 848637 847313 849332
27162 849332 854887 862337 869128 871657 869447 865002 857321 844769 830857 818351 807693 795995 781534
27149 781534 767736 758128 752025 747697 745019 742132 741355 746363 756165 770222 785742 802412 819603
27136 819603 837023 856690 882682 912658 945598 979188 1016523 1062088 1122477 1198288 1287605
27125 1287605 1392638 1514124 1650081 1796949 1956198 2129171 2310330 2486817 2644725
27116B644725J28229R0018M6849p68n1947r5977j28710j51833j63612j68792j68822
27105A979360j63100j54210j36636j19173j04661q7435o9709n1739l6342k2799
27095A033556r565K282J4409K9415M2026N4383P1931R1095J11505J30080J47889
27084A719006J64816J84113K00450K09250K12235K06782J91853J69249J39901
27075C397655J00167N1767J259n0431j04115j50938j86631k12108k28812k37107
27065B380706k32324k19314j98123j71918j48052j26367j06843r3025q3115p1169
27055I30456n8569m7071l8415l3309k9553k3682j8531j7106j5286r746m554l307
27043F31327m41L074L326N440J2775K0420K6715L1367L5671M4298N3946O1415
$$ plain form
27116 2644725 2772954 2862972 2909821 2909053 2857106 2761129 2632419 2480586 2316974 2148182 1979360
27105 1979360 1816260 1662050 1525414 1406241 1301580 1214145 1144436 1092697 1056355 1033556
27095 1033556 1023991 1026273 1040682 1070097 1112123 1166506 1238437 1329532 1441037 1571117 1719006
27084 1719006 1883822 2067935 2268385 2477635 2689870 2896652 3088505 3257754 3397655
27075 3397655 3497822 3549589 3550848 3500417 3396302 3245364 3058733 2846625 2617813 2380706
27065 2380706 2148382 1929068 1730945 1559027 1410975 1284608 1177765 1084740 1001625 930456
27055 930456 871887 824816 786401 753092 723539 699857 681326 664220 648934 639188 634634 631327
27043 631327 630886 633960 637286 642726 655501 675921 702636 734003 769674 813972 867918 929333
27031I29333P0395P8228Q4855R2151R4543R1768Q7857P8878O5755M6041K0290
27020A740094m627k4605m1503n4342o4922p1586p3512p3445o5332n2788l8630
27009A174802k3318n412J2433K8764M3260N4901O7940Q0046R0756R8469J06009
26998A728650J10116J13589J16253J12949J08185J07258J02717R5282Q7251P7902
26988B760152O4168M5340K1264p413l8601o9020r8903j24565j40864j50762j55796
26977B105000j51212j37571j19734r6431p5334n4793l4821j2818R306K8050M4430
26966A504072N6515O7312P1252O3875N1795L7723K2225O370j3960m0167o6781
26955A760231q6540j01843j11942j15377j12756j06749r6585q5909p8205p0365
$$ plain form
27031 929333 999728 1077956 1162811 1254962 1349505 1441273 1529130 1608008 1673763 1719804 1740094
27020 1740094 1735467 1710862 1669359 1615017 1550095 1478509 1404997 1331552 1266220 1213432 1174802
27009 1174802 1151484 1146072 1158505 1187269 1230529 1285430 1353370 1433416 1524172 1622641 1728650
26998 1728650 1838766 1952355 2068608 2181557 2289742 2397000 2499717 2594999 2682250 2760152
26988 2760152 2824320 2869660 2890924 2883511 2844910 2775890 2676987 2552422 2411558 2260796 2105000
26977 2105000 1953788 1816217 1696483 1600052 1524718 1469925 1435104 1422286 1431592 1459642 1504072
26966 1504072 1560587 1627899 1699151 1763026 1814821 1852544 1874769 1881139 1867179 1827012 1760231
26955 1760231 1673691 1571848 1459906 1344529 1231773 1125024 1028439 942530 864325 793960
26945G93960o3957n2840m2088l4857k8858k6661k5331k0329j2631r449j1441j0363
26933D55155p732n191j958O77M390Q708P731O262J0093J7881K3091K3266K3962
26920E66335K9582L6003M1593M9539N7399O2749O9811P8998Q3543Q1484P8898
26909A235934P6353O6125N2380L7925J8305k770k3872m6095o1413o8988p7736
26898A206148q3450q0905p8509p6193o7016n4418m4382l5218k7369k0041j0269
26887F28378j179K788Q588J6852K4023L0195L7929M6556N7123O9458P7878Q2439
26875A081028Q7277R2932R4577Q9101P6692O3963M7291K5210o69k6091m9299o8226
26863A513786q3881r7203j02490r9373r2328q3419o7903n3849m7736m2549l5318
$$ plain form
26945 793960 730003 677163 635075 600218 571360 544699 519368 499039 486408 476959 465518 455155
26933 455155 447423 442232 440274 440951 445341 454049 461780 468042 478135 496016 519107 542373 566335
26920 566335 595917 631920 673513 723052 780451 843200 913011 992009 1075552 1157036 1235934
26909 1235934 1312287 1378412 1430792 1468717 1487022 1484252 1460380 1414285 1352872 1283884 1206148
26898 1206148 1122698 1041793 963284 887091 820075 765657 721275 686057 658688 638647 628378
26887 628378 627199 629987 638575 655427 679450 709645 747574 794130 851253 920711 998589 1081028
26875 1081028 1168305 1261237 1355814 1444915 1521607 1585570 1632861 1658071 1657402 1631311 1582012 1513786
26863 1513786 1429905 1332702 1230212 1130839 1038511 955092 887189 833340 785604 743055 707737
26852G07737k4773j6552r220j749O636J6255K2307K9570M0244N1154O2326P1487
26840I55422P8504Q5312R4303J02447J07097J09020J06335R6400Q4275P0307N2590
26829A942012K8666J375k4235m6091o2775p4518q3710q6246q5053q1087p6260
26818A352078o9173o3447o0575n8116n6912n6271n5278n5561n7021n4844n0413
26807G14467m4315m0092l6701l1988k7563k7349k7386k2580j5621j1201j0625
26796D19046q595q235p350o670o572k528K327M326M141M417N134O214Q609J0570
26782D24834J0892J3052J7096K0694K3297K5993K8594K9407L1348L8497M3517
26771G07221M7539N4261O0708O9871Q2252R2997J05450J23875J44055J59803J72508
$$ plain form
26852 707737 682964 666412 657192 655443 662079 678334 700641 730211 770455 821609 883935 955422
26840 955422 1033926 1119238 1213541 1315988 1423085 1532105 1638440 1734840 1819115 1889422 1942012
26829 1942012 1970678 1972053 1947818 1901727 1838952 1764434 1680724 1594478 1509425 1428338 1352078
26818 1352078 1282905 1219458 1158883 1100767 1043855 987584 932306 876745 819724 764880 714467
26807 714467 670152 630060 593359 561371 533808 506459 479073 456493 440872 429671 419046
26796 419046 410451 402216 394866 388196 381624 379096 381423 385749 389890 394307 399441 405655 414264 424834
26782 424834 435726 448778 465874 486568 509865 535858 564452 593859 625207 663704 707221
26771 707221 754760 809021 869729 939600 1021852 1114849 1220299 1344174 1488229 1648032 1820540
$$ [...]
##END NTUPLES=NMR SPECTRUM
##END=
