##TITLE=Analysis number 324639
Compound Code cc 62301
Book Reference 505/41
Project Code adrs
Chemist Name robb
##JCAMPDX= 6.0         $$ Bruker NMR JCAMP-DX V2.0
##DATA TYPE= NMR SPECTRUM
##DATA CLASS= NTUPLES
##ORIGIN= Bruker BioSpin GmbH
##OWNER= nmr
$$ XWIN-NMR		Version 3.5
$$ Tue Nov 28 11:48:26 2006 GMT Standard Time (UT+0h)  MAYBRIDGE\nmr@NMR_250MHZ
##.OBSERVE FREQUENCY= 250.131544655141
##.OBSERVE NUCLEUS= ^1H
##.ACQUISITION MODE= SIMULTANEOUS (DQD)
##.ACQUISITION SCHEME= undefined
##.AVERAGES= 16
##.DIGITISER RES= 18
##SPECTROMETER/DATA SYSTEM= dpx250
##.PULSE SEQUENCE= zg30
##.SOLVENT NAME= DMSO
##.SHIFT REFERENCE= (INTERNAL, DMSO, 0, 16.523)
##AUDIT TRAIL= $$ (NUMBER, WHEN, WHO, WHERE, WHAT)
$$ ##TITLE= Audit trail, XWIN-NMR		Version 3.5
$$ ##JCAMPDX= 5.01
$$ ##ORIGIN= Bruker BioSpin GmbH
$$ ##OWNER= nmr
$$ C:\u/data/dgb/nmr/ADRS/1300/pdata/1/auditp.txt
$$ ##AUDIT TRAIL=  $$ (NUMBER, WHEN, WHO, WHERE, WHAT)
(   1,<2006-11-28 11:47:52.65 +000>,<MAYBRIDGE\nmr>,<NMR_250MHZ>,
      <created by zg, POWCHK disabled, PULCHK disabled
       configuration hash MD5:
       49 4B E0 1D 92 C2 6B 37 9F E6 65 BC 52 41 86 1D
       data hash MD5: 64K
       0A A7 A4 06 2D 01 E0 03 A2 7F 5D 2B EE 70 2E 53>)
(   2,<2006-11-28 11:48:13.17 +000>,<MAYBRIDGE\nmr>,<NMR_250MHZ>,
      <Start of raw data processing
       ef LB = 0.3 FT_mod = 6 PKNL = 1 SI = 32K 
       data hash MD5: 32K
       B6 40 EF AC 85 89 DC EB EE F3 58 99 4D 19 44 95>)
(   3,<2006-11-28 11:48:14.87 +000>,<MAYBRIDGE\nmr>,<NMR_250MHZ>,
      <apk 
       data hash MD5: 32K
       87 4F 61 D0 00 6A 8B 2E 27 08 8B 3B EA 4F A0 D6>)
(   4,<2006-11-28 11:48:15.61 +000>,<MAYBRIDGE\nmr>,<NMR_250MHZ>,
      <abs ABSG = 5 
       data hash MD5: 32K
       4E 9F B8 9B 4F 30 8E 99 9D 87 A5 3D C6 E6 91 D6>)
$$ ##END=
$$ 
$$ hash MD5
$$ FF C3 BE 5B 0C 14 58 5D B2 26 2A 97 D6 65 80 C5
##$RELAX= 
##$RELAX= 
##$RELAX= 
##$RELAX= 
##$RELAX= 
##$RELAX= 
##$RELAX= 
$$ Bruker specific parameters
$$ --------------------------
##$DU= <C:\u>
##$EXPNO= 1300
##$NAME= <ADRS>
##$PROCNO= 1
##$TYPE= <nmr>
##$USER= <dgb>
##$AMP= (0..31)
100 100 100 100 100 100 100 100 100 100 100 100 100 100 100 100 100 100 
100 100 100 100 100 100 100 100 100 100 100 100 100 100 
##$AQSEQ= 0
##$AQ_mod= 3
##$AUNM= <au_zg>
##$AUTOPOS= <30 >
##$BF1= 250.13
##$BF2= 250.13
##$BF3= 250.13
##$BF4= 250.13
##$BF5= 500.13
##$BF6= 500.13
##$BF7= 500.13
##$BF8= 500.13
##$BYTORDA= 1
##$CFDGTYP= 0
##$CFRGTYP= 5
##$CHEMSTR= <none>
##$CNST= (0..31)
1 1 145 1 1 1 1 1 1 1 1 1 1 1 1 1 1 1 1 1 1 1 1 1 1 1 1 1 1 1 1 1 
##$CPDPRG= <>
##$CPDPRG1= <>
##$CPDPRG2= <>
##$CPDPRG3= <>
##$CPDPRG4= <mlev>
##$CPDPRG5= <mlev>
##$CPDPRG6= <mlev>
##$CPDPRG7= <mlev>
##$CPDPRG8= <mlev>
##$CPDPRGB= <>
##$CPDPRGT= <>
##$D= (0..31)
0 1 0 0 0 0 0 0 0 0.06 0 0 0 0 0 0 0.0002 0 0 0 0 0 0 0 0 0 0 0 0 0 0 
0 
##$DATE= 1164714469
##$DBL= (0..7)
120 120 120 120 120 120 120 120 
##$DBP= (0..7)
150 150 150 150 150 150 150 150 
##$DBP07= 0
##$DBPNAM0= <>
##$DBPNAM1= <>
$$ [...]
##$SUBNAM7= <"">
##$SUBNAM8= <"">
##$SUBNAM9= <"">
##$SW= 20.6930455092707
##$SWIBOX= (0..15)
0 0 3 0 0 0 0 0 0 0 0 0 0 0 0 0 
##$SW_h= 5175.983436853
##$TD= 65536
##$TD0= 1
##$TE= 294.16
##$TE2= 300
##$TE3= 300
##$TEG= 300
##$TL= (0..7)
0 120 120 120 120 120 120 120 
##$TP= (0..7)
150 150 150 150 150 150 150 150 
##$TP07= 0
##$TPNAME0= <>
##$TPNAME1= <>
##$TPNAME2= <>
##$TPNAME3= <>
##$TPNAME4= <>
##$TPNAME5= <>
##$TPNAME6= <>
##$TPNAME7= <>
##$TPOAL= (0..7)
0.5 0.5 0.5 0.5 0.5 0.5 0.5 0.5 
##$TPOFFS= (0..7)
0 0 0 0 0 0 0 0 
##$TUNHIN= 0
##$TUNHOUT= 0
##$TUNXOUT= 0
##$USERA1= <user>
##$USERA2= <user>
##$USERA3= <user>
##$USERA4= <user>
##$USERA5= <user>
##$V9= 5
##$VALIST= <valist>
##$VCLIST= <CCCCCCCCCCCCCCC>
##$VD= 0
##$VDLIST= <DDDDDDDDDDDDDDD>
##$VPLIST= <PPPPPPPPPPPPPPP>
##$VTLIST= <TTTTTTTTTTTTTTT>
##$WBST= 1024
##$WBSW= 4
##$XGAIN= (0..3)
0 0 0 0 
##$XL= 0
##$YL= 0
##$YMAX_a= 387662
##$YMIN_a= -396111
##$ZGOPTNS= <>
##$ZL1= 120
##$ZL2= 120
##$ZL3= 120
##$ZL4= 120
##$ABSF1= 16.52304
##$ABSF2= -4.170132
##$ABSG= 5
##$ABSL= 3
##$ALPHA= 0
##$AQORDER= 0
##$ASSFAC= 0
##$ASSFACI= 0
##$ASSFACX= 0
##$ASSWID= 0
##$AUNMP= <proc_1d>
##$AZFE= 0.1
##$AZFW= 0.1
##$BCFW= 0
##$BC_mod= 0
##$BYTORDP= 0
##$COROFFS= 0
##$CY= 12.5
##$DATMOD= 1
##$DC= 0
##$DFILT= <>
##$DTYPP= 0
##$F1P= 14.0000005364418
##$F2P= -0.99999901652339
##$FCOR= 0.5
##$FTSIZE= 32768
##$FT_mod= 6
##$GAMMA= 0
##$GB= 0
##$INTBC= 1
##$INTSCL= 1
##$ISEN= 128
##$LB= 0.3
##$LEV0= 0
##$LPBIN= 0
##$MAXI= 10000
##$MC2= 0
##$MEAN= 0
##$ME_mod= 0
##$MI= 0
##$NCOEF= 0
##$NC_proc= -2
##$NLEV= 6
##$NOISF1= 0
##$NOISF2= 0
##$NSP= 0
##$NTH_PI= 0
##$NZP= 0
##$OFFSET= 16.52304
##$PC= 1
##$PHC0= 213.7214
##$PHC1= -1.617444
##$PH_mod= 1
##$PKNL= yes
##$PPARMOD= 0
##$PSCAL= 4
##$PSIGN= 0
##$REVERSE= no
##$SF= 250.129999738113
##$SI= 32768
##$SIGF1= 0
##$SIGF2= 0
##$SINO= 400
##$SIOLD= 32768
##$SREGLST= <1H.DMSO>
##$SSB= 0
##$STSI= 32768
##$STSR= 0
##$SW_p= 5175.98343685301
##$SYMM= 0
##$S_DEV= 0
##$TDeff= 65536
##$TDoff= 0
##$TI= <Analysis number 999999
Compound Code 99
Book Reference 9
Project Code 9>
##$TILT= no
##$TM1= 0
##$TM2= 0
##$TOPLEV= 0
##$USERP1= <user>
##$USERP2= <user>
##$USERP3= <user>
##$USERP4= <user>
##$USERP5= <user>
##$WDW= 1
##$XDIM= 32768
##$YMAX_p= 458341950
##$YMIN_p= -333823
$$ End of Bruker specific parameters
$$ ---------------------------------
##NTUPLES= NMR SPECTRUM
##VAR_NAME=  FREQUENCY,     SPECTRUM/REAL,   SPECTRUM/IMAG
##SYMBOL=    X,             R,               I
##VAR_TYPE=  INDEPENDENT,   DEPENDENT,       DEPENDENT
##VAR_FORM=  AFFN,          ASDF,            ASDF
##VAR_DIM=   32768,         32768,           32768
##UNITS=     HZ,            ARBITRARY UNITS, ARBITRARY UNITS
##FACTOR=    0.157963299565203, 1,           1
##FIRST=     4132.90818384422, 0,            0
##LAST=      -1043.07525300879, 0,           0
##MIN=       -1043.07525300879, -333823,     0
##MAX=       4132.90818384422, 458341950,    0
$$ Real data points
##PAGE= N=1
##DATA TABLE= (X++(R..R)), XYDATA
$$ [...]
$$ plain form
19614 7138 8789 10018 8647 318 2840 3542 -1647 -5950 -3328 -6785 -3125 3907 5781 3015 -5203
19599 -5203 -2179 4989 8799 4117 -1725 -264 182 1825 1724 735 -2573 274 -4004 -12852 -17173
19584 -17173 -15518 -8459 -1627 250 2403 5536 5002 -1408 -1212 -4309 -7215 -4991 -12982 -10003 5592
19569 5592 12970 8719 6103 6615 6661 9082 9065 5828 726 -3528 -3277 -7947 -15024 -14208 -13180 -3918
19553 -3918 2017 -317 -2768 -5880 -1432 2250 2862 4046 523 -3085 -8595 -9501 -12754 -10167 -3522
19538 -3522 512 -1330 -9255 -10536 -9424 -5556 -9096 -11543 -9307 -13506 -12794 -4151 1695 4338 4006
19523 4006 -1235 3140 7129 6461 -221 2243 9495 16557 24666 28164 22675 16054 8421 6677 3494
19508 3494 2200 2851 1388 5098 5490 330 -1633 -839 -5068 2308 10800 12047 7438 9837 15176
$$ packed form
19614G138J651J229j371q329K522P02n189m303K622l457L660P032J874k766q218
19599e203L024P168L810m682n842J461M46J643j01r89l308K847m278q848m321
19584a7173J655P059O832J877K153L133n34o410J96l097k906K224p991K979J5595
19569E592P378m251k616N12M6K421j7l237n102m254K51m670p077Q16J028R262
19553c918N935k334k451l112M448L682O12J184l523l608n510r06l253K587O645
19538c522M034j842p925j281J112L868l540k447K236m199P12Q643N846K643l32
19523D006n241M375L989o68o682K464P252P062Q109L498n489o621p633j744l183
19508C494j294O51j463L710L92n160j963P94m229P376Q492J247m609K399N339
$$ plain form
19493 15176 5302 5705 5409 5364 10723 4468 7085 6113 2334 4293 5087 2332 1392 -2788 -3769 -3010 -3466
19476 -3466 -377 -1549 -8390 -11944 -15554 -9791 -976 -454 -458 1068 -1747 -7953 -13660 -14793 -13191 -8059
19460 -8059 -166 -3349 -4592 2075 3541 -7192 -11295 -3411 1168 3109 5889 -822 -7662 -8565 -9445
19445 -9445 -13346 -10725 -7113 -9164 -637 1530 5828 4433 4717 -67 -4501 -918 -1129 8110 7908
19430 7908 2336 -2042 2820 6337 3753 -878 -4356 -1555 907 4193 7495 4221 -7135 -14666
19416 -14666 -13638 -3082 8775 6828 5472 7877 3427 -383 1789 2797 -671 5054 10857 13619
19402 13619 3790 3231 9470 8228 3818 1638 2570 2682 351 -6960 -8244 -5899 -3862 629 -928
19387 -928 723 567 -2959 2919 5984 6915 5125 415 -8079 -7624 -124 -369 -2485 -7770 -8400 -8101
$$ packed form
19493A5176r874M03k96m5N359o255K617r72l779J959P94k755r40m180r81P59m56
19476c466L089j172o841l554l610N763Q815N22mJ526k815o206n707j133J602N132
19460h059P893l183j243O667J466j0733m103P884M579J941K780o711o840r03q80
19445i445l901K621L612k051Q527K167M298j395K84m784m434L583k11R239k02
19430G908n572m378M862L517k584m631l478K801K462L286L302l274j1356p531
19416a4666J028J0556J1857j947j356K405m450l810K172J008l468N725N803K762
19402A3619r829n59O239j242m410k180R32J12k331p311j284K345K037M491j557
19387i28J651j56l526N878L065R31j790m710q494M55P500k45k116n285o30K99
$$ plain form
19371 -8101 -6801 -13022 -19916 -20561 -10722 -3754 -501 -4654 -7029 -9408 -9890 -6065 -4532 -8380 -4457
19356 -4457 -2145 -3270 -1284 -3104 -4370 -3826 -9237 -15340 -9922 -6981 -11168 -14314 -12607 -9797 -9248
19341 -9248 -6309 -1891 -6900 -1643 -1077 -2405 -8116 -6962 734 7336 1868 -4021 -7723 -2938 -4057
19326 -4057 -1876 1125 757 6116 13112 8869 2421 -1612 -4756 -8329 -8625 -4927 2182 -1115 -4807
19311 -4807 -4895 -8490 -11033 -3518 1977 7637 10271 11328 9622 5909 7649 4230 5056 6825 -3864
19296 -3864 -8113 1550 8036 4081 247 -3383 -1863 -1562 -4844 -6700 -6500 -6422 -4714 -4361 -441 539
19280 539 6727 5847 2541 5985 5132 -666 2036 1841 -9 -1128 3368 6634 4815 -1564 -4337 -1376
19264 -1376 -22 3820 9024 8029 -1804 -7925 -5066 4473 3996 2606 -2496 5403 13557 18807 12971
$$ packed form
19371h101J300o221o894o45R839O968L253m153k375k379m82L825J533l848L923
19356d457K312j125J986j820j266N44n411o103N418K941m187l146J707K810N49
19341i248K939M418n009N257N66j328n711J154P696O602n468n889l702M785j119
19326d057K181L001l68N359O996m243o448m033l144l573k96L698P109l297l692
19311d807q8l595k543P515N495N660K634J057j706l713J740l419Q26J769j0689
19296c864m249R663O486l955l834l630J520L01l282j856K00P8J708L53L920R80
19280E39O188q80l306L444q53n798K702j95j850j119M496L266j819o379k773K961
19264a376J354L842N204r95r833o121K859R539m77j390n102P899Q154N250n836
$$ plain form
19249 12971 -486 -11462 -9335 -6309 -760 -255 -3094 -1873 -3249 -4690 2464 5677 1656 1899
19235 1899 1618 1661 -3169 -3551 -3937 3888 6119 7593 9758 9553 4009 9636 8681 8710 6450 653 3840
19218 3840 7663 2698 3679 5432 1803 -3932 -2778 -3060 -5164 -3517 -465 577 987 4639 146
19203 146 -877 -1844 3478 4711 -861 -5787 -4623 2810 4196 -1402 1264 8412 7461 7014 4933 -267
19187 -267 -799 8049 9937 5983 -221 4364 12509 15795 18048 13601 8896 8382 5748 6272 13884 12846
19171 12846 11785 7122 13103 17196 12376 15178 10884 8079 10058 12480 12320 7381 4877 5497 4681
19156 4681 5392 9313 10023 3148 5988 7576 7424 10343 11473 15630 12070 1517 -3569 -1978 8255
19141 8255 10318 13751 15694 17307 15629 13712 14489 13375 6197 2169 7238 17245 21039 21879 28968
$$ packed form
19249A2971j3457j0976K127L026N549N05k839J221j376j441P154L213m021K43
19235A899k81M3m830l82l86P825K231J474K165k05n544N627r55K9k260n797L187
19218C840L823m965R81J753l629n735J154k82k104J647L052J042M10L652m493
19203A46j023r67N322J233n572m926J164P433J386n598K666P148r51m47k081n200
19187b67n32Q848J888l954o204M585Q145L286K253m447m705n14k634N24P612j038
19171A2846j061m663N981M093m820K802m294k805J979K422j60m939k504O20q16
19156D681P11L921P10o875K840J588j52K919J130M157l560j0553n086J591J0233
19141H255K063L433J943J613j678j917P77j114p178m028N069J0007L794Q40P089
$$ plain form
19126 28968 23039 13939 16507 18902 23415 26469 17001 11315 11887 12954 14366 18242 19255 23452 20657
19111 20657 17664 17567 21726 22824 23164 18024 14479 12419 15087 15453 13983 11561 10894 16416 28620
19096 28620 28939 29766 32123 35318 46808 62674 81108 98237 117425 150215 202363 259554 318434
19083 318434 355777 340956 289216 227975 179900 148204 135963 134064 153796 186733 233931 298775
19071 298775 355600 373033 334747 268138 199630 148233 115855 97697 81625 68573 58354
19060 58354 54328 51930 45379 42099 35497 29809 32988 27404 26640 20759 22565 23579 23165 17598 10980
19045 10980 12478 18994 18824 21691 17441 13476 9944 10014 14280 16068 14377 12660 15515 17888 15504
19030 15504 15105 20035 22265 21550 20325 26374 26864 17965 9692 11092 12904 19268 25329 29825 24324
$$ packed form
19126B8968n929r100K568K395M513L054r468n686N72J067J412L876J013M197k795
19111B0657k993r7M159J098L40n140l545k060K668L66j470k422o67N522J2204
19096B8620L19Q27K357L195J1490J5866J8434J7129J9188L2790N2148N7191N8880
19083C18434L7343j4821n1740o1241m8075l1696j2241j899J9732L2937M7198O4844
19071B98775N6825J7433l8286o6609o8508n1397l2378j8158j6072j3052j0219
19060E8354m026k398o551l280o602n688L179n584p64n881J806J014m14n567o618
19045A0980J498O516j70K867m250l965l532P0M266J788j691j717K855K373k384
19030A5504l99M930K230p15j225O049M90q899q273J400J812O364O061M496n501
$$ plain form
19015 24324 16575 13980 14429 13734 18728 20789 13023 11315 11431 5824 7833 7581 13251 19087 15831
19000 15831 19888 17997 18149 15270 15575 22306 26124 26717 27011 28818 18563 11320 13891 13313 17782
18985 17782 13550 11623 16149 20414 18059 17820 15960 8626 1888 2341 4514 11590 10585 5751 9581
18970 9581 9475 4676 3608 1772 1833 11072 14645 13941 16506 19833 21798 15839 12522 17984 20042 22558
18954 22558 21681 23069 20042 27283 33976 31525 30214 29330 23694 29930 28520 18350 19772 30599
18940 30599 30551 34098 40613 40486 31562 32589 25823 23694 24999 26407 19199 15049 19877 26424 26323
18925 26323 15580 11327 13200 12815 10194 11417 20036 29708 26580 18757 19503 25361 25064 25046 22892
18910 22892 21739 24997 18953 14979 17553 20501 18893 20826 26867 28377 27647 24153 19031 14565 16498
$$ packed form
19015B4324p749k595M49o95M994K061p766j708J16n607K009k52N670N836l256
19000A5831M057j891J52k879L05O731L818N93K94J807j0255p243K571n78M469
18985A7782m232j927M526M265k355k39j860p334o738M53K173P076j005m834L830
18970I581j06m799j068j836O1R239L573p04K565L327J965n959l317N462K058K516
18954B2558q77J388l027P241O693k451j311q84n636O236j410j0170J422J0827
18940C0599m8L547O515j27q924J027o766k129J305J408p208m150M828O547j01
18925B6323j0743m253J873l85k621J223Q619R672l128p823P46N858k97j8k154
18910B2892j153L258o044l974K574K948j608J933O041J510p30l494n122m466J933
$$ plain form
18895 16498 21675 24272 25047 26093 29777 27888 27171 31235 29565 26402 30472 33181 28552 27174 24426
18880 24426 24244 25308 28404 21700 13994 13040 11194 19743 28371 27158 24751 27725 23257 16182 19565
18865 19565 29094 31637 31437 31562 25099 26509 26087 22395 22482 31562 39838 53882 68604 90835 110990
18850 110990 118780 114842 112247 110787 108718 96953 78935 68027 58343 59883 62939 71364 84134
18837 84134 96449 99878 99584 100751 104891 99643 90211 76489 57818 45986 40479 36448 27407 27186
18823 27186 31446 26674 28030 27300 20605 22648 22687 14602 10404 15248 12655 15594 13432 10522 14947
18808 14947 18765 23247 32662 35148 32934 31388 25288 16293 13050 9523 1972 4264 9645 15601
18794 15601 14659 15632 19834 29785 35386 34693 29762 24411 16118 8181 5980 6385 11057 20996 26577
$$ packed form
18895A6498N177K597P75J046L684j889p17M064j670l163M070K709m629j378k748
18880B4426j82J064L096o704p706r54j846Q549Q628j213k407K974m468p075L383
18865A9565R529K543k00J25o463J410m22l692Q7R080Q276J4044J4722K2231K0155
18850A10990P790l938k595j460k069j1765j8018j0908r684J540L056Q425J2770
18837H4134J2315L429k94J167M140n248r432j3722j8671j1832n507m031r041k21
18823B7186M260m772J356p30o695K043L9q085m198M844k593K939k162k910M425
18808A4947L818M482R415K486k214j546o100q995l243l527p551K292N381N956
18794A5601r42R73M202R951N601o93m931n351q293p937k201M05M672R939N581
$$ plain form
18779 26577 25404 28947 29842 29006 35057 34216 40255 40431 37328 33408 28377 22762 25950 35932 39249
18764 39249 42265 51781 59833 63781 70729 85012 94432 101928 106341 111161 113466 113451 112140 113276 117057
18749 117057 123003 125465 117344 118112 124480 129535 133322 133220 133163 131724 127836 124231 128146 130379 123631
18734 123631 115009 108145 100505 88516 80274 67337 52907 49993 55027 50239 46342 47400 45124
18721 45124 39513 42439 42130 41648 37357 34248 39001 49917 54068 53538 54414 50225 45198 40594 40472
18706 40472 38106 30424 27152 28034 35140 43000 45776 57751 62077 64612 56386 39794 28088 23907
18692 23907 27978 32410 33388 42869 42872 47894 57161 62658 60132 52916 44418 37563 38196 37400 36688 41982
18676 41982 60927 71266 72700 75132 82611 82653 78304 74097 67607 62873 54888 52377 53658 59314
$$ packed form
18779B6577j173L543Q95q36O051q41O039J76l103l920n031n615L188R982L317
18764C9249L016R516Q052L948O948J4283R420P496M413M820K305j5j311J136L781
18749A17057N946K462q121P68O368N055L787j02n7j439l888l605L915K233o748
18734A23631q622o864p640j1989q242j2937j4430k914N034m788l897J058k276
18721D5124n611K926l09m82m291l109M753J0916M151n30Q76m189n027m604j22
18706D0472k366p682l272Q82P106P860K776J1975M326K535q226j6592j1706m181
18692B3907M071M432R78R481LN022R267N497k526p216q498o855O33p96p12N294
18676D1982J8945J0339J434K432P479M2m349m207o490m734p985k511J281N656
$$ plain form
18662 59314 61595 66917 77862 78625 84888 89777 89829 82902 73007 68621 64376 62704 63326 62790 68050
18647 68050 74316 80739 83195 83248 77004 80161 77512 74905 79794 90201 98116 103403 98297 100190 111876
18632 111876 125567 132887 131256 127115 135319 147687 157937 175420 198250 210971 210591 199766 166781
18619 166781 117771 86086 78153 78362 79733 87736 97666 114828 140439 161899 178597 177898 147639
18606 147639 106546 76147 61434 57388 58993 67838 88500 111912 143147 176282 180104 165141
18594 165141 152798 141601 134588 121391 114357 113692 112070 129195 162379 201589 219050 198709
18582 198709 161901 136094 112976 101906 104533 110211 106085 105579 106043 108983 107102 114492 118074 120833
18568 120833 116551 120892 122507 125387 126499 135837 139320 134233 134680 141400 139216 140494 143952 148802
$$ packed form
18662E9314K281N322J0945P63O263M889N2o927r895m386m245j672O22n36N260
18647F8050O266O423K456N3o244L157k649k607M889J0407P915N287n106J893J1686
18632A11876J3691P320j631m141Q204J2368J0250J7483K2830J2721l80j0825l2985
18619A66781m9010l1685p933K09J371Q003R930J7162K5611K1460J6698o99l0259
18606A47639m1093l0399j4713m046J605Q845K0662K3412L1235L3135L822j4963
18594A65141j2343j1197p013j3197p034o65j622J7125L3184L9210J7461k0341
18582A98709l6808k5807k3118j1070K627N678m126n06M64K940j881P390L582K759
18568A20833m282M341J615K880J112R338L483n087M47O720k184J278L458M850
$$ plain form
18554 148802 157243 163258 169370 177625 181919 184918 192364 198722 201748 205249 211723 228094 245351 260917
18540 260917 270717 284404 310082 336972 358903 393552 443096 499021 550791 579593 591634 616858
18528 616858 673249 759008 839785 885614 897428 884267 885035 922281 997082 1090246 1169112 1222855
18516 1222855 1280861 1390526 1536931 1701815 1858721 2001004 2166150 2370318 2577526 2780785
18506 2780785 3038250 3395692 3888872 4576351 5573272 7045411 9282589 12837518 18686479
18497 18686479 28282060 42717061 60695530 76790360 79411818 66657659 47986595
18490 47986595 32575022 23886789 19935129 19032173 20811801 25927254 35670624 50610204
18482 50610204 68463517 81892391 79042376 62714380 42727741 27660529 18809358
$$ packed form
18554A48802Q441O015O112Q255M294K999P446O358L026L501O474J6371J7257J5566
18540B60917R800J3687K5678K6890K1931L4649M9544N5925N1770K8802J2041K5224
18528F16858N6391Q5759Q0777M5829J1814j3161P68L7246P4801R3164P8866N3743
18516A222855N8006J09665J46405J64884J56906J42283J65146K04168K07208K03259
18506B780785K57465L57442M93180O87479R96921J472139K237178L554929N848961
18497A8686479R595581J4435001J7978469J6094830K621458j2754159j8671064
18490D7986595j5411573q688233l951660r02956J779628N115453R743370J4939580
18482E0610204J7853313J3428874k850015j6327996j9986639j5067212q851171
$$ plain form
18475 18809358 13663465 10465793 8355967 6908816 5863994 5086378 4509749 4066570
18467 4066570 3693965 3360157 3028680 2704261 2429239 2245454 2138942 2063367 1962903 1817195
18457 1817195 1669462 1556274 1463498 1367701 1277612 1212931 1151316 1101906 1079333 1077350 1058863
18446 1058863 1008525 912249 810814 726650 674184 657562 649852 637706 586965 515277 455521
18435 455521 422039 401517 377625 354484 338707 323821 310810 296515 279820 272354 267346 261864
18423 261864 251229 244500 246454 250626 249925 248434 248341 256529 270632 275382 268039 263018 262188 260069 252262
18408 252262 241734 222684 211786 215642 225734 236236 237373 233550 227056 221296 212636 202518 187719
18395 187719 177871 158861 148748 139089 129514 120868 118235 116782 121301 123770 119020 122644 127563 129352
$$ packed form
18475A8809358n145893l197672k109826j447151j044822p77616n76629m43179
18467D066570l72605l33808l31477l24419k75022j83785j06512p5575j00464j45708
18457A817195j47733j13188r2776r5797r0089o4681o1615m9410k2573j983j8487
18446A058863n0338r6276j01435q4164n2466j6622p710j2146n0741p1688n9756
18435D55521l3482k0522k3892k3141j5777j4886j3011j4295j6695p466n008n482
18423B61864j0635o729J954M172p01j491r3Q188J4103M750p343n021q30k119p807
18408B52262j0528j9050j0898L856J0092J0502J137l823o494n760q660j0118j4799
18395A87719r848j9010j0113r659r575q646k633j453M519K469m750L624M919J789
$$ plain form
18381 129352 127122 125506 119635 118262 123795 129817 140053 145924 151649 152359 155724 163304 164397 148809
18367 148809 108691 74506 55611 53183 61924 70971 75211 81681 93206 112554 121671 112604 91297
18354 91297 53790 19003 -2481 -14335 -12227 81 5872 16096 26027 38266 43935 48066 60511
18341 60511 76700 76448 72933 78899 82320 80255 69698 71882 80401 86203 91173 89671 88709 93525
18327 93525 92880 86854 81185 69447 65588 65029 54214 49066 39103 32479 30545 30702 32259 32520 29032
18312 29032 26406 32063 38815 39027 34402 34348 24650 18666 16914 15928 13268 18628 25366 30012 31847
18297 31847 37837 42012 43610 44183 47446 38928 33539 31092 26261 30938 35863 48326 59859 68220
18283 68220 67787 68230 63582 53557 47606 44956 45544 43167 50390 56108 62458 69964 69099 67395 64352
$$ packed form
18381A29352k230j616n871j373N533O022J0236N871N725P10L365P580J093j5588
18367A48809m0118l4185j8895k428Q741R047M240O470J1525J9348R117r067k1307
18354I1297l7507l4787k1484j1854K108J2308N791J0224R931J2239N669M131J2445
18341F0511J6189k52l515N966L421k065j0557K184Q519N802M970j502r62M816
18327I3525o45o026n669j1738l859n59j0815n148r963o624j934J57J557K61l488
18312B9032k626N657O752K12m625n4r698n984j752r86k660N360O738M646J835
18297C1847N990M175J598N73L263q518n389k447m831M677M925J2463J1533Q361
18283F8220m33M43m648j0025n951k650N88k377P223N718O350P506q65j704l043
$$ plain form
18268 64352 59912 53397 49513 50345 45518 39361 33670 33720 40438 47309 39184 33652 34097 30673 25225
18253 25225 22215 24086 30377 40586 41962 38106 31649 28806 29177 29599 32969 37287 41420 37668 39533
18238 39533 34582 33266 33341 34157 32064 27698 21185 17997 18929 18153 9534 10671 15726 15060 19601 11505
18222 11505 3758 6209 8913 10953 14763 16287 8980 9153 7217 6834 9890 14601 13826 15335 24456
18207 24456 28117 24556 31336 29373 17642 16529 20388 22321 20233 12546 3880 11460 17595 30322
18193 30322 34737 32090 32196 31098 33856 31070 33870 32185 30687 26089 21725 25147 22600 25904 28650
18178 28650 35250 40036 33137 28567 22241 24513 29895 29259 21163 19576 18866 17821 18487 17369 17457 11315
18162 11315 8758 8910 6032 5727 9126 6020 9764 16928 20100 19400 12370 11386 15669 20265 12114
$$ packed form
18268F4352m440o515l884Q32m827o157n691N0O718O871q125n532M45l424n448
18253B5225l010J871O291J0209J376l856o457k843L71M22L370M318M133l752J865
18238C9533m951j316P5Q16k093m366o513l188R32p76q619J137N055o66M541q096
18222A1505p747K451K704K040L810J524p307J73j936l83L056M711p75J509R121
18207B4456L661l561O780j963j1731j113L859J933k088p687q666P580O135J2727
18193C0322M415k647J06j098K758k786K800j685j498m598m364L422k547L304K746
18178B8650O600M786o899m570o326K272N382o36q096j587p10j045O66j118Q8o142
18162A1315k557J52k878l05L399l106L744P164L172p00p030r84M283M596q151
$$ plain form
18147 12114 15365 20380 23256 22413 21034 18901 9324 4098 4035 7841 10698 831 -283 2991 4112
18132 4112 3608 2619 -1663 -5114 -7841 -8111 -932 -1143 -285 5439 6286 1849 1312 2888 6157 3424
18116 3424 2589 4516 7774 6233 -859 4613 8651 9107 11120 13569 10800 10579 6431 8977 6300
18101 6300 187 1662 6409 6454 7872 5059 8339 9878 10704 6080 3190 9876 10447 6155 2767 5348
18085 5348 9357 12145 10448 10329 5445 9900 13856 6064 1046 2294 10865 15608 11056 10350 10519
18070 10519 7029 9959 11241 7044 12364 13289 6795 7471 17166 18043 15655 16314 9601 10570 11241 12916
18054 12916 16849 20479 24489 20699 23673 15885 9907 6189 2814 3813 10342 14581 9230 3365 -296
18039 -296 2016 -984 -5163 1249 4651 4066 6032 3894 -3159 -8584 -5576 2988 8132 4944 3008
$$ packed form
18147A2114L251N015K876q43j379k133r577n226o3L806K857r867j114L274J121
18132D112n04r89m282l451k727k70P179k11Q58N724Q47m437n37J576L269k733
18116C424q35J927L258j541p092N472M038M56K013K449k769k21m148K546k677
18101F300o113J475M747M5J418k813L280J539Q26m624k890O686N71m292l388K581
18085E348M009K788j697j19m884M455L956p792n018J248Q571M743m552p06J69
18070A0519l490K930J282m197N320R25o494O76R695Q77k388O59o713R69O71J675
18054A2916L933L630M010l790K974p788n978l718l375R99O529M239n351n865l661
18039b96K312l000m179O412L402n85J966k138p053n425L008Q564N144l188j936
$$ plain form
18024 3008 7041 11338 10807 11926 9640 4442 9685 9219 4137 -1667 -1519 5588 11661 14549 13186
18009 13186 16496 22446 19937 23145 25447 20155 19716 28004 31069 25479 24340 23721 19867 19735 27802
17994 27802 33322 37494 38882 42835 46944 50732 55531 53736 53997 63018 76144 92139 129914 177991
17980 177991 230318 310309 398889 447595 421925 342959 256549 192454 158473 141819 143738 163499
17968 163499 199089 258262 332611 413621 430068 370157 284989 206290 155012 128296 109739
17957 109739 93454 82162 73838 62957 58862 62632 69360 71237 65097 66836 64729 52314 38562
17944 38562 35666 39192 42095 38201 36435 39339 40188 36210 37794 37880 32532 38058 39358 41433 36358
17929 36358 38545 44919 42665 38358 39908 36989 25625 27740 35900 39245 34912 27031 31170 36819
$$ packed form
18024C008M033M297n31J119k286n198N243m66n082n804J48P107O073K888j363
18009A3186L310N950k509L208K302n292m39Q288L065n590j139o19l854j32Q067
17994B7802N520M172J388L953M109L788M799j795K61R021J3126J5995L7775M8077
17980A77991N2327P9991Q8580M8706k5670p8966q6410o4095l3981j6654J919J9761
17968A63499L5590N9173P4349Q1010J6447n9911q5168p8699n1278k6716j8557
17957A09739j6285j1292q324j0881m095L770O728J877o140J739k107j2415j3752
17944C8562k896L526K903l894j766K904Q49l978J584Q6n348N526J300K075n075
17929C6358K187O374k254m307J550k919j1364K115Q160L345m333p881M139N649
$$ plain form
17915 36819 33498 28244 26201 24420 26107 30077 36458 41472 42911 51962 58977 63466 71426 83751
17901 83751 103338 135593 188684 248872 315232 366669 364069 317769 259073 208610 174476 161966
17889 161966 163400 172677 202429 245794 303383 362826 384836 361733 305638 237804 177152 135318
17877 135318 112009 98851 84406 75486 72189 67583 66016 66427 59357 51505 50624 43147 46269 48296
17863 48296 44251 35276 32478 38868 33763 32423 31224 26846 19856 19322 19556 22848 25881 28272 31179
17848 31179 25860 23318 19265 23857 22377 15045 12892 13044 12411 12837 12578 12893 13146 6294 7630 15254
17832 15254 20626 21056 17966 15711 17207 18466 18539 19308 25144 26252 23141 16975 10870 16196 15759 14497
17816 14497 18373 14695 9467 14005 16803 15145 15856 16353 15883 9553 10963 18594 15515 13723 14189
$$ packed form
17915C6819l321n254k043j781J687L970O381N014J439R051P015M489P960J2325
17901H3751J9587L2255N3091O0188O6360N1437k600m6300n8696n0463l4134j2510
17889A61966J434R277K9752M3365N7589N9443K2010k3103n6095o7834o0652m1834
17877A35318k3309j3158j4445q920l297m606j567M11p070p852q81p477L122K027
17863D8296m045q975k798O390n105j340j199m378o990n34K34L292L033K391K907
17848C1179n319k542m053M592j480p332k153J52o33M26k59L15K53o852J336P624
17832A5254N372M30l090k255J496J259P3P69N836J108l111o166o105N326m37j262
17816A4497L876l678n228M538K798j658P11M97m70o330J410P631l079j792M66
$$ plain form
17801 14189 5778 5868 13876 18485 18340 22998 25394 28528 25562 27313 25260 22041 21849 18124 20396
17786 20396 20132 23246 18111 13203 13617 14996 18914 15636 9096 9005 8147 13288 18828 24024 27818 24994
17770 24994 23294 24910 27816 25542 26250 27284 22671 12810 11602 20688 18969 19395 20223 14376 18017
17755 18017 23699 23442 19933 14656 18956 24457 28953 26987 27644 23821 14863 10537 13116 14233 13597
17740 13597 7769 12485 19244 20210 15628 12095 17330 16103 8833 15414 23547 30242 31363 27033 20293
17725 20293 12910 11151 15030 15255 13115 13719 10816 4432 4222 7172 7381 5672 7281 12920 14680
17710 14680 9483 6590 9184 12575 11489 8477 6245 9283 11097 13557 7960 7488 11637 13757 8984
17695 8984 8594 13627 21932 19157 22831 32207 29843 30159 28718 26550 24133 22601 23556 24931 27096
$$ packed form
17801A4189q411R0Q008M609j45M658K396L134k966J751k053l219j92l725K272
17786B0396k64L114n135m908M14J379L918l278o540r1q58N141N540N196L794k824
17770B4994j700J616K906k274P08J034m613r861j208R086j719M26Q28n847L641
17755A8017N682k57l509n277M300N501M496j966O57l823q958m326K579J117o36
17740A3597n828M716O759R66m582l533N235j227p270O581Q133O695J121m330o740
17725B0293p383j759L879K25k140O04k903o384k10K950K09j709J609N639J760
17710A4680n197k893K594L391j086l012k232L038J814K460n597m72M149K120m773
17695H984l90N033Q305k775L674R376k364L16j441k168k417j532R55J375K165
$$ plain form
17680 27096 26837 28337 30700 34380 41049 43653 46303 50067 50657 43318 37340 49932 64204 75009
17666 75009 77106 75041 75984 73200 56093 46225 41040 39047 38246 43377 51901 63201 78340 80353
17652 80353 78356 81815 82672 66711 54206 51633 55406 57240 56030 51268 54486 57222 59660 53967
17638 53967 51920 55624 51900 55325 46721 39222 45363 54299 58222 62600 59843 49922 43028 37029
17624 37029 29344 31053 38501 46369 54743 57292 59447 63073 67858 59103 48618 43618 36348 30753
17610 30753 28676 39427 48956 52348 66998 77634 82252 78581 69461 58637 44043 37595 30524
17597 30524 31107 36285 46980 52572 56935 70028 79317 80556 76018 67931 58037 58701 57369 55282
17583 55282 55601 59083 62831 61287 57961 60069 58194 49258 51024 52252 49653 48963 51251 54287 53293
$$ packed form
17680B7096k59J500K363L680O669K604K650L764N90p339n978J2592J4272J0805
17666G5009K097k065R43k784j7107r868n185j993q01N131Q524J1300J5139K013
17652H0353j997L459Q57j5961j2505k573L773J834j210m762L218K736K438n693
17638E3967k047L704l724L425q604p499O141Q936L923M378k757r921o894n999
17624C7029p685J709P448P868Q374K549K155L626M785q755j0485n000p270n595
17610C0753k077J0751R529L392J4650J0636M618l671r120j0824j4594o448p071
17597C0524N83N178J0695N592M363J3093R289J239m538q087r894O64j332k087
17583E5282L19L482L748j544l326K108j875q936J766J228k599o90K288L036r94
$$ plain form
17568 53293 53866 57354 57713 62985 71235 77014 74901 63328 58920 62055 70086 71699 80792 85877 90886
17553 90886 94483 105148 110265 113634 113995 110968 112777 126680 146653 160409 184118 210376 220355
17540 220355 207233 164623 105875 57462 46365 48758 54305 72438 91261 107119 134220 164339
17528 164339 169410 158549 111430 56875 20365 7059 5238 8740 10321 13197 16813 29036 41668
17515 41668 46107 53108 49068 49820 53252 55165 58297 54032 57925 67695 73167 77751 78461 85602 96319
17500 96319 106331 108190 125313 145541 162939 177466 194564 218770 218930 191200 166140 152101
17488 152101 146729 145229 154866 179752 193472 194609 207895 232436 247039 237079 208986 177676
17476 177676 158423 155828 156084 157476 162579 168792 178646 183364 182628 188311 193864 202721 209586 204062
$$ packed form
17568E3293N73L488L59N272Q250N779k113j1573m408L135Q031J613R093N085N009
17553I0886L597J0665N117L369L61l027J809J3903J9973J3756K3709K6258R979
17540B20355j3122m2610n8748m8413j1097K393N547J8133J8823J5858K7101L0119
17528A64339N071j0861m7119n4555l6510j3306j821L502J581K876L616J2223J2632
17515D1668M439P001m040P52L432J913L132m265L893R770N472M584P10P141J0717
17500I6319J0012J859J7123K0228J7398J4527J7098K4206J60k7730k5060j4039
17488A52101n372j500R637K4886J3720J137J3286K4541J4603r960k8093l1310
17476A77676j9253k595K56J392N103O213R854M718p36N683N553Q857O865n524
$$ plain form
17462 204062 204049 203144 216607 226926 245544 260026 266784 283868 296645 306949 320579 339472 352390
17449 352390 362601 383738 405269 422725 449971 480751 525152 570113 610999 662346 732478
17438 732478 837162 995513 1189176 1355752 1404136 1411424 1440786 1563765 1778383 2039889
17428 2039889 2285158 2460667 2641496 2906513 3321395 3905449 4622288 5508373 6804169
17419 6804169 8856357 12253715 18011895 27918443 43794742 64798186 85874322 89708547
17411 89708547 73000287 49673195 31650941 22504754 18450711 17390521 18926603 23784281
17403 23784281 33602941 49690755 70207946 88084075 84573660 65073996 41775215
17396 41775215 25847321 17450636 12766431 9824930 7839907 6468003 5509182 4828739
$$ packed form
17462B04062j3r05J3463J0319J8618J4482O758J7084J2777J0304J3630J8893J2918
17449C52390J0211K1137K1531J7456K7246L0780M4401M4961M0886N1347P0132
17438G32478J04684J58351J93663J66576M8384P288K9362J22979K14618K61506
17428B039889K45269J75509J80829K65017M14882N84054P16839Q86085J295796
17419F804169K052188L397358N758180R906548J5876299K1003444K1076136L834225
17411H9708547j6708260k3327092j8022254r146187m054043j060190J536082M857678
17403B3784281R818660J6087814K0517191J7876129l510415j9499664k3298781
17396D1775215j5927894q396685m684205k941501j985023j371904r58821o80443
$$ plain form
17388 4828739 4323488 3850696 3391215 2991806 2690627 2453697 2269037 2093386 1911963
17379 1911963 1741762 1610662 1544115 1537898 1527272 1409881 1219993 1021336 870258 774142
17369 774142 706694 649743 602695 560579 524046 497318 467181 434253 401779 365571 338100
17358 338100 322254 311186 302931 295408 289192 278764 267525 257358 246741 227439 213762 198166
17346 198166 188989 180201 174037 174348 167763 164585 160470 161538 158294 157210 156813 147634 135082 125625
17332 125625 123958 129143 132380 127876 120473 119457 119114 108448 93166 91599 90636 85218 81613 79425
17318 79425 84349 88336 92569 89847 88786 88696 88377 83318 80925 80950 79107 76228 76741 80503 81243 77917
17302 77917 81588 79493 79294 81135 83237 84684 91827 100651 104508 112026 122644 126067 139429 142199
$$ packed form
17388D828739n05251m72792m59481l99409l01179k36930j84660j75651j81423
17379A911963j70201j31100o6547o217j0626j17391j89888j98657j51078r6116
17369G74142o7448n6951m7048m2116l6533k6728l0137l2928l2474l6208k7471
17358C38100j5846j1068q255p523o216j0428j1239j0167j0617j9302j3677j5596
17346A98166r177q788o164L11o585l178m115J068l244j084l97r179j2552r457
17332A25625j667N185L237m504p403j016l43j0666j5282j567r63n418l605k188
17318G9425M924L987M233k722j061r0l19n059k393K5j843k879N13L762P40l326
17302G7917L671k095j99J841K102J447P143Q824L857P518J0618L423J3362K770
$$ plain form
17288 142199 145634 131907 84761 37454 11894 16464 27714 41287 49955 55521 63707 73584 78459
17275 78459 75716 61457 19408 -28618 -51818 -54170 -45799 -41152 -35031 -29213 -30504 -32473 -39418
17262 -39418 -36735 -30185 -19656 -9816 -7433 -5381 -1993 -2323 -3674 -4506 -8266 -187 1208 3856 7490
17247 7490 4456 142 653 6590 11179 8989 11773 14509 10855 7403 3696 1081 -1749 -12003 -17184
17232 -17184 -17814 -17020 -14353 -3067 10310 8725 2810 -1901 -12861 -19870 -23304 -15317 -12291 -3581
17218 -3581 4148 6080 8537 10410 11096 8058 4635 705 -11066 -21170 -22437 -16352 -12764 -13158 -6836
17203 -6836 3546 10866 14741 13416 6634 4215 -1844 -6071 -5230 1108 12285 23408 24278 19441
17189 19441 12922 3745 -3756 -1210 -4993 -14898 -19341 -17478 -14237 -10297 -8939 -9418 -8891 -5570 -1776
$$ packed form
17288A42199L435j3727m7146m7307k5560M570J1250J3573Q668N566Q186R877M875
17275G8459k743j4259m2049m8026k3200k352Q371M647O121N818j291j969o945
17262c9418K683O550J0529R840K383K052L388l30j351q32l760Q079J395K648L634
17247G490l034m314N11N937M589k190K784K736l654l452l707k615k830j0254n181
17232a7184o30P94K667J1286J3377j585n915m711j0960p009l434P987L026Q710
17218c581P729J932K457J873O86l038l423l930j1771j0104j267O085L588l94O322
17203f836J0382P320L875j325o782k419o059m227Q41O338J1177J1123Q70m837
17189A9441o519r177p501K546l783r905m443J863L241L940J358m79N27L321L794
$$ plain form
17174 -1776 -3361 -8202 -1222 3475 2379 246 5027 9198 6828 5125 -1993 -5060 -541 4233 7032
17159 7032 13156 17850 13514 -3868 -9042 -5906 -8357 -6931 -3750 -3290 75 -688 4118 4697 7054
17144 7054 10185 4212 1885 3612 5835 -461 -8509 -10612 -10476 -12793 -13522 -8449 -10680 -11975 -9798
17129 -9798 -6999 -5203 -2004 946 2566 1217 -4246 -8771 -10921 -6116 -6476 -7730 -8938 -6789 -5639
17114 -5639 -2279 -5046 -5181 -412 730 7393 10911 11053 10595 8297 11262 6102 332 402 2306 1933
17098 1933 4557 7050 8877 12279 12822 10989 11798 8971 4640 -2940 -1628 -3130 -12216 -14292 -16843
17083 -16843 -16216 -15500 -13040 -4949 -1482 -11100 -23831 -13098 -7563 -632 3152 2462 -1752 -6359 -11612
17068 -11612 -11739 -11764 -7380 -10713 -6785 -3926 -2952 -6408 -6959 -4812 1111 -458 -6250 -9882 -8821 -14840
$$ packed form
17174a776j585m841O980M697j096k133M781M171k370j703p118l067M519M774K799
17159G032O124M694m336j7382n174L136k451J426L181M60L365p63M806N79K357
17144G054L131n973k327J727K223o296q048k103J36k317p29N073k231j295K177
17129i798K799J796L199K950J620j349n463m525k150M805l60j254j208K149J150
17114e639L360k767j35M769J142O663L518J42m58k298K965n160n770P0J904l73
17098A933K624K493J827L402N43j833Q09k827m331p580J312j502r086k076k551
17083a6843O27P16K460Q091L467r618j2731J0733N535O931L784o90m214m607n253
17068a1612j27k5M384l333L928K859R74l456n51K147N923j569n792l632J061o019
$$ plain form
17052 -14840 -17968 -21207 -22673 -16443 -10663 -4980 -3090 -41 3834 8406 11640 10325 1602 -2744
17038 -2744 -4161 -3780 -5128 -4027 -3349 -6255 -2925 -2111 -6276 -12899 -10841 -3566 -6892 -3889 -5800
17023 -5800 -9141 -8775 -4699 -7742 -6953 -3482 -3291 -8304 -8377 -571 911 3567 4945 3717 -5367 -14705
17007 -14705 -13102 -11550 -12932 -15369 -18478 -20550 -20850 -23059 -26655 -17085 -9133 458 -1381 -4421 -1377
16992 -1377 -444 -7291 -13402 -10761 -9444 -14377 -14586 -9814 -810 -61 -2557 -9669 -8858 -8736 -14129 -18406
16976 -18406 -12385 -8765 -5329 -3445 -3779 -4391 -2322 3390 3807 -3765 -8589 -9837 -4326 -6136 -9794
16961 -9794 -11214 -13233 -15825 -15535 -19011 -19252 -17183 -16335 -9742 -8542 -10612 -5323 -1491 -5943 -12551
16946 -12551 -15874 -14986 -7658 -4123 -5336 -3370 -122 -3402 -6516 -2873 -64 -6025 -11075 -10498 -4026
$$ packed form
17052a4840l128l239j466O230N780N683J890L049L875M572L234j315q723m346
17038b744j417L81j348J101O78k906L330Q14m165o623K058P275l326L003j911
17023e800l341L66M076l043P89L471J91n013p3P806J482K656J378j228r084r338
17007a4705J603J552j382k437l109k072l00k209l596R570P952R591j839l040L044
16992a377R33o847o111K641J317m933k09M772R004P49k496p112Q11J22n393m277
16976a8406O021L620L436J884l34o12K069N712M17p572m824j248N511j810l658
16961i794j420k019k592K90l476k41K069Q48O593J200k070N289L832m452o608
16946a2551l323Q88P328L535j213J966L248l280l114L643K809n961n050N77O472
$$ plain form
16931 -4026 1272 1250 -59 -1418 -8172 -11997 -8091 -7850 -1992 77 5294 8035 3621 -2024 -7965
16916 -7965 -7338 -5051 -2347 -4990 -3050 -8338 -7304 -5938 -7042 -8743 -8369 -10428 -12485 -8271 -5583
16901 -5583 -2964 270 -911 1238 -5816 -8119 -11832 -12607 -13060 -6375 -1255 -1910 -672 1645 3467
16886 3467 3749 -2505 -2504 -775 830 -5288 -7659 -3299 2185 -1267 -3180 3659 10297 5576 4963 7051
16870 7051 12010 11290 6432 2723 5084 7608 9957 10695 14141 14879 14044 7496 3630 9048 15409 20379
16854 20379 19671 18166 24935 29461 31599 39105 56881 76764 104136 144469 206403 289109 373152
16841 373152 406910 363437 283677 206511 151266 125947 111232 116247 141334 183562 249745 321711
16829 321711 384809 393594 333252 247255 169558 115374 85293 66734 49297 35799 28235 25735
$$ packed form
16931d026N298k2j309j359o754l825L906K41N858K069N217K741m414n645n941
16916g965O27K287K704k643J940n288J034J366j104j701L74k059k057M214K688
16901e583K619L234j181K149p054k303l713p75m53O685N120o55J238K317J822
16886C467K82o254JJ729J605o118k371M360N484l452j913O839O638m721o13K088
16870G051M959p20m858l709K361K524K349P38L446P38q35o548l866N418O361M970
16854B0379p08j505O769M526K138P506J7776J9883K7372M0333O1934Q2706Q4043
16841C73152L3758m3473p9760p7166n5245k5319j4715N015K5087M2228O6183P1966
16829C21711O3098Q785o0342q5997p7697n4184l0081j8559j7437j3498p564k500
$$ plain form
16817 25735 21665 19519 17099 16974 22762 18624 9446 7454 10426 10724 6696 12222 14956 14120 13042
16802 13042 11223 11756 11857 17109 20277 18512 17763 4086 804 2078 2166 -1072 1857 147 -7047
16787 -7047 -12534 -7351 -8352 -5813 -6881 -3074 -1165 572 2780 -3617 -5147 -4936 -6882 -3821 -1980
16772 -1980 -1714 1618 2750 3027 4919 1829 -3427 -4795 -11233 -12903 -8357 -10609 -12636 -10799 -13897
16757 -13897 -12898 -5379 2888 4114 3590 9765 8654 8651 5223 -360 -6484 -3404 1771 949 1545 1855
16741 1855 -1716 -6303 -4059 -1935 -557 617 4484 4077 3697 5728 9292 282 -2694 -3865 -789
16726 -789 5708 1180 -5269 -12668 -10350 -5969 -7237 -2157 -49 -563 3274 4052 3229 -1368 -5977 1281
16710 1281 7807 5225 2867 3278 -2250 1309 5884 717 -3096 -2676 -3124 -2365 -5175 -7802 771 9146
$$ packed form
16817B5735m070k146k420j25N788m138r178j992K972K98m028N526K734q36j078
16802A3042j819N33J01N252L168j765p49j3677l282J274Q8l238K929j710p194
16787g047n487N183j001K539j068L807J909J737K208o397j530K11j946L061J841
16772a980K66L332J132K77J892l090n256j368o438j670M546k252k027J837l098
16757a3897R99P519Q267J226n24O175j111ll428n583o124L080N175q22N96L10
16741A855l571m587K244K124J378J174L867m07l80K031L564r010k976j171L076
16726g89O497m528o449p399K318M381j268N080K108n14L837P78q23m597m609P258
16710A281O526k582k358M11n528L559M575n167l813M20m48P59k810k627Q573Q375
$$ plain form
16694 9146 2038 -4924 -10076 -13521 -13866 -14169 -12807 -16133 -16602 -12432 -3676 2802 1173 1334 5006 6601
16678 6601 2008 -629 -380 -753 -2840 -2890 -6373 -4949 524 -3696 -11368 -7803 -4235 -2212 -4846 -2409
16662 -2409 1505 -5497 -7220 -6340 -2848 -881 -1469 -2063 435 -459 -2995 -9785 -9931 -5325 4738 6745
16646 6745 1725 -6994 -4700 113 3982 10513 10867 7131 5235 9574 9930 8720 10247 1392 -1038
16631 -1038 1634 358 732 -1869 -1314 -3160 1356 7252 8601 8402 3184 1952 5765 10190 8852
16616 8852 4250 -3552 1660 9975 11470 9642 3793 9709 6675 -333 1977 3823 1343 -2338 -606
16601 -606 80 678 7299 6561 2610 -414 -1974 2061 5214 1479 2911 4416 -509 5472 9329 10714
16585 10714 7348 3181 4731 3083 -1357 594 2583 3494 -3091 -2001 -8901 -9327 -8889 -12097 -8579
$$ packed form
16694I146p108o962n152l445l45l03J362l326m69M170Q756O478j629J61L672J595
16678F601m593k637K49l73k087n0l483J424N473m220p672L565L568K023k634K437
16662b409L914p002j723Q80L492J967n88n94K498q94k536o790j46M606J0063K007
16646F745n020q719K294M813L869O531L54l736j896M339L56j210J527q855k430
16631a038K672j276L74k601N55j846M516N896J349j99n218j232L813M425j338
16616H852m602p802N212Q315J495j828n849N916l034p008K310J846k480l681J732
16601f06O86N98O621p38l951l024j560M035L153l735J432J505m925N981L857J385
16585A0714l366m167J550j648m440J951J989R11o585J090o900m26M38l208L518
$$ plain form
16570 -8579 -3917 -9358 -11719 -10597 -5670 -4040 -1796 5048 3299 4332 8735 10657 9135 4681 -4790
16555 -4790 -7085 -3290 6194 11827 14790 14108 13071 14797 24235 32705 39839 50563 63045 69847
16541 69847 58604 39738 32407 25581 21970 19073 26054 38280 56873 80230 101346 114201 117085
16528 117085 109578 93454 70449 50173 32510 21347 20858 24075 28152 36231 46543 65541 75523
16515 75523 67177 49316 31679 23046 18816 13855 13236 9557 4464 36 -4753 -3659 -4957 -3694
16501 -3694 -7101 -7215 -5125 -5332 -5379 393 12005 11341 8208 7760 8400 1862 727 12311 17294 15855
16485 15855 15788 15369 12302 7516 1457 2110 7155 6513 3865 5369 7756 6635 7386 14626 16558 18419
16469 18419 28354 45624 67407 77799 66106 51696 35209 25877 24162 24366 27639 37047 46573
$$ packed form
16570h579M662n441k361J122M927J630K244O844j749J033M403J922j522m454r471
16555d790k295L795R484N633K963o82j037J726R438Q470P134J0724J2482O802
16541F9847j1243j8866p331o826l611k897O981J2226J8593K3357K1116J2855K884
16528A17085p507j6124k3005k0276j7663j1163m89L217M077Q079J0312J8998R982
16515G5523q346j7861j7637q633m230m961o19l679n093m428m789J094j298J263
16501c694l407j14K090k07m7N772J1612o64l133m48O40o538j135J1584M983j439
16485A5855o7m19l067m786o059O53N045o42k648J504K387j121P51P240J932J861
16469A8419R935J7270K1783J0392j1693j4410j6487r332j715K04L273R408R526
$$ plain form
16456 46573 61401 84329 100528 102101 91806 72330 47838 28258 17388 15145 20989 26228
16444 26228 22263 34110 45983 54226 56110 42683 28935 24425 18069 17108 13712 14344 8832 9352
16430 9352 13962 16126 13237 9521 9495 4683 3670 3373 3018 2705 2107 -4029 -8807 -8115 -13288 -10319
16414 -10319 -6252 -2746 -2613 -5205 -3151 88 -3687 -4815 -10782 -9908 -12557 -5773 -3574 -8305 -4960
16399 -4960 1518 3691 5045 3997 4134 1708 147 -1296 4868 10861 4026 4650 7419 7280 4471
16384 4471 4787 1308 2015 158 -6129 -6998 -3717 -6336 -11476 -10206 -10127 -2386 199 -4690 -5465 -6704
16368 -6704 -3826 -3816 -6839 -9393 -9573 -3491 -2509 -2010 968 -646 -2507 -2266 5990 3686 -4261 -1370
16352 -1370 -4155 -4968 -5727 -10924 -7834 -1045 -2827 -3098 1724 -5042 -10354 -6877 -9013 -12766 -6170
$$ packed form
16456D6573J4828K2928J6199J573j0295j9476k4492j9580j0870k243N844N239
16444B6228l965J1847J1873Q243J884j3427j3748m510o356r61l396O32n512N20
16430I352M610K164k889l716k6m812j013k97l55l13n98o136m778O92n173K969
16414a0319M067L506J33k592K054L239l775j128n967Q74k649O784K199m731L345
16399d960O478K173J354j048J37k426j561j443O164N993o835O24K769j39k809
16384D471L16l479P07j857o287q69L281k619n140J270P9P741K585m889p75j239
16368f704K878J0l023k554j80O082R82M99K978j614j861K41Q256k304p947K891
16352a370k785q13p59n197L090O789j782k71M822o766n312L477k136l753O596
$$ plain form
16337 -6170 -6264 -11823 -8231 4449 6998 8912 2166 10401 10502 7107 6593 1027 -2634 -1258 -157
16322 -157 444 -2316 -3888 -12870 -14811 -7912 -820 5006 -2683 -9115 -9135 -9452 -2892 -217 -5251 -6624
16306 -6624 -6158 -11414 -7583 5786 17163 16772 12797 6252 6636 12671 8070 225 -3671 -2692 6898
16291 6898 14228 15452 11174 3750 1202 1332 15 318 3509 1767 -3576 -2096 6980 5905 -1266
16276 -1266 1455 2356 -2612 -10285 -4744 1620 -267 -3163 -2956 291 322 -4078 -3189 -1834 -2931 -4747
16260 -4747 -12642 -11737 -6281 -2965 -1259 -320 -4326 -3632 -6966 -6018 -891 7093 8006 1010 -2166 -4930
16244 -4930 -4491 -3298 981 7027 2596 -728 1516 207 1786 3013 -507 -4684 -7389 -7369 -13502
16229 -13502 -12278 -10608 -12144 -13439 -13076 -11708 -11866 -11877 -10158 -8883 -9542 -6474 -7249 -8916 -13572 -10975
$$ packed form
16337f170r4n559L592J2680K549J914o746Q235J01l395n14n566l661J376J101
16322a57O01k760j572q982j941O899P092N826p689o432k0l17O560K675n034j373
16306f624M66n256L831J3369J1377l91l975o545L84O035m601p845l896R79R590
16291F898P330J224m278p424k548J30j317L03L191j742n343J480R076j075p171
16276a266K721R01m968p673N541O364j887k896K07L247L1m400Q89J355j097j816
16260d747p895R05N456L316J706R39m006O94l334R48N127P984R13o996l176k764
16244d930M39J193M279O046m431l324K244j309J579J227l520m177k705K0o133
16229a3502J224J670j536j295L63J368j58j1J719J275o59L068p75j667m656K597
$$ plain form
16213 -10975 -7245 -3742 -2918 -1848 -2387 -1873 -7299 -9140 -4410 -3799 -8717 -9717 -9218 -5703 -5878 -2218
16197 -2218 -3312 -3377 -2360 -2965 -2726 2 -98 -998 512 -1886 -6726 -6137 -14569 -16749 -14444 -11246
16181 -11246 -9444 -1390 2852 734 -5284 -11446 -11478 -13880 -8685 -14539 -15655 -14815 -15099 -10340 -3954
16166 -3954 1034 952 9257 6514 7746 12850 7653 4147 5207 1801 -676 -340 -3212 -4377 -4238 -5991
16150 -5991 -612 1428 -60 -472 -2101 6651 12680 12845 4411 -3716 -2021 1816 3835 1330 6481
16135 6481 3289 3241 1509 -3648 45 -6095 -4541 -6460 -10069 -5944 -591 540 -3407 -8359 -6499
16120 -6499 -5268 -6148 -663 -3818 -2363 -490 -1998 -4056 -4332 -3610 -4052 -3715 -644 2776 5233 4886
16104 4886 6266 4092 -2306 -4870 -5702 -4428 -5466 -8069 -854 9414 10474 6710 2207 2432 -1440
$$ packed form
16213a0975L730L503Q24J070n39N14n426j841M730O11m918j000M99L515j75L660
16197b218j094o5J017o05K39K728j00r00J510k398m840N89q432k180K305L198
16181a1246J802Q054M242k118o018o162l2k402N195n854j116Q40k84M759O386
16166c954M988q2Q305k743J232N104n197l506J060l406k477L36k872j165J39j753
16150e991N379K040j488m12j629Q752O029J65q434q127J695L837K019k505N151
16135F481l192m8j732n157L693o140J554j919l609M125N353J131l947m952J860
16120f499J231q80N485l155J455J873j508k058k76P22m42L37L071L420K457l47
16104D886J380k174o398k564q32J274j038k603P215J0268J060l764m503K25l872
$$ plain form
16089 -1440 -954 949 5967 6556 2240 4246 11242 9398 -698 -1278 1987 6246 6541 4066 3117 5486
16073 5486 5421 8004 6399 6847 11074 11072 10495 7557 2689 -2622 -5311 -7290 -4314 -7354 -11431 -11410 -7096
16056 -7096 -4120 -1580 3240 3298 155 -4840 -4137 -8617 -11554 -8033 -6845 -9427 -12308 -6728 -933
16041 -933 5033 8966 -1303 -6149 -10372 -7305 -874 -1833 -2529 -7000 -2874 1568 6091 5390 -319
16026 -319 -7266 -14290 -12483 -4889 -10663 -13294 -471 5094 8700 6107 2144 -2737 -194 6052 4364
16011 4364 -5114 -8000 -3789 1149 6335 7375 5774 5561 5361 2951 3663 11230 9694 1805 -2667
15996 -2667 -5756 -8161 -2382 3449 7060 9951 5184 2428 3442 3369 8130 8494 6168 5535 4746 -894
15980 -894 -4504 -5644 -681 4506 9392 7218 3709 3079 503 -3475 -8542 -645 2997 7589 2508
$$ packed form
16089a440M86J903N018N89m316K006O996j844j0096n80L265M259K95k475r49K369
16073E486o5K583j605M48M227kn77k938m868n311k689j979K976l040m077K1M314
16056g096K976K540M820N8l143m995P03m480k937L521J188k582k881N580N795
16041i33N966L933j0269m846m223L067O431r59o96m471M126M442M523p01n709
16026c19o947p024J807P594n774k631J2823N565L606k593l963m881K543O246j688
16011D364r478k886M211M938N186J040j601k13k00k410P12P567j536p889m472
15996b667l089k405N779N831L611K891m767k756J014p3M761L64k326o33p89n640
15980h94l610j140M963N187M886k174l509o30k576l978n067P897L642M592n081
$$ plain form
15965 2508 -9438 -7467 -3324 -1314 -6891 -5357 -5208 -3356 3395 2712 2776 -2827 -1552 -2408 -2739 4329
15949 4329 7990 3558 721 3866 5617 2129 9738 12834 8277 1579 155 -1502 -2036 -1296 1406
15934 1406 176 3312 6720 6857 6960 5519 6547 6198 9634 9460 9520 10617 3213 -103 -5712 -2214
15918 -2214 4535 8365 9504 2379 -69 -1048 2078 7887 3444 1842 4444 1064 6626 12418 17806
15903 17806 10150 989 7523 9539 3264 4794 2991 6315 8286 4617 -4538 -7382 -9846 -5813
15889 -5813 -4338 -471 -3728 -8154 -9905 -7009 -12496 -19445 -13754 -4072 -124 -5325 -7082 -9238 -747
15874 -747 24 -1054 -5725 -6045 -4491 1285 3761 -2801 -8472 -3205 1827 -7039 -9340 -5661 -3122
15859 -3122 -1475 -3628 -6839 -9718 -8030 -1393 -2254 -2899 -417 -3148 993 5078 4020 -2047 -5773
$$ packed form
15965B508j1946J971M143K010n577J534J49J852O751o83O4n603J275q56l31P068
15949D329L661m432k837L145J751l488P609L096m557o698j424j657n34P40K702
15934A406j230L136L408J37J03j441J028l49L436j74O0J097p404l316n609L498
15918b214O749L830J139p125k448r79L126N809m443j602K602l380N562N792N388
15903A7806p656r161O534K016o275J530j803L324J971l669r155k844k464M033
15889e813J475L867l257m426j751K896n487o949N691R682L948n201j757k156Q491
15874g47P71j078m671l20J554N776K476o562n671N267N032q866k301L679K539
15859c122J647k153l211k879J688O637q61o45K482k731M141M085j058o067l726
$$ plain form
15844 -5773 -1302 3945 4939 -4152 -10936 -8421 -1657 6635 4228 -1966 1641 4781 5378 2192 168
15829 168 958 6176 4756 -566 -544 -638 -1643 747 2704 -936 -502 -3912 -4797 1592 -5498 -8097 -4970
15812 -4970 -1127 2038 2466 5852 4928 8897 12584 7433 606 1585 985 268 3148 5807 172 -2289
15796 -2289 3212 -1615 -748 1321 -642 -1188 -5337 -6490 -4319 -9050 -6793 -1420 757 5324 8427
15781 8427 6555 977 3409 1263 -2428 -1857 -1758 -5166 -4376 -850 2578 -1769 -5048 -4351 -7520 -965
15765 -965 232 3981 9895 8203 6820 3370 -1752 -2031 -2274 455 -1238 369 1359 7256 5993 1067
15749 1067 -1087 -391 805 4114 1957 2686 5036 5440 -2727 -6364 -4692 -5146 -4547 548 -2623 -1429
15733 -1429 -7785 -7490 -2820 3419 6267 3787 5818 11898 8077 -885 -4418 -6856 -7579 -15094 -17010
$$ packed form
15844e773M471N247R94r091o784K515O764Q292k407o194L607L140N97l186k024
15829A68P90N218j420n322K2r4j005K390J957l640M34l410q85O389p090k599L127
15812d970L843L165M28L386r24L969L687n151o827R79o00p17K880K659n635k461
15796b289N501m827Q67K069j963n46m149j153K171m731K257N373K177M567L103
15781H427j872n578K432k146l691N71R9l408P90L526L428m347l279O97l169O555
15765i65J197L749N914j692j383l450n122k79k43K729j693J607R90N897j263m926
15749A067k154O96J196L309k157P29K350M04q167l637J672m54N99N095l171J194
15733a429o356K95M670O239K848k480K031O080l821q962l533k438p23p515j916
$$ plain form
15718 -17010 -12965 -10507 684 5799 3234 -1473 3773 7288 692 -4313 -6057 -9883 -13357 -12827
15704 -12827 -4400 -696 2632 4165 10422 9803 5791 1972 105 -766 7392 11989 13774 13406 5334
15689 5334 -636 -2973 -4268 -715 3295 9076 6858 4074 6174 2028 -11748 -13791 -8034 -7035 -6947
15674 -6947 -1585 3199 789 -5535 -3324 6896 12562 9339 3172 2481 3536 -3585 -4156 2035 30
15659 30 1670 6189 4912 836 -2549 -6598 -4361 -4543 -5803 -1860 228 -4760 -6837 -6013 -6246 -11695
15643 -11695 -9173 -9083 -407 8797 6487 7144 6844 7558 8168 6938 9401 7720 3378 9579 13788 13097
15627 13097 952 -124 5822 6087 7504 6489 3819 2188 4570 178 -1872 -5753 -2253 -3816
15613 -3816 766 1784 -247 3363 6230 8144 7319 7066 7044 10061 7659 4974 782 -8462 -4727 3031
$$ packed form
15718a7010M045K458J1191N115k565m707N246L515o596n005j744l826l474N30
15704a2827Q427L704L328J533O257o19m012l819j867q71Q158M597J785l68q072
15689E334n970k337j295L553M010N781k218k784K100m146j3776k043N757R99Q8
15674f947N362M784k410o324K211J0220N666l223o167o91J055p121n71O191k005
15659C0J640M519j277m076l385m049K237j82j260L943K088m988k077Q24k33n449
15643a1695K522R0Q676R204k310O57l00P14O10j230K463j681m342O201M209o91
15627A3097j2145j076N946K65J417j015k670j631K382m392k050l881L500j563
15613c816M582J018k031L610K867J914q25k53k2L017k402k685m192r244L735P758
$$ plain form
15597 3031 8662 15267 15253 12630 14944 17111 15265 9681 14488 18457 12684 6426 88 -867 2159
15582 2159 9080 15047 17200 13817 14161 13806 15381 18329 18880 8939 5203 4905 2942 2953 831 1243
15566 1243 -1298 4655 15678 12664 5926 3818 2978 -6409 -9361 -7932 1053 1458 801 -1481 -7530
15551 -7530 -4893 -2942 -891 1045 -89 11334 13674 7718 306 -1154 -752 5229 11204 9147 2913
15536 2913 3971 -1619 -5230 6850 13703 12916 5536 3873 -2489 3476 12060 10103 10676 15079 21327
15521 21327 17143 6449 7467 9178 15152 11021 2811 1271 5512 11115 13294 14639 9420 6500
15507 6500 7758 5921 3529 7591 6951 8096 8685 14128 15276 10935 7691 8330 14557 16619 10773
15492 10773 14193 14755 8840 12766 18917 18276 9787 2982 1276 2796 881 2704 3428 4805 6912
$$ packed form
15597C031N631O605j4k623K314K167j846n584M807L969n773o258o338r55L026
15582B159O921N967K153l383L44l55J575K948N51r941l736k98j963J1k122M12
15566A243k541N953J1023l014o738k108q40r387k952J429Q985M05o57k282o049
15551g530K637J951K051J936j134J1423K340n956p412j460M02N981N975k057o234
15536B913J058n590l611J2080O853p87p380j663o362N965Q584j957N73M403O248
15521B1327m184j0694J018J711N974m131q210j540M241N603K179J345n219k920
15507F500J258j837k392M062o40J145N89N443J148m341l244O39O227K062n846
15492A0773L420N62n915L926O151o41q489o805j706J520j915J823P24J377K107
$$ plain form
15477 6912 7719 15064 13065 9329 8098 8765 4268 1224 1451 324 3261 3607 -1912 -5440 -10666 -3540
15461 -3540 941 5081 874 -639 4948 10511 13737 10714 -69 -62 3895 2947 -2304 351 1326 1627
15445 1627 3365 3976 10794 12748 13712 9520 5989 8734 11549 5651 2118 1950 4351 5314 801 3623
15429 3623 6428 9276 12514 10515 11102 10120 8124 9793 7330 6148 -213 3265 -1267 -3697 -188
15414 -188 -2772 -5379 -5836 -27 2937 2757 798 5278 4008 1482 -1409 -5030 -262 4970 4307 7464
15398 7464 7370 3783 6393 10692 18330 24808 19753 13563 13312 9752 5048 5343 7705 2990 6380 2298
15382 2298 5524 6975 2551 5666 9731 6258 3953 -837 3816 5158 -433 950 160 -3543 -135
15367 -135 5571 7557 7840 3807 5287 12366 12826 11231 4039 3823 7381 8402 6922 7540 10161 8357
$$ packed form
15477F912Q07P345j999l736j231O67m497l044K27j127K937L46n519l528n226P126
15461c540M481M140m207j513N587N563L226l023j0783PL957r48n251K655R75L01
15445A627J738O11O818J954R64m192l531K745K815n898l533j68K401R63m513K822
15429C623K805K848L238j999N87r82j996J669k463j182o361L478m532k430L509
15414a88k584k607m57N809K964j80j959M480j270k526k891l621M768N232o63L157
15398G464r4l587K610M299P638O478n055o190k51l560m704K95K362m715L390m082
15382B298L226J451m424L115M065l473k305m790M653J342n591J383p90l703L408
15367a35N706J986K83m033J480P079M60j595p192k16L558J021j480O18K621j804
$$ plain form
15351 8357 -1352 -6847 -9234 -6494 -3838 578 2881 1176 3828 8191 -1429 -1274 6241 15124 13673
15336 13673 10387 8569 18784 16918 11451 7555 4303 6865 12655 7741 5376 748 5504 4505
15322 4505 4673 3174 3851 5808 1921 -1703 -2585 -3416 1615 2548 -20 2838 9454 10179 18700 14745
15306 14745 9320 11464 12781 2391 2170 4670 8292 9363 9964 12021 11167 6828 7191 9429 12355
15291 12355 10778 14122 17222 16287 15138 17700 15514 18406 25812 24035 21831 17790 7217 5529
15277 5529 3214 8079 15201 15825 20445 20431 16968 17097 16721 11051 4089 297 2659 3697 -756 -4683
15261 -4683 -8397 -10010 -5105 -1441 2580 3460 -2170 347 5060 8479 14455 12218 4121 3397 5782
15246 5782 2942 6132 8273 8428 6402 13620 17041 11987 4569 2111 3851 11996 20011 11857 7485
$$ packed form
15351H357r709n495k387K740K656M416K303j705K652M363r620J55P515Q883j451
15336A3673l286j818J0215j866n467l896l252K562N790m914k365m628M756r99
15322D505J68j499O77J957l887l624q82q31N031R33k568K858O616P25Q521l955
15306A4745n425K144J317j0390k21K500L622J071O01K057q54m339L63K238K926
15291A2355j577L344L100r35j149K562k186K892P406j777k204m041j0573j688
15277E529k315M865P122O24M620j4l463J29l76n670o962l792K362J038m453l927
15261d683l714j613M905L664M021Q80n630K517M713L419N976k237q097p24K385
15246E782k840L190K141J55k026P218L421n054p418k458J740Q145Q015q154m372
$$ plain form
15231 7485 3736 -2016 -4734 -5327 -723 -349 794 3253 2421 3294 5604 8650 12168 12921 16279 15445
15215 15445 11402 5105 1139 7201 151 254 6926 2208 4120 6210 5456 3101 2594 881 3465
15200 3465 968 856 9783 18790 18015 21291 25026 19498 12074 7527 2414 831 -5972 -6087 1210
15185 1210 549 7719 12643 10099 10426 10131 12270 9644 6076 7863 5230 11879 15017 8756 10722
15170 10722 11479 16052 15777 22261 28509 40259 53161 61526 69509 75496 80506 86777 89387 84468
15156 84468 74031 62649 47351 36397 32295 27658 28048 29074 27779 19780 14381 18339 10540 6367
15142 6367 5534 8094 14930 18346 19439 18889 16465 15312 16275 14683 13191 12758 11016 13917 11707 11771
15126 11771 7831 2674 -180 -6334 -7566 -5614 2712 8353 11817 15260 18120 14925 12720 17239
$$ packed form
15231G485l749n752k718n93M604L74J143K459q32Q73K310L046L518P53L358q34
15215A5445m043o297l966O062p050J03O672m718J912K090p54k355n07j713K584
15200C465k497j12Q927R007p75L276L735n528p424m547n113j583o803j15P297
15185A210o61P170M924k544L27k95K139k626l568J787k633O649L138o261J966
15170A0722P57M573k75O484O248J1750J2902Q365P983N987N010O271K610m919
15156H4468j0437j1382j5298j0954m102m637L90J026j295p999n399L958p799m173
15142F367q33K560O836L416J093n50k424j153R63j592j492m33j742K901k210O4
15126A1771l940n157k854o154j232J952Q326N641L464L443K860l195k205M519
$$ plain form
15112 17239 16612 15420 12951 8525 1887 811 4312 5889 11719 12719 13233 16436 19829 16755 14060
15097 14060 11171 11818 19618 19643 18846 18741 15181 9524 7679 3511 2019 7900 13529 10073 16936 15063
15081 15063 9097 7094 10529 23351 21733 15263 7119 9270 16645 12739 8980 10867 8834 11656
15067 11656 12141 9173 11180 12648 13857 12348 14320 7648 8924 15993 12226 7314 8242 8476 7044
15052 7044 16574 18828 11322 13318 8780 8593 14343 15359 15590 12085 12579 12140 11369 6554 3586 11478
15036 11478 19811 20838 14777 17525 21803 19563 12175 10737 8525 1952 4803 14768 14554 16267 21817
15021 21817 22626 14004 10360 14264 17899 17756 16735 12391 12867 11699 6540 3664 9068 15749 17260
15006 17260 21966 20208 17561 13415 14921 18618 12030 9828 6606 5715 9874 10773 10053 13254 9662
$$ packed form
15112A7239o27j192k469m426o638j076L501J577N830J000N14L203L393l074k695
15097A4060k889O47P800K5p97j05l560n657j845m168j492N881N629l456O863j873
15081A5063n966k003L435J2822j618o470q144K151P375l906l759J887k033K822
15067A1656M85k968K007J468J209j509J972o672J276P069l767m912R28K34j432
15052G044R530K254p506J996m538j87N750J016K31l505M94m39p71m815k968P892
15036A1478Q333J027o061K748M278k240p388j438k212o573K851R965k14J713N550
15021B1817Q09q622l644L904L635j43j021m344M76j168n159k876N404O681J511
15006A7260M706j758k647m146J506L697o588k202l222q91M159Q99p20L201l592
$$ plain form
14991 9662 2937 -1217 -2505 4314 10295 12886 11382 9866 9399 16685 18110 15193 20429 19586 17510
14976 17510 14336 13385 19489 17670 12960 12922 15349 16258 18175 14858 15241 23450 18739 17450 15954 15531
14960 15531 19849 15248 10997 12017 10381 4442 2531 119 1609 4390 8939 10210 7045 2554
14946 2554 2714 10359 11764 8002 9093 10447 11501 8460 5128 7917 13880 18447 21133 18738 14276
14931 14276 7918 8063 6122 14590 17085 16744 17132 20956 22205 23748 22202 16429 19889 24383 25836
14916 25836 27396 26637 19150 17547 14407 17349 20722 16733 18468 21011 17370 16235 16526 12058 4797
14901 4797 2134 4191 16174 24562 28321 25538 27424 25682 24832 22111 24757 25256 23286 24697 24819
14886 24819 32039 44123 44752 44826 45678 42428 39002 36903 39162 51465 71063 84279 97940 115011
$$ packed form
14991I662o725m154j288O819N981K591j504j516m67P286J425k917N236q43k076
14976A7510l174r51O104j819m710l8K427R09J917l317L83Q209m711j289j496m23
14960A5531M318m601m251J020j636n939j911k412J490K781M549J271l165m491
14946B554J60P645J405l762J091J354J054l041l332K789N963M567K686k395m462
14931A4276o358J45j941Q468K495l41L88L824J249J543j546n773L460M494J453
14916B5836J560p59p487j603l140K942L373l989J735K543l641j135K91m468p261
14901D797k663K057J1983Q388L759k783J886j742q50k721K646M99j970J411J22
14886B4819P220J2084O29P4Q52l250l426k099K259J2303J9598J3216J3661J7071
$$ plain form
14872 115011 140519 165624 194709 221556 253863 267408 266692 253088 219929 182411 154634 130706
14860 130706 103187 85850 82017 75591 69852 61834 55098 50882 43221 42868 43203 38526 30170 24008
14846 24008 26969 24078 18355 17523 16348 21755 25754 28205 28239 22550 21704 21749 23626 21501 24439 25856
14830 25856 23734 22516 17250 18237 15601 17688 18689 10644 12977 15066 11761 12026 16795 18708 22271
14815 22271 27387 26323 19171 12317 11946 16809 19992 20910 23908 23540 17749 11896 11727 8504 5596
14800 5596 6136 10190 13877 15927 13656 11361 12477 13226 8688 3133 4842 4950 11101 8246 9686
14785 9686 15276 14599 14807 13060 18203 19679 23611 22122 18511 14248 14038 11403 11021 12085 11526 14178
14769 14178 14075 8764 12729 15877 26481 27089 26311 26388 23172 15805 15064 18759 26898 28714 26379 24907
$$ packed form
14872A15011K5508K5105K9085K6847L2307J3545p16j3604l3159l7518k7777k3928
14860A30706k7519j7337l833o426n739q018o736m216p661l53L35m677q356o162
14846B4008K961k891n723q32j175N407L999K451L4n689q46M5J877k125K938J417
14830B5856k122j218n266R87k636K087J001q045K333K089l305K65M769J913L563
14815B2271N116j064p152o854l71M863L183R18K998l68n791n853j69l223k908
14800E596N40M054L687K050k271k295J116P49m538n555J709J08O151k855J440
14785I686N590o77K08j747N143J476L932j489l611m263k10k635l82J064n59K652
14769A4178j03n311L965L148J0604O08p78P7l216p367p41L695Q139J816k335j472
$$ plain form
14753 24907 24514 17322 10819 13353 12785 8857 10782 10549 6157 6265 10541 14933 17278 25607 25766 22331
14737 22331 18314 18758 17046 10119 14454 19627 19498 15612 22125 24082 20127 19453 15875 9405 12831
14722 12831 18507 19320 14370 8341 16763 16709 11421 10640 10332 13862 12494 10140 9832 13800 15574 18829
14706 18829 22714 26081 26844 22241 17070 17015 12707 4310 5826 14522 18731 25973 27614 26627 25213
14691 25213 22831 24765 22037 21288 16782 13734 14768 12029 11315 11053 7266 3497 5386 7219 12481
14676 12481 8657 12183 13232 10591 20414 20556 13453 12823 13788 14182 14964 15641 14664 12108 18338 23432
14660 23432 21076 23935 23644 23150 23445 24481 26998 28636 24678 22675 21772 24408 31416 31456 26027 18551
14644 18551 15125 17660 17838 18096 18388 15738 14185 11245 7548 9157 12633 12415 9766 5468 7686
$$ packed form
14753B4907l93p192o503K534n68l928J925k33m392J08M276M392K345Q329J59l435
14737B2331m017M44j712o927M335N173j29l886O513J957l955o74l578o470L426
14722A2831N676Q13m950o029Q422n4n288p81l08L530j368k354l08L968J774L255
14706A8829L885L367P63m603n171n5m308q397J516Q696M209P242J641r87j414
14691B5213k382J934k728p49m506l048J034k739p14k62l787l769J889J833N262
14676A2481l824L526J049k641R823J42p103o30R65L94P82O77r77k556O230N094
14660B3432k356K859k91m94K95J036K517J638l958k003r03K636P008M0n429p476
14644A8551l426K535J78K58K92k650j553k940l697J609L476k18k649m298K218
$$ plain form
14629 7686 8876 7111 13188 11176 11702 9708 9629 15281 15365 11293 13467 13958 14094 20635 19947 21453 28614
14612 28614 21475 18842 16300 20444 19539 20791 25306 26022 25687 25000 23922 21886 20688 27044 30562
14597 30562 28539 22897 18144 19447 22951 24300 27498 25737 23606 24359 18901 12970 10210 11831 15059
14582 15059 15681 11276 5098 9065 8915 13844 26294 29447 24171 16255 14837 19167 16388 9858 11810
14567 11810 16624 13298 10757 14400 17276 18277 22889 27247 33364 33221 24132 21941 26806 31024 30273
14552 30273 22304 10673 11027 18492 17465 12262 6077 10256 20251 22106 21365 28440 28260 24950 28385
14537 28385 27692 30268 25504 23033 24170 24525 16159 15589 15473 11768 14147 21428 31599 29986 30037 31229
14521 31229 29068 29314 21003 19951 22077 18112 16223 19460 19565 13542 12956 14914 14728 20231 25082
$$ packed form
14629G686J190j765O077k012N26j994p9N652Q4m072K174M91J36O541o88J506P161
14612B8614p139k633k542M144r05J252M515P16l35o87j078k036j198O356L518
14597C0562k023n642m753J303L504J349L198j761k131P53n458n931k760J621L228
14582A5059O22m405o178L967j50M929J2450L153n276p916j418M330k779o530J952
14567A1810M814l326k541L643K876J001M612M358O117j43r089k191M865M218p51
14552C0273p969j1631L54P465j027n203o185M179R995J855p41P075j80l310L435
14537B8385o93K576m764k471J137L55q366n70j16l705K379P281J0171j613N1J192
14521C1229k161K46q311j052K126l965j889L237J05o023n86J958j86N503M851
$$ plain form
14506 25082 23308 21488 27110 32533 31290 17350 8583 11194 16140 19249 23645 22565 25619 29319
14492 29319 26715 25316 30235 33859 39325 38766 32053 29456 38159 47257 51393 47456 38506 38070 44377
14477 44377 51039 59136 68613 85012 98218 114109 140439 185178 243504 321124 408950 464779
14465 464779 459743 397613 307179 229261 161964 121903 98915 87644 85206 69422 59164 45302
14453 45302 39895 45030 38579 33850 37380 37169 32741 30229 31890 40347 42548 36251 31536 29313 34412
14438 34412 33003 28613 26483 25188 26402 27624 25955 28167 30377 35320 35550 38392 29454 24686 26208
14423 26208 19820 20079 22050 32385 34620 33276 24704 22719 24456 23014 23960 19581 20212 18154 17129
14408 17129 22750 17933 19470 24070 29098 35095 31337 27173 28990 24998 28043 31787 31217 30828 32002
$$ packed form
14506B5082j774j820N622N423j243j3940q767K611M946L109M396j080L054L700
14492B9319k604j399M919L624N466n59o713k597Q703R098M136l937q950m36O307
14477D4377O662Q097R477J6399J3206J5891K6330M4739N8326P7620Q7826N5829
14465D64779n036o2130r0434p7918o7297m0061k2988j1271k438j5784j0258j3862
14453D5302n407N135o451m729L530k11m428k512J661Q457K201o297m715k223N099
14438C4412j409m390k130j295J214J222j669K212K210M943K30K842q938m768J522
14423B6208o388K59J971J0335K235j344q572j985J737j442R46m379O31k058j025
14408A7129N621m817J537M600N028N997l758m164J817l992L045L744n70l89J174
$$ plain form
14393 32002 29251 23876 23802 27754 23188 20898 21717 25915 27076 27251 26498 29790 30258 25850 19699 19387
14377 19387 15763 21342 30539 35386 31950 29787 30234 27341 29610 30590 30266 33449 37104 30230 23177
14362 23177 19409 17995 15780 14663 19595 19526 30979 36400 31350 26393 22088 20097 21828 25787 31307
14347 31307 32455 29867 27076 18994 13866 17327 23375 21992 18923 11112 7839 -937 7450 17328
14333 17328 18920 25488 35137 34759 31709 36159 35029 30851 31229 26223 30463 23946 19792 19327 25688
14318 25688 24745 25183 28944 33045 39187 37578 36188 37988 35672 30451 31350 26617 27544 31977 35974
14303 35974 36538 33224 32347 28349 24449 26053 28157 30575 31505 33729 34209 25492 21807 26112 32692
14288 32692 34510 27778 26871 27408 29508 32337 34602 32001 28277 28780 24418 25107 19261 24314 32549
$$ packed form
14393C2002k751n375p4L952m566k290Q19M198J161J75p53L292M68m408o151l12
14377A9387l624N579R197M847l436k163M47k893K269R80l24L183L655o874p053
14362B3177l768j414k215j117M932o9J1453N421n050m957m305j991J731L959N520
14347C1307J148k588k791q082n128L461O048j383l069p811l273q776Q387R878
14333A7328J592O568R649l78l050M450j130m178L78n006M240o517m154m65O361
14318B5688r43M38L761M101O142j609j390J800k316n221Q99m733R27M433L997
14303C5974N64l314q77l998l900J604K104K418R30K224M80q717l685M305O580
14288C2692J818o732r07N37K100K829K265k601l724N03m362O89n846N053Q235
$$ plain form
14273 32549 31825 29336 29184 31763 40179 31517 24587 24299 25949 23204 22975 29960 30640 26689 24702 27749
14257 27749 31086 37306 36103 32685 33277 34623 31292 26557 34489 37444 35795 39229 40694 38246 34946
14242 34946 28219 28278 29321 29429 29694 30835 32940 34418 31982 30410 32928 33571 28617 30680 30629 29964
14226 29964 27874 19603 14826 23558 38889 47532 39172 33475 33541 37109 38849 44084 50393 39148
14212 39148 33072 33955 30822 33640 30555 29981 31517 26839 26825 28289 21716 20086 28845 30925 29797
14197 29797 29309 32660 29742 30906 37812 41243 42268 38580 31175 32070 36948 39540 32342 25915 25975
14182 25975 28162 31766 37433 39023 35778 32499 31743 37668 37329 33012 31982 37773 43257 38598 33325
14167 33325 29852 31993 36211 35406 36676 33276 33859 40722 33984 28257 29393 29330 36717 40183 41949
$$ packed form
14273C2549p24k489j52K579Q416q662o930k88J650k745k29O985O80l951j987L047
14257B7749L337O220j203l418N92J346l331m735P932K955j649L434J465k448l300
14242C4946o727N9J043J08K65J141K105J478k436j572K518O43m954K063n1o65
14226B9964k090q271m777Q732J5331Q643q360n697O6L568J740N235O309j1245
14212C9148o076Q83l133K818l085n74J536m678j4J464o573j630Q759K080j128
14197B9797m88L351k918J164O906L431J025l688p405Q95M878K592p198o427O0
14182B5975K187L604N667J590l245l279p56N925l39m317j030N791N484m659n273
14167C3325l473K141M218q05J270l400N83O863o738n727J136o3P387L466J766
$$ plain form
14152 41949 48579 45906 46908 38020 30492 31132 36465 30767 22690 26142 29544 29040 30547 32345 34245
14137 34245 35967 28365 24936 30134 32350 25254 33265 40022 40839 41705 40981 43446 41573 38632 38567 42810
14121 42810 46601 46059 40535 36238 27991 24312 25707 30767 41935 40947 35679 33041 41182 44706 43478
14106 43478 41989 35965 34507 39649 45461 42444 35870 38386 42802 39967 42574 48727 50080 47575
14092 47575 44844 40301 35012 39030 41500 46591 48747 48985 44807 46300 50186 53594 56897 53654 44857
14077 44857 41894 37526 31105 36572 44823 41562 42711 47724 42605 46428 45985 45756 43863 42145 43382
14062 43382 47936 48571 48583 49457 55388 56079 52705 52864 48227 42271 43524 42213 40195 42030 43124 40314
14046 40314 37071 45221 50779 47161 46078 47794 46451 46720 50161 56580 58376 59750 59851 54114 53324
$$ packed form
14152D1949O630k673J002q888p528O40N333n698q077L452L402n04J507J798J900
14137C4245J722p602l429N198K216p096Q011O757Q17Q66p24K465j873k941o5M243
14121D2810L791n42n524m297q247l679J395N060J1168r88n268k638Q141L524j228
14106D3478j489o024j458N142N812l017o574K516M416k835K607O153J353k505
14092D7575k731m543n289M018K470N091K156K38m178J493L886L408L303l243q797
14077D4857k963m368o421N467Q251l261J149N013n119L823m43k29j893j718J237
14062D3382M554O35J2Q74N931O91l374J59m637n956J253j311k018J835J094k810
14046D0314l243Q150N558l618j083J716j343K69L441O419J796J374J01n737p90
$$ plain form
14031 53324 53978 48627 48184 50059 45794 38916 36357 33047 39508 43084 39418 37720 46173 43788 45159
14016 45159 51794 55865 54689 50252 41875 42867 50514 56886 60299 57026 51364 43697 36940 38876 45843
14001 45843 47522 47584 46262 42212 43345 45580 37151 36489 36822 40237 38867 40325 44325 42288 40172
13986 40172 40039 38683 35954 41375 45624 42795 44029 51302 53281 49021 47126 46998 48335 48060 51339
13971 51339 53476 54270 50746 49649 48966 48534 55830 52726 46413 42233 48047 48754 43956 42138 44697
13956 44697 47847 48376 54514 61292 61793 53580 50015 49696 51262 47401 51123 53958 47260 49943 55567
13941 55567 53433 45441 42711 50110 60104 62145 53079 49961 49982 51089 43811 44049 47613 57457 55497
13926 55497 50309 47680 44211 46339 57408 64745 61138 56537 57335 58587 51979 37331 39211 39021
$$ packed form
14031E3324O54n351m43J875m265o878k559l310O461L576l666j698Q453k385J371
14016D5159O635M071j176m437q377R92P647O372L413l273n662p667o757J936O967
14001D5843J679O2j322m050J133K235q429o62L33L415j370J458M000k037k116
13986D0172j33j356k729N421M249k829J234P273J979m260j895j28J337k75L279
13971E1339K137P94l524j097o83m32P296l104o313m180N814P07m798j818K559
13956D4697L150N29O138O778N01q213l565l19J566l861L722K835o698K683N624
13941E5567k134p992k730P399R994K041r066l118K1J107p278K38L564R844j960
13926E5497n188k629l469K128J1069P337l607m601P98J252o608j4648J880j90
$$ plain form
13912 39021 45483 45281 46377 56588 61430 63337 51264 42400 33704 37093 41329 42928 42218 51415
13898 51415 56971 54469 48009 46353 51124 52232 43667 38940 46160 50347 51513 53097 50169 42930
13884 42930 45170 47102 50295 62837 63315 51552 47488 42326 42108 48720 48780 41119 45083 54711 54375
13869 54375 53707 50508 48913 50279 57188 52012 46843 43588 46628 45372 46484 47824 44669 47801 55915
13854 55915 53402 49178 54624 57328 61090 60644 57201 63498 59807 57248 63311 64790 67639 69321 62949
13839 62949 55199 55659 53810 49867 45568 46249 54768 59552 54593 54402 58105 61678 63250 62934 57620
13824 57620 60281 59487 57867 63387 67370 68415 68352 63449 57733 55546 57018 58602 59028 56739 52233
13809 52233 43125 40596 44698 48654 56342 62743 68203 63332 65115 66954 69463 66690 59208 58049
$$ packed form
13912C9021O462k02J096J0211M842J907j2073q864q696L389M236J599p10R197
13898E1415N556k502o460j656M771J108q565m727P220M187J166J584k928p239
13884D2930K240J932L193J2542M78j1763m064n162k18O612O0p661L964R628l36
13869E4375o68l199j595J366O909n176n169l255L040j256J112J340l155L132Q114
13854E5915k513m224N446K704L762m46l443O297l691k559O063J479K849J682o372
13839F2949p750M60j849l943m299O81Q519M784m959j91L703L573J572l16n314
13824E7620K661p94j620N520L983J045o3m903n716k187J472J584M26k289m506
13809E2233r108k529M102L956P688O401N460m871J783J839K509k773p482j159
$$ plain form
13795 58049 53002 56144 59630 58953 60347 56125 62260 61100 52098 56674 61616 63308 65623 68055 67169
13780 67169 68729 67150 66950 64333 64269 67554 68859 64905 54564 58695 56598 63256 65297 56040 59071
13765 59071 71277 76675 76490 76322 76004 71125 65705 72714 79254 75760 70718 60426 55083 54986 53459
13750 53459 54148 60299 67348 65302 62433 62861 62640 64340 69402 75142 72849 67531 65931 67211 66920
13735 66920 60476 54421 54548 52756 45927 43597 52777 62039 66506 65259 59354 63770 66102 65448 62717
13720 62717 54034 49399 54748 60931 68230 72964 74125 74310 80719 81174 73936 64562 62528 66190 68840
13705 68840 67619 69414 72042 74133 70683 65341 56730 61755 67560 63280 62448 60508 62911 64847 66073
13690 66073 71457 76016 69519 59207 58318 61983 69573 72117 73195 68570 68826 67328 72161 80086 77317
$$ packed form
13795E8049n047L142L486o77J394m222O135j160r002M576M942J692K315K432q86
13780F7169J560j579k00k617o4L285J305l954j0341M131k097O658K041r257L031
13765E9071J2206N398j85j68l18m879n420P009O540l494n042j0292n343r7j527
13750E3459O89O151P049k046k869M28k21J700N062N740k293n318j600J280k91
13735F6920o444o055J27j792o829k330R180R262M467j247n905M416K332o54k731
13720F2717q683m635N349O183P299M734J161J85O409M55p238r374k034L662K650
13705F8840j221J795K628K091l450n342q611N025N805m280q32j940K403J936J226
13690F6073N384M559o497j0312q89L665P590K544J078m625K56j498M833P925k769
$$ plain form
13675 77317 67303 66244 64301 57148 56817 66084 73969 76188 77438 81179 82616 79019 74052 68506
13661 68506 66987 73068 75595 77122 83035 87234 86299 83109 80849 79876 79991 74916 76110 78067 79144
13646 79144 76797 80981 84211 87972 92894 94757 94652 87576 84442 88019 91846 85294 86571 88174 84042
13631 84042 78243 79873 80082 80304 78397 76880 76697 76298 74752 72461 76652 81634 83072 87331 88506
13616 88506 89324 92728 90083 86010 81053 85825 88402 81267 75740 75391 78338 81687 83103 79327 79611
13601 79611 74908 67006 64528 69231 70815 79404 87481 86221 87851 93162 97353 100471 99593 104586 100973
13586 100973 93679 86170 82599 85926 87063 89277 91032 93681 98202 111306 110704 98269 96426 101994
13572 101994 97006 89865 90206 93056 99523 102734 101979 103039 97284 90333 93406 98025 92370 84219 83949
$$ packed form
13675G7317j0014j059j943p153l31R267P885K219J250L741J437l597m967n546
13661F8506j519O081K527J527N913M199r35l190k260r73J15n075J194J957J077
13646G9144k347M184L230L761M922J863j05p076l134L577L827o552J277J603m132
13631H4042n799J630K09K22j907j517j83l99j546k291M191M982J438M259J175
13616H8506Q18L404k645m073m957M772K577p135n527l49K947L349J416l776K84
13601G9611m703p902k478M703J584Q589Q077j260J630N311M191L118q78M993l613
13586A00973p294p509l571L327J137K214J755K649M521J3104o02j2435j843N568
13572A01994m988p141L41K850O467L211p55J060n755o951L073M619n655q151k70
$$ plain form
13557 83949 89517 103826 114316 120955 119966 120330 113546 111375 116420 117575 113284 102962 101428 104210
13543 104210 102902 107270 106387 112247 125267 127689 127729 126101 124496 129929 146449 155042 164153 179964
13529 179964 190569 198428 210392 227485 239057 263614 293401 326557 374736 449247 555363
13518 555363 730559 1010279 1427426 1945681 2395097 2443113 2045463 1488016 1025801 733829
13508 733829 551312 437930 366980 313470 276725 252029 238228 220012 208274 201074 193840
13497 193840 177291 166151 164044 156401 143734 132645 124851 124330 127212 126219 126255 125928 126736 132273 132706
13482 132706 132492 134510 135535 129463 132133 136145 135044 130037 130175 133364 129895 120265 112628 113516 110088
13467 110088 109539 120217 125302 129990 133175 137200 142689 136289 124801 119306 117689 123045 126517 128764
$$ packed form
13557H3949N568J4309J0490O639r89L64o784k171N045J155m291j0322j534K782
13543A04210j308M368q83N860J3020K422M0j628j605N433J6520Q593R111J5811
13529A79964J0605P859J1964J7093J1572K4557K9787L3156M8179P4511J06116
13518E55363J75196K79720M17147N18255M49416M8016l97650n57447m62215k91972
13508G33829j82517j13382p0950n3510l6745k4696j3801j8216j1738p200p234
13497A93840j6549j1140k107p643j2667j1089p794n21K882r93L6l27Q08N537M33
13482A32706k14K018J025o072K670M012j101n007J38L189l469r630p637Q88l428
13467A10088n49J0678N085M688L185M025N489o400j1488n495j617N356L472K247
$$ plain form
13453 128764 131026 132908 146330 155860 145588 130055 121425 118462 115343 112850 115574 117608 128602
13440 128602 143131 150181 149693 145900 148723 158728 160141 156638 143658 136259 137630 136072 137255 129364
13426 129364 132369 130899 126108 123537 124505 121623 128216 127360 132442 140142 141098 146345 146641 135922 124386
13411 124386 125610 127662 126736 120754 122599 128984 127628 123747 131139 137985 147641 149374 155787 157550
13397 157550 155908 157186 154985 145793 143009 149792 154156 149230 148862 151399 143008 136615 124048 116642
13383 116642 114528 113244 112226 110419 94282 75719 69541 71029 75736 76933 81765 93481 103916
13370 103916 109592 120060 131872 139491 142788 144934 143272 144664 143916 142267 142297 145507 149624 154312
13356 154312 153806 157825 160901 162334 159893 159713 169131 179472 181400 186485 194819 192993 191172 186206
$$ packed form
13453A28764K262J882J3422R530j0272j5533q630k963l119k493K724K034J0994
13440A28602J4529P050m88l793K823J0005J413l503j2980p399J371j558J183p891
13426A29364L005j470m791k571R68k882O593q56N082P700R56N247K96j0719j1536
13411A24386J224K052r26n982J845O385j356l881P392O846R656J733O413J763
13397A57550j642J278k201r192k784O783M364m926l68K537q391o393j2567p406
13383A16642k114j284j018j807j6137j8563o178J488M707J197M832J1716J0435
13370A03916N676J0468J1812P619L297K146j662J392p48j649L0L210M117M688
13356A54312n06M019L076J433k441j80R418J0341J928N085Q334j826j821m966
$$ plain form
13342 186206 187109 187536 184671 183570 189933 196216 204547 216892 234202 242157 241280 233075 234640 240825
13328 240825 264576 291677 323486 376061 437181 450611 429919 423181 381802 321937 280141 257311
13316 257311 236805 217552 198909 185907 183809 192428 196487 194727 196451 199071 210184 217931 231467
13303 231467 245417 245516 241949 243726 249340 250618 255445 246302 223980 198916 191570 195471 201663 205746
13289 205746 211165 223008 230041 234835 233742 224220 205972 198555 202230 191834 186942 195600 218977
13276 218977 243511 266071 279711 261384 240767 224424 202730 189607 189442 207889 222768 247630
13264 247630 269761 292306 310728 331284 343309 339862 314053 286496 290620 290889 281333 277614 290827
13251 290827 309726 332223 346343 350009 358063 353382 345757 342570 324673 301972 293409 292153 292105
$$ packed form
13342A86206R03M27k865j101O363O283Q331J2345J7310P955q77q205J565O185
13328B40825K3751K7101L1809N2575O1120J3430k0692o738m1379n9865m1796k2830
13316B57311k0506j9253j8643j3002k098Q619M059j760J724K620J1113P747J3536
13303B31467J3950R9l567J777N614J278M827r143k2322k5064p346L901O192M083
13289B05746N419J1843P033M794j093r522j8248p417L675j0396m892Q658K3377
13276B18977K4534K2560J3640j8327k0617j6343k1694j3123j65J8447J4879K4862
13264B47630K2131K2545J8422K0556J2025l447k5809k7557M124K69r556l719J3213
13251B90827J8899K2497J4120L666Q054m681p625l187j7897k2701q563j256m8
$$ plain form
13238 292105 289807 288224 280358 281324 285253 291306 299193 307405 310862 315275 314503 319580 337922 360158
13224 360158 383585 412312 437185 454710 469591 475724 468770 466636 466160 464905 469712 475296 477471
13211 477471 484003 498508 514997 537713 574169 607766 635032 666020 704750 767542 870149
13200 870149 994327 1105419 1129138 1050405 845027 549787 308271 202003 174561 160161
13190 160161 161753 175105 192235 211051 230188 252239 273952 289238 297826 300890 315879 333213
13178 333213 345960 355992 362241 379128 402423 422564 442816 463392 474739 470915 465901 472467
13166 472467 488785 503573 522972 534517 544173 547699 543204 541885 537232 531418 545273 560436 567693
13153 567693 581797 603638 635776 666181 680304 692635 704041 719102 736052 746980 757358
$$ packed form
13238B92105k298j583p866R66L929O053P887Q212L457M413p72N077J8342K2236
13224C60158K3427K8727K4873J7525J4881O133o954k134m76j255M807N584K175
13211D77471O532J4505J6489K2716L6456L3597K7266L0988L8730O2792J02607
13200H70149J24178J11092K3719p8733k05378k95240k41516j06268k7442j4400
13190A60161J592J3352J7130J8816J9137K2051K1713J5286Q588L064J4989J7334
13178C33213J2747J0032O249J6887K3295K0141K0252K0576J1347l824n014O566
13166D72467J6318J4788J9399J1545R656L526m495j319m653n814J3855J5163P257
13153E67693J4104K1841L2138L0405J4123J2331J1406J5061J6950J0928J0378
$$ plain form
13142 757358 761458 769638 783903 807612 822898 840468 850828 858293 865046 873501 888161 910686
13130 910686 952489 1011938 1078504 1129221 1166683 1199725 1236335 1280930 1326549 1373508 1408016
13119 1408016 1437189 1462389 1495426 1532084 1592333 1667400 1754972 1843310 1912050 1963575 2004018
13108 2004018 2063381 2144588 2241947 2364956 2502338 2649450 2800560 2962613 3150236 3352817
13098 3352817 3548241 3758116 3992780 4266561 4590557 4986684 5436918 5940222 6510058
13089 6510058 7167264 7955114 8877122 9952489 11179588 12628346 14413256 16678347 19608514
13080 19608514 23471706 28716114 36035448 46379412 61201759 83300869 117856339
13073 117856339 173515051 256592856 357883261 446216032 458341950 383647051 273364705
$$ packed form
13142G57358M100Q180J4265K3709J5286J7570J0360P465O753Q455J4660K2525
13130I10686M1803N9449O6566N0717L7462L3042L6610M4595M5619M6959L4508
13119A408016K9173K5200L3037L6658O0249P5067Q7572Q8338O8740N1525M0443
13108B004018N9363Q1207R7359J23009J37382J47112J51110J62053J87623K02581
13098C352817J95424K09875K34664K73781L23996L96127M50234N03304N69836
13089F510058O57206P87850R22008J075367J227099J448758J784910K265091K930167
13080A9608514L863192N244408P319334J0343964J4822347K2099110L4555470
13073A17856339N5658712Q3077805J01290405Q8332771J2125918p4694899j10282346
$$ plain form
13066 273364705 177166849 118308743 84621539 63770948 49640968 39413892 31811960
13059 31811960 26044224 21640069 18225186 15510334 13311284 11547537 10145756 9010507
13051 9010507 8062324 7250697 6526925 5896702 5352745 4886441 4479437 4108961 3760944
13042 3760944 3438024 3151732 2888580 2658511 2455526 2275549 2110190 1967718 1856228
13033 1856228 1767459 1671812 1562273 1453246 1356940 1266264 1187268 1109992 1038709 977625 915557
13022 915557 844843 769520 690500 623311 583659 558308 538752 518281 501116 489444 483109 488723
13010 488723 513049 551497 575280 550258 495933 443058 395248 358217 332279 302564 289826
12999 289826 271424 248527 230530 208233 193796 187570 179224 174073 173483 178605 181411 181309 173779
$$ packed form
13066B73364705r6197856n8858106l3687204k0850591j4129980j0227076p601932
13059C1811960n767736m404155l414883k714852k199050j763747j401781j135249
13051I010507r48183q11627p23772o30223n43957m66304m07004l70476l48017
13042C760944l22920k86292k63152k30069k02985j79977j65359j42472j11490
13033A856228q8769r5647j09539j09027r6306r0676p8996p7276p1283o1084o2068
13022I15557p0714p5323p9020o7189l9652k5351j9556k0471j7165j1672o335N614
13010D88723K4326L8448K3783k5022n4325n2875m7810l7031k5938k9715j2738
12999B89826j8402k2897j7997k2297j4437o226q346n151n90N122K806j02p530
$$ plain form
12986 173779 180451 182446 177629 177057 171817 153711 131164 114460 109696 109922 108494 112422 118157 123945
12972 123945 129939 124193 110742 99043 99465 107397 116059 124696 138390 154033 160967 169309 176717
12959 176717 184505 196629 204643 210916 218975 225336 246012 272677 304028 332553 360803 393258
12947 393258 418781 429090 412949 318100 110360 -125259 -290905 -333823 -317273 -281479 -246048
12936 -246048 -227291 -211645 -194091 -183792 -163684 -138290 -120546 -113106 -122347 -125699 -126160 -132355 -132917
12923 -132917 -136960 -142766 -148076 -157456 -166247 -166395 -141834 -111725 -87715 -67673 -61868 -48344 -32078
12910 -32078 -23523 -26863 -21992 -21506 -22071 -16375 -13484 -17577 -20947 -32646 -42279 -47553 -49748 -59547 -66324
12895 -66324 -77631 -93716 -97257 -105638 -106470 -102760 -89901 -74011 -52767 -42763 -37570 -43275 -58107
$$ packed form
12986A73779O672J995m817n72n240j8106k2547j6704m764K26j428L928N735N788
12972A23945N994n746j3451j1699M22P932Q662Q637J3694J5643O934Q342P408
12959A76717P788J2124Q014O273Q059O361K0676K6665L1351K8525K8250L2455
12947C93258K5523J0309j6141r4849k07740k35619j65646m2918J6550L5794L5431
12936b46048J8757J5646J7554J0299K0108K5394J7744P440r241l352m61o195n62
12923a32917m043n806n310r380q791j48K4561L0109K4010K0042N805J3524J6266
12910c2078Q555l340M871M86n65N696K891m093l370j1699r633n274k195r799o777
12895f6324j1307j6085l541q381q32L710J2859J5890K1244J0004N193n705j4832
$$ plain form
12882 -58107 -66017 -83300 -105399 -118288 -115483 -98163 -79050 -55351 -37618 -23434 -6906 17848
12870 17848 34771 26817 527 -25754 -45837 -62441 -53348 -25767 2872 16434 24768 24885 18061
12857 18061 7022 -2688 -9102 -20564 -28543 -26487 -14462 -1218 -3934 -6602 -7687 -10684 -10643 -16104
12843 -16104 -28409 -44028 -52968 -58277 -54582 -49844 -50475 -43622 -38281 -37322 -28246 -18430 -13200 -10647
12829 -10647 -2972 7625 13191 13559 10511 358 -8929 -3466 11477 24350 25068 25569 31177 30119
12815 30119 22599 12604 -1460 -16305 -24085 -33180 -43080 -50381 -59782 -64815 -56991 -42667 -37140 -30777
12801 -30777 -29576 -27649 -26838 -33402 -33240 -27732 -28101 -31800 -26904 -25245 -25935 -22473 -23269 -17386 -12706 -4679
12785 -4679 1715 8432 6694 9881 17459 11313 9176 15998 14918 10020 4095 2328 6414 13479 24975
$$ packed form
12882e8107p910j7283k2099j2889K805J7320J9113K3699J7733J4184J6528K4754
12870A7848J6923p954k6290k6281k0083j6604R093K7581K8639J3562Q334J17o824
12857A8061j1039r710o414j1462p979K056J2025J3244k716k668j085k997M1n461
12843a6104j2305j5619q940n309L695M738o31O853N341R59R076R816N230K553
12829a0647P675J0597N566L68l048j0153r287N463J4943J2873P18N01N608j058
12815C0119p520r995j4064j4845p780r095r900p301r401n033P824J4324N527O363
12801c0777J201J927Q11o564J62N508l69l699M896J659o90L462p96N883M680Q027
12785d679O394O717j738L187P578o146k137O822j080m898n925j767M086P065J1496
$$ plain form
12770 24975 29978 40397 48325 54174 71914 85064 88423 81884 67416 59896 50049 41609 33904
12757 33904 26704 20906 13110 14159 10671 8026 8127 5295 1470 -3714 -7445 -10023 -10635 -10497 -6002
12742 -6002 -5268 -5510 -2332 6744 16612 27975 33065 36671 39521 39325 28958 20072 4947 -4867 -58
12727 -58 2545 -765 -2416 -5269 -9116 -8315 -747 1813 351 8928 7148 2833 2749 2707 3766 8859
12711 8859 13055 8241 858 -1133 752 -6545 -13549 -7164 -10908 -13236 -6118 -24 9701 13760 23863
12696 23863 34109 45941 63529 83632 107951 154523 242793 374255 544040 696063 753942
12685 753942 720854 574994 408072 259618 171281 120733 82590 65485 51570 41894 32307
12674 32307 30667 27030 14259 5301 2145 4887 5864 5500 -1765 -4780 -5665 165 5301 7343 6246
$$ packed form
12770B4975N003J0419P928N849J7740J3150L359o539j4468p520r847q440p705
12757C3904p200n798p796J049l488k645J01k832l825n184l731k578o12J38M495
12742f002P34k42L178R076R868J1363N090L606K850j96j0367q886j5125r814M809
12727e8K603l310j651k853l847Q01P568K560j462Q577j780m315q4m2J059N093
12711H859M196m814p383j991J885p297p004O385l744k328P118O094R725M059J0103
12696B3863J0246J1832J7588K0103K4319M6572Q8270J31462J69785J52023N7879
12685G53942l3088j45860j66922j48454q8337n0548l8143j7105j3915r676r587
12674C2307j640l637j2771q958l156K742R77l64p265l015q85N830N136K042j097
$$ plain form
12659 6246 4073 -631 -3849 -7915 -1 10032 17411 23760 25009 25660 30414 28676 23908 21599 21386
12644 21386 19266 28859 34065 34166 33910 36784 47416 53698 54787 48832 54449 59843 71543 84375
12630 84375 95415 115767 150885 194169 251107 324748 425338 583836 836064 1224727 1719150
12619 1719150 2204486 2365008 2037626 1476426 959415 629030 439053 325267 251328 195340
12609 195340 152304 120066 97537 84996 78299 68071 60094 55903 56938 44835 38364 44072 49963
12596 49963 42144 36121 33165 31998 26384 14348 5095 -5909 -12139 -9319 -13268 -9900 -222 1548
12582 1548 1480 6839 17158 31615 27889 24662 22844 11304 8023 15493 18846 17182 16956 15612 19135
12567 19135 28592 27314 24060 28385 28785 30457 28873 25037 18432 14068 15828 13753 11478 15390 16750
$$ packed form
12659F246k173m704l218m066P914J0033P379O349J249O51M754j738m768k309k13
12644B1386k120R593N206J01k56K874J0632O282J089n955N617N394J1700J2832
12630H4375J1040K0352L5118M3284N6938P3641J00590J58498K52228L88663M94423
12619A719150M85336J60522l27382n61200n17011l30385j89977j13786p3939n5988
12609A95340m3036l2238k2529j2541o697j0228p977m191J035j2103o471N708N891
12596D9963p819o023k956j167n614j2036r253j1004o230K820l949L368R678J770
12582A548o8N359J0319J4457l726l227j818j1540l281P470L353j664k26j344L523
12567A9135R457j278l254M325M00J672j584l836o605m364J760k075k275L912J360
$$ plain form
12552 16750 13938 7283 8545 18360 23221 22611 25484 28066 21004 16397 16748 18046 19083 20820 21938
12537 21938 21655 22669 27947 21395 13923 9966 7684 6170 9864 13693 17094 18339 19467 15871 17491
12522 17491 15003 13677 18352 26984 28492 25812 25659 22225 22140 19437 16733 13493 17924 12952 14740
12507 14740 14525 12916 6361 5181 5915 5645 11588 17273 11643 8673 14651 22983 23177 20997 16985
12492 16985 13433 7773 9675 10912 16553 17144 15783 16263 20112 18678 13718 12051 6732 7891 17381
12477 17381 25306 30989 32301 29729 23424 14202 10799 12835 14285 14413 13762 12616 22705 34305
12463 34305 34963 26543 23661 23788 25506 22400 15765 15695 16750 22859 27660 24199 17525 18785 19642 27918
12447 27918 34977 28710 26605 32117 31386 21341 18075 20362 21739 23451 18255 16117 16728 25576 28702
$$ packed form
12552A6750k812o655J262R815M861o10K873K582p062m607L51J298J037J737J118
12537B1938k83J014N278o552p472l957k282j514L694L829L401J245J128l596J620
12522A7491k488j326M675Q632J508k680j53l434q5k703k704l240M431m972J788
12507A4740k15j609o555j180P34k70N943N685n630k970N978Q332J94k180m012
12492A6985l552n660J902J237N641N91j361M80L849j434m960j667n319J159R490
12477A7381P925N683J312k572o305r222l403K036J450J28o51j146J0089J1600
12463C4305O58q420k882J27J718l106o635p0J055O109M801l461o674J260Q57Q276
12447B7918P059o267k105N512p31j0045l266K287J377J712n196k138O11Q848L126
$$ plain form
12432 28702 32390 33231 29810 25102 23044 20813 19331 17412 18632 16528 16742 20723 21126 23743 28235
12417 28235 27130 25371 27134 30598 31006 31206 31828 29846 31471 32165 34731 33185 35044 36437 30577
12402 30577 27775 29145 25360 21365 17493 17779 19859 20002 17799 23004 26477 25681 25514 27295 25072
12387 25072 16886 19808 29339 29793 21675 16589 19796 25136 30127 30185 28560 34038 33207 28664 34248
12372 34248 39389 37050 27010 21868 18110 13019 18664 26916 30228 25371 20115 24090 24306 26307
12358 26307 29376 29223 31911 31035 30776 24097 21414 26316 26907 24338 28662 32443 31703 35997 39177 36275
12342 36275 34389 31515 25788 26783 26131 28198 33867 34376 34460 34690 35354 36636 31559 28373 34054 43453
12326 43453 38722 37491 32889 30975 36371 36306 30296 29326 27799 32277 40720 44558 42795 33956 27669
$$ packed form
12432B8702L688Q41l421m708k058k231j482j919J220k104K14L981M03K617M492
12417B8235j105j759J763L464M08K00O22j982J625O94K566j546J859J393n860
12402C0577k802J370l785l995l872K86K080J43k203N205L473p96j67J781k223
12387B5072q186K922R531M54q118n086L207N340M991N8j625N478q31m543N584
12372C4248N141k339j0040n142l758n091N645Q252L312m857n256L975K16K001
12358B6307L069j53K688q76k59o679k683M902N91k569M324L781p40M294L180k902
12342C6275j886k874n727R95o52K067N669N09Q4K30O64J282n077l186N681R399
12326D3453m731j231m602j914N396o5o010r70j527M478Q443L838j763q839o287
$$ plain form
12311 27669 31317 32421 39514 37532 37974 35586 30459 29810 34154 34498 38568 40216 36549 33274 34532
12296 34532 31983 32478 42149 46460 38258 37650 36466 40545 32082 27445 37529 41795 35140 24346
12282 24346 25295 30152 36099 33501 31075 30824 34912 35108 33273 36765 46914 51146 46142 44198 46806
12267 46806 44810 43641 42590 44123 45452 48562 49392 46743 44591 50517 51194 55317 57181 60060 61492
12252 61492 52923 44870 32476 39146 42791 32755 30626 40291 46684 40161 38781 41682 42458 40620
12238 40620 41282 39832 38897 46265 39169 35130 38634 30756 36284 38271 33577 36267 41169 44687 41427
12223 41427 41030 47207 48088 46078 46102 43670 37715 39337 44204 42481 39346 39231 39928 39474 37774 35249
12207 35249 39190 34770 34510 39408 38767 33969 31580 33122 40568 41246 44519 49135 50141 45976 46403
$$ packed form
12311B7669L648J104P093j982M42k388n127o49M344L44M070J648l667l275J258
12296C4532k549M95R671M311q202o08j184M079q463m637J0084M266o655j0794
12282B4346R49M857N947k598k426k51M088J96j835L492J0149M232n004j944K608
12267D6806j996j169j051J533J329L110Q30k649k152N926O77M123J864K879J432
12252F1492q569q053j2394O670L645j0036k129R665O393o523j380K901P76j838
12238D0620O62j450r35P368p096m039L504p878N528J987m694K690M902L518l260
12223D1427l97O177Q81k010K4k432n955J622M867j723l135j15O97m54j700k525
12207C5249L941m420k60M898o41m798k389J542P446O78L273M616J006m165M27
$$ plain form
12192 46403 47012 38715 37083 40253 47496 52185 51973 50955 42967 40979 41386 28791 22287 30366 40020
12177 40020 45389 50075 48462 44713 41305 40519 40997 43354 45986 42207 40475 40472 34678 33014 36186 37057
12161 37057 40398 44778 41844 40161 44749 44170 43496 45610 47665 51749 53098 46019 43462 50783 58969
12146 58969 54942 47597 49289 46521 41396 44410 40556 34105 35567 44115 52960 62187 61661 62739 60973
12131 60973 56669 58881 58036 54637 56921 54602 49734 45295 41914 41547 45442 43172 47467 56066 59362
12116 59362 53256 50395 49678 47669 46505 45462 42072 39557 36879 40408 44485 47070 50457 52749 56301
12101 56301 54973 51782 52632 54815 54407 57437 59467 52852 51547 57962 61404 59887 56602 51104 45893
12086 45893 44714 51491 51000 44088 41463 51209 53610 52609 48207 42175 38934 45240 49392 45342 39701
$$ packed form
12192D6403O09q297j632L170P243M689k12j018p988j988M07j2595o504Q079R654
12177D0020N369M686j613l749l408p86M78K357K632l779j732ln794j664L172Q71
12161C7057L341M380k934j683M588n79o74K114K055M084J349p079k557P321Q186
12146E8969m027p345J692k768n125L014l854o451J462Q548Q845R227n26J078j766
12131F0973m304K212q45l399K284k319m868m439l381l67L895k270M295Q599L296
12116E9362o106k861p17k009j164j043l390k515k678L529M077K585L387K292L552
12101E6301j328l191Q50K183m08L030K030o615j305O415L442j517l285n498n211
12086D5893j179O777m91o912k625R746K401j001m402o032l241O306M152m050n641
$$ plain form
12071 39701 35764 37897 42921 48969 51601 47960 44888 45574 48802 45107 44291 47478 44959 45412 47722
12056 47722 46330 42270 43394 41266 48500 48922 52103 48478 49924 54537 55196 51358 44569 48752 54459
12041 54459 55350 56905 53602 50088 50040 47319 50123 50042 53819 52683 56254 53492 56933 56859 51207 48897
12025 48897 51271 58679 62679 54117 51731 56891 61206 59383 52652 48261 46908 45360 46783 50644
12011 50644 49957 47340 55330 62111 58989 47900 41756 40900 44180 55561 61342 57595 50011 54252
11997 54252 56819 59407 60536 57813 51205 53802 52281 56152 72798 80764 75802 70283 71281 74858
11983 74858 76259 69350 66651 63157 54444 52458 54227 59657 57021 49306 50743 53094 55642 53829
11969 53829 52703 49525 50614 52931 52556 56612 68062 71241 60616 56132 62574 56219 53553 58514
$$ packed form
12071C9701l937K133N024O048K632l641l072O86L228l695q16L187k519M53K310
12056D7722j392m060J124k128P234M22L181l625J446M613O59l838o789M183N707
12041E4459Q91J555l303l514m8k721K804q1L777j136L571k762L441p4n652k310
12025D8897K374P408M000q562k386N160M315j823o731m391j353j548J423L861
12011E0644o87k617P990O781l122j1089o144q56L280J1381N781l747p584M241
11997E4252K567K588J129k723o608K597j521L871J6646P966m962n519R98L577
11983G4858J401o909k699l494q713j986J769N430k636p715J437K351K548j813
11969E3829j126l178J089K317l75M056J1450L179j0625m484O442o355k666M961
$$ plain form
11955 58514 53783 52121 59926 64220 59089 57252 58071 57720 66533 70198 65148 68551 77942 87855 99165
11940 99165 96821 90321 78523 63650 52586 58337 61966 59908 54669 52123 58503 64788 62390 55136
11926 55136 47006 46766 50043 50261 51041 44090 47062 50836 54002 56390 56198 47679 47847 57847 64165
11911 64165 61049 49836 42169 44136 46887 46480 42995 43168 46974 51168 52630 55386 54461 56684 64509
11896 64509 68544 60054 50540 49560 55705 57850 51707 48304 50338 55070 50780 45430 38614 38571 41533
11881 41533 45104 38333 39942 51600 48225 42251 42589 45449 37827 33445 40609 47826 51682 56019
11867 56019 59277 57109 59660 55659 52986 56913 53444 59114 52876 48056 52735 52814 52256 47683 53595
11852 53595 58731 59437 60549 59017 55363 52159 51566 49757 46620 44588 48058 47824 50777 55083 56887
$$ packed form
11955E8514m731j662P805M294n131j837Q19l51Q813L665n050L403R391R913J1310
11940I9165k344o500j1798j4873j1064N751L629k058n239k546O380O285k398p254
11926E5136q130k40L277K18P80o951K972L774L166K388j92q519J68J0000O318
11911F4165l116j1213p667J967K751m07l485J73L806M194J462K756r25K223P825
11896F4509M035q490r514r80O145K145o143l403K034M732m290n350o816m3K962
11881D1533L571o771J609J1658l375n974L38K860p622m382P164P217L856M337
11867E6019L258k168K551m001k673L927l469N670o238m820M679P9n58m573N912
11852E3595N136P06J112j532l654l204n93j809l137k032L470k34K953M306J804
$$ plain form
11837 56887 55785 53198 52854 52746 51670 50183 50515 54161 59177 63879 59770 51077 54677 58036 62605
11822 62605 70580 66471 63912 60932 52985 52671 55187 57045 55036 56409 57448 57129 59715 61841 58200
11807 58200 51753 56245 53855 52239 57039 54306 50774 50838 50469 46145 44814 50381 59324 61220 56012
11792 56012 52812 50603 49665 52259 49174 52279 50671 48063 48303 45227 47419 48201 47348 44697 41648
11777 41648 45588 45772 43819 40871 44467 46787 50513 52106 49088 54471 52345 50698 46145 48436 51231
11762 51231 58484 55159 47555 49079 52464 53068 53375 51880 50371 46737 43962 44530 39714 30761 36447
11747 36447 43913 46158 48436 56112 61159 63373 61559 60467 55341 50691 55143 53552 48800 46762
11733 46762 44986 46777 49380 45912 42895 43365 42195 39433 42128 51795 51023 47141 45817 41233 35642
$$ packed form
11837E6887j102k587l44j08j076j487L32L646N016M702m109q693L600L359M569
11822F2605P975m109k559k980p947l14K516J858k009J373J039l19K586K126l641
11807E8200o447M492k390j616M800k733l532O4l69m324j331N567Q943J896n208
11792E6012l200k209r38K594l085L105j608k608K40l076K192P82q53k651l049
11777D1648L940J84j953k948L596K320L726J593l018N383k126j647m553K291K795
11762E1231P253l325p604J524L385O04L07j495j509l634k775N68m816q953N686
11747C6447P466K245K278P676N047K214j814j092n126m650M452j591m752k038
11733D6762j776J791K603l468l017M70j170k762K695R667p72l882j324m584n591
$$ plain form
11718 35642 38642 40787 44812 50062 48030 48308 53666 48873 46590 54353 62011 66094 65537 57390 51050
11703 51050 48972 50964 49704 44255 48604 49993 49309 51152 52961 50077 46312 46076 38124 35010 38570
11688 38570 41908 47530 48319 41961 37379 39303 39797 39606 46948 47596 46738 40106 32984 30385 32990 39458
11672 39458 44153 44115 47093 46426 48101 43654 42743 43089 47149 41704 38938 32786 33011 36821 40580 37624
11656 37624 43768 47312 51989 57603 58900 50612 47010 48371 52217 56721 55241 49821 53903 49519
11642 49519 46919 41336 41701 40556 39583 42203 39288 40107 44842 46672 48777 49619 51920 45899 43163
11627 43163 47207 51005 52453 55374 55965 52074 53483 52347 50650 52557 54912 55728 60674 60556 63707
11612 63707 62388 51869 43846 34231 35770 33546 34556 35163 34178 43990 46208 43275 43293 42629 44592
$$ packed form
11718C5642L000K145M025N250k032K78N358m793k283P763P658M083n57q147o340
11703E1050k078J992j260n449M349J389o84J843J809k884l765k36p952l114L560
11688C8570L338N622P89o358m582J924M94j91P342O48q58o632p122k599K605O468
11672C9458M695l8K978o67J675m447r11L46M060n445k766o152K25L810L759k956
11656C7624O144L544M677N614J297q288l602J361L846M504j480n420M082m384
11642D9519k600n583L65j145r73K620k915Q19M735J830K105Q42K301o021k736
11627D3163M044L798J448K921N91l891J409j136j697J907K355Q16M946j18L151
11612F3707j319j0519q023r615J539k224J010O07r85R812K218k933J8o64J963
$$ plain form
11597 44592 45261 40773 32560 26797 29558 36005 42179 46307 43634 39550 39192 40070 47382 53089 47735
11582 47735 43031 41541 41211 41040 45061 51288 48018 43799 42165 43267 36973 37118 40053 41414 39134
11567 39134 34325 35347 37959 39963 46711 54328 56858 54217 55077 51871 55956 62526 69375 67769 66312
11552 66312 67964 70019 66646 57952 55392 50525 44917 37500 35834 48228 48388 48273 49384 50698 53910
11537 53910 56612 49855 48127 47859 47893 44834 46326 46677 47876 54141 50977 51855 59850 67665 56173
11522 56173 54926 55794 57047 54286 51743 46940 45359 36899 38778 45252 50242 50420 52208 52816 46464
11507 46464 40492 37889 35643 34944 35725 36043 38602 39114 40401 42753 40462 35173 33911 30345 28181
11492 28181 28848 38042 37524 36669 40368 46785 42288 43857 41913 40212 44249 45878 40769 37543 42610
$$ packed form
11597D4592O69m488q213n763K761O447O174M128k673m084l58Q78P312N707n354
11582D7735m704j490l30j71M021O227l270m219j634J102o294J45K935J361k280
11567C9134m809J022K612K004O748P617K530k641Q60l206M085O570O849j606j457
11552F6312J652K055l373q694k560m867n608p417j666J2394J60j15J111J314L212
11537E3910K702o757j728k68L4l059J492L51J199O265l164Q78P995P815j1492
11522E6173j247Q68J253k761k543m803j581q460J879O474M990J78J788O08o352
11507D6464n972k603k246o99P81L18K559N12J287K352k291n289j262l566k164
11492B8181O67R194n18q55L699O417m497J569j944j701M037J629n109l226N067
$$ plain form
11477 42610 49308 57172 55950 55153 50807 43293 37495 36842 36449 40452 45098 48925 41004 37712 37636 39659
11461 39659 38995 31231 29787 23347 16482 18785 27212 27210 23638 28051 33897 36141 39881 38345 39404
11446 39404 39527 33739 35984 31495 37610 43077 53955 49105 41260 39997 44084 48675 53811 48154
11432 48154 40824 38492 31283 28304 35089 37359 37382 40807 41795 39474 37939 33220 35137 42506 39617
11417 39617 37288 37622 42436 44518 41348 39469 33268 31882 26581 24469 22436 23407 24440 34793 37124
11402 37124 38825 33210 31871 35308 31811 32820 39419 37803 27276 29384 30930 28565 28574 35142 42389
11387 42389 43405 44871 43046 38002 37137 35472 32293 32214 32699 31465 27571 30770 31764 30829 30443 35159
11371 35159 44067 45896 42124 31801 31824 31215 34418 34235 34372 34459 39585 31542 27133 26583 25145 28361
$$ packed form
11477D2610O698P864j222p97m346p514n798o53l93M003M646L827p921l292p6K023
11461C9659o64p764j444o440o865K303Q427kl572M413N846K244L740j536J059
11446C9404J23n788K245m489O115N467J0878m850p845j263M087M591N136n657
11432D8154p330k332p209k979O785K270K3L425R88k321j535m719J917P369k889
11417C9617k329L34M814K082l170j879o201j386n301k112k033R71J033J0353K331
11402C7124J701n615j339L437l497J009O599j616j0527K108J546k365RO568P247
11387D2389J016J466j825n044q65j665l179p9M85j234l894L199R94r35l86M716
11371C5159Q908J829l772j0323K3o09L203j83J37Q7N126q043m409n50j438L216
$$ plain form
11355 28361 33957 35916 36308 41958 40240 38585 31959 30504 36580 43944 46753 44019 41935 38841 38516
11340 38516 40243 36438 42507 42281 38651 36295 33920 32470 26797 26317 24793 28392 28796 30142 29042
11325 29042 29798 27681 30310 29051 28641 34803 32878 34458 33260 37550 44642 45105 38412 31702 28663
11310 28663 28084 27336 31754 37122 32823 36244 39223 43785 44487 45145 42735 45614 37630 33801 36093
11295 36093 40026 43166 39025 36064 35428 29037 31570 33377 36042 38381 29609 23796 24994 29163 38480
11280 38480 35349 32346 33268 34284 43057 46454 41194 30120 21089 22751 24062 28872 34449 36460
11266 36460 37145 34308 39002 42373 42022 39137 39361 39131 35391 33665 29075 26197 25191 23263 26871
11251 26871 30912 37055 33855 34802 36917 33561 28344 22251 24248 30487 30498 31411 32410 34328 38287 35372
$$ packed form
11355B8361N596J959L92N650j718j655o626j455O076P364K809k734k084l094l25
11340C8516J727l805O069k26l630k356k375j450n673m80j524L599M04J346j100
11325B9042P56k117K629j259m10O162j925J580j198M290P092M63o693o710l039
11310B8663n79p48M418N368m299L421K979M562P02O58k410K879p984l829K292
11295C6093L933L140m141k961o36o391K533J807K665K339q772n813J198M169R317
11280C8480l131l003R22J016Q773L397n260j1074r031J662J311M810N577K011
11266C6460O85k837M694L371l51k885K24k30l740j726m590k878j006j928L608
11251B6871M041O143l200R47K115l356n217o093J997O239J1R13R99J918L959k915
$$ plain form
11235 35372 28408 22791 18803 22378 25726 24845 29725 30558 28298 23072 29901 38018 37927 36941 33380 33419
11219 33419 32914 33526 32204 26776 22857 23847 33780 36252 30576 22610 22352 25042 23849 24304 25560 19252
11203 19252 15992 20468 29668 23936 20691 16775 18989 25088 27207 28999 31522 37752 27919 21369
11189 21369 21434 24671 29726 28788 24331 23151 25327 27107 31398 30344 31862 37426 32364 20340 21598
11174 21598 27512 32885 36507 36552 36502 37959 39429 36313 37557 35171 34042 39353 39459 35700 38459 41957
11158 41957 41895 33744 29940 27674 25420 24737 26384 28294 30559 35517 32486 33238 33738 29118 30565 35273
11142 35273 41221 42461 44990 44021 41024 32850 28286 25528 27029 24168 25972 26375 28918 28361 34333
11127 34333 30526 23932 21816 17696 23556 32419 28854 25307 25406 28116 33002 32690 33993 32593 28302
$$ packed form
11235C5372o964n617l988L575L348q81M880Q33k260n226O829Q117r1r86l561L9
11219C3419n05O12j322n428l919R90R933K472n676p966k58K690j193M55J256o308
11203A9252l260M476R200n732l245l916K214O099K119J792K523O230r833o550
11189B1369O5L237N055r38m457j180K176J780M291j054J518N564n062j2024J258
11174B1598N914N373L622M5n0J457J470l116J244k386j129N311J06l759K759L498
11158D1957o2q151l804k266k254o83J647J910K265M958l031P52N00m620J447M708
11142C5273N948J240K529r69k997q174m564k758J501k861J804M03K543n57N972
11127C4333l807o594k116m120N860Q863l565l547R9K710M886l12J303j400m291
$$ plain form
11112 28302 28078 24563 20044 17029 21664 20443 22920 19755 25841 33364 31561 27609 34783 33068 28219
11097 28219 28144 18910 14101 21328 24854 24690 19552 22721 23093 28219 26642 31603 35598 33062 28414
11082 28414 36334 40435 34917 29524 31080 34424 37005 31342 24893 24464 28109 30008 24251 20861 16425
11067 16425 20912 25023 27314 37463 46738 50062 45153 38474 39658 38745 36931 39024 45503 45796 49048
11052 49048 49869 52564 56971 55462 57317 59307 61868 62013 62540 68022 62540 55636 60172 66891 72018
11037 72018 82273 91237 95398 95374 87611 78768 72460 73943 78817 83790 87482 96212 102095 108957 115104
11022 115104 118800 103276 89915 79356 77381 69880 66164 63970 70927 78941 80774 86468 88834
11009 88834 72545 62756 58342 50767 47768 42996 42658 55534 64828 63966 55011 47966 41951 36788
$$ packed form
11112B8302k24l515m519l015M635j221K477l165O086P523j803l952P174j715m849
11097B8219p5r234m809P227L526j64n138L169L72N126j577M961L995k536m648
11082B8414P920M101n518n393J556L344K581n663o449m29L645J899n757l390m436
11067A6425M487M111K291J0149R275L324m909o679J184r13j814K093O479K93L252
11052D9048Q21K695M407j509J855J990K561J45N27N482n482o904M536O719N127
11037G2018J0255Q964M161k4p763q843o308J483M874M973L692Q730N883O862O147
11022A15104L696j5524j3361j0559j975p501l716k194O957Q014J833N694K366
11009H8834j6289r789m414p575k999m772l38J2876R294q62q955p045o015n163
$$ plain form
10995 36788 37530 34644 37431 25397 17772 28416 38083 36817 35939 27604 20715 26554 24968 20726
10981 20726 23040 26928 29207 31100 27890 24928 25839 29435 29541 23458 26201 32837 31467 31106 33433
10966 33433 39605 35405 30882 29198 27055 24829 26138 26998 27509 26568 27463 26294 22046 34869 42415
10951 42415 38017 34022 27454 28250 36373 40732 41968 38261 39111 36368 26152 28477 28211 35796 36605
10936 36605 34334 34554 32415 31399 29374 22408 17929 20082 33042 41261 40530 35133 29033 25333 30561
10921 30561 23027 14138 20765 31160 36000 40685 36627 30927 25493 25528 31489 37305 28649 24572 22174
10906 22174 21992 21768 32597 38985 38273 33693 28472 24865 22811 29117 32874 31583 30477 30705 32313
10891 32313 26806 24101 26579 26727 26740 25876 23622 22951 24681 34585 36920 38419 30849 27281 28262 28460
$$ packed form
10995C6788P42k886K787j2034p625J0644R667j266q78q335o889N839j586m242
10981B0726K314L888K279J893l210k962R11L596J06o083K743O636j370l61K327
10966C3433O172m200m523j684k143k226J309Q60N11r41Q95j169m248J2823P546
10951D2415m398l995o568P96Q123M359J236l707Q50k743j0216K325k66P585Q09
10936C6605k271K20k139j016k025o966m479K153J2960Q219p31n397o100l700N228
10921C0561p534q889O627J0395M840M685m058n700n434L5N961N816q656m077k398
10906B2174j82k24J0829O388p12m580n221l607k054O306L757j291j106K28J608
10891C2313n507k705K478J48J3q64k254o71J730R904K335J499p570l568R81J98
$$ plain form
10875 28460 29682 28926 30945 31242 29702 28275 31335 33589 30674 30247 34350 37745 38298 38653 38411 43174
10859 43174 40482 37714 43075 47301 45667 41372 39433 42618 34012 24654 26423 29773 34504 39927
10845 39927 39575 42447 45748 34438 24249 27948 34112 41659 40064 28102 29080 34308 32042 29274
10831 29274 33289 39926 41254 41100 45113 47812 44837 38742 35808 29097 30351 31418 35363 34488 36017
10816 36017 38628 36069 34339 39815 39347 42218 41387 44477 46492 46870 47312 41138 36235 32522 33001 41872
10800 41872 45009 49822 50648 42674 44146 46908 36099 28660 31096 39823 44913 41356 45140 46434
10786 46434 43429 46746 48883 50596 49654 49066 47969 45905 47102 47439 49471 41246 39690 43087 45783
10771 45783 47861 53709 53289 50391 48807 45189 45730 49375 50451 48445 49012 54015 59669 57866 57489
$$ packed form
10875B8460J222p56K019K97j540j427L060K254k915m27M103L395N53L55k42M763
10859D3174k692k768N361M226j634m295j939L185q606r358J769L350M731N423
10845C9927l52K872L301j1310j0189L699O164P547j595j1962R78N228k266k768
10831B9274M015O637J328j54M013K699k975o095k934o711J254J067L945q75J529
10816C6017K611k559j730N476m68K871q31L090K015L78M42o174m903l713M79Q871
10800D1872L137M813Q26p974J472K762j0809p439K436Q727N090l557L784J294
10786D6434l005L317K137J713r42n88j097k064J197L37K032q225j556L397K696
10771D5783K078N848m20k898j584l618N41L645J076k006N67N003N654j803l77
$$ plain form
10756 57489 59326 56656 55144 54578 53140 51685 58530 64949 57387 58249 62875 68343 73401 76362 78423
10741 78423 82115 78186 78193 80603 81412 80771 74903 76848 79266 77363 73200 71553 66814 59869 56502 60205
10725 60205 63104 71855 79486 79173 81233 80399 76956 72972 66667 63733 57493 52701 53640 62038 72008
10710 72008 75900 75204 72205 69960 62998 57038 49253 52402 56415 65222 65346 59313 58860 54049 57662
10695 57662 68838 81409 85887 80663 80941 78221 76101 79202 80689 74854 76628 82904 87795 94529
10681 94529 98903 99656 99742 105301 107167 107348 99134 97181 99034 102391 101778 103421 112028 117201 121734 119312
10665 119312 121233 125506 131384 140494 145598 141626 140204 135963 140168 143820 145999 157909 172117 186480
10651 186480 195201 205909 211109 208644 208785 210567 213630 223273 231319 241040 246149 259862 279182 309572
$$ packed form
10756E7489J837k670j512n66j438j455O845O419p562Q62M626N468N058K961K061
10741G8423L692l929PK410Q09o41n868J945K418j903m163j647m739o945l367L703
10725F0205K899Q751P631l13K060q34l443l984o305k934o240m792R39Q398R970
10710G2008L892o96k999k245o962n960p785L149M013Q807J24o033m53m811L613
10695E7662J1176J2571M478n224K78k720k120L101J487n835J774O276M891O734
10681I4529M374P53Q6N559J866J81q214j953J853L357o13J643Q607N173M533k422
10665A19312J921M273N878R110N104l972j422m241M205L652K179J1910J4208J4363
10651A86480Q721J0708N200k465J41J782L063R643Q046R721N109J3713J9320L0390
$$ plain form
10637 309572 332783 365575 406902 454691 495930 524786 549528 575010 613889 657654 729986
10626 729986 823321 954663 1141289 1393122 1727568 2175334 2733806 3401421 4134929 4787303
10616 4787303 5194836 5294912 5142561 4911595 4773787 4837525 5173812 5835096 6853345
10607 6853345 8191126 9656792 10882063 11425855 11122379 10238629 9251603 8537405 8278174
10598 8278174 8524949 9304133 10613669 12335159 14135555 15434977 15626748 14579629 12779966
10589 12779966 10914063 9452545 8564251 8231328 8392172 8979836 9862771 10758194 11246640
10580 11246640 10952467 9865866 8356008 6895496 5769804 5041450 4665746 4561439 4666884
10571 4666884 4883872 5081149 5084201 4783511 4194544 3443379 2691116 2058986 1578796 1234190
$$ packed form
10637C09572K3211L2792M1327M7789M1239K8856K4742K5482L8879M3765P2332
10626G29986R3335J31342J86626K51833L34446M47766N58472O67615P33508O52374
10616D787303M07533J00076j52351k30966j37808O3738L36287O61284J018249
10607F853345J337781J465666J225271N43792l03476q83750r87026p14198k59231
10598H278174K46775P79184J309536J721490J800396J299422J91771j047119j799663
10589A2779966j865903j461518q88294l32923J60844N87664Q82935Q95423M88446
10580A1246640k94173j086601j509858j460512j125692p28354l75704j04307J05445
10571D666884K16988J97277L052l00690n88967p51165p52263o32130m80190l44606
$$ plain form
10561 1234190 984782 805550 667120 562153 475655 407644 359190 320912 284275 243902
10551 243902 211897 181445 154866 134590 118711 101463 88971 77131 68904 65078 51715 50534
10539 50534 48619 42456 37125 32396 25944 22604 20754 15726 10032 6490 9945 8719 4870 -810
10525 -810 -5023 -1654 467 3141 6653 1812 -778 -993 -2112 -8225 -12603 -9070 -14207 -19671 -14785
10510 -14785 -8094 -10793 -21111 -17644 -12010 -14247 -12774 -17579 -17411 -15007 -16651 -11270 -8456 -10157
10496 -10157 -11196 -18425 -19399 -18527 -23015 -19850 -16961 -15183 -7563 -4466 -9768 -6036 -3516 -2985 -1879
10481 -1879 -2879 -2675 -3023 -3833 -8358 -11219 -19030 -26344 -20696 -8192 -15205 -19066 -11506 -7977 -10161
10466 -10161 -15271 -23057 -26287 -21731 -17158 -15788 -16937 -18921 -21700 -18309 -19661 -19506 -17555 -19809 -25452
$$ packed form
10561A234190k49408j79232j38430j04967q6498o8011m8454l8278l6637m0373
10551B43902l2005l0452k6579k0276j5879j7248j2492j1840q227l826j3363j181
10539E0534j915o163n331m729o452l340j850n028n694l542L455j226l849n680
10525h10m213L369K121K674L512m841k590k15j119o113m378L533n137n464M886
10510a4785O691k699j0318L467N634k237J473m805J68K404j644N381K814j701
10496a0157j039p229r74Q72m488L165K889J778P620L097n302L732K520N31J106
10481a879j000K04l48q10m525k861p811p314N648J2504p013l861P560L529k184
10466a0161n110p786l230M556M573J370j149j984k779L391j352J55J951k254n643
$$ plain form
10451 -25452 -24979 -22322 -15096 -12092 -18255 -14316 -11068 -8946 -4942 -1499 -2712 -611 5341 9255 7354
10436 7354 6634 8534 8861 10380 11275 16635 6865 -1732 -1573 -1097 3231 4251 7311 13294 13815 12993
10420 12993 15105 7360 4377 1171 6199 15917 21993 21437 22948 25281 33582 40110 42859 49593 55485
10405 55485 56149 58204 57341 54493 46126 46400 52582 56844 59174 57532 52351 46903 42811 45232 44631
10390 44631 35368 27909 27689 24165 24196 27667 33588 35552 33061 32986 34233 36026 33161 33247 34566 36164
10374 36164 38788 42633 42453 52030 60098 65057 62954 59084 58951 56185 53717 51036 48925 51083 51928
10359 51928 44521 40238 35090 26910 29481 29099 27874 28815 29734 25988 21841 21434 19903 15900 18857
10344 18857 17357 16019 11370 9745 8462 10396 13973 11689 10456 12769 15730 17779 19867 19152 20426
$$ packed form
10451b5452M73K657P226L004o163L939L248K122M004L443j213K101N952L914j901
10436G354p20J900L27J519Q95N360r770q597J59M76M328J020L060N983N21q22
10420A2993K112p745k983l206N028R718O076n56J511K333Q301O528K749O734N892
10405E5485O64K055q63k848q367K74O182M262K330j642n181n448m092K421o01
10390D4631r263p459k20l524L1L471N921J964k491p5J247J793k865Q6J319J598
10374C6164K624L845j80R577Q068M959k103l870j33k766k468k681k111K158Q45
10359E1928p407m283n148q180K571l82j225R41R19l746m147m07j531m003K957
10344A8857j500j338m649j625j283J934L577k284j233K313K961K049K088p15J274
$$ plain form
10329 20426 20713 22739 20596 7791 2041 -2553 3292 9039 11398 3696 -5971 -12787 -16468 -25374
10315 -25374 -20038 -18595 -23375 -17273 -8188 -500 -2273 -10159 -16262 -9104 -2979 -3252 -4632 -752 -3748
10300 -3748 235 -728 -1101 -3390 848 3393 1424 -3567 -6202 -8325 -5877 -3969 -9892 -12476 -14011
10285 -14011 -8408 -7177 -6038 -3237 -4070 -11724 -7111 -6956 -13494 -17019 -21209 -17415 -14888 -7118 -4298
10270 -4298 -7911 -8953 -9181 -12592 -6286 -6292 -11862 -19068 -24318 -20736 -21803 -18425 -20137 -23871 -24088 -17720
10254 -17720 -15070 -11193 -13641 -20178 -24701 -25988 -23891 -21525 -21231 -18175 -16651 -9521 -21 2029 -7218
10239 -7218 -13150 -13341 -12209 -13075 -8721 -8900 -10656 -12326 -13339 -18134 -17608 -20388 -21350 -20143 -21071 -18257
10223 -18257 -21351 -16734 -9554 -2157 -4492 -3364 -2343 -2365 -6786 -5113 -8869 -15089 -12148 -10862 -12824
$$ packed form
10329B0426K87K026k143j2805n750m594N845N747K359p702r667o816l681q906
10315b5374N336J443m780O102R085P688j773p886o103P158O125k73j380L880k996
10300c748L983r63l73k289M238K545j969m991k635k123K448J908n923k584j535
10285a4011N603J231J139K801q33p654M613J55o538l525m190L794K527P770K820
10270d298l613j042k28l411O306on570p206n250L582j067L378j712l734k17O368
10254a7720K650L877k448o537m523j287K097K366K94L056J524P130R500K050r247
10239g218n932j91J132q66M354j79j756j670j013m795N26k780r62J207r28K814
10223a8257l094M617P180P397k335J128J021k2m421J673l756o220K941J286j962
$$ plain form
10208 -12824 -9711 -1076 65 -5325 -6812 -5340 -10721 -9315 -4595 -681 -2702 -12392 -19554 -18858 -15489
10193 -15489 -3164 3535 2477 3173 5359 851 -3049 -1275 1739 -1964 -5830 -2740 8717 8665 7052
10178 7052 5017 10947 12304 9960 18219 21439 24028 31045 39669 49243 45675 41093 35511 35182 34464
10163 34464 30990 30549 32129 35608 39737 54589 69520 74476 74596 70787 60331 47903 38763 42012
10149 42012 39752 37037 36256 40862 46176 44852 36666 28439 21644 22562 17363 13233 18092 20202 18443
10134 18443 16008 20179 18217 15293 7145 4019 3911 -1072 -4838 -6210 -6978 -9198 -14513 -19131 -18760
10119 -18760 -25995 -16200 -8204 -6122 -4116 -7948 -18568 -27348 -22801 -15581 -17869 -19733 -18749 -17489
10105 -17489 -20481 -26404 -27940 -26232 -21359 -15414 -5182 -4702 -677 833 -732 -7 -6303 -8990 -5378
$$ packed form
10208a2824L113Q635J141n390j487J472n381J406M720L914k021r690p162O96L369
10193a5489J2325O699j058O96K186m508l900J774L014l703l866L090J1457n2j613
10178G052k035N930J357k344Q259L220K589P017Q624R574l568m582n582l29p18
10163C4464l474m41J580L479M129J4852J4931M956J20l809j0456j2428r140L249
10149D2012k260k715p81M606N314j324q186q227o795R18n199m130M859K110j759
10134A8443k435M171j962k924q148l126j08m983l766j372p68k220n315m618L71
10119a8760p235R795P996K082K006l832j0620q780M547P220k288j864R84J260
10105a7489k992n923j536J708M873N945J0232M80M025J510j565P25o296k687L612
$$ plain form
10090 -5378 -1540 -4612 -7217 -11357 -15648 -12709 -7802 -9974 -15331 -20553 -13230 -9072 -12640 -6623 -5577
10075 -5577 -6223 -8651 -9186 -8052 -11181 -14532 -21593 -17799 -14575 -9523 -1486 1105 -5042 -13618 -15046
10060 -15046 -12950 -19104 -22631 -24001 -20940 -20108 -18650 -13892 -7566 -5802 -5552 -6505 -9483 -7376 -1348
10045 -1348 -4319 -9231 -11218 -12312 -6597 -5172 -1018 -316 -1440 4008 13127 23988 37636 55280
10031 55280 84515 117677 144247 172263 174899 150853 108969 74734 47778 27829 24098 22756
10019 22756 17016 10616 7815 3189 2910 -2200 -12290 -15709 -11419 -11341 -18031 -13119 -16270 -24233 -24878
10004 -24878 -16645 -5566 38 -2494 -10805 -11754 -7209 -2767 1744 -4129 -6954 -8911 -7781 -5325
9990 -5325 -9174 -9325 -7458 -6489 218 -2399 -10204 -4847 -406 -3122 -6963 -8544 -9996 -9625 -13924 -13856
$$ packed form
10090e378L838l072k605m140m291K939M907k172n357n222P323M158l568O017J046
10075e577o46k428n35J134l129l351p061L794L224N052Q037K591o147q576j428
10060a5046K096o154l527j370L061Q32J458M758O326J764K50r53k978K107O028
10045a348k971m912j987j094N715J425M154P02j124N448R119J0861J3648J7644
10031E5280K9235L3162K6570K8016K636k4046m1884l4235k6956j9949l731j342
10019B2756n740o400k801m626k79n110j0090l419M290P8o690M912l151p963o45
10004b4878Q233J1079N604k532q311r49M545M442M511n873k825j957J130K456
9990e325l849j51J867R69O707k617p805N357M441k716l841j581j452L71m299O8
$$ plain form
9974 -13856 -6239 -9263 -9250 -12861 -14158 -14391 -5645 2134 -3633 -6057 -8152 -8420 -3897 -4860 -10569 -14454
9958 -14454 -10465 -10325 -3986 7718 11247 663 -6707 -7133 -15327 -16801 -11994 -12590 -12631 -24176 -29759
9943 -29759 -21218 -15530 -14653 -24187 -23049 -15712 -17886 -17419 -14751 -16922 -8624 -13688 -18428 -16378 -13582
9928 -13582 -12728 -7829 -9817 -13497 -10392 -13295 -9277 -7666 -13748 -10599 -12689 -12332 -10889 -10168 -6045
9913 -6045 -3750 -6541 -3824 -7710 -7630 -12063 -12422 -7891 -6933 -7280 -18457 -22002 -17127 -12087 -11283 -7384
9897 -7384 -4389 -8432 -12540 -14547 -8640 709 5832 -1130 2304 4836 2865 -3390 112 4098 5649
9882 5649 -1118 -9171 -9724 -11448 -12726 -14163 -13799 -16858 -18765 -18041 -14619 -13044 -15146 -15047 -11732 -10607
9866 -10607 -9350 -7175 -1568 1047 -7014 -12262 -11751 -7642 -11148 -13270 -13739 -14776 -12421 -3634 -428
$$ packed form
9974a3856P617l024J3l611j297k33Q746P779n767k424k095k68M523r63n709l885
9958a4454L989J40O339J1704L529j0584p370m26q194j474M807n96m1j1545n583
9943b9759Q541N688Q77r534J138P337k174M67K668k171Q298n064m740K050K796
9928a3582Q54M899j988l680L105k903M018J611o082L149k090L57J443P21M123
9913f045K295k791K717l886Q0m433l59M531R58l47j1177l545M875N040Q04L899
9897g384K995m043m108k007N907R349N123o962L434K532j971o255L502L986J551
9882E649o767q053n53j724j278j437L64l059j907P24L422J575k102R9L315J125
9866a0607J257K175N607K615q061n248N11M109l506k122m69j037K355Q787L206
$$ plain form
9851 -428 -7107 -9272 -10257 -12521 -15931 -13160 -11323 -15717 -15096 -10570 -8753 -11430 -11969 -10273 -10121 -11893
9835 -11893 -16102 -19047 -18215 -21492 -25465 -26633 -29376 -26774 -25259 -17704 -18957 -26358 -24203 -20656 -20749
9820 -20749 -22924 -17487 -19324 -22895 -23550 -22100 -11541 -19077 -28141 -24441 -12210 -8262 -11761 -14016
9806 -14016 -9502 -9049 -7687 -8185 -8998 -12889 -16483 -15061 -15496 -12739 -7843 -7439 -7250 -10023 -7849 -6617
9790 -6617 -5557 -8583 -3279 3143 -2699 -11029 -14763 -13699 -8548 -8227 -8017 -17941 -16729 -14939 -16813
9775 -16813 -20166 -13973 -9646 -7658 -4214 2510 4329 3601 -1195 -10511 -11410 -10918 -11950 -11723 -6562 -14142
9759 -14142 -15481 -7295 -7363 -12028 -18412 -26889 -26323 -24275 -17593 -9121 -7670 -8801 -10300 -9702 -12934 -10001
9743 -10001 -2382 -7930 -11928 -8118 -6121 -2316 -4339 -7468 -10731 -11526 -9429 -14996 -19492 -22285 -15251
$$ packed form
9851d28o679k165r85k264l410K771J837m394O21M526J817k677n39J696J52j772
9835a1893m209k945Q32l277l973j168k743K602J515P555j253p401K155L547r3
9820b0749k175N437j837l571o55J450J0559p536r064L700J2231L948l499k255
9806a4016M514M53J362m98q13l891l594J422m35K757M896M04J89k773K174J232
9790f617J060l026N304O422n842q330l734J064N151L21K10r924J212J790j874
9775a6813l353O193M327J988L444O724J819p28m796r316q99M92j032K27N161p580
9759a4142j339Q186o8m665o384q477N66K048O682Q472J451j131j499N98l232K933
9743a0001P619n548l998L810J997L805k023l129l263p95K097n567m496k793P034
$$ plain form
9728 -15251 -12331 -15850 -18710 -11349 -3588 2038 585 -3865 -3230 -6287 -7669 -11506 -13802 -6444 -7236
9713 -7236 -7429 -12925 -11319 -10988 -9103 -6720 -7253 -7857 -11263 -12269 -10934 -8090 -9840 -12932 -17701 -16680
9697 -16680 -12607 -15612 -12662 -13260 -18698 -12670 -8382 -7969 -14666 -20075 -18491 -12371 -5549 -4137 -9218
9682 -9218 -11424 -11821 -9443 -3251 -3672 -10650 -13138 -6124 -8518 -11440 -10033 -7792 -8805 -3799 -2681
9667 -2681 -1171 -4986 -706 -3406 -4583 -4616 -4930 -5083 -9422 -9654 -4888 -5978 -4747 136 7398 16626
9651 16626 24041 32646 52130 69636 68157 51984 35363 16910 2330 -4149 -5494 -11568 -14184
9638 -14184 -10434 -6433 -5981 -9409 -5433 -3696 -7370 -4775 -5624 -5550 -5246 -7403 -8500 -14703 -11109 -7063
9622 -7063 -13002 -15001 -16069 -8901 -9719 -14288 -16333 -12777 -8158 -6134 -6347 -7644 -8411 -7910 -6300 -6731
$$ packed form
9728a5251K920l519k860P361P761N626j453m450O35l057j382l837k296P358p92
9713g236j93n496J606L31J885K383n33o04l406j006J335K844j750l092m769J021
9697a6680M073l005K950n98n438O028M288M13o697n409J584O120O822J412n081
9682i218k206l97K378O192m21o978k488P014k394k922J407K241j013N006J118
9667b681J510l815M280k700j177l3l14j53m339k32M766j090J231M883P262R228
9651A6626P415Q605J9484J7506j479j6173j6621j8453j4580o479j345o074k616
9638a4184L750M001M52l428L976J737l674K595q49P4L04k157j097o203L594M046
9622g063n939j999j068P168q18m569k045L556M619K024k13j297p67N01J610m31
$$ plain form
9606 -6731 -6034 -5722 -10536 -12099 -5862 -5561 -9910 -10869 -11969 -15664 -15836 -10717 -4842 -6631 -13142 -15567
9590 -15567 -25821 -29867 -15598 -14257 -8121 -4739 -6242 -8873 -12383 -14535 -11882 -10378 -3531 -6989
9576 -6989 -11259 -18575 -19537 -17405 -20099 -15544 -14145 -16618 -11733 -8206 9 -1001 -3115 -187 -67
9561 -67 -5234 -5601 -3671 -5430 -572 -3709 -10539 -14928 -15796 -18714 -14216 -11958 -10225 -5133 -1318 3663
9545 3663 -2637 -12101 -10560 -4461 -7067 -7084 -5941 -6678 -2886 -2844 -9864 -12726 -10926 -3256 -2718 -1623
9529 -1623 -5125 -4087 -4244 -6140 -9650 -7595 -10416 -9783 -9962 -6819 -439 -4522 -3440 -9150 -15364 -12973
9513 -12973 -13367 -12112 -11543 -16425 -11798 -6017 -3584 1831 4366 -1780 -6782 -3424 -6473 -3245 -5922
9498 -5922 -8274 -5555 -3844 -6600 -9205 -10992 -15357 -12311 -4594 -8203 -15468 -12780 -7433 -590 2265
$$ packed form
9606f731O97L12m814j563O237L01m349r59j100l695j72N119N875j789o511k425
9590a5567j0254m046J4269J341O136L382j503k631l510k152K653J504O847l458
9576f989m270p316r62K132k694M555J399k473M885L527Q215j010k114K928J20
9561f7n167l67J930j759M858l137o830m389q68k918M498K258J733N092L815M981
9545C663o300r464J541O099k606j7J143p37L792M2p020k862J800P670N38J095
9529a623l502J038j57j896l510K055k821O33j79L143O380m083J082n710o214K391
9513a2973l94J255N69m882M627N781K433N415K535o146n002L358l049L228k677
9498e922k352K719J711k756k605j787m365L046P717l609p265K688N347O843K855
$$ plain form
9483 2265 1070 3190 -6276 -16978 -14280 -14780 -19000 -23105 -23663 -13420 -11019 -10177 -7516 -9642 -13977
9468 -13977 -11296 -2395 1455 -2959 -11161 -10401 -9562 -6902 -11069 -11897 -6230 -1799 -4454 -5847 -5481 -8982
9452 -8982 -6899 -5630 -9412 -12433 -9908 -11153 -12516 -8547 -8673 -10883 -6106 -11228 -13844 -14340 -14497 -13039
9436 -13039 -8470 -11963 -7378 -3486 -5288 -1611 -4723 -4259 -10309 -11178 -15662 -23000 -22215 -19534 -14512
9421 -14512 -21939 -28896 -23718 -20323 -18433 -20951 -12722 -9044 -12786 -13203 -13992 -16349 -12675 -7272 245
9406 245 -5043 -13209 -12722 -10400 -9252 -10767 -9938 -15380 -17917 -19750 -25455 -21740 -16594 -21206 -18968 -17453
9390 -17453 -16419 -10189 -7345 -6948 -9586 -15044 -15411 -12679 -14893 -13143 -7601 -15980 -15882 -15086 -9151 -12590
9374 -12590 -15245 -14354 -8734 -6248 -5222 -5384 -10873 -15572 -19171 -24216 -15503 -11405 -12618 -7435 -2597
$$ packed form
9483B265j195K120r466j0702K698n00m220m105n58J0243K401Q42K661k126m335
9468a3977K681Q901L850m414q202P60Q39K660m167q28N667M431k655j393L66l501
9452h982K083J269l782l021K525j245j363L969j26k210M777n122k616m96j57J458
9436a3039M569l493M585L892j802L677l112M64o050q69m484p338P85K681N022
9421a4512p427o957N178L395J890k518Q229L678l742m17p89k357L674N403P517
9406B45n288q166M87K322J148j515Q29n442k537j833n705L715N146m612K238J515
9390a7453J034O230K844L97k638n458l67K732k214J750N542q379R8P96N935l439
9374a2590k655Q91N620K486J026j62n489m699l599n045Q713M098j213N183M838
$$ plain form
9359 -2597 -7109 -10647 -15769 -14289 -7982 -4046 -7372 -13659 -15516 -11503 -5988 -7946 -11843 -11726 -19043
9344 -19043 -20442 -21718 -26133 -19234 -15260 -18926 -15715 -10418 -5823 862 1843 1932 -49 -4795 -9804
9329 -9804 -8688 -11483 -14545 -16761 -15826 -19295 -20812 -19342 -14938 -17711 -21067 -19163 -12633 -15395 -22260
9314 -22260 -12592 -10132 -12752 -4846 -3335 -1745 3324 -3642 -8807 -10470 -16243 -18572 -19485 -20516 -21955
9299 -21955 -23541 -28043 -24400 -18046 -14280 -11503 -12945 -14249 -13656 -14874 -9257 -772 3152 -2494 -11831
9284 -11831 -12427 -14572 -12587 -12496 -5599 -4140 -5485 -11192 -9916 -5712 -2939 1077 -4622 -8232 -3897
9269 -3897 -14140 -20364 -16674 -8321 -3333 1800 -229 -8516 -7626 -9349 -646 -7531 -9566 -5949 -13246
9254 -13246 -16512 -13757 -9068 -6741 -5208 -7607 -13951 -18541 -13308 -11337 -8497 -3941 -3535 -5954 -7841
$$ packed form
9359b597m512l538n122J480O307L936l326o287j857M013N515j958l897J17p317
9344a9043j399j276m415O899L974l666L211N297M595O685R81Q9j981m746n009
9329i804J116k795l062k216R35l469j517J470M404k773l356J904O530k762o865
9314b2260R668K460k620P906J511J590N069o966n165j663n773k329r13j031j439
9299b1955j586m502L643O354L766K777j442j304N93j218N617Q485L924n646r337
9284a1831n96k145J985R1O897J459j345n707J276M204K773M016n699l610M335
9269c897j0243o224L690Q353M988N133k029q287Q90j723Q703o885k035L617p297
9254a3246l266K755M689K327J533k399o344m590N233J971K840M556M06k419j887
$$ plain form
9239 -7841 -11721 -5597 2045 1038 1476 -1048 204 3058 3400 -825 -4040 -2945 -1024 1867 5111
9224 5111 -1090 -4683 -7288 -4913 -7109 -12626 -17183 -14371 -12608 -6292 -2415 -3941 -301 -1856 -6905
9209 -6905 -9731 -4648 -9029 -14558 -11606 -7729 -6506 -16637 -19114 -11114 -4310 -7178 -6742 -5769 -10595
9194 -10595 -18599 -18400 -15724 -17617 -19168 -18842 -13720 -7011 -2117 -2696 -5901 -5460 -10142 -14944 -11078 -4559
9178 -4559 -4254 -6371 -11033 -11673 -8500 -12177 -16925 -17379 -16371 -19779 -17194 -7269 -4769 -5320 -4767 -1576
9162 -1576 -2473 -4085 -4899 -11254 -14966 -20086 -18442 -14521 -14522 -15100 -16829 -9454 -9332 -13210 -11704 -11942 -9516
9145 -9516 -17021 -17340 -15697 -12416 -13517 -13172 -6169 -6098 -4972 -1370 1592 1059 -2194 -10790 -18070 -19899
9129 -19899 -16102 -12509 -14019 -11167 -8179 -5715 -6444 -6705 -15095 -11593 -10484 -14585 -20428 -17701 -9846
$$ packed form
9239g841l880O124P642j007M38k524J252K854L42m225l215J095J921K891L244
9224E111o201l593k605K375k196n517m557K812J763O316L877j526L640j555n049
9209f905k826N083m381n529K952L877J223j0131k477Q000O804k868M36R73m826
9194a0595q004J99K676j893j551L26N122O709M894n79l205M41m682m802L866O519
9178d559L05k117m662o40L173l677m748m54J008l408K585R925K500n51N53L191
9162a576q97j612q14o355l712n120J644L921jn78j729P375J22l878J506k38K426
9145i516p505l19J643L281j101L45P003P1J126L602K962n33l253q596p280j829
9129a9899L797L593j510K852K988K464p29k61q390L502J109m101n843K727P855
$$ plain form
9114 -9846 -5460 -3766 -9025 -9433 -7852 -12595 -20944 -23091 -17454 -11156 -12730 -10636 -6102 -464 146
9099 146 -1670 -5293 -6284 -4910 -8934 -8920 -6727 -5768 -7830 -8657 -5511 -1870 7735 6001 254 -5475
9083 -5475 -9318 -4557 -2811 -2975 -3263 -476 -7259 -14539 -15294 -13502 -16443 -15243 -12254 -8420 -5541 4733
9067 4733 4651 -5532 -12316 -11526 -8721 -5640 -4765 -12744 -17048 -16566 -16616 -16053 -11054 -10709 -14567 -14053 -14961
9050 -14961 -11591 -10460 -10605 -10710 -7216 -10441 -14321 -13879 -11825 -12189 -9627 -8112 -12025 -10052 -8577 -9216
9034 -9216 -5558 -3558 -9718 -9465 -9633 -6591 -4414 -5389 -7501 -7873 -5276 -6092 -10200 -16417 -17054 -10558
9018 -10558 -5137 -2342 -2475 -4532 -4298 -3849 -8095 -8593 -703 -8357 -10896 -6152 -10446 -14797 -9569 -9270
9002 -9270 -9448 -5326 -3945 -4642 -1 6580 9823 2293 -5351 -9568 -9135 -14743 -13891 -14919 -12492 -10021
$$ packed form
9114i846M386J694n259m08J581m743q349k147N637O298j574K094M534N638O10
9099A46j816l623r91J374m024J4K193R59k062q27L146L641R605j734n747n729
9083e475l843M761J746j64k88K787o783p280p55J792k941J200K989L834K879J0274
9067D733q2j0183o784P90K805L081Q75p979m304M82n0N63M999L45l858N14r08
9050a4961L370J131j45j05L494l225l880M42K054l64K562J515l913J973J475o39
9034i216L658K000o160K53j68L042K177r75k112l72K597q16m108o217o37O496
9018a0558N421K795j33k057K34M49m246m98P890p654k539M744m294m351N228K99
9002i270j78M122J381o97M641O581L243p530p644m217M33n608Q52j028K427K471
$$ plain form
8986 -10021 -768 -1562 -11328 -13626 -11224 -9185 -5209 -387 -2050 -5920 -1482 -2584 -7242 -12412 -6972
8971 -6972 -2318 -8603 -14357 -13821 -11730 412 8735 11882 12080 5280 3953 3413 -2790 -1090 -1423 -2686
8955 -2686 2720 3250 6233 5376 2388 -3241 -14554 -15504 -16688 -18060 -17962 -11291 -12731 -14954 -11695 -7755
8939 -7755 -85 -5862 -9208 -14044 -13567 -6738 -4681 -4192 -10953 -15175 -12420 -7813 -9911 -9884 -6096 -4779
8923 -4779 -4870 -4782 -4435 -8458 -12500 -5778 -505 355 -2583 -5285 2534 -2263 -9779 -9927 -9155 -9172 -5669
8906 -5669 -7822 -13938 -16792 -11266 -6221 -3393 -4712 -4446 -2635 -5632 -7593 -9674 -5461 1174 -474
8891 -474 -2870 -770 1329 -587 1110 4157 6660 6041 516 -557 -8355 -10367 -10832 -11556 -7026 -8593
8875 -8593 -4329 386 2289 -2726 -15212 -22446 -18609 -13821 -13976 -14316 -15373 -12613 -10603 -6215 -5075
$$ packed form
8986a0021R253p94r766k298K402K039L976M822j663l870M438j102m658n170N440
8971f972M654o285n754N36K091J2142Q323L147J98o800j327n40o203J700l33j263
8955b686N406N30K983q57k988n629j1313r50j184j372R8O671j440k223L259L940
8939g755P670n777l346m836M77O829K057M89o761m222K755M607k098K7L788J317
8923d779r1Q8L47m023m042O722N273Q60k938k702P819m797p516j48P72j7L503
8906e669k153o116k854N526N045K828j319K66J811k997j961k081M213O635j648
8891d74k396K100K099j916J697L047K503o19n525j073p798k012m65p24M530j567
8875h593M264M715J903n015j2486p234L837M788j55l40j057K760K010M388J140
$$ plain form
8860 -5075 -1061 -3257 -3453 -7984 -5075 -5948 -11139 -6873 -6536 -6550 -8122 -10390 -6235 -7055 -8042 349 2297
8843 2297 -2997 -1219 1424 2546 6001 1515 -1543 -4837 -958 1593 -4108 -6190 -2670 -7522 -9315
8828 -9315 -10014 -3112 -2226 -2310 -8670 -9077 -7675 -4541 -5226 -2309 356 -913 -10583 -15212 -14728 -17107 -16324
8811 -16324 -9661 -3967 559 3612 711 -120 -3428 -7490 -6443 -8025 -13625 -20343 -13429 -4238 -5108
8796 -5108 -8071 -4545 1786 -562 -5628 -11811 -10987 -12440 -12436 -16763 -14245 -10246 -7033 -11714 -6402 -520
8780 -520 -4084 -7182 -7510 -8891 -12706 -6380 4087 7086 9779 7372 6197 8648 9086 7198 6844 3127
8764 3127 2569 221 -6187 -7311 -2627 1936 5060 5532 9854 6321 2287 -3313 -5414 -2361 -2062 -2004
8748 -2004 -741 -5004 -4357 -5722 -8128 -8618 -3466 8890 17627 18833 5248 -14596 -17489 -19083 -21518
$$ packed form
8860e075M014k196j96m531K909q73n191M266L37j4j572k268M155q20r87Q391J948
8843B297n294J778K643J122L455m486l058l294L879K551n701k082L520m852j793
8828i315o99O902Q86q4o360m07J402L134o85K917K665j269r670m629M84k379P83
8811a6324O663N694M526L053k901q31l308m062J047j582n600o718O914R191q70
8796e108k963L526O331k348n066o183Q24j453Mm327K518L999L213m681N312N882
8780e20l564l098l28j381l815O326J0467K999K693k407j175K451M38j888l54l717
8764C127n58k348o408j124M684M563L124M72M322l533m034n600k101L053K99N8
8748b004J263m263O47j365k406m90N152J2356Q737J206j3585j9844k893j594k435
$$ plain form
8733 -21518 -19172 -14551 -20470 -17548 -5400 20468 26003 24230 16242 2430 -5313 -6149 -3996 -4330
8719 -4330 -14616 -12234 -7919 -10994 -14587 -14870 -12976 -11122 -5518 -3881 -5364 -7954 -1957 2101 -2595
8704 -2595 -2543 -2831 -6177 -10866 -10017 -6601 -12729 -15978 -14586 -8849 -12091 -19810 -19250 -14191 -18443 -19193
8688 -19193 -12627 -12972 -16569 -17177 -8547 -1756 -703 -2619 -5078 -8528 -8151 -2123 -4759 -9989 -11356
8673 -11356 -17019 -19173 -17888 -12706 -7821 -8433 -13816 -10739 -12466 -11712 -6256 110 2348 -7125 -8855
8658 -8855 -4343 -9339 -11284 -16671 -15772 -7864 -6204 -8867 -8975 -6575 -5770 -14300 -16324 -13469 -11615 -4391
8642 -4391 -786 -138 -3701 -4748 4692 5627 11043 12654 10936 1640 -5284 -1186 4458 1086 -2146
8627 -2146 -1327 2509 6371 3880 -1083 1219 5822 5189 2142 659 -761 854 -2458 -4881 -7182
$$ packed form
8733b1518K346M621n919K922J2148K5868N535j773p988j3812p743q36K153l34
8719d330j0286K382M315l075l593k83J894J854N604J637j483k590N997M058m696
8704b595N2k88l346m689Q49L416o128l249J392N737l242p719N60N059m252p50
8688a9193O566l45l597o08Q630O791J053j916k459l450L77O028k636n230j367
8673a1356n663k154J285N182M885o12n383L077j727P54N456O366K238r473j730
8658h855M512m996j945n387Q99P908J660k663j08K400Q05q530k024K855J854P224
8642d391L605O48l563j047R440R35N416J611j718r296o924M098N644l372l232
8627b146Q19L836L862k491m963K302M603o33l047j483j420J615l312k423k301
$$ plain form
8612 -7182 -8714 -6730 -16101 -17032 -2388 7212 12202 15850 14850 6327 5965 9594 1441 1078 -4472
8597 -4472 -4493 -2761 -4694 821 -788 -2478 -2688 -1308 -602 301 -5537 -11446 -11565 -13562 -12438 -9315
8581 -9315 -3185 1089 1489 3970 3605 -2298 4313 8388 10035 10497 6454 4913 4895 7512 5814 -26
8565 -26 -7726 -12898 -12985 -11495 -13226 -12418 -6070 -942 811 -5209 -5230 -95 548 2741 -5335 -4734 -4449
8548 -4449 -9341 -14733 -20566 -18023 -8822 -6354 -5091 -5090 -5219 -9734 -10565 -9782 -9292 -3401 -3377 -4388 -4640
8531 -4640 -2101 4768 4455 1665 -466 -1850 -5060 -9118 -4602 1559 -91 80 -3726 -7499 -5104
8516 -5104 -2827 -6500 -11065 -9652 -5676 -7934 -9270 -10180 -9686 -5521 -5974 -7862 -5882 214 -2913 -7626
8500 -7626 -3586 -3689 -8592 -4162 -768 198 -3167 445 -360 -4043 -4644 -3796 -1296 1637 5440 -1112
$$ packed form
8612g182j532J984r371r31J4644R600M990L648j000q523l62L629q153l63n550
8597d472k1J732j933N515j609j690k10J380P06R03n838n909j19j997J124L123
8581i315O130M274M00K481l65n903O611M075J647M62m043j541j8K617j698n840
8565b6p700n172q7J490j731Q08O348N128J753o020k1N135O43K193q076O01K85
8548d449m892n392n833K543R201K468J263Jj29m515q31P83M90N891K4j011k52
8531d640K539O869l13k790k131j384l210m058M516O161j650J71l806l773K395
8516e104K277l673m565J413L976k258j336r10M94M165m53j888J980O096l127m713
8500g626M040j03m903M430L394R66l365L612q05l683o01Q48K500K933L803o552
$$ plain form
8484 -1112 -6748 -5672 -10498 -15459 -14581 -8047 -4783 -6771 -2679 -113 -10644 -11911 -11405 -16582 -10791
8469 -10791 -3886 1130 4043 4027 -1284 688 187 -5069 -5537 -1318 3880 5260 7177 9281 10663 9930
8453 9930 5028 8081 12531 21151 26210 23411 26871 29641 35000 34755 29085 33663 45793 49397 47172
8438 47172 45922 47723 45671 41592 38186 32725 26514 24517 27111 27540 28218 27962 20801 17320 15633
8423 15633 9519 2619 -1510 -3872 8729 15451 10746 4282 -2340 -2801 -837 7690 8631 6862 5270
8408 5270 2696 -303 -1183 -5225 -12309 -4814 -2577 -661 4768 6557 1961 776 1065 4344 3996 8883
8392 8883 11327 3563 -2857 -1591 126 5755 8210 13992 24339 31668 26579 11113 2809 -3749
8378 -3749 -5830 -10208 -8279 -12568 -13159 -4632 -2212 -3223 -10452 -11250 -19758 -19666 -14206 -16652 -19153 -14244
$$ packed form
8484a112n636J076m826m961Q78O534L264j988M092K566j0531j267N06n177N791
8469a0791O905N016K913j6n311J972n01n256m68M219N198J380J917K104J382p33
8453I930m902L053M450Q620N059k799L460K770N359k45n670M578J2130L604k225
8438D7172j250J801k052m079l406n461o211j997K594M29O78k56p161l481j687
8423A5633o114o900m129k362J2601O722m705o464o622m61J964Q527R41j769j592
8408E270k574k999q80m042p084P495K237J916N429J789m596j185K89L279l48M887
8392H883K444p764o420J266J717N629K455N782J0347P329n089j5466q304o558
8378c749k081m378J929m289n91Q527K420j011p229p98q508R2N460k446k501M909
$$ plain form
8362 -14244 -6180 -8510 928 -1796 -1221 -3411 668 3339 2349 1291 -1594 -3505 -8528 -9147 -5289
8347 -5289 -3816 -5795 -7774 -14971 -10405 6229 25664 44107 57951 63640 53557 30784 13674
8334 13674 9609 9677 8167 1834 -2422 -635 656 -3626 -2014 -2328 -5202 -9774 -7926 -1476 2289
8319 2289 -413 -4622 -9766 -10974 -1038 1487 -5928 -7745 -6213 -7439 -9259 -9301 -8394 -14040 -16850 -10995
8303 -10995 2264 2354 -2754 -4436 351 12353 17654 19809 31971 36827 29723 19014 15763 9176
8289 9176 3875 -295 -3118 -10096 -13817 -11068 -9544 -6176 -2843 1416 3996 3127 2 -3033 -10089
8274 -10089 -10796 -4634 666 8377 6034 -1404 -7072 -5353 -6374 -3531 108 -610 2016 4962 3210
8259 3210 3343 -4154 -12154 -11218 -5208 -6758 -8615 -3782 4689 3179 -5485 -3155 -7002 -7938 -4143 -3535
$$ packed form
8362a4244Q064k330R438k724N75k190M079K671r90j058k885j911n023o19L858
8347e289J473j979j979p197M566J6634J9435J8443J3844N689j0083k2773j7110
8334A3674m065O8j510o333m256J787J291m282J612l14k874m572J848O450L765
8319B289k702m209n144j208R936K525p415j817J532j226j820m2R07n646k810N855
8303a0995J3259R0n108j682M787J2002N301K155J2162M856p104j0709l251o587
8289I176n301m170k823o978l721K749J524L368L333M259K580q69l125l035p056
8274a0089p07O162N300P711k343p438n668J719j021K843L639p18K626K946j752
8259C210J33p497q000R36O010j550j857M833Q471j510q664K330l847r36L795O08
$$ plain form
8243 -3535 -1755 -96 3983 7759 -1425 -7894 -8653 -11566 -13874 -15215 -10334 1121 -1192 -5161 -11969
8228 -11969 -14590 -14788 -10953 -7437 -8258 -5909 -2521 -6156 -12850 -13414 -13663 -9458 -6056 -7493 -8657 -600
8212 -600 -1169 -3687 -2622 -6975 -13239 -11481 -5291 1725 -2775 -10034 -11968 -4197 -1210 -2496 -130
8197 -130 516 -1142 -2694 -3863 5021 1415 -6259 -16834 -15410 -10142 -6727 -7564 -11560 -9732 -9828 -7900
8181 -7900 -2771 -3425 -933 -425 -6616 -3152 -6378 -7844 -9052 -13370 -12352 -9072 -6723 2129 1086
8166 1086 -1601 -10 -6900 -10284 -4702 -2140 -8230 -12766 -17557 -12726 2613 8437 1380 669 2186
8151 2186 -1843 -3626 -10538 -9111 -11650 -12220 -8691 -10141 -11459 -10041 -8418 -5392 -7178 -9007 -11784
8136 -11784 -14219 -7144 -5601 -8271 -8554 -9127 -7374 -10854 -9945 -8285 -6937 -4783 -5012 -2181 -2866 -4970
$$ packed form
8243c535J780J659M079L776r184o469p59k913k308j341M881J1455k313l969o808
8228a1969k621j98L835L516q21K349L388l635o694n64k49M205L402j437j164Q057
8212f00n69k518J065m353o264J758O190P016m500p259j934P771K987j286K366
8197a30O46j658j552j169Q884l606p674j0575J424N268L415q37l996J828r6J928
8181g900N129o54K492N08o191L464l226j466j208m318J018L280K349Q852j043
8166A086k687J591o890l384N582K562o090m536m791M831J5339N824p057p11J517
8151B186m029j783o912J427k539n70L529j450j318J418J623L026j786j829k777
8136a1784k435P075J543k670k83n73J753l480R09J660J348K154k29K831o85k104
$$ plain form
8120 -4970 -742 -3840 -6830 -10759 -9850 -9588 -8873 -3603 -7130 -12230 -9287 -9403 -11097 -10283 -8502 -7283
8104 -7283 -3767 -5829 -10178 -18116 -14845 -8970 -6379 -2785 1381 -831 -6238 -201 930 -3613 -6723
8089 -6723 -12009 -12143 -6393 -8339 -10901 -11613 -18457 -17409 -8751 -1414 -2202 8 644 -3259 -5080 -6552
8073 -6552 -7226 -7175 -1275 -120 -3658 -8064 -5121 -3992 -6643 -4421 -4634 -6855 -9125 -8478 -4786 -9177
8057 -9177 -9751 -3621 3548 4438 2374 -4380 -4623 -8480 -15015 -10881 -6386 -2800 -4989 -3888 1104 4763
8041 4763 3784 3715 -5039 -5245 1495 11804 13089 6897 -234 -10850 -17130 -17719 -8317 -406 -3699 -10346
8025 -10346 -7823 997 5956 3358 -2344 -3116 3162 3247 2731 4936 7194 3441 -2140 341 571 4221
8009 4221 2872 4141 3274 -2651 -3867 -4220 568 3188 3281 -6079 -6086 -5845 -5310 -7963 -11427 -13164 -9555
$$ packed form
8120d970M228l098k990l929R09K62P15N270l527n100K943j16j694Q14J781J219
8104g283L516k062m349p938L271N875K591L594M166k212n407O037J131m543l110
8089f723n286j34N750j946k562p12o844J048Q658P337p88K210O36l903j821j472
8073f552o74N1N900J155l538m406K943J129k651K222k13k221k270O47L692m391
8057i177n74O130P169Q90k064o754k43l857o535M134M495L586k189J101M992L659
8041D763r79o9q754k06O740J0309J285o192p131j0616o280n89R402P911l293o647
8025a0346K523Q820M959k598n702p72O278Q5n16K205K258l753n581K481K30L650
8009D221j349J269q67n925j216l53M788K620R3r360pK41N35k653l464j737L609
$$ plain form
7992 -9555 -6982 -6447 -7226 -6461 -7984 -13129 -7078 -5155 -4485 -602 -1225 -3426 2500 12622 6773 1705
7976 1705 4590 5996 10664 7988 -3003 -11379 -9145 -8914 -12365 -8910 -4390 -2845 -3825 -1609 1486
7961 1486 1554 90 5157 8598 3823 1067 3806 3662 8710 12774 8256 909 -1800 5139 2737 1596
7945 1596 92 72 3283 3919 3678 4295 4914 4036 2316 3015 -19 -2120 -2269 -10888 -11594 -4336 -4700 -177
7927 -177 9355 11776 4808 -4619 -1647 -361 641 4065 5258 -325 -7992 2028 8506 -1359 -7149
7912 -7149 -3600 -6349 -1041 2586 -2387 -4870 -6324 -1843 129 -811 -222 -5325 -5973 1773 8124 7094
7896 7094 5226 1333 -2342 -3714 635 -4520 -7314 -9408 -6548 -3753 -3493 -964 -5217 -7164 -9643
7881 -9643 -9442 -10240 -6431 -1574 7255 11640 9373 1854 -9572 -11564 -8737 -2294 2598 6826 5099
$$ packed form
7992i555K573N35p79P65j523n145O051J923O70L883o23k201N926J0122n849n068
7976A705K885J406M668k676j0991q376K234K31l451L455M520J545r80K216L095
7961A486O8j464N067L441m775k756K739j44N048M064m518p347k709O939k402j141
7945A596j504k0L211O36k41O17O19q78j720O99l034k101j49q619p06P258l64M523
7927a77R532K421o968r427K972J286J002L424J193n583p667J0020O478r865n790
7912g149L549k749N308L627m973k483j454M481J972r40N89n103o48P746O351j030
7896G094j868l893l675j372M349n155k794k094K860K795K60K529m253j947k479
7881i643K01p98L809M857Q829M385k267p519j1426j992K827O443M892M228j727
$$ plain form
7866 5099 3544 1952 3 -952 -914 2169 1004 -1813 -1169 -2272 -3956 -438 2591 4900 7304 881
7850 881 -8472 -10651 1359 830 -5015 -7456 -6453 -3292 3338 1070 -3908 -10736 -8854 921 -123
7835 -123 -739 -376 -4143 -8956 -10524 -11574 -10664 -6896 -10922 -16202 -13297 -6399 -2295 -1033 -4120 -1618
7819 -1618 2915 -914 -788 -3097 -4841 -3866 -179 8205 7166 623 -3259 -9768 -16555 -8242 1743
7804 1743 -777 -2876 -4857 -4303 -4771 -6506 -1957 3568 3593 5284 2769 2973 6996 4901 -3090 690
7788 690 -2918 -8654 -10039 -12383 -11069 -12086 -21763 -18363 -11433 -6108 -1898 -6368 -4182 -7978 -12293
7773 -12293 -2067 388 -2325 -5368 -6584 -7075 -6456 -9579 -11232 -6558 -5682 -9942 -6572 -1735 3508
7758 3508 7323 12761 11264 2462 -3780 -5781 -2348 -2836 -1847 -3390 -9260 -8952 -11457 -14001 -13468 -10790
$$ packed form
7866E099j555j592j949r55L8L083j165k817O44j103j684L518L029K309K404o423
7850H81r353k179J2010n29n845k441J003L161O630k268m978o828J882R775j044
7835a23o16L63l767m813j568j050R10L768m026n280K905O898M104J262l087K502
7819a618M533l829J26k309j744R75L687Q384j039o543l882o509o787Q313R985
7804A743k520k099j981N54m68j735M549N525K5J691k515K04M023k095p991L780
7788F90l608n736j385k344J314j017r677L400O930N325M210m470K186l796m315
7773a2293J0226K455k713l043j216m91O19l123j653M674Q76m260L370M837N243
7758C508L815N438j497q802o242k001L433m88R89j543n870L08k505k544N33K678
$$ plain form
7742 -10790 -7382 -3454 -5528 -7969 -10644 -11090 -7734 -8642 -7948 -2342 2481 -146 -7304 -12459 -13867
7727 -13867 -17180 -15886 -4812 -5111 -7468 -5504 -3448 789 5273 4954 2647 3383 1766 1667 3328 -1119
7711 -1119 1861 -778 -4392 -6607 -7949 -7156 -1514 -4492 -7929 -4235 666 -1181 -4259 -3180 -2083
7696 -2083 -1390 8 1462 -4143 -12898 -10116 -3730 1352 708 -6851 -8418 -11467 -14489 -15257 -11109 -7301
7680 -7301 -7985 -3915 100 6481 1394 -2646 -3058 -6546 -11425 -8805 -10050 -6790 7397 8665 8444
7665 8444 6030 -56 36 -834 5257 14999 21210 19438 5572 -7047 -9913 -14539 -8920 -2746 -9546
7650 -9546 -17086 -14595 -4320 9260 10967 14064 3964 -6739 -6287 -2823 -3974 -11004 -10357 -9435 -11371
7635 -11371 -4286 -2482 1922 2217 2136 2795 4126 -567 -762 -5072 -9967 -10279 -13222 -12675 -6788 -3227
$$ packed form
7742a0790L408L928k074k441k675m46L356r08O94N606M823k627p158n155j408
7727a3867l313J294J1074k99k357J964K056M237M484l19k307P36j617r9J661m447
7711a119K980k639l614k215j342P93N642k978l437L694M901j847l078J079J097
7696b083O93J398J454n605q755K782O386N082o44p559j567l049l022p68M148L808
7680g301o84M070M015O381n087m040m12l488m879K620j245L260J4187J268k21
7665H444k414o086R2q70O091R742O211j772j3866j2619k866m626N619O174o800
7650i546p540K491J0275J3580J707L097j0100j0703M52L464j151p030O47R22j936
7635a1371P085J804M404K95q1O59J331m693j95m310m895l12k943N47N887L561
$$ plain form
7619 -3227 -7729 -12315 -7997 -2290 -600 -303 -6425 -3838 -6066 -2852 -1203 -962 -5566 -15775 -9944
7604 -9944 2317 6067 6877 5249 3616 -2829 -2844 -7238 -1652 5097 4508 4566 7716 5747 3945 3327
7588 3327 2422 -7699 -4216 1252 -2290 -4221 1334 2732 7632 8246 6839 7148 6767 6227 -1925 -2919
7572 -2919 -7529 -7212 -8513 -7373 -12383 -18975 -15173 -12565 -3840 -4750 -3673 -2158 946 1875 -1054 -4227
7556 -4227 -3054 -3665 -4465 2580 2201 -1244 -4242 -8126 -8167 -7026 -9834 -5694 -2930 -7819 -8997 -12282
7540 -12282 -12573 -11777 -7309 -4705 -6734 -11807 -11222 -16723 -9706 -3841 -2876 -3387 -3670 -8707 -10997 -8465
7524 -8465 -5979 -4082 -632 -1696 -7955 1530 840 -4697 -9249 -10682 -11311 -6422 -5297 -11836 -11616 -13052
7508 -13052 -15459 -15050 -16275 -11587 -13406 -14609 -9171 -2801 -5990 -8119 -12364 -15140 -11264 -10282 -14976
$$ packed form
7619c227m502m586M318N707J690K97o122K587k228L214J649K41m604j0209N831
7604i944J2261L750Q10j628j633o445j5m394N586O749n89N8L150j969j802o18
7588C327r05j0121L483N468l542j931N555J398M900O14j407L09l81n40q152r94
7572b919m610L17j301J140n010o592L802K608Q725r10J077J515L104R29k929l173
7556d227J173o11q00P045l79l445k998l884m1J141k808M140K764m889j178l285
7540a2282k91P96M468K604k029n073N85n501P017N865R65n11k83n037k290K532
7524h465K486J897L450j064o259R485o90n537m552j433o29M889J125o539K20j436
7508a3052k407M09j225M688j819j203N438O370l189k129m245k776L876R82m694
$$ plain form
7493 -14976 -8281 -1879 1972 -2124 -5904 -8437 -9913 -14086 -11765 -2187 3036 4726 3260 426 1481
7478 1481 1639 3742 -853 -3477 -6174 -3747 -3214 -7518 -12568 -15583 -17426 -16644 -9514 -8104 -5708 -7572
7462 -7572 -9663 -5996 -733 4442 2561 -5286 -12533 -12953 -10452 -9165 -13727 -6352 -608 -1791 -4670
7447 -4670 52 5655 -3225 -9104 -8345 -7141 -3555 -1861 -10057 -23821 -19012 -12645 -7027 -7061 -11007
7432 -11007 -6470 -2684 -6646 -7452 -7669 -5616 -6776 -15156 -17091 -13609 -4504 -4504 -10000 -9375 -11426 -11777
7416 -11777 -2217 1033 -4803 -7692 -3754 -8605 -11139 -13393 -11155 -6050 -1304 -2885 -3576 -4071 -4274
7401 -4274 -4777 -6654 -6122 -4106 -1828 -6296 -302 4244 1224 -2653 -810 -2535 -11752 -9714 -8994 -3758
7385 -3758 3087 6260 7213 8555 6934 489 -2870 -3141 -2918 -7055 -9377 -8489 -8816 330 -559 -4625
$$ packed form
7493a4976O695O402L851m096l780k533j476m173K321R578N223J690j466k834J055
7478A481J58K103m595k624k697K427N33m304n050l015j843P82P130J410K396j864
7462g572k091L667N263N175j881p847p247m20K501J287m562P375N744j183k879
7447d670M722N603q880n879P59J204L586J694q196j3764M809O367N618l4l946
7432a1007M537L786l962q06k17K053j160q380j935L482R105%n496O25k051l51
7416a1777R560L250n836k889L938m851k534k254K238N105M746j581o91m95k03
7401d274n03j877N32K016K278m468N994M546l020l877J843j725r217K038P20N236
7385c758O845L173R53J342j621o445l359k71K23m137k322Q88l27R146q89m066
$$ plain form
7369 -4625 -2524 -4617 829 -5124 -7107 835 -444 1202 2448 -5623 -11117 -9487 -6192 -7571 -3568
7354 -3568 -2884 368 3105 -2340 -2234 3745 9603 4449 -4386 -1921 9360 11091 8335 1560 -5657
7339 -5657 -1944 1573 -1372 -8184 -4449 2681 2918 2663 -933 -4622 -2124 -3173 -4534 -1072 1920
7324 1920 5154 5549 1608 3694 -2456 -11616 -11116 -6851 -2238 3699 1347 -980 -1837 -2757 2385 4598
7308 4598 -1386 -1055 -1562 315 -646 -2596 -8390 -5521 -3266 -8135 -9424 -7107 212 6587 7454 3218
7292 3218 4665 6029 8834 14039 8485 368 3694 9128 2700 1459 3254 4508 6052 4608 4253
7277 4253 8434 2201 -5984 -7694 -4226 -7173 -3183 -2124 -8956 -9857 -6504 -944 -2735 81 5445
7262 5445 10793 10118 8559 8966 9277 3650 -3635 -6147 -5660 -4426 -7075 -15506 -16439 -14505 -4255 2759
$$ packed form
7369d625K101k093N446n953j983P942j279J646J246q071n494J630L295j379M003
7354c568O84L252K737n445J06N979N858n154q835K465J1281J731k756o775p217
7339e657L713L517k945o812L735P130K37k55l596l689K498j049j361L462K992
7324A920L234L95l941K086o150r160N00M265M613N937k352k327q57r20N142K213
7308D598n984L31n07J877r61j950n794K869K255m869j289K317P319O375Q67m236
7292C218J447J364K805N205n554q117L326N434o428j241J795J254J544j444l55
7277D253M181o233q185j710L468k947L990J059o832r01L353N560j791K816N364
7262E445N348o75j559M07L11n627p285k512M87J234k649q431r33J934J0250P014
$$ plain form
7246 2759 1224 998 2217 -2879 582 380 -645 -5537 -4369 -657 -1446 3788 4787 -7955 -16983 -13099
7230 -13099 -3597 4001 8705 3333 -1682 -2875 -1038 -3745 -9800 -5064 728 826 2888 6999 3118
7215 3118 -2367 -8400 -10804 -10178 -9919 -10090 -8088 1558 2632 2729 2771 456 -5000 -12676 -13601 -11254 -3551
7198 -3551 1643 963 -1732 -5827 -9101 -4712 -5083 -1515 -5388 -7740 -4610 -5595 -10947 -11573 -9991 -2998
7182 -2998 4538 11300 9430 2156 -10788 -15131 -10115 -5062 -4236 -2272 1062 -135 2174 1310 -9366
7167 -9366 -13010 -5472 -5964 -7717 -7380 -4973 -4873 -7374 -9298 -9407 -1260 1925 4296 -487 -6213 -6737
7151 -6737 -4350 381 -1290 -8677 -6883 -7777 -5502 -6382 -7291 -2578 1481 -1933 -4564 -489 2181 3391
7135 3391 5370 6281 6653 9021 13499 13040 11747 5770 895 -1122 -7115 -7947 -3146 866 3138 1375
$$ packed form
7246B759j535k26J219n096L461k02j025m892J168L712p89N234R99j2742r028L884
7230a3099R502P598M704n372n015j193J837k707o055M736N792R8K062M111l881
7215C118n485o033k404O26K59j71K002R646J074R7M2k315n456p676r25K347P703
7198c551N194o80k695m095l274M389l71L568l873k352L130r85n352o26J582O993
7182b998P536O762j870p274j2944m343N016N053Q26J964L334j197K309q64j0676
7167i366l644P538m92j753L37K407J00k501j924j09Q147L185K371m783n726n24
7151f737K387M731j671p387J794q94K275q80r09M713M059l414k631M075K670J210
7135C391J979R11L72K368M478m59j293n977m875k017n993q32M801M012K272j763
$$ plain form
7119 1375 110 -4266 -3042 -7681 -10232 -4464 -557 2226 534 2660 -694 4475 2631 1599 -3111
7104 -3111 -8397 -10363 -5847 -7004 -7854 -9579 -11535 -16582 -15192 -7242 -771 1001 1572 4999 13490
7089 13490 10018 6206 -354 -6528 -5315 -687 2863 8413 10718 6887 6483 2407 -1354 -7154 -5163
7074 -5163 -2379 -446 625 3756 -420 -5535 -2690 -3544 -4681 -8508 -11643 -8400 -6042 -7906 -7575
7059 -7575 -200 6046 4482 3513 5085 10435 11014 6835 -4575 -11407 -8636 -5313 -3633 -8150 -9170
7044 -9170 -4592 -2347 5246 3381 -254 -4347 3133 6777 4605 -6358 -8762 -2614 519 2962 5356
7029 5356 3958 -4105 -7767 -11177 -12050 -16496 -14680 -4228 1006 963 1412 2958 9527 6635 1831 2239
7013 2239 3050 6843 -587 -6025 -5557 -869 -146 5301 6278 -2982 -5630 -3986 -5291 -4443 -1312 2033
$$ packed form
7119A375j265m376J224m639k551N768L907K783j692K126l354N169j844j032m710
7104c111n286j966M516j157q50j725j956n047J390P950O471J772N71L427Q491
7089A3490l472l812o560o174J213M628L550N550K305l831m04m076l761n800J991
7074e163K784J933J071L131m176n115K845q54j137l827l135L243K358j864L31
7059g575P375O246j564r69J572N350N79m179j1410o832K771L323J680m517j020
7044i170M578K245P593j865l635m093P480L644k172j0963k404O148L133K443K394
7029E356j398q063l662l410q73m446J816J0452N234m3M49J546O569k892m804M08
7013B239Q11L793p430n438M68M688P23N447R77r260k648J644j305Q48L131L345
$$ plain form
6997 2033 3231 -208 -1646 -4635 -9294 -11295 -5737 -1347 -355 -3744 -17 -4971 -12172 -11937 -10721
6982 -10721 -8867 -3800 -2292 6937 15128 24252 32322 29882 22810 17860 11517 2759 2239 -1814 2029
6967 2029 2797 -481 -2123 5886 7799 -281 -7260 -4463 1012 64 -1043 4899 3503 4408 2127 -1711
6951 -1711 2266 659 -654 5361 4383 -138 -3051 -1722 1296 2949 6609 3856 -7201 -6858 -7190
6936 -7190 -11124 -16570 -18323 -13605 -8337 -11766 -12834 -4974 -2804 -1921 -454 -1982 7620 7450 3426
6921 3426 5084 1414 -4480 -6453 -2750 2381 -361 1884 7360 12575 15590 11616 6396 1507 -3948
6906 -3948 -7241 -10988 -10717 -6724 -835 433 5841 11159 3520 -195 -2961 1213 -3341 -4362 3169
6891 3169 6482 4760 3741 7967 4590 7031 9509 11981 10473 8944 3606 -6031 -5090 -1231 1776
$$ packed form
6997B033J198l439j438k989m659k001N558M390R92l389L727m954p201K35J216
6982a0721J854N067J508R229Q191R124Q070k440p072m950o343q758n20m053L843
6967B029P68l278j642Q009J913q080o979K797N475r48j107N942j396R05k281l838
6951a711L977j607j313O015r78m521k913J329L018J653L660k753j1057L43l32
6936g190l934n446j753M718N268l429j068P860K170Q83J467j528R602j70m024
6921C426J658l670n894j973L703N131k742K245N476N215L015l974n220m889n455
6906c948l293l747K71L993N889J268N408N318p639l715k766M174m554j021P531
6891C169L313j722j019M226l377K441K478K472j508j529n338r637R41L859L007
$$ plain form
6876 1776 -4 5506 5040 -1683 -1783 -1539 -2638 -5035 2043 6080 10977 10630 6902 1980 -1855 1914
6860 1914 1580 7928 10170 7857 7171 7751 3715 3323 -3713 -2911 -3890 -1166 -7291 -11448 -11535 -15613 -14486
6843 -14486 -6445 3481 5946 6433 7125 1886 2359 5650 6255 5067 -1763 -3387 -3895 901 -2127 -6419
6827 -6419 -8726 -11010 -6090 -2917 4412 8490 6065 578 -1733 -1636 736 96 152 105 1763 7484 7719
6810 7719 4757 761 1591 4046 -908 -3792 -3705 -9895 -7836 -1735 4786 4282 7641 11376 15777 18706
6794 18706 19480 13123 10121 11357 5261 3260 1756 7928 7085 613 -2536 -2864 4113 8341 4253
6779 4253 4119 2981 577 6620 11841 14803 14522 12547 14932 9165 7105 9815 9472 6990 7239 -2493
6763 -2493 -8202 -2256 -1650 -324 949 4470 11680 17498 18383 13352 4385 6289 12472 4002 3051 8281
$$ packed form
6876A776j780N510m66o723j00K44j099k397P078M037M897l47l728m922l835L769
6860A914l34O348K242k313o86N80m036l92p036Q02r79K724o125m157q7m078J127
6843a4486Q041R926K465M87O92n239M73L291O05j188o830j624n08M796l028m292
6827f419k307k284M920L173P329M078k425n487k311R7K372o40N6m7J658N721K35
6810G719k962l996Q30K455m954k884Q7o190K059O101O521n04L359L735M401K929
6794A8706P74o357l002J236o096k001j504O172q43o472l149l28O977M228m088
6779D253j34j138k404O043N221K962k81j975K385n767k060K710l43k482K49r732
6763b493n709N946O06J326J273L521P210N818Q85n031q967J904O183q470r51N230
$$ plain form
6747 8281 9820 139 -2302 2495 1059 -6617 -8825 -4756 4212 12626 17028 10375 6929 9157 11695
6732 11695 17349 15966 15894 8033 4163 -1045 -1886 3317 5800 7204 8344 8402 4066 -573 3091 2821
6716 2821 8211 15194 13864 9432 6636 10078 6678 9381 13687 18596 15847 17233 16073 13193 8992
6701 8992 12967 14455 12300 15442 14863 11657 18731 22288 14056 13224 13452 9042 10916 9292 10079 12680
6685 12680 15942 14672 17249 17639 22029 19909 14400 16003 10670 13473 13730 8367 8356 12330 9579 10498
6669 10498 9025 19065 22234 16279 13135 11870 9977 8568 12704 15564 20909 25773 26177 27276 28332
6654 28332 28478 32077 31292 23181 24245 30184 32365 32280 39294 41209 37118 32096 29167 30728 31371 40330
6638 40330 46165 50387 51439 53961 56802 56446 57241 65572 81342 96028 123220 166978 222633 281424
$$ packed form
6747H281J539r681k441M797j436p676k208M069Q968Q414M402o653l446K228K538
6732A1695N654j383p2p861l870n208q41N203K483J404J140N8m336m639L664k70
6716B821N390O983j330m432k796L442l400K703M306M909k749J386j160k880m201
6701H992L975J488k155L142n79l206P074L557q232q32K28m410J874j624P87K601
6685A2680L262j270K577L90M390k120n509J603n333K803K57n363j1L974k751R19
6669A0498j473J0040L169n955l144j265j893j409M136K860N345M864M04J099J056
6654B8332J46L599p85q111J064N939K181q5P014J915m091n022k929J561O43Q959
6638D0330N835M222J052K522K841l56P95Q331J5770J4686K7192M3758N5655N8791
$$ plain form
6624 281424 300935 272560 224119 184652 177065 189384 206155 226920 250252 284425 329286 406125
6612 406125 514197 659628 862133 1153129 1639981 2534169 4041067 6070812 8151792
6603 8151792 8200885 6309477 3862064 2135375 1324960 934671 709362 556018 433488
6594 433488 335934 263856 213454 181885 162704 138492 126139 122801 128158 151933 190459 233967
6582 233967 239770 196302 133746 82058 60379 44662 30812 31585 32299 19814 9135 5376 684
6569 684 631 486 -1153 -3401 1008 970 -1169 -12453 -15190 -10404 -3716 -6199 -13244 -8755 -4709 -55
6553 -55 1968 1487 -212 -1601 -7531 -8064 -3579 3757 10148 5505 2419 1670 -8073 -12338 -17616 -13590
6537 -13590 -10638 -13811 -22438 -23522 -13187 -10806 -6067 -1578 -392 -10437 -16018 -14735 -10802 -4717
$$ packed form
6624B81424J9511k8375m8441l9467p587J2319J6771K0765K3332L4173M4861P6839
6612D06125J08072J45431K02505K90996M86852Q94188J506898K029745K080980
6603H151792M9093j891408k447413j726689q10415l90289k25309j53344j22530
6594D33488r7554p2078n0402l1569j9181k4212j2353l338N357K3775L8526M3508
6582B33967N803m3468o2556n1688k1679j5717j3850P73P14j2485j0679l759m692
6569F84n3j45j639k248M409l8k139j1284k737M786O688k483p045M489M046M654
6553e5K023m81j699j389n930n33M485P336O391m643l086p49r743m265n278M026
6537a3590K952l173q627j084J0335K381M739M489J186j0045n581J283L933O085
$$ plain form
6523 -4717 -2828 -1681 -4998 -8021 -3939 -8758 -13554 -14668 -12268 -13695 -8392 -5344 -46 -793 -1639
6508 -1639 -1720 -5231 -8353 -13522 -14261 -11420 -8088 -1992 21 -2311 152 -254 -8591 -18049 -20447 -16486
6492 -16486 -17464 -19177 -11880 -4423 -7814 -15253 -12752 -17312 -12098 -6704 -9379 -6644 267 4166 -2303
6477 -2303 -9844 -18908 -19136 -12638 -16277 -12062 -5868 -7974 -10733 -5382 2101 -689 -888 3809 5677
6462 5677 1029 -12161 -12671 -14059 -11932 -5282 -6407 -7587 -11681 -10405 -9951 -8295 -1147 -4590 -5478
6447 -5478 -4515 -3992 -7760 -5212 -2129 -1305 27 -1570 -818 -1528 -386 752 1048 1306 -1520 -1500 -2011
6430 -2011 -4797 -1573 211 1403 -4325 -6520 -9752 -9652 -7921 -5778 2497 -4580 -15588 -23146 -20915
6415 -20915 -14780 -7603 -5774 -3522 -13341 -21921 -14769 -6283 -8721 -15145 -14681 -12197 -15093 -16333 -11676
$$ packed form
6523d717J889J147l317l023M082m819m796j114K400j427N303L048N298p47q46
6508a639q1l511l122n169p39K841L332O096K013k332K463m06q337r458k398L961
6492a6486r78j713P297P457l391p439K501m560N214N394k675K735O911L899o469
6477b303p541r064k28O498l639M215O194k106k759N351P483k790j99M697J868
6462E677m648j3190n10j388K127O650j125j180m094J276M54J656P148l443q88
6447e478R63N23l768K548L083Q24J332j597P52p10J142J138K96K58k826K0n11
6430b011k786L224J784J192n728k195l232J00J731K143Q275p077j1008p558K231
6415b0915O135P177J829K252r819q580P152Q486k438o424M64K484k896j240M657
$$ plain form
6400 -11676 -11152 -9233 -9043 -5020 -7275 -13145 -21695 -17162 -13772 -17829 -12805 -197 -2764 -3819 -3096
6385 -3096 -2928 1348 3212 -778 -1653 -4095 2162 1254 1923 2585 1050 4571 8716 6452 14395 7379
6369 7379 -3644 -7243 -6531 -2006 -5831 -4571 -4139 -4613 -4564 -4214 -5402 -9822 -8583 -13315 -12879 -5020
6353 -5020 -7389 -8834 -5699 -9716 -5776 -1716 798 -4802 -8201 -3490 -3081 -7543 -13164 -11730 -5091
6338 -5091 -3026 1660 1523 -2575 -6923 -9458 -8996 -10102 -14191 -12204 -8635 -3104 -4282 -2516 -6163
6323 -6163 -6719 -2134 -2120 -6841 -5069 -7626 -8740 -6546 -5262 -8110 -2507 1195 2710 1808 -1537 -10219
6307 -10219 -9222 -6677 -5271 -3479 743 -1265 -9136 -11961 -14983 -15474 -9755 -1417 1452 -751 -4701
6292 -4701 -7940 -3637 -696 1613 4457 1754 -1467 -2815 -5178 -5377 -1251 -3295 -5601 -6829 -9330
$$ packed form
6400a1676N24J919J90M023k255n870q550M533L390m057N024J2608k567j055P23
6385c096J68M276J864l990q75k442O257r08O69O62j535L521M145k264P943p016
6369G379j1023l599P12M525l825J260M32m74M9L50j188m420J239m732M36P859
6353e020k369j445L135m017L940M060K514n600l399M711M09m462n621J434O639
6338e091K065M686j37m098m348k535M62j106m089J987L569N531j178J766l647
6323f163n56M585J4m721J772k557j114K194J284k848N603L702J515r02l345q682
6307a0219R97K545J406J792M222k008p871k825l022m91N719Q338K869k203l950
6292d701l239M303K941K309K844k703l221j348k363j99M126k044k306j228k501
$$ plain form
6277 -9330 -4083 5648 1506 -2713 -3248 -3863 -6361 -2999 -1807 -2039 -9457 -7648 -6446 -7268 -7644 -7826
$$ packed form
6277i330N247R731m142m219n35o15k498L362J192k32p418J809J202q22l76j82
$$ [...]
##END NTUPLES=NMR SPECTRUM
##END=
