##TITLE=Analysis number 325023
Compound Code cc 62302
Book Reference 505/47
Project Code adrs
Chemist Name robb
##JCAMPDX= 6.0         $$ Bruker NMR JCAMP-DX V2.0
##DATA TYPE= NMR SPECTRUM
##DATA CLASS= NTUPLES
##ORIGIN= Bruker BioSpin GmbH
##OWNER= nmr
$$ XWIN-NMR		Version 3.5
$$ Thu Dec  7 10:01:39 2006 GMT Standard Time (UT+0h)  MAYBRIDGE\nmr@NMR_250MHZ
##.OBSERVE FREQUENCY= 250.131544655141
##.OBSERVE NUCLEUS= ^1H
##.ACQUISITION MODE= SIMULTANEOUS (DQD)
##.ACQUISITION SCHEME= undefined
##.AVERAGES= 16
##.DIGITISER RES= 18
##SPECTROMETER/DATA SYSTEM= dpx250
##.PULSE SEQUENCE= zg30
##.SOLVENT NAME= CDCl3
##.SHIFT REFERENCE= (INTERNAL, CDCl3, 0, 16.522)
##AUDIT TRAIL= $$ (NUMBER, WHEN, WHO, WHERE, WHAT)
$$ ##TITLE= Audit trail, XWIN-NMR		Version 3.5
$$ ##JCAMPDX= 5.01
$$ ##ORIGIN= Bruker BioSpin GmbH
$$ ##OWNER= nmr
$$ C:\u/data/dgb/nmr/ADRS/430/pdata/1/auditp.txt
$$ ##AUDIT TRAIL=  $$ (NUMBER, WHEN, WHO, WHERE, WHAT)
(   1,<2006-12-07 10:01:17.81 +000>,<MAYBRIDGE\nmr>,<NMR_250MHZ>,
      <created by zg, POWCHK disabled, PULCHK disabled
       configuration hash MD5:
       49 4B E0 1D 92 C2 6B 37 9F E6 65 BC 52 41 86 1D
       data hash MD5: 64K
       D6 1B 91 C0 71 C7 60 2B AE D6 28 82 98 83 9F E6>)
(   2,<2006-12-07 10:01:30.32 +000>,<MAYBRIDGE\nmr>,<NMR_250MHZ>,
      <Start of raw data processing
       ef LB = 0.3 FT_mod = 6 PKNL = 1 SI = 32K 
       data hash MD5: 32K
       9F E9 41 3E C0 B7 CE 30 D5 8A 83 D0 6D 7E 6A 68>)
(   3,<2006-12-07 10:01:32.00 +000>,<MAYBRIDGE\nmr>,<NMR_250MHZ>,
      <apk 
       data hash MD5: 32K
       53 8F B7 7F 97 19 52 4E 6C B2 45 EF C6 7A 21 3B>)
(   4,<2006-12-07 10:01:32.71 +000>,<MAYBRIDGE\nmr>,<NMR_250MHZ>,
      <abs ABSG = 5 
       data hash MD5: 32K
       03 E0 8D 97 AB 64 CD 52 08 DC EA 85 87 10 0E 8F>)
$$ ##END=
$$ 
$$ hash MD5
$$ 20 47 D3 6F 0D E3 A9 DB E7 27 47 C3 05 3E 87 5B
##$RELAX= 
##$RELAX= 
##$RELAX= 
##$RELAX= 
##$RELAX= 
##$RELAX= 
##$RELAX= 
$$ Bruker specific parameters
$$ --------------------------
##$DU= <C:\u>
##$EXPNO= 430
##$NAME= <ADRS>
##$PROCNO= 1
##$TYPE= <nmr>
##$USER= <dgb>
##$AMP= (0..31)
100 100 100 100 100 100 100 100 100 100 100 100 100 100 100 100 100 100 
100 100 100 100 100 100 100 100 100 100 100 100 100 100 
##$AQSEQ= 0
##$AQ_mod= 3
##$AUNM= <au_zg>
##$AUTOPOS= <7 >
##$BF1= 250.13
##$BF2= 250.13
##$BF3= 250.13
##$BF4= 250.13
##$BF5= 500.13
##$BF6= 500.13
##$BF7= 500.13
##$BF8= 500.13
##$BYTORDA= 1
##$CFDGTYP= 0
##$CFRGTYP= 5
##$CHEMSTR= <none>
##$CNST= (0..31)
1 1 145 1 1 1 1 1 1 1 1 1 1 1 1 1 1 1 1 1 1 1 1 1 1 1 1 1 1 1 1 1 
##$CPDPRG= <>
##$CPDPRG1= <>
##$CPDPRG2= <>
##$CPDPRG3= <>
##$CPDPRG4= <mlev>
##$CPDPRG5= <mlev>
##$CPDPRG6= <mlev>
##$CPDPRG7= <mlev>
##$CPDPRG8= <mlev>
##$CPDPRGB= <>
##$CPDPRGT= <>
##$D= (0..31)
0 1 0 0 0 0 0 0 0 0.06 0 0 0 0 0 0 0.0002 0 0 0 0 0 0 0 0 0 0 0 0 0 0 
0 
##$DATE= 1165485676
##$DBL= (0..7)
120 120 120 120 120 120 120 120 
##$DBP= (0..7)
150 150 150 150 150 150 150 150 
##$DBP07= 0
##$DBPNAM0= <>
##$DBPNAM1= <>
$$ [...]
##$SUBNAM7= <"">
##$SUBNAM8= <"">
##$SUBNAM9= <"">
##$SW= 20.6930455092707
##$SWIBOX= (0..15)
0 0 3 0 0 0 0 0 0 0 0 0 0 0 0 0 
##$SW_h= 5175.983436853
##$TD= 65536
##$TD0= 1
##$TE= 295.16
##$TE2= 300
##$TE3= 300
##$TEG= 300
##$TL= (0..7)
0 120 120 120 120 120 120 120 
##$TP= (0..7)
150 150 150 150 150 150 150 150 
##$TP07= 0
##$TPNAME0= <>
##$TPNAME1= <>
##$TPNAME2= <>
##$TPNAME3= <>
##$TPNAME4= <>
##$TPNAME5= <>
##$TPNAME6= <>
##$TPNAME7= <>
##$TPOAL= (0..7)
0.5 0.5 0.5 0.5 0.5 0.5 0.5 0.5 
##$TPOFFS= (0..7)
0 0 0 0 0 0 0 0 
##$TUNHIN= 0
##$TUNHOUT= 0
##$TUNXOUT= 0
##$USERA1= <user>
##$USERA2= <user>
##$USERA3= <user>
##$USERA4= <user>
##$USERA5= <user>
##$V9= 5
##$VALIST= <valist>
##$VCLIST= <CCCCCCCCCCCCCCC>
##$VD= 0
##$VDLIST= <DDDDDDDDDDDDDDD>
##$VPLIST= <PPPPPPPPPPPPPPP>
##$VTLIST= <TTTTTTTTTTTTTTT>
##$WBST= 1024
##$WBSW= 4
##$XGAIN= (0..3)
0 0 0 0 
##$XL= 0
##$YL= 0
##$YMAX_a= 468071
##$YMIN_a= -494696
##$ZGOPTNS= <>
##$ZL1= 120
##$ZL2= 120
##$ZL3= 120
##$ZL4= 120
##$ABSF1= 16.522
##$ABSF2= -4.171173
##$ABSG= 5
##$ABSL= 3
##$ALPHA= 0
##$AQORDER= 0
##$ASSFAC= 0
##$ASSFACI= 0
##$ASSFACX= 0
##$ASSWID= 0
##$AUNMP= <proc_1d>
##$AZFE= 0.1
##$AZFW= 0.1
##$BCFW= 0
##$BC_mod= 0
##$BYTORDP= 0
##$COROFFS= 0
##$CY= 12.5
##$DATMOD= 1
##$DC= 0
##$DFILT= <>
##$DTYPP= 0
##$F1P= 14.0000005364418
##$F2P= -0.99999901652339
##$FCOR= 0.5
##$FTSIZE= 32768
##$FT_mod= 6
##$GAMMA= 0
##$GB= 0
##$INTBC= 1
##$INTSCL= 1
##$ISEN= 128
##$LB= 0.3
##$LEV0= 0
##$LPBIN= 0
##$MAXI= 10000
##$MC2= 0
##$MEAN= 0
##$ME_mod= 0
##$MI= 0
##$NCOEF= 0
##$NC_proc= -1
##$NLEV= 6
##$NOISF1= 0
##$NOISF2= 0
##$NSP= 0
##$NTH_PI= 0
##$NZP= 0
##$OFFSET= 16.522
##$PC= 1
##$PHC0= 223.5699
##$PHC1= 7.631549
##$PH_mod= 1
##$PKNL= yes
##$PPARMOD= 0
##$PSCAL= 4
##$PSIGN= 0
##$REVERSE= no
##$SF= 250.13
##$SI= 32768
##$SIGF1= 0
##$SIGF2= 0
##$SINO= 400
##$SIOLD= 32768
##$SREGLST= <1H.CDCl3>
##$SSB= 0
##$STSI= 32768
##$STSR= 0
##$SW_p= 5175.98343685301
##$SYMM= 0
##$S_DEV= 0
##$TDeff= 65536
##$TDoff= 0
##$TI= <Analysis number 999999
Compound Code 99
Book Reference 9
Project Code 9>
##$TILT= no
##$TM1= 0
##$TM2= 0
##$TOPLEV= 0
##$USERP1= <user>
##$USERP2= <user>
##$USERP3= <user>
##$USERP4= <user>
##$USERP5= <user>
##$WDW= 1
##$XDIM= 32768
##$YMAX_p= 345674383
##$YMIN_p= -33239
$$ End of Bruker specific parameters
$$ ---------------------------------
##NTUPLES= NMR SPECTRUM
##VAR_NAME=  FREQUENCY,     SPECTRUM/REAL,   SPECTRUM/IMAG
##SYMBOL=    X,             R,               I
##VAR_TYPE=  INDEPENDENT,   DEPENDENT,       DEPENDENT
##VAR_FORM=  AFFN,          ASDF,            ASDF
##VAR_DIM=   32768,         32768,           32768
##UNITS=     HZ,            ARBITRARY UNITS, ARBITRARY UNITS
##FACTOR=    0.157963299565203, 1,           1
##FIRST=     4132.6476996994, 0,             0
##LAST=      -1043.33573715361, 0,           0
##MIN=       -1043.33573715361, -33239,      0
##MAX=       4132.6476996994, 345674383,     0
$$ Real data points
##PAGE= N=1
##DATA TABLE= (X++(R..R)), XYDATA
$$ [...]
24951 -17801 -22889 -13316 -7308 -8026 -3872 -5150 -7647 -5154 217 -818 462 -471 3684 19025 20252
24936 20252 9875 3927 8163 7796 8222 10670 14210 9639 -2262 -5397 2030 7266 -657 -199 2798
24921 2798 617 1654 -1041 8635 13745 10179 2558 574 -1742 2156 4608 5902 10573 11763 6928
24906 6928 9170 6687 4213 7470 8021 7140 12139 10620 -456 2222 8527 7095 90 -4274 -4790
24891 -4790 -2524 1327 6108 1546 1964 -2206 -4807 -15487 -10245 -2759 930 -64 -4425 -2713 2032
24876 2032 -2941 -5974 655 955 -651 4904 9408 13218 6090 655 -645 -1998 2020 750 1534
24861 1534 -1853 712 5398 10598 9216 2523 4275 3327 7734 6055 3780 4990 260 -1091 7791
24846 7791 13204 11729 9790 5537 -8490 -11280 -3991 270 2143 1366 -1519 -1079 -6516 -7227 -7341
24831 -7341 -2809 -731 -2263 -2681 -5372 -14992 -5696 2793 1923 -2716 -1276 2507 5004 5565 3540
24816 3540 1109 -4694 -3827 -3586 1231 6854 9307 3154 3885 8574 7169 8327 1345 1769 2898 -4000
24800 -4000 -9059 -10540 -8852 -11339 -19744 -18442 -4527 -1846 -4416 -6856 -8784 -15237 -17401 -13754
24786 -13754 -11170 -10307 -14471 -11384 -5129 -6068 -11310 -12100 -9187 433 6436 7515 5854 4938 6374
24771 6374 5584 11418 10377 4737 -3607 -14203 -15734 -5029 5063 6764 -2621 4668 13176 3492
24757 3492 -10617 -7844 3192 -1184 -5201 -8942 -2717 -3561 -609 -3688 -2451 3192 10940 13568
24743 13568 18595 14558 5640 11272 15520 20327 14882 9554 3617 -4997 -2743 -2380 -9703 -1819 6877
24728 6877 8942 15544 11436 937 -7566 -12973 -11316 -14369 -11393 -8864 -9942 1040 7784 11607
24714 11607 11235 14374 12740 6393 1842 38 -5809 -9304 -7346 -4200 -371 -1416 -3498 -8039 -6539
24699 -6539 -9781 -2434 6777 2071 -2145 1483 4117 6837 9092 13357 13664 15541 8575 3816 5238
24684 5238 5453 7019 3961 2457 -1644 -5456 -4679 3026 -4640 -8363 -2969 1398 4664 6690 7542
24669 7542 6721 11014 10390 6209 5092 5954 2572 394 348 -2617 -3535 6585 5067 -4142 -4397 -3712
24653 -3712 -5359 -9398 -10468 -8170 -3896 -3923 -3985 -2193 -1814 4162 8806 9396 9726 4239 6952 7024 5153
24636 5153 4650 7559 9474 4132 -621 -4940 -7190 741 6180 2224 2108 723 -3411 -5920 2101
24621 2101 9953 4367 3682 5872 379 1976 -1296 2964 10250 16321 15932 17669 11174 11355 13656
24606 13656 13900 16403 19561 12658 9203 5028 -3246 -5200 -4570 -4483 -8508 -4859 3272 3603 -65 -5482
24590 -5482 -4843 -3899 -7209 -8322 -1149 1088 -430 -4759 3466 6555 3130 -1988 -7422 -13878 -10599
24575 -10599 -3277 -1929 -2469 -7520 -3480 -5312 -6197 -4944 -5731 -641 658 1692 773 1636 100 1654
24559 1654 5831 3133 3909 7318 7194 6721 7475 3146 11326 11885 1567 -3337 1657 1893 2953 4281
24543 4281 6433 10154 7430 -4736 -11119 -9051 -4707 236 8111 7905 1018 -8022 -10796 -8415 4238
24528 4238 10531 8422 6115 5101 -468 38 -595 2614 1728 1120 2282 -2527 -1991 -3818 1229 6520
24512 6520 5924 3184 -6664 -14016 -13573 -10787 -1739 5783 15473 14461 10646 1670 2571 5561 7177
24497 7177 11769 9652 -953 -2942 -6055 -4966 238 4596 8832 5550 -3101 -4226 1151 5630
24483 5630 7532 3736 -2105 829 3564 6552 6904 3497 1731 -1049 -1669 -930 -2183 -4666 -5074 -11972
24467 -11972 -17983 -12005 -3429 -5380 -1753 -336 -8303 -5048 -5374 -4528 -1872 -21 -2335 -3675 -960
24452 -960 -2709 -4086 5017 9177 6416 3936 6152 835 3537 10682 8654 1101 6146 2693 335
24437 335 513 3503 8761 8564 7535 4791 -2304 -1106 -514 3594 8130 6505 4053 5928 -2816 2758
24421 2758 984 3084 7598 9325 6223 935 1047 -2553 6898 16006 12478 5555 -1009 5135 4485
24406 4485 6234 1153 1312 8298 9119 5448 6089 11295 5688 115 -1822 -3414 -4319 961 6973 5247
24390 5247 2824 1943 8252 15251 7885 10360 10164 4218 -7122 -3431 552 -4008 -1489 1022 -2246
24375 -2246 -445 634 -9482 -4686 10149 16924 11066 1090 -1164 -526 956 5603 7712 7738 10139
24360 10139 8405 6440 11028 8268 6232 8215 7368 1643 -7824 -3921 -2093 3327 4005 -3240 -4337
24345 -4337 832 1777 7315 2611 92 -2125 -3033 1736 6266 2823 -3333 -11752 -10635 -6752 -2760
24330 -2760 -4246 300 6550 9192 7882 6127 3747 3998 187 -9034 -16487 -21138 -17270 -14459 -6336
24315 -6336 5953 12770 15016 12448 7246 9000 12587 9993 744 668 4475 8821 5905 6319 -1412
24300 -1412 -5974 4412 6320 3985 -324 -1620 4364 3156 -452 -5469 -4126 -2502 -5338 -4654 -3488
24285 -3488 -6347 -8566 -11370 -3826 -367 10408 18521 17110 14341 17611 14882 13833 12740 6760
24271 6760 10718 19757 18415 7175 7688 7580 -345 -2226 -11018 -6713 -3111 614 3875 1151 -9172
24256 -9172 -22699 -16175 -6881 -613 6605 -1425 -1013 -5017 -10739 -13901 -13796 -6609 5739 7755 7217
24241 7217 4113 -3820 -11738 -9012 -3960 -1574 -2610 -3834 -1340 -2671 921 -2861 -2011 -3750 2164
24226 2164 3371 391 2725 12338 13395 7703 12696 16397 19044 14262 5655 -4370 -7705 -5872
24212 -5872 -4000 1861 458 -8653 -6465 3403 -3926 -9611 -567 4137 2253 1941 7230 3116 3999
24197 3999 5182 7274 7194 15355 13431 18248 19208 20353 15443 3318 1785 -2952 -7259 -13803 -7092
24182 -7092 -4922 1146 4660 -2678 -7858 -4259 -4620 -3748 -3274 -7949 -6911 -3818 -3053 -5910 1011 7317
24166 7317 4955 84 -7880 -4300 -2010 -222 5673 4294 3940 -2424 -272 -2947 -5227 -9343 -14509
24151 -14509 -20883 -19010 -8673 -3682 1302 954 -3484 -5335 -5117 -2421 -3765 -7228 -4307 -502 115
24136 115 -729 1849 -314 -2926 -3256 -3891 2930 2926 -815 -3729 -5605 -2574 -1802 -190 -3815 -8180 -14309
24119 -14309 -9300 4290 2231 7272 10223 9090 7056 6486 4616 -4205 -143 -444 -13058 -18605
24105 -18605 -14400 1837 11452 10037 7470 12368 13446 11023 11183 10475 7431 3071 6984 7642 4528
24090 4528 -142 2492 5541 4190 7269 10482 6329 2751 94 -1324 1633 81 -8745 -7267 -4285
24075 -4285 -2565 2139 591 -5915 -4979 -1616 4871 6636 -2129 -6322 -8414 -13717 -4985 1600 5551
24060 5551 2652 9786 7776 6601 8926 3598 -2270 1311 4436 5529 -1447 -8241 -9056 -8151 -10716
24045 -10716 -2160 1761 877 4703 7853 5950 2683 7603 624 -4578 -3829 -4084 -819 2264 4613
24030 4613 1941 3875 1886 6875 8279 3733 370 -2217 -5995 -7286 -5426 -7519 -3148 555 3063
24015 3063 4816 3435 1398 1607 221 -957 -681 -3174 -2041 3326 6427 4669 -2561 -999 -4807
24000 -4807 -3240 -355 2905 7485 3949 1501 1966 -6118 -11055 -4484 4956 12321 11012 8378 12423
23985 12423 7058 -3161 -12072 -12806 -9838 -3408 2326 1711 -1031 -1559 -7064 -9080 -3517 -1343 -6249
23970 -6249 -6224 -2128 -2125 3963 2776 751 1002 -7148 -569 2652 1032 -4203 -4272 -5174 -6265 -4624 1585
23953 1585 7502 3020 3211 3033 5291 3689 -661 1700 3752 -6005 -9720 -5560 -6353 -8354 -7209
23938 -7209 -2422 2766 392 6151 9579 12710 20348 17044 5599 7710 7190 3718 6737 -1897 -6319
23923 -6319 6555 9461 5306 -2256 -2801 -3045 -4860 -4802 -3176 -9440 -14512 -12315 -5267 2763 6942
23908 6942 6254 12536 11310 5790 3707 2170 3636 262 -5452 -7811 -5431 -4814 -6032 -8954 -8145
23893 -8145 -3758 -2816 -8327 -6901 -5438 -5517 -5249 -2457 -4235 9003 12533 -217 -9491 -7976 -9316
23878 -9316 -10237 1437 1943 -5740 -8845 -2414 -4932 -7370 -4179 -1765 2005 12222 13033 8788 -1382
23863 -1382 -5 984 -2421 1501 2325 -3634 -5209 -1818 -1279 -3565 1760 4904 7303 502 -3328
23848 -3328 2780 13953 16778 14651 8489 -777 -3712 -2977 -7088 -4449 1750 -721 -9829 -14800 -11082
23833 -11082 -7342 -7483 -10470 -13400 -12754 -12853 -15069 -24826 -19477 -18691 -18557 -20992 -12052 -17147 -17827 -7603
23817 -7603 -2939 -3473 -1593 4045 9901 4472 -3210 -979 -5931 -1846 -1128 -1209 5145 4761 4543 6316
23801 6316 6471 2892 -5211 -3536 3899 660 4433 2483 437 -2165 -3383 3661 8639 2513 -4771
23786 -4771 -8150 -10073 -8354 -5847 -896 3287 3716 -766 -5512 -6074 -2974 -1307 -973 -5190 -7516
23771 -7516 -8051 -5948 -10784 -12306 -14194 -14169 -25621 -24953 -18181 -16249 -20959 -23313 -18722 -12499 -3775
23756 -3775 -7499 -7340 -7075 -6506 -4511 -792 -3618 -900 -3635 -8061 -3150 3401 -3274 -6424 -4657
23741 -4657 -5283 -657 -7602 -10036 -5165 -4492 -7727 -14033 -13742 -6150 -8858 -6336 -9881 -10136 -8090 -10347
23725 -10347 -3913 136 3200 5641 4289 -491 70 10045 9604 10419 5926 3011 3232 4874 6600
23710 6600 5297 -2670 -3461 -2056 -3099 -3069 947 6802 7650 -3476 -7200 -8928 -9028 -6835 9 3152
23694 3152 12271 12272 740 -3951 1485 4464 -2506 3941 8929 10920 12880 17736 18575 15247 14945 13002
23678 13002 15555 8635 3000 1140 -2698 -1741 2933 -75 -708 -1611 -8662 -11732 -17938 -11066 -7187
23663 -7187 -3273 -2286 -3174 -11442 -8442 -10024 -5818 -5301 -8088 -7089 -6362 -6613 -5308 -779 3687 6073
23647 6073 1512 -2969 -7609 -13309 -6788 1453 3572 -973 -2358 -2893 -3656 -10202 -6093 -10001 -14927
23632 -14927 -12965 -6816 -315 -2283 -1026 -1650 -6153 -4381 -6307 -591 7102 -388 -6838 -10268 -4353
23617 -4353 4351 2184 -147 -550 1502 1415 3012 7092 5627 3654 3275 -1544 -2238 -3762 -5990 -6626
23601 -6626 -11565 -18230 -17643 -9617 -2965 -372 -3537 -3196 -2334 -1094 7289 3336 348 -3810 -1717
23586 -1717 5643 5993 7086 3467 2185 -1590 -6000 -4660 1530 7976 7478 3703 6772 12818 11168
23571 11168 2134 -456 2682 6198 8427 165 -3503 4830 -2103 -87 10201 11188 8878 1624
23557 1624 3262 6425 5239 9081 9150 4555 3955 672 2671 -1224 -3479 -8280 -7754 -11272 -11892 -3870
23541 -3870 -4451 1607 2679 -2294 -1403 -80 -5035 -4347 2482 7730 2837 -6525 -4160 -3594 -9738 -6291
23525 -6291 1095 274 4373 4211 -5447 -7977 -9597 -7068 -10755 -3085 3177 3646 4387 35 -3268 -9961
23509 -9961 -12396 -6873 2339 2222 -559 -5645 1637 6257 13300 5492 2159 7834 7631 4717 6572
23494 6572 6698 -1302 -9450 -6926 7192 10695 10229 -4834 -10949 -7123 -3214 -7037 -8639 -3474 -2562
23479 -2562 -1560 1922 774 -76 -4657 -3117 1354 6395 5356 4645 -604 -7604 -9188 -6099 886
23464 886 5565 17009 11713 3236 2951 3607 3386 -3845 -4671 2102 6529 5931 -18 -2782 -5632 -10386
23448 -10386 -4673 6351 6450 3183 -232 -4740 -7576 -8142 -3067 -3526 -4491 -4819 -4688 -6897 -7590 -8909
23432 -8909 -5901 -3701 -4262 -5666 -3106 1140 -1876 -5176 -3996 -129 3843 13073 17795 12242 5641
23417 5641 -1692 -4660 -1721 -517 7489 2371 -3074 -1474 3190 7527 11052 10886 11433 6287 7765
23402 7765 5415 6724 4487 -2629 1114 4533 4329 7341 11540 4753 887 60 -6606 -13324 -14353
23387 -14353 -5107 -1255 3184 6836 4531 -1706 4047 266 -6637 -8143 -4259 -481 -144 3065 4954
23372 4954 7361 4355 3138 4089 1132 -1569 -5361 -7449 -3907 -1058 -5581 3139 6901 9433 10093
23357 10093 7514 5444 694 -2098 11176 17903 12757 5906 3472 10448 10839 5474 6469 11886 3361
23342 3361 -7140 -5989 -2889 712 2722 2298 -435 -1321 3507 11878 8362 -771 -9083 -12575 -5735
23327 -5735 1758 5175 5869 6877 5994 -976 -4751 -3855 6455 11058 15722 15553 6730 3656 3373 9073
23311 9073 1403 -5855 -5949 -3560 -5337 -5038 3230 12133 9471 4808 -4656 -2700 3105 -1117 5779
23296 5779 6878 -2093 -11227 -3588 -1404 -3568 -5567 -2869 1114 -4730 -9863 -8910 1580 7273 10794
23281 10794 7955 -312 -4357 -9957 -15571 -16616 -7199 849 -1815 -4209 3163 9522 1213 -3719
23267 -3719 -6026 -10346 -14666 -15854 -15858 -10317 -5099 -8426 -4531 -2578 -4581 -4235 488 5127 453 -7188
23251 -7188 -6045 -1875 -4965 -3100 1532 9014 14132 10459 4944 5048 5507 9992 5558 519 -3184
23236 -3184 -3183 -3459 -2892 -2302 1098 -137 -1665 2860 1359 2323 397 1342 -5652 -11042 -4888 3281 12236
23219 12236 8933 9812 7715 -420 -6232 -11319 -8753 -3372 1492 1612 -431 -1639 -8505 -12144 -12758
23204 -12758 -13975 -13852 -8888 -8788 -6674 -222 -4311 -4856 -3698 -3437 -251 -2898 -3996 1455 3492
23189 3492 -3200 -5086 -3581 7298 7509 -8471 -13356 -12172 -8181 4290 3168 -5502 -7625 -8755
23175 -8755 2697 8793 -834 -912 6026 4032 -2855 -7795 -5341 -184 13130 15342 13754 9145 3994
23160 3994 2532 2746 10608 18165 14523 13944 11300 1680 -4699 1676 8526 3082 -2100 -1122 -4628
23145 -4628 -4614 4420 -779 -1919 -2047 -2705 -5508 -8288 -9331 -11606 -10396 -8550 -2867 -536 5552 6038
23129 6038 -60 -2063 -6571 -14679 -14841 -15851 -11530 -12904 -19823 -17635 -9047 -3442 -735 -3616 821
23114 821 1103 -8434 -12739 -10089 -9235 -7721 -1400 967 -119 -2387 3379 5011 8256 9581 5330
23099 5330 -3511 -9165 -4813 -2346 3085 -55 -11507 -16946 -8023 3578 3854 3584 -2064 -2794 -5258
23084 -5258 -10873 -7408 -1136 -2571 -12505 -5714 1126 5018 6353 7231 7906 4649 1696 1472 -1067
23069 -1067 1990 7493 3425 -1200 1707 4947 6680 4112 856 -3274 -3532 5019 3245 7347 15021
23054 15021 12662 2067 -10830 -14797 -12854 -8932 -9970 -3468 -427 -4177 2473 13185 13029 10343
23040 10343 7433 7045 7160 7865 7709 -2138 -14158 -13016 -12483 -8685 -12596 -9259 -4248 -3492 2630 -851
23024 -851 -14241 -14170 -13289 -12507 -4835 -2792 -4435 -12805 -1193 4115 9575 3923 1263 708 5047 7405
23008 7405 8775 3280 6574 7054 2137 -8237 -17743 -15370 -7556 -4025 -2954 574 3477 -369 -3077
22993 -3077 -4201 -2020 -925 1185 937 -806 -2213 -13476 -16165 -9711 -3585 -3535 1292 2434 -660
22978 -660 97 5133 11861 6630 -162 1559 -828 -6295 -11531 -14925 -14136 -4905 847 4110 5353
22963 5353 -2841 -7677 -1781 -988 1207 -2263 -4193 7280 11694 7394 -1707 -1607 -4595 -10747 -8592
22948 -8592 -2533 -3648 -8240 -12843 -16156 -23023 -11078 -5237 -5628 -3663 3013 4277 4242 2610 948
22933 948 3249 -1054 -1125 3168 5627 5707 8363 7703 -351 -3502 2010 1432 10071 14366 6111 -537
22917 -537 5108 4887 3573 10474 7441 3347 -3190 634 4322 4833 2064 -713 -5353 -11579 -13280
22902 -13280 -5112 -5420 -3142 909 3326 -4712 -11371 -7307 -424 2387 4453 7191 3970 -9380
22888 -9380 -7530 -11238 -14945 -6833 -4136 -7707 -9920 -7692 -1590 2465 -827 -6760 -3842 -7004 -6886
22873 -6886 -3154 -10062 -17272 -12525 -6339 -7695 -5278 -1785 -990 -1730 -2976 -1112 -4148 -4565 3524
22858 3524 6947 4988 -2509 -2492 -9858 -11579 -14310 -16629 -9456 -6077 -2593 2072 1970 -2433 -6161
22843 -6161 -6515 -6572 -7277 -796 800 -3123 -10798 -4663 134 4037 7560 6251 3775 -900 -5617 -8176
22827 -8176 -7078 -6728 -342 3017 11934 10502 8113 4860 2372 6312 1333 1062 1030 5086 7114 132
22811 132 -1502 -142 -357 -2528 1833 3396 -348 1306 -804 -4518 -10717 -6935 2976 -240 267
22796 267 -527 -3150 -5088 -9906 -11474 -6662 -8736 -5561 4623 9474 856 -7607 -9958 -6631 -7735
22781 -7735 -4387 -1935 -4107 -4011 -2161 -3471 -4239 -1932 3338 674 -4071 -5127 -5835 3214 -1469 -5694
22765 -5694 2583 9180 10319 9214 3919 -5528 -13243 -9030 -10320 -12576 -9381 -1918 1732 2416 2519
22750 2519 3395 8111 6633 5637 4172 5142 -820 -330 -4592 -6450 -5165 -1568 3136 4864 7752 10150
22734 10150 7422 12154 15567 14525 13411 19184 15272 14413 12341 6365 5876 4430 3348 5237 3387
22719 3387 3397 -2524 -9139 -5596 4064 9472 6633 -2898 -13127 -13628 -910 9902 4433 5893 2800
22704 2800 5991 13039 7004 51 -5488 -7970 -6445 -5180 -6401 -2633 -5882 -7526 -3975 514 -212
22689 -212 -447 -1760 -1600 2859 3099 5717 1123 844 -1379 2490 3609 3166 -1716 -956 -2970 -5650
22673 -5650 -2122 911 6457 8366 8014 -135 -5126 -2108 -2550 -1448 -299 -7436 -7831 -6970 -8407 -8764
22657 -8764 1097 7804 10709 7079 3232 -4293 371 184 -6780 -8081 -4389 -2776 -2755 -13655 -15592
22642 -15592 -7367 -2029 888 207 -3636 -4598 -69 10845 7892 2055 -8390 -17626 -18996 -20289
22628 -20289 -12577 -1773 -218 -7173 -11212 -4974 -2697 -4151 4841 7182 2847 4706 1142 2160
22614 2160 3235 484 3315 9400 4169 -4832 -4465 -1939 1850 2526 -56 -7345 -13843 -14024 -9093
22599 -9093 1095 4825 4959 7482 6066 -2131 -563 3271 1869 10091 14323 13917 6371 -4746 -6830
22584 -6830 -5829 -8461 2108 8689 4191 -4360 -3240 -752 5838 10396 5087 2617 -1553 -9699
22570 -9699 -3738 1842 6433 625 -5761 -2017 3204 -2062 -6973 -5822 -6986 -10658 -5287 2078 -3024
22555 -3024 -1715 -3514 -7772 -6054 554 4917 4454 3315 2309 5105 10339 3837 678 -2942 -3462
22540 -3462 -1142 -3843 -14555 -10051 -3693 -11171 -13247 383 9698 11628 11861 9840 6597 3630
22526 3630 -3490 -4654 1156 8224 14281 10148 8605 1399 -6492 -8564 -6274 -4583 4773 5538 -1559
22511 -1559 -11033 -6973 -3198 -3766 -6170 -6904 -2118 -2201 -2383 -4912 -7007 -14211 -16413 -9869 2614 5055
22495 5055 11423 13163 9798 7414 188 -1973 6238 4218 3678 675 -6471 -3755 -1611 -2254 -9945
22480 -9945 -7525 2049 13707 9755 7371 10068 11468 10404 114 -6432 -9997 -6329 -10525 -8563
22466 -8563 -5690 4783 1776 129 -2392 -8820 -14609 -11641 -687 1919 -2960 -4684 -9688 -8227
22452 -8227 2008 344 -1030 -742 8871 9486 10155 5488 2810 5695 2755 1398 -168 1309 1830
22437 1830 3206 -2243 -10456 -9337 -8717 -5825 820 -2073 -5123 2229 4047 4098 5245 -4878 -14080
22422 -14080 -17734 -17323 -13683 -8982 -3191 5236 1336 5980 5031 4401 3109 -1294 -725 5464 13975
22407 13975 4141 6187 3147 533 -782 -7159 -10281 -4482 -1820 -1727 -3800 -806 1167 -694 -11996
22392 -11996 -6694 4728 5331 6670 -2280 -6771 -4278 -8635 -12184 -5620 4084 5759 1974 -880
22378 -880 3173 -745 -3809 -12753 -2245 1495 2073 -2670 -14091 -3686 2180 -7140 -6458 -7186 -3950
22363 -3950 4051 -5991 -6987 -4482 -7648 -9492 -2795 2930 191 -2159 -5256 -6664 -5959 -4149 -2398
22348 -2398 -6538 -10096 48 713 -2358 4014 5965 9610 6300 6362 1795 -1543 -2047 -1797 -5934 -3226
22332 -3226 6800 5052 -3168 -7621 -2824 -1498 4487 13215 9778 3423 827 -4360 -10491 -10369 -10570
22317 -10570 -6561 -1428 -716 -3958 -987 4075 1821 640 -11139 -17217 -14554 -12438 -15965 -15234 -11271
22302 -11271 -7046 -16091 -21114 -9025 -5194 -1969 4129 304 -4981 -4663 -6037 1618 6570 -1502
22288 -1502 -1982 5458 -2366 -5213 -3499 -1703 2261 5793 4657 1587 -1310 -1445 497 3799 8114
22273 8114 4362 1439 -7573 -11969 -6984 641 1532 -4879 -3886 -4288 -3360 -1900 -1202 993 -1466 -9314
22257 -9314 -15790 -14583 -8874 -2209 8005 8464 8777 5325 -328 -8478 -1475 3415 5118 9579 10382
22242 10382 6617 2371 1955 4997 -313 -687 363 -104 -4071 -10154 -10546 -8930 -8094 -11940 -14418 -12443
22226 -12443 -9424 -6257 -2177 3024 -5518 -8174 -5050 -4361 -11043 -5720 4511 2450 680 -21 -1326
22211 -1326 2900 6529 8799 5926 1329 982 930 -283 6459 14103 4290 -4460 6045 9444 4274
22196 4274 1838 -73 -783 -1095 -5698 -8962 -4559 -7047 -12601 -11122 -8908 -5657 -2351 -985 -6592
22181 -6592 -11918 -12531 -10077 -10092 -1825 -546 1999 4578 1861 2080 169 -3114 -1283 1219 4927 8933
22165 8933 14002 13267 8274 7826 13415 6309 1554 6157 8435 6364 3132 2230 4582 2688 2383 748
22149 748 -2897 -5204 -2088 1125 3833 2793 3688 6463 4469 3616 8160 7516 4659 2919 -4439 -3769
22133 -3769 1521 276 -5014 -5056 -9686 -12542 -10533 -9026 -1153 3973 6379 -688 -2121 -1438 2526
22118 2526 4094 -373 -7624 -28 88 -941 488 2912 3893 3505 2783 4342 4971 3673 5169 -1530
22102 -1530 -8505 -8907 -10386 -11466 -3834 1018 -827 -2490 1069 3228 3619 1092 2593 2660 -3723 -2478
22086 -2478 6726 2614 -2013 -1101 -437 -221 -164 -183 -1396 -987 3838 9835 11387 7336 5233 5089 1284
22069 1284 2066 1605 1906 -4271 -3895 963 11992 17061 12105 4055 -308 2971 6578 4796 -43
22054 -43 5668 7744 3834 2001 -251 -1958 2656 -4381 -12847 -10667 -2225 -877 2483 -2687 -6461
22039 -6461 -3307 -4365 -4066 -4991 -2401 1901 -2339 -3986 -483 40 938 -3245 -5879 -2392 -1526 989
22023 989 2975 2368 3020 1626 -3986 -10107 -12484 -12959 -16693 -14856 -8239 -5222 -1458 -6982 -8090 1476
22007 1476 4639 -727 -1764 -197 -3667 -7211 -12704 -10501 -6383 -1657 2997 5886 11625 11384 6190
21992 6190 -3066 75 -558 -2556 186 1878 894 1613 3322 2818 1757 -937 1453 1461 -6183 -6276 -2986
21975 -2986 859 -2142 -1873 6422 6091 9124 15053 14711 8764 3635 -459 5 379 -1470 2842 -1741
21959 -1741 -13397 -14717 -7382 -6019 -5970 -12904 -13539 -6421 -6122 -8259 -3856 -5557 -7962 -11338 -8033
21944 -8033 -4082 -4205 -6275 -9112 -7344 -5778 -4407 -6001 -4885 3549 8165 6057 4669 5369 6156
21929 6156 -291 -10866 -10773 -5978 -3645 -3763 -1818 -10462 -18824 -14234 -12383 -20186 -15963 -10712 -1392
21914 -1392 1452 6943 537 -1719 556 -2044 -1145 4236 4521 481 -1397 -1482 131 778 8132 4662
21898 4662 1204 -2196 1091 -602 -3778 -9839 -5483 -2188 -5241 -8523 -3246 1590 -1867 -1906 -4727
21883 -4727 -10205 -7153 -5760 -4684 -3170 -1870 783 9682 4832 -4321 -367 4995 -1218 -4592 -4073
21868 -4073 -3042 -2264 -3433 -5869 -9930 -14296 -10149 -7571 -6599 -4183 -6948 -1307 -1498 -8557 -10116
21853 -10116 -1875 1546 4323 7137 4562 674 2418 3811 786 -8367 -5438 -7484 -5638 -1801
21839 -1801 -1830 -2640 421 664 2883 7746 1005 4401 4075 -761 -1578 -2859 -2577 1193 2308 -9200
21823 -9200 -12295 -12580 -7976 -4564 -7566 2892 10106 8863 5559 7731 317 -11104 -12369 -9750
21809 -9750 -5990 -1171 -5092 -11232 -13915 -428 2900 -4815 -3240 -2988 -2468 2329 9611 2718 -5949
21794 -5949 -4762 752 -4188 -7130 919 -82 2274 7640 10186 9752 5675 -1675 -4482 -2088 1033
21779 1033 -1953 -7879 -5827 -3973 -345 -411 1191 4170 1194 -763 -631 4204 4076 4422 6426 5675
21763 5675 4649 4502 1338 -3352 1134 167 -118 2048 5068 -5941 -9336 -5594 -5097 -7748 -3203
21748 -3203 -646 3811 -833 -182 -872 -5249 -3835 -4958 -3545 840 -316 -5174 -2064 -2567 -11762
21733 -11762 -5484 5317 2923 -5555 -9451 -10917 -7084 -2979 -6328 -3274 -6573 -9138 -2617 1518
21719 1518 -680 -2272 -2613 853 9461 8467 -1758 -5282 -454 2 -3619 3308 11459 11285 3109
21704 3109 -6845 -9684 -4946 -4556 -176 3750 -6673 -8231 -3116 -10056 -12437 -9094 -5322 -2840 -5051
21689 -5051 158 3530 3814 5836 10432 11626 5931 1396 -5891 737 3700 -6770 -4123 2620 2523
21674 2523 5327 -1280 1950 4332 5836 4921 4505 -50 -4079 -6099 -4536 -7703 -9828 -5415 3126
21659 3126 3881 3132 -80 -4011 -10776 -14210 -11236 -12427 -14015 -13355 -17163 -13648 -10327 -16426 -20375
21644 -20375 -14978 -11194 -6988 -6387 -5731 3275 8181 10438 3504 -1511 -2023 -4547 -5112 -9660 -11118
21629 -11118 -7038 -7186 -5458 -3399 -2077 -505 1396 567 -3266 -9642 -9917 -6167 -6542 -2060 1491
21614 1491 1396 -1897 -1311 2509 2105 -2303 -1085 4993 1876 -3374 -912 1204 -527 3066 -3952 -11335
21598 -11335 -9428 -8140 -5496 -992 935 4856 3023 9076 704 -10330 -10981 -9312 -11080 -6861
21584 -6861 -2148 5280 6432 -3237 -1675 -1657 455 667 5752 6001 3686 12682 11341 -311 -11148
21569 -11148 -3820 2428 -518 -3275 1290 5801 5995 7493 6339 1574 1476 -4348 -6495 -1157 -3857
21554 -3857 -3442 -154 2593 9014 8688 8307 7352 -2765 -6882 -2924 -1639 1172 -3821 -10669 -9540
21539 -9540 -11882 -4401 -1891 -2673 3258 2800 1547 -5249 -452 4423 238 -2878 -3620 -3063 -3517 -3206
21523 -3206 -1490 -1473 1816 2730 4873 498 827 9656 11438 9427 10028 9753 4601 -3274 -6104 -3621
21507 -3621 -3296 3168 6235 9162 6609 7412 8041 6693 12660 9685 7304 1366 -933 -1775 -9634 -9100
21491 -9100 -8727 -7382 -3929 1888 8364 11224 8300 3637 8629 6854 1598 -1911 -5006 -3460 -3330
21476 -3330 -8703 -4099 50 -5159 -1814 -9948 -15695 -11997 -7633 -3859 -2230 1337 233 -11613
21462 -11613 -11904 -1551 120 -2875 -1545 -3122 -9043 -17465 -9399 -3609 -3865 -6485 -568 5074 11835
21447 11835 18093 17043 5001 -7704 -7379 -178 2632 -497 2894 9712 5855 3027 3429 6983
21433 6983 9969 1112 -10414 -10114 -2323 2238 1907 5413 -3545 -5626 -2978 -6236 -8561 1130 -1856
21418 -1856 -2500 -3001 -1254 -2746 -3031 488 5391 2199 1700 -2626 319 -3443 -4926 4243 7618 14674
21402 14674 8391 6859 4031 4628 5661 8 -274 6540 5110 -1626 -1989 501 1694 5533 7669
21387 7669 2707 -4509 -10991 -11868 -6576 -4440 -1019 12614 8974 -3049 -8115 4149 16231 20805
21373 20805 13966 7511 4489 5379 1682 8204 11725 16975 10693 7414 6878 15028 18042 9127 2624
21358 2624 4238 3112 -2950 -666 -783 -2557 3287 -3427 -9770 -9199 -8012 -4393 -628 4006 -2562
21343 -2562 -2083 9435 14119 9273 3872 -434 4637 2870 5123 4628 -1668 -7881 206 4720 2170
21328 2170 3183 5882 6918 4440 3687 8804 8689 9356 5113 956 6553 8542 8612 9338 160 -5942
21312 -5942 -4985 -2598 1548 3862 572 -3186 -1976 -3617 968 7033 12519 7379 9761 11906 11064
21297 11064 1810 -7422 -8246 -3241 -687 -4256 -4337 -8152 -6294 -5791 -10984 -12942 -10167 -4113 -1544
21282 -1544 -3863 -3057 6187 4605 963 249 1878 -1892 -9862 -13388 -9221 -3843 -12079 -8016 2213
21267 2213 6052 4967 -3363 -1641 6386 1657 1565 4260 -4447 -10127 -9457 -20186 -19989 -17269 -9682
21252 -9682 1352 6734 3571 -521 -1239 7655 9513 896 -4285 -8730 -5790 3709 12798 14575 11472
21237 11472 8356 7175 -5062 -3108 2238 4878 2928 -165 7204 12542 6777 6323 2578 5664
21223 5664 7799 8468 13039 13204 11690 4279 603 -1038 1803 -3149 1067 -1415 -3472 489 43
21208 43 -7935 -7721 -8292 -9903 -7862 -6257 2946 2186 -2825 -5100 -1355 -1297 -2239 1034 619 8091 10818
21191 10818 6487 -800 -3807 -935 -2574 -410 -4961 -5006 -157 -4154 -6001 -1545 -2742 1796 9481
21176 9481 13657 12718 6261 934 -9671 -14799 -10798 -3610 -1100 -4003 -7565 742 -6768 -3686 -2706
21161 -2706 1843 2761 134 -1666 1399 1939 1390 6355 5522 2519 308 2127 9731 14784 12137 3376
21145 3376 4796 9066 9977 6792 6349 5438 628 2425 8899 9383 343 -2357 4213 6644 1474 3124
21129 3124 5741 3019 -4182 -9625 -15445 -15716 -17911 -17167 -12789 -9906 -5524 1557 -1831 -7653 -9669
21114 -9669 -8053 -9291 -10207 -16376 -19315 -17052 -9532 -4955 5019 7951 -1109 -6759 -81 -4051 -8144
21099 -8144 -3623 -3652 -2985 -5288 -5583 -7721 -9281 -7644 -7608 -9096 -10798 -6158 -3295 403 7848 5340
21083 5340 -494 -1963 -1969 -5285 -8453 -6987 -3302 -4639 -10813 -12134 -22057 -27104 -20862 -14984 -19726
21068 -19726 -23194 -6917 -248 2032 1554 2818 -1120 -4045 -4429 -2679 3706 7399 3807 -5622 -11698
21053 -11698 -7730 940 5182 261 -9198 -12909 -9557 -9354 -9299 -4468 -2764 4891 10338 -224 -8973
21038 -8973 -8014 -5585 -6434 -1292 2165 6391 4216 636 2889 4177 4579 2559 11 4575 7747
21023 7747 5893 7047 3032 1518 2169 -1835 -3613 -7784 -14250 -11979 -7820 -3647 -1007 -747 -2485
21008 -2485 -3328 203 3605 4275 11404 13934 7812 6570 8033 91 -7937 -5861 -5479 560 3482
20993 3482 10344 7441 0 -5524 -9289 -7451 -10463 -9397 -1117 -2472 -1343 -7211 -7722 -4673 -1653
20978 -1653 -3114 -7214 -5611 -11553 -11670 -7347 -6921 -8768 -5110 -8171 -11179 -8482 -9059 -5055 -413
20963 -413 -3195 -7504 -7987 -12904 -13424 -17487 -12702 -5719 -1557 -482 -4552 -2947 -5539 -10493 -8249
20948 -8249 -7394 -7196 -10725 -7004 -9867 -6917 -2403 4809 9209 7984 1363 -3734 -673 3244 4180
20933 4180 2175 1960 7462 8979 9723 3261 -1449 5197 10547 7246 1901 -6555 -7888 -9365 -2289
20918 -2289 3766 801 -1144 6106 6962 10768 11857 8324 2158 8061 10002 1013 -325 2285 3236
20903 3236 -3773 -7390 -3107 3468 -3725 -6531 -5146 -1477 -985 564 6919 6596 10259 12443 10756
20888 10756 5724 5343 5532 3483 4079 -2642 -9052 -10801 -4211 -3650 -3653 6262 6741 12252 10870 2732
20872 2732 -1621 -419 1637 -4483 -1430 -1725 -199 7594 4701 4654 4576 5167 4697 2518 -3982 -4559 -6899
20855 -6899 -3826 -3510 866 1856 -3800 -1987 3030 5949 2859 -1399 36 94 -4527 -3118 889 -407
20839 -407 -4455 3264 11153 3719 -2697 -7153 -1011 -2597 -3284 -5561 -8574 -8073 -11944 -13679 -13237 -7374
20823 -7374 -2188 -10440 -15232 -16130 -12888 -11846 -7610 -4411 -6678 -12059 -9349 -6104 -2203 662 452
20808 452 1120 700 -4280 -2572 -2925 2954 7234 3910 134 -3411 -4159 -256 533 -4476 -9900 -5193
20792 -5193 2083 8987 1126 -3119 -925 -5098 -4775 5158 9437 2702 -1344 -7083 -10627 -12943 -4552
20777 -4552 -5050 -7736 -5485 -1915 1743 786 -2996 -6990 -6863 -9513 -6888 -1767 1829 3365 921
20762 921 -7284 -3916 -6067 -752 5824 16466 14409 10575 11881 12087 4577 -61 978 5164 2387
20747 2387 -6773 -10078 -3644 -1012 -6482 -5416 -1860 2515 3627 -2626 -6092 -4295 -4666 -704 873
20732 873 354 -1122 5921 2689 1626 -690 4511 288 -7460 -8675 -11351 -5962 -2012 76 -3829
20717 -3829 -11862 -12916 -15727 -18030 -15094 -8692 -12970 -11109 -7200 -5652 -1699 2561 7042 8413 6908
20702 6908 -533 -7121 -7636 -3578 -5232 -7154 -5599 -4332 -3266 1956 9331 11714 14157 15684 13192
20687 13192 10706 13595 18543 16390 13588 15676 14705 6299 6853 12002 13813 4984 1204 10407 13212
20672 13212 16390 9761 3745 -2053 -2320 -10168 -7943 -4894 -3544 1774 9311 14630 12095 9282 9974
20657 9974 4103 1442 2456 4651 2826 -1663 -10619 -15527 -14006 -11311 -13457 -16814 -15896 -6833 -7011
20642 -7011 -12392 -9492 -3407 -1306 -118 -1096 3616 6679 4710 1439 -3416 -1647 -4219 -8465 -5721
20627 -5721 -5790 -4485 -13625 -20341 -11211 -9118 -1585 -678 -4942 -10543 -12993 -5543 -4287 -6287 -6360 -9403
20611 -9403 -10627 -7440 -6951 145 -2920 -1011 670 2417 -1816 -2639 2581 1410 -2404 -3008 -4317
20596 -4317 -3121 -1222 -2352 -1172 -4891 -8716 -8386 -4064 6343 10263 7761 9005 7886 6024 -1347
20581 -1347 -2488 367 3095 6768 7746 5526 -3843 -5698 -1726 -1009 2751 2707 -3857 -8507 -422 5174
20565 5174 6836 5106 1504 -3367 -9551 -3355 2175 329 -2048 1063 4953 -67 -3089 1085 2991
20550 2991 496 -7225 -5950 -899 5161 9970 8549 932 3217 2050 -4952 -12213 -12983 -8791 -3813
20535 -3813 -1408 3693 5234 15564 17223 6082 -2593 -661 -3788 -7067 -7763 -5913 -2153 -3540
20521 -3540 -8721 -10739 -11621 -17841 -13787 -3105 4302 5955 5044 6517 -1307 -12025 -9009 -4418 -756
20506 -756 -2387 -5786 -7055 5568 -147 -3652 -1405 4875 11108 5424 3897 -1022 -7169 -5094 1808
20491 1808 1655 -6990 -6565 -6050 -4790 -8642 -14975 -11457 -4258 -245 6569 6700 3901 6288 5134 -647
20475 -647 561 1898 1908 4303 5113 2809 -2905 -9530 -13719 -12710 -11154 -4777 -1373 -1133 -3247 -110
20459 -110 2059 -3724 -7048 -7503 -2686 -1133 -1559 -5689 497 2222 -1903 -6678 -7299 -2786 -458 4834
20443 4834 -3916 -12723 -13299 -10122 -7644 -8843 -3028 -991 -3518 -14671 -18869 -14492 -16131 -13413 -7547
20428 -7547 -1334 -4327 -1089 2608 4455 333 -2689 -3385 -2353 6347 4717 3587 2788 -1792 -1528
20413 -1528 5705 9903 4324 945 -4345 -10251 -16138 -19137 -15389 -11632 -9077 -10838 -17948 -20538 -12606
20398 -12606 -7690 -13319 -12793 -13754 -12972 -14313 -6121 -2195 -5020 -10342 -14296 -6817 -5652 -2346 -2047
20383 -2047 -2124 1447 -5770 -16021 -15759 -11888 -11863 -20060 -16503 -5158 -1718 848 4780 1148 -344
20368 -344 -807 -855 2123 6381 -1718 -3233 1677 2967 -2534 -6857 2164 6482 -416 165 -2963 -6116
20352 -6116 -295 3791 7483 4891 -968 1056 2513 -6224 -11711 -6057 -6573 -9699 -2289 4123 -380
20337 -380 -5179 -5187 -2868 178 933 3747 3463 3102 371 -2059 -1614 1875 11233 15841 11802 8810 6964
20320 6964 7459 4032 -7171 -14001 -17317 -9477 398 -2607 -6402 3440 15672 13052 9889 6935
20306 6935 15727 21720 15102 9035 4157 -2020 -766 -165 4558 -2478 -8492 -11222 -7036 -2811 3639
20291 3639 4919 -256 -2755 -8644 -4887 -6138 -8045 -4515 -730 -2496 857 8475 12830 13052 7202
20276 7202 2362 -1052 -12924 -13368 -3843 6804 497 -8621 -6964 -1948 10140 10138 7184 3541 -4863
20261 -4863 -6730 2271 5168 2516 4833 4794 4865 -3258 -202 6426 6707 2325 -3317 -3924 -6243 2700
20245 2700 10897 6934 3754 -1218 -1547 3375 6836 9335 5085 2088 -116 956 1276 2346 -1759
20230 -1759 1105 2336 -4508 -1822 4889 14083 16029 5459 -2258 -4131 -3744 -4479 3612 3530 -2432
20215 -2432 -1590 2068 10145 4596 -947 -6523 -5635 4125 14172 8702 -3227 -10331 -9995 -12749 -13299
20200 -13299 1418 -1010 -2989 2983 5308 1090 -9757 -15904 -12840 -2530 6192 3593 -602 387
20186 387 6075 11796 6428 313 -2751 -2702 1473 4446 2647 3443 3949 -432 3689 6020 -3793 693
20170 693 7267 8703 6638 686 -9781 -2661 5874 5485 10894 13885 10563 2457 1663 -783 1885
20155 1885 1140 703 -1073 2169 5686 2866 5855 11100 10754 8180 3532 -3776 -6910 -601 2424
20140 2424 -2095 -2502 -4822 -4007 -7825 -4141 -8258 -13120 -5944 -4726 -10385 -6057 -8513 -6417 3881
20125 3881 1500 -2286 -6190 -5551 -4245 461 -2368 3733 2657 -5149 -229 4131 3014 7119 5222
20110 5222 4351 749 -1759 -2148 -4103 -1378 -1626 -11955 -14423 -11390 -8018 -6336 -4332 1279 -425
20095 -425 2755 8974 8343 -5114 -984 4784 1705 -957 8526 11936 13950 14037 6759 8071 5464
20080 5464 9979 11359 6821 2095 565 4653 1976 9670 6850 4154 799 40 -2050 -2949 -714
20065 -714 5354 6234 2975 9929 844 1180 5508 4491 7786 10791 7847 3485 4331 5826 -272 -5993
20049 -5993 -8553 -13135 -14125 -12202 -16501 -18732 -14001 -8480 -11417 -13769 -11165 -5301 1082 2216 -19
20034 -19 -3259 -6424 -8633 -7082 -3966 100 1433 -5760 -11087 -7894 -384 5955 -334 -5642 -8033
20019 -8033 -3836 703 10802 8646 2967 -4578 -5006 -987 3974 1796 -3906 -5632 -8088 -6389 1538
20004 1538 7396 10605 8418 5721 1675 2547 -2724 -11824 -3646 6573 4244 1501 -3141 -14414
19990 -14414 -11336 -10970 -9802 -8953 -8037 -1425 782 -1287 -6295 -4660 -3508 124 -6549 -11217 -2795
19975 -2795 4954 2582 3230 9429 5131 -374 4202 16972 19486 12179 8773 6012 5552 8228 2341
19960 2341 -1454 -953 -3283 2478 9892 6164 1508 3404 5899 4822 145 -11170 -11445 -8528 -8488
19945 -8488 -10533 -6986 1587 -7675 -9676 401 288 -8861 -8886 -5085 -6062 3036 11662 15683 14928 10263
19929 10263 6365 6035 12951 7456 3986 5555 9000 3050 1390 6487 9067 10008 12380 13589 7639
19914 7639 1065 -3991 -8784 -6131 -2019 1593 2657 7440 6954 1346 -1046 -1779 -4297 -946 2243
19899 2243 581 -840 -1545 2130 13067 13596 13826 10838 15225 13596 11111 6614 2296 928 4116
19884 4116 4244 5454 4578 8277 -391 119 6588 7954 -1231 -7722 -4025 4408 3605 5726 1961 4195
19868 4195 12237 16792 18193 18647 18995 18681 13025 5856 753 3262 796 2237 -1878 -6412 -1499
19853 -1499 -1053 -8654 -12065 -4809 1139 5728 13653 7853 6770 11426 7639 8310 13361 9340 6926
19838 6926 10074 15316 14297 18773 18494 11220 4847 9013 10340 7128 8578 3656 4026 4607 4657 2967
19822 2967 -2541 -1721 5814 10837 11205 12998 6574 -472 -1233 -1394 -3792 -4117 5071 14629 20552 16648
19806 16648 11457 10150 12482 13980 13011 11775 1318 -8774 -4000 1990 3436 1742 -3440 -3989
19792 -3989 1629 1412 7311 18203 10314 11427 17428 18418 15201 5496 3926 10244 14106 4844 -5893
19777 -5893 -1267 1174 1229 492 -1183 -2052 -1835 -4032 -5860 -7502 276 7585 1454 -1131 -5182 -2530
19761 -2530 5026 4992 5107 3213 3574 5156 9814 18588 16097 13880 3756 -1618 1852 4008 1943
19746 1943 -2196 -3686 -3812 -4976 -2107 -767 -4232 -8380 -7151 -2524 997 -4879 -3297 -1857 3067
19731 3067 7585 10034 10935 9767 -3918 -7554 -5218 4445 6562 8426 7877 6961 6878 10804 5640 -1406
19715 -1406 -3341 -726 3746 1387 7684 9906 7469 -1571 353 6099 8746 10977 7342 2910 -587
19700 -587 -4681 -4618 -1147 -3949 -4798 -2584 2284 1790 4361 3202 5440 11002 11570 7285 5473 5980
19684 5980 2548 8892 7751 15979 15957 5006 1769 -2195 262 -3313 -3583 4663 9910 9857 11962 15986
19668 15986 12988 10155 14659 14602 5347 -3671 -5313 410 -1723 -2271 -5883 -7969 -2634 7736 6208
19653 6208 5970 -482 4281 1317 -927 -11040 -12711 -7591 276 2119 5449 3215 -4071 -6009 -1387
19638 -1387 -8689 -6248 -3861 2285 2986 -1069 -2994 2762 4892 9990 9978 10317 1391 826 6118 6603
19622 6603 249 3821 6935 13340 12709 11492 10600 8800 1935 -5571 -2505 2985 -3883 -1854 -1994
19607 -1994 -11083 -8649 -8848 -2266 8200 7274 1362 2998 3539 6594 8415 839 947 2744 -1912
19592 -1912 1794 7350 5171 383 3222 7247 16277 18363 13954 8469 7241 7071 3770 3184 2383
19577 2383 -257 -5736 -2923 -1954 4506 6340 11225 17558 14236 7378 6720 6763 5611 8460 9176 1809
19561 1809 1496 10686 10503 5753 7118 11708 4247 6507 6197 -482 1465 625 1520 -377 7847 14947
19545 14947 19599 20053 16495 9100 -4327 -10071 -5867 -4890 -5019 -5814 -9916 -9806 -972 944 2806
19530 2806 -1942 -3234 -2608 -7263 -12226 -8755 -6163 -475 373 -383 -990 -7156 -6440 -2788 4539 12390
19514 12390 10148 13639 3490 -2228 -1099 843 -1685 49 7972 9610 3991 4722 5885 1928
19500 1928 7806 2221 -5510 -4578 -2440 4022 7173 11324 16127 5215 4355 2684 3346 3129 4577
19485 4577 3674 7363 8451 3865 3448 9285 13706 15824 12651 11590 10180 7805 13793 18179 11084
19470 11084 2878 636 2577 7726 7721 6210 7177 12782 9637 2512 -4007 -719 3612 5643 8165
19455 8165 10080 4868 -334 5199 6312 3139 269 3395 6987 11472 10167 12233 15694 10661 8537
19440 8537 6228 2650 9001 10332 1303 8980 12285 9291 9080 15088 12106 10472 8278 232 3249
19425 3249 8767 8638 9253 7569 3720 3621 3143 4367 1651 -1233 5755 11953 13658 20570 21708 20556
19409 20556 16783 12119 12540 14416 15578 21337 21855 16932 6998 527 -628 3484 7559 5877 4267
19394 4267 -531 1428 1516 -5231 -5567 -6167 -6009 -3059 4169 6079 379 -1042 1755 823 -2485 263
19378 263 -213 3357 -176 -4885 2239 2676 4643 6963 6807 7956 11004 2785 2030 4338 10883 10995
19362 10995 8636 5240 4247 2552 -4602 -6857 -6920 -5541 -5570 -8679 -2867 2754 -4945 -8432 -8267 -11795
19346 -11795 -6472 1073 -2593 -2047 -479 -591 2225 6460 -79 -1119 -2157 -8718 -6949 -4754 -2577
19331 -2577 461 1215 -2023 -224 -1487 4227 3505 4259 4673 7569 9034 11328 10121 6444 983 -732
19315 -732 -5494 -3219 7206 8555 -506 -11583 -6374 7994 13287 11934 11397 14102 15209 10498
19301 10498 8848 5695 7308 3198 912 -1454 1953 8668 6150 10928 3340 -229 -579 5929 7070
19286 7070 2742 1634 839 1215 2378 -810 3703 6076 -6173 -16895 -8739 -8433 -2285 -2201 331
19271 331 -2070 -8220 -4190 -1372 4511 13048 17578 10672 -493 1331 3527 4586 3388 3055 965
19256 965 -5429 -2288 710 463 -2313 1388 5284 1385 3752 7469 8288 6213 2171 2544 11505 18021
19240 18021 15286 3379 -1165 6315 7601 4918 -1950 -4561 -3006 -488 801 1975 3389 8024
19226 8024 14429 14491 15820 9975 5930 5356 9584 13322 12868 6153 2543 7702 18669 17038 14044
19211 14044 5403 2793 3852 6549 11058 13386 5119 5702 10541 9600 13005 15377 10438 12236 16157
19196 16157 13422 9242 7920 7151 7283 11119 19133 12439 11102 6931 3607 3645 1593 1905 3418 9852
19180 9852 14723 9950 5275 11033 9464 5144 2587 -299 2490 10429 7943 9200 11996 11038 8397
19165 8397 13464 15616 10686 9561 8213 2350 2816 3375 4044 -1812 3425 20120 14585 12508 5705
19150 5705 262 8229 12058 18327 12624 10110 11938 14751 8221 10297 10704 11731 9892 4628 7238
19135 7238 10188 17688 14580 9445 9368 6055 7156 14479 15428 22546 27772 24882 26746 24691 19662
19120 19662 31790 38952 42105 42501 43195 47997 71873 94544 116986 150752 181491 198767 198196
19107 198196 178817 158628 136939 109825 86154 81967 89668 101149 110147 121619 152737 187760
19095 187760 201249 195711 182405 153795 117362 95301 74061 63951 53251 36544 28105 30113
19083 30113 30505 26916 26268 25876 17907 8214 4436 2799 6262 15725 15772 19496 15630 7416 11120 14464
19067 14464 19279 21050 22520 23380 30886 29035 15178 2242 2793 7477 13350 16761 15460 20505
19053 20505 16986 15665 16739 17870 17568 15982 15431 16555 14827 15812 14843 17449 21886 22539 17887 16677
19037 16677 9080 6466 5402 6318 5326 14172 21603 17417 12408 17084 14165 7456 1838 2924 829
19022 829 -665 -219 4178 7596 12784 16242 14418 15327 15166 13296 9676 2831 -7211 -2326 5533
19007 5533 11766 17715 15234 9369 7625 13923 13921 12668 13847 10953 11445 13846 20876 21739 13555 10755
18991 10755 13033 23831 32073 33216 27760 23582 24142 23671 17440 20145 17485 14698 9760 9306 16381
18976 16381 23439 19852 22377 27084 28272 19935 17005 11750 14728 23707 26786 27886 19925 19492 18891
18961 18891 20028 25660 27438 26796 25919 29822 20618 12883 12200 10202 10314 13190 16950 23971 20565
18946 20565 18373 16581 11254 1276 -6158 -5095 -5413 -437 2611 4504 9193 6745 13946 15534 16481
18931 16481 19962 17323 16630 8528 7122 12146 14164 14243 19732 24119 18699 13015 13383 16171 14911
18916 14911 12271 10898 8197 11657 4912 -1021 -4519 604 5825 15925 25999 24049 23625 22670
18902 22670 20933 23364 14884 11437 9472 7213 6195 5254 14113 15295 14537 11570 20041 26063 21740
18887 21740 22354 17800 15990 11033 9253 6823 5927 10088 17150 24325 21786 26165 32088 32104 31963 33402
18871 33402 28210 23520 19320 15578 12429 13586 13999 12096 20101 21585 10685 8948 11112 12144
18857 12144 15002 11058 12902 15711 8809 8036 12939 19264 22096 17790 15654 17320 21501 24182 19937
18842 19937 16631 18002 20455 21955 12548 10579 13670 25766 31230 33865 29417 26246 24373 31808
18828 31808 40230 34521 27108 29848 31881 25435 22830 24077 23344 20955 21456 23109 19708 23566 26535
18813 26535 24460 23953 23056 22781 27068 31147 36049 37879 34349 26609 22108 21209 21170 23898 22458 20969
18797 20969 33120 44979 43481 36851 34368 34275 31594 31882 32120 27360 30598 38142 46522 48836 45996
18782 45996 38901 43594 46029 34388 26914 24068 34563 44613 40186 42088 49427 53010 59375 76545
18768 76545 103451 120772 113310 89326 74111 69657 66957 62266 59439 52848 44700 46559 42026
18755 42026 42767 51396 54549 57026 60248 58122 59818 63184 62618 60320 51883 44132 45410 45487 42117
18740 42117 44220 39016 33626 32709 36613 36830 30107 26414 20999 25246 27289 26258 37760 35853 36251
18725 36251 42646 42559 39641 39821 40657 44780 47058 39188 36028 39972 37550 33290 31793 36419 42550
18710 42550 40545 36445 35820 35749 38376 34642 35825 43347 49434 48284 45168 42244 44737 41850 28488
18695 28488 33945 37933 43182 40282 41524 40578 38376 35544 31009 33192 36989 35917 37811 46015 43237
18680 43237 31915 35280 47306 50796 52522 55612 57066 56558 51220 49097 51275 50449 50331 50826 50400
18665 50400 55745 64222 64094 63520 58108 52903 53431 60144 64945 67180 67122 67044 59627 54117 54220 56316
18649 56316 71298 83724 93361 97868 97063 89991 88905 84353 75463 71616 71735 71004 84032 83262 74105
18634 74105 72510 75271 76996 84408 86509 87493 89762 95796 93653 93483 90162 93364 93984 88150 90164
18619 90164 99444 99043 90463 86994 88701 96251 112107 118500 115767 114789 115557 111243 115650 119312 115696
18604 115696 112100 106959 110639 115129 117613 127088 132116 141929 148781 152551 149801 147510 145008 153223
18590 153223 157937 163907 169213 167466 170995 175220 187253 192266 197228 201690 209929 217788 221634 227385
18576 227385 236551 244662 245426 249194 251386 254879 263688 269750 275230 285932 294421 311009 332647 343389
18562 343389 346725 355474 363531 376958 396935 416122 432453 454176 471926 480438 488293 520991
18550 520991 564856 610609 659857 702833 723645 757833 800804 836000 865046 886022 904717
18539 904717 939323 984493 1041292 1121519 1227764 1330642 1415574 1515486 1641373 1788364 1953566
18528 1953566 2129140 2295820 2467512 2666582 2905912 3209135 3608448 4117372 4754872
18519 4754872 5574087 6659019 8125458 10140738 12887224 16601988 21445295 27142308
18511 27142308 32361301 34857623 33400625 29140816 24214452 20100583 17280239 15685767
18503 15685767 15191330 15750360 17418664 20336395 24582234 29794675 34529474 36400386
18495 36400386 34142408 28970818 23093530 17970001 14019957 11112197 8985672 7405494
18487 7405494 6221562 5312678 4605244 4041913 3585967 3214682 2907697 2654618 2425375
18478 2425375 2235066 2073985 1925972 1789922 1658487 1544212 1453447 1376442 1300416 1219830
18468 1219830 1156572 1112891 1108123 1138629 1170049 1151129 1071205 961617 851060 766443 701489
18457 701489 650664 620541 593004 560569 540849 535487 552021 555455 521851 463277 401638 357838
18445 357838 316037 285064 264182 249808 235424 222387 213928 206906 199963 191728 193375 188182 177905
18432 177905 166689 155410 145543 138327 139164 135514 131336 132680 136960 138834 130336 126428 125371 121957
18418 121957 120837 120353 119088 118008 110101 105574 101408 93772 90532 85378 81222 86799 94891 91162
18404 91162 80858 81534 86618 91460 92236 90121 89638 84374 82339 77186 72767 70623 66695 68492 74468
18389 74468 75714 77260 76871 77757 80634 77779 79633 83367 81322 75990 70662 70932 73494 70101 64696
18374 64696 66172 67989 71411 78309 80214 73468 68577 69045 60636 56826 61497 67814 67098 60417 57555
18359 57555 48839 45699 45720 49919 47466 42589 32754 30481 36043 41578 45961 45397 38884 35284 35312 35520
18343 35520 44404 48422 47197 50921 50814 54325 51855 52290 48806 43011 38757 50319 61379 63532
18329 63532 58780 65798 70892 66703 62153 56870 52035 53895 60147 57837 63307 67422 65449 69040
18315 69040 65801 58653 59975 65948 72649 69418 69179 64661 56363 48462 48348 46620 55271 61692 60077
18300 60077 57891 51219 39714 40237 49475 59014 56861 62042 78148 81892 74454 70804 68970 71907
18286 71907 67107 68960 68688 64772 57030 47660 41237 39894 41877 39328 42651 46086 53060 55162 42090
18271 42090 39660 41694 47502 46514 41208 46861 55923 58389 51175 53747 56392 61390 71473 73057
18257 73057 66091 62518 49556 40449 35473 30753 28874 25161 23653 29060 37457 45079 50253 49837
18243 49837 45081 45214 37855 24396 26474 34732 37954 27598 26177 42097 44877 47001 43509 35006
18229 35006 33752 38664 41396 39504 38709 45857 46276 50077 49243 47723 46717 50887 49836 47184 47552
18214 47552 44595 42869 45912 51671 41559 32497 23957 26792 28405 25278 24438 17811 15205 23078
18200 23078 25816 20787 24736 26534 31258 36575 39309 39534 43677 40672 36042 35768 38772 33395 26044
18185 26044 29429 33626 30800 26903 31613 38021 43456 49304 50755 47384 34488 33092 37981 38981
18171 38981 44055 47666 35069 34179 42448 43387 43278 45526 47461 45338 42068 31487 27963 29838 32885
18156 32885 46863 54834 53754 53948 61948 68638 71922 70442 68889 77892 93428 105928 111892 108001
18142 108001 96608 93976 98639 99961 105183 108989 112317 105799 102752 107911 118191 137630 156796
18129 156796 166522 173423 179681 193988 213762 233383 255468 282983 327855 398361 475568 564001
18117 564001 684036 856256 1122520 1565959 2300883 3503110 5681679 9815657 14863755
18108 14863755 14468723 10129307 6011450 3579928 2341440 1673308 1270687 989999 786865
18099 786865 653131 543974 468304 416530 358855 311746 282016 264120 239140 205583 189031
18088 189031 180707 168241 154036 144628 136281 130782 124222 106427 96886 86077 73896 72846 69678
18075 69678 62403 51146 39694 36658 38359 41810 46581 53711 58152 52993 47624 44500 40948 43924
18061 43924 42458 37240 33813 28957 35202 44663 51095 51326 55997 54736 51228 58128 67279 71284 70226
18046 70226 60777 52121 50063 52607 63652 67504 62434 61460 54023 48043 47495 49124 46976 42768 39280
18031 39280 36097 35783 39415 47804 58896 60739 60195 58634 55449 63852 64292 62115 56562 49824 46342
18016 46342 49243 53910 61073 69766 70515 71398 71270 72819 73353 66186 58276 51970 43068 40154 42026
18001 42026 44977 53366 61084 63550 72856 75154 75834 86600 89193 90469 96041 93820 98372 104056
17987 104056 101927 103651 99264 96224 104878 113112 113482 116682 123878 129736 126213 127369 127255 118164 115647
17972 115647 108721 108939 112224 114784 113042 110967 108857 109849 110378 121002 130464 132458 141456 148469 145827
17957 145827 144940 142894 146656 149460 161206 161531 166316 175098 176072 183435 200517 216873 224452 224775
17943 224775 223688 229471 237162 244859 254955 267970 278235 288270 292784 298763 304363 316155 337181
17930 337181 346475 349721 359844 379438 401064 422545 449312 467523 484361 513099 542041 562842
17918 562842 595644 650430 721321 807679 923216 1065476 1187375 1258089 1317145 1405895 1546525
17907 1546525 1743282 1981217 2208534 2418244 2659637 2995517 3468608 4129193 5075995
17898 5075995 6426335 8391380 11357260 15924366 23141105 34007787 46153282 51278312
17890 51278312 45298009 34155770 24254979 17782760 14096453 12199701 11599403 12191423
17882 12191423 14117686 17798124 24132167 33994735 44935963 48965378 42474962 31349322
17874 31349322 21600700 15082110 11020063 8385901 6608601 5371041 4437975 3692037
17866 3692037 3111640 2689507 2368999 2103370 1870635 1677313 1527485 1404374 1299881
17857 1299881 1223302 1177209 1130771 1042963 918315 794810 699376 626525 562557 503456 455992
17846 455992 417766 381904 353516 329596 312043 294318 275408 260981 241723 226951 214791
17835 214791 200451 182955 160807 143085 132184 130559 125438 121489 113355 112039 107834 93758 84142
17822 84142 80981 79429 74124 65744 60373 65776 64167 60990 58045 50994 50181 56933 61889 60212 51709
17807 51709 47815 49100 48855 52206 60147 66523 71338 64928 52293 45081 39855 43916 51533 51336 45992
17792 45992 44436 39112 34378 32326 41428 43548 32346 28611 35430 34571 31891 33063 27877 24432
17778 24432 20235 16508 11298 15946 19437 15203 15860 22709 25136 29487 33752 44085 59017 63275
17764 63275 50879 39905 35349 34720 30325 32824 36446 41639 40773 34246 30713 33335 42893 52872
17750 52872 52549 51121 48135 44906 40445 35187 28060 24898 20970 12347 3632 1084 1637 4219 4098
17735 4098 6675 9949 11647 5982 -2894 -1029 1749 2700 9300 12675 15615 12231 6379 7078 13529
17720 13529 8800 -4384 -6348 -4330 -6915 -8554 -5699 10669 8874 9085 11595 15230 12913 10886
17706 10886 13968 16346 23527 16075 10577 6972 7995 10211 11385 8975 10949 13795 7837 5299
17692 5299 8112 7020 3682 3171 1694 -8970 -9267 -13012 -8960 14 -4689 -8006 -6509 -8384 -13976
17677 -13976 -6328 -6093 413 9401 9786 5596 5994 5819 1510 -1810 -55 1000 -1034 -5846 -5098 -1202
17661 -1202 -1670 -1453 719 10193 11110 14186 12186 13698 15098 16478 14335 11184 8531 12481 9308
17646 9308 988 3280 2619 3910 1119 -5310 -1363 -4738 -4441 6320 12913 4146 4797 6668 7736
17631 7736 2495 -8252 -3852 3751 6231 2407 -3010 -4807 -1966 -5624 -5550 -4532 -8215 -6060 -5048
17616 -5048 -10373 -13201 -7876 -738 5765 3992 -1958 -3023 -7854 -8604 -675 -4011 -10962 -13521 -6007
17601 -6007 -4832 -6130 -6496 -6130 -6031 -4689 -5546 -10417 -4678 -7813 -11786 -12009 -5446 4942 5286 -7352
17585 -7352 -9236 -2888 -5201 -1879 259 -6875 -10648 -13697 -18488 -25010 -21010 -13156 -9596 -5037 -4096
17570 -4096 -1354 4732 14348 13759 13738 11447 10045 7583 6266 4856 1447 -388 10379 13362 12308
17555 12308 19045 24602 24741 26030 30601 25345 25902 25945 26207 26246 21799 25129 23569 24162 27537 30307
17539 30307 30741 27374 17053 13310 12438 11563 8295 9918 2288 4408 3139 -3791 -6285 -13561 -15202
17524 -15202 -15130 -11242 -7804 -9193 -4607 1941 6676 16777 11947 8888 9452 14221 15049 17841 14731
17509 14731 15173 11032 10140 8622 -2262 -8909 -10427 -10348 -12139 -13846 -15765 -14859 -19024 -18678 -16726 -16887
17493 -16887 -13999 -14787 -12203 -1961 -1895 -7894 -12031 -12510 -19320 -21560 -15174 -9662 -11546 -18164 -26540
17478 -26540 -28718 -30837 -25997 -11964 825 -4014 -17560 -18607 -10170 -3824 -2037 -773 311 -6300
17464 -6300 -5984 -6492 -7434 -731 -14874 -23496 -26316 -21383 -14541 -8523 -12635 -14976 -14864 -8792 -12981
17449 -12981 -5274 -3132 -1547 2333 11779 33746 66231 81565 57735 34915 26453 12221 3297
17436 3297 -2132 -5900 -9200 -9633 -12814 -10312 -7040 -6241 -3360 -1810 1724 40 -3194 -6961 -6581
17421 -6581 -6096 -1827 -3626 -6509 -16220 -19804 -17229 -10437 -5629 -7080 -3758 5998 -942 2789 6883
17406 6883 -2447 -6253 631 8438 7010 1713 313 -4307 -9404 -7610 -5278 -5124 -8743 -11833 -10500
17391 -10500 -9919 -5826 2143 837 -981 51 -2243 -9582 -8723 -7667 -3616 -5356 -756 -5523 -9918
17376 -9918 -4165 -4604 -7272 -12017 -14938 -10079 -6828 -1531 2798 4728 4134 6682 4808 6948 3974
17361 3974 3598 6544 1950 2337 3155 241 3894 3658 3381 4222 1876 3648 5445 2002 467 786
17345 786 -133 -859 -1473 713 9213 8095 13068 11794 11017 14550 10367 681 158 -3653 -2272 3645
17329 3645 4606 4027 5796 6100 11735 15226 14513 12904 9693 18898 26863 35721 52793 68180 94594
17314 94594 142569 205131 257845 259427 217756 163112 121547 94615 77403 73769 69047 69417 88195
17301 88195 119776 160001 225141 265325 252089 197982 137176 98269 76997 56692 41856 36918
17289 36918 31147 22385 20818 18131 11644 5393 7851 6186 -1110 -6198 658 5775 9136 3600
17275 3600 7061 1033 -6887 -3172 -3635 -9483 -6696 -6739 -12985 -11637 -5655 -2607 -1188 -2048 -1830 -9019
17259 -9019 -15145 -18755 -18055 -16106 -10125 -3449 -1945 1898 -37 472 -779 -2038 1163 2357 -4251
17244 -4251 -3030 -3636 -10966 -4645 1140 4207 2053 -2260 -10451 -4360 -7881 -9017 -2283 -2312 1817
17229 1817 1361 -7963 -13079 -18784 -15175 -8222 -11190 -22577 -23414 -14246 -5495 -9104 -13764 -14967 -10867
17214 -10867 -10652 -11387 -8322 -10976 -14992 -7423 -6422 -8450 -7515 -10565 -9423 -14069 -10209 -7408 -4703
17199 -4703 -5945 -7706 -5014 -10460 -8421 -9678 -6674 -6777 -2689 -570 -4880 -4811 -10833 -6473 -6
17184 -6 -3217 -9181 -7676 -8028 -10306 -11334 -6054 -1288 -9846 -7651 757 1970 -9024 -23240 -22033
17169 -22033 -11191 -8567 -11752 -21629 -26224 -21958 -13917 -16610 -13142 -11566 -13944 -16966 -20489 -14264
17155 -14264 -8248 -5467 -7658 -5086 -1232 -584 -4228 -6872 -6468 -15308 -12923 -6834 -9963 -13950 -14070
17140 -14070 -7503 -6605 -11242 -13230 -13542 -13502 -5748 8418 10883 7416 6726 -1192 -7696 -7967 -11296 -14932
17124 -14932 -8728 -1085 5427 6761 688 -2559 -3255 -9800 -9183 -2019 -1307 108 -589 -6410 -13934
17109 -13934 -15377 -16081 -14750 -18462 -13361 -9984 -6394 -6305 -2624 -21 -5856 -12423 -18563 -17370 -12125
17094 -12125 -12269 -12472 -13782 -20914 -18277 -8086 -9633 -6650 -3386 -7479 -6351 -6958 -10196 -11973 -12326
17079 -12326 -7725 -5991 -6940 -2343 -1192 -3355 -2039 -1886 -1337 -405 -6228 -5715 -2089 -6041 -268 3206
17063 3206 630 354 1339 922 -2304 -12336 -14461 -9245 -5457 -4017 -4891 -6170 -9314 -7102 -5203
17048 -5203 -3221 -8567 -14356 -11582 -7654 -6990 -14744 -15790 -12650 -11839 -5295 -5368 -5174 -4421 -5236 -10318
17032 -10318 -15714 -20552 -21109 -17607 -15658 -8245 -4555 -2954 -6131 -16952 -9186 -2484 -927 -4654
17018 -4654 -18320 -22171 -15632 -9353 -6076 -5178 -8316 -679 -8727 -14817 -5017 3445 7492 4718 -2467
17003 -2467 -8823 -16266 -19647 -10985 -6323 -6122 -11512 -12808 -12118 -8513 -10285 -5710 969 76 -2198
16988 -2198 -561 -7641 -6694 -4027 -11504 -18136 -18673 -10197 -844 -6553 -16876 -18420 -9869 -9009 -10771
16973 -10771 -11840 -11249 -8806 -1127 -1249 -5224 -7404 -8094 -3 281 501 1296 -6038 -8192 -678 1267
16957 1267 -8185 -7421 -3570 -2829 -2251 -5661 -5795 -528 -5879 -4473 -3253 -2558 -7284 -5803 -2499 -6226
16941 -6226 -10286 -8617 -5793 -4163 -11454 -17579 -22799 -17292 -7916 -10751 -12394 -11469 -1270 6620 1554
16926 1554 -2574 -2886 -6567 -11635 -6451 -5930 -5370 -2758 -4577 -1943 594 1603 4718 -1044 -6484
16911 -6484 -1273 -1036 -4720 -2996 -3155 -4432 -5724 -14291 -18319 -17505 -22267 -22060 -10614 -1219 -2979
16896 -2979 -5351 -5578 -539 -1957 -4445 -10038 -9398 -4003 -8480 -12263 -19371 -21378 -20495 -14921 -13517
16881 -13517 -12158 -12859 -21325 -18696 -10436 -8733 -8052 -6308 -7414 -9485 -12037 -10661 -3059 -3847 -2876
16866 -2876 -1977 -944 -249 -192 -3664 2739 2817 -10284 -15982 -20703 -16887 -13026 -4498 2833 7517 7992
16850 7992 1501 1075 8688 4882 254 1064 5596 5546 6660 7809 1415 -4321 -13350 -17975 -13562 -17367
16834 -17367 -19576 -13463 -3542 4780 1718 -7786 -2665 -4155 -15565 -12397 -3258 -1314 -1966 -9012
16820 -9012 -5373 -8901 -9428 -6962 3677 6331 2544 -3043 -7351 -6039 -7207 -9286 -7340 -8399 -15229
16805 -15229 -15994 -8005 -9406 -13301 -8849 -7717 -2517 228 -4268 -9856 -8089 -7143 -12856 -7282 -145
16790 -145 4200 3270 -7416 -9408 -7162 -5582 -3215 2629 -2407 2017 -1346 -1537 -4736 -8753 -2158
16775 -2158 -1174 5609 7350 -112 -1277 -4749 -11798 -8958 -8609 -8361 -8049 -13075 -8175 -9844 -9250 -7433
16759 -7433 -10025 -11352 -11885 -5668 -7218 -6737 -5842 -2752 1572 -6339 -1951 5646 5286 -1566 -10633 -21004
16743 -21004 -21056 -18517 -16649 -10038 5329 10578 2579 2078 120 7679 3963 -4643 -456 6075 2634
16728 2634 -422 -1013 -6459 -6108 -852 7359 11881 3789 -3824 2037 5473 3015 4411 8136 8180 3846
16712 3846 4164 -3184 -5934 -113 2196 8106 13024 3338 -1442 5353 11450 13033 8842 8945 4921
16697 4921 -1556 -481 1089 -996 -1648 4084 6013 3306 -91 -3554 3653 8223 5968 938 1221
16682 1221 1424 -649 1405 -8744 -12608 -11907 -8539 -7930 -3297 2387 6917 10788 6089 686 -3066
16667 -3066 500 7749 6798 3979 2324 8228 5706 78 -687 -2126 1208 3472 -48 -3504 890
16652 890 5079 9260 9252 5625 4206 1901 -646 -2411 1287 4437 -567 3913 2167 -2424 -2698 -1568
16636 -1568 -4673 -5475 -3797 9862 12559 5264 -1992 -2926 -4771 -8120 -13006 -6288 -4337 -9535 -10996
16621 -10996 -11462 -11895 -8978 -18631 -23420 -17943 -11600 -9678 -9184 -2792 -111 4890 10630 8358 -4977
16606 -4977 -3267 -99 2982 2417 -2020 -9609 -13511 -13970 -5496 -5482 -6492 -6137 -1166 -944 -2162 -839
16590 -839 -605 -3529 -3693 -2010 2093 3805 -4257 -6056 -4376 -6667 -5372 -3061 1349 4255 3607 -940
16574 -940 -5622 -5079 256 -17 -385 4265 4754 -4561 -15003 -17096 -5906 -296 -1179 604 -198 1878
16558 1878 2365 -3666 -251 1233 -3956 -4471 -6162 -9349 -2333 -3517 -4468 -11714 -10441 -10290 -9037 -12019
16542 -12019 -12827 -9670 -7775 -8289 -7726 8551 10615 10808 10883 10450 10741 3599 5504 9227 9474 5072
16526 5072 2987 6869 4249 3909 1238 6784 4659 1028 -617 -2448 5012 8953 10423 881 1729
16511 1729 3463 -1190 -6805 -13355 -6028 -2791 -4490 -2111 3494 6428 2592 -8092 -18773 -15125
16497 -15125 -9797 -2142 3277 5914 2566 -4747 -9433 -9064 -13329 -8492 -5772 -2554 -1765 -6558 -8746
16482 -8746 -2976 9642 10138 6099 -74 -6216 -4302 -1601 2607 -510 -1955 1345 2518 3251 633
16467 633 -3776 2624 4465 2658 4811 7330 3911 2615 1547 4435 -308 -2929 316 838 -4877
16452 -4877 -4503 -181 4741 -399 2768 5527 6050 2628 3558 3754 -1606 -8049 1586 9927 3051 132
16436 132 -3942 -17448 -23419 -19394 -17830 -11949 -3144 3918 4332 510 5173 5406 4773 3529 3353 128
16420 128 -6820 -7178 -10674 -10716 -10544 -6744 -15070 -18572 -15122 -15746 -12368 -7551 -3115 -7053 -10830 -12457
16404 -12457 -7634 3395 13475 9953 767 -8572 -5205 -5411 -10869 -13713 -4326 -3712 -8298 -14424
16390 -14424 -18402 -16301 -16720 -14372 -6750 -9002 -9273 -1368 -5541 -6529 -23 2581 2688 -1346 -5184
16375 -5184 2369 12374 17331 7898 2128 -3321 -3283 -641 -2136 -135 -1860 -2024 -2944 1190 -736
16360 -736 -7596 -11292 -13411 -13247 -12048 -11208 -7697 -3899 -566 2627 4461 11417 12560 5683 162
16345 162 -340 -4131 -13453 -4792 74 -526 3277 3891 1075 -4039 -8068 -8117 -17057 -14571 -9851 -4924
16329 -4924 -535 -5212 -7924 -6754 -9445 -10659 -12329 -11420 -3727 -4966 -10624 -12146 -6683 -1088 1120
16314 1120 4836 4927 -4093 -10834 -12863 -12495 -9564 -11786 -11278 -13031 -10597 -10327 -11666 -12066 -5526 -588
16298 -588 1652 10394 7456 2213 -1018 -1456 -5281 -6153 -289 10400 13016 8592 6994 -586 -5231
16283 -5231 -2853 -7222 -11712 -13974 -8609 -8176 -5341 -1683 2381 2289 3286 2176 -1551 -6094 -6129 -3807
16267 -3807 -4103 -9687 -13631 -10976 -9639 -2475 2385 5173 1262 5814 8546 10418 14732 6012 -6813
16252 -6813 -13050 -19755 -23367 -19882 -6937 -2890 -9647 -11064 -7024 -4757 173 9279 6490 -2536
16238 -2536 -43 3215 -3035 -142 -163 -10063 -8587 -4749 1195 1818 -3722 -2772 -2580 -1810 117 263
16222 263 2208 1359 4035 9712 7100 743 138 -4337 -2953 1554 -4138 -12506 -13455 -9798 -12451 -8481
16206 -8481 207 4616 8629 5918 -2439 -8833 -7786 -12446 -13179 -8965 -7557 -518 -835 -4172 823
16191 823 13251 6351 -38 -2605 -4760 -1555 3792 11553 10385 3181 -5497 -14102 -16311 -18446 -15314
16176 -15314 -8632 -7254 -9413 -6729 -2946 -10044 -13734 -12115 -12136 -9466 -2153 4453 6862 8773 11120
16161 11120 9588 852 3373 -243 -1606 3283 1307 -590 3219 9801 8097 5971 1166 -2228
16147 -2228 -7688 -5554 -7348 -11217 -10172 -3447 265 -2932 -118 -3179 -998 -3798 4134 8246 9236
16132 9236 5484 526 4390 2510 -7126 -3303 1449 -6742 -13446 -18499 -16430 -17158 -10968 -8305 -2747
16117 -2747 -5852 -12340 -15778 -7117 -2512 5449 2694 -561 -3215 -8597 -15444 -15309 -5593 -4081 -8118
16102 -8118 -3711 -4755 -5355 -1104 -839 2441 -1133 3202 3470 -487 6594 1779 -6952 887 12840
16087 12840 8708 -3942 -6209 -5349 -8318 -2285 544 -356 5034 6385 5437 -1608 -9165 -17779 -11358
16072 -11358 -7721 -10688 -5392 -3135 -2797 -6613 -11995 -12147 -9040 -1256 6520 -1613 -3140 311 -5909
16057 -5909 -5394 192 3011 822 3761 5519 6939 62 -2039 -6360 -8658 -4626 1793 -854 5095
16042 5095 11718 11256 12933 4250 -4603 -1216 3536 1642 4048 7117 2330 8502 5364 1940 -5015
16027 -5015 -13159 -12288 -14774 -16147 -12969 -6532 -1277 4075 11305 9771 3486 6955 2203 -3869 1759
16012 1759 1706 -4031 -9498 -18042 -15765 -5591 418 -1006 -2911 -3074 882 70 1644 -3662 -6124
15997 -6124 -5942 -7050 -6675 -2242 -2914 -9197 -11821 -8774 -2157 -6283 -6216 -2995 1564 2906 2952 -892
15981 -892 -1079 1557 -1032 1407 -6109 -6679 -1447 524 -137 -4776 -7315 -5452 -798 -3120 -13345
15966 -13345 -6938 -305 1519 764 -4092 -6448 -204 6610 4534 2526 4277 -5245 -6026 -2975 -8239
15951 -8239 2754 4743 -1958 2618 5036 6394 4054 488 1099 6247 -369 1828 7461 6124 27
15936 27 -1213 6283 11472 11049 11075 9349 4801 -3234 -6445 -8342 -13563 -10773 -8198 -11283 -6576 -3445
15920 -3445 -11193 -6886 -1756 -6889 -6667 600 88 4040 7001 10170 10666 10839 9088 6582 2319 -4277
15904 -4277 -11518 -3882 -3224 -6211 -8232 -10113 -11081 -6724 -9340 -9094 -7192 -2925 -3728 -8066 -5666 -2900
15888 -2900 -2493 -1264 -2465 -3815 4716 458 -4725 -7132 2938 13178 12813 8446 4706 778 -10646
15873 -10646 -14482 -7899 -292 -4803 -3582 -2182 -758 -3372 -3814 -867 3718 585 1877 4701 3483
15858 3483 124 -2153 -7438 -12923 -8531 -5749 -2717 2524 -3337 -4689 2475 6282 -911 384 5985
15843 5985 -842 -10808 -10990 -10095 -10047 -3562 -6820 -15703 -12554 -10066 -5171 -9983 -13160 -11538 -5394 -1678
15827 -1678 -81 3970 1965 -1616 499 2672 7072 7450 1933 -8369 -11683 -12166 -9471 -9083 -13026
15812 -13026 -13154 -9912 -3858 -3615 -3114 -3941 3487 10193 9075 7939 2713 -8659 -10482 -2414 -505
15797 -505 1133 1596 1038 -1082 -2649 -219 14 -1961 5061 433 -10557 -5569 3453 15581 18385
15782 18385 10938 6085 5441 6629 2554 554 -2301 -5161 175 4536 -2802 -4938 -8973 -8126 2766
15767 2766 4626 -4718 -15665 -10795 -1254 2760 -2411 -4188 -7176 -11633 -7705 2412 4244 -5877
15753 -5877 -9791 -4710 -8067 -8189 -4099 -2131 -1289 -834 -3569 2476 -3783 -2940 1562 -2443 -1510 2452
15737 2452 6869 908 1109 -1284 -3202 -7025 580 7628 9623 -1281 -4978 -3334 -2918 -9401 -9266
15722 -9266 -4048 868 -3450 -7141 -6497 -8912 -10230 -6273 4492 7083 6551 10417 15922 13630 7962
15707 7962 -1953 -4544 -884 -6440 -6623 178 -1729 -3548 1940 8934 10871 11459 10889 9856 5123
15692 5123 5997 -3795 -11328 -13629 -14246 -12040 -13908 -9281 -9585 -11476 -9848 -8108 -5818 -8095 -13375
15677 -13375 -16355 -12753 -5738 -4364 -12611 -13942 -19422 -14172 -14061 -18823 -15398 286 3361 1711
15663 1711 597 2273 -1518 -5523 -6799 3932 8186 12401 5475 1683 -854 -5179 -3226 -1393
15649 -1393 -7925 -7641 1805 5738 971 -8842 -6701 -6936 -4085 305 503 270 1205 -774 208 -5276
15633 -5276 -4848 -5146 -7218 -6593 -3574 -6481 -9569 -9280 -9264 -7821 -8002 -4711 -69 -1212 -1088 2755 8654
15616 8654 9656 38 -11010 -10921 -7949 -5093 54 2226 4004 4933 -5254 -8576 -7517 81 2740
15601 2740 4692 -1756 -2057 -4789 -8130 -3728 -4233 -6862 -16494 -14777 -8539 -7854 -5380 -1896 -3925
15586 -3925 -2011 -1518 -26 2528 4609 13315 10092 5279 -3151 -8871 -4263 -6327 -7624 -4617 -2003
15571 -2003 -1038 4218 6846 -787 -1621 -5107 -6601 258 -3719 -9898 -175 3057 5696 8134 3300
15556 3300 7742 17528 6054 3023 4705 4339 4292 -3031 -7809 -4004 -356 -2498 -3939 482 -873
15541 -873 450 4090 -353 -7709 -14658 -12667 -13569 -14512 -8312 -5353 -8099 -5376 -6542 -8082 -7972 -460
15525 -460 2775 2668 131 -3720 -1941 -411 -1783 395 2062 90 -3083 -6741 -4801 2976 -127
15510 -127 4663 6179 76 -1341 -509 -1359 3804 8594 5568 4697 1168 5318 7803 1087 1421 702
15494 702 4088 -1337 -4755 -4886 -13949 -16329 -6440 -3248 -4973 -6783 -4323 -3679 431 5047 8039
15479 8039 4434 -588 -9562 -13728 -14111 1223 10412 7683 -1775 -7805 -12655 -9545 -14516 -17569 -13527
15464 -13527 -4396 -2373 368 123 2564 1266 1353 2079 -2347 -3453 2783 -96 -1191 -4396 -484
15449 -484 5692 5669 3878 -1376 -5919 -2332 -3217 -2390 -4310 677 2356 -599 -4842 -6617 -3992 -3103
15433 -3103 -3743 -1189 -565 3365 1048 -494 5577 -1095 -1186 1983 4423 4850 4463 6416 211 -7164
15417 -7164 -8824 -7343 -4340 4623 6516 2917 1861 5332 6004 9327 -1762 -9356 -9306 -14853 -17992
15402 -17992 -16707 -15345 -12980 -9391 -19434 -15128 -4453 -4143 -9199 -7808 -11424 -15357 -2820 6804
15388 6804 5821 703 -3450 -7226 -5852 -634 -237 337 4471 4281 -1024 122 5133 4848 -418 -3232
15372 -3232 -1581 -3483 415 4495 6537 3858 -2059 -5277 -3083 3558 6385 6132 7212 8068 6336
15357 6336 -745 2996 4115 3929 1802 5066 2274 3533 4233 1132 3849 -3321 -5019 2773 -986
15342 -986 -7933 1939 4590 -4465 -29 3453 185 1310 10346 7580 4386 1842 3838 1872 6114
15327 6114 9881 5757 1709 -1437 1835 8276 6550 2267 2009 -6894 -3335 4120 4773 -731 -5401
15312 -5401 -2298 5763 10888 15874 13487 12847 6708 -328 3765 872 -4077 -12971 -10811 -7576 -8285
15297 -8285 -7792 -5429 -7488 -4946 -6032 -2637 -4391 -4341 -2575 4827 2122 1296 586 -3026 -9918 -6140
15281 -6140 -6949 -4750 427 5370 2471 2404 -15 -3413 -4195 -13594 -16981 -11633 -1087 -1313 3278 8934
15265 8934 7678 7848 4392 6532 14351 6139 -2657 -97 5843 10384 11673 16226 9143 11430 14562
15250 14562 3568 -4989 -1883 4958 7786 6243 8487 -1835 -6020 -1029 390 3434 10108 4497
15236 4497 2978 9395 9913 12679 7840 4669 -744 4657 12958 11917 9836 6396 3539 9757 10421
15221 10421 9465 6662 2239 6986 7254 2478 -1265 -4349 -2890 -4695 -4437 -1140 -7465 -14092 -5793
15206 -5793 -5190 -6757 -449 4233 -4164 -4168 2828 1421 -247 -1640 7874 2981 1191 3856 3880 4539
15190 4539 9838 13193 14906 13100 7422 4511 -4204 -8354 -2369 1832 5301 5327 6250 -738 -3444
15175 -3444 -3231 -5336 4905 4476 4872 885 -1687 -1060 5178 5854 2086 -5691 -8186 -4152 -3913 -3723
15159 -3723 -2360 2001 3614 -619 -5954 -2282 -1552 5989 15580 15639 12691 6801 9387 7878 10036
15144 10036 13771 6455 -108 -1967 -2103 287 1368 3461 8268 4249 7738 6506 -2036 -4684 -5888
15129 -5888 -8945 -11911 -14527 -9158 871 -1324 -5252 -3602 -2240 -5279 -3575 -564 2899 8823
15115 8823 6168 4379 7513 768 -2596 -5015 -1877 2203 -2566 -11026 -5566 2512 6691 7096 8252
15100 8252 3552 -5847 -4224 2297 879 -4737 -418 2570 3275 2604 1018 -4517 -4606 -4309 -4793 1858
15084 1858 837 3633 4702 6372 3763 8100 5024 13951 19011 7887 -2043 -2366 -3662 418 -1274
15069 -1274 -5584 -8894 -13729 -6261 -7271 -6392 -5281 -5741 -8598 -9618 -4151 -4407 -9885 -13670 -16160
15054 -16160 -10225 -3739 -3440 143 9898 8376 8873 11737 12045 11365 5057 2156 282 -3039 674
15039 674 389 -3619 -6689 -5794 -3306 -6078 -4862 330 1415 592 3794 -2015 -2895 -6165 -4806 -7168
15023 -7168 -3151 -2322 -3945 -2754 5431 6879 4933 3366 -2370 -12148 -2885 5155 12412 14257 12578
15008 12578 4018 -4504 1261 -457 -4937 -3234 -1626 -2052 2441 5669 224 -11501 -14377 -8702
14994 -8702 -5222 -4810 1249 3473 7931 7981 3457 1295 2713 6599 4263 6928 7520 10700 12487 7707
14978 7707 3200 5456 1281 2959 3454 9201 8438 2201 -1399 6413 2715 -1691 895 404 2794
14963 2794 3641 6528 648 -6013 -4919 -7413 -2426 5327 108 -2870 -2594 3799 2783 -4701 -1174
14948 -1174 -473 -3359 3242 1154 592 1867 6526 11747 13502 14863 10610 11125 -804 -2177 6693
14933 6693 11870 15352 17197 13035 9260 7742 9253 8298 6152 2875 -1824 -4694 -3577 4123 14938
14918 14938 15746 11342 9623 7264 4524 -1178 1769 3756 5815 -1524 4313 13041 13440 13612 6871
14903 6871 -1469 -4701 -7590 -8671 -3860 3080 4134 4307 4303 8587 4435 -5786 49 -2911 -6429
14888 -6429 -4375 -3090 -2718 644 1150 -6016 -5424 -6538 -6128 574 565 -6705 -10095 -9162 -9929 -14023 -13004
14871 -13004 -11130 -9787 -6172 -7471 -11244 -13741 -13839 -7385 8878 7830 5969 -2637 -6080 -1118 3555
14856 3555 3819 1514 -3464 -8028 -4174 526 2871 10638 18565 16502 20866 19151 9019 6583 7543
14841 7543 -355 -353 2353 1991 2164 -4054 -6550 387 8280 15318 17644 16234 10911 5199 5536 -670
14825 -670 3161 5145 4029 2840 11526 19677 9908 8751 4777 683 -4197 4450 3374 -904 -5892
14810 -5892 917 5547 3444 4338 9202 8025 8432 7938 -2478 -4602 5433 5337 6046 6117 7933 4213
14794 4213 10 7524 3929 -1848 -851 2409 1696 -4851 -3482 14242 20440 12900 11111 4033 2760
14779 2760 3305 -4163 25 8728 13323 8174 9039 8362 7982 11291 14477 18126 7190 697 7388
14764 7388 6120 -804 -663 8709 17148 22132 23046 19229 13447 6332 728 6562 3233 2062 6839
14749 6839 10985 5697 -7113 -1494 366 -2851 -5633 1111 869 10230 8465 415 889 4178 6691
14734 6691 5875 5422 1749 2641 411 -8231 -9071 -4304 -2999 960 11311 9668 12144 11307 5106 3561
14718 3561 17 1292 407 -6635 -6713 7139 4829 -3593 -4513 -495 1638 -2407 -3740 2740 6503
14703 6503 4747 1924 8042 12595 8456 7932 2830 -1236 3358 2036 7611 4537 -5494 -8816 -1769
14688 -1769 5553 -3992 -15157 -15646 -13237 -6380 4925 15684 17259 20844 21497 8400 -744 -4904
14674 -4904 -4016 -7004 1111 279 -1136 -3185 1843 1612 1643 3353 7704 6625 4666 6348 8820 6165
14658 6165 3103 659 3233 -5580 -319 14701 15939 12707 13578 17306 12455 6659 14002 7526 -1810
14643 -1810 -2269 -1260 2118 3230 2078 2461 1926 2386 3381 11773 7757 -1102 -4635 -1785 -1654 -815
14627 -815 -296 1396 -1867 -4222 -9914 -16113 -14925 -6470 -6498 -9101 -5215 2091 -1716 951 -1999 -4646
14611 -4646 147 1731 -5066 -8200 -1196 1855 2677 1668 2039 4810 12647 12523 15179 14056 7088
14596 7088 4014 2825 2313 8413 7508 11322 5893 3716 3901 -2640 -8819 -9253 261 6643 5564 -2844
14580 -2844 2705 8896 3437 12205 19691 15051 5830 1571 -1121 -124 9929 8568 3592 4544 1197
14565 1197 -1903 2999 3494 -1565 5693 5557 -6094 -14132 -16883 -6958 -5252 -5634 -1628 1755 2569
14550 2569 -1105 440 5676 2724 6590 7987 8531 6510 15871 16161 7051 -1978 2877 -3159 1277
14535 1277 5648 4977 -1549 -5702 335 7902 8609 8527 8864 9705 10140 7013 10710 11033 12120 185
14519 185 4444 6051 6817 8252 1234 -2890 -1641 -1961 -1811 2682 17855 24191 18467 13122 7291
14504 7291 4955 5929 6015 8231 9064 9475 6922 3601 6348 516 -1790 -3426 -4163 647 1616 1537 -2098
14487 -2098 1443 -4668 -8839 -2781 760 1590 2178 3261 -2823 -552 3625 6810 11952 17223 14177
14472 14177 7716 3286 8183 14479 6540 -969 2254 2278 1650 234 -1459 -851 -2745 4214 4822 5799
14456 5799 11812 13739 14913 12018 8430 10438 10542 7126 4884 3535 1890 4917 5213 5970 2695
14441 2695 -988 -8693 -7281 -3420 -5596 -12338 -12092 -4521 -4985 -3201 -6341 -7110 -8486 -10618 -16591
14426 -16591 -16910 -7086 358 2616 5303 4958 -658 -4495 5588 13235 8621 9130 2430 1156 4341
14411 4341 4251 5927 3454 -1364 18 2951 4796 8496 8141 13698 14832 7755 1154 -5013 -2059
14396 -2059 2076 8658 14798 19792 10374 2266 9177 17888 18790 9079 8730 7648 6744 8348 15752
14381 15752 12056 8860 5956 -4474 -2147 1267 267 143 -5776 -6610 -6119 56 11068 12270 9655
14366 9655 3889 3614 10533 7379 -952 -44 2762 8942 16155 15134 11189 11452 17855 20331 15144
14351 15144 12305 17525 19130 13487 7622 6465 4947 -2157 1215 3451 519 4920 11132 8973
14337 8973 3626 5072 1510 1237 8779 1127 -242 -221 -2748 1585 -4485 -3751 266 1228 4053 2731
14321 2731 1764 6360 12728 9405 -452 -1104 2593 1560 7265 7389 -402 -5319 -2145 1191 8639
14306 8639 5467 9713 12649 12086 11204 8638 4654 10432 6692 6478 15422 20617 16154 12433 9693
14291 9693 4047 770 -13 -2640 -6135 215 6550 3909 5508 10518 8270 10609 9125 5361 4785
14276 4785 112 456 1599 -905 5742 10494 6424 567 -2137 -1617 -821 7316 13799 9889 -1197
14261 -1197 -4441 -3868 2163 3153 548 9262 12208 11813 8220 -3746 -7090 -8379 -4576 -4369 -1670
14246 -1670 11940 11770 -2010 -4077 -2424 -8177 -8900 -4028 4856 5722 1510 -2236 -1019 -1315 -2728
14231 -2728 -4388 -3649 -1186 2580 7593 12420 12798 12453 14648 14109 15148 11496 2006 -284 -7434 -7542
14215 -7542 -4608 -74 5273 3180 -4305 -4460 -1770 -3481 -473 4122 9834 8833 3204 8128 11348
14200 11348 9402 9843 3174 4841 8146 11426 10702 5841 4354 8049 10243 14249 8418 2242 5431
14185 5431 5166 8014 3968 -243 11070 10537 16479 22272 16870 15231 11168 14945 26270 25540 23429
14170 23429 25293 18177 14839 16206 14331 7596 -1924 -5702 -7286 4101 7859 8137 4968 -3606
14156 -3606 -4523 -867 977 4882 2752 2204 3520 2383 5161 10718 19038 23049 12764 2683 -5369
14141 -5369 -4629 3716 13411 16644 13486 10042 10072 8105 8131 5830 4527 2415 -5710 -1478 -1796 -377
14125 -377 1284 9036 15870 22789 22932 16991 8816 1673 1121 6282 1777 4850 8860 12413 9639
14110 9639 4460 3911 10016 14417 14888 11217 17584 16469 2585 642 2002 10929 16230 15790 11901
14095 11901 7142 1670 4452 9097 9353 8605 -2754 -2301 6842 8311 11130 14296 16887 13450 12749
14080 12749 2230 1611 4065 6319 7995 17856 23982 21885 10663 9234 13413 14410 3703 299
14066 299 -2289 -2397 6427 6464 -1534 -1144 809 1877 -1455 -9222 -5396 -3547 -1955 -638 2544 6801
14050 6801 18152 20234 16612 15662 12125 10846 15770 23780 19698 15643 8085 2784 13835 16463
14036 16463 22159 25015 16569 10727 9140 2916 7457 10103 2257 4406 4567 8367 14469 19124 18968
14021 18968 12330 15271 24381 17821 14875 3887 -1099 3602 121 -2300 -8088 -8776 -14313 -11942
14007 -11942 -5839 -5458 -2623 -7525 2649 12936 14367 10864 12448 16465 20242 17933 12830 11788
13993 11788 9954 2480 6344 17322 12361 10572 6835 1339 -5016 303 2567 1744 -4257 -2513
13979 -2513 5149 7348 10383 6063 2616 5066 12426 15863 10701 10060 10128 11436 13100 14384 13634 13957
13963 13957 12679 12402 13747 11985 9716 7673 8416 11165 11979 16715 13069 8374 2509 2527 2284 5492
13947 5492 9672 12419 12017 7645 9452 10221 12413 19571 27579 26421 17337 24299 29077 25461 16593
13932 16593 16397 19381 18314 17142 12237 15942 27517 25130 18685 14464 11759 11965 9579 9430 7759
13917 7759 5711 9832 11663 6172 10708 13467 7773 8248 8700 6448 8103 11169 12058 13527 13228 9291
13901 9291 -480 -7120 -8011 -3784 -3048 -3246 12063 20238 18003 21847 25837 23691 15195 20384 26348
13886 26348 32554 43282 54212 67443 83679 113520 145155 170874 170243 145850 109080 70103
13874 70103 49657 38781 31761 30967 29891 20527 19241 17175 12445 9471 1934 1101 7291 7509 11799
13859 11799 16239 18550 20354 12442 6704 9295 19741 20113 11615 9574 10544 11912 13355 15354 18695
13844 18695 13106 9906 15764 17620 10896 14526 10601 -964 -5088 3587 11632 15446 7699 1338
13830 1338 2581 7878 10826 14219 18307 14012 7515 6979 8619 11496 11196 13232 8833 1254 2963
13815 2963 9946 16300 17345 15412 14972 13867 9423 8552 8037 13053 18303 14845 12366 11432 13537 15868
13799 15868 7728 2227 2934 9416 9258 8103 10497 13986 14499 17643 21879 20442 20815 19982 16627 11644
13783 11644 16179 18626 15287 20747 11739 10512 14039 12046 10977 12900 9667 11527 15803 9350
13769 9350 9612 12963 10913 6289 2761 1800 9500 13756 10613 12896 14064 7682 5967 12226 15062
13754 15062 11174 1923 3036 12801 25265 32266 33314 30732 23252 22961 17987 14579 16539 23801
13740 23801 23815 19556 20333 17210 14483 8393 2479 90 9713 8888 4998 4941 4929 8432 7126 3764
13724 3764 1460 4565 10826 18484 24637 22626 26584 27632 20141 15657 24749 25496 15688 16001 13947
13709 13947 16017 19944 23077 27310 24068 21186 22042 25817 26422 22820 20698 19907 21854 20140 14618
13694 14618 8647 11317 16860 23659 18237 17809 16882 13249 13365 11027 12106 18036 15725 15899 14050
13679 14050 15042 14007 16712 24504 17434 19527 23306 20235 18966 14496 16879 22995 21714 21003 29979
13664 29979 36266 26189 25329 32364 31936 29543 23752 22432 17448 23792 22784 26502 32378 28968 25566
13649 25566 14246 19821 28923 32546 41136 35623 24598 18778 15123 10204 4079 12772 19267 20931
13635 20931 28939 27368 21076 17315 11293 7676 21134 30888 34973 37541 39571 41249 46091 50554
13621 50554 52305 49151 48908 50810 51995 62689 76426 84648 106508 147528 199034 268622 368916
13608 368916 521869 784265 1231334 1761402 1858609 1450366 952934 612014 427168 321341
13598 321341 250073 197048 161756 138036 115320 90010 73718 63669 59862 53725 51174 47172
13586 47172 42766 36174 35628 41128 42930 39400 41152 39366 35505 37651 36396 36342 28804 23475 26971
13571 26971 29769 35665 27377 20294 20654 24785 28699 38408 41011 36692 29215 29253 28619 23804 25787
13556 25787 25353 29564 33946 27795 20424 17860 27844 36213 33834 32545 34752 29719 27200 29794 26397
13541 26397 26207 26324 27358 19943 9807 8823 14568 11754 13257 19065 24326 25706 26906 28711 29370
13526 29370 29903 26177 25498 22320 16085 16198 19498 16142 19097 25077 25402 24923 27998 25335 21228 18576
13510 18576 29502 32318 32677 32063 38893 43712 40116 36145 31812 36509 28235 21800 21890 19805 22124
13495 22124 26677 34378 41059 38322 40829 45143 38406 36297 42484 41092 44979 51729 58427 56633
13481 56633 54777 55989 58286 60535 63580 63128 55643 55580 52525 44746 40445 34956 34858 25446 22678 31885
13465 31885 28170 15265 10868 25447 51817 73777 82276 83312 76004 62860 60058 59408 59993 50003
13451 50003 44349 54839 69077 70819 66529 68744 61549 49370 46220 46496 49523 53050 56166 52872
13437 52872 49094 46229 49042 47042 34940 23521 25710 26511 26199 21477 29837 43539 50661 52755
13423 52755 63171 65820 64477 73729 85917 97158 101238 108344 126687 155019 206010 274669 321005
13410 321005 293451 214839 150677 107642 82309 74912 71493 74785 63070 51855 57583 61516
13398 61516 62626 69265 56354 45601 38353 41011 45012 44704 46493 55617 56753 53989 61028 65438
13384 65438 61379 58058 59080 57573 45446 27203 15733 13989 12686 7175 13218 28862 45731
13371 45731 62939 83639 100210 109552 117071 118170 123982 123518 118277 101606 91782 96848 103731 112821
13357 112821 103538 82663 54748 39298 33228 33379 54779 78026 81510 48126 8909 -6518
13345 -6518 -7417 4766 36587 73516 91154 89252 82365 81880 71396 60780 57651 70819 88665
13332 88665 91013 83418 74913 69113 63410 50144 33568 31510 55007 86904 120972 137595 140865
13319 140865 146378 141494 129828 116917 97374 93357 95708 103205 103630 98947 100606 101192 100100 93177
13305 93177 98834 111586 114649 106889 111137 118884 119820 117043 121704 122816 119738 118315 125950 131982
13291 131982 138143 146490 163272 176606 161766 132891 85833 47397 20529 32633 96753 127764
13279 127764 136196 139660 129553 116400 117885 123532 122729 123681 125447 126241 139745 155207 163065 168270
13265 168270 184825 206125 229712 257151 288513 315898 353784 406477 458474 485088 471520
13254 471520 408957 339833 286292 257076 237744 218554 201189 205263 221625 241617 257875 270599
13242 270599 270590 270222 267437 260254 261636 272153 288448 299173 302874 305210 303194 312284 321797 330649
13228 330649 351760 389451 417648 424218 434487 447474 448098 466314 487909 509980 529380 539543
13216 539543 539003 540096 551165 576557 609892 632362 635843 630803 641715 656270 673307 727196
13204 727196 773459 795679 825907 848951 846232 834465 858484 926071 983814 1038465 1109716 1180481
13192 1180481 1238078 1313037 1394069 1460275 1506485 1558020 1651357 1759350 1855819 1982839 2146603
13181 2146603 2335078 2563610 2854302 3203999 3595096 4031002 4534594 5139959 5824944
13172 5824944 6618322 7603186 8966593 10811419 13124846 16075989 20165191 26150289
13164 26150289 34899255 48039693 68405574 101643960 159887465 255235373 345674383
13157 345674383 334782296 248622055 159318643 100398216 68197573 49902921 38188199
13150 38188199 29899297 23707546 19052181 15513043 13012914 11237993 9746425 8385322
13142 8385322 7270828 6425424 5699780 5091262 4620065 4243076 3917668 3601528 3310445
13133 3310445 3039076 2786600 2547189 2310233 2106336 1940608 1763490 1594686 1468182
13124 1468182 1371056 1275802 1205984 1146770 1105064 1047541 988845 946750 868721 772672 697016
13113 697016 654278 625524 596914 583314 562546 535164 504856 466765 418709 384905 369656
13102 369656 365209 364236 342147 306358 280403 260585 256182 264925 269751 267252 249843 232127 212381
13089 212381 201802 214772 233747 237662 235463 235392 228676 212875 209727 203484 195876 189495 188007 179429
13075 179429 168056 156674 147287 144139 147662 164008 180752 195327 192958 185113 188907 190146 181500
13062 181500 170894 161420 143996 126332 112374 100245 92139 85799 88338 97551 112385 130352
13050 130352 158053 190270 185124 166043 144034 137971 137792 136295 136676 141773 139666 136682 138646 140645
13036 140645 156902 185771 217142 277629 350313 343828 284406 237295 196735 164137 142784 126845
13024 126845 114745 104166 101592 93654 83040 83151 78075 72563 76474 74155 69772 59889 52995 49102
13010 49102 57752 63696 65531 61688 58869 52429 48654 56057 58761 47220 37321 27122 10105 -3024
12996 -3024 -13992 -21299 -18927 -7803 26837 64502 80325 81117 67914 60665 50681 44334 43396 42170
12982 42170 41524 46734 60550 79243 87398 88589 92037 88648 63338 60673 92425 128583 148358
12969 148358 135578 103889 82953 72306 68739 73940 81091 82249 67342 39229 20474 1622
12957 1622 -10403 -14506 -11162 -3121 -10257 -24599 -33239 -20295 -11933 -21412 -23042 -14497 -4922 12787
12943 12787 26745 49281 64977 66974 57324 52148 47824 37992 29750 23420 15088 11176 16799 12076
12929 12076 9886 17933 21034 16094 18604 25509 28984 26963 30018 27089 20735 19255 19362 26567 28234
12914 28234 29900 25181 10732 226 1434 5744 14160 22233 29864 30410 32628 30968 14259 -682
12900 -682 -5964 -8146 -7944 -4917 -8816 -4649 564 2723 2088 13514 29268 38119 37514 34874 34648
12885 34648 35623 17780 8639 9870 18496 26250 21520 9047 3408 -576 -7428 -4602 -3801 -11295
12871 -11295 -6281 -6669 -9132 -7557 -2894 -3186 -4167 -9263 -11706 -7004 -7821 -10160 -9244 -16450 -21344 -15096
12855 -15096 -12283 1698 21266 34967 32982 19449 4552 6935 24128 14904 8670 7247 3966
12842 3966 -5109 -18265 -22727 -18641 -18920 -28053 -22578 -20033 -22040 -14066 -391 -1233 -12293 -14756
12828 -14756 -16955 -7323 -2860 -1398 1201 -787 -2253 -5132 -10478 -9132 -3984 2380 13049 18720
12814 18720 17978 11370 2142 -4071 -475 8450 12629 6298 8681 6700 8049 11999 11803 11673 12307
12799 12307 16194 15840 16793 10343 6985 8262 10646 15719 10619 6640 1818 3449 6854 9461 11819
12784 11819 8056 2529 -2724 -3425 -1879 5901 9456 14436 8649 2036 4334 7858 3574 742 8325
12769 8325 6592 6966 9139 13263 16503 6974 -2115 -899 5908 -2077 -9413 -5413 1197 2144 3902
12754 3902 -899 -2869 -1297 1900 5817 6325 611 -5234 -3426 -188 5920 7777 6987 10756 17708
12739 17708 27910 35513 42198 38836 28814 23086 17421 9740 8425 2632 -5259 4118 5966 1952
12725 1952 -544 8830 15233 18721 12841 8020 13314 28753 33001 33930 35360 49456 65521 96378
12711 96378 125984 162576 230666 337775 529020 865527 1393558 1834662 1693797 1200547
12701 1200547 745791 465617 317350 245335 186623 147840 118955 88932 70752 56769 41828
12690 41828 36726 35997 39173 39112 36302 36021 31699 23848 16075 14549 17077 17297 19731 26182 22981 18051
12674 18051 17290 14488 9403 1383 2348 2284 1819 3633 4824 1313 -2216 -2879 -8549 -8962 -12356 -8787
12658 -8787 -10046 -6812 -2213 3993 8874 8109 -1778 -4255 -2957 -9196 -15400 -8501 -4440 -1407 -2638
12643 -2638 -3050 -6266 -3676 1423 815 -725 -5811 -6151 -1047 -5378 693 4709 8622 4548 4117 5457
12627 5457 3614 -1830 -1325 -2168 -3486 -169 -564 -2723 -3930 -2812 1301 -1291 -6464 -3162 -2842 -5508
12611 -5508 -7740 -7347 -11743 -14962 -14579 -21285 -25408 -21865 -17482 -9093 -3852 -786 5313 2137 122
12596 122 5201 5754 -2174 -2294 -3901 -7165 -2464 1100 3194 6378 7343 -736 -5957 -6521 -2524 -1672
12580 -1672 313 4136 2529 2424 3955 1006 58 -3130 -7292 -1008 -3413 -6920 -9874 -13059 -13803
12565 -13803 -17508 -14216 -5975 101 8782 5307 3412 5501 4017 11475 9971 2834 -4554 -10334
12551 -10334 -5369 1597 6699 11694 5755 -9376 -14162 -11703 -4847 6240 4214 1049 -765 -3031
12537 -3031 -1343 1818 3061 6455 10231 3023 -4690 -5548 -3796 -4165 2434 1913 -4116 -6631 -10459
12522 -10459 -6103 -1387 -785 -4999 -4601 1009 3029 -1239 2134 3817 -4675 1953 9531 3555 -5662
12507 -5662 -4684 -3216 -2936 -4928 -4841 992 -2526 -6003 -1543 1378 -4256 -6799 -5793 -7235 -5050 -1714
12491 -1714 -1745 824 -4257 -4052 -6686 -8953 -3569 4131 360 -6044 -632 -980 -90 2103 -5553 -15571
12475 -15571 -8481 -8909 -5451 -2749 -1357 503 -1311 4651 2548 1078 4802 2808 5237 2312 1535
12460 1535 -8622 -17814 -24820 -26502 -19085 -6180 -4573 -6015 -7257 -8141 -10261 -10318 -4489 -3866 -2489
12445 -2489 -6942 -8385 -6304 -5927 -10056 -7186 -5735 2988 6473 2757 -3233 -9077 -1978 -1263 -4690
12430 -4690 -1683 -4894 -9603 -5057 -6302 -5457 -4551 3603 7201 8396 4196 -1382 -2828 -2535 -9103
12415 -9103 -5920 -2853 -7603 -13999 -20022 -27680 -22084 -10824 -3815 2315 -940 -475 282 -3515 -4500
12400 -4500 601 1238 -11762 -10666 -5541 -1293 -1450 167 -2335 -1861 -4577 -3091 -4693 -9885 -9931 -3932
12384 -3932 -2806 -8091 -456 6110 5342 -2943 -4554 -2055 -6733 -6096 -3070 -5823 -297 6259 11013
12369 11013 14271 12098 7315 5002 3002 -9304 -7393 1759 -2133 -2475 -5026 -8236 -6725 -3189
12355 -3189 5614 2570 1442 -6049 -9885 -12697 -8999 -12722 -9649 -4226 -6175 -9685 -4890 2101 60
12340 60 3936 5488 4382 1516 3898 8041 9525 5665 4806 4824 2226 -1544 -5176 -1846 549 2015
12324 2015 5220 260 1269 -4329 -111 -1899 -7787 -8841 -11854 -11936 -8847 -11316 -9095 -3540 -4198
12309 -4198 -6306 -5886 -7015 -10649 -7458 -7303 662 -1062 -4054 3883 4853 -2315 -10156 -18836 -18395 -11936
12293 -11936 -2832 -3852 -4870 -1057 -8577 -5812 -614 -3894 -1132 7978 13483 5722 -1245 -1544 -1224
12278 -1224 -464 -4377 -7751 -8304 -8113 1105 -1584 -4086 -3918 -8732 -8294 -9863 -11811 -12570 -9737 -11792
12262 -11792 -7915 -2113 -6199 -6079 -3288 3759 1726 -3122 -900 -5990 -17399 -17098 -15461 -5801 -8692
12247 -8692 -12594 -16668 -13776 -9148 -7142 1040 9359 9861 11 -7612 -10602 -11475 -7318 415 -1250
12232 -1250 549 4419 1463 1977 482 -1583 -2606 -4766 -13378 -20461 -10171 -3080 -4139 -8406 -9083
12217 -9083 -10337 -7382 -7005 -3464 -2940 -6544 -11749 -12934 -8978 -1320 1353 -1353 3280 9128 5924
12202 5924 -6252 -13011 -4694 -1146 4795 13876 16924 8958 4044 1511 -10037 -10516 -4316 -3485 -7331
12187 -7331 -11455 -3635 -8728 -19124 -19687 -14311 -12601 -13802 -6592 -7485 -7878 -5640 6294 11761 12996
12172 12996 10186 9225 15228 21806 16930 16163 10008 5609 -188 -4951 -7821 -7191 -6464 -9069 -4951
12157 -4951 -2311 -3274 -12928 -16508 -12787 -4392 -4672 -1900 -280 -5251 -10433 -5906 -8659 -4509 -2672
12142 -2672 3494 11398 3091 -1825 -5759 -6358 -843 1707 9857 14140 14645 14275 5295 2144 -7133
12127 -7133 -8003 -7441 -5391 3079 8234 7815 15643 18137 19619 11932 15440 22969 19431 14894 6309
12112 6309 3275 1450 1743 1787 5471 2521 -2786 -10154 -10988 -8022 -10627 -6852 -89 4501 10458 10513
12096 10513 3956 -565 4286 3202 606 -2126 -1882 1009 3191 1891 -2881 -5293 -3431 -1705 -316
12081 -316 6269 259 -6874 -1229 2021 1467 -1575 2530 -3041 -2112 100 3192 6146 4750 3986 -2993
12065 -2993 -881 -2192 1142 -6677 -9261 -8753 -3486 -1162 -3871 731 -1111 -3265 229 -1341 -821
12050 -821 1815 11914 11752 7082 2814 -5536 -11903 -11923 -5704 239 677 -1404 -4231 -7041 -7222 -7423
12034 -7423 -2032 -28 -4401 -5380 -2202 -6846 -7089 -2187 -852 -5029 -3913 -8613 -17772 -17372 -14003
12019 -14003 -16888 -13407 -6318 1620 4371 -2402 -8303 -7609 -10214 -11248 -15456 -9959 -3421 -4606 -4057
12004 -4057 4214 9162 11222 3168 -3423 3160 6190 5951 3271 -2014 4222 8968 10602 -1177 -12692
11989 -12692 -2162 5085 6166 -3399 -5778 -9259 -6017 -3476 -2221 -3617 -3745 -180 -3744 -12023
11975 -12023 -10351 -5428 -4567 -3616 -2374 -1008 3946 9062 2225 -8072 -4824 -4373 -3095 -494 2786
11960 2786 8943 10590 9408 9959 9795 5850 -1526 -8000 -5026 -7228 -11969 -11813 -12860 -5382 -3026
11945 -3026 -5823 -2545 -2234 -1627 -3048 -5409 -5700 -5062 -2705 -2579 -9693 -8888 -6070 -3312 -5180 -4183
11929 -4183 -19 -798 4672 11094 12105 -1039 -7378 -6453 -9001 -15974 -26352 -23689 -16450 -12283 -14812
11914 -14812 -15994 -14960 -11128 -3257 4439 6548 986 -8099 -8482 -8542 -9217 -10968 -10523 -1081 -4162 -6479
11898 -6479 -7771 -6601 -3352 6214 5899 1958 7063 8671 8185 5236 -8445 -7240 3040 5450 -1378
11883 -1378 -6668 -4010 4505 14829 12155 1290 -6154 -14292 -11252 405 -7736 -11674 -4245 -675
11869 -675 -1937 5567 8640 379 256 -974 -654 -2626 -621 -1708 -4753 -805 7205 8584 778
11854 778 3426 5572 6792 6934 10835 18510 20140 8345 -1531 -5181 -4893 -1493 1693 6658 14717
11839 14717 12874 12600 9949 8925 9576 445 -6848 -896 7271 -457 -9328 -8016 -3166 -4664 -8604
11824 -8604 -568 1455 -5940 -6078 -5763 -10731 -11150 -12939 -5365 643 1325 4854 2316 24 -4320 -5066
11808 -5066 -8630 -6573 -7501 -7851 -3751 -5320 -2358 756 952 -4666 -10162 -7308 -1895 -4709 742
11793 742 2757 140 -5536 -13218 -6825 -4190 -5939 -1175 -3888 -4435 -4266 -3582 -8235 -3197 135 3505
11777 3505 -328 -4116 -5510 -11167 -13096 -13293 -8140 -5701 -7659 -6442 2428 974 -1118 -144 -4562
11762 -4562 1950 5602 2525 467 1043 -1123 2511 2585 -4395 -4929 -3894 4233 6541 5719 280 -4028
11746 -4028 3645 3915 2445 1359 -1098 273 2974 6642 4551 2346 7052 3001 -6973 -9441 -7810
11731 -7810 -11303 -13222 -9429 -9466 -11885 -18377 -22035 -15188 -3814 -1547 -6146 -6574 -1455 3294 3917
11716 3917 6639 4568 -4708 -9767 -11441 -7939 -4121 -1058 7783 9760 5898 8398 8159 7610 8630
11701 8630 -645 -5015 -1026 8489 10233 7277 -459 -11121 -4492 -2711 -10910 -13236 -8430 22
11687 22 2857 1463 -1724 -4047 -3743 -4964 -9253 -7212 -6829 -2943 2663 4831 2608 -3695 1220 2193
11671 2193 7515 6005 1616 -1121 -556 8117 4415 3272 4804 1500 -4719 -3419 -393 -8300 -4240
11656 -4240 -2532 -1704 2085 5895 6796 2665 8170 3007 5293 9201 3577 -118 -1738 -3320 -2689
11641 -2689 1402 6104 8259 4221 6005 1071 2674 12134 20181 24841 25311 20787 14699 22099 29499
11626 29499 26193 23793 31860 43939 53679 57711 60092 66804 71598 83660 107097 128198 150130
11613 150130 173867 214003 261342 329483 435101 585090 800876 1086566 1398453 1621540
11603 1621540 1628408 1430075 1138247 861323 648631 501286 390964 316747 265330 226154
11593 226154 194599 173149 153402 131885 114969 107126 98552 82136 63777 60283 57657 52011
11581 52011 46160 36837 35439 37477 35627 31729 24553 23120 22991 21208 19685 19029 25242 29097 34305
11566 34305 22936 20637 16223 9022 12245 20559 24253 23114 14951 13610 11414 6447 7104 4891
11552 4891 10134 15028 16068 23867 28080 25953 22152 21930 25670 29436 31597 30818 26119 21579 14132
11537 14132 10398 10069 3859 7695 4836 967 1586 3580 3015 6934 11633 6936 1892 4612 11203
11522 11203 8740 7624 16458 18198 14054 5635 912 -3526 63 1621 3004 6243 9995 6775
11508 6775 7694 7371 1258 6588 11798 13872 12410 12712 11277 4484 4372 6 -8798 723 8247 6756
11492 6756 14506 21453 22948 24695 28413 31087 23961 17036 14852 21164 26404 30053 34975 36282 45634
11477 45634 56443 59912 67990 67367 73399 88943 94987 100553 111173 142194 173634 199555 233427
11464 233427 271416 334464 420684 544900 734666 1001935 1312173 1576541 1664530 1518067
11454 1518067 1235413 940494 706280 531878 407312 321813 265674 217175 185371 164801
11444 164801 144026 114396 96523 82440 74988 66693 59749 52805 41393 31701 34782 38441 34414
11431 34414 31793 24050 20436 17454 20218 20754 20063 14232 8028 2795 4342 1769 -4945 -5999 -7918
11416 -7918 -12329 -10575 -6536 455 -2457 -2896 -4875 -5820 2925 4449 2664 1708 2092 1257 6969 11619
11400 11619 8240 9112 13306 5480 8054 8245 1244 -3936 -4190 -4400 -10055 -7151 -3910 7068 7197
11385 7197 -177 -4121 -4115 -7072 -12018 -10785 -963 4008 7189 1286 -184 -3120 -990 -4598 -4302 -328
11369 -328 2065 -1262 -3400 358 -2269 -13197 -11920 -4505 1765 930 -2145 495 2240 675 -2637
11354 -2637 581 -8973 -19348 -13120 -8644 -11556 -12528 -14387 -6808 -6817 -5400 -394 4422 4416 5174 392
11338 392 -5590 -6894 -5567 -1869 -555 -3278 -7163 -6262 -4470 -4382 -2720 -1669 -897 -1327 -401 2364
11322 2364 3257 -1000 -4860 -8704 -8974 -6719 -5874 -5325 -188 770 6042 7380 3605 1009 2367 18
11306 18 -3872 -829 274 1181 3178 -3478 1510 -2004 -10679 -6721 -4547 -6199 -4024 -953 -3991
11291 -3991 -2494 -5100 -4782 -5054 -5684 2687 11074 -665 1069 491 -2948 930 4356 5214 4577 2076
11275 2076 4209 2447 2490 -2332 -4709 -4996 -2759 -9699 -8688 3214 7371 4155 -510 -8970 -10745
11260 -10745 -8360 -12306 -11494 -5933 3420 9123 13200 6440 1734 -3457 -7460 -12239 -9294 -3504 -5453
11245 -5453 -8102 -12645 -12962 -6944 -5663 -5864 -12300 -15423 -7238 -7338 -14163 -5079 2996 5034 -389
11230 -389 -10241 -14856 -13320 -7295 -947 5620 4942 -1213 8459 17107 13014 6606 9822 14166 12167
11215 12167 5847 1076 1057 -397 1453 1884 4737 6899 10314 8766 11567 8158 1079 3186 3769
11200 3769 1390 -2136 -4917 4475 6848 728 3015 3301 5792 2688 -374 2476 -783 -3707 -4178
11185 -4178 -6814 -7672 -7419 -7364 -6931 1440 8702 12229 13232 4805 3441 13378 12474 7323 6647 6518 976
11168 976 457 -2670 -8066 -8721 -4853 -10447 -3009 2668 -993 3250 11652 13540 12070 7125 3335
11153 3335 5590 6620 7031 7802 6450 2384 -2505 -11489 -6426 -7001 -4393 2357 3030 -4371 -4776 -1286
11137 -1286 6572 7264 3922 4178 4362 762 2240 8925 6863 3007 -5094 -5530 -2362 -2437 -2582 -4252
11121 -4252 -5312 -2572 -465 -9522 -21752 -15122 -7598 -8512 -12989 -17198 -11813 -9440 -4179 -771 -4545
11106 -4545 -4856 -10251 -7921 -7624 -6218 730 455 -3301 -5547 -1027 3496 8769 5264 699 -3901
11091 -3901 -10517 -2315 2023 1077 -4492 -3205 3719 366 -2680 -7289 -12850 -12199 -11864 -9230 -2303
11076 -2303 -2678 -9379 -18672 -14804 -7432 583 2436 9487 8929 -4380 -14259 -11188 -7460 -4518 6482
11061 6482 8878 6981 4946 -2092 -8512 -11622 -14808 -13410 -20223 -16374 -9597 -2289 -3204 -3096 -349
11046 -349 -3352 -9865 -6228 -276 -592 -3553 -7541 -11639 -10035 -7896 3890 8007 5960 -2382 -7638
11031 -7638 -7122 -2924 -8290 -14679 -6524 5331 7342 -1432 -9077 -11757 -9052 -4556 -7699 -13926 -16255
11016 -16255 -20043 -10304 -10564 -5284 2715 8672 11489 15731 17341 9071 -73 -3248 3699 4899 4216
11001 4216 -4316 -6810 -6600 -2977 -2697 -8846 -9827 -7814 -2984 -4052 -9892 -18426 -18329 -12450 -3156 -5468
10985 -5468 -11346 -13757 -15499 -11504 -2890 1423 -6693 -5424 30 4920 2327 -736 2575 4504 -4114
10970 -4114 -13327 -7682 -6396 -10229 -7708 -8908 -10171 -12592 -9438 -8844 -10069 -7251 -8098 609 5413
10955 5413 8855 9614 1484 -9641 -9186 -469 1522 556 -3039 -9082 -6664 -8861 -14586 -9459 -13211
10940 -13211 -9078 -5762 -5178 -7079 -6941 -1263 6167 6895 4036 -114 -1657 -5626 -8635 -591 -10394
10925 -10394 -13728 -7933 -5111 -6181 -7844 -8619 -6503 -9697 -7413 -1121 9129 14281 9410 1800
10911 1800 2978 550 -9982 -14931 -15717 -19816 -8807 -5792 -9434 -10801 -11528 -11580 -7611 -7523 -13172 -14586
10895 -14586 -6236 -7933 -3687 -4049 -14173 -14465 -15779 -20151 -9126 -3403 -200 1628 1484 -199 -1709
10880 -1709 -8091 -8884 -8087 -4110 -3375 -1555 -4749 -6202 718 237 10410 14855 9274 3748 1466
10865 1466 5239 3170 -3109 -3078 4049 2810 -3939 -4977 -6344 -12317 -14663 -10043 -244 6245 3757
10850 3757 8627 4172 -1197 -9193 -10805 -5955 815 5476 2198 5515 -3459 -8610 -7449 -6385 -9092
10835 -9092 -13002 -10686 -2062 -1055 1444 3055 6320 4528 7895 13954 10916 4024 201 958 5333
10820 5333 385 -4932 -10864 -6042 215 273 -3951 1003 -1089 -1695 2768 8428 17224 19162 12020
10805 12020 15558 16228 13618 14614 11782 6968 5871 5977 12023 15267 14844 16458 10546 6775 11491
10790 11491 7868 -1416 -5394 -5492 -7675 -5872 48 2878 1377 7809 12206 12939 12177 10604 884
10775 884 -2227 -84 2960 9294 9134 11078 7612 3717 1828 -2889 -946 -2135 -746 -3279 -5
10760 -5 6175 12263 11390 3473 -8908 -9342 -8663 -3993 -1712 5317 -1867 -8769 -9993 4523 8269 -421
10744 -421 -4707 1960 -1241 -5293 -7129 -5176 -1161 5346 654 -6166 -4678 1568 1250 2783 3282
10729 3282 -99 -4332 -12064 -6009 814 3537 10829 7547 2327 2755 4653 -2109 -4411 186 7311
10714 7311 5756 -4340 -7858 -8756 -13791 -6778 -4538 -5649 -1040 678 1747 2577 3080 4721 5935
10699 5935 804 -2530 -8996 -14289 -10388 -9677 -12790 -13049 -3990 -2649 4047 6445 7065 2151 -5859
10684 -5859 -9069 -9023 -5589 -9861 -8975 -7155 -9734 -12544 -1649 4649 -108 1181 391 -7819 -2367
10669 -2367 5123 4646 752 -3240 -11342 -14736 -14098 -8054 -1768 -5092 -5505 -3108 1178 -4066 -122
10654 -122 -4817 -7688 1431 7848 11928 16587 8911 3131 -1145 -2642 -6622 -6800 -7121 -2767 1122
10639 1122 2764 -1387 -5819 -2933 -3578 -4969 1056 -2019 -12281 -6826 6194 9847 5537 4845 5670
10624 5670 563 2481 5500 -2171 -7442 -7114 -9954 -11935 -8228 -4190 -5576 -7701 -7519 -9857 3608
10609 3608 4213 2268 2957 6059 1279 1764 -1770 3157 8216 8918 6275 3403 11526 18434 17421 5523
10593 5523 2208 -148 -3159 -801 -3761 -1456 1070 3676 7287 4503 -2314 604 7272 6457 -631
10578 -631 -5435 -5216 -6184 -1317 1797 2573 -2943 -9608 -7277 -487 -1121 -218 -9120 -11244 -8646 -13404
10562 -13404 -9887 -5167 -6761 -10586 -5102 -8507 -11663 -11182 -892 -1 -10 3193 -3355 -4739 731
10547 731 3386 5355 7435 6125 2427 3251 8699 9318 2309 -2381 1521 -6854 -7614 3951 6574
10532 6574 928 -8277 -10628 -2048 2716 -5082 -15563 -13472 -11492 -6522 -3795 3054 6058 -235
10518 -235 -5040 -3476 -178 5311 -1223 -2455 -4108 -9481 -10692 -8815 -3824 2796 -3522 -3189 -3525
10503 -3525 -672 3023 -5491 -12131 -10270 -20867 -16978 -14683 -13805 -6577 -6092 -6487 2069 10514 5712
10488 5712 -1619 -7127 -9302 3427 1505 -4147 -7564 -9256 -5373 756 2506 -955 -7377 -14914
10474 -14914 -17207 -11668 -8662 -8823 -8746 -3216 -6871 -14415 -15265 -7655 -10596 -6548 -2558 -5146 -5431 1522
10458 1522 10578 10341 5678 1979 3298 5326 8644 -1699 -3541 1899 2569 5343 8549 11803 9893
10443 9893 10396 5637 335 -893 -3224 -2003 1706 1924 -2629 -6055 -5789 174 405 -4311 -6729 -5774
10427 -5774 -4086 3491 2514 1954 7650 3486 3658 9393 16376 15281 13536 13365 14280 14733 11345 -2150
10411 -2150 -3183 2053 265 792 8064 7629 -2411 -11248 -10714 -6806 -4923 477 -170 -3967 -10146
10396 -10146 -5356 3332 3819 144 -2154 -888 5744 9044 3682 2460 6552 10779 7995 4477 4777
10381 4777 7076 14696 11674 5514 3822 4006 -3068 -8675 -25 5405 3775 -2245 -9235 -6126 3993
10366 3993 -96 462 5220 7994 5976 5930 5798 -2418 -4751 -9877 -9959 -3378 2438 5914 -787 625
10350 625 6192 8451 12284 14372 13553 12244 2451 -4394 -6306 2468 11401 11886 12300 22226 35843
10335 35843 49115 58655 68037 70919 86384 103109 109650 94773 92489 93416 85150 63621 47980
10322 47980 37910 32146 22677 10386 4069 4717 6978 7440 6538 1302 1265 4962 1625 4240 4413
10307 4413 5209 6974 6312 -3011 -11721 -14807 -18200 -16200 -619 6599 13061 12388 10253 4808 2554
10292 2554 3555 2210 590 -4634 -4365 -1098 -181 -1243 699 -77 -5071 -5965 -4013 -4703 -13064 -11143
10276 -11143 -7836 -7880 -8481 -4778 -551 8091 15133 18523 19136 11480 6329 14070 16122 18165 17154
10261 17154 12325 1897 1054 -12 5362 3506 7132 18719 19140 18050 9021 586 1528 370 -2700
10246 -2700 -34 5792 9662 3491 1101 13111 13900 7936 6020 5098 4287 5931 8639 8504 4251
10231 4251 3525 19151 23024 23696 16088 18467 17459 12758 19161 20071 19849 15602 2876 -4407 -3941
10216 -3941 -5912 -50 9280 7952 5402 5668 5395 1159 1593 9359 11037 3165 -713 162 1982 -2776
10200 -2776 -10043 -8413 -4649 -7 8170 14500 10784 9994 13517 11334 11457 15530 13571 7564 12857
10185 12857 14593 11614 13180 3576 -2025 -3894 -1718 5134 10293 2027 -4270 -2144 2222 7810
10171 7810 6906 6365 6502 2027 -4 -5954 -3784 149 -2208 -712 4073 3213 3312 1021 5964 10562
10155 10562 10027 5631 5309 2382 983 -4411 2124 550 -2514 2289 1562 3018 2193 -1460 -7076
10140 -7076 -5470 -6499 -5088 -342 -3507 -11193 -2153 5884 5144 -1168 252 -8783 -15269 -11218 -3997
10125 -3997 3337 4358 -2078 -5382 -3755 -7005 -2460 -110 3347 5864 6052 2491 -1980 -2160 2768
10110 2768 4907 8314 8321 3224 -3270 -5980 -1852 1923 -3479 -18 2854 844 1858 6058 1090
10095 1090 1287 4376 7195 6774 -4717 -7514 -614 514 176 8421 11876 11793 6746 3578 -2575 890
10079 890 6860 9139 12093 10400 5470 1227 -952 -1730 633 2741 -230 1033 5150 9991 20405
10064 20405 20346 10685 -983 -4483 -8197 -4232 2424 4536 5605 1732 3863 5350 5111 10228 7053
10049 7053 9743 7353 3053 9993 26774 47391 73682 73720 47028 26931 18821 9107 6496 855
10035 855 -1995 -2869 3299 7145 12416 11575 12305 7420 8262 13657 10192 9866 14519 11539 8062 2923
10019 2923 255 2733 6207 4592 -586 6153 11077 14141 16306 14038 10362 3475 6696 6165 3458
10004 3458 -464 911 4637 9011 5869 1434 -2608 770 9082 11558 11153 10147 11857 14372 10650
9989 10650 13493 24199 20831 22412 13376 -1290 2998 7799 11381 12000 11354 5584 2909 4250 6474
9974 6474 10594 13177 10699 3044 4739 7938 5374 -1584 -7762 -4033 -3350 5981 6865 13493 20933
9959 20933 14965 8348 6069 2503 8983 9043 14155 16578 6831 2811 3232 3896 2830 292 5882 6799
9943 6799 5118 5803 18910 19732 12879 6801 5105 7895 7836 6626 8221 15018 11349 5099 3546 5700
9927 5700 10806 12213 19005 24944 23861 26502 24051 15892 11062 6123 1865 -2886 -2989 -4233 -11084
9912 -11084 -10990 -675 5555 2898 -989 -2764 3344 6777 10917 1567 3372 17543 18566 18116 14857
9897 14857 14105 13632 10742 6403 6803 3771 3736 5470 10128 16996 14728 12249 14934 10912 1722 7541
9881 7541 14194 16290 17480 16367 19084 12993 9314 8839 4963 6736 11058 14399 15908 9567 8477
9866 8477 13442 12277 8189 10276 11348 15982 22534 26896 25952 17821 10067 13844 13225 3382 4269 3951
9850 3951 -370 -536 -1079 599 5892 12792 14734 13407 13562 10725 7565 382 5443 13049 12162 12447
9834 12447 7997 4938 11296 19462 16354 12397 13691 16392 15472 10197 10284 13517 16779 17731 15299 18292
9818 18292 18542 21752 14809 16772 11552 9814 10268 10300 9713 5500 6324 13811 7931 4027 6409 7926
9802 7926 2942 2581 -1206 2263 8138 17969 15931 11033 11165 17081 17197 13784 19775 27777 19294 16034
9786 16034 23584 19099 14698 12491 12314 6823 14039 19807 23350 18756 8794 2090 469 -822 -7216
9771 -7216 -3217 3640 5651 9297 16641 23013 27465 25820 18292 15368 14655 9936 11033 13407 16893
9756 16893 14757 12100 13557 9968 5823 3950 13531 22919 24176 26900 25952 24407 27178 20110 9783
9741 9783 8750 7524 5599 9868 8173 9378 8123 7246 10824 16484 24219 28640 26817 20165 12032
9726 12032 12495 8411 6449 15412 18743 8360 8108 23939 31318 30703 29692 28298 19419 21302 26621
9711 26621 30308 29260 22338 18823 18133 17804 15672 14182 9978 15081 11614 6963 7679 9762 19200
9696 19200 25637 25628 28367 28891 23236 20329 20459 20764 22656 27309 23638 17461 9257 8829 14251 15271
9680 15271 13121 8678 11608 13370 21554 27873 31331 27091 27284 27810 27456 30436 32055 38765 31772
9665 31772 26671 14228 16019 23504 15381 15270 22470 26561 23935 23445 32786 31330 22847 26077 26876
9650 26876 25453 26970 25952 28161 29573 29557 20861 21230 29594 31713 29670 30195 34421 40584 35003 31186
9634 31186 29774 27029 20325 24606 27902 32104 35774 38487 31213 31108 42766 42972 42403 39729 38125
9619 38125 33700 28969 38499 39733 35154 35430 35345 36611 29368 37738 46590 43821 36441 34205 37959
9604 37959 35741 36191 36190 41789 49326 46343 40352 30436 24048 27354 28032 29881 31466 30239 24250 18884
9588 18884 23459 30336 32212 30023 29748 33787 31594 30500 39865 41563 36692 33942 35218 35661 25263
9573 25263 28373 33167 31254 32771 33405 34098 38419 40502 34778 35095 34582 36057 44432 48956 43595 37644
9557 37644 39886 42302 39159 32344 28035 32856 40227 39821 40067 40639 41457 38615 48864 52070 44700
9542 44700 38977 37472 35916 37588 37198 37962 36233 38947 43413 40244 33904 39079 42399 46876 40750
9527 40750 48817 53378 51568 44360 38500 41579 42482 49364 53188 53023 56619 58524 56874 46723 43802
9512 43802 41565 41711 36417 29637 31691 37569 40355 44514 48289 40026 33429 30999 40288 42938 43276
9497 43276 44311 40097 38033 43541 46668 47470 43859 37459 48173 45242 42768 39462 41804 43602 44972
9482 44972 48045 47798 44189 43616 43417 47878 52931 52383 49511 47425 43237 38058 46367 51039 44950 36252
9466 36252 27954 34798 43780 43720 45441 44868 44622 46087 50949 52702 53492 52969 46780 40725 39260 50163
9450 50163 58637 54260 50974 43761 39244 36268 38212 40827 42613 47314 48283 43319 36333 36258 43370
9435 43370 56277 58502 56460 49101 46255 49517 49379 42610 42562 40857 43135 43458 45993 44145 48140
9420 48140 56201 55639 53330 59131 58457 56782 47877 51791 48747 44578 44294 44325 39433 32046 38306 46549
9404 46549 55833 60174 57309 56587 51933 48895 43170 41538 43536 45385 53941 52274 44235 38584 39825
9389 39825 46586 45360 42743 43827 42008 38476 32651 29122 34174 41644 44437 50850 46042 37902 38887
9374 38887 35719 37362 42475 39327 35404 35492 39707 40565 42125 36991 37546 45809 56924 53920 40531
9359 40531 31999 32187 39207 40703 38824 38227 41677 46828 50246 49844 52080 52845 48037 41467 41125 34700
9343 34700 35012 38994 41305 34914 35761 39028 34406 32318 28430 35740 36032 27153 25813 28056 36072
9328 36072 39445 34737 29123 24975 22970 22668 34449 43428 35453 23744 25675 27984 25238 29516
9314 29516 33906 33357 27964 36120 38390 30186 30676 32693 35080 30645 29318 32399 36532 28767 24777
9299 24777 20606 23472 28848 33860 37487 30631 24320 20713 26173 25024 26192 31135 31444 37439 36531
9284 36531 32102 37200 32481 21361 22086 27888 29539 22594 28051 27967 27199 26731 22696 23792 28835 35573
9268 35573 29212 29489 32132 42161 43603 36308 36800 33097 36156 33553 33253 27138 30875 34510 34331
9253 34331 29993 34114 35058 38379 42452 39745 34251 31537 28143 23004 17980 16072 20113 25698 32965
9238 32965 33520 35866 36061 36700 35906 29649 22236 29281 29931 31528 30389 28848 21653 12579 17302 21990
9222 21990 22197 25540 26516 26862 33908 36515 27555 28360 24934 17959 22803 21634 14769 17192 17028 11485
9206 11485 8931 15883 17284 22608 33815 34848 30645 26038 25237 22867 28460 33405 28772 19984 17969
9191 17969 23049 28433 27245 23291 20909 17483 16850 18429 22458 25806 29294 37308 34454 22683 17399
9176 17399 16079 19449 18354 13930 15707 19228 14173 11582 16384 13291 8720 10402 22782 24995
9162 24995 18465 13314 17857 21680 22627 27785 27622 26658 19482 15854 22291 30541 33821 28651 28344 26075
9146 26075 24013 23510 23213 26479 24092 22382 19027 12786 9167 13056 17572 16902 12314 15735 11689
9131 11689 13736 16076 19634 25950 25624 19212 20611 21391 19020 15943 19063 24094 27587 19204 15237
9116 15237 7350 294 5258 7789 6830 8660 16939 15715 20225 17878 11096 8353 2765 3587 7392
9101 7392 13144 9600 14958 24294 31308 28252 22034 16621 18646 19665 14934 17358 12074 11302 15225
9086 15225 13881 18303 20057 19917 23797 20543 18511 15405 9445 13965 18707 17612 17378 17495 18844
9071 18844 21824 14187 9360 6473 4443 3732 5933 10467 10305 9231 13187 12812 9039 12702 16334
9056 16334 16238 13039 17127 22136 21263 11893 4982 6534 13725 12625 11757 14797 21709 22886 23718 22154
9040 22154 16687 10857 13455 18056 25516 26050 15622 13620 17316 16571 15916 16598 15079 12083 10365
9025 10365 3612 677 5783 8801 6882 3335 4937 9039 18027 20110 16822 12941 12205 8925 2661
9010 2661 2649 7426 4179 -1758 1381 4378 8573 10523 10882 14171 10652 8292 818 3103 9398 16742
8994 16742 23359 13139 8593 6075 7874 9872 12825 18793 23867 23315 19469 15776 11488 10329 10151
8979 10151 7078 14161 15901 13369 15398 12653 13448 11505 8863 14781 16685 20883 24168 14864 13872
8964 13872 20835 18201 11114 4972 -3733 -7023 -5523 -3163 -253 -769 -1307 -3215 1362 12141 20823
8949 20823 16666 17616 11159 6135 8936 7579 3049 3110 7802 13851 10984 11594 14698 12045 4975 3613
8933 3613 13490 16392 13067 11114 12162 10072 9795 10400 14606 12224 6102 2462 5651 7017 2803
8918 2803 1921 1572 3841 7453 10576 14778 9237 4626 -1775 1485 10592 15717 15622 23174 18806 12908
8902 12908 10278 8035 14541 17267 12667 6541 9940 20307 18942 9116 6160 3720 249 -3584
8888 -3584 -4407 2217 4226 15053 14193 15572 19901 14123 3546 627 2012 2623 5941 13501 16528
8873 16528 14234 6987 10701 12559 6423 7121 9327 4529 11805 6434 -1071 2990 4580 2372 9644
8858 9644 12933 9676 10954 18497 19484 13602 3351 -4408 -1503 -2225 413 -126 -3090 -1988 6548
8843 6548 4607 466 8998 11843 9000 5952 9697 10909 15263 13667 2852 1491 8021 7955 12467
8828 12467 15054 14461 16092 16539 12644 9269 14180 14525 12904 6474 5956 6548 4181 7433 10242 9857
8812 9857 3997 -3394 -6331 -2443 8275 8415 1541 -4340 -3211 -7046 -7267 -66 471 3630 1513
8797 1513 -2262 -172 3272 -1467 -1496 9 1208 1748 1646 4658 5569 11807 10169 5478 1629 2435
8781 2435 4404 4349 9256 7987 3009 6296 8987 4970 1944 -3584 -2586 -1090 -3394 -6145 -393 4233
8765 4233 3530 -2544 509 5286 764 -1563 -8538 -11411 -13257 -8010 3900 6186 7278 13288 18523
8750 18523 14315 12318 16164 8072 -189 5124 11243 16080 15340 12499 7226 4413 -6314 -8844 -2238
8735 -2238 -3597 -10058 -7236 -6283 -10587 -9228 -13225 -11988 -2390 -451 -3875 -2532 3691 15228 15359
8720 15359 6318 5792 7922 396 2704 8763 11048 9940 6052 2174 2638 962 -3707 -2760 2872
8705 2872 7448 5113 6149 2465 2583 12910 10071 2743 4292 8471 6135 113 -7653 -11173 -4192
8690 -4192 835 -641 462 1019 1258 1237 -2870 -1152 2911 8003 9958 3478 2239 -775 -2203 -3467
8674 -3467 -2729 -1933 -2464 -3986 3446 2706 -3396 -5858 -647 2228 2191 7395 9553 11320 8580 -1680
8658 -1680 -7584 -11299 -11426 -12187 -4870 -2654 1220 1006 -3250 -4489 -5608 -8067 -3751 5914 10522 7460
8642 7460 7351 3006 5516 6755 12868 13961 11445 8635 3986 1328 3667 9929 15645 -637 -8146
8627 -8146 -11107 -8126 -2133 3018 1617 854 256 914 7082 8845 8318 6961 6026 3703 2885 4980
8611 4980 462 327 1117 -51 8658 13313 18165 14895 2164 -2189 -840 -415 2665 704 2649
8596 2649 1893 -2101 -2257 3415 4948 6628 8229 9843 14599 21431 23631 25720 23547 23706 21002 25975
8580 25975 26537 22923 17606 12651 8040 13512 15111 16530 15456 13664 15567 11555 12545 9934 10621
8565 10621 16337 22120 16865 5058 1386 -1237 6087 10847 11563 13619 14735 15940 18480 22174 22058
8550 22058 21269 20432 13554 3722 4110 7528 7215 3711 9730 10677 14600 12868 12514 10200 10866 11513 3606
8533 3606 -7 2647 -3244 1715 4631 4421 124 402 1040 856 8041 9249 2019 4661 10541 10496
8517 10496 2611 4531 13518 3795 -2440 -8942 -6614 2202 5375 10696 7809 6601 2318 5906 2191
8502 2191 2330 6934 994 -1892 6608 8876 10450 8980 6569 10279 9967 -209 -10533 -777 8281
8487 8281 5902 1546 7115 8578 1144 -9613 -10241 201 4891 4218 -6354 -7295 -4387 -4064 -684
8472 -684 -3600 -1836 1558 5114 8389 -1971 -8624 -3099 -4705 -4835 -5411 -4919 -2773 -906 1652 -2444
8456 -2444 3540 5653 9992 8624 11664 11508 7378 9339 3798 8084 11768 13113 12006 12583 12553 10765
8440 10765 2628 2252 2096 -5062 -8320 3495 9624 8047 7517 8131 10358 9910 8526 4838 8702 14112
8424 14112 9421 3387 2193 1180 650 -5376 -6856 -5770 -2776 2885 1941 -1696 7437 4765 935
8409 935 929 -1240 985 -2226 1609 1735 -5263 5472 5379 12282 7680 -4868 -9816 -15844 -14991 -15572 -16364
8392 -16364 -18166 -10193 -1703 -3790 -8085 -7380 -5763 774 7061 8002 3242 840 8255 3482 -16222
8377 -16222 -16306 -10236 -4209 -7184 -6789 -1364 -488 3472 3496 -2508 -1196 1921 4807 1989 2410 1648 -1650
8360 -1650 -1582 361 -4157 -10108 -9961 -10805 -11234 -11985 -8060 -6019 -1606 1059 9279 17705 14716 9341
8344 9341 2034 7442 8019 4089 3568 3485 6727 6691 -918 33 -4753 -12742 -13981 -11317 -7296 -8006 -796
8327 -796 5175 -466 2643 5105 5679 2868 1412 2675 2749 2034 4241 7357 2612 2720 1154 -4971
8311 -4971 3852 5461 2034 189 3150 2898 -25 2220 4736 165 -989 -9420 -8388 -7121 -11875
8296 -11875 -14892 -10296 -8059 -5243 -294 3370 8164 5025 5774 3543 6816 1841 -1723 -2336 1361
8281 1361 4284 6311 7594 -281 -8903 -8546 -11814 -11716 -7001 -4778 -10957 -6180 -3976 -7065 -4736 -1005
8265 -1005 6308 4401 735 -2160 -6299 652 8148 945 -8472 -12414 -8851 -5732 -4145 -2501 -8046
8250 -8046 -1842 3794 567 -4597 -60 7046 8636 11022 12543 7774 3587 2215 3633 3902 -997
8235 -997 -6828 -4359 531 -741 -1576 526 -4357 -10346 -4789 -2402 -7714 -8029 -5178 -4793 1408 1924
8219 1924 -1084 -3108 -12113 -12169 -8305 4879 1890 -2629 -7271 554 8041 9732 5385 -3440 -4141
8204 -4141 733 -10278 -11520 -14081 -10773 -3559 -6618 -6866 595 371 939 -162 -1028 -2248 -5624 1909
8188 1909 3232 413 -10504 -17197 -9776 -2384 -862 -844 3085 8075 8897 4435 -4750 -1991 -7080
8173 -7080 -5321 -2362 -1196 -4382 -14054 -11714 -6022 1416 3119 2765 -3125 491 4077 1121 247
8158 247 403 4337 -2421 -8134 -7767 399 5997 4516 5721 6787 7171 -147 -7480 -7471 -1522 3852 5426
8141 5426 11504 10303 2933 -1987 3709 10056 6699 517 4123 7215 915 2634 4810 2221 7908
8126 7908 6561 3524 5839 8994 7665 2539 -2257 -4489 -6902 -4526 -983 93 2292 3440 3972
8111 3972 3030 -855 -1367 696 2170 -11 2387 10810 13280 8266 5577 3422 1700 7040 5044
8096 5044 -1573 -5153 -4501 -1077 -2815 68 -2422 -4776 -6475 -10642 -12297 -9497 -2513 5779 5298
8081 5298 4442 8220 10343 7425 5815 3192 3447 2893 3841 5493 -1406 -3082 -8774 -6562 -4097 -4012
8065 -4012 -3157 -5775 -4794 -4547 -3090 538 -1837 -8426 -627 5844 6625 4648 5004 6599 5589 3603
8049 3603 -1297 -846 3056 1816 -4218 -2364 -1099 1385 -685 3358 -3695 2061 4675 -4358 -3091
8034 -3091 -480 735 1230 2208 1265 1082 -946 -3610 -9489 -11943 -7338 663 7223 6457 -4365 -8033
8018 -8033 -6295 -3347 -1836 -8162 -9359 -5871 -4532 845 2524 -1543 1284 -4019 -4146 1801 4343
8003 4343 7186 5630 -2787 -5440 -3854 -529 4914 2152 1149 1701 3739 720 -3971 -8497 -2373
7988 -2373 4677 -2444 -4095 -1086 -251 -2464 -4704 -9007 -14933 -17193 -10879 -2206 5150 9096 10088
7973 10088 12486 11045 3425 5893 10175 11522 14952 8298 4121 9916 9070 4244 5541 5268 5555
7958 5555 9356 9531 8549 5605 -216 -2922 -440 4054 9054 9596 10217 16115 25637 16846 7663 5911
7942 5911 8523 4623 413 4119 13849 13016 3067 7213 11469 7121 5892 12547 12769 8636 10043
7927 10043 10842 10584 8900 4424 3682 4613 6798 15660 14969 12488 12895 14124 13105 10401 9651 1804
7911 1804 -2535 -4325 -353 3739 -956 -4219 -156 -906 31 9600 7154 -3250 -11693 -2969 3791
7896 3791 4706 1862 8044 13618 15312 15702 15508 7779 4619 7591 6287 5069 3908 5755 9054 8317
7880 8317 11154 11412 12338 6707 1624 -7612 -8353 -1626 3804 5124 3664 -2148 -4194 -4421 5779 11643
7864 11643 8284 7006 5578 2473 -7835 -11714 -6102 -4318 -6265 -2111 4773 2909 7390 6526 4847
7849 4847 730 -1856 3659 5188 2139 -3414 -6538 -9188 -6496 -3537 -4929 -16 7078 12909 4878
7834 4878 -3070 -2989 6243 15738 16643 11741 2951 -7390 -10659 -11624 -5088 -2810 -5573 -2540 -1356 -2322
7818 -2322 4645 6946 9580 8360 5901 -559 1928 6352 3819 765 -7823 -6000 -7397 -11389 -12504
7803 -12504 -7432 -11484 -8846 -7650 -3742 2219 8080 -1426 -7615 -5444 513 2327 7828 14863 17715
7788 17715 21050 15746 2214 -2027 1961 1060 4666 9684 -3491 -8934 -8615 -4578 -2757 -11925 -14413
7773 -14413 -15195 -17098 -20856 -17039 -9667 -8792 -7590 -6883 -10970 -4581 808 3872 -3341 -8491 -8584 -1867
7757 -1867 -8691 -11371 -8929 -7390 -4562 -2271 -2864 71 3389 1747 -6151 -7343 -4439 -9961 -3927
7742 -3927 -1652 -5036 -4595 -4261 -6334 1716 5194 5005 1893 2722 2779 311 -3847 -677 3271 -4944
7726 -4944 90 3650 -1998 -7577 -3019 -4872 1027 15067 15424 5267 5611 3050 -5434 -11289 -10821
7711 -10821 -4522 -12073 -14160 -10686 -11368 -13983 -8082 -384 4714 -2002 -3635 2243 1584 2690 4847
7696 4847 -10707 -20620 -20760 -11533 -5810 2403 5325 5953 3431 1791 1643 -2513 -1086 -4772 -6976
7681 -6976 -7644 -3598 -2769 871 -523 -555 4230 5758 6152 7923 7106 3280 2255 1532 2155 -3370 -9467
7664 -9467 -11178 -7615 -12333 -10987 -5294 -555 -1925 4243 8693 6122 4382 9005 6827 7314 5495
7649 5495 1911 2781 4623 7470 4159 4023 3288 1772 807 2267 219 -5081 -8079 -1251 -1181 -7210
7633 -7210 -9069 -7904 -13078 -8258 1493 -1694 -1496 162 1946 -5854 -10419 -2115 191 -2965 3656
7618 3656 9170 13322 5318 -149 -4051 -7170 -14205 -20617 -19263 -7400 -5802 -4251 -7144 -6779 -6197
7603 -6197 -8693 -8122 -6503 779 5055 718 -8935 -14425 -15896 -12428 -14497 -11817 -9790 1074 5109
7588 5109 4416 5127 1041 7955 5009 -2721 -7990 -7048 -5102 -3699 -4844 -2574 941 -2463 -6367 -11596
7572 -11596 -16982 -15948 -8198 -9650 -12384 -15035 -15109 -18025 -17810 -18633 -12547 -2320 4934 6753 6296 6504
7556 6504 -449 -76 2201 1557 -3864 -5309 3865 2371 -534 -5418 -5111 2983 3208 3421 4257 6357
7540 6357 3632 2627 1921 -6807 -9276 663 4244 369 -5773 1933 6058 1101 -3595 -8113 -6085
7525 -6085 -11068 -9765 -12114 -13114 -6473 -5897 -4766 -7372 -6624 4888 9221 5379 5952 1794 -2284
7510 -2284 -5731 -3597 -6445 -12002 -15640 -18472 -15800 -4515 -1028 -1912 -5543 -3223 -3946 1303 -1195
7495 -1195 -13991 -7398 -5383 -13551 -12746 -6842 -2090 -9150 -14537 -15531 -12000 -9385 -3269 -360 -1877
7480 -1877 -6524 -6131 2143 636 4185 937 -452 -3782 -11805 -7642 -7323 294 2704 338 2494
7465 2494 11255 14187 7076 -1816 -10123 -11964 -1391 1385 -1574 -1282 -6333 -13313 -11314 -5834 3494
7450 3494 -1569 -9888 -3453 2426 3452 -2839 -12762 -8014 -5676 -8153 -1645 -993 -376 -2016 -1008
7435 -1008 -6266 -10691 -14851 -16335 -9596 -9332 -8686 -15624 -20671 -14218 -14003 -10738 -5602 -2265 -5900 -11512
7419 -11512 -8671 -5295 -2994 -3512 1368 -1624 -2943 2913 4278 2141 -1846 1192 4786 3275 8754
7404 8754 20695 16858 11965 14444 14968 8631 5305 4838 7401 11719 13519 12017 6405 -971 -1342
7389 -1342 -4591 -1008 -5375 -11410 -5040 664 6338 11384 11682 6640 -1737 -5175 -12862 -19145 -14226
7374 -14226 -4291 -8783 -4464 798 -8159 -311 6121 -6925 -12598 -16290 -9776 -2037 61 -2845
7360 -2845 1307 -561 -1708 -3531 -6841 -1261 1703 -3647 -6072 -4413 -3651 -3859 -1793 -4261 -5729
7345 -5729 304 -3746 -2287 8373 7892 -168 -336 4058 971 -3342 -7609 -8544 -7689 -6652 -1319 -3366
7329 -3366 -4984 1224 8807 13262 8805 12774 20828 23650 15690 12076 1005 -8200 -6380 -3932 -4340
7314 -4340 -4569 -3929 -4472 -2324 -4088 2349 3444 -7556 -12692 -2902 2287 -534 -5629 -8676 -7101
7299 -7101 -3091 -5172 -10221 -8067 -2757 -3605 -10108 -9754 497 502 -5149 -10282 -7151 -4408 -8203 -10330
7283 -10330 -14140 -17311 -9284 -7448 1312 539 9944 18010 15180 8027 6226 6493 961 -86 -5142
7268 -5142 -9153 -5403 1147 1764 -5408 -2094 6263 7405 5113 185 -6581 -7969 -2725 -4744 -8498
7253 -8498 -11185 -11591 -13986 -12797 -7613 1619 -141 -658 -3808 -7451 -7334 -5593 -5664 -3063 566 5386
7237 5386 5675 -5168 101 12652 14860 1750 -947 -2310 -3709 -3833 1116 8044 11019 10302 5974
7222 5974 1656 -84 -5206 -5221 -6304 -6651 -3208 -5978 -2240 -7172 -8085 -3078 2373 768 -2536 -5673
7206 -5673 -2017 7737 10801 6849 6071 821 -2671 -25 622 106 -140 -6918 -4819 1199 3194 -540
7190 -540 -1082 -8426 -10735 -12136 -14291 -14585 -16502 -13666 -10499 -4854 -5726 -13256 -17093 -23215 -20069 -7177
7174 -7177 -4292 -1234 -4610 -9894 -4466 1877 -3276 -4906 -3192 -739 -454 819 1016 -1291 1376
7159 1376 60 -5281 -3712 -560 3933 1681 291 -580 -304 -397 -7940 -11051 -7062 -818 -1808 -7899
7143 -7899 -12963 -7317 -5670 -1816 2426 -3653 -11248 -14385 -14895 -16346 -13402 -7292 -1798 3166 6235
7128 6235 -63 -1701 8514 11834 9453 6638 865 -3027 -7386 -11488 -5788 1086 -204 494 -684
7113 -684 -3387 570 5679 8490 7530 7780 9099 7552 5910 -3177 -1277 5396 346 -1433 -43 3849
7097 3849 2106 -1497 -4281 -3788 -5824 -5111 2311 240 -8744 -4171 2323 1621 -6907 -10643 -4642 -5382
7081 -5382 -13688 -4043 4458 -2380 -8613 -10117 -12802 -21328 -12571 -6763 -1816 -1231 -5368 -5793 -1701
7066 -1701 -3996 -8485 -9039 -2555 -507 -2094 -3687 -11233 -9753 3163 8137 7073 3392 -6905 -15165
7051 -15165 -9505 1190 2273 9996 7695 -2858 -3161 -7564 -6047 -3677 92 -3413 -486 7238
7037 7238 12049 6793 7221 3723 -4345 -6768 -5231 1042 -752 -2909 -4306 -9368 -12785 -15301 -11404
7022 -11404 -10239 -6503 -2096 3926 4024 320 -7389 -10681 -1355 2343 -514 -2115 -3482 -7999 -11348
7007 -11348 -14639 -10900 -10190 -8212 -11800 -9483 -5073 -3417 -2090 -395 -6253 -7458 -5358 582 -1017
6992 -1017 -2394 4972 -6466 -15157 -7662 -6170 -1659 129 -2615 -896 -5193 -6873 -7186 -747 5140
6977 5140 -3817 -5672 -8437 -17318 -12708 -1142 3908 8538 6927 -2660 -6421 -7260 -3488 -4791 -6359
6962 -6359 -1092 256 -271 -1850 -1050 162 -3180 -6490 -11223 -6569 -673 2789 9882 10688 11223 14732
6946 14732 9121 497 -2473 -2782 -1211 6854 11226 8897 5783 7872 907 -2862 -4499 -2182 -1022
6931 -1022 -3555 -7562 -6973 -9891 -12717 -7868 -6800 -6082 4084 3721 -9159 -9550 -5716 3147 6087
6916 6087 8728 7903 3787 1917 1466 8954 1803 -1232 3589 994 -613 -6444 -3631 -5431 -1266
6901 -1266 -3038 -4722 -5118 -1913 -3073 2310 7257 4326 -3233 -3630 -1079 -2061 3130 9143 7570 4174
6885 4174 -1760 -6824 -46 3176 -2832 -5403 -3146 -7959 -6048 -5694 71 4111 4481 -2736 542
6870 542 1613 4458 3733 865 -3403 -2486 -1322 -3186 -8024 -11291 -6773 -9382 -12627 -9408 -5302 -8648
6854 -8648 -6625 -6231 -3445 954 6004 7404 4067 5538 1035 -3510 -2399 3264 1852 -1370 -7277
6839 -7277 -9699 -8595 -4778 253 4332 2453 -349 -2700 -2468 -1913 1184 6583 8364 12305 6652
6824 6652 3317 -3059 -9100 -11493 -6551 -8091 -6915 -6250 -13085 -13909 -13346 -7527 -1646 3325 5668 -362
6808 -362 -1513 4642 3143 6323 9062 2917 -7513 -8051 -9442 -5772 -8658 -8768 -7820 -9536 -853 -3850
6792 -3850 -1816 2727 338 -2898 -2832 -1005 4436 8896 6555 -3151 -4558 -6333 -8327 -7771 -2424 2138
6776 2138 11474 14075 8221 6196 -1056 -5179 -2414 1350 686 3238 2263 6830 -5245 -5757 -3604
6761 -3604 2626 5680 1796 4069 9387 1012 -4619 -11897 -11244 1355 7960 1265 2078 707 -3741
6746 -3741 627 5159 3276 8533 12187 8852 1132 -3962 -4632 -9391 -2986 -1383 -6234 1486 -3049
6731 -3049 -7875 60 6103 7116 -1547 1031 8497 7195 6518 599 -2186 -9840 -12986 -8591 -5713
6716 -5713 -2069 -2383 -2893 626 -4173 -5723 -128 -1252 -3333 -12508 -15978 -16814 -12723 -10221 -9435 -10164
6700 -10164 -10485 -5294 -9500 -9078 -11149 -8965 -7037 -4747 -2430 -5152 -8812 -4617 596 1870 -3433
6685 -3433 -9123 -20288 -23768 -14602 67 1165 -5872 -5873 -596 -2027 -3741 2420 5544 4212 -1387
6670 -1387 -2376 940 706 -524 -1901 -2671 3959 4806 6364 10484 12936 2462 -2687 -5646 -5794 -4903
6654 -4903 -6763 -11881 -10782 -1802 1087 3411 -599 -9776 -15211 -7260 -3166 -2990 -10654 -9947 -7534
6639 -7534 -5535 3164 12140 6864 -3440 -3001 -11463 -16865 -14322 -5755 -894 4669 7281 10484 11345
6624 11345 4053 -401 -1067 2538 4257 6943 8264 7192 220 -4028 -1949 -1134 -4873 -2687 -5261
6609 -5261 -4808 -4224 -6376 -10002 -8086 -2536 -1099 -4442 113 205 -169 -1981 -2479 -4328 -2043 4296
6593 4296 3799 4221 1847 245 -5461 -9882 9 3625 -305 -1480 -441 1205 1932 -3140 -3864 2389
6577 2389 1259 5878 4972 -921 -2673 -1577 -2148 3560 1804 -3043 -5510 -1634 5158 5868 -2633 -6483
6561 -6483 375 7645 -580 -5171 -3109 -5349 -2126 -4518 1411 -197 -71 -2319 -14222 -11431 -4328
6546 -4328 -3670 -3517 -7183 1614 4987 6140 367 -8032 -8282 -10731 -8127 -10394 -9023 -2965 -1674 -3443
6530 -3443 -11982 -12358 -7549 -4055 -2820 6955 5486 6465 5061 1413 1802 -5233 -12533 -11832 -2947 5635
6514 5635 2168 2663 8108 753 -57 911 -6473 -4101 -2264 -2549 -1205 -8527 -5896 -311 2354 5037
6498 5037 5793 2817 -11084 -16828 -13800 -10925 -5064 -791 -916 -2361 -2213 224 1179 -476 -677 -1587
6482 -1587 -434 179 -1308 -1321 -2227 -618 -888 71 5007 12973 9179 4287 6146 4175 -3623 5083
6466 5083 5161 -3948 -4816 -5563 -4463 -1932 -5060 1485 -318 -6978 -4919 -9998 -14350 -4321 -2635 -8839
6450 -8839 -16823 -16960 -8692 677 -2525 -5568 -2028 5103 1360 -3590 -8951 -13898 -7219 6109 5811
6435 5811 -456 -3318 -6024 -5788 -8039 -7511 -9677 -1430 3206 9119 2902 -2636 5301 11502 15241
6420 15241 9277 1557 -312 1992 4505 5207 7678 -3105 -14087 -9227 -5561 -9558 -4249 2359
6406 2359 4459 5844 7486 5737 4724 6553 11309 10269 8294 3905 4810 7932 5252 -2979 -2724
6391 -2724 3465 3506 6120 9046 9439 8397 2940 8184 7287 6342 4811 523 -5475 -3644 1679 13204
6375 13204 6839 7222 4504 -2604 -9349 -8778 -4897 -7070 -3879 2663 2372 -4207 -4372 -3349 -3241 -6867
6359 -6867 -7121 -9565 -15028 -14841 -8338 -7020 -500 -347 -982 2205 2295 -399 -7072 -3986 -3089 -2635 -497
6342 -497 -3771 -588 5163 9960 4104 -9251 -16326 -9732 -2634 -1977 -4492 3679 12212 14936 14541
6327 14541 9075 7534 473 -170 -624 -898 2365 4830 630 -3416 -6358 -4887 2058 5216 1901
6312 1901 2304 6611 68 -10292 -9275 -1524 -3613 -8041 -3746 -1954 -5007 2050 133 -8513 -8517 -1713
6296 -1713 823 4499 12184 15189 14594 5360 1977 -830 1229 -455 367 5273 6586 4039 4518 3798
6280 3798 -1110 -2597 -4182 -8379 -9878 -1094 2258 2651 5602 1748 5091 5184 -334 -5277 -3060 -5866
6264 -5866 -5558 -2017 -368 3104 6899 -418 -5294 -1686 -2901 -351 1508 1394 -2219 2876 3373 -3571
6248 -3571 -8816 -6615 2364 6909 3920 650 -1886 -5839 -1487 7772 12489 10825 2366 217 2298
6233 2298 6665 2339 3460 11257 21107 18497 7046 1274 1874 -50 -4768 -5942 1243 4938 2322
6218 2322 -466 -4211 -3627 -5924 -3520 4203 1649 -4054 -7902 -9986 -9125 -8940 -5757 -5233 -10825 -3833
6202 -3833 2465 -802 1667 475 4852 2279 -61 10703 13526 4081 -3338 -5076 -2536 -5593 -3654
6187 -3654 -2869 -3288 -5235 -4164 -1334 -3040 -7835 -959 6145 11614 9038 11669 12323 5951 16210
6172 16210 24241 15140 3916 203 5869 1680 -2628 -3316 -4711 2832 5322 3786 3141 -1340 -2143
6157 -2143 4591 8106 8232 5609 -2038 -4551 -9947 -11491 -8558 -15383 -18263 -11416 -4736 654 1913
6142 1913 -998 1053 -188 830 3837 -2145 -856 -3340 -5372 -5356 -9824 -14439 -7980 -6833 2203
6127 2203 8323 -1657 -12587 -14913 -10495 3 5234 5476 -840 -28 7402 11640 12302 6989 3650
6112 3650 2855 9772 4961 -3772 -4599 -1840 -400 -2607 3091 -3299 -7263 -7438 -2913 664 -2192 -6315
6096 -6315 -9144 -6414 -601 -934 -2232 -1055 -316 6555 6087 2891 1324 226 194 10858 15117 4946
6080 4946 172 -6508 -11751 -11703 985 2863 3854 -323 6434 18159 11437 10130 11184 16021 17550
6065 17550 9358 1838 1144 689 2507 2020 5402 8414 7639 3800 6460 8158 18213 20662 9807
6050 9807 2468 -6850 -8538 -1917 4064 4576 -27 1828 -1918 -5066 -4800 3119 6694 8521 6065
6035 6065 3725 -1993 -4865 -5671 -1725 4066 5265 5423 5629 6094 6086 1959 -1926 2256 10800 13268 10749
6018 10749 1150 -822 -2625 -8940 -14166 -8747 -751 -780 -9913 -10444 -111 5086 64 -8464 1460
6003 1460 1474 -6108 -6398 3355 -3769 -9548 -9027 -8557 -12014 -10628 107 3886 -2115 1128 -84 -8230
5987 -8230 -8298 -7 -3331 -6932 -6881 -4405 -8933 -15224 -15468 -7549 -6131 -2271 -3486 -2463 3769 8647
5971 8647 12070 2919 -1722 -5971 -951 3189 2637 -333 7366 6819 738 -977 -591 5367 8395 12413
5955 12413 16352 11896 10383 10478 12735 5613 1424 184 -2214 -3631 -7010 -9548 -1624 6638 10159
5940 10159 6140 -1202 -3602 -2975 -5091 -4668 9493 15611 13360 12202 9693 11096 7663 21 -3906
5925 -3906 541 2705 2162 -2085 -6024 -5823 -5623 -4256 -11005 -10914 -8257 -12407 -8345 -15486 -17659 -13555
5909 -13555 -12804 -11743 -7524 -4479 -173 -3297 -6515 -3378 1454 7653 -183 -3948 -2888 -9209 -14423
5894 -14423 -13458 -15002 -17431 -16583 -12218 -2684 2860 7451 3981 2836 5959 1479 -6525 -3627 3189
5879 3189 3449 -4453 -7472 -5058 -4715 -9496 -8655 -4957 1782 6844 2049 1470 293 -1677 -1973 -2057 -4689
5862 -4689 -7039 -9738 -16531 -14196 -5954 5414 9265 4873 3790 4119 6244 -1224 -5729 -5941 -11762
5847 -11762 -7776 -544 2134 -5450 -13400 -10056 -4156 1386 2669 2637 4153 13938 21759 13332 5372
5832 5372 4984 -1050 -4784 -1464 3869 11446 9809 4249 -2720 -9691 -8115 -4103 1441 6941 3737
5817 3737 2489 7220 3925 1720 -1382 235 -5953 -9694 -1995 697 -7330 -16117 -13700 -13034 -5638
5802 -5638 -659 -825 -1864 -7597 -7746 -3723 -5799 -4679 -2691 -5846 -2383 1284 -2211 -8589 -10050
5787 -10050 -7010 -8683 -8471 -4422 -4334 -5661 1491 -1584 -12117 -10149 -13992 -18053 -8089 -6488 91
5772 91 6150 7263 12859 5893 -234 -1874 -2778 -1814 2118 -1115 -1021 -3037 -10625 -15381 -5842 -4400
5756 -4400 562 7270 -3519 -4659 -4560 -2148 6640 12131 9099 11507 9034 3552 5182 6760 2342
5741 2342 -791 -1746 -4941 -1567 2818 6306 7732 5029 -4022 -11488 -12263 -5913 -777 1468 2708
5726 2708 4650 1575 852 -1002 -232 -2444 -1173 5355 7158 3095 -2857 -9212 -8038 -2216 -1827 -4914
5710 -4914 -5929 -5336 4424 11225 13543 10146 5225 1436 5527 8458 6797 8594 6187 3820 65
5695 65 -6934 -8908 83 4194 2573 -3891 -277 603 3674 5258 9276 8138 4875 6306 6808 1391
5679 1391 -2980 2000 5059 3876 5309 2174 54 3502 6595 1053 -6579 -8909 -8146 -3998 -1596
5664 -1596 -5051 -9778 -10920 -7603 -8420 -125 10971 13164 11557 5291 4620 13926 11862 6701 4417
5649 4417 8694 13480 8578 -2804 -16845 -16615 -14426 -11672 -4172 5529 -823 -5890 -3003 -1450 2894
5634 2894 4325 -2339 -7324 -10671 -4478 2361 2089 -1695 -4514 -4647 -791 7188 9189 7296 1676
5619 1676 2065 3252 7431 13876 15519 5982 3301 1914 -5234 -10854 -9754 -1995 3264 3015 6615
5604 6615 5553 4814 1273 -355 -3192 596 1700 -2201 -4229 1048 6408 850 -886 4115 9793
5589 9793 6142 1588 287 -2126 -2396 -3192 926 1661 -7454 -7845 -4942 -9553 -10678 2802 9693 1103
5573 1103 -448 -9917 -8912 -4097 1040 959 1983 -4611 -8862 -5978 -6588 -1082 5327 7722 7363 7350
5557 7350 7071 924 -10662 -14163 -12035 -16793 -23347 -22513 -12377 -9686 -6718 -3154 -3234 571 1643
5542 1643 -392 1246 -2415 -2200 2556 2221 -6111 -2172 2468 2005 -3080 -4744 -1146 969 5091 -2403
5526 -2403 350 -1527 -195 2208 -5051 -8468 -8583 -12002 -13799 -9307 -1860 3322 15 -946 4120
5511 4120 9528 8477 11207 4898 -1975 2498 3292 -6321 -11562 -9358 1624 4692 1726 -4143 -7364
5496 -7364 -8672 -2643 -3011 -2644 -5406 -9803 -2742 -5717 -11591 -15041 -12766 -6879 -2427 -6400 -10076
5481 -10076 -11113 -14423 -17337 -5079 -2945 -1191 -1070 -3671 -10691 -8751 -771 874 1558 2505 220
5466 220 -3306 -5474 -4044 -4498 402 2609 357 -5531 114 -1120 -620 234 -3130 1234 4226 12585
5450 12585 7170 -5290 -14272 -16131 -12159 -7167 -5688 -1536 359 -5063 -8098 -10553 -17933 -13601
5436 -13601 -1390 5751 5145 2615 -587 1130 1843 1364 2629 2924 -3566 -2823 5066 2314 402 1887
5420 1887 -2283 -7463 -18727 -13738 3657 9004 6470 7907 8663 2101 -2133 -2895 2668 6666 -2152
5405 -2152 -2730 6696 7742 11928 10253 1589 -7570 -1526 2358 1239 -1691 -1786 -6418 -6460 -5692 -8365
5389 -8365 -6101 392 8113 12129 9253 4432 8702 10479 5313 1022 -2474 -8351 -8572 -2630 -1228
5374 -1228 6613 13838 11803 1847 -6744 -8771 191 1604 -845 -4586 -4132 1171 4085 6295 11590
5359 11590 9256 -1568 -11382 -11688 -2819 7632 8766 561 -4180 -5605 -7260 937 635 1134 5208
5344 5208 9657 12550 6404 -9087 -6426 -2296 -286 -3736 -36 4491 96 -5722 -3356 4239 5160
5329 5160 8375 6958 7803 8182 3081 2266 -6139 -6802 513 578 6855 16461 12899 4227 82 -5186
5313 -5186 -9397 -8148 -8460 -11770 -11658 -7728 -7081 -881 -3079 -9724 -11493 -9623 -5254 -5665 -4176 -2288
5297 -2288 3409 9042 7124 1874 4508 7989 7587 10916 2730 -6002 -6186 -9227 -8092 -624 1203
5282 1203 -1179 -2573 -7325 -5402 -3430 -1312 -1601 -2951 -2172 2458 4280 -243 -5708 -3830 -4600 -6795
5266 -6795 -3566 -5521 -5526 -5139 -4155 -2735 -249 -3705 -10218 -15024 -14163 -9746 -9380 -10382 -10176 -2528 3372
5249 3372 10147 5356 6161 6127 -1949 -4036 -2878 -3710 1127 3229 5365 -1604 -2418 4069 802 -849
5233 -849 -247 -8950 -13546 -10754 -4052 1746 5471 3327 -1650 -8217 -9412 -2889 -5835 -10115 -8725
5218 -8725 -9171 -10957 -184 2396 -2247 361 -2686 -5253 317 5692 7972 7442 1966 6106 4916
5203 4916 5516 3878 8434 4222 2033 5926 11860 8506 2285 -8742 -12922 -3668 3239 5533 -710
5188 -710 -6634 -12205 -10641 1298 1161 979 -7418 -14203 -3912 -516 -6720 -11300 -11477 -14125 -5200
5173 -5200 6569 1806 -6778 -8780 -12286 -11151 -3853 3655 1474 2904 5197 12706 7289 599 -1317
5158 -1317 -3855 -3472 -3471 783 755 2727 2967 4797 5663 7839 4095 5571 7372 10809 8726 9977 5218
5141 5218 -8905 -13015 -9548 -5165 -954 -2658 -8049 -8822 -8996 -8216 -7062 -969 5289 3240 -4256
5126 -4256 -7341 -8073 -4810 -2533 -7559 -5558 -4884 -1691 6484 13040 13958 -945 -9497 -7247 -8561
5111 -8561 -9463 -7289 -6247 3923 4976 5836 8598 7646 3480 -439 -9264 -8538 -3305 -83 1027 6963
5095 6963 10840 16815 9264 -3541 -5530 -2022 -4136 -4941 1884 4932 -168 -3741 -8690 -9806 -13788
5080 -13788 -11963 -7463 -1244 2502 5811 9439 3841 -4062 -5029 -7440 -992 -687 -577 206 -2581 -5793
5064 -5793 -658 5182 8315 8360 6351 9235 10127 6912 829 -2661 -1105 -4341 -6384 -6571 -3153 -10854
5048 -10854 -3774 5130 9446 8310 6675 7971 11621 5248 2698 4044 484 4200 9010 6920 8654
5033 8654 7553 5806 8687 2570 -4146 -1232 -1990 -2207 70 -2495 -2613 1953 -6053 -7623 -4526 -8128
5017 -8128 -4381 177 2684 6932 10415 17674 13603 12749 9933 7629 4142 7752 13683 17286 18037
5002 18037 14411 5525 7370 3104 3969 5393 390 1469 2906 615 29 240 -3457 1223 6106
4987 6106 3705 -405 -1819 4474 7958 6908 11417 7127 -667 -11562 -9022 -6361 -1498 5339 6960
4972 6960 13474 19180 3760 -6230 -5140 2369 -89 2304 7435 2452 -5830 -6188 86 1934 5471
4957 5471 231 701 2215 -1839 4815 147 -4820 -608 3640 5493 2417 9196 11097 5634 5887
4942 5887 5532 8842 4805 2664 -1793 -2579 -4424 -6655 -6550 -9243 -13081 -1629 1311 -4247 326
4927 326 6057 34 -2290 -4643 -1846 -3145 -4761 -7113 -2078 129 1 -1181 -2877 -10388 -10334 -9533
4911 -9533 -7661 -2264 4126 7577 9826 5194 6762 7163 4615 1114 -2677 -2498 -71 -7018 -6219 -4830
4895 -4830 -3265 -5401 -3990 3917 4015 2262 1351 -553 -6276 -9025 913 7420 5915 2832 -5589 -2361
4879 -2361 -4463 -11635 -15583 -10596 -7495 -1968 -1185 -5459 -7026 -6861 -6688 -5820 -1483 9048 6011 4910
4863 4910 6891 6437 6194 3895 387 2953 2805 3457 14154 13194 362 -2954 3037 7703 4557 2038
4847 2038 -2826 -5532 -13610 -18716 -18000 -16921 -14822 -7423 -8386 -10711 -5302 -5811 -10940 -8615 -6288 -3969
4831 -3969 2207 -739 4899 11051 8214 1701 -4357 -5851 269 4240 8785 6505 2578 -960 -5846
4816 -5846 -11599 -14219 -4102 -3698 -7408 -9768 -7303 -279 506 -2922 -2840 -338 976 4164 1365 -3947
4800 -3947 -3271 -992 -1792 -5506 -11435 -13109 -10805 -6715 379 2568 12665 16871 10620 2862 2047
4785 2047 2494 4988 4384 119 -889 4161 6479 8951 10046 12226 21224 21648 13964 7611 6793 8711
4769 8711 6079 -390 -7957 -11216 -13829 -4838 835 6697 3560 -7185 -14199 -8141 -7846 -8643 -6212
4754 -6212 -5252 -10603 -5297 -12515 -19997 -15456 -6211 -7702 -3382 2699 -1003 -10475 -9842 -4594 -2016
4739 -2016 -2274 234 -1844 2901 2571 70 -1417 -7320 -15242 -11438 -4826 -416 845 -5187 -8673
4724 -8673 -5413 -10798 -11496 -7917 -2240 8631 9491 5316 7543 1740 -4187 -2160 1397 2747 -2883
4709 -2883 -8980 -10068 -4745 -2069 -5046 -11950 -11002 -5237 5454 10353 1605 -4467 1930 3185 623
4694 623 69 -3715 8206 10002 8178 7116 5476 6353 4856 277 -3028 -1621 -9535 -11239 -4571
4679 -4571 3035 2824 -2052 -823 -7221 -9999 -7631 1185 8811 -736 39 8650 8961 5239 11070 16728
4663 16728 18437 17845 11463 1805 -3027 -7304 -11547 -8604 -7831 -6193 -5078 -8416 -8835 -7390 -8139 -9663
4647 -9663 -3697 1069 494 5461 9974 7980 -784 94 -803 5498 11406 14229 16676 10463 -1683
4632 -1683 -1515 -7213 -6469 -5667 -13369 -12172 -2474 -897 1502 -4908 -8606 -8748 -10736 -12348 -11064 -8098
4616 -8098 -3229 -1439 -6478 -11374 -11423 -10561 -4862 -7883 -1386 -1923 -7849 -5738 -7451 -4654 -640 1957
4600 1957 5008 3126 -1017 4129 6947 5977 2374 -969 1191 -559 -106 1459 -2840 -9003 -8838 -7059
4584 -7059 -10617 -5047 -4234 -3763 -4048 -1865 6274 9845 5849 5014 4549 2066 6227 7053 12505 8121
4568 8121 10030 3925 1750 7205 6777 1968 -1445 -313 2005 1341 399 -4100 -3060 -418 332 4798
4552 4798 -3550 -3237 3176 4941 5621 3965 -1103 -700 3912 -489 -2965 -11088 -6977 2161 12035 15799
4536 15799 7002 3523 2461 -6964 -8246 -5752 -3977 1928 1706 -8836 -14330 -4139 5509 4984 -4689
4521 -4689 -3429 -2655 -966 -1528 -261 4960 465 6496 9999 -1247 -9423 -9539 -534 -963 -9821 -13472
4505 -13472 -2913 -185 -7536 -5586 2166 3515 6814 12613 17532 18654 13725 8841 7419 5286
4491 5286 3684 3237 2027 2726 1965 3681 3924 1818 -2614 -8937 -9825 -2413 -817 6444 7417 2190
4475 2190 165 -4606 150 6050 3826 -1330 -870 -2225 -7862 -12168 -9626 -8461 -7426 -7202 -5226
4460 -5226 -1258 3408 1106 -2912 -1717 1839 -305 -6416 -8098 -7245 -3327 -35 -2107 -8008 -2890
4445 -2890 1078 -277 393 3605 5781 -2050 -733 1192 6148 6416 107 -1495 -3988 -8292 -3434
4430 -3434 2151 3900 4328 1196 -184 3765 4689 1126 -3975 -4386 -6539 -9190 -6810 -469 337 -5704
4414 -5704 -12505 -13696 -13267 -6089 -4297 -6366 -15705 -16238 -15726 -11042 -8434 -6430 -3623 3181 2604 8204
4398 8204 5998 5224 11184 6677 9776 6751 1554 -1975 -9106 -14850 -16944 -14049 900 2208 -926
4383 -926 1962 5926 8948 1385 -4649 -9705 -5201 -2820 -1416 -49 -7260 -9077 -6534 -1579 3742
4368 3742 1687 -3100 -2005 -3861 -6070 -9269 -14939 -10346 -3708 -2107 -3246 -8136 -7423 3365 4353
4353 4353 -2153 -4829 -3389 -8435 -7155 -3749 -2112 7523 9866 6911 7835 6116 -3900 -6124 -3626
4338 -3626 -11014 -4412 2522 4555 4108 3822 1264 -1465 -2917 -4843 -3879 -2106 -3217 -1536 -904 2175
4322 2175 6482 3659 -3227 996 1167 -2673 -12781 -10753 -10369 -12057 -10492 -12098 -9863 -14759 -15306
4307 -15306 -17359 -14317 -9825 -4231 -10161 -11120 -9101 -8756 -7827 -954 9206 7178 464 -9666 -9969
4292 -9969 -6442 1546 7448 10873 11787 -1448 -6359 646 5880 8096 6408 6939 8354 5079 2527
4277 2527 2211 5381 -357 -741 1208 1186 -1675 -2355 430 2291 9034 11115 8247 2818 172 -4205
4261 -4205 -9725 -9692 -8546 -19 6371 -1316 -4751 -2696 -2692 -10263 -8413 -8942 -3197 1498 9862 13551
4245 13551 14879 11098 2678 6153 3672 320 2855 6420 4806 -3119 -6844 -11153 -12537 -916
4231 -916 5444 7763 9987 -117 -5725 -3346 -1447 2524 5146 4149 384 3556 1146 1367 -539
4216 -539 1773 -505 -3639 -3367 -5649 2066 4167 -5140 -9008 435 -2137 -3826 -5200 1551 7814
4201 7814 12071 13585 9919 1252 -9139 -7067 -7754 -10803 -17451 -14900 -5461 -2700 3308 6302 5960
4186 5960 11048 2426 -223 3424 910 2407 7800 13404 10745 1670 806 5257 10012 10517 6282
4171 6282 549 -8423 -3669 894 -1092 4992 7333 -2573 -13418 -19281 -20719 -17751 -8374 -7595 -15032
4156 -15032 -15583 -17922 -17864 -9932 -4604 -6404 -5111 -4215 78 -947 -8263 -9785 -652 1198 -4458 -6370
4140 -6370 -2698 -2348 -3000 -6455 -3618 -4674 -438 1677 -320 430 7287 8268 6186 5229 -1682 -3143
4124 -3143 -2650 -75 1241 1690 1627 -658 3864 1040 6504 13790 16346 15858 8944 4152 235 -1762
4108 -1762 -8236 -8697 -2907 3529 5041 479 1710 1445 1047 1806 5592 10588 3495 -15506 -14407 -12679
4092 -12679 -6917 -7915 -5019 1518 2468 5844 10884 5870 -4710 -7887 -2998 1338 2654 7024 2877
4077 2877 786 -849 -1126 -278 6553 12311 4597 2308 -1369 -7431 -9947 -13376 -14809 -9102 -9039 -12085
4061 -12085 -1545 7925 7581 871 -809 -2524 -332 -4077 -6667 -5479 -6122 -9545 -12605 -13577 -16688
4046 -16688 -6467 -2224 -5337 -12504 -8095 -516 -2464 712 3355 -32 2464 2681 5825 5264 11022
4031 11022 17047 7324 934 1104 737 6926 4920 3525 4463 6062 1766 -2387 -4789 3871 11072
4016 11072 10743 5408 1511 -3289 -7968 -445 4202 -1341 -6844 1019 6664 -1946 -3670 179 4368
4001 4368 7393 -298 -7240 -6110 931 -1261 -3944 -4077 -6462 -8458 -2160 -186 -5700 -9631 -11209
3986 -11209 -5158 -2138 -5065 -2133 796 511 -4681 -3526 -1912 -2910 -7590 -1855 4515 3762 -946
3971 -946 -10114 -16391 -24568 -23841 -17778 -9322 -7911 -6423 2241 7144 12425 11285 14664 12638 7951
3956 7951 -646 -1610 1670 -2122 -8548 -6810 -2522 -3195 -5008 -4568 45 -6670 -9597 -7712 -4722 -126
3940 -126 -3251 -4219 -6170 -3936 -2100 -8611 -14164 -9070 -3854 1508 1488 6273 8064 4731 -4331 -2921
3924 -2921 1264 316 -3491 -2007 -4483 -4728 301 89 -2894 -10245 -13909 -4720 4896 -2258 -3832 -499
3908 -499 1598 2467 434 -2430 974 5375 1509 -4817 -3640 1053 2620 -2614 3871 -40 -5007
3893 -5007 -7829 -8686 -10325 -16111 -21913 -15962 -7305 4658 7636 491 2942 5820 6858 11630 10326
3878 10326 4768 8389 4576 -3541 5021 1823 -2321 -2288 -8775 -8985 -4960 -3918 -8353 -9824 -5605
3863 -5605 3785 5417 2116 -4855 -4627 -4781 -560 2377 -3707 -7531 -9427 -16357 -18465 -10531 -19489
3848 -19489 -18538 -5933 -5292 -5980 -8256 -3710 -1501 -5669 -4709 -5543 -6673 -2331 -881 521 3962 3990
3832 3990 5592 4712 3021 6110 5860 -5199 -10468 -8286 -2547 2975 221 -4396 -2393 -4097 -2260
3817 -2260 -6102 -5840 -5252 2249 10271 12008 13071 6646 3861 7440 12259 14845 12761 15776 11534
3802 11534 7330 11611 13648 11222 7455 2509 2433 5934 1030 -1138 -5906 -4897 5536 7934 12217
3787 12217 7467 3641 2082 2759 3923 10741 9975 2921 -5111 -4553 5820 5168 -1998 -4965 -2545
3772 -2545 65 3226 5595 4743 2669 2359 -2955 863 -1896 92 -940 -7111 -10144 -9374 -7204 1420
3756 1420 2674 2223 1081 -3029 -3565 -2752 -5119 -4060 -3337 -8146 -3661 1801 4350 7303 783 -8184
3740 -8184 -8765 -4838 5212 1993 -2710 4115 4998 3186 6777 10297 4381 5906 1009 1480 2271 -2703
3724 -2703 206 2294 1373 -931 -6048 -7197 -7606 -6288 -12240 -9311 -7583 -4463 6620 6362 6235 2465
3708 2465 -3519 -4715 -3251 -6968 -555 -6020 -13356 -10749 -6232 -6946 -5816 109 -3048 -5235 -3849
3693 -3849 -2854 -4070 -1491 -3494 -5847 1559 5687 3606 -7121 -13547 -13982 -13400 -8763 -6599 -1625
3678 -1625 1098 1375 2854 4902 -2373 -8159 -1858 1688 3783 9463 19901 15303 2538 -5528 -9462
3663 -9462 -11639 -12859 -7206 470 -11427 -19620 -10796 -2977 -3513 -6348 -7798 566 4346 10549 16665
3648 16665 8459 -4647 -4018 1032 3261 -2676 -8461 -14446 -13253 -4983 -8311 -6279 -10091 -17740 -18174
3633 -18174 -8450 -844 -1380 5227 7189 5745 5585 9431 7865 6842 10997 11241 5653 11452 14224
3618 14224 9952 4157 6794 10259 5149 5062 12840 8580 -1835 88 2831 -3279 -4631 -5313 754
3603 754 7201 4176 8975 5527 2938 2038 2002 -4820 -5246 3785 3812 772 1747 -1940 -6289 -7650 -6345
3586 -6345 -5992 -7195 -8250 -4791 -5566 -8921 -5937 2009 2526 -2156 -2374 -1785 3538 4746 189 -4375
3570 -4375 -6707 -8063 -13366 -9396 -8578 -10278 -13854 -12081 -1393 4471 -1722 -10938 -3884 -289 4157
3555 4157 2423 -2743 -6037 -11001 -5859 -13331 -20736 -20922 -16169 -10535 -3427 9709 17545 10467 200
3540 200 4715 9420 3224 729 -1542 -9737 -6091 -1333 686 6261 1881 -6188 -8758 -12194 -14408
3525 -14408 -14380 -10149 -1243 3491 5208 -2887 -1431 772 2070 3996 2564 -2999 -5858 -974 -1514
3510 -1514 -9089 -5197 -583 -5711 -8510 -14235 -12211 -10586 -5727 2338 2643 -19 2433 1754 -4457
3495 -4457 -2539 10521 14019 9717 4584 4572 5303 6783 4708 1236 883 3795 1976 -4914 -5325 3990
3479 3990 1476 -1725 -3356 -4153 -5084 1549 1452 8393 13156 18194 12037 7264 10566 14572 10093 2962
3463 2962 -229 -7175 -4980 -2761 -5947 -6489 2091 2772 -208 2935 5646 2952 1360 419 -4730 -3614
3447 -3614 -4859 -7021 -2429 2216 5190 1182 -4640 -3901 -10024 -8808 5392 10522 10077 7776 6620
3432 6620 12249 15448 8887 -1746 -2532 -2051 2368 2464 -177 6898 8164 2983 -3892 -5002 -4433 488
3416 488 1121 1488 3582 4048 6504 13324 11002 5533 3988 9513 11255 9194 4730 5278 10847 14238
3400 14238 4172 -5890 17 9144 8650 7073 5434 4937 3375 -1025 -6807 -7965 -9244 -11321 -5715
3385 -5715 -8585 -9981 -13714 -12364 -4678 -4389 -3604 -1121 -6487 -5958 -6258 -2136 -7191 -15708 -9773 -6132
3369 -6132 -5823 946 15786 24292 17903 8052 9424 8142 -5007 -8520 -4952 -11883 -15330 -10490 -11804
3354 -11804 -10838 -5928 4507 3670 -1374 -8537 -4258 -56 2748 267 13016 17246 8894 -41 -3598
3339 -3598 -9911 4179 7767 -6003 -5230 -742 -2706 1804 -986 2444 4165 5307 4646 305 -6132
3324 -6132 -2626 3349 -325 -2131 -3153 -6221 -5619 -7824 -4577 344 2465 -7233 -11105 2080 6196
3309 6196 6148 1339 -5672 -2005 6200 5769 13700 27035 22970 10158 1673 -6672 -1225 7498 8253
3294 8253 3842 6107 2881 -3160 -8824 -9810 -11449 -14083 -16001 -11730 -5725 -7085 -7690 -1598 1112
3279 1112 2006 -1118 -2753 2148 8789 8849 1533 -1455 -381 4489 9220 5594 5054 1740 1576 315
3263 315 -4559 -13718 -9597 2112 5206 2418 4380 114 -1935 6644 15535 18190 13935 13063 10642
3248 10642 9308 9154 12640 8950 4095 2561 1270 -1054 -4923 -9905 -6296 -5685 -8409 -11689 -6092
3233 -6092 -5830 -5186 -7818 -8935 -6645 -6815 -10823 -6895 -649 3809 8927 4168 -5814 -9686 2370
3218 2370 4606 -1047 -5029 -6781 -6668 -6474 -4718 -913 1126 5971 7826 2320 -5297 -4602 -4830 -3311
3202 -3311 5189 95 -3245 -919 -461 1398 3863 5345 3013 5464 7834 10965 9880 5068 227
3187 227 -9096 -12103 -3687 -2716 -7767 -2889 3911 6056 -49 -2558 2007 -727 912 -1126 1259
3172 1259 3320 5871 2911 2348 -1427 -9476 -3860 1364 -511 3962 641 -788 770 4031 3623
3157 3623 3732 302 1939 2915 -2090 293 5813 5590 -1456 762 1041 -4080 -6504 -11938 -5973 -3231
3141 -3231 -5685 -7605 -5407 -4492 -5464 -409 3792 535 -2465 -8570 -7753 -2543 947 -935 -9753 -11544
3125 -11544 -2324 633 4099 1975 1914 4123 8146 2406 -6057 -11031 -6943 -7639 -8532 -2932 8092
3110 8092 6478 4861 7076 8710 6459 2652 -1274 -2292 -1208 1148 -2110 3502 5010 6126 4639
3095 4639 2895 3224 1112 829 5996 1557 -3156 -11904 -14765 -15844 -3254 6071 10347 3473 -5991
3080 -5991 -2435 -1965 1245 1042 -3464 -4831 -6938 -6174 -1361 3437 -184 -940 852 685 4226 13154
3064 13154 6036 3229 5453 5560 612 8520 8006 7380 12161 5047 1545 1380 -3630 3386 6453 -2671
3048 -2671 -4176 -3143 -3721 2752 4185 8308 7329 23 2504 5523 7240 1611 1955 -3170 -10792 -13327
3032 -13327 -10759 -6308 2580 1736 8768 12055 8279 2451 2806 2619 -7705 -1019 -2282 -6467 -7119
3017 -7119 2439 12951 12712 13062 14345 12076 12242 13295 7823 3880 6983 8826 7386 5202 8332
3002 8332 15431 10041 11245 10529 12473 10088 8798 8560 6445 3694 -462 -6362 -1946 -1437 -3536 -7202
2986 -7202 -8419 -8867 -5464 -2771 -251 -3712 1799 2340 3088 6780 3828 4523 3547 1013 -569 -2070
2970 -2070 -720 -3331 -6508 -11592 -9301 -1021 3190 -4537 -13615 -10355 -6749 -4221 -2395 -6622 -9128
2955 -9128 -8816 -8358 -11957 -8788 -6386 -7449 -2415 -4665 -8048 -3505 2531 1203 1698 683 4926 8194
2939 8194 1601 -6349 -11562 -8903 -732 -996 -4656 -8242 -6714 -2649 2145 -5465 -2935 -3742 -12801
2924 -12801 -15639 -10139 -1102 -3656 -6857 -6783 -4645 -4574 454 8550 13953 8649 4314 6869 684 1123
2908 1123 2703 3024 774 -3918 -7300 -6494 -5890 -10164 -12016 -7520 -6076 -9812 -8792 -4481 -4383 380
2892 380 -1762 392 -3712 -10267 -9890 -7635 -1046 -1918 2888 -1436 -7817 -8923 -14073 -9943 -13332 -12434
2876 -12434 -7912 -11002 -7151 -6376 -5183 -2189 1605 12263 12199 8755 4635 7256 9744 4639 5818
2861 5818 5222 4819 4667 2239 3572 2265 3072 5210 4182 4843 11335 14274 6865 351 -6354 -8457
2845 -8457 -11443 -10193 -5019 5615 8681 9164 3073 2014 2454 3144 3725 874 1911 3188 1838 -1514
2829 -1514 -922 -5332 -4902 5417 3045 -210 381 1510 4226 6140 4357 277 -6626 -5757 -2781 3062
2813 3062 5643 -4734 -16822 -20781 -16029 -9938 -4398 879 -5695 -4564 -1176 -729 1135 -1743 -9091
2798 -9091 -8274 -8460 -2158 5786 7867 9585 10577 5167 1125 6439 5790 30 11538 13508 7011 6565
2782 6565 12664 14347 15440 11817 6013 14037 13776 12199 4804 -648 7464 6068 9264 10545 5537
2767 5537 2163 -990 -2316 -988 -3271 -4464 -1012 -6963 -12193 -2765 -418 -579 -2824 385 989
2752 989 4860 613 -4408 -12706 -12745 -9437 1568 3358 307 1997 1687 211 5336 9817 11701 8202
2736 8202 8408 10253 9964 15206 16152 12516 5213 -1360 -3244 -13549 -19716 -15016 -3948 6881 11625
2721 11625 14458 12908 10284 16003 11978 584 -5910 1694 8784 8655 4756 -2248 1742 7308 -851
2706 -851 -566 -3276 5512 11770 7025 710 -2543 -11339 -13801 -8817 -2422 4496 27 9309 10131 6011
2690 6011 6084 5479 2698 -4031 -3830 -1147 2500 -2020 -4858 -788 -1075 1618 4870 -2500 -1241 4816
2674 4816 5969 2705 4383 1964 2547 5156 5738 8801 8886 2222 -8493 -8004 909 4077 1223 -4737
2658 -4737 -11051 -12542 -3664 -4322 -1364 1406 -5561 -8303 -10668 -14170 -14026 -12926 -8913 -4742 -4158 6648
2642 6648 11940 6095 463 -2265 -2334 4908 1842 3392 -289 2351 6649 11332 2617 -4060 1089
2627 1089 6848 4555 6731 2252 -230 -4658 -4564 -8110 -12659 -11506 -2891 6637 868 -5644 -3526
2612 -3526 -3059 -7615 -2641 -3341 -450 54 -1974 834 5225 188 -5626 -4152 -1975 1210 4629 4372
2596 4372 3300 5572 7471 8755 1070 6449 5421 -4800 -9423 -4089 -6748 -12950 -8666 -766 5582
2581 5582 3444 4883 6187 8758 15688 18854 15953 8432 682 -6217 -2851 3231 3511 -355 3303
2566 3303 8200 5206 7489 4224 2614 7697 10273 5774 6768 10556 16290 20516 10144 -2096 -6555
2551 -6555 -3078 1514 4913 7666 5493 -2374 -4940 725 3596 4889 7648 14798 12248 8231 4790
2536 4790 1339 -9925 -8993 -3433 88 -3488 -6916 -289 1406 -6085 -3261 -2060 -9953 -9681 -4341
2521 -4341 -2366 104 3792 5120 8493 4222 1543 2900 -2304 -1032 2934 3620 15 -606 5241
2506 5241 7209 6776 770 -4258 -6681 -4727 162 2910 -2609 -11431 -13356 -7991 -5718 1307 494
2491 494 7511 6983 17019 15291 9444 10425 9264 6908 7949 15649 13130 10071 728 -5504 -3033
2476 -3033 -499 2410 -7 -1694 3475 3416 -2820 -4737 170 -1747 2209 8664 9029 3066 5233 7344
2460 7344 2488 6022 6212 1688 2812 10985 3800 -8007 121 8863 10943 8122 6188 -2787 -2297
2445 -2297 853 1324 -5918 -3904 -250 1183 6133 2353 -3209 -4031 1958 8937 10215 10253 -1345 167
2429 167 2710 1560 5187 6489 855 2361 2891 3289 3893 6248 7562 6825 3872 -1986 -3998 -332
2413 -332 3122 1654 -1403 -3653 -435 -7304 -10047 -8308 3207 7653 8508 5016 -3000 -2484 6583
2398 6583 8392 6344 8546 9751 11291 14076 11350 8016 5167 10417 7997 4189 3806 3060 7949
2383 7949 11568 4770 -809 -2418 -746 -297 -5785 -8586 -9955 -11361 -7975 -5106 -2014 -1302 -1272 -11556
2367 -11556 -15806 -4412 -3170 -2767 -346 6866 5803 2980 6391 4619 -2446 -7717 -4432 3744 12819
2352 12819 13000 2970 4981 10474 3000 -2255 -1456 2246 971 -10924 -8571 3728 1942 -8216
2338 -8216 -11266 -9931 -3042 -4852 -5481 -5908 -5367 -4392 -7661 -2954 -1092 -5602 -2130 1843 3481 -4390
2322 -4390 1893 2922 3115 13739 11020 4887 1513 1644 -613 -633 5296 -226 -8733 -6154 -4968 -7162
2306 -7162 -12920 -18321 -21028 -12825 -8474 -6441 -10728 -11810 -8745 -11506 -10199 -10220 -9477 -1075 8616 9495
2290 9495 13651 18236 15964 9204 4687 6705 514 6396 4980 4473 97 -6034 -13425 -12294 -9420
2275 -9420 -6456 -10317 -9510 -7120 -4326 -6870 -17374 -12157 -9231 -5204 2696 1772 -2933 -7628 -9012
2260 -9012 -5912 -854 8309 8865 5648 318 -2113 1862 8852 10713 3137 1015 481 10688 7610
2245 7610 -5494 -7974 -2409 5938 8332 8067 4582 -779 -3789 -4885 -7462 -7176 -3323 -2285 -2670
2230 -2670 3647 3209 1977 10586 13245 12111 12381 6401 -2499 -5303 -7901 -6033 -6969 3362 4063 6959
2214 6959 8639 8955 1478 -4236 -5910 1416 5948 4386 2030 640 -1188 -5009 -11642 -9046 -8726
2199 -8726 -6562 -11332 -10574 -15055 -12516 -4231 3502 6574 2648 -824 1067 -915 4082 169 -3462
2184 -3462 -4945 -3001 -5394 -5008 1787 4403 1016 5917 12513 14330 11911 12873 9018 3432 -2550
2169 -2550 -5943 -4519 -3370 -2667 405 -191 232 -3507 -919 1523 4273 4329 2994 9685 11894 9056
2153 9056 6759 2231 6144 8311 1636 2028 6230 1946 3970 1526 4326 3894 1286 6294 11394
2138 11394 14685 10136 7162 8726 3781 1383 -2059 -7047 -8943 -167 8810 6865 7808 11458 11723
2123 11723 5925 -3043 -6300 -3646 -6252 -10839 -8651 -10402 -9633 -1204 -3593 -9454 -7337 -6369 -8358
2108 -8358 -4756 -4043 -7683 -12382 -10289 -7204 -7258 -4263 5334 12883 9528 9689 16014 17755 12725 7056
2092 7056 6180 9674 2847 -7857 -10572 -9838 -7511 -6695 3480 5521 7123 6702 444 2366 3603
2077 3603 -553 8 -2726 -3375 -7136 -6082 -2137 -2337 4731 5185 6294 -482 -339 -8018 -9863 -3787
2061 -3787 -2284 -3647 -8434 -5763 -2683 -5649 -10070 -11762 -13698 -14395 -13642 -6434 -2081 4744 6192
2046 6192 -474 -6091 -4436 2302 1079 3684 667 298 2479 8053 9339 11747 8293 848 4835
2031 4835 4157 3783 67 4434 12647 11852 7057 4106 -442 271 8795 15550 9749 1251 -4384 7338
2015 7338 10802 12206 11574 5945 -593 2942 9400 15321 17555 17299 10248 3681 2936 372 996 5037
1999 5037 8634 8314 5927 7601 7313 5373 3511 6995 -1520 -7669 -4776 634 6884 12117 5484
1984 5484 1549 4196 6651 12881 12797 13536 11003 7490 5053 -5142 -2016 -1018 5475 6506 8618 4699
1968 4699 -1558 -2530 -48 8292 7542 7517 6606 4003 5219 4472 6925 -405 -5068 -2413 2312 6566
1952 6566 7563 6269 11701 11372 10737 14010 17803 11040 8082 11059 12599 16043 16010 8064 7850 12643
1936 12643 14667 12593 11559 4655 359 680 -18 2967 3133 -2334 -7739 122 3760 2661 -4419
1921 -4419 -7773 -12514 -19963 -8632 1583 153 1492 6505 9060 3650 -1417 55 -2422 5521
1907 5521 3670 3079 -2260 -4377 -3021 2583 12368 16521 12166 9633 7975 -2186 -11148 -677 8190
1892 8190 -747 -5403 2465 11821 7065 3589 774 -2090 -3718 -1971 -1612 -2041 -5462 1246 14767
1877 14767 16175 4893 2227 1886 3293 697 -990 4317 9757 12533 6954 2560 1370 -2132 7
1862 7 7081 8742 2766 1764 5874 5973 820 -1646 -1957 -6376 -1147 -170 -1350 -8836 -17891 -12935 -8621
1845 -8621 -5618 -633 2777 -328 -2279 4405 2885 7107 6594 6590 7355 8983 8493 8411 10308 12197 7436
1828 7436 4376 3909 2128 6354 8304 7896 1494 10353 16836 12414 10847 6868 5996 1756 -5808 -13102
1812 -13102 -9895 -4711 1878 2032 -6762 -14868 -5090 -4525 -5600 -7468 -6687 -2304 133 4703 5294 3374
1796 3374 7528 8541 3523 4219 9522 13450 15687 9477 1959 -3921 -9653 -6769 625 9871 6713
1781 6713 10214 6066 -3443 -2893 -3415 -3205 2618 -9267 -14504 -7557 -2983 151 2710 -4477 -4867 -6616
1765 -6616 -7312 -5703 -3452 -5829 -3689 -106 2661 6018 8238 -753 -3678 -1658 -831 -2723 -7051
1750 -7051 -7311 -3817 -3599 -5985 -5099 -6636 -11413 -8743 1229 6227 6244 2979 4248 1572 467 1979
1734 1979 2071 956 2035 5422 6235 6578 8221 6051 3739 2995 906 5475 13855 11158 3440 -3806
1718 -3806 -1070 3117 12789 12298 5317 -3480 1388 2979 -3791 1830 1449 -1178 1487 -1527 -4077
1703 -4077 -4431 -1736 -3690 -1719 1691 162 -6685 -2080 -416 57 -1096 -2211 1389 -1523 -7531
1688 -7531 -9960 -6075 -8854 -7878 -1509 3167 1367 -7349 -12157 -8530 -5362 178 4968 -1147 -4115
1673 -4115 983 4618 2815 4901 6765 7484 6545 5722 4786 -3091 193 -2297 -3617 -3764 -2240 -821
1657 -821 -5082 -14343 -10630 -7000 -5253 -7499 -4955 -5993 -3205 5211 6673 3818 3983 5139 1619
1642 1619 539 5556 3952 1081 4911 5165 5534 2937 8843 8955 9191 6853 2646 -862 866 -279
1626 -279 -8585 -15657 -11250 -2403 -2743 -14922 -13758 -7660 -3731 -4688 -4711 1888 6821 1406 2233 2183 -5550
1609 -5550 -12484 -5913 -759 1889 3176 -3592 -5326 -4861 1309 7591 -2636 -7648 -6597 -1452 -2785
1594 -2785 -3406 -8434 -2175 6586 993 -2882 1701 6257 2006 -2152 3194 5467 5676 4547 5724
1579 5724 5518 -2534 -7367 -2421 -4006 -81 -5366 -6754 2161 9997 6521 6124 12385 13509 5439
1564 5439 -3021 -3046 -1942 -1183 -2409 -5154 -7024 -13520 -12714 -3573 1721 4177 6835 3321 515 -815
1548 -815 3294 8033 610 -1756 2172 12426 16099 17011 10907 5573 796 -4341 -1173 8385 15013
1533 15013 6315 -3486 -2701 -4752 -447 -1399 -3435 3033 2902 3932 1904 -2332 -537 3755 -2051
1518 -2051 -5946 -12390 -12553 -11684 -12579 -15264 -13788 -7446 -2449 -3433 -4803 -8109 -7549 -6072 -7689 -361
1502 -361 3455 -2908 -6589 -11994 -16392 -7036 -6045 -2228 -2170 -5977 -7348 -2489 1689 10231 12297 6374
1486 6374 -1293 -3440 -3397 -1727 -668 -2443 1515 7605 621 -2043 3482 5215 -1740 -382 -1911
1471 -1911 -3163 -3149 -2656 -1227 -2727 90 7599 11715 -1759 -9600 -7263 -590 1185 4210 5129 2692
1455 2692 1280 -935 2018 7 -6589 -1251 1387 2521 -256 -1643 -2778 -6754 -4226 -9651 -15324
1440 -15324 -13592 -12770 -17448 -10927 7309 13205 4132 -80 -3689 -9279 -5218 -2926 -3607 797 -731
1425 -731 2073 10357 1969 -347 -4867 680 5207 8331 9158 12572 5730 1858 4405 6311 5844 -710
1409 -710 -8903 -10440 3519 6998 -1664 -8046 -6578 -1966 -2509 -560 1713 3522 3303 8235 5375
1394 5375 6199 1139 -3237 -2780 -1447 -1857 -3479 344 2932 -2018 -4601 -1581 2961 1824 4030 9651
1378 9651 13803 10979 6844 5471 1039 488 -3044 -6598 -1515 5454 7753 4988 6800 2543 3269
1363 3269 4066 -195 -1661 -1412 131 -4695 1129 8371 3353 -1891 -5992 -7649 4374 7535 5583
1348 5583 -1353 -6641 -6114 -5323 -4482 265 1485 2071 6247 3509 -2054 -6592 26 8204 16335 12478
1332 12478 8334 8200 6179 5581 -1238 -5080 3062 9757 3397 -531 2785 7169 16119 16987 14519
1317 14519 21504 11192 -2550 -4624 -1842 6488 11429 7880 -428 -6649 -2781 388 2533 6134
1303 6134 2110 585 -4295 -12031 -7022 -7546 -13334 -14394 -13070 -9175 -2229 1626 670 -2936 -7561
1288 -7561 -4808 -2247 -3346 -741 -479 -756 -124 -5331 -11455 -13783 -5977 -3850 -9250 -5259 -3374 -5706
1272 -5706 660 710 1047 2685 2201 3615 9668 3800 5772 6344 4904 5446 -8528 -10117 -1073 5649
1256 5649 5887 6740 9707 7128 4680 2279 3948 -3822 -7308 -5563 -6380 -4099 -585 5388 8893 4105
1240 4105 4113 8438 2891 -2428 -1954 3940 7179 4921 356 -845 -2437 -3804 -5565 -7281 -6978 -5263
1224 -5263 -2132 917 2051 4674 -1094 1900 9518 3187 4490 9592 2700 3737 -3491 -5592 1169
1209 1169 2830 -596 -6986 -7830 -5627 1308 -4781 -9654 -4383 -5568 -2529 6388 9641 11369 12582
1194 12582 12761 7661 -622 -3439 -6832 -4124 -2023 -2269 -4358 -3976 -2387 6243 4671 1203 44
1179 44 -232 1821 1472 2671 9334 14327 7776 -292 -4025 -9938 -3385 6212 8839 4462 2518 -3338
1163 -3338 -4658 -7171 2074 8504 -383 -4922 -607 1454 1621 -4123 -4970 1312 2824 259 -6419
1148 -6419 -6336 -11680 -15530 -4948 -312 -5885 -4313 -7833 -5471 4347 7111 -2211 -2193 -648 265 -5881
1132 -5881 -8591 -4941 -4601 -3326 3057 6472 10503 10538 10476 8216 3185 -473 -2419 -1095 2860 2907 2117
1115 2117 961 -3918 -9889 -13585 -5294 -4169 -8153 -7720 -4919 -3091 -1735 3920 4178 1165 1165 2055
1099 2055 2263 1351 -385 920 -536 -5314 -6284 -11553 -9553 -6728 -4770 8937 10828 1595 5921
1084 5921 8337 6675 -368 -11012 -11047 976 5039 -1092 -8653 -10293 -7813 -9233 -10613 -6142 -7857
1069 -7857 -9932 -11244 -7172 -3467 -9106 -5717 -12120 -9207 -2627 -3324 -7757 -7649 -7916 -13441 -12211 -13394
1053 -13394 -16684 -11443 -5665 1336 6691 9958 11838 12615 2812 -2543 4519 8410 9817 3889 6468
$$ [...]
##END NTUPLES=NMR SPECTRUM
##END=
