##TITLE=Analysis number 325225
Compound Code gk 01947
Project Code adrs
Chemist Name aci
##JCAMPDX= 6.0         $$ Bruker NMR JCAMP-DX V2.0
##DATA TYPE= NMR SPECTRUM
##DATA CLASS= NTUPLES
##ORIGIN= Bruker BioSpin GmbH
##OWNER= nmr
$$ XWIN-NMR		Version 3.5
$$ Thu Dec 14 15:24:24 2006 GMT Standard Time (UT+0h)  MAYBRIDGE\nmr@NMR_250MHZ
##.OBSERVE FREQUENCY= 250.131544655141
##.OBSERVE NUCLEUS= ^1H
##.ACQUISITION MODE= SIMULTANEOUS (DQD)
##.ACQUISITION SCHEME= undefined
##.AVERAGES= 16
##.DIGITISER RES= 18
##SPECTROMETER/DATA SYSTEM= dpx250
##.PULSE SEQUENCE= zg30
##.SOLVENT NAME= DMSO
##.SHIFT REFERENCE= (INTERNAL, DMSO, 0, 16.522)
##AUDIT TRAIL= $$ (NUMBER, WHEN, WHO, WHERE, WHAT)
$$ ##TITLE= Audit trail, XWIN-NMR		Version 3.5
$$ ##JCAMPDX= 5.01
$$ ##ORIGIN= Bruker BioSpin GmbH
$$ ##OWNER= nmr
$$ C:\u/data/dgb/nmr/ADRS/1620/pdata/1/auditp.txt
$$ ##AUDIT TRAIL=  $$ (NUMBER, WHEN, WHO, WHERE, WHAT)
(   1,<2006-12-14 15:24:04.23 +000>,<MAYBRIDGE\nmr>,<NMR_250MHZ>,
      <created by zg, POWCHK disabled, PULCHK disabled
       configuration hash MD5:
       49 4B E0 1D 92 C2 6B 37 9F E6 65 BC 52 41 86 1D
       data hash MD5: 64K
       BD 88 EC 64 DA 32 8B 44 B5 73 D5 5B 2F 2D 36 D8>)
(   2,<2006-12-14 15:24:16.01 +000>,<MAYBRIDGE\nmr>,<NMR_250MHZ>,
      <Start of raw data processing
       ef LB = 0.3 FT_mod = 6 PKNL = 1 SI = 32K 
       data hash MD5: 32K
       95 32 86 45 33 9C 93 96 E2 13 32 61 1E E1 85 86>)
(   3,<2006-12-14 15:24:17.67 +000>,<MAYBRIDGE\nmr>,<NMR_250MHZ>,
      <apk 
       data hash MD5: 32K
       BA 19 D6 9B 91 15 EC F6 47 AF 0F 1E F7 95 68 52>)
(   4,<2006-12-14 15:24:18.43 +000>,<MAYBRIDGE\nmr>,<NMR_250MHZ>,
      <abs ABSG = 5 
       data hash MD5: 32K
       C2 85 F8 A4 D0 80 D0 F9 56 C7 52 A3 83 71 E3 75>)
$$ ##END=
$$ 
$$ hash MD5
$$ EC 2F 15 9D A4 D3 93 54 73 59 E2 B3 06 8B 2E 29
##$RELAX= 
##$RELAX= 
##$RELAX= 
##$RELAX= 
##$RELAX= 
##$RELAX= 
##$RELAX= 
$$ Bruker specific parameters
$$ --------------------------
##$DU= <C:\u>
##$EXPNO= 1620
##$NAME= <ADRS>
##$PROCNO= 1
##$TYPE= <nmr>
##$USER= <dgb>
##$AMP= (0..31)
100 100 100 100 100 100 100 100 100 100 100 100 100 100 100 100 100 100 
100 100 100 100 100 100 100 100 100 100 100 100 100 100 
##$AQSEQ= 0
##$AQ_mod= 3
##$AUNM= <au_zg>
##$AUTOPOS= <27 >
##$BF1= 250.13
##$BF2= 250.13
##$BF3= 250.13
##$BF4= 250.13
##$BF5= 500.13
##$BF6= 500.13
##$BF7= 500.13
##$BF8= 500.13
##$BYTORDA= 1
##$CFDGTYP= 0
##$CFRGTYP= 5
##$CHEMSTR= <none>
##$CNST= (0..31)
1 1 145 1 1 1 1 1 1 1 1 1 1 1 1 1 1 1 1 1 1 1 1 1 1 1 1 1 1 1 1 1 
##$CPDPRG= <>
##$CPDPRG1= <>
##$CPDPRG2= <>
##$CPDPRG3= <>
##$CPDPRG4= <mlev>
##$CPDPRG5= <mlev>
##$CPDPRG6= <mlev>
##$CPDPRG7= <mlev>
##$CPDPRG8= <mlev>
##$CPDPRGB= <>
##$CPDPRGT= <>
##$D= (0..31)
0 1 0 0 0 0 0 0 0 0.06 0 0 0 0 0 0 0.0002 0 0 0 0 0 0 0 0 0 0 0 0 0 0 
0 
##$DATE= 1166109843
##$DBL= (0..7)
120 120 120 120 120 120 120 120 
##$DBP= (0..7)
150 150 150 150 150 150 150 150 
##$DBP07= 0
##$DBPNAM0= <>
##$DBPNAM1= <>
##$DBPNAM2= <>
##$DBPNAM3= <>
$$ [...]
##$SUBNAM6= <"">
##$SUBNAM7= <"">
##$SUBNAM8= <"">
##$SUBNAM9= <"">
##$SW= 20.6930455092707
##$SWIBOX= (0..15)
0 0 3 0 0 0 0 0 0 0 0 0 0 0 0 0 
##$SW_h= 5175.983436853
##$TD= 65536
##$TD0= 1
##$TE= 295.16
##$TE2= 300
##$TE3= 300
##$TEG= 300
##$TL= (0..7)
0 120 120 120 120 120 120 120 
##$TP= (0..7)
150 150 150 150 150 150 150 150 
##$TP07= 0
##$TPNAME0= <>
##$TPNAME1= <>
##$TPNAME2= <>
##$TPNAME3= <>
##$TPNAME4= <>
##$TPNAME5= <>
##$TPNAME6= <>
##$TPNAME7= <>
##$TPOAL= (0..7)
0.5 0.5 0.5 0.5 0.5 0.5 0.5 0.5 
##$TPOFFS= (0..7)
0 0 0 0 0 0 0 0 
##$TUNHIN= 0
##$TUNHOUT= 0
##$TUNXOUT= 0
##$USERA1= <user>
##$USERA2= <user>
##$USERA3= <user>
##$USERA4= <user>
##$USERA5= <user>
##$V9= 5
##$VALIST= <valist>
##$VCLIST= <CCCCCCCCCCCCCCC>
##$VD= 0
##$VDLIST= <DDDDDDDDDDDDDDD>
##$VPLIST= <PPPPPPPPPPPPPPP>
##$VTLIST= <TTTTTTTTTTTTTTT>
##$WBST= 1024
##$WBSW= 4
##$XGAIN= (0..3)
0 0 0 0 
##$XL= 0
##$YL= 0
##$YMAX_a= 249092
##$YMIN_a= -228668
##$ZGOPTNS= <>
##$ZL1= 120
##$ZL2= 120
##$ZL3= 120
##$ZL4= 120
##$ABSF1= 16.522
##$ABSF2= -4.171173
##$ABSG= 5
##$ABSL= 3
##$ALPHA= 0
##$AQORDER= 0
##$ASSFAC= 0
##$ASSFACI= 0
##$ASSFACX= 0
##$ASSWID= 0
##$AUNMP= <proc_1d>
##$AZFE= 0.1
##$AZFW= 0.1
##$BCFW= 0
##$BC_mod= 0
##$BYTORDP= 0
##$COROFFS= 0
##$CY= 12.5
##$DATMOD= 1
##$DC= 0
##$DFILT= <>
##$DTYPP= 0
##$F1P= 14.0000005364418
##$F2P= -0.99999901652339
##$FCOR= 0.5
##$FTSIZE= 32768
##$FT_mod= 6
##$GAMMA= 0
##$GB= 0
##$INTBC= 1
##$INTSCL= 1
##$ISEN= 128
##$LB= 0.3
##$LEV0= 0
##$LPBIN= 0
##$MAXI= 10000
##$MC2= 0
##$MEAN= 0
##$ME_mod= 0
##$MI= 0
##$NCOEF= 0
##$NC_proc= -3
##$NLEV= 6
##$NOISF1= 0
##$NOISF2= 0
##$NSP= 0
##$NTH_PI= 0
##$NZP= 0
##$OFFSET= 16.522
##$PC= 1
##$PHC0= 217.9026
##$PHC1= 5.77098
##$PH_mod= 1
##$PKNL= yes
##$PPARMOD= 0
##$PSCAL= 4
##$PSIGN= 0
##$REVERSE= no
##$SF= 250.13
##$SI= 32768
##$SIGF1= 0
##$SIGF2= 0
##$SINO= 400
##$SIOLD= 32768
##$SREGLST= <1H.DMSO>
##$SSB= 0
##$STSI= 32768
##$STSR= 0
##$SW_p= 5175.98343685301
##$SYMM= 0
##$S_DEV= 0
##$TDeff= 65536
##$TDoff= 0
##$TI= <Analysis number 999999
Compound Code 99
Book Reference 9
Project Code 9>
##$TILT= no
##$TM1= 0
##$TM2= 0
##$TOPLEV= 0
##$USERP1= <user>
##$USERP2= <user>
##$USERP3= <user>
##$USERP4= <user>
##$USERP5= <user>
##$WDW= 1
##$XDIM= 32768
##$YMAX_p= 415149805
##$YMIN_p= -151832
$$ End of Bruker specific parameters
$$ ---------------------------------
##NTUPLES= NMR SPECTRUM
##VAR_NAME=  FREQUENCY,     SPECTRUM/REAL,   SPECTRUM/IMAG
##SYMBOL=    X,             R,               I
##VAR_TYPE=  INDEPENDENT,   DEPENDENT,       DEPENDENT
##VAR_FORM=  AFFN,          ASDF,            ASDF
##VAR_DIM=   32768,         32768,           32768
##UNITS=     HZ,            ARBITRARY UNITS, ARBITRARY UNITS
##FACTOR=    0.157963299565203, 1,           1
##FIRST=     4132.6476996994, 0,             0
##LAST=      -1043.33573715361, 0,           0
##MIN=       -1043.33573715361, -151832,     0
##MAX=       4132.6476996994, 415149805,     0
$$ Real data points
##PAGE= N=1
##DATA TABLE= (X++(R..R)), XYDATA
$$ [...]
18551a1947J2916N3421j8633k7319M719l993l6118J512k9488J3822K9497K5320
18539A3709j3635o598j7259j1158K9638J7379l3333p334j4601J4696J7155M221
18527g120k1502n0165l5839N9144J3673k3641L58L9354P0576N271l4062l5013
18515a8966k1540Q935K835j0440O508J0388J7259j9281k7742M7205j9857l626
18503b8322L4453K6729M149j6404j9618l6143K0890k7537j3956N15O118L5762
18491a3364K2660M3586L7486k6832j7516m0755k1590n055l7431J3597J0475o73
18479c5412J7139M021q670J7008j1092n453K9343N1960k454J5046l9834l8039
18467f437J0579n257k4915k009L4816M2137L858l7539p1628j1205R802J9745j287
$$ plain form
18551 -11947 969 54390 35757 8438 13157 9164 -26954 -25442 -54930 -41108 -11611 13709
18539 13709 74 -6524 -23783 -34941 -5303 12076 -21257 -28591 -43192 -28496 -11341 -7120
18527 -7120 -28622 -78787 -114626 -55482 -41809 -65450 -65092 -25738 44838 50109 16047 -18966
18515 -18966 -40506 -31571 -28736 -39176 -32668 -22280 -5021 -24302 -52044 -4839 -24696 -28322
18503 -28322 6131 32860 37009 20605 987 -35156 -14266 -41803 -55759 -55244 -49126 -13364
18491 -13364 9296 52882 90368 63536 46020 5265 -16325 -21380 -58811 -45214 -34739 -35412
18479 -35412 -18273 -14252 -22922 -5914 -17006 -22459 6884 58844 56390 71436 31602 -6437
18467 -6437 4142 -1115 -26030 -28039 6777 48914 52772 15233 -56395 -67600 -57798 -38053 -39340
18454c9340k6490L5001L0933m5732k6423L3288L0490q611P371j6600K6632n47
18442b8r026k1764L4514K6351L168L3405n1092N713R458l8592j9327L9478K9776
18429D2034Q134l5421j1235j8899k6671K2407M3164K0846L1171n7953l5934J8841
18417D84K6849J9025n103j4880l8040j9688M9308n060j1401J2933m57k7721j3472
18404b7223J6789K531l8081m7548K0685L5502j7834K5410N5063n881m5060j6311
18392d1958K9192q538j3173L952K8358m761o328l7377j1520J5611O546j5470M8669
18379f797L164m0677j9398o581M6807N3914N9605k7592l8904j1937O657L1630
18367D9891k479l380l5366o0933q06O8680J7228K5988k185k856n555l097L79K0076
$$ plain form
18454 -39340 -65830 -30829 104 -45628 -72051 -38763 -8273 -16884 -9513 -26113 519 -28
18442 -28 -9054 -30818 3696 30047 33215 66620 15528 21241 30699 -7893 -27220 12258 42034
18429 42034 50168 14747 3512 -15387 -42058 -19651 23513 44359 75530 17577 -18357 484
18417 484 27333 46358 41255 26375 -11665 -31353 17955 12895 1494 14427 13970 -13751 -27223
18404 -27223 -10434 -7903 -45984 -93532 -72847 -37345 -55179 -29769 25294 19413 -25647 -41958
18392 -41958 -12766 -21304 -34477 -30525 -2167 -6928 -13256 -50633 -62153 -46542 -39996 -55466 -6797
18379 -6797 -3633 -44310 -63708 -70289 -23482 30432 90037 62445 23541 11604 18261 49891
18367 49891 47412 44032 8666 -52267 -53073 15607 32835 58823 56638 53782 48227 45130 45509 65585
18353F5585k874L8574m0465j9071l6007k6993j1749j603R289K2417j2352k7624
18341d2873K1916R786L237J2409j706mJ3823P713L27p673j8432r557p903o509
18327b5446n163K4940P807r303K7277q911k4991j7109M3545N000o72j2267l1611
18314b6904k0461j9601K2116k4319K645K8235K8862r628l2197k5089K0772L453
18302e2116m2026k3848K6493K4521M6123M1165L0370J6230j0187k0394j9326j8536
18290a531k3093J2687J0905l8458k7267J3188K5201J7035r824j3877j7862J1240
18278d1656J7747J1117p383J4030o183l2253o076K5550N4119J1184l5616j6598
18266a2018P970K0860j1802o953K1329K0338J1789o765J2077m284l2970k423k5976
$$ plain form
18353 65585 62711 101285 60820 41749 5742 -21251 -33000 -34603 -25314 -2897 -15249 -42873
18341 -42873 -20957 -11171 -7934 4475 2769 2765 16588 24301 24628 16955 -1477 -11034 -18937 -25446
18327 -25446 -30609 -5669 2138 -7165 20112 11201 -13790 -30899 12646 17646 16974 4707 -26904
18314 -26904 -47365 -66966 -44850 -69169 -66524 -38289 -9427 -19055 -51252 -76341 -55569 -52116
18302 -52116 -94142 -117990 -91497 -66976 -20853 20312 50682 66912 56725 36331 17005 -1531
18290 -1531 -24624 -11937 -1032 -39490 -66757 -53569 -28368 -11333 -21157 -35034 -52896 -41656
18278 -41656 -23909 -12792 -20175 -6145 -12328 -44581 -50657 -25107 29012 40196 4580 -12018
18266 -12018 -4048 16812 5010 -1943 19386 39724 51513 44748 56825 52541 19571 17148 -8828
18253h828J6304K1974k4811j4014L2296j8014j4768l6827j7594L5942K4524l872
18241g688o356j5157l5298K6943L3540k7411m3881j7262N3358j2362l0146J312
18229h0408K3582l8904K4881L2831q47J0454m807m0142L866L1622K7702J1799
18217A629m3507j9453J5890N0549K7552J0194K2724q650J6433j8239q80j2777
18205D1465k7389N649J9618j0108l2948n7751n5731M3031M6864K9692L5044l9798
18193b362K0499J5384J1663j8069j9235R299O410N036j8411P243j0161j3584K0811
18180A4523J816J6132k5244m9048P1Q160K2559r601k3122j2544M420K337J2654
18167c6887L2277Q124j2411L550k1133L1322q235k169J0892l5053J7250O602N438
$$ plain form
18253 -8828 7476 29450 4639 -9375 22921 4907 -9861 -46688 -64282 -28340 -3816 -7688
18241 -7688 -14044 -29201 -64499 -37556 -4016 -31427 -75308 -92570 -39212 -51574 -81720 -80408
18229 -80408 -56826 -95730 -70849 -38018 -38865 -28411 -33218 -73360 -69494 -37872 -10170 1629
18217 1629 -41878 -61331 -45441 5108 32660 42854 65578 56928 73361 55122 54242 41465
18205 41465 14076 19725 39343 29235 -3713 -61464 -117195 -74164 -27300 2392 37436 -2362
18193 -2362 18137 33521 45184 27115 7880 17179 23589 28625 10214 17457 7296 -6288 14523
18180 14523 16339 32471 7227 -41821 -41750 -33590 -11031 -20632 -43754 -56298 -51878 -49541 -36887
18167 -36887 -4610 3514 -8897 -5347 -26480 4842 -3393 -5562 5330 -29723 -12473 -5871 -433
18154d33J8909j1674j7174K7621K3142K7268o528J8241l2636n0787k1611J701
18142b3961M2522l821m8834k3170N0651j3693j8420J3824k6533j6671K330P250
18130e8526L0533L245R847J4474J4270r494L0528k603m292p4151P562M5749l1482
18117b4340l0112J3287L1972K9374P882k3391k2307O0827M6363l2937p2404k467
18105a8253L0211J5530n8129o4458M251J7695M0618j7208j9443M80K2999L6526
18093i181K747P376m8492r383L5016l036L2192M3213Q552j6558r108m6551m9976
18080f3189J5695K5082j4455l9855P87P687r912j3189J5589K5130k4945R658P965
18067e7952M2520R741l2365o547L4139j3053J276j8951l4620Q456K8917O1645
$$ plain form
18154 -433 18476 6802 -10372 17249 40391 67659 61131 79372 46736 -4051 -25662 -23961
18142 -23961 18561 14740 -34094 -57264 -6613 -20306 -38726 -24902 -51435 -68106 -65776 -58526
18130 -58526 -27993 -24748 -14901 -427 13843 4349 34877 32274 27982 -46169 -38607 7142 -24340
18117 -24340 -54452 -41165 -9193 20181 28063 4672 -17635 43192 89555 56618 -15786 -18253
18105 -18253 11958 27488 -30641 -95099 -90848 -73153 -32535 -49743 -69186 -68706 -45707 -9181
18093 -9181 -6434 942 -47550 -56933 -21917 -24953 7239 50452 59004 42446 33338 -13213 -63189
18080 -63189 -47494 -22412 -36867 -76722 -75935 -68248 -78160 -91349 -75760 -50630 -75575 -65917 -57952
18067 -57952 -15432 -5691 -38056 -44603 -10464 -23517 -22241 -41192 -75812 -67356 -38439 23206
18055B3206L3103m6660Q791K2360M154r317o5061j7502j4734J8287j6856L111
18043e7118k5141j465K62j1940L0476J7202k627P565J5104K5930j8714j7689k3777
18030f1932L3442M4166M3232j0169k6025P961j8566J7693M4293k8967k2624j9604
18018B900r529J0815L8598j0015n1835J7184K550o340l6415j457K4735L5170J680
18005A8041L2578m315j6037k8369M858K0338m805k5331j5142J4142l0265k0229
17993e4536O259r773L437J8686J8936N0828l8656j9642r295n912L721J4219K9805
17980H077j2900m0926J6607M5523J0348K478j494o099j1179q480K0371m2208p208
17967b7090K2228J0989j1597L3426K6429j5161l0392m9632j0964O901l4432k5448
$$ plain form
18055 23206 56309 9649 18440 40800 44954 35637 -29424 -46926 -61660 -43373 -60229 -57118
18043 -57118 -82259 -83724 -83462 -95402 -64926 -47724 -50351 -42786 -27682 -1752 -20466 -38155 -61932
18030 -61932 -28490 15676 58908 48739 22714 30675 12109 29802 74095 45128 22504 2900
18018 2900 -6629 4186 42784 32769 -19066 -1882 668 -5672 -42087 -43544 -18809 16361 18041
18005 18041 50619 46304 30267 1898 6756 27094 22289 -3042 -18184 -4042 -34307 -54536
17993 -54536 -48277 -58050 -54613 -35927 -16991 33837 -4819 -24461 -33756 -39668 -35947 -21728 8077
17980 8077 -4823 -45749 -29142 16381 26729 29207 27713 21614 10435 1955 22326 -19882 -27090
17967 -27090 -4862 6127 -5470 27956 54385 39224 8832 -40800 -51764 -44863 -79295 -104743
17955a04743P439j1253N0823N3078K3234l2843q576j6039J5469L3440o570m0937
17943c7478j6993K5162r104l4016K4655p209k3711L622J1859j4967L8532M1801
17931B153J0394k2108M272K507p255l4298Q308K8930j108K432L1067K880l9391
17918a1217m2565j8710j8488l594L6515O0634p586j3412Q717j877l7734j8277
17906f7594J8018L4176J3664K1764O374N086P330O298j3651N178R551o446l1565
17893H183k3807q334M2557j2567l7470j6160j0295j2787J4468J8285l1535p661
17881g7123K9748M8393J1556m905p2140k1586P346p702R47j0431j3804O3239K9612
17868a6850j2621r455k7642L8444Q328j8403j58K4145l559q706j8326J2349p175
$$ plain form
17955 -104743 -97304 -108557 -57734 -4656 18578 -14265 -22841 -38880 -23411 10029 3459 -37478
17943 -37478 -54471 -29309 -38413 -72429 -47774 -54983 -78694 -75072 -63213 -78180 -39648 2153
17931 2153 12547 -9561 -5289 -2782 -10037 -44335 -36027 -7097 -8205 -5773 25294 28174 -11217
17918 -11217 -53782 -72492 -90980 -94574 -58059 2575 -5011 -18423 -9706 -11583 -49317 -67594
17906 -67594 -49576 -15400 -1736 20028 26402 31488 38818 45116 31465 36643 46194 39748 8183
17893 8183 -15624 -23958 18599 6032 -31438 -47598 -57893 -70680 -56212 -37927 -69462 -77123
17881 -77123 -47375 1018 12574 7669 -64471 -86057 -78711 -86413 -85466 -95897 -109701 -46462 -16850
17868 -16850 -29471 -38926 -66568 -28124 -19796 -38199 -38357 -14212 -17771 -26477 -44803 -32454 -39629
17855c9629M3171k7330O410P407M863M025k9531J957K4184k3453j0801L390n957
17842d1294J8474L9611j0418m4046j3921J8919K1369j8637k6350Q347J6657J0101
17830b1188L5770J0558q367J5045j0090l0950J5884P383J4939m8703m8263j9143
17818h7125K6996N140M3792j2580K7327J0003l5850L81L9136J5888o185k0562
17806F361l7475K771M5067K4771j8472j9809l0755p89k8302l813j0576k7161L5504
17793f2678L2050K0353K1185k6339j1145m599k9208L066K8101M337K7422l695
17781a150m6979l4065j1656J3883K6115l4715K3866R051K1262N6496N105J499
17769B8712p962m8137k2486N138J1414k2762K7818K0475l6107J5064P3978J9434
$$ plain form
17855 -39629 3542 -23788 -17378 -9971 -5108 -1083 -30614 -28657 -4473 -27926 -38727 -35337 -41294
17842 -41294 -22820 16791 6373 -37673 -51594 -32675 -11306 -29943 -56293 -47946 -31289 -21188
17830 -21188 14582 25140 16773 31818 21728 -9222 6662 14045 28984 -19719 -67982 -87125
17818 -87125 -60129 -54989 -11197 -23777 3550 13553 -22297 -21916 17220 33108 26923 6361
17806 6361 -31114 -28343 16724 41495 23023 3214 -27541 -28330 -56632 -60445 -71021 -98182 -62678
17793 -62678 -30628 -10275 10910 -15429 -26574 -31173 -60381 -57315 -29214 -24877 2545 -1150
17781 -1150 -48129 -82194 -93850 -79967 -53852 -88567 -64701 -55650 -34388 22108 27213 28712
17769 28712 20750 -27387 -49873 -44735 -33321 -56083 -28265 -7790 -43897 -28833 45145 64579
17757F4579J2930K925k4520m5779k3839p383o961J3681J4647j9232r133K8706
17745F21j0998n8586M235N414R445J8929K6374j2428j1635l2534N464M2159K0368
17732F828l445m047k271K2073l2212n0931L635M8451M6462O61j5013k3543l1593
17719c4945j9533J4268L2563o446J2276k4819O112N7980N633m6746K334M9865
17707D8542K3956l5358o304l6440k0952j5842J8839n924j5672K1943K9575j1524
17695e161j378K927j1047j1070J6006P202l0543k0793j5170M6343M1011j0634
17683G693j5855J4172j5343k6886K0643k720L7458M850n5524n6826O2675M0325
17671A4662M525J3805k8233p493k539r759j5526M907K9552O143K0700K5890m0575
$$ plain form
17757 64579 77509 80434 55914 10135 -13704 -21087 -28048 -14367 280 -18952 -28085 621
17745 621 -10377 -68963 -64728 -59314 -49869 -30940 -4566 -16994 -28629 -61163 -55699 -13540 6828
17732 6828 3383 -664 -2935 19138 -13074 -64005 -60370 -11919 34543 35204 20191 -3352 -34945
17719 -34945 -54478 -40210 -7647 -14093 -1817 -26636 -20524 37456 43089 -3657 -1323 48542
17707 48542 72498 37140 30836 -5604 -26556 -42398 -23559 -29483 -45155 -23212 6363 -5161
17695 -5161 -6539 -3612 -14659 -25729 -9723 -2521 -33064 -53857 -69027 -22684 18327 7693
17683 7693 -8162 6010 -9333 -36219 -15576 -18296 19162 24012 -31512 -88338 -25663 14662
17671 14662 19187 32992 4759 -2734 -5273 -15032 -30558 -25651 3901 10044 30744 56634 16059
17658A6059J2976J4943K5955N534j4889j1656q895q043k8230k05l6328k2760j2167
17645f7706j2950R963o320K5156M1716j5559J6657L645j5667j0027J9604j4119
17633b5607q739J7649m239N014M94l0741J0168J1003M458n858R452l21k5343K8339
17619a4271L8530Q895L671J8838J811k1362O124m720l2571L016J6376r922m1208
17606b6793o501J2271N83N756L6158M040l8523J9600K5752k0486l3615j9568N230
17593c6096k8825q78k1034J435L9132K5148j8129r509J1797M0666K3164K970M936
17580C4777J7770K5450k0167j0383m5890k4647J295Q713Q141J903n722k1902J8945
17567a1717J2248j3574m5907K033L6640q226m836k5161Q042k472k774K0172r112
$$ plain form
17658 16059 29035 43978 69933 75467 60578 48922 40027 31984 3754 3549 -32779 -55539 -67706
17645 -67706 -80656 -70693 -77013 -51857 -10141 -25700 -9043 -5398 -21065 -31092 -11488 -25607
17633 -25607 -34346 -16697 -20936 -15922 -15428 -46169 -36001 -24998 -20540 -26398 -16946 -17267 -42610 -14271
17619 -14271 24259 33154 36825 55663 57474 36112 42236 37516 4945 7961 24337 14415 -26793
17606 -26793 -33294 -21023 -20440 -14684 21474 25514 -13009 6591 32343 11857 -21758 -41326 -36096
17593 -36096 -64921 -65799 -86833 -85398 -46266 -21118 -39247 -48756 -36959 3707 26871 29841 34777
17580 34777 52547 77997 57830 47447 1557 -23090 -21795 -13082 -4941 -3038 -8760 -30662 -11717
17567 -11717 531 -13043 -58950 -56917 -20277 -28503 -33339 -58500 -50458 -52930 -55704 -35532 -44644
17554d4644m979K2681l4427k355J1462J2488L8953N8493j2618m2623n07o559m1255
17541d5890J7111L8916k2917j1014M5742R429l5809o030m3500N419J7796J7821
17529a2926j0869N175N848O424J7298L1045j6439K0500k6063n1334j2555M0516
17517c380K9492K3250l8321k6978M9930j2189P824p966o15J1887R20l8824m2357
17504d7327K2275J3025J3325j2l732N551R737p0747j8367J9333K5042K5958j9808
17491b5747j682K3356k1626k1712j5814j6972K8676M7755K1978m3537P253L3189
17479A5117J479k1948l008J7416k2375j7178J0090J0332j8595o310L6388P286
17467H694j3065o535K8461J2520l4982K5257k3422m2601k8080m6183K3711N3627
$$ plain form
17554 -44644 -49623 -26942 -61369 -63724 -52262 -39774 -821 57672 45054 2431 1924 -4635 -45890
17541 -45890 -28779 10137 -12780 -23794 21948 31377 -4432 -10462 -53962 -48543 -30747 -12926
17529 -12926 -23795 -18620 -12772 -6348 10950 41995 25556 46056 19993 -31341 -43896 -3380
17517 -3380 26112 49362 11041 -15937 33993 21804 29628 21662 21047 32934 33854 -4970 -47327
17504 -47327 -25052 -12027 1298 1286 -2446 3105 12842 -57905 -76272 -56939 -31897 -5939 -25747
17491 -25747 -27429 -4073 -25699 -47411 -63225 -80197 -51521 -3766 18212 -25325 -18072 15117
17479 15117 16596 -5352 -8360 9056 -13319 -30497 -20407 -10075 -28670 -34980 1408 8694
17467 8694 -4371 -10906 17555 30075 -4907 20350 -3072 -45673 -73753 -119936 -96225 -42598
17455d2598k429o173J4396L5787j3743o186r193L0577R670J569J4204q069J21
17442A7933J5074m476p311K103N36j6157m0451q105K0385L6230N2530l1700m4693
17429h102K6837l1987j2633j7752j741L587P011k0850J9401j9194J5330L1780
17417h313L284j1231J71J3208J3536N207j6971j1285J435j4367J5307k9482L6309
17404c192N6311J0086o030j5415l7242m908m3615j2454M0698J7830j2107k661
17392a2699j2588j3416k8451J0734K466j8121P485P939J690J6140k3971O9J741
17379f0982K7914K7163k4613P589n88J5765k1233j2960L1107L9111P260k1280
17367A4253m0501K0052M2227J7094J4782j6029n4317k7918K2082J6760j6331l5556
$$ plain form
17455 -42598 -45027 -51200 -36804 -1017 -14760 -20946 -30139 438 10108 11677 25881 17812 17933
17442 17933 33007 28531 21220 23323 23859 7702 -32749 -40854 -20469 15761 68291 36591 -8102
17429 -8102 18735 -13252 -25885 -43637 -45378 -41791 -34780 -55630 -36229 -55423 -40093 -8313
17417 -8313 -5029 -16260 -16089 -2881 10655 15862 -1109 -12394 -10959 -25326 -10019 -39501 -3192
17404 -3192 53119 63205 57175 41760 4518 -390 -44005 -56459 -15761 2069 -10038 -12699
17392 -12699 -25287 -38703 -67154 -56420 -53954 -72075 -64590 -56651 -54961 -38821 -62792 -62723 -60982
17379 -60982 -33068 -5905 -30518 -22929 -23517 -7752 -28985 -41945 -10838 28273 35533 14253
17367 14253 -26248 -6196 36031 53125 67907 51878 -2439 -30357 -8275 8485 -7846 -43402
17355d3402L6727K6940k8157n845j8819j1691k2269L4017K6948j2572J6021k995
17343e097q128k3264K8673J6458Q954k9462l3069m893K5322R186l0426K099R109
17330c4538o44Q83j2689k9287K7226L9649J0734R470J7652M348J4410k8707j5924
17317B583Q567j6857k3357K669O3425K9377n5071j9025l4520K712Q870L4203K9509
17304C3085P25k1801k6399n103j9302k4543K3658L6536k320k1272L156N0956l1532
17291d156l9813l8995N710L6384L3498j3769K8722K5263j4082J0602n9864n2778
17279h3278K1800L0831J8647K8167l0790m6917j0864n687O6786J8826M905K47
17267A2673j5029J4124L3429l0606k8173k0496q768m0883r621O1181K2293O517
$$ plain form
17355 -43402 -6675 20265 -7892 -13737 -32556 -44247 -66516 -32499 -5551 -18123 -2102 -5097
17343 -5097 -13225 -36489 -7816 8642 17596 -11866 -44935 -49828 -24506 -15320 -45746 -43647 -34538
17330 -34538 -35182 -34299 -46988 -76275 -49049 -9400 1334 10804 28456 32804 47214 18507 2583
17317 2583 11150 -5707 -29064 -26395 37030 66407 11336 -7689 -42209 -39497 -30627 3576 33085
17304 33085 33810 12009 -14390 -19493 -38795 -63338 -39680 -3144 -5464 -26736 -23580 27376 -4156
17291 -4156 -43969 -82964 -77254 -40870 -7372 -21141 7581 32844 18762 29364 -30500 -83278
17279 -83278 -61478 -30647 -12000 16167 -14623 -61540 -72404 -78091 -11305 7521 12426 12673
17267 12673 -2356 11768 45197 14591 -13582 -34078 -42846 -83729 -93350 -32169 -9876 -3359
17255c359l6382k2705O9296M238k9883J4484m717k8363L8290J7072r942l4829
17243b6800k11K0330Q139j601k1296K4530J2362J6381K1616j8436k0176j6537
17231a699M605m213J9446J655m1383J308p481l8006m6692k0174L6265N7091M5713
17218F435K2858j2824l029j876q070j0721j817m034j9603M0463J3990k6924m625
17205i777k361r857j1619M4967M2802l7343n4093L6209M8673o666n1466K4901
17193A4370K3539m928O474n6808m9604N372j562L4443K5776o375l5077l9603L3254
17180e0729L3812j4603q558K6682j5626l9621J778J6907j0258O58j1357q152Q580
17167g0487K6214l053Q662o675J8723J2147J2547K4059K9483l2876k1684M9322
$$ plain form
17255 -3359 -39741 -62446 6850 11088 -18795 -4311 -9028 -37391 899 17971 8029 -26800
17243 -26800 -27011 -6681 1458 -143 -21439 3091 15453 31834 53450 35014 14838 -1699
17231 -1699 2906 -1307 18139 19794 -21589 -20281 -27762 -65768 -112460 -132634 -96369 -39278 6435
17218 6435 29293 16469 13440 11564 3494 -7227 -9044 -13078 -32681 7782 21772 -5152 -9777
17205 -9777 -12138 -21995 -33614 11353 54155 16812 -37281 -1072 47601 40935 -10531 14370
17193 14370 37909 32981 39455 -17353 -66957 -61585 -63147 -28704 -2928 -9303 -44380 -83983 -50729
17180 -50729 -16917 -31520 -40078 -13396 -29022 -68643 -66865 -49958 -60216 -59558 -70915 -79067 -70487
17167 -70487 -44273 -47326 -38664 -45339 -26616 -14469 -1922 22137 51620 18744 -2940 46382
17155D6382N480O72j6113m6200n6482l0491Q490L2166M7405O3637J2170n5762
17143A1354J2942j9584M967K6194j0845j5167q237J108j3181j2021r017m0308
17131g1795M3436q499j9197k1722j5479J2465O590k0520K1253J8997j4321R443
17119e9349n146k7L3477K2183o4847k7205L7649P6744K8290P709k2291O541J2071
17106D5799q25k4740m647P263L2974j7669l3932p804p871r434L8178M9709m100
17093F2901j0532p7614k1136N194k0651L4092J9678k6045Q05M0938m572k6028
17081b2970N327m877N854J4640L1172o3688m8428M424Q7262K5074K812j6401j0739
17068I462k0955j9192l4618k5551K7074J9579N1349K0165j1684Q835Q429j0380
$$ plain form
17155 46382 51862 52534 36421 -9779 -66261 -96752 -88262 -56096 -8691 54946 67116 11354
17143 11354 24296 4712 9679 35873 25028 9861 1624 2732 -10449 -22470 -31487 -71795
17131 -71795 -28359 -36858 -56055 -77777 -93256 -80791 -74201 -94721 -73468 -54471 -68792 -59349
17119 -59349 -64495 -64522 -31045 -8862 -73709 -100914 -63265 13479 41769 49478 27187 33728 45799
17106 45799 44974 20234 15587 22850 55824 38155 4223 -3581 -11452 -20886 17292 67001 62901
17093 62901 52369 -25245 -46381 -41187 -61838 -27746 -8068 -34113 -33308 7630 3058 -22970
17081 -22970 -17643 -22520 -16666 -2026 29146 -34542 -82970 -78546 8716 33790 36602 20201 9462
17068 9462 -11493 -30685 -65303 -90854 -63780 -44201 7148 27313 15629 24464 32893 22513
17056B2513k0406k7726q554J7889M6384l4664j0904r011N960q118J7149K404j0894
17043a7978r348n599J5624q53k011k226J8766o666m27l222L676q009k5480p985
17029e1738N946P928l4492J3703Q993p44L8353M8646L1830l905q0370m2512L1420
17016b6942K3336J5868K4383j920k6909R909j1155j4685j0015O292J5025M5055
17004D8242K282l5328l8367k7102k2167L2588R250k3550L5655J2856K5907M7613
16992F7879J0908l3650k2438k2332l4337m973K8354Q062L475K6960l1304n5691
16980e9087J759J3376j1279j681K106J4135j6489j3457L5250M9655j6728l4125
16968c6565j7667k2436O166k1735J8796j6500k8578K2830J0802J4252j8019J4036
$$ plain form
17056 22513 2107 -25619 -34173 -16284 30100 -4564 -15468 -24479 -18519 -26637 -9488 -7084 -17978
17043 -17978 -27326 -32925 -17301 -18154 -20165 -22391 -3625 -10291 -10718 -13940 -10264 -18273 -43753 -51738
17029 -51738 -45792 -37864 -72356 -58653 -49660 -50404 -12051 36595 68425 64520 -15850 -58362 -26942
17016 -26942 -3606 12262 36645 34725 7816 17725 6570 -8115 -18130 -11838 3187 48242
17004 48242 50524 15196 -23171 -50273 -72440 -39852 -30602 -54152 -18497 -5641 20266 67879
16992 67879 78787 45137 22699 367 -33970 -38943 -10589 -2527 948 27908 -3396 -59087
16980 -59087 -57328 -43952 -55231 -56912 -54806 -40671 -57160 -70617 -35367 14288 -2440 -36565
16968 -36565 -54232 -76668 -70502 -92237 -73441 -89941 -118519 -95689 -84887 -70635 -88654 -74618
16956g4618L8565k2112k7476O786Q894M0710L1407k6763k7497O210J6751O513
16944b2630m5810J0500J7308r858p439K1175j7706l7795J7290J6250K285J175
16932e5255k9220K991M393j1577K4896j3576j8809K7722L0593J2528L4771k2471
16920a3014l7192j5013q89K3110K3175k0444Q389k2412K4853P6708J1096m1607
16908A6760j5181K1592O388j9361m3806j1919J6850k062j2964J9383j4322L9565
16896I23O7837K8828j0702n194O013j9452M554J0372n8153p5105J4557N4850m60
16883A8868m3950p428J8122M160K6565K460K29K60K6067J87L7625j2279l5504
16870C5382m1965l0727M805J1911L065m202K116J6415K9956O4802m447k0117l5077
$$ plain form
16956 -74618 -36053 -58165 -85641 -78855 -69961 -29251 2156 -24607 -52104 -45894 -29143 -22630
16944 -22630 -68440 -57940 -40632 -50490 -57929 -36754 -54460 -92255 -74965 -58715 -56430 -55255
16932 -55255 -84475 -81484 -77091 -88668 -63772 -77348 -96157 -68435 -37842 -25314 9457 -13014
16920 -13014 -50206 -65219 -66108 -42998 -19823 -40267 -31878 -54290 -29437 47271 58367 16760
16908 16760 1579 23171 29559 10198 -33608 -45527 -28677 -30739 -43703 -24320 -38642 923
16896 923 68760 97588 86886 81692 87705 68253 72807 83179 25026 -50079 -35522 19328 18868
16883 18868 -25082 -32510 -14388 -10228 16337 18797 19026 19286 45353 45540 83165 70886 35382
16870 35382 -6583 -37310 -32505 -20594 -17529 -21731 -19615 -3200 26756 91558 87111 66994 31917
16857C1917m7899k312M8388L4278J6004l9580l7785j8605J9258K1106K680l1601
16845d151J2840K6522r10J2284l1859n5205J3060M2134K448l496k4200l0191K583
16832c8141O1268M3542j1625j0570K8392j3801l0182K0590n949K7499N491q5163
16820h649l7299J2086L1949r986j3983j189k6150l1759K689l794K3715L5615N3976
16807B7221O589l5899j2589K0618J7545p996n930j5862j1340n959k933J534j34
16794b5135l966K9746M480K4845l2770J5124k23J7554j258j0262j4996m4639K4312
16781a7188J8488k2806q523M7963L5521k6781j7310m9566j1235J3261n181j15
16769d3472j3086j185L950l3106l718l0368L2708M6311J462M057N041J8647L3148
$$ plain form
16857 31917 -15982 -18294 30094 64372 80376 40796 3011 -15594 3664 24770 27450 -4151
16845 -4151 8689 35211 34301 46585 14726 -40479 -27419 14715 17163 13667 -10533 -40724 -38141
16832 -38141 23127 66669 55044 44474 72866 59065 28883 49473 43524 71023 76514 -8649
16820 -8649 -45948 -33862 -1913 -11899 -25882 -27071 -53221 -84980 -82291 -86085 -62370 -26755 27221
16807 27221 33810 -2089 -14678 5940 23485 15489 9559 -6303 -17643 -23602 -26535 -25001 -25135
16794 -25135 -29101 645 5125 29970 -2800 12324 12101 29655 28397 18135 3139 -41500 -17188
16781 -17188 1300 -21506 -30029 17934 53455 26674 9364 -40202 -51437 -38176 -43357 -43472
16769 -43472 -56558 -57743 -53793 -86899 -90617 -120985 -88277 -41966 -40504 -36447 -31406 -12759 20389
16756B0389k1808m0602O97J2508J5772L0167n1018k8198o774M4056m822O146P295
16743a6192k8381j8939m6877k5482N9607K2832K3629m180l2093L8920R260m2930
16731f0826O394J0635l9188O0398L6448j3843L2698j2254p160k2072Q871L302
16719C403j9163j0423K0420J6164P883j1124j9669l4138j2930K7595l886m1205
16707g7073k2376J1722k308M5661K5924j9504K8465K6371k5462q581j9564m001
16695d0726M0717j5551n7313n4435K4458O4382N6778J7467k9783n832J7646n331
16683A2477j1946J1202J3708K4326j2322J206j2236J96J9539k0228l3365j6392
16671b3835n295j9787J1368n534mk099M6461j4989l4179P394M0638P7697m1424
$$ plain form
16756 20389 -1419 -42021 -41324 -28816 -13044 17123 -33895 -62093 -68867 -24811 -29633 -23487 -16192
16743 -16192 -44573 -63512 -110389 -135871 -76264 -53432 -29803 -33983 -66076 -27156 -17896 -60826
16731 -60826 -54432 -43797 -82985 -22587 13861 18 32716 20462 13302 -8770 101 3403
16719 3403 -15760 -26183 -5763 10401 18284 7160 -12509 -46647 -59577 -31982 -35868 -77073
16707 -77073 -99449 -87727 -90035 -44374 -18450 -37954 -9489 16882 -8580 -17161 -36725 -40726
16695 -40726 -9 -15560 -72873 -127308 -102850 -38468 18310 35777 5994 162 17808 12477
16683 12477 531 11733 25441 49767 37445 38651 26415 26611 46150 25922 -7443 -23835
16671 -23835 -29130 -48917 -37549 -43083 -43087 -45186 1275 -13714 -47893 -40499 139 77836 36412
16658C6412p3506M808k508r616j1980O263K1963J3172L8579j772l8034l007o725
16645b5951K542R32J7789L0985k4367l6877Q190J380m3312q172K8165M0243J8362
16632I909m1967K6790J2588K3911j8600J5038J4516j0958k3402j7956j5293k8689
16620e4113M077k9970N629K238J220J5870K6131j2668m146j3297k0305q715K5845
16607f2204P213l336O412l7029K5535K9908j8941r681k1486J0345M2997K2885
16595g382q13Q25j0714O220K2479o541n338K1157M177m8745j8635l2212m884J1519
16581f8887J3231M981L2451J4653L1055J2811p659j4002k4798L616k8252J7679
16569a3121N494L557m8018k0474R314M4112K4950k1674l1271J1857L3243j8215
$$ plain form
16658 36412 -37094 -32286 -34794 -44410 -56390 -50127 -28164 -14992 23587 21815 -16219 -19226 -25951
16645 -25951 -23409 -22477 -4688 26297 1930 -34947 -26757 -25377 -68689 -76861 -48696 -8453 9909
16632 9909 -32058 -5268 7320 31231 12631 27669 42185 31227 7825 -10131 -25424 -54113
16620 -54113 -50036 -80006 -74377 -72139 -70919 -55049 -28918 -41586 -45732 -59029 -79334 -88049 -62204
16607 -62204 -54991 -58327 -51915 -88944 -63409 -33501 -52442 -62123 -83609 -73264 -30267 -7382
16595 -7382 -8195 -7370 -18084 -11864 10615 4074 -1264 19893 24070 -24675 -43310 -75522 -80406 -68887
16581 -68887 -55656 -50675 -18224 -3571 27484 40295 32636 18634 -6164 -2548 -30800 -13121
16569 -13121 -7627 -4070 -52088 -72562 -63248 -19136 5814 -15860 -47131 -35274 -2031 -20246
16557b0246J6345J2032p308K6525K6212l3021l0601k3297j4794J8995l0180M1978
16545a7360k050J873K0830L8634n607j105l1558q0016j8069j1426J4751k773J3216
16532h0660M3809M6858k2917j0494K6460K2811j934o5925J1520j4724l6071p357
16520h8624L983r643K4133m333j5084L669M403J8286l5232m387L5532J2309l606
16507e8594j621L20R973K7865M9797k955o683j547j0608l463J0426O87l5086n438
16493b6927k0640q9074o934M0386J7914K7406J0614J5603J9723L1638k2635j0571
16481a3497k075P911K6956L0424K2632j2939l7868Q621J527k8525j1212M8373
16469D0328K24k0700k6261O268L121P10j105M697j1442K1612Q187M491J5355j0032
$$ plain form
16557 -20246 -3901 8131 823 27348 53560 20539 -10062 -33359 -48153 -29158 -59338 -17360
16545 -17360 -19410 -17537 3293 41927 36320 35215 3657 -76359 -94428 -105854 -91103 -93876 -80660
16532 -80660 -36851 10007 -12910 -23404 3056 25867 23933 -41992 -30472 -45196 -81267 -88624
16520 -88624 -84641 -94284 -70151 -74484 -89568 -85899 -81496 -63210 -98442 -102829 -67297 -54988 -58594
16507 -58594 -60215 -59895 -49922 -22057 27740 24785 18102 16555 5947 2484 12910 13597 -21489 -26927
16493 -26927 -47567 -136641 -143575 -103189 -85275 -57869 -47255 -31652 -11929 19709 -2926 -13497
16481 -13497 -15572 -7661 19295 49719 72351 59412 21544 30165 31692 3167 -8045 40328
16469 40328 40552 19852 -6409 -141 2980 3690 2585 7282 -4160 17452 25639 30130 45485 35453
16455C5453J0720N087j5025K7213m1449m1931P391J5169Q119j8013j460N139k9972
16442c3559J7378K6791Q836k191J1327l2000K4017j4101Q87k6249l4523M35P667
16429d5285K8880L3572p015j0021l269K6512k2989l4077j2026j6118Q107L5308
16417a8421K0559j7881O884q667R96M2143L2848m9900k3547O717n4457K0346L5942
16404f438N681J0339K3080k2762j315K5188Q663k2516L9k0173M839M418j534k8989
16390b1480p910k0280M1786J8569k0351k1466m9850q353L0582m0J6593j0694q014
16377f0908R596r83J6424j3061k6297o943K6360l705K0947L3787j1119k8202j53
16364d4257K4495K4624J3610K5343O228p2916j0197L4241q745l933K9956r470
$$ plain form
16455 35453 46173 51260 36235 63448 21999 -19932 -12541 2628 10747 -7266 -8726 -3587 -33559
16442 -33559 -16181 10610 19446 17255 28582 -3418 20599 6498 7385 -18864 -53387 -52952 -45285
16429 -45285 -16405 17167 10152 131 -3138 23374 385 -33692 -45718 -61836 -53729 -18421
16417 -18421 2138 -15743 -8859 -17526 -16530 25613 58461 8561 -14986 -8269 -62726 -42380 -6438
16404 -6438 -757 9582 32662 9900 8585 33773 42436 19920 19959 -214 4625 9043 7509 -21480
16390 -21480 -29390 -49670 -7884 10685 -9666 -31132 -80982 -89335 -58753 -58793 -42200 -52894 -60908
16377 -60908 -51312 -52295 -35871 -48932 -75229 -82172 -55812 -59517 -38570 -4783 -15902 -44104 -44257
16364 -44257 -19762 4862 18472 43815 50043 -22873 -33070 1171 -7574 -11507 18449 8979
16352H979l0709j6904K1045j040r073J2685J6155j7117J0631o325k5803K1580
16340a5896k933l9436K9829k91j2426K029J5229J2964K5381J6776l8506o2022
16328f9302O988L0772p283L0639k872J2698M026o166K0714J4081o339j0420j530
16315A6006m4521R034M074K703J6895m7545r739K0220J1736M1685K0879j954k7000
16302A2473r963k0461k9117k5229k720L2670R13R441J2682L247L0724L4351L970
16289E2981P19m7358j6277J6505J4396j2377j0147m07k586J0939j4255l9682k8587
16276g6136k1779J8859M697k397K4446K7960L5191N0299m8721k8959l4630M2967
16264h203J1412n53L9466Q99j0640J7414K1121k0767N689m2887m3391K7144j1687
$$ plain form
16352 8979 -21730 -38634 -17589 -18629 -27702 -15017 1138 -15979 -5348 -11673 -37476 -15896
16340 -15896 -18829 -58265 -28436 -28727 -41153 -39124 -23895 -10931 14450 31226 -7280 -69302
16328 -69302 -62314 -31542 -38825 -8186 -11058 1640 5666 -500 20214 34295 27956 17536 16006
16315 16006 -28515 -19481 -15407 -12704 4191 -43354 -53093 -32873 -21137 20548 41427 39473 12473
16302 12473 2510 -17951 -47068 -72297 -75017 -42347 -41434 -31993 -19311 -16064 14660 49011 52981
16289 52981 53700 6342 -9935 6570 20966 8589 -1558 -1965 -4551 6388 -7867 -47549 -76136
16276 -76136 -97915 -79056 -74359 -76756 -52310 -24350 10841 61140 12419 -16540 -51170 -8203
16264 -8203 3209 2656 42122 43021 32381 49795 70916 50149 55838 12951 -30440 -3296 -14983
16251a4983j2990K0757l017l0376j0205O7595N69K581o925l1491K127M9964k127
16238C1479l3305l814j7775P425j7595l2422q945Q406L0575k0997j6949P736Q013
16225e8168j5017j1536J7066O014l5707m141O753k8591l771L0126r610O1037m456
16212e0001J1402o790j5681K0215N0437J0663n5933m840J5446n326n847L6730
16200D75K0930K7422P20J0843l8135m0390L5489L3675Q640r317L4987n440m5959
16187C3940l0883o114M833J9743k585O690K7509P478j6150j6402o5906p543L0051
16174a5339M9570L5346J9685J4819P796k2565k5864k737n4728l3315L799j5699
16162c9232r585J353k613L675K9778J5523O651k3593R415L1573k4957l2814j8468
$$ plain form
16251 -14983 -27973 -7216 -10233 -40609 -50814 16781 17350 19931 13006 -18485 -16358 33606 31479
16238 31479 -1826 -5640 -23415 -15990 -33585 -66007 -74952 -66546 -35971 -56968 -73917 -66181 -58168
16225 -58168 -73185 -84721 -67655 -61641 -97348 -101489 -94736 -123327 -127098 -96972 -106582 -45545 -50001
16212 -50001 -38599 -45389 -61070 -40855 9582 20245 -35688 -40528 -25082 -30408 -36255 475
16200 475 21405 48827 49547 60390 22255 -18135 17354 51029 59669 50352 85339 79899 33940
16187 33940 3057 -3057 1776 21519 18934 25624 53133 60611 44461 28059 -37847 -45390 -15339
16174 -15339 34231 69577 89262 104081 111877 89312 63448 60711 5983 -27332 -23533 -39232
16162 -39232 -48817 -47464 -50077 -46402 -16624 -1101 5550 -18043 -8628 22945 -2012 -34826 -53294
16149e3294j1183L5803j4650k3716j3025O382N2703J7989J857k0221j3681J0363
16137b4673K8587k1787l417L4004j3302l4985K9818L3787J9272l9745n6804l74
16125d9619K4652J9012O146k1950k2796k3349K4730R650M2990K3750Q445j3904
16113B7757l6811J2341J2053j4741K2284n1409L266J4557Q575L053J25q635o929
16100a4514J3508j0316k4471P785J628O3326M7263Q773k9203m1120l4525n0755
16088f2621n8466K5730K1417j0187L8235M9860K0447j9374p338q520K1399k5409
16076a4827j2840M073j5539j4515j5181J1714J2210j0678L1540K9676p203n951
16064g521o63j8679k3809J9680J4902K2082M767m2318m2725l1306L2913N4797
$$ plain form
16149 -53294 -64477 -28674 -43324 -67040 -80065 -73683 -20980 -2991 -1134 -21355 -35036 -24673
16137 -24673 3914 -17873 -21290 12714 -588 -35573 -5755 28032 47304 7559 -49245 -49619
16125 -49619 -24967 -5955 191 -21759 -44555 -67904 -43174 -33524 9466 33216 41661 27757
16113 27757 -9054 3287 15340 599 22883 -28526 -25260 -10703 -2128 925 1050 -7585 -14514
16100 -14514 -1006 -11322 -35793 -28008 -26380 36946 84209 92982 63779 22659 -11866 -62621
16088 -62621 -121087 -95357 -73940 -84127 -45892 3968 24415 5041 -2297 -10817 10582 -14827
16076 -14827 -27667 -23594 -39133 -53648 -68829 -57115 -44905 -55583 -24043 5633 -1570 -7521
16064 -7521 -8184 -26863 -50672 -30992 -16090 5992 10759 -31559 -74284 -105590 -72677 -17880
16052a7880K2016l4670M058J1360j797J7022N2070m603l7525M739K4997N500l7826
16039G461K5281M5112r251j7861q015J1603R577K690k9909n1255n0096k1515K5693
16026f0485M6741J1772K709J540J4469P976J0411n810j9191p857N52K638k9243
16013b3778P45J550M7679K467k3623M765N279J3615j2794J0861j0210k3249l77
16000g070K6583k7752j0153l144q45J3660L3949j2848n0120P648R48M019K2437
15987b688m248q1872L4751O2674j0298l14l0491L072L2491M822j6792l4821k4004
15974f7718m064L3260J4062k393N8455L8142j124l8654n931J7691p276p750J4554
15961D1254l5970j0704j3270k335J5742k3410l2476J7504N5664j371l3485l6169
$$ plain form
16052 -17880 4136 -30534 -26476 -15116 -16913 109 52179 47576 10051 14790 39787 45287 7461
16039 7461 32742 77854 68603 50742 42727 54330 63907 66597 36688 -14567 -64663 -86178 -60485
16026 -60485 -13744 -1972 737 2277 16746 24722 35133 29323 10132 2275 2827 5465 -23778
16013 -23778 -23033 -21483 26196 28663 5040 9805 15084 28699 15905 26766 16556 -6693 -7070
16000 -7070 19513 -8239 -18392 -21536 -22381 -8721 25228 12380 -37740 -30092 -29144 -25125 -2688
15987 -2688 -6936 -88808 -54057 8617 -1681 -1995 -32486 -29414 3077 7899 -8893 -43714 -67718
15974 -67718 -71782 -38522 -24460 -26853 31602 69744 68620 29966 24035 41726 34450 26700 41254
15961 41254 5284 -5420 -18690 -21025 -5283 -28693 -61169 -43665 11999 10628 -22857 -59026
15949e9026j4217K8161N428j3926l5737k447L0178J0225J8880j0001J837K9668
15937a0977J8088L1076M683K1846L5409J5902m9173l9916K7989K4829j1483r495
15925E8778m8377l0417K9263j439l5557k3774K2188M4197K7913N972k4326k0034
15913D387k301M983k9038j4649J4690J0202j1273J6101J1834M6757J3554k4405
15901D0842l0359l0973K0868J9566l3460J2288K4877j835j1362k2023j3208K2989
15889a790J5751R635r581j8583J5555K68n1915k2207k0508J413K9272K3712N0004
15876B1026J9090m2797k3931j6345k869P611M3274L005J4920o4344K3171Q309
15864i880q009q354N5035J2742K5063J8262l3240l5813J4813j8k0610o214K0428
$$ plain form
15949 -59026 -73243 -45082 -39654 -53580 -89317 -91764 -61586 -51361 -32481 -42482 -40645 -10977
15937 -10977 7111 38187 42870 64716 100125 116027 66854 26938 54927 79756 68273 58778
15925 58778 10401 -20016 9247 7808 -27749 -51523 -29335 14862 42775 48747 24421 4387
15913 4387 2086 7069 -21969 -36618 -21928 -11726 -22999 -6898 4936 51693 65247 40842
15901 40842 10483 -20490 378 19944 -13516 -1228 23649 21814 10452 -11571 -24779 -1790
15889 -1790 13961 23596 14015 -4568 10987 11255 -40660 -62867 -83375 -81962 -52690 -28978 21026
15876 21026 40116 -2681 -26612 -42957 -45826 -38215 5059 8064 22984 -41360 -18189 -9880
15864 -9880 -17889 -26243 28792 41534 66597 84859 51619 15806 30619 30601 9991 3777 24205
15851B4205p612j6176R560n7244J8338k2918k317N8971M4589Q260k6362q089l4679
15838a1474M35m0892l1571J0187Q4957M7915j5608l5193k3811r018l4321N5598
15826b796J7040j2000O022J2958p236l326j0726P775l9282Q48Q981j3304K639
15813c2407R363J3091L0351J5875m0250m2199R743J8331L369j1446L3811k363
15801E269j8396K6146J1693n525p8893j4487L3489K0174K9173K858l1286k2331
15789d2116K197K0423r539k2010j4395M2207P2054L3240j5848l9844j0155j491
15777A4723k5152J173k6422m883L4040J2007m8021j9503L9446O723Pk883N43Q375
15763i827J3520k3756k9807K2219K9755N787O476J9052l8007K6950K4489m9326
$$ plain form
15851 24205 16593 417 9977 -47267 -28929 -51847 -54164 4807 49396 57656 31294 23205 -11474
15838 -11474 -11039 -51931 -83502 -73315 11642 59557 43949 8756 -15055 -24073 -58394 -2796
15826 -2796 14244 2244 8266 21224 13988 10662 -64 7711 -31571 -30723 -21742 -35046 -32407
15813 -32407 -23044 -9953 20398 36273 -3977 -46176 -36433 -18102 -14733 -26179 7632 5269
15801 5269 -13127 13019 24712 19187 -59706 -74193 -40704 -20530 8643 11501 -19785 -42116
15789 -42116 -39919 -19496 -29035 -51045 -65440 -23233 48821 82061 66213 26369 16214 14723
15777 14723 -10429 -9256 -35678 -40561 -6521 5486 -42535 -62038 -22592 -15869 -15862 -18745 -18202 -9827
15763 -9827 3693 -20063 -49870 -27651 2104 7891 14367 33419 -4588 22362 46851 -2475
15751b475m7075j7281L9005n89k9873J7626K5787n370k398m684k4237O713P961
15738c6890j7304J5338K8595L2714J7490J6899J163O509r3647k2090Q183M514
15726c8526N370L792J1398J1102m1379l450J7687o3044J534L5798q182J6944M9937
15713a019M136j8397j928j1344j6905l0585K1735J5722k4337j1352j5512J5464
15701g4322L093o570L542L2573m4046j1261M3458O5689j6623N83p62K861K1641
15688A9856j6861k0290p516k059j62J7530J7281k1994l2707L9756J3839k42n796
15675F35k5640R37P62j5398N055j4427N4662L7338J6972p23l1887k2967J3136
15662A8455m9413J4856M1946K4774m7060l7025L088N6371j8738k1044J4189J4397
$$ plain form
15751 -2475 -49550 -66831 -27826 -28415 -58288 -40662 -14875 -20245 -22643 -27327 -51564 -44851 -36890
15738 -36890 -54194 -38856 -10261 22453 39943 56842 58005 64514 -29133 -51223 -43040 -38526
15726 -38526 -33156 -29364 -17966 -6864 -48243 -51693 -34006 -97050 -95516 -59718 -67900 -50956 -1019
15713 -1019 3117 -15280 -17208 -28552 -45457 -76042 -54307 -38585 -62922 -74274 -89786 -74322
15701 -74322 -71229 -77799 -74257 -41684 -85730 -96991 -53533 12156 -4467 -3884 -4646 -1785 19856
15688 19856 2995 -17295 -24811 -26870 -27032 -9502 7779 -14215 -46922 -7166 6673 6431 635
15675 635 -25005 -24068 -23306 -38704 -33649 -48076 6586 43924 60896 60173 28286 5319 18455
15662 18455 -30958 -16102 25844 50618 3558 -33467 -30379 25992 7254 -13790 399 14796
15650A4796m9386j0619J3155J3630j9176K4607J2236K9753m6675n4112J1248N999
15638e4544j382J9649L0660p341k2365j6694j9074J9912K8112L3037k0438k8964
15626c9432P907j4461n044R266J9949M4743J5591N926J8490l9759j6083j0425
15614c332L9041N2786l4262J9674l0439n5226k4339j5316K0185M567j430J3490
15602a4601N806L998L6170K6914k4969k2967K80k2833k0611r293K1263J9108j8063
15589a9798L4062k0449R411O005k5196n339p798j2462M409K839k5451j2604j2051
15576h4422L4323J2458L4491M3515q634o850L695p297j196l1680o928J3293k7442
15563c2674j8990k0840r455j7977K6282j3654j4778n018L9042L0033K0520J0034
$$ plain form
15650 14796 -34590 -45209 -32054 -18424 -37600 -12993 -757 28996 -17679 -71791 -60543 -54544
15638 -54544 -55926 -36277 -5617 -12958 -35323 -52017 -71091 -51179 -23067 9970 -10468 -39432
15626 -39432 -31525 -45986 -51030 -41764 -21815 22928 38519 44445 62935 23176 7093 -3332
15614 -3332 35709 88495 54233 73907 43468 -11758 -36097 -51413 -31228 -26661 -28091 -14601
15602 -14601 -8795 -4797 31373 58287 33318 10351 10631 -12202 -32813 -42106 -20843 -1735 -19798
15589 -19798 14264 -6185 3226 9231 -15965 -21304 -29102 -41564 -37155 -34316 -59767 -72371 -84422
15576 -84422 -50099 -37641 -3150 40365 31731 24881 28576 21279 20083 -11597 -18525 -5232 -32674
15563 -32674 -51664 -72504 -81959 -99936 -73654 -87308 -102086 -107104 -68062 -38029 -17509 -7475
15551g475M5867k5199l2272L1433L2358l0679J6017l5810M210K778K3875k491
15539B2612J7305J2884j3555J0652j6675l9298j6331o718j6985L7660P255K1941
15527B0747j3081j2466j856k3563n845J6582M6621J4994p013l1963q395k3579
15515b8817j1282K4812j0396L1282k653j6595j4744J5073J4796j8281L4249l702
15503A3742j6654P643K2053L7732k0919k1357k8019j6535Q700J0108J4133l5606
15491b4979K041N645N026J6029J8507Q515j7509k1386R612M7800P705j7246j5658
15478B4102j5291j4816j1723Q362k478J2895MK047j1814j8828l579K3498p00j7451
15464b5772N4682J3507n176l8125j8427L125J9084M8362O259j6319n6469o9166
$$ plain form
15551 -7475 38392 13193 -19079 12354 44712 14033 30050 -5760 -1550 1228 25103 22612
15539 22612 39917 52801 39246 49898 33223 -6075 -22406 -29124 -46109 -8449 -1194 20747
15527 20747 7666 -4800 -6656 -30219 -36064 -19482 27139 42133 35120 3157 -5238 -28817
15515 -28817 -40099 -15287 -25683 5599 2946 -13649 -28393 -13320 1476 -16805 17444 13742
15503 13742 -2912 4731 26784 64516 43597 22240 -5779 -22314 -13614 -3506 10627 -24979
15491 -24979 -22938 -17293 -12267 3762 22269 30784 13275 -8111 1501 49301 57006 39760 24102
15478 24102 8811 -6005 -17728 -9366 -11844 1051 1055 3102 -8712 -27540 -31119 -7621 -8321 -25772
15464 -25772 28910 42417 37241 -884 -19311 -16186 2898 51260 57519 41200 -15269 -84435
15452h4435K1976M3481J2337J9383K2554k8359j7381K6123l0316j7226n5766K4195
15440f3434M8972J6826l1538l4349K151M116N1136K0642J1295K9437k2707j1697
15428B0850k1935k6794R369K7756q048K4396K0377J5275k1870m3186k8763J1710
15416b0863L1056K324o3333N498L4413J1855l4396j0652j7389k0643k2969j0148
15404a15247L2331N4495L0589L3431j9469P979J6959m0149m2242L4688N037m2754
15392d4352l4600L5917J8041j0470L6575L9936l2325m5023k4044J885k202J7957
15380d2705J4505L6962L2077K597O276j2334l8067k3785j1659j4915J1457K1683
15368a7908J9587j641k468M597k3759k5736J4524L6328N8477Q337m5935k6095
$$ plain form
15452 -84435 -62459 -18978 -6641 12742 35296 6937 -10444 15679 -14637 -31863 -87629 -63434
15440 -63434 -14462 2364 -29174 -63523 -61372 -57256 -6120 14522 25817 55254 32547 20850
15428 20850 -1085 -27879 -18510 9246 1198 25594 45971 61246 39376 -3810 -32573 -20863
15416 -20863 10193 12517 -50816 -45318 -10905 950 -33446 -44098 -61487 -82130 -105099 -115247
15404 -115247 -82916 -28421 2168 35599 16130 24109 41068 919 -41323 -6635 -1598 -44352
15392 -44352 -78952 -43035 -24994 -35464 1111 41047 8722 -36301 -60345 -58460 -60662 -42705
15380 -42705 -28200 8762 40839 43436 49712 37378 -689 -24474 -36133 -51048 -39591 -17908
15368 -17908 1679 38 -2430 2167 -21592 -47328 -32804 3524 62001 70338 24403 -1692
15356a692M077J7150L2953l0289k2264O599j8412P144J704J8375J9358m4588p218
15343a7103L5738k3714j8555k369N307M7068P52M771L294n7186J456L4690j4974
15330h25l0761j8629L8517J7122K51k2936l9341K3272M2802K8862N9705k1661
15318G6378p3170k3898K1956j4228p449J461L7173L9731j3609k0612o592Q101
15306B5242k2959k1901K8651o565J680k375m1413k6200K2663R082K8003l5761
15294d1853j9271o689J2932L1430M8321l2157j5511k6601J739r850j5810K1684
15282e1636j1643l3700L9065P9026K4097j9318j6406Q049j6053m2329O469L2950
15270a429J6783L7004l1497l5562K7241M2366R548j7524m2117m4975k0624J3622
$$ plain form
15356 -1692 2385 19535 52488 22199 -65 6534 -11878 -4734 -3030 15345 34703 -9885 -17103
15343 -17103 18635 -5079 -23634 -26003 -20696 26372 27124 31895 35189 -21997 -20541 14149 -825
15330 -825 -31586 -50215 -11698 5424 5675 -17261 -56602 -33330 9472 38334 98039 76378
15318 76378 3208 -20690 1266 -12962 -20411 -18950 18223 57954 44345 23733 17141 25242
15306 25242 2283 -19618 9033 2468 4148 1773 -39640 -65840 -43177 -34095 -6092 -41853
15294 -41853 -61124 -67813 -54881 -23451 24870 -7287 -22798 -49399 -47660 -57510 -73320 -51636
15282 -51636 -63279 -96979 -57914 21112 45209 25891 9485 17534 1481 -40848 -34379 -1429
15270 -1429 15354 52358 20861 -14701 12540 54906 64454 46930 4813 -40162 -60786 -47164
15258d7164L4717M4177j2603n0976o4324J1340M9929J5328K3536J9403K227l7830
15246a2240k900L769n257O274j2163j8330N9212j7492n7668j1411P321k8107j0147
15233i9139K5586L5377J7514J1214P638m4450j279k8996J6256J6540p743j9316
15221g0798M4485K281k8005J0060k2557P154M3911K9444K177j4680M800l7855
15209b9583M744P760j2377Q303J4266k260N954k9330j5303J45p599o712k4454
15196h6446J4940N3823L7433l9422k3167K7520L1518k1230k7316N419q575j9040
15184e4543M3028J4031j8342o901j488k7141L8157k868o298l4209j964M4834J9079
15171E375l7909N664J4555K3278O412k3128L884J0814j9704j3292l1217J8675
$$ plain form
15258 -47164 -12447 31730 19127 -31849 -96173 -84833 -34904 -19576 3960 23363 25590 -12240
15246 -12240 -15140 -11371 -16628 -10354 -22517 -40847 18365 873 -56795 -68206 -60885 -88992 -99139
15233 -99139 -73553 -38176 -20662 -9448 -1810 -46260 -47539 -76535 -60279 -43739 -51482 -70798
15221 -70798 -26313 -24032 -52037 -41977 -64534 -57380 -13469 15975 18152 3472 8272 -29583
15209 -29583 -24839 -17079 -29456 -21153 -6887 -9147 -3193 -32523 -47826 -47681 -55280 -61992 -86446
15196 -86446 -71506 -17683 19750 -19672 -42839 -15319 16199 -5031 -32347 -26928 -35503 -54543
15184 -54543 -11515 2516 -15826 -22727 -24215 -51356 -13199 -16067 -22365 -56574 -58538 -13704 5375
15171 5375 -32534 -26870 -12315 10963 17375 -5753 -1869 8945 -10759 -24051 -55268 -36593
15159c6593M4639K3103m7686q333j78j7224K6020L540J1579J4469l0849o541L1494
15146G440J6794j147k151P533O415Q329m9412n802Q546L8586Q967j9033J7357
15133D2422j2117j6148m1970R965M0724K2941q287l7903j771j2249K0255L5663
15121D1525j5561k2252K4223N713j2203r248j3r054j7328R693K329p369Q428l0025
15107c1142k0763q041L8434O2088J268l2753k0547L9263J8648j6184j3713k956
15095A3602J1129N211k4971j2270j5691k6747L502K9026L0113n889L755N974J7465
15082C4209J9012l3615l0025m5445K3199K7700l6r261P031J9198K8454k1474K2871
15069D1818q990j8594j6681l1353J6948j1674J3000J5815K1721j1052j1025K1555
$$ plain form
15159 -36593 8046 31149 -16537 -24870 -25048 -42272 -16252 -12712 -1133 13336 -17513 -24054 7440
15146 7440 24234 23087 20936 28469 34884 43213 -6199 -12001 -3455 35131 44098 25065 42422
15133 42422 30305 14157 -27813 -17848 22876 45817 37530 -373 -2144 -14393 5862 41525
15121 41525 25964 3712 27935 33648 21445 12197 12184 3130 -14198 -4505 -2176 -9545 -1117 -31142
15107 -31142 -51905 -59946 -21512 40576 41844 9091 -11456 27807 46455 30271 16558 13602
15095 13602 24731 29942 4971 -7299 -22990 -49737 -46235 -17209 12904 7015 10770 16744 34209
15082 34209 53221 19606 -10419 -55864 -32665 -4965 -5001 -14262 -7231 11967 40421 18947 41818
15069 41818 32828 14234 -2447 -33800 -16852 -28526 -15526 289 22010 10958 -67 21488
15057B1488r978L101j5825K4428j0243k6172j3106M4167j0483l4772r089j4676
15045e1160K6788O1787l4593k0652m7741j4609l5149j8373O8107J9763J0286j2902
15033d8448j8030j7356j401R300M3090j6111l0956J0192L5384M9402L0262j3535
15021C1793L282J445o045m098j0142j8272k2179j1585j7420q717m1881L0832L3916
15008c9071J5692k2519j9909o390L2054q284Q169k8577j977M1433J2339K5323
14996H283k2725k9439J3405L0259n479j1440N2781N0982k0295k6123L3435J3179
14984H6823l5353j5905k9507l8474R344J3558K2796p3739O166J2634k5582K4768
14972d2471Q608m007J5132J4283k5557m0446M2899m530k8872R082K9869R107p446
$$ plain form
15057 21488 11510 14611 -1214 23214 12971 -13201 -26307 17860 7377 -27395 -36484 -51160
15045 -51160 -24372 37415 2822 -17830 -65571 -80180 -115329 -133702 -65595 -45832 -35546 -48448
15033 -48448 -66478 -83834 -85235 -75935 -32845 -48956 -79912 -69720 -34336 15066 45328 31793
15021 31793 35075 36520 30475 26377 16235 -2037 -24216 -35801 -53221 -61938 -103819 -72987 -39071
15008 -39071 -23379 -45898 -65807 -72197 -40143 -48427 -40258 -68835 -70812 -29379 -17040 8283
14996 8283 -14442 -43881 -30476 -217 -5696 -17136 35645 86627 66332 40209 73644 86823
14984 86823 51470 35565 6058 -32416 -23072 -9514 13282 -60457 -54291 -41657 -67239 -42471
14972 -42471 -33863 -37870 -22738 -8455 -34012 -74458 -31559 -36089 -64961 -55879 -26010 -16903 -24349
14959b4349K0821O378L321j5739l8649K5172L5779K1624k9166O853L502j2276
14947C271j173J733J6867L2375k0609o563j2031j9386L9649P831J1455k3479l7436
14934g496J7295P785p873l0929K6241K1263R208J1789m2860l5681M244l4661k1785
14921h3460l597L8765j0055J303k0196m130K9617L2674j780j6287n508J455K4698
14908a6501j718k4392K9535J5319j1891K6024K066l623J1119K7955k7307k4094
14896B492L513k936n70k44l1099j1476N3387q676J278p749k3865Q137j3124k985
14882c3917l438j946K3851m263j8698j5219J5021L2860n039j4101k121m3316m1693
14869a12019O545N9063J9027J2116p027m387K0279j3479J0051J7472J5531Q796
$$ plain form
14959 -24349 -3528 2850 6171 -9568 -48217 -23045 12734 34358 5192 12045 15547 3271
14947 3271 2098 3831 20698 53073 32464 25901 13870 -5516 34133 41964 53419 29940 -7496
14934 -7496 9799 17584 9711 -21218 5023 26286 35494 47283 4423 -31258 -27014 -61675 -83460
14921 -83460 -87057 -48292 -58347 -57044 -77240 -81370 -51753 -19079 -20859 -37146 -42654 -41199 -16501
14908 -16501 -18219 -42611 -13076 2243 -9648 16376 18442 14819 25938 53893 26586 2492
14896 2492 6005 3069 2499 2255 -28844 -40320 13067 4391 5669 -2080 -25945 -17808 -30932 -33917
14882 -33917 -37355 -39301 -15450 -19713 -38411 -53630 -38609 -5749 -10788 -24889 -27010 -70326 -112019
14869 -112019 -105474 -46411 -27384 -15268 -22295 -26682 -6403 -19882 -9831 7641 23172 31968
14857C1968k7743m6223j943j0098M0567Q108l135r344j5417J7083J8055J49k3352
14844b1325J1691l54p508J576J4675L508o8121k7126n413P459L0505K3865L6481
14831h7K276K7687K00m3456m154j790J8380K7460L0513n407m187k0586R981j6391
14817B0439m2279M2722n92m8120m5851L1201L1232K0688l619j2493r36j2925J3894
14804f639N641J0369n501k4825j1637J3748L2106R145q75J9760k4215j4662K8440
14791C0855J5670l2431j9132j3669r433n976L3316K6991q867m4017J2246P224
14779g223j667j426M4149R739l961M5731K096j0171k6921L304K0433j75k7052
14766D6856l0477j0040N098K9186k0833o0087L748M9452K1624m5091R519O017
$$ plain form
14857 31968 4225 -41998 -43941 -54039 -13472 -5364 -8499 -17843 -33260 -16177 1878 2027 -21325
14844 -21325 -9634 -9988 -17496 -15920 -1245 2263 -65858 -92984 -98397 -90938 -60433 -36568 -87
14831 -87 2189 29876 30076 -13380 -17534 -19324 -944 26516 57029 51622 47435 26849 36830 20439
14817 20439 -21840 20882 20290 -27830 -73681 -42480 -11248 9440 5821 -6672 -7608 -20533 -6639
14804 -6639 -998 9371 3870 -20955 -32592 -18844 13262 22407 21532 41292 17077 2415 30855
14791 30855 46525 14094 -5038 -18707 -28140 -34116 -800 26191 17324 -26693 -14447 -7223
14779 -7223 -8890 -10316 33833 43572 39611 85342 87438 77267 50346 53650 74083 73908 46856
14766 46856 16379 6339 11437 40623 19790 -40297 -36549 12903 34527 -10564 -1045 4972
14754D972k1805j0629j4095M9630P2457Q984o243j6045l0214j6946k411P27j7181
14741A201P329J4066n344l2438k1030R1k7639l7793j2406N5148K6002M591j860
14728c0082N980J3764j2717l0366J6531L4840J3457k1115o287M4160J2865k699
14716C8331j0194k8116k5441L884K3644P691q263j2871o005J4741j1112n890l097
14703b2698K3990p198l897l222k2663j6552Q364l209P646j97K8302K0871K7265
14690C6802l3678R325K815J487N900K2167k9724p4114m5759J2259M3456J7463
14678c1601q502j054J6605R872J9568M8646J7779k434o6537l6345L0623p575q943
14665a9898J6939k932J4284J1682k8775j8745K1760K9630j2231j5236r40J2384
$$ plain form
14754 4972 -16833 -27462 -41557 8073 80530 89514 83271 67226 37012 20066 17655 18382 1201
14741 1201 8530 22596 17252 -15186 -36216 -36125 -63764 -101557 -113963 -58815 -32813 -28222 -30082
14728 -30082 -24102 -10338 -23055 -53421 -36890 -2050 11407 -9708 -15995 28165 41030 38331
14716 38331 28137 21 -25420 -21536 2108 9799 1536 -11335 -17340 -2599 -13711 -19601 -22698
14703 -22698 1292 -5906 -9803 -13025 -35688 -52240 -43876 -47085 -39439 -39636 -11334 9537 36802
14690 36802 3124 12449 15264 16751 22651 44818 15094 -59020 -104779 -92520 -49064 -31601
14678 -31601 -40103 -41157 -24552 -14680 4888 53534 71313 68879 2342 -34003 -3380 -10955 -19898
14665 -19898 -2959 -5891 8393 20075 -8700 -27445 -5685 23945 11714 -3522 -4462 7922
14653G922l448k403r065k0909k5167k5086K7082j8814N082L9253J6332j1616P203
14640a3634P379O910j4872j1437K941o840M0415J2305N868m406K2167N439m73
14627E1762k1192p0593K0633j0623P299j2138R062J2310J0014J4038N094j1257
14615D409l267q802M060q34M2989k0326l0256l744j112L3283n510J2415K4633
14602D7938o251k4941m2011j1721L0929o506j5439J3899K9617j142K1710n499
14590C0583l1943j0691K9900j3382l6341j7189n6764K074L8784L4953O911J1792
14578a1313L6047K8983l5876P29L4072k2452j6920J8734j0766j8839l0862l718
14566c2181J9053N4282K2850l6650l682k3771K4580j9844J7913q56j497K4068
$$ plain form
14653 7922 4474 2071 -6994 -27903 -53070 -78156 -51074 -69888 -64806 -25553 -9221 -20837 -13634
14640 -13634 -6255 655 -14217 -25654 -22713 -29553 10862 23167 29035 24629 46796 52235 51762
14627 51762 30570 -40023 -19390 -30013 -22714 -34852 -25790 -13480 -3466 10572 15666 4409
14615 4409 1142 -7660 -3600 -4434 38555 18229 -12027 -15771 -16883 16400 10890 23305 47938
14602 47938 41687 16746 -25265 -36986 -6057 -12563 -28002 -14103 15514 14372 36082 30583
14590 30583 -1360 -12051 17849 4467 -31874 -49063 -105827 -103753 -64969 -30016 -23105 -11313
14578 -11313 24734 53717 17841 18570 52642 30190 13270 32004 21238 2399 -28463 -32181
14566 -32181 -13128 41154 64004 27354 23672 -99 24481 4637 22550 21694 20197 44265
14554D4265q119l8703L311j1052J0840O919J9700J6111j163l9261j7122K0259
14542E985l567j7401l1253l495Q87J6490K9429J6550R885k1152J224K620J8380
14529B4582j3205O966K2261k5498j4148L7442o96j2748l0011L191Q772k0444j1757
14516b5293m0237J659L3617J0395K9635N251j0961k0656m56L5878M4560L9468
14504A02860Q723l7397k8143j8186O430L186j7397R362j1436k2028l697M9532
14492D1809N5772j4213n2083j5195k6322p478K1541J4432r728P681K48K9828o410
14479C9882K106M492M0113k0695n0571p352r411K1006K6773j6813j9767m0905
14467c1142J5482N4426M774k5586L760j6468J2363R661J8294j7825J3787j2815
$$ plain form
14554 44265 36146 -2557 754 -10298 542 7461 27161 43272 42109 2848 -14274 5985
14542 5985 2418 -14983 -46236 -49731 -48844 -32354 -2925 13625 23510 2358 3582 6202 24582
14529 24582 11377 18343 40604 15106 958 38400 37704 24956 -5055 -1864 6908 -13536 -25293
14516 -25293 -65530 -63871 -30254 -19859 9776 15027 4066 -16590 -17046 18832 63392 102860
14504 102860 111583 74186 46043 27857 34287 37473 20076 29438 18002 -4026 -7723 41809
14492 41809 97581 83368 31285 16090 -10232 -17710 3831 18263 8535 16216 16464 46292 39882
14479 39882 41988 46480 86593 65898 15327 7975 -1436 19570 46343 29530 9763 -31142
14467 -31142 -15660 38766 43540 17954 21714 5246 17609 27270 45564 27739 41526 28711
14455B8711m0090l8604k3975K1755N5515N144P655J2909n270j2636k8026j770
14443a8682k802J6287O019R779j7728l2176j3703J0690L2589L1027k0221j6978
14431a5899k8883l908m0672J2167K8947L350M09K3104j1802j9169K5063L8636
14419A1343M3939k0314m7434k3591l5777L3705K3087K035l431J540K2654K1034
14407B8790p644j8895p319M0029J7791j0706j2944r219L745J7008Q073k3882l9869
14394a5042p949L6649k7744r942K0998K5168m124j0889K08j8209J5288K7652K5003
14381E7067l6816l3082j241J5920l0906M5740R094j3007k7845J497J6696q30K3585
14368B5872k0886m4438l039M5236J3968j1052q029M054j8417j8091L2684M1669
$$ plain form
14455 28711 -11379 -49983 -73958 -52203 3312 8456 16111 29020 23750 11114 -16912 -18682
14443 -18682 -21484 -5197 822 10601 -7127 -39303 -53006 -42316 -9727 21300 1079 -15899
14431 -15899 -44782 -48690 -89362 -77195 -48248 -44898 -44489 -21385 -33187 -52356 -27293 11343
14419 11343 55282 34968 -12466 -36057 -71834 -38129 -15042 -13007 -16438 -14898 7756 28790
14407 28790 21146 2251 -5068 34961 52752 42046 29102 19883 23628 40636 48709 24827 -15042
14394 -15042 -22991 13658 -14086 -24028 -3030 22138 18014 7125 7333 -10876 4412 32064 57067
14381 57067 20251 -12831 -14072 1848 -29058 16682 25776 12769 -15076 -13579 3117 2287 25872
14368 25872 4986 -39452 -42491 2745 16713 5661 -2368 1686 -16731 -34822 -2138 39531
14356C9531o497p3368m72j4153M3916K0949p732j8523J3580q991L1115Q794m5666
14343a7517k440K8560k1357p944J3761k1739j6774M4766J8538n677j6537K9415
14331B5055L4741n716j0298l2013J982m0866R966L0368l686l2035j9355L8954
14319b903M6759K053k3716j7985m82k098j9016p359K0056j1023K127K2155N1727
14306F0295k6888n0855K610K224K0010J6814k2462k4812k7781J2111M5144K8515
14294C4925J0256k4892N231K0183r726j1518K5379J8034l5662k0616L307J4448
14282B9349M150j4951k6946l193k0238O264L4876K5956k9342k8187J2109K4290
14270A4137j9241q484L829P373L0314k6962j1334P60k623N7192k1827m1189J7138
$$ plain form
14356 39531 33034 -40334 -40806 -54959 -11043 9906 2174 -16349 -2769 -11760 19355 28149 -17517
14343 -17517 -19957 8603 -12754 -20698 -6937 -28676 -45450 -684 17854 12177 -4360 25055
14331 25055 59796 54080 43782 11769 13751 -27115 -17149 13219 9533 -22502 -41857 -2903
14319 -2903 43856 45909 22193 4208 3726 1628 -17388 -24747 -4691 -15714 -13587 8568 60295
14306 60295 33407 -17448 -14838 -12614 7396 24210 1748 -23064 -50845 -38734 6410 34925
14294 34925 45181 20289 25520 45703 35977 24459 49838 67872 32210 11594 14901 29349
14282 29349 33499 18548 -8398 -11591 -31829 -25565 9311 35267 5925 -22262 -10153 14137
14270 14137 -5104 -13588 -9759 -2386 27928 966 -10368 -9608 -12231 44961 23134 -18055 -917
14257i17K3723K0965l1553j1825J7740K1465j7668l0621J0104J6713K5520k7455
14245A6191l3020J0705J5583k9159K5148J1672k4150k3661k970L5579K9014j4295
14233A6637o0993j1649l465J3061n088k3337j2741N2054J4176l555L0939l561
14221B478R010k1504k273K8222m4604J1042M3312L5405k1621q873j3207P512k1795
14208C104l8938K8142J8015K7138K8717l3385k4390O307J387j349R288j7396j6900
14195a0260J6566L707M2212J8202L5662k4440m3310k3316n319j0129J0599L9460
14183D9634L307j5140Q088j1991n1785l4094L5844L080M147M326M584P574j977
14170E597j2078K6317o994P760j6939j4110k0325l4393K8657J4371r123M668O648
$$ plain form
14257 -917 22806 43771 12218 393 18133 39598 21930 -8691 1413 18126 43646 16191
14245 16191 -16829 -6124 9459 -19700 5448 17120 -7030 -30691 -33661 1918 30932 16637
14233 16637 -44356 -56005 -59470 -46409 -51497 -74834 -87575 -35521 -21345 -24900 6039 2478
14221 2478 11488 -10016 -12289 15933 -28671 -17629 25683 61088 39467 30594 17387 24899 3104
14208 3104 -35834 -7692 10323 37461 66178 32793 8403 14710 16097 14748 24036 6640 -10260
14195 -10260 6306 10013 52225 70427 106089 81649 38339 15023 9704 -425 10174 49634
14183 49634 52941 37801 45889 33898 -17887 -51981 -16137 -13057 -8910 -4584 0 7574 5597
14170 5597 -6481 19836 12842 20602 3663 -10447 -30772 -65165 -36508 -22137 -31260 -26592 -19944
14157a9944j8255L4532R708k5465k3024J377O592J1806J0691K0077L1577L3836
14145G3508m3181m0666J1829J6746k6148l898L9150R980J5317q451k1804o93k5165
14132c476m3157l6619n5302L1033O0777K5510K17m622j1051l90K5426K9405J9933
14119C7684J441j0602k8871L4810L960k2131L23K8143k1601k0742K2567o222N977
14106B4736k256J8579J6513R747p293m8377M168O706j0536r753K224K0583Q476
14093C3517l0463j3603N1137N3988j4854j1528j7520m1109M7548K5505j0081M645
14081G7182R045j5197m3633j2050k5747R878j058l4144j9740j178M2022j041J5124
14068e37p471l9599J562L2998L9942o6l0289l3898k0157K6765N4917J592k7274
$$ plain form
14157 -19944 -38199 -3667 6041 -19424 -42448 -41071 -34479 -22673 -11982 8095 39672 73508
14145 73508 30327 -10339 1490 18236 -7912 -11810 27340 37320 52637 44186 22382 21689 -3476
14132 -3476 -46633 -83252 -138554 -107521 -46744 -21234 -21017 -25639 -36690 -37080 -11654 17751 37684
14119 37684 39125 28523 -348 34462 38422 16291 16614 44757 23156 2414 24981 18759 24736
14106 24736 22480 41059 57572 67319 60026 11649 15817 22523 11987 2234 4458 25041 33517
14093 33517 3054 -10549 40588 94576 79722 68194 50674 9565 57113 82618 72537 77182
14081 77182 86227 71030 27397 15347 -10400 -522 -1580 -35724 -55464 -56642 -14620 -15661 -537
14068 -537 -8008 -47607 -46045 -13047 26895 26829 -3460 -37358 -57515 -30750 24167 25759 -1515
14055a515j7870M4502O0630J0323l4853n2249k4325K4824k1446J4618J9226l123
14043A8742N3767J0436k4005l7887k2666L6529M805j8373L8725J558r335j6544
14031C5752j3214q055K855J5040K7823l2r408l1340m2052K8531k1687k755K2442
14018C900J8391M2188L904J0209P697n2578j7262L1424L6981J983j9843j4132
14006E2862k2608k4567N423L228k3017j1942p777J5930l3413J9829N0537l399
13994B1086l1593k6433M7130M3061q117k8876N539j5388j9561k4341J5993O9095
13982D7595k0828l94o999M243J9903j7539l0527n790k5299k3960L491j0053R146
13969e7011M276K9153K4349K0000j3713J7642M212k384M6355l0193l562L248q446
$$ plain form
14055 -1515 -19385 25117 85747 96070 61217 8968 -15357 9467 -11979 2639 21865 18742
14043 18742 72509 82945 58940 21053 -1613 34916 39721 21348 60073 61631 52296 35752
14031 35752 22538 14483 17338 32378 60201 60169 50761 19421 -22631 5900 -15787 -18542 3900
14018 3900 22291 64479 68383 78592 86289 33711 16449 47873 84854 86837 66994 52862
14006 52862 30254 5687 11110 14338 -8679 -20621 -28398 -12468 -45881 -26052 24485 21086
13994 21086 -10507 -36940 10190 53251 45134 16258 21797 6409 -13152 -37493 -21500 47595
13982 47595 26767 26373 19374 23617 43520 25981 -4546 -10336 -35635 -59595 -56104 -66157 -57011
13969 -57011 -52735 -23582 767 20767 7054 24696 28908 26524 72879 42686 39124 42372 33926
13956C3926K1972J4012J9872l8797m6019P955m1258K2461N032J483j6295j444
13944a7100n564j3467J8208K4382j1678r359J6002O397N898L6778l1092n2992
13932c3587O014k4485K6132K0588q129l157M9460L8205l6965J786j9208k2094
13920e440M4368J7898n2985j8963j2255j7022K8770M2934J1005j6513m4541k57
13908b3001J9705K9734J813n287J4650M4848J2934l4506l0164j6529r420k7566
13896b2789N518L0550j5347j2476j5153K8333N9364j8688j5748j4166m589j8116
13884a3307J3818K4606j2675k1447L6372o29L4547K998k4089p754O300k3290l021
13871A2429J5702m5619j7515K0972M8233p280n2434m894K6783q090Q82J9530j9496
$$ plain form
13956 33926 55898 69910 89782 50985 4966 12921 -28337 -5876 -844 639 -15656 -17100
13944 -17100 -22664 -36131 -17923 6459 -5219 -14578 1424 7821 13719 50497 19405 -33587
13932 -33587 -27573 -52058 -25926 -5338 -13467 -16624 32836 71041 34076 35862 16654 -5440
13920 -5440 38928 56826 3841 -15122 -27377 -44399 -15629 27305 38310 21797 -22744 -23001
13908 -23001 -3296 26438 28251 22964 37614 82462 95396 60890 30726 14197 4777 -22789
13896 -22789 -17271 13279 -2068 -14544 -29697 -1364 58000 39312 23564 9398 4809 -13307
13884 -13307 511 25117 12442 -9005 27367 26738 61285 64283 40194 32440 38740 15450 12429
13871 12429 28131 -17488 -35003 -14031 34202 26922 -25512 -30406 -3623 -11713 -10831 8699 -10797
13858a0797J8506J1687l3952M486M4875L6741K4793j8336p0549k2639J1245Q96
13846c044R2N7509k1973k3069k7231K9235K7835k1086j2803L5051l1538j2428
13834c450K1569R11K4416K2678l7890m5187j0574L2204r55n395J9739j3709k4634
13821b0277L7308K3173L7878m4111l9615l0066N752L3502L7372j3553K4446J4977
13809F6786N240j6286J397j0514j0497o5315r240L4457M148K0625k3J8172q453
13796C0497j863j6526j6487M9099K8310j3917m4970J7710M706j5844J8864j1836
13784B7743J2832j7522J143k958k6642L5738L7122l5127m236o068K4339N670j633
13771E0401o138j7879j5782k9003J7946J7090J3967J11p513o010l1010J9073j0692
$$ plain form
13858 -10797 7709 19396 -14556 -10070 34805 71546 96339 78003 7454 -15185 -3940 -3044
13846 -3044 -2952 54557 32584 9515 -17716 11519 39354 18268 5465 40516 8978 -3450
13834 -3450 18119 19030 43446 66124 28234 -16953 -27527 4677 3722 -1673 18066 4357 -20277
13821 -20277 17031 40204 78082 33971 -5644 -35710 -29958 3544 40916 27363 51809 66786
13809 66786 72026 55740 57137 46623 36126 -29189 -38429 -3972 176 20801 20778 38950 30497
13796 30497 28634 12108 -4379 44720 73030 59113 14143 31853 36559 20715 39579 27743
13784 27743 40575 23053 24196 21238 -5404 30334 67456 32329 28093 22025 46364 52034 50401
13771 50401 44263 26384 10602 -18401 -455 16635 30602 30713 23200 17190 -13820 5253 -5439
13758e439n1274J9000J5428r604J9872r036J2275K9956Q22n351L0809M2998l2416
13745E8040k566q504m7892l6230l7468K2147K6617L6232K2140n35k3717J6829
13733B5093J5289J5671q35k4325J9548l7851l9613L1575L3733j0761J8519J7513
13721F3556j2034Q687o350j1679N627k2752K1094j7087n578m571j4968m7369j4068
13708e7492P0017Q350m602j2014J3812j1840k2662K5930M6489q508n7030l3723
13696d3273l4083L0978L860J7173Q612L9222p433j8159L6355K0970k9392J3408
13684C8238j4221J0949o803K6752P187o349K1594O4018L254p0556o6574k1144
13672a3655L2847l5582l65j1019m430J8047o202J8530K0228k029l024J2087k495
$$ plain form
13758 -5439 -56713 -37713 -22285 -31889 -12017 -21053 -8778 21178 22000 16649 47458 90456 58040
13745 58040 55474 46970 -922 -37152 -74620 -52473 -25856 10376 32516 31981 8264 25093
13733 25093 40382 56053 55218 30893 50441 12590 -27023 4552 38285 27524 46043 63556
13721 63556 51522 60209 53859 42180 47807 25055 46149 29062 23484 18913 3945 -43424 -57492
13708 -57492 12525 20875 16273 4259 18071 6231 -16431 9499 55988 47480 -9550 -43273
13696 -43273 -77356 -46378 -42518 -25345 -16733 22489 15056 -3103 33252 54222 24830 38238
13684 38238 24017 34966 28163 54915 62102 55753 77347 141365 144619 74063 7489 -13655
13672 -13655 19192 -16390 -16755 -27774 -32204 -14157 -20359 -1829 18399 16370 13346 25433 22938
13659B2938q125m7409R940N0688K6920k0909j1462P684J1272J2164L703l09l424
13646E3671j5689k5634j5756O4634K7603L938l5427m5922l1904J4316k1686j5784
13634d3640K9362N3628Q023l90j7695l5548j7118J2344m109m877J1604p564l5950
13621e1930j003l2440j9521P257J8857K1584N7568k1513r592L7112K2558j1582
13609A7355k7424M028l2p454n518k6877Q912K1822k7127l8832L0742L512k512
13596d9405J7242N9823k3538k2534j2042j4852J863K5697J2833l0318L161p981
13584d0051m630K6863m51L966K7891J5054r310L8809n870l8372K0094L390J7020
13571E4403K1124k792l5705J9658n271J4729r375j7957K9522j2510l7634K155
$$ plain form
13659 22938 14813 -32596 -22656 28032 54952 34043 22581 30265 41537 53701 57404 57095 53671
13646 53671 37982 12348 -3408 61226 88829 92767 57340 11418 -20486 -6170 -27856 -43640
13634 -43640 -14278 39350 47373 46983 29288 -6260 -23378 -11034 -15143 -20020 -8416 -15980 -51930
13621 -51930 -52933 -85373 -104894 -97637 -78780 -57196 372 -21141 -30733 6379 28937 17355
13609 17355 -10069 -6041 -6073 -13527 -19045 -45922 -37010 -15188 -42315 -81147 -50405 -46893 -49405
13596 -49405 -32163 27660 4122 -18412 -30454 -45306 -43443 -17746 -4913 -35231 -32070 -40051
13584 -40051 -44681 -17818 -18269 -14303 13588 28642 19332 58141 52271 13899 33993 37383 54403
13571 54403 75527 72735 37030 56688 51417 66146 56771 38814 68336 55826 18192 20347
13559B0347k3607j4949L1896J9686o603J1477J0647j1862P19P675M7965P639l8107
13546F2923M807j0242Q082k7870j6359k0265l1965J4167J3394J1812M965L3315
13534D6764l122J650J5714k116k223J7941p477j6192L1203J1831l6910k5846K9734
13521F0951j4028L179J7104j2816j603j7204J395K0669p285R829m5139k6491L1324
13508A9885L8859m0496j2958L8980J4077o2371O996j279j4675M60L8829O013L56
13495C2676k812j871K2077J6512k1193q979j102l7729n7413k8540M2778N9829
13483A4233K8349K4616k7748K7041K2446k7282k2424O624K097O266P613R176K3501
13470I4508K598k5125n2003k9335J2783J5006J0486N991Q3152J5381l5527l6860
$$ plain form
13559 20347 -3260 -18209 13687 33373 26770 38247 48894 37032 37751 45426 93391 101030 62923
13546 62923 67730 57488 65570 37700 21341 1076 -30889 -16722 -3328 8484 13449 46764
13534 46764 43642 45292 61006 58890 56667 74608 67131 50939 82142 93973 57063 31217 60951
13521 60951 46923 50102 67206 54390 52787 35583 36978 57647 50362 60191 15052 -11439 19885
13508 19885 58744 18248 5290 44270 58347 -4024 2972 1693 -12982 -12522 26307 32320 32676
13495 32676 29864 27993 50070 66582 45389 36410 35308 -2421 -59834 -88374 -45596 14233
13483 14233 42582 67198 39450 66491 88937 61655 39231 45855 47952 54218 61831 71007 94508
13470 94508 97106 71981 19978 -9357 3426 18432 28918 34909 118061 133442 97915 61055
13458F1055m3315J1295J8257j634j9144j094k107k9888L803j8664N173j8696K5142
13445i817M1786k5263m9553q964M8470j2541j0870j0227K145L7701o038j9012
13433b2183L4535J7809p728N9447j5154k1958J9683J5323l3703m9199m2959j8494
13421f4581L5994L2651j2174L129J3203R666K3460N625k715k2075k4183J220P281
13408F501j5194R955L389L6392R679j5764Q463J7089K1485r191K86r897j6353
13395D6840L9670j350J078q709J278Q322k692K464k4402k5918J0144K4023l5977
13382C4771l4639j3374j6694M1471P1880n219N849j4573j1382j7386l6552K0702
13370B4854M4462M957K475J7110m5574j1952m1344k4600Q930m387J355Q695K3293
$$ plain form
13458 61055 17740 29035 47292 45658 26514 25420 23313 -6575 -2772 -21436 -16263 -34959 -9817
13445 -9817 31969 6706 -42847 -51811 -3341 -15882 -26752 -36979 -34834 2867 -3171 -22183
13433 -22183 12352 30161 22433 81880 66726 44768 64451 79774 46071 -3128 -46087 -64581
13421 -64581 -28587 4064 -8110 -4981 8222 17888 41348 46973 44258 22183 -2000 -780 6501
13408 6501 -8693 1262 4651 41043 50722 34958 43421 60510 81995 72804 73090 63193 46840
13395 46840 86510 85160 86238 77529 78807 87129 84437 86901 62499 36581 46725 70748 34771
13382 34771 132 -13242 -29936 11535 83415 78196 84045 69472 58090 40704 4152 24854
13370 24854 69316 74273 76748 93858 48284 36332 -5012 -29612 -20682 -25069 -23714 -15019 8274
13357H274k7556k4789K5900N8950j1558j1315l524J01K2476M9539k346k1537j869
13344F0746O747K2430j5445j9406L0308n299k4913L739k2654k0538K7889J7704
13332F1308j7946n451l6559R811L6532l2365j9087J8269K2536m939N905L0614
13320F8628L316j80L046l8320L5352j7624l0761K7129R054J7495M4489j6345l2011
13307G3268K2678j9551l9777J874l7901J2520J6850N589q984n583K7347M1137
13295H9467j4665o5531l5163P413J7649K4454L4542J0171j692M988j6318M485
13283E9800L0511L4361m8958k5331k4336r725k08j1602K4712J3643k3816m3372
13271b4321N135K4379L1378j923k1499L8007N7722N427m4853k3787K247q485j5167
$$ plain form
13357 8274 -19282 -44071 -18171 40779 29221 17906 14382 14483 36959 86498 84152 62615 60746
13344 60746 67493 89923 74478 55072 85380 80081 55168 58907 36253 15715 43604 61308
13332 61308 43362 37911 1352 11163 47695 15330 -3757 14512 37048 32109 38014 68628
13320 68628 71944 71764 74810 36490 71842 54218 23457 50586 59640 77135 121624 105279 73268
13307 73268 95946 76395 36618 38492 591 13111 29961 35550 26566 20983 48330 89467
13295 89467 74802 9271 -25892 -18479 -830 23624 58166 68337 66645 71633 55315 59800
13283 59800 90311 124672 75714 50383 26047 16322 16114 4512 29224 42867 19051 -24321
13271 -24321 -19186 5193 36571 34648 13149 51156 108878 114305 69452 45665 47912 39427 24260
13258B4260r723R568K3339j1046m430M6250O43k2830J2190r811k6677o870k5998
13245a135O702j0848j5630K4128n886P99j0075j5255J284q764j3901j1984K2260
13232c8305K2041m729q573p053O206O5746L1174k6171l341r340j973L7288K3005
13219H5975k1811j6762k145k0334j6357J3604P220k0028R99L5741K2392K9234
13207I7728P049j5290k8493l7530q977R18J3591L9923K0238l2603l9114J6816
13195C4256J6477K8146M3933q78j8888o6978k9574J3055K3127J4923l3627k2071
13183A901J1112P6253K5473n2738l1988J623q139j6016J5438K1751p988q038k2767
13170E877j1487N2139j1757k4964j5684J4323n4427K1253N6942Q6201L799m3730
$$ plain form
13258 24260 14537 24105 47444 36398 31968 78218 78861 56031 68221 58410 31733 24863 -1135
13245 -1135 5567 -5281 -20911 3217 -2669 -1870 -11945 -27200 -25916 -34680 -48581 -60565 -38305
13232 -38305 -16264 -20993 -29566 -36619 -30413 35333 66507 40336 36995 27655 25682 62970 85975
13219 85975 64164 47402 45257 24923 8566 22170 29390 9362 10361 46102 68494 97728
13207 97728 104777 89487 60994 23464 14487 15405 28996 68919 89157 56554 17440 34256
13195 34256 50733 78879 122812 121934 103046 36068 6494 19549 42676 57599 23972 1901
13183 1901 13013 89266 114739 62001 30013 31636 23497 7481 22919 44670 36682 28644 5877
13170 5877 -5610 46529 34772 9808 -5876 8447 -45980 -24727 32215 118416 122215 78485
13158G8485k8803K1417k3135l1602N555q305N5195n7521j854K3048L1529r459
13146E4550j1416O96p184K3321l332M291K790L0508K1422K7210n2447l3916r947
13133D6546L5412L206J7419p09j2264L5348n244j9240K5798L4276L6301j8013
13121A78836m2905o6050j6761L3762N0139K7536J2279N5521j6378l0958K0951
13110B05972L9190j4019l5386L8144M6757P6290O6989R5992J80572K75981L31209
13099A307691L89923L31584J22947j48909k42058l41468k84066k79437j83164
13090F73043j68925q3300m5510l9457m2441n1265m2677k6944K7724k1315k3183
13079A55750o046j5984k3514j1560R661o25K0578N8726j6015l0133k1293l0473
$$ plain form
13158 78485 49682 71099 47964 16362 21917 13612 68807 11286 9432 32480 64009 54550
13146 54550 43134 43830 36646 59967 56635 60926 63716 94224 115646 142856 90409 56493 46546
13133 46546 81958 85164 102583 101874 89610 124958 119714 100474 126272 160548 196849 178836
13121 178836 135931 69881 53120 86882 137021 164557 176836 232357 215979 185021 205972
13110 205972 245162 231143 195757 233901 280658 356948 423937 519929 700501 976482 1307691
13099 1307691 1697614 2029198 2152145 2003236 1761178 1419710 1135644 856207 673043
13090 673043 504118 420818 375308 335851 293410 242145 199468 172524 200248 178933 155750
13079 155750 149704 133720 110206 98646 108307 107682 128260 186986 170971 140838 119545 89072
13067H9072l0902K859n937J8123M5864k479k7002R634n276n2166j7548N3686J2100
13054I0028J3901L6087p823k545l6664l6531L817p169j3250O243J2727Q467k1167
13041D6121j9361K719p544j9543K4061J1036M919q764j6494K9911K2994K7831
13029I7886j1728J1099J9667j3810k9175Q185J9155L1269N4613n6828k8754L1467
13017A33046J3366j6839L8764l9927l6644j1343J1521Q092l3175k2453P207N532
13005E7147J4733J5443m5303l4820M3975K0956m7508l0489J8225L5516K6000k8992
12993D4883r282N3227l326r106M825J2839M921K1859K72k7902l2119J0133J7637
12980H8861j2811Q096R062k1219N761o09O816P921J8990k1602j3742L0711j1653
$$ plain form
13067 89072 58170 61029 55092 73215 119079 116600 89598 99232 93956 41790 24242 77928 90028
13054 90028 103929 140016 132193 129648 92984 56453 60270 53101 39851 46094 58821 67288 46121
13041 46121 26760 29479 21935 2392 26453 37489 42408 33644 17150 47061 70055 97886
13029 97886 86158 97257 116924 103114 73939 82124 101279 132548 187161 130333 101579 133046
13017 133046 146412 129573 168337 128410 91766 80423 91944 100036 66861 44408 51615 57147
13005 57147 71880 87323 42020 7200 51175 72131 24623 -5866 12359 47875 73875 44883
12993 44883 35601 88828 85502 76396 81221 94060 98981 120840 121112 93210 61091 71224 88861
12980 88861 76050 84146 93208 71989 77750 77141 83957 91878 110868 89266 75524 106235 94582
12967I4582j667L0974j9926l3939K9138K4451m3029j5935o965R003L8586L7931
12955A43204O444k4915o102k5966J3475r30r792j7475j7158j4654J2442l3743
12943B4830j13J3581l5680j9695j9376j9114P989r18j7108L6395K4153N2081L5653
12930H2678Q338k7883j2137K7611J2124O164j2887J5670K1823k3478n50p88K3355
12917A20040K4492m1498j0597J3399K0121J2058L1915k6714k511k6252l3723J2300
12905I3030N0552J6783r450k0886n923k0603r142q282J4822L7931J0936L00P4499
12892B24567K9826K9054J6556q52K4411K4953K1200n6681j032p903l5440k4690
12880B43969p0759k1063L1660K92k0589j0197j378P937p006J4771j4009L7976
$$ plain form
12967 94582 92915 123889 103963 70024 99162 123613 80584 64649 57684 66687 105273 143204
12955 143204 149648 124733 118631 92665 106140 105210 95418 77943 60785 46131 58573 24830
12943 24830 24717 38298 2618 -17077 -36453 -55567 -47578 -48496 -65604 -29209 -5056 47025 82678
12930 82678 91016 63133 50996 78607 90731 96895 84008 99678 121501 98023 97473 96685 120040
12917 120040 144532 103034 92437 105836 125957 138015 169930 143216 140705 114453 80730 93030
12905 93030 143582 160365 150915 130029 124106 103503 94361 86079 100901 138832 149768 150068 224567
12892 224567 254393 283447 300003 299151 323562 348515 369715 313034 312002 304099 268659 243969
12880 243969 173210 152147 183807 184099 163510 153313 151935 159872 152866 167637 153628 191604
12868A91604k3352M729k7357m956m7661m3460K5309M4438l755j2559K3596K9983
12856A56559K1530K1857k8342P099l2977l4271J2585L4976R187n832j9902m1388
12844A01081K6602K095r293J6115p088k2109l6290J3024J7217J4461j675K5946
12832A40086K2257K385N947L3805M9183k5653k6216k5447j7705K8942O478M5255
12820B39317Q5246J0669l6572j6961o1749o4627o0264N544L899l6022q720j2373
12808D7387J125j8589m42L3846q809r610j3439l5414J4995K3491K9329L2287N4631
12795A50788K7907N1235k204q817k9275p629l4531l8711R606J6570N1224J1154
12783A97317l4079k2546P807Q651k258l3361m2689L7147J5955k7937j7087N5762
$$ plain form
12868 191604 168252 172981 145624 140668 93007 49547 74856 119294 115539 102980 126576 156559
12856 156559 178089 199946 171604 178703 145726 111455 124040 159016 168203 162371 142469 101081
12844 101081 127683 129778 120485 136600 129512 107403 71113 84137 101354 115815 114140 140086
12832 140086 162343 164728 170675 204480 253663 228010 201794 176347 158642 187584 194062 239317
12820 239317 324563 335232 298660 281699 219950 155323 95059 100603 104502 68480 59760 47387
12808 47387 48512 29923 29481 63327 54518 44908 31469 -3945 11050 34541 63870 96157 150788
12795 150788 178695 229930 227726 218909 189634 182005 147474 108763 118369 134939 186163 197317
12783 197317 163238 140692 148499 157150 154892 121531 78842 115989 131944 104007 86920 142682
12771A42682N8401M0460k5411k5170J3835q982l9249n7603m9537l1529o6262o6988
12759a15353J0417M0080M9867Q8848J02293L0598n249K6227L1365L1503J2360
12748C02956L0326j4386n6142l5871L0236J4357L5156K6944k5813J4321K264k0846
12736C03502j0422N5579M2879j1044k2531m5531l8902p57J5204l0414M3532M8284
12724C49379K4177L8755M5934o355P619R544n050k1193J0597k855j0552N6387
12712D96387O6848J5632l71J9831J0J1675k1499L1230L9982J8385J006r720l75
12699F69021K7622L5746M6981Q955K4028K6272m25K9431M3273O5518J86r945N5565
12686A022228M1400P076J358Q6268N0609L9580Q9796J30555Q4746Q4034R7964
$$ plain form
12771 142682 201083 241543 216132 190962 204797 195815 156566 98963 49426 17897 -48365 -115353
12759 -115353 -104936 -64856 -14989 73859 176152 206750 201501 227728 259093 290596 302956
12748 302956 333282 318896 262754 226883 257119 271476 306632 333576 307763 322084 324348 303502
12736 303502 293080 348659 391538 380494 357963 312432 273530 272773 287977 257563 301095 349379
12724 349379 373556 412311 458245 451890 459509 469053 464003 442810 453407 450552 440000 496387
12712 496387 563235 578867 578496 598327 598337 610012 588513 619743 659725 678110 679116 669396 669021
12699 669021 696643 732389 779370 788325 812353 838625 838200 867631 910904 976422 976608 966663 1022228
12686 1022228 1063628 1070704 1072062 1158330 1208939 1248519 1338315 1468870 1553616 1637650 1735614
12675A735614P0143Q6645J16503J11367J36147J26767J39364J56343J76073J18043
12665B973009J50035K52976K67912K76798K96924K90402M27589N53588O43516
12656F132749Q92640J179348J530159K079708K433488J970998J145162P13713
12648A8077965M69143O44706J474931K246780K948505L844018N222664P338335
12640D2267047J0508896J5362994K2926136L5013460N3413187P6115859Q8176446
12633C43784025O2316533R049247l2156165o5891082q0309125o4135428m3707627
12626A28950378k9151978j9856358j4026204j0200912p596920n732498m608516
12619C7776992l987092l562651l235659k951921k613236k196975j779161j545772
$$ plain form
12675 1735614 1805757 1892402 2008905 2120272 2256419 2383186 2522550 2678893 2854966 2973009
12665 2973009 3123044 3376020 3643932 3920730 4217654 4508056 4935645 5489233 6132749
12656 6132749 7025389 8204737 9734896 11814604 14248092 16219090 17364252 18077965
12648 18077965 18547108 19191814 20666745 22913525 25862030 29706048 34928712 42267047
12640 42267047 52775943 68138937 91065073 126078533 179491720 255607579 343784025
12633 343784025 406100558 415149805 382993640 317102558 236793433 172658005 128950378
12626 128950378 99798400 79942042 65915838 55714926 48118006 42385508 37776992
12619 37776992 33789900 30227249 26991590 24039669 21426433 19229458 17450297 15904525
12611A5904525j268784j080996r23209q49044p74068p11861o57934n66607n88913
12602H483109n10315m33283m40156m20956l32991l00695k95350k30233k46037
12593E273093k19338k04493k24660k31910j69112j10817j01268r6835j32947r5331
12583C686382j27043j45663j22221p8415j25521j37245o4718n2718j29728q5905
12573B617205l7125k5841m4044j05311r6558r4356n2242j8386o3047o8488r6280
12562A915527o7007j2736o723q988n9026p1737l2415N037k5887n1727j629K0601
12550A603290j9141l7225m1948l5107k4429M283J1241n4074k4798k4605k7553
12539A329934l120N6k8825k0828r743l3054p050k1458j9922n2465k902J2385p985
$$ plain form
12611 15904525 14635741 13554745 12631536 11782492 11008424 10296563 9638629 9072022 8483109
12602 8483109 7972794 7539511 7099355 6678399 6345408 6044713 5749363 5519130 5273093
12593 5273093 5053755 4849262 4624602 4392692 4223580 4112763 4011495 3914660 3781713 3686382
12583 3686382 3559339 3413676 3291455 3213040 3087519 2950274 2885556 2832838 2703110 2617205
12573 2617205 2580080 2554239 2510195 2404884 2308326 2213970 2161728 2143342 2080295 2011807 1915527
12562 1915527 1848520 1835784 1829061 1820073 1761047 1689310 1656895 1661932 1636045 1584318 1582689 1603290
12550 1603290 1584149 1546924 1504976 1469869 1445440 1449723 1460964 1406890 1382092 1357487 1329934
12539 1329934 1326814 1326870 1298045 1277217 1267474 1234420 1227370 1205912 1185990 1133525 1130623 1143008 1135023
12526A135023J8879j3289l6686k766O126k0881j1268j9035N964L3237K5754l1215
12514A089843l7681k2516J9782L1986P0186O0413N7301J28054R7011N6512P604
12503A558495q9936j33577o9841m8218n3928k0654R018k158r120k4606L3646M2148
12491A191269l7576K9287Q1192K0217j620p2500r5274j7006q439O766J0472J8727
12479A125515q015j2579K4060J18470N1268J05863K30863L41194L39281J47472
12469B463392o7613j44608k44531k72381k14742j43589p1998k6614L121j4915
12459A265522k1803l468K656j3644k2464m3643m6318N263l2304m6762r075l2177
12447A001783q9657l0931J3405M8465M5521J9064L8377j894k7091n4690k4165
$$ plain form
12526 1135023 1153902 1140613 1103927 1101161 1107287 1086406 1075138 1056103 1062067 1095304 1121058 1089843
12514 1089843 1052162 1029646 1049428 1081414 1151600 1212013 1269314 1397368 1494379 1550891 1558495
12503 1558495 1468559 1334982 1265141 1216923 1162995 1142341 1151359 1149201 1140081 1115475 1149121 1191269
12491 1191269 1153693 1182980 1264172 1284389 1282769 1210269 1114995 1097989 1089550 1096316 1106788 1125515
12479 1125515 1117500 1104921 1128981 1247451 1298719 1404582 1635445 1976639 2315920 2463392
12469 2463392 2395779 2251171 2006640 1734259 1519517 1375928 1303930 1277316 1280437 1265522
12459 1265522 1243719 1240251 1242907 1229263 1206799 1163156 1116838 1122101 1089797 1043035 1033960 1001783
12447 1001783 912126 881195 894600 943065 988586 1007650 1046027 1044133 1017042 962352 938187
12436I38187P798r39M4841R682J809L6067M008J8387m388k350P369j0567q95J8575
12422A067584k1119J0869M8576P154m8799Q327M9320L085m014J626j2363k2679
12410A087567M400M2603M4828n003J8973M620l709M496j4052j0644K067L1246
12398A207392o452N895K3262k1511J1453n260M4835o975R429L99M9061K88J9341
12385A331157K0711K2034l3347K9851J0342k9240j4778J9223K3573j339K6373
12374A404560L5306N1413p548m6232J0620j2839l514O4263J6457q418P772K4153
12362A535993M322J0027J5159j5204M387M1610M8105L115l3826J5718M5177O2403
12350A736986j7726j1118l530M588J430Q359J8061N8090M4809K2412K7230O6237
$$ plain form
12436 938187 945985 945046 989887 999569 1001378 1037445 1041453 1059840 1055452 1053102 1060471 1049904 1049009 1067584
12422 1067584 1046465 1057334 1105910 1113064 1064265 1072592 1121912 1124997 1120983 1122609 1110246 1087567
12410 1087567 1091967 1134570 1179398 1174395 1193368 1197988 1194279 1198775 1184723 1174079 1176146 1207392
12398 1207392 1200940 1206835 1230097 1208586 1220039 1214779 1259614 1252639 1262068 1262467 1311528 1311816 1331157
12385 1331157 1351868 1373902 1340555 1370406 1380748 1351508 1336730 1355953 1379526 1378187 1404560
12374 1404560 1439866 1491279 1483731 1437499 1448119 1435280 1431766 1496029 1512486 1504068 1511840 1535993
12362 1535993 1540315 1550342 1565501 1550297 1554684 1596294 1644399 1647514 1613688 1629406 1674583 1736986
12350 1736986 1719260 1708142 1704612 1709200 1710630 1718989 1737050 1795140 1839949 1862361 1889591 1955828
12338A955828K0122K1836K1706o970M023L818N8940O4609N3567L1430N5987P977
12326B292873p271j491l2389k1715J050N1226M6595L7969M959L7555L8098J2247
12314B459706l3565P431K1966O6188P1962N9246Q89N7095K8343M6799O3276P83
12302B850119J6855J3034L4171j9651L680P0371N7363K3376R426K0863K7737N2116
12290C159460L0715M3641K1002M6049L4447J0049L282O3410N8286L9177M8565
12279C558083P7880L2105l4331N1193J45182N4036L6089M7855M5953O7200N3942
12268D135187O6738K8101J4618L1386N1213O4518L3193K6994N9256M0189M5700
12257D597093L8500O0353N7719M5522M4083O1813Q0015M4534N8692N9982J0423
$$ plain form
12338 1955828 1975950 1997786 2019492 2012522 2016545 2020363 2079303 2143912 2197479 2228909 2284896 2292873
12326 2292873 2285602 2284111 2251722 2230007 2231057 2282283 2328878 2366847 2371806 2409361 2447459 2459706
12314 2459706 2426141 2433572 2455538 2521726 2593688 2652934 2653823 2710918 2739261 2786060 2849336 2850119
12302 2850119 2866974 2880008 2914179 2894528 2898208 2968579 3025942 3049318 3058744 3079607 3107344 3159460
12290 3159460 3190175 3233816 3254818 3300867 3335314 3345363 3348645 3412055 3470341 3509518 3558083
12279 3558083 3635963 3668068 3633737 3684930 3830112 3884148 3920237 3968092 4014045 4081245 4135187
12268 4135187 4201925 4230026 4244644 4276030 4327243 4391761 4424954 4451948 4511204 4551393 4597093
12257 4597093 4635593 4695946 4753665 4799187 4843270 4905083 4985098 5029632 5088324 5148306 5158729
12246E158729P5085L6064J0709K2938M5805Q4737J8403J7628N2554M3111R8247
12235E664010Q9987L6276M6851N4382L3943J3124K0946N6474N1542M5637R3587
12224F206759P6096J4931M772M2185M3718J04206P9529j1651j1184Q519M6213
12213F604093J04967Q0838K7617R009k2516L7246O4141O1324J4514K3068N3443
12202G057744M9324N3683Q46L8404K4548j8828M264R579J9586Q3772L2324j2224
12190G343022M2114K8338N6242L2033O3859N2967K0021N0925J3414P1444L9399
12179G813778L5077R033m016N164K3314J931K877P0354L4041n659K2168L3963
12167H042025N6605R4438J80418J94336K99164L95073M25553K73599L4172j27003
$$ plain form
12246 5158729 5233814 5269878 5280587 5303525 5349330 5434067 5452470 5470098 5522652 5565763 5664010
12235 5664010 5753997 5790273 5837124 5891506 5925449 5938573 5959519 6015993 6067535 6113172 6206759
12224 6206759 6282855 6297786 6302558 6344743 6388461 6492667 6572196 6560545 6549361 6557880 6604093
12213 6604093 6709060 6789898 6817515 6826524 6804008 6841254 6905395 6966719 6981233 7004301 7057744
12202 7057744 7107068 7160751 7161597 7200001 7224549 7205721 7209985 7219564 7239150 7322922 7355246 7343022
12190 7343022 7385136 7413474 7469716 7501749 7565608 7618575 7638596 7689521 7702935 7774379 7813778
12179 7813778 7848855 7857888 7853872 7859036 7882350 7884281 7887158 7957512 7991553 7985894 8008062 8042025
12167 8042025 8098630 8193068 8373486 8567822 8866986 9262059 9687612 9961211 9995383 9868380
12157I868380k73682l39332k70345k35254j89498r4960q8829n2628o5016m8480
12147H210356m7330n8416p6521m9152k6173p45n4787n9520J2960n0477q0277q2566
12135G637352n4135l5845k2118q3470n6980m5469m8551p2390r8278q6595o954
12124G026567l4731n621q7943r6570p7606o6096o4499n7792q8366r6512n5474
12113F295357p4691j03336n0777o2926j38024j10204p0605m9856m8666m8933o8579
12102E468760n6059p5088q8964q6684p7268n1456m1717j4786j14426j11061m6644
12091D704607m336q6370p1784j00651p8700j3305n5736p4164k6211l1048p0486
12080D091816j01308p4908o0227m5999k7312n5136n5006l9723p1995q1747o9851
$$ plain form
12157 9868380 9594698 9255366 8985021 8749767 8560269 8465309 8376480 8323852 8258836 8210356
12147 8210356 8163026 8104610 8028089 7978937 7952764 7952019 7897232 7837712 7850672 7800195 7719918 7637352
12135 7637352 7583217 7547372 7525254 7441784 7384804 7339335 7290784 7218394 7120116 7033521 7026567
12124 7026567 6991836 6986215 6898272 6801702 6724096 6658000 6593501 6535709 6447343 6350831 6295357
12113 6295357 6220666 6117330 6066553 6003627 5865603 5755399 5684794 5634938 5586272 5537339 5468760
12102 5468760 5412701 5337613 5248649 5161965 5084697 5033241 4991524 4976738 4862312 4751251 4704607
12091 4704607 4700271 4613901 4542117 4441466 4362766 4349461 4293725 4219561 4193350 4162302 4091816
12080 4091816 3990508 3915600 3855373 3809374 3782062 3726926 3671920 3632197 3560202 3478455 3408604
12069C408604n4167j1652j9564n5006n5104j6545l9015p3288m8125o2657m3451
12058B930030k0453Q512l6203p4186p7050J085l8534l4280k0710l8176p059l9474
12046B553502n8262o5114k5578K287j0284m1003o1321k8610J25J170l6189m8274
12034B182449k833p172m6928p5756p3227k3407j3329m2738k3635J0182N032J5384
12022A904022m887r300l0077k0442o19k2083k9618o479n1766k5876l3944O205
12010A675136j8735n1954k5255Q199q069j7878j5257j6165k4238l5986l2293m532
11998A432973j3994l5751K046J8404K6381N562L450k1993n7036j8232J9547j6664
11986A344693l3759m2522k4957K5053N230J6845K5046k2896m4898j1005l5759
$$ plain form
12069 3408604 3354437 3342785 3323221 3268215 3213111 3196566 3157551 3084263 3036138 2973481 2930030
12058 2930030 2909577 2918089 2881886 2807700 2730650 2731735 2693201 2658921 2638211 2600035 2592976 2553502
12046 2553502 2495240 2430126 2404548 2406835 2396551 2355548 2294227 2265617 2265742 2266912 2230723 2182449
12034 2182449 2179616 2172444 2125516 2049760 1976533 1953126 1939797 1897059 1873424 1883606 1888638 1904022
12022 1904022 1899135 1889835 1859758 1839316 1838697 1816614 1786996 1780517 1728751 1702875 1668931 1675136
12010 1675136 1656401 1604447 1579192 1587391 1579322 1561444 1546187 1530022 1505784 1469798 1437505 1432973
11998 1432973 1418979 1383228 1385274 1403678 1430059 1435621 1439071 1417078 1360042 1341810 1361357 1344693
11986 1344693 1310934 1268412 1243455 1268508 1273738 1290583 1315629 1292733 1247835 1236830 1201071
11975A201071l2170q486m205k2l9639k2196j1488J3143k5256k6305m497m974M1048
11962A076024p961n2953o17N831P815R581o9026m4875J3325K4340q465k4727j7931
11949I10361j7184m4487J7968j9886M389j3278N1268K4913J0560k5397l5961r764
11937H53502n654l6565P810l6260j9962O026L2804O1863R483j8233k2276m5605
11925G86933n5446j9887K913J8160P368o989O86j1157K0173K5765l4834p099M3970
11912G70556k4235j1109j8419m0545j8154j1310J0622Q380L288o142L200J5751
11900F81883k1072O683J1014j7754l9053n291n280J2272J1676j262p95J0366K2816
11887F66203n418n5943j8015K1203J1243j1139k9318o519J5211l9516J55k0041
$$ plain form
11975 1201071 1168901 1160415 1156210 1156188 1116549 1094353 1082865 1096008 1070752 1044447 1039950 1034976 1076024
11962 1076024 1068063 1015110 1014493 1020324 1028139 1037720 968694 923819 937144 961484 953019 928292 910361
11949 910361 893177 848690 866658 846772 851161 837883 889151 914064 924624 899227 863266 853502
11937 853502 847848 811283 819093 782833 762871 768897 801701 863564 873047 854814 832538 786933
11925 786933 731487 711600 714513 732673 740041 733052 733738 722581 742754 768519 733685 726586 770556
11912 770556 746321 735212 716793 676248 658094 646784 657406 665786 669074 662932 666132 681883
11900 681883 660811 667494 678508 660754 621701 616410 611130 623402 635078 633816 633021 643387 666203
11887 666203 660785 604842 586827 608030 619273 608134 578816 572297 587508 547992 548147 528106
11875E28106n917p703k7995k913k0833m836L4544J0703j6473j4357J0049j8034
11863D64341j4486q958m6307k9736L0200N1074L1679N9404J3996n7882j6276k8840
11851D48209j2893J3736O2040l202q386K7337k8306k6580j5838j5352K8276K5508
11839D94549j733R683j8355k3621P916K0309J2048l6048k9062k0174k3319M186
11827C96379R649k849m463j0293k3916L8918L8917k608m5001j4654M496o132m320
11814C74123n533J3546K063K06o535K6918k2503k0179k8113J9308L344M970k4163
11801C37452o894Q345K0848r831q176M52J5332K5154J5712q518n1950j820K4145
11788C60251j0733J7667N0542j0339j5462j8645P64k1548p857R433K7818j07L359
$$ plain form
11875 528106 522189 514486 486491 483578 462745 457909 492453 503156 486683 472326 482375 464341
11863 464341 449855 440897 394590 364854 395054 446128 477807 537211 551207 493325 477049 448209
11851 448209 435316 449052 511092 507890 499504 526841 498535 471955 456117 440765 469041 494549
11839 494549 492816 502499 484144 460523 468439 488748 500796 464748 435686 415512 392193 396379
11827 396379 406028 403179 398716 388423 364507 403425 442342 439734 394733 380079 384575 378443 374123
11814 374123 368590 382136 384199 384405 377870 404788 382285 362106 333993 353301 356645 361615 337452
11801 337452 330558 338903 359751 349920 341744 342196 357528 382682 398394 389876 337926 336106 360251
11788 360251 349518 367185 417727 407388 391926 373281 374045 352497 344640 354073 381891 381784 385143
11775C85143l1695p0503k6902O747J1100M3000R06K982P805P591J109k1475J4296
11762C30104r458K1446K4383j2737k0783m9712L509k1352j4311L3359L6038Q861
11750C29347k362o659l0099l983M46K5364P624l7038k7062J861K6589J7186k3904
11737B77310J314r99q090M301R342J6413j1794j3763j7788J5369j9897k779K7790
11724B76729l1598k5137K2518K5110m88k9088J8473p267j4180j6992K1393J3267
11712B52740k3211K7745J9818l3027L0519N0681m6521j6836L8964j609l8557n8804
11700B01902J8411J0139k1699j3221K4706K8775m913l272k7112L736K1675J8831
11688B57958J3k3477j1055K984J0959k7297K7207M527o849K659O739o4754k2092
$$ plain form
11775 385143 353448 282945 256043 262790 273890 316890 317796 320778 328583 336174 337283 315808 330104
11762 330104 320646 342092 366475 353738 332955 283243 286752 265400 251089 284448 320486 329347
11750 329347 326985 320326 290227 286244 286690 312054 319678 282640 255578 257439 284028 301214 277310
11737 277310 278624 277625 269535 273836 283178 299591 287797 274034 256246 271615 251718 248939 276729
11724 276729 245131 219994 242512 267622 267134 238046 256519 249252 235072 218080 239473 252740
11712 252740 229529 257274 277092 244065 274584 325265 278744 261908 300872 299263 260706 201902
11700 201902 220313 230452 208753 195532 220238 249013 244100 240828 213716 217452 239127 257958
11688 257958 257971 234494 223439 226423 237382 210085 237292 241819 234970 237629 244368 179614 157522
11675A57522J8701K1830K692n1649N914L0474K3723J0481l8301n7919K2964K1839
11663A68271K1541k7780J2815P8512k7897o7053J0904K6408l550M044O920p110
11651A96025O1388L9340k803k241m1062m0783l4221J3515K5101j232m505k3224
11639A85298J1123J1863R427j2637J3023J0244l7999l5643l1021l425N575P4944
11627B00772J6738k1996L3322M5815k7065q2713m6821P061L0701K1226j8794k0697
11615A37549j8208M8947P0415K9149P34j3093l7671m9551m769o371l1898k7646
11603I7587Q395J3355K7672L1676q118j6824Q974k7208m0758o880J5656K1482
11591A25009R803L4316k0738j691K5252r56q031j3148m1314p728J6542N8211Q708
$$ plain form
11675 157522 176223 198053 200745 149096 155010 185484 209207 219688 181387 123468 146432 168271
11663 168271 189812 162032 174847 253359 225462 158409 169313 195721 192171 196215 203135 196025
11651 196025 257413 296753 293950 291709 250647 209864 175643 189158 214259 213027 208522 185298
11639 185298 196421 208284 217711 205074 218097 228341 190342 154699 123678 120253 125828 200772
11627 200772 217510 195514 228836 274651 247586 164873 118052 125113 155814 177040 158246 137549
11615 137549 119341 168288 238703 267852 268586 255493 217822 168271 163502 157131 125233 97587
11603 97587 105982 119337 147009 178685 170567 153743 162717 135509 94751 87871 103527 125009
11591 125009 134812 169128 148390 146699 171951 170995 162964 149816 108502 100774 117316 175527 184235
11578A84235m2506j7754K1037M2149Q831j2079n3512J653N4606r902J309K645
11566A80712J1044K9768k291l6482m6743k0288l40p02J5321j2229j0482j7479
11554H9809J3779k2416Q306p133j4974J8949L1511K8899m6216l6393J8371L0582
11542A13074L3000j1375j4967K2902K2724L2605j5589m3758p002K7048j9944k6744
11530A11974L3363J5173j6615n2784k6088L5573j7331l6301K5460K2360J4603
11519A09387K437J8405j1529j1808j0215L475K4531j2828L3845j157J1027M161
11507A59731N0482j7809l4990k5500j576l5499P537K0725j9363K4517o164k9765
11495I2326j690J1690j4452n313L943k9787L4435Q60k6058k3029J012M5373R144
$$ plain form
11578 184235 141729 123975 145012 187161 195992 183913 130401 132054 186660 176758 178067 180712
11566 180712 191756 221524 219233 182751 136008 115720 115380 114678 129999 117770 107288 89809
11554 89809 103588 81172 89478 82345 67371 86320 117831 146730 100514 64121 82492 113074
11542 113074 146074 134699 119732 142634 165358 197963 182374 138616 131614 158662 138718 111974
11530 111974 145337 160510 143895 91111 65023 100596 83265 46964 72424 94784 109387
11519 109387 111824 130229 118700 106892 96677 100152 124683 111855 145700 144543 155570 159731
11507 159731 210213 192404 157414 131914 130338 94839 102376 123101 103738 128255 122091 92326
11495 92326 90636 102326 87874 82561 86504 56717 91152 92012 65954 42925 43937 89310 98454
11482I8454k4483R969L5985p317j2485L2822k6127l8402l035J4036o967N344K812
11469H0606k1427j6662M7334K4888L4397m157m13j1654l0151N468j5020j0413
11457H2796J3521m4610r81K0685l1969k294K4812M7921L2657J0276j089j0029
11445A41696J2958L742j3433j7200P586J7891M3846j5718k8927l1288k3012J9551
11433A17692L9675j8884M412J3681l993l1323k8465j7303K4626J9945K000L111
11421A25174j7091m394K2951l020k6994R08K4111l6639O448M4568j8383m4003
11409G3636k6753M2351P1358o86j8747k255j9700n3331n757K8281N6082L864K977
11396A51320j5838o185p834R654j0190n5282j2322K1860M136J1178J9803k340
$$ plain form
11482 98454 73971 83940 119925 112608 100123 132945 106818 68416 65381 79417 72450 77794 80606
11469 80606 59179 42517 89851 114739 149136 144979 144566 132912 102761 108229 93209 82796
11457 82796 96317 51707 50726 71411 39442 37148 61960 109881 142538 152814 151725 141696
11445 141696 154654 158396 144963 127763 135349 153240 197086 181368 152441 121153 98141 117692
11433 117692 157367 138483 142895 156576 152583 121260 92795 75492 100118 120063 122063 125174
11421 125174 108083 103689 126640 123620 96626 97534 121645 85006 91454 136022 117639 73636
11409 73636 46883 89234 160592 159906 141159 138904 119204 65873 60116 88397 144479 148343 151320
11396 151320 135482 129297 121463 131117 120927 65645 53323 75183 79319 90497 110300 107960
11384A07960l5466J5554j0478J445Q371M308p7561m5364J7852K2833P264L2339
11372D9057j3302j8136J9210K2595L1330l7438k7069M0226P0435k4349K720J8956
11360A34235k7419j4494m5732m4185O308J7491L3723j7634O509L1547k9910L2367
11348H2806m616J451l9356J0377J73J7054k2349n832R826L6929k1553j477M3658
11335A07091P042j711N60j4009p824p08j8009K8446L2254j4287j9980k8962J1150
11322H1053N385J3515Q840k924p940k4594K4250J6069r385j6772j1751j0771j3958
11309E1017o494k2538L0183J3627k0753l5135M763K5493L3374k7437k5778J4117
11297C4439Q125O476J6416j9716m817P225K6791J6700m544k6123j1027M5993k3509
$$ plain form
11384 107960 72494 88048 77570 79015 87386 91694 14133 -31231 -13379 9454 16718 49057
11372 49057 35755 17619 36829 59424 90754 53316 26247 66473 136908 112559 115279 134235
11360 134235 106816 92322 46590 2405 8713 26204 59927 42293 48802 80349 50439 82806
11348 82806 78190 79641 40285 50662 50835 67889 45540 39708 49534 86463 64910 63433 107091
11335 107091 114133 112422 112982 98973 91149 90441 72432 100878 133132 118845 98865 69903 81053
11322 81053 86438 99953 108793 105869 97929 73335 97585 113654 104269 87497 75746 64975 51017
11309 51017 44523 21985 52168 65795 45042 9907 14670 40163 73537 46100 20322 34439
11297 34439 42564 49040 65456 45740 40923 48148 74939 91639 87095 60972 49945 95938 72429
11284G2429k058J4030k5806n587P3811K0165m1546m149j8798p127n56K9807R706
11271A14321k6483q098Q637j2007J541k5419l9148o791N302P88Q404K1958J3186
11258E6191J8789k7308j4726q698l268l2416j2933J77L4068M2441K7358K4405
11246A04080k5148l2936j6774o246j0690Q677P8151j736q968J9149M823k5j8199
11233I4158j4730j6433M290J4407l1312L3937j739j7658k2718j6005n7422J5859
11221a5366M3480N2156k845m722L1942O15m36K3259l763k0556q958m409k1127
11208F9270l986K5778K4590m2958j7312K3544n00j4975k3131J2398J8127k8129
11196D2716n7613J3639K7016J2251j8101Q422J0553j1499L3069J7778J0157j6241
$$ plain form
11284 72429 70371 84401 58595 53008 126819 146984 105438 101289 82491 75364 74808 104615 114321
11271 114321 87838 79740 88377 76370 77911 52492 13344 6553 11855 12643 21047 43005 56191
11258 56191 74980 47672 32946 24248 20980 -11436 -24369 -24192 9876 52317 79675 104080
11246 104080 78932 45996 29222 22976 12286 20963 99114 97378 88410 107559 112382 112357 94158
11233 94158 79428 62995 67285 81692 50380 84317 82578 64920 42202 26197 -31225 -15366
11221 -15366 28114 80270 77425 72703 104645 105260 104824 128083 124320 103764 94806 90397 69270
11208 69270 65284 91062 115652 72694 55382 78926 78426 63451 40320 52718 70845 42716
11196 42716 -14897 -1258 25758 38009 19908 28330 38883 27384 60453 78231 88388 72147
11184G2147n2153k3220j0322m7937N010O0336N9467J3516P292o222m305N2612
11172A26221j7853q980j412l9410j4266l8713l692J1544j2843R148N1979N4377
11160A16100j5551k1429K400j5060m6912j1249j3371j3099N433J459J0706j5770
11148a6343P567J0468N6441J6840l0899l1330J3639o819q840N987L4991o4p218
11135D4420j0736j828k2943J1420N0897j3341J2635m945K8783J8022k0954m6773
11123D4657l3482L449N990L9724K5564j2173l6152m6560J1073J2416M7897J0222
11111G2625o0100L0019J4253j3346o343q79J097k2826j0693O170K0240K4125L2153
11098H6495j013j5694j2764O168k1647j4845J8680K8121j553o0838q879j346L7454
$$ plain form
11184 72147 19994 -3226 -13548 -61485 -56475 3861 63328 76844 84136 77914 73609 126221
11172 126221 108368 99388 97976 58566 44300 5587 1895 13439 596 9744 61723 116100
11160 116100 100549 79120 81520 66460 19548 8299 -5072 -18171 -12738 -11279 -573 -16343
11148 -16343 -8776 1692 58133 74973 44074 12744 26383 19564 10724 16711 51702 51638 44420
11135 44420 33684 31856 8913 20333 71230 57889 70524 65579 94362 112384 91430 44657
11123 44657 11175 14624 20614 60338 85902 73729 37577 -8983 2090 14506 62403 72625
11111 72625 12525 42544 56797 43451 37108 36229 37326 14500 3807 9977 30217 54342 86495
11098 86495 85482 69788 57024 63192 41545 26700 45380 73501 71948 11110 2231 885 38339
11085C8339L8776J2813l4621q28l0664R293K8125j0950L0965K065k0320k7660
11073C5333K1952l998J3428j2341J9745J0457j4189k1263j8517K6463N8604Q313
11061A23987o7768l1806L5939K1290K2258k1860L827J7186R193O710J9847K0820
11049A59623K0467K3664N920J2743o916k3760N873l5606R892M0655O177m2009
11037A76723k364O1331L7030K0567J9359j1962j7198k0505K4855k8342J0230Q908
11025B78632J6600J5188L5803m941q539J0852J4598j1980l1309K607j9665n6360
11013B41486L4284K4294L7688J8527K2133k2568o7266o9498k4909m996j3333R400
11001A85242j7756O91K6982j519m5779K7096J7757n6911n0277q515l4970P851
$$ plain form
11085 38339 77115 89928 55307 54479 23815 33108 61233 50283 81248 83313 62993 35333
11073 35333 57285 53287 66715 54374 74119 84576 70387 49124 30607 57070 115674 123987
11061 123987 56219 24413 60352 81642 103900 82040 85867 103053 112246 118956 138803 159623
11049 159623 180090 203754 209674 222417 215501 191741 197614 162008 171900 212555 218732 176723
11037 176723 174359 235690 272720 293287 312646 300684 283486 262981 287836 259494 269724 278632
11025 278632 295232 310420 346223 341282 332743 343595 358193 346213 314904 317511 297846 241486
11013 241486 275770 300064 337752 356279 378412 355844 288578 219080 194171 189175 175842 185242
11001 185242 167486 168177 195159 193640 147861 174957 192714 135803 85526 77011 42041 49892
10989D9892K3375j0161j4275J2222K9415j3046m5907j2092J4728j1709n226j4067
10977C149Q367j6305J1513N1049J4419o126J4139L372j1195R096k0251M628l152
10964F2703L326M305R706Q442k9938k2806k9138k787K1999p541l5320j7339j2092
10951d6480K7261r151k004K0932K2344M1502M28o698L787j2313j1765j9872J4107
10938B2078j2628K2035L3844P024J9078L7783l0970o4778k6715K2454J2659m799
10926C7065r666L041j8896Q093P182q705j1569j6055m513J0859j8579J5310K9991
10913B3558J8437K6883m4436l8172O358K5020J5865m35l5586k4841J0464J0029
10901f856m1744k2481J4714L377p4L0449J8003K4215q464K845j2183L3029R70
$$ plain form
10989 49892 73267 63106 48831 61053 90468 77422 31515 19423 34151 22442 17216 3149
10977 3149 11516 -4789 6724 57773 72192 66066 80205 83577 72382 81478 61227 65855 62703
10964 62703 66029 70334 80040 88482 58544 35738 6600 3813 25812 18271 -17049 -34388 -46480
10951 -46480 -19219 -28370 -30374 -9442 12902 54404 54832 48134 51921 39608 27843 7971 22078
10938 22078 9450 31485 65329 72353 91431 129214 98244 33466 6751 29205 41864 37065
10926 37065 27399 30440 11544 19637 26819 18114 6545 -9510 -14023 -3164 -21743 -6433 23558
10913 23558 41995 68878 24442 -13730 -7372 17648 33513 33078 -2508 -27349 -16885 -6856
10901 -6856 -48600 -71081 -56367 -52990 -53064 -22615 -4612 19603 11139 13984 1801 34830 35800
10888C5800N2892K0937o0978j5571l054O24J0564R927j4685q705j2764n3753j9581
10875e8347K9007L4171M2928k6550O660n928m7493J0189K8875k2363R847J010
10863B006j9132J36K0994l3154n6016l5356M2750P5942J3443M3662J6345K3573
10851I5193k3107J0114N581p097l5144l4097O69K3874J2238J877J9929L1943j6052
10838H5921n8233q935K8536n68k3167k8855J0925L5497J4703j453J460J7192j1746
10825F1277j3947j7252k7895m229M9246K8420k7747R161J2740k1094m5486K8198
10813C1392l91k2397J6927J5878O23p508k1947j8478k524O309L5578L191l946
10800C2707L3200j0441k6324q443J3527K4002N2007j1988j9009K4183j825j8545
$$ plain form
10888 35800 88692 109629 48651 33080 30026 30650 41214 51141 36456 27751 14987 -38766 -58347
10875 -58347 -29340 4831 47759 21209 27869 21941 -25552 -15363 13512 -8851 996 2006
10863 2006 -17126 -16990 4004 -29150 -85166 -120522 -77772 -1830 11613 55275 71620 95193
10851 95193 72086 82200 87781 80684 45540 11443 12112 35986 48224 50101 70030 101973 85921
10838 85921 27688 18753 47289 46721 23554 -5301 5624 41121 55824 54371 55831 73023 61277
10825 61277 47330 30078 2183 -2046 47200 75620 47873 57034 69774 48680 3194 31392
10813 31392 31001 8604 25531 41409 42032 34524 12577 -5901 -8425 -2116 33462 36653 32707
10800 32707 65907 55466 29142 20699 34226 58228 110235 98247 79238 103421 101596 83051
10788H3051Q255j7641k0996N798j6969k7384m296j7619K6432O330k3552k5354
10776b3945j5597Q11R541p699r674K1151N4829K4976m8218l6783l794K363J4697
10763a7342L3883Q766J2908l2718J4537K151q757k0075q236N621J8217r395l2929
10750c3369j8466n888L6789K6748q633m0262k5436K3533j828j9394l001K9218
10738c9989K2564K8087j2386l5114Q752J7500J5854K0477l122q956J5274K3997
10726E2938J0064m3697m4555l8319q158M0429K0496L163l2820J8065j637r149
10714c3180J2173j6457j7405N671J7737k3139J4497o891j5557K6110o402J9437
10702b3406P285k0789q646L7604M7530P514m9452k4027n221M423k8052j0275n532
$$ plain form
10788 83051 91306 73665 52669 58467 41498 14114 9818 -7801 18631 24961 1409 -23945
10776 -23945 -39542 -38731 -29190 -36889 -46563 -25412 29417 54393 6175 -30608 -34402 -32039 -17342
10763 -17342 16541 25307 38215 5497 20034 22185 13428 -6647 -14883 -9262 8955 -440 -33369
10750 -33369 -51835 -57723 -20934 5814 -2819 -43081 -68517 -44984 -46812 -66206 -69207 -39989
10738 -39989 -17425 10662 -1724 -36838 -28086 -10586 5268 25745 22623 13667 28941 52938
10726 52938 63002 19305 -25250 -63569 -71727 -31298 -10802 -7639 -40459 -22394 -24031 -33180
10714 -33180 -21007 -37464 -54869 -49198 -31461 -54600 -40103 -46994 -62551 -36441 -42843 -23406
10702 -23406 -16121 -36910 -45556 -7952 39578 47092 -2360 -26387 -31608 -27185 -55237 -65512 -71044
10689g1044J9407L0603R1363J6434o037l8124J3078R628K3587K3864k972j4838
10677I4949O053j0126l1506q13K5799J3701l1183m8307q214L0852M6236J5614
10665A03055l74o812L6443K7624J4240Q368j1076L8793k2086n486O4063R7613
10653C44365O5578R2530O2321N3309R959J5211o5642o1866r891k4813m259K3035
10641D99837L0360M5088P3623N4857N8836O8417J10895J19446J58189J33475J13800
10630A466823R0335J33807J55517J72446K28125L83974N16364O72589R07878J195653
10620E923511J640681K166053K738741L054139K901330K167442J101119m33o55594
10611B1036989o75798q8088R29826K186215L727900N243462O087831N575906L402850
$$ plain form
10689 -71044 -51637 -21034 70329 86763 80726 42602 55680 65308 88895 112759 109787 94949
10677 94949 101002 90876 59370 58557 84356 98057 66874 18567 10353 41205 87441 103055
10665 103055 102681 95869 132312 159936 174176 182544 171468 210261 188175 182689 246752 344365
10653 344365 409943 502473 564794 618103 628062 643273 577631 515765 505874 481061 476802 499837
10641 499837 530197 575285 648908 703765 762601 831018 941913 1061359 1219548 1353023 1466823
10630 1466823 1557158 1690965 1846482 2018928 2247053 2631027 3147391 3819980 4727858 5923511
10620 5923511 7564192 9730245 12468986 15523125 18424455 20591897 21693016 21692583 21036989
10611 21036989 20361191 20273103 21202929 23389144 27117044 32360506 38448337 44024243 47427093
10602D7427093N51366k013094l434325l286423j954055j2565K256242M640792
10594D4175031O756536P718306O311136K704607j616192n201801p039913o693011
10586D7114699m918229k686987n03845J585219L202526L756171K665508J25800
10578E0340862k752277m918771n874567n392870m020757k508147j215140j37059
10570B3521274N66526O98786J40740q55157j965961k820279l070304k805086k353112
10561A1057427j861440j385184j070224q40012o61615m85638m05325m01421l16662
10552C629906k97690k17776j95245k24235k01543j80850j53331j25557p5614o9463
10542A888602p0497j06950j09326q7125j31875p3749l7613j7567m1711p4628n2527
$$ plain form
10602 47427093 47978459 45965365 42531040 39244617 37290562 37277997 39534239 44175031
10594 44175031 50931567 58649873 64961009 67665616 66049424 60847623 53807710 47114699
10586 47114699 42196470 39509483 39005638 40590857 43793383 47549554 50215062 50340862
10578 50340862 47588585 42669814 36795247 31402377 27381620 24873473 23658333 23521274
10570 23521274 24087800 24786586 24927326 24072169 22106208 19285929 16215625 13410539 11057427
10561 11057427 9195987 7810803 6740579 5900567 5238952 4753314 4347989 3946568 3629906
10552 3629906 3332216 3114440 2919195 2694960 2493417 2312567 2159236 2033679 1958065 1888602
10542 1888602 1818105 1711155 1601829 1514704 1382829 1309080 1271467 1253900 1212189 1137561 1085034
10531A085034m6575l7303k5325j3568k4723o1691l6147m8525k2778Q077l911k2459
10519G50106n8427r838j1130k4201J7620K4525l8180q4432m1022m573M066R505
10507E34019M3075k3126k9511j5657Q120K171k6056M893K5873n0276l5333j7378
10495D20814M834l0208j1021k6951J8948q072n706m172q749L9937m266l1818l5473
10482C18097k9447J2257L3653j8853l8112J1240l090r155J5446R485O2231N059
10470C68811M169O283k466k1007l3765l1173L8084K1611K3923K776K273o599m7535
10457C25385m5095l0676k288K2793L2563k5997j3027q054J4796L972l527R724
10445B80569l0197k169O4468K795n1615j7077K1588J6964q204k5820j8811l6345
$$ plain form
10531 1085034 1038459 1001156 975831 962263 937540 875849 839702 791177 768399 776476 772565 750106
10519 750106 691679 681841 670711 646510 664130 688655 650475 566043 525021 520448 524514 534019
10507 534019 577094 553968 524457 508800 516920 519091 493035 497928 523801 473525 438192 420814
10495 420814 425648 395440 384419 357468 376416 368344 362638 358466 349717 389654 385388 353570 318097
10482 318097 288650 300907 334560 315707 277595 288835 285745 276590 292036 301521 363752 368811
10470 368811 372980 379263 376797 355790 322025 290852 328936 350547 374470 377246 379519 372920 325385
10457 325385 280290 249614 247326 270119 302682 276685 263658 255604 270400 274372 270845 280569
10445 280569 250372 248203 312671 315466 263851 246774 268362 285326 277122 251302 232491 196146
10433A96146j6479l423j7613k9063J4439L2001K8380j5457M0817L2068Q735l9946
10421B30605k869J3780l6946l6385j7700N0025K1867j7604R255m970k1152K469
10409A90375l4278k1401L8399M819J2746m0691k4725k097k1202J2669n753o310
10397A02551J444k7973K6801l882J6449r490k7796k3520j4111J6968J2116j2520
10385E7037k8214j80N4191R664L9820K6073j8502l1971M4732j5132n9671j1080
10373F6767J5L2096K2163l8759m303L1848r30k7013j2193j1585J8143L4011J7829
10360A28089j240q756j8065j1070l6624j1017L2556o989l4151O382J9002J0529
10348F8646j350K1385K5921j249J3651k425J8159J7599k6360o3719j7991p561
$$ plain form
10433 196146 179667 176244 158631 129568 144007 176008 204388 188931 229748 261816 270551 230605
10421 230605 227736 241516 204570 168185 150485 200510 222377 204773 214028 209058 187906 190375
10409 190375 156097 134696 173095 177914 190660 149969 125244 123147 101945 114614 108861 102551
10397 102551 103995 76022 102823 98941 115390 105900 78104 54584 40473 57441 69557 57037
10385 57037 28823 28643 82834 92498 132318 158391 139889 107918 152650 137518 77847 66767
10373 66767 66782 98878 121041 82282 77979 109827 108897 81884 69691 58106 76249 110260 128089
10360 128089 126849 118093 100028 88958 52334 41317 73873 66884 32733 39115 58117 68646
10348 68646 67296 88681 114602 113353 127004 124579 142738 160337 133977 70258 52267 44706
10336D4706j1078M5096K4132J2927M53n53K19j4432j0662m0673O936L2517m495
10323H5093l7251l059R978j4811M6512M703j8501K957N348j643j9172R13k2249
10310C8818K5125j3242r413K0349K052L5466k9617o8136J4503J6701o444O101
10298C2263p871J5473K6378K7781J138j3202l657k3010l6785j9229L1226J2403
10286D2908L5674j233n6145n5971L6916N3451N492K2550o721K1870J9054J9597
10274A37442o771k6102m245J4421l4335m1474m632m162J943K5184J4775l9737
10262C2307k229O025M3673K4148Q312j1213r299K876J4896l1032j4053K5033j0059
10249G9385k6392R13N251J9952j5830l3236j0917o712J4279O1613K1505J3328
$$ plain form
10336 44706 33628 78724 102856 115783 116236 115683 115902 101470 90808 50135 57071 89588 85093
10323 85093 47842 44783 54761 39950 86462 91165 72664 75621 80969 79326 60154 61067 38818
10310 38818 63943 50701 41288 61637 63689 99155 69538 1402 15905 32606 26162 32263
10298 32263 24392 39865 66243 94024 95162 81960 78303 55293 18508 -721 30505 42908
10286 42908 78582 77349 21204 -34767 2149 55600 61092 83642 76921 98791 117845 137442
10274 137442 130671 104569 100324 114745 80410 38936 34304 30142 32085 57269 72044 32307
10262 32307 30078 36103 79776 103924 112236 101023 91724 94600 109496 78464 64411 89444 79385
10249 79385 52993 53906 59157 79109 63279 30043 19126 12414 26693 88306 109811 123139
10237A23139l0642m5564j9199R188m6121j8672M6872J6558j380n815J1305M907
10225D4576k7940J5153K5149j5148o700N2193l052m2833K0943J3881j587K2728
10213I7363m0747k9575J4727j0920j3203K3251M0885m4265o306k901R915L3889
10201G2113K0520k1445j5884q116J0961J940P953N8812O473l4438k9079l9495
10189C0315k8540J6903L9081J8753j8782k2072J2103K2167M1810J9898j423j9358
10177A10855P997M1775L245m7073l7771M9893O8856J9518J1773J7785K6305J6906
10165B90064N362p082k2705k5884J5009p850K1890J8434L4249N3810N0755J1684
10153D37736r349l0389l8940p660q785K6468Q449j1423q045O918k1782k3916k1517
$$ plain form
10237 123139 92497 46933 27734 36922 -9199 -27871 19001 35559 34179 28364 39669 44576
10225 44576 16636 31789 56938 41790 35090 87283 84231 41398 62341 76222 74635 97363
10213 97363 56616 27041 41768 30848 17645 40896 81781 37516 31210 28309 38224 72113
10201 72113 92633 71188 55304 47188 58149 60089 68042 126854 133327 98889 69810 30315
10189 30315 1775 18678 57759 76512 57730 35658 47761 69928 111738 131636 130213 110855
10177 110855 118852 160627 163872 116799 79028 128921 197777 217295 229068 246853 273158 290064
10165 290064 295426 288344 265639 239755 254764 246914 268804 287238 321487 375297 426052 437736
10153 437736 428387 397998 359058 351398 342613 369081 377530 366107 358062 364980 343198 319282 297765
10140B97765m5673n4179n5539K2396M8481J8440l1425k8297N919k2184m3312n865
10128A06527J9648j2891l5527N5128N0984J280q53J7298o0835r1947j4590K5021
10116E9243M7587k2516j9264L6521L0857n2686p338n3661l7927L5723K4844J781
10104D3164J229M389J179o139M38j0529L7810J6592l3954n2866Q384N174J0036
10091B4907K444L0426L492m0643k3401M5296J3176j2652j4523l462j9792k9328
10079b4060J3305M7166K0416K1378J5715J4938K2807Q537n2015n8001m3211k8622
10067d1647J5568J3745m498J0894n450k6189j779J4285J8317J9192K6457K7613
10055F6508M7702n177m2787j4600M2165l3236m3670j6314k8128J0550k3642N773
$$ plain form
10140 297765 252092 197913 142374 164770 213251 231691 200266 171969 177888 155704 112392 106527
10128 106527 126175 113284 77757 132885 183869 185149 184296 201594 140759 48812 34222 59243
10116 59243 106830 84314 65050 101571 132428 79742 72404 18743 -19184 16539 41383 43164
10104 43164 44393 48782 49961 43822 44260 33731 71541 88133 54179 1313 9697 14871 24907
10091 24907 27351 57777 61269 20626 -2775 42521 55697 43045 28522 25060 5268 -24060
10079 -24060 -10755 36411 56827 78205 93920 108858 131665 140202 88187 30186 -13025 -41647
10067 -41647 -26079 -12334 -16832 -5938 -11388 -37577 -39356 -25071 -6754 12438 38895 66508
10055 66508 114210 109033 66246 51646 93811 60575 16905 591 -27537 -16987 -40629 -34856
10043c4856M3087K6884K0028N806Q431j1584m8267l5871L6216P3129K7248k1216
10031H9035n3823m835m146m1489j7787R864k3758n163N1002K7531j642o985r700
10018H104K0914Q913O94R566k8481m5029o735L6400J2933O642l4185q948k540
10005b1752k57k838M333L7798L40P757m227l3454o900j053L4625n533J2865J2312
9991C4016k4382q966Q350O033l95r805J1690K669j3987J3536L3971n683P140J332
9977E5519k5176k5201K845J1564r201J5871q891O124m0899K39K0873J2918M000
9964B0585l0521m742K2481o207k2276k0081r262p290L8828M1514J7460O814j413
9951D5890j3591J4590J3306O331j1107k0431Q188L2432k307K897m186l8715p2156
$$ plain form
10043 -34856 8231 35115 55143 60949 69380 57796 9529 -26342 9874 83003 110251 89035
10031 89035 35212 30377 26231 -15258 -33045 -23181 -46939 -52102 -1100 26431 24789 17804 8104
10018 8104 29018 37931 38625 48191 19710 -25319 -32054 4346 17279 23921 -10264 -19212 -21752
10005 -21752 -22009 -24847 -20514 17284 17624 25381 21154 -12300 -19200 -20253 14372 8839 21704 34016
9991 34016 9634 668 9018 15051 14656 4851 16541 19210 5223 18759 52730 47047 54187 55519
9977 55519 30343 5142 7987 19551 10350 26221 17330 23454 -17445 -17206 3667 16585 20585
9964 20585 -9936 -14678 7803 1596 -20680 -40761 -50023 -57313 -18485 23029 40489 47303 45890
9951 45890 32299 46889 60195 66526 55419 34988 43176 75608 73301 76198 72012 33297 -38859
9938c8859J9638K1631j488k2840j4568L9481L9852m707n3518n096j7946k2910
9926f1330M6467M4563K8862k3738j6748j0073N875P083P287k6560k1205M1537
9914B2020j3527K3909M2061N74m3080M6281L7088m7662l0823m4494k550j7481
9902b7684n2109L0897L3098J1264K6397J5472L8720J4318J75k4367k4282L504
9890D5403L7203R827m2398k6157l6143o462K6663M57l0615l291L4519N502K0201
9877C4709J3906j626k151j5217J5624k5490p650j0226k5462j7358L0312K9923
9865A9294L015j5018K2618j3814j4149k5718K9255L0338l882q287k4804R000K2516
9852C0364p0626j9234L904J2170K5894K8386J5752K8590K3862K2152k332l5939
$$ plain form
9938 -38859 -19221 2410 922 -21918 -36486 2995 42847 38140 -15378 -20474 -38420 -61330
9926 -61330 -14863 29700 58562 34824 18076 8003 13878 20961 28248 1688 -19517 22020
9914 22020 8493 32402 74463 75037 31957 78238 115326 67664 36841 -7653 -10203 -27684
9902 -27684 -79793 -48896 -15798 -4534 21863 37335 76055 90373 90548 66181 41899 45403
9890 45403 82606 92433 50035 23878 -12265 -18727 7936 8393 -22222 -25513 9006 14508 34709
9877 34709 48615 46989 44838 29621 45245 19755 12105 1879 -23583 -40941 -10629 19294
9865 19294 22309 7291 29909 16095 1946 -23772 5483 35821 31939 23652 -1152 7848 30364
9852 30364 -40262 -59496 -55592 -43422 -17528 10858 26610 55200 79062 101214 98882 62943
9840F2943l7414l2034r391J0348N0007j4127j6913q186L4229R782q387R387J3153
9827F3397K1669n746l8547l7626l6036J0037L7451o03O981M2889K551l7112J6167
9814D5472N326Q911M224K6903l9064j785j0298j6084k191j013Q894j7526R442
9801B1211l6053o20L8726m1356k011n129Q337K7260l1641k4071J2056K6807N6713
9788E0229k0244j4307K723R617p73j3385N026J0650K1429K5622K4106j5434j2075
9775G3184k1291j8417j6714j5279l476k4399M1139K3292M399K3495j6622r289
9763D0022K0077O60l6823l6221J2680P735J3218K2910Q437l0477m5738n1832N563
9750f9789J5429L1893L0258J8948l0342k2493L1318K3878r661m7414j6528K9626
$$ plain form
9840 62943 25529 -6505 -15896 -5548 44459 30332 13419 5233 39462 49244 40857 50244 63397
9827 63397 85066 79320 40773 3147 -32889 -22852 14599 13996 20977 63866 66417 29305 45472
9814 45472 50798 59709 63933 90836 51772 49987 39689 23605 21414 20401 29295 11769 21211
9801 21211 -14842 -15462 23264 -18092 -20103 -25232 -16895 10365 -21276 -45347 -33291 -6484 50229
9788 50229 29985 15678 18401 28018 27245 13860 18886 29536 50965 76587 100693 85259 73184
9775 73184 51893 33476 16762 1483 -1993 -26392 14747 38039 42438 65933 49311 40022
9763 40022 60099 60759 23936 -12285 395 8130 21348 44258 52695 22218 -23520 -75352 -69789
9750 -69789 -54360 -22467 7791 26739 -3603 -26096 5222 29100 19439 -27975 -44503 -14877
9738a4877L9910j1568l3938J9030k9083j0519l190K7991M1070l667n3481o606
9726c8928N2743L5585l972M4452K000k4087j31J5673O631k065k9769k9143j8114
9713A0875k086k4181l8051P384N1845l6292k2108J2460M8952K5928j774o070l6699
9700i817j3679m685L2238P154n887k9824M4136N395j1457L587k0651J1366L7799
9687D5675j2352o169J8022J212k3636J7665L5986l1567j6068P36J7250P130J7101
9674G0985K3795J0574k4428j9199q167j6528J6417M3887m535q481K2783J0717
9662A17820M2191N6224M8372Q7931J22784J35293K88971N23234Q45594J255187
9652C523601J221704L65872l25146q17403j189317r29737n85898l53228k50497
$$ plain form
9738 -14877 25033 13465 -20473 -1443 -30526 -41045 -44235 -16244 24826 21159 -32322 -38928
9726 -38928 13815 49400 45428 89880 91880 67793 67662 83335 89966 87901 58132 28989 10875
9713 10875 8789 -15392 -53443 -46059 5786 -30506 -52614 -40154 8798 34726 32952 26882 -9817
9700 -9817 -23496 -28181 4057 11211 5324 -24500 19636 25031 13574 17161 -3490 7876 45675
9687 45675 33323 27154 45176 46388 22752 40417 76403 44836 28768 29504 46754 53884 70985
9674 70985 94780 105354 80926 61727 53560 37032 53449 97336 92801 84320 107103 117820
9662 117820 160011 216235 264607 352538 475322 610615 899586 1422820 2268414 3523601
9652 3523601 4745305 5111177 4786031 3968628 2779311 1849574 1263676 910448 659951
9643F59951j44894o1049k3334l9766l7569r278l3510r6537j4293n4342k7536k6999
9631I0844M3272J4689L4505R313l1475o707k2615j5133j5119n0063m4726L6953
9619D3738P3469K0762k3318j4405m6391o0606l1462O3948K6106k8328j4186O783
9607A6110J6075J1976L6925j7987m4571L0871M8053k2648J7133O23k5350m3765
9595B3445m1448K740N461L4725N1284m2125Q6j0586J6906j048j9887k7058K8890
9582B1385q972J4065K252j3414J7647r078m1308J8267M5677J2846o799k5972j7754
9569H842K9697J0585m5290j0511K9019J2357J9079J1176k6871l384p226q722j8849
9556i8K7001L943m4120j7091j454L3400K2598J5959j900j4862M808l830J010k188
$$ plain form
9643 659951 515057 454008 430674 390908 353339 344061 310551 214014 199721 145379 117843 90844
9631 90844 134116 148805 183310 192623 161148 154441 131826 116693 101574 51511 6785 43738
9619 43738 117207 137969 114651 100246 53855 -6751 -38213 25735 51841 23513 9327 16110
9607 16110 32185 44161 81086 63099 18528 49399 97452 74804 91937 92560 67210 23445
9595 23445 -18003 -15263 -9802 24923 76207 34082 34168 23582 40488 39440 19553 -7505 21385
9582 21385 12413 26478 28730 15316 32963 23885 -17423 844 46521 59367 52568 26596 8842
9569 8842 38539 49124 3834 -6677 22342 34699 53778 64954 38083 34699 27473 18751 -98
9556 -98 26903 30846 -13274 -30365 -31819 1581 24179 40138 38238 23376 28184 24354 25364 23176
9542B3176J3698l9757k5088P621k0473l677J8323K374J3111M5905M1068r332n4637
9529A2312J6096K1847j9522N153n6505j082N795R725O145K9260J5882l0687R353
9516B3772k6832l133K9673K2776j1500r93K2813m982k292j8464l5154m6734K3927
9503b7123K9045n050n866j358k4799j49M9137N208O011J2421K8663l1008n9010
9490b3878j8557p458M0781J1132J6982J6144k337J0397P09l528m655J3016M4651
9477I3399l2868m8405m027J6286k7736N668K6078K3725j4370j6731J5359L0660
9465F7038M087k5679k0128l4072j7233k1951N5119K5314j2128k8005L39R874K1788
9452B4363l3349J2747R062k5053Q678n822J8289M4769m1334l6631k654K3963Q383
$$ plain form
9542 23176 36874 -2883 -27971 -20350 -40823 -44500 -26177 -23803 -10692 35213 76281 66949 12312
9529 12312 28408 50255 30733 35886 -20619 -21701 -15906 -6181 -36 29224 45106 14419 23772
9516 23772 -3060 -6193 23480 46256 34756 33763 56576 51594 49302 30838 -4316 -51050 -27123
9503 -27123 1922 -3128 -8994 -10352 -35151 -35300 13837 19045 25056 37477 66140 35132 -23878
9490 -23878 -42435 -49893 -9112 2020 19002 35146 32809 43206 43915 40387 35732 48748 93399
9477 93399 60531 12126 8099 24385 -3351 2317 28395 52120 37750 21019 36378 67038
9465 67038 71125 45446 25318 -8754 -25987 -47938 7181 32495 20367 -7638 -7299 2575 24363
9452 24363 -8986 3761 12823 -12230 -3552 -9374 8915 53684 12350 -24281 -26935 -2972 5411
9439E411l9391n280J9930j0437K5640P838j6597J2865n888q271O593K9103N370
9426B6886N484O944j8136j4746O088R863l1407m812K0078l2445n1993J630M1212
9413c5354J3628j4891n937L9916r340M820L4452r281k364j0012L3223J8606R932
9400F7398o346n047k991j052j7184k4790k6588J6872J4674l2331J4358J9510J4137
9387C0620o776p611m892l7349m2958M4567L1480n171k0886j2631L5873J4445M120
9374B2831J0303q4l5951k3455l864q690P069K3271K8075K1037J37L2749R922k6629
9360E6721l5138q328p735l8220q968J4796Q729j8717j7907O283K7821O9920K914
9347E2171O19J0160m9738n7511K3405K6357M2447J4678j6788l4723k9094p184
$$ plain form
9439 5411 -33980 -39260 -19330 -29767 -4127 3711 -12886 -21 -5909 -14180 -7587 21516 26886
9426 26886 32370 39314 21178 6432 12520 22383 -9024 -13836 6242 -26203 -78196 -76566 -35354
9413 -35354 -21726 -36617 -42554 -2638 -11978 -7158 27294 18013 15649 5637 38860 57466 67398
9400 67398 61052 56005 53014 51962 34778 9988 -16600 272 14946 -17385 -3027 16483 30620
9387 30620 23844 16233 11341 -26008 -68966 -24399 7081 1910 -18976 -31607 4266 18711 22831
9374 22831 33134 33050 -2901 -26356 -30220 -38910 -31841 -8570 19505 40542 40679 73428 83350 56721
9360 56721 21583 13255 5520 -32700 -41668 -26872 -18143 -36860 -54767 -48484 -20663 49257 52171
9347 52171 52790 62950 13212 -44299 -20894 5463 47910 62588 45800 11077 -18017 -25201
9335b5201J8415L0329k3520J3415J8072j5214K6492k8142k0154L439j1150K2106
9323H887k1016j7701J0428k7666K9605j169K5467L9836k6136n1741j8012j895
9311e1113r701j1928J7431P3721N7123k0143k1328j721j9908m4340O521K0283
9299e103j1983m0246J189K6738N4664J2331l1948O8204L9228m9535l7312j3513
9287A2714J8657M7530l1404k4247k6277j7521j2278K8174L5705M0776n230k5449
9275D1150L002k121m3579k8279m6390J9803J4119K5134N7695L7490p800J6160
9263H6384R355p5657n0546M43o418K5729p128K9558M2111j8194l2469l4499l20
9250c1651J1764M2287m222k4809l1727K2895M1948k6366j3444j264m372l5512
$$ plain form
9335 -25201 -6786 23543 23 13438 31510 16296 42788 14646 -5508 -2069 -13219 8887
9323 8887 -12129 -29830 -19402 -47068 -17463 -18632 6835 46671 20535 -31206 -49218 -51113
9311 -51113 -60814 -72742 -55311 18410 75533 55390 34062 32341 12433 -31907 -25386 -5103
9299 -5103 -17086 -57332 -56143 -29405 25259 37590 5642 73846 113074 63539 26227 12714
9287 12714 31371 78901 47497 23250 -3027 -20548 -32826 -4652 31053 71829 66599 41150
9275 41150 44152 42031 -1548 -29827 -76217 -56414 -42295 -17161 40534 78024 70224 86384
9263 86384 95739 20082 -30464 -30021 -36439 -10710 -17838 11720 53831 35637 3168 -31331 -31651
9250 -31651 -19887 22400 18178 -6631 -38358 -15463 26485 119 -13325 -14589 -18961 -54473
9238e4473J1939K1543P2J0115M8259l5041m155j4749r065j6802K085L422k3435
9225f0285M1021K5798J7380J1036k6958l1152j3940O917R048J827l5517J608k8135
9212h1352K0645M8103Q384q471j6091K2299K3980J8462k6833m1387L6192k2140
9200a8209j4348L5480J3689n407L927l995j1538k4044K7155K2240k3274n0799
9188d9123L57K5930n4445j1557N2086j6323l1809J1184J3109j7781K0116P1667
9176A3411M0079j4907o0508O568k4592J153r88q695J4560K2295Q872k505k5591
9163c0848k1686J7470r131j0856K1398J1479j6883o380m753K1131K8427L3149
9151C2517m106p930k5309q693J9291K216L7381K8086n6638l2641L9o478j4864
$$ plain form
9238 -54473 -42534 -20991 -20919 -10804 37455 2414 -1741 -16490 -25555 -42357 -40272 -36850 -60285
9225 -60285 -19264 6534 23914 34950 7992 -23160 -37100 -30183 -21135 -19308 -54825 -53217 -81352
9212 -81352 -60707 -12604 -4220 -12691 -28782 -6483 17497 35959 9126 -32261 3931 -18209
9200 -18209 -32557 2923 16612 11205 15132 11137 -401 -24445 2710 24950 1676 -49123
9188 -49123 -48766 -22836 -77281 -88838 -36752 -53075 -84884 -73700 -60591 -78372 -58256 13411
9176 13411 53490 38583 -21925 -15357 -39949 -38796 -39784 -48479 -33919 -11624 -2752 -5257 -30848
9163 -30848 -52534 -35064 -44195 -55051 -33653 -22174 -39057 -45437 -50190 -29059 -632 32517
9151 32517 28411 20481 -4828 -13521 5770 7986 45367 73453 16815 -15826 -15787 -22265 -37129
9138c7129L1677L313K0637q290l6764K3783N5557J1338k0555l8379N934m286n6542
9125d9706K4681J7927L909N81j6498L1561M5680l5227l1483P552O3169p811p6258
9112b1923L0920J6659k6726p709K2735K6931K4845p523k1834l5765l5768n385
9100d0543m471O495J7326K8375J8352K4551J6796l0261m3985j5141j1367k2741
9088e6614L5646O6866Q143J956K5486m286m9983m7022K3902K3785l4565j6357
9076b3043k3379L7487k4412l5949L5554M6961R167p709l1431R467P94q711L404
9063a1800p980k4270m116k1583M8902P603l8561K5390L0174R555m0398k367K4481
9050d970J6514J0226o623l0068m068M994k7942R285l2770j7496J6818O626L847
$$ plain form
9138 -37129 -5452 -2139 18498 10208 -26556 -2773 52784 64122 43567 5188 11122 6836 -49706
9125 -49706 -25025 -7098 -3189 -2608 -19106 12455 58135 22908 -8575 -1023 62146 54335 -21923
9112 -21923 8997 25656 -1070 -8779 13956 40887 65732 58209 36375 610 -35158 -40543
9100 -40543 -45014 -38519 -21193 7182 25534 50085 66881 36620 -7365 -22506 -33873 -56614
9088 -56614 -20968 45898 54041 55997 81483 77197 27214 -19808 4094 27879 -6686 -23043
9076 -23043 -46422 -8935 -33347 -69296 -33742 13219 22386 14677 -16754 -7287 -6493 -15204 -11800
9063 -11800 -19780 -44050 -48166 -69749 -20847 -13244 -51805 -26415 3759 13314 -27084 -29451 -4970
9050 -4970 11544 21770 15147 -14921 -18989 -13995 -41937 -32652 -65422 -82918 -66100 -59474 -55627
9037e5627L2164K6681j1340o6787M4769R274p681P727J0551Q309j599J0275J6302
9024B3018K2747j3503p749l971l6691l8348M899K608J9378L4676j3617m0187K7713
9011a9027K2855p469j2021K3709K983j0788J4562k539Q685l9758K1621L3782M9721
8998H6316j7723p2053m0799J1531K9787j6257O2Q652o607M796L5258K8691K117
8985E3771l8099j0949k8729k771K323L7647J4063k1037l2876K561J1230p757m277
8972b4900K3558N4491k4811k2378K4206K2298k4709j69L176L6049K2626n744n4748
8959B8945o460L0311j6849r806p438j5207M7982K6191j0452j1870j1557j3686
8947C0104L2685j6477j1458K1492K0646L4585m995m7693r1736j435J6798K4642
$$ plain form
9037 -55627 -23463 3218 -8122 -74909 -30140 -20866 -28547 -20820 -10269 -1960 -3559 6716 23018
9024 23018 45765 32262 24513 20542 -16149 -54497 -49598 -46990 -27612 7064 -6553 -46740 -19027
9011 -19027 3828 -3641 -15662 8047 11030 242 14804 12265 20950 -18808 2813 36595 86316
8998 86316 68593 -3460 -44259 -32728 -2941 -19198 -19136 -10484 -17091 -12295 22963 51654 53771
8985 53771 15672 4723 -24006 -26777 -24454 13193 27256 6219 -26657 -24096 -12866 -20623 -24900
8972 -24900 -1342 53149 28338 5960 30166 52464 27755 27586 30762 66811 89437 83693 28945
8959 28945 22485 52796 35947 26141 18703 3496 51478 77669 67217 55347 43790 30104
8947 30104 62789 46312 34854 56346 76992 111577 106582 58889 -32847 -34282 -17484 7158
8935G158K7363k459k9497k712L1364K450m836K8025k0959l0584N723q3252Q740
8922f3476J9424l027K1813L3258K9800J2411j6809M330m2340k1070P260M2610
8910B4184j2480l8642K8038K9675K6794q570l1410M8558N1342l7884m0681m756
8898C4168N1204J0453l4312j8283L562J0758M112l1015l5034M394L6203l7409
8886a199m2046l785k1524J721L3892R489l019K9072k1034k3895O3401K8489L8754
8873H8316k7646O979l4139l1193n905j3987j0271J8489K507p214l633j1694L5325
8860E934l6540j9711K7865J2656L595Q281M433k1845m2816J894K3666L5361K0627
8847B3400l9379k4845j7943k7579J7211L3091M1008j3938K2322O066j7026O341
$$ plain form
8935 7158 34521 32062 2565 -147 31217 33667 28831 56856 35897 5313 11036 -72216 -63476
8922 -63476 -44052 -47079 -25266 7992 37792 50203 33394 37724 -4616 -25686 -18426 24184
8910 24184 11704 -26938 1100 30775 57569 48999 17589 66147 117489 79605 38924 34168
8898 34168 85372 95825 61513 43230 46792 57550 61662 30647 -4387 7 36210 -1199
8886 -1199 -43245 -47030 -68554 -66833 -32941 -23452 -26471 2601 -18433 -42328 21073 49562 88316
8873 88316 60670 67649 33510 2317 -3588 -17575 -27846 -9357 -6850 -14064 -17697 -29391 5934
8860 5934 -30606 -50317 -22452 -9796 -6201 2080 6513 -15332 -58148 -56254 -32588 2773 23400
8847 23400 -15979 -40824 -58767 -86346 -69135 -36044 4964 -8974 13348 19414 2388 8729
8835H729n533q409K1382m989K822K0468M0940J173l7863l3409k2844N1964K8555
8822F2986j3045k3010l2810J2564K4492J2522m4729r198j5507k2539L5209L9426
8810B6361J1314O789r272j3509j9388L042J6235K37k1631J0451K4811j2188m4804
8797b1552j8667j751j2138K0495Q154j0545L5081L5997L9626k5519k9725O556
8785B6012j2185J8494L387n6118k6931K4145M9375l5592j1122L3388K1908q427
8773B6334M630l316l2986j1533J1446K6713J2246N932O076O830M7217K8482j0857
8760A17214k8798j6513k5888k623j932K172m0435k2587K6666O544m0139Q858q877
8747b6338j8200K60J4967K7925k3468k5537N744K2088L8395L159L0891M525r099
$$ plain form
8835 8729 3196 -5213 16169 11180 14002 34470 75410 76583 38720 5311 -17533 34431 62986
8822 62986 49941 26931 -5879 6685 31177 43699 -1030 -10228 -25735 -48274 -13065 26361
8810 26361 37675 44464 35192 21683 2295 5337 21572 21809 178 10629 35440 23252 -21552
8797 -21552 -40219 -41970 -54108 -33613 -25459 -36004 -923 35074 74700 49181 19456 26012
8785 26012 13827 32321 35708 -20410 -47341 -23196 26179 -9413 -20535 12853 34761 26334
8773 26334 30964 27648 -5338 -16871 -5425 21288 33534 39466 45542 52372 99589 128071 117214
8760 117214 88416 71903 46015 43392 41460 43632 3197 -19390 7276 13820 -26319 -17461 -26338
8747 -26338 -44538 -44278 -29311 -1386 -24854 -50391 -44647 -22559 15836 18995 49886 54411 45312
8734D5312l6761n737L1478m3504j8229L7236L1197m3472j7074L0049n072k3792
8722a8369J1848L9800K1503j2896K4627j080j2719l7657j4862L1310J2025R801
8710E3331p170r306p255j3975j6908J3534K0673P559K2549j116r503k2444l9348
8697i379M1122j2854l1223J954j332K8974L3163k5355o1985j1732j5675R745J5657
8684c8920K6234O180j7115k8845L1279k3320l09K9754j1919o112K862l3747L2203
8671c1775L2263l328l7946J3780R793j0420k6936n224K7075M5724K076m6208j8040
8658d9166J0825J9448K4021p315L8690N084o481k2814j2556J0866j6370m3055
8646d8823J5186K7405L6607p871L0913L6274k3797k0350r405j1109j3530J8842
$$ plain form
8734 45312 8551 2814 34292 -9212 -27441 9795 40992 -2480 -19554 10495 5423 -18369
8722 -18369 -6521 33279 54782 41886 66513 65433 52714 15057 195 31505 43530 53331
8710 53331 46161 36855 29600 15625 -1283 12251 32924 40483 63032 61916 52413 29969 -9379
8697 -9379 31743 18889 -12334 -10380 -11712 17262 50425 25070 -36915 -48647 -64322 -54577 -38920
8684 -38920 -12686 -6506 -23621 -52466 -21187 -44507 -44816 -15062 -26981 -33093 -30231 -63978 -31775
8671 -31775 488 -2840 -40786 -27006 -17213 -27633 -54569 -59793 -32718 13006 15082 -31126 -49166
8658 -49166 -38341 -18893 5128 -2187 36503 41587 35106 12292 -264 10602 -5768 -48823
8646 -48823 -33637 -6232 30375 22504 53417 89691 65894 45544 36139 25030 11500 30342
8634C0342j8837l5228l2857J6474L8356J2443J684J6330K3051l7724j6486J9790
8622A7338l5201k3415l2202K9191L8225R464M267J786j9071J6716M4l8961j4140
8609d5959L8226M0243k9297j3839l430k042j1005r758L4887L7466L208k4322k1144
8596f766L0400J9529k481j5908r694J4766k6816l0434p157N1982J2355J818K6510
8583E8104M7786m461k0634k3661k7881K0551N024k1227k7034O727L7649N0664
8571A01607r79k7811m822L7663j5420j8941O31m5162j4030K2373P155o4981J1913
8558a0804K4834k0733j253l727M0429J0021o658N074j3643j5977K3569J2524j3190
8545C0466l2527m1544l598K3853J9126O8270Q968l0416j4779k515J2205l2980
$$ plain form
8634 30342 11505 -23723 -56580 -40106 -1750 10693 12377 28707 51758 14034 -2452 17338
8622 17338 -17863 -41278 -73480 -44289 -6064 3400 7667 9453 -9618 7098 7142 -31819 -45959
8609 -45959 -7733 32510 3213 -10626 -14056 -16098 -27103 -36861 -1974 35492 38700 14378 -6766
8596 -6766 23634 43163 40682 24774 15080 29846 3030 -27404 -34561 17421 29776 31594 58104
8583 58104 105890 101429 80795 57134 29253 49804 54828 33601 6567 13294 50943 101607
8571 101607 100628 72817 67995 105658 90238 71297 71928 26766 12736 35109 42264 -22717 -10804
8558 -10804 14030 -6703 -7956 -11683 28746 38767 32109 37183 23540 7563 31132 43656 30466
8545 30466 -2061 -43605 -47203 -23350 -4224 64046 73014 42598 27819 25304 37509 4529
8533D529k5781N5763M0462p1888n2228R494K8338L8290l2523n783n637M510o450
8520a8904J5353J5630j1395O036k376k4634k0631J7880K4482m112J083J2188l189
8507G411m7968l2674J4838K0700j0924M6717M906r929M1237J9370o4401l541L9890
8494B5632K2793k1463j8479k672k95j8994Q906M4557m455l7274J2448K9673K2889
8481F3266j1034l0717k4957l5119N879m789K8331M1768k1686k4677P619R896R002
8468A2782o562j2888n2591L3548M8237J1869q133l3350j4926O940l2360j7983
8456f5417r57J3774K8354J1294q086R764K852L4875J7151J5241l109j8565l1734
8443E437J8028m352j7323k5740K1127M6836N921j0977R013J8596p305m7185O980
$$ plain form
8533 4529 -21252 34511 74973 3085 -49143 -39649 -11311 26979 -5544 -11327 -16964 -12454 -18904
8520 -18904 -3551 12079 684 6720 4344 -20290 -40921 -23041 1441 -2671 -1588 10600 7411
8507 7411 -40557 -73231 -58393 -37693 -48617 -1900 3006 -6923 34314 53684 -10717 -14258 25632
8494 25632 48425 26962 8483 5811 5516 -13478 -4572 39985 35530 -1744 10704 40377 63266
8481 63266 52232 21515 -3442 -38561 -32682 -37471 -9140 32628 10942 -13735 -6116 3780 12782
8468 12782 6220 -6668 -59259 -25711 22526 34395 26262 -7088 -22014 -15074 -47434 -65417
8456 -65417 -66374 -52600 -24246 -12952 -21038 -11274 -8422 26453 43604 58845 55736 37171 5437
8443 5437 23465 19113 1790 -23950 -2823 44013 49934 38957 47970 66566 59261 12076 19056
8430A9056k8028j2787k3389l1310j656L7455L6098J5511L032L638k6892J1227
8418A955L4841J0331n430l7719l170q536p308P872M4085K826l9009j8765L7832
8405A9805J0186o3001j9422M2118M1274o8J4048N307k2163K5443j365j9214k1584
8392A1364o541N135L0458Q192j8722m5895k7373J3922L3859L2449M5545L400R574
8379I5367o2025j5476K582L0023k443j2656J095k9568J1358L1483k8464j2941
8367H335J7818l5477l2983J71J5816J2693K094L2206j5760j6786M7716J7461j9125
8354C4179l0157m4631l9768L7347n389M1368l131k6105j3489K5980R511R876J2870
8341H461j9292j4785R911N1229k6794l5723L2895M4212K3167k0009m4121K6357
$$ plain form
8430 19056 -8972 -21759 -45148 -76458 -78114 -40659 -4561 10950 13982 17620 -9272 1955
8418 1955 36796 47127 41697 3978 808 -7728 -15036 -7164 36921 39747 738 -18027 19805
8405 19805 29991 -33010 -52432 -10314 30960 30892 44940 50247 28084 53527 52162 32948 11364
8392 11364 4823 9958 40416 48608 29886 -16009 -43382 -29460 4399 36848 82393 85793 95367
8379 95367 33342 17866 20448 50471 48028 35372 36467 6899 18257 49740 21276 8335
8367 8335 26153 -9324 -42307 -42136 -26320 -13627 -11533 20673 4913 -11873 35843 53304 34179
8354 34179 4022 -40609 -80377 -43030 -48419 -7051 -10182 -36287 -49776 -23796 -14285 -4409 8461
8341 8461 -10831 -25616 -15705 35524 8730 -26993 5902 50114 73281 53272 9151 35508
8329C5508M6903k8554l5782J7075k4612J8383p08j220k0844j5870m0236k1758
8317g1715K1155J9057j9260j3688L78K1536J1636K7408K3410N713j9961M921o584
8304D006J666j0540j6390K8702J3317L3812Q713k3886J5657k3976n0046m1870
8292f0835O499J5762J4107j1042J8301l0081k3807n142J5201K1459J7395K0143
8280b040k1728k5658L0169J1104l2182k2662k0704n033r078m878J2713J5663L6577
8267c7737o54j6734J933O5991J4369J2301L3113q176l0661o130j1911L277o733
8254A2248R858j3982N6838K2397l9003m1804J047R860k4242P857j7431j5960o965
8241c9282M2627R469k3479l196m5544K1284p22K6521k3009j1275J8268K7880J8630
$$ plain form
8329 35508 82411 53857 18075 35150 10538 28921 28213 26993 6149 -9721 -49957 -71715
8317 -71715 -50560 -31503 -50763 -64451 -64073 -42537 -30901 -3493 19917 25630 5669 10590 4006
8304 4006 5672 -4868 -21258 7444 20761 54573 63286 39400 55057 31081 -18965 -60835
8292 -60835 -54336 -38574 -24467 -35509 -17208 -47289 -71096 -76238 -61037 -39578 -22183 -2040
8280 -2040 -23768 -49426 -19257 -8153 -40335 -62997 -83701 -88734 -97812 -102690 -89977 -74314 -37737
8267 -37737 -38391 -55125 -53192 12799 27168 39469 72582 64406 33745 27615 15704 18981 12248
8254 12248 22106 8124 64962 87359 48356 6552 7599 17459 -6783 1074 -16357 -32317 -39282
8241 -39282 3345 12814 -10665 -13861 -59405 -38121 -38843 -12322 -35331 -46606 -28338 -458 18172
8228A8172k5108m9627K9692N9885j9212j1170M9955J4820l2215k6760j7909J9924
8216A0447k4491p018j1463J861o433m6722m287K7162k9234R216L2494M6642R858
8203H032k2386k4770O260l4019K7805N2580o857j7127J0068r194q91K5091l7242
8190b2650K3599L1970l5790k031K2798J2389L055J5074m0920J7408p028k10k5620
8177g956L1955L5657k0798k2874q243k4797m1411K635M4587L7706J3077J2038
8165E1576K518k1010o36j0121m5211k5932K5813J4943j902n7932j5444N1706K4884
8152f748J2053J1603l0535j6855J9859j5374R360M0781K0924j5010q154j0827
8140A1077M4266m9194l2414K5482K611J6513L4371J7373k903n485k6943l4444
$$ plain form
8228 18172 -6936 -56563 -26871 33014 13802 2632 52587 67407 35192 8432 -9477 10447
8216 10447 -14044 -21062 -32525 -30664 -37097 -83819 -88106 -60944 -90178 -80962 -48468 -1826 8032
8203 8032 -14354 -39124 -32864 -66883 -39078 13502 6645 -10482 -414 -9608 -10499 14592 -22650
8190 -22650 949 32919 -2871 -4902 17896 30285 33340 48414 7494 24902 17874 17664 -7956
8177 -7956 23999 59656 38858 15984 7741 -17056 -58467 -55832 -11245 26461 39538 51576
8165 51576 54094 33084 32448 22327 -22884 -48816 -23003 -8060 -9962 -67894 -83338 -31632 -6748
8152 -6748 5305 16908 -13627 -30482 -10623 -25997 -16637 24144 45068 30058 21904 11077
8140 11077 55343 6149 -26265 -783 1828 18341 52712 70085 67182 61697 34754 310
8128C10l3451K0974J8689J1761m0641k8475J7622J2425o970j0474j1339K301Q105
8115c9163m066j4560Q426l0149K0817J3585J5274k3671P143K492J7698O9402K1282
8102F4510j6634k5218m521j941q266j2201j5447r175l279o653K1350J0765O538
8089a72M2015K3860j034l7064k6562Q117K6619j2962m437L3293K2152n395m4450
8076B3980o882n959l3719M918K3343k7207p937j6396q062m948L9394K6746j3493
8063f222N998Q141k2464j4684l3651K400m363M357K1123L5908q7q899J134R526
8049a783k0881l3725j8870j4251J1964l330j820J6988K2823J5874M8689L2320
8037E3998K612o974l6706l0440J888J4170p608j4220J4517j3233j2586J3788k5637
$$ plain form
8128 310 -33141 -12167 6522 18283 -22358 -50833 -33211 -20786 -27756 -38230 -49569 -47268 -39163
8115 -39163 -43229 -57789 -49363 -79512 -58695 -45110 -29836 -53507 -46364 -43872 -26174 43228 64510
8102 64510 47876 22658 18137 16196 7930 -4271 -19718 -28893 -32172 -38825 -17475 -6710 -172
8089 -172 41843 65703 64669 27605 1043 9160 35779 22817 18380 51673 73825 68430 23980
8076 23980 17098 11139 -22580 -17662 5681 -21526 -29463 -45859 -53921 -58869 -19475 7271 -6222
8063 -6222 -224 7917 -14547 -29231 -62882 -60482 -64845 -60488 -39365 -3457 -3544 -12443 -11309 -1783
8049 -1783 -22664 -56389 -75259 -89510 -77546 -80876 -82696 -65708 -42885 -27011 21678 53998
8037 53998 56610 49636 12930 -17510 -15622 -1452 -9060 -23280 -8763 -21996 -34582 -20794 -46431
8024d6431k7994L8805M238J7878K1171j124l0163l8764j6266J2131L2914R535
8012b4070l784n462k164j3776j8375m000K1097K0695m1550M414k419O5369K4063
7999B0038n5552J328K2067k4333m8247j2346L6780L2019K0315l9892p1083K0736
7987i8170L3625M2160M0802L4525j7709J022j3372J4060J8984K4700K4030j1956
7975I2701k7885j0295k2328l7854j5429L2593k599j2034o23n85J6826o667n6748
7962e0927M8292L9066K9332K732j5256k6568k0155l502j0855j412n355m5692R246
7949e1054L9333P472j5545k2389o453m78m740M0306M7579M0124r740j2800j6201
7936C5414M851k7205L5687k2857j187K072K7194K1023k5816m3661p9928k1519
$$ plain form
8024 -46431 -74425 -35620 -31382 -13504 7667 6543 -23620 -62384 -78650 -66519 -33605 -24070
8012 -24070 -27854 -33316 -35480 -49256 -67631 -71631 -50534 -29839 -71389 -66975 -69394 -4025 20038
7999 20038 -35514 -34186 -12119 -36452 -84699 -97045 -60265 -28246 -7931 -47823 -118906 -98170
7987 -98170 -64545 -22385 18417 52942 35233 36255 22883 36943 55927 80627 104657 92701
7975 92701 64816 54521 32193 -5661 -21090 11503 8904 -3130 -3753 -4338 12488 5821 -50927
7962 -50927 -2635 36431 65763 68495 53239 26671 6516 3014 -7841 -9253 -14608 -60300 -51054
7949 -51054 -11721 -4249 -19794 -42183 -48636 -49114 -53854 -13548 34031 74155 64415 51615 35414
7936 35414 40265 13060 48747 25890 24703 26775 53969 74992 49176 5515 -74413 -95932
7924i5932J8139O7100K2681m0343j878K1551m2716Q757K1030K8618L206n65j4553
7911d905k7674j6933j2218n180L8580L7255J3765R05N525l047l03q706J9431P1
7897C6566O565j1231K6925j1667k4006j138j3108l3615j9709L0005J9207r454
7885d660L8937r12l8287j6272J3638r425L158K5202L3983J7025j8505k2162k760
7872A8960J4319m337J5016j1650n2557N463J0856K1696m8527K6627p049j2027
7860b3210K902m098R805J8897l3460k0432K4886J6134l9053J067K4217r053m2
7847c1440J3899L341R318J2023K504K4101j02Q066J1364k5266M982L6445o863
7834F2372k9071r196j0196R398n052l5522j9607J1032k9726J1024L9408K0448
$$ plain form
7924 -95932 -77793 -10693 11988 -28355 -30233 -8682 -51398 -42641 -21611 7007 10213 9648 -4905
7911 -4905 -32579 -49512 -61730 -66910 -28330 8925 22690 23595 29120 26073 25770 17064 36495 36566
7897 36566 43131 31900 58825 47158 23152 22014 8906 -24709 -44418 -14413 4794 -4660
7885 -4660 34277 33365 -4922 -21194 -7556 -16981 -13823 11379 45362 62387 43882 21720 18960
7872 18960 33279 28942 43958 32308 -20249 -14786 -3930 17766 -30761 -4134 -11183 -23210
7860 -23210 -20308 -24406 -14601 4296 -29164 -49596 -24710 -8576 -47629 -46562 -22345 -31398 -31440
7847 -31440 -17541 -14200 -4882 7141 9645 33746 33644 41710 53074 27808 32790 69235 62372
7834 62372 33301 24105 13909 23307 18255 -17267 -36874 -25842 -55568 -44544 -5136 15312
7822A5312M3527j4848j2707k3114l896l2420j4983m444L0541k6994o648K1854
7810b8820N6697P898j3005j8819R886J7014M0573k0154j5800j9775J6758n0972
7798a8519q677K8662j1452q814K5661k334l7309n490K6064K285K1147L9349k042
7785D8531J1013l4460k7292k2905l0071J9143R998J3689K7907L4614J0220K3389
7773H3776P646j4380k9609o9732m2017J786oJ3493P228J1070o170l277Q154p034
7759c9072L1040l509l7449K0140M9948J4370j9969j5932R82J9416m4429n2539
7747g7003L5115M9447K7566k44p9335k4727K1482M1534J9987k5855l049n127L290
7734a6919N1794J223j7243N934J1469k4596J1223J4760K1703k6913k4603k4050
$$ plain form
7822 15312 58839 43991 31284 8170 4274 -28146 -43129 -47573 -17032 -44026 -50674 -28820
7810 -28820 27877 35775 22770 3951 13837 30851 71424 51270 35470 15695 32453 -18519
7798 -18519 -27196 1466 -9986 -18800 6861 4527 -32782 -38272 -12208 -9923 11224 50573 48531
7785 48531 59544 25084 -2208 -25113 -55184 -36041 -26043 -12354 15553 50167 60387 83776
7773 83776 91422 77042 47433 -22299 -64316 -62530 -62536 -49043 -41815 -30745 -36915 -40192 -32038 -39072
7759 -39072 -8032 -11541 -48990 -28850 21098 35468 15499 -433 549 19965 -24464 -77003
7747 -77003 -41888 7559 35125 34881 -44454 -69181 -47699 -6165 13822 -12033 -15082 -20209 -16919
7734 -16919 34875 36098 18855 24789 36258 11662 22885 37645 59348 32435 7832 -16218
7722a6218J4647J8920l1500k8911M9844L5554l715r92K8674J6026k5161o0368
7710c200j242K9101J0206J2366o818l314P610r37l2264k0589Q603l8744l7087
7697g6309j7846K1903L4045Q187K862R492R935j2016M6463J9397J7843J766r92
7684F4730j2903j1849O318k7172m5604P601k877o509N707j8050M3112K2494K1505
7671D6503k2929k3696k6716O846K2854j3567n7416K7322L6930K306l1907n4061
7659h7531L1589L9244M3351O306l914K824q956K145N926L552R626J3983l821m9542
7645D782n5042j669m526K0827L3193N7060L9482P200l0609o298K5696j4703k9526
7632D5867j5669J9705O103n570k8477j7133N316P719J3985m7567k7023J8726q79
$$ plain form
7722 -16218 -1571 17349 -14151 -43062 6782 42336 38621 37629 66303 82329 57168 -3200
7710 -3200 -4442 24659 34865 47231 40413 37099 44709 43772 11508 -9081 -478 -39222 -76309
7697 -76309 -94155 -72252 -38207 -30020 -27158 -17666 -7731 -19747 26716 46113 63956 65722 64730
7684 64730 51827 39978 46296 19124 -26480 -18879 -21756 -28265 -22558 -40608 2504 24998 46503
7671 46503 23574 -122 -26838 -19992 2862 -10705 -68121 -40799 -3869 -1563 -33470 -87531
7659 -87531 -55942 -16698 26653 32959 29045 31869 22913 25058 30984 34536 44162 58145 54324 4782
7645 4782 -50260 -51929 -56455 -35628 -2435 54625 94107 101307 70698 64400 90096 75393 45867
7632 45867 30198 49903 56006 50436 21959 4826 10142 17861 31846 -15721 -42744 -24018 -24897
7619b4897J8077Q569J087j5708J05l2106n7142j1168K3176M2000K9882Q4j2984
7606c1025K5717p692K1117j3468k3437J0873L78k5719J9136L7421j3544P999K252
7593A0008m3555l1437k0143p46N3999K3649k5602L035P760j9693l0711K8265J7576
7580b7595J9136M42k988m326M916R651k9961j619J3440J208k822J5317J7319L397
7566A5515j5974m9559O205r375J8244K0956m1592l7078k8058K458M1461K5393
7554e1404K5204L5282K677M050K7659j7214l7512k3090j0784J9641K3860l8240
7542c9871K730N3816J805m2185j5799L2291L0175k8647k4756L604O523k722j0886
7529c3922r018L2250O5358J1202k8870k375L4888j837m90m5207r471j8926k497
$$ plain form
7619 -24897 -6820 1749 2836 -12872 -12767 -44873 -102015 -113183 -90007 -48007 -18125 -18041 -31025
7606 -31025 -5308 -13000 8117 -5351 -28788 -17915 -17537 -43256 -24120 13301 -243 7756 10008
7593 10008 -33547 -64984 -85127 -85873 -31874 -8225 -33827 -30792 -23032 -42725 -73436 -45171 -27595
7580 -27595 -8459 -8017 -11005 -15331 -10415 -764 -30725 -32344 -18904 -17696 -20518 -5201 12118 15515
7566 15515 -459 -50018 -43813 -53188 -34944 -13988 -55580 -92658 -120716 -118258 -76797 -51404
7554 -51404 -26200 9082 11759 15809 43468 26254 -11258 -34348 -45132 -25491 -1631 -39871
7542 -39871 -37141 16675 18480 -23705 -39504 -7213 22962 -5685 -30441 -26837 -20314 -23036 -33922
7529 -33922 -42940 -10690 54668 65870 37000 34625 69513 67676 67186 21979 12508 -6418 -8915
7516h915q479l450J5754O2112m878n9158J8553k6835l9697J1643J5512l5849k8324
7503i2011K4190N3406R774j2765N498n748R346j680K4054L0496p492k3388k9345
7490a5665J7631r062J3059P406K0106j1070j7303k5189j0375J2781k925K2801
7478B195M367j8850n7540k809L5855J6411r784q377m7171J7476K5798m228p717
7465e4374K9755L102K3693N2609p016J9808o288n3354k9066K71J3718K0597k44
7452A3211P545k1554l920M80k8408N668M3709L2627K9622j8409l1325m4905K012
7439a3647L6071J3350J0776q548j0108n0136r136J116L577J1729N0272k0645k0586
7426e915K2452o657P115K5109q970o4771k430M821J5890o22j3866k0828k0095
$$ plain form
7516 -8915 -17394 -20844 -5090 57022 52144 -7014 11539 -15296 -54993 -43350 -27838 -63687 -92011
7503 -92011 -67821 -14415 -4641 -17406 -11908 -17656 -8310 -9990 14064 44560 37068 13680 -15665
7490 -15665 1966 -7096 5963 13369 33475 22405 5102 -20087 -30462 -17681 -20606 2195
7478 2195 6562 -12288 -69828 -72637 -36782 -20371 -30155 -38532 -85703 -68227 -42429 -46657 -54374
7465 -54374 -24619 -21517 2176 54785 47769 67577 61289 7935 -21131 -20860 -7142 13455 13211
7452 13211 20756 -798 -4718 -4238 -32646 -26978 16731 49358 78980 60571 29246 -15659 -13647
7439 -13647 22424 35774 46550 38002 27894 -22242 -31378 -30262 -26685 -14956 35316 14671 -5915
7426 -5915 16537 9880 16995 42104 33134 -31637 -34067 -29246 -13356 -13978 -27844 -48672 -68767
7413f8767L2290P5172l0302J9829L149l2891K2077j6692Q910o664K641K1505J6201
7400D6458l850n1764k8233J9809K9276k9602j3455J8156k016k4391J020p48j0880
7387e0220L0866j6525K9997K3879q321K0950Q015l2641l2095j8953m3608k2843
7375a11499K1706K892j0076L4436m765o0J5197J1083r003j0256K4958J1588K55
7362b3544j9741K345M1260m511l5716j0976j452j7460m873P5700P0167n532j9346
7349D6321o7395k2011J3518L861o987L3654K599k9113j508j0257L6833P45j0538
7336a0278k137M03M534J0127r141K545r400M464l914R165P13N9079n0799k7063
7322b1702l5477J2725K9892m417m0752J5273N1718N133J2522m0640Q249j8244
$$ plain form
7413 -68767 -36477 38695 8393 28222 31371 -1520 20557 3865 12775 6111 8752 30257 46458
7400 46458 42608 -9156 -37389 -17580 11696 -17906 -31361 -13205 -15221 -39612 -38592 -39340 -50220
7387 -50220 -19354 -35879 -5882 17997 9676 30626 38641 6000 -26095 -45048 -88656 -111499
7375 -111499 -89793 -86901 -96977 -62541 -67306 -67366 -52169 -41086 -50089 -60345 -35387 -23799 -23544
7362 -23544 -43285 -40940 320 -4191 -39907 -50883 -52335 -69795 -74668 1032 71199 65667 46321
7349 46321 -21074 -43085 -29567 -25706 -32693 961 3560 -25553 -27061 -37318 -485 260 -10278
7336 -10278 -12415 -12012 -7478 2649 -6492 -3947 -13347 -8883 -12797 -3632 -2919 56160 5361 -21702
7322 -21702 -57179 -44454 -14562 -18979 -59731 -44458 7260 12393 24915 -15725 -7476 -25720
7310b5720J9190j1315J0437J5689O103K3473n2827l1851J3737q617l805J1673
7298c3833M4762n549l3122j3751K231K2022K3683o846J8885j6978k1059j6482
7286c6037k2239K8081M94J6371R084J702n656K3173q23j2619k3427k6301J0450
7273c7747K4319M0163L1855O258n2205j6147k1761Q904j3871k0126l6347m7218
7261a33923J4622J8993K6372J6323L0487K8797n878K9709n920k4935l3163q411
7249d6927k9392J6583L8227n314k4969J0087J7740J2019l516n87J9076L6466Q700
7236D8193k7201K2516J7139k0357O676j3486j6005k9213J3236l4058k179J6545
7224a8194O491K537j4762n2672J1430O2054K1518P004n0820n5378K0999K8911
$$ plain form
7310 -25720 -6530 -17845 -7408 8281 14384 37857 -14970 -46821 -33084 -41701 -45506 -33833
7298 -33833 10929 5380 -27742 -41493 -39262 -17240 6443 -403 18482 1504 -19555 -36037
7286 -36037 -58276 -30195 -29701 -13330 -4246 -2544 -8200 14973 14150 1531 -21896 -48197 -37747
7273 -37747 -13428 26735 58590 64848 12643 -3504 -25265 -16361 -30232 -50358 -86705 -133923
7261 -133923 -119301 -100308 -73936 -57613 -27126 1671 -4207 25502 19582 -5353 -38516 -46927
7249 -46927 -76319 -59736 -21509 -26823 -51792 -41705 -23965 -11946 -15462 -16049 3027 39493 48193
7236 48193 20992 43508 60647 40290 46966 33480 17475 -11738 1498 -32560 -34739 -18194
7224 -18194 -11703 -9166 -23928 -76600 -65170 -3116 18402 25406 -25414 -80792 -59793 -30882
7212c0882N4849K4974l7090l1651k8453J5956M154K5233K6763K6573q219k7277
7200A4930q386M9846K8453O827m5891p148J5848L0908j5400m6135M3561M4001
7188A11414n367k5273m4544l5792k7618o9603J5608K6295l721l580j7844k0163
7176a00188M3082J2056P612J4037R777J355n415J2960J1788K0085J2985K7253
7164F7387K2981j3993m389l9312l8921j1825J534L1485j4364l6832k3437J7224
7152d2462j8907m966k037j0964M8153L5799q766j1148J3652J805k7694J4080L3575
7139B0120j7101j7720q807L8280K0524k4962q743k2124J1075J5545j6455k8247
7127c8615K8003l1348n4700j0076L8858L532k2156L2184N4091M3518n919j7010
$$ plain form
7212 -30882 23967 48941 11851 -19800 -48253 -32297 -28143 -2910 23853 50426 42207 14930
7200 14930 6544 56390 84843 91670 45779 38631 54479 85387 69987 23852 67413 111414
7188 111414 106047 80774 36230 438 -27180 -96783 -81175 -54880 -58601 -62181 -80025 -100188
7176 -100188 -57106 -45050 -37438 -23401 -13624 -12269 -17684 -4724 7064 27149 40134 67387
7164 67387 90368 76375 71986 32674 -6247 -18072 -16538 14947 583 -36249 -59686 -42462
7152 -42462 -61369 -66335 -68372 -79336 -31183 4616 -4150 -15298 -1646 159 -27535 -13455 20120
7139 20120 3019 -14701 -23508 14772 35296 10334 1591 -20533 -9458 6087 -10368 -38615
7127 -38615 -10612 -41960 -96660 -106736 -67878 -64346 -86502 -54318 -227 43291 37372 20362
7115B0362l7288J3302m508j1798j5252l498J9514p892k0368j0030K4039J1241
7103b2176j4330J8476K019K2k6075J8341K8963J1603j4772J3869K283k4858o865
7090a3500J1991l887O311l9835j8566k335K660J8291J8559M0839N119O487j0953
7077B1181l5022K6j2592n934m971J943K5458J9691j5998j8027J9846J8651O832
7064B1084j0674l3031N129J8022M1432M7568l3129n3358j3890j2516M801K2091
7052C529J7378k3955K548J8613p825l9200l3483N887k6850k1L6949K2132k7274
7039e1572n6589L5917M8758M1821J4609k9136m1703k3450j3349m1810j1098J3022
7027a14580K8248L6032L0153j220j0736R726k506j0126k4029N2357K8836k9190
$$ plain form
7115 20362 -16926 -3624 -8132 -19930 -35182 -38680 -19166 -27058 -47426 -57456 -33417 -22176
7103 -22176 -36506 -18030 -16011 -15989 -42064 -23723 5240 16843 2071 15940 18223 -6635 -13500
7090 -13500 -1509 -5396 915 -38920 -57486 -59821 -57161 -38870 -20311 20528 25647 32134 21181
7077 21181 -13841 -13815 -26407 -32341 -37312 -35369 -9911 9780 -6218 -24245 -4399 14252 21084
7064 21084 10410 -22621 -17492 530 41962 89530 56401 3043 -10847 -23363 -18562 3529
7052 3529 20907 -3048 -500 18113 10288 -28912 -62395 -56508 -83358 -83379 -46430 -24298 -51572
7039 -51572 -108161 -72244 -23486 18335 32944 3808 -37895 -61345 -74694 -116504 -127602 -114580
7027 -114580 -86332 -50300 -20147 -21367 -32103 -22377 -24883 -35009 -59038 -6681 22155 -7035
7015g035m1203J4450J5729j2853j9572j6449r930n221J669P0640P055J8205K9797
7002D5282m156k375l0145k79j9074k3326M1242L6765j4581j3419o333L1299K5046
6989F5946k1131n271J2329n7156k4669j4814M1858Q084K2622j5455l6489K4424
6977B78K0450j8518q506j4540k508o4517l6775N3159P813j596P165J718J7055
6964c9322J1225P425p090R859j1858L4119N6214o894o5359k4599l1818M988K7535
6951c5575P3743J4732k6543k7524K1873K3787j5954m5055k6142j111Q160k2519
6939e8128K6092j0914J9584J0526J1189j5939k3007M800k4744J0332K2830M7415
6927B0036K3754o5616j3674L0713J843j7599k2328J1856n242J3987K026J0705
$$ plain form
7015 -7035 -48238 -33788 -18059 -30912 -50484 -66933 -76863 -82084 -80415 -9775 -2720 15485 45282
7002 45282 41126 38751 8606 8327 -10747 -34073 7169 43934 29353 15934 9601 40900 65946
6989 65946 44815 39544 51873 -5283 -29952 -44766 -2908 5176 27798 12343 -24146 278
6977 278 20728 2210 -6296 -20836 -23344 -87861 -124636 -71477 -63664 -65260 -58095 -56377 -39322
6964 -39322 -28097 -20672 -27762 -17903 -29761 4358 60572 53678 -11681 -36280 -68098 -63110 -35575
6951 -35575 38168 52900 26357 -1167 20706 44493 28539 -16516 -42658 -43769 -35609 -58128
6939 -58128 -32036 -42950 -23366 -12840 -1651 -17590 -40597 -35797 -60541 -50209 -27379 20036
6927 20036 43790 -21826 -35500 -4787 -2944 -20543 -42871 -31015 -36257 -22270 -20244 -9539
6915i539N959K464k1726o394k1483j4518J7738n044K6493R3k6337j4539K2603
6902d4230k3415m777M1474J8244j2220o277j1529R536R714K1545n571J4269L8712
6889D5475q470q968k1533k5249J0293L5405K4631O747l9714j0961J3800P083J0316
6876C8855l4006k177k5447J8095J3855K222J0167J6337N985k218r406J0726j260
6863D1728j5982m0295R673J7113N155k401r728K3282q217p071m5394q827O684
6850c4280N493o388J4992m294m588M465p496R76j446l2442J2184j4864l0167M2669
6836e5186N3480M548j5458p184k0366M294M0514K4058K4991j0781K3342k0624
6824D5628K1115k1822m9900l891l146k609m111L384k451K178J5228l386p521J0406
$$ plain form
6915 -9539 -3580 -1116 -22842 -29236 -50719 -65237 -47499 -52543 -26050 -25957 -52294 -66833 -44230
6902 -44230 -67645 -72422 -30948 -12704 -24924 -31201 -42730 -33194 -23480 -1935 -7506 6763 45475
6889 45475 37005 28037 6504 -18745 -8452 26953 51584 58331 18617 7656 21456 28539 38855
6876 38855 4849 2672 -22775 -4680 9175 11397 21564 37901 43886 41668 32262 42988 41728
6863 41728 25746 -14549 -4876 12237 17392 14991 5263 28545 20328 13257 -32137 -40964 -34280
6850 -34280 -28787 -35175 -20183 -24477 -29065 -24600 -32096 -31120 -32566 -65008 -52824 -67688 -97855 -55186
6836 -55186 -1706 2842 -12616 -19800 -40166 -35872 4642 28700 53691 42910 66252 45628
6824 45628 66743 44921 -4979 -8870 -12016 -14625 -18736 -15352 -17803 -15625 -397 -3783 -11304 -898
6810h98p175N643j4886Q830J7208q448J0246J1643k1667k3558J6201M24k599j0111
6796a9147l0039k8535O3829j4948j397J9800J44l1934K9229L2945K1985K0168
6784F2100k6178k0568J8096J2616m0586k0012n016k761j4980l7337L8510R465
$$ plain form
6810 -898 -8073 -2430 -17316 -8486 8722 274 10520 22163 496 -23062 -6861 -6437 -9036 -19147
6796 -19147 -49186 -77721 -13892 -28840 -30237 -10437 -10293 -42227 -12998 19947 41932 62100
6784 62100 35922 15354 33450 46066 5480 -14532 -19548 -22309 -37289 -74626 -36116 -26651
$$ [...]
##END NTUPLES=NMR SPECTRUM
##END=
