##TITLE=Analysis number 325118
Compound Code km 01841
Project Code adrs
Chemist Name new century
##JCAMPDX= 6.0         $$ Bruker NMR JCAMP-DX V2.0
##DATA TYPE= NMR SPECTRUM
##DATA CLASS= NTUPLES
##ORIGIN= Bruker BioSpin GmbH
##OWNER= nmr
$$ XWIN-NMR		Version 3.5
$$ Tue Dec 12 13:13:51 2006 GMT Standard Time (UT+0h)  MAYBRIDGE\nmr@NMR_250MHZ
##.OBSERVE FREQUENCY= 250.131544655141
##.OBSERVE NUCLEUS= ^1H
##.ACQUISITION MODE= SIMULTANEOUS (DQD)
##.ACQUISITION SCHEME= undefined
##.AVERAGES= 16
##.DIGITISER RES= 18
##SPECTROMETER/DATA SYSTEM= dpx250
##.PULSE SEQUENCE= zg30
##.SOLVENT NAME= DMSO
##.SHIFT REFERENCE= (INTERNAL, DMSO, 0, 16.522)
##AUDIT TRAIL= $$ (NUMBER, WHEN, WHO, WHERE, WHAT)
$$ ##TITLE= Audit trail, XWIN-NMR		Version 3.5
$$ ##JCAMPDX= 5.01
$$ ##ORIGIN= Bruker BioSpin GmbH
$$ ##OWNER= nmr
$$ C:\u/data/dgb/nmr/ADRS/780/pdata/1/auditp.txt
$$ ##AUDIT TRAIL=  $$ (NUMBER, WHEN, WHO, WHERE, WHAT)
(   1,<2006-12-12 13:13:18.21 +000>,<MAYBRIDGE\nmr>,<NMR_250MHZ>,
      <created by zg, POWCHK disabled, PULCHK disabled
       configuration hash MD5:
       49 4B E0 1D 92 C2 6B 37 9F E6 65 BC 52 41 86 1D
       data hash MD5: 64K
       E9 5B B0 8D 43 A6 AE E8 17 93 CA F0 DB CB 69 4A>)
(   2,<2006-12-12 13:13:41.72 +000>,<MAYBRIDGE\nmr>,<NMR_250MHZ>,
      <Start of raw data processing
       ef LB = 0.3 FT_mod = 6 PKNL = 1 SI = 32K 
       data hash MD5: 32K
       D5 AF 27 1D 6A 17 13 B1 3F 68 80 00 9E 3A 00 E2>)
(   3,<2006-12-12 13:13:43.67 +000>,<MAYBRIDGE\nmr>,<NMR_250MHZ>,
      <apk 
       data hash MD5: 32K
       5F 28 92 6D 9B 93 6F 88 FD B0 15 71 3E 38 4D B5>)
(   4,<2006-12-12 13:13:44.67 +000>,<MAYBRIDGE\nmr>,<NMR_250MHZ>,
      <abs ABSG = 5 
       data hash MD5: 32K
       01 76 99 91 97 72 FE B1 1D 8E BA 92 63 8E B0 C5>)
$$ ##END=
$$ 
$$ hash MD5
$$ 52 41 6B DC 18 BC 75 99 6A 28 F5 16 EA 56 57 CD
##$RELAX= 
##$RELAX= 
##$RELAX= 
##$RELAX= 
##$RELAX= 
##$RELAX= 
##$RELAX= 
$$ Bruker specific parameters
$$ --------------------------
##$DU= <C:\u>
##$EXPNO= 780
##$NAME= <ADRS>
##$PROCNO= 1
##$TYPE= <nmr>
##$USER= <dgb>
##$AMP= (0..31)
100 100 100 100 100 100 100 100 100 100 100 100 100 100 100 100 100 100 
100 100 100 100 100 100 100 100 100 100 100 100 100 100 
##$AQSEQ= 0
##$AQ_mod= 3
##$AUNM= <au_zg>
##$AUTOPOS= <42 >
##$BF1= 250.13
##$BF2= 250.13
##$BF3= 250.13
##$BF4= 250.13
##$BF5= 500.13
##$BF6= 500.13
##$BF7= 500.13
##$BF8= 500.13
##$BYTORDA= 1
##$CFDGTYP= 0
##$CFRGTYP= 5
##$CHEMSTR= <none>
##$CNST= (0..31)
1 1 145 1 1 1 1 1 1 1 1 1 1 1 1 1 1 1 1 1 1 1 1 1 1 1 1 1 1 1 1 1 
##$CPDPRG= <>
##$CPDPRG1= <>
##$CPDPRG2= <>
##$CPDPRG3= <>
##$CPDPRG4= <mlev>
##$CPDPRG5= <mlev>
##$CPDPRG6= <mlev>
##$CPDPRG7= <mlev>
##$CPDPRG8= <mlev>
##$CPDPRGB= <>
##$CPDPRGT= <>
##$D= (0..31)
0 1 0 0 0 0 0 0 0 0.06 0 0 0 0 0 0 0.0002 0 0 0 0 0 0 0 0 0 0 0 0 0 0 
0 
##$DATE= 1165929197
##$DBL= (0..7)
120 120 120 120 120 120 120 120 
##$DBP= (0..7)
150 150 150 150 150 150 150 150 
##$DBP07= 0
##$DBPNAM0= <>
##$DBPNAM1= <>
##$DBPNAM2= <>
$$ [...]
##$SUBNAM7= <"">
##$SUBNAM8= <"">
##$SUBNAM9= <"">
##$SW= 20.6930455092707
##$SWIBOX= (0..15)
0 0 3 0 0 0 0 0 0 0 0 0 0 0 0 0 
##$SW_h= 5175.983436853
##$TD= 65536
##$TD0= 1
##$TE= 295.16
##$TE2= 300
##$TE3= 300
##$TEG= 300
##$TL= (0..7)
0 120 120 120 120 120 120 120 
##$TP= (0..7)
150 150 150 150 150 150 150 150 
##$TP07= 0
##$TPNAME0= <>
##$TPNAME1= <>
##$TPNAME2= <>
##$TPNAME3= <>
##$TPNAME4= <>
##$TPNAME5= <>
##$TPNAME6= <>
##$TPNAME7= <>
##$TPOAL= (0..7)
0.5 0.5 0.5 0.5 0.5 0.5 0.5 0.5 
##$TPOFFS= (0..7)
0 0 0 0 0 0 0 0 
##$TUNHIN= 0
##$TUNHOUT= 0
##$TUNXOUT= 0
##$USERA1= <user>
##$USERA2= <user>
##$USERA3= <user>
##$USERA4= <user>
##$USERA5= <user>
##$V9= 5
##$VALIST= <valist>
##$VCLIST= <CCCCCCCCCCCCCCC>
##$VD= 0
##$VDLIST= <DDDDDDDDDDDDDDD>
##$VPLIST= <PPPPPPPPPPPPPPP>
##$VTLIST= <TTTTTTTTTTTTTTT>
##$WBST= 1024
##$WBSW= 4
##$XGAIN= (0..3)
0 0 0 0 
##$XL= 0
##$YL= 0
##$YMAX_a= 319867
##$YMIN_a= -337549
##$ZGOPTNS= <>
##$ZL1= 120
##$ZL2= 120
##$ZL3= 120
##$ZL4= 120
##$ABSF1= 16.522
##$ABSF2= -4.171173
##$ABSG= 5
##$ABSL= 3
##$ALPHA= 0
##$AQORDER= 0
##$ASSFAC= 0
##$ASSFACI= 0
##$ASSFACX= 0
##$ASSWID= 0
##$AUNMP= <proc_1d>
##$AZFE= 0.1
##$AZFW= 0.1
##$BCFW= 0
##$BC_mod= 0
##$BYTORDP= 0
##$COROFFS= 0
##$CY= 12.5
##$DATMOD= 1
##$DC= 0
##$DFILT= <>
##$DTYPP= 0
##$F1P= 14.0000005364418
##$F2P= -0.99999901652339
##$FCOR= 0.5
##$FTSIZE= 32768
##$FT_mod= 6
##$GAMMA= 0
##$GB= 0
##$INTBC= 1
##$INTSCL= 1
##$ISEN= 128
##$LB= 0.3
##$LEV0= 0
##$LPBIN= 0
##$MAXI= 10000
##$MC2= 0
##$MEAN= 0
##$ME_mod= 0
##$MI= 0
##$NCOEF= 0
##$NC_proc= -2
##$NLEV= 6
##$NOISF1= 0
##$NOISF2= 0
##$NSP= 0
##$NTH_PI= 0
##$NZP= 0
##$OFFSET= 16.522
##$PC= 1
##$PHC0= 213.5367
##$PHC1= 3.346874
##$PH_mod= 1
##$PKNL= yes
##$PPARMOD= 0
##$PSCAL= 4
##$PSIGN= 0
##$REVERSE= no
##$SF= 250.13
##$SI= 32768
##$SIGF1= 0
##$SIGF2= 0
##$SINO= 400
##$SIOLD= 32768
##$SREGLST= <1H.DMSO>
##$SSB= 0
##$STSI= 32768
##$STSR= 0
##$SW_p= 5175.98343685301
##$SYMM= 0
##$S_DEV= 0
##$TDeff= 65536
##$TDoff= 0
##$TI= <Analysis number 999999
Compound Code 99
Book Reference 9
Project Code 9>
##$TILT= no
##$TM1= 0
##$TM2= 0
##$TOPLEV= 0
##$USERP1= <user>
##$USERP2= <user>
##$USERP3= <user>
##$USERP4= <user>
##$USERP5= <user>
##$WDW= 1
##$XDIM= 32768
##$YMAX_p= 298714863
##$YMIN_p= -128061
$$ End of Bruker specific parameters
$$ ---------------------------------
##NTUPLES= NMR SPECTRUM
##VAR_NAME=  FREQUENCY,     SPECTRUM/REAL,   SPECTRUM/IMAG
##SYMBOL=    X,             R,               I
##VAR_TYPE=  INDEPENDENT,   DEPENDENT,       DEPENDENT
##VAR_FORM=  AFFN,          ASDF,            ASDF
##VAR_DIM=   32768,         32768,           32768
##UNITS=     HZ,            ARBITRARY UNITS, ARBITRARY UNITS
##FACTOR=    0.157963299565203, 1,           1
##FIRST=     4132.6476996994, 0,             0
##LAST=      -1043.33573715361, 0,           0
##MIN=       -1043.33573715361, -128061,     0
##MAX=       4132.6476996994, 298714863,     0
$$ Real data points
##PAGE= N=1
##DATA TABLE= (X++(R..R)), XYDATA
$$ [...]
19550A23480P076J0127M889K203k053k023j454k425l361m524n207p17M413Q356
$$ 123480 130556 140683 145572 147775 145722 143699 142245 139820 136459 131935 126728 126011 130424 138780
19536A38780J0609L598O264L633j902N229J515l855L078Q584J2235J1868Q985
$$ 138780 149389 152987 159251 162884 160982 166211 167726 163871 166949 175533 187768 199636 208621
19523B08621Q419J3284K0306J3532M572M366J2503K2358J9824J4030J7897K3507
$$ 208621 217040 230324 250630 264162 268734 273100 285603 307961 327785 341815 359712 383219
19511C83219L1381M9515O5873P7841N9862K1867m028m924L093K1569L6568N6440
$$ 383219 414600 464115 529988 607829 667691 689558 685530 680606 683699 705268 741836 798276
19499G98276P6463J04665J29456J68207J80861J44189J03458J21674J88039K84400
$$ 798276 874739 979404 1108860 1277067 1457928 1602117 1705575 1827249 2015288 2299688
19489B299688M05378N69616Q35977J258753J962906L143153M968821O924012O133218
$$ 2299688 2705066 3274682 4110659 5369412 7332318 10475471 15444292 22368304 28501522
19480B8501522l10906n825870o126451m190095k443697j256646l92404M16304
$$ 28501522 28190616 22364746 16238295 12048200 9604503 8347857 7955453 8371757
19472H371757J406341K843057M883647O755143M690589k682811o779212n967062
$$ 8371757 9778098 12621155 17504802 24259945 28950534 26267723 19488511 13521449
19464A3521449l923364k430023j524084r71788o52232m83674l79147k80276j81611
$$ 13521449 9598085 7168062 5643978 4672190 4019958 3536284 3157137 2876861 2695250
19455B695250j29728j21884j18999j11734p1543j4496O8929J15601R2719O3379
$$ 2695250 2565522 2443638 2324639 2212905 2141362 2126866 2195795 2311396 2404115 2467494
19445B467494R6763J81368K79496L58921M83663P33706J140878J830263L016171
$$ 2467494 2564257 2745625 3025121 3384042 3867705 4601411 5742289 7572552 10588723
19436A0588723M944698P399519P737968J173364o217572p252551n031135k906062
$$ 10588723 15533421 22932940 30670908 31844272 25626700 18374149 13343014 10436952
19428A0436952j503617n38585L06660J285105K658853M622212O585224N425741
$$ 10436952 8933335 8394750 8701410 9986515 12645368 17267580 23852804 29278545
19420B9278545j359333o485631o436823m477208k840521j819092j211267q42790
$$ 29278545 27919212 21433581 14996758 10519550 7679029 5859937 4648670 3805880
19412C805880o00419m18293k93593k05836j58798j81056j95620j96773j80599
$$ 3805880 3205461 2787168 2493575 2287739 2128941 1947885 1752265 1555492 1374893
19403A374893j53266j22512r4924o9084m3827k4166k662R31k3415p1642q4233
$$ 1374893 1221627 1099115 1004191 935107 891280 867114 864452 865383 841968 770326 686093
19392F86093p2301n9433m8917m1960l4229k4190j9146k1558k0052j9910j3725
$$ 686093 613792 554359 505442 463482 429253 405063 385917 364359 344307 324397 310672
19381C10672o013l822j3650j0732j2924j9726j0317j4184p473m667L490k158r368
$$ 310672 304659 300837 287187 276455 263531 243805 233488 219304 211831 207164 210654 208496 199128
19368A99128m155o907q877j849k359m545l323j72j2748m401k939l967K634o218
$$ 199128 194973 188066 179189 177340 174981 170436 167113 166941 154193 149792 146853 142886 145520 139302
19354A39302r706n507j0390j084P163M361l404l116J908K27n162J295m259r994
$$ 139302 129596 124089 113699 112615 119778 124139 120735 117619 119527 119754 114592 115887 111628 101634
19340A01634j1238k479N886j659n157n480j0936m846o472o404l41P519Q111R783
$$ 101634 90396 87917 93803 92144 86987 81507 70571 65725 59253 52849 52508 60027 68138 77921
19326G7921L502L003j365j125M052r222o508k214j1005k620R0J530R734J0758
$$ 77921 81423 84426 83061 81936 85988 76766 70258 68044 57039 54419 54509 56039 65773 76531
19312G6531l861L641O470R02J706j404j1863k860m315j167l11L845P033r8k159
$$ 76531 72670 76311 82781 83683 85389 83985 72122 69262 64947 63780 63469 67314 74347 74249 72090
19297G2090j680L318J587m903p678k064O658m510j43K036K333q33R78k013q92
$$ 72090 70410 73728 75315 70412 62734 60670 67328 62818 62675 64711 67044 66211 67189 65176 64284
19282F4284j941Q298J8311J8128J0691J1090J2292P386m380l263p677k2506j7433
$$ 64284 62343 70641 88952 107080 117771 128861 141153 148539 144159 140896 133219 110713 93280
19269I3280l322M972Q503J3120J5553J4810P357o91p23o827j6796j3225m958p732
$$ 93280 89958 94930 103433 116553 132106 146916 154273 153582 152859 146032 129236 116011 111053 103321
19255A03321j5164m07j336M866R122P707P112P672R717P766Q751J0006J0657q92
$$ 103321 88157 87750 86414 91280 100402 108109 115221 122893 132610 140376 149127 159133 169790 168898
19241A68898j5306j4745j0700p399J141K756K847J7700J0727M694Q79q043k0986
$$ 168898 153592 138847 128147 120748 121889 124645 127492 145192 155919 160613 161492 153449 132463
19228A32463j4271m651n675j7839q723q676l281m733n14p33M157K415r558m418
$$ 132463 118192 113541 107866 90027 81304 72628 69347 64614 64100 63367 67524 69939 60381 55963
19214E5963m094N078l329m567m177K132l956j0811q367K666J621l364k205J168
$$ 55963 51869 56947 53618 49051 44874 47006 43050 32239 23872 26538 28159 24795 22590 23758
19200B3758K747J1249k191n972J430p77O751K743N619K313p697m682j195N715
$$ 23758 26505 37754 35563 29591 31021 30244 36995 39738 45357 47670 39973 35291 34096 39811
19186C9811m046l083k915q23l878M782L845N238K523Q682N838p440o011o377n696
$$ 39811 35765 32682 29767 28944 25066 29848 33693 38931 41454 50136 55974 48534 42523 36146 30450
19171C0450q189K934L79M189p9j317L499m201k799q5j0m707o126p671o619L733
$$ 30450 22261 25195 25574 29763 29684 28367 31866 27665 24866 24781 24771 20064 13938 6267 -352 3381
19155C381L659L58J348J457j557k767M96L128j79j545l150K641L00N94M422k394
$$ 3381 7040 7398 8746 10203 8646 5879 6375 9503 9324 7779 4629 7270 7570 8164 12586 10192
19139A0192o12P791L903K320M893m333n036J240R483J2183j444l188j0051o652
$$ 10192 9580 17371 21274 23594 28487 24154 19118 20358 29841 42024 40580 37392 27341 20689
19125B0689l341j3340k221M602Q602K591M106J95l237k727q28l691k619o494J091
$$ 20689 17348 4008 1787 6389 14991 17582 21688 21883 18646 15919 15091 11400 8781 2287 3378
19110C378l493p639K008o95l378j65O415M806N766j646l660K43k626n36J853L435
$$ 3378 -115 -7754 -5746 -6441 -9819 -9984 -3569 1237 7003 5357 1697 1940 -686 -1222 631 4066
19094D066n31l877J670J192m448K548M331L179j709J217L024j593J980N962O23
$$ 4066 3535 -342 1328 2520 -1928 620 4951 8130 6421 7638 10662 9069 11049 17011 17634
19079A7634J974K059n313j455J468n85L010j882j505k399o40j143k569J485J033
$$ 17634 19608 21667 16354 14899 16367 15782 18792 16910 15405 13006 12366 11223 8654 10139 11172
19064A1172j853n751L898K790O04k84Q048L603j33p02l777N74J982k434n267N085
$$ 11172 9319 3568 7466 10256 10860 10576 18624 22227 22094 21392 17615 18189 20171 17737 12470 17555
19048A7555j686m107J191J844K707k522j850L911j670l861K775J594n178p179
$$ 17555 15869 11762 12953 14797 17504 14982 13132 17043 15373 11512 14287 15881 10703 3524
19034C524l077O44k895J019N702J611N580M125m30J6l577j081L93m792n872Q737
$$ 3524 447 1091 -1804 -785 4917 6528 12108 16233 15803 15819 12242 11161 11554 6762 890 9627
19018I627N901N702j220j1648l866n288q08K172m180M372O825j769l320L54o671
$$ 9627 15528 21230 20010 8362 4496 -792 -1600 572 -3608 764 7589 5820 2500 2854 -3817
19003c817q40Q769j9J874L201k758n03L839P83n4k920K493J059O31m579l567l110
$$ -3817 -4657 4112 4093 5967 9168 6410 5907 9746 10529 10475 7555 10048 11107 11738 7159 3592 482
18986D82Q950J0121l547J06N914l502p202r741m070N804K360O955n519K245M283
$$ 482 9432 19553 16006 16112 22026 18524 11322 1581 -2489 3315 5675 12630 7111 9356 13639
18971A3639m2l8N931L897R968M900l938l361J74O707Q636J4689J7395K5686K7593
$$ 13639 13597 13559 19490 23387 33355 38255 34317 30956 31130 37837 46473 61162 78557 104243 131836
18956A31836R59j7116k2558j7905q702o521r36k219O449J2554J2797J9342J8960
$$ 131836 132795 115679 93121 75216 66514 59993 59057 56838 63287 75841 88638 107980 126940
18943A26940Q35j3510j9595k0721j3610j5982j5678l167M979n47M73n541l836
$$ 126940 127775 114265 94670 73949 60339 44357 28679 25512 30491 29944 30417 24876 21040
18930B1040K800P489J28o864m739k667L429L40m143O88O29K726N850L217Q662
$$ 21040 23840 31329 31457 24593 19854 17187 20616 20956 16813 17501 18130 20856 26706 29923 38585
18915C8585M177J5024J3661J0643J8638J6684J7193r332k1320j7437k1912q971
$$ 38585 42762 57786 71447 82090 100728 117412 134605 125273 103953 86516 64604 55633
18903E5633J284j972K285Q469J7149J8084J5213L774j3177k7155j5974j4344j2709
$$ 55633 56917 54945 57230 65699 82848 100932 116145 119919 106742 79587 63613 49269 36560
18890C6560j1438J157P694l160q546m586J945l334p358l34M806L848o070l831
$$ 36560 25122 26279 33973 30813 22267 17681 19626 16292 8934 8600 13406 17254 11184 7353
18876G353m15l36M582N239K219J084k37j514J251k150m549k280k532K815j277
$$ 7353 6938 6602 11184 16423 18642 19726 19489 17975 19226 17076 12527 10247 7715 10530 9253
18861I253K366l057k613L616K546m799m263J65K677k741m653k992l83K883K23
$$ 9253 11619 8562 5949 9565 12111 7312 3049 3214 5891 3150 -1503 -4495 -4878 -1995 -1772
18846a772Q067O295k173j718K645O14k229m381o629r272l521P753R931j464j631
$$ -1772 6295 12590 10417 8699 11344 11958 9729 5348 -1281 -10553 -14074 -6321 3610 2146 515
18831E15k618L087M100K416M990j197q549o49M317L623Q18l471j196j004L023
$$ 515 -2103 984 5084 7500 12490 11293 2744 2095 6412 10035 10853 7382 6186 5182 8205
18816H205M918j672l872l492p55k111j145j999j285M71K138L48K999Q32M22J152
$$ 8205 13123 11451 7579 4087 3332 1221 76 -1923 -3208 -2737 -599 -251 2748 3580 4002 5154
18800E154N840k733o343m275J26M948R01J412j085o1J770p25j685Q07n290K754
$$ 5154 10994 8261 1918 -2357 -2231 2717 3618 5030 3945 3884 5654 4929 3244 4051 -1239 1515
18784A515l834K463L134j564j006K315J192L35M898k93k020o998K0K934N709k161
$$ 1515 -2319 144 3278 1714 708 3023 4215 4550 9448 9155 7135 137 157 3091 8800 6639
18768F639q665l285q67K532O798M716M222j486L8K502L601j411j534K162k178
$$ 6639 -2026 -5311 -6178 -3646 3152 7868 12090 10604 10642 13144 16745 15334 13800 15962 13784
18753A3784l154p990m600l37l519Q34K115j443K984j058j665K789K212k322j510
$$ 13784 10630 2640 -1960 -2297 -5816 -4982 -2867 -4310 -1326 -2384 -4049 -1260 952 -1370 -2880
18738b880P49P022P02k396M754L041J39n358l954m1m457q47n723J42N063L924
$$ -2880 -2131 4891 5593 3197 7951 10992 11131 5773 1819 1778 -2679 -3526 -9249 -9107 -4044 -120
18722a20N552L375m686M223K370j749n19j793Q42p180k006K997Q896N706o997
$$ -120 5432 8807 4121 8344 10714 8965 8446 6653 7495 315 -1691 1306 10202 15908 8911
18707H911L8L800o153n357q65J881k380o349j683L241O05j217J971N253L91n76
$$ 8911 8949 12749 6596 1239 374 2255 -125 -6474 -8157 -4916 -4311 -5528 -3557 1696 2087 1511
18691A511k23O640j521n244K680J793J17k968p587p549n704K417J221k03P181
$$ 1511 1288 7928 6407 1163 3843 5636 5753 2785 -4802 -12351 -18055 -15638 -14417 -14620 -7439
18676g439J0644K795k797K75j822q79l32O16L264J335p72L697j994l863Q88j516
$$ -7439 3205 6000 3203 3478 1656 777 445 1061 4325 5660 4888 8585 6591 2728 3616 2100
18660B100k865K140P17j3246l699O040J518n52j086N419J248l414M391O958k118
$$ 2100 -765 1375 2092 -11154 -14853 -8813 -7295 -7847 -8933 -3514 -2266 -5680 -1289 5669 3551
18645C551j427K984J563n09m579o267n099M8L295M370K719O731M113M418j096
$$ 3551 2124 5108 6671 6162 1583 -4684 -9783 -9735 -6440 -2070 649 7380 11493 15911 14815
18630A4815q137q846m864n454O422O348N123l38q51N72N096K659o04J731n598
$$ 14815 6678 -2168 -7032 -12486 -6064 284 5407 5069 4218 4790 9886 12545 11941 13672 8074
18615H074o063K661J729p1L173k707m359M47K497m823m03J728M996l370P709J0121
$$ 8074 2011 4672 6401 6330 9503 6796 2437 2884 5381 558 155 1883 6879 3509 11218 21339
18599B1339J4228J7338K0879L4654L2876L918k6192l3815k8410j3555o496j1796
$$ 21339 35567 52905 73784 108438 141314 145232 119040 85225 56815 43260 36764 24968
18587B4968m871k478k742J306J15r55j600k929q63N99J0505r62q396L032Q74R69
$$ 24968 20097 17619 14877 16183 16298 15343 13743 10814 9951 10550 21055 20093 11697 14729 15603 16572
18571A6572N426R760J5310R007J3024K5298L6168J4390l1896l2743k2563j3789
$$ 16572 21998 31758 47068 56075 69099 94397 130565 144955 113059 80316 57753 43964
18559D3964p349n355o545r690k607N058O25K725O149R879K0420L1150L5967J8670
$$ 43964 36615 31260 24715 15025 12418 17476 18101 20826 26975 36854 57274 88424 124391 143061
18545A43061j8379l7666k7183j2219r891j090k224n963j0024k535l620K983Q79
$$ 143061 124682 87016 59833 47614 37723 36633 34409 28446 18422 15887 12267 15250 16129
18532A6129l891k244j957L886L856m703j488K149j582j478J0532J1615J1440J1253
$$ 16129 12238 9994 8037 11923 15779 11076 9588 11737 10155 8677 19209 30824 42264 53517
18518E3517K3363L3546K6998j4399l4142k9748j8053j4568p410m302o288k533
$$ 53517 76880 110426 137424 123025 88883 59135 41082 26514 19104 14802 8514 5981
18506E981m110R3J151K061m487L530M560K984o999j0889J498J200K817N818j406
$$ 5981 1871 1964 3115 5176 689 4219 8779 11763 4764 -6125 -4627 -3427 -610 5208 3802
18491C802j384J78j004J233M237j450J36K369j970J02j013k135M264n210o493
$$ 3802 2418 2596 1592 2825 7062 5612 5748 8117 6147 6249 5236 3101 7365 2155 -4338
18476d338M251K093j669j298j348M363J121m829j367j28n26J049o43P454j92M84
$$ -4338 -87 2006 337 -961 -2309 2054 3175 -1654 -3021 -3149 -3675 -2626 -3269 4185 3993 4477
18460D477J957P744K031j036o951J820l167o62k450K22J993l008q63j190l631
$$ 4477 6434 14178 16209 15173 8222 10042 6875 6213 3763 3985 5978 2970 2107 917 -2714
18445b714n99o91o36M592j806m725J998n27L974Q753Q869K351J394l50q371K321
$$ -2714 -3313 -4004 -4640 -48 -1854 -6579 -4581 -5108 -1134 7619 16488 18839 20233 19883 11512 13833
18429A3833N979m611P036L245j165m416J740q138q113l195o738L170R886j968
$$ 13833 19812 15201 22237 25482 24317 19901 21641 13503 5390 2195 -4543 -1373 8513 6545
18415F545j560K041P261k519q256J415M794p9o580m310P599J2861P47m427L548
$$ 6545 4985 7026 14287 11768 3512 4927 9721 9642 3062 -1248 6351 19212 19959 15532 19080
18400A9080J6324J6882M312J0209K3178K9638J5827m47j7628k4835k0733j4343
$$ 19080 35404 52286 56598 66807 89985 119623 135450 135003 117375 92540 71807 57464
18388E7464r233j1795k432l573l364l959N559L406J180q667n777K640L197R54
$$ 57464 48231 36436 34004 30431 27067 23108 28667 32073 33253 24586 18809 21449 24646 25600
18374B5600J94K166K518K987O719M018O511J4225J3912J9106K1276J0755L301
$$ 25600 25794 27960 30478 33465 40184 44202 50713 64938 78850 97956 119232 129987 133288
18361A33288j9302k3198j6197j2193j3491r539o876M598N349j701M014J1157K1208
$$ 133288 113986 90788 74591 62398 48907 39368 32492 37090 42439 40738 44752 55909 77117
18348G7117K0551K1794M796j7806k0580j3281j6080j6937j1846p670nr49k508
$$ 77117 97668 119462 124258 106452 85872 72591 56511 39574 27728 20058 20053 19104 16596
18335A6596j84j467k203m8M122p264o328M533N459N494L936k195K363R472P148
$$ 16596 16412 14945 12742 12694 16816 9552 3224 7757 13216 18710 22646 20451 22814 32286 39434
18320C9434P264J0717J6475K0888J6561J183o131k2484k2186j3234n478k266n634
$$ 39434 46698 57415 73890 94778 111339 112522 106391 83907 61721 48487 43009 40743 35109
18307C5109m349n585j0728l025l073m62m542l241M180M876L481P310J262o295
$$ 35109 30760 25175 14447 11422 8349 7887 3345 104 4284 9160 12641 19951 21213 14918
18293A4918q721n3j838J402K201K848k187j06j131o903m359J500K481K704j396
$$ 14918 6197 6144 4306 5708 7909 10757 8570 8464 7333 430 -3929 -2429 52 2756 1360
18278A360L402Q614j1311j898M215J598J535J388l017l729j206k19l27R77q627
$$ 1360 4762 13376 2065 167 4382 5980 7515 8903 5886 2157 951 732 405 1382 -7245
18263g245k913Q133M21M248J1641P499M691l552j0476n250l331M562o033n705
$$ -7245 -10158 -2025 -1604 2644 14285 21784 26475 22923 12447 7197 3866 8428 2395 -3310
18249c310L569J06n704m182K555K483k977j789n75o08M865M835K78m842J187M336
$$ -3310 259 365 -5339 -9521 -6966 -4483 -7460 -9249 -9824 -10432 -5567 -732 -454 -5296 -4109 227
18233B27L326j233L390O489N678l629q068J613j236k856k804Q52p78k462K23M949
$$ 227 3553 2320 5710 12199 17877 14248 6180 7793 6557 3701 897 1749 971 -1491 -1268 3681
18217C681m2r69K22j075r6K297M750o06r83n33n95M029P518J082o609l789l774
$$ 3681 3639 2670 2892 1817 1721 4018 8768 8162 7179 6646 6051 10080 17598 18680 12071 8282 4508
18200D508j256j864N10M298K540j91o179N193L901O031Q901J587l931m357J122
$$ 4508 3252 1388 1898 6196 8736 8545 2366 7559 11460 17491 26392 27979 24048 19691 20813
18185B0813L457k65M54j647k853J341J412m311j864k770m333L26j533r747l535
$$ 20813 24270 24005 24459 22812 19959 21300 22712 18401 16537 13767 9434 9760 8227 -1520 -5055
18170e055l74L09o65k583M726J748O018O875l97m95j508j641m543M382J728o128
$$ -5055 -5429 -5120 -5785 -8368 -3642 -1894 4124 10999 10602 10107 8599 6958 2415 6797 8525 2397
18154B397K51M509K872r63j07L438K980M160R510L151k255R29q455j2032n709
$$ 2397 2648 7157 10029 9066 8959 12397 15377 19537 29047 32198 29943 30872 22417 10385 4676
18139D676o647n445k17M250P328p58K391L752P3j307L346M074P2o796m451n055
$$ 4676 -1971 -7416 -7633 -3383 3945 3187 5578 9330 9403 8096 11442 15516 15588 8792 4341 -714
18123g14j923n130J855J1431J1707M130j0835o143l696L838N200m239k115J409
$$ -714 -2637 -7767 -5912 5519 17226 21356 10521 4378 682 4520 9720 5481 3366 4775
18109D775j95o184k308R673J1359K323n520l830M657p87n15K578L996j856p190
$$ 4775 4580 -1604 -3912 5761 17120 19443 13923 10093 14750 13963 13448 16026 20022 18166 10976
18094A0976n657Q71R09r219K504j907L495K902J45k755j970N886K080J665L008
$$ 10976 5319 6190 7099 -2120 384 -1523 1972 4874 5019 2264 294 6180 8260 9925 12933
18079A2933J134O47Q44K629R09j153O707K035l804o027p933p088j614n974k538
$$ 12933 14067 14714 15558 18187 19096 17943 24650 26685 22881 16854 8921 1833 219 -5755 -8293
18064h293N117o62L802J3435K538l223j553k579J863K154k745L928n289p121J559
$$ -8293 -3176 -3838 -36 13399 15937 12714 11161 8582 10445 12599 9854 13782 8493 1372 2931
18049B931J180L3L093M611N428P853K528J287K341K067R83j0765r152q787k057
$$ 2931 4111 4144 7237 11848 17276 25129 27657 28944 31285 33352 34335 23570 14418 5631 3574
18034C574K780O005L083n660k791K801K68K23K052l030M214k042p991m750N190
$$ 3574 6354 12359 15442 9782 6991 9792 10060 10283 12335 9305 13519 11477 3486 -1264 3926
18019C926J1465Q299R912L871K98m337p429m061n211j905l315K785M374O156o006
$$ 3926 15391 23690 33602 37473 37771 33434 26005 21944 16733 14828 11513 14298 18672 24828 18822
18004A8822o328j968K849O956O814L936J064J456N070O499P59K751n159j0468
$$ 18822 12494 10526 13375 20331 27145 31081 32145 33601 38671 45170 45929 48680 43521 33053
17990C3053j2605j424M286P900Q671J188j575N188O44n818l869k371p925j899
$$ 33053 20448 19024 23310 31210 39881 41069 39494 44682 45326 39508 35639 33268 25343 23444
17976B3444M311Q62k755j516L107J1769J0348N571M695J228J846K532J345K495
$$ 23444 27755 28617 25862 24346 27453 39222 49570 55141 59836 61064 62910 65442 66787 69282
17962F9282L48O51o319j1558k009l070l883l215M451O867M646l519K682N811L007
$$ 69282 69630 70281 63962 52404 50395 47325 43442 40227 44678 51545 56191 52672 55354 61165 64172
17947F4172K102P226J636m429K387M855k86L143P582K597L534K292L455l194r181
$$ 64172 66274 73500 75136 70707 73094 77949 77663 80806 88388 90985 94519 96811 100266 97072 87891
17932H7891o463N39L35J831O62N824M877M125L744Q296O577j481M572L591k078
$$ 87891 81428 81967 82302 84133 84795 90619 95496 99621 103365 111661 118238 116757 121329 124920 122842
17917A22842N231M446M633R394J2804P648J1512J2739P125l05m220M811J0015
$$ 122842 128073 132519 137152 146546 159350 166998 178510 191249 198374 198069 193849 198660 208675
17904B08675O465P320N953J2482J1930J0228J3268J0998J2535K1414J6264K6116
$$ 208675 215140 222460 228413 240895 252825 263053 276321 287319 299854 321268 337532 363648
17892C63648L4504L7223M2289N4436O8962O1404K6654J3167K9008N1702O9436
$$ 363648 398152 435375 477664 532100 601062 662466 689120 702287 731295 782997 852433
17881H52433R4551J11990J37863J73421K01951K36059K98881M04360N53497P75632
$$ 852433 946984 1058974 1196837 1370258 1572209 1808268 2107149 2511509 3065006 3840638
17871C840638J123393J692359K648004M232952O365783P255318K771594m514653
$$ 3840638 4964031 6656390 9304394 13537346 19903129 27158447 29930041 25415388
17863B5415388p043768n642441l642941k263670j438064r47527o52748m93517
$$ 25415388 18371620 12729179 9086238 6822568 5384504 4436977 3784229 3290712
17855C290712l87481k87444j90537j19313p0801m9806k8095K1840R4926J63891
$$ 3290712 2903231 2615787 2425250 2305937 2235136 2185330 2157235 2179075 2274001 2437892
17845B437892K32884K85779L55376M81585O99922J025838J522932K375112L822810
$$ 2437892 2670776 2956555 3311931 3793516 4493438 5519276 7042208 9417320 13240130
17836A3240130N834736O988451L486020l547325o610145n541585l577140k149651
$$ 13240130 19074866 26063317 29549337 26002012 19391867 13850282 10273142 8123491
17828H123491j235896o66484k55815J24444N67109J146187K028439L460217N451890
$$ 8123491 6887595 6221111 5965296 6089740 6656849 7803036 9831475 13291692 18743582
17819A8743582O763014L650026l333219o633830n704034l757905k347555j523820
$$ 18743582 25506596 29156622 25823403 19189573 13485539 9727634 7380079 5856259
17811E856259j051778p42142n37581m18743l33609k40278j70218j24187r1668
$$ 5856259 4804481 4062339 3524758 3106015 2772406 2532128 2361910 2237723 2146055
17802B146055o6042k3153M6163J07150J66461K18181K72086L58314N43438Q36468
$$ 2146055 2080013 2056860 2103023 2210173 2376634 2594815 2866901 3225215 3768653 4605121
17792D605121J281719K031979L318845N243568O849655M501961k560794o536702
$$ 4605121 5886840 7918819 11237664 16481232 23330887 27832848 25272054 18735352
17784A8735352n875745l899318k428529j551682j045237p30423n37292m02026
$$ 18735352 12859607 8960289 6531760 4980078 3934841 3204418 2667126 2265100
17776B265100k97426k37551j91378j54057j37521j25294j13680q9644n6816l3240
$$ 2265100 1967674 1730123 1538745 1384688 1247167 1121873 1008193 918549 861733 828493
17766H28493k4100m2516o2294n9274o2865n9286m7663l7752k7364k9887k3000
$$ 828493 804393 761877 699583 640309 577444 518158 470495 432743 405379 375492 352492
17755C52492k0910j9626r636p911j2829j3351n905o788j1488q274o725n273j5568
$$ 352492 331582 311956 302320 294409 281580 268229 262324 255536 244048 235774 229049 223776 208208
17742B08208j4638k115K411M1q417r099n482j2981q351J856Q72j242o311j1367
$$ 208208 193570 191455 193866 193907 185490 176391 170909 157928 149577 151433 152305 151063 144752 133385
17728A33385j4803r370n681J636K81N15J96k469k333r397n285L225L82o023o082
$$ 133385 118582 109212 103531 105167 105448 105963 106159 103690 101357 91960 86675 89900 90282 84259 78177
17713G8177j135N148J0972J0584N355j033m156m116o118m891j174l536M487o23
$$ 78177 77042 82190 93162 103746 109101 108068 103912 99796 93678 88787 87613 84077 88564 87941
17699H7941O69j042l500j212K639k610n586p550j3538o796J629l289j1846K331
$$ 87941 88610 87568 84068 82856 85495 82885 77299 69749 56211 49415 51044 47755 35909 38240
17685C8240K249L624o084R511J0617M082Q981J231J120m941o695k771l98J392
$$ 38240 40489 44113 38029 47540 58157 62239 71220 72451 73571 68630 61935 59164 58766 60158
17671F0158l959p941p511m417p400J896J1908J5544J2833k228l236n698m115J262
$$ 60158 56199 48258 40747 36330 28930 30826 42734 58278 71111 68883 65647 59949 55834 57096
17657E7096k949k371J32j399j644J115L959K276P077j048o72k192K835p998j3835
$$ 57096 54147 51776 51908 50509 48865 49980 53939 56215 63292 62244 61572 59380 62215 54217 40382
17642D0382j403k433p456m692j821m114n882R187Q076M972Q282M36m899L647O614
$$ 40382 38979 36546 29090 24398 22577 18463 12581 21768 29844 34816 43098 43534 38635 42282 48896
17627D8896r198q484k500L70Q48j673j613q70M354P315J0196K667r260o809n187
$$ 48896 39698 31214 28714 29084 29932 28259 26646 25776 30130 37445 47641 50308 41048 34239 29052
17612B9052K623l432p364J236P117K669j181L087O815L282J1m107q81J807k168
$$ 29052 31675 28243 20879 22115 29232 31901 30720 33807 40622 43904 43915 39808 38927 40734 38566
17597C8566j831r800l546P386M806L502O210o57j092j14J191j386o15l46K333
$$ 38566 36735 26935 23389 30775 35581 39083 45293 44636 43544 43430 44621 43235 42620 42274 44607
17582D4607J449m307k876k496n557j754l713N644L365p97M192j375l287K566L041
$$ 44607 46056 41749 38873 36377 30820 29066 25353 30997 34362 33565 37757 36382 33095 35661 38702
17567C8702k645o33Q507M037l752j541K897P30k319p436j1151n524k287J629K208
$$ 38702 36057 35424 43931 47968 44216 42675 45572 46302 43983 36547 25396 19872 17585 19214 21422
17552B1422m242k12L942m46O518L923N563p38m58K738p572l736l351L357L542
$$ 21422 17180 16968 20910 20464 26982 30905 36468 35730 35272 38010 30438 26702 23351 26708 30250
17537C0250n858k750q64K832N762N930K053K444r282j971p603q766q5n815l749
$$ 30250 24392 21642 20778 23610 29372 35302 37355 39799 30517 28546 20943 12177 12092 6277 2528
17522B528L798Q524R39j949L107J1928M027j843j425Q21m723k647o927j6309q396
$$ 2528 6326 14850 15789 13840 16947 28875 32902 31059 29634 30455 25732 23085 16158 -151 -8547
17507h547j151J2433N555L603j816K546K922l261K13K750k165m01r31O56J388
$$ -8547 -9698 2735 8290 11893 10077 12623 15545 12284 12497 15247 13082 12681 11750 12406 13794
17492A3794o62k940l727m205O590K715P021K19J164M779K577m173j0452j6765
$$ 13794 13132 10192 6465 2260 8850 11565 18586 18805 19969 24748 27325 23152 12700 -4065
17478d065j4069j640J21M719N321L443P074J625o200j769J854k365M445M168j551
$$ -4065 -18134 -19774 -19653 -14934 -9613 -6170 904 2529 -3671 -5440 -3586 -5951 -1506 2662 1111
17463A111j856J098K963j789k292J92n481M034P9j79K772K218J0356r6j407k190
$$ 1111 -745 353 3316 1527 -765 -573 -6054 -2020 -1941 -2120 652 2870 13226 13130 11723 9533
17447I533p726n406K091k110k51l476O435r41l882O657K008j587l897k738K294
$$ 9533 1807 -3599 -1508 -3618 -3869 -7345 -910 -1851 -5733 924 2932 1345 -2552 -5290 -2996
17432b996J286l939j558N835L139O051N56l98p21K2p904o990J296M139J377P87
$$ -2996 -1710 -5649 -7207 -1372 1767 7818 8374 7976 7255 7277 -627 -7617 -6321 -2182 -805 -18
17416a8J976J269L341m622L312J679k885l553M5k484j027L751l46j424j361L552
$$ -18 1958 3227 6568 1946 5258 6937 4052 499 544 -1940 -2967 784 438 -986 -2347 1205
17400A205L779q54j189m813K970k3J120N224n193n583N130L7j18k041n55K384
$$ 1205 4984 4130 2941 -1872 1098 1075 2195 7419 2226 -3357 1773 1810 1692 -349 -904 1480
17384A480L004J559K326q03L9P98O6M736K564L030o596m123k461o335r713R43
$$ 1480 4484 6043 8369 7566 7605 8403 8469 13205 15769 18799 12203 8080 5619 -716 -10429 -9486
17368i486N272Q154N542O286o829p573K496R82L398M608L667m88j63o349m339
$$ -9486 -4214 3940 9482 15768 8939 1366 3862 4844 8242 12850 16517 16029 15866 9517 5178
17353E178M143M123l288m016k24J502L499R808m11o454K645K236J199J520j637
$$ 5178 9321 13444 10156 6140 5916 7418 10917 20725 20314 13860 16505 18741 19940 21460 19823
17338A9823O508J308M100J4633J6711J5796J5006J7108o0r258j8133k3422j1416
$$ 19823 26331 27639 31739 46372 63083 78879 93885 110993 110933 101675 83542 60120 48704
17325D8704o975j0109p404k648j250J056O206p596M681K077m878n952m788m562
$$ 48704 41729 31620 24216 21568 20318 21374 27580 19984 24665 26742 21864 15912 11124 6562
17311F562J622M71K404J3353O479J625K554P341J0592J9040K7832K1384O056m724
$$ 6562 8184 8655 11059 24412 30891 32516 35070 42411 53003 72043 99875 121259 127315 122591
17297A22591k2762k2246j9330p532m730l302M359Q82O575K368O993P403J9007
$$ 122591 99829 77583 58253 50721 45991 42689 47048 47930 54505 56873 63866 71269 90276
17284I0276J7351P408j7861j3273j5160j1604j4387p913p985O175m128r51l028
$$ 90276 107627 115035 97174 83901 68741 57137 42750 34837 26852 33027 28899 27948 24920
17271B4920j0499m372q8N42O680J410K720K597m004o32K195l1J122J4812J2262
$$ 24920 14421 10049 9961 10503 17183 18593 21313 23910 19906 19274 21469 21438 22560 37372 49634
17256D9634M519J1797K6187K4860R089j2880k1574k0804j3481j0925q151j0245
$$ 49634 54153 65950 92137 116997 126086 113206 91632 70828 57347 46422 38271 28026
17244B8026m208l969k652k996J221o69m414L947N147m965L271m616p19L41m876
$$ 28026 23818 19849 17197 14201 15422 14753 10339 14286 19433 14468 17739 13123 12404 12745 7869
17229G869J932N900r06q173k140L593J647K236M895N456K294p104k07l914q978
$$ 7869 9801 15701 14795 6622 4482 8075 9722 11958 16853 22309 24603 17499 17292 13378 4400
17214D400l613K482K069m136l457j169l484M774K091O834P854m309m315K150L400
$$ 4400 787 3269 5338 1202 -2255 -3424 -6908 -2134 -43 6791 14645 10336 6021 8171 11571
17199A1571o58p882M79K881Q71n635k207j323j298K28O263L94l916o953k463O483
$$ 11571 10913 3031 3510 6391 7262 1627 -580 -1903 -3201 -2973 3290 3684 -232 -7185 -9648 -3165
17183c165R75j944K467j30P874j522l833k567K338K168M920n633m065m172K540
$$ -3165 -2190 -4134 -1667 -1797 6077 4555 722 -1845 493 2661 7581 1948 -2117 -6289 -3749
17168c749O17k526j404K976O243M118q156j366L528k79m306J746K116J415O179
$$ -3749 -3132 -5658 -7062 -4086 2157 6275 -1881 -3247 281 2 -4304 -2558 -442 973 7152
17153G152l99p921J224m534M158J108p878j80L105R69P252j64j759J393K276J648
$$ 7152 6753 -1168 56 -4478 -320 788 -7090 -7270 -4165 -3196 4056 3892 2133 3526 5802 7450
17137G450j587K584P44m228p569k079Q09L34j150K157K45o13L020M760l136J088
$$ 7450 5863 8447 9191 4963 -2606 -4685 -3876 -3542 -4692 -2535 -2290 -2903 117 4877 1741 2829
17121B829o897l43P80o9p95k899n792L146O761L099j799N211L084k032l496j839
$$ 2829 -4068 -4411 -3631 -3700 -4495 -7394 -13186 -10040 -3279 -180 -1979 3232 6316 4284 788 -1051
17105a051j870J867k655o871l273M340M089R456m675J910J057j0r1j769k495k456
$$ -1051 -2921 -1054 -3709 -10580 -13853 -9513 -5424 4032 -643 1267 2324 2314 2223 454 -2041 -4497
17089d497n826k611M618N483L099p84p247O566l93r61n393L151J4143m369o327
$$ -4497 -10323 -12934 -8316 -2833 266 -518 -7765 -1199 -1592 -2553 -7946 -4795 9348 4979 -1348
17074a348Q29J89k83O38J414L016j344j312l88O97l425j130j614K502K041O702
$$ -1348 -519 -330 -613 25 1439 4455 3111 1799 1411 2108 -1317 -2447 -4061 -1559 482 7184
17058G184J002j110m154p837k075k620K373k156k936K486k59L383M010l36l741
$$ 7184 8186 7076 2922 -4915 -6990 -9610 -7237 -9393 -12329 -9843 -10102 -6719 -2709 -3045 -6786
17043f786l896K727N29l987q16O512O30j052J1215l387p533L152l655m313L163
$$ -6786 -10682 -7955 -7426 -11413 -12229 -5717 -5087 -6139 5076 1689 -5844 -2692 -6347 -10660 -7497
17028g497N430N180L338K477j264K89m767Oj061K743j969m570j907J272K818r41
$$ -7497 -2067 3113 6451 8928 7664 7953 3186 3192 2131 4874 2905 -1665 -3572 -2300 518 -423
17012d23J662L988k519n071j289J523l045q615P223J1722n576k681l643q67M539
$$ -423 1239 5227 2708 -2363 -3652 -2129 -5174 -13789 -6566 5156 -420 -3101 -6744 -7611 -3072
16997c072P713k231M58j535N23j359K848m83J1l492k191M74N075M165n03O167
$$ -3072 4641 2410 2868 1333 1856 497 3345 2862 2873 -619 -2810 -2336 2739 6904 6401 12568
16981A2568l061n968p493N818K198j016M06J557p08J63j394l626m076n04j511
$$ 12568 9507 3539 -3954 1864 4062 3046 3452 5009 4301 4464 3070 -556 -4632 -5136 -6647
16966f647k28N718M812K794j662O235n532m928m935K59N652L648K781J573q48
$$ -6647 -6875 -1157 3655 6449 4787 11022 5490 562 -4373 -4114 1538 5186 7967 9540 8692
16951H692n982k9J997k863k647o50L284Q62l647M67N175J011j498n0l708m079
$$ 8692 2710 2681 4678 1815 -832 -1482 1802 2664 -983 -516 4659 5670 4172 4122 414 -3665
16935c665n491M18K645O597J206n693j248p278j480m1o27M579O237l867k816N107
$$ -3665 -9156 -8738 -6093 504 1710 -3983 -5231 -12509 -13989 -14030 -14657 -10078 -3841 -7708 -10524 -5417
16919e417J1119k232J451j961p252o356n215P109J2463N543j347o631N8L607q73
$$ -5417 5702 3470 4921 2960 -4292 -10648 -15863 -8754 3709 9252 7905 1274 1332 4939 4066
16904D066l949j919l55l111m609m34L745O651n013J191O819l323K959K938k118
$$ 4066 117 -1802 -2157 -5268 -9877 -10311 -6566 85 -4928 -3737 3082 -241 2718 5656 3538
16889C538K1l085J072n967q350J882Q53L793K387M529M687l971M788k188l398
$$ 3538 3559 474 1546 -4421 -12771 -10889 -10036 -6243 -3856 673 5360 1389 6177 3989 591
16874E91J55j090k420l549m161p4N86k9J196J945M194k199m071J568K275K456
$$ 591 746 -344 -2764 -6313 -10474 -10548 -9962 -9991 -8795 -6850 -2656 -4855 -8926 -7358 -5083 -2627
16858b627j125k607k656J467L194m880L149O241j218J573q60N119J036J076N26
$$ -2627 -3752 -6359 -9015 -7548 -4354 -9234 -6085 156 -1062 511 -349 4770 5806 6882 7408
16843G408n674l424l838J473M033K488m815n500M7J284O241J434L837N491P15
$$ 7408 1734 -1690 -5528 -4055 -22 2466 -2349 -7849 -7802 -6518 -277 1157 4994 10485 11200
16828A1200p55n119l665k414L180k445q864Q20K75J023M852O115k689M435n866
$$ 11200 10445 5326 1661 -753 2427 -18 -8882 -8062 -7787 -6764 -1912 4203 1514 5949 83
16813H3k279P44n562j980O547P025m510Q78J437O583m834n969L23L557k10o421
$$ 83 -2196 -1452 -7014 -8994 -2447 4578 68 946 2383 8966 4132 -1837 -1514 2043 1833 -4588
16797d588k848O409N10o11l094P13N25M187M159p009o700J931R783j572m629k758
$$ -4588 -7436 -1027 -517 -1128 -4222 -3509 -2984 1203 5362 -1647 -8347 -6416 3367 1795 -2834 -5592
16781e592j01l279m01L314N169J071j031n212N18l420J856O677J348K963L586
$$ -5592 -5693 -8972 -9373 -6059 -890 181 -850 -6062 -5544 -8964 -7108 -431 917 3880 7466
16766G466M59n664j462l72n26K305r9Q795L430n141k519p785o926p416O61M664
$$ 7466 7925 2261 799 427 -99 2206 2107 10902 14332 9191 6672 -1113 -8039 -15455 -14794 -10130
16750a0130K989K961O121k532M787L849j1869q868M187P910K810j924p943J989
$$ -10130 -7141 -4180 1941 -591 4196 8045 -3824 -12692 -8505 -595 2215 291 -7652 -5663
16736e663J342n778J152R45m707k711N090L024m993O78O476j07k51q95Q03l145
$$ -5663 -4321 -10099 -8947 -8002 -12709 -15420 -10330 -7306 -12299 -11621 -5145 -5252 -5503 -6398 -5595 -8740
16720h740P853R363r19q961j90p69L891q00q78L153q378l634K908M159m854j918
$$ -8740 -887 8476 7557 -1404 -1594 -2363 1528 728 -150 3003 -5375 -9009 -6101 -1942 -6796 -8714
16704h714K301M478K874N308l576K33J040j0309j940N514J038K337k89j315m003
$$ -8714 -6413 -1935 939 6247 2671 2904 3944 -6365 -8305 -2791 -1753 584 295 -1020 -5023
16689e023r43L050L936k288n668q63L803R45j24K869o385R58M164j811k633l736
$$ -5023 -5966 -2916 1020 -1268 -6936 -7799 -3996 -3051 -3175 -306 -6691 -5733 -1569 -3380 -6013 -9749
16673i749M05K329n58R08K926j362O908N321l821j896J171j201l144J704l473
$$ -9749 -9344 -7015 -7573 -6665 -3739 -5101 1807 7128 3307 1411 2582 1381 -1763 -59 -3532
16658c532m721M04O796P021n78q640m182O923K407L921K130R12M809k682K481
$$ -3532 -8253 -7849 -1053 5968 5390 -3250 -7432 -509 1898 5819 7949 8861 13670 10988 13469
16643A3469q20m976k974l610l534k23m628j125M359L39L436J888O271l959l764
$$ 13469 12649 7673 4699 1089 -2445 -2668 -7296 -8421 -4062 -3723 -287 1601 7872 3913 149
16628A49j493K866j8j761L139J147K098n569o698o285L415P935j554r75q16N903
$$ 149 -1344 1522 1504 -257 2882 4029 6127 558 -6140 -12425 -9010 -1075 -2629 -3604 -4420 1483
16612A483L5n715m01k993K275J565k586J468Q12o1L342P600K259n021o582J167
$$ 1483 1518 -4197 -4598 -7591 -5316 -3751 -6337 -4869 -4057 -4118 -776 6824 9083 4062 -2520 -1353
16596a353n981j862M532M021O636J376j1612j0223K462Q870M773J256N048m67
$$ -1353 -7334 -9196 -4664 -643 5993 7369 -4243 -14466 -12004 -3134 1639 2895 7943 7476
16582G476N1l594l353j932m6J498L13L49J640j398m344J29K404L824m097p092
$$ 7476 7527 3933 580 -1352 -1398 100 413 762 2402 1004 -3340 -3211 -807 3017 -1080 -8172
16566h172m423J768J701J0367K417K445M934q301p846K426l896M082K135n662
$$ -8172 -12595 -10827 -9126 1241 3658 6103 11037 2736 -5110 -2684 -6580 -2498 -363 -6025
16552f025m367k317N138J2274k443M390j242m849j165m550N752j325m014N03K802
$$ -6025 -10392 -12709 -7571 4703 2260 6650 5408 559 -606 -5156 596 -729 -4743 -4240 -1438
16537a438L595J886N853O054j054n208K802J768L849m04l111m551k908j295m438
$$ -1438 2157 4043 9896 15950 14896 9688 12490 14258 18107 17703 14592 10041 7133 5838 1400
16522A400l144r53J78o408l247p746K757l389j622O616K624L328J622P632O543
$$ 1400 -1744 -2697 -2519 -8927 -12174 -19920 -17163 -20552 -22174 -15558 -12934 -9606 -7984 -352 6191
16507F191J424k322N56p044m074O319l291j598P8m0j394J853K72P344p00j202
$$ 6191 7615 5293 5849 -1195 -5269 1050 -2241 -3839 -3761 -3801 -5195 -3342 -3070 4274 3574 2372
16491B372N458n088n753k481N065P920m571r813r288rL74P0P040O717l951J961
$$ 2372 7830 2742 -3011 -5492 -427 7493 2922 -6891 -16179 -16188 -15814 -15744 -8704 -1987 -5938 -3977
16475c977M327k01l121P81M090k854J748m060N63Q410N052p455p597j402k203
$$ -3977 350 149 -2972 -2191 1899 -955 793 -3267 -2704 5706 10758 3303 -4294 -5696 -7899
16460g899R5O47P741o59j937k297k283j825J190r41L782K695l119L070O441O40
$$ -7899 -7804 -7157 584 -75 -2012 -4309 -6592 -8417 -7227 -8168 -4386 -1691 -4810 -1740 4701 5341
16444E341l733K315j236p56k155k535j34L824L331J588j014o886n408m214k302
$$ 5341 1608 3923 2687 1931 -224 -2759 -2893 931 4262 5850 4836 -2050 -7458 -11672 -13974
16429a3974M192J0004N070k509l486q552O949K220J31o630k67N879P841k937o885
$$ -13974 -9782 222 5292 2783 -703 -9255 -2306 -86 45 -6585 -6852 -973 6868 3931 -2954
16414b954r510j35N711J000j929n07Q924N396q05j1504k780Q646N968P39l846
$$ -2954 -12464 -12599 -6888 -5888 -7817 -8324 600 5996 5191 -6313 -9093 -447 5521 6260 2414
16399B414l095K175R557n098J25J392L67j601N074J125p143k496J727Q9o086o056
$$ 2414 -681 1494 11051 5953 6078 7470 7837 6236 11310 12435 5292 2796 4523 4612 -1474 -7530
16383g530l98J999j279j958M394N431l618l280k509J031J524L535N337J347n286
$$ -7530 -7928 -5929 -7208 -9166 -4772 659 -2959 -6239 -8748 -7717 -6193 -2658 2679 4026 -1260
16368a260k916K937O69l961m013j537j636K025J618l31m0J595J589J139l170R13
$$ -1260 -4176 -1239 -570 -4531 -8544 -10081 -11717 -9692 -8074 -8405 -8445 -6850 -5261 -4122 -7292 -6379
16352f379N886N37P92n778J063k48m77k682n91N236j759j104k311J486M226j459
$$ -6379 -493 44 836 -4942 -3879 -4127 -4604 -7286 -7877 -2641 -4400 -5504 -7815 -6329 -2103 -3562
16336c562j695m96K630K208J172p90r015o925O514J1527K832N4n429l235J308
$$ -3562 -5257 -5753 -3123 -915 257 -533 -9548 -16473 -9959 1568 4400 4454 -975 -4210 -2902
16321b902m51n18N036O045J630k18k222j132J705m455l004m07L340q08K349K110
$$ -2902 -3353 -3871 1165 7210 8840 8622 6400 5268 6973 2518 -486 -893 2447 1639 3988 6098
16305F098P62L137j395m329n192n038k661m38M445L157L252p057p164N05Q380
$$ 6098 6860 9997 8602 4273 -919 -5957 -8618 -9056 -4611 -1454 1798 -5259 -12423 -11918 -3538
16290c538J089k298Q88P400p426l018Q538M453j881r727p34J539k310N162K369
$$ -3538 -2449 -4747 -3859 3541 -3885 -6903 1635 6088 4207 -5520 -6254 -4715 -7025 -1863 506
16275E06J315J204j390j927l368K224n099M044L089M80l716l241j709J019K398
$$ 506 1821 3025 1635 -292 -3660 -1436 -6535 -2491 598 1078 -2638 -5879 -7588 -6569 -4171
16260d171R690K646n571n671j1666j386Q511J626M780P743J191p61l872O48L232
$$ -4171 5519 8165 2594 -3077 -14743 -16129 -7618 -5992 -1212 6531 7722 6961 3089 3737 6969
16245F969m38l422o56R75p882j026J48M101j520J343j012K144N30m756J045Q74
$$ 6969 6531 3109 2453 3428 -4454 -5480 -5332 -1231 -2751 -1408 -2420 -276 254 -4502 -3457 -2583
16229b583j433L509K925l468o7j913j869j665M89k758n541j180J1415N385N427
$$ -2583 -4016 -507 2418 -1050 -1117 -3030 -4899 -6564 -6075 -8833 -14374 -15554 -4139 1246 6673
16214F673J107n09J315n026j2441l822O995J0480K810p742K590k066k064o132
$$ 6673 7780 7271 8586 3560 -8881 -12703 -5708 4772 7582 -160 2430 364 -1700 -7832
16200g832M195j086P92L40L607J036k620P3M629l130j303P6o254k234P5J813L906
$$ -7832 -3637 -4723 -3931 -3591 16 1052 -1568 -1495 3134 4 -1299 -1223 -7477 -9711 -9636 -7823 -3917
16183c917J593m109O12L259K09K392q71n09J5k436L25j35m045l515R55N017J701
$$ -3917 -2324 -6433 -5821 -2562 -2353 39 -832 -1341 -1326 -3762 -3437 -3572 -7617 -11132 -10177 -5160 -3459
16166c459K868K91n940L087j025j419M2J852l132O55O773k222m393P68l60l818
$$ -3459 -591 -300 -6240 -3153 -4178 -5597 -5555 -3703 -6835 -6180 593 -1629 -6022 -5254 -5614 -9432
16150i432N147K273K43j60L541k348J103K577m718j705n750k310p17J209l069
$$ -9432 -4285 -2012 -1769 -1929 1612 -736 367 2944 -1774 -3479 -9229 -11539 -12256 -11047 -14116
16135a4116j868Q170L751l806J4K475L131k684N139O33m484N373j58p173J911
$$ -14116 -15984 -7814 -4063 -7869 -7855 -5380 -2249 -4933 206 839 -3645 1728 1570 -5603 -3692
16120c692Q2r529R00m454N456O798M142N634k048n392m074P67J388o68M684L696
$$ -3692 -3610 -13139 -12239 -16693 -11237 -4439 -297 5337 3289 -2103 -6177 -5410 -4022 -4690 -6 3690
16104C690l803N64J536l406L6P354K886j904K871n961k687o096j377P217J724
$$ 3690 -113 451 1987 -1419 -1383 5971 8857 6953 9824 3863 1176 -4920 -6297 920 2644
16089B644K262j391q208j505j143K558O7J059M518J975n004m432k355k354L021
$$ 2644 4906 3515 -4693 -6198 -7341 -4783 -4716 -3657 861 2836 -2168 -6600 -8955 -11309 -8288
16074h288O581J066r253J769O458N563o008n067L701M615M552j841j0314J123
$$ -8288 -1707 -641 -9894 -8125 -1667 3896 -2112 -7179 -3478 1137 5689 3848 -6466 -5343
16060e343k97M945P211J54Q224p228j1159M13Q94J011m905m924r1N030O169M73
$$ -5343 -5640 -695 6516 6670 14894 7666 -3493 -3080 -2186 -1175 -6080 -11004 -11095 -6065 104 577
16044E77L60O26j519m209J52M265L930J691L269k505j494o02L541K503m760j2244
$$ 577 937 1563 44 -4165 -4013 252 4182 5873 9142 6637 5143 4541 8082 10585 5825 -6419
16028f419k493M261j553J785M032o222L846J0358r80p356j037p686K13P658J854
$$ -6419 -8912 -4651 -6204 -4419 -387 -6609 -2763 7595 6615 -741 -1778 -9464 -9251 -1593 261
16013B61k014K560N0n971J159o654l357K567Q713l924M82o720J846R596N121k42
$$ 261 -1753 807 857 -5114 -3955 -10609 -13966 -11399 -2686 -6610 -6128 -12848 -11002 -1406 3715 3473
15997C473n301K10n42L575K590l346J414P815J063j0550j0009j85N264l691k156
$$ 3473 -1828 -1618 -2160 1415 4005 659 2073 9888 10951 401 -9608 -9793 -4529 -8220 -10376
15982a0376J639m980M83L466O703L343L466j249j768p521j668N112Q251K742j103
$$ -10376 -8737 -13717 -13234 -9768 -3065 278 3744 2495 727 -6794 -8462 -3350 4901 7643 6540
15967F540m75K181m549n995j460l22o90M828k568n828k611k12L286P229J581N20
$$ 6540 6065 8246 3697 -2298 -3758 -4080 -4770 58 -2510 -8338 -10949 -11161 -7875 -646 935 1455
15951A455N742K471k30J85p041o472r70k000q38K12J883j456J187M729K420J895
$$ 1455 7197 9668 9438 9623 2582 -3890 -4860 -6860 -7698 -7486 -5603 -7059 -5872 -1143 1277 3172
15935C172j125m323j738J709L82j16j272l723N989M903l141l848m801Q25M882
$$ 3172 2047 -2276 -4014 -2305 -1923 -2039 -3311 -7034 -1045 3858 717 -3131 -7932 -7107 -2225
15920b225M246R47k709M41J490k231n273o747K264Q294l657r01P572j653n120
$$ -2225 2021 2968 259 700 2190 -41 -5314 -12061 -9797 -1503 -5160 -6061 1511 -142 -5262
15905e262j369p10j872O784q97k812P19L060L964n686j339K440O384j437J8Q419
$$ -5262 -6631 -7341 -9213 -2429 -3326 -6138 -5419 -2359 1605 -4081 -5420 -2980 3404 1967 1985 10404
15889A0404r16k986m29n945n16L906o777q263P217L790j974L807j434p523l431
$$ 10404 9488 6502 6073 128 -388 3518 -3259 -11522 -4305 -515 -2489 1318 -116 -7639 -11070
15874a1070K461N371P79N407n277k353Q33n627k968k15K45L70M445K112l998L153
$$ -11070 -8609 -3238 -2459 2948 -2329 -4682 -3849 -9476 -12444 -12659 -12414 -12044 -7599 -5487 -9485 -6332
15858f332l292J943M686J183p840l022Q978J112J696M385o484j1623L540P559
$$ -6332 -9624 -7681 -2995 -1812 -9652 -12674 -3696 -2584 -888 3497 -2987 -14610 -11070 -3511
15844c511J0396L641j173m783m777k644j563J406j629K8o731Q66N052R20j158
$$ -3511 6885 10526 9353 4570 -207 -2851 -4414 -3008 -4637 -4609 -11340 -10474 -5422 -4502 -5660
15829e660j482P910K970J661r30l647o965M74L003K119k363k296L728P199J094
$$ -5660 -7142 768 3738 5399 4469 822 -6143 -5669 -2666 -547 -2910 -5206 -1478 5721 6815
15814F815j378r72K162L15k443k613n370n732o31l072R31P707K505l92L479K608
$$ 6815 5437 4465 6627 6942 4499 1886 -3484 -9216 -9847 -12919 -11988 -4281 -1776 -2168 1311 3919
15798C919q07L812p298j565P486l026o083r488J88J955N122j776l037L881J238
$$ 3919 3112 6924 -374 -1939 5547 2521 -3562 -13050 -12862 -10907 -5785 -7561 -10598 -6717 -5479
15783e479M467Q944n52k6l413N270l843p389J128N801J56j216O614m293r625o491
$$ -5479 -1012 7932 7380 7354 3941 9211 5368 -2021 -893 4908 5064 3848 10462 6169 -3456 -9947
15767i947j963P071P533l94o250P19N888N72k49n980l336J692k676l073K554P13
$$ -9947 -11910 -4839 2694 2300 -3950 -3231 2657 3229 2980 -3000 -6336 -4644 -7320 -10393 -7839 -7126
15751g126K16M83J094L296l152p6O737N837K021j800l905j206l462K88J303n359
$$ -7126 -6910 -6427 -5333 -2037 -5189 -5265 1472 7309 9330 7530 3625 2419 -1043 -755 548 -4811
15735d811J7k472k07L7Q298O982j09q753P50L835K403J02o48j63P359k408k918
$$ -4811 -4794 -7266 -7473 -7436 862 7844 7735 -1018 -268 3567 5970 6072 5424 5261 12620 10212 7294
15718G294K808j200k600p305j997M078K273o128k567Q42J050j426Q59M327o563
$$ 7294 10102 8902 6302 -1003 -3000 1078 3351 -2777 -5344 -4502 -3452 -4878 -4019 308 -6255
15703f255k480J328k596k762r11J1504P528M239k342q226l765M285J794M155N198
$$ -6255 -8735 -7407 -10003 -12765 -13676 -2172 5356 9595 7253 -973 -4738 -453 1341 5496 10694
15688A0694p553q316L247R67J049k469o712j655j410L315O930O458K05k325k601
$$ 10694 3141 -5175 -1928 -961 88 -2381 -9093 -10748 -12158 -8843 -1913 4545 4750 2425 -176
15673a76L779p06q641j3066m7K655J983L95L944K759l999Q382J0220L373p361
$$ -176 3603 2897 -5744 -18810 -18857 -16202 -14219 -13824 -9880 -7121 -11120 -2738 7482 10855 3494
15658C494j097L56K03J808Q868n091o875m240N667n66m04n47m716m370K259L620
$$ 3494 2397 2753 2956 4764 13632 8541 1666 -2574 3093 2527 2123 1576 -3140 -7510 -5251 -1631
15642a631k914M187J270L115K039K986j879n001k033k40J205J950l111M70K162
$$ -1631 -4545 -358 912 4027 6066 9052 7173 2172 139 -101 1104 3054 -57 413 2575
15627B575N539K670L622J964l856m274k982l270n454N569J138p440l883L387L912
$$ 2575 8114 10784 14406 16370 12514 8240 5258 1988 -3466 2103 3241 -4199 -8082 -4695 -783
15612g83Q215J029n313n715Q030J423m590Q08r86n48O74j549M024m012k038N628
$$ -783 7432 8461 3148 -2567 5463 6886 2296 3104 2118 1570 2244 695 4719 707 -1331 4297
15596D297M301l614k588n72K823K328k300Q43k250L084J786L350J96k547r874
$$ 4297 8598 4984 2396 1824 4647 6975 4675 5518 3268 6352 8138 11488 11684 9137 -737
15581g37j2200R62J0511M995j836k951j921M568J285r50K913M266K549k620m288
$$ -737 -12937 -11975 -1464 3531 1695 -1256 -3177 1391 2676 1726 4639 8905 11454 8834 4546
15566D546r201n387O297j348m892j853K195K71K591L693M126J874q015r564Q420
$$ 4546 -4655 -10042 -3745 -5093 -9985 -11838 -9643 -9372 -6781 -3088 1038 2912 -5103 -14667 -6247
15551f247Q095m354l358N36J073J067n91N050l092l525J553Mm03J9J085M685k186
$$ -6247 1848 -2506 -5864 -5328 -4255 -3188 -3779 1271 -1821 -5346 -3793 -3789 -4192 -4173 -3088 1597 -589
15534e89l528J166J041L681o051j631K119K729m121l008R69K58P005M348m948
$$ -589 -4117 -2951 -1910 1771 -4280 -5911 -3792 -1063 -5184 -8192 -7223 -6965 40 4388 -560
15519e60o200k5k239L768N802n141j282N736l815j695M944L508P077p084o318
$$ -560 -6760 -6785 -9024 -5256 546 -4595 -5877 -141 -3956 -5651 -707 2801 9878 2794 -3524
15504c524m483J488L713M716O28n931K840j124K618l644J842J879r389l623O905
$$ -3524 -8007 -6519 -2806 1910 2538 -3393 -553 -1677 941 -2703 -861 1018 -8371 -11994 -5089
15489e089M045M38p10J416O15N42p231j788K461N532M204n637K405L458o84P46
$$ -5089 -1044 -606 -1316 100 715 1257 -5974 -7762 -5301 231 4435 -1202 1203 4661 3977 4723
15473D723j457l368j095J124J720l46n732m886N084J603M693R868K857j0146k622
$$ 4723 3266 -102 -1197 -73 1647 1301 -4431 -9317 -4233 -2630 2063 11931 14788 4642 2020
15458B020L701k931m904o55o67K622L576o88j176n622j752M436j168q63J511k87
$$ 2020 5721 2790 -2114 -2769 -3436 -814 2762 2074 898 -4724 -6476 -2040 -3208 -4071 -2560 -2847
15442b847M045O367k828k731N963P750L14j466J269n647j2550K89K973L362R09
$$ -2847 1198 7565 4737 2006 7969 15719 16033 14567 15836 10189 -2361 -2072 901 4263 5172
15427E172q87n041n264K422R92K376q5K032M48l596o51k69J36O012l43J180q047
$$ 5172 4285 -756 -6020 -3598 -2606 -230 -315 1717 2165 -1431 -2082 -2351 -2215 3797 3454 4634 -3413
15410c413l778J544O312K04r74J510K829K666L952N573r207n514J093J118M114
$$ -3413 -7191 -5647 665 869 -105 1405 4234 6900 10852 16425 7218 1704 2797 3915 8029
15395H029L755n866k322K384r73K741J702k822l97l815l173l377p558L525m1j248
$$ 8029 11784 5918 3596 5980 5007 7748 9450 6628 6231 2416 -757 -4134 -11692 -8167 -8208 -9456
15379i456p94O142N930L888K982m557k193R63M04K64j446J163k999L567K892O322
$$ -9456 -10250 -4108 1822 5710 8692 4135 1942 2905 3309 3573 2127 3290 291 3858 6750 13072
15363A3072l895n56j14n5M421k252r143k860K630j025M03l13j532j141K7k12j704
$$ 13072 9177 8621 8507 8452 12873 10621 1478 -1382 1248 223 626 313 -1219 -2360 -2333 -2545 -4249
15346d249M958J435J652q196r88Q49J97m303j253J569O32N633N553M520m755q47
$$ -4249 709 2144 3796 -4400 -5388 -4539 -4342 -8645 -9898 -8329 -7697 -2064 3489 8009 3254 2407
15330B407m483m798L264R141P92J080l333J683m060m43N082q15p305q098N234
$$ 2407 -2076 -6874 -3610 5531 6323 7403 4070 5753 1693 1250 6332 5517 -1788 -9886 -4652
15315d652Q310L777M220m025k964p432L49J078l769m40N484M025R28n172k258
$$ -4652 3658 7435 11655 7630 4666 -2766 -2417 -1339 -5108 -5548 -64 3961 4889 -283 -2541
15300b541p785K494l323m912N111N414J17N994p45j913m975M31K324m26K730N859
$$ -2541 -10326 -7832 -11155 -16067 -10956 -5542 -5425 569 -176 -2089 -7064 -6633 -4309 -4735 -2005 3854
15284C854k097k516J740j225q66L617J121m531L31N852j30j123K77J251J286j99
$$ 3854 1757 -759 981 -244 -1110 2507 3628 -903 -572 5280 5150 4027 4304 5555 6841 6642
15268F642L03l313j324n556m567p03O763J0340R868J846q152j0170n045K160q15
$$ 6642 6945 3632 2308 -3248 -7815 -8518 -1755 8585 18453 20299 12147 1977 -3068 -908 -1723
15253a723j522r34p785N245J2011J508j665m342O53L80J480O967l174M517N71
$$ -1723 -3245 -4179 -11964 -6719 5292 6800 5135 793 1446 1826 3306 10273 7099 11616 12187
15238A2187r153o886L832j391k198N769L233M136p4j505l962j107N353L978l450
$$ 12187 3034 -3852 -20 -1411 -3609 2160 5393 9529 9455 7950 3988 2881 8234 12212 8762
15223H762m371l439q90Q290l22m968o960M45P238k66p365p195K30j0n28L943O651
$$ 8762 4391 952 62 8352 8030 3062 -3898 -3453 3785 3519 -3846 -11041 -10811 -10821 -11349 -7406 -755
15206g55K621j031p486O51M615P626k10m295K654L725M030m615n557l343J71J022
$$ -755 1866 835 -6651 -6000 -1385 6241 6031 1736 4390 8115 12145 7530 1973 -1370 -1199 -177
15190a77n73J057N591M462J146n645l767M945M525j228p003o30N337j623q611
$$ -177 -750 307 5898 10360 11506 5861 2094 7039 11564 10336 3333 2703 8040 6417 -2194
15175b194j897M594L822K279J46n521o786Q435Q836N3m162o29J716k851l620K293
$$ -2194 -4091 503 4325 6604 6750 1229 -5557 2878 11714 11767 7605 6976 8692 5841 2221 4514
15159D514j33j062r43p75m222O19k901J767M969P839L250q774r835L11O342J958
$$ 4514 4381 3319 2376 1601 -2621 -2002 -4903 -3136 1833 9672 12922 4148 -5687 -5376 966 2924
15143B924k102J81M07o604N062K567k875n531M95K786M795M860l301l541O64l579
$$ 2924 822 1003 1410 -5194 -132 2435 -440 -5971 -5476 -2690 2105 6965 3664 123 787 -2792
15127b792m137j955J237k228j52M145M5O890O828K34O076p92j268r93J117j935
$$ -2792 -6929 -8884 -7647 -9875 -10027 -5882 -5837 1053 7881 8115 14191 13399 12131 11138 12255 10320
15111A0320l641j0412p534J807J0067J2392k175j422n716j502l12K478J108j180
$$ 10320 6679 -3733 -11267 -9460 607 12999 10824 9402 3686 2184 1872 4350 5458 4278
15097D278K366K70l465J265O26K07R9p34o884r769P862J0620J989l735l87m159
$$ 4278 6644 6914 3449 4714 5340 5547 5646 4912 -1972 -11741 -3879 6741 8730 4995 4608 449
15081D49k761R067J072J75n78l818o249m282k260M414O987L684M19r76j0041p487
$$ 449 -2312 6755 7827 8002 7424 3606 -2643 -6925 -9185 -4771 2216 5900 6319 5343 -4698 -12185
15065a2185K049J139j775N657Q650L985m30n964J134r663m093P031M257j128K549
$$ -12185 -10136 -8997 -10772 -5115 3535 7520 7090 1126 2260 -7403 -11496 -4465 -208 -1336 1213
15050A213P24q0O203k169k074J629J558j003Q8j873o163M909j394J982j333n128
$$ 1213 1937 1857 8060 5891 3817 5446 7004 6001 6089 4216 -1947 2962 1568 3550 2217 -2911
15034b911k194l703R11R332O476l379m056k387M823N850m760n941m145l86L536
$$ -2911 -5105 -8808 -7897 1435 7911 4532 476 -1911 2912 8762 4002 -1939 -6084 -6470 -2934
15019b934l8k346K110L699j635n069J763M211L071K997j113J594j317q992n963
$$ -2934 -2972 -5318 -3208 491 -1144 -6213 -4450 -239 2832 5829 4716 6310 4993 -3999 -9962
15004i962L52K334Q0K885J289Q317M514m778j0233j864j442l591R363N18l283
$$ -9962 -9610 -7276 -7196 -4311 -3022 5295 9809 5031 -5202 -7066 -8508 -12099 -2736 -2218 -5501
14989e501l137N12P499O485O693k219k270R05m323K49q753k410K591l392K624
$$ -5501 -8638 -8126 -627 5858 12551 10332 8062 8967 4644 4893 -3860 -6270 -3679 -7071 -4447
14974d447L623q397k262L687N702m70N160Q98n570k017j96q8L400N679l481j0146
$$ -4447 -824 -9221 -11483 -7796 -2094 -2564 2596 3494 -2076 -4093 -4289 -4377 -977 4702 1221 -8925
14958h925l607J009Q95J226O735M075k511M358K403P63L520j711n108l375J70
$$ -8925 -12532 -11523 -10628 -9402 -2667 1408 -1103 3255 5658 6421 9941 8230 3122 -253 -83
14943h3L216N96l245p86k866L23N911k266p674l552L633r22L60O363L005l160
$$ -83 3133 3729 484 -302 -3168 -2845 3066 800 -6874 -10426 -6793 -7715 -7355 -992 2013 -1147
14927a147j29m04l855L607j117j132R87p29j076j040J690J206k884N173L791n11
$$ -1147 -1276 -1680 -5535 -1928 -3045 -4177 -3190 -3919 -4995 -6035 -4345 -3139 -6023 -850 2941 2430
14911B430p382L124j933j674J07J847k850k246j327O2k670Q36P491L367K448l896
$$ 2430 -4952 -1828 -3761 -5435 -5328 -3481 -6331 -8577 -9904 -9842 -12512 -11676 -4185 -818 1630 -2266
14895b266k312k520L546O118Q00k513l336K09O937J052p521M272J3162L150m785
$$ -2266 -4578 -7098 -3552 2566 3366 853 -2483 -2274 4663 5715 -1806 2466 15628 18778 13993
14880A3993p047p390N723j744n922L971q90j853j954j883P690J621J70o985p235
$$ 13993 6946 -444 5279 3535 -2387 1584 694 -1159 -3113 -4996 2694 4315 4485 -2500 -9735
14865i735m496l342P988Q251j6l122R040p58j853l294l320K773M604P064l00j1722
$$ -9735 -14231 -17573 -9585 -1334 -1350 -4472 4568 3810 1957 -1337 -4657 -1884 2720 9784 9484 -2238
14849b238n451N125J701K493M534J235k417L481M761l465j2084M59L038J102o096
$$ -2238 -7689 -2564 -863 1630 6164 7399 4982 8463 13224 9759 -2325 -1866 1172 2274 -3822
14834c822k866J267L324m393K337P18O84L156K103J055j162o213j69P814Q624
$$ -3822 -6688 -5421 -2097 -6490 -4153 -3435 -2751 405 2508 3563 2401 -3812 -3981 3833 12457
14819A2457K3k362m869j878J977l921J638j431k230n515m416j428R100J339j948
$$ 12457 12480 10118 5249 3371 5348 1427 3065 1634 -596 -6111 -10527 -11955 -2855 -1516 -3464
14804c464J472j031k656n21K352%k562L652j409P59L822k74n851l560j816J182
$$ -3464 -1992 -3023 -5679 -6200 -3848 -3848 -6410 -2758 -4167 -3408 414 140 -5711 -9271 -11087 -9905
14788i905K023P226O206j96k996k647r96M731J385k082J2n14O15N60j218l739
$$ -9905 -7882 -656 5550 5354 2358 -289 -1285 3446 4831 2749 2761 2247 2862 3422 2204 -1535
14772a535l182N003N315j180k576K933N722j613r220l269Q76J794N753Q118L750
$$ -1535 -4717 286 5601 4421 1845 4778 10500 8887 -333 -3602 -2726 -932 4821 12939 16689
14757A6689j610r095m594K324m370L44m231n581r20N61J530N755N020j392K489
$$ 16689 15079 5984 1390 3714 -656 -312 -4543 -10124 -11044 -10483 -8953 -3198 1822 430 2919
14742B919R309L540K156m48k666m04l558K113j125m008j334L219o264k579n0l41
$$ 2919 12228 15768 17924 17476 14810 14406 10848 12961 11836 7828 6494 9713 3449 870 820 479
14726D79J145k469Q1M221J170K396M329j533l650m10M723o253n803k572J0681
$$ 479 1624 -845 -764 3457 4627 7023 11352 9819 6169 5759 10482 4229 -1574 -4146 6535
14711F535K074L788J209p894l753J439N27L33j363R14J209J891J4K241m491j550
$$ 6535 8609 12397 13606 5712 1959 3398 3925 4258 2895 3809 5018 6909 6923 9164 4673 3123
14695C123L62q599n360K354K883M670M492K56j248P6o822L217M646j139p012k928
$$ 3123 3485 -5114 -10474 -8120 -5237 -567 3925 4181 2933 3009 -3813 -596 4050 2911 -4101 -7029
14679g029Q007k009M076J718o3K625l579j245m671k049J40m796l293O443p83N289
$$ -7029 978 -1031 3045 4763 4700 7325 3746 2501 -2170 -4219 -4079 -8875 -12168 -5725 -6508 -1219
14663a219J695r41J958P45l847k22K658k65M087M516l518m448n353k97N431m90
$$ -1219 476 -465 1493 2238 -1609 -1831 827 562 4649 9165 5647 1199 -4154 -4451 980 490
14647D90K133N336j246N933L148J58j738p524r576j81j039m336L005L043O883
$$ 490 2623 7959 6713 12646 15794 15952 14214 6690 -2886 -3067 -4106 -8442 -5437 -2394 4489
14632D489O008k299j01k871l361m5L416K108k293l680k841J302l657p523L232
$$ 4489 10497 8198 8097 5226 1865 1820 5236 7344 5051 1371 -1470 -168 -3825 -11348 -8116
14617h116N042M5q648K796Q278p88J607N265Q180l607n948J114k813j387l245
$$ -8116 -3074 -3029 -11677 -8881 -603 -1391 216 5481 13661 10054 4106 5220 2407 1020 -2225
14602b225o039k345K142P655P497m743o251J412K032n29q222n231J1427O509n83
$$ -2225 -8264 -10609 -8467 -812 6685 1942 -4309 -2897 -865 -1394 -9616 -14847 -3420 3089 2506
14587B506J52r32k597j203O422j311K603j085k489k612o359q334Q78K531K047
$$ 2506 2658 1726 -871 -2074 4348 3037 5640 4555 2066 -546 -6905 -15239 -14361 -11830 -9783
14572i783Q527R578J24p764o727j917Q802J3L228L808K858J747r83p069n484j037
$$ -9783 -1256 8322 8446 682 -6045 -7962 840 853 4081 7889 10747 12494 11511 4442 -1042 -2079
14556b079m07j044R87K847N376l873j746O050j876o390k995q82L773J844j286
$$ -2079 -2486 -3530 -2543 304 5680 1807 61 6111 4235 -2155 -5150 -6032 -2259 -415 -1701
14541a701N331P192n848J491l768k841j168l978K906O095K491L59m168j749K249
$$ -1701 3630 10822 4974 6465 2697 -144 -1312 -5290 -2384 3711 6202 6561 2393 644 2893
14526B893l627l449J500o533J047J784k247Q150Q225J594J090o427m86K699j104
$$ 2893 -734 -4183 -2683 -9216 -8169 -6385 -8632 -482 7743 9337 10427 4000 3514 6213 5109
14511E109n024l809p76O318K115K120l937j363k998o420K676R569j212k975m780
$$ 5109 85 -3724 -4500 1818 3933 6053 2116 753 -2245 -8665 -5989 3580 2368 -607 -5387
14496e387r29N934P269L485n777o967k279Q457K330j153o180p135L734J907m375
$$ -5387 -6316 -382 6887 10372 4595 -2372 -4651 3806 6136 4983 -1197 -8332 -4598 -2691 -7066
14481g066k505K044N906P587K892k091M649L703j945o529l76Q980j548j768l412
$$ -7066 -9571 -7527 -1621 5966 8858 6767 11416 15119 13174 6645 6269 15249 13701 11933 8521
14466H521o017k60K86L70K014r53N406k843r075k533O135O356L502l093j238k281
$$ 8521 2504 2244 2530 2900 4914 3961 9367 6524 -2551 -5084 1051 7407 10909 7816 6578 4297
14450D297m714N907k463j507Q53J51l190J311K688l38k395l169L22O73o108m405
$$ 4297 -417 5490 3027 1520 2373 2524 -666 645 3333 2995 600 -2569 -2247 -1574 -7682 -12087
14434a2087K348j066J1866K844n341l889J712J860k553O616M902o772l061m742
$$ -12087 -9739 -10805 1061 3905 -1436 -5325 -3613 -1753 -4306 2310 7212 440 -2621 -7363
14420g363k410K882P367P466L727M717K610k371k298l038m356Q31O94l990n124
$$ -7363 -9773 -6891 476 7942 11669 16386 18996 16625 14327 11289 6933 7764 8458 4468 -656
14405f56n47k806r05M623Q746j19k582l538p004J771o49O02L368L152L782K320
$$ -656 -1203 -4009 -4914 -291 8455 8336 5754 2216 -4788 -3017 -3666 -3064 304 3456 7238 9558
14389I558j403L110n777r141M145L795Q007j307r644l398p0q25r59K238K763k061
$$ 9558 8155 11265 5488 -3653 492 4287 12294 10987 1343 -2055 -2125 -2950 -3909 -1671 1092 -969
14373i69K159p16J517K877Q65N711o817K476M127K395q12k556o15q005l453J844
$$ -969 1190 474 1991 4868 5733 11444 4627 7103 11230 13625 12813 10257 9642 1637 -1816 28
14357B8m332o546L472J893P074M333L387M915k520j2l191j758L036k243l463m232
$$ 28 -4304 -10850 -7378 -5485 1589 5922 9309 14224 11704 11692 8501 6743 9779 7536 4073 -159
14341a59J934K031K3L408Q51L12r466O533J1528m233m487p624l775K291O168K431
$$ -159 1775 3806 3829 7237 8088 8400 -1066 5467 16995 12762 8275 651 -3124 -833 5335 7766
14325G766q770k952L21K908M542K510L928Q96K042j1147m575k10n01p72m947K254
$$ 7766 -1004 -3956 -3635 -727 3815 6325 10253 11149 13191 2044 -2531 -2741 -3242 -4014 -8961 -6707
14309f707J621J826L044M93L89J642k149K125l281k659P119j723m307J156L133
$$ -6707 -5086 -3260 -216 277 666 2308 159 2284 -997 -3656 3463 1740 -2567 -1411 1722
14294A722k106j621k727J412J045M032J034J252j466L322K785j717j523l60k693
$$ 1722 -384 -2005 -4732 -3320 -2275 1757 2791 4043 2577 5899 8684 6967 5444 5084 2391
14279B391l54m98O343N892k727l991r03L090k055p950k577J757L788J994Q50j758
$$ 2391 2037 1539 7882 13774 11047 7056 6153 9243 7188 -762 -3339 -1582 2206 4200 5050 3292
14263C292P195L88n591k089N678P07m701l349M991N656K750J443j0937q07J124
$$ 3292 10487 10875 5284 3195 8873 9580 4879 1530 6521 12177 14927 16370 5433 4626 5750
14248E750J385N640m554l274p31M63J867l386m259J866K74o24j327p780Q447M771
$$ 5750 7135 12775 8221 4947 4216 4679 6546 3160 -1099 767 1041 417 -910 -8690 -243 4528
14232D528n194O38K038L746M724r08o381n130L720Pk593k396L442P467k811m606
$$ 4528 -666 -28 2010 5756 10480 9572 3191 -1939 1781 1788 -805 -3201 241 7708 4897 291
14216B91j124m09K488P986j216o208n908l389o63J64K826K363J097L408J267N463
$$ 291 -833 -1242 1246 9232 8016 1808 -4100 -7489 -8152 -7988 -5162 -2799 -1702 1706 2973 8436
14200H436J563o805p39J091j704r1l97l165J093M041J892k071J33k578O404K221
$$ 8436 9999 3194 2455 3546 1842 1751 1354 -1811 -718 3323 5215 3144 3277 699 7103 9324
14184I324p506j709J144L40K53o505K62l092j786J212L245M437m72O8M84m315
$$ 9324 1818 109 1253 1593 1846 -4659 -4397 -7489 -9275 -8063 -4818 -381 -853 -785 -301 -4616
14168d616M09P664k567n383L830J346j446j847L034K391m40O20m247l323Q996
$$ -4616 -4207 3457 890 -4493 -663 683 -763 -2610 424 2815 2375 2995 -1252 -4575 4421
14153D421N979j384m087p127M260M108p089l750N048K50k571O051L012O44j015
$$ 4421 10400 9016 4929 -2198 2062 6170 -919 -4669 379 629 -1942 4109 7121 7765 6750
14138F750q733j0689Q29R107N888n7k114M851j722P59q27K004N909K586o155p662
$$ 6750 -1983 -12672 -11843 -2736 3152 3095 981 5832 4110 4869 4042 6046 11955 14541 8386 724
14122G24k473P620k550m029O280O308l440k713m384k477L87L258K488j842k082
$$ 724 -1749 5871 3321 -708 5572 11880 8440 5727 1343 -1134 -747 2511 4999 3157 1075
14107A075K900K710l166j248l237n105m7l75P548K29j693k783p3M203M721Q86
$$ 1075 3975 6685 3519 2271 -966 -6071 -6118 -6493 1055 1284 -409 -3192 -3265 938 5659 6545
14091F545k017p75N025J995m335q62J99J407L516Q70j080m752J316M334M010p7
$$ 6545 4528 3753 8778 10773 6438 5576 5775 7182 10698 11568 10488 5736 7052 11386 15396 15319
14075A5319n460k4%J528r20n587l552P81J820q35n432J1137O605m023K694j356
$$ 15319 9859 9835 9835 11363 10443 4856 1304 2085 3905 3070 -2362 8775 15380 11357 14051 12695
14059A2695m920m103K230N306J596L910J660o157o865l609K564k706J63L734K377
$$ 12695 7775 3672 5902 11208 12804 16714 18374 12217 5352 1743 4307 1601 1764 5498 7875
14044G875M79j351k852J88L706k675m740j1667M76N995N140K477N434j545J789
$$ 7875 8354 7003 4151 4339 8045 5370 630 -11037 -10561 -4566 574 3051 8485 6940 8729
14029H729m051o639k427P78K580J238q3M671M9J871N242K608j546R2L385L73N64
$$ 8729 4678 -1961 -4388 -3610 -1030 208 125 4796 4845 6716 11958 14566 13020 13112 16497 16870 17434
14012A7434m018j555K91r12k795l726Q314o212k145M767q526q261M709M697l005
$$ 17434 13416 11861 12152 11240 8445 4719 13033 6821 4676 9443 917 -7344 -2635 2062 -943
13997i43K427L874k434l259j314K515Q208K150k672N700O227j225p335q298k949
$$ -943 1484 5358 2924 -335 -1649 866 9074 11224 8552 14252 20479 19254 11919 3621 672
13982F72M562O578J861o036p396n749j521L985K452J364L580j830k240l248j271
$$ 672 5234 11812 13673 7637 241 -5508 -7029 -3044 -592 772 4352 2522 282 -2966 -4237
13967d237J659M609L517l736j178K690l95O328L96q137n42N549k235m3K899N303
$$ -4237 -2578 2031 5548 1812 634 3324 2929 9257 9653 1516 974 6523 4288 4245 7144 12447
13951A2447j963l685j011P618O025r72k877l083k932m094M879K19L753nl406l565
$$ 12447 10484 6799 5788 13406 19431 18459 15582 12499 9567 5473 10352 10571 14324 14319 10913 7348
13935G348L10N88l649J220K708M627q321q404Q638M7k898k479K302P209K256O968
$$ 7348 7658 8246 4597 5817 8525 13152 4831 -3573 5065 5112 2214 -265 2037 9246 11502 18470
13919A8470k744m742k273n85Q40n237o896N854M868K769J893K317R74N04n688
$$ 18470 15726 10984 8711 8126 8966 3729 -3167 2687 7555 10324 12217 14534 15508 16012 10324
13904A0324q166M569M039J404k399k524j251p5J360k248m617J035J289M187N588
$$ 10324 2158 6727 10766 12170 9771 7247 5996 5921 7281 5033 416 1451 2740 6927 12515
13889A2515k513p787j366M318M411n006O216N73m515l563L799O440N828J79q653
$$ 12515 10002 2215 849 5167 9578 4572 10788 11361 6846 3283 7082 13522 19350 19529 10876
13874A0876j175J045O014O052O19n723k017K923J511p427n952N186R73m943K664
$$ 10876 9701 10746 16760 22812 23431 17708 15691 18614 20125 12698 6746 11932 12905 7962 10626
13859A0626k4m96k899j338N996p07M89P823j912j516k71q079j753k870k102P319
$$ 10626 10602 10106 7207 5869 11865 11158 11647 19470 17558 16042 15771 7692 5939 3069 967 8286
13843H286O390o487l154N153L685l530m926L37J579M330o94o20J973k428l524
$$ 8286 14676 8189 5035 10188 13873 10343 5417 5754 7333 11663 10969 10349 12322 9894 6370
13828F370k488j630J874L966j11O04J067n893K199M110J252m980j282r08k024
$$ 6370 3882 2252 4126 8092 7981 8585 9652 3759 5958 10068 11320 6340 5058 4150 2126
13813B126k436P352J851L431p653p839j834q606M714J2469R195N552j782k660
$$ 2126 -310 7042 8893 12324 4671 -3168 -5002 -13608 -8894 3575 12770 18322 16540 13880
13799A3880p025P69j467n354O8K185j89N013l576Q78N827L021J07K494m462m04
$$ 13880 6855 7624 6157 803 871 3056 2867 7880 4304 5182 11009 14030 14137 16631 12169 11765
13783A1765O894L685o287p707l74M241L089M482R061j719o402n995p091k297O229
$$ 11765 18659 22344 16057 8350 7976 12217 15306 19788 28849 27130 20728 14733 7642 5345 11574
13768A1574K566P4J367r115p752K827k079k188K994M58m093O315K603K848m155
$$ 11574 14140 14214 15581 6466 -1286 1541 -538 -2726 268 726 -3367 2948 5551 8399 4244
13753D244n777L691K530q172K797J778j036N551L652k316L688l834J049K867k354
$$ 4244 -1533 2158 4688 -3484 -687 1091 55 5606 9258 6942 10630 6796 7845 10712 8358
13738H358K309M295m894l269L639j439M068M156n73o449J039J609j888J430l088
$$ 8358 10667 14962 10068 6799 10438 8999 13067 17223 16650 10201 11240 12849 10961 12391 9303
13723I303K839L042m707P66N358n604Q69O075j880l681M02q71N92l802j854m014
$$ 9303 12142 15184 10477 11243 16601 10997 11866 17941 16061 12380 12782 11911 12503 8701 6847 2833
13707B833K471L657l73l269O75J379l580P956l204j706N097K934k772m851O228
$$ 2833 5304 8961 8588 5319 5994 7373 3793 11749 8545 6839 11936 14870 12098 7247 13475
13692A3475P910k964q180J802j78n14O386j297o610j293k425m580K84m155K015
$$ 13475 21385 18421 10241 12043 11865 11351 17737 16440 9830 8537 6112 1532 1816 -2339 -324
13677c24J0036N218j715K055K788l200q05o856m064k754R37K765O053Q762KJ869
$$ -324 9712 14930 13215 15270 18058 14858 14053 7197 3133 379 1316 4081 10134 18896 18898 20767
13661B0767j938J596o256j539O325J093o552m664k531R794j11R60O129K781k779
$$ 20767 18829 20425 14169 12630 18955 20048 13496 8832 6301 16095 15984 16944 23073 25854 23075
13646B3075m567R22M211J085K160k25r008n907j919J80L007q17j116l127N046
$$ 23075 18508 19430 23641 24726 26886 26661 17653 11746 9827 10007 13014 12197 11081 7954 13000
13631A3000M570k477p072m13P093N221o166J380J119L434l080L287L438K447L731
$$ 13000 17570 15093 8021 7608 14701 19922 13756 15136 16255 19689 16609 19896 23334 25781 29512
13616B9512q776l547j763q73k120n057o704J747O980M822J075j0J123N457m837
$$ 29512 20736 17189 15426 14553 12433 7376 672 2419 9399 14221 15296 15286 16409 21866 17029
13601A7029n089n99J660k050j275P109M119m794n490o503m93M081M024j305k58
$$ 17029 11940 11341 13001 10951 9676 16785 20904 16110 10620 4117 3624 7705 11729 10424 10166
13586A0166M211k611n04K239j273R90l314k892k470O472L978P77k142l987M78
$$ 10166 14377 11766 11262 13501 12228 13218 9904 7012 4542 11014 14992 15769 13627 9640 10118
13571A0118J182M044M301J425K670Q93o051m045J564n960j207R580J977k589j172
$$ 10118 11300 15344 19645 21070 23740 24633 18582 14537 16101 10141 8934 18514 20491 17902 16730
13556A6730j331J128L303k423J206j166o828j654N777p50J930R54k8O72L48l370
$$ 16730 15399 16527 19830 17407 18613 17447 10619 8965 14742 13992 15922 16876 16848 17520 17868 14498
13540A4498n301J769l503j481K379J479O388M110n872j727J2126J2646p129j3767
$$ 14498 9197 10966 7463 5982 8361 9840 16228 20338 14466 12739 24865 37511 30382 16615
13526A6615R29K78j629k207L118P95L18J961j524k424Q21M46l998R584O245J252
$$ 16615 17544 17822 16193 13986 17104 17899 18217 20178 18654 16230 17051 17497 13499 23083 29328 30580
13510C0580p053k491N223L684j050J655J135r226m948L567R00l091l980j923K161
$$ 30580 23527 21036 26259 29943 28893 30548 31683 22457 17509 21076 21976 18885 14905 12982 15143
13495A5143K003m468m448M18O290j986l420Q37k664J499r7n98O888J940m150j782
$$ 15143 17146 12678 8230 8648 14938 12952 9532 10369 7705 9204 9107 8509 15397 17337 13187 11405
13479A1405o049O944R490P51j648m077k968n670l907J757J0016O549l727J142
$$ 11405 5356 12300 21790 22541 20893 16816 13848 8178 4271 6028 16044 22593 18866 20008
13465B0008L542r863j584K615M520J355J391o072m396m210N904J410j121J426
$$ 20008 23550 13687 12103 14718 19238 20593 21984 15912 11516 7306 13210 14620 13499 14925
13451A4925L140K007j234m721j946O46P300N055m085m92K516j605j708m128k619
$$ 14925 18065 20072 18838 14117 12171 12817 20117 25172 21087 20595 23111 21506 19798 15670 13051
13436A3051j660O113j797J127N742O70q945k160N79j53L469N948M178O687J814
$$ 13051 11391 17504 15707 16834 22576 23246 14301 12141 12720 12567 16036 21984 26162 32849 34663
13421C4663j07j70r540p932k922L335O421k290p089M533J1125Q4r741r821r07
$$ 34663 34556 34386 24846 16914 13992 17327 23748 21458 14369 18902 30027 30111 20370 10549 9642
13406I642O033M639j352l995M446J592q220J535j68m61k28L377K749K318R610
$$ 9642 15675 20314 18962 14967 19413 21005 12785 14320 14152 13691 13463 16840 19589 21907 31517
13391C1517N517k184k880j639l02K304j056p79K757J307M076k317o499J02k753
$$ 31517 37034 34850 31970 30331 30029 32333 31277 30498 33255 34562 38638 36321 29822 29924 27171
13376B7171K397O285m44j310M046M313l876o868n388m73K979K505M9k578j902
$$ 27171 29568 35853 35409 34099 38145 42458 38582 31714 26326 25853 28832 31337 31386 28808 26906
13361B6906N435k041P55J868M62K144K703j339R50j19o684o467K371k57O19O025
$$ 26906 32341 30300 31055 32923 33385 35529 38232 36893 37843 37724 31040 24573 26944 26687 27306 33331
13345C3331K974o19o476l327N472L667N02L113N084m849n230l497p89j560p147
$$ 33331 36305 35686 29210 25883 31355 35022 35524 38637 43721 38872 33642 30145 29356 27796 20649
13330B0649L991M725M54K256l870k856M053J2538M36K637L710k534l15P574P420
$$ 20649 24640 29365 29819 32075 28205 25349 29402 41940 42376 45013 48723 46189 45874 53448 60868
13315F0868n403l043J524l946p824k786j594J203N745K184K359M955M447J3736
$$ 60868 55465 52422 53946 50000 42176 39390 37796 38999 44744 46928 49287 54242 58689 72425
13301G2425M720k622K279Q36L657l477p74R053J0621J701Q55M190L536K740Q134
$$ 72425 77145 74523 76802 77638 81295 77818 77044 86097 96718 98419 99274 103464 107000 109740 117874
13286A17874J2227J5693J6388J8939J6478L1256M1494N4151Q8655J27828J86000
$$ 117874 130101 145794 162182 181121 197599 228855 270349 324500 413155 540983 726983
13275G26983K58838L10269K20748m0553k60473l00867k37316j62154j10328p9837
$$ 726983 985821 1296090 1516838 1476285 1215812 914945 677629 515475 405147 325310
13265C25310o1008m7293k7352k3023k3865k1097r891q624r234l891N25N452L738
$$ 325310 264302 217009 189657 166634 142769 121672 111781 103157 93923 90032 90557 96009 99747
13252I9747p570k911o525n80j858l712r388j890n223n294m027L410M97j176j423
$$ 99747 92177 89266 82741 82161 80303 76591 67203 65313 60090 54796 50769 54179 54676 53500 52077
13237E2077l716M92Q46K195K085K35q280k877k904O977l458l108K332K194j622
$$ 52077 48361 48853 49699 51894 53979 54214 45934 43057 40153 47130 43672 40564 42896 45090 43468
13222D3468o301j801L222N495J504l037J0509Q16K974k405J703l136n425m934
$$ 43468 37167 35366 38588 44083 45587 42550 53059 53875 56849 54444 56147 53011 47586 42652
13208D2652L941M908R015o531o505O479j809k013n769k613L245l497L893K014
$$ 42652 46593 51501 60516 53985 47480 53959 52150 50137 44368 41755 45000 41503 45396 47410
13194D7410J819l420p822p061M606L586Q844K389L079K400p34n083k008m37p102
$$ 47410 49229 45809 37987 30926 35532 39118 47962 50351 53430 55830 55096 50013 48005 47568 40466
13179D0466O28J0919L433o256j981K451O858N133J3266K128j353j0330m827m787
$$ 40466 41094 52013 55446 49190 47209 49660 56518 61651 74917 77045 75692 65362 60535 55748
13165E5748j078M205L136K484l863L628Q871L004k603P397l810L133M499k044
$$ 55748 54670 58875 62011 64495 60632 64260 73131 76135 73532 80929 77119 80252 84751 82707
13151H2707n352J269L98P767N922j695r47n938L8L31K716N426k84J161J210m03
$$ 82707 77355 78624 79022 86789 92711 91016 90069 84131 84169 84500 87216 92642 92358 93519 94729 94326
13135I4326L905O683O554K015j497O322J5365J0517J4464K5958J2574K197j2466
$$ 94326 98231 104914 111468 113483 111986 118308 133673 144190 158654 184612 197186 199383 186917
13122A86917m0330p3103p7524o0473l8729j8666o153J8426K5548K3169J0769R459
$$ 186917 146587 73484 -4040 -64513 -103242 -121908 -128061 -109635 -84087 -60918 -50149 -40690
13110d0690J2222O043M579L068j657j12M244J4255J2417Q361N382K24O515j157
$$ -40690 -28468 -22425 -17846 -14778 -16435 -16547 -12303 1952 14369 22730 28112 28336 34851 33694
13096C3694K177L316k425o688k705k919P659L004M061J565L209L26K731k478n201
$$ 33694 35871 39187 36762 30074 27369 24450 32109 35113 39174 40739 43948 44274 47005 44527 39326
13081C9326L124O129N273O069J034O024M490J189K432L148J3320K8125M8141M1912
$$ 39326 42450 48579 53852 59921 60955 66979 71469 72658 75090 78238 91558 119683 167824 209736
13067B09736K7669m894l6455l5949k7405j6832j8258n071j2119j6148p652P76
$$ 209736 237405 232511 196056 160107 132702 115870 97612 92541 80422 64274 56622 57398
13055E7398L545M365K891m505J295k378o52L557R496L893k847m495M277Q121M942
$$ 57398 60943 65308 68199 63694 64989 62611 61959 65516 75012 78905 76058 71563 75840 83961 88903
13040H8903M089J125J168N497o38j247l255q827k123m926m320Q602R630L14M402
$$ 88903 92992 94117 95285 100782 100144 98897 95642 86815 84692 79766 75446 84048 93678 93992 98394
13025I8394N329M725k06L219M877L969m550q805j7032j7076j5757m273K537J465
$$ 98394 103723 108448 108242 111461 116338 120307 115757 106952 89920 72844 57087 52814 55351 56816
13011E6816R58k424k237j0820j0685q73l481q230j3407j4470j5919j5204o844
$$ 56816 57774 55350 53113 42293 31608 30735 27254 19024 5617 -8853 -24772 -39976 -46820
12998d6820O388J4480J9152K2818K0100K5803J5921N466l608j3652q249L507K01
$$ -46820 -40432 -25952 -6800 16018 36118 61921 77842 83308 79700 66048 57799 61306 61507
12985F1507m287O572N493R691J5807J8682L277o786j0968p028j5357p814j3067
$$ 61507 57220 63792 69285 78976 94783 113465 116742 109956 98988 91960 76603 68789 55722
12972E5722r204K794R18R039N4179R3240J04353Q1103L7364j4285l2906k8113
$$ 55722 46518 49312 50230 59269 113448 206688 311041 392144 429508 415223 382317 354204
12960C54204k6224j3778o040j0132j4110j8526q940L122J0740P006m85P73P308
$$ 354204 327980 314202 308162 298030 283920 265394 256454 259576 270316 277322 276837 277610 284918
12947B84918J4823K2739K6746L3006M7025L9005K8289j3009n6356n7902m6370
$$ 284918 299741 322480 349226 382232 429257 468262 496551 483542 427186 369284 322914
12936C22914k8329j1372q025n120n694q372l061L68Q285J4155R222R712L448J380
$$ 322914 294585 283213 275188 270068 264374 256002 252941 253309 261594 275749 284971 294683 298131 299511
12922B99511j904J562n551q558M982J1673N653l343K509n614k017O900P329N764
$$ 299511 297607 299169 293618 285060 290042 301715 307368 304025 306534 300920 298903 305803 313132 318896
12908C18896P642P311O641Q415Q988P183J3735O889J5928N627P428O278K146N253
$$ 318896 326538 333849 340490 348905 357893 365076 378811 385700 401628 407255 414683 420961 423107 428360
12894D28360Q111J0148J9310K0660P333P653J4572K4285J8646J3697K1672J8167
$$ 428360 436471 446619 465929 486589 493922 501575 516147 540432 559078 572775 594447 612614
12882F12614J7497K6786K4594K1673J9987K5372K1771K3977K4890K4383K2729
$$ 612614 630111 656897 681491 703164 723151 748523 770294 794271 819161 843544 866273
12871H66273L7826L3369J9302K4764K6944L0284M1144M0320M7089N9758P2289
$$ 866273 904099 937468 956770 981534 1008478 1038762 1079906 1120226 1167315 1227073 1299362
12860A299362P8375P4421M9289O2582O8399P7824Q2145Q4178Q1416R4736J09267
$$ 1299362 1377737 1452158 1501447 1564029 1632428 1710252 1792397 1876575 1957991 2052727 2161994
12849B161994J20284J20169J28813J25988J27009J40399J62097K00286K42693
$$ 2161994 2282278 2402447 2531260 2657248 2784257 2924656 3086753 3287039 3529732
12840C529732K71612K98013L29256L67494M15232M73440N59082O58685P71082
$$ 3529732 3801344 4099357 4428613 4796107 5211339 5684779 6243861 6902546 7673628
12831G673628Q95185J065624J299218J633533K001249K310901K504467K794598
$$ 7673628 8568813 9634437 10933655 12567188 14568437 16879338 19383805 22178403
12823B2178403L577171M926430O879270R755379J4210029K1335377L2529963M8382056
$$ 22178403 25755574 30682004 37561274 47316653 61526682 82862059 115392022 163774078
12815A63774078O3967710N9386130J1586945m5793918o4755897n3893197l7210408
$$ 163774078 227741788 287127918 298714863 252920945 188165048 134271851 97061443
12808I7061443k4649225j6597619j1543840q238237n961656m359973l250322k619643
$$ 97061443 72412218 55814599 44270759 36032522 30070866 25710893 22460571 19840928
12800A9840928k434184k292928k013207j679154j357513j084048q90152p54312
$$ 19840928 17406744 15113816 13100609 11421455 10063942 8979894 8089742 7335430
12792G335430o68201n86024n18762m60465m02845l44780l01169k76589k57494
$$ 7335430 6667229 6081205 5562443 5101978 4699133 4354353 4053184 3776595 3519101
12783C519101k57244k41844k15525j98868j69025j39171j25850j25768j18919
$$ 3519101 3261857 3020013 2804488 2605620 2436595 2297424 2171574 2045806 1926887
12774A926887j07839r4636q1703q3558q5980p8367n9261m8885m0025k8160l8461
$$ 1926887 1819048 1724412 1642709 1559151 1473171 1394804 1335543 1286658 1246633 1218473 1180012
12763A180012m2843m2670m0265l8552m6097m4206l9153m2215k5539k4466k8127
$$ 1180012 1137169 1094499 1054234 1015682 969585 925379 886226 844011 818472 794006 765879
12752G65879k4153k4879l0341k2714j8369j7889j5463j6250j0880m040m259q742
$$ 765879 741726 716847 686506 663792 645423 627534 612071 595821 584941 580901 576642 567900
12740E67900p671j1213j8304j2524j3666o980j0552p354n355j3733j3989j0469
$$ 567900 560229 549016 530712 518188 504522 497542 486990 479636 474281 460548 446559 436090
12728D36090j5757j2551j222o930p299r938r758k808K384p896o061p650j0176
$$ 436090 420333 407782 406560 399630 392331 382393 372635 369827 372211 364315 358254 350604 340428
12715C40428o443r288r128l097m362j0370q290n236k2183j4973K482m275p654
$$ 340428 333985 324697 315569 312472 308110 297740 289450 284214 262031 247058 249540 245265 237611
12702B37611j869R12M34L514P469J2757j669k613K134P212j013K001J4774K7645
$$ 237611 235742 236654 237088 240602 248071 260828 259159 256546 258680 265892 264879 266880 281654 309299
12688C09299R607l6519o4771m3315j5880l746r677r803l466J162j37k986n239
$$ 309299 318906 282387 217616 174301 158421 154675 144998 135195 131729 132891 132754 129768 124529
12675A24529k419k482p805o537j1190j6099j5788j8874k0043k8505l8185l8073
$$ 124529 122110 119628 111823 105286 94096 77997 62209 43335 23292 -5213 -43398 -81471
12663h1471k1243J4460O3909J03613J01326O3567L3153K0225K5920L7346O0078
$$ -81471 -102714 -88254 -24345 79268 180594 244161 277314 297539 323459 360805 420883
12652D20883P2959M2506m2980r5090q4621n6789k9928p47P788k470n071j1297
$$ 420883 493842 536348 493368 398278 313657 256868 226940 226193 233981 231511 226440 215143
12640B15143k0468q281j3739n815K152K772N704Q905J7734K4553J6176J0720M909
$$ 215143 194675 186394 172655 166840 168992 171764 177468 186373 204107 228660 244836 255556 260465
12627B60465m467j5762j4134j2356j2056j0046j1810k701p32j972n531p668K275
$$ 260465 255998 240236 226102 213746 201690 191644 179834 177133 176401 174429 168898 161230 163505
12614A63505l285p695j0965j3205k5179k0687j0038n647k500l671K046j796J256
$$ 163505 160220 152525 141560 128355 103176 82489 72451 66804 64304 60633 62679 60883 62139
12601F2139J2807O585O601Q157K242j138L03J21L504p872p764n294P600l015l897
$$ 62139 74946 81531 88132 96289 98531 97393 97696 97817 101321 93449 85685 80391 87991 84976 81079
12586H1079Q53P48O039K254j722j378q92J13L984M245N29r30l043R499J0237L504
$$ 81079 81932 82680 88719 90973 89251 87873 86981 87094 91078 95323 95852 94922 91879 101378 111615 115119
12570A15119n91l889k423j044P180J0297l861q77J4391J3145j833m515j0482m126
$$ 115119 114528 110639 108216 107172 114352 124649 120788 119911 134302 147447 145614 141099 130617 126491
12556A26491M451j488j0957k256k887p948m962l163p65L396k85L464M931j171
$$ 126491 130942 129454 118497 116241 113354 105406 100444 97281 96516 99912 99627 103091 108022 106851
12542A06851m046k650k338J457N83k922K719N786J652J472k386r556n293q70j043
$$ 106851 102805 100155 97817 99274 99857 96935 99654 105440 107092 108564 106178 96622 91329 90459 89416
12527H9416K570N356J0955P611N467NM727J19K964O542N142R394J3151J4985J6231
$$ 89416 91986 97342 108297 115908 121375 121380 126107 126226 129190 135732 140874 150268 163419 178404 194635
12512A94635K3449K1037L323j5351k5115l6882o2116q2302p0826l7773N245J4351
$$ 194635 218084 239121 242444 227093 201978 165096 102980 20678 -50148 -87921 -82676 -68325
12500f8325J9180J5899O697J5288M357N146M527L551O50m980N934O606m751K585
$$ -68325 -49145 -33246 -26549 -11261 -6904 -1758 2769 6320 6970 1990 7924 14530 9779 12364
12486A2364n998P178M408J306o61P31O451L892P376P468m595o668p834r511j094
$$ 12364 6366 13544 17952 19258 18597 19328 25779 29671 37047 44515 39920 33252 25418 15907 14813
12471A4813Q463k383K246K044N865M326r45n528L124L171O193M191l878J237L381
$$ 14813 23276 20893 23139 25183 31048 35374 34429 28901 32025 35196 41389 45580 41702 42939 46320
12456D6320K376L303Q45n86q6Q602L046n883j395N205K60o568O26m031l181O885
$$ 46320 48696 51999 52844 52258 52172 60774 63820 57937 56542 61747 62007 55439 56065 52034 48853 55738
12440E5738M026l074n386J200p205l766j262L182O490J522r20K459J100M520L942
$$ 55738 59764 56690 51304 52504 45299 41533 40271 43453 49943 51465 50545 53004 54104 58624 62566
12425F2566p813j288m308l825P126k68M384N837K590M463n571k89j054m928j0272
$$ 62566 54753 53465 49157 45332 52458 52190 56574 62411 65001 69464 63893 63604 62550 57622 47350
12410D7350m1P995N259l989K452K928J323n19M09j692M696j346m811m682l43N74
$$ 47350 47309 55304 60563 56574 59026 61954 63277 62758 63167 61475 66171 64825 60014 55332 54989 55563
12394E5563O243L845j13Q48K08K52k810k621K007m876N812J1634l022k064p512
$$ 55563 61806 65651 65538 66386 66594 66846 64036 61415 63422 58546 64358 75992 72970 70906 63394
12379F3394l364n401K569K185M610N771L628J1479J2135m0J115m094J178O245
$$ 63394 60030 54629 57198 59383 63993 69764 73392 84871 97006 96966 98081 93987 95165 101410
12365A01410M150J4900J1343J5149O525K327J1821J2699J8554J9864K8002M0715
$$ 101410 105560 120460 131803 146952 153477 155804 167625 180324 198878 218742 246744 287459
12353B87459N2610O0527Q3502J28406K02179K93391L10254J54595j20766k91036
$$ 287459 340069 400596 484098 612504 814683 1108074 1418328 1572923 1452157 1161121
12343A161121k92354k26402j57946j08014o7510m7667l9683l2163j9113j8676
$$ 1161121 868767 642365 484419 376405 308895 261228 221545 189382 170269 151593
12333A51593j9057j1051q879j758l681o433l185L91Q08L17L127p84l967o148L888
$$ 151593 132536 121485 112606 110848 107167 100734 97549 97940 98748 99065 102192 101408 97441 91293 95181
12318I5181O324q5k624p830p098l961j939k742M373M053J503m562m377N413P02
$$ 95181 101505 101420 98796 90966 83868 79907 77968 75226 79599 83652 85155 80593 76216 81629 82331
12303H2331j515M492k494o698L232j242k870K389L738l661l994n05P041K428l961
$$ 82331 80816 85308 82814 76116 79348 78106 75236 77625 81363 77702 73708 73203 80244 82672 78711
12288G8711l481N956K247m367l325p30K111L237L106K913K128j0684p661k497
$$ 78711 75230 81186 83433 79066 75741 75011 77122 80359 83465 86378 88506 77822 70161 67664
12274F7664P847J0814M917j862m632M662L896j322n63p906j672O087L381N1K311
$$ 67664 75511 86325 91242 89380 84748 89410 93306 91984 91421 83515 81843 87930 91311 91362 93673
12259I3673L742N553j002n028l813m045M123M869P376K735qj431n214N130M183
$$ 93673 97415 102968 101966 96938 93125 89080 93203 98072 105448 108183 108175 106744 101530 106660 110843
12244A10843L886k871o14n363j012l721J163J695M17l867k120K998N455K246Q00
$$ 110843 114729 111858 111244 105881 104869 101148 102311 104006 104423 100556 98436 101434 106889 109135 109935
12229A09935L970O101J936m771r269p700L021M093N531K205J406O8J766L956J190
$$ 109935 113905 120006 121942 117171 107902 100202 103223 107316 112847 115052 116458 116526 118292 122248 123438
12214A23438j338l468k441N573L976L121J557K672m070k699J102l71K361o52k06
$$ 123438 122100 118632 116191 121764 125740 128861 130418 133090 129020 126321 127423 127052 129413 128761 128555
12199A28555L281K580M069j727J563J800M795R343L423q97l315M798o912m266
$$ 128555 131836 134416 138485 136758 138321 140121 144916 154259 157682 156785 153470 158268 151356 147090
12185A47090P475J6097L398m962o908o879N598P157j891q78J392P109N186m54
$$ 147090 154565 170662 174060 169098 162190 155311 160909 168066 166175 165297 166689 173798 178984 178530
12171A78530m977k948K414O574L012Q56k552l218K389L838J2076N377K675j574
$$ 178530 173553 170605 173019 179593 182605 183461 180909 177691 180080 183918 195994 201371 204046 202472
12157B02472j400N054O663j416k227j013o10m637j882O760N494L42J732L79j603
$$ 202472 201072 206126 212789 211373 209146 208133 207523 202886 201004 207764 213258 213600 215332 215711 214108
12142B14108M654N184L438L640L333L844P23L353Q648J200o034m357j905K155
$$ 214108 218762 223946 227384 231024 234357 238201 238924 242277 250925 252125 246091 241734 239829 241984
12128B41984J0458M151J705J54j445j115J583J3237P152L331O310K898N873O772
$$ 241984 252442 256593 258298 258452 257007 255892 257475 270712 277864 281195 287505 290403 296276 303048
12114C03048J141m117n849K830j620L035L095L237L145Q127R293K835L634l364
$$ 303048 304189 300072 294223 297053 295433 298468 301563 304800 307945 316072 325365 328200 331834 328470
12100C28470j013J2182O540M908K44L173N188P587P555N849K971n871q372J0679
$$ 328470 327457 339639 346179 351087 351331 354504 359692 367279 374834 380683 383654 377783 369411 380090
12086C80090J5098N554K902P970k76J241R378M456l53P705J4603N371k303O83
$$ 380090 395188 400742 403644 411614 411338 412579 421957 426413 426060 433765 448368 453739 451436 452119
12072D52119R916J2477R887Q275K572N805O635O371j967L115L565R112P737J1636
$$ 452119 462035 474512 484399 492674 495246 501051 507686 514057 512090 515205 518770 527882 535619 547255
12058E47255Q250O88J937J1716M638K669Q268R596Q018J2113N966K217M698Q260
$$ 547255 555505 556193 558130 569846 574484 577153 585421 595017 603035 615148 621114 623331 628029 636289
12044F36289J0898J1653O049Q240L268N330P797N925O886R895J5144J4107Q739
$$ 636289 647187 658840 664889 673129 676397 681727 689524 695449 702335 712230 727374 741481 750220
12031G50220R503J3102N871Q533M065N249Q380J0730R276Q440P677J0577O496
$$ 750220 759723 772825 778696 787229 791294 796543 804923 815653 824929 833369 841046 851623 858119
12018H58119R414K3887J1642N586O437J4309N334P678J1717R814R883R258J4542
$$ 858119 867533 891420 903062 908648 915085 929394 934728 942406 954123 963937 973820 983078 997620
12005I97620P073K683K698L545O657J4219J6002J8064N589O375N964J0673P539
$$ 997620 1004693 1007376 1010074 1013619 1020276 1034495 1050497 1068561 1074150 1080525 1086489 1097162 1104701
11992A104701N981L925M403L661J119Q614Q922O277L743J290K362J0242l6J429
$$ 1104701 1110682 1114607 1119010 1122671 1123790 1132404 1141326 1147603 1151346 1152636 1154998 1165240 1165204 1166633
11978A166633Q718N120j740k052L02K596j838J422N396M941K718P38J321p021
$$ 1166633 1175351 1180471 1178731 1176679 1176981 1179577 1177739 1179161 1184557 1189498 1192216 1192954 1194275 1187254
11964A187254l438K62m11o221o174l851o011j0203p982j957O840J196n159r966
$$ 1187254 1183816 1184078 1183667 1177446 1171272 1167421 1161410 1151207 1143225 1141268 1148108 1149304 1144145 1134179
11950A134179o889j0467j2603o141m034j036r491j4537q931j075n870r599p697
$$ 1134179 1127290 1116823 1104220 1098079 1094045 1093009 1083518 1068981 1060050 1058975 1053105 1043506 1035809
11937A035809j0806p832j0311r818r934q380j3621p280k651q236p338j5060j4212
$$ 1035809 1025003 1017171 1006860 997042 987108 978728 965107 957827 955176 946940 939602 924542 910330
11924I10330n122j1595j0050j0441r330o15n164k0063o193l614j3753j4736j0948
$$ 910330 905208 893613 883563 873122 863792 863177 858013 837950 831757 828143 814390 799654 788706
11911G88706n135q212j2317n911j4960j5541m903k2l358r443r496k990j2968j7801
$$ 788706 783571 775359 763042 757131 742171 726630 721727 721705 718347 708904 699408 696418 683450 665649
11897F65649r239j0192p860k575j798o252j0544j0484j251o044j2496j4932q802
$$ 665649 656410 646218 638358 635783 633985 627733 617189 606705 605454 599410 586914 571982 563180
11884E63180o74m237o228k543n378r310p784m113j2925r118m3m316o985o068k454
$$ 563180 562506 558269 552041 549498 544120 534810 527026 522913 509988 500870 500827 496511 489526 483458 481004
11869D81004n680o210K5k638j1848j0446p703j3484q753J773k654j703K072j4845
$$ 481004 475324 469114 469139 466501 454653 444207 436504 423020 414267 416040 413386 411683 413755 398910
11855C98910j2258l628n251m538k706j401q98o779j0084J043L60n933o054l720
$$ 398910 386652 383024 377773 373235 370529 369128 368230 361451 351367 352410 352770 346837 340783 337063
11841C37063l631p621k872k341n06O86l728j743J5o808r386q131L944k151M764
$$ 337063 333432 325811 322939 320598 320092 320778 317050 315307 315322 308514 299128 290997 294941 292790 297554
11826B97554K969o466o525m905k953o008q751l229L697k635j051k016n596n932
$$ 297554 300523 294057 287532 282627 279674 273666 264915 261686 265383 262748 261697 259681 254085 248153
11812B48153k968l156k703K091l250o407m539J197l389k511O95j406L647l34n160
$$ 248153 245185 242029 239326 241417 238167 231760 227221 228418 225029 222518 223213 221807 225454 225120 219960
11797B19960k156n134n231p348J288q49M14L598N650l835m033p625m305m618q198
$$ 219960 217804 212670 207439 200091 201379 200530 200944 204542 210192 206357 202324 194699 190394 185776 177578
11782A77578J004m09M73O35j540l226o590N22k031j215J271n985n026L380L564
$$ 177578 178582 178173 178646 179281 177741 174515 167925 168447 166416 165201 166472 160487 155461 158841 162405
11767A62405M097l161o623n779J79k870r24L59L109M968l612r18K593n685n515
$$ 162405 166502 163341 156718 150939 151118 148248 147324 147683 150792 155760 152148 151230 153823 148138 142623
11752A42623l115k520Q48J09O39k842k089K125l557q369n026J503K807L770J656
$$ 142623 139508 136988 137836 137945 138584 135742 133653 135778 132221 123852 118826 120329 123136 126906 128562
11737A28562k244J960J794p273n176J850p64K342n15m211l919J596L462l158q121
$$ 128562 126318 128278 130072 122799 117623 119473 118709 121051 120536 116325 112406 114002 117464 114306 106185
11722A06185M67L014J763j830n96k905l82K804K132j455r067j733N168J061N161
$$ 106185 106652 109666 111429 109599 109003 106098 105716 108520 110652 109197 100130 98397 103565 104626 109787
11707A09787M972L834j157r743k456l00k718p579L78k541r23Q194N185K225q427
$$ 109787 114759 118593 117436 107693 105237 104937 102219 94640 95018 92477 91554 99748 104933 107158 98731
11692I8731j778o036l54n840n659L313L573O272R025j465j825m97r103j0776K599
$$ 98731 96953 90917 90563 84723 79064 82377 85950 92222 101247 99782 97957 97460 88357 77581 80180
11677H0180M813N943O346o316n291q908K5Q034K390K624N710m082J306L870K500
$$ 80180 84993 90936 97282 90966 85675 76767 76792 84826 87216 89840 95550 91468 92774 96644 99144
11662I9144n683j1309k77p980P90M806K908K465N691j252m251q21K990m120K758
$$ 99144 93461 82152 81875 73895 74685 79491 82399 84864 90555 89303 85052 84231 87221 83101 85859
11647H5859P203J0595J4893J4988P037R763N262o929j5596j4477j5923m202r64
$$ 85859 93062 103657 118550 133538 140575 150338 155600 148671 133075 118598 102675 98473 97509
11634I7509o717q780K856l547q869J012P85p188l620L507N451j039o846j0156
$$ 97509 90792 82012 84868 81321 72452 73464 74249 67061 63441 66948 72399 71360 64514 54358
11620E4358o082J999K044J56l198O163K632j13j166n40K17l788l375j828m707
$$ 54358 48276 50275 52319 52475 49277 55440 58072 57959 56793 56253 56470 52682 49307 47479 42772
11605D2772k257R68J50J0745L423k413m872n714j518M450O148j426J35j0042k305
$$ 42772 40515 41483 41633 52378 55801 53388 48516 42802 41284 45734 51882 50456 50591 40549 38244
11590C8244L293N321q89j326R682j738J204L880n451M243k534J930l533q043O33
$$ 38244 41537 46858 45969 44643 54325 52587 53791 57671 52220 56463 53929 55859 52326 44283 44916
11575D4916m89M018K583j1717l84L856j64J675m462M527N614n721k311M953N217
$$ 44916 44427 48445 51028 39311 38927 42783 42619 44294 39832 44359 49973 44252 41941 46894 52111
11560E2111M272L197m177j916Q21q27n823K54k216p25O654J559j0719m009M124
$$ 52111 56383 59580 55403 53487 54308 53481 47658 47912 45696 44971 51625 53184 42465 38456 42580
11545D2580J951k993l796K30J764k370m43M572J848j650n057q06Q859R354j322
$$ 42580 44531 41538 37742 37972 39736 37366 36923 41495 43343 41693 36636 35830 44689 54043 52721
11530E2721l037m454K25k341j7k363q662p5K172L481q58m307k202k941q864K097
$$ 52721 49684 45230 45455 43114 43097 40734 32072 31997 34169 37650 36792 32485 30283 27342 18478 20575
11514B0575L446P763L241k989n119K168O414o238n885m570j485J280K888R907
$$ 20575 24021 31784 35025 32036 26917 29085 35499 29261 23376 18806 17321 18601 21489 31396
11500C1396P007m613m485J152R802M728j2955r310M891N614L84k730j431k769
$$ 31396 38403 33790 29305 30457 40259 44987 32032 22722 27613 33227 33611 30881 29450 26681
11486B6681P9K208o93N718l610j690L267L811n199o448L639N546j126q366k807
$$ 26681 26760 28968 28275 33993 30383 28693 31960 35771 30572 24124 27763 33309 32183 23817 21010
11471B1010N648P308p87m69m296q132P316N862O990J209j0051l992L760k409n644
$$ 21010 26658 33966 33179 32710 28414 20282 27598 33460 40450 41659 31608 27616 31376 28967 23323
11456B3323r55j629J326j540P437M578n578m456O737K279k627J526q251L906l00
$$ 23323 22368 20739 22065 20525 27962 32540 26962 22506 29243 31522 28895 30421 22170 26076 25776
11441B5776l795L048O541K224n507p897j959k145j097J497M285j84N376j901m87
$$ 25776 21981 25029 31570 33794 28287 20390 18431 16286 15189 16686 20971 20787 26163 24262 23775
11426B3775K812J160J962j755p076m983n296n224K834J0052O781O194K28k022
$$ 23775 26587 27747 29709 27954 20878 15895 10599 5375 8209 18261 25042 31236 31464 29442
11412B9442p17p09M777Q63k698l338j2375q178J0067N372K728L12K0l428J985
$$ 29442 28725 28016 32793 33656 30958 27620 15245 7067 17134 22506 25234 25546 25566 22138 24123
11397B4123K494m749j0215l978O069j105L259k361j155L691N267k203M142k015
$$ 24123 26617 21868 11653 7675 13744 12639 15898 13537 12382 16073 21340 19137 23279 21264
11383B1264k647L890j954m35K353l822j118J0658K239n302q43o53j506j326K408
$$ 21264 18617 22507 20553 20118 22471 18649 17531 28189 30428 25126 24283 23630 22124 20798 23206
11368B3206K844j180p317j042K183N686l046j272j5o45l691N835L86l897p669
$$ 23206 26050 24870 17553 16511 18694 24380 21334 20062 20047 19402 15711 21546 21932 18035 10366
11353A0366j736O010M497J762j582K952k282J599j192L710K240k476m794N3L360
$$ 10366 8630 14640 19137 20899 19317 22269 19987 21586 20394 24104 26344 23868 19074 19127 22487
11338B2487J0218N149q445p294p844k525j625Q065M233j346k242l934K873J568
$$ 22487 32705 37854 29409 22115 14271 11746 10121 18186 22419 21073 18831 14897 17770 19338
11324A9338N028p596j753O785R11o52Q32j723m099n288J666L962p12o02J555j961
$$ 19338 24366 16770 15017 21802 22713 22061 22893 21170 17071 11783 13449 17411 16699 16097 17652 15691
11308A5691m598M704R59M812j894J71L388J244n247m571l505l816M837Q921k631
$$ 15691 11093 15797 16756 21568 19674 19845 23233 24477 19230 14659 11154 7338 12175 21096 18465
11293A8465l48L432L601k693l328k255K876m52p571o012J463j007J026M358N441
$$ 18465 18117 21549 25150 22457 19129 16874 19750 19298 11727 5715 7178 6171 7197 11555 16996
11278A6996N42n565J758m736l797M638M283k208J33o17k70q81m523k704N028P805
$$ 16996 17538 11973 13731 8995 5198 9836 14119 11911 12044 11427 11157 10276 5753 3049 8077 15882
11262A5882K10m649j256j739l36j080N89M930P993J294J57n09q015p699l492j262
$$ 15882 16092 11443 10187 8448 8112 7032 7621 12551 20544 21838 21995 21486 13471 5772 2280 1018
11246A018Q961J237l187l104J71M626K765r83k432M59O041K311J150L68k527p155
$$ 1018 9979 11216 8029 4925 5096 9722 12487 11504 9072 9531 15572 17883 19033 19401 16874 9719
11230I719l431l346k267K934R006J123L738k822r481k023K236L041j875Q40K068
$$ 9719 6288 2942 675 3609 12615 13738 17476 14654 5173 3150 5386 8427 6552 7392 9460
11215I460l374j047P329p279q578k004M700J137J673M046j125M58J389k742q688
$$ 9460 6086 5039 12368 5089 -3489 -5493 -793 344 2017 6063 4938 5396 6785 4043 -4645
11200d645K758P363N933M413p947k34M597N623J632n896k446o14N869J0914j184
$$ -4645 -1887 5476 11409 15822 7875 7641 12238 17861 19493 13597 11151 10537 16406 27320 26136
11185B6136l929l249K413J12q272n133R98O962M110n899o251l113K834J621K958
$$ 26136 22207 18958 21371 21483 13211 8078 9076 16038 20148 14249 7998 4885 7719 9340 12298
11170A2298K922k90J431N774m892k87M812p48M996J215n543q313j597j992j606
$$ 12298 15220 14930 16361 22135 17243 16956 21768 21020 26016 27231 21688 13375 11778 9786 8180
11155H180l998N4R190j808o246R17r71m2J752J594N350M424K771k01l801r249
$$ 8180 4182 4236 13426 11618 5372 6289 5318 5276 7028 8622 13972 18396 21167 20966 17165 7916
11139G916k916l799J069L422R485M110n16j08o448k697m3K90o63k303n529j663
$$ 7916 5000 1201 2270 5692 15177 19287 18771 18663 12215 9518 9475 9765 9102 6799 1270 -393
11123c93k104N283L135N538P19l439q387l078P90M834L340K046j07r29q89L210
$$ -393 -2497 2786 5921 11459 12178 8739 352 -2726 -1936 2898 6238 8284 8177 7248 6359 9569
11107I569O467n435m329m667L050L961L314L701l471k269K263J359N065K176o000
$$ 9569 16036 10601 6272 1605 4655 8616 11930 15631 12160 9891 12154 13513 18578 20754 14754
11092A4754k492Q90m112J821l452n995j603Q072N406l867m481m117K009P890O044
$$ 14754 12262 13152 9040 10861 7409 1414 -189 7883 13289 9422 4941 824 2833 10723 16767
11077A6767K391K787J01K049k79l956j873K358P35l050n003P65L059J939o610
$$ 16767 19158 21945 22046 24095 23816 19860 17987 20345 21080 18030 13027 13792 16851 18790 12180
11062A2180p979N768K879m370j331K890Q155P02J976N23K538p4m706K069J168
$$ 12180 4201 9969 12848 8478 7147 10037 18192 18894 20870 21393 23931 23857 19151 21220 22388
11047B2388L268J2147J1717J901j483j543j0410j711M764J650M713O320J231R300
$$ 22388 25656 37803 49520 51421 49938 48395 37985 36274 41038 42688 47401 53721 54952 64252
11033F4252J0380L391o73n112p308o500m269J972M993N572Q575J1222N084K861
$$ 64252 74632 78023 77350 72238 64930 58430 54161 56133 61126 66698 75273 86495 91579 94440
11019I4440n098j7002j2553q449j915M341L574M271R226M056j837n490l06n602
$$ 94440 89342 72340 59787 51338 49423 53764 57338 61609 70835 74891 73054 67564 67258 61656
11005F1656j2090o761L70l5k392L81k148r96L18p576r32Q50j304l941k242o978
$$ 61656 49566 42805 43175 43140 40748 41129 38981 37985 38303 30727 29795 30645 29341 25400 23158 16180
10989A6180k474k289Q06j453N12m184M844J077j392K876J114J351K971j556j458
$$ 16180 13706 11417 12223 10770 11282 7098 11942 13019 11627 14503 15617 16968 19939 18383 16925
10974A6925m97k434m061k960K55J72j281Q87J355P852l024L894O862l434l767
$$ 16925 16428 13994 9933 6973 7228 7400 6119 7006 8361 16213 13189 17083 23945 20511 16744
10959A6744k008k572m983J228K161N864M253K568n019n576r52K261M701L437l480
$$ 16744 14736 12164 7181 8409 10570 16434 20687 23255 18236 12660 11708 13969 18670 22107 18627
10944A8627r03m062o64M952j613l986l838q0L526K856J127J736L686k450l248
$$ 18627 17724 13662 12998 17950 16337 12351 8513 8433 11959 14815 15942 17678 21364 18914 15666
10929A5666J355K428r90k392O75o736N72L309N22N016K144j142m091J936n36m203
$$ 15666 17021 19449 18459 16067 16742 10006 10578 13887 14409 19425 21569 20427 16336 18272 17736 13533
10913A3533l996N327M128O49q43k810J99k447L09K998J420J018O204K045p019
$$ 13533 9537 14864 18992 19641 18798 15988 16187 13740 14049 17047 18467 19485 25689 27734 20715
10898B0715r701k904l49N87k34m383J866o02n046P602k810o7j339p631M181N732
$$ 20715 11014 8110 7761 8348 8114 3731 5597 4995 -51 7551 4741 4674 3335 -4296 -115 5617
10882E617l848l330M661l647n063q38M428Q667Q180R52p488k139k665J300l22
$$ 5617 1769 -1561 3100 -547 -5610 -6448 -2020 6647 14827 15779 8291 6152 3487 4787 4465
10867D465k623J676K491J135O220L654p2n679M378K786k904l875N703j360o88
$$ 4465 1842 3518 6009 7144 13364 17018 16946 11267 15645 18431 15527 11652 17355 15995 15307
10852A5307L248P28o8K075j617j736J009J203M069J730q695R85J633o189l048
$$ 15307 18555 19283 19215 21290 19673 17937 18946 20149 24218 25948 17253 18238 19871 13682 10634
10837A0634L12R821N723m947N80M187m486k083l839K771L901l073j962n547j293
$$ 10634 10946 20767 26490 21543 22123 26310 21824 19741 15902 18673 22574 19501 17539 11992 10699
10822A0699O840L648j389J771J407n2k127o401M131K948J858l02J756m167m962
$$ 10699 17539 21187 19798 21569 22976 22924 20797 14396 18527 21475 23333 23031 24787 20620 15658
10807A5658J047m159j900n372j943o672j578R151O576J202M994l54j01M932M735
$$ 15658 16705 12546 10646 5274 3331 -3341 -4919 4232 10808 12010 17004 16650 16549 21481 26216
10792B6216n007o031j862l825j395j652j945M297J878K833L008k329K698l858
$$ 26216 21209 15178 13316 9491 8096 6444 4499 8796 10674 13507 16515 14186 16884 13026
10778A3026j3752J211J951L19L876j066K553K870k683l634l240K231M141P152
$$ 13026 -726 485 2436 2755 6631 5565 8118 10988 8305 4671 1431 3662 7803 14955
10764A4955O281q37l390m281q864k65N537K011P10P260P248Q532j038j424l830
$$ 14955 21236 20399 17009 12728 3864 3599 9136 11147 11857 19117 26365 34897 33859 32435 28605
10749B8605o797l159P965P143L742N163L45q23K024J723k83p056K411L842k076
$$ 28605 21808 18649 26614 33757 37499 42662 43007 42184 44208 45931 45648 38592 41003 44845 42769
10734D2769m76J258J0993K234p37K796K558j958M417l48k770q981p384m253N867
$$ 42769 42293 43551 54544 56778 56041 58837 61395 59437 63854 63506 60736 51755 44371 40118 45985
10719D5985K712L20L557j456M22J267j284j043k038l31R524R815k249j182k489
$$ 45985 48697 49017 52574 51118 51540 52807 51523 50480 48442 48111 57635 67450 65201 64019 61530
10704F1530l447o636q489J481P410P229M669k250k975O31l839n837O293P960j597
$$ 61530 58083 51447 42958 44439 51849 59078 63747 61497 58522 59153 55314 49477 55770 63730 62133
10689F2133m221m82k83j304L920j208l716l890N299Q02l851J865M909O350L033
$$ 62133 57912 57430 57147 55843 59763 58555 54839 50949 56248 57050 53199 55064 59973 66323 69356
10674F9356Q086O853K197n678o685r66Q885N423k458O982N250M495P73O664O566
$$ 69356 77442 84295 86492 80814 74129 73163 82048 87471 85013 91995 97245 101740 102513 109177 115743
10659A15743J595P751Q290J1301J7380K0180J8044J2916Q244P710J6811J5093
$$ 115743 117338 125089 133379 144680 162060 182240 200284 213200 221444 229154 245965 261058
10647B61058p746j6740r789m45J0895J5716J1055J8292K2075K4122L4570L2904
$$ 261058 253312 236572 226783 226338 237233 252949 264004 282296 304371 328493 363063 395967
10635C95967M4803N7416O0260N9547M8829L7651K4957L5952M3973O2432Q9922
$$ 395967 440770 498186 558446 617993 666822 704473 729430 765382 809355 871787 961709
10624I61709J22771J64246K24725K90454L74085M66563N55184O66106P36796O50718
$$ 961709 1084480 1248726 1473451 1763905 2137990 2604553 3159737 3825843 4562639 5213357
10614E213357L75224N5185j45948j72170n2257J47515M06000O97765J021464J337799
$$ 5213357 5588581 5643766 5497818 5325648 5273391 5420906 5826906 6524671 7546135 8883934
10604H883934J474208J177299L87420m54679q93397q65547n50955j36359L17013
$$ 8883934 10358142 11535441 11922861 11468182 10574785 9709238 9158283 9021924 9338937
10595I338937Q07453J320555J725614J798215J191628n7281j263412j798386j688877
$$ 9338937 10146390 11466945 13192559 14990774 16182402 16125121 14861709 13063323 11374446
10586A1374446j265459p69029k83191J69897N76424Q60417Q58251L78439m76109
$$ 11374446 10108987 9339958 9056767 9226664 9803088 10663505 11521756 11900195 11424086
10577A1424086j230477j497907j350580j010707o61012l63984j15388O8278J75505
$$ 11424086 10193609 8695702 7345122 6334415 5673403 5309419 5194031 5262309 5437814
10568E437814J43141p7740m11816o78495p70806p10452n77196m45629l32132k54052
$$ 5437814 5580955 5503215 5091399 4412904 3642098 2931646 2354450 1908821 1576689 1322637
10558A322637k01077j57689j19398r8810p6272p4289n6395n0626m4713l5652l4887
$$ 1322637 1121560 963871 844473 745663 669391 595102 538707 488081 443368 407716 372829
10547C72829l8207l1738k3310j4029k3201j1644j0550j1958j7614j2644p213k446
$$ 372829 334622 302884 279574 265545 242344 230700 220150 208192 190578 177934 170721 168275
10535A68275m226j2407l351l084p314j4000r015n777m541m976j476m164k484J546
$$ 168275 164049 151642 148291 145207 137893 123893 114878 109101 104560 99584 98108 93944 91460 93006
10521I3006p06q95p277r546o245k100k663k998p2K570j046j196j847J525p03m209
$$ 93006 92300 91405 84128 74582 68337 66237 63574 60576 60504 63074 62028 60832 58985 60510 59807 55598
10505E5598j931l615L55J179l32m344m529O47k06J033m870L104K515P41p181K849
$$ 55598 53667 50052 50407 51586 51254 46910 42381 43028 42822 43855 38985 42089 44604 45345 38164 41013
10489D1013L023k293m495n212J047j476p514l923M023k145l275L540J047O240
$$ 41013 44036 41743 37248 32036 33083 31607 24093 20170 24193 22048 18773 22313 23360 29600
10475B9600M367p766K23j867j58j516J160p32n431l738N651O516L76p153J704
$$ 29600 33967 26201 26424 24557 24399 22883 24043 23311 17880 14142 19793 26309 26685 19532 21236
10460B1236r06q676q65M265m250p198N259m088m265L955k398k06J664j099l568
$$ 21236 20330 11654 10789 15054 10804 3606 8865 4777 512 4467 2069 1863 3527 2428 -1140
10445a140M261J167k90K965n357J859M701l955K505L762M757L366k718J3M31o76
$$ -1140 3121 4288 3998 6963 1606 3465 8166 4211 6716 10478 15235 18601 15883 15896 16327 15651
10429A5651m623K433k225K330L585L016j056o638M075L829J171k777l420k085
$$ 15651 11028 13461 11236 13566 17151 20167 19111 12473 16548 20377 21548 18771 15351 13266
10415A3266j786N75N398L016m220K299J884k297l16M19O365l752o730k835m783
$$ 13266 11480 12055 17453 20469 16249 18548 20432 18135 17819 18238 24603 20851 14121 11286 6503
10400F503J561N136m417O88k166m011J96L195K228p06l871O393N580K986j454
$$ 6503 8064 13200 8783 9471 7305 3294 3490 6685 8913 8207 4336 10729 16309 19295 17841
10385A7841M525O386q70p706j4084j2328j74M174N660N901j812K287N941o26K344
$$ 17841 22366 28752 27882 20176 6092 -6236 -6410 -2236 3424 9325 7513 9800 15741 15115 17459
10370A7459K114p545o420r17J634N987l126m610k100j477O805J210m481N975N888
$$ 17459 19573 12028 5608 4691 6325 12312 9186 4576 2476 999 7804 9014 4533 10508 16396
10355A6396J766l796O92N697o511q814K980K335M610l332l359j96P487M975m871
$$ 16396 18162 14366 15058 20755 14244 5430 8410 10745 15355 12023 8664 8468 15955 20930 16059
10340A6059l203j252k137M785P301L760j059r022j956J297L804l953q377J004
$$ 16059 12856 11604 9467 14252 21553 25313 24254 15232 13276 14573 18377 14424 6047 7051
10326G051O650L764j043n815p805j076P74K258k85O373Q684o136l737K927N168
$$ 7051 13701 17465 16422 10607 2802 1726 2500 4758 4473 10846 19530 13394 9657 12584 17752
10311A7752J753M99L75l947m012l839O159q11K643m233n698N494l233l239Q442
$$ 17752 19505 20004 20379 16432 12420 8581 14740 13929 16572 12339 6641 12135 8902 5663 14105
10296A4105j892q6p49m081l569J4K489L511j703l037j433k521p358L712M791l314
$$ 14105 12213 12127 11378 7297 3728 3742 6231 9742 8039 5002 3569 1048 -6310 -2598 2193 -1121
10280a121L60O816n353n107L509n966l702M215M71l510K006L039M318O422m243
$$ -1121 -761 6055 702 -4405 -896 -6862 -10564 -6349 -5878 -9388 -7382 -4343 -25 6397 2154
10265B154r330o340J554P380O549p281q572J89l923l379k993M932Q329P452O577
$$ 2154 -7176 -13516 -11962 -4582 1967 -5314 -13886 -13697 -17620 -20999 -23992 -19060 -10731 -3279 3298
10250C298j064m326N80J172k651N52M742L561r047Q60j208j114P21k899N412L677
$$ 3298 2234 -2092 -1512 -340 -2991 -2439 2303 5864 -3183 -2323 -3531 -4645 -3924 -6823 -1411 2266
10234B266J345m124n58n23k202N740K763j237L663j314m402J147J403L680o912
$$ 2266 3611 -513 -1071 -1594 -3796 1944 4707 3470 7133 5819 1417 2564 3967 7647 735
10219G35L708L471p864q16m313K22J142K31M192n925K02K910J415K560N16O368
$$ 735 4443 7914 50 -766 -5079 -4857 -3715 -3484 708 -5217 -5015 -2105 -690 1870 2386 8754
10203H754R536p86n808n344p698n065k241N236N159j853r139o205N661J1875M942
$$ 8754 18290 17504 11696 6352 -1346 -6411 -8652 -3416 1743 -110 -9249 -15454 -9793 2082 7024
10188G024K771j626K556k400L119O284R20J1428L700r00r49R90k118R36K151l913
$$ 7024 9795 8169 10725 8325 11444 17728 18648 30076 33776 32876 31927 32917 30799 31735 33886 29973
10172B9973j16M619N682O147Q212J5935L219n893j0460j2819m540M603k300O253
$$ 29973 29857 34476 40158 46305 54517 70452 73671 67778 57318 44499 39959 44562 42262 48515
10158D8515O746J0110J5190L658j348L797m591q652j0193q949k994M352k022L16
$$ 48515 55261 65371 80561 84219 82871 86668 82077 73425 63232 54283 51289 55641 53619 53935
10144E3935P967O140k634K624k498l567n349r620j5266j1971M63N303K459R99
$$ 53935 61902 68042 65408 68032 65534 61967 56618 46998 31732 19761 20224 25527 27986 28985
10130B8985O82k346J77l894o400l054n542j356j810J044n7k942K240n281k517
$$ 28985 29667 27321 27498 23604 17204 14150 8608 7252 5442 6486 6429 3487 5727 446 -2071
10115b071l420N983M368n702j099P437J680p272j553L428L953n356n509Q41K324
$$ -2071 -5491 492 4860 -842 -1941 5496 7176 -96 -1649 1779 5732 376 -5133 -4292 -1968
10100a968q27j152L050J185J148k822j127J289n681k435l039q91M476K082L447
$$ -1968 -2795 -3947 -897 288 1436 -1386 -2513 -1224 -6905 -9340 -12379 -13270 -8794 -6712 -3265
10085c265Q405N11j727p007l301L593N403j396j31j302j546l717j0095j0884O511
$$ -3265 5140 5651 3924 -3083 -6384 -2791 2612 1216 1085 -217 -1763 -5480 -15575 -26459 -19948
10070a9948Q09J927n74J875N953K266o990o75M69O109M288J923l73o245L266M657
$$ -19948 -19139 -17212 -17786 -15911 -9958 -7692 -14682 -15357 -14888 -8779 -4491 -2568 -2941 -9186 -5920 -1263
10054a263l60M367k96k06m332J794L894j519J027r464n964Q120N862l158n410
$$ -1263 -1623 2744 2448 2242 -2090 -296 3598 2079 3106 -6358 -12322 -4202 1660 -1498 -6908
10039f908j960Q041p32J372N982k058n425r162K62R939l083l610j853N214Q806
$$ -6908 -8868 -827 -1559 -187 5795 3737 -1688 -10850 -10588 -649 -3732 -7342 -9195 -3981 4825
10024D825m62k881l349k784p39l035p246J318J2519O355k067k850P79l238r09
$$ 4825 4363 1482 -1867 -4651 -5390 -8425 -15671 -14353 -1834 4521 2454 -396 383 -2855 -3764
10009c764M82N04L263j532m608j094O991L682q8j0491l439P11L048Q964m688k338
$$ -3764 -3282 -2778 485 -1047 -5655 -6749 242 3924 3836 -6655 -10094 -9383 -6335 2629 -2059 -4397
9993d397N854P948j741j267j065r006o481L244J477L913l555l07P820m19n863
$$ -4397 1457 9405 7664 6397 5332 -3674 -10155 -6911 -5434 -1521 -5076 -5383 2437 2018 -3845
9978c845k293M164l60l291P5J234K861n36m994n017J306N018L604j425M569k002
$$ -3845 -6138 -1974 -2334 -5625 -5550 -4316 -1455 -1991 -6985 -12002 -10696 -5678 -2074 -3499 1070 -932
9962i32p797n159k490L3Q407O840n553p67K135l528K948L211j109p30L800J448
$$ -932 -8729 -13888 -16378 -16345 -7938 -1098 -6651 -7418 -5283 -8811 -5863 -2652 -3761 -4491 -691 757
9946G57r44N418l019k502m90n235l666N828n155n996L617l584j979M629m030K974
$$ 757 -187 5231 2212 -290 -780 -6015 -9681 -3853 -9008 -15004 -11387 -14971 -16950 -12321 -16351 -13377
9930a3377K775N156K472k352k058q62O841L265j392L779N58n175k373m811j773
$$ -13377 -10602 -5446 -2974 -5326 -7384 -8246 -1405 1860 468 4247 4805 -370 -2743 -7554 -9327
9915i327J923J427K235N24K870m425n54k958o908j427O028M420k8k359m11j421
$$ -9327 -7404 -5977 -3742 -3218 -348 -4773 -5327 -8285 -15193 -16620 -10592 -6172 -6200 -8559 -8970 -10391
9899a0391l1L056N253L822m73J550r544L961K777j699n91R97k27o8J237P96L925
$$ -10391 -10422 -7366 -2113 1709 1236 2786 -6758 -2797 -20 -1719 -2310 -1313 -1540 -1608 -371 425 4350
9882D350m65M678j639k377o064n928m638J837P450M000k774o27K636p869l364
$$ 4350 3885 8563 6924 4547 -1517 -7445 -12083 -10246 -2796 1204 -1570 -2197 439 -7430 -10794
9867a0794O526l697l844K931P28L535j953l16k05L061K400K741M685Q515M942
$$ -10794 -4268 -7965 -11809 -8878 -8150 -4615 -6568 -6884 -7089 -4028 -1628 1113 5798 14313 19255
9852A9255n407l898m258o96p163j309K307K2m520J242m624o479l031J832O44K159
$$ 19255 13848 9950 5692 4996 -2167 -3476 -1169 -1147 -5667 -4425 -9049 -15528 -18559 -16727 -16083 -13924
9836a3924K602N682j446K039K331K24M90o561P56N948K288m741J608L016L118
$$ -13924 -11322 -5640 -7086 -5047 -2716 -2492 -2002 -8563 -7807 -1859 429 -4312 -2704 312 3430
9821C430l550k556K629m6J567N034J42m679K130l06o047n84M677j653q23L444
$$ 3430 -120 -2676 -47 -93 1474 6508 6650 1971 4101 3795 -2252 -2836 1841 188 -635 2809
9805B809j089m15J01M86O381J044m064j056q935l667L564k227j223k68K438M16
$$ 2809 1720 1305 1406 1892 8273 9317 5253 4197 -4738 -8405 -4841 -7068 -8291 -8559 -6121 -5705
9789e705L953M256p254j0160o797l264O138J2099O125j499N80o725K666L554L146
$$ -5705 -1752 2504 -4750 -14910 -21707 -24971 -18833 -6734 -609 -2108 -1528 -8253 -5587 -2033 1113
9774A113j38L241l604m275Q977N564k174j2204o096K347L865M217j478K949o28
$$ 1113 975 4216 612 -3663 5314 10878 8704 -3500 -9596 -7249 -3384 833 -645 2304 1676
9759A676k945N208j978p288J795M144J937m826l621l733k770J517P18k605j836
$$ 1676 -1269 3939 1961 -5327 -3532 612 2549 -2277 -5898 -9631 -12401 -10884 -10166 -12771 -14607
9744a4607P216P021j968n208M772O378l950q76j760R51O736l155l702m238l012
$$ -14607 -7391 -370 -2338 -7546 -2774 3604 -346 -1222 -2982 -2031 4705 1550 -2152 -6390 -9402
9729i402l59J1911K613L089l744m803K57Q74k998M243k364L678J644o468m620
$$ -9402 -9761 2150 4763 7852 4108 -695 -438 436 -2562 1681 -683 2995 4639 -1829 -6449
9714f449k537Q451j638j1282O47M115P379N890m115m614K104L33m103N235M142
$$ -6449 -8986 -535 -2173 -13455 -12808 -8693 -1314 4576 461 -4153 -2049 -1716 -5819 -584 3558
9699C558K329j921q58j531j386j377k489l188Q27N149J515k898j849N948R07o936
$$ 3558 5887 3966 3108 1577 191 -1186 -3675 -6863 -6036 -887 628 -2270 -4119 1829 2736 -4200
9683d200m436K345P426j849p676m087J381k118N969M748N206J722j707r72j095
$$ -4200 -8636 -6291 1135 -714 -8390 -12477 -11096 -13214 -7245 -2497 2709 4431 2724 1752 657
9668F57j271q346L86k269K402P454m883L111O383J835l259K78N217K135L900N203
$$ 657 -614 -8960 -8574 -10843 -8441 -987 -5870 -2759 3624 5459 2200 2478 7695 9830 13730 18933
9652A8933J984R588J5735J7257k488j6282j4950j1361r685k987m288l766J631
$$ 18933 20917 30505 46240 63497 61009 44727 29777 18416 8731 5744 1456 -2310 -679
9639f79r14m059m807n93R018M677l022l330j637j730l452J120N82O265k012l948
$$ -679 -1593 -5652 -10459 -11052 -2034 2643 -379 -3709 -5346 -7076 -10528 -9408 -8826 -2561 -4573 -8521
9623h521K615M763M67k212N53J52m05K736K013L359m378N55R81n37n707j516k88
$$ -8521 -5906 -1143 -676 -2888 -2335 -2183 -2588 148 2161 5520 1142 1697 2678 2141 -3566 -5082 -5370
9606e370k402P00K265m11M493k471o585K890J329r94N456Q05o79l520P9L253R27
$$ -5370 -7772 -7072 -4807 -5218 -725 -3196 -9781 -6891 -5562 -6556 -1100 -295 -974 -4494 -4415 -1162 -235
9589b35m29o9j333l824N674N731m165k805J817m84J583N971K468o666r350K30
$$ -235 -664 -733 -2066 -5890 -216 5515 1350 -1455 362 -122 1461 7432 9900 3234 -6116 -5886
9573e886J126Q59L103j161p93O626P18m041J6K926k872j649Q447N48j18l047o566
$$ -5886 -4760 -3901 -798 -1959 -2752 3874 4592 551 567 3493 621 -1028 7419 7967 7849 4802 -1764
9556a764Q57J222M072J34o087l840Q53Q283k842J366M1l232K61K90r367m941O644
$$ -1764 -907 315 4387 4521 -1566 -5406 -4553 3730 888 2254 2295 -937 -676 -386 -9753 -14694 -8050
9539h050J614Q369k385l957O965M323p002k733O378J746p05m661m942J913L328
$$ -8050 -6436 1933 -452 -4409 2556 6879 -123 -2856 3522 5268 4563 -98 -5040 -3127 201
9524B01K900k081k75J128p79n241j622J823L926N027l419k089O406q17l735K091
$$ 201 3101 1020 745 1873 1094 -4147 -5769 -3946 -20 5007 1588 -501 5905 5088 1353 3444
9508C444%K708m950l607j683M7K918L754k020l918M95j38l468K82K62J661j315
$$ 3444 3444 6152 1202 -2405 -4088 -4041 -1123 2631 611 -3307 -2812 -2950 -6418 -6136 -5874 -4213 -5528
9491e528P991L469o185m64j86j891J301j949k571L451J946N78P540q56p069j787
$$ -5528 2463 5932 -253 -717 -903 -2794 -1493 -3442 -6013 -2562 -616 -38 7502 6646 -423 -2210
9475b210K126L99k165l299J913P82o390n16K210J224M814K519k914N825l878l771
$$ -2210 -84 315 -1850 -5149 -3236 -2454 -8844 -9360 -7150 -5926 -1112 1407 -1507 4318 440 -3331
9459c331m362j552p58J043j430j280K781L373m593j360J4382N783l789m000K059
$$ -3331 -7693 -9245 -10003 -8960 -10390 -11670 -8889 -5516 -10109 -11469 2913 8696 4907 907 2966
9444B966m689j98N967O221n071n158N586n02L502r39o716o021l10L350K695K104
$$ 2966 -1723 -1921 4046 10267 5196 38 5624 5122 8624 7685 969 -5052 -5362 -2012 683 2787
9428B787n198m554k698J53M503Q32L178L874L652p430l353J559Q92k114P23k507
$$ 2787 -2411 -6965 -9663 -9510 -5007 -4175 -997 2877 6529 -901 -4254 -2695 -1803 -3917 -3194 -5701
9412e701r59N346n0k048L723K021k302J85J728L088p898k093K576N468o395j280
$$ -5701 -6660 -1314 -1364 -3412 311 2332 30 215 1943 5031 -2867 -4960 -2384 3084 -3311 -4591
9396d591o82n605j673M147K736o692Q68M467M28j388o485l571K917O101J27J305
$$ -4591 -5273 -10878 -12551 -8404 -5668 -12360 -11492 -7025 -6597 -7985 -14470 -18041 -15124 -9023 -8896 -7591
9380g591K813k877n745l632K701Q133P759n994N694L877l372N973K373l064o728
$$ -7591 -4778 -7655 -13400 -17032 -14331 -6198 1561 -4433 1261 5138 1766 7739 10112 7048 320
9365C20K060L404m156j868M224n307P61l736q533P50Q05j482M006Q911O111k686
$$ 320 2380 5784 1628 -240 3984 -1323 -562 -4298 -12831 -12081 -11276 -12758 -8752 159 6270 3584
9349C584q11N293J679k002j046j807m47k29J927J327q490P568J258m389k545k697
$$ 3584 2773 8066 9745 7743 6697 4890 4443 4214 6141 7468 -1022 6546 7804 3415 870 -1827
9333a827j984l876K895N489n61M92O469K732L447j828o391p268l753N33K656j036
$$ -1827 -3811 -7687 -4792 697 136 628 7097 9829 13276 11448 5057 -2211 -5964 -5431 -2775 -3811
9317c811l308r44l794P458M620J483r37j731m81l243K053K915l812n452o981m164
$$ -3811 -7119 -8063 -11857 -4399 221 1704 767 -964 -1445 -4688 -2635 280 -3532 -8984 -15965 -20129
9301b0129m159P887J0682L450P556l99j802K963o466n838L208R922k233r980l523
$$ -20129 -24288 -16401 -5719 -2269 5287 4888 3086 6049 -417 -6255 -3047 6875 4642 -5338 -8861
9286h861j419j298L311L021O318o29j986j682k543K54J856N786L638j005k525
$$ -8861 -10280 -11578 -8267 -5246 1072 443 -1543 -3225 -5768 -5514 -3658 2128 5766 4761 2236
9271B236l388R54K265m612J991j044j385m8J458l698O786N047j481n897q462P749
$$ 2236 -1152 -198 2067 -2545 -554 -1598 -2983 -3031 -1573 -5271 1515 6562 5081 -816 -9278 -1529
9255a529K558M49K189k946l559j955P16n185m575M260N859j513k557m276L365
$$ -1529 1029 1478 3667 721 -2838 -4793 -4077 -9262 -13837 -9577 -3718 -5231 -7788 -12064 -8699
9240h699O381L177M825j865m383J243J610Q90J58l632l486o089K061N544K804
$$ -8699 -2318 859 5684 3819 -564 679 2289 3179 3337 -295 -3781 -9870 -7809 -2265 539
9225E39Kj102R78N742j364l814j858J233K083n064k066o600N837R485J870J413
$$ 539 541 -561 417 6159 4795 981 -877 356 2439 -2625 -4691 -11291 -5454 4031 5901 7314
9209G314p1n554K180KJ52j739J753p94o356L202M36m426J878L037m871M74L302
$$ 7314 7243 1689 3869 3871 4023 2284 4037 3243 -3113 89 525 -3901 -2023 1014 -3857 -3383 -81
9192h1k55K770k367O68O524j018k099K76J000k438o888K397M101k266J922k642
$$ -81 -336 2434 67 735 7259 6241 4142 4418 5418 2980 -3908 -1511 2590 324 2246 -396
9176c96k464l341L657O044m240k450K847K772j088j678L694j88N279j627J53q69
$$ -396 -2860 -6201 -2544 3500 -740 -3190 -343 2429 1341 -337 3357 3169 8448 6821 6974 6105
9160F105r691L71M906k304n581l353J375M007N304n30k301n822k181j987k086
$$ 6105 -3586 -3215 1691 -613 -6194 -9547 -8172 -4165 1139 609 -1692 -7514 -9695 -11682 -13768
9145a3768N612M020L40l863l212L675k357m884L233O384P185p38K870K943o382
$$ -13768 -8156 -4136 -3796 -7659 -10871 -7196 -9553 -14437 -11204 -4820 2365 1627 4497 7440 1058
9130A058n791J354L848L286k416K522k659j881K246M863J792J635o597j852K564
$$ 1058 -4733 -3379 469 3755 1339 3861 1202 -679 1567 6430 8222 9857 3260 1408 3972
9115C972j580o957O39Q23P623L119l818j94o208J421K745J91J538Q310L322r308
$$ 3972 2392 -4565 -3926 -3103 4520 7639 3821 3627 -2581 -1160 1585 1776 3314 11624 14946 5638
9099E638p135J517j399m55J450k456K402J8o316J608J161j382n593l943M939J253
$$ 5638 -1497 20 -1379 -1834 -384 -2840 -438 -420 -6736 -5128 -3967 -5349 -10942 -14885 -9946 -8693
9083h693j057K58M24J3138L295n980j187N71P09k572j656p35n457K31k62M579
$$ -8693 -9750 -9492 -9068 4070 7365 1385 198 769 1478 -1094 -2750 -3485 -8942 -8711 -8973 -4394
9067d394K047o965n697O147L252Q227l044n686m573M005j787J4064R054o412r241
$$ -4394 -2347 -9312 -15009 -8862 -5610 2617 -427 -6113 -10686 -6681 -8468 5596 14650 8238 -1003
9052a003j449M047m108L386O241l689j11l545n183j183j673m808K049j833K345
$$ -1003 -2452 1595 -2513 873 7114 3425 3314 -231 -5414 -6597 -8270 -13078 -11029 -12862 -10517
9037a0517R033L748L18p541m125K091J981M856K678j875L082M149l202j0733M814
$$ -10517 -1484 2264 2582 -4959 -9084 -6993 -5012 -156 2522 647 3729 7878 4676 -6057 -1243
9022a243M551n368l762j614J617o57J101N345J0826K776k782m509o655k043L623
$$ -1243 3308 -2060 -5822 -7436 -5819 -6476 -5375 -30 10796 13572 10790 6281 -374 -2417 1206
9007A206K773j930J400m262k44m85J392m639O019m536j2450R54j095M6Q167N161
$$ 1206 3979 2049 3449 -813 -1057 -1542 -150 -4789 1230 -3306 -15756 -14802 -15897 -15851 -7684 -2523
8991b523L075l308n159L287M32m91l441K721r22m174P129Q763L53r651j3520K683
$$ -2523 552 -2756 -7915 -4628 -4196 -4687 -8128 -5407 -6329 -10503 -3374 5389 5742 -3909 -17429 -14746
8975a4746J1658L616N423K632m481p515k326L764j956j187K391n798j132K590
$$ -14746 -3088 528 5951 8583 4102 -3413 -5739 -1975 -3931 -5118 -2727 -8525 -9657 -7067
8961g067K560L237K10m755O008J971j1826o8M781k309m205M570L625K693K820
$$ -7067 -4507 -1270 -1060 -5815 193 2164 -9662 -9730 -4949 -7258 -11463 -6893 -3268 -575 2245
8946B245l283J050J149k261L325k61j591K434K717L800L02o1l516p598J43Q28
$$ 2245 -1038 12 1161 -1100 2225 1964 373 2807 5524 9324 9626 9565 6049 -1549 -1406 -578
8930e78J820J120m298m077K206J435O264j145j10J917K334k160p831j303k387
$$ -578 1242 2362 -1936 -6013 -3807 -2372 3892 2747 2637 4554 6888 4728 -3103 -4406 -6793
8915f793j494M387j695n056L799N940m647j907J0865K088L839q612J180J044J057
$$ -6793 -8287 -3900 -5595 -10651 -6852 -912 -5559 -7466 3399 5487 9326 714 1894 2938 3995
8900C995J628n089j820ML62p61m026j531L483P701Q729J376n741q991n050N462
$$ 3995 5623 534 -1286 -1282 -920 -1681 -5707 -7238 -3755 3946 12675 14051 8310 -681 -5731 -269
8884b69l964j0091K524P463M143l817M453M499l661j023k45m853k766K986J521
$$ -269 -4233 -14324 -11800 -4337 -194 -4011 442 4941 1280 257 12 -4841 -7607 -4621 -3100
8869c100R6k32o491J0522K947o253M764N615J117J436r609l309m187N140M216
$$ -3100 -3004 -3236 -9727 795 3742 -2511 2253 7868 8985 10421 812 -2497 -6684 -1544 2672
8854B672K193n24n720m489L81O191r6l000J352M089L826J250l141K089L592k750
$$ 2672 4865 4341 -1379 -5868 -5487 704 608 -2392 -1040 3049 6875 8125 4984 7073 10665 7915
8838G915M135K118p055m973M386j221n892K743J502L387m489p13L535J099l372
$$ 7915 12050 14168 7113 2140 6526 5305 -587 2156 3658 7045 2556 1843 5378 6477 3105
8823C105l275k866l686j79M234J242n178O788J211l361k135l504j691P235m88
$$ 3105 -170 -3036 -6722 -6901 -2667 -1425 -6603 185 1396 -1965 -4100 -7604 -9295 -2060 -2548
8808b548n46L396j602l702L92J242p102l239j911o100N396N068k334L082L395
$$ -2548 -3094 302 -1300 -5002 -4610 -3368 -10470 -13709 -15620 -21720 -16324 -11256 -13590 -10508 -7113
8793g113j159N18P25Q859P130R84q047p45O250j749m651r13o88M386n973p091
$$ -7113 -8272 -7754 -7029 1830 8960 9944 1897 1152 7402 5653 1002 89 -599 3787 -2186 -9277
8777i277n314O059R056Q07m480N2N397n341k620r62j036J461J123Q255O278n339
$$ -9277 -14591 -8532 524 1331 -3149 -3097 2300 -3041 -5661 -6623 -7659 -6198 -5075 3180 9458 4119
8761D119m80M64l952n242l267L412l388J837N198M189m586j470k161k339K788
$$ 4119 3639 4103 151 -5091 -8358 -4946 -8334 -6497 -1299 2890 -1696 -3166 -5327 -7666 -4878
8746d878J667q58l53J506J270J718M295m510k027K326j38K108j953k648o8J149
$$ -4878 -3211 -4069 -4422 -2916 -1646 72 4367 -143 -2170 156 18 2126 173 -2475 -2543 -1394
8730a394j850N780M154m005k045J326j580K549k235K95l79k515k87R129J353n17
$$ -1394 -3244 2536 6690 2685 640 1966 386 2935 700 995 616 -1899 -2186 6943 8296 7779
8714G779m446m99K70q311n995J199P003L09m502L670K889L65O708O878m548j883
$$ 7779 3333 2834 3104 -5207 -11202 -10003 -3000 -2691 -7193 -3523 -634 -269 6439 13317 8769 6886
8698F886P46n210p428K761j568J089Q701N767k416j724L947k278m476J95m856
$$ 6886 7632 2422 -5006 -2245 -3813 -2724 5977 11744 9328 7604 11551 9273 4797 4992 136
8683A36m540J405r160J904N510M995j628K76k374M223l1j725Mm441N800M114N296
$$ 136 -4404 -2999 -12159 -10255 -4745 250 -1378 -1102 -3476 747 716 -1009 -1005 -5446 354 4468 9764
8666I764J18n980p454m596l985J200Q540L228m612L425j478k045Q82J197m84k709
$$ 9764 9882 3902 -3552 -8148 -12133 -10933 -2393 835 -3777 -352 -1830 -3875 -2993 -1796 -2280 -4989
8650d989J346o220l266N91P677P974K598j34k933o247j355K049M984J0860q961
$$ -4989 -3643 -9863 -13129 -12538 -4861 3113 5711 5577 2644 -3603 -4958 -2909 2075 12935 3974
8635C974k294j749l40L9L671J242l31p219k217M098L453l385o223M230R423J754
$$ 3974 1680 -69 -409 -370 3301 4543 4212 -3007 -5224 -1126 2327 -1058 -7281 -3051 6372 8126
8619H126j92L469l332Q09J44J325j11o617l272l774k070L781L621L493K603j808
$$ 8126 7934 11403 8071 8880 9024 10349 10238 3621 349 -3425 -5495 -1714 1907 5400 8003 6195
8603F195n611m454J477q10n86J091k006p35L110K629l53k025N526l623n161M243
$$ 6195 584 -3870 -2393 -3203 -3789 -2698 -4704 -5439 -2329 300 -53 -2078 3448 -175 -5336 -1093
8587a093R672n50l323j760o04m05k781J052k390p473k628l562k04K468K355l98
$$ -1093 8579 8029 4706 2946 2342 1937 -844 208 -2182 -9655 -12283 -15845 -16049 -13581 -11226 -11624
8571a1624P35O394N572k715K135L881k081J133K222q797m357L749K486l862K344
$$ -11624 -10889 -4495 1077 -1638 497 4378 2297 3430 5652 -3145 -7502 -3753 -1267 -5129 -2785
8556b785L901k409J146N2N163K575M379j349J423O541n428r602k640N474N942
$$ -2785 1116 -1293 -147 -95 5068 7643 12022 10673 12096 18637 13209 3607 967 6441 12383
8541A2383m204l00P36r571j0674J819J1949M08o235L838P670K90K375k797k529
$$ 12383 8179 7879 8615 -956 -11630 -9811 2138 2546 -3689 149 7819 8109 10484 7687 5158
8526E158k507r16K223j749K059K093K65r558l03k394N753n376P68N770K047k72
$$ 5158 2651 1735 3958 2209 4268 6361 6626 -2932 -3235 -5629 124 -5252 -4484 1286 3333 3061
8510C061O987n85q893L382K527n247L07M650K778o624n290O282L396J846O23p17
$$ 3061 10048 9463 570 3952 6479 1232 1539 6189 8967 2343 -2947 3335 6731 8577 9200 8483
8494H483n572o629P97R643J503r101O9J135Q65j193j215J777j981M186L646l500
$$ 8483 2911 -3718 -2921 6722 8225 -876 -807 328 1193 0 -1215 562 -1419 2767 6413 2913
8478B913o629O43k95N91k212k878N454j607l745j185m221O354N214j04j392J377
$$ 2913 -3716 -3073 -3368 -2777 -4989 -7867 -2413 -4020 -7765 -8950 -13171 -6817 -1603 -1707 -3099 -1722
8462a722J773n008j603K394K872J176J633k160k182Q514j168r033n145L571O349
$$ -1722 51 -4957 -6560 -4166 -1294 -118 1515 -645 -2827 5687 4519 -4514 -9659 -6088 261
8447B61M16Q584N606j351J052M846K076o019p495q240l143k637r75n317O912k644
$$ 261 677 9261 14867 13516 14568 19414 21490 15471 7976 -264 -3407 -6044 -7019 -12336 -5424 -8068
8431h068n58n62M350O500L718R60j928m441m700N760Q318k013p347n996l639K727
$$ -8068 -8626 -9188 -4838 1662 5380 6340 4412 -29 -4729 1031 9349 7336 -11 -6007 -9646 -6919
8415f919K514L616K128M099r62m8K733j60m289m12k571n180l655K633j033n274
$$ -6919 -4405 -789 1339 5438 4476 4428 7161 7001 2712 2300 -271 -5451 -9106 -6473 -7506 -12780
8399a2780n807K649J4205J1308p477p435L409O83L146K29l902j115l735O515K118
$$ -12780 -18587 -15938 -1733 9575 2098 -5337 -1928 -1245 1901 2130 -1772 -2887 -6622 -107 2011
8384B011k66k180n69p49J443K034j323N39N235l924K324K123K704R02k775m902
$$ 2011 1745 -435 -1004 -1753 -310 1724 401 940 6175 2251 4575 6698 9402 10304 7529 2627
8368B627m354K137L767p52o389m014L254J790M409K652j049J697j206J549p03
$$ 2627 -1727 410 4177 3425 -2964 -6978 -3724 -1934 2475 5127 4078 5775 4569 6118 5415
8353E415o329J252k057n215k178J858P448N913L649n764K170k464k936K795j598
$$ 5415 -914 338 -1719 -6934 -9112 -7254 194 6107 9756 3992 6162 3698 762 3557 1959
8338A959j559K031j552j200K284j220k688L073l244l504p89M350r52L78j920k904
$$ 1959 400 2431 879 -321 1963 743 -1945 1128 -2116 -5620 -6409 -2059 -3011 -2633 -4553 -7457
8322g457J1306M568l775k03m360J992K253k746m494j206K946K116jM587k517j370
$$ -7457 3849 8417 4642 4439 79 2071 4324 1578 -2916 -4122 -1176 940 939 5526 3009 1639
8306A639O536K207k28N81j422m635J658r38l485M28J597n253l864m600j402j133
$$ 1639 8175 10382 10154 10735 9313 4678 6336 5398 1913 2341 3938 -1315 -5179 -9779 -11181 -12314
8290a2314r62M973N878Q38j02n270M068K242L328L629m67k200o351k861Q370O961
$$ -12314 -13276 -8303 -2425 -1587 -1689 -6959 -2891 -649 2679 6308 5841 3641 -2710 -5571 2799 9760
8274I760k669m155j7l132m040n097Q05J725q76m388K771K219K556l416L120J503
$$ 9760 7091 2936 2919 -213 -4253 -9350 -8545 -6820 -7696 -12084 -9313 -7094 -4538 -7954 -4834 -3331
8258c331J193m21k492M871M417J240M172m466k391O02L786j601Q88o69K076R32
$$ -3331 -2138 -2559 -5051 -180 4237 5477 9649 5183 2792 3394 7180 5579 6467 5798 7874 8806
8242H806k788m913j632k803n548Q237L378j568l159m389j802p86j54N879K000
$$ 8806 6018 1105 -527 -3330 -8878 -641 2737 1169 -1990 -6379 -8181 -8967 -9121 -3242 -1242
8227a242K34l814l258L168O236J052l595j592M248j458Q59q310n660P547J300
$$ -1242 -1008 -4822 -8080 -4912 1324 2376 -1219 -2811 1437 -21 838 -7472 -13132 -5585 -4285
8212d285J148m238M662O658O401J680q095o025p26r282K673O521L625N823l850
$$ -4285 -3137 -7375 -2713 3945 10346 12026 3931 -2094 -2820 -12102 -9429 -2908 717 6540 2690
8197B690j3619R53J422O170P156L132p48J698r127j1382j188J1464M096j47l255
$$ 2690 -10929 -9976 -8554 -2384 4772 7904 7156 8854 -273 -11655 -12843 -1379 2717 2570 -685
8182f85k146j249j165j422k308L706L180J202k925o93O889L745r812p26K086K537
$$ -685 -2831 -4080 -5245 -6667 -8975 -5269 -2089 -887 -3812 -4505 2384 6129 -3683 -4409 -2323 214
8166B14o75j931J320j539l733O69L183m281o728N982N020M241l540j927L774P238
$$ 214 -461 -2392 -1072 -2611 -6344 -5675 -2492 -6773 -13501 -7519 -2499 1742 -1798 -3725 49 7287
8150G287l681o122L87K395L97O01J663m110O41J591m676k780j348O878M217j436
$$ 7287 3606 -2516 -2129 266 663 1264 2927 -1183 -542 1049 -3627 -6407 -7755 -877 3340 1904
8134A904J746L129k405k249M295L544m545o478k169J173p839K494O862L235k055
$$ 1904 3650 6779 4374 2125 6420 9964 5419 -1059 -3228 -2055 -9894 -7400 -538 2697 642
8119F42q318J637J231l659M30P187J1944L294m250j656m956k765k0q68J414M63
$$ 642 -7676 -6039 -4808 -8467 -8037 -850 11094 14388 10138 8482 3526 761 741 -127 1287 1750
8103A750k402k80j56M236N089L663m68m003n609q289q64K251N243M187N809n47
$$ 1750 -652 -932 -1088 3148 8237 11900 11432 7429 1820 -6469 -7333 -5082 161 4348 10157 9610
8087I610P37K144n745m796N333K228m037j771j059L338J122J611q59j4995j89
$$ 9610 10347 12491 6746 1950 7283 9511 5474 3703 2644 5982 7104 8715 7856 -7139 -7328
8072g328M117P828K06k859O84n942J508o825j649p21M828M837j632k199K596o12
$$ -7328 -3211 4617 4823 1964 2648 -3294 -1786 -8611 -10260 -10981 -6153 -1316 -2948 -5147 -2551 -3163
8056c163k903N9l685m812j018J326J70P173Q678L987L680p172n234k739l390K048
$$ -3163 -6066 -6007 -9692 -14504 -15522 -14196 -14026 -6853 1825 5812 9492 2320 -2914 -5653 -9043 -6995
8040f995N948K067l173K395q3l699j122J471L24m30L735J118k843k121q898m101
$$ -6995 -1047 1020 -2153 242 159 -3540 -4662 -3191 -2867 -3297 438 1556 -1287 -3408 -12306 -16407
8024a6407M820J0849j863n299q69J098k69k508K333J730j519o82L193L204m16
$$ -16407 -11587 -738 -2601 -7900 -8769 -7671 -7940 -10448 -8115 -6385 -7904 -8586 -5393 -2189 -2605
8009b605O253n40m059j461j592k261j648k63O336k527P05K61K188R738L853n037
$$ -2605 3648 3108 -951 -2412 -4004 -6265 -7913 -8176 -1840 -4367 -3662 -3401 -1213 8525 12378 7341
7993G341n522k822M101k221J8J988K909o111o800l270M549O66N738J780P659K547
$$ 7341 1819 -1003 3098 877 895 2883 5792 -319 -7119 -10389 -5840 -5174 564 2344 10003 12550
7977A2550j343j900j815p61N098l514n787K347L381q983l912J43K263J892q149
$$ 12550 11207 9307 7492 6731 11829 8315 2528 4875 8256 -727 -4639 -4496 -2233 -341 -8490
7962h490k070M113k601M162J4384L949J723k082j264m95K9j900O445k173l701
$$ -8490 -10560 -6447 -9048 -4886 9498 13447 15170 13088 11824 11329 11358 9458 15903 13730 10029
7947A0029k055j501o503j071p666J211M6K244K929L006M519O277Q52r763n042
$$ 10029 7974 6473 -30 -1101 -8767 -7556 -7510 -5266 -2337 669 5188 11465 12317 2554 -2488
7932b488M391k846m684l747M360J0413M982k320q36K110j138O233l500r734j444
$$ -2488 1903 -943 -5627 -9374 -5014 5399 10381 8061 7225 9335 8197 14430 10930 1196 -248
7917b48J520j485n818K531N363J944p502j0592k53k647P433L259j785N792K543
$$ -248 1272 -213 -6031 -3500 1863 3807 -3695 -14287 -14540 -17187 -9754 -6495 -8280 -2488 55
7902E5k623l390j875K252K900k086k143j504J810j014P51J77K216M498m903N121
$$ 55 -2568 -5958 -7833 -5581 -2681 -4767 -6910 -8414 -6604 -7618 -6867 -6690 -4474 24 -4879 242
7886B42J0817n639o163k938j184K771K755j826j091N864J235J67K86p185K006
$$ 242 11059 5420 -743 -3681 -4865 -2094 661 -1165 -2256 3608 4843 5010 5296 -1889 117
7871A17N932K254q902m255n001m563K598Q858Q136l18J418J630M93n36L72J736
$$ 117 6049 8303 -599 -4854 -9855 -14418 -11820 -2962 5174 4856 6274 7904 8397 7861 8233 9969
7855I969j0844l402k783M433O19N02K702k03n435M21J259j613K512J1691K826
$$ 9969 -875 -4277 -7060 -2627 -2008 -1506 1196 993 -4442 -4021 -2762 -4375 -1863 9828 12654
7840A2654k00M976o473j2638j488J0353J093l982r225q306P36J638M30k405N99
$$ 12654 12454 17430 10957 -1681 -3169 7184 8277 4295 -4930 -13236 -12500 -10862 -10432 -12837 -12238
7825a2238M240m373M1K080j178O016p97K012P101O34J625n590j183P143n774K812
$$ -12238 -7998 -12371 -12330 -10250 -11428 -5412 -6209 -4197 2904 3538 5163 -427 -1610 5533 -241 2571
7809B571L074j456j0362p990K958L454N255m232l623l967J441j787n594N844N335
$$ 2571 5645 4189 -6173 -14163 -11205 -7751 -2496 -6728 -10351 -14318 -12877 -14664 -20258 -14414 -9079
7794i079R322N555L850k08n135j728j860q524l17M80J706L692j898l386L455K22
$$ -9079 243 5798 9648 9440 4305 2577 717 -7807 -8124 -7644 -5938 -2246 -4144 -7530 -4075 -3853
7778c853K589o66n4J237L635K585l774K229j495R48l036m165l155O607J1940O595
$$ -3853 -1264 -1930 -1984 -747 2888 5473 1699 3928 2433 3381 345 -3820 -6975 -368 11572 18167
7762A8167N809m611p254o542j0726m02N744J224l966j470J348o182L446N635k854
$$ 18167 23976 19365 12111 5569 -5157 -5559 185 1409 -2557 -4027 -2679 -8861 -5415 220 -2634
7747b634k824q009m702j942N893j714N020O288Q698K022R03j816N400K434l00
$$ -2634 -5458 -13467 -18169 -20111 -14218 -15932 -10912 -4624 4074 6096 6999 5183 10583 13017 12717
7732A2717J7o386k088l887j164q83j125q58j726j644k479j237K240O518N967m39
$$ 12717 12734 6348 4260 373 -791 -1674 -2799 -3657 -5383 -7027 -9506 -10743 -8503 -1985 3982 3543
7716C543j439m526n737k537K822o12j0178J009j426p60J287L521Q836P683O892
$$ 3543 2104 -2422 -8159 -10696 -7874 -8486 -18664 -17655 -19081 -19841 -18554 -15033 -6197 1486 8378
7701H378L217k178K895l487q149j218k912K62J005L902j759k059m79l864j310
$$ 8378 11595 9417 12312 8825 676 -542 -3454 -3192 -2187 1715 -44 -2103 -2582 -6446 -7756
7686g756k728k91L667J924l441j05M82k872j273J603L248K073K634R4p8o74m032
$$ -7756 -10484 -10775 -7108 -5184 -8625 -8730 -8248 -11120 -12393 -10790 -7542 -5469 -2835 -2741 -2819 -3493 -7525
7669g525k324M237k590n923K729K446L205L782L893r38k420R61K39R6k117J524
$$ -7525 -9849 -5612 -8202 -14125 -11396 -8950 -5745 -1963 1930 992 -1428 -467 -228 -132 -2249 -725
7653g25R23k154o758J970J286o823k657M273N427n93L145J99k739M013j543k199
$$ -725 198 -1956 -8714 -6744 -5458 -12281 -14938 -10665 -5238 -5831 -2686 -2487 -5226 -1213 -2756 -4955
7637d955K181J646J114q071j286j837j418O062J193J483J162k889k382m142K978
$$ -4955 -2774 -1128 -14 -8085 -9371 -11208 -12626 -6564 -5371 -3888 -2726 -5615 -7997 -12139 -9161
7622i161j054M390P140M41n20j172k780L196p090p454N927L905K481l300k924
$$ -9161 -10215 -5825 1315 1756 1236 64 -2716 480 -6610 -14064 -8137 -4232 -1751 -5051 -7975
7607g975k259l523J054O895N125o707n804M747N850j716k261k892q01J197L59
$$ -7975 -10234 -13757 -12703 -5808 -683 -7390 -13194 -8447 -2597 -4313 -6574 -9466 -10267 -9070 -8711
7592h711L197K224K378l326m044M937K782n64J295L002j61j476l639q30J575q55
$$ -8711 -5514 -3290 -912 -4238 -8282 -3345 -563 -1127 168 3170 3009 1533 -2106 -2936 -1361 -2216
7576b216K328J55L584m29q035m997N556P21M303o77K471J509l687l541m893J583
$$ -2216 112 267 3851 3422 -4613 -9610 -4054 -3333 970 293 2764 4273 586 -2955 -7848 -6265
7560f265J247M49M152n88P986L620m256K065k862o502l434M746j213o506J77j459
$$ -6265 -5018 -4569 -417 -1005 6981 10601 6345 8410 5548 -954 -4388 358 -855 -7361 -7184 -8643
7544h643j928J595P524N967J42l958L29P14K618l601j55n675O671M751j843j306
$$ -8643 -10571 -8976 -1452 4515 4657 699 1028 1742 4360 759 604 -5071 1600 6351 4508 3202
7528C202m759M38O968n83l568p008R50n11J223L013J461L730l872l357L076L814
$$ 3202 -1557 -1119 5849 5266 1698 -5310 -4360 -4871 -3648 -635 826 4556 684 -2673 403 4217
7512D217L656j221k952N135K203J071J40n299j977k990p831Q47Q240M595j065
$$ 4217 7873 6652 3700 8835 11038 12109 12249 6950 4973 1983 -5848 -5001 3239 7834 6769
7497F769j824p030l991K54j301K781K635K544L455J593l607Q33n425p362l049
$$ 6769 4945 -2085 -6076 -5822 -7123 -4342 -1707 837 4292 5885 2278 3111 -2314 -9676 -12725
7482a2725L253j56j192K903M235l245l447j683L030N708M066k546o907N89k974
$$ -12725 -9472 -9628 -10820 -7917 -3682 -6927 -10374 -12057 -9027 -3319 747 -1799 -8706 -8117 -11091
7467a1091p38L222K21j592O982N069o43l148O213L725L521L60m470o537n578M415
$$ -11091 -11829 -8607 -8386 -9978 -2996 2073 1430 -1718 4495 8220 11741 12101 7631 1094 -4484 -69
7451f9J975p32k273m654J826k111M12K169m420o902M418N982k570K917L043M857
$$ -69 1906 1174 -1099 -5753 -3927 -6038 -5626 -3457 -7877 -14779 -10361 -4379 -6949 -4032 -989 3868
7435C868k157m446k423j870m54K042P95K823K3m386J224j580N528R799N402K027
$$ 3868 1711 -2735 -5158 -7028 -7482 -5440 -4645 -1822 -1799 -6185 -4961 -6541 -1013 8786 14188 16215
7419A6215r992l057L862m227n171p060k54P08N524N189J064o583j46P695k47m167
$$ 16215 6223 3166 7028 2801 -2370 -9430 -9684 -8976 -3452 1737 2801 -3782 -3928 3767 3520 -647
7403f47k039j454R93j331K620O89M888P45j936l024l920j606P004N474k159K525
$$ -647 -2686 -4140 -3147 -4478 -1858 -1169 3719 4464 2528 -496 -4416 -6022 982 6456 4297 6822
7387F822P89n781J152j130m351M046j845j051L341N428n504K863J234j313m431
$$ 6822 7611 1830 2982 1852 -2499 1547 -298 -1349 1992 7420 1916 4779 6013 4700 269
7372B69J237N500J438J574K209m777l074m233o982O661Q381L48M025p42p3l07
$$ 269 1506 7006 8444 10018 12227 7450 4376 143 -6839 -178 8203 8551 12576 11834 11761 11454
7356A1454p751n293p22J382K877J1137o8n211p038J221m94k429n400K16J0456
$$ 11454 3703 -1590 -2312 -930 1947 13084 13016 7805 767 1988 1494 -935 -6335 -6119 4337
7341D337N518l244j660J858o126m303N985N130q996m711n703k86R786N698o762
$$ 4337 9855 6611 4951 6809 683 -3620 2365 7495 -1501 -6212 -11915 -12201 -2415 3283 -3479
7326c479l247N865P178K20m171J450N456L198J479p685j4617K30P82N184M692
$$ -3479 -6726 -861 6317 6537 2366 3816 9272 12470 13949 6264 -8353 -8123 -7341 -2157 2535
7311B535l091L004O74m261O286M688o466m054j833l085l9J097n481M09r62J654
$$ 2535 -556 2448 3122 -1139 5147 9835 3369 -685 -2518 -5603 -5642 -4545 -10026 -9617 -10579 -8925
7295h925J0722K048j790J377M761O09n141o540m531J959m213N124M578n696M000
$$ -8925 1797 3845 2055 3432 8193 8802 3661 -2879 -7410 -5451 -9664 -4540 38 -5658 -1658
7280a658K467j641L883j135O84j453N804j201p395j762o894J87M803O120K145
$$ -1658 809 -832 3051 1916 2600 1147 6951 5750 -1645 -3407 -10301 -10114 -5311 809 2954
7265B954k163L655k187l932m24L549k202m024k800L13P817j419q094p351m691
$$ 2954 791 4446 2259 -1673 -2097 1452 -750 -4774 -7574 -7261 556 -863 -8957 -16308 -20999
7250b0999J0071K947M136J714J788K518M688n42K068n964k120L842J876r4k540
$$ -20999 -10928 -7981 -3845 -2131 -343 2175 6863 6321 8389 2425 305 4147 6023 5929 3389
7235C389l322k171l70M742p16K32J791l515p803q95j091N567J438N141O972n071
$$ 3389 67 -2104 -2474 2268 1552 1784 3575 60 -7743 -8638 -9729 -4162 -2724 2417 9389 4318
7219D318m006K639J466O352J069j517n27n656K42L040L987K085k332l803l357
$$ 4318 312 2951 4417 10769 11838 10321 9794 4138 4380 7420 11407 13492 11160 7357 4000
7204D000m484n943m565j702J184Q40q2K203Q642K002p385l292M701K709K832J112
$$ 4000 -484 -6427 -10992 -12694 -11510 -10670 -10752 -8549 93 2095 -5290 -8582 -3881 -1172 1660 2772
7188B772j711L781r215L74J74L75k323J54O97K83n24o81Q33O321N11l586l881
$$ 2772 1061 4842 -4373 -3999 -3825 -3450 -5773 -5619 -4922 -4639 -5163 -5844 -5011 1310 1821 -1765 -5646
7171e646k440j865N67L992L209O052O190K72n083p283L784O027p569l065L982
$$ -5646 -8086 -9951 -9384 -5392 -2183 3869 10059 10331 5248 -2035 1749 7776 207 -2858 1124
7156A124k744K714N625j392k753k056j855l438o448o11m562K39j440O499L667
$$ 1124 -1620 1094 6719 5327 2574 518 -1337 -4775 -11223 -11834 -16396 -16157 -17597 -11098 -7431
7141g431n853j672L676L070L534q2J339K837m37o28J993L698M284j799M345l578
$$ -7431 -13284 -14956 -11280 -8210 -4676 -4758 -3419 -582 -1019 -1647 346 4044 8328 6529 10874 7296
7125G296l336k235K195m607R89O54j155j452m038K004N572R03L85N497L089r281
$$ 7296 3960 1725 3920 -687 302 956 -199 -1651 -5689 -3685 1887 2790 3175 8672 11761 2480
7109B480k193N6k290J015O98K644M4J056j409J460m414p690k58N808m49j327J873
$$ 2480 287 343 -1947 -932 -234 2410 2454 3510 2101 3561 -853 -8543 -8801 -2993 -3442 -4769 -2896
7092b896L163n038K827K16J267K044M513r171l3l55r31K134n79j363r2l180L672
$$ -2896 267 -4771 -1944 -1728 -461 1583 6096 -3075 -3108 -3463 -4394 -2260 -2839 -4202 -4294 -7474 -3802
7075c802J215m305m212n53N988J1080P212N521k574q457m394M448l002m005k300
$$ -3802 -2587 -6892 -11104 -11657 -5669 5411 12623 18144 15570 7113 2719 7167 4165 160 -2140
7060b140n180j632L539K48K78J269n490l620L824J578L242j217m022l979k747
$$ -2140 -7320 -8952 -5413 -5165 -4887 -3618 -9108 -12728 -8904 -7326 -4084 -5301 -9323 -13302 -16049
7045a6049L065M584L535l745j859J205J426J460O336M511m721k754j294O00M144
$$ -16049 -12984 -8400 -4865 -8610 -10469 -9264 -7838 -6378 -42 4469 -252 -3006 -4300 -3700 444
7030D44J390K074m222p070j812m808Q49L925K547L811K914L753l159j849l426
$$ 444 1834 3908 -314 -7384 -9196 -14004 -13155 -9230 -6683 -2872 42 3795 636 -1213 -4639
7015d639l970K308L970J714K057N375j235q897n057p103j499J767L173O6M073
$$ -4639 -8609 -6301 -2331 -617 1440 6815 5580 -3317 -8374 -15477 -16976 -15209 -12036 -11970 -7897
7000g897P117K043m153j998K160K782K000J997J408j451o120o39l874j070L245
$$ -7897 -780 1263 -2890 -4888 -2728 54 2054 4051 5459 4008 -2112 -2751 -6625 -7695 -4450
6985d450L025j40P08K025p091k648M558r66l659j418P995K636N147j340m056M385
$$ -4450 -1425 -1565 -857 1168 -5923 -8571 -4013 -4979 -8638 -10056 -2061 575 5722 4382 326 4711
6969D711R87J763l295l715K234K984l090k668M914j634l152N748n70m178L23p917
$$ 4711 5698 7461 4166 451 2685 5669 2579 -89 4825 3191 39 5787 5217 1039 1362 -6555
6953f555J765N460J162J461M11n255M028j087N53o939j0558N162K313J328m44
$$ -6555 -4790 670 1832 3293 3704 -1551 2477 1390 1943 -4996 -15554 -10392 -8079 -6751 -7195
6938g195j059l363l362J4632J1294L56m571R24l667n710j017m23k742K769J804
$$ -7195 -8254 -11617 -14979 -347 10947 11303 6732 7656 3989 -1721 -2738 -3161 -5903 -3134 -1330
6923a330K90M731m906r36k85m619Q15J798J319m178n28J095l100K410P341k687
$$ -1330 -1040 3691 -1215 -2151 -2436 -7055 -6240 -4442 -3123 -7301 -7829 -6734 -9834 -7424 -83 -2770
6907b770p994Q48M247M178l820J423P555P9n483r043J644J0384L351K1r480j405
$$ -2770 -10764 -9916 -5669 -1491 -5311 -3888 3667 3746 -1737 -10780 -9136 1248 4599 4620 -4860 -6265
6891f265K161L635Q48l789N627j926j60j814l579n810k692N572J626l24j292J512
$$ -6265 -4104 -469 379 -3410 2217 291 131 -1683 -5262 -11072 -13764 -8192 -6566 -6890 -8182 -6670
6875f670L449L972m91n22l652O47K178k148q416n75M859O28m40P984N569N72j991
$$ -6670 -3221 751 260 -262 -3914 -3267 -1089 -3237 -11653 -12228 -7369 -6741 -7181 803 6372 6944 4953
6858D953j271o691J885k658n134k445m9J334R058P494j299p489r038n686M878
$$ 4953 3682 -3009 -1124 -3782 -8916 -11361 -11410 -10076 -1018 6476 5177 -2312 -11350 -17036 -12158
6843a2158N799K415L642P2P51j93J573j017k697m035J604L170L997N667L17o828
$$ -12158 -6359 -3944 -302 -230 521 328 1901 884 -1813 -5848 -4244 -1074 2923 8590 8907 2079
6827B079O96r84K845k203n062N383N785j14o147j468O056J671k192l165m46K678
$$ 2079 2775 1791 4636 2433 -2629 2754 8539 8425 2278 810 6866 8537 6345 3180 2734 5412
6811E412k858K543k179l009J913K454K270l493k871j674M734l432m960L891o61
$$ 5412 2554 5097 2918 -91 1822 4276 6546 3053 182 -1492 3242 -190 -5150 -1259 -1920
6796a920L792p45l353K740J387J072m953K755Q41Q88j082J428n453k932K038R36
$$ -1920 1872 1127 -2226 514 1901 2973 -1980 775 1616 2504 1422 2850 -2603 -5535 -3497 -2561
6780b561k136M129K774K716k515M584J324q958l95J645j215P32L255N562N188
$$ -2561 -4697 -568 2206 4922 2407 6991 8315 -643 -1038 607 -608 124 3379 8941 14129
6765A4129N957k972j0877q370M86N089N540j793L87k661p712m523K109K736J121
$$ 14129 20086 17114 6237 -2133 -1647 3442 8982 7189 7576 4915 -2797 -7320 -5211 -2475 -1354
6750a354l476k500L868K310m57R097L070q275l702k620R4J259M910P291p09K64
$$ -1354 -4830 -7330 -3462 -1152 -1609 7488 10558 2283 -1419 -4039 -3945 -2686 2224 9515 8806 9070
6734I070n08r478p986M269R290L397r696o980K614L156N095J319j101p66j346
$$ 9070 8562 -916 -8902 -4633 4657 8054 -1642 -8622 -6008 -2852 2243 3562 2461 1695 349
6719C49nk403n083o84J0249N546j0847m381k767l893K016Q021N989j419p81K69
$$ 349 344 -2059 -7142 -7826 2423 7969 -2878 -7259 -10026 -13919 -11903 -3882 2107 688 -93 176
6703A76k7N40p313j389N394J995k068o606L06N903N906p45K95J667J127j099k495
$$ 176 149 689 -6624 -8013 -2619 -624 -2692 -9298 -8992 -3089 2817 2072 2367 4034 5161 4062 1567
6686A567k477k716K6L668L804J78J096J868l371l71M99k752K146m414n766N752
$$ 1567 -910 -3626 -3600 68 3872 4050 5146 7014 3643 3272 3771 1019 3165 -1249 -7015 -1263
6670a263L222L7L882k966k133j188N504j732J060J689K227n469O35L74N206L20
$$ -1263 1959 1996 5878 2912 779 -409 5095 3363 4423 6112 8339 2870 3505 3879 9085 9405
6654I405j320k777p557l481k845k981J495M516L096k910M99L764O13K378m139
$$ 9405 8085 5308 -2249 -5730 -8575 -11556 -10061 -5545 -2449 -5359 -4860 -1096 -483 1895 -2244
6639b244o578l298k810l678J1617J0027M047j735l866o88n342o783j229M089J79
$$ -2244 -8822 -12120 -14930 -18608 -6991 3036 7083 5348 1482 794 -4548 -11331 -12560 -8471 -8292
6624h292j0175k504N204J2720O689k480l402n755L133N336K112k802j424k22l6
$$ -8292 -18467 -20971 -15767 -3047 3642 1162 -2240 -7995 -4862 474 2586 -216 -1640 -1862 -1898
6609a898P853O887k350j407L587j837m22n598p353N164N51r49l228k163J222k868
$$ -1898 5955 12842 10492 9085 12672 10835 10413 4815 -2538 2626 3177 2228 -1000 -3163 -1941 -4809
6593d809k971O504M092J000k543N29j20j975k6K392M381J49p075l495j595q31
$$ -4809 -7780 -1276 2816 3816 1273 1802 1682 -293 -319 2073 6454 6603 -472 -3967 -5562 -6393
6577f393P781n692m624j48L816m92J917k942k987m76j707J909R473K899m233J723
$$ -6393 1388 -4304 -8928 -9076 -5260 -5752 -3835 -6777 -9764 -10240 -11947 -10038 -565 2334 -1899 -176
6561a76P41o016k156K876N543J684j98m289M137L569j0104J57K657K057J254j553
$$ -176 565 -5451 -7607 -4731 812 2496 2298 -1991 2146 5715 -4389 -4232 -1575 482 1736 183
6545A83j780J551J1109J87j4742m897L554N87l13K40K933j17l346n20L446M19
$$ 183 -1597 -46 11063 11250 -3492 -8389 -4835 -4248 -4561 -4321 -1388 -1505 -4851 -5371 -1925 -1506
6529a506k018j987J638L115m84l351o581j671O283l666n496N410P674J085k505
$$ -1506 -3524 -5511 -3873 -758 -1242 -4593 -11174 -12845 -6562 -10228 -15724 -10314 -2640 -1555 -4060
6514d060k957k491L691O08J060m962J317Q476k933o567L368J319K037O228Q992
$$ -4060 -7017 -9508 -5817 -5209 -4149 -9111 -7794 682 -2251 -8818 -5450 -4131 -2094 4134 13126
6499A3126k454K034L079o629n395J928K475n452m725K151L29K794j940k180j837
$$ 13126 10672 12706 15785 9156 3761 5689 8164 2712 -2013 138 467 3261 1321 -859 -2696
6484b696K614J321j55K010J074j971n451R23l36M60KJ658l292j561L924L107R78
$$ -2696 -82 1239 1084 3094 4168 2197 -3254 -2331 -2667 -2207 -2205 -547 -3839 -5400 -1476 1631 2609
6467B609L285P924O78k375j446q979m586o624m87M016l556k390L176J155j734
$$ 2609 5894 13818 14496 12121 10675 1696 -2890 -9514 -10001 -5985 -9541 -11931 -8755 -7600 -9334
6452i334N135j47J823O962P094p47k831m871p078J750O792l56j90k064k659l186
$$ -9334 -4199 -4346 -2523 4439 11533 10786 7955 3084 -3994 -2244 4548 4192 4002 1938 -721 -3907
6436c907j069M011P284J695j603o173l30J106J079O918o333j0818m682j186K371
$$ -3907 -4976 -965 6319 8014 6411 238 -92 1014 2093 9011 2678 -8140 -12822 -14008 -11637
6421a1637N807l076n46M795J0850L006m211q828n692J920L95Q380m128K2N002
$$ -11637 -5830 -8906 -9452 -4657 6193 9199 4988 -3840 -9532 -7612 -7217 1163 -2965 -2943 2059
6406B059J349K669K70n137M781L006j448K353J37k160j689l672K589K523k200
$$ 2059 3408 6077 6347 1210 5991 8997 7549 9902 10039 7879 6190 2518 5107 7630 5430
6391E430j325k564l867j832m46M270L034M238m195q175j396Q57M939K531K87m082
$$ 5430 4105 1541 -2326 -4158 -4604 -334 2700 6938 2743 -5432 -6828 -5971 -1032 1499 1786 -2296
6375b296j827K534n293l4R257r64p447j305J406N888N226J202M810l97m131m52
$$ -2296 -4123 -1589 -6882 -6916 2341 1377 -6070 -7375 -5969 -81 5145 6347 11157 10760 6629 6177
6359F177j047M08p476k851J584K284o355l889J344P905K721k00o188o837R369
$$ 6177 5130 5538 -1938 -4789 -3205 -921 -7276 -11165 -9821 -1916 805 605 -5583 -12420 -3051
6344c051J2042K023r28K200n507n22j274r063l644r66k979J619L527J018M655
$$ -3051 8991 11014 10086 12286 6779 6257 4983 -4080 -7724 -8690 -11669 -10050 -6523 -5505 -850
6329h50J386N24j416k457K798N994N862o019n218k258L393P676k4k111o471k403
$$ -850 536 1060 -356 -2813 -15 5979 11841 5822 604 -1654 1739 9415 9391 7280 809 -1594
6313a594n910J306J764l847l169J288L761O060l872p41K339p578m267N685P029
$$ -1594 -7504 -6198 -4434 -8281 -11450 -10162 -6401 -341 -4213 -4954 -2615 -10193 -14460 -8775 -1746
6298a746l84j14P838j903o02o292j03l61q9N166Q464k937Q88m340l953k170o094
$$ -1746 -2130 -2244 5594 3691 3089 -3203 -3306 -3667 -3756 1410 9874 6937 7825 3485 -468 -2638 -8732
6281h732l154K492P736J1840K549n351r960l835P98j129K165L042N73N220M189
$$ -8732 -11886 -9394 -1658 10182 12731 7380 -2580 -6415 -5617 -6746 -4581 -1539 -966 4254 8443
6266H443L183k452p478q309J494N162N80q27K018N558k597q427M098j005M356
$$ 8443 11626 9174 1696 -6613 -5119 43 623 -204 1814 7372 4775 -3652 446 -559 3797
6251C797J0582P292m693R58l151l658m196n972k732J79M166j425J114J095j760
$$ 3797 14379 21671 16978 17936 14785 11127 6931 959 -1773 -1594 2572 1147 2261 3356 1596
6236A596P083k329q733J266J182k410k793K978j637L255L733N022J147j449J022
$$ 1596 8679 6350 -2383 -1117 65 -2345 -5138 -2160 -3797 -542 3191 8213 9360 7911 8933
6221H933m718m454J627L757k205L327J515p63q656r20L266m545k095O756L838
$$ 8933 4215 -239 1388 5145 2940 6267 7782 7019 -1637 -2557 709 -3836 -5931 825 4663
6206D663j364L305K18l978k90J416N62m150l139L31M186J2271K751m987n074j3023
$$ 4663 3299 6604 6822 2844 2554 3970 4532 382 -2757 -2426 1760 14031 16782 11795 6721 -6302
6190f302o547M206J447j225M747L407m648j082m419J414j042l029R89L654J067
$$ -6302 -12849 -8643 -7196 -8421 -3674 -267 -4915 -5997 -10416 -9002 -10044 -13073 -12084 -8430 -7363
6175g363L393n183N062P095L352j0724o219M679J307J696L722K930k453j211N405
$$ -7363 -3970 -9153 -4091 3004 6356 -4368 -10587 -5908 -4601 -2905 817 3747 1294 83 5488
6160E488O801k636K632m465j0994k153J762P389k251j322K09j294K228J1179L967
$$ 5488 12289 9653 12285 7820 -3174 -5327 -3565 3824 1573 251 460 -834 1394 12573 16540
6145A6540n972j0073j1580m822K26K395N034O161M136l693l155n511l132l07O691
$$ 16540 10568 495 -11085 -15907 -15681 -13286 -8252 -2091 2045 -1648 -4803 -10314 -13446 -13753 -7062
6130g062O085P208j243j603K459K788K140o615j1188r176M339J4629J691r630
$$ -7062 -977 6231 4988 3385 5844 8632 10772 4157 -7031 -16207 -11868 2761 4452 -5178
6116e178j483K549J916O912j44j3287j578J855J596M476L287m111l006M531P051
$$ -5178 -6661 -4112 -2196 4716 4572 -8715 -10293 -8438 -6842 -2366 921 -3190 -6196 -1665 5386
6101E386M866n448m632k350J633j965O28p766R5J102M67Q20P30m466K670k019
$$ 5386 10252 4804 172 -2178 -545 -2510 -1882 -9648 -9553 -8451 -7984 -7164 -6434 -10900 -8230 -10249
6085a0249J174M845R636k792l690K899q26l688j889L686m198l832o19J109K242
$$ -10249 -9075 -4230 5406 2614 -1076 1823 997 -2691 -4580 -894 -5092 -8924 -9543 -8434 -6192
6070f192N181j672l494q631Q563R565M474K17q328q846M732O553J9j291J486K447
$$ -6192 -1011 -2683 -6177 -14808 -6245 3320 7794 8011 -317 -9163 -4431 2122 2141 850 2336 4783
6054D783l922n42K312k196K069k906q547K37k699m6L48L475J506k615P942k191
$$ 4783 861 319 2631 435 2504 -402 -8949 -8712 -11411 -11457 -11109 -7634 -6128 -8743 -801 -2992
6038b992Jo81K801M62K479j677k4j402K02O123L444K470r130q644M7j951k262
$$ -2992 -2991 -3672 -871 -409 2070 393 369 -1033 -831 5292 8736 11206 2076 -6568 -6521 -8472 -10734
6021a0734J473J285J528p313N537P065K488o806r20J207k8k952n62M056J356L7
$$ -10734 -9261 -7976 -6448 -13761 -8224 -1159 1329 -5477 -6397 -5190 -5218 -8170 -8732 -4676 -3320 -3283
6005c283K678K499O340L352l387J00k777j155l479j668j823P5P25K444k247J707
$$ -3283 -605 1894 8234 11586 8199 8299 5522 4367 888 -780 -2603 -2528 -1803 641 -1606 101
5989A01K644J900M393j847K027J664o097N96k749m662N2Q007j499m940p433k424
$$ 101 2745 4645 9038 7191 9218 10882 4785 5381 2632 -2030 -1978 6029 4530 -410 -7843 -10267
5973a0267K526O51o03k171K083K036M979J766L561k891k257J509O62j892k177
$$ -10267 -7741 -7090 -7693 -9864 -7781 -5745 -766 1000 4561 1670 -587 922 1584 -308 -2485
5958b485N200J720P05j711K982n444M016O284q433m779k39O62M504M093K285n980
$$ -2485 2715 4435 5140 3429 6411 967 4983 11267 2834 -1945 -2184 -1522 2982 7075 9360 3380
5942C380m874m09n196l721J153Q362N073j239p512n724M602K793j873o544k910
$$ 3380 -1494 -1903 -7099 -10820 -9667 -1305 3768 2529 -4983 -10707 -6105 -3312 -5185 -11729 -14639
5927a4639J3005O825L026L43o343M92P890P215l640p874j0369q586J515L24K333
$$ -14639 -1634 5191 8217 8560 2217 2709 10599 17814 14174 6300 -4069 -12655 -11140 -10816 -8483
5912h483P566O133k783p018k4O93J884k83L776N581k104n735k850L026m00l674
$$ -8483 -917 5216 2433 -4585 -4609 -3916 -2032 -2315 1461 7042 4938 -797 -3647 -621 -1021 -4695
5896d695n455P74K283N426P421l188o559m153o18M05J34j274J619n038J0K135
$$ -4695 -10150 -9376 -7093 -1667 5754 2566 -3993 -8146 -8764 -8359 -8225 -9499 -7880 -12918 -12908 -10773
$$ [...]
##END NTUPLES=NMR SPECTRUM
##END=
