##TITLE=XTC-888_1
##JCAMPDX= 6.0         $$ Bruker NMR JCAMP-DX V2.0
##DATA TYPE= nD NMR SPECTRUM
##DATA CLASS= NTUPLES
##NUM DIM= 2
##ORIGIN= BRUKER
##OWNER= patiny
$$ 1.79 TOPSPIN		Version 3.0
$$ 2012-05-19 12:14:12.525 +0200  patiny@icmbsg005
$$ Compression mode = diff/dup
##.OBSERVE FREQUENCY= 400.131429926894
##.OBSERVE NUCLEUS= ^1H
##.ACQUISITION MODE= SIMULTANEOUS (DQD)
##.ACQUISITION SCHEME= Echo-Antiecho
##.AVERAGES= 4
##.DIGITISER RES= 23
##SPECTROMETER/DATA SYSTEM= spect
##.PULSE SEQUENCE= hmbcetgpl3nd
##.SOLVENT NAME= D2O
##.SHIFT REFERENCE= INTERNAL, D2O, 1, 5.46698
##AUDIT TRAIL= $$ (NUMBER, WHEN, WHO, WHERE, PROCESS, VERSION, WHAT)
$$ ##TITLE= Audit trail, TOPSPIN		Version 3.0
$$ ##JCAMPDX= 5.01
$$ ##ORIGIN= Bruker BioSpin GmbH
$$ ##OWNER= patiny
$$ $$ /opt/data/patiny/nmr/XTC-888_1/14/pdata/1/auditp.txt
$$ ##AUDIT TRAIL=  $$ (NUMBER, WHEN, WHO, WHERE, PROCESS, VERSION, WHAT)
(   1,<2012-05-19 12:14:10.434 +0200>,<patiny>,<icmbsg005>,<go>,<TOPSPIN 3.0>,
      <created by zg
	started at 2012-05-19 11:52:03.990 +0200,
	POWCHK enabled, PULCHK disabled,
       configuration hash MD5:
       77 C7 B7 C4 10 F4 BA 30 64 2E BB 52 82 F2 DA 41
       data hash MD5: 4K * 128
       AB 3B 22 EA E2 24 13 17 24 BF E2 B1 87 39 37 3B>)
(   2,<2012-05-19 12:14:10.496 +0200>,<patiny>,<icmbsg005>,<audit>,<TOPSPIN 3.0>,
      <user comment:
       ICON-NMR User ID: patiny
       data hash MD5: 4K * 128
       AB 3B 22 EA E2 24 13 17 24 BF E2 B1 87 39 37 3B>)
(   3,<2012-05-19 12:14:11.546 +0200>,<patiny>,<icmbsg005>,<proc2d>,<TOPSPIN 3.0>,
      <Start of raw data processing
       xfb same F2: SI = 2K WDW = 3 SSB = 4 FT_mod = 6 PKNL = 1 F1: SI = 1K ME_mod = 2 NCOEF = 32 WDW = 4 SSB = 2 FT_mod = 6 PHC0 = 0 PHC1 = 0
       data hash MD5: 2K * 1K
       20 A3 C4 37 4A 65 94 D0 D1 CB 61 D9 E2 6F FB 88>)
(   4,<2012-05-19 12:14:11.665 +0200>,<patiny>,<icmbsg005>,<proc2d>,<TOPSPIN 3.0>,
      <abs2 F2: ABSG = 5 ABSF1 = 5.46698 ABSF2 = 1.680332
       data hash MD5: 2K * 1K
       A2 C4 BD 15 63 43 04 0C 6F E2 8B 2D EF 34 A9 06>)
(   5,<2012-05-19 12:14:11.841 +0200>,<patiny>,<icmbsg005>,<proc2d>,<TOPSPIN 3.0>,
      <abs1 F1: ABSG = 5 ABSF1 = 210.754 ABSF2 = -11.10083
       data hash MD5: 2K * 1K
       67 19 D1 31 DF BC 6E 39 36 54 07 88 BC 09 36 39>)
$$ ##END=
$$ 
$$ $$ hash MD5
$$ $$ 80 2F 57 09 AE C1 F6 F1 27 17 72 2C 1C 05 8C 76
##$RELAX= 
##$RELAX= 
##$RELAX= 
##$RELAX= 
##$RELAX= 
##$RELAX= 
##$RELAX= 
##$RELAX= 
##$RELAX= 
##$RELAX= 
##$RELAX= 
$$ Bruker specific parameters
$$ --------------------------
##$DATPATH= </opt/data/patiny/nmr>
##$EXPNO= 14
##$NAME= <XTC-888_1>
##$PROCNO= 1
##$ACQT0= 1000000
##$AMP= (0..31)
100 100 100 100 100 100 100 100 100 100 100 100 100 100 100 100 100 100
100 100 100 100 100 100 100 100 100 100 100 100 100 100
##$ANAVPT= -1
##$AQSEQ= 0
##$AQ_mod= 3
##$AUNM= <au_getlinv>
##$AUTOPOS= <19 >
##$BF1= 400.13
##$BF2= 100.612769
##$BF3= 400.13
##$BF4= 400.13
##$BF5= 400.13
##$BF6= 400.13
##$BF7= 400.13
##$BF8= 400.13
$$ [...]
##$SIGF1= 5.46698
##$SIGF2= 1.680332
##$SINO= 0
##$SIOLD= 2048
##$SPECTYP= <>
##$SREGLST= <1H.DMSO>
##$SSB= 4
##$STSI= 2048
##$STSR= 0
##$SW_p= 1515.15151515152
##$SYMM= 0
##$S_DEV= 3709992
##$TDeff= 4096
##$TDoff= 0
##$TI= <>
##$TILT= no
##$TM1= 0
##$TM2= 0
##$TOPLEV= 100
##$USERP1= <>
##$USERP2= <>
##$USERP3= <>
##$USERP4= <>
##$USERP5= <>
##$WDW= 3
##$XDIM= 2048
##$YMAX_p= 109706758
##$YMIN_p= -104717848
##$CURPLOT= <Cups-PDF>
##$CURPRIN= <$Cups-PDF>
##$DFORMAT= <normdp>
##$LAYOUT= <+/2D_inv.xwp>
##$LFORMAT= <normlp>
##$PFORMAT= <normpl>
$$ Bruker specific parameters for F1
$$ ---------------------------------
##$ACQT0= 0
##$BF1= 100.612769
##$FnMODE= 6
##$NUC1= <13C>
##$O1= 10043.8343986724
##$SFO1= 100.622812834399
##$SW= 221.832681201688
##$SW_h= 22321.4283611104
##$TD= 128
##$ABSF1= 210.754
##$ABSF2= -11.10083
##$ABSG= 5
##$ABSL= 0
##$ALPHA= 0
##$AQORDER= 0
##$ASSFAC= 0
##$ASSFACI= 0
##$ASSFACX= 0
##$ASSWID= 0
##$AUNMP= <>
##$AXLEFT= 0
##$AXNAME= <F1>
##$AXNUC= <13C>
##$AXRIGHT= 0
##$AXTYPE= 0
##$AXUNIT= <>
##$AZFE= 0.1
##$AZFW= 0.5
##$BCFW= 0
##$BC_mod= 0
##$BYTORDP= 0
##$COROFFS= 0
##$CY= -3
##$DATMOD= 1
##$DC= 0
##$DFILT= <>
##$DTYPP= 0
##$ERETIC= no
##$F1P= 210.76350402832
##$F2P= -11.0913240743493
##$FCOR= 0.5
##$FTSIZE= 1024
##$FT_mod= 6
##$GAMMA= 0
##$GB= 0
##$INTBC= 1
##$INTSCL= 1
##$ISEN= 128
##$LB= 0
##$LEV0= 0
##$LPBIN= 256
##$MAXI= 10000
##$MC2= 5
##$MEAN= 0
##$ME_mod= 2
##$MI= 1
##$NCOEF= 32
##$NC_proc= -12
##$NLEV= 6
##$NOISF1= 0
##$NOISF2= 0
##$NSP= 0
##$NTH_PI= 0
##$NZP= 0
##$OFFSET= 210.754
##$PC= 4
##$PHC0= 0
##$PHC1= 0
##$PH_mod= 1
##$PKNL= no
##$PPARMOD= 1
##$PPDIAG= 0
##$PPIPTYP= 0
##$PPMPNUM= 2147483647
##$PPRESOL= 1
##$PSCAL= 1
##$PSIGN= 0
##$PYNMP= <>
##$REVERSE= no
##$SF= 100.612769
##$SI= 1024
##$SIGF1= 210.754
##$SIGF2= -11.10083
##$SINO= 0
##$SIOLD= 1024
##$SPECTYP= <>
##$SREGLST= <>
##$SSB= 2
##$STSI= 1024
##$STSR= 0
##$SW_p= 22321.42836111
##$SYMM= 0
##$S_DEV= 3709992
##$TDeff= 256
##$TDoff= 0
##$TI= <>
##$TILT= no
##$TM1= 0
##$TM2= 0
##$TOPLEV= 0
##$USERP1= <>
##$USERP2= <>
##$USERP3= <>
##$USERP4= <>
##$USERP5= <>
##$WDW= 4
##$XDIM= 128
##$YMAX_p= 109706758
##$YMIN_p= -104717848
$$ End of Bruker specific parameters
$$ ---------------------------------
##NTUPLES= nD NMR SPECTRUM
##VAR_NAME=  FREQUENCY1,    FREQUENCY2,      SPECTRUM
##SYMBOL=    F1,            F2,              Y
##.NUCLEUS=  13C,           1H
##VAR_TYPE=  INDEPENDENT,   INDEPENDENT,     DEPENDENT
##VAR_FORM=  AFFN,          AFFN,            ASDF
##VAR_DIM=   1024,          2048,            2048
##UNITS=     HZ,            HZ,              ARBITRARY UNITS
##FACTOR=    21.7982698838965, 0.739820075757578, 1
##FIRST=     21204.543296753, 1514.41169507576, 4578336
##LAST=      -1095.08679447308, 0,           -861658
##MIN=       -1095.08679447308, 0,           -104717848
##MAX=       21204.543296753, 1514.41169507576, 109706758
##PAGE= F1=21204.54329675
##FIRST=     21204.543296753, 1514.41169507576, 4578336
##DATA TABLE= (F2++(Y..Y)), PROFILE
$$ [...]
##PAGE= F1=7253.650571059
##FIRST=     21204.543296753, 1514.41169507576, -1073165
##DATA TABLE= (F2++(Y..Y)), PROFILE
1670g64650A783636a0942108b833030J211976C169797e00469o150534E628558
1661A997236d616818F741674f838971L102206A653377K331772r50253a325186
1652E50013f037730B88992h84189A498702C07201b775852B785237f14858E597624
1642c78265A310447g977044L915131A693650K771038J689229i379535d60466A590595
1632c478409F731717C288639e338782b308513J61383D728344a962939B581760
1623h412627a258065l356467a22489C784918a0016147E083941H51785a624621
1614E751412a052870B240593N357276d831948B922294d337872j109899K526459
1606b921312F237369l058228J090507B50629O33156d406503b84554o80278k832707
$$ plain form
1670 -764650 1783636 -10942108 -2833030 -1621054 3169797 -500469 -6651003 5628558
1661 1997236 -4616818 6741674 -6838971 -3736765 1653377 3985149 3034896 -1325186
1652 550013 -6037730 288992 -884189 1498702 307201 -2775852 2785237 -614858 5597624
1642 -378265 1310447 -7977044 -4061913 1693650 4464688 6153917 -9379535 -460466 1590595
1632 -3478409 6731717 3288639 -5338782 -2308513 -2147130 4728344 -1962939 2581760
1623 -8412627 -1258065 -4614532 -122489 3784918 -10016147 5083941 851785 -1624621
1614 5751412 -1052870 2240593 7597869 -4831948 2922294 -4337872 -5447771 -2921312
1606 -2921312 6237369 3179141 4269648 250629 883785 -4406503 -284554 -964832 -3797539
1597c797539L99927n37580G173312A044246L367704R196437f449649j193228A922427
1587H124492c610524C255452a91724C697271f068282a139105m92164A165653d661798
1577i58114l855377C063531d440326J416253D701933A00522c56959j024829A0099268
1567c526831B08574M054696a386855I21880N37717O109855d953021K214491j334977
1558d073507B085400J827239d742776D060389A104504P856215k326042a494562
1549B217956h24901F293385h568161g48216I72699P44673Q007467B658732B62858
1539C946007a483249G197046D57197d022642E102688c052597h02175j451294F079426
1529A397148f192888C04678d217853F872401h089940b892550F720702e997282
$$ plain form
1597 -3797539 -3397612 -3935192 7173312 1044246 4411950 13608387 -6449649 -7642877 1922427
1587 8124492 -3610524 3255452 -191724 3697271 -6068282 -1139105 -1631269 1165653 -4661798
1577 -958114 -4813491 3063531 -4440326 -3024073 4701933 100522 -356959 -1381788 10099268
1567 -3526831 208574 4263270 -1386855 921880 1459597 7569452 -4953021 -2738530 -4073507
1558 -4073507 2085400 3912639 -4742776 4060389 1104504 8960719 6634677 -1494562
1549 2217956 -824901 6293385 -8568161 -748216 972699 1717372 9724839 2658732 262858
1539 3946007 -1483249 7197046 457197 -4022642 5102688 -3052597 -802175 -2253469 6079426
1529 1397148 -6192888 304678 -4217853 6872401 -8089940 -2892550 6720702 -5997282
1520F094923g36019k738764k342703g61143A0667988a930453n365611D228329
1511G80998N400366c559314F157343a348872f41131B103413P919498a009239k187807
1502c197046D230267a032155A54515M082294k06875A32649f765354A750021d322567
1492G305502a0305981A854619g572114G232478c917218A035550b892039A21680
1483h435145H938619b119956k451743d26128C793011j218759E10555a0513414
1474B215760J385666c174596A0152459A522628M200449A723243g079985C485940
1465f44547I806255m074379a7988002j836277F688251B249417k4320N2277J318697
1456C596071h532885c700991n694223m073319A0740540K782022F654268M95589
$$ plain form
1520 6094923 -736019 -3474783 -5817486 -761143 10667988 -1930453 -7296064 4228329
1511 780998 6181364 -3559314 6157343 -1348872 -641131 2103413 10022911 -1009239 -3197046
1502 -3197046 4230267 -1032155 154515 4236809 4029934 132649 -6765354 1750021 -4322567
1492 7305502 -10305981 1854619 -7572114 7232478 -3917218 1035550 -2892039 121680
1483 -8435145 8938619 -2119956 -4571699 -426128 3793011 2574252 510555 -10513414
1474 2215760 3601426 -3174596 10152459 1522628 5723077 1723243 -7079985 3485940
1465 -644547 9806255 5731876 -17988002 -19824279 6688251 2249417 2225097 2277374 3596071
1456 3596071 -8532885 -3700991 -9395214 -13468533 10740540 13522562 6654268 7149857
1448G149857a746829j454839a482425l153334B314748m28350N161156h342994
1439A439055c500334P50134q48626J565730A1205929d415944D149969b011600
1430B030731K719278b711558j659709E680491b215687k174427F023110j635249
1422D387861k127079K943021e865732D340502h20740o237727i82089B837108g451050
1412b826444F500775e002577b061364F987079d783492J031800D1053b384008A505985
1402B569674g980929A0121611g0948j032062B696023m99662D26285N037574b341129
1392c844842G143107h994096K618829B625867a461855H281083C779589h528412
1383B323062j36319b008659m973004p76586A9668K087760R00756K562680B652706
$$ plain form
1448 7149857 -1746829 -3201668 -1482425 -4635759 2314748 1886398 7047554 -8342994
1439 1439055 -3500334 -2750200 -3598826 -2033096 11205929 -4415944 4149969 -2011600
1430 2030731 4750009 -2711558 -4371267 5680491 -2215687 -4390114 6023110 4387861
1422 4387861 2260782 5203803 -5865732 4340502 -820740 -7058467 -982089 2837108 -7451050
1412 -2826444 6500775 -5002577 -2061364 6987079 -4783492 -3751692 41053 -2384008 1505985
1402 2569674 -7980929 10121611 -70948 -1103010 2696023 2196361 426285 5463859 -2341129
1392 -3844842 7143107 -8994096 -6375267 2625867 -1461855 8281083 3779589 -8528412
1383 2323062 2186743 -2008659 -6981663 -7758249 19668 2107428 3008184 5570864 2652706
1373A585125b231804A27567J927101p81292J882912d724133G178816h151714f96781
1363b68996D61538L240659i822819a927504C275721a133305C857911a240345L28323
1354i12022m317956C729015A768893F61129f745l28840G50040R32573K814283
1345D496896a731457F33591Q05705P96332G16267J133611b896336A0433258D72592
1335a371422r808510d324192l060339B83188L711960D19833b458090m157491B311234
1325A758795b032366D140055m30655C29880b00565M5054E608581B36133b312433
1315E012402c692708a611138D785898h670279b575548b82906E5355J819070h97723
1305h100233D827774h825228B240633O551328f757914a805718m021361D770991
$$ plain form
1373 1585125 -2231804 127567 2054668 1273376 3156288 -4724133 7178816 -8151714 -696781
1363 -268996 461538 3702197 -9822819 -1927504 3275721 -1133305 3857911 -1240345 -912022
1354 -912022 -5229978 3729015 1768893 661129 -6745 -335585 750040 1682613 4496896
1345 4496896 -1731457 633591 1439296 2235628 716267 1849878 -2896336 10433258 472592
1335 -1371422 -11179932 -4324192 -7384531 283188 3995148 419833 -2458090 -6615581 2311234
1325 1758795 -2032366 4140055 3709400 329880 -200565 -155511 5608581 236133 -2312433
1315 5012402 -3692708 -1611138 4785898 -8670279 -2575548 -282906 55355 1874425 -897723
1305 -8100233 4827774 -8825228 2240633 8791961 -6757914 -1805718 -5827079 4770991
1296b478727D117115K891276a215751A495923a059751E805554j167465a250124
1287C178969e427906K424923F640325h016951A888774d393388E185022J160616
1279F345638c25105C206691c226749C44801c684054C965887c957427F393160A92293
1269a08477o50344D2901a196246A221260h354647G364939c116103b20280n686301
1260e906581A3557995C30683f46316m808670B583191o9423b639508i78026A195118
1250A054488M220922k128793a534159A260733L6027M626731e199251f56415A609589
1240A907066e464230I07179Q475204b269146I290305c890574C498761f408725
1231a337174e66167G636612b351828j292022h72741L76904H83318b942587E751299
$$ plain form
1296 -2478727 4117115 7008391 -1215751 1495923 -1059751 5805554 4638089 -1250124
1287 3178969 -5427906 -3002983 6640325 -8016951 1888774 -4393388 5185022 6345638
1279 6345638 -325105 3206691 -3226749 344801 -3684054 3965887 -3957427 6393160 192293
1269 -108477 -758821 42901 -1196246 1221260 -8354647 7364939 -3116103 -220280 -5906581
1260 -5906581 13557995 330683 -646316 -5454986 2583191 2513768 -2639508 -978026 1195118
1250 1054488 5275410 3146617 -1534159 1260733 1296760 5923491 -5199251 -656415 1609589
1240 1907066 -5464230 907179 9382383 -2269146 9290305 -3890574 3498761 -6408725
1231 -1337174 -566167 7636612 -2351828 -3643850 -872741 -495837 883318 -2942587 5751299
1221b339741n639833A2003606c741440F531895e963569B151895M80714r68373
1213A664236d54471k87185k301366d36432l103418j794996K130226G584867b068237
1203A0628R24202a462258n765509B022624a983595b58227C705203I49636a147812
1193F427370n26226b951363G028395C491435P719602A541295M649997J783777
1185G975069J058081K751900R941209l373602H849875b1932976o1130972L274532
1177g9789416c4172467A9316831k6386D790659J1315572J464263i196323n6916011
1169f6112334k6309397L6554312d916290C5554334j5967080o033337J0036469
1162B3590386A0365797j809910B992097K852102L47260B325815h46205I535878
$$ plain form
1221 -2339741 -7979574 12003606 -3741440 6531895 -5963569 2151895 2632609 1664236
1213 1664236 -454471 -741656 -3043022 -436432 -3539850 -5334846 -3204620 7584867 -2068237
1203 10628 934830 -1462258 -7227767 2022624 -1983595 -258227 3705203 949636 -1147812
1193 6427370 5901144 -2951363 7028395 3491435 11211037 1541295 6191292 7975069
1185 7975069 9033150 11785050 21726259 18352657 8849875 -21932976 -83063948 -79789416
1177 -79789416 -34172467 19316831 19290445 4790659 16106231 17570494 -9196323 -66112334
1169 -66112334 -92421731 -55867419 -4916290 35554334 19587254 13553917 23590386
1162 23590386 10365797 8555887 2992097 5844199 6191459 2325815 -846205 9535878
1153a1127613F265525K202965l113854k640897a006843C831166M668537C578326
1144A289503c191237h59865C455696g918445a017260o265833E16546g32702H965550
1134H814365b697746E876247b335312k091902J946182l832561J063727I361647
1125G934909K343923N590711m565151j14282C423814a5652541j64928A515309
1116c763030C537408L060618r79270b798041D314759d189042n732006R65533L385753
1107e569762G299805j23958D04709L166089J389210e609739C439965A13692b325291
1097G904154b541918C829859a244706r978285B908177a150616p045062A0064450
1088A095911J6540024b581791f53103A234746a232240m34673B665063e190729
$$ plain form
1153 -11127613 6265525 8468490 5354636 2713739 -1006843 3831166 8499703 3578326
1144 1289503 -3191237 -859865 3455696 -7918445 -1017260 -7283093 516546 -732702 8965550
1134 8814365 -2697746 5876247 -2335312 -4427214 -2481032 -6313593 -5249866 9361647
1125 7934909 10278832 15869543 11304392 11190110 3423814 -15652541 -15817469 1515309
1116 -3763030 3537408 6598026 5618756 -2798041 4314759 -4189042 -9921048 -8955515 -5569762
1107 -5569762 7299805 7175847 404709 3570798 4960008 -5609739 3439965 113692 -2325291
1097 7904154 -2541918 3829859 -1244706 -11222991 2908177 -1150616 -8195678 10064450
1088 1095911 17635935 -2581791 -653103 1234746 -1232240 -1666913 2665063 -5190729
1079c732390A226821g402179H859394a102487n004155b475796E516961b479293
1070d544495A571417A92225J1884114D970640A700796b226362m857364K476867
1062d606859b015351j482906A274878J727021q31124a4221743B29527h56729D286547
1052H15760J960553K547553H43179M080790j233838J0283611E352246J4680255
1044B0032501k44080H443546a0552934L027531b186581D154258J6579016g776434
1035g374144D068855K2092149q559265j611799b152782j8051301M39900D026477
1026A1266505J920152C863994c153867e04964n72148C090542J2052442b1620891
1017h332074K941722D44009K03415J2743024A74162K296450O249609a2788745
$$ plain form
1079 -3732390 1226821 -7402179 8859394 -1102487 -6106642 -2475796 5516961 -2479293
1070 -4544495 1571417 192225 12076339 4970640 1700796 -2226362 -7083726 -4606859
1062 -4606859 -2015351 -3498257 1274878 3001899 2170775 -14221743 229527 -856729 4286547
1052 815760 2776313 5323866 843179 4923969 3690131 13973742 5352246 20032501
1044 20032501 19788421 8443546 -10552934 -7525403 -2186581 4154258 20733274 -7776434
1035 -7374144 4068855 26161004 17601739 15989940 -2152782 -20204083 -19764183 4026477
1026 11266505 13186657 3863994 -3153867 -504964 -1077112 3090542 15142984 -21620891
1017 -8332074 -5390352 444009 647424 13390448 174162 2470612 8720221 -12788745
1008a4217473K026668b807519B708660j018599d115657D462674e46783A8117648
999C4194b697565m999701k419375a828992q22336D99906L089297R61391M928569
990I479163B518272Q793850n093815b0989324O506454o34351M356832j0318826
982b1079215N880465o86761e345446k581318o879363j0525100g83545p471570
974h255115A526992N9548J3835946F965958b410219C0580005k684207j0237651
966A7658147J6954603o466669j1914583L868051R620491j1955480G420383R369235
958A6789618f310682D465887c625626j6141780i591820J444470j5445057L35486
950b3256921R647467b920287E96332h743665L387373n008969k002292c285522
$$ plain form
1008 -14217473 -12190805 -2807519 2708660 1690061 -4115657 4462674 -546783 18117648
999 34194 -2697565 -7697266 -10116641 -1828992 -2651328 499906 3589203 4550594 9479163
990 9479163 2518272 11312122 6218307 -20989324 -14482870 -15117221 -10760389 -21079215
982 -21079215 -15198750 -15885511 -5345446 -7926764 -14806127 -25331227 -783545 -8255115
974 -8255115 1526992 1586540 15422486 6965958 -2410219 30580005 27895798 17658147
966 17658147 34612750 28146081 16231498 20099549 29720040 17764560 7420383 16789618
958 16789618 -6310682 4465887 -3625626 -19767406 -9591820 -8147350 -23592407 -23256921
950 -23256921 -13609454 -2920287 596332 -8743665 -5356292 -10365261 -12367553 -3285522
941h36983J6308D889165a489846o784844A724820a994371m209984C332364j387504
932A944860N11636a011907M73517q005597C3140J6382407D03512J854845c024643
922c216224C875468f357772e64338q44892o316992B012038q50139j77172a757297
912B096497r6192m23374f678130A098102e991185a428217o896365L170355E565575
902e842814K265855h55626m18642l339145a425046b93021q104534K147940a513678
892a155419B895388b171658C734194a2066410b97173A452214a688670A067414
883a590773j039559e09183k88766b97289D491882f486883F162289D04503K948077
874C352580A15690e223125a425787B286228a526532D926351A282866g382203b721698
$$ plain form
941 -836983 -820675 4889165 -1489846 -8274690 1724820 -1994371 -6204355 3332364 1944860
932 1944860 2456496 -1011907 -538390 -8543987 33140 16415547 403512 2258357 -3024643
922 -3216224 3875468 -6357772 -564338 -1409230 -7726222 2012038 1161899 984727 -1757297
912 2096497 2000305 1576931 -6678130 1098102 -5991185 -1428217 -8324582 -5154227 5565575
902 -5842814 -3576959 -855626 -1274268 -4613413 -1425046 -293021 -8397555 -6249615 -1513678
892 -1155419 2895388 -2171658 3734194 -12066410 -297173 1452214 -1688670 1067414
883 -1590773 -2630332 -509183 -797949 -297289 4491882 -6486883 6162289 404503 3352580
874 3352580 115690 -5223125 -1425787 2286228 -1526532 4926351 1282866 -7382203 -2721698
864e894864E809855m08054k268207r87009R285169B61837i74429A214643c944043
854C241445b309475J129051l287222C07989Q684398a0871007B87122L504121J690412
845E481655J815900c62609j867683c45628b7097A201668a947307D811204E04537
835h425546A641177b613875j707470G117801i716224a036362m877045f89154C152007
825a908969j384625J034536D653296b157584A857119N092762a493827M3991A639368
815B535548d65817A619449K128671a216689o341597K799159J593363a063205r937000
806a1000205b119585r67202D379966i883782A840358A73012f869088I62905P360157
797H323062I11117L792263B04158N445346a357322A196433D61815b7048B671161
$$ plain form
864 -5894864 5809855 5401801 3133594 2146585 11431754 261837 -974429 1214643 -3944043
854 3241445 -2309475 -1180424 -4467646 307989 8992387 -10871007 287122 3791243 5481655
845 5481655 7297555 -362609 -2230292 -345628 -27097 1201668 -1947307 4811204 504537
835 -8425546 1641177 -2613875 -4321345 7117801 -9716224 -1036362 -5913407 -689154 3152007
825 -1908969 -3293594 -2259058 4653296 -2157584 1857119 6949881 -1493827 -1449836 1639368
815 2535548 -465817 1619449 3748120 -1216689 -7558286 -4759127 -3165764 -1063205 -11000205
806 -11000205 -2119585 -3086787 4379966 -9883782 1840358 173012 -6869088 962905 8323062
797 8323062 911117 4703380 204158 5649504 -1357322 1196433 461815 -27048 2671161
787B07025L450316N48506e688036C564294e411861a150229B367542c099714E705892
777a57969j563515A096829g82258E244489f182415J410950F374672a126381I73553
767E184685h60718B325538J479865d290295A741534a894261A966826d916109B072974
757b894825B016556d05955B186580K885414c489075j929108b639436G48387N45866
748A294253b546645C150718i53993D042816a459510q148191A070445c6711D321400
738b96531m878634C970089G73902k22422K377583a1220497B432850M36231e081326
728F116167e301937K559638G776981H33017a512101A060676b464848I921649A528932
718A769254R604592g507509F18186b354131m36866a293263C600042f365167F640016
$$ plain form
787 207025 3657341 4205847 -5688036 3564294 -5411861 -1150229 2367542 -3099714 5705892
777 -157969 -1721484 1096829 -782258 5244489 -6182415 -4771465 6374672 -1126381 973553
767 5184685 -860718 2325538 3805403 -4290295 1741534 -1894261 1966826 -4916109 2072974
757 -2894825 2016556 -405955 2186580 5071994 -3489075 -5418183 -2639436 748387 1294253
748 1294253 -2546645 3150718 -953993 4042816 -1459510 -9607701 1070445 -36711 4321400
738 -296531 -5175165 3970089 773902 551480 2929063 -11220497 2432850 2869081 -5081326
728 6116167 -5301937 -2742299 7776981 833017 -1512101 1060676 -2464848 9921649 1528932
718 1769254 11373846 -7507509 618186 -2354131 -2790997 -1293263 3600042 -6365167 6640016
708a381427d61967A051289O289199a0292627h25983l705017a109172J69465D470341
698e441495b320682J013268e14325A0177761e002930F062517B326294b319158
689D026116f441559L064777I12023a999278Q57933E200833B396527G44965e812213
679d384008j821366D268034K647471b098894k16145E210171d194920E048979a459354
669d983464C069638h11702o357110B852773c691792C263097h36044D732295B89927
659b278708a080820D686296b439267E65608K988086q17004a837775c51118F10387
649A701793q4302a993863D348717K325046b661952q52319A347192L39183c878013
639D182083K4225B7473b594293P89475l404681a636242E23914c134589J064269
$$ plain form
708 -1381427 -461967 1051289 7340488 -10292627 -825983 -4531000 -1109172 -939707 4470341
698 -5441495 -2320682 -1307414 -514325 10177761 -5002930 6062517 2326294 -2319158
689 4026116 -6441559 -3376782 912023 -1999278 -1141345 5200833 2396527 744965 -5812213
679 -4384008 -6205374 4268034 6915505 -2098894 -2315039 5210171 -4194920 5048979 -1459354
669 -4983464 3069638 -811702 -7168812 2852773 -3691792 3263097 -836044 4732295 289927
659 -2278708 -1080820 4686296 -2439267 565608 3553694 2736690 -1837775 -351118 610387
649 1701793 1617491 -1993863 4348717 6673763 -2661952 -3514271 1347192 1686375 -3878013
639 4182083 4206308 27473 -2594293 -1804818 -5209499 -1636242 523914 -3134589 -2070320
630b070320B274364c335306g42768A62728M274392j549578O029367d200122k97294
621d497416g93742A2007757B202331j50396p22468d473868G331273a587209k714899
612d302108A351805N137134a556224B887008c342893k172688B037748j78220a0871835
602B852674b06024p333747C381092d444947h2031l475730C365488f5286l255964
593c321250E33396e172640B232377C87013K998704a930163B56829N482352J519688
584G258869e102011C295570a706305D347823a507072m149079P02599E030537A82498
574D045102c571141C95351M006432f50547A226334c764023B481955O446760B269844
564e759525c15053C609557f227136C308942d704909G31245e012011A744850c542297
$$ plain form
630 -2070320 2274364 -3335306 -742768 162728 4437120 2887542 8916909 -4200122 -4497416
621 -4497416 -793742 12007757 2202331 2051935 1329467 -4473868 7331273 -1587209 -4302108
612 -4302108 1351805 6488939 -1556224 2887008 -3342893 -5515581 2037748 1859528 -10871835
602 2852674 -206024 -7539771 3381092 -4444947 -82031 -3557761 3365488 -65286 -3321250
593 -3321250 533396 -5172640 2232377 387013 3385717 -1930163 256829 5739181 7258869
584 7258869 -5102011 3295570 -1706305 4347823 -1507072 -5656151 -4953552 5030537 182498
574 4045102 -3571141 395351 4401783 -650547 1226334 -3764023 2481955 8928715 2269844
564 -5759525 -315053 3609557 -6227136 3308942 -4704909 731245 -5012011 1744850 -3542297
554h11286A918342d989874b012887N26163e13363l398145J437776E639745A975837
544a1739520E573154c825537D782701M538422a0488678a275830o21777C622632
535c590064I457578c311678A013843J900741d755064F11339M430242c38414j951012
526b289426A5105049e090089C801996d927994H048100b632535D470443f56316
517a693452F30745b76127A919834e096723h75482m353916A330630h287262E366458
507C838096H83380R90844f88118B554873j167016c987172B026935H85696a648738
497G491759c083289P98013E41393d930605K386793J114134B909223A206720J233485
488B440205b693816A2480311h663910H89399a173853d07799k618422C820037k44786
$$ plain form
554 -811286 1918342 -4989874 -2012887 -1486724 -513363 -3911508 -2473732 5639745 1975837
544 -11739520 5573154 -3825537 4782701 9321123 -10488678 -1275830 -1897607 3622632
535 -3590064 9457578 -3311678 1013843 2914584 -4755064 611339 5041581 -338414 -2289426
526 -2289426 15105049 -5090089 3801996 -4927994 8048100 -2632535 4470443 -656316
517 -1693452 630745 -276127 1919834 -5096723 -875482 -5229398 1330630 -8287262 5366458
507 3838096 883380 1874224 -688118 2554873 1387857 -3987172 2026935 885696 -1648738
497 7491759 -3083289 -2285276 541393 -4930605 -2543812 -1429678 2909223 1206720 2440205
488 2440205 -2693816 12480311 -8663910 889399 -1173853 -407799 -3026221 3820037 3575251
479C575251J694894a774136D109202i619437I539488e829996b247781j588263
471c836044B140586b995092k930954A609046J020833i328634C217905A157147
462G54819J13829J651445d646693E162887a897326A022850p819c876654D157249
452G08448R338217a572231A540714g137730A979837p03099o30762a2213430F199202
442G81897e633075I434445d133821f79933l539792F804791a780475n849104A151854
432i98092B789587e907983o493248A670743L986692a180685F944060k256054a0138075
422g321887b855248M5084A847510N137685e173938E79474d307589C638768N368092
413I006860b432094D174785A596491a1400364a03867j099419B729710H16119M275169
$$ plain form
479 3575251 5270145 -1774136 4109202 -9619437 9539488 -5829996 -2247781 -3836044
471 -3836044 2140586 -2995092 -5926046 1609046 2629879 -9328634 3217905 1157147
462 754819 868648 2520093 -4646693 5162887 -1897326 1022850 1015031 -3876654 4157249
452 708448 10046665 -1572231 1540714 -7137730 1979837 1276738 645976 -12213430 6199202
442 781897 -5633075 9434445 -4133821 -679933 -4219725 6804791 -1780475 -7629579 1151854
432 -998092 2789587 -5907983 -12401231 1670743 5657435 -1180685 6944060 4688006 -10138075
422 -7321887 -2855248 -2810164 1847510 6985195 -5173938 579474 -4307589 3638768 9006860
413 9006860 -2432094 4174785 1596491 -11400364 -103867 -1203286 2729710 816119 5091288
404E091288K603530a542624A301369b767688k613754F640128A483362O55614a325311
394f302499E015815d202026C589517c15988A628526B91230c127728j129431a664066
384G909495g41653l216814B528838K602917d178229C683721a23880m847391A1925
374A191383K866115c577212j742196H271423c910277a363867E028048A37785b241639
364E791122c43087C950589j485506c847106C62879a396991O71075A095393e65009
354d68244C423076J21888b713923J66226H21088l41193c377818j979115H4355
344a0724854b696801M85514B174476H9290d597062k88250D544859A842971i82465
334a055608m754873B906533F54034d472075a72414q12081A915835d725977A070311
$$ plain form
404 5091288 7694818 -1542624 1301369 -2767688 -5381442 6640128 1483362 2138976 -1325311
394 -6302499 5015815 -4202026 3589517 -315988 1628526 291230 -3127728 -4257159 -1664066
384 7909495 -741653 -3958467 2528838 5131755 -4178229 3683721 -123880 -4971271 11925
374 1191383 4057498 -3577212 -5319408 8271423 -3910277 -1363867 5028048 137785 -2241639
364 5791122 -343087 3950589 2465083 -3847106 362879 -1396991 -725916 1095393 -565009
354 -468244 3423076 3544964 -2713923 -2547697 821088 479895 -3377818 -5356933 84355
344 -10724854 -2696801 -2211287 2174476 89290 -4597062 -4885312 4544859 1842971 -982465
334 -1055608 -5810481 2906533 654034 -4472075 -172414 -984495 1915835 -4725977 1070311
324b174699B638796J083824A818637K190402d10971o900171G343087c630654D735719
314C708201a352523k620374A29177h78359g7606l446595C960548A876698R59445
305B836143d249577a381682H16023D683b13971m074902A972669b199058k191470
296d390528F351155A746750a438191d25011E568999a236928A515275n79910f860586
286d089367A593715K027531r24800H46284f31324j564034c72229o349891L356530
277c365590B388327n08562k74205J179012b724855n72356C12770J770940M107489
268F191199c88307m953215A264705f53518C127512E18926c361263J34923A01638
258b816031d99412l38692m006668A2426971a62307l211186G978080c737807J371065
$$ plain form
324 -2174699 2638796 3722620 1818637 4009039 -410971 -7311142 7343087 -3630654 4735719
314 3708201 -1352523 -3972897 129177 -878359 -77606 -3524201 3960548 1876698 2836143
305 2836143 -4249577 -1381682 816023 4683 -213971 -4288873 1972669 -2199058 -4390528
296 -4390528 6351155 1746750 -1438191 -425011 5568999 -1236928 1515275 935365 -6860586
286 -4089367 1593715 3621246 2696446 846284 -631324 -2195358 -372229 -6722120 -3365590
277 -3365590 2388327 1879765 1605560 2784572 -2724855 -3297211 312770 2083710 6191199
268 6191199 -388307 -5341522 1264705 -653518 3127512 518926 -3361263 -3226340 101638
258 -2816031 -499412 -838104 -4844772 12426971 -162307 -3373493 7978080 -3737807 -2366742
249b366742k013944d45323j479951R45220k674295o79039a458826r49114B275736
239d213744f14954a08923H075990c295231A3121J684477L134239k77676c113450
229B535100L311692a825873A335558J018638J774258b488824h82337H695697e487194
219d79649E340664a518528C330180R69867B4187c171010A312842D6439b073261
209E78017c38170G270315d374952p53465a69153E405319A030257g99823b82963
199b34863n608870C318500K33749a994641m8817N79122k189765F538749h435633
189H43013P150914b701218a297880G79501l16528g424362E493552B583338f288131
179D337564e567697D747663j92738e091596n502274G263187e983305I614110B147452
$$ plain form
249 -2366742 -4380686 -445323 -1925274 -980054 -3654349 -4333388 -1458826 -2407940 2275736
239 -4213744 -614954 -108923 8075990 -3295231 13121 1697598 4831837 4554161 -3113450
229 2535100 5846792 -1825873 1335558 2354196 4128454 -2488824 -882337 8695697 -5487194
219 -479649 5340664 -1518528 3330180 4300047 24187 -3171010 1312842 46439 -2073261
209 578017 -338170 7270315 -4374952 -5128417 -169153 5405319 1030257 -799823 -282963
199 -234863 -5843733 3318500 3552249 -1994641 -2043458 -1464336 -3654101 6538749 -8435633
189 843013 7993927 -2701218 -1297880 779501 462973 -7424362 5493552 2583338 -6288131
179 4337564 -5567697 4747663 4554925 -5091596 -10593870 7263187 -5983305 9614110 2147452
169b413554D841994A592710e923152j383737A265885d73911E030876B018869g92877
159A942660a1206099c060323C404461f19175k101815m697103b72650F00637b086854
149a544821E05600b563407D135093A908101P237436e570981I035543i57927q6428
140a044355n93671C254956N020701C611757i535406A42880O078290c486472a84942
130b077320F298643f349018a013791F248955j184219e968979a091883p94481D3664
120e141955a14413k962399m669716D982762J537149b445597n921678H251273f603475
110A077135e677960b764673E516302d71636B964248A132756N299148B318360J142588
101C460948g627918H1232J0010568e301680D962809K57870i112473a86304C596931
$$ plain form
169 -2413554 4841994 1592710 -5923152 -7306889 1265885 -473911 5030876 2018869 -792877
159 1942660 -11206099 -3060323 3404461 -619175 -2720990 -7418093 -272650 600637 -2086854
149 -1544821 505600 -2563407 4135093 1908101 9145537 -5570981 9035543 -957927 -1044355
140 -1044355 -1638026 3254956 8275657 3611757 -9535406 142880 6221170 -3486472 -184942
130 -2077320 6298643 -6349018 -1013791 6248955 5064736 -5968979 -1091883 -1886364 43664
120 -5141955 -114413 -3076812 -7746528 4982762 6519911 -2445597 -8367275 8251273 -6603475
110 1077135 -5677960 -2764673 5516302 -471636 2964248 1132756 6431904 2318360 3460948
101 3460948 -7627918 81232 10091800 -5301680 4962809 5220679 -9112473 -186304 3596931
91e135434A0301301A587175a635687j043170F070927d970321K312862E109029
82a237338l610032F697947b27422m20048j106929D504965a1182651D457811f538484
72a519087E200292C90543b378194M7499B123437a922347J07336E28738b73597
62A011429b205572G669112H14192b961141E758720B365719R64574I10259d679079
52H507507d056959C683467g690069K500145C991275j84449c452177B496397e511564
42d901552h4039m193726a465746f09082F82491a246886D481350j103238e49280
32f501706E078712B170823H39292O270686a161604G09790L631895B140683a765948
22D341235H79543M62181c262729K61044c57956A151748e231309b97367A295789
$$ plain form
91 -5135434 10301301 1587175 -1635687 -2678857 6070927 -4970321 -2657459 5109029
82 -1237338 -4847370 6697947 -227422 -647470 -1754399 4504965 -11182651 4457811 -6538484
72 -1519087 5200292 390543 -2378194 -2330695 2123437 -1922347 -1815011 528738 -273597
62 1011429 -2205572 7669112 814192 -2961141 5758720 2365719 3330293 910259 -4679079
52 8507507 -4056959 3683467 -7690069 -5189924 3991275 3806826 -3452177 2496397 -5511564
42 -4901552 -84039 -4277765 -1465746 -609082 682491 -1246886 4481350 3378112 -549280
32 -6501706 5078712 2170823 839292 7109978 -1161604 709790 4341685 2140683 -1765948
22 4341235 879543 1341724 -3262729 -3001685 -357956 1151748 -5231309 -297367 1295789
12A509800n82164b116252g92245B764466j093649c480058C766288c826118J890144
3a935974m19525j64071A193168
$$ plain form
12 1509800 927636 -2116252 -792245 2764466 1670817 -3480058 3766288 -3826118 -1935974
3 -1935974 -2355499 -2519570 1193168
##PAGE= F1=7231.852301175
##FIRST=     21204.543296753, 1514.41169507576, -1466911
##DATA TABLE= (F2++(Y..Y)), PROFILE
2047a466911B586760H73354b215176c1839j558172B128004I94452K89435L185885
2038D469772l32147D24721J522314o95283a175073j597836E025697E28997e331123
2028D29675f73850o216821F66130h25015A0105316H8842e405678b014481E671711
2018A50433b41239l573765R1520P02172C149805g4817F581371b033492O21915
2009a411577G128939h288753A2536069A750154m86528N577234b468943A77851
2000A456496n2286M04484o39766k65262e871911K680301D88789J098601L107044
1991D694434c812907E736852c273087A38617J528269K133209b594225a89860F013285
1981e552417B538042a35130r65345k266211E523769e464548B717512O360899b994632
$$ plain form
2047 -1466911 2586760 873354 -2215176 -31839 -1590011 2128004 994452 1283887 4469772
2038 4469772 4137625 424721 1947035 1251752 -1175073 -2772909 5025697 528997 -5331123
2028 429675 -673850 -6890671 666130 -825015 10105316 88842 -5405678 -2014481 5671711
2018 150433 -241239 -3815004 -3723484 -3021312 3149805 -74817 6581371 -2033492 -1411577
2009 -1411577 7128939 -8288753 12536069 1750154 1263626 6840860 -2468943 177851
2000 1456496 1404210 1808694 1168928 903666 -5871911 -3191610 488789 1587390 4694434
1991 4694434 -3812907 5736852 -3273087 138617 1666886 3800095 -2594225 -189860 6013285
1981 -5552417 2538042 -135130 -1100475 -3366686 5523769 -5464548 2717512 9078411 -2994632
1971c235649D796309K106131D66525O612391c467851D366260i84421E24364c446050
1961c251600C814871A380990g24260j035535d30410m525368C939010M47960h509116
1951h04740A448872d211535C56580f47409D296497a527151H93751a425151A262605
1941B856711K689195k336845A475769b15147j712696B035877E19602a14995H71589
1931h336831a010433a76971B262662d98015A453575a392960J36598j636331A871729
1921G44675O07845M39961e737956C759756e195023p17447G938512B67716J167289
1912A435005G9876a21954p93184D851904A779316a859115P35066j177814l468546
1903e770409H954568h056619G119510B102901i239631a25628E530416i36000B134812
$$ plain form
1971 -3235649 4796309 6902440 466525 7078916 -3467851 4366260 -984421 524364 -3446050
1961 -3251600 3814871 1380990 -724260 -1759795 -430410 -4955778 3939010 4386970 -8509116
1951 -804740 1448872 -4211535 356580 -647409 4296497 -1527151 893751 -1425151 1262605
1941 2856711 5545906 3209061 1475769 -215147 -1927843 2035877 519602 -114995 871589
1931 -8336831 -1010433 -176971 2262662 -498015 1453575 -1392960 -1256362 -2892693 1871729
1921 744675 1352520 1792481 -5737956 3759756 -5195023 -5912470 7938512 267716 1435005
1912 1435005 79876 -121954 -915138 4851904 1779316 -1859115 -1124049 -2301863 -5770409
1903 -5770409 8954568 -8056619 7119510 2102901 -9239631 -125628 5530416 -936000 2134812
1893f37355C815632e530382E259562d045292j536555Q40507N19688J751403c75678
1883a681703m376843K02576B3517108M723220j2562219G716281f160697q700417
1875a4861114e97189l754145j6567893R366610C715799J3557007N972332I498637
1866g183030c20774j244653o454694E679797j1438e642324K781582A85427M657689
1857D843116f134205a907153H01444c285511i50194B352196a854464j186753C188533
1847A896440J532478b677470B131552J12600e9212m884954L47111A273613d615066
1837F614080A65337M721105e53944o262355F283226b34106p102021E486244a875525
1827B846823j051971P98587A208864d994743J498364C191463g921641A718791
$$ plain form
1893 -637355 3815632 -5530382 5259562 -4045292 -5581847 -4741340 -4221652 -2470249 -375678
1883 -1681703 -6058546 -5855970 23517108 28240328 15678109 7716281 -6160697 -14861114
1875 -14861114 -597189 -4351334 -20919227 -11552617 3715799 17272806 23245138 9498637
1866 -7183030 -320774 -1565427 -8020121 5679797 5668359 -5642324 -2860742 185427 4843116
1857 4843116 -6134205 -1907153 801444 -3285511 -950194 2352196 -1854464 -3041217 3188533
1847 1896440 3428918 -2677470 2131552 2244152 -59212 -4944166 -4597055 1273613 -4615066
1837 6614080 165337 4886442 -553944 -6816299 6283226 -234106 -7336127 5486244 -1875525
1827 2846823 1794852 2593439 1208864 -4994743 -3496379 3191463 -7921641 1718791
1818h011777H254200i37858O0871e8230j392304k478912A890739c33620m94907
1809h28527C257506K83376A244769b419135p79275B125805a369894F18901e556121
1799B908324b903891D421057f099501a738449I35691c524726A861582b842397
1790c707536a008852D225120i948897A038982O148709c127835C997424I7927L955190
1781D053117d650736A960174K549578h51260a92576j904752D638210k075550j198220
1772A364440N879982f228560a514422A972242n87425L847522N319537E33389c688035
1762e186921P61526A0746549b207212Q97153k14415E307553d4610n337028B862057
1752a779762E358372D59620f096346C078766b239210Q99067B325119A161443a811240
$$ plain form
1818 -8011777 8254200 -937858 -876987 -58230 -1450534 -3929446 1890739 -333620 -828527
1809 -828527 3257506 3540882 1244769 -2419135 -3198410 2125805 -1369894 618901 -5556121
1799 2908324 -2903891 4421057 -6099501 -1738449 935691 -3524726 1861582 -2842397
1790 -3707536 -1008852 4225120 -9948897 1038982 7187691 -3127835 3997424 97927 4053117
1781 4053117 -4650736 1960174 4509752 -851260 -192576 -2097328 4638210 2562660 1364440
1772 1364440 7244422 -6228560 -1514422 1972242 1384817 5232339 10551876 533389 -3688035
1762 -5186921 -4425395 10746549 -2207212 -1310059 -1524474 5307553 -44610 -5381638 2862057
1752 -1779762 5358372 459620 -6096346 3078766 -2239210 -1340143 2325119 1161443 -1811240
1742I71064K758105e609042K33119G184396a856760A942291j22569a857463p05315
1733b562778q95966H620691f775455L234719B238207e27015A266748c066478a24203
1723b363633G94660R654198d178954A207139i64723j006917p285D287493M82574
1714D770067A898793G07828c195084C98748L660935a522895j002664m23091B959067
1704d412462H750641d622014a033685j67684N02078n15106B783320a281096A838003
1694C178032b890089q56475C508345b681774j617255A192329L349233F72674d02292
1684B70162b054426D133409c31976k447452F441992A455001K940244b805662J123300
1675a682362r68502R53716r75645D272746f23862A307880i943615b797802m25979
$$ plain form
1742 971064 3729169 -5609042 -5375923 7184396 -1856760 1942291 1819722 -1857463 -2562778
1733 -2562778 -3458744 8620691 -6775455 -3540736 2238207 -527015 1266748 -3066478 -124203
1723 -2363633 794660 10448858 -4178954 1207139 -964723 -1971640 -1978925 4287493 4770067
1714 4770067 1898793 707828 -3195084 398748 4059683 -1522895 -2525559 -2948650 2959067
1704 -4412462 8750641 -4622014 -1033685 -1201369 -699291 -1214397 2783320 -1281096 1838003
1694 3178032 -2890089 -3746564 3508345 -2681774 -4299029 1192329 4541562 672674 -402292
1684 270162 -2054426 4133409 -331976 -2779428 6441992 1455001 4395245 -2805662 -1682362
1675 -1682362 -2650864 -1697148 -2672793 4272746 -623862 1307880 -9943615 -2797802 -3223781
1666c223781C390102h00714n235753E332594B127128e011901B926209e525651
1657c077784B507740J140831A110700b000492F09171g435647e17842k43289B569169
1647H67674c728654A403479a89460F511052a034740e7958r270246d024100A407753
1637E531194p28305i658643A473649D50753c843087F428271k250788e716127b364631
1627a393537E380168b056537A490722h500708h63992l877684c62191C881300a0485323
1617E712228C16983a815940D148640b065065C176518M342003e102374B781564
1608d051525k4566M84236F570113l188779n87035D09000J385046d590788H317
1598e08825k697585k19389m89422G611429e25948E547801P682261f669389j814530
$$ plain form
1666 -3223781 3390102 -800714 -6036467 5332594 2127128 -5011901 2926209 -5525651
1657 -3077784 2507740 3648571 1110700 -2000492 609171 -7435647 -517842 -761131 2569169
1647 867674 -3728654 1403479 -189460 6511052 -1034740 -57958 -9328204 -4024100 1407753
1637 5531194 4802889 -9658643 1473649 450753 -3843087 6428271 4177483 -5716127 -2364631
1627 -1393537 5380168 -2056537 1490722 -8500708 -863992 -4741676 -362191 3881300 -10485323
1617 5712228 316983 -1815940 4148640 -2065065 3176518 7518521 -5102374 2781564
1608 -4051525 -4076091 -3591855 6570113 3381334 2794299 409000 1794046 -4590788 8317
1598 -508825 -3206410 -3425799 -3915221 7611429 -525948 5547801 13230062 -6669389 -8483919
1589h483919A318781R551731d890235C205052d18898C628579e924088b538524
1580b047422B396003d883917A655795e448049A664294e050500b208719E261327
1571A580055d03790j480261G521240b709772A546462R02383b61846A72925J844770
1562B017695M239448d387249N31456P01395A282887K947273d545495C052577k24091
1553B828486N472192j534039f18052B491991a585750F452320h788023a815066
1544g5419B258690P588879A998114C14153L835895a390322G562728C8661b083201
1534E158762c682234J801321j213998H118568A106339f139263a27941m915952
1526e043893H210902i185798b540257G232886e138207D932458a116369k240693
$$ plain form
1589 -8483919 1318781 10870512 -4890235 3205052 -418898 3628579 -5924088 -2538524
1580 -2047422 2396003 -4883917 1655795 -5448049 1664294 -5050500 -2208719 5261327
1571 1580055 -403790 -1884051 7521240 -2709772 1546462 2448845 -261846 172925 2017695
1562 2017695 6257143 -4387249 -3855793 -3154398 1282887 4230160 -4545495 3052577 2828486
1553 2828486 8300678 6766639 -618052 2491991 -1585750 6452320 -8788023 -1815066
1544 -75419 2258690 9847569 1998114 314153 4150048 -1390322 7562728 38661 -2083201
1534 5158762 -3682234 -1880913 -3094911 8118568 1106339 -6139263 -127941 -5043893
1526 -5043893 8210902 -9185798 -2540257 7232886 -5138207 4932458 -1116369 -3357062
1518c357062k790732c91422I909005b325418m955622D383869D08473O419151d429201
1508E642697a512813N21844B725014O886868b086329l533153D832837a346228
1499A275577K052358P27168A108893e911212A175556d371309G267779a1690998
1490A61571g739750G019441c821789B667096d108682G9042h565119I240298a409093
1480d668313a323167C165207m50527j190159a1288810A695888K836940b333642
1471I328018A069326M694370A268078f892908D074968i24591I035915l192331
1463E843584a6434902j466396D337122A435039J88117J82309Q1948h357275c739634
1453h863954j850827G981321N319774E697805J370835a318309j528207L80177
$$ plain form
1518 -3357062 -6147794 -391422 9909005 -2325418 -7281040 4383869 408473 6827624 -4429201
1508 5642697 -1512813 -990969 2725014 9611882 -2086329 -5619482 4832837 -1346228
1499 1275577 3327935 4055103 1108893 -5911212 1175556 -4371309 7267779 -11690998
1490 161571 -7739750 7019441 -3821789 2667096 -4108682 79042 -8565119 9240298 -1409093
1480 -4668313 -1323167 3165207 2714680 1524521 -11288810 1695888 4532828 -2333642
1471 9328018 1069326 5763696 1268078 -6892908 4074968 -924591 9035915 5843584
1463 5843584 -16434902 -17901298 4337122 1435039 1623156 1805465 1887413 -8357275 -3739634
1453 -8863954 -10714781 7981321 13301095 5697805 7068640 -1318309 -2846516 -2466339
1445b466339k149787A929429o13016O305863i956683A545183b618313P46149j991047
1436c863211E2892P948736b853825C651476a184895A44859N513623c744374o27373
1427d371747E602618a694834k194421F461616l031862j311707K171934f614844
1418C367739b18558o698563a113807B852300a0506116a527998C724756e704603
1409a680205H781049d656947L438d5675j11413A376099C33642h770674A1035835
1399D65353a223542B402422I50395J39781M228614a991661k601825G990432i287140
1389f701119C260647b101867H286975B779842g686620B843942J28478a642705
1380g290516R73712A230931N2623J510947L369496B447724B57104b881412E70956
$$ plain form
1445 -2466339 -4616126 1929429 1316413 7622276 -9956683 1545183 -2618313 -1872164 -3863211
1436 -3863211 52892 8001628 -2853825 3651476 -1184895 144859 5658482 -3744374 -4371747
1427 -4371747 5602618 -1694834 -3889255 6461616 3429754 2118047 4289981 -6614844
1418 3367739 -218558 -6917121 -1113807 2852300 -10506116 -1527998 3724756 -5704603
1409 -1680205 8781049 -4656947 -4653509 -45675 -157088 1376099 333642 -8770674 11035835
1399 465353 -1223542 2402422 950395 1090176 5318790 -1991661 -4593486 7990432 -9287140
1389 -6701119 3260647 -2101867 8286975 2779842 -7686620 2843942 2972420 -1642705
1380 -7290516 -6316804 1230931 1283554 2794501 6163997 2447724 257104 -2881412 570956
1370H00083J655357O5183e644001F843805h963436a131485A99896K15745K875648
1361C291289i094185d084325D485730a479697C492355a063388M8922n155770C202836
1351A445704n28846a505862A790357a71440A422507L729630a996668E70637R94438
1342A565075L273224E78927J261211c927770A2108888b213705c58577j2001126
1334a2359703e554564q24654B86353M290047f9287j342124n298716A950528G62873
1324a141009C036277P12720b89035B4504c52867E890789I34712b206524D822115
1314c465276h73442C884046g803581b382576a006150B421936j28002a043943p423538
1305h467481E138590h291286a09758I712991e714683a422985k971439F053117
$$ plain form
1370 800083 2455440 2520623 -5644001 6843805 -8963436 -1131485 199896 415641 3291289
1361 3291289 -9094185 -4084325 4485730 -1479697 3492355 -1063388 -1014466 -6170236 3202836
1351 1445704 916858 -1505862 1790357 -171440 1422507 5152137 -1996668 570637 1565075
1342 1565075 4838299 578927 1840138 -3927770 12108888 -2213705 -358577 -12359703
1334 -12359703 -5554564 -6379218 286353 4576400 -69287 -1411411 -6710127 1950528 762873
1324 -1141009 3036277 3748997 -289035 24504 -352867 5890789 934712 -2206524 4822115
1314 -3465276 -873442 3884046 -7803581 -2382576 -1006150 2421936 2293934 -1043943 -8467481
1305 -8467481 5138590 -8291286 -109758 9712991 -5714683 -1422985 -4394424 6053117
1296b469189D419901J990142h91354A893466i96391E519851j401441a457193D315114
1286f367511a072319F912275g393731A735797c922244E096662P21371G66167K173808
1277B939975c625048a112903k081096E639590d341382F134400d46109j27269l14793
1268h88171D53279b703613A95672f663763F873609b465862I03823f360550A2805234
1258c04615j459289k877101C147920A136170b838832J196763c03557d2093E082377
1248D586205a633378A497057p44217M704598f157471a74846A801951F89146d568921
1238A121969Q779751b649234I739169d944052C297691e247008a300357R2425G689091
1228a554579l800222f50814p9898A201313b128935E619208b638667o569517A2007379
$$ plain form
1296 -2469189 4419901 6410043 -891354 1893466 -996391 5519851 4118410 -1457193 4315114
1286 -6367511 -1072319 6912275 -7393731 1735797 -3922244 5096662 5818033 766167 2939975
1277 2939975 -3625048 -1112903 -3193999 5639590 -4341382 6134400 -446109 -573378 -888171
1268 -888171 453279 -2703613 195672 -6663763 6873609 -2465862 903823 -6360550 12805234
1258 -304615 -1763904 -4641005 3147920 1136170 -2838832 -1642069 -303557 -42093 5082377
1248 4586205 -1633378 1497057 752840 5457438 -6157471 -174846 1801951 689146 -4568921
1238 1121969 9901720 -2649234 9739169 -4944052 3297691 -5247008 -1300357 -1207932 7689091
1228 -1554579 -5354801 -650814 -730712 1201313 -2128935 5619208 -2638667 -9208184 12007379
1218c603151E431604g303596C540480A595935G71605e69508l81020m057281D41186
1208d503948j208116b304569H285741a732132H51210A73789i59690n886487A91346
1198b845401F6427M675799k067654a55284F518678j400626b712454H396599C684115
1188A1857115B601200L445197K971189p6370L782292J1198723l877776F176853
1179b9023377o3850696J2821543b7286175B1051906m642259b432666A1679993
1171B4554434d393736o1164565l4864869L3424335a1805638C7651716j3763903
1164B3887813r963708J0245994H178990K11731B997965L715659k897647j590274
1156B225703g70859A0474082a1606505F481378J154648k567914k382555a256470
$$ plain form
1218 -3603151 5431604 -7303596 3540480 1595935 771605 -569508 -950528 -5007809 441186
1208 -4503948 -5712064 -2304569 8285741 -1732132 851210 173789 -959690 -6846177 191346
1198 -2845401 66427 4742226 2674572 -155284 6518678 5118052 -2712454 8396599 3684115
1188 11857115 2601200 6046397 9017586 8941216 12723508 23922231 20044455 6176853
1179 -29023377 -92874073 -80052530 -27286175 21051906 16409647 -2432666 11679993
1171 24554434 -4393736 -65558301 -100423170 -66998835 -11805638 37651716 23887813
1164 23887813 13924105 24170099 8178990 8390721 2997965 6713624 3815977 2225703
1156 2225703 -770859 10474082 -11606505 6481378 7636026 5068112 2685557 -1256470
1147C140947N436564C585341j126523b272672C20187M222109a0712702d138250
1138i741772C88062f52941H752706J251957g79071F454777d299165n46660J464577
1129c381248m575061K443761A1018664r9820L161543M443222o115773O63349D630980
1119a8624832j53718A118749b908547C479261L975814j69305b194511D737239
1110d251773o855182n54495L307549G065217l68431A1914K713431r02776d836465
1100C630004G82174a523588G830288b285597C129376h26683p098068D165595h98810
1090g465329A0153886b273110A2858299c814572a200103A693101b125541k41423
1082b366964B544228c690243p37037F80844g788092I210199G8891e493929b220286
$$ plain form
1147 3140947 8577511 3585341 2458818 -2272672 320187 4542296 -10712702 -4138250
1138 -9741772 388062 -652941 8752706 10004663 -779071 6454777 -4299165 -4845825 -3381248
1129 -3381248 -7956309 -5512548 11018664 10918844 14080387 18523609 12407836 13071185 4630980
1119 -18624832 -18778550 1118749 -2908547 3479261 7455075 7285770 -2194511 4737239
1110 -4251773 -11106955 -11661450 -8353901 7065217 6696786 11914 2725345 1822569 -4836465
1100 3630004 782174 -1523588 7830288 -2285597 3129376 -826683 -7924751 4165595 -898810
1090 -7465329 10153886 -2273110 12858299 -3814572 -1200103 1693101 -2125541 -2366964
1082 -2366964 2544228 -3690243 -4427280 680844 -7788092 9210199 78891 -5493929 -2220286
1072E738853g34800l231124B613355h72266A1642077E458539C65503c151222k479239
1063e630461O73880a901176k962182F16213J405190P57094a3897360B741651a790478
1053C394746B60403L088094J891352A485627K552965n07254J1396446p448961
1045G478823K3107787l754896H956951a2981247l16924b973486I235287J7810181
1037B7045468g410980j339990E454044L1254216p034699r539449f598020k4076931
1029c0674951k01354C985168J3970549K359687F923502d071460h22948A102546
1020D163848Q875212b4070408P996227P808317B427994K74840J1327298B082995
1011A963617M345335a5241666j28701K376876b673491A530749k74420d562729
$$ plain form
1072 5738853 -734800 -3965924 2613355 -872266 11642077 5458539 365503 -3151222 -5630461
1063 -5630461 -4956581 -1901176 -4863358 616213 2021403 2778497 -13897360 2741651 -1790478
1053 3394746 260403 3348497 5239849 1485627 4038592 3531338 14927784 7478823
1045 7478823 30586610 26831714 8956951 -12981247 -13298171 -2973486 9235287 27045468
1037 27045468 -7410980 -8750970 5454044 36708260 29673561 20134112 -6598020 -30674951
1029 -30674951 -30876305 3985168 17955717 20315404 6923502 -4071460 -822948 1102546
1020 4163848 13039060 -24070408 -16074181 -8265864 2427994 2702834 14030132 2082995
1011 1963617 6308952 -15241666 -15370367 -12993491 -2673491 1530749 1256329 -4562729
1002B719207a380954A6597226b93804j32171r572106j847517b319039o25921B44971
992D580082K32092O112337D003113O987704m882960b4235417J1152533L60515
984a2722369J096414m388725M095489j279648a886930m608454n266335j3541038
976b5302757a191965j0719334A513281J917354J1272591o863261b986219B7772125
967B0953535l815433J1220102l805426j0635879L489983Q837764j1251470F582514
958A4911673f377181E823160c714675j3832889Q591356L018862j4519790J845845
950a8611291P040891c911790a20322q230331L113086m201389j229102b788306
941h74373p34507E675809h44138o793771F99554a501894n028195D244715A461366
$$ plain form
1002 2719207 -1380954 16597226 -293804 -425975 -9998081 -11845598 -2319039 -2944960 244971
992 4580082 4812174 10924511 4003113 10990817 6107857 -24235417 -13082884 -12722369
984 -12722369 -11625955 -16014680 -11919191 -13198839 -1886930 -6495384 -11761719 -25302757
976 -25302757 -1191965 -11911299 1513281 3430635 14703226 7839965 -2986219 27772125
967 20953535 17138102 28358204 24552778 13916899 17406882 26244646 14993176 6582514
958 14911673 -6377181 5823160 -3714675 -17547564 -8956208 -5937346 -20457136 -18611291
950 -18611291 -11570400 -3911790 -120322 -8350653 -5237567 -9438956 -10668058 -2788306
941 -874373 -1608880 5675809 -844138 -7637909 699554 -1501894 -6530089 4244715 1461366
931B035109h63412E6785h437527b30656A6117810A411448K112583b429729P3321
922b356408C267515g130320g91628k50985n194671C265368A207455b97146k253894
913b551040B048674K42505q01102e453111A355305f213723b438407o559925M359176
904d639156E072974f089718K822053a152522n68284j999958a142656c98664p708042
895h106706K094408A1373a589303B868419a371017D82879i288031b402295F23668
885a556707A984745b370351i74622C00505h7494F31332M182782e608414G100698
875A367365K534625a685094k220486J669939G73135a797288F085771F89029g421199
865b041519m473734F451285j62790B261473r51271J0693526B252619b49752I41533
$$ plain form
931 2035109 -863412 56785 -8437527 -230656 16117810 1411448 3524031 -2429729 -2356408
922 -2356408 3267515 -7130320 -791628 -1042613 -6237284 3265368 1207455 -297146 -2551040
913 -2551040 2048674 2291179 1490077 -5453111 1355305 -6213723 -2438407 -8998332 -4639156
904 -4639156 5072974 -6089718 -3267665 -1152522 -1720806 -3720764 -1142656 -398664 -8106706
895 -8106706 -6012298 11373 -1589303 2868419 -1371017 482879 -9288031 -2402295 623668
885 -1556707 1984745 -2370351 -974622 300505 -87494 631332 4814114 -5608414 7100698
875 1367365 3901990 -1685094 -3905580 -2235641 773135 -1797288 6085771 689029 -7421199
865 -2041519 -6515253 6451285 6288495 2261473 1310202 12003728 2252619 -249752 941533
855d813748C766240c761104J654653k037902C15305Q875757a1199054D6538M279333
846D325871N61175J706830d22515o43183I22202D6228J842849c184640D724384
836d94304q197643A386256b121388j616774G386501i261257b557512k505815e18763
826B961048b091410J82971j127967D989166c102820A645750N559989b495662P77214
817a718448A485598R20496A12865M199114q31647b383947m359491J921342K392816
808b429280O40234r399713b569583O73238C790480i533459A680606b23261m602820
799d826081A977663O252134B000654J651699d0479F568637a011480E2287M67311
790E19598a46453B403657o01097J919444j374169c561783B848153e815453b41862
$$ plain form
855 -4813748 3766240 -3761104 -2106451 -4144353 315305 9191062 -11199054 46538 4325871
846 4325871 4887046 6593876 -422515 -1065698 922202 46228 1889077 -3184640 4724384
836 -494304 -8691947 1386256 -2121388 -3738162 7386501 -9261257 -2557512 -5063327 -518763
826 2961048 -2091410 -1908439 -3036406 4989166 -3102820 1645750 7205739 -2495662 -1718448
817 -1718448 1485598 2406094 112865 4311979 3480332 -2383947 -6743438 -4822096 -2429280
808 -2429280 -1789046 -11188759 -2569583 -1896345 3790480 -9533459 1680606 -223261 -4826081
799 -4826081 1977663 8229797 2000654 3652353 -40479 6568637 -1011480 52287 519598
790 519598 -146453 2403657 1802560 3722004 2347835 -3561783 2848153 -5815453 -241862
780B269016b366418D075864a69920k737386A282340c63191D934463e495932J148373
771d347559F405570a925367B257445K381550i02087B652006R29229d316713H38656
761a202234A080205d167838C337625c630124A305054C81765J991074K508230c420816
751d698602K131361G77265M22998c536432C218039e1498B717059a750199p278602
742i028801I57016h51151E034583h70664l430879B858210G16931M7650K990647
733C755228a0893713D356205j604201e618546F670389e090162K119687H108777
724A086587b133370i2896k253686I144120B025406H55770J0598571f764744A007862
714a279547l349616d04849D508315f935528D678990f93295m17258B090332N715638
$$ plain form
780 2269016 -2366418 4075864 -169920 -2907306 1282340 -363191 4934463 -5495932 -4347559
771 -4347559 6405570 -1925367 2257445 4638995 -902087 2652006 3581235 -4316713 838656
761 -1202234 1080205 -4167838 3337625 -3630124 1305054 381765 2372839 4881069 -3420816
751 -4698602 -2567241 777265 1200263 -3536432 3218039 -51498 2717059 -1750199 -9028801
742 -9028801 957016 -851151 5034583 -870664 -4301543 2858210 716931 764581 3755228
733 3755228 -10893713 4356205 2752004 -5618546 6670389 -5090162 -2970475 8108777
724 1086587 -2133370 -92896 -2346582 9144120 2025406 855770 11454341 -6764744 1007862
714 -1279547 -4629163 -404849 4508315 -6935528 4678990 -693295 -1110553 2090332 7805970
705G805970a0077177b91006m006008J637505e68951D300370e070199K300326f66321
695B41720J1068237d733805E354712B287534b609092E486004e735637K467535
687c268102A561031b799124f35076E327529B320471o73303f306479J871319L55305
678d079855D013135K021905b764847J314664E419484b603503D457702C9752e063892
668B373824f91190o260874D594897d585435B479573C59078M270719A27944a502505
658a358599D345027b456687C52186J777427J696145b563292f54435B60261K643172
649B903433j290243a750680D401759K914872b768927m9828H47648J071186d914422
639D494896j32266d81293m09463k559172j444428a721086E72776c496661a002818
$$ plain form
705 7805970 -10077177 -291006 -4297014 -2659509 -568951 4300370 -5070199 -2769873 -666321
695 241720 11309957 -4733805 5354712 2287534 -2609092 5486004 -5735637 -3268102
687 -3268102 1561031 -2799124 -635076 5327529 2320471 1647168 -6306479 -4435160 -4079855
678 -4079855 4013135 6035040 -2764847 -1450183 5419484 -2603503 4457702 39752 -5063892
668 2373824 -691190 -6952064 4594897 -4585435 2479573 359078 4629797 127944 -1502505
658 -1358599 4345027 -2456687 352186 2129613 3825758 -2563292 -654435 260261 2903433
649 2903433 1613190 -1750680 4401759 7316631 -2768927 -2818755 847648 1918834 -4914422
639 4494896 4362630 -481293 -890756 -3449928 -4894356 -1721086 572776 -3496661 -1002818
629A460297d685679F97052B8702M810406B351163P371370c779995p47794h17987
619A4388362A641270P65770q76118d781956H360514a829862l015577A476731N450500
610F927231a315516B325370c19482l453643A185898Q13029a0779874B858601c49221
600f723854C456996d262009F47650c803354C217620D40631b906685c18164n950392
591f268556A920562q04296J510763b934370G06704M870581K812638e429479D909786
581h53097D976202f80309m972067K111130E478915a10202C746092c392243A682230
571A560736C59081q6272b672586B396794P360447B411180g033316A344149J948784
562C292933e372959C053604e535463A108627d784159A438506c656963B73703K174199
$$ plain form
629 1460297 -4685679 697052 28702 4839108 2351163 9722533 -3779995 -4527789 -817987
619 14388362 1641270 2407040 1530922 -4781956 8360514 -1829862 -4845439 1476731 6927231
610 6927231 -1315516 2325370 -319482 -3773125 1185898 1998927 -10779874 2858601 -349221
600 -6723854 3456996 -4262009 647650 -3803354 3217620 440631 -2906685 -318164 -6268556
591 -6268556 1920562 1116266 2627029 -2934370 706704 5577285 8389923 -5429479 4909786
581 -853097 4976202 -680309 -5652376 -3541246 5478915 -110202 3746092 -3392243 1682230
571 1560736 359081 272809 -2672586 2396794 9757241 2411180 -7033316 1344149 3292933
562 3292933 -5372959 3053604 -5535463 1108627 -4784159 1438506 -3656963 273703 2447902
553B447902e115513a176167m06219C15450c344137J52299D777511B121201a1258041
543E605962c710611D826977N139854i543638c489657a568070B296041a148562
534I356963d145239A525655O23716b709268a353394E449910e69374j769112A6166924
524e807833D898162c824684I002131b593319D392809e92354j147236B268019b30127
514B055563e395987a114066l667987A062886g932957D737796k67872H72380J420723
505B293103a436053B458263q00141b915720B809654A94056a732652H752591d248738
495a088953a73447m291762a902645O38030B279653p52700P42974b187590A0448662
485h090601D50668a564454c56849l502091C617480k74173K224302a966887C383475
$$ plain form
553 2447902 -5115513 -1176167 -1582386 315450 -3344137 -3191838 4777511 2121201 -11258041
543 5605962 -3710611 4826977 9966831 -9543638 -3489657 -1568070 2296041 -1148562
534 9356963 -4145239 1525655 2149371 -2709268 -1353394 5449910 -569374 -2338486 16166924
524 -5807833 4898162 -3824684 9002131 -2593319 4392809 -592354 -1739590 2268019 -230127
514 2055563 -5395987 -1114066 -4782053 1062886 -7932957 4737796 4469924 872380 2293103
505 2293103 -1436053 2458263 1658122 -2915720 2809654 194056 -1732652 8752591 -4248738
495 -1088953 -173447 -4465209 -1902645 -1264615 2279653 1526953 2269927 -2187590 10448662
485 -8090601 450668 -1564454 -356849 -3858940 3617480 3343307 5567609 -1966887 3383475
475i208136I070821e191836b056892j284651A337211a973881m210412B173236
466B815031i713296D215887H55788J72003Q8534o4007d758493E788063a436941
456A482272n08859d605645E266553A211039J0052704a270664A954339g169145
447A782753J067776d33283j1744323F386760H59263e161732H837007b671320f20247
437d557332G840328a721558m792253G03058d98856C064606f844762n298284a45664
427F625429a332335E168605L85439a1051557N133128b687276l76173C068661L518302
418F586963e490220B38889c874343D234329N659803c311883D050952A302631a0824823
408B48433a503675A798852D02694N133377J606782a585441A811861b831958l537230
$$ plain form
475 -9208136 9070821 -5191836 -2056892 -3341543 1337211 -1973881 -6184293 2173236
466 2815031 -9713296 4215887 855788 1027791 1116325 1052318 -4758493 5788063 -1436941
456 1482272 973413 -4605645 5266553 1211039 11263743 -1270664 1954339 -7169145
447 1782753 2850529 -433283 -12177606 6386760 859263 -5161732 8837007 -2671320 -620247
437 -4557332 7840328 -1721558 -6513811 703058 -498856 3064606 -6844762 -12143046 -145664
427 6625429 -1332335 5168605 5554044 -11051557 -5918429 -2687276 -3063449 3068661 6586963
418 6586963 -5490220 238889 -3874343 4234329 9894132 -3311883 4050952 1302631 -10824823
408 248433 -1503675 1798852 402694 5536071 7142853 -1585441 1811861 -2831958 -6369188
399f369188H848338A260570P09061A84208f120398C459459d651117D033386E65380
389A602887b65733m450297L13601e56104H625732b94188m550500B879684J084290
380C963974c306086D347402h33070m157271c48124A859106J355638c859743o9888
371c929631H986674d167270a287773E005027D9243a882072E569395c33019D160802
361B140784c899113H22103a124038L15132A580035h77762j7383B681325J190086
352C871411b443914k11759G79120L26699d391173K35130i8516j0206410b609029
342c112198B579764i01857l494215p16912D246988j798497E63610a371337o175280
333g546617D711690a38952l654415E1902h05322A383663c571787A257056a575117
$$ plain form
399 -6369188 8848338 1260570 1969631 184208 -6120398 3459459 -4651117 4033386 565380
389 1602887 -265733 -4716030 -4402429 -556104 8625732 -294188 -4844688 2879684 3963974
380 3963974 -3306086 4347402 -833070 -4990341 -348124 1859106 3214744 -3859743 -3929631
371 -3929631 8986674 -4167270 -1287773 5005027 49243 -1882072 5569395 -333019 4160802
361 2140784 -3899113 822103 -1124038 -808906 1580035 -877762 -895145 2681325 3871411
352 3871411 -2443914 -2655673 779120 1105819 -4391173 -4156043 -98516 -10304926 -2609029
342 -3112198 2579764 -901857 -4396072 -5112984 4246988 2448491 563610 -1371337 -7546617
333 -7546617 4711690 -138952 -3793367 51902 -805322 1383663 -3571787 1257056 -1575117
323B867502J067685A453698K043838H41173f492044H069905b787924E873134k391505
314C481629A57921d905203A066596a531935F85744c210752D321468k050313J736105
305D007260d589911J777200G22452a474545b10238k823101A786914b483964j405445
296c889409F830004B113305A019945C45009M244091A87977N86072O98929e669309
286d081576B534169R77697L8324G04323a552140r39655e05221o272417L305632
277c472006C161172j415544K39625K132323b602095l61528b24266A706459K859274
268D565733A17853f233888A954656B02317K757987I77300d068730J500328f95253
258a803200c82321a72934m695881A2845190a73670l599641H959046c136345J422257
$$ plain form
323 2867502 3935187 1453698 3497536 841173 -6492044 8069905 -2787924 5873134 3481629
314 3481629 157921 -4905203 1066596 -1531935 685744 -3210752 4321468 2271155 4007260
305 4007260 -4589911 -2812711 722452 -1474545 -210238 -3033339 1786914 -2483964 -3889409
296 -3889409 6830004 2113305 1019945 345009 4589100 187977 774049 1472978 -5669309
286 -4081576 2534169 3511866 3550190 704323 -1552140 -2491795 -505221 -6777638 -3472006
277 -3472006 3161172 1745628 1985253 4117576 -2602095 -2963623 -224266 1706459 4565733
268 4565733 117853 -6233888 1954656 202317 2960304 977300 -4068730 -2568402 -695253
258 -1803200 -382321 -172934 -4868815 12845190 -173670 -3773311 8959046 -3136345 -1714088
249a714088k474946B51477a873708L98821j281466q25216g01587q84429B484004
239e139378i38169G20445P048104a254358J22613A133087K516470j33916a518662
229B842765K519254a877327A197235K015474K32296i93760J76985H769105d994467
219h7489E564503b437042D144844j86495b04579l273948B096993a340280n953
210a346233a36270D16381O551458d039673j114330A135080M259266A599818C35779
200d00509l8073m943489C638938R75836e067509a506948e97473l074119G660786
190i538722D75220Q964334a946951R24452A693576B46856h242668G168350A125110
180e393244D432956b207980D176906M24776c671640o085730G029741f742111I818549
$$ plain form
249 -1714088 -4189034 251477 -1873708 -1474887 -2756353 -3581569 -701587 -1586016 2484004
239 -5139378 -938169 720445 7768549 -1254358 -1131745 1133087 3649557 3515641 -1518662
229 2842765 5362019 -1877327 1197235 3212709 3445005 -993760 -816775 8769105 -4994467
219 -87489 5564503 -2437042 4144844 3958349 -204579 -3478527 2096993 -1340280 -1346233
210 -1346233 -136270 416381 6967839 -4039673 -5154003 1135080 5394346 1599818 335779
200 -400509 -438582 -5382071 3638938 4614774 -5067509 -1506948 -597473 -3671592 7660786
190 -9538722 475220 9439554 -1946951 -1022499 1693576 246856 -8242668 7168350 1125110
180 -5393244 4432956 -2207980 4176906 4601682 -3671640 -9757370 7029741 -6742111 9818549
170B261945b052153C977671A667043d565060l574828A308711j58721M158025B064371
160E48991H8222i286356c433944D273299A02094c702850n773872b26221A352989
150b299463a064688M79581k651591C672894A651895P334089e480640I594934h66421
140a508161L07491C386318L756216k255216g909110a85526E409615c037969G52468
130a951254H232383g188796c33920F700606k547619f382774b44837l297105A793
120d238007c91469k847798n514456E298346J295647b515070l923916G537542g606264
110G19010d785003J697216E008558H20622L128832D16487O598832A910660M55461
101B366121h367441E88176R463997d956742D647161K3284h756396F48644K424244
$$ plain form
170 2261945 -2052153 3977671 1667043 -4565060 -8139888 1308711 1149990 5308015 2064371
160 548991 88222 -9286356 -3433944 4273299 102094 -3702850 -9476722 -226221 1352989
150 -2299463 -1064688 -585107 -3236698 3672894 1651895 8985984 -5480640 9594934 -866421
140 -1508161 -1200670 3386318 7142534 4887318 -7909110 -185526 5409615 -3037969 752468
130 -1951254 8232383 -7188796 -333920 6700606 4152987 -6382774 -244837 -3541942 1793
120 -4238007 -391469 -3239267 -8753723 5298346 6593993 -2515070 -6438986 7537542 -7606264
110 719010 -4785003 -3087787 5008558 820622 3949454 416487 7015319 1910660 2366121
101 2366121 -8367441 588176 10052173 -4956742 4647161 4670445 -8756396 648644 3072888
92C072888g504486I568123A751462a602062m19304F455766d762607K033100E566069
82a524239k605199E885826B39981a092900l63540D950200a1579584E129078f276498
72a360234D858684A201606a640062o67201A745312a081367n58260E20333e68183
62C116071c886856H626207A461175b454276F559841C70755K788221A069297d667348
52I251037c778712D740665h124827K855079C865673O77914d216605B946528d696773
42e147694d34443l721212a450476C929d22451j034586E739939k591551i57746
32e755387E050733A338789m93554O117731c82061A225801K970835j337497a713988
22D748555A633945a72835m107780J845691e30880B043483d817581c58253A368509
$$ plain form
92 3072888 -7504486 9568123 1751462 -1602062 -2021366 6455766 -4762607 -2729507 5566069
82 -1524239 -4129438 5885826 239981 -1092900 -1456440 4950200 -11579584 5129078 -6276498
72 -1360234 4858684 1201606 -1640062 -2307263 1745312 -1081367 -1639627 520333 -568183
62 3116071 -3886856 8626207 1461175 -2454276 6559841 370755 3158976 1069297 -4667348
52 9251037 -3778712 4740665 -8124827 -5269748 3865673 4543587 -4216605 2946528 -4696773
42 -5147694 -434443 -4155655 -1450476 3929 -422451 -1457037 5739939 3148388 -957746
32 -5755387 5050733 1338789 845235 6962966 -382061 1225801 4196636 2859139 -1713988
22 4748555 1633945 -172835 -4280615 -2434924 -530880 2043483 -4817581 -358253 1368509
12B073598A26923a299475N65468C082055r46018c904428C177535c565414J645499
3a919915m98205k95814A197896
$$ plain form
12 2073598 126923 -1299475 -734007 3082055 2136037 -3904428 3177535 -3565414 -1919915
3 -1919915 -2418120 -2713934 1197896
##PAGE= F1=7210.054031291
##FIRST=     21204.543296753, 1514.41169507576, -1789074
##DATA TABLE= (F2++(Y..Y)), PROFILE
2047a789074C577972F09990b047592A002009b072510A883155r01471M18817L150709
2038D551210j94434a486780B771359A323359a898224K65658B990013D93814d863720
2028d96227l52622m955774A58627c32332I894682d36445n391735d81789F377496
2018F33324f21070l726552J427761L48368C136636A066695N350954a471292L74435
2009a096857F335721g640130A2281544C455061D90759R109257c585286G74860
2000B551467j264533K25584K86168B95328d771385L35145G5555J276788M855350
1991F207693d006906E884221c394066B023547r3993R18309a976894F13462N511776
1982F125238c373481A669703F02057h37889k870680E480650d295160C198771M575662
$$ plain form
2047 -1789074 3577972 609990 -2047592 1002009 -2072510 1883155 981684 1400501 4551210
2038 4551210 4356776 -1486780 2771359 1323359 -1898224 -1632566 2990013 493814 -4863720
2028 -496227 -848849 -5804623 158627 -332332 9894682 -436445 -5828180 -481789 6377496
2018 633324 -621070 -4347622 -2919861 -2571493 3136636 1066695 6417649 -1471292 -1096857
2009 -1096857 6335721 -7640130 12281544 3455061 490759 9600016 -3585286 774860
2000 2551467 1286934 1512518 1798686 295328 -4771385 -4436240 75555 1352343 6207693
1991 6207693 -4006906 5884221 -3394066 2023547 1929554 2847863 -1976894 613462 6125238
1982 6125238 -3373481 1669703 602057 -837889 -3708569 5480650 -4295160 3198771 7774433
1973G774433c687413J152638D716768J015312C08186O709770b808134C042222
1964e45873F47271c158045J95152C400626A171094a709312f30097B08651d580894
1954E227193L01168i014280E0560R19690d162113F47672h25047E435999a888077
1944B09320d5755j4153C335171K539402k109971G35442l26753a488929A732165
1934H13872f01136E23067h066906a763296H18466J083555b81346A382314a326218
1924b602529P99944B360091A43574J413791p41299e018331C741075e123793M31453
1915d692340F709889E40427J463599j000040g90312m50449E733040A451715a421806
1905a58470k019678l559515I297167i440767F828996B154792h322334i35597E660081
$$ plain form
1973 7774433 -3687413 -2534775 4716768 5732080 308186 7017956 -2808134 3042222
1964 -545873 647271 -3158045 -2962893 3400626 1171094 -1709312 -630097 208651 -4580894
1954 5227193 5528361 -9014280 50560 970250 -4162113 647672 -825047 5435999 -1888077
1944 209320 -45755 -59908 3335171 5874573 3764602 735442 408689 -1488929 1732165
1934 813872 -601136 523067 -8066906 -1763296 818466 1902021 -281346 1382314 -1326218
1924 -2602529 -1802585 2360091 143574 1557365 816066 -5018331 3741075 -5123793 -4692340
1915 -4692340 6709889 540427 2004026 1003986 -790312 -1240761 5733040 1451715 -1421806
1905 -158470 -2178148 -5737663 9297167 -9440767 6828996 2154792 -8322334 -935597 5660081
1895a131588B432833i83712B786765e928369D980890c705301q08535k175122J849753
1886d839205J835889J203885j036521m647565J893506B9564724L412361j5216226
1878A7760859H666896h703099r234943F57029c168300k3195997a3151178A630429
1869A8749950J3884486A5248367c947219e68500o76940p966084D213172K788125
1861G001297e794683a984653K29776D966930e417179a942965R04530j685215J147436
1852a576214B510900b541968j236496C524024j588012K011616c257085B126774
1843B135885F45887d770165P45452A224830e225799H207581b04853C692272b11613
1833e754946G156559a016733o170676D479650a652952B901346A419444J486096
$$ plain form
1895 -1131588 2432833 -983712 2786765 -5928369 4980890 -3705301 -4513836 -6688958 -4839205
1886 -4839205 -3003316 -1799431 -2835952 -7483517 -5590011 29564724 32977085 17760859
1878 17760859 8666896 -8703099 -17938042 657029 -3168300 -26364297 -13151178 1630429
1869 18749950 32634436 15248367 -3947219 -568500 -1245440 -9211524 4213172 7001297
1861 7001297 -5794683 -1984653 -1754877 4966930 -5417179 -1942965 -1038435 -2723650 -1576214
1852 -1576214 2510900 -2541968 -3778464 3524024 1936012 3947628 -3257085 2126774
1843 2135885 645887 -4770165 -4024713 1224830 -5225799 8207581 -204853 3692272 -211613
1833 -5754946 7156559 -1016733 -7187409 4479650 -1652952 2901346 1419444 2905540
1825B905540j071902e690370J295903C524684g841487B378740g887234H719727
1816c295108a200807B65304f53469l681065F47129a50711p80732B593173O40931
1807C234104A454932c354437n38022B286097b101511I38975d728526B298022b249315
1797B361091e590337b214458A248867c472815B335909b826159k67207J519842
1789a573524D005057a1185211G70773O775751c721265C654946A08014L111113
1781C219127c385940B180181K099812a63377a2455j061361C687914L9818A340577
1771G736297g041056a750983B491061n00986L652868N270544B369393d192403
1762e232474Q37237A0787219F5329b283391J079628G648672a021448l780291D307436
$$ plain form
1825 2905540 1833638 -5690370 -4394467 3524684 -7841487 2378740 -7887234 8719727
1816 -3295108 -1200807 265304 -653469 -4334534 647129 -150711 -931443 2593173 3234104
1807 3234104 1454932 -3354437 -3892459 2286097 -2101511 938975 -4728526 2298022 -2249315
1797 2361091 -5590337 -2214458 1248867 -3472815 2335909 -2826159 -3093366 -1573524
1789 -1573524 4005057 -11185211 770773 7546524 -3721265 3654946 108014 3219127
1781 3219127 -3385940 2180181 4279993 -163377 -12455 -1073816 3687914 3727732 1340577
1771 7736297 -7041056 -1750983 2491061 1990075 5642943 10913487 2369393 -4192403
1762 -5232474 -4395237 10787219 65329 -2283391 -1203763 7648672 -1021448 -4801739 4307436
1752a114823E315157h10371n247316B690969b241485h37654B645624c59492j386532
1743a746024B005152k39949f262284b936700G004576a935938B282888l48386a548462
1733b755675o28398H493518g383689c434516B393187C62973J030611c372966F69641
1723b979895A990487Q298674c505783A103632a091797n26952j164112C751863
1714E091589A357404m41291b585410A608472N84950a465793l94551q69923B823293
1704d353183H648493d065503g00114j96136L86189l66892A469969c68688A769537
1694D884016c359236o33161D114290d167936j00363B344252J633992A77382n1726
1685A25656a24828k079931C731683d3862k826369G090281I99993K479167b811397
$$ plain form
1752 -1114823 5315157 -810371 -6057687 2690969 -2241485 -837654 2645624 -359492 -1746024
1743 -1746024 2005152 1765203 -6262284 -2936700 7004576 -1935938 2282888 1934502 -1548462
1733 -2755675 -3384073 8493518 -7383689 -3434516 2393187 362973 1393584 -3372966 669641
1723 -2979895 1990487 10289161 -3505783 1103632 -1091797 -1618749 -2782861 3751863
1714 5091589 1357404 916113 -2585410 1608472 2193422 -1465793 -1860344 -2730267 2823293
1704 -4353183 8648493 -4065503 -700114 -896250 -510061 -876953 1469969 -368688 1769537
1694 4884016 -3359236 -3992397 4114290 -4167936 -4268299 2344252 3978244 177382 125656
1685 125656 -124828 -2204759 3731683 -43862 -2870231 7090281 999993 3479160 -2811397
1675B49420a405290J35895k616117D022932e27406H31564h435213b598005j879732
1666d477737C513839i70208m221542D823475B222375e485611e83502l154172J268311
1657b469363C452356j53436e15143k130504H47833h236876a102999e01631C654745
1647A609477d149551c06641B14638O654134a563379M10250r054220c651814A268097
1637F490106k977612i529329B855751c56589l417595E821461j000813e776782
1628b010877f91210E822339b033890E75504h194698b59858m158499e42992D130547
1618a0146193E970162b39842j531431B871423b953769C964012L308511e327435
1609B742346c590195J351159j980553F890798l272019A304138E96720K116183
$$ plain form
1675 249420 -1405290 -1269395 -3885512 4022932 -527406 831564 -8435213 -2598005 -4477737
1666 -4477737 3513839 -970208 -5191750 4823475 2222375 -5485611 -583502 -3737674 -2469363
1657 -2469363 3452356 3298920 -515143 -2645647 847833 -8236876 -1102999 -501631 3654745
1647 1609477 -4149551 -306641 214638 6868772 -1563379 -1153129 -10207349 -3651814 1268097
1637 6490106 3512494 -9529329 2855751 -356589 -3774184 5821461 4820648 -5776782
1628 -2010877 -691210 5822339 -2033890 575504 -8194698 -259858 -4418357 -542992 4130547
1618 -10146193 5970162 -239842 -1771273 2871423 -2953769 3964012 7272523 -5327435
1609 2742346 -3590195 -2239036 -4219589 6890798 3618779 1304138 596720 2712903
1601B712903d280212D32038A06888b553618q44583k10454H106496a820877F504000
1591A2698917f451060k726465A134790J1464486e875067C246234e01677D086742
1582e881158K303605J577219C054676d799056C896104e542148F94448e342915
1573a422218E569552k366445d99243k044001D681713a444173B949878D91761L59129
1564H50890e98030B332966K541700c297504j573256b018011D73770M131615d017366
1554A755165K413941L183552p65672D28539K403106b115807F667842i007866b891426
1544g48433B840815O764676A437920F11158L494342a224174G849209F7304e5585
1534E070282d267791J592350j265459I756651A010224e518700d56180n032194
$$ plain form
1601 2712903 -4280212 432038 106888 -2553618 -3398201 -3608655 8106496 -1820877 6504000
1591 12698917 -6451060 -9177525 1134790 12599276 -5875067 3246234 -501677 4086742
1582 -5881158 -3577553 -2000334 3054676 -4799056 3896104 -5542148 694448 -5342915
1573 -1422218 5569552 3203107 -499243 -2543244 4681713 -1444173 2949878 491761 850890
1564 850890 -598030 2332966 4874666 -3297504 -4870760 -2018011 473770 4605385 -4017366
1554 1755165 4169106 7352658 6586986 428539 2831645 -2115807 6667842 -9007866 -2891426
1544 -748433 2840815 9605491 1437920 611158 4105500 -1224174 7849209 67304 -55585
1534 5070282 -4267791 -2675441 -3940900 9756651 1010224 -5518700 -456180 -5488374
1526e488374I521272i830746b153475H099563c911370C429289a384206j845037
1518c229243k683364D4008R229148b630264m179367D537607D8835P112722e204407
1508D879807a679543N07080C148390N773321b986552m517711E360108a646516
1499B445081o13114K168231j746204d725971G05336c802748G106018a2882494
1490a359648n971274F630673c539470D346665d866832C10353h730892I214578
1481d53537m033771b025894B658303J93416j8241a1326435A210476M066523a171980
1471G918540G14998M794155H21825f343741E009719a059662H132821k073051a4506152
1461a5403282B150447H91026o1589N97205B46486g901633c671102m483510O2703
$$ plain form
1526 -5488374 9521272 -9830746 -2153475 8099563 -3911370 3429289 -1384206 -3229243
1518 -3229243 -5912607 44008 9273156 -2630264 -6809631 4537607 48835 7161557 -5204407
1508 4879807 -1679543 -1172463 3148390 8921711 -2986552 -7504263 5360108 -1646516
1499 2445081 1831967 4000198 2253994 -4725971 705336 -3802748 7106018 -12882494
1490 -1359648 -7330922 6630673 -3539470 4346665 -4866832 310353 -8730892 9214578
1481 -453537 -4487308 -2025894 2658303 2851719 2833478 -11326435 1210476 5276999 -1171980
1471 7918540 714998 5509153 821825 -6343741 5009719 -1059662 8132821 6059770 -14506152
1461 -15403282 2150447 891026 829437 1426642 246486 -7901633 -3671102 -8154612 -8091909
1452h091909E146324P775910D467408K531952g04827j632599j097227r35695A475177
1442I87399P053629a0904665A665267a625786f98471l124100A985376L089004
1434E074380a203639C104654b74341j542944F557179d043622n2399E410405a015073
1424c503505F746785B403946m17177J108196f965825B596594F76550f705383a041921
1414B502151a2409851b4608G96360f214029a413211A0687085d265996j034017
1406e300013a38122B526884A117544a745683p359707A1492735H65952a190836
1397B267636a49903A762774L252969a367005l927269H924776i181680K396166
1389f785514C782665b367160H150783A498919f544152C427799J25724a476501
$$ plain form
1452 -8091909 5146324 12922234 4467408 6999360 -704827 -2337426 -3434653 -4370348 1475177
1442 987399 8041028 -10904665 1665267 -1625786 -698471 -3822571 1985376 5074380
1434 5074380 -1203639 3104654 -274341 -1817285 6557179 -4043622 -4096021 5410405 -1015073
1424 -3503505 6746785 2403946 1986769 3094965 -6965825 2596594 676550 -6705383 -1041921
1414 2502151 -12409851 -24608 796360 -6214029 -1413211 10687085 -4265996 -5300013
1406 -5300013 -138122 2526884 1117544 -1745683 -9105390 11492735 865952 -1190836
1397 2267636 -149903 1762774 5015743 -1367005 -5294274 8924776 -9181680 -6785514
1389 -6785514 3782665 -2367160 8150783 1498919 -6544152 3427799 3553523 -1476501
1380g105063K326893B526291F33467J882177L632831B094933e94012l252201A027553
1370c21564C499547j519908f459073F329373i065816a509718A121861D20704K523301
1361B944005h135914K099747E708786a703626C349887e67696n45795n763210B623898
1351A299814k54849b635078C784081a062689A202543M464728b203492D27522J060447
1342A487969N292402E45981J417405d731441A3386429d731402G16565a3132735
1333f392957J097817B65055M854310g33193K60894n895180A588708a01789j64608
1324b66397A763018K074213g40027B78484f82514F114786A872342a928549D221870
1314b892207b76723B788391f765873a922490L39320E275306k630605a183255p341354
$$ plain form
1380 -7105063 -4778170 2526291 633467 2515644 6148475 2094933 -594012 -3846213 1027553
1370 -321564 3499547 1979639 -6459073 6329373 -9065816 -1509718 1121861 420704 2944005
1361 2944005 -8135914 -6036167 5708786 -1703626 3349887 -567696 -1113491 -6876701 2623898
1351 1299814 1044965 -2635078 3784081 -1062689 1202543 5667271 -2203492 427522 1487969
1342 1487969 6780371 545981 1963386 -4731441 13386429 -4731402 716565 -13132735
1333 -6392957 -5295140 265055 5119365 -733193 -472299 -6367479 1588708 -101789 -266397
1324 -266397 1763018 3837231 -740027 278484 -682514 6114786 1872342 -1928549 4221870
1314 -2892207 -276723 2788391 -6765873 -1922490 -1583170 5275306 2644701 -1183255 -8524609
1305h524609E305334g029752b085366A0264350d423597g83753j725134G427687
1296b210463D795164J136623e11086B262876i08007D929995j344207a448371E290352
1286g135171G50328O335333f836238A799310c334011D669730N09382A580574J097995
1277B678569d062453J994676o74104G327647d534967E913253g82791j25196Q7331
1268h20656H32071d112452g92187l661151F142892a984980B052483f495806A1970036
1258h52903k013413n51278C733438a62178k839042O37008N80424P63465D550427
1248E978361a587685A694282A91432M938262f937232C17248J648512f66171l097459
1239c763630A335655Q966402b765349I469141e742316B938835c698034a497035
$$ plain form
1305 -8524609 5305334 -7029752 -2085366 10264350 -4423597 -783753 -2508887 7427687
1296 -2210463 4795164 5931787 -511086 2262876 -908007 4929995 3585788 -1448371 5290352
1286 -7135171 750328 7085661 -6836238 1799310 -3334011 4669730 5179112 1580574 2678569
1277 2678569 -4062453 -2067777 -2741881 7327647 -4534967 5913253 -782791 -907987 -820656
1268 -820656 832071 -4112452 -792187 -4453338 6142892 -1984980 2052483 -6495806 11970036
1258 -852903 -2866316 -3417594 3733438 -162178 -3001220 -2364212 -1783788 -1020323 4550427
1248 5978361 -1587685 1694282 191432 5129694 -6937232 317248 1965760 -666171 -3763630
1239 -3763630 1335655 10302057 -2765349 9469141 -5742316 2938835 -3698034 -1497035
1230a667473G323761g08348n766731e24296l31525A446208a144166E337069b778338
1220a0360045A1913922c109607D275355h343858D617352F94380b47413m96052
1212g43465m36852n555832A405936e267328n68508a120260H943384a163617A728887
1202e14999J98146n543352a398312k149657A03192N684122j233886G39431N796917
1193F536348k450688b304845I459019C884508Q047644C643145J837957M528977
1185A0010079j444835N666892J1268499m763916C783012c7341326o2318976K2360248
1177g7300054a8520889B2123731r251874a1049754F037366K5493330G63240f1021316
1168a04717848K8843326a7345136C7628360j0036459j3619122J0484842E193291
$$ plain form
1230 -1667473 7323761 -708348 -6475079 -524296 -855821 1446208 -1144166 5337069 -2778338
1220 -10360045 11913922 -3109607 4275355 -8343858 4617352 694380 -247413 -743465
1212 -743465 -1180317 -6736149 1405936 -5267328 -5835836 -1120260 8943384 -1163617 1728887
1202 -514999 -316853 -5860205 -1398312 -3547969 103192 5787314 4553428 739431 6536348
1193 6536348 4085660 -2304845 9459019 3884508 11932152 3643145 5481102 10010079
1185 10010079 8565244 14232136 25500635 20736719 3783012 -37341326 -99660302 -77300054
1177 -77300054 -18520889 22123731 12871857 -11049754 6037366 31530696 763240 -61021316
1168 -104717848 -75874522 -17345136 37628360 27591901 13972779 24457621 5193291
1160H172381C179882M324087A732389P1917f48510A0788438a1484018F506171
1151F760426j816655k279372a334844B430000N387108C517339P18183a318163
1142A641497M089745a3133921N925394m933126b96947c1295H640188K584377A413339
1132F735242f042035J066898R20842n382181L767539A2467601J652090L412506
1124A7532197K480383o608882R06566E568030b0188079o19411G53355a598881
1115C332272M186943R10064a792561E131326d167158p791289k713820L767737
1107a0904530F472069J20330a1736A574370a723857k371486C689338A312449f19671
1097G533638a904267B428377d49723l477082E620252g27710n458291A0089319
$$ plain form
1160 8172381 3179882 7503969 1732389 1804306 -648510 10788438 -11484018 6506171
1151 6760426 4943771 2664399 -1334844 2430000 7817108 3517339 4235522 -1318163
1142 1641497 5731242 -13133921 -7208527 -12141653 -296947 -31295 8640188 11224565 1413339
1132 6735242 -6042035 -4975137 -4054295 -9436476 -5668937 12467601 14119691 17532197
1124 17532197 20012580 13403698 14310264 5568030 -20188079 -20807490 753355 -1598881
1115 3332272 7519215 8429279 -1792561 5131326 -4167158 -11958447 -14672267 -10904530
1107 -10904530 6472069 6592399 -11736 1574370 -1723857 -4095343 3689338 1312449 -619671
1097 7533638 -1904267 2428377 -449723 -3926805 5620252 -727710 -6186001 10089319
1088e547824H226628e034968a854202B005192c049988k64281B223153b410018
1079d929991a9918p713476I546539A145729d707138a764915E844145H22532c351722
1069C408987a990510A0802851m784651a141390k970614K27727j130218a760275
1060e986153A8089Q34518K286345a3056946E088751b934980B559812a48007C621949
1050E291342B404189P91801J34433J1860123o025552L0221238p069186H732715
1041a6778400k569486c752734A4566046J7921748g160691l107032F355096L9672345
1033D6027441k879445j8621051a0970849l0846638J903462D140027K0217995J731855
1025B6089877I125624e141431a035504C374762K272490M980926b4570533R34296
$$ plain form
1088 -5547824 8226628 -5034968 -1854202 2005192 -3049988 -3314269 2223153 -2410018
1079 -4929991 -19918 -7733394 9546539 1145729 -4707138 -1764915 5844145 822532 -3351722
1069 3408987 -1990510 10802851 6018200 -1141390 -4112004 -3884277 -5014495 -1760275
1060 -5986153 18089 852607 3138952 -13056946 5088751 -2934980 2559812 -148007 3621949
1050 5291342 2404189 3195990 3330423 15190546 9164994 39386232 32317046 8732715
1041 -16778400 -19347886 -3752734 14566046 32487794 -7160691 -10267723 6355096 46027441
1033 46027441 43147996 24526945 -10970849 -41817487 -39914025 4140027 24358022 26089877
1025 26089877 9125624 -5141431 -1035504 3374762 5647252 10628178 -24570533 -23636237
1017b3636237a0711750D409212M26976Q957108C537819A233342J313440a7394112
1008a6099944K955154b450462A41973O05542d212310A020094a916181A4435246
999d74287A893437a2002917o36738b706568m19400a66308E267021k06172O054008
990A1114857E134910N341920m969470b5949738a1470214J917240k589763J205077
982a0937660K221756j752084A402713e353032l382814j5507046a450111j3544960
974a4995071A465834L528399Q599501n392022c362325B3121016r151372K281078
966A6250722M284139o46542q623895K680547P539619r582200E646692O849961
958A2496653f192463F544209c824964j0334673O057572c744406j2830860K787022
$$ plain form
1017 -23636237 -10711750 4409212 4836188 13793296 3537819 1233342 2546782 -17394112
1008 -16099944 -13144790 -2450462 141973 747515 -4212310 1020094 -1916181 14435246
999 -474287 1893437 -12002917 -12639655 -2706568 -3125968 -166308 5267021 5060849 11114857
990 11114857 5134910 10476830 5507360 -25949738 -11470214 -9552974 -12142737 -10937660
982 -10937660 -8715904 -10467988 1402713 -5353032 -8735846 -24242892 -1450111 -14995071
974 -14995071 1465834 4994233 13593734 8201712 -3362325 23121016 13969644 16250722
966 16250722 20534861 19888319 11264424 13944971 21484590 11902390 5646692 12496653
958 12496653 -6192463 6544209 -3824964 -14159637 -8102065 -3744406 -16575266 -13788244
950a3788244M692796M394274a074264o789768L131906l444240k53895b356306
941h17702j381980F185877b60581o425889b16430p36487n639989D923680I48961
931A487126h08822F35725h249440e59025A5348486B140920K454702a808951L18733
922a490218B494079g523884a210767a11851m756419D533730A211225a797407j654455
913c451862A946605N26503r13647d242370A585499f055148K680746o289917c869070
903D439945f217615b900566a425848o85608o389a002871d75758p039109J898319
894e616548A410027b152234B904555c13569k647425l494296J829036b06527j269683
885a476210B986862c174841F08424K20477l646O14868L557835d582668G639509
$$ plain form
950 -13788244 -9095448 -4701174 -1074264 -7864032 -4732126 -8176366 -8430261 -2356306
941 -817702 -2199682 6185877 -260581 -6686470 -216430 -952917 -6592906 4923680 948961
931 1487126 -808822 635725 -8249440 -559025 15348486 2140920 4595622 -1808951 -1490218
922 -1490218 2494079 -7523884 -1210767 -111851 -4868270 4533730 1211225 -1797407 -3451862
913 -3451862 1946605 2473108 1559461 -4242370 1585499 -6055148 -3374402 -9664319 -3869070
903 4439945 -6217615 -2900566 -1425848 -2111456 -2117845 -1002871 -475758 -7514867 -5616548
894 -5616548 1410027 -2152234 2904555 -313569 -2960994 -6455290 -4626254 -206527 -1476210
885 -1476210 2986862 -3174841 608424 828901 825255 1440123 4997958 -4582668 7639509
875B276392J818769d043646J515022k42399i86555j156068G048718G5994g180759
865a644109n141819F599401K74485A249483E40719J1198629D260067B25269M70506
856F95775e541787C717367e204284K283539q61068I378R108046a1099371c52030
846D633922n22394J334081e52061b42314B121106c20500B268378d070198D470317
836a486408o663503A052157a825832j343460G280437h130424c812472K34986a21746
826B790783a838986g90596l095810E075073d022315A350600N784469c395716J482851
817a912865F79916J434495D60166N899832B582251c400918k038657Q37454a488762
807b570550q432329c016310e86259C179621i051030A435620g83859j763128B843722
$$ plain form
875 2276392 4095161 -4043646 -2528624 -2771023 -986555 -2142623 7048718 75994 -7180759
865 -1644109 -6785928 6599401 6873886 1249483 540719 11739348 4260067 225269 695775
856 695775 -5541787 3717367 -5204284 -2920745 -3781813 9378 9117424 -11099371 -352030
846 4633922 4111528 5445609 -552061 -242314 2121106 -320500 2268378 -4070198 4470317
836 -1486408 -8149911 1052157 -1825832 -3169292 7280437 -8130424 -3812472 -3577486 -121746
826 2790783 -1838986 -790596 -3886406 5075073 -4022315 1350600 7135069 -3395716 -1912865
817 -1912865 679916 2114411 460166 6359998 2582251 -3400918 -5439575 -4602121 -1488762
807 -2570550 -11002879 -3016310 -586259 3179621 -9051030 1435620 -783859 -2546987 2843722
797G444668C393376j066841d74239G076587d38946p25436B76052a31749B274455
787C012063N33521D36901a288302A918443f013689F27881J312521a625498B214097
777c1616m225539H32917a4411D409532d915586J041277F156223b834494C449366
767D014814a001279B526346O92053d254320d58o54505a31582l237133D730119
757d378687E27924L58206J526912K150787c168303j056120J562924F01511O16267
748A217778d693038B903386D12440P29697b111125n694296F79618a678370E396121
738a425889j819647A607670C26199O31967L236023a0378465E900758B421793e996487
728F972777e021320J860405G800791A453216b967053a083572j016856H001143
$$ plain form
797 7444668 3393376 2326535 -474239 7076587 -438946 -1164382 276052 -131749 2274455
787 3012063 3545584 436901 -1288302 1918443 -6013689 627881 1940402 -1625498 2214097
777 -31616 -4257155 832917 -14411 4409532 -4915586 -3874309 6156223 -2834494 3449366
767 4014814 -1001279 2526346 3218399 -4254320 -458 -654963 -131582 -3368715 4730119
757 -4378687 527924 886130 2413042 4563829 -3168303 -4224423 -2661499 601511 1217778
748 1217778 -4693038 2903386 412440 1142137 -2111125 -7805421 679618 -1678370 5396121
738 -1425889 -3245536 1607670 326199 958166 4194189 -10378465 5900758 2421793 -5996487
728 6972777 -5021320 -3160915 7800791 1453216 -2967053 -1083572 -2100428 8001143
719B369742b93509A1053481e865530A469999e07208n692540C16782M772195g264075
709C105169b06409j565676C376592M238310i449977A07384c532112n39482c60102
699C943645d664679J321661A05790M41729J1548591d235722D660987B003750b681295
689F857016d861587J713264B050894c422746b86830E253862B095098K07414f911508
679d299255a882027C452360J457080c124838h71445E607925i38503C535171A038409
669e111869A460631f11192n757393F293135e236904A395547p3010K902821c3341
659h30753r98100C959209b327472a23483G19775L964028c326468a098777B06766
649C811855A456873a617401D221981L593460b984984Q52995B12496J719661f004208
$$ plain form
719 2369742 -293509 11053481 -5865530 1469999 -507208 -6199748 316782 5088977 -7264075
709 3105169 -206409 -1772085 3376592 7614902 -9449977 107384 -3532112 -4071594 -360102
699 3943645 -4664679 -3343018 105790 547519 12096110 -4235722 4660987 2003750 -2681295
689 6857016 -4861587 -3148323 2050894 -3422746 -286830 5253862 2095098 2302512 -6911508
679 -4299255 -1882027 3452360 4909440 -3124838 -871445 5607925 -938503 3535171 1038409
669 -5111869 1460631 -611192 -6368585 6293135 -5236904 1395547 1322537 4225358 -33341
659 -830753 -1828853 3959209 -2327472 -123483 719775 4683803 -3326468 -1098777 206766
649 3811855 1456873 -1617401 4221981 7815441 -2984984 -2131989 212496 1932157 -6004208
639D414429O711a046311G00281e138359N48314b009182E62561c753712a75340
629E43412e954404A976402a36761D983589B018016Q186898c256383j300839f11223
619A5931284H52546J640570r71453e163667H968257b309242k991764A406778N713499
610G120277a327123A457143J119621a936432A04438J930436a0297812B820029
601e46201n464672C301690d159374A043028c804263B996081A106849b505654a207356
591g124063A331365M70972K1588c827584I85567M343884L571341e794279F112491
581g8849E041705a2688n336148b351890E655784d11132C621171c129566B560951
571a652589A285488f56925j097655B097068P822308B339027g770793B585559M1944
$$ plain form
639 4414429 4421140 -1046311 700281 -5138359 -4590045 -2009182 562561 -3753712 -175340
629 543412 -5954404 1976402 -136761 4983589 2018016 10204914 -3256383 -4557222 -611223
619 15931284 852546 2493116 1521663 -5163667 8968257 -2309242 -5301006 1406778 7120277
610 7120277 -1327123 1457143 2576764 -1936432 104438 2034874 -10297812 2820029
601 -546201 -6010873 3301690 -4159374 1043028 -3804263 2996081 1106849 -2505654 -1207356
591 -7124063 1331365 1802337 1823925 -3827584 985567 5329451 8900792 -5794279 6112491
581 -78849 5041705 -12688 -5348836 -2351890 5655784 -411132 3621171 -3129566 2560951
571 -1652589 1285488 -656925 -1754580 2097068 9919376 2339027 -7770793 2585559 2627503
562B627503d435432B663248f281773A145890d563875I98275c762724A338290J529087
553B867377e180247a44532j698806I51033b829198j228946C542547j314258a0556684
543E341268c610265D416480N960620g958404J970047a255272G78995M07047P846419
534I032461d854559A858174o15407g78740k511356E579964h99873j521883A6233062
524f627421E571885b597234I316900b358016D149990g79412r14544C536294c67563
514A920457e593718a464494k457940F71603g486164C623709J064301G55725J581421
505B337146b333461A892224K41476b141122C323700h60409r11112I413506e335727
495d6812j099052k787749a258293n2464A445919K11692J55828a884165G949273
$$ plain form
562 2627503 -4435432 2663248 -6281773 1145890 -4563875 998275 -3762724 1338290 2867377
553 2867377 -5180247 -144532 -1843338 951033 -2829198 -4058144 3542547 2228289 -10556684
543 5341268 -3610265 4416480 10377100 -7958404 -5988357 -1255272 778995 1186042 9032461
534 9032461 -4854559 1858174 1242767 -778740 -3290096 5579964 -899873 -2421756 16233062
524 -6627421 5571885 -2597234 9316900 -2358016 4149990 -779412 -1693956 3536294 -367563
514 1920457 -5593718 -1464494 -3922434 671603 -7486164 3623709 4688010 755725 2337146
505 2337146 -2333461 1892224 2133700 -2141122 3323700 -860409 -1771521 9413506 -5335727
495 -46812 -1145864 -3933613 -1258293 -1310757 1445919 1657611 1813439 -1884165 7949273
485g152698a81842j694934d89798m246542B787192L5432K451579b147705B468326
475h967764H237971d627865a793464j226427E74424g13066n735795B458803J57899
466B616702i580768D731170C92800P87807O5278f56814m404229F061624a124424
456A620306G20360e536330E782038A484921J0535365a048414B269598f604330
447A370576K817976a613700r820798F025966E77721d637705G702466a599868f61569
437d784708H493185a808524l504543F6573c8063C127733g725314l822964b148551
427G189476a720507C273749K642128a1752127d633112b272259j260114D019974
418E896196e867168b96749l242560D423366N779538d576309C770775H39069i632279
$$ plain form
485 -7152698 -181842 -1876776 -489798 -4736340 2787192 2822624 5274203 -2147705 2468326
475 -8967764 8237971 -4627865 -1793464 -3019891 574424 -713066 -6448861 2458803 2616702
466 2616702 -9580768 4731170 392800 1180607 1245885 -656814 -5061043 6061624 -1124424
456 1620306 720360 -5536330 5782038 1484921 12020286 -1048414 2269598 -6604330
447 1370576 4188552 -1613700 -11434498 6025966 577721 -4637705 7702466 -1599868 -661569
437 -4784708 8493185 -1808524 -5313067 66573 -38063 3127733 -7725314 -11548278 -2148551
427 7189476 -1720507 3273749 5915877 -11752127 -4633112 -2272259 -3532373 4019974
418 5896196 -5867168 -296749 -3539309 4423366 10202904 -4576309 3770775 839069 -9632279
408B64180a885767G20272b18932E628126O01855a807478B163968b981428m326012
399g307440A0312680A117585J17185M57804e966317A709744e090058D206484A614821
389A459325a033196n366554J883118E80190Q006448b21886n352679B834566k08234
380B626332b395817D698712a710495l172269f05590B212312k73750d314637J446672
371b867965I128767d567500a483714D567605e4436j727678E021960c42698D376451
361A492903d169855A178805h83291l76450A834128a379885M0346A829215K103388
352C932603b089651p59154D46944J260456e371167K178565f91016q451222b466520
342d268262B744652a990948k019765j475503C710315q97344j181879a747079p699889
$$ plain form
408 264180 -1885767 720272 -218932 5628126 6229981 -1807478 2163968 -2981428 -7307440
399 -7307440 10312680 1117585 1234770 1692574 -5966317 1709744 -5090058 4206484 1614821
389 1459325 -1033196 -6399750 -4516632 580190 8586638 -221886 -5574565 2834566 2626332
380 2626332 -2395817 4698712 -1710495 -4882764 -605590 2212312 1938562 -4314637 -2867965
371 -2867965 9128767 -4567500 -1483714 4567605 -54436 -1782114 5021960 -342698 4376451
361 1492903 -4169855 1178805 -883291 -1259741 1834128 -1379885 -1339539 1829215 3932603
352 3932603 -2089651 -2848805 446944 1707400 -5371167 -3192602 -691016 -9142238 -2466520
342 -4268262 2744652 -1990948 -4010713 -5486216 3710315 2812971 1631092 -1747079 -9446968
333i446968F388569g12894k762858B08981f67846D46786b729181A137859i67316
323B854676P31453I50006J576687o48110e597756H696446b289231F477493B855320
313A496822e942278A758676b205686A224416b882745D301665j792496K333048
305D842217e207559J050344C61835b697462c96545j687826A458323b806954n18714
296c325668F815521B170634M37850H93229K271815A228551a96766A939287d426682
286d431533C350742k84602P56675B27385b539617n56003f55710o223384L233414
277c645680C533792A413418O99451K736338b428474m95013a044683A175779J444921
268B620700A59367f998133B313551G52417J792877A244730d966281a900132J21890
$$ plain form
333 -9446968 6388569 -712894 -3475752 208981 -667846 446786 -2729181 1137859 -967316
323 2854676 3586129 950006 2526693 1878583 -5597756 8696446 -2289231 6477493 2855320
313 1496822 -5942278 1758676 -2205686 1224416 -2882745 4301665 2509169 4842217
305 4842217 -5207559 -4157215 361835 -2697462 -396545 -2084371 1458323 -2806954 -3325668
296 -3325668 6815521 2170634 2608484 893229 3165044 1228551 -196766 1939287 -4426682
286 -4431533 3350742 3066140 3822815 227385 -2539617 -3095620 -655710 -6879094 -3645680
277 -3645680 3533792 1413418 2112869 4849207 -2428474 -2923487 -1044683 1175779 2620700
268 2620700 159367 -6998133 2313551 752417 2545294 1244730 -4966281 -1900132 -1778242
259a778242e06647J6313C88524d960907A2657765d58689m088040I183828b823505
249a236039k760281F68122a811489j29183j91306p01492e03053k89837B370736
239f289417a461601A380977N608225G29002b628746C71991J969016k12120B32524
229B877753J349106b116707G36464L024942j197900A49270g77382H137126d600545
219a571E336629c430033D560050j405514e09806l396491B912572b782917f23398
209i97591H70632N351855c961404j207229B114835K568294A915083p51258g89390
199i10802m124972C572266J621280h190648a128003H7204c873413H130220a0172137
189H7990J0237988a570565O94738B347453g5307q953198H455414e92435l739860
$$ plain form
259 -1778242 -506647 -490334 388524 -4960907 12657765 -458689 -4546729 9183828 -2823505
249 -1236039 -3996320 668122 -1811489 -1940672 -2131978 -2833470 -503053 -792890 2370736
239 -6289417 -1461601 1380977 6989202 729002 -2628746 371991 2341007 2128887 232524
229 2877753 4226859 -2116707 736464 3761406 2563506 149270 -777382 8137126 -4600545
219 -1571 5336629 -3430033 4560050 3154536 -509806 -3906297 2912572 -2782917 -623398
209 -997591 870632 6222487 -3961404 -5168633 2114835 4683129 1915083 1163825 -789390
199 -910802 -5035774 3572266 5193546 -8190648 -1128003 87204 -3873413 8130220 -10172137
189 87990 10325978 -1570565 -875827 2347453 -75307 -9028505 8455414 -592435 -4332295
180d332295D131394C82166L011233Q38525b883066n837559F518527g760634I664324
170B290751a753332B860184A248832c286769n577633A005482J304848K818512
162E128842A908875m09986a925272n498906L636606D634066G13127e115717o197793
153a1313510c46458A546248b676131h71502q80679k412366C116306A249161P164804
144H413965e648186I789492i27613j107634i06289C104172K848824l30959f236300
134h20324D309432b786539A513711b198397I564559g955093A49655O323834C056312
124f941541D95618e086198c74939l219158f97423k987119n943713E014562J411527
115F426089b870757j711301F682056h720232B79492d052042L42350C941046A823466
$$ plain form
180 -4332295 4131394 382166 3393399 4231924 -2883066 -8720625 6518527 -7760634 9664324
170 2290751 -1753332 2860184 1248832 -3286769 -8864402 1005482 2310330 5128842
162 5128842 1908875 1498889 -1925272 -7424178 -3787572 4634066 713127 -5115717 -11313510
153 -11313510 -346458 1546248 -2676131 -871502 -1752181 -4164547 3116306 1249161 8413965
144 8413965 -5648186 9789492 -927613 -2035247 -906289 3104172 5952996 5622037 -6236300
134 -820324 4309432 -2786539 1513711 -2198397 9564559 -7955093 149655 6473489 3056312
124 -6941541 495618 -5086198 -374939 -3594097 -697423 -3684542 -9628255 5014562 6426089
115 6426089 -2870757 -4582058 6682056 -8720232 279492 -4052042 -3709692 3941046 1823466
105D627657f55116F783702A207689j10880h717907G20812Q915191d913854D114989
95C753108h158135A153792J034749i904175H097686A844000a794989K42970F352109
85d268192J331038E500254b109474j295006D679293D30462a853198L73662D880152
75a1755530E309858e873849a391685D085304A669508a217488j194155A216804
66c66626j510211D05764a223987E177710e629015H960363A774232b476813G233575
56b126569B732005G85655d566147I515309c537667E294330h547735L009377C552552
46E326189e049548C050457d077274j243028i98484l106714a491193E53918a715142
36a988350F629932B516618a317672m151135D626390D80990L07604N272307A91380
$$ plain form
105 4627657 -655116 6783702 1207689 1096809 -8717907 720812 9636003 -4913854 4114989
95 3753108 -8158135 1153792 2188541 -9904175 8097686 1844000 -1794989 -1552019 6352109
85 -4268192 -2937154 5500254 -2109474 -3404480 4679293 430462 -1853198 -1479536 4880152
75 -11755530 5309858 -5873849 -1391685 4085304 1669508 -1217488 -2411643 1216804
66 -366626 -1876837 405764 -1223987 5177710 -5629015 8960363 1774232 -2476813 7233575
56 -2126569 2732005 785655 -4566147 9515309 -3537667 5294330 -8547735 -5538358 3552552
46 5326189 -5049548 3050457 -4077274 -5320302 -998484 -4105198 -1491193 553918 -1715142
36 -1988350 6629932 2516618 -1317672 -5468807 4626390 480990 788594 6060901 191380
26A340322K385767m51437a825711D786116B125933a488671m053523b020531h96557
16B495600d370932g60620A032570J521635a000886d39407m22271C014867j141068
7A873799d291308B047447c268480J239795o30366m71318I06084
$$ plain form
26 1340322 3726089 3274652 -1825711 4786116 2125933 -1488671 -5542194 -2020531 -896557
16 2495600 -4370932 -760620 1032570 2554205 -1000886 -439407 -861678 3014867 1873799
7 1873799 -4291308 2047447 -3268480 -2028685 -2659051 -3130369 906084
##PAGE= F1=7188.255761407
##FIRST=     21204.543296753, 1514.41169507576, -2310071
##DATA TABLE= (F2++(Y..Y)), PROFILE
2047b310071D709351A0131b012978A775298b697047A287049m79627L97954K941434
2038D146810J4789c628165B975770A254728b663042d86380C50959C5253d421579
2028a602943N15837l621795f54500D8735Q854945i26291n518619H73863N668387
2019F542250G37027a199934l859657b290587m9893B821946q45078L640884i04112
2009a030894E258369f762073A1128723D695231e50592A1423630d414919A107451
2000C380528I68260J02368J144463b39884l559705j769975e22202H24280O342582
1991G166862d158776E554718c702153C559639j741785q9843a525042A265423M588338
1982E853761a263316F54702M53165f68910l645521E202182c369936C395740K488409
$$ plain form
2047 -2310071 4709351 10131 -2012978 1775298 -2697047 1287049 807422 1205376 4146810
2038 4146810 4161599 -3628165 2975770 1254728 -2663042 -486380 350959 35253 -4421579
2028 -1602943 -1087106 -4708901 -654500 48735 8903680 -926291 -6444910 873863 6542250
2019 6542250 737027 -1199934 -5059591 -2290587 -2340480 2821946 1976868 5617752 -904112
2009 -1030894 5258369 -6762073 11128723 4695231 -550592 11423630 -4414919 1107451
2000 3380528 968260 1070628 2215091 -239884 -3799589 -5569564 -522202 824280 7166862
1991 7166862 -4158776 5554718 -3702153 3559639 1817854 1728011 -1525042 1265423 5853761
1982 5853761 -1263316 654702 1107867 -668910 -4314431 5202182 -3369936 3395740 5884149
1973E884149d242444a675537D405931p79107c3784F559192b160451A395058g9272
1963E57895c072652K81587B863550G20272b744611A96334N91132d313800F248023
1953F307596i389565G04532l09222d143316F02286i88393F052624b122813h16251
1943A067629a394998C141699K762205j835393c40731G06876a147315A264530n04284
1934G60246a157080A39341g719592b709818A646409l40818b82469A033454a334870
1924c804656a032898B530781d72918A366296b71674m037578C553596d928273J350498
1915c577775E277738E46442J757636n45207a587642K09889F240704I77016a088132
1905F70003b166999l700283I016666a0727460F386026B034159g152870a878163
$$ plain form
1973 5884149 -4242444 -1675537 4405931 3626824 -33784 6559192 -2160451 1395058 -79272
1963 557895 -3072652 -2791065 2863550 720272 -2744611 196334 787466 -4313800 6248023
1953 6307596 -9389565 704532 395310 -4143316 602286 -988393 6052624 -2122813 -816251
1943 1067629 -1394998 3141699 5903904 4068511 -340731 706876 -1147315 1264530 760246
1934 760246 -1157080 139341 -7719592 -2709818 1646409 1305591 -282469 1033454 -1334870
1924 -3804656 -1032898 2530781 -472918 1366296 -271674 -4309252 3553596 -4928273 -3577775
1915 -3577775 5277738 546442 2304078 1758871 -1587642 -1377753 6240704 977016 -1088132
1905 670003 -2166999 -5867282 9016666 -10727460 6386026 2034159 -7152870 -1878163
1896E872135a467769B375089a582434A764746f531891D583876c628049Q8876m853138
1887h392311K483406K138637L06539p91035m573029L912096C5480802J026587
1879C6507389j7409574H751785a1300956r499311A855216i52153l1049505a5603007
1870i40627A9467547K2269840k0401370c2833q00710l73500q816927B402375N319657
1861G722032e830815a291936k286982D804410d545963a979843j076681N71860
1853b484664L40336B525537c215461j264788C449709j487166K321482c930714
1844A847355r5288m14577d605099J065335I74862e757798I362095d24816B113068
1834c2076m712757G587502a676969n048987B781301a442137B607329I14851K275486
$$ plain form
1896 5872135 -1467769 2375089 -1582434 1764746 -6531891 4583876 -3628049 -3539173 -8392311
1887 -8392311 -5908905 -3770268 -3463729 -4254764 -8827793 -4915697 35480802 36507389
1879 36507389 19097815 8751785 -11300956 -20800267 1855216 -952153 -32001658 -15603007
1870 -940627 19467547 41737387 21336017 -32833 -833543 -1207043 -10023970 2402375 7722032
1861 7722032 -5830815 -1291936 -3578918 4804410 -4545963 -1979843 -3056524 -2484664
1853 -2484664 -2144328 2525537 -3215461 -4480249 3449709 1962543 4284025 -3930714
1844 1847355 1752067 1337490 -4605099 -3539764 974862 -5757798 9362095 -424816 2113068
1834 -32076 -4744833 7587502 -1676969 -6725956 2781301 -1442137 2607329 914851 3190337
1825C190337o59967f261888J048974C652422g618700C056265g483874H872381
1816e925483a393064C86958a75800m486418g28982a74530j025484A563777R32818
1807B496595j071586d491694J94823B354132c029468H32537c674448A622508b008975
1797B37687d857216K117705A340417c388452B648829b945378O81657J55146C296945
1787a1876006B38621P238286d289849C093693h7271B496638b253315B417202J374594
1778C791796D85096A80291a02249B442637K254826A158739O474238g557743a921989
1768B632215j71319L178563N169686C568303d819534n85415J610469A0148141
1759A996792b975462h68926I125201a725689k641851E570972c99667D956962b393126
$$ plain form
1825 3190337 2530370 -6261888 -5212914 3652422 -7618700 3056265 -7483874 8872381
1816 -5925483 -1393064 386958 -175800 -4662218 -728982 -174530 -1200014 1563777 2496595
1807 2496595 1425009 -4491694 -4296871 2354132 -3029468 832537 -3674448 1622508 -2008975
1797 237687 -4857216 -2739511 1340417 -3388452 2648829 -2945378 -2263721 -2108575 3296945
1787 -11876006 238621 7476907 -4289849 3093693 -87271 2496638 -2253315 2417202 3791796
1778 3791796 485096 180291 -102249 2442637 4697463 1158739 7632977 -7557743 -1921989
1768 2632215 2460896 5639459 10809145 3568303 -4819534 -5404949 -3794480 10148141
1759 1996792 -2975462 -868926 9125201 -1725689 -4367540 5570972 -399667 4956962 -2393126
1749e685086B058428b321268d03917B867571a675464J35709C052500f97861o232771
1740f930632d23268F183426a961309B415521n03985a204154j635061l63733G825998
1730g719159b968073B142557q36915J75789c677432I55132c305599B978059O787024
1721I765083b652649I29113a106856k22476k278591C168359J840094G54804K22945
1712I77749b026617B647749D10811a436412J12776r49866B384675d231613H225048
1702c306242d51742j03999J10041n6896e0615E16408J043688M859561c737494
1692d209898D375849e436444J384784C550827n09444c40748F62726f48276j616038
1683b264314C136828I7486b900738G249919B64818K154828b559152B068770d5348
$$ plain form
1749 -5685086 2058428 -2321268 -403917 2867571 -1675464 -1539755 3052500 -697861 -6930632
1740 -6930632 -423268 6183426 -1961309 2415521 1911536 -1204154 -2839215 -3202948 7825998
1730 -7719159 -2968073 2142557 1305642 1481431 -3677432 955132 -3305599 2978059 9765083
1721 9765083 -2652649 929113 -1106856 -1329332 -3607923 3168359 5008453 754804 977749
1712 977749 -2026617 2647749 410811 -1436412 -1323636 -2273502 2384675 -4231613 8225048
1702 -3306242 -451742 -555741 -445700 -502596 -50615 516408 1560096 6419657 -3737494
1692 -4209898 4375849 -5436444 -4051660 3550827 3041383 -340748 662726 -648276 -2264314
1683 -2264314 3136828 97486 -2900738 7249919 264818 2419646 -2559152 2068770 -45348
1673i96638m131310C536439f22654B07824f830702b424789l069027C344766a189468
1663d317246D012897j940667f121558K452081J821634k43720D227027j420116
1655B806911a877851j540256H91853h286842a634343b96835D511405k163323d196548
1645b403832D42520O007027b126476P0790q658332c149740A146750N977508B242505
1635i128750C282688i30783k586141D806056K29401e721363a344500b40231E867982
1625b051006b30412p428919C83818c867804h09374D358358i303399E641639i25686
1615a728908A866820c794042D419017K250970e677470B656774c153307b30655
1606d923529G026534l327026b56453F60974K767834c659595H17852j43932b056543
$$ plain form
1673 -996638 -5127948 3536439 -622654 207824 -6830702 -2424789 -5493816 3344766 -1189468
1663 -4317246 4012897 2072230 -6121558 -3669477 -1847843 -2091563 4227027 2806911
1655 2806911 -1877851 -3418107 891853 -8286842 -1634343 -296835 4511405 2348082 -4196548
1645 -2403832 442520 6449547 -2126476 -2055686 -10714018 -3149740 1146750 7124258 2242505
1635 -9128750 3282688 -930783 -3516924 4806056 5035457 -5721363 -1344500 -240231 5867982
1625 -2051006 -230412 -7659331 383818 -3867804 -809374 4358358 -9303399 5641639 -925686
1615 -1728908 1866820 -3794042 4419017 6669987 -5677470 2656774 -3153307 -230655
1606 -4923529 7026534 3699508 -256453 660974 3428808 -3659595 817852 673920 -2056543
1596c453463K77466H480282b864051G065347M873042e965580l837843A186539
1587A2939322f577355C209108e67367D912228f093951J712275a690639B885795
1578d496644E571579e398010g7704n370038h47863E507947q19088g61651k635084
1569c396735A832328i8877D020960a560225A746572a447956B308014J123452a999107
1559e838262h72868d14758D816568c325225A84955M618751J289906j64869A415262
1549C077003b521363F767968i231827d027719a206236C320776N572379H65020
1540I64535K700235a118227G884853C70177J347016L030899d924415J636895j517790
1531d805310A0680762I77319d587963g79102m835173A0484117a0116396a808046
$$ plain form
1596 -3453463 -3175997 8480282 -2864051 7065347 11938389 -5965580 -9803423 1186539
1587 12939322 -6577355 3209108 -567367 4912228 -6093951 -4381676 -1690639 2885795
1578 -4496644 5571579 -5398010 -77704 -5447742 -847863 5507947 4688859 -761651 -3396735
1569 -3396735 1832328 -98877 4020960 -1560225 1746572 -1447956 2308014 3431466 -1999107
1559 -5838262 -872868 -414758 4816568 -3325225 184955 4803706 6093612 5928743 1415262
1549 3077003 -2521363 6767968 -9231827 -4027719 -1206236 3320776 8893155 865020
1540 964535 3664770 -1118227 7884853 370177 1717193 4748092 -4924415 -3287520 -4805310
1531 -4805310 10680762 977319 -4587963 -779102 -5614275 10484117 -10116396 -1808046
1522I060568b531014A595088a656040j573730k082365C83303Q254027b922146
1513f028403D524873c65860G136608f008338C837026a968713O68434C216375M700160
1504G916535c784645n110344E662691b036518C455009b26773C727104l60990c464410
1494B59810b754595F676269a3877346b708550l893231F044559c208061E758552
1485e232926F42733i019287H798668E39283d138223J504558B137372P22023J340039
1476D199434a0806374F69780M998479G8984N831479C15588M595391B98101e523847
1466F133752a181570G077463q74357a2357992k36195A47307M16799b16201A061711
1456a324231o042320c601160l796747J491835B326406R932213B904012L949901
$$ plain form
1522 9060568 -2531014 1595088 -1656040 -3229770 -5312135 383303 8637330 -2922146
1513 -6028403 4524873 -365860 7136608 -6008338 3837026 -1968713 -1300279 3216375 7916535
1504 7916535 -3784645 -8894989 5662691 -2036518 3455009 -226773 3727104 3366114 -3464410
1494 259810 -2754595 6676269 -13877346 -2708550 -6601781 6044559 -3208061 5758552
1485 -5232926 642733 -9019287 8798668 539283 -4138223 -2633665 2137372 2859395 4199434
1476 4199434 -10806374 669780 5668259 78984 5910463 315588 4910979 298101 -5523847
1466 6133752 -1181570 7077463 6203106 -12357992 -12594187 147307 564106 -216201 1061711
1456 -1324231 -7366551 -3601160 -7397907 -5906072 2326406 12258619 2904012 6853913
1448F853913b6938j777811k605904L91536H72898j19826P383759a1191719A686864
1438g95787E83640c605320C516321j018017C43196K113195E61983c849203G283024
1428c724292O6194E000401c33883l128308F744601A298702M92438k45282f989590
1418A975095k27190f510221h94506A658203a3055867A447013b082081m553551
1410f635632a377530A2428438c733228k035605c42881E401517F43524c559111
1401i092141A1361630A007635a129141B223901a192809B332528K143132e64020
1392e987010I846150h853880K126601D105368b342087G789988b4041n218077C934708
1382C765726a569795n002521L181760C713973I1603J987163L256460A511928a115127
$$ plain form
1448 6853913 -26938 -1804749 -4410653 -4019117 872898 753072 8136831 -11191719 1686864
1438 -795787 583640 -3605320 3516321 2498304 343196 2456391 561983 -3849203 7283024
1428 -3724292 -3658098 5000401 -333883 -3462191 6744601 1298702 1791140 1545858 -6989590
1418 1975095 1747905 -6510221 -894506 1658203 -13055867 1447013 -2082081 -6635632
1410 -6635632 -1377530 12428438 -3733228 -5768833 -342881 5401517 643524 -3559111
1401 -9092141 11361630 1007635 -1129141 2223901 -1192809 2332528 4475660 -564020
1392 -5987010 9846150 -8853880 -6727279 4105368 -2342087 7789988 -24041 -5242118 3934708
1382 3765726 -1569795 -6572316 -3390556 3713973 91603 2078766 5335226 1511928 -1115127
1372e128013A389204a336786D239991A473705g195815E593029h562496a893139
1363B330045C88941K193368g140433n18529F679877a901983C406005I5006a307172
1353g371468A934429o74578l30496c448870E415766a973750I41449N027896b397478
1343A54771R47489O717817E46467J593250e349470A4026332f909867A708959a3481611
1333f901684K598501G9694N386692a634669B37459e706122A169577h08444D44012
1323C66331L549031a059111D27209a155415F125253B879042a553101C120556b066963
1313D9305J468036e717135a311910o98203H109889B838155a366726p012300E294277
1303e378515J784859A0302670c091287e7365l53232H710843a778363E124759M03082
$$ plain form
1372 -5128013 1389204 -1336786 4239991 1473705 -7195815 5593029 -8562496 -1893139
1363 2330045 388941 2582309 -7140433 -7658962 6679877 -1901983 3406005 95006 -1307172
1353 -7371468 1934429 1259851 929355 -3448870 5415766 -1973750 941449 5969345 -2397478
1343 154771 1102260 7820077 546467 2139717 -5349470 14026332 -6909867 1708959 -13481611
1333 -6901684 -4303183 79694 5466386 -1634669 237459 -5706122 1169577 -808444 444012
1323 366331 3915362 -1059111 427209 -1155415 6125253 2879042 -1553101 3120556 -2066963
1313 49305 1517341 -5717135 -1311910 -2010113 8109889 2838155 -1366726 -8379026 5294277
1303 -5378515 -3593656 10302670 -3091287 -57365 -410597 8710843 -1778363 5124759 5527841
1294E527841a23989B478466h83558C985649r47724a289676E980273g722914B207401
1284G108485f481828B020076b696944C889627N45094A991713L90444d598357K139442
1275b458915K2775H822176d569273E676038g91595l38580M67105A053343e339605
1265a737461k37681E203676a788584C039085f380959A1103202a319530k662352
1257c981882a871559D246004a363682j829377N5757j1988J271638C653919L553293
1248G207212a454862A765677d80695D896171g488523G22888J300235b171198r65410
1239c136608A463356R023973b675934H568288f296984B378258a898670j2394j8883
1230a929947F512853F1720f785524e82369l49261A537729a23380D872526b848243
$$ plain form
1294 5527841 -123989 2478466 -883558 3985649 3037925 -1289676 5980273 -7722914 2207401
1284 7108485 -6481828 2020076 -2696944 3889627 4434721 1991713 2382157 -4598357 -2458915
1275 -2458915 -2436140 8822176 -4569273 5676038 -791595 -1130175 -663070 1053343 -5339605
1265 -1737461 -1975142 5203676 -1788584 3039085 -6380959 11103202 -1319530 -3981882
1257 -3981882 -1871559 4246004 -1363682 -3193059 -3137302 -3149290 -1877652 3653919 7207212
1248 7207212 -1454862 1765677 -480695 4896171 -7488523 722888 2023123 -2171198 -3136608
1239 -3136608 1463356 10487329 -2675934 8568288 -6296984 2378258 -1898670 -1911064 -1929947
1230 -1929947 6512853 61720 -6785524 -582369 -931630 1537729 -123380 4872526 -2848243
1220a1353845A1637697b297039C084470i107739E256067h4168j330239M24059
1212i90348m89234o679609B295245e833148M5586B64877R152688d83248B525444
1202a147144C90100d375865J638863j297994a88564F718521m94029A420435N010655
1193F431090B831358a817644A0058063D015383P375172D580703o9503O289301
1185A0800501k952044Q361907R819972n631605A873288d6005081n6272811L0244360
1177g2033532h979807B2441646H970086b0052473b63600C7561712E764876e3429266
1168a04623880K3596579b0915418C5408670n162182A3724451J0730010A786177
1160G885295C533381M709185A39447R43118d36049A0422387a0809769F298565
$$ plain form
1220 -11353845 11637697 -2297039 3084470 -9107739 5256067 -84168 -1414407 -990348
1212 -990348 -1479582 -8159191 2295245 -5833148 -5787562 264877 9417565 -483248 2525444
1202 -1147144 390100 -4375865 -2737002 -4034996 -188564 6718521 6224492 1420435 6431090
1193 6431090 2831358 -1817644 10058063 4015383 11390555 4580703 4511200 10800501
1185 10800501 7848457 16210364 26030336 20398731 1873288 -46005081 -102277892 -72033532
1177 -72033532 -8979807 22441646 8970086 -20052473 -263600 37561712 5764876 -53429266
1168 -104623880 -81027301 -20915418 35408670 30246488 13724451 24454461 1786177
1160 7885295 3533381 8242566 139447 1082565 -436049 10422387 -10809769 6298565
1151E847150r04431k335083a173128A726244M484360k873415K998832d55343B991294
1141F925537a4957406M928746m261949a590985I51943P726345L672674C699761
1132F663874g487633K585783M03471o135221M941108A3531921L669667K897602
1124B0099190L23994o246086O12527F133058b0348745j243145B68042b4747C045586
1114F905290K092456a576474E456248c958616q490938n192725M674777E617819
1105F773347C17805r1968e106016J875869C533641A581522C28321O670769a426883
1095A729942a17696B90359O769109f64043l752750I786235h319518D378864f171680
1085b580561B111791d055399n17091A736944a436064l842913h46854o453455I893916
$$ plain form
1151 5847150 4942719 2607636 -1173128 1726244 6210604 3337189 6336021 -455343 2991294
1141 6925537 -14957406 -10028660 -14290609 -1590985 951943 8678288 12350962 3699761
1132 6663874 -7487633 -4901850 -4498379 -10633600 -5692492 13531921 17201588 20099190
1124 20099190 20423184 14177098 14789625 6133058 -20348745 -21591890 268042 -24747 3045586
1114 6905290 8997746 -1576474 5456248 -3958616 -12449554 -17642279 -12967502 5617819
1105 6773347 317805 225837 -5106016 -3230147 3533641 1581522 328321 6999090 -1426883
1095 1729942 -117696 290359 7059468 -664043 -4416793 9786235 -8319518 4378864 -6171680
1085 -2580561 2111791 -4055399 -4572490 1736944 -1436064 -5278977 -846854 -7300309 9893916
1075A954637c876801a185460E780237B062750b740536C864513c104663I616075
1066F653416b703817k340063a945454k846632a605759n188319d22313k0244C169406
1056a1775897F879254d270984A916469c78192C637018J767543j961693j130511
1048B312357P82033J1710719m314967L4888603r516292H149427b1556970l647354
1040b5204324d543329A9520825J6935051f907604m616823F854444M6142268L201385
1032E6198097k7527859a4904742l7477658O567301D404546K5484398L19087A0668606
1023f187857a150523E160564K164745P56416b3496288o658000a2563585F264580
1014F920652N855589D532303B04249b086478j6963784K729140L789730b092279
$$ plain form
1075 1954637 -3876801 -1185460 5780237 2062750 -2740536 3864513 -3104663 9616075
1066 6653416 -2703817 -5043880 -1945454 -4792086 -1605759 -6794078 -422313 -442557 3169406
1056 -11775897 6879254 -4270984 1916469 -378192 3637018 5404561 3442868 2312357
1048 2312357 3094390 14805109 10490142 45378745 35862453 8149427 -21556970 -25204324
1040 -25204324 -4543329 19520825 36455876 -6907604 -11524427 6854444 52996712 56198097
1032 56198097 28670238 -14904742 -52382400 -45815099 4404546 29888944 30208031 10668606
1023 -6187857 -1150523 5160564 7325309 8081725 -23496288 -30154288 -12563585 6264580
1014 6920652 12776241 4532303 204249 -2086478 -19050262 -16321122 -12531392 -2092279
1005a347007A74941c210584e55450j611559A1883623d87321D022865a3530667
996a2472821b996080k06312f82298E676374l89256M739326m168645L988816D480880
986b5805515i819687L823614o350682O035746M54963j974286D299839d555287
977f083332j6066310a525657j5652216A409012M777518O004454m124576c455832
968A7260196H007942P033782k611222K367792o216836J540488O054722p422762
960H753906m047713N065322e733000F589038c940335o080612K911260a705898
951a2399960L118652K900762J173046b151467n164581L562808k903999Q27300
943e829939a963919f10964j963899F399392B67983e426137h80305c35322n991751
$$ plain form
1005 -1347007 174941 -3210584 -555450 -2167009 11883623 -487321 4022865 -13530667
996 -12472821 -2996080 -3202392 -682298 5676374 5287118 10026444 5857799 9846615 4480880
986 -25805515 -9819687 -5996073 -12346755 -6311009 -5856046 -7830332 4299839 -4555287
977 -6083332 -22149642 -1525657 -17177873 1409012 6186530 12190984 8066408 -3455832
968 17260196 8007942 15041724 12430502 14798294 8581458 10121946 16176668 8753906
960 8753906 4706193 9771515 -5733000 6589038 -3940335 -10020947 -7109687 -1705898
951 -12399960 -9281308 -6380546 -5207500 -2151467 -7316048 -3753240 -6657239 -5829939
943 -5829939 -1963919 -610964 -2574863 6399392 267983 -5426137 -880305 -335322 -6327073
934f327073E328658D52348M44116h03667A225127g937470h46344A4142877B588876
924E485922a146579N06833A659521g542613a740934A337403c653887E757319A273106
914c366902j019854A835519P50258p03725c083492A822368e509425J360457o072357
905a0221325b855724C694875f124428b450862Q43544p79058b0657r39175d70412
895f654271J639158B508063b760192C021479I71253f175774K380096k934325i55537
885a371489D066333c933576B082124r40387P97271J49556L007512c410697G863677
875C090173R28645f697456a192892j765624J99515K87690G820808d58142o155910
866f614052a522897n120693F342605Q33021A79069e5047A0663656m432065D87794
$$ plain form
934 -6327073 5328658 452348 896464 -803667 1225127 -7937470 -846344 14142877 2588876
924 5485922 -1146579 -639746 1659521 -7542613 -1740934 1337403 -3653887 5757319 1273106
914 -3366902 -4386756 1835519 2585777 1882052 -3083492 1822368 -5509425 -4148968 -10221325
905 -10221325 -2855724 3694875 -6124428 -2450862 -1607318 -2386376 -20657 -959832 -470412
895 -6654271 -5015113 2508063 -2760192 3021479 971253 -6175774 -3795678 -6730003 -955537
885 -1371489 4066333 -3933576 2082124 1141737 1939008 2088564 5096076 -3410697 7863677
875 3090173 4018818 -6697456 -1192892 -2958516 -2759001 -2471311 7820808 -458142 -6614052
866 -6614052 -1522897 -6643590 6342605 7175626 179069 -55047 10663656 6231591 487794
856E44258f039124C140444f498680L009705J46118d98197H891194a0509207g94710
846D768178j502484P90518f64286C89831K896199i84750B383489d479477D142545
836b338205m507094F98302a620694r49381F882509f506239J818822a720256C30533
826B661714a253381A04258d637216D967593d660524A051623N769496d082794a938130
816d65711A782627G48514O995753A455438d053416L27569l76980c61929k898919
807c260848p066464c339438H15802J845825h363904A189722a414639b58515C603111
797F074479r84026I24855i55904G229143C61703b277047a16459A53180K162421
788B315601J510800n96157a282725A010316m9293e897982A488343j9382h47984
$$ plain form
856 544258 -6039124 3140444 -6498680 -3488975 -3342857 -498197 8891194 -10509207 -794710
846 4768178 3265694 4056212 -664286 389831 3286030 -984750 2383489 -4479477 4142545
836 -2338205 -6845299 698302 -1620694 -2570075 6882509 -6506239 -4687417 -1720256 330533
826 2661714 -1253381 104258 -4637216 4967593 -4660524 1051623 6821119 -4082794 -1938130
816 -465711 1782627 748514 7744267 1455438 -4053416 -3725847 -4102827 -361929 -3260848
807 -3260848 -10327312 -3339438 815802 2661627 -8363904 1189722 -1414639 -258515 3603111
797 6074479 5090453 924855 -955904 7229143 361703 -2277047 -116459 153180 2315601
788 2315601 3826401 3230244 -1282725 1010316 961023 -5897982 1488343 1468961 -847984
778C84494l9308e593924d3563C41052L488408d356039J111820E731947c715990
768D559676j090559a053687B003484Q35417c989426f41188a62135j290966j016877
759b469978F183762d972043a43786A213260J213336J812728b636232j223076J072956
750b786352C70312J065889e798387B338092E26583d83165j926137l626401D02784
740b373804E526456a843124p2676C33521a99245A245399L148837i622369G022280
730B013517f098474G153612d961107J806184G020552B052495c831325a735404
721a611296F698938B666120a505795A0321097d722740B113780A7448g249065A021859
711E414642g215727B240749A97656b312332D911931J979649h307878D00124b119638
$$ plain form
778 384494 345186 -5593924 -43563 341052 3829460 -4356039 -3244219 5731947 -3715990
768 4559676 3469117 -1053687 2003484 2838901 -3989426 -641188 -162135 -1453101 -2469978
759 -2469978 6183762 -4972043 -143786 1213260 2426596 4239324 -2636232 -3859308 -2786352
750 -2786352 370312 1436201 -5798387 2338092 526583 -483165 -2409302 -6035703 402784
740 -2373804 5526456 -1843124 -1915800 333521 -199245 1245399 4394236 -9622369 7022280
730 2013517 -6098474 7153612 -4961107 -3154923 7020552 2052495 -3831325 -1735404
721 -1611296 6698938 2666120 -1505795 10321097 -4722740 2113780 17448 -7249065 1021859
711 5414642 -7215727 2240749 197656 -2312332 4911931 6891580 -8307878 400124 -2119638
701e170194a59176C589195d117512K45630A151602D71663J2119324c385386D162496
691A676013b436362H239800c781971R06091B481756c642245a440E120844A887435
681B820897g464523L637803B90546K481205R80094b992392c92655E959916H40962
671B525622r63952d924227E45402c98867m979186G894324e456679B41450J973790
662B215240J465844d9354q7676k137518C683540a912714f21082K37514E365529
652c885490a505472D57167M085794A310136a401786C985911M248600c100443a313014
642c41960A936830f939844D184506K78642a468355B176025f558414K439279J769192
633b349943F60022c747589E20415b86227o568287C202070a39867D998914B074866
$$ plain form
701 -5170194 -159176 3589195 -4117512 -3871882 1151602 471663 12590987 -3385386 4162496
691 1676013 -2436362 8239800 -3781971 -2875880 2481756 -3642245 -1440 5120844 1887435
681 2820897 -7464523 -3826720 290546 2771751 3751845 -2992392 -392655 5959916 840962
671 2525622 1561670 -4924227 545402 -398867 -5378053 7894324 -5456679 241450 2215240
662 2215240 3681084 -49354 -137030 -2274548 3683540 -1912714 -621082 -383568 5365529
652 -3885490 -1505472 457167 4542961 1310136 -1401786 3985911 8234511 -3100443 -1313014
642 -341960 1936830 -6939844 4184506 4463148 -1468355 2176025 -6558414 -4119135 -2349943
633 -2349943 660022 -3747589 520415 -286227 -6854514 3202070 -139867 4998914 2074866
623A0547121b487332j940449d2836A6708809A04343K352221r58017e485293I272880
613b794989k629407A324169N899741a410186E27821M731818c712j002125B146859
603i224211B893180e52184m704013C096861c921695A281094c290022B865968q14686
594B051282a944833R3599n660215F79103J904497A242329d371952A292567L912513
585E205080L732057e971553F989063G32633M093922F57130d574517a293840E751834
575d81812C918396b609016C190411d742203B309654a322994M61614A769487P832691
566I602178B260760g756090C521034j639317c254058B350875f693026A017861
557d159156F69848c630427B535180Q09219d985468A166581b058104A597098b196290
$$ plain form
623 10547121 -2487332 -4427781 -42836 16708809 104343 2456564 1498547 -5485293 9272880
613 -2794989 -5424396 1324169 7223910 -1410186 527821 5259639 -3712 -1005837 2146859
603 -9224211 2893180 -552184 -5256197 3096861 -3921695 1281094 -3290022 2865968 2051282
594 2051282 -1944833 -1851234 -7511449 679103 2583600 1242329 -4371952 1292567 5205080
585 5205080 8937137 -5971553 6989063 732633 4826555 657130 -4574517 -1293840 5751834
575 -481812 3918396 -2609016 3190411 -4742203 2309654 -1322994 -861380 1769487 9602178
566 9602178 2260760 -7756090 3521034 1881717 -3254058 2350875 -6693026 1017861
557 -4159156 669848 -3630427 2535180 3344399 -4985468 1166581 -2058104 1597098 -2196290
547d778826B199799L29798i466831E035781c304302C763063O954813e653665k646364
538h300029g25220R6934C410840N420214e171340B170867D78746O22944d803632
528E681615a060580j272824A5549243g291206E983065a181097I222547a707252
519C988345i49129l98928D544679d60073A745027e506779a615762q63303D10900
509f772515B363024K352334G83773J418506c107876A045559J982499a477519C796069
499a981470M28293I680896f032057I91596b030323j107559d32240q88267G23507
489A822034m67885a556254E587780e722315g20775j140830e73263m782129A665800
479B297134K344347b043561A663710h630932G373538c943596a261466j394468
$$ plain form
547 -4778826 2199799 2529597 -9466831 5035781 -3304302 3763063 10717876 -5653665 -8300029
538 -8300029 -725220 -628286 3410840 8831054 -5171340 2170867 478746 1101690 -4803632
528 5681615 -1060580 -2333404 15549243 -7291206 5983065 -1181097 9222547 -1707252
519 3988345 -949129 -1348057 4544679 -460073 1745027 -5506779 -1615762 -2479065 410900
509 -6772515 2363024 4715358 783773 2202279 -3107876 1045559 3028058 -1477519 3796069
499 -1981470 -1553177 9680896 -6032057 991596 -2030323 -3137882 -432240 -1320507 723507
489 1822034 1354149 -1556254 5587780 -5722315 -720775 -1861605 -573263 -5355392 1665800
479 2297134 4641481 -2043561 1663710 -8630932 7373538 -3943596 -1261466 -2655934
471b655934A47013P39692f418918B703379m36131h787010E055069h631A454241
461A534112b313039k927699F268785g17314A683156E21409f347877E976452A783934
451A2503230f81078B734009e337908A012965M514125b574066p310384E418070
442B59755c822320F362179f18732N8864m027239H958823a768038k128506d31205
432F15457K633827h255255k059739c925314G558673b012073A668182M355333a1950033
422c219308a354840k535744D933815L28680f013416g26447k301684D467191N710703
413A0177894e902182C595063E28756g743556B08743b052523b00696n06602E687069
403E298497a931827B597364b881487m961162A1196579A369408C02427L051705
$$ plain form
471 -2655934 147013 886705 -6418918 2703379 2267248 -8787010 5055069 -8631 1454241
461 1534112 -2313039 -5240738 6268785 -717314 1683156 521409 -6347877 5976452 1783934
451 12503230 -681078 2734009 -5337908 1012965 5527090 -2574066 -9884450 5418070
442 259755 -3822320 6362179 -618732 -559868 -4587107 8958823 -1768038 -3896544 -431205
432 615457 3249284 -8255255 -10314994 -3925314 7558673 -2012073 1668182 6023515 -11950033
422 -3219308 -1354840 -3890584 4933815 5262495 -6013416 -726447 -3028131 4467191 10177894
413 10177894 -5902182 3595063 528756 -7743556 208743 -2052523 -200696 -707298 5687069
403 5298497 -1931827 2597364 -2881487 -7842649 11196579 1369408 302427 3354132
395C354132e550334B09554e184981D400682j287065A490643a683861o034787L418283
386d300365A904200O266953b20104n667840B681676j192533a253179E015193b345233
376d405264c64464B505977E51467d577598a928398H980063d778872a699629D038756
366A13226a647715D485756i8796E055952H55405d286340A714443d14574j343208
357a757782B175492a715012J87837A261884K758412a321868j484146A19640K443668
348B563308e958384b226501Q38908n658429a981810l246117B912739b762622m72801
339c235423k304785C241849J7992p91230a802195r208997H112884h33976k384623
330c218599E88286c25752j72185j474392A063855a37135B912916J54967F52278
$$ plain form
395 3354132 -5550334 209554 -5184981 4400682 3113617 1490643 -1683861 -7718648 -4300365
386 -4300365 1904200 8171153 -220104 -5887944 2681676 1489143 -1253179 5015193 -2345233
376 -4405264 -364464 2505977 551467 -4577598 -1928398 8980063 -4778872 -1699629 4038756
366 113226 -1647715 4485756 -98796 5055952 855405 -4286340 1714443 -414574 -1757782
357 -1757782 2175492 -1715012 -1527175 1261884 4020296 -1321868 -2806014 119640 2563308
348 2563308 -5958384 -2226501 -1387593 -7046022 -1981810 -5227927 2912739 -2762622 -3235423
339 -3235423 -5540208 3241849 3259841 2468611 -1802195 -11011192 8112884 -833976 -3218599
330 -3218599 588286 -325752 -497937 -1972329 1063855 -137135 2912916 3067883 652278
320A479260J406744d367626I442344a837856F817126B132283P51766f698665B461109
310b419424A881601b278988D196557j355883K748294e664655O12075F6663c368865
300d53813o82996A326314b827390L50387F654948B209855J315641A523997K05007
291A729004M16987a031451B565091b875984j894550D298877j673293J214747b52314
281c182976m79188e04020o194667L132381C799279A228813J092891K891666a920526
271b852155J062073H39721K893F1506g185343B611104A290912R45007o62888e688551
260h72063j895762A296852e20115A175823d772360A2183267f71157m612909H923262
250b491124f98464k805278A062849a396503o50111N96185k67590e79936B51495
$$ plain form
320 1479260 2886004 -4367626 9442344 -1837856 6817126 2132283 2884049 -6698665 2461109
310 -2419424 1881601 -2278988 4196557 2840674 5588968 -5664655 -5052580 66663 -3368865
300 -453813 -1136809 1326314 -2827390 -2477003 6654948 2209855 3525496 1523997 1729004
291 1729004 2145991 -1031451 2565091 -2875984 -4770534 4298877 2625584 3840331 -252314
281 -3182976 -3662164 -504020 -6698687 -3566306 3799279 1228813 2321704 5213370 -1920526
271 -2852155 -1790082 839721 842614 61506 -7185343 2611104 1290912 2235919 1573031 -5688551
260 -872063 -2767825 1296852 -520115 1175823 -4772360 12183267 -671157 -5284066 8923262
250 -2491124 -698464 -3503742 1062849 -1396503 -2046614 -1450429 -1718019 -579936 251495
240B263907g287724a875445B209802L890083B743548d067119b10771A357551n76898
231G80653J548020O75606k10558b170839B86327M001392A850124p72244d67327
221G092645c955021I3700M901366d137718D842045B238649f72454l428581D045124
211c709293C48582a556326A332776M059084c863929j004796C026173O47488j385195
202B288466l56542a104747k28094l149552C432953K152667a0706606e99140H40722
192c920624H231114a0006511B9465J0863594a326586e43888B998457a77179r232287
183i409466I596307b132977p56302C809123j415337M00706R03864b418307m835157
174g253464F077435h668066I490701B603514a190175A899759F76091a858699p292000
$$ plain form
240 2263907 -7287724 -1875445 2209802 6099885 2743548 -4067119 -210771 1357551 780653
231 780653 2328673 3004279 2793721 -2170839 286327 4287719 1850124 1077880 -467327
221 7092645 -3955021 93700 4995066 -4137718 4842045 2238649 -672454 -4101035 4045124
211 -3709293 348582 -1556326 1332776 5391860 -3863929 -4868725 3026173 3673661 2288466
202 2288466 1931924 -1104747 -1332841 -4482393 3432953 5585620 -10706606 -599140 840722
192 -3920624 8231114 -10006511 29465 10893059 -1326586 -543888 2998457 -177179 -9409466
183 -9409466 9596307 -2132977 -2889279 3809123 2393786 2794492 3698356 -2418307 -7253464
174 -7253464 6077435 -8668066 9490701 2603514 -1190175 1899759 676091 -1858699 -9150699
165i150699F93591K570916J584734A876175L71110c572402j830518J543706D792955
155A492049f543260n887589c52016A463700b797415f67582j922836k336075B790210
145A073738O693760e779336I924990h59000j382556d36352B715279K395545R66951
136F077775d364347a424904C239232b405007B369798b489106A0541860h275708
127G28494N176756B120193g278790A336900f108912g33186k155035g37108l350924
118d088032n880971D527198J794195c295382O01604F063299i615514C4989c205943
108d277318B748775o1518K488144a709019F086635E84060E1437h385442G72172
98I147389d883142C712464q96248f991979A597313k88740a1800047F302673B162358
$$ plain form
165 -9150699 693591 3264507 4849241 1876175 2247285 -3572402 -5402920 -3859214 4792955
155 1492049 -6543260 -12430849 -352016 1463700 -2797415 -667582 -2590418 -4926493 2790210
145 1073738 7767498 -5779336 9924990 -859000 -2241556 -436352 2715279 5110824 6077775
136 6077775 -4364347 -1424904 3239232 -2405007 2369798 -2489106 10541860 -8275708
127 728494 5905250 2120193 -7278790 1336900 -6108912 -733186 -2888221 -737108 -4088032
118 -4088032 -9969003 4527198 6321393 -3295382 -2693778 6063299 -9615514 34989 -3205943
108 -4277318 2748775 2687257 5175401 -1709019 6086635 584060 51437 -8385442 772172
98 9147389 -4883142 3712464 2816216 -6991979 1597313 1308573 -11800047 6302673 2162358
88a979355R25082F073181c303115M18303E220670b694802K89419C371283F33489
78b617956J088043D595729a1432054E194594e037105a381922C246686j223416
70B023270h79091j460147H54951D13150b224272D95570a922010G202375g084329
60H942016B066902b759491H039124d665971B305319C22290d086253I513473c102357
50E568293h645988K968737C366935K956882e656305C054530c418587j678732a474446
40c899590a341467A286167b923774L61254G318953A827929a383093l996228D163491
30i2690H86184L815705G17789N97881J941095L44654a876263D704848k154339
21B550509b294942m445496a507334K67222B727008c650565a255483E43811K576745
$$ plain form
88 -1979355 -1054273 6073181 -3303115 -2884812 5220670 -2694802 -2405383 3371283 633489
78 -2617956 -1529913 4595729 -11432054 5194594 -5037105 -1381922 3246686 2023270
70 2023270 -879091 -2339238 854951 413150 -2224272 495570 -1922010 7202375 -7084329
60 8942016 2066902 -2759491 8039124 -4665971 2305319 322290 -4086253 9513473 -3102357
50 5568293 -8645988 -5677251 3366935 6323817 -5656305 3054530 -3418587 -5097319 -1474446
40 -3899590 -1341467 1286167 -2923774 -2562520 7318953 1827929 -1383093 -5379321 4163491
30 -92690 886184 4701889 717789 1315670 3256765 3601419 -1876263 4704848 2550509
21 2550509 -2294942 -6740438 -1507334 -1240112 2727008 -3650565 -1255483 543811 3120556
12C120556b161959F23182i46873B814285A090990d354488F37519b773502P29679
3b043823p93890o89522E48107
$$ plain form
12 3120556 -2161959 623182 -946873 2814285 1090990 -4354488 637519 -2773502 -2043823
3 -2043823 -2837713 -3527235 548107
##PAGE= F1=7166.457491523
##FIRST=     21204.543296753, 1514.41169507576, -2750987
##DATA TABLE= (F2++(Y..Y)), PROFILE
2047b750987F095903f60887j179854B483875c210856F17273J27136J97473K590051
2038C531933K80977e532385B715541A277987c158752H42047b411084e74838l199783
2029c774621J228196a126090k356667a430183D93589O987521a132039n879064
2021g011103B160414M230919F93443a719170l903209a611062n24846B464006L39273
2012B803279J714827a35260q59160D221429e516528I416751l836826a542503A2422838
2002d733784A422258K696438G08407J54135J758343d52780k370929l474856a009240
1992B89790P390935d019036E029984c946324D880106A547906G62109a047663A936092
1982E465290G53646b03035A594051c51189m569109D921050b475477C516668L64650
$$ plain form
2047 -2750987 6095903 -660887 -1840741 2483875 -3210856 617273 744409 941882 3531933
2038 3531933 3812910 -5532385 2715541 1277987 -3158752 842047 -2411084 -574838 -3774621
2029 -3774621 -2546425 -1126090 -3482757 -1430183 493589 7481110 -1132039 -7011103
2021 -7011103 2160414 6391333 693443 -1719170 -5622379 -1611062 -2135908 2464006 2803279
2012 2803279 4518106 -135260 -994420 4221429 -5516528 9416751 5579925 -1542503 12422838
2002 -4733784 1422258 4118696 708407 862542 2620885 -452780 -2823709 -6298565 -1009240
1992 289790 7680725 -4019036 5029984 -3946324 4880106 1547906 762109 -1047663 1936092
1982 5465290 753646 -203035 1594051 -351189 -4920298 4921050 -2475477 3516668 3881318
1973C881318d363351d67605D101731A142847b87317E978833a335405a43688E84670
1963D98243b963068M69818B493070B74666c514386I20997O25168c930447G082653
1953F866101i461726A364668d3927l934160D90457h78993F322926a975972J50343
1944a825629A976368b407921B582193L282033j509543a463742H85607f35185H80409
1934E79729a460449e9685p025827c510557B429962G65115b88896F45276a200952
1924d554894d09913B596018h44017A018309a160932k265300C441024d410899J998909
1915b411990C982513E01702K054340K8670b232738a085074F501590F35761f49637
1905A541286b027997l883938H315459a1578690F064367B019491e607220b653959
$$ plain form
1973 3881318 -4363351 -467605 4101731 1142847 -287317 5978833 -1335405 -143688 584670
1963 498243 -2963068 -2493250 2493070 274666 -3514386 920997 1546165 -3930447 7082653
1953 6866101 -9461726 1364668 -43927 -3978087 490457 -878993 6322926 -1975972 -1825629
1944 -1825629 1976368 -2407921 2582193 5864226 4354683 -1463742 885607 -635185 880409
1934 579729 -1460449 -59685 -7085512 -3510557 2429962 765115 -288896 645276 -1200952
1924 -4554894 -409913 2596018 -844017 1018309 -1160932 -3426232 3441024 -4410899 -2411990
1915 -2411990 3982513 501702 2556042 2584712 -2232738 -1085074 6501590 635761 -649637
1905 1541286 -2027997 -5911935 8315459 -11578690 6064367 2019491 -5607220 -2653959
1896F372371a722827B237510b157478A107582g083200D205515c534924J041287
1888b493637o984170K370626K695754o07435n70928m187255c530312D1019847
1879C8738962j9067663H155335a3569850r324526C262326r46970c6886343J8313830
1871a8572513c520793A9706657K9559784k2000424D358775h82160l23816q958973
1863a0164949F51388P346311e563573e91927m342270D617945c467087J704521
1855a762566l082618b264119j50840B700767c608291j239806C246394j029369
1847B217025K407344d420698A562124j99653Q51276d254325J290981G68173e935763
1837A0193304a90721E15736B20287c619030G748196a893732l960559G32438a084431
$$ plain form
1896 6372371 -1722827 2237510 -2157478 1107582 -7083200 4205515 -3534924 -2493637
1888 -2493637 -9477807 -7107181 -4411427 -5018862 -5589790 -9777045 -3530312 41019847
1879 38738962 19671299 8155335 -13569850 -22894376 3262326 2315356 -36886343 -18572513
1871 -18572513 -3520793 19706657 49266441 27266017 4358775 -882160 -1205976 -10164949
1863 -10164949 651388 7997699 -5563573 -591927 -4934197 4617945 -3467087 -1762566
1855 -1762566 -4845184 -2264119 -2414959 2700767 -3608291 -4848097 3246394 2217025
1847 2217025 4624369 -4420698 1562124 1362471 2213747 -4254325 -2963344 768173 -5935763
1837 10193304 -190721 515736 220287 -3619030 7748196 -1893732 -5854291 732438 -1084431
1827B190850E15574L141897j49321f440420Q68290C804494g094410C913890f623115
1817H878923h348916a173193E30411B00747d603489a870122b06006j199539D31991
1807A610760k66837e461694J294998B535309c899338E37238b231035A182340b037855
1797a531121k206933O60674A439480c045476C082796b943478a080215j288470
1789b368685B361523a1777785b80067G198821d561194B554136b50758B142846
1780a056962B873787M36950A254784F15296L91479K00014M357417A086842O079925
1771G166767g499289a803213B538170M30717K514364M985157D344672e315893
1762e399457b529486I200403C714751c089253c29818I847696a959940j902898
$$ plain form
1827 2190850 515574 3657471 3508150 -6440420 -5572130 3804494 -7094410 3913890 -6623115
1817 8878923 -8348916 -1173193 530411 200747 -4603489 -1870122 -206006 -1405545 431991
1807 1610760 1343923 -5461694 -4166696 2535309 -3899338 537238 -2231035 1182340 -2037855
1797 -1531121 -3738054 -3077380 1439480 -3045476 3082796 -2943478 -1080215 -2368685
1789 -2368685 2361523 -11777785 -280067 7198821 -4561194 2554136 -250758 2142846
1780 -1056962 2873787 3310737 1254784 615296 1006775 1206789 5564206 1086842 7166767
1771 7166767 -7499289 -1803213 2538170 2968887 5483251 10468408 4344672 -5315893
1762 -5399457 -2529486 9200403 3714751 -3089253 -329818 9847696 -1959940 -3862838
1754c862838F773763F45036L928750d007905p02378A445733b255107A91388K995719
1745C187107b477084i64558D284688c143480m221627B210916K838872a711709
1736B566103n83411f26460j952407p3283F895423g455762a938371A716307P25767
1727B442074o83863c727266I71770c148782C874912N309895a404011H88221g73182
1717i31191l262013B768329K036428C87114O88871a322505C694131i36977k48229
1708a185206M84326o62229A878555c844448G708491b196291h0283A5662c10730
1698A01714a389005A521657r0242O362822c822257k74962D469968f143670K723288
1689c420382D795680B070593f25534A424049i83572j027427B603017C35484b654266
$$ plain form
1754 -3862838 6773763 645036 4573786 -4007905 -4710283 1445733 -2255107 191388 3187107
1745 3187107 -2477084 -964558 4284688 -3143480 -7365107 2210916 5049788 -1711709
1736 2566103 1982692 -626460 -2578867 -2652150 6895423 -7455762 -1938371 1716307 2442074
1727 2442074 1758211 -3727266 971770 -3148782 3874912 9184807 -1404011 888221 -773182
1717 -931191 -4193204 2768329 4804757 387114 1075985 -1322505 3694131 -936977 -1185206
1708 -1185206 -700880 -1363109 1878555 -3844448 7708491 -2196291 -80283 15662 -310730
1698 101714 -1389005 1521657 1431415 7794237 -3822257 -4097219 4469968 -6143670 -3420382
1689 -3420382 4795680 2070593 -625534 1424049 -983572 -2010999 2603017 335484 -2654266
1679G174994d80179A612991a874966C828982A549057f86207n391277C073397f30228
1669c07002m848049b072196l952362C100936a243971j983637C226027j340558
1661A885469f595694O98253A55956a710176D969296B439947b662917j409345G31886
1651g137703a888945E1130N243473k003515c678402q30543G29554M764369b490756
1641b506887q106573b351130A297384O316768A308812h242115B879517a006568
1632b950700C701394J348147e371713a29701A64632N574408a891356f21519o101312
1623f722831A259815b966164i29976D756427g937816D964330a466737r0437A408551
1613d294851D746230J177218e935461B747005b562430A993752e441695G170541
$$ plain form
1679 7174994 -480179 1612991 -1874966 3828982 1549057 -686207 -6077484 3073397 -630228
1669 -307002 -5155051 -2072196 -6024558 3100936 -1243971 -3227608 3226027 1885469
1661 1885469 -6595694 -5897441 155956 -1710176 4969296 2439947 -2662917 -4072262 731886
1651 -7137703 -1888945 51130 5294603 3291088 -3678402 -4508945 729554 5493923 -2490756
1641 -2506887 -10613460 -2351130 1297384 7614152 1308812 -8242115 2879517 -1006568
1632 -2950700 3701394 5049541 -5371713 -129701 164632 5739040 -1891356 -621519 -6722831
1623 -6722831 1259815 -2966164 -929976 4756427 -7937816 4964330 -1466737 -1557174 1408551
1613 -4294851 4746230 5923448 -5935461 2747005 -2562430 1993752 -5441695 7170541
1604C809238a576404H20390L285349b577414A360927o959a553335j810364R38255
1595b425444H904725c350859G412573L830797e051569n029878A634333J0439586
1587A2073919f675170C281914c91742F230202f324649J583042i98129B090524
1578c843536F849082d902872e07902m650942b98754E344896P71622i44540l187483
1569d132023e25260A393280L512960c321261B572071b087019B213744N9308d72607
1559f462146D02509a104531E005710b313063J041532D867828Q760J44329B454962
1549C415281b583278F913177i104891M188735a297762C901895M087326D99407
1540A510803J541396h65788G837852A065834K221965J175059e434917J928537
$$ plain form
1604 3809238 -1576404 820390 4105739 -2577414 1360927 1353968 -1553335 -3363699 -2425444
1595 -2425444 8904725 -3350859 7412573 11243370 -5051569 -10081447 1634333 12073919
1587 12073919 -6675170 3281914 -391742 6230202 -6324649 -4741607 -998129 2090524
1578 -3843536 6849082 -4902872 -507902 -5158844 -298754 5344896 6116518 -944540 -4132023
1569 -4132023 -525260 1393280 4906240 -3321261 2572071 -2087019 2213744 2273052 -472607
1559 -6462146 402509 -1104531 5005710 -2313063 -1271531 4867828 4876588 5020917 2454962
1549 3415281 -2583278 6913177 -9104891 -4916156 -1297762 3901895 7989221 499407
1540 1510803 3052199 -865788 7837852 1065834 3287799 4462858 -5434917 -3506380
1532c506380j850230A0962071A203802c298060h67674m321936A1081048i878861
1523a252386A0160296h98083b02954j518812j438418j097899G94673P391996b952899
1513d777780D506064e84373G043585f639091B839209b166431R88141C123050L773477
1504F896527d251664n331803E919366b292766D426124b409262C428545J121130
1496D549675b077036F7667a099971F163692a4381362c596293j918619E538765
1487b664059F926817e004761A204028i185822H248789A675103c449785N05706
1479b944079A764229J158727K725046i656210B90541N577986A476811K171242
1471C648053C6729M210486i1886m153727G555055a115866F153128K36614i879479
$$ plain form
1532 -3506380 -5356610 10962071 1203802 -3298060 -867674 -5189610 11081048 -9878861
1523 -1252386 10160296 -898083 -202954 -1721766 -3160184 -4258083 794673 8186669 -2952899
1513 -4777780 4506064 -584373 7043585 -6639091 2839209 -2166431 -1178290 3123050 6896527
1504 6896527 -4251664 -9583467 5919366 -2292766 4426124 -2409262 3428545 4549675
1496 4549675 -2077036 67667 -1099971 6163692 -14381362 -3596293 -5514912 5538765
1487 -2664059 6926817 -5004761 1204028 -9185822 8248789 1675103 -3449785 -2944079
1479 -2944079 1764229 2922956 5648002 -9656210 290541 5868527 1476811 3648053
1471 3648053 36729 4247215 -91886 -4245613 7555055 -1115866 6153128 6389742 -9879479
1461i463314a401338F63970a256361I21670b547220m104253L293152l081294K354331
1452d085284a03369A1494312A275279N553445H68008a091364m044934J737507
1444c398791C35978M12625P292593a0616237A788928h4549B058994c073190D730933
1434E35698J349398O0354m99776e650471G959469b697198k12190D556183D64619
1424c684785F614130C97670J333772a30085o378394A689883J431417f146666e42896
1414E16788a2285060B920773d447008k354979a390862A3998243b931225k956555
1406e887780d96114H426510A41001d760267l844282A0843429A049614i06155B456261
1396b012155B951847R43573E61020f452325A0887968h272242J909938D406272
$$ plain form
1461 -9463314 -1401338 663970 -1256361 921670 -2547220 -6651473 -3358321 -6439615 -4085284
1452 -4085284 -103369 11494312 1275279 6828724 868008 -1091364 -5136298 -3398791
1444 -3398791 335978 748603 8041196 -10616237 1788928 -84549 2058994 -3073190 4730933
1434 535698 1885096 1945450 1445674 -5650471 7959469 -2697198 -2909388 4556183 464619
1424 -3684785 6614130 397670 1731442 -130085 -6508479 1689883 3121300 -6146666 -542896
1414 516788 -12285060 2920773 -4447008 -6801987 -1390862 13998243 -2931225 -5887780
1406 -5887780 -496114 8426510 141001 -4760267 -8604549 10843429 1049614 -906155 2456261
1396 -2012155 2951847 3895420 561020 -6452325 10887968 -8272242 -6362304 4406272
1387a890631G383986a465374k213813D473478p35956a712885l898042b134136
1378D862282a69947A647656K244853H84114a234738n190298A795563b046080D781580
1368A175933g638096D846472g385299b105169C866698D79123J886141f038055
1359h602552G375151a932783C830840I85223a453595o003777A314699J52498G06880
1349c812504F739748b721269G90383N433152b397861f7159E61229P529937G31489
1339B504432e615749A4092193h401996B709678a3214796O261485c333623a82852
1330E698567b583809H37441d647835H50756a125456A077253h74972D138953a074674
1320E58882a543453E986306j998347i49388A692864i09111B11324J09987d599821
$$ plain form
1387 -1890631 7383986 -1465374 -3679187 4473478 3737522 -1712885 -5610927 -2134136
1378 4862282 -169947 1647656 3892509 884114 -1234738 -6425036 1795563 -2046080 4781580
1368 1175933 -7638096 4846472 -7385299 -2105169 3866698 479123 2365264 -6038055
1359 -8602552 7375151 -1932783 3830840 985223 -1453595 -7457372 1314699 1467197 706880
1349 -3812504 6739748 -2721269 790383 6223535 -2397861 -67159 561229 8091166 731489
1339 2504432 -5615749 14092193 -8401996 2709678 -13214796 -6953311 -3333623 -182852
1330 5698567 -2583809 837441 -4647835 850756 -1125456 1077253 -874972 4138953 -1074674
1320 558882 -1543453 5986306 3987959 -949388 1692864 -909111 211324 321311 -4599821
1310d76513j614826A0613614C011903a434557o511455E283392c489609r22062
1302d411671I925416a709972G84095J034547Q093551a063516E491781j59291D36022
1292B618032h12003B888393k28541h69807F471686g947912C280210L845529f243260
1282B506327a893205B967616Q14662j666290Q1389e094463b099535q5423A0111271
1272d305126E549115b96618p94022c48694A181418f119906b442023F68584L610581
1263D279165a775712C874795e923730A0379545a533716l424673D6179M719047
1255D765226b286579j016125m70459l63781J675713B592588N726271a132352A807204
1245a162503D863030g595185A116259R44822c643961J052396A587732Q948656
$$ plain form
1310 -476513 -2091339 10613614 3011903 -1434557 -7946012 5283392 -3489609 -4411671
1302 -4411671 9925416 -1709972 784095 1818642 9912193 -1063516 5491781 5332490 436022
1292 2618032 -812003 2888393 2659852 -869807 6471686 -7947912 3280210 7125739 -6243260
1282 2506327 -1893205 2967616 3782278 2115988 2197377 -5094463 -2099535 -2184958 10111271
1272 -4305126 5549115 -296618 -1090640 -348694 1181418 -6119906 -2442023 668584 4279165
1263 4279165 -1775712 3874795 -5923730 10379545 -1533716 -4958389 46179 4765226
1255 4765226 -2286579 -3302704 -3773163 -4136944 -2461231 2592588 8318859 -1132352 1807204
1245 -1162503 4863030 -7595185 1116259 2061081 -3643961 -2591565 1587732 10536388
1237A0536388b298428G347737f501535A750908A41905b345647N09095E427048
1228G93741f008232g46549j26802A554648o08374L412555b780526r183229A1260507
1218a089858B015215i490580E518886f19759j973387a176118n60784p364433C090425
1208f079763N61104A884877P844440B97380K973840a614922A215400b412013j302024
1199c714037m25137f77481G535926j4876A927069M353784A527208a207990A0188742
1189D138218O230498m897308k158213Q061337m477596J1671461O776879o118703
1181A9226573F28598e3627812m6343290L5001875B89511K1799829E131720b8159211
1172f395302D1838417A0237856d4005853n5924200J8488345b2199162C1345035
$$ plain form
1237 10536388 -2298428 7347737 -6501535 1750908 141905 -2345647 -1836552 5427048
1228 793741 -6008232 -746549 -873351 1554648 946274 4358829 -2780526 -11963755 11260507
1218 -1089858 2015215 -9490580 5518886 -619759 -2593146 -1176118 -1736902 -9101335 3090425
1208 -6079763 -5518659 1884877 9729317 297380 3271220 -1614922 1215400 -2412013 -3714037
1199 -3714037 -4139174 -677481 7535926 7521050 1927069 6280853 1527208 -1207990 10188742
1189 4138218 10368716 5471408 3313195 11374532 6896936 18568397 25345276 19226573
1181 19226573 628598 -53627812 -99971102 -64969227 289511 22089340 5131720 -28159211
1172 -6395302 41838417 10237856 -44005853 -99930053 -81441708 -22199162 31345035
1164C1632503A3354572J0870948a546712G612270l479932M907480g31561B07656
1155A3706R498630i581145E934886r33607R0357k514822f28646A152570K785573
1146C938143q26724N443638B99788M046729L759017a5901155L571641l586201
1138a5915715c370915B153094O826001M374288E968698L35891h494880L857445
1130d637435o348o722269e465798A4145783N723615J511740j326774n345298j77023
1121A4532043F322020a9231783j700466c85595A707590R52996L177450L237259
1113I075295a451320E756290c584627q913366p611726N848815D672221K519177
1105G191398A003022a123878o566391b033134C172821A558516k21626M957965
$$ plain form
1164 31632503 13354572 24225520 -1546712 7612270 4132338 9039818 -731561 207656
1155 13706 9512336 -9581145 5934886 5001279 5091636 2576814 -628646 1152570 3938143
1146 3938143 3111419 8555057 299788 4346517 8105534 -15901155 -12329514 -15915715
1138 -15915715 -3370915 2153094 8979095 13353383 5968698 6304589 -8494880 -4637435
1130 -4637435 -4643783 -11366052 -5465798 14145783 19869398 21381138 20054364 14709066 14532043
1121 14532043 6322020 -19231783 -20932249 -385595 1707590 2660586 5838036 9075295
1113 9075295 -1451320 5756290 -3584627 -12497993 -20109719 -14260904 4672221 7191398
1105 7191398 1003022 -1123878 -7690269 -2033134 3172821 1558516 1336890 6294855
1097F294855h12111A101216B22362L986148M111049f75464j543647I232581a0193519
1087A789156g101298c292974B018478e083402r27776A199200g68972m705007a704344
1077f532270A0287897B436998c115838e21855E538306k588850b136565C955298
1068d109982H209254p93503d139767j710122I4678d285482a415678n783298e78343
1058a756476B851430a0161313G834302e735485A602531c81588C486057K061000
1050E547057j041490A374039J486133J1031501k338172L6458679j0632039G564994
1041b6618884l718190e403820B3391215J5173611f535441n561262G065994M9706992
1033E6772986J0015436C2050043a8026408m2939112J2892097D682971K9266159
$$ plain form
1097 6294855 -812111 1101216 222362 4208510 8319559 -675464 -2219111 9232581 -10193519
1087 1789156 -7101298 -3292974 2018478 -5083402 -6011178 1199200 -768972 -5473979 -1704344
1077 -6532270 10287897 2436998 -3115838 -521855 5538306 2949456 -2136565 3955298
1068 -4109982 8209254 7415751 -4139767 -5849889 94678 -4285482 -1415678 -7198976 -578343
1058 -1756476 2851430 -10161313 7834302 -5735485 1602531 -381588 3486057 5547057
1050 5547057 4505567 1374039 2860172 13891673 11553501 48012180 37380141 7564994
1041 -26618884 -30337074 -5403820 23391215 38564826 -6535441 -12096703 7065994 56772986
1033 56772986 66788422 32050043 -18026408 -60965520 -48073423 4682971 33949130
1026C3949130j355248A1859662g014881a161777E922493L011996l352074b1357691
1017c4841222a3705929G877333R45149K309144E115659a180103n789774j3082787
1009b0052664M056115M860993a581600j238968d49614j298941j96985k19855I200394
999c45620E738883a4438135L000251c225804J9596a255759E854752l92868K327179
990G789063j650987L018991C125916b3811752h267819b453205r867078b434925
981c533452j871237F616671d130019O4922j5107232a434995j6843610A335752
972F930860L651783l125098c238033A0980700C725631R817839E143559M733809
964I877368l766474K01390M694283n275771j936418L154296e030029E957154d086727
$$ plain form
1026 33949130 32593882 11859662 -7014881 -1161777 5922493 8934489 5582415 -21357691
1017 -34841222 -13705929 7877333 8822482 11131626 5115659 -1180103 -6969877 -20052664
1009 -20052664 -15996549 -11135556 -1581600 -2820568 -449614 -1748555 -1945540 -2165395 9200394
999 -345620 5738883 -14438135 -11437884 -3225804 -3206208 -1255759 5854752 5461884 7789063
990 7789063 6138076 9157067 3125916 -23811752 -8267819 -2453205 -12320283 -2434925
981 -3533452 -5404689 6616671 -4130019 -4065097 -19172329 -1434995 -18278605 1335752
972 6930860 10582643 7457545 -3238033 10980700 3725631 13543470 5143559 9877368
964 9877368 6110894 6312284 11006567 5730796 3794378 6948674 -5030029 5957154 -4086727
954e674181m45506A8328h353183K875262J808563j760746K155661l516879b332354
944e007944J858167J511811b67731k519685F268101F91840c947610a239417B85505
934e753553E378913e1342B77842h61588A784024g520589a066539A2516464B710193
924F145585e01475A08600O66739g273277b350960C117726b672477F800985A420910
914d920287m31580A683636R07069j63895b084502B012658d674903r6042n879706
905a0650651a709916B789714e815790a980898K57588q58564B191001a046660d27836
895e677318J410334C053240c418276C126823q02785h870537a586176p000646a650465
885a256654E085820d671161C315876A225135J900386o84536K633250b228131G793533
$$ plain form
954 -5674181 -6119687 18328 -8353183 -5477921 -3669358 -5430104 -3274443 -6791322 -2332354
944 -5007944 -3149777 -1637966 -267731 -2787416 6268101 691840 -3947610 -1239417 285505
934 -5753553 5378913 -51342 277842 -861588 1784024 -7520589 -1066539 12516464 2710193
924 6145585 -501475 108600 775339 -7273277 -2350960 3117726 -2672477 6800985 1420910
914 -4920287 -5351867 1683636 2590705 2426810 -2084502 2012658 -4674903 -4770945 -10650651
905 -10650651 -1709916 2789714 -5815790 -1980898 -1723310 -2581874 2191001 -1046660 -427836
895 -5677318 -4266984 3053240 -3418276 3126823 2324038 -8870537 -1586176 -8586822 -1650465
885 -1256654 5085820 -4671161 3315876 1225135 3125521 2440985 5074235 -2228131 7793533
875C663011J0969i404907a00196k770449j552756J617120H309436i32401m878442
866e810843a760755m426960E692788J411423i97763M85072H803016q07520D76949
856D18429f355083B015826g645596L820173R03685a203369H514775i546027a300847
846D670161B328750J83298h03153H41060L440227a914966B162770d483283C696553
836c061434j974572B45130a531229n07380F160182d706896n30760H0704N56016
827F36720J813041e66273G05109e270955D585567e030259F67566N543751d596722
817a868782O8965A362153l94713P396191B74333d368134a852306j643408G36649
807c884130n384736c590940B106258O9398g588503H57063b179302A642960K489261
$$ plain form
875 3663011 3673980 -9404907 -100196 -2870645 -4423401 -2806281 8309436 -932401 -5810843
866 -5810843 -1760755 -6187715 5692788 7104211 -997763 -512691 8803016 7995496 476949
856 418429 -6355083 2015826 -7645596 -3825423 -2921738 -1203369 8514775 -9546027 -1300847
846 4670161 2328750 2512048 -803153 841060 4281287 -1914966 2162770 -4483283 3696553
836 -3061434 -5036006 245130 -1531229 -2038609 6160182 -4706896 -5237656 80704 636720
827 636720 2449761 -566273 705109 -5270955 4585567 -5030259 667566 6211317 -4596722
817 -1868782 -1799817 1362153 967440 8363631 274333 -4368134 -1852306 -3495714 736649
807 -3884130 -9268866 -3590940 2106258 2175656 -7588503 857063 -2179302 1642960 4132221
798D132221j102K733363e45082r63443F951541A202875c298934f70878F53114
788B360857J734309j387207b798264C056131b8057n539380B183315G70965a99965
778a328766H43360f928491a296943E88244K572427c915179J362706E048916d626224
768E407815k464473a159352A004747J358844c620196a162809A70779b858753J225189
759a633564G438344e460982g56206A289571J036192J493591a959955j694993O42118
750c012830B8713J674618f839494A458289B06647b152922n83842j338929E7014
740c031536E348357b239570d60464o10628K13055A503611K802734h809363G503616
730A446582f057394G126254d993331J960085E749636B733375d768448b135551
$$ plain form
798 4132221 4131119 6864482 -545082 -1508525 6951541 1202875 -3298934 -670878 653114
788 2360857 4095166 2707959 -2798264 3056131 -28057 -5567437 2183315 770965 -199965
778 -1328766 843360 -6928491 -1296943 588244 3160671 -3915179 -2552473 5048916 -4626224
768 5407815 2943342 -1159352 1004747 2363591 -3620196 -1162809 170779 -2858753 -1633564
759 -1633564 7438344 -5460982 -756206 1289571 2325763 3819354 -1959955 -3654948 -3012830
750 -3012830 28713 1703331 -6839494 1458289 206647 -2152922 -2736764 -4075693 57014
740 -3031536 5348357 -2239570 -460464 -1071092 -858037 1503611 4306345 -8809363 7503616
730 1446582 -6057394 7126254 -4993331 -3033246 5749636 2733375 -4768448 -2135551
721a027537E222163k435434b842471I201894c504134B793473A44000g812701A614681
711E327256f911539A979078D03385b850497F409585q25852f848464C83627b78871
701f046635f1896C170519c573778q63878B319058a29148A2622593b354398C724269
691A259995b060620I465474b727986J45273B698169c526051F3094M743372A594465
681C054743h061927c156919B100248k02536O02643b487164h1864F363551B492380
671A403138K3879d592845d24842a68992m086651I073342e369443a027758B928558
661B885130g0080D23353b755060C368781a387215K04935k0540E639698d298966
$$ plain form
721 -1027537 5222163 2786729 -2842471 9201894 -3504134 2793473 144000 -7812701 1614681
711 5327256 -6911539 1979078 403385 -2850497 6409585 5583733 -6848464 383627 -278871
701 -6046635 -61896 3170519 -3573778 -4437656 2319058 -129148 12622593 -2354398 3724269
691 1259995 -2060620 9465474 -2727986 -2582713 2698169 -3526051 63094 4806466 1594465
681 3054743 -8061927 -3156919 2100248 1897712 2500355 -2487164 -81864 6363551 2492380
671 1403138 1427017 -4592845 -424842 -168992 -4255643 9073342 -5369443 -1027758 2928558
661 2885130 -70080 423353 -2755060 3368781 -1387215 -1182280 -1202820 5639698 -4298966
$$ [...]
##END NTUPLES=nD NMR SPECTRUM
##END=
