##TITLE=XTC-1706_3
##JCAMPDX= 6.0         $$ Bruker NMR JCAMP-DX V2.0
##DATA TYPE= nD NMR SPECTRUM
##DATA CLASS= NTUPLES
##NUM DIM= 2
##ORIGIN= BRUKER
##OWNER= patiny
$$ 1.79 TOPSPIN		Version 3.0
$$ 2012-05-20 17:13:55.949 +0200  patiny@icmbsg005
$$ Compression mode = diff/dup
##.OBSERVE FREQUENCY= 400.131767230267
##.OBSERVE NUCLEUS= ^1H
##.ACQUISITION MODE= SIMULTANEOUS (DQD)
##.ACQUISITION SCHEME= Echo-Antiecho
##.AVERAGES= 4
##.DIGITISER RES= 23
##SPECTROMETER/DATA SYSTEM= spect
##.PULSE SEQUENCE= hmbcetgpl3nd
##.SOLVENT NAME= D2O
##.SHIFT REFERENCE= INTERNAL, D2O, 1, 8.297366
##AUDIT TRAIL= $$ (NUMBER, WHEN, WHO, WHERE, PROCESS, VERSION, WHAT)
$$ ##TITLE= Audit trail, TOPSPIN		Version 3.0
$$ ##JCAMPDX= 5.01
$$ ##ORIGIN= Bruker BioSpin GmbH
$$ ##OWNER= patiny
$$ $$ /opt/data/patiny/nmr/XTC-1706_3/14/pdata/1/auditp.txt
$$ ##AUDIT TRAIL=  $$ (NUMBER, WHEN, WHO, WHERE, PROCESS, VERSION, WHAT)
(   1,<2012-05-20 17:13:54.046 +0200>,<patiny>,<icmbsg005>,<go>,<TOPSPIN 3.0>,
      <created by zg
	started at 2012-05-20 16:51:46.842 +0200,
	POWCHK enabled, PULCHK disabled,
       configuration hash MD5:
       77 C7 B7 C4 10 F4 BA 30 64 2E BB 52 82 F2 DA 41
       data hash MD5: 4K * 128
       20 30 30 A5 E0 D7 5D 69 4A 01 8F B6 A0 DB 9B AA>)
(   2,<2012-05-20 17:13:54.108 +0200>,<patiny>,<icmbsg005>,<audit>,<TOPSPIN 3.0>,
      <user comment:
       ICON-NMR User ID: patiny
       data hash MD5: 4K * 128
       20 30 30 A5 E0 D7 5D 69 4A 01 8F B6 A0 DB 9B AA>)
(   3,<2012-05-20 17:13:55.047 +0200>,<patiny>,<icmbsg005>,<proc2d>,<TOPSPIN 3.0>,
      <Start of raw data processing
       xfb same F2: SI = 2K WDW = 3 SSB = 4 FT_mod = 6 PKNL = 1 F1: SI = 1K ME_mod = 2 NCOEF = 32 WDW = 4 SSB = 2 FT_mod = 6 PHC0 = 0 PHC1 = 0
       data hash MD5: 2K * 1K
       F7 BB 9C AA 5F 42 86 52 28 F2 A4 47 CE 83 C1 06>)
(   4,<2012-05-20 17:13:55.159 +0200>,<patiny>,<icmbsg005>,<proc2d>,<TOPSPIN 3.0>,
      <abs2 F2: ABSG = 5 ABSF1 = 8.297366 ABSF2 = 0.5359135
       data hash MD5: 2K * 1K
       1C 54 9C 7D 24 CD 22 56 AC 85 03 75 68 90 51 5B>)
(   5,<2012-05-20 17:13:55.337 +0200>,<patiny>,<icmbsg005>,<proc2d>,<TOPSPIN 3.0>,
      <abs1 F1: ABSG = 5 ABSF1 = 210.754 ABSF2 = -11.10083
       data hash MD5: 2K * 1K
       75 9F EC DC 78 4C 2A 65 2F 41 8E 41 0B 0B A8 8A>)
$$ ##END=
$$ 
$$ $$ hash MD5
$$ $$ 93 63 4D 5F 65 D0 3E C3 3F 55 3E 87 02 4B 7A F4
##$RELAX= 
##$RELAX= 
##$RELAX= 
##$RELAX= 
##$RELAX= 
##$RELAX= 
##$RELAX= 
##$RELAX= 
##$RELAX= 
##$RELAX= 
##$RELAX= 
$$ Bruker specific parameters
$$ --------------------------
##$DATPATH= </opt/data/patiny/nmr>
##$EXPNO= 14
##$NAME= <XTC-1706_3>
##$PROCNO= 1
##$ACQT0= 1000000
##$AMP= (0..31)
100 100 100 100 100 100 100 100 100 100 100 100 100 100 100 100 100 100
100 100 100 100 100 100 100 100 100 100 100 100 100 100
##$ANAVPT= -1
##$AQSEQ= 0
##$AQ_mod= 3
##$AUNM= <au_getlinv>
##$AUTOPOS= <45 >
##$BF1= 400.13
##$BF2= 100.612769
##$BF3= 400.13
##$BF4= 400.13
##$BF5= 400.13
##$BF6= 400.13
##$BF7= 400.13
$$ [...]
##$SIGF1= 8.297366
##$SIGF2= 0.5359135
##$SINO= 0
##$SIOLD= 2048
##$SPECTYP= <>
##$SREGLST= <1H.DMSO>
##$SSB= 4
##$STSI= 2048
##$STSR= 0
##$SW_p= 3105.5900621118
##$SYMM= 0
##$S_DEV= 864799
##$TDeff= 4096
##$TDoff= 0
##$TI= <>
##$TILT= no
##$TM1= 0
##$TM2= 0
##$TOPLEV= 100
##$USERP1= <>
##$USERP2= <>
##$USERP3= <>
##$USERP4= <>
##$USERP5= <>
##$WDW= 3
##$XDIM= 2048
##$YMAX_p= 260735195
##$YMIN_p= -270896644
##$CURPLOT= <Cups-PDF>
##$CURPRIN= <$Cups-PDF>
##$DFORMAT= <normdp>
##$LAYOUT= <+/2D_inv.xwp>
##$LFORMAT= <normlp>
##$PFORMAT= <normpl>
$$ Bruker specific parameters for F1
$$ ---------------------------------
##$ACQT0= 0
##$BF1= 100.612769
##$FnMODE= 6
##$NUC1= <13C>
##$O1= 10043.8343986724
##$SFO1= 100.622812834399
##$SW= 221.832681201688
##$SW_h= 22321.4283611104
##$TD= 128
##$ABSF1= 210.754
##$ABSF2= -11.10083
##$ABSG= 5
##$ABSL= 0
##$ALPHA= 0
##$AQORDER= 0
##$ASSFAC= 0
##$ASSFACI= 0
##$ASSFACX= 0
##$ASSWID= 0
##$AUNMP= <>
##$AXLEFT= 0
##$AXNAME= <F1>
##$AXNUC= <13C>
##$AXRIGHT= 0
##$AXTYPE= 0
##$AXUNIT= <>
##$AZFE= 0.1
##$AZFW= 0.5
##$BCFW= 0
##$BC_mod= 0
##$BYTORDP= 0
##$COROFFS= 0
##$CY= -3
##$DATMOD= 1
##$DC= 0
##$DFILT= <>
##$DTYPP= 0
##$ERETIC= no
##$F1P= 210.76350402832
##$F2P= -11.0913240743493
##$FCOR= 0.5
##$FTSIZE= 1024
##$FT_mod= 6
##$GAMMA= 0
##$GB= 0
##$INTBC= 1
##$INTSCL= 1
##$ISEN= 128
##$LB= 0
##$LEV0= 0
##$LPBIN= 256
##$MAXI= 10000
##$MC2= 5
##$MEAN= 0
##$ME_mod= 2
##$MI= 1
##$NCOEF= 32
##$NC_proc= -9
##$NLEV= 6
##$NOISF1= 0
##$NOISF2= 0
##$NSP= 0
##$NTH_PI= 0
##$NZP= 0
##$OFFSET= 210.754
##$PC= 4
##$PHC0= 0
##$PHC1= 0
##$PH_mod= 1
##$PKNL= no
##$PPARMOD= 1
##$PPDIAG= 0
##$PPIPTYP= 0
##$PPMPNUM= 2147483647
##$PPRESOL= 1
##$PSCAL= 1
##$PSIGN= 0
##$PYNMP= <>
##$REVERSE= no
##$SF= 100.612769
##$SI= 1024
##$SIGF1= 210.754
##$SIGF2= -11.10083
##$SINO= 0
##$SIOLD= 1024
##$SPECTYP= <>
##$SREGLST= <>
##$SSB= 2
##$STSI= 1024
##$STSR= 0
##$SW_p= 22321.42836111
##$SYMM= 0
##$S_DEV= 864799
##$TDeff= 256
##$TDoff= 0
##$TI= <>
##$TILT= no
##$TM1= 0
##$TM2= 0
##$TOPLEV= 0
##$USERP1= <>
##$USERP2= <>
##$USERP3= <>
##$USERP4= <>
##$USERP5= <>
##$WDW= 4
##$XDIM= 128
##$YMAX_p= 260735195
##$YMIN_p= -270896644
$$ End of Bruker specific parameters
$$ ---------------------------------
##NTUPLES= nD NMR SPECTRUM
##VAR_NAME=  FREQUENCY1,    FREQUENCY2,      SPECTRUM
##SYMBOL=    F1,            F2,              Y
##.NUCLEUS=  13C,           1H
##VAR_TYPE=  INDEPENDENT,   INDEPENDENT,     DEPENDENT
##VAR_FORM=  AFFN,          AFFN,            ASDF
##VAR_DIM=   1024,          2048,            2048
##UNITS=     HZ,            HZ,              ARBITRARY UNITS
##FACTOR=    21.7982698838965, 1.51640139751553, 1
##FIRST=     21204.543296753, 3104.07366071428, 1914608
##LAST=      -1095.08679447308, 0,           1704367
##MIN=       -1095.08679447308, 0,           -270896644
##MAX=       21204.543296753, 3104.07366071428, 260735195
##PAGE= F1=21204.54329675
##FIRST=     21204.543296753, 3104.07366071428, 1914608
##DATA TABLE= (F2++(Y..Y)), PROFILE
$$ [...]
##PAGE= F1=14490.67617251
##FIRST=     21204.543296753, 3104.07366071428, 262530
##DATA TABLE= (F2++(Y..Y)), PROFILE
1874A906403a389694c83551I88649g43283a49924G45062j90544A20330J20560
1865B40890c60381C40145J203059D41582a281710F04880b28977G31097a8588j91277
1855b09865n70421i0690C13693J070935a35768A220951a64314k27732k58626A538615
1844F39797a292212B222131J868822K219286k469994b446626O87956A678407a880548
1834f02224E15568e26052D14506h88201c16500o30957B38622e3533B28279n5535
1824A72744J229229g42857A682823d59277A27925k8815P24548h59781I46520b539785
1813D6681a267614B12125a369885H54405a40665k42456G42718b41629h7926K4228
1803f3698H5363P89872f11964p42815E05746a977000i73684I70281k15955d13936
$$ plain form
1874 1906403 -1389694 -383551 988649 -743283 -149924 745062 554518 120330 240890
1865 240890 -360381 340145 1543204 441582 -1281710 604880 -228977 731097 -18588 -209865
1855 -209865 -780286 -90690 313693 1384628 -135768 1220951 -164314 -392046 -650672 1538615
1844 639797 -1292212 2222131 4090953 6310239 3840245 -2446626 -1758670 1678407 -1880548
1834 -602224 515568 -526052 414506 -888201 -316500 -947457 238622 -53533 228279 172744
1824 172744 1401973 -742857 1682823 -459277 127925 99110 823658 -859781 946520 -2539785
1813 46681 -1267614 212125 -1369885 854405 -140665 -383121 742718 -241629 -87926 -63698
1803 -63698 85363 875235 -611964 -1354779 505746 -1977000 -973684 970281 754326 -413936
1792F65350r8494a59293j166141B075409a749431D78255a00887A50826b010524
1782h3271A100202F3708a321246B95196g9577j590891O20012a2280o70150A377331
1771c02627n29509F74662a187437H26355c96231j061804K25626h0407B40326a812638
1760a17498A524868D35810f70091k633889B411452C62225a75424B07565h73875
1750g31730I59137a639404c96441D2215g66041r01313E5488e90999A279408L11963
1740A591371a405029c00205p88416F23006j77605a52050l79857q7234G83240M7427
1730H30667D2806b1603A610497b150602H64349i09663j102763I35620g72454L39996
1720d32458a0139B2229d25293L1071a74883C82931J98831g93213o21776C27935
$$ plain form
1792 665350 566856 -159293 -1325434 2075409 -1749431 478255 -100887 150826 -2010524
1782 -83271 1100202 63708 -1321246 295196 -79577 -1670468 -1050456 -12280 -682430 1377331
1771 -302627 -832136 674662 -1187437 826355 -396231 -1458035 -1232409 -80407 240326 -1812638
1760 -117498 1524868 435810 -670091 -3303980 2411452 362225 -175424 207565 -873875
1750 -731730 959137 -1639404 -396441 42215 -766041 -1667354 55488 -590999 1279408 1591371
1740 1591371 -1405029 -300205 -1088621 623006 445401 -152050 -531907 -619141 783240 830667
1730 830667 42806 -21603 1610497 -2150602 864349 -909663 -2012426 935620 -772454 -432458
1720 -432458 -10139 22229 -425293 -394222 -174883 382931 581762 -793213 -1414989 327935
1709B25507d85573J19034A542214b185397A203448k60906B37468O81735i36650
1699D86737a114723c80731D37453g40920b04924a5916A89071J045797n48588i39424
1688I11040D20621K64503e50501a06292q17494D99693L00101i18897F61211b825669
1677a247026N40232a20349B95478J63385M21524g32630A098531k72759C78180
1667A244952i44671B237845A053917f06404a21464j285361H66238C15949P82048
1658A097997b494472b08478O7320A288581d38859B13974e20998i4826l14061l50685
1648g59572A785189D87764K20752d70726E80393k41195j20377e07362A58308a456797
1637D25612a922995B454899d74738C85382a485792B298767B77745b000435B40732
$$ plain form
1709 225507 -485573 -366539 1542214 -2185397 1203448 942542 237468 919203 -936650
1699 486737 -1114723 -380731 437453 -740920 -204924 -15916 189071 1234868 686280 -939424
1688 911040 420621 685124 -550501 -106292 -923786 499693 799794 -918897 661211 -2825669
1677 -1247026 -706794 -120349 295478 458863 880387 -732630 1098531 825772 378180
1667 1244952 -944671 2237845 1053917 -606404 -121464 -1406825 866238 315949 1097997
1658 1097997 -2494472 -208478 -141158 1288581 -438859 213974 -520998 -94826 -408887 -759572
1648 -759572 1785189 487764 708516 -470726 580393 339198 218821 -507362 158308 -1456797
1637 425612 -1922995 2454899 -474738 385382 -1485792 2298767 277745 -2000435 240732
1627f52903B11276a498235A210674e82631F91002b35455B01696h32262C36426
1617f80445C97962n3411o7427a705083A000687m92985h29167A042669D00970e02352
1606B020680i70853Q374A360589n94782l22042j72198a9858q61700M1995D98478
1595h36113B12121J3721f09413B37469M87961a115664L02610H56513a47953a8589
1584b011927c67542H27999b42610P2457k6242q00003G18129e44249A156347A4054
1573g52871b23206j59341E70572g44807F98416b12854q68871D13270d62569J7924
1563d44645h2783j710561c50029J02547G94397c68908j53925I13O89801a088872
1552A831281p08189k0418C76934L58064E5386f44707A115663k99368M75664e09272
$$ plain form
1627 -652903 211276 -1498235 1210674 -582631 691002 -235455 201696 -832262 336426
1617 -680445 397962 344551 277124 -1705083 1000687 507702 -829167 1042669 400970 -502352
1606 2020680 -970853 -962479 1360589 765807 443765 271567 -19858 -881558 -839563 498478
1595 -836113 212121 225842 -609413 237469 725430 -1115664 -813054 856513 -147953 -18589
1584 -2011927 -367542 827999 -242610 -170153 -196395 -996398 718129 -544249 1156347 14054
1573 -752871 -223206 -382547 570572 -744807 698416 -212854 -1081725 413270 -462569 -444645
1563 -444645 -82783 -1793344 -350029 -247482 794397 -368908 -522833 913 690714 -1088872
1552 1831281 1123092 1102674 376934 734998 55386 -644707 1115663 816295 1291959 -509272
1541E01164d26323A48868a333672A575208b45840D4488J498228g65629B58907
1531a148482H5335O46280a632585G58587a404402C53921A01944d22871k31952
1522f54823I41621j55183J19928F8959L563945a101892l57377A220954h6458k22510
1512c08968A945411f57787A160608e72864O3162a04018C21457g88553J10759j8712
1502f96506b41091D25149c00253D47334f02256R7671C7158J61524J326227c04275
1491D48544r5152J141603a942612A016701L07563A80075b344998f82210A37528
1481b94898J16424o45741C12946a137535f7898j212665A415805k1116c81090n31308
1471i12398D46798a35514A116474c56631A732657g49949j99814A545853h65001
$$ plain form
1541 501164 -426323 148868 -1333672 1575208 -245840 44488 1542716 -765629 258907
1531 -1148482 85335 731615 -1632585 758587 -1404402 353921 101944 -422871 -654823
1522 -654823 941621 786438 906366 68959 3632904 -1101892 -1459269 1220954 -86458 -308968
1512 -308968 1945411 -657787 1160608 -572864 -509702 -104018 321457 -788553 -677794 -696506
1502 -696506 -241091 425149 -300253 447334 -602256 -504585 37158 198682 1524909 -304275
1491 448544 353392 1494995 -1942612 1016701 1324264 180075 -2344998 -682210 137528
1481 -294898 -178474 -824215 312946 -1137535 -67898 -1280563 1415805 1394689 -381090 -912398
1471 -912398 446798 -135514 1116474 -356631 1732657 -749949 -949763 1545853 -865001
1461G61685B03780J09529g87509b64784A748491a254353A3745a120064A073418
1451e02609m19475G97488d47954C78396A19623d21360n65567H23310h79477H63471
1440a429206A616823f27762M8687B078892d29259a26123j015752B668913b276122
1430e74212I97766J298018a961454e37336K48244I58565i11513A293076a606708
1420A781512a097591d44342I29849j3103D06729g04493a30666j748184a35220
1410b43853g1793A088015d28340j195377H35833A59550d6114n19010A625437D74249
1399h87369J56333G88140L81283h8041F40321a880776D57474K95045f48062A08811
1388f03332j07192b62966A066892B24856N43894d07400l2195q31614G78657l82065
$$ plain form
1461 761685 203780 313309 -787509 -264784 1748491 -1254353 13745 -1120064 1073418
1451 -502609 -922084 797488 -447954 378396 119623 -421360 -986927 823310 -879477 863471
1440 -1429206 1616823 -627762 -579075 2078892 -429259 -126123 -1141875 2668913 -2276122
1430 -574212 997766 2295784 -1961454 -537336 -289092 958565 -911513 1293076 -1606708
1420 1781512 -1097591 -444342 929849 916746 406729 -704493 -130666 -1878850 -135220
1410 -243853 -71793 1088015 -428340 -1623717 835833 159550 -46114 -565124 1625437 474249
1399 -887369 -731036 788140 1169423 -88041 640321 -1880776 457474 752519 -648062 108811
1388 -603332 -710524 -262966 1066892 224856 768750 -407400 -439595 -1271209 778657 396592
1378C96592a3186A302240b054575A46819P41053A26170d6044C59106c65249J04677
1368b60572Q7245k87377B301829b61638C46576J035110a312502C32350L83453
1359G15803a106945A863557E08507c02953p81543C72235O15499B25068a89248
1349c67103C55564N09630b180684C87764K77280b21473I94371e90586p6214B934514
1338c47131m89529E47660j03599a46294B56222h92731B698982I09305k91668l488
1328F14149c356210I04089c47812M7755F56445b0405j410484A21794J163254b414474
1317e6552k44128J3761j159051E02528c74516I11865c356077A767608i97002M71253
1307e25749B161220g81057B071954f52496I47485C6937J138120a997734B257327
$$ plain form
1378 396592 -13186 1302240 -2054575 146819 887872 126170 -46044 359106 -365249 -260572
1368 -260572 -173327 -460704 2301829 -261638 346576 1381686 -1312502 332350 715803
1359 715803 -1106945 1863557 508507 -302953 -1084496 372235 987734 225068 -189248
1349 -367103 355564 865194 -2180684 387764 665044 -221473 994371 -590586 -666800 2934514
1338 -347131 -836660 547660 444061 -146294 256222 -892731 2698982 909305 617637 614149
1328 614149 -3356210 904089 -347812 -300057 656445 -20405 -1430889 121794 1285048 -2414474
1317 -56552 -300680 -286919 -1445970 502528 -374516 911865 -3356077 1767608 -997002 -525749
1307 -525749 2161220 -781057 2071954 -652496 947485 36937 1175057 -1997734 2257327
1297d49615A467903l86108f26700j395675B567333H30974A876f38004F48712J19133
1287G67845C79108g57987C02446h86955A230424A53998a431099b33116B60139
1277g79241B321738l13729g96003m35424d37201A832244b132715B377111D35077
1267a427670G27843a115807E11952a029568A055560B15380b22613G28843M05344
1258A134187a645667A271626c49674C71602O36729a19041A63689J040292c13030
1248e38026a82189D15904a083247B56709J491870d53103D31978b076170C94402
1238F87050d44529a93672k235918A498881a075416q3933B34431O80234b7084p93455
1228h20539K38818A879629d24396e1642H37328j18801d53004l93386C99682K0158
$$ plain form
1297 -449615 1467903 1081795 -626700 -2022375 2567333 830974 1876 -638004 648712 767845
1287 767845 379108 -757987 302446 -886955 1230424 153998 -1431099 -233116 260139
1277 -779241 2321738 2008009 -796003 -1231427 -437201 1832244 -2132715 2377111 435077
1267 -1427670 727843 -1115807 511952 -1029568 1055560 215380 -222613 728843 1134187
1258 1134187 -1645667 1271626 -349674 371602 1008331 -119041 163689 1203981 -313030
1248 -538026 -182189 415904 -1083247 256709 1748579 -453103 431978 -2076170 394402
1238 687050 -444529 -193672 -2429590 1498881 -1075416 -1159349 234431 914665 -27084 -820539
1228 -820539 -581721 1879629 -424396 -51642 837328 718527 -453004 -846390 399682 419840
1218D19840m3984a641788e35772A261381o26295B16971i31274G91686B45231F6691
1207c11381j298315B82289A3270Q12370c35373k84354b59645C59229P4149a037144
1196G23690a988011F14474k60060L90428a207845j76118a30032B03831M69966
1187F73797J408327f12341a1513l80317A722301D81694A00288R10908f98120m18951
1177a117071E31941d05512F6419Q80250a016618p16670b99628B78565J778935
1168B057500d04186B90449a19239D62537K53457L7171a783819B208681H11846
1158d19842k7916H49522J958645b792656A74981J189700e2783I90147h88231D42551
1147a124711a17169F33111J119527E15603c85708q38369C3374L300276B63183
$$ plain form
1218 419840 375856 -1641788 -535772 1261381 635086 216971 -931274 791686 245231 66691
1207 -311381 -1609696 282289 13270 825640 -335373 -619727 -259645 359229 433378 -1037144
1196 723690 -1988011 614474 354414 744842 -1207845 -1383963 -130032 203831 673797
1187 673797 2082124 -612341 -11513 -391830 1722301 481694 100288 1011196 -698120 -1117071
1177 -1117071 531941 -405512 66419 946669 -1016618 -1733288 -299628 278565 2057500
1168 2057500 -404186 290449 -119239 462537 715994 753165 -1783819 2208681 811846
1158 -419842 -447758 849522 2808167 -2792656 174981 1364681 -52783 990147 -888231 442551
1147 -1124711 -117169 633111 1752638 515603 -385708 -1224077 33374 3333650 263183
1137b279708A842268H24416h39731C57870L95062c02385A16240O02230a1996r51411
1127i63407O0785M39451A022696k12345a092891d24171A060387h61449f137p00737
1117g06874C84812K98821a174147A75291g41122A94697F5849e23377B36212L03560
1107E39772a437163A73524L23971L15742l12499i31832E64768b3496r50635j86049
1097a160180A062396B40783c02448A45787e96976D94635e23388q39723A911848
1087H47221A59196a199611F01197L73437a744490M24482B6522M13988K04031N16810
1077A161351a061803G36928A1951f14006a6773F47594i17143a16729n86355H70815
1066A628660A91036i58657G34006B15743J192590e27006i9823C60464a377649
$$ plain form
1137 -2279708 1842268 824416 -839731 357870 752932 -302385 116240 718470 -11996 -963407
1127 -963407 -902622 -463171 1022696 810351 -1092891 -424171 1060387 -861449 -6137 -706874
1117 -706874 384812 683633 -1174147 175291 -741122 194697 65849 -523377 236212 539772
1107 539772 -1437163 173524 497495 813237 500738 -931832 564768 -23496 -974131 -1160180
1097 -1160180 1062396 240783 -302448 145787 -596976 494635 -523388 -1363111 1911848
1087 847221 159196 -1199611 601197 974634 -1744490 -1320008 26522 440510 644541 1161351
1077 1161351 -1061803 736928 11951 -614006 -16773 647594 -917143 -116729 -703084 870815
1066 1628660 191036 -958657 734006 215743 1408333 -527006 -99823 360464 -1377649
1056A061263a140135H25636O15693a057855A084983E32542j26104d89189G84032
1046b13403l65846A23984J16157a629549C68410J24927K74860k16510d43657H46900
1035C39641f50817J36859l40994B183075D04390f99410B185106a250566E98411
1025a511461a60908B9764b76694j98963j37617C40370a044095E39984B26158c28748
1014A54736a36954H12684K48841A83628d60282A452850a093075F7144J036796
1005A103940m65753k27591o8037g79969F47835a45892j733827A618036C86646
995b468796F38129d87239D64636J942951d92137C03315g25151l03127d08005I85406
984E7714L28187c10046A629070a96518n38718c08829F09159i73842E57340A40428
$$ plain form
1056 1061263 -1140135 825636 1441329 -1057855 1084983 532542 406438 -489189 784032
1046 -213403 -579249 123984 240141 -1629549 368410 493337 768197 551687 -443657 846900
1035 339641 -650817 -513958 -854952 2183075 404390 -699410 2185106 -1250566 598411
1025 -1511461 -160908 29764 -276694 -475657 -613274 340370 -1044095 539984 226158 -328748
1014 154736 -136954 812684 1061525 183628 -460282 1452850 -1093075 67144 1103940
1005 1103940 638187 410596 342559 -779969 647835 -145892 -1879719 1618036 386646
995 -2468796 638129 -487239 464636 2407587 -492137 303315 -725151 -1028278 -408005 985406
984 57714 385901 -310046 1629070 -196518 -735236 -308829 609159 -973842 557340 140428
973A416922h63969a31073C94471O95314j87322g91916G36976a367349c05331A108709
962C10977J617313a176386A60239P48579c36566C10547e18091F33450C11655e34496
951A959951e22403C2105R22948f93390B72028h75600K37236g7151j480136E32133
940B50780L9358H6366N3960a130278D24200O35296h7478j478972M15845A84089
929A597553a201771C35185c04048G12247h17559J9380C85505d20314B09860a035150
918D43452Q4928a511294C66851b9933F67016d18248R2168k463B417496g41383
907a65093A401114a34037p60880b59124I40401e56260F53305a171741B352739
897a207948H39104Q51586d0148G20259F2574a013435A564532p78563a114046A280326
$$ plain form
973 1416922 -863969 -131073 394471 1089785 902463 -791916 736976 -1367349 -305331 1108709
962 310977 1928290 -1176386 160239 908818 -336566 310547 -518091 633450 311655 -534496
951 1959951 -522403 32105 955053 -693390 272028 -875600 -638364 -77151 -1557287 532133
940 250780 290138 86366 140326 -1130278 424200 1059496 -87478 -1566450 -1150605 184089
929 1597553 -1201771 335185 -304048 712247 -817559 -798179 385505 -420314 209860 -1035150
918 443452 528380 -1511294 366851 -29933 667016 -418248 -326080 -328543 2417496 -741383
907 -165093 1401114 -134037 -894917 -259124 940401 -556260 653305 -1171741 2352739
897 -1207948 839104 1690690 -40148 720259 62574 -1013435 1564532 785969 -1114046 1280326
886B48295e16101h5570I2414e69042A500351D61744h03075L28131m20491G35959
875a390025k4288O74729r72708g06874E20924a026842l4216d41442n123461k5927875
865c1492778j21850158b258789H1757734R6991707a0310586k795537d791250q01196
857e592446b490650l26436m2520h00272Q5221K20898k87522J3570L62073F6364
846A153026a435482d21690i1102A171786a725738Q22895d21013j663826C464665
836a742137A86206g45550B56510J46726L34123j54999P91089c64006F11035P98578
826A409613b402868F86758K08503D31851b20478j71843n3093i3514A87287a027498
815B68972f98060A241917e92804R4747j733495B663081p76866e00837H96704f8500
$$ plain form
886 248295 -516101 -85570 92414 -569042 1500351 461744 -803075 -474944 -895435 735959
875 -1390025 -1414313 -739584 -1712292 -706874 520924 -1026842 -1061058 -441442 -5564903 -31492778
865 -31492778 -153342936 -2258789 81757734 178749441 -10310586 -13106123 -4791250 -5592446
857 -5592446 -2490650 -2817086 -2859606 -800272 -715051 -494153 -781675 -768105 -406032 66364
846 1153026 -1435482 -421690 -91102 1171786 -1725738 -902843 -421013 -2084839 3464665
836 -1742137 186206 -745550 256510 403236 737359 582360 1373449 -364006 611035 1409613
826 1409613 -2402868 686758 895261 431851 -220478 -392321 -445414 -93514 187287 -1027498
815 268972 -698060 1241917 -592804 -498057 -2231552 2663081 1886215 -500837 896704 -68500
804H04457f3482o0422j79835r17444A639103a070763G26771d6704j37383j251856
794a435943G82613b89087j190706A148015E25673c26003k476116I00784J535481
785B436265B90610c89902G84785a86179k41489F68955f30276A007730h79982C01118
774E27709F6483M11919h38498A429622n67819a43116j222333A043804A82483f78612
763A733622p25617d42018j6739A195311C66136a383288B31036a119825b3762r67982
753i91744E66176b92060B015034B60267Q88222m23499i90216j13468M98071A806989
742F70456b300151C8167M47173A00898b97553C84558J834662A69256N67474b291155
731D80334K3544R64480i63875B064738i33644K07409B0284J71680L55155f98962
$$ plain form
804 804457 -63482 -123904 -303739 -1221183 1639103 -1070763 726771 -46704 -184087 -1435943
794 -1435943 782613 -289087 -1479793 1148015 525673 -326003 -2802119 900784 2436265
785 2436265 290610 -389902 784785 -186179 -427668 668955 -630276 1007730 -879982 301118
774 527709 66483 478402 -838498 1429622 861803 -143116 -1365449 1043804 182483 -678612
763 1733622 1008005 -442018 -458757 1195311 366136 -1383288 231036 -1119825 -23762 -991744
753 -991744 566176 -292060 2015034 260267 1148489 724990 -990216 -1103684 -605613 1806989
742 670456 -2300151 38167 485340 100898 -297553 384558 2219220 169256 736730 -2291155
731 480334 503878 1468358 -963875 2064738 -933644 -726235 20284 191964 547119 -698962
720f89306K12595a72067j122008A67354a50753C31927J65875A86425a57493D98668
709B88702H2358R99142a212263A033139k47285a608441B200559d13620j311761
700a725381h46174A570131m64268K00539G2145c90969E67616g04187G75946a107975
689D77744O60089q0859A66814g75722j30552D4435c41892j09197P8421B364417
678a081890B075663B07018P5954D0473b089017f48631A50307O65905A8942a140959
667A876471h21172E34396k67023f48377a27651j036907a2400B742510i64252a86197
656A51218g91201j024055b36208F41803O33469c53277k288853H98368g0434l93544
646d63978B37782M46977E7745K34957a193300I81362B54133J88305f22972a19885
$$ plain form
720 -689306 -476711 -172067 -1294075 167354 -150753 331927 497802 186425 -157493 498668
709 288702 82358 1081500 -1212263 1033139 785854 -1608441 2200559 -413620 -1725381
700 -1725381 -846174 1570131 1105863 1306402 72145 -390969 567616 -704187 775946 -1107975
689 477744 1137833 1056974 166814 -775722 -906274 44435 -341892 -451089 -372668 2364417
678 -1081890 2075663 207018 282972 40473 -2089017 -648631 150307 816212 18942 -1140959
667 1876471 -821172 534396 267373 -648377 -127651 -1164558 -12400 2742510 -964252 -186197
656 151218 -791201 -1815256 -236208 641803 1275272 -353277 -2642130 898368 -70434 -463978
646 -463978 237782 684759 57745 292702 -1193300 981362 254133 442438 -622972 -119885
635a622483F67859j12349e78019A773745e5035C15942a542391o4168A069743M29365
625A499108A37280i94299F42833J297518a581073O79784b88824E69230a32791
615C30838R54871c68467L968k40733B18897a4593A357726a449978D58699d8303
604E69783h06773F73691C16171a090364f7896E59152a001836C05132d3809j926218
594a970027E09485f670o6777C502554F85438k60444h5130j343427B575888f7858
583f99181B6905a497426B43103N22975c36831B538023h24453c8803H13737N49554
573A363291d99107j551344G13521B02309J36848m5902c30012A86674d26997a90323
562a321252E32373a52889I01211e73989A040666a068052H32459C48732a314503
$$ plain form
635 -1622483 667859 555510 -578019 1773745 -55035 315942 -1542391 -1606559 1069743 1499108
625 1499108 137280 -994299 642833 1940351 -1581073 -901289 -288824 569230 -132791
615 330838 1285709 -368467 -364499 -605232 218897 -14593 1357726 -1449978 458699 -48303
604 569783 -806773 673691 316171 -1090364 -67896 559152 -1001836 305132 -43809 -1970027
594 -1970027 509485 -6670 -73447 3502554 685438 424994 -85130 -1428557 2575888 -67858
583 -699181 26905 -1497426 243103 766078 -336831 2538023 -824453 -38803 813737 1363291
573 1363291 -499107 -2050451 713521 202309 339157 293255 -330012 186674 -426997 -190323
562 -1321252 532373 -152889 901211 -573989 1040666 -1068052 832459 348732 -1314503
552C07957j9788d37096k02336J52421E76119Q37519a327579C53362A43147f54299
541A078165a138534C55921a67704A098244k91868C0999b72478B75946J53590e80819
530A551537a465104c66892r26440A591457f06097D40768K11082A13243a539368
520A5152f00971k42513J878L77918f6480q80533A480177i7737D80143a11561j283372
509a394933A472384B6056d467j085421L96001a82216m87260E62458B3447P45895
499G69342a42092d3946G213a9520B81565a528768M33194C35018e4607A058764
488a049951M58884a06052l76073I42387b175824i26108k711B33053R07935m95928
478F45060c73562A615996h82167c29268q1429p18839n53513A3886P32608h40002
$$ plain form
552 307957 288169 -437096 -639432 -487011 576119 1413638 -1327579 353362 143147 -654299
541 1078165 -1138534 355921 -167704 1098244 806376 30999 -272478 275946 429536 -580819
530 1551537 -1465104 -366892 -1293332 1591457 -606097 440768 651850 113243 -1539368
520 15152 -600971 -843484 -841606 -463688 -66480 -947013 1480177 -97737 480143 -111561 -1394933
509 -1394933 1472384 26056 -4467 -1089888 -693887 -182216 -669476 562458 23447 769342
499 769342 -142092 -43946 7213 -19520 281565 -1528768 -1095574 335018 -54607 1058764
488 -1049951 -591067 -106052 -482125 942387 -2175824 -926108 -928819 233053 1140988 645060
478 645060 -373562 1615996 -882167 -329268 -410697 -1129536 -1683049 13886 746494 -840002
467B932i53711G18872a337374A629167C99031O39Q75526a563122d58625F33416
456h00333e1646k88089l6463A233365o14164A83938M56297i25506b53650A398085
445F01732J382768D0256i52478j071710A51760R036M81285j47500e61415q1214
435f42629H94143C88530a645147E67348K77350l45118P9249f84058A263456q2651
425A180805g42838b17775A760125a075560B009293a334481m39765A015204a09387
415c70014k65125G24804o9203a74263l93149a949j68064A415238g80942G1228
404e17566p48431O04731b28377G09861A16771Q93797d76411j41184A988652a277095
393H89907R61925a23274l50532G64380b6144p62024C86068A4664M14980d73311
$$ plain form
467 2932 -953711 718872 -1337374 1629167 399031 399670 1275196 -1563122 -458625 633416
456 -800333 -51646 -339735 -376198 1233365 619201 183938 640235 -925506 -253650 1398085
445 601732 1984500 40256 -952478 -2024188 151760 160796 642081 494581 -561415 -642629
435 -642629 894143 388530 -1645147 567348 844698 499580 578829 -684058 1263456 1180805
425 1180805 -742838 -217775 1760125 -1075560 2009293 -1334481 -1774246 1015204 -109387
415 -370014 -635139 724804 655601 -174263 -567412 -1949 -170013 1415238 -780942 71228
404 -517566 -1265997 -661266 -228377 709861 116771 1010568 -476411 -617595 1988652 -1277095
393 889907 1851832 -123274 -473806 764380 -26144 -788168 386068 14664 429644 -473311
382D33885b83825j169682D86514L86879B29471d04461k795229d13164G06763b70297
371i37776A205315k95028l7766a80748A351312a408189A78799c96904p2886A125272
360C20680M09248H3994B8711L22896a354366C14175O22312c17142F42755k56536
350C86219a175011E63982B41472N2991O98267e27777o4693p15523E5395a90152
339A681029l66517c26631A253614A25929b244395I93429g34239J55601A58187
329a77686F90955B02464O02245f20816A290496a46661B9425d72254a65812m653
319a70465k8671B59983J111335g77276A835769C62290L51980i85499b18521j353932
309a572453d44040C12389i29702G70057E707J70582a74368l53329J89282H4128
$$ plain form
382 433885 -283825 -1453507 486514 873393 229471 -404461 -3199690 -413164 706763 -270297
371 -937776 1205315 910287 872521 -180748 1351312 -1408189 178799 -396904 -469790 1125272
360 320680 729928 83994 28711 351607 -1354366 314175 936487 -317142 642755 386219
350 386219 -1175011 563982 241472 294463 992730 -527777 -592470 -1307993 55395 -190152
339 1681029 1314512 -326631 1253614 125929 -2244395 993429 -734239 -578638 158187
329 -177686 690955 202464 804709 -620816 1290496 -146661 29425 -472254 -165812 -170465
319 -170465 -199136 259983 1371318 -777276 1835769 362290 714270 -985499 -218521 -1572453
309 -1572453 -444040 312389 -929702 770057 5707 176289 -174368 -527697 -338415 84128
298a493282e849I41032B70136J46032f80430A460770n72026a549353B63255J57244
288D20499a898289D51961g40968a7388j068568M51359A099592f67175B33459o8281
278A65178J03496J037519g54525b63160A3798M91142c48545C14328a47587F52021
267A14377J34980f5003F15797k86289J25602f51302b75758D97050a487695c18831
256c70254A573451g04937F1187P54376K35978f29991F80129J044111a080150j051396
246b131546E22357d67081A608383i55947d30407D19180d09536k21227F33520c94893
235e49034b18954G9563k4037M06879k7529J7573J63427R16295a124648A962004
224H73845k70014A93312b2834q50784A151347a74920D87523a231750A043085i5918
$$ plain form
298 -1493282 -5849 941032 270136 416168 -680430 1460770 888744 -1549353 263255 420499
288 420499 -1898289 451961 -740968 -17388 -1085956 -634597 1099592 -667175 233459 165178
278 165178 268674 1306193 -754525 -263160 13798 504940 -348545 314328 -147587 652021
267 114377 249357 -65003 615797 329508 455110 -651302 -275758 497050 -1487695 -318831
256 -370254 1573451 -704937 61187 815563 1051541 -629991 680129 1724240 -1080150 -2131546
246 -2131546 522357 -467081 1608383 -955947 -430407 419180 -409536 -630763 633520 -394893
235 -549034 -218954 79563 55526 462405 434876 452449 615876 1532171 -1124648 1962004
224 873845 603831 193312 -22834 -873618 1151347 -174920 487523 -1231750 1043085 -95918
213A291772f16086o16902A507556m51937f79967H95448f53239A40815d45866a89161
202a319727A294887i69864a3717C78888a168918N41607A424673J6473m88163p1365
192H81618h11736C98095e56836A158960b27543A794428g02689L09296G20516j71927
182E48589c53326G57193a182894B97676c28682C16651N49552a672320C57144b73902
171A016132a52863A269472a662968A096729C79863a567862I2518i70949B104254
161e62637k19667K02376D74369G4913i64506C24519a29824m31381j305681A196820
150B95866h6668F54503P30622c53604j07475l74220C27548b417917A177051a213318
139D27740J690843b139522D06693a549319L52885g344m60638B7241a82941B050931
$$ plain form
213 1291772 -616086 -1232988 1507556 1055619 -679967 895448 -653239 140815 -445866 -189161
202 -1319727 1294887 -969864 -13717 378888 -1168918 -627311 1424673 1441146 952983 881618
192 881618 -811736 398095 -556836 1158960 -227543 1794428 -702689 -393393 720516 548589
182 548589 -353326 757193 -1182894 297676 -328682 316651 866203 -1672320 357144 -273902
171 1016132 -152863 1269472 -1662968 1096729 379863 -1567862 92518 -970949 2104254
161 -562637 -782304 -579928 474369 74913 -964506 324519 -129824 -561205 -1866886 1196820
150 295866 -86668 654503 1385125 -353604 -461079 -835299 327548 -2417917 1177051 -1213318
139 427740 2118583 -2139522 406693 -1549319 -1196434 -7344 -467982 27241 -182941 2050931
128i97093d3435o8266B340596A37456d3054A506810F220J592984k57143a43506
117B68410a786297A73245k1073N3084a847411F86653B08409a168094D06233N7200
107D63433H256P36471A3922e5996k20003a00120p59654H1372K323120d50994K10809
96b40185B41187J278351G2918h65323C04260a25761F16457J46170a025093I11686
85C73375d37898j94695K59159F14122L26963b07414j56329N398j28192A50784
74a033139A3895f50101k08822E66511k16893g87729A947049G06387B23103N09425
64G32528a171866A41942m9434c53946E64922N8002d09057B09314Q04981g74866
53a676464a12244o19661A275617B44388Q45886L8971c80313A014524A08615a103030
$$ plain form
128 -997093 -43435 -111701 2340596 137456 -43054 1506810 6220 1599204 1342061 -143506
117 268410 -1786297 173245 152172 205256 -1847411 686653 208409 -1168094 406233 463433
107 463433 8256 744727 13922 -55996 -275999 -100120 -859774 81372 2404492 -450994 -240185
96 -240185 241187 1519538 72918 -865323 304260 -125761 616457 762627 -1025093 911686
85 373375 -437898 -632593 -373434 614122 941085 -207414 -363743 -358345 -486537 150784
74 -1033139 13895 -650101 -858923 566511 349618 -787729 1947049 706387 223103 732528
64 732528 -1171866 141942 92508 -353946 564922 622924 -409057 209314 1014295 -774866
53 -1676464 -112244 -731905 1275617 244388 1090274 1129245 -380313 1014524 108615 -1103030
42B315808c62884D22400L13076a685773j185995A639058G34212a96479A43742
32A45815e58466q67381c79373B50824a255087M62137p41974A140730a389095A35848
21A02033J862369B37181d56594C17273i79105H23550a307504b22689C18977j24048
11A94929Q3166R2325i60268b21392a09367D7644K094443a361705E95010j98550
1C96460g7791
$$ plain form
42 2315808 -362884 422400 735476 -1685773 -2871768 1639058 734212 -196479 143742
32 145815 -558466 -1425847 -379373 250824 -1255087 -792950 -1534924 1140730 -1389095 135848
21 102033 1964402 237181 -456594 317273 -979105 823550 -1307504 -222689 318977 194929
11 194929 278095 370420 -960268 -221392 -109367 47644 2142087 -1361705 595010 396460
1 396460 -77791
##PAGE= F1=14468.87790263
##FIRST=     21204.543296753, 3104.07366071428, 157377
##DATA TABLE= (F2++(Y..Y)), PROFILE
2047A57377J090941m38145f97662A44985O41768B70665d05469N0215a71768j081687
2037a253455A62168B6577b630139e46970F85159h71907j74792A016282d96034
2027A57467J135337f00121K26698I54928f9358r60413E10678a328589A117204
2017I3724i76483G40700B2754L84375a825668A643736e99662m26216j098991A392159
2006D62531f70429H17800a569300B02839g67897m84822A69938K04663P20162K83313
1996A378076f69520G02367L38803E0965d63809A148871b90646n38397B64456H0307
1985a565872E42390b625679l826386m775518a800809A243899O15324J471365c04525
1975C23162a001096A03719J109338A73337O18947a9519B52510e5889A037932c54991
$$ plain form
2047 157377 1248318 810173 -697662 144985 786753 270665 -405469 -355254 -171768 -1253455
2037 -1253455 162168 26577 -2630139 -546970 685159 -871907 -1046699 1016282 -496034
2027 157467 1292804 -600121 -373423 954928 -69358 -1029771 510678 -1328589 1117204
2017 93724 -976483 740700 22754 407129 -1825668 1643736 -599662 -1025878 -2124869 1392159
2006 462531 -670429 817800 -1569300 202839 -767897 -1252719 169938 374601 1094763 1378076
1996 1378076 -669520 702367 1041170 50965 -463809 1148871 -290646 -829043 264456 80307
1985 -1565872 542390 -2625679 -6452065 -11227583 -1800809 1243899 1859223 3330588 -304525
1975 323162 -1001096 103719 1213057 173337 792284 -19519 252510 -55889 1037932 -354991
1964A335546i68021A442864D63567i45784A511509F6672g67583b41636A98882
1954D83016B9117P27903e78481J21755J68840m20112o24718A262508a330113f17331
1943a209054F32080d65496o5869F91613P81288e30838q89657E92087B12i99560
1932e63736D84872r9731L29837G4464a563016K16128A520892e6857j272616A070053
1921E8063L12801a150790J34575b92442H17082f60416E90405R6821a197027e79248
1910b4610j183074A480424a438835E12846J825716B77967d24254n23164A26168
1900F55006k75740l4446i05871A534875C42730g07319K18245A038016e66302B239597
1889g98000C25352C7908c039k609236G45430J051422A81033J096325c96042A514224
$$ plain form
1964 1335546 -968021 1442864 463567 -945784 1511509 66672 -767583 -241636 198882
1954 483016 29117 757020 -578481 -456726 -287886 -707998 -1332716 1262508 -1330113 -617331
1943 -1209054 632080 -465496 -531365 691613 1472901 -530838 -1420495 592087 212 -999560
1932 -563736 484872 385141 714978 74464 -1563016 -1346888 1520892 -56857 -1329473 1070053
1921 58063 370864 -1150790 -1016215 -292442 817082 -660416 590405 687226 -1197027 -579248
1910 -24610 -1207684 1480424 -1438835 512846 2338562 277967 -424254 -947418 126168
1900 655006 379266 344820 -905871 1534875 342730 -707319 -489074 1038016 -566302 2239597
1889 -798000 325352 37908 -3039 -2612275 745430 1796852 181033 1277358 -396042 1514224
1878a96123k05035E32785a625168B264168a494831B59844P61825f82118a37582
1868G29525C58365m9315D0042b41706B14668J617826C31269a188130F23368d3993
1857D04177H5633a29112m63495A9386K15879J129341c777A309144a48948l37747
1847d86695r8319A669846q15317a439461B196157K558478L792086C975624b734017
1837a608450A709940a578055M89772G59143e83261B77253h78668c05253n85188
1828h90441A43993d330B39758m1693J478822i84366A480816d64907G1238L2838
1818A04076O99859h89145I31143b450309G6785a293171B86785a664382I31972
1808B06372h48120H28702a56715N4319I7260C1896Q98921g02960q56237F48503
$$ plain form
1878 -196123 -401158 532785 -1625168 2264168 -1494831 259844 1021669 -682118 -137582
1868 729525 358365 309050 40042 -241706 214668 1832494 331269 -1188130 623368 -43993
1857 404177 85633 -129112 -592607 19386 235265 1364606 -3777 1309144 -148948 -486695
1847 -486695 -585014 1669846 854529 -1439461 2196157 4754635 8546721 3975624 -2734017
1837 -1608450 1709940 -1578055 -1088283 759143 -583261 277253 -878668 -305253 -890441
1828 -890441 143993 -4330 239758 198065 1676887 -984366 1480816 -464907 71238 104076
1818 104076 803935 -889145 931143 -2450309 76785 -1293171 286785 -1664382 931972
1808 206372 -848120 828702 -156715 -102396 97260 31896 930817 -702960 -1559197 648503
1797a764630h07455G98847k03691d74887F54952k34425b51838j053961B045910
1787b016892E79285D9444b0060j970041B27412L52378H6873a126852C31715e6631
1776a739350L56936A51495f37337A362171f97447R4981F85074i71005D94021d21477
1765a170713k26409d1819D26374a703418b44044A301012E80070f90341k532411
1756c222752B595858B22636E0568K35893g03018q3587G95741a654868b07725A47656
1745a064240m87379b3049k84308A327858K26165a383723e09850l71149E65797
1735G76609b85900j13898K1184H75298p2261A92756K12078P75018a882558G01126
1724a368178o32341A097815g11953k06927B02072L9343b85494l20771b88397D09017
$$ plain form
1797 -1764630 -807455 798847 595156 -474887 654952 420527 -251838 -1305799 2045910
1787 -2016892 579285 49444 -20060 -1990101 227412 579790 86873 -1126852 331715 -56631
1776 -1739350 -1382414 151495 -637337 1362171 -697447 -602466 685074 -971005 494021 -421477
1765 -1170713 -1397122 -41819 426374 -1703418 -244044 1301012 580070 -690341 -3222752
1756 -3222752 2595858 222636 50568 286461 -703018 -786605 795741 -1654868 -207725 147656
1745 -1064240 -1551619 -23049 -307357 1327858 1554023 -1383723 -509850 -880999 565797
1735 776609 -285900 -399798 -378614 875298 803037 192756 404834 1179852 -1882558 701126
1724 -1368178 -2000519 1097815 -711953 -918880 202072 241415 -285494 -606265 -288397 409017
1713D81124f14336n13139D88728E3288d08257j37415A659393b117837A284294
1703A149857E9703Q09660i43651D07754a080476b97473A92546f30483f8743j3679
1693h2422C13573Q24931E24734g03059A022944m32129J72930e81927e3092q26414
1683h79506D35020K69007f78597F21576c158142a277902M71579A68697a62006
1673D81074L41511g26741A294578E15605j82701J041446g45442B169640j052318
1664A117322g53203g6472j105124E69623m7397O12583a996993a19748j67607A457976
1653a59523j30293j80654c4416m64135m7110A708095p95634k47267f61309E29403
1642B93305r9803e28419A8604a504410D74971a871443B036206d30907F12954a437621
$$ plain form
1713 481124 -614336 -1127475 488728 53288 -408257 -545672 1659393 -2117837 1284294
1703 1149857 59703 869363 -943651 407754 -1080476 -297473 192546 -630483 -68743 -82422
1693 -82422 313573 1138504 524734 -703059 1022944 590815 763745 -581927 -53092 -879506
1683 -879506 435020 704027 -678597 621576 -3158142 -1277902 -806323 168697 -162006
1673 481074 822585 -726741 1294578 515605 332904 1374350 -745442 2169640 1117322
1664 1117322 -753203 -76472 -1181596 569623 522226 1134809 -1996993 -119748 -287355 1457976
1653 -159523 -289816 -470470 -34416 -498551 -545661 1708095 912461 665194 -661309 529403
1642 293305 193502 -528419 18604 -1504410 474971 -1871443 2036206 -430907 612954 -1437621
1631B146120A65857a884407B92711f98875A21862a224998A160825h64245G90081
1621a73037B88979g30518B61578e81109C29108K61399k19252a645670A226059
1611G51942f54050A225593C11881e87167A571288a336716J64043A503420G00847
1601D69373j52676j47859g59701c39812D51166i01014F79517d8749m18898A38637
1590H24412h61308K7139A083468a88453i2920j600440a87544I47023a47170K9636
1580a17534l64006j8195A003975e48136A143672b68049j91125a70021o4081E47074
1569h14843F75203a21240q44286B83301f12347K33483M5947j437865b36217n2289
1559b88506G24525b24612k44277D38919L74738a114225A694724o73957j88737
$$ plain form
1631 2146120 165857 -1884407 292711 -698875 121862 -1224998 1160825 -864245 790081
1621 -173037 288979 -730518 261578 -581109 329108 590507 371255 -1645670 1226059
1611 751942 -654050 1225593 311881 -587167 1571288 -1336716 -1172673 1503420 700847
1601 469373 316697 168838 -759701 -339812 451166 -901014 679517 -48749 -467647 138637
1590 824412 -861308 -834169 1083468 -188453 -92920 -1693360 -187544 947023 -147170 -117534
1580 -117534 -481540 -499735 1003975 -548136 1143672 -268049 -459174 -170021 -234102 547074
1569 -814843 675203 -121240 -965526 283301 -612347 -378864 -332917 -1770782 -236217 -288506
1559 -288506 724525 -224612 -468889 438919 813657 -1114225 1694724 1020767 832030
1550H32030B52241K97022A31704f00637A131775k30628R37107i20867G27391d37033
1539D43840a293611A460144h6249D1878J150092f51496G7291a145561G4548M35861
1529E10409a331653G03633a439061C93810b429k18563k07343A017648j96984P9453
1519I00117A99511L074910a192517l72670A262756F1430e22423A875456f28155
1509A438084c19108j89398e6757C95170g41815J89608M4381J5524C06688c56113
1498C19609g11765J16749f7931C92129J146954b47577F52888k32439J482900a938487
1487A094466M59206C83930b420220f05629I4120d67577f3721p29158B87941a275409
1476a02159j426174A627991l7371c67559m95568E24060c87132A288731f18227
$$ plain form
1550 832030 252241 549263 131704 -600637 1131775 901147 1838254 -920867 727391 -437033
1539 443840 -1293611 1460144 -86249 41878 1191970 -651496 77291 -1145561 74548 510409
1529 510409 -1331653 703633 -1439061 393810 -2429 -220992 -428335 1017648 820664 900117
1519 900117 199511 3274421 -1192517 -1565187 1262756 61430 -522423 1875456 -628155
1509 1438084 -319108 -508506 -56757 395170 -741815 -552207 -507826 -492302 306688 -356113
1498 319609 -711765 -595016 -67931 392129 1539083 -247577 652888 420449 1903349 -1938487
1487 1094466 1553672 383930 -2420220 -605629 94120 -467577 -63721 -792879 287941 -1275409
1476 -102159 -1528333 1627991 1590620 -367559 -863127 524060 -387132 1288731 -618227
1466A777338g12047J53375A654296a112707I42784B3884J34896a013962G2302
1456A275931a183438A95693a244013H95875b75984n30628E33678a76757C75423
1446A92906d79459n53026H79704h19426E96682a041867A420992e73180K21246
1437c51934B100647e84371B13022a131459B691633b208413d65200A065392Q54235
1428A919627a875126e78888a58754G63000f71925A269916a787223A891845a218274
1418d04278A073461j87954B85040g05958a97224j538475a97044A7768J42889Q65241
1408A025898e50368j115548H55092B54571i2653o33867A541955C48247a283929
1398g51577G07568O73562B55767M65728a714898C86143K52994b79146A58918f83062
$$ plain form
1466 1777338 -712047 -558672 1654296 -1112707 942784 23884 158780 -1013962 72302
1456 1275931 -1183438 195693 -1244013 895875 -275984 -806612 533678 -176757 375423
1446 192906 -479459 -1032485 879704 -819426 596682 -1041867 1420992 -573180 -351934
1437 -351934 2100647 -584371 213022 -1131459 2691633 -2208413 -465200 1065392 1919627
1428 1919627 -1875126 -578888 -158754 763000 -671925 1269916 -1787223 1891845 -1218274
1418 -404278 1073461 885507 285040 -705958 -197224 -1735699 -197044 17768 160657 1025898
1408 1025898 -550368 -1665916 855092 254571 -92653 -726520 1541955 348247 -1283929
1398 -751577 707568 1381130 255767 721495 -1714898 386143 639137 -279146 158918 -683062
1387e73794a69285A083410C99427L29887e26652j15615n22746F44264k24971A58332
1376H50023a749240d8342H44236B31151b3864F88691e06629a41861K1726l57005
1366d77140B396381d53075C72185J278328a689441G08472J1682a040595B068697
1356B23606c01320j119257D02046N91757C23212C4878g15665D88815N10952b323395
1345D82040K01646c98970A281389e99293m6590C194693d30218k15293C59130K90959
1335F50089i7666B66122i63855B860910I83431m77381m1717b745400H61128d34423
1324c91903H70067A64370a333282A54446J224845b235593i5271d3423m01503q59148
1314a304074G08935d89424G23344b939739A386902h99159b95493B009095f68235
$$ plain form
1387 -573794 -169285 1083410 399427 729314 -526652 -642267 -1165013 644264 419293 158332
1376 850023 -1749240 -48342 844236 231151 -23864 688691 -506629 -141861 -120135 -477140
1366 -477140 2396381 -453075 372185 1650513 -1689441 708472 720154 -1040595 2068697
1356 223606 -301320 -1420577 402046 993803 323212 34878 -715665 488815 999767 -2323395
1345 482040 683686 -398970 1281389 -599293 -645883 3194693 -430218 -645511 359130 650089
1335 650089 -97666 266122 -963855 2860910 983431 506050 464333 -2745400 861128 -434423
1324 -391903 870067 164370 -1333282 154446 1379291 -2235593 -95271 -43423 -444926 -1304074
1314 -1304074 708935 -489424 723344 -2939739 1386902 -899159 -295493 2009095 -668235
1304B159196e69980A014900E4967R34551a715992B478043d93372A303994l24398
1295I79596f41575q00539B608637G37505A37491d09447F14096J64825E3532g90926
1284D85801a004838A414618a70060j196900F5279Q9453g00205B321601j95932
1275B125669f41774o36833c61389A540930a993829B241458C89695a462823F22743
1265a402804E22090a081788I49920l71773a13336G54016K18853a288402A285347
1255a74863C2520Q30269C4791N9249J165144b83376j37888F1923P1126a058674
1244E59137Q15644d07659D69896a787667A08274O54471a98057l32676j834252
1235b364985A607093g89373l25453D85354M18588H2835e81955j34319B045041
$$ plain form
1304 2159196 -569980 1014900 54967 989518 -1715992 2478043 -493372 1303994 979596
1295 979596 -641575 -1442114 2608637 737505 137491 -409447 614096 778921 53532 -790926
1284 485801 -1004838 1414618 -170060 -1366960 65279 154732 -700205 2321601 2125669
1275 2125669 -641774 -1278607 -361389 1540930 -1993829 2241458 389695 -1462823 622743
1265 -1402804 522090 -1081788 949920 578147 -113336 754016 972869 -1288402 1285347
1255 -174863 32520 862789 34791 94040 1259184 -283376 -421264 61923 133049 -1058674
1244 559137 1374781 -407659 469896 -1787667 108274 762745 -198057 -530733 -2364985
1235 -2364985 1607093 -789373 -1114826 485354 903942 82835 -581955 -716274 2045041
1225c93831J18343H41603k45978f40902k56633D91446p525L0079a574288e11307
1214A095317l90365B18826h24744F82497B47776D9531b17652r10068B42617a65538
1203F89268e68341J39464J12205D89244L9594a384300A014638b062846G16069
1193C41114N53082a325496M5110a44657D45849k9123J805118d86582E462b14302
1182A646711C59913q4476R39173h56067k05393C75598d64134B83056O73532a028420
1171a981996a27735f308B097193c28098D53647b16615D31148N12518r3457b012050
1160A709824o24234e735n05026H03975J603646b690617C72571R28253D8098J270283
1150A318381f63733C86846a130716c1045G31201J213735F37343c06621q22226
$$ plain form
1225 -393831 -275488 841603 595625 -640902 -897535 491446 483921 514000 -1574288 -511307
1214 1095317 704952 218826 -824744 682497 247776 49531 -217652 -1127720 242617 -165538
1203 689268 -568341 -428877 -316672 489244 528838 -1384300 1014638 -2062846 716069
1193 341114 894196 -1325496 -1280386 -144657 445849 416726 2221844 -486582 5462 -214302
1182 1646711 359913 275437 1214610 -856067 -1061460 375598 -464134 283056 956588 -1028420
1171 -1981996 -127735 -6308 2097193 -328098 453647 -216615 431148 943666 850209 -2012050
1160 1709824 1085590 -5735 -510761 803975 2407621 -2690617 372571 1300824 48098 1318381
1150 1318381 -663733 386846 -1130716 -31045 731201 1944936 637343 -306621 -1128847
1141a128847b05530C135441C37159b382916B038871H97472h42464D79672J73586
1132F53258c38723J69049F69825g8900p90452J2729c76829A160479n29211g44410
1121e37889I25265i50906c4616n17441D79690J48402a503709B86769e48897G1233
1110B11959d37051F75268o6145a364551A47712K08129L85182j39512a217694G19559
1099E5712h93030k98847A401507C74197c16592B27886d21027D35683f01171o88989
1089a290160A955609G82599c6140j168630E42003Q40789b033831Q09681a95751
1079D24067K02914O77494a040798H78256b93698k15695b23564F41472a074426
1069a45333p32757H68785M98483C03457i56150F70272C22695J311286d60624C4567
$$ plain form
1141 -1128847 -205530 3135441 337159 -2382916 2038871 897472 -842464 479672 653258
1132 653258 -338723 -169674 669825 -78900 -869352 -856623 -376829 1160479 631268 -744410
1121 -537889 925265 -950906 -34616 -552057 479690 628092 -1503709 286769 -548897 71233
1110 211959 -437051 675268 609123 -1364551 147712 355841 741023 601511 -1217694 719559
1099 55712 -893030 -1191877 1401507 374197 -316592 227886 -421027 435683 -601171 -1290160
1089 -1290160 1955609 782599 -36140 -1204770 542003 1382792 -2033831 -1224150 -195751
1079 424067 626981 1304475 -1040798 878256 -293698 -509393 -223564 641472 -1074426
1069 -145333 -878090 868785 1367268 303457 -956150 670272 322695 1633981 -460624 34567
1058A12625a237799G51587a101780I66838J48998a099196A062416C65299J0421
1049C75720c30274F79631b51497N545B05566N8638a739065D48167R9256k68994
1039B78429N43186c49391E78475J78559e27869k28878J02512B313268B54198f06228
1028A970783a223345I44278a596713c69655B381b94776p1570m52615A04228i20680
1017C46550j16330b83187B21617E228Q19159J70520g5479m44908A682500a145378
1006a8869A200796C75428K43704G0964g63930I06010c49345j333802A584385E41439
995b287823F14043e27853D23012K046544d46823C79000e71264j68409K84132A053750
984A23713L81569h1844A868710c54574m93531b36528D63793h66534D76016A64081
$$ plain form
1058 112625 -1237799 751587 -1101780 966838 1115836 -1099196 1062416 365299 375720
1049 375720 -330274 679631 -251497 -245952 205566 264204 -1739065 448167 547423 278429
1039 278429 821615 -349391 578475 757034 -527869 -756747 -654235 2313268 254198 -606228
1028 1970783 -1223345 944278 -1596713 -369655 2381 -294776 -366346 -818961 104228 -920680
1017 346550 230220 -283187 221617 5228 824387 994907 -75479 -520387 1682500 -1145378
1006 -18869 1200796 375428 619132 70964 -763930 906010 -349345 -1683147 1584385 541439
995 -2287823 614043 -527853 423012 2469556 -446823 379000 -571264 -739673 -455541 1053750
984 123713 505282 -81844 1868710 -354574 -848105 -236528 463793 -866534 476016 164081
973A122707a276903C9107L96488P23638l22955h44917F65772a244536d19045A193947
962B42656J799456a328324C74559M36644c09776D02779g06512F32280k62831f60546
951A827964e87623A21389Q86446f49659a19856j081438M32881f7918j220427D63216
940A43262Q2278g9386C20355a304791F88827l2658c09594j121589J34599e8766
929A540639a062258A22886i0834F00732h22223p2832F02472d82368B90691a087186
918D06038n0215a668427C28652n3052N41820d31099q6773b37873B405011e76892
907c00401A245330c1824r55128c13602F45631c04550E12627a133973B869440a085392
896I90422M75674E3404P63158d1278r68231A727200p43389a213298A203993B90058
$$ plain form
973 1122707 -1276903 39107 435595 1159233 836278 -844917 665772 -1244536 -419045 1193947
962 242656 2042112 -1328324 374559 811203 -309776 402779 -706512 632280 369449 -660546
951 1827964 -587623 121389 1007835 -649659 -119856 -1201294 -768413 -67918 -1288345 463216
940 143262 225540 -79386 320355 -1304791 688827 656169 -309594 -1431183 -1296584 -58766
929 1540639 -1062258 122886 -90834 600732 -822223 -895055 602472 -482368 290691 -1087186
918 406038 355823 -1668427 328652 275600 817420 -431099 -517872 -237873 2405011 -576892
907 -300401 1245330 -31824 -986952 -313602 645631 -304550 512627 -1133973 2869440 -1085392
896 990422 1466096 53404 816562 -41278 -1009509 1727200 983811 -1213298 1203993 290058
885g27488g6290l3452c7595A196994D50527f99018L3059k61718E69948a342946
874a290031N42520j404669i63494C47446a207779K38493L15601n227666l2797879
865c8679230j49984178e179270A00600721J20171686a0249039o397065f024224
857f670118b799555r97572P28927a057456L65437Q4104k61800j77512b27678e082
846A260134a551914c18066J53672I75000a740687O69849i7889k096933C450517
836a642434A00589b39633B77731N9660N09044k83933P31510c29713F50483P33644
826A384127b621472E34136L81952C02838a59872j08038o0322J7508H8671f95083
815B48069h35321I50437f36010J54844j530362B506893o97829d32046I55403a24872
$$ plain form
885 -727488 -76290 -109742 -37595 1196994 450527 -699018 -665959 -927677 569948 -1342946
874 -1290031 -747511 -2152180 -963494 347446 -1207779 -969286 -653685 -5881351 -38679230
865 -38679230 -188663408 -5179270 100600721 220772407 -10249039 -16646104 -6024224
857 -6670118 -2799555 -3797127 -3068200 -1057456 -692019 -607915 -869715 -1047227 -227678 -5082
846 1260134 -1551914 -318066 -164394 975000 -1740687 -1070838 -97889 -2194822 3450517
836 -1642434 100589 -239633 277731 337391 846435 562502 1294012 -329713 650483 1384127
826 1384127 -2621472 534136 916088 302838 -159872 -267910 -328232 -310724 88671 -695083
815 248069 -835321 950437 -636010 -481166 -2011528 2506893 1809064 -432046 955403 -124872
804G05182A67000d8649j68006j131772A532231h21093F86754D7793c97463j115229
794a512692G75937b63706j059719A229112E95107d71498k271332I47701J437631
785B385332D05648b60444E75064a91461l17925D92459e06532A177439i48142D59339
774C78509a23637C98090h36791A565222o87789i2065j020235H87401E819e56359
763B007945E77732e37484J90388A198520C51151a504731E14186i56933E4200h09129
752e3237p3988B094673C75700O32775p7897a348915K27554a64198A656026m90979
742A165047b690121g98473E17155i4550J2906D06551J500533C51440K22112b253568
731C58335j29916J477887a158597B056804h45081k9561A24577a48123D08935g71298
$$ plain form
804 705182 167000 -48649 -216655 -1348427 1532231 -821093 686754 47793 -397463 -1512692
794 -1512692 775937 -263706 -1323425 1229112 595107 -471498 -2742830 947701 2385332
785 2385332 405648 -260444 575064 -191461 -509386 492459 -506532 1177439 -948142 459339
774 378509 -123637 398090 -836791 1565222 877433 -92065 -1112300 887401 5819 -556359
763 2007945 577732 -537484 -347096 1198520 351151 -1504731 514186 -956933 54200 -809129
752 -53237 -127225 2094673 375700 1008475 930578 -1348915 -1121361 -164198 1656026 1165047
742 1165047 -2690121 -798473 517155 -94550 -81644 406551 1907084 351440 573552 -2253568
731 358335 228419 1706306 -1158597 2056804 -845081 -874642 124577 -148123 408935 -771298
720h63983L25261E9329a279086C27768a30092A14671N71458l15812a5326E07771
709A01882J01785P37299h57700A119998n32808a449539B143782b82295j514976
700a797271g84746A460534k23990N8803i1029j91734D27368e14690E50673a021375
689D13170P80310l54509D02282i72481K05517f8472p8107m00749J20629A912891
678a076091B264154B59791q9607p1932b049597f89441A96937M33320f5099r02512
668i67611A922526h46235E35248I9844f08036g5626p91034B2090K970422e22597
657a71614N5903q19090p57509e17951I05273K35295c38664k424213I77728g9383
646f32215A11503R44560H2005L47092a133855A016362B04002J03031d55824a90771
$$ plain form
720 -863983 -538722 59329 -1279086 327768 -130092 114671 686129 370317 -15326 507771
709 101882 203667 940966 -857700 1119998 587190 -1449539 2143782 -282295 -1797271
700 -1797271 -784746 1460534 1236544 1295347 -91029 -282763 427368 -514690 550673 -1021375
689 413170 1193480 838971 402282 -972481 -766964 -68472 -146579 -547328 -426699 1912891
678 -1076091 2264154 259791 170184 98252 -2049597 -689441 196937 630257 -65099 -967611
668 -967611 1922526 -846235 535248 99844 -608036 -75626 -866660 22090 2992512 -522597
657 -171614 -115711 -934801 -1692310 -517951 905273 1140568 -338664 -2762877 977728 -79383
646 -632215 111503 1056063 82005 429097 -1133855 1016362 204002 307033 -455824 -190771
635a391215G34002l25719a92089A683130b14616C69934a287765k80827H25504
625A306755C4265a028115D95342J284894a444019N80928c47334E64299c08782
615B36066Q01293d42804J56861l52399A23678b46719A241616a274957D68874c08283
604F61536g50352H96159A30873a053711a0307G25574g82353C60957A08638a715450
593E33516B2011K6784L171026G44509k86920A0240a103154B435735B6456d41957
582D8555a514940A69104N08333f87451B924970a046191c23980F83822R69797e29945
571a873445E10483k31392M2533q4833h08391A91294b50017P0038j039390E34358
560c7344H32926e79151H67000e22430A194756A50162a352787A44847K94921A2044
$$ plain form
635 -1391215 734002 408283 -192089 1683130 -214616 369934 -1287765 -1568592 825504
625 1306755 34265 -1028115 495342 1780236 -1444019 -863091 -347334 564299 -308782
615 236066 1037359 -442804 -285943 -638342 123678 -246719 1241616 -1274957 468874 -308283
604 661536 -750352 896159 130873 -1053711 -10307 725574 -782353 360957 108638 -1715450
593 533516 22011 48795 3219821 744509 457589 10240 -1103154 2435735 26456 -441957
582 48555 -1514940 169104 677437 -687451 2924970 -1046191 -323980 683822 1653619 -529945
571 -1873445 510483 279091 321624 236791 -808391 191294 -250017 -179979 -1219369 534358
560 -37344 832926 -579151 867000 -522430 1194756 150162 -1352787 144847 439768 12044
549h44490K07891H18823R82613a573924C84456A48324e96877A194268i17379C07403
538H0829R30066m82044A70073a25539A96211J72126e96243A436217a855417b87819
527a282417A738379f65578C92512M68362a53043j353560A81325f76433j45964
518h22397L84559k17253a48054q97677A570892f54466F99199a42164j562156A568659
507e5025A72321a135768L89669f8575l38987A50398F3487O75921b04100j35121
497c39221A67836a74973B99235a664585M80998B29694e0348H06173h85150K81575
487f03575a30944l80100H77560b062436O97344O43613F628J406025D72351d06382
476A896465h40695c39748l06498n75266q0296a8968I99867i20855a42889q59958
$$ plain form
549 -844490 -636599 818823 1801436 -1573924 384456 148324 -596877 1194268 -917379 307403
538 80829 1010895 528851 170073 -125539 196211 368337 -596243 1436217 -1855417 -287819
527 -1282417 1738379 -665578 392512 860874 -153043 -1506603 181325 -676433 -822397
518 -822397 -437838 -655091 -148054 -1045731 1570892 -654466 699199 -142164 -1704320 1568659
507 -55025 172321 -1135768 -746099 -68575 -407562 150398 63487 739408 -204100 -339221
497 -339221 167836 -174973 299235 -1664585 -1183587 229694 -50348 806173 -885150 -603575
487 -603575 -130944 -511044 877560 -2062436 -1365092 -721479 6628 1412653 472351 -406382
476 1896465 -840695 -339748 -646246 -1221512 -1301808 -18968 999867 -920855 -142889 -1002847
466a002847G87368a213003A684996E17409p1787O07867a601194c39377G89806
456h51971b79941k12220k2654A409229F67824A28982J19011g33788L39509A609198
445F63398P86819b742q71251q81037D72055A95221M95023o5049e88344J79724
435d08620A289118A38796a672403E86631L97926C66748K57608e18033A113189
425H92886d46598a67119A645545g84612A943918a467692j5226I96059c63210J06412
415b56798n24716I24908A69906c63546K7760C2575K1568J137378g75441i4053
404e38054p29519b91456l36622G19993B90125O13812f70385c04221B173148a153284
393I66607Q02980e67554J51028I66931c21414k68267B50580D6390M13902f68189
$$ plain form
466 -1002847 787368 -1213003 1684996 517409 445622 1053489 -1601194 -339377 789806
456 -851971 -279941 -492161 -514815 1409229 667824 128982 247993 -733788 -394279 1609198
445 663398 1450217 -2742 -873993 -1755030 472055 195221 690244 625195 -588344 -408620
435 -408620 1289118 138796 -1672403 586631 984557 366748 624356 -518033 1113189
425 892886 -446598 -167119 1645545 -784612 1943918 -1467692 -1482918 996059 -363210 -256798
415 -256798 -781514 924908 169906 -363546 -335786 32575 54143 1191521 -775441 -94053
404 -538054 -1267573 -291456 -628078 719993 290125 903937 -670385 -304221 2173148 -1153284
393 966607 1769587 -567554 -416526 966931 -321414 -589681 250580 46390 460292 -668189
382F88075H6563a540304G40328j472A62497d79976k396349f39494A020024e18954
371i86732A409573o42713N9964c72441A419087a310464A40861b43704k08363A150701
360B92501N30797b10716A59225J06327a422921B29186Q54126d47307E10238q2539
350D27699a267617H31647B88266b00006I19255d31045j50688n34248A37705g7636
339A740513j49736c63921A175445B53344b258997F70610e18816j48970C8434a10550
328F58084B37832N58986d91434A331299a44511B04116d11757a63082q3124h6878
317A02763J212281g07577A723060C75568K34692i38718M06756j021341d16659
307C58257a062060E80901A78326O3848A12279g32210K0717A57478a457009a28154
$$ plain form
382 688075 86563 -1540304 740328 738856 162497 -479976 -2876325 -639494 1020024 -518954
371 -986732 1409573 766860 826824 -372441 1419087 -1310464 140861 -243704 -452067 1150701
360 292501 823298 -210716 159225 265552 -1422921 229186 1083312 -447307 510238 427699
350 427699 -1267617 831647 288266 -200006 919255 -431045 -581733 -1115981 137705 -77636
339 1740513 1590777 -363921 1175445 253344 -2258997 670610 -518816 -667786 38434 -110550
328 658084 237832 796818 -491434 1331299 -144511 204116 -411757 -163082 -246206 -86878
317 102763 1315044 -707577 1723060 375568 610260 -938718 -531962 -1553303 -416659
307 358257 -1062060 580901 178326 242174 112279 -732210 -711493 157478 -1457009 -128154
296A122860A8261K82293e79257A419257F27323a125290C02847K2925a863664D93515
285e00832d074j533188g53648A057360f55833B12630c7313A46124J013694e26975
274a15722j03978B68588e04649B52592d43540G43208d3004A43169B6101N18573
264E44674r0861n9055g29614L23297D67602a582030a46651j76912A350049f65430
253a7080E86856M92317e51080G02700J122077a223633p24827C21700f31453A528787
242i25467L53051D56019g0163n21570F77939i9159l64284J58843a20406C16024
231A12906M28392k5540J10617N55560a159762B068771I56955D34349A88274a35146
220i32230A259215a92486E06844a437174H29412b34115A387098e99155l90979
$$ plain form
296 1122860 18261 300554 -579257 1419257 627323 -1125290 302847 325772 -1863664 493515
285 -500832 -4074 -1537262 -753648 1057360 -655833 212630 -37313 146124 1159818 -526975
274 -115722 -219700 268588 -504649 252592 -443540 743208 -43004 143169 26101 544674
264 544674 453813 394758 -729614 -406317 467602 -1582030 -146651 -323563 1350049 -665430
253 -17080 586856 1079173 -551080 702700 1824777 -1223633 -1948460 321700 -631453 1528787
242 -925467 -572416 456019 -70163 -591733 677939 -99159 -463443 -304600 -120406 316024
231 112906 541298 515758 626375 1181935 -1159762 2068771 956955 434349 188274 -135146
220 -932230 1259215 -192486 506844 -1437174 829412 -234115 1387098 -599155 -990134
211i90134A330587k39712e21609H41729b67963D4923a36302m5605j150429A328668
200f93117a36113E24865a201757d73502A295712p3736m84575M6630g76212C69575
189f03451A216465E2990J360993g84063K82895C75605N80308c71259F43522a229939
178B02632a92222E91246J1943a783019C80462b44727I13175a20792A249567a281130
167E18485K07140a227124A66298h37671A669583e36174k43427J83505G23906a48034
156a208722C38052b56252k47117j147846A215762A04595b29444F43304R59425
147A602729c79538l53160J64160D4538b428489A527039a271301D78495J464896
138A943391b075494C35351a409723K7454B74214h86907B73996a25261B041483
$$ plain form
211 -990134 1330587 1090875 -521609 841729 -267963 44923 -136302 -181907 -1332336 1328668
200 -693117 -136113 524865 -1201757 -473502 1295712 1221976 737401 784031 -776212 369575
189 -603451 1216465 52990 1413983 -784063 -501168 375605 955913 -371259 643522 -1229939
178 202632 -192222 591246 603189 -1783019 380462 -244727 913175 -120792 1249567 -1281130
167 518485 725625 -1227124 166298 -837671 1669583 -536174 -779601 -596096 723906 -148034
156 -1208722 338052 -256252 -503369 -1651215 1215762 104595 -229444 643304 1602729
147 1602729 -379538 -732698 -568538 44538 -2428489 1527039 -1271301 478495 1943391
138 1943391 -2075494 335351 -1409723 -1382269 274214 -886907 273996 -125261 2041483
128a054996H5169b5976B026644A60375b8357A668199c09745A427636q5778a60260
117B57526b108041f0874C28199j1490b049147I31978G9974a361322D54496m2484
107D12012B0161N56874a81775o3246p9992J15874n28297A56334K115121b02326
96b09723D7994J449522g5785j099435C79846b30715G24349L4906a433494G54863
85D99454f59271i2973l65474F85635J05764b78190l43953L5376O6431B81304i41289
73B688g35828k37365C99358p5732h98200B034996F42491F7272N57084a060888
62A02138C2038e21986E38884q5800b74091G3385O12223d36776j245558D2432e97523
50A115399F9805Q92828J17096e99337I93539A43185a066830B222046c55609D82412
$$ plain form
128 -1054996 85169 -25976 2026644 160375 -28357 1668199 -309745 1427636 1341858 -160260
117 257526 -2108041 -60874 328199 316709 -2049147 931978 79974 -1361322 454496 412012
107 412012 20161 577035 -181775 -245021 -325013 -209139 -737436 156334 2271455 -202326
96 -209723 47994 1497516 -75785 -1175220 379846 -230715 724349 759255 -1433494 754863
85 499454 -659271 -92973 -458447 685635 791399 -278190 -622143 -586767 -520336 281304 -941289
73 2688 -735828 -973193 399358 323626 -898200 2034996 642491 67272 624356 -1060888
62 102138 32038 -521986 538884 453084 -274091 73385 685608 -436776 -1682334 42432 -597523
50 1115399 69805 962633 1079729 -599337 993539 143185 -1066830 2222046 -355609 482412
39G04262b035364p33143A420624o88784b98740a27032h016n47001r20020e82082
28B20275a101783L14475o35970A080492a240143e1599k5226B101475C92613e78952
17B29027h18525H63304a318865b47306B77192r9020J24552j4685h19326a71874
6a44539D03469J283346a532444F59564C02925c71536
$$ plain form
39 704262 -2035364 -2768507 1420624 731840 -298740 -127032 -8016 -555017 -1475037 -582082
28 220275 -1101783 -787308 -1423278 1080492 -1240143 -51599 -76825 2101475 392613 -578952
17 229027 -818525 863304 -1318865 -247306 277192 178172 302724 288039 -819326 -171874
6 -144539 403469 1686815 -1532444 659564 302925 -371536
##PAGE= F1=14447.07963274
##FIRST=     21204.543296753, 3104.07366071428, 47078
##DATA TABLE= (F2++(Y..Y)), PROFILE
2047D7078J253641F15992f64885G986Q07874B9797d77613J6175H3623a230619
2036b3021k54103k052210e49017F83189h41857l14014I05697e15447A01307J156208
2026A257515d23101J08298H55482a72608j070213G76411a195645A029310A38198
2016f64270E16255a79397G42745a828508A568502e59889o1575j503075A244738
2006D78027f60445C13330a259181D8616h29924l96556B82421l6812O21965L72499
1996A240073f63761H11813Q7957E6013b21034H69698b00563q91895D40567i3165
1985a322487E13113b811819l516511o935292b242137A178398N47773J593340b92699
1975C69837e43328A91538Q61786C07033L18265a29180D36925a70436H55132c71582
$$ plain form
2047 47078 1300719 615992 -664885 7986 815860 29797 -477613 -461438 83623 -1230619
2036 -23021 -277124 -2329334 -549017 683189 -841857 -1155871 905697 -515447 101307 1257515
2026 1257515 -423101 -314803 855482 -172608 -1242821 776411 -1195645 1029310 138198
2016 -664270 516255 -179397 742745 -1828508 1568502 -559889 -621464 -2124539 1244738
2006 478027 -660445 313330 -1259181 48616 -829924 -1226480 282421 245609 867574 1240073
1996 1240073 -663761 811813 899770 56013 -221034 869698 -200563 -1092458 440567 -93165
1985 -1322487 513113 -2811819 -6328330 -13263622 -2242137 1178398 1726171 3319511 -292699
1975 369837 -543328 191538 1053324 307033 625298 -129180 436925 -170436 855132 -371582
1964A343206i65704A317970B61342h67868A626919e920o87097a86784C66200J9218
1954C85418j75055N37949g85591L31034r9261k05494o74253A232943a269764M56609
1944h13155l48819E53373c54921k55785F68463J004283g80533o55950F58585a49511
1933h38767J50858C04281J55587M10459B61890a656484K29361A359017E9839a292526
1922H50306H1178L15378i76168p9867b26116H48340c52102E57825J39368a100431
1911d88984D3678a294457A769302a860300F08724J623902C20477d76783n24190
1902a000973C64894J97516L1720j57274i76493A307924D35939b80223n76370A537785
1891f36934B308429a245201D42286B03438c5885k330616D66727J372178C00745
$$ plain form
1964 1343206 -965704 1317970 261342 -867868 1626919 -5920 -693017 -186784 366200 385418
1954 385418 210363 748312 -785591 -454557 -553818 -759312 -1433565 1232943 -1269764 -813155
1944 -813155 -1161974 553373 -354921 -610706 668463 1672746 -780533 -1436483 658585 -149511
1933 -838767 -687909 304281 459868 870327 261890 -1656484 -1427123 1359017 59839 -1292526
1922 850306 81178 396556 -976168 -1056035 -226116 848340 -352102 557825 697193 -1100431
1911 -488984 43678 -1294457 1769302 -1860300 608724 2232626 320477 -476783 -1000973
1902 -1000973 364894 562410 594130 436856 -976493 1307924 435939 -280223 -856593 1537785
1891 -636934 2308429 -1245201 442286 203438 -35885 -2366501 466727 1838905 300745
1881A195251c80510A444221c38588J45994D34665a621832B633235a555318H43264
1871I87532f16830a44057F37967A45148L15012a50234J9127F1605K006191A85392
1860a101177F18864A64697C4830J73414d8961l66828A28593L5494J087258A15512
1849A348734a01263n51361J26126A754972p96845a508294B075141L026439N375769
1840A0477349C843810b813397a396127A685443a280163l38075I79985f27369A23183
1830h98282b54366n85143E9247j9740J16611M0970J635153a214586A193887d35552
1819I977P3128O21322i55092H99760b285850E5519a325866C60376a895001I92910
1808E85971a314407H67354e8461d344B20452h2205I55063g50869r24925G20142
$$ plain form
1881 1195251 -380510 1444221 -338588 -192594 434665 -1621832 2633235 -1555318 843264
1871 987532 -616830 -144057 637967 145148 460160 -150234 -131107 61605 2067796 185392
1860 -1101177 618864 164697 34830 208244 -48961 -415789 128593 164087 1251345 115512
1849 1348734 -101263 -652624 -526498 1754972 958127 -1508294 2075141 5101580 10477349
1840 10477349 3843810 -2813397 -1396127 1685443 -1280163 -1618238 979985 -627369 123183
1830 -898282 -254366 -839509 59247 39507 156118 197088 1832241 -1214586 1193887 -435552
1819 9977 83105 704427 -955092 899760 -2285850 55519 -1325866 360376 -1895001 992910
1808 585971 -1314407 867354 -58461 -4344 220452 -82205 955063 -750869 -1675794 720142
1797a571776f29890E78455j52113f42343F69153B21265c37164r70870A936890
1787b221819F03305A93286b25033j816167E25794b3444A39128h90377C69688b3448
1776a755476J71143B23527e93893A220093a039491d06911F55092g10671A49097
1766d60814l91482o65316e137D55978a457405c08271I95753l21886g34770k219922
1756b954692B669380E6056K06819P2718d97688l60621E85025a661112d4113B04127
1745a311622r4282a62772i615A294539J66872a301503N80791M2367D93357N91214
1735A084571d09460O4655a21303I44388k50731l28057L92847r3692a569908D54431
1724a739622j50398A163315f58662q13170D14959J3137a73807o42841L20232C74186
$$ plain form
1797 -1571776 -629890 578455 426342 -642343 669153 221265 -337164 -1308034 1936890
1787 -2221819 603305 193286 -225033 -2041200 525794 -23444 139128 -890377 369688 -23448
1776 -1755476 -1584333 223527 -593893 1220093 -1039491 -406911 655092 -710671 149097
1766 -460814 -852296 -1517612 -5137 455978 -1457405 -308271 995753 673867 -734770 -2954692
1756 -2954692 2669380 56056 262875 335593 -497688 -858309 585025 -1661112 -44113 204127
1745 -1311622 -1405904 -162772 -9615 1294539 1461411 -1301503 -720712 -678345 493357 1084571
1735 1084571 -409460 -344805 -121303 944388 693657 365600 758447 664755 -1569908 454431
1724 -1739622 -1890020 1163315 -658662 -1471832 414959 428096 -173807 -816648 -496416 374186
1713D19046d53150l54843F32928a20817k11070l69902A642097b008983A265863
1703A290089c21603G52547h96535B64460a102147b33454e8585m33943A13413a86578
1692D30155O12234C00602e07318A125017l74596N7690f22168i4779o81392C80956
1681E64756d44868D53987c392974a303996M19887E00780e74675D30857K82988
1672G13845g31375A402185A65965J30974J095190e70040A981357q73150i11698
1662d9514r00509B21875M75168M46471a501660a01694l54827A476803A11898h19747
1651d86130E3789e64643K41192A498971l09666n87962h45797D59053B05396n9148
1641A46248e63626a75102j375813D52503a804189A559398d33154H27172a412635
$$ plain form
1713 419046 -453150 -807993 632928 -120817 -331887 -701789 1642097 -2008983 1265863
1703 1290089 -321603 752547 -896535 264460 -1102147 -233454 -58585 -492528 113413 -186578
1692 430155 1042389 300602 -507318 1125017 750421 808111 -622168 -94779 -776171 380956
1681 564756 -444868 453987 -3392974 -1303996 -884109 500780 -574675 430857 713845
1672 713845 -731375 1402185 165965 296939 1392129 -570040 1981357 1108207 -911698
1662 -49514 -950023 221875 697043 1143514 -1501660 -101694 -456521 1476803 111898 -819747
1651 -486130 53789 -564643 -323451 1498971 1189305 601343 -845797 459053 205396 146248
1641 146248 -563626 -175102 -1550915 452503 -1804189 1559398 -433154 827172 -1412635
1631A905832D961a714284C18982g48832a024r10315A020154a141563H06066b09456
1620C58728f48430A16610d95436A86294O22714C89193a694296A396875m86174
1611I10701d30323A328413B19117g32622A124672a672406K73690A563798E79635
1601D89031k07649K5298f34806A74244J30469i33558A065968d00535O1034C2036
1590H62482f28456k35490A263063b16850O7580j256638a8473I36422d4350n5969
1580a00319o58585i9878A174117e31592A112664e92096b44975J02365K6824D77847
1569h93564E72476c1221p86105H2467g64412c09094l97187r61460a33702k18808
1559c52510E58707a21250l28726H37937L7289a168362A472383o10559l81258H5837
$$ plain form
1631 1905832 4961 -1714284 318982 -748832 -1024 -911339 1020154 -1141563 806066 -209456
1620 358728 -648430 116610 -495436 186294 809008 389193 -1694296 1396875 910701
1611 910701 -430323 1328413 219117 -732622 1124672 -1672406 -1398716 1563798 579635
1601 489031 281382 306680 -634806 174244 304713 -933558 1065968 -400535 -339501 32036
1590 862482 -628456 -863946 1263063 -216850 -149270 -1405908 -18473 936422 -44350 -100319
1580 -100319 -758904 -99878 1174117 -531592 1112664 -592096 -244975 -142610 -115786 477847
1569 -893564 572476 -31221 -817326 82467 -764412 -309094 -706281 -1667741 -133702 -352510
1559 -352510 558707 -121250 -449976 837937 875226 -1168362 1472383 861824 480566 85837
1548C31350j55126e48114A052898j18013J258683a311617H33981d38285E47158
1538a216365A229650E010J3094P51783e20826a04386j018065a6962B56425i84673
1527E94469a446461C72958a67848e3824j56593A063548k72873J8171B75014K464717
1517B739731a262077m16865A279643A95371g75181A697656f38377A698156a17598
1507e41522e6616D37851f99752K34320R9285m02193A81569d32277A63069h50525
1496g10619a79122E32684R26471b46670H33695m08488J721859a936678A110926
1486A739529D35772b415977e42681g6197n11114E0259g58341B30682a428896a62274
1475a695494A694097l6544c20058m77027E66870f24397A344482h68364A786573
$$ plain form
1548 331350 176224 -548114 1052898 934885 2193568 -1311617 833981 -438285 547158
1538 -1216365 1229650 5010 18104 769887 -520826 -104386 -1122451 -16962 256425 -984673
1527 594469 -1446461 372958 -167848 -53824 -210417 1063548 790675 808846 275014 2739731
1517 2739731 -1262077 -1678942 1279643 195371 -775181 1697656 -638377 1698156 -117598
1507 -541522 -56616 437851 -699752 -465432 -366147 -768340 181569 -432277 163069 -850525
1496 -710619 -179122 532684 1459155 -246670 833695 425207 2147066 -1936678 1110926
1486 1739529 435772 -2415977 -542681 -76197 -587311 50259 -758341 230682 -1428896 -162274
1475 -1695494 1694097 1657553 -320058 -797085 566870 -624397 1344482 -868364 1786573
1465g33851a83775A665003a343003A034598a60888b3056j184105C12607M91731
1456H04338a125930C68361a408810G31798h7479o01920B15372H6531K38780A15045
1445d59960o24106I21719g28056B94673f28997A122451e73518a22201A939519
1435f74246D80248a105463B574772b120964c70352A029744L58706a776022f26208
1425f4580D99391d92746A056372a917617A944867a282919b91195A131648l27709
1416H03939I1685f82107b59930j326295b71861B27059P7647N75111f68633j026457
1406a695090H24965C03524a74482p64398A391687B00379a649483g95647E23131
1396A544240E74626K04223a550166B52099K05453B350K65200g71503L18862a01214
$$ plain form
1465 -733851 -183775 1665003 -1343003 1034598 -160888 -23056 -1207161 312607 804338
1456 804338 -1125930 368361 -1408810 731798 -87479 -689399 215372 86531 325311 115045
1445 -459960 -1084066 921719 -728056 294673 -628997 1122451 -573518 -122201 1939519
1435 -674246 480248 -1105463 2574772 -2120964 -370352 1029744 1388450 -1776022 -626208
1425 -64580 499391 -492746 1056372 -1917617 1944867 -1282919 -291195 1131648 803939
1416 803939 91685 -682107 -259930 -1586225 -271861 227059 304706 879817 -668633 -1695090
1406 -1695090 824965 303524 -174482 -938880 1391687 200379 -1649483 -795647 523131
1396 1544240 574626 778849 -1550166 252099 457552 2350 267550 -771503 -452641 -101214
1385A013485m74668J18735e91257k24003k51272C86611P3797A91291J07121a416278
1374c03195G94009C57996c2874I14970f71679d6554p7808l71171B325629e80344
1363C06391J556557b037014A007274l85231i65486B189436d2470k59826j463369
1354a765665C97885M87286C45657j04829a086185E81963N14397b382016E53558
1344E72501e81144A448801f13981n1276C301500e41899P0224A60747O18277i2079
1333B30202a045340B791109A044382C24447K7796b037020F34938e99643J24627
1324d75016A020145B23988a186952B40799J084139a828617a50117B09656f15350
1314a183579H46502f32117D32610b436232I40140h22701d5787A715292e87075
$$ plain form
1385 1013485 538817 657552 -591257 -815260 -1066532 386611 460408 191291 298412 -1416278
1374 -303195 794009 357996 -32874 914970 -671679 -46554 -124362 -495533 2325629 -580344
1363 306391 1862948 -2037014 1007274 622043 -965486 2189436 -42470 -302296 -1765665
1354 -1765665 397885 885171 345657 240828 -1086185 581963 1096360 -2382016 553558
1344 572501 -581144 1448801 -613981 -665257 3301500 -541899 -471675 160747 779024 -92079
1333 230202 -1045340 2791109 1044382 324447 352243 -2037020 634938 -599643 -475016
1324 -475016 1020145 223988 -1186952 240799 1324938 -1828617 -150117 209656 -615350
1314 -1183579 846502 -632117 432610 -2436232 940140 -822701 -45787 1715292 -587075
1304B073666d67510I77851C5977O95736a403848B472272e68161A091994k90140
1295H01854f86542j85425B510038F30155A34926c02564D89314K31158b46995o08015
1285h55010F14819a107803A531645e43413p84033D19486i7903m38488B177549
1275B094066d85984q57414b77371A153558a853994B005844B56350a490159D55054
1265a653589E11679a164232H10245N2587C594O84246M4632h98938A215297c2330
1254c73083F27089A12823A9528J220374b65455n0673B44567a81363q70038H12692
1243I39505c87189D35165a516862a60865G77638D7185h45892j325911A674595
1233e42587n03328F29489J85405A47448b79719o46613B129847c88058j25235H24693
$$ plain form
1304 2073666 -467510 977851 35977 731713 -1403848 2472272 -568161 1091994 801854
1295 801854 -686542 -871967 2510038 630155 134926 -302564 489314 720472 -246995 -855010
1285 -855010 614819 -1107803 1531645 -543413 -1327446 419486 -97903 -536391 2177549
1275 2094066 -485984 -1343398 -277371 1153558 -1853994 2005844 256350 -1490159 455054
1265 -1653589 511679 -1164232 810245 862832 3594 687840 732472 -898938 1215297 -32330
1254 -373083 627089 112823 19528 1239902 -265455 -316128 244567 -181363 -1051401 812692
1243 939505 -387189 435165 -1516862 -160865 777638 47185 -845892 -2171803 1674595
1233 -542587 -1045915 629489 814894 147448 -279719 -926332 2129847 -388058 -513293 824693
1222C74239g37408k22742E83887j27454J55041a454892e16456I10437j89546A50244
1211g51504E37422B22533e2671j17482m82504A80248b82629D93059g89181b71503
1200c98598E80676L1532a683689A225557b103469G56755B83566P59677a470017
1190a148681a44382F54071B6255K304946c46376b3322l9679A503172A65380K81162
1180D46542R48895a026876J2993A99665e10866D60708M91290i92553j222308D6941
1169b93099A964244b58202E67404c28018C15040P76791j76499b206870A107538
1159A290176C74695e71523G54355J107549b379322F05642O17638A21061J431227
1150A552288d81231C27476a100352A6678P77814J260507G31505b77160p61450
$$ plain form
1222 374239 -737408 -960150 583887 456433 611474 -1454892 -516456 910437 720891 150244
1211 -751504 537422 222533 -52671 -170153 -652657 180248 -282629 493059 -789181 -271503
1200 -398598 580676 612208 -1683689 1225557 -2103469 756755 283566 1043243 -1470017
1190 -1148681 -144382 654071 26255 2331201 -346376 -23322 -63001 1503172 165380 446542
1180 446542 1395437 -1026876 -1013883 199665 -510866 460708 951998 -992553 -2214861 46941
1169 -293099 1964244 -258202 567404 -328018 315040 1091831 915332 -2206870 1107538
1159 1290176 374695 -571523 754355 1861904 -2379322 605642 1223280 121061 1552288
1150 1552288 -481231 327476 -1100352 16678 794492 2054999 731505 -277160 -1038610
1141a038610d56778B779569C59066b442836B191782I05217g91841E66792q1708
1132D85084d28606J3659E93394a53567o83803R0592c09646A257661D56302d20751
1121f56737F99657i74774a14345k94577E39954Q6671a702129D26865c98154h5657
1110B42337c71515A029499l67204a286845I6637J11618L83073P1482a369185H41370
1099A12783h34410l60784A636115D59206c75209B88237b99530C38172f53941n56684
1089a210625A909153F97962b56614r87369E02169J240784b305760a078804d06692
1079D10927J26518Q14172i81676I69463e89285J25488k8085F41705a134757a88675
1068a051266H10296K57974C99581i08565E39335j19686J388882c87340A50750
$$ plain form
1141 -1038610 -456778 2779569 359066 -2442836 2191782 905217 -791841 566792 485084
1132 485084 -428606 -414947 593394 -153567 -837370 -746778 -309646 1257661 456302 -420751
1121 -656737 699657 -974774 -114345 -408922 539954 626625 -1702129 426865 -398154 -85657
1110 242337 -371515 1029499 662295 -1286845 96637 208255 591328 662810 -1369185 841370
1099 112783 -834410 -1195194 1636115 459206 -375209 288237 -299530 338172 -653941 -1210625
1089 -1210625 1909153 697962 -256614 -1243983 502169 1742953 -2305760 -1078804 -406692
1079 410927 537445 1351617 -981676 969463 -589285 -463797 -491882 641705 -1134757 -188675
1068 -1051266 810296 1068270 399581 -908565 539335 419649 1808531 -387340 150750
1058a15879r86528C97662a003115A061621l22822a043012I12306A73611J56537
1049C30148b53259E69526b74568A3661K67566l1531a773229E85505k5820b78320
1038A057006c29533B36864R29303d37727n31167d33076B179129H2957e16989A698384
1027a199397A342854a668084e90348f8605k15845L3252p74089a35715o75510F1279
1016B30624b49113C20169j59825O64486N0773c12732k84303A828018a064834a43974
1005A278013A09209O90947a64543o11576A117841d78149j006332A500798F98789
995a986313E79709e98418C40430J915375c44059D99246c90602r6300O698A085262
984A55208M77438D6392K051859d85063m53563a15612B86828g37713C55189j46595
$$ plain form
1058 -115879 -1102407 397662 -1003115 1061621 738799 -1043012 912306 173611 330148
1049 330148 -253259 569526 -274568 13661 281227 249696 -1773229 585505 559685 -278320
1038 1057006 -329533 236864 1166167 -437727 -968894 -433076 2179129 82957 -516989 1698384
1027 -1199397 1342854 -1668084 -590348 -68605 -284450 -251198 -1025287 -135715 -811225 61279
1016 230624 -249113 320169 160344 824830 875603 -312732 -597035 1828018 -1064834 -143974
1005 1278013 109209 800156 -164543 -776119 1117841 -478149 -1484481 1500798 698789
995 -1986313 579709 -598418 340430 2255805 -344059 499246 -390602 -486902 -480204 1085262
984 155208 632646 46392 2098251 -485063 -938626 -115612 286828 -737713 355189 208594
974B08594O28211a621548B25324K56738N98081l58071h09248E29230a023928M75189
964e48739A180819A62515J868847a365178E45333J30774b72271D27371i11530
954F06125j73790h21855A514958f22170B22557P51527e96307R0789r70963N68063
944i08418c2316r46554C57882f116A67397b50654E12749a454669I11471B05939
933d98069p15131k10585c08380A448094h76192i8734A50207L35089h32271j15953
923i48224H18917e70508C90222a115294C15916H4291a764506B53392L24421L58582
913I36395d19146l18038g3044B287870c35461r0673A064374C9551a069876c69598
902C03624c1145C89306a101082C331269h89129A057475J42232A46362P05444a48891
$$ plain form
974 208594 836805 -1621548 225324 482062 1080143 722072 -809248 529230 -1023928 -548739
964 -548739 1180819 162515 2031362 -1365178 545333 676107 -272271 427371 -911530
954 606125 432335 -821855 1514958 -622170 222557 974084 -596307 -505518 -1476481 -908418
944 -908418 -32316 -978870 357882 -6116 167397 -250654 512749 -1454669 911471 205939
933 -498069 -1213200 -1423785 -308380 1448094 -876192 -98734 150207 485296 -832271 -948224
923 -948224 818917 -570508 390222 -1115294 315916 84291 -1764506 253392 577813 936395
913 936395 -419146 -737184 -73044 2287870 -335461 -426134 1064374 39551 -1069876 -369598
902 303624 -31145 389306 -1101082 3331269 -889129 1057475 1199707 146362 851806 -148891
891i70842A885487p53641a261493A071091C18357h95157h4320j22025C52455N50463
881I02918D44027e75494l01525l8351D67969a290585J62067M43544j867710a219642
870B13546a363122N14393o0677n087337l7524673j69432491g879274A13817987
861B49909580i499467r922667g213922j50220b939147j598695J376950a212661
852e65370j53783k17451m20679d9154o0743A299535a649208a79887m1801G67248
841a674253M84652B38861b183556C243796a486634C1174J89847Q0518m4460O81207
831I38286m07003O17688c24416F56527O37807b752502D13497M62306A49904a14162
820a37004p1590k38592e0772k26538B29322i32248F24662f11980J75633j277358
$$ plain form
891 -970842 1885487 1131846 -1261493 1071091 318357 -895157 -84320 -206345 352455 902918
881 902918 444027 -575494 -877019 -915370 467969 -1290585 -1128518 -684974 -2552684 -1219642
870 213546 -1363122 -848729 -909406 -5996743 -43521416 -212953907 -7879274 113817987
861 249909580 -9499467 -19422134 -7213922 -7364142 -2939147 -4537842 -3160892 -1212661
852 -565370 -719153 -936604 -1357283 -49154 -109897 1299535 -1649208 -179887 -221688 767248
841 -1674253 -1189601 238861 -2183556 3243796 -1486634 31174 221021 301539 257079 938286
831 938286 531283 1148971 -324416 656527 1294334 -2752502 413497 875803 149904 -114162
820 -137004 -208594 -447186 -50772 -277310 229322 -932248 624662 -611980 -436347 -1713705
810a713705B278641o28225c36822I77213a90195F18688k07918A5004a44702j251453
800a396155A336713e36662F86252A39151e81766r68992G45062b22215r26150A196708
789F50432e87341j946336I55367J382762E01277a76641C53018a85686m21719C09954
778d08436A314453i58130F06529B27737c03737C20042g95589A652563p83541e4871
767h56557G31915a42587k71050B176127A54393e78655a97939A131823C32338a613864
756H16116g77217A03304e75847q9954C4813K019773E00714K43725L59393a635491
745a124849B19184J222220R5620b734929J325232C87091b54462A65920K23702
736C89622J154430E16451j20393b162377B29983i7213A693394a312733B010541
$$ plain form
810 -1713705 2278641 1650416 -336822 977213 -190195 618688 410770 15004 -144702 -1396155
800 -1396155 1336713 -536662 686252 139151 -581766 -1550758 745062 -222215 -1148365 1196708
789 650432 -587341 -2533677 955367 2338129 501277 -176641 353018 -185686 -607405 309954
778 -408436 1314453 -958130 606529 227737 -303737 320042 -795589 1652563 869022 -54871
767 -856557 731915 -142587 -413637 2176127 154393 -578655 -197939 1131823 332338 -1613864
756 816116 -777217 103304 -575847 -665801 34813 2054586 500714 744439 1103832 -1635491
745 -1124849 219184 1441404 1537024 -2734929 -1409697 387091 -254462 165920 389622
736 389622 1544052 516451 396058 -2162377 229983 -97213 1693394 -1312733 2010541
726g31557k74189A88547c51746B36844h03681k00486M23041B78220a192216D98278
715g9780n4160H55427l27784A43946L78016h6138C28391M30430e61272A188444
704C41223a306041B022557a07450j724146f44716A288955N0766r8942a85627Q4693
694a00934B64684b84139C04858i33863C99319P80781E20624J55091a151087N32377
684f18710a58119A4750f42263J62665A405296a023799B324127C07405D1179J14768
674A55947a855442f74120B17216K08028a31289q04935A938442h39533E41127e4830
663e16194d6236m56460D3850L065727b7392j06381k60757o50470m58987g51505
652A163739j91409b76011k516688A071513g4732o60174c9366A439019A22028L92847
$$ plain form
726 -731557 -1005746 188547 -351746 236844 -803681 -1004167 -581126 278220 -1192216 498278
715 -79780 -133940 855427 527643 143946 521962 -86138 328391 758821 -561272 1188444
704 341223 -1306041 2022557 -107450 -1831596 -644716 1288955 1339721 1240779 -185627 -100934
694 -100934 264684 -284139 304858 -933863 399319 1180100 520624 675715 -1151087 -618710
684 -618710 -158119 14750 -642263 -479598 1405296 -1023799 2324127 307405 41179 155947
674 155947 -1855442 -674120 217216 425244 -131289 -936224 1938442 -839533 541127 -54830
663 -516194 -46236 -502696 43850 3109577 -27392 -133773 -394530 -1045000 -1503987 -751505
652 1163739 972330 -276011 -2792699 1071513 -74732 -734906 -39366 1439019 122028 514875
642E14875i86456I85519A18399P6626b56314L625q73498G87398B05446n725J360032
631A559753c76500C85589h94322o69907E45322N85335g5977r11539C14156J274640
621A588796a248375M54975L95840E66436e26648A34650P15089d66463b04664m75678
611f80342D2513e17008A109535a124067E49146e48521F93022f70174A104311d4257
600i77001G8736P71352e30759D19248j43814a459630E29417G6825J35342K593464
590B805631H11956l39440B9403g80807B261610A09834a35852D2197a431462C8201
579E93954a007656C251740a232927e73039E26817J304826e06669j141293C00748
569C30641m200A56610a243425B04018d1671j33646r59051E16771H4392O36069
$$ plain form
642 514875 -986456 985519 118399 195025 -256314 -252689 -1126187 787398 205446 199721 1559753
631 1559753 -376500 385589 -894322 -1564229 545322 1130657 -75977 -987516 314156 1588796
621 1588796 -1248375 -793400 -397560 566436 -526648 134650 849739 -466463 -204664 -680342
611 -680342 42513 -517008 1109535 -1124067 549146 -548521 693022 -670174 1104311 -44257
600 -977001 78736 850088 -530759 419248 275434 -1459630 529417 76825 212167 2805631
590 2805631 811956 472516 29403 -780807 2261610 109834 -135852 42197 -1431462 38201
579 593954 -1007656 3251740 -1232927 -573039 526817 1831643 -506669 -1647962 300748
569 330641 326441 156610 -1243425 204018 -41671 -175317 -1134368 516771 84392 720461
559G20461e64808F81088D9337J451510a3682j312426B3594N40471j21620i63983
548g40166I90015J158089a668436C98249A02299d91723A346653f48972B81087
538C20845N78903B13555R8486A4144Q7437K64881e68825A250691b222512a77741
527a151606A776563f40108C63605O10250d22381r95960C79174f97552q8169e0324
516f37061a40640r99075A612025a191722I17198a82320j760992A621926a38140
506C55385a152112M04265D8810a26011j46753A14276N28911b72828l19516C40645
495c20038C45770a691177M68182A18814h670D20725g01098J14422a45985l84679
485e30664H19832a800125J41172f02335a84554A675468C08946d27459B016397
$$ plain form
559 720461 -564808 681088 49337 1500847 -13682 -1326108 23594 564065 442445 -963983
548 -740166 990015 2148104 -1668436 398249 102299 -491723 1346653 -648972 281087
538 320845 899748 213555 312041 14144 101581 366462 -568825 1250691 -2222512 -177741
527 -1151606 1776563 -640108 363605 973855 -422381 -1418341 379174 -697552 -785721 -50324
516 -637061 -140640 -1139715 1612025 -1191722 917198 -182320 -1943312 1621926 -138140
506 355385 -1152112 -747847 48810 -126011 -272764 114276 643187 -272828 -592344 340645
495 -320038 345770 -1691177 -1222995 118814 -8670 420725 -701098 -586676 -145985 -530664
485 -530664 819832 -1800125 -1658953 -602335 -184554 1675468 308946 -427459 2016397
475g87714c04483n98993l28796M49944d1976A175917i40754b74104o75453H15807
464a050437A752935E31673n5408L52727a558724a89331I36818h92141M14776j24210
454f01575n5138A545392G28632E7405f6306m18676k6659A780670F98652J42361
444H41013d1634p20812o32329G73809B43422M92614L3191f42919a88527A672721
433f4253j607819F11385M56574B23927M52530c17041I28441l53386a58864f5599
422A513506d27287A787128a563847M58638I27869e68840a36056p06484A076055
412c45224k19379h9645F0305K44787O81436g41007b62913k45679p39940A07755
401i71102G18861k78373L58401h21453b1985B318745i11003I25747O67573i68235
$$ plain form
475 -787714 -304483 -903476 -1232272 -782328 -41976 1175917 -940754 -274104 -949557 815807
464 -1050437 1752935 531673 476265 828992 -1558724 -189331 936818 -892141 -477365 -601575
454 -601575 -656713 1545392 728632 57405 -66306 -484982 -511641 1780670 698652 841013
444 841013 -41634 -762446 -1394775 773809 243422 736036 769227 -642919 -188527 1672721
433 -64253 -1672072 611385 1067959 223927 676457 -317041 928441 575055 -158864 -65599
422 1513506 -427287 1787128 -1563847 -1105209 927869 -568840 -136056 -842540 1076055
412 -345224 -564603 -89645 60305 305092 986528 -741007 -262913 -508592 -1248532 107755
401 -971102 718861 440488 798889 -821453 -21985 2318745 -911003 925747 1593320 -968235
390b93966A168577f50270K19146A77018H2360M00073h26370I61794D44104a631653
379I45467l08251I7975e61986j796783h67126A295137g07460l32658A563987E75982
368H45794d91251A468989a103770A40485i7382l23313A181074B39547O98469e44998
357C08842j38532a435691A32133J095390e86788C71128J13155a294459A045015
347C47166f15288H23004c34941j76644l83387B41726E8002J646358P7095c86947
336A093397C70623b149999D17859c04347m22844i1764c8701E65464k70472N16308
326H11300b98073A390776a24102D09302c33629J51479j37416A9055e0828A199341
315f16067A559157C92837J47545h39380R347o58833c78622C80745a168975C97595
$$ plain form
390 -293966 1168577 -650270 -431124 177018 82360 482433 -826370 961794 444104 -1631653
379 945467 637216 97975 -561986 -2358769 -867126 1295137 -707460 -1040118 1563987 575982
368 845794 -491251 1468989 -1103770 140485 -97382 -420695 1181074 239547 938016 -544998
357 308842 170310 -1435691 132133 1227523 -586788 371128 484283 -1294459 1045015
347 347166 -615288 823004 -334941 -511585 -894972 241726 58002 1704360 1781455 -386947
336 1093397 370623 -2149999 417859 -304347 -727191 -91764 -38701 565464 294992 811300
326 811300 -298073 1390776 -124102 409302 -333629 -182150 -319566 19055 -50828 1199341
315 -616067 1559157 392837 540382 -839380 -830033 -1488866 -378622 380745 -1168975 397595
304C64251r1693J82690a129441J09133B14456a373664b79341A324779b32251A67985
293d18674A357151C69039f69297C60759j74290a702906E38334a97799a7295j888442
283a905737h13778A037344f38317B51719b56165B4111R12676b54890E7213d09786
272E2146f52028B26942g58265G95883a46002B0459R0755L04475K13963k69686
262C59966g91976L11620D68505a643370I4386b82333A045518e56371g8641C46422
251A053032d09672G01035J138667a332860k86873A18022g56107A410639h35262
241f95258D89651k41783d80013G19032A90613c57555K8367R921E66662b37393
230F72611j32882Q2805K15793a164592B036184I61910B32990j9473a91355p46171
$$ plain form
304 364251 272558 455248 -1129441 -1020308 214456 -1373664 -279341 1324779 -232251 167985
293 -418674 1357151 369039 -669297 360759 186469 -1702906 538334 -197799 -17295 -1905737
283 -1905737 -813778 1037344 -638317 251719 -256165 24111 936787 -254890 57213 -409786
272 52146 -652028 226942 -758265 795883 -146002 20459 111214 415689 629652 359966
262 359966 -791976 -480356 468505 -1643370 94386 -282333 1045518 -556371 -78641 346422
251 1053032 -409672 701035 1839702 -1332860 -1619733 118022 -756107 1410639 -835262
241 -695258 489651 247868 -480013 719032 190613 -357555 -329188 -319267 566662 -237393
230 672611 539729 622534 838327 -1164592 2036184 961910 232990 213517 -191355 -937526
220i37526A339682a89249D78251a463870F03022c56918A483241e40955j76119
211g17074A134019m9691c87189G93204A13908a6592A55544a71914j100165A347620
200d05252J20241G04142a179021c21614A199656k19664m56288J52234g00980C47823
189f26193A257066C63412O36312h07607J92723D4183J274080d25825E45950a253878
178A25454d0466H31515C76007a782982D28124a89835H03756e9107A134221g57044
167h4979I85071h06438C02569f54257A147356d75484k61305J27795I97268c57378
156a394644D00522c66383m5362r42002A228950d9041l83385F48648J081776c46850
145a001008c04239J23019k139226A743451a255151E52153J142324a952834C12043
$$ plain form
220 -937526 1339682 -189249 478251 -1463870 603022 -356918 1483241 -540955 -717074
211 -717074 1134019 1084328 -387189 793204 113908 -16592 155544 -171914 -1272079 1347620
200 -405252 -285011 704142 -1179021 -321614 1199656 979992 523704 675938 -700980 347823
189 -626193 1257066 363412 999724 -807607 -614884 44183 1318263 -425825 545950 -1253878
178 125454 -40466 831515 376007 -1782982 428124 -189835 803756 -59107 1134221 -757044
167 -84979 985071 -806438 302569 -654257 1147356 -475484 -736789 -608994 997268 -357378
156 -1394644 400522 -366383 -411745 -1353747 1228950 -49041 -432426 648648 1730424 -346850
145 -1001008 -304239 -181220 -2320446 1743451 -1255151 552153 1694477 -1952834 312043
135a217848k93197E58559a286304E35712c2536A989849a040624B19991D9444J604224
125A653668A43682B9206J672154e39531A220371J08761a13434B22337b223039
115b95059D64314M3191b156084A153541a9026j481458E42099j70403C4161M08783
105D42944c35142q6407P7708N4126k95221B08973J821450H2759a24178j9361A433323
93a73898j273539D74887c29295G91857k6937a794531E73733K3930h77189D48499
82d91960G82933j11974b89842o01260J20205K91877D21295g84451c2307p14245
72g46552j53128A38123K73085i50518B074770E74924i8864E70790h77454H0812
61A3699f62610E48397k64431g3355b8473C62627e5748j542151A87060d13582I21780
$$ plain form
135 -1217848 -1511045 558559 -1286304 535712 -32536 1989849 -1040624 219991 49444 1653668
125 1653668 143682 29206 1701360 -539531 1220371 1329132 -113434 222337 -2223039
115 -295059 464314 507505 -2156084 1153541 -19026 -1500484 542099 371696 34161 442944
105 442944 -335142 -421549 -343841 -289715 -584936 208973 2030423 82759 -124178 -143539 1433323
93 -173898 -1447437 474887 -329295 791857 764920 -1794531 573733 597663 -877189 448499
82 -491960 782933 670959 -289842 -891102 -770897 -479020 421295 -784451 -32307 -746552
72 -746552 -899680 138123 411208 -950518 2074770 574924 -98864 570790 -877454 80812
61 13699 -662610 548397 283966 -73355 -28473 362627 -55748 -1597899 187060 -413582 921780
49a06934G95917K29695h28572I64805A16506i74286B031267b79113E08058J90916
39F98974b167917m28224A130146m23960c99965J10220a23387l61196r69955O92632
29g61906B17408i19178K62587o40817A050660a061820a53459l2105B230334E69004
18f61080A89717e67371H93993a254382b15016B15043j0874J77188A84127f09845
7i1822o3798G82947M08292a577960G48990B08083e89911
$$ plain form
49 -106934 795917 1025612 -828572 964805 116506 -974286 2031267 -279113 508058 698974
39 698974 -2167917 -2596141 1130146 706186 -399965 -289745 -123387 -484583 -1454538 -761906
29 -761906 217408 -919178 -656591 -1297408 1050660 -1061820 -153459 -185564 2230334 569004
18 -661080 189717 -567371 893993 -1254382 -215016 215043 204169 381357 184127 -609845
7 -91822 -155620 782947 1191239 -1577960 748990 208083 -589911
##PAGE= F1=14425.28136286
##FIRST=     21204.543296753, 3104.07366071428, -960
##DATA TABLE= (F2++(Y..Y)), PROFILE
2047i60A355427D55022e22026f2580H39426a12081l38597k5462C50231a143209
2036a32261l67536j340505e02663F82412f88660n00953H69904d43927I3767J085928
2026A179695a66497o537G68731b07559j116752A053295i58921A031452A97087
2016c44531C12760b91491I97758a663632A465038d15974a72277j910645A114191
2006E20707e72052a06505p28415i7193p25183k11914D22781A87564N13725L51990
1996A053279e35410I02301j54998A13994D1076N98742d0287j209282G33016b38524
1985a024826E30608b833405k982750q447610b493213A030373N65071J610639a83044
1975D35669a19092C21445O14673m38201m1591a83540E07834b54800F37179c28787
$$ plain form
2047 -960 1355427 455022 -522026 -62580 839426 -112081 -450678 -476140 350231 -1143209
2036 -132261 -499797 -1840302 -502663 682412 -688660 -1189613 869904 -443927 93767 1179695
2026 1179695 -166497 -173034 768731 -207559 -1324311 1053295 -958921 1031452 197087
2016 -344531 312760 -291491 997758 -1663632 1465038 -415974 -172277 -2082922 1114191
2006 520707 -572052 -106505 -834920 -97193 -822376 -1034290 422781 187564 701289 1053279
1996 1053279 -535410 902301 747303 113994 41076 639818 -40287 -1249569 733016 -238524
1985 -1024826 530608 -2833405 -5816155 -14263765 -2493213 1030373 1595444 3206083 -183044
1975 435669 -119092 321445 936118 497917 456326 -183540 507834 -254800 637179 -328787
1964A344214i30015A209019B36851g91257A736152e2416m72144a24720E72327
1954B90102O2478M34635i41741d13444l61055L5681p02945A198846a124078J89842
1944i34236q0018D97879a49163n03845F95708J194709a017144l06531G18890b23237
1933f30067j36544A30368M08152N33069D46507a649819K99216A249230A99558
1923a205574F03699A44285K36506f95378l46064a09757H59794C091N14142K39110
1913G56343i98241c42705A86889a357050A916846b119735F66204J421762C57847
1903d71273m74403F12043r5593K78711k01662i85145A049679E14118A46337a090659
1892A943622f42609B307137a587632E67496j59695f8737j903107A58310J670236
$$ plain form
1964 1344214 -930015 1209019 236851 -791257 1736152 -52416 -524560 -124720 572327
1954 290102 352580 787215 -941741 -413444 -774499 -738818 -1441763 1198846 -1124078 -934236
1944 -934236 -1014254 497879 -149163 -653008 695708 1890417 -1017144 -1323675 718890 -223237
1933 -630067 -766611 130368 538520 1071589 446507 -1649819 -1350603 1249230 199558
1923 -1205574 603699 144285 380791 -695378 -1041442 -109757 859794 3091 517233 756343
1913 756343 -998241 -342705 186889 -1357050 1916846 -2119735 666204 2087966 357847
1903 -471273 -945676 612043 516450 795161 593499 -985145 1049679 514118 146337 -1090659
1892 1943622 -642609 2307137 -1587632 567496 407801 -68737 -1971844 158310 1828546
1883A828546D59783O73771c57925A324329d51233A2950K82724a552618B991657
1873a528790A346615m26632e19564a27154E07547c3918E97403b87429h198o8278
1863g6476B287471C5237i92971F29967k11569c15841C78418E1517b23933B59517
1852A28859R59145B44145J125737G523h46509M03470A815324q26849a450060A899608
1841E138791O624927C516838b658053a104999A655732i83516j124446A197928
1832f20099b649r20358a41193o27286A4580R2719B6353J74397J691097a385005
1821H95399c35356a8950G9000M85505a021765H78246b027595B2429a333585D63562
1810b006218A063580o6207a707119H91213H5002J33416J21856b13707I66573g16703
$$ plain form
1883 1828546 459783 1133554 -357925 1324329 -451233 12950 295674 -1552618 2991657
1873 -1528790 1346615 919983 -519564 -127154 507547 -33918 597403 -287429 -8198 -76476
1863 -76476 2287471 35237 -992971 629967 418398 -315841 378418 51517 -223933 259517
1852 128859 1088004 244145 1369882 7523 -846509 -443039 1815324 988475 -1450060 1899608
1841 5138791 11763718 3516838 -2658053 -1104999 1655732 -983516 -2107962 1197928
1832 -620099 -2649 -923007 -141193 -768479 14580 107299 26353 200750 1891847 -1385005
1821 895399 -335356 -18950 79000 564505 -1021765 878246 -2027595 22429 -1333585 463562
1810 -2006218 1063580 997373 -1707119 891213 85002 218418 340274 -213707 966573 -716703
1799a664985G49468a371656d13427C71193o8259h56908G42125E964c74304r13294
1789a287598A784708b314383E77609k15449d10053j714542H22012f19483B51300
1779e94066D38578E5505a688670J18032B32768e17416I83892a259539b23871F27798
1768c81007a37690l39354j4407j044662E5729L20727a079784b75680F75578P7253
1758G52831g56497j752162B664762i2232D67697q7530b34816o70724C77297a632021
1747A23174J46151a457283K70081c05778C14281R06070J32416a127089K37277
1738h89812M39296D55254R24505d80106J45797A70033Q58084m99815O5501M68796
1728A062599A63690a207013A63357a948289K84405A158111e75950j420016F50737
$$ plain form
1799 -1664985 749468 -1371656 -413427 371193 302934 -856908 742125 5964 -374304 -1287598
1789 -1287598 1784708 -2314383 577609 362160 -410053 -2124595 822012 -619483 251300
1779 -594066 438578 55505 -1688670 -1570638 232768 -517416 983892 -1259539 -223871 627798
1768 -381007 -137690 -477044 -491451 -1536113 55729 376456 -1079784 -275680 675578 752831
1758 752831 -756497 -2508659 2664762 -92232 467697 380167 -234816 -905540 377297 -1632021
1747 123174 269325 -1457283 -1187202 -305778 314281 1220351 1352767 -1127089 -889812
1738 -889812 -450516 455254 1379759 -480106 -334309 170033 1028117 528302 593803 1062599
1728 1062599 163690 -1207013 163357 -1948289 -1663884 1158111 -575950 -1995966 650737
1718F10446e5987q98728K09315C23769J28257b81178j66749H02416b44758K3785
1708b20973n62762A537313a859746A208246J83898g99832F17112g71752A07612
1698a160619a56377r8347l5301C91252b93276E83674M13965F7930c22424A248168
1687I39825q9607f24613a96665l77469C75275N7389a90883B05767c470818a260622
1676h94901H87880h74510C58507K47452g01780A452514a60213C20219J004343
1667A324562c82424A725085o55991a025594I043f99157a05678H69815K99216a019089
1656a00152m83243A368178D10054a284702e20835B06146e84864f2098A216028
1646A343042E59477i59700D11179A30424j1256e58157J89429j184349D06765a697342
$$ plain form
1718 610446 -55987 -954715 -745400 323769 452026 -281178 -447927 802416 -244758 -220973
1708 -220973 -783735 1537313 -1859746 1208246 1392144 -799832 617112 -771752 107612
1698 -1160619 -156377 -254724 -290025 391252 -293276 583674 997639 67930 -322424 1248168
1687 939825 850218 -624613 -196665 -574134 375275 432664 -190883 205767 -3470818 -1260622
1676 -894901 887880 -874510 358507 605959 -701780 1452514 -160213 320219 1324562
1667 1324562 -382424 1725085 1069094 -1025594 9043 -699157 -105678 869815 1169031 -1019089
1656 -100152 -583395 1368178 410054 -1284702 -520835 206146 -584864 -62098 1216028
1646 1343042 559477 -959700 411179 130424 119168 -558157 -368728 -1553077 406765 -1697342
1635A121203d38007A042957a365520A645341a47785j312175C63285g49945a04212
1625e35183H40290a357487G88062c05452D50153e49185c1191l45049A8328J014651
1615A032979C73625a789406A535564n16743a29230A396506A60785h86081G75661
1605a908229L34545A569297D53378R2162B15772K25475d70447G08017A17916h80982
1594A385068g24675a84115d5880H80085c93413m52466A431460a89848M9932r97822
1584a137738A68719O73199A09407f8210q98778B20912J039056d57049A110075
1574h82663f8380k3397A5219L95943i21860D40955I8482e93033a24482p34351
1564h58833a98440r34219l13276A589c82062C70104b4572l88271A202410k71900
$$ plain form
1635 1121203 -438007 1042957 -1365520 1645341 -147785 -1459960 363285 -749945 -104212
1625 -535183 840290 -1357487 788062 -305452 450153 -549185 -31191 -376240 18328 1032979
1615 1032979 373625 -1789406 1535564 1018821 -129230 1396506 160785 -886081 775661
1605 -1908229 -1573684 1569297 453378 545540 215772 441247 -470447 708017 117916 -880982
1594 1385068 -724675 -184115 -45880 880085 -393413 -845879 1431460 -189848 -139916 -1137738
1584 -1137738 168719 841918 109407 -68210 -966988 220912 1259968 -457049 1110075
1574 -882663 -68380 -91777 15219 411162 -921860 440955 98482 -593033 -124482 -858833
1564 -858833 -198440 -1132659 -1445935 1589 -382062 370104 -24572 -412843 1202410 930510
1554I30510a191479A226256n19106A19457f4217A50796Q2488d40909I37577K2873
1544I60450J419996a571106H45449c75851E06101a062192I54862G0224B6877L43773
1534C70650c29707J34045q58127a37635D1255e61182D92671a382223C41364c29408
1523A25285C4342J087035l66476o1566C33978J787507a249779m97567A318743
1513C56900i98454A480995f49907A964949G1717e59398e0481D97599f16254K40933
1503c75321J48626p67812A06819d83038C4665i51639J57910b39366F65481O68794
1493A334275b59714A026195D16315J839063a885987A117627Q01072C78848b289382
1483d42562J30497k86996B06997f68265A93770a533882b00218j518460A666291
$$ plain form
1554 930510 -1191479 1226256 707150 119457 -64217 150796 233284 -440909 937577 960450
1544 960450 2380446 -1571106 845449 -375851 506101 -1062192 954862 70224 26877 370650
1534 370650 -329707 -195662 -1053789 -137635 41255 -561182 492671 -1382223 341364 -329408
1523 125285 34342 1121377 754901 693335 333978 2121485 -1249779 -1747346 1318743
1513 356900 -998454 1480995 -649907 1964949 71717 -559398 -50481 497599 -616254 -375321
1503 -375321 -226695 -994507 106819 -483038 34665 -951639 -793729 -239366 665481 1334275
1493 1334275 -259714 1026195 416315 2255378 -1885987 1117627 1918699 378848 -2289382
1483 -442562 -312065 -599061 206997 -668265 193770 -1533882 -200218 -1718678 1666291
1473A657019a90973m74000F11158g87483A340627a034011A821367g62804B00939
1463A632722a479306A094816b83384J12645j128441D93985r0422a044992E70164
1453a548203F37236A12767e25757i6426C78960r5817d5988k58520p78612I95166
1442e62264C1593a96591G80810e53656A35074J550563f48813G10089a028734B379340
1431a972589b48394I38387j40057a611552f23802B9217K10574c40626G12749a931822
1420A989413a220462f6781A153595m29732a01794m80535b61852j138808c03552
1410D05785J11L07040g29410r25285G83974C49928b33462r16193A237256H7182
1399a924315h03417B93999J403759q04100n1910a365180A20830J46366l5248K54171
$$ plain form
1473 1657019 -190973 -664973 611158 -787483 1340627 -1034011 1821367 -762804 200939
1463 1632722 -1479306 1094816 -283384 -170739 -1299180 493985 403563 -1044992 570164
1453 -1548203 637236 112767 -525757 -96426 378960 283143 -45988 -304508 -1083120 995166
1442 -562264 31593 -196591 780810 -553656 135074 1685637 -648813 710089 -1028734 2379340
1431 -1972589 -248394 938387 798330 -1611552 -623802 29217 239791 -340626 712749 -1931822
1420 1989413 -1220462 -66781 1153595 723863 -101794 -582329 -261852 -1400660 -303552
1410 405785 405896 712936 -729410 -1654695 783974 349928 -233462 -1149655 1237256 87182
1399 -1924315 -803417 293999 1697758 893658 841748 -1365180 120830 267196 231948 486119
1389D86119h12351c15301f075I07913k27731q4280e42209l56572m2424F2725N09336
1378E72061A26162b33446q06414M84415G82871k30866c0970A062930g98466F0142
1367a33961l35496B149215e82166B06704J838042b269946A243107D80276h32195
1357B276220b38090j8944j786702C94739L15234C46113J12887a403683F71142
1347A201557b297045F45549k55949g10356A536654e88959p8832C299514f31146
1337b76429A7449Q45386h1693A92421a076514B517069A141283A33765K23007a304807
1326B85206g91101L00139A142800B02647i48427C92302P66977a175858a86362
1316D87362g42176k97634I40939g53565A17245a855585E07971g24323B45264J112239
$$ plain form
1389 486119 -812351 -315301 -6075 907913 680182 595902 -542209 -898781 -941205 62725 572061
1378 572061 126162 -233446 -1039860 -555445 782871 552005 -30970 1062930 -798466 60142
1367 -133961 -469457 2149215 -582166 206704 2044746 -2269946 1243107 480276 -832195
1357 2276220 -238090 -257034 -2043736 394739 709973 346113 459000 -1403683 671142
1347 1201557 -2297045 645549 389600 -710356 1536654 -588959 -667791 3299514 -631146
1337 -276429 17449 862835 -81693 192421 -1076514 2517069 1141283 133765 356772 -1304807
1326 285206 -791101 -490962 1142800 202647 -948427 392302 1159279 -1175858 -186362
1316 487362 -742176 -1039810 940939 -753565 117245 -1855585 507971 -724323 245264 1357503
1306A357503d90358A837409c06761H90243A4939M55187a042713B292744f30873
1296H86211k82934g13125c07149B329881E59733E3838b84561C29494L12382d67414
1285i00917G23546a139147A598818i04417l66395H59434d34968J79203A946026
1275A971582b92449j089153a40615G45533a679462A729415H6344a465630C09677
1265a810920E23226a239735F94464M01682A63079M18368j19467d82151A114521
1255A08525g60997C51127A36809a4431A201438b23495L6263D00291d52820n63625
1245a016445A049415E07840c60563C70409a236628c52832G75277C08827a062745
1235a856785A732728c01712o38100F78419J7824B01377I7892a156437B148053
$$ plain form
1306 1357503 -490358 1837409 -306761 890243 14939 470126 -1042713 2292744 -630873
1296 886211 603277 -713125 -307149 2329881 559733 53838 -284561 329494 641876 -467414
1285 -900917 723546 -1139147 1598818 -904417 -1270812 859434 -434968 -255765 1946026
1275 1971582 -292449 -1381602 -140615 745533 -1679462 1729415 86344 -1465630 309677
1265 -1810920 523226 -1239735 694464 1096146 163079 581447 461980 -482151 1114521
1255 108525 -760997 351127 136809 -14431 1201438 -223495 -187232 400291 -452820 -1016445
1245 -1016445 1049415 507840 -360563 370409 -1236628 -352832 775277 308827 -1062745
1235 -1856785 1732728 -301712 -939812 678419 696243 201377 97892 -1156437 2148053
1225c63212l37403H33755A03175g10791k82774G08698l40610L32292a258851e15986
1214G44134l5417E7806f72088C97502j91731a90401O1239o5228A28478b80647
1203B83781i43805a09619l55929F64609O0126a897578A374589b076603G87190
1193B04105J006471a580722O10217h2818H38552d23154B429389a61156e9509H7617
1182A343442e8661F31780R42295a162108K22106D2292e00015F27894L37838h80773
1171b374234B50038e29208A694544a67329F60491d11966A64188J008349k02048
1162I70489b276399D84330R56097p09877e95646G36012N22251a895731H91166
1152A156717A92444J523336c23061B95019a009557E0205Q01350J251944H29401
$$ plain form
1225 -363212 -700615 833755 103175 -710791 -993565 708698 368088 700380 -1258851 -515986
1214 744134 708717 57806 -672088 397502 205771 -190401 -129162 -194390 128478 -280647
1203 283781 -943805 -109619 -465548 664609 724735 -1897578 1374589 -2076603 787190
1193 204105 1210576 -1580722 -970505 -82818 838552 -423154 2429389 -161156 -59509 87617
1182 1343442 -58661 631780 1574075 -1162108 -940002 42292 -500015 627894 965732 -880773
1171 -2374234 250038 -529208 1694544 -167329 660491 -411966 164188 1172537 970489
1162 970489 -2276399 484330 1440427 730550 -595646 736012 1258263 -1895731 891166
1152 1156717 192444 1715780 -323061 295019 -1009557 50205 851555 2103499 829401
1142b60729o76375K62918B328350C59764b429920B311435H73055f62466F43103
1132B97667e32141m9836E31945b09637o34483L08749b48893A352022C09307a08124
1121g53107D22227i03196b15592m0676E79676J27410a717243F07469b71420K8270
1111b43150A80018c20066A293251n73836a182365D7840M8388L03027L06516a374562
1100I55834A72769g81782l74283A770647E16092d53181C46801b28952B33494f65783
1089a099590A794230F17961d71163q39985E08691J537681b507810h79066L07123
1080e71943D28507j7047R04742h64329A033562h33105L65446l19036F72183a083691
1069b26202r61020G26952N6180k87402h01661C73262J52797J409015b91028B64797
$$ plain form
1142 -260729 -937104 -674186 2328350 359764 -2429920 2311435 873055 -662466 643103
1132 297667 -532141 -581977 531945 -209637 -844120 -535371 -248893 1352022 309307 -108124
1121 -753107 422227 -903196 -215592 -256268 579676 707086 -1717243 607469 -271420 -243150
1111 -243150 180018 -320066 1293251 719415 -1182365 47840 96228 399255 705771 -1374562
1100 955834 172769 -781782 -1156065 1770647 516092 -453181 346801 -228952 233494 -665783
1089 -1099590 1794230 617961 -471163 -1311148 508691 2046372 -2507810 -879066 -571943
1080 -571943 428507 411460 1316202 -864329 1033562 -833105 -467659 -786695 672183 -1083691
1069 -226202 -1187222 726952 783132 495730 -801661 373262 526059 1935074 -291028 264797
1058c02715o35636D2269h47527A121707C52079h71124F79111A640K85671b37758
1047D78136b65927B00935J70171j58072a697921G77356k39772h43136A256958
1037c82481a24030A536840c68342p38374a90554A773882g9246l42227A415292
1027a169054A790798a708623g91600a57800p7717a10673j088330c47906l57954
1018g05860b87122B42641b14408D57499j33964N04449r5088d99016j68223A898656
1007h37832b87484A335544a25048I55564c20809m86781A278934e09623p67364
998a276987A379654n15096a597755E47260f81704B45443J532555a81762F66181
988a91357q8688j91446A081813A62719O04154G1587K221666e69145m30584E2347
$$ plain form
1058 -302715 -938351 42269 -847527 1121707 352079 -871124 679111 1640 287311 -237758
1047 478136 -265927 200935 371106 213034 -1697921 777356 537584 -843136 1256958
1037 -382481 -124030 1536840 -368342 -1106716 -190554 1773882 -79246 -421473 1415292
1027 -1169054 1790798 -1708623 -791600 -157800 -235517 -110673 -1199003 -347906 -705860
1018 -705860 -287122 242641 -214408 457499 323535 827984 732896 -499016 -667239 1898656
1007 -837832 -287484 1335544 -125048 955564 -320809 -807590 1278934 -509623 -1276987
998 -1276987 1379654 864558 -1597755 547260 -681704 245443 1777998 -181762 666181
988 -191357 -280045 -471491 1081813 162719 766873 71587 2293253 -569145 -999729 52347
977I8172e80284B05335P1344L06609a853599D18951J06245L47209k94683f72354
966C40544g14519L0988A082656H9662J802463a265311F79349j70219b11414C88308
955a114803E65133o9961i81891A054234f02658C24429N53770e30000l06614q36659
945a673273O21676D1817f47507B25716a78352A19769d07982G10312a558032A080660
934b46707l88433k93686n78414e46355A325551f42944c10757D07851l4100h39738
923i49721A019399f71019E03981a113840A81236b48240j528256A45984P00098
914H46082J76571c70958n95883A52670J917635b3990n07008H77862G1000a128505
903d08193e7339B45710M7042a071837C672469f35531A047051j27005B30865N97325
$$ plain form
977 98172 -580284 205335 276679 583288 -1853599 418951 525196 872405 577722 -672354
966 340544 -714519 -683531 1082656 89662 1892125 -1265311 679349 509130 -211414 388308
955 -1114803 565133 495172 -981891 1054234 -602658 324429 878199 -530000 -836614 -1673273
945 -1673273 -1051597 41817 -647507 225716 -178352 119769 -407982 710312 -1558032 1080660
934 -246707 -635140 -928826 -1507240 -546355 1325551 -642944 -310757 407851 373751 -839738
923 -949721 1019399 -671019 503981 -1113840 181236 -248240 -1776496 145984 846082
914 846082 1022653 -370958 -966841 152670 2070305 -23990 -530998 877862 71000 -1128505
903 -408193 -57339 245710 292752 -1071837 3672469 -635531 1047051 920046 230865 828190
893H28190b43362o58207B028616q04228a249874H98888C37149a014434a03895
883a54970E57912Q8380j99214d39349o56185K48824D27024a237776K95594L68800
873e73382k312710J428755A50847a497170g08067m85021m713062l9293732j76490005
864b21689887i936982A18957060J41778135h130677j2791806h222738O44878b903309
855d974203J854263a258604c59687m62735j57214o89969A13782b41130A273493
845a723261a3657k53704E55716a544595K88066E35576b044652B881052a286084
835b3134F05326k88804j54343Q47046D87603M60682c31735F22623N13559b764324
824C32453M36564a1615q2242a7502q3162l80398b36279A81819L3285i85869B94618
$$ plain form
893 828190 -243362 -901569 2028616 1224388 -1249874 898888 337149 -1014434 -103895
883 -154970 557912 646292 447078 -439349 -1095534 -846710 427024 -1237776 -942182 -573382
873 -573382 -2886092 -1457337 150847 -1497170 -708067 -1193088 -5906150 -45199882 -221689887
864 -221689887 -9936982 118957060 260735195 -8130677 -20922483 -8222738 -7577860 -2903309
855 -4974203 -3119940 -1258604 -359687 -822422 -979636 -1669605 113782 -241130 1273493
845 -1723261 -13657 -267361 555716 -1544595 -1256529 535576 -2044652 2881052 -1286084
835 -23134 605326 316522 162179 1009225 487603 948285 -331735 622623 1136182 -2764324
824 332453 769017 -11615 -93857 -17502 -100664 -481062 -236279 181819 215104 -985869 294618
812e39231J94414j054453B005031n87652b29063I50532b62388E45939J08050F2527
801i6770j281224A084478b32159G15503B04783g34407q07888F86927a70814p98830
791i69644A019332l37447f58822j518272I20189J375332E60968a47259A20186
781a80435n33003A18492c21996A406623i22624G25249G6084d72247B39714g24820
770A667967H29601d8724n67367E84407b63038K505B210430b07606l73331c1008
759I95491B98610a710951A106963e92007A13469c10906r16854A72150J740983
750A913133F22848k63114Q69618a824487P09440E14930O43030N56987b396907
740a757629A06580c79280D17851r1411Q18185m96261A98316b000698I3044d48899
$$ plain form
812 -539231 -344817 -1399270 2005031 1417379 -229063 950532 -262388 545939 653989 62527
801 -96770 -1377994 1084478 -232159 715503 204783 -734407 -1542295 686927 -170814 -969644
791 -969644 1019332 681885 -658822 -2177094 920189 2295521 560968 -147259 120186
781 -180435 -713438 118492 -321996 1406623 -922624 725249 76084 -472247 239714 -724820
770 1667967 829601 -48724 -616091 584407 -263038 -260533 2210430 -207606 -580937 -31008
759 995491 298610 -1710951 1106963 -592007 113469 -310906 -1227760 172150 1913133
750 1913133 622848 359734 1229352 -1824487 -1115047 514930 1157960 1714947 -2396907
740 -1757629 106580 -379280 417851 326440 1144625 648364 198316 -2000698 93044 -448899
729A432585a425689A909597f07205n08830A98454d19188C8443h04503l01980M97000
719f09483D58203a038255F46835f68m11779I82286l39563B99449K30965b71791
708D40631R3034c60360A233210E5238a199544A836574H8572a834601d43287A054851
697A409214k32035b30420A09157j7418d0409C9511h62787D20224O61915I8460
686I64138a314968d66523b23500A15852g39406K14226H89143i42961B237146C37831
675i8962B03211a536760f18016B02936M038a90510q64744A915244h11323E37382
664b05635j75371d7668o9123D4386L040432D64433h4411n81929m52527j48129
654a266996L37323A393332o26521a83085k567240A169196g1905o98519b15605
$$ plain form
729 1432585 -1425689 1909597 -607205 -1116035 198454 -419188 38443 -804503 -1106483 -609483
719 -609483 458203 -1038255 646835 -668 -412447 982286 642723 299449 530414 -271791
708 440631 533665 -360360 1233210 55238 -1199544 1836574 88572 -1834601 -443287 1054851
697 1409214 1177179 -230420 109157 91739 -40409 39511 -862787 420224 1082139 98460
686 964138 -1314968 -466523 -223500 115852 -739406 -525180 889143 -942961 2237146 337831
675 -98962 203211 -1536760 -618016 202936 206974 -190510 -1055254 1915244 -811323 537382
664 -205635 -381006 -47668 -116791 44386 3084818 464433 -84411 -666340 -1118867 -1266996
654 -1266996 -929673 1393332 766811 -183085 -2750325 1169196 -71905 -770424 -215605
644A784845A66402L64333g65370H86386a0278A12492c8304k78773n20199H21426
633d5995E58209Q39809e37910C55709d16952j174597B33841P38750a87460o93250
623h80710I6391J269369a021281L25226K46595E71721g89034B8360O93747d18059
612a29577o08443c6083p79669I60739a002071F81994g60291F56028e68977A273604
601b07896o54669A92160P29128b72350D56686j7783a221307D90242A41632K58993
591D00625J893296H82470m25710c2297m64130B054445A69063J6565A243a270831
580a38563E15324a263443C474277a378215N94358C65503J504698d41084r46910
571a387994I1217K55483l075D6389a609255B19848l8520a78964q85615D73725
$$ plain form
644 1784845 166402 530735 -765370 886386 -10278 112492 -38304 -317077 -837276 821426
633 -45995 558209 1398018 -537910 355709 -416952 -1591549 233841 972591 -187460 -880710
623 -880710 96391 1365760 -1021281 -696055 -449460 571721 -789034 28360 722107 -418059
612 -129577 -738020 -36083 -815752 960739 -1002071 681994 -760291 656028 -568977 1273604
601 -207896 -862565 192160 921288 -272350 456686 438903 -1221307 490242 141632 400625
591 400625 2293921 882470 456760 -32297 -496427 2054445 169063 185628 1243 -1270831
580 -138563 515324 -1263443 3474277 -1378215 -783857 365503 1870201 -441084 -1387994
571 -1387994 91217 346700 343625 46389 -1609255 219848 181328 -178964 -1064579 473725
560B02082L66788e34554D83850J12413J122874a41189j116709e6797F47273J56269
550H03542i94526J84980A072486J362048a608154C88186G740c51888A520197c65111
539B75447K52567K49142a29904D38903A46066d126D15057e02390A016866b532719
528e4817q66727A703666e38213C53140O12764f81395n99694E90757f70374p0672
518g41046B94777d30001d6436j177615A600314a627073A115370b31969j869953
509b101922A599918b15355E28153a137789M37397A59637o9f83924A78239L01199
499D79438c52835m36557E14578d45374D10106a607272L96565B0900M5173e9295
488e17372k5435a62418l74793G68820a405519l85828e77611K61263A894182A62525
$$ plain form
560 202082 568870 -534554 483850 596263 1719137 -141189 -1257898 -56797 647273 803542
550 803542 -994526 -809546 1072486 2434534 -1608154 388186 7740 -351888 1520197 -365111
539 275447 528014 777156 -129904 438903 146066 -4126 415057 -502390 1016866 -2532719
528 -54817 -921544 1703666 -538213 353140 965904 -681395 -1281089 590757 -670374 -741046
518 -741046 294777 -430001 -46436 -1224051 1600314 -1627073 1115370 -231969 -2101922
509 -2101922 1599918 -215355 528153 -1137789 -700392 159637 159568 -683924 178239 479438
499 479438 -352835 -789392 514578 -445374 410106 -1607272 -1210707 20900 66073 -59295
488 -517372 -542807 -162418 -537211 768820 -1405519 -1791347 -577611 -316348 1894182 162525
477d26819A968611g24660b22105r43842K948a82173e3673A241780i07040c81290
466g99335H06390h56463A840088D37407O7252J03312a436718a7607A073061i26926
455f38081j2518j42963A629517G96720c2286k35668O1659l82688A902181G05536
444B05810g1990n39309l64705A016749C04346M77740J43847g14987A33K013369
434B013502a93415j453820F53112M49405F3071O82506i3361G27749B53990A02235
423H0819J289393b4798A553653a604478f74063H14409g02645a4714p85610A160090
412h37994P1365A56787p1860M94931K30607f76492K54683r876p76832E13461a218657
400G07495j43244J40514i18322B21983K190885e72641G94582N36911a286730a00722
$$ plain form
477 -426819 1968611 -724660 -222105 -1165947 -1162999 -182173 -53673 1241780 -907040 -381290
466 -799335 806390 -856463 1840088 437407 504659 607971 -1436718 -17607 1073061 -926926
455 -638081 -650599 -793562 1629517 796720 -32286 -267954 -206295 -588983 1902181 705536
444 205810 -71990 -611299 -976004 1016749 304346 782086 925933 -714987 133 2013502
434 2013502 -193415 -1647235 653112 1102517 63071 745577 -93361 727749 253990 102235
423 80819 1370212 -24798 1553653 -1604478 -674063 814409 -702645 -14714 -800324 1160090
412 -837994 -766629 156787 84927 579858 810465 -676492 -421809 -431685 -1208517 513461 -1218657
400 707495 564251 704765 -918322 221983 2412868 -572641 794582 1331493 -1286730 -100722
389A359701i76366c31772A72542m0729L58519i35000A243474m80491a711098A104592
378E73707D6878f37846j055893O12491A505895h09812k70078A658009C39429N98768
368I38197e07214A501817g85182A75546C7868c77293A208476A68878R21573h94847
357D78687H3782a394761C6430J333793g18096B37527L19238a252635A204132D16871
346i21287G02483b33648j50005k75851C63418j38577J359050K94855c87687A022776
335D81333a913334B48434a03659o42330b17900D3271L84285o1526M92025c8892
324A443930g9297F41848b38592L5407j82022A21125a77964A040752e03046A367289
313D31385O5004f86691l88972l02468c21798C84289a225215B32506L29181B74987
$$ plain form
389 1359701 -976366 -331772 172542 131813 490332 -935000 1243474 762983 -1711098 1104592
378 573707 46878 -637846 -1693739 -1081248 1505895 -809812 -1079890 1658009 339429 938197
368 938197 -507214 1501817 -785182 175546 37868 -377293 1208476 168878 1090451 -894847
357 478687 83782 -1394761 36430 1370223 -718096 237527 556765 -1252635 1204132 416871
346 -921287 702483 -233648 -383653 -659504 363418 224841 1583891 1878746 -387687 1022776
335 481333 -1913334 248434 -103659 -745989 -217900 43271 427556 366030 858055 -38892
324 1443930 -79297 641848 -238592 -203185 -385207 121125 -177964 1040752 -503046 1367289
313 431385 496389 -686691 -1075663 -1378131 -321798 384289 -1225215 232506 561687 274987
302H33548a663292M25062B61362a237341d38053A540727d63084D3565b05999A290262
291A36929a98672D25657B5080a416474E89875A39016d5918k080114h03864A045651
280f10089C57723d71048h1175F52376D6775K08119e52464a22563o51749B43212
269a057640H11488a85121P6858A88948O9784N88611C56930h27299L38271E10069
258a656734C98399b38476F64729c75580a10847A21250Q57693b16540F87534J089902
248A777436a394485K37241f7987p56620A266504f86862j00087E27203n119b99925
237G67571l03000b30938n2184k23730G86001e55821H18081k61593N3366q4741
227E25113a125667A880819I06690C1424K29861a86354o99618A392149a65414C97903
$$ plain form
302 833548 -1663292 -1238230 261362 -1237341 -438053 1540727 -463084 43565 -205999 1290262
291 136929 -198672 425657 25080 -1416474 589875 139016 -45918 -2126032 -803864 1045651
280 -610089 357723 -471048 -81175 652376 46775 254894 -552464 -122563 -774312 243212
269 -1057640 811488 -185121 -108263 188948 258732 847343 356930 -827299 -489028 510069
258 -1656734 398399 -238476 664729 -375580 -110847 121250 978943 -216540 687534 1777436
248 1777436 -1394485 -1157244 -67987 -824607 1266504 -686862 -786949 527203 522084 -299925
237 767571 464571 -230938 -283122 -506852 786001 -555821 818081 556488 609854 525113
227 525113 -1125667 1880819 906690 31424 261285 -186354 -885972 1392149 -165414 397903
216a297624C88083d49427A566484d50477J8354I33727J17962b83786G50760k69129
206D81631c5687D05463a59509r79364A353210a26936l21114I11337a104605a78658
195A141859m07139C31755K34141e91753C34630f22664A274975n94420p4885g74847
184g34487b46267A606960e05646D68510a251140G0998M4956R03198A87491a666515
173D94170a19835F87381B9581R03665a63666m87561A143450c54139D87014d46970
162E81192c73278k89738L9679A271058e53801r62629E06068d65395J65364p01190
152a001221A220972a62780n45382F58718J112490b64030r93296f5222k69094j777201
142b111517A802706a179514F38918P30438a783304C32062a005049n84599H20699
$$ plain form
216 -1297624 388083 -449427 1566484 -450477 -432123 933727 1051689 -283786 750760 481631
206 481631 -35687 405463 -159509 -1138873 1353210 -126936 -448050 911337 -1104605 -178658
195 1141859 734720 331755 565896 -591753 334630 -622664 1274975 680555 605670 -774847
184 -734487 -246267 1606960 -505646 468510 -1251140 70998 115954 1019152 187491 -1666515
173 494170 -119835 687381 29581 933246 -163666 -651227 1143450 -354139 487014 -446970
162 581192 -373278 -663016 -623337 1271058 -553801 -1516430 506068 -465395 -300031 -1001221
152 -1001221 1220972 -162780 -708162 658718 1771208 -264030 -1257326 -65222 -334316 -2111517
142 -2111517 1802706 -1179514 638918 1369356 -1783304 332062 -1005049 -1589648 820699
132a658973G77071G5107J808498i73964C33748I5238J126512H3043L2199J491729
122A606971g03781I72937L28501b5324A47233b138337e33028E38264K18673b181234
111A311694i7287j479745F28993k95934B7460L01011d56850j31820K39079j9474
101c69065o0834B15145J452834C64252i849l30606A313692b40067j448337E58846
90d37556G92759n1942b105855C58142K71349a101850I33255e00192H75548l18381
80E57167b75691r01100K47123c95016E32247f06291a18764n91207N0109b09515
69E43100i73148B038973D65967b96988E28965f63451C4439D100h09864E53299
58I1098M0893a27831A8144K82612a466685B77216b44097F75124c07806E65339
$$ plain form
132 -1658973 777071 75107 1883605 -973964 333748 95238 1221750 83043 115242 1606971
122 1606971 -703781 972937 1301438 -25324 147233 -2138337 -533028 538264 756937 -2181234
111 1311694 -97287 -1577032 628993 333059 27460 328471 -456850 -588670 -349591 -369065
101 -369065 -429899 215145 1667979 364252 -9849 -340455 1313692 -240067 -1688404 558846
90 -437556 792759 740817 -2105855 358142 629491 -1101850 933255 -500192 875548 557167
80 557167 -275691 -1176791 -929668 -395016 532247 -606291 -118764 -709971 -659862 -209515
69 543100 -973148 2038973 465967 -296988 528965 -663451 34439 4100 -809864 553299
58 91098 131991 -127831 18144 300756 -1466685 277216 -244097 675124 -307806 565339
47I24292a094293H84676a6026q53273A726414a92298D48033K37097b084265l49690
37b433955G35553j28812e45230J61087J43375j73231r91843M30231A88877g69256
26d69731p51625I90997i31732b27708n4614B281525F94005g53084A40561c02724
15H37811a195400a93442G2704J27652K36772i516m09432e1320j59717A082102
4F37295a588608G77694E0831g94829
$$ plain form
47 924292 -1094293 884676 -16026 -869299 1726414 -192298 448033 685130 -2084265 -2433955
37 -2433955 735553 606741 -545230 -384143 -240768 -413999 -1405842 -975611 188877 -769256
26 -469731 -1221356 990997 -931732 -227708 -282322 2281525 694005 -753084 140561 -302724
15 837811 -1195400 -193442 72704 200356 437128 -9516 -418948 -51320 -211037 1082102
4 637295 -1588608 777694 50831 -794829
##PAGE= F1=14403.48309298
##FIRST=     21204.543296753, 3104.07366071428, -98219
##DATA TABLE= (F2++(Y..Y)), PROFILE
2047i8219A296635B37713d15339a70336G47071b48297j88242o6003D97933a110229
2036b73251m59191n86715e22528E76802e28399p26256G92478c90265B7061R39880
2026I66941E1044f8798E95991b78085j082812A226140g47428A005509A63446a59005
2015C9214d12158A056648a447860A235769b84434A96189b095148I18999m32406
2006D86593e13581J0636O9157J19933n28620M4788D86414A02881M13599K37925
1996G54405c94042H79205l77487A21235R3394J73156H5223a380208A025443d40212
1985g86547E01273b779548k318200r026020b599345G32690O44785J526024g4070
1975D24337A58014K29342L86438j24172B10968b70121C92737c92017B97266c20079
$$ plain form
2047 -98219 1296635 237713 -415339 -170336 747071 -248297 -436539 -502542 497933 -1110229
2036 -273251 -732442 -1319157 -522528 576802 -528399 -1254655 792478 -390265 27061 966941
2026 966941 51044 -68798 595991 -278085 -1360897 1226140 -747428 1005509 163446 -159005
2015 39214 -412158 1056648 -1447860 1235769 -284434 196189 -2095148 918999 486593
2006 486593 -513581 -502945 -433788 -313855 -842475 -797687 486414 102881 516480 754405
1996 754405 -394042 879205 501718 121235 214629 387785 85223 -1380208 1025443 -440212
1985 -786547 501273 -2779548 -5097748 -14123768 -2599345 732690 1377475 2903499 -74070
1975 424337 158014 387356 773794 649622 210968 -270121 392737 -392017 297266 -320079
1964A259168i52569A037467B90987g98764A731175a54046k02263a42961F96540
1954A17370K46687M15356a117812d22793n97837K87776p03289A086484i83114
1944a051615J84802C91329E2279g36336F90500J341526a299983J26631F89870
1934c03008j54586m18091a08914E31247P01230E24558a624660M27708A114498
1924B70946a155210B65474r4740P8165d00632o48619a6658G71392C30724N8636
1914C89360M00855i74017b31125C28153a467105A843421b292341F08375J227473
1905A835848C18340d83295l75446G63715k99559M27981j65389a007097G10284
1895D97320k4794a254331B162274f52349B168655a864483F21668m9722a69152
$$ plain form
1964 1259168 -952569 1037467 290987 -798764 1731175 -154046 -356309 -142961 696540
1954 117370 364057 779413 -1117812 -422793 -1020630 -732854 -1436143 1086484 -983114
1944 -1051615 -866813 391329 52279 -736336 690500 2032026 -1299983 -1173352 689870
1934 -303008 -457594 -875685 -108914 531247 1232477 524558 -1624660 -1196952 1114498
1924 270946 -1155210 265474 170734 248899 -400632 -1049251 -16658 771392 330724 389360
1914 389360 790215 -974017 -231125 328153 -1467105 1843421 -2292341 608375 1835848
1905 1835848 318340 -483295 -858741 763715 464156 892137 726748 -1007097 710284
1895 497320 472526 -1254331 2162274 -652349 2168655 -1864483 621668 571946 -169152
1885a555757b09158A689670E79858M50618d06374A086961e95622A45470E4074
1875a492209C210523a480340A659234G53886d66013a48563B78760b32841F44899
1865d36263D6544b58024B430944a87554p49561E94068L9372f92267E22219I3879
1854i2188C32532E2953P75931C04600R99264A00634a118078d02914A774123q81073
1844H93050a326505A617786L206858P228107B989922b369493h24482A575386g75364
1834b570165A334198f26266a56096q68480d5867p03988f0696A28700a92190A42617
1823A791554a547429E57337b33910g7423C5040K93386a148416G95700a759850
1813g6985j309423E28774b049653A071103K68222b051603H36855B04709K61106
$$ plain form
1885 -1555757 -209158 1689670 579858 1030476 -406374 1086961 -595622 145470 54074
1875 -1492209 3210523 -1480340 1659234 753886 -466013 -148563 278760 -232841 644899
1865 -436263 46544 -258024 2430944 -187554 -937115 594068 633440 -692267 522219 93879
1854 -92188 332532 52953 828884 304600 1303864 100634 -1118078 -402914 1774123 893050
1844 893050 -1326505 1617786 4824644 12052751 2989922 -2369493 -824482 1575386 -775364
1834 -2570165 1334198 -626266 -156096 -1024576 -45867 -749855 -60696 128700 -192190 142617
1823 1791554 -1547429 557337 -233910 -77423 35040 328426 -1148416 795700 -1759850
1813 -76985 -1386408 528774 -2049653 1071103 1339325 -2051603 836855 204709 465815
1804D65815p2613d12477H91821f63570r33137F73581a229584b29818A36993M2727
1794A79720a145729H04714b81593j41043q73824A533319b351433D40026M8815
1785D88841f18522j673302A032239a213897C54409c21169D69381A14494a611112
1775a383572A19205d71420F02627a398381a23591E49444f0948l36782j31993a73640
1764a501360F6391Q5640f76816b19847C09879M47805h05550j201916B526607b75870
1753E74494k24361A0032i84767A25262a638744B28780P5091a558171O03052M65061
1743d90058E78522M73491J19790i33550j37809b63608D02607J170483e54851J29309
1733d25542D09408O57639B44448N60767M47527c28016n59595b21501j812158O21658
$$ plain form
1804 465815 393202 -412477 891821 -663570 -1596707 673581 -1229584 -229818 136993 179720
1794 179720 -1145729 804714 -281593 -422636 -1296460 1533319 -2351433 440026 488841
1785 488841 -618522 -2291824 1032239 -1213897 354409 -321169 469381 114494 -1611112
1775 -1383572 119205 -471420 602627 -1398381 -123591 549444 -60948 -397730 -529723 -173640
1764 -1501360 66391 152031 -676816 -219847 309879 757684 -805550 -2007466 2526607 -275870
1753 574494 350133 10032 -984767 125262 -1638744 228780 303871 -1558171 -955119 -490058
1743 -490058 578522 1052013 1171803 -933550 -1071359 -263608 402607 1573090 -554851 -425542
1733 -425542 409408 1067047 244448 805215 1252742 -328016 -887611 -221501 -2033659 -1412001
1723a412001A019462e26662j961716H30233j05900F981a050064k0275B08473L18849
1713E27322a66455K7059I39611c66299a39872p02397A303006a759288A082309
1703A394538a351067D15745f44415a05809j219693a30438l05026h7962F99660
1693d62978G16004K37657b14908L027A323921k24733k76987f41908K27231P6574
1683c38103C55963r6187A3105a62305l279125a187531K91642A230040a100469
1673B18776K35489f91806A382317d98969C48565P61049b42997A363625m15840
1664I47785a138085D9152e11967P2914I71548J85370f47172a57345n45680A073616
1653F70821a689049f23020C55549f35449A68991O59696M86598D83903a043256
$$ plain form
1723 -1412001 1019462 -526662 -2488378 830233 724333 6981 -1050064 -1070339 208473 527322
1713 527322 -166455 -139396 939611 -366299 -139872 -842269 1303006 -1759288 1082309
1703 1394538 -1351067 415745 -644415 -105809 -1325502 -130438 -435464 -87962 699660
1693 -462978 716004 953661 -214908 -211881 1323921 1099188 822201 -641908 -414677 -338103
1683 -338103 355963 259776 13105 -162305 -3441430 -1187531 -895889 1230040 -1100469
1673 218776 454265 -691806 1382317 -498969 348565 1109614 -242997 1363625 947785
1664 947785 -1138085 49152 -511967 -439053 971548 1156918 -647172 -157345 -703025 1073616
1653 670821 -1689049 -623020 355549 -635449 168991 828687 1315285 483903 -1043256
1643C28941B4503L2551e56601m9596r60326B89759a622020G07754d98037A178383
1632a348255A333321c31889q63559C69565g49074b33874N5837E79602a557399
1622F91540e13256E01738d92733b13363o2276N5335A196674B72298a957115A568915
1611A019690A76851J203113G6114a090378E03647b080885L50646A456172B75313
1601E81017G6894M45125c31556A172722a43022o53182A559517a014137e9674r7009
1591a56683H21508b26622n95292A525388a66364M6189q46127C06293L15174B54961
1580f8607j079036C97656Q06369c86936A082359a162185A8580f6653A04821J91880
1570B96701i38430B38964k9493c51234j7869n68897a07439j519969M55180A15370
$$ plain form
1643 328941 24503 57054 -556601 -606197 -1566523 289759 -1622020 707754 -498037 1178383
1632 -1348255 1333321 -331889 -1195448 369565 -749074 -233874 -178037 579602 -1557399
1622 691540 -513256 501738 -492733 -213363 -275639 -220304 1196674 272298 -1957115 1568915
1611 1019690 176851 1379964 76114 -1090378 503647 -2080885 -1730239 1456172 275313
1601 581017 76894 522019 -331556 1172722 -143022 -796204 1559517 -1014137 -59674 -156683
1591 -156683 821508 -226622 -821914 1525388 -166364 -120175 -966302 306293 621467 254961
1580 -68607 -1147643 397656 1204025 -386936 1082359 -1162185 18580 -66653 104821 296701
1570 296701 -938430 238964 209471 -351234 -369103 -938000 -107439 -1627408 -1172228 115370
1559d19157A43846E311d02306A443756n07630a221249I24191m03143b73675L4945
1549b38730a5478B48105c31218G51210J73380J424758a694909G01083b96156B98297
1538h92893F17826F0980B3580a7166j18259p6283q00628c25516J61635K6416C62932
1526a301241B54555e15289B67020k1327Q90237m60747j53751j98650J102847a196623
1515a811498A329864D90795a219283A201379g16804B169341A95083f07616g9921
1505E27128e40375K07876a36972j056603C9956e58555a03164r41099J63343b89124
1494G43478L83934c35202A171822C51672J830313a827833A074209R59190A81860
1484b106134c49216k83397Q2037C54786e66133A36682a622095b62109j381061
$$ plain form
1559 -419157 143846 5311 -402306 1443756 936126 -1221249 924191 521048 -273675 -238730
1549 -238730 -15478 248105 -331218 751210 924590 2349348 -1694909 701083 -296156 298297
1538 -892893 617826 60980 23580 -17166 -135425 -211708 -1012336 -325516 -163881 -137465 362932
1526 -1301241 254555 -515289 267020 245693 1135930 675183 521432 322782 1425629 -1196623
1515 -1811498 1329864 490795 -1219283 1201379 -716804 2169341 195083 -607616 -79921
1505 527128 -540375 -332499 -136972 -1193575 39956 -558555 -103164 -1044263 -880920 -289124
1494 743478 1127412 -335202 1171822 351672 2181985 -1827833 1074209 2033399 181860
1484 -2106134 -349216 -632613 -550576 354786 -566133 136682 -1622095 -262109 -1643170
1475a643170A514858N2312c1054m85753F02385i15932A246134a139587A846039
1465h34908E32843R92302a545709A091797c70808N6111j006265E69319D6317i92396
1454G46950a685365E73209k85993c62954o8530F45719B14775c03147e7513j006833
1444a064346A054004c72545J62687A63891K07809e23592C56899R95770e55880
1434H54378i52815B087428a811345a47737G60394A65889a418605f05904G0971
1424b7803k35387B33900a859412A982280a057542B10295Q93012m92349c07567
1414d45618K10585j001139c21806D94176o5326P7749g67738q07969F90535l35426
1404C55109b95539j091807A059181b0425k120454g98816F60J798567o43398k96380
$$ plain form
1475 -1643170 1514858 1567170 -31054 -516807 602385 -915932 1246134 -1139587 1846039
1465 -834908 532843 1525145 -1545709 1091797 -370808 -314697 -1320962 569319 46317 -992396
1454 746950 -1685365 573209 287216 -362954 -431484 645719 214775 -303147 -57513 -1064346
1444 -1064346 1054004 -372545 -209858 163891 371700 -523592 356899 1352669 -555880
1434 854378 -952815 2087428 -1811345 -147737 760394 165889 -1418605 -605904 70971
1424 -27803 -263190 233900 -1859412 1982280 -1057542 210295 1103307 610958 -307567
1414 -445618 -235033 -1236172 -321806 494176 428850 506599 -767738 -1575707 690535 355109
1404 355109 -295539 -1387346 1059181 -20425 -2140879 -798816 660 1799227 1155829 859449
1394H59449a216652b4536D8041L25501L97574h34022b10118H5623O54748L8738
1384G79109k71478d07805n13677Q6004c41477G16656f1426o44813J8303j30026
1374h17962G74292m26e6809A089019i05655A34428a70808k61475A861960d87168
1363E7749K092045b389679A364185B83664f72393B307918c91549a94345k062912
1354b257257C57406R0248j42706L39373a668098G15877N71690b095859G25389
1344A26553h05553A522161e54540j14895C171202g19141i4292J0772H64066h9241
1333A25896a069663B029733p83294g2547D72195f88163a75276q47286d56410A206549
1322H7112f52384E45207L16453c68271J30445G48518h41482n6616I52872h69899
$$ plain form
1394 859449 -1216652 -24536 48041 373542 771116 -834022 -210118 85623 740371 779109
1384 779109 507631 -407805 -921482 -835478 -341477 716656 -61426 -706239 -687936 -817962
1374 -817962 774292 773866 -56809 1089019 -905655 134428 -170808 -432283 1861960 -487168
1363 57749 2149794 -2389679 1364185 283664 -672393 2307918 -391549 -194345 -2257257
1354 -2257257 357406 447654 304948 644321 -1668098 715877 1287567 -2095859 725389
1344 126553 -805553 1522161 -554540 -669435 3171202 -719141 -94292 -83520 864066 -89241
1333 125896 -1069663 2029733 1246439 -72547 472195 -688163 -175276 -1022562 -456410 1206549
1322 87112 -652384 545207 861660 -368271 -237826 748518 -841482 -898098 952872 -869899
1311b11165j063229A02116f26694E29560M24775c96605A420117a18014G44097
1301c4496B10060f79183A950564g00761F75719l00099g35810B02623J867730E10194
1290i7464k73481A34202L97989f19878l19405G87895a108029A575725a250974
1280a213585A340244h38143A00287J534686J30477h7652j318613C1059L06063
1271C37122a498614A417747a21090j282235B04636a882775E40412a321977E99874
1261A253411C40305R3968A59218i3248I86535B23420a102023C3638N1835a8744
1250A147486a76151e4592E16152f62182l01577A253305I2536c48723B69972i69072
1239d65842G49587j95924a167391l15314A760300h3956p45932F05895n6931B34653
$$ plain form
1311 -211165 -1274394 102116 -626694 529560 954335 -396605 1420117 -118014 744097
1301 -34496 210060 -679183 1950564 -700761 675719 375620 -735810 202623 2070353 510194
1290 -97464 -370945 134202 532191 -619878 -939283 787895 -1108029 1575725 -1250974
1280 -1213585 1340244 -838143 100287 1634973 1765450 -87652 -1406265 31059 337122
1271 337122 -1498614 1417747 -121090 -1403325 204636 -1882775 540412 -1321977 599874
1261 1253411 340305 434273 159218 -93248 986535 223420 -1102023 33638 85473 -18744
1250 1147486 -176151 -54592 516152 -662182 -963759 1253305 92536 -348723 269972 -969072
1239 -465842 749587 553663 -1167391 -1482705 1760300 -83956 -829888 605895 548964 234653
1228E08140a394674B071241c21675m99805H66397b11803l77492m13738H48934
1218B12177N55968a012797M93088E87288O2322e4164n33793B60466p1418c53207
1207i6524B03705G9294a58550F8084a025304E4117e20087G32511J31552b041113
1196A447454a991825H19507H9529J281170a637676g67224D1010R30988h85455
1186B494744E8565i9356B25270R55267b99526H12368R19491a250896M09901i5844
1175d24698G78691K13020g04959j737653D70843g00162A306412f2559G29681d60377
1164a8A172158j67934b180790a10255A526175m85216e82975G50210r2655a326703
1153A210484j14849B60028J547415a96478B88327h67145F8039Q35125J185140
$$ plain form
1228 508140 -1394674 2071241 -321675 -821480 866397 -211803 -589295 -1003033 848934
1218 212177 768145 -1012797 -519709 587288 649610 -54164 -587957 260466 189048 -353207
1207 -96524 203705 79294 -158550 68084 -1025304 54117 -520087 732511 864063 -2041113
1196 1447454 -1991825 819507 89529 1370699 -1637676 -767224 41010 971998 -885455
1186 2494744 58565 -99356 225270 1180537 -299526 812368 1731859 -1250896 -840995 -95844
1175 -424698 778691 991711 -704959 -2442612 470843 -700162 1306412 -62559 729681 -460377
1164 -18 1172158 1004224 -2180790 -110255 1526175 1040959 -582975 750210 657555 -1326703
1153 1210484 1095635 260028 1807443 -196478 288327 -867145 68039 903164 2088304
1144B088304I35937b46757n88870l991A830292C41871b344859B383944H05282
1134d63430G07342A17390f31560l7072E03074b46786o36956b23358K1262A453567
1123A92662m880h21938A15166g37542c26169i4111E93296K67738a538818H14353
1112a67796k20265C9145b86944A451699o69614a050220F673L3238J46902N48075
1102G34888a251362A066333B43960g29684l49432A804725E50706e37859D08347
1092b15696A38500f37653l11552A626094E53432f62328p48593E70375J704722
1083B275097b609308f34622l9965D88183k11909R31086f84510A085083i98032
1073e15972n58862G42257i27778b46833j014852F43281j00172N6560f32796A99497
$$ plain form
1144 2088304 935937 -246757 -835627 -839618 1830292 341871 -2344859 2383944 805282
1134 -463430 707342 117390 -631560 -668632 503074 -246786 -883742 -223358 -202096 1453567
1123 192662 187782 -821938 115166 -737542 -326169 -94111 593296 861034 -1538818 814353
1112 -167796 -388061 39145 -286944 1451699 782085 -1050220 6673 39911 186813 734888
1102 734888 -1251362 1066333 243960 -729684 -1079116 1804725 550706 -537859 408347
1092 -215696 138500 -637653 -949205 1626094 553432 -662328 -1410921 570375 2275097
1083 2275097 -2609308 -634622 -674587 488183 276274 1207360 -684510 1085083 -998032
1073 -515972 -1074834 742257 -927778 -246833 -1261685 643281 543109 599669 -632796 199497
1062F51240J363459a64481C85668d36879k85624b79638l67304A155672i180n77369
1052e86549D09310a16161B59891b62676D23163b15839C22779J67292A69309a497013
1041A007257D88893a357517A419696e01275N5720A837949c07608q26779G1312
1031A130167b06247j02610A164984a121177B272345a703279P58982b37296R7606
1022a39690G0968a309641e00951r2051o6891B82581a64906F38039j49266L60996
1012H49769k49998f05352j02076A913998d66666M3950A375978b91830A091663
1002c57286m82878A393578d29513o18694A240137j91164a164266E33547g52714
992A72853R31058D1977Q39672B4706a14456k99096A054187A65898P48036A4218
$$ plain form
1062 651240 2014699 -164481 385668 -436879 -722503 -279638 -646942 1155672 -9180 -586549
1052 -586549 409310 -116161 259891 -262676 423163 -215839 322779 490071 169309 -1497013
1041 1007257 488893 -1357517 1419696 -501275 -445555 1837949 -307608 -1134387 71312
1031 1130167 -206247 -308857 1164984 -1121177 2272345 -1703279 -944297 -237296 -139690
1022 -139690 70968 -1309641 -500951 -593002 -659893 282581 -164906 638039 488773 849769
1012 849769 599771 -605352 -707428 1913998 -466666 -422716 1375978 -291830 1091663
1002 -357286 -840164 1393578 -429513 -1048207 1240137 1048973 -1164266 533547 -752714
992 172853 1103911 41977 881649 24706 -114456 -413552 1054187 165898 913934 14218
981B435648e82466m35147B68313g2277l08385D9781L26665J4538a934834F22631
970E64768J2875j43367d21689A28966c22183m76575I31020E4519J590960a009867
959G96307C31206a03779C09445a287170E32234L3640a086516E07929d95933D29860
948G61586d33758o23832o99173N82113A76191b97760I3333c38192A00451e18362
937I17150a581826A204734f43450m8255J07882r25511g40268A195939c52599j25009
927d77608F86002B86904h18621n9996A207785g52356F44677a061270C1589e75892
916a669459C2319J037810K4644b61181r08552D38556J343999C61281e87355G23447
905G7883a127675c92024L078E27353B48355a024149C858236c23959I95228l24725
$$ plain form
981 2435648 -582466 -1017613 268313 -72277 -380662 49781 376446 390984 -1934834 622631
970 564768 577643 434276 -421689 128966 -322183 -798758 931020 54519 1645479 -1009867
959 796307 331206 -103779 309445 -1287170 532234 565874 -1086516 507929 -495933 429860
948 761586 -433758 -1057590 -1756763 -1174650 176191 -297760 93333 -338192 100451 -518362
937 917150 -1581826 1204734 -643450 -691705 -583823 -1509334 -740268 1195939 -352599 -477608
927 -477608 686002 286904 -818621 -878617 1207785 -752356 644677 -1061270 31589 -575892
916 -1669459 32319 1070129 1094773 -261181 -1169733 438556 1782555 361281 -587355 723447
905 77883 -1127675 -392024 -388946 527353 248355 -1024149 3858236 -323959 995228 670503
895F70503C19579M55164b87806n01839B166774q86221a152958G28786l56771a063457
884a05654H9151M90607j08562J5304b77475j011328N99920D57389a167519M46319
874g21200L03651k687988J471991B07254a594372e33368r29641m137947l7840063
865d3441019j69635204a1017543A14995702J36116428f295206j4520987h886905
857g267413b679447k389276K151572a176506h4824q03882q5251r61589B70582
847c63029A212368a743690A94515b82510C71881a348193R7735G69706a761757
837B440132a031100d1235I25044C34781G8674J003299D54629K74638c07823E68477
826I37084b605750C18560L01982a40265N8646I8145G839c75990o7566F60294B32400
$$ plain form
895 670503 319579 774743 -287806 -789645 2166774 1280553 -1152958 728786 372015 -1063457
884 -105654 89151 579758 471196 486500 -277475 -1288803 -688883 457389 -1167519 -721200
874 -721200 -417549 -3105537 -1633546 207254 -1594372 -533368 -1463009 -5600956 -43441019
865 -43441019 -213076223 -11017543 114995702 251112130 -6295206 -20816193 -8886905
857 -7267413 -2679447 -5068723 -2917151 -1176506 -84824 -888706 -973957 -1935546 270582
847 -363029 1212368 -1743690 194515 -282510 371881 -1348193 -1250458 769706 -1761757
837 2440132 -1031100 -41235 925044 334781 78674 1081973 454629 729267 -307823 568477
826 937084 -2605750 318560 620542 -140265 -81619 98145 7839 -375990 -443556 660294 232400
814i71322I752d15203a63511r41648A745465n97286i8714H92713c12672E10324
803I07566A16955e4698j241250H36815A02365O85093B47228h31245o29089F27101
792i1386o84116G05326k46f48921j015419H65632J417709E96903a50218N0520
782i9698o1846o31789e9051j50523A469080h32455H23967d9705n53402A76776
771f10737A617365G79199f0615l22759D73350c32303h5031B118752d41710r4915
761e36625A58989O60514B64706a769405A382049c90274A02460a4008j660255B88042
750A721582G53156a04287A317774a878226Q07663G25880J26030Q81461a767894
740a893722b10176k37357F72243B35462N11232J0092a383j738449c2309p42954
$$ plain form
814 -971322 9752 -415203 -163511 -1105159 1745465 1148179 -98714 892713 -312672 510324
803 907566 116955 -54698 -1295948 836815 102365 787458 247228 -831245 -1460334 627101
792 -91386 -775502 705326 705080 -648921 -1664340 865632 2283341 596903 -150218 -99698
782 -99698 -161544 -793333 -59051 -209574 1469080 -832455 823967 -49705 -603107 176776
771 -610737 1617365 779199 -60615 -383374 473350 -332303 -85031 2118752 -441710 -536625
761 -536625 158989 819503 264706 -1769405 1382049 -390274 102460 -14008 -1674263 288042
750 1721582 753156 -104287 1317774 -1878226 -1070563 725880 851910 1733371 -1767894
740 -1893722 -210176 -447533 672243 235462 746694 756786 -1383 -1739832 -32309 -775263
730g75263I79946a476641A763510d64042p17382A70063c51760a58446o03402l84702
720a146550N39774E97876h10299G60902A22953f94992A068141l42877k75772R3619
710E43111d28857E45197k56173b57902A269833b40059q85419A611105C01439a792928
699a82770G82120O76635l21364b26519C31589f1104B07745b21609n82791D74675
688I10978c98581A260015a449913b95723M5557A57980h22779K81158D25097h35420
677B011761C57447b27577B46956a120133e24877A64615a743k36483j048269A860709
666g57689E25468c47385J47551g1042B62026C1568K904563I09249b2634q77605
656i00239k41180J52270m6501A584501E35442f5742k577078A266053g4200o57211
$$ plain form
730 -775263 979946 -1476641 1763510 -464042 -1181424 170063 -351760 -158446 -761848 -1146550
720 -1146550 -606776 597876 -810299 760902 122953 -694992 1068141 725264 449492 543111
710 543111 -428857 545197 289024 -257902 1269833 -240059 -1125478 1611105 301439 -1792928
699 -182770 782120 1458755 1137391 -226519 331589 -61104 207745 -221609 -804400 474675
688 910978 -398581 1260015 -1449913 -295723 -250166 157980 -822779 -541621 425097 -835420
677 2011761 357447 -227577 246956 -1120133 -524877 164615 -1743 -238226 -1286495 1860709
666 -757689 525468 -347385 -199834 -71042 262026 31568 2936131 909249 -22634 -900239
656 -900239 -1141419 -989149 -1035650 1584501 535442 -65742 -2642820 1266053 -74200 -731411
646g31411L28799B054692B14170K60364d77888G33533a75460G2905J19512c85655
635e24385H39103c24898H57098L46952f85401B85636I0810a630198i3001H37938
624b84651m27016a49384A119426g83926K15744O2266E82660a086109g4368F48556
613b79888e9389p51327a18277j004938H00308i05939H45438i31916E52662d47928
602A385361c55664l54689C21339O14824c2268D53727J29941a015675D14389B01009
591E96459J128139p73490D06045a67818j10163A814389A93085K93238g8639r82744
581a061383c45868D38804a437278C555199a479909N21042B16256J535929c51747
571a112463a14205C16379M2003a00368j792363B30171J67030a97936q16654C95407
$$ plain form
646 -731411 -402612 2054692 214170 474534 -477888 733533 -175460 72905 192417 -385655
635 -524385 839103 -324898 857098 1204050 -685401 285636 90810 -1630198 -93001 837938
624 -284651 -711667 -149384 1119426 -783926 -568182 -505916 582660 -1086109 -74368 648556
613 -279888 -59389 -810716 -118277 -1123215 800308 -905939 845438 -931916 552662 -447928
602 1385361 -355664 -710353 321339 936163 -32268 453727 583668 -1015675 414389 201009
591 596459 1724598 951108 406045 -167818 -277981 1814389 193085 486323 -78639 -1061383
581 -1061383 -345868 438804 -1437278 3555199 -1479909 -958867 216256 1752185 -351747
571 -1112463 -114205 316379 358382 -100368 -1892731 230171 397201 -197936 -1014590 395407
560C01351Q0270d99141B71623P94552P51267b39693r39997a04402F70477L76483
550A046960i48513Q1839A048439J589796a417829C38604a38140o4438A685207
540a07036B78185L92776k6367d98513E23703B59997a28892D88292d15637G49448
529b762389D9117f35423A515390c87791C43755M67525i27940j93410G81835f18181
518g13530E61469i3212A05012a306766A520211a897390A258505c06018j888670
509b194688A464747b96785F55285a112514M85073B36429J78594a077103B36219
499B32563d63878m78075F58927e66398D59145a445691K77247f8975A44202f05983
488c76655j21913b12081l39330F99430i38462q50777f66635K70117B015490A4400
$$ plain form
560 301351 381621 -499141 271623 1066175 1817442 -239693 -1179690 -104402 670477 1046960
550 1046960 -948513 -866674 1048439 2638235 -1417829 338604 -138140 -202578 1685207
540 -107036 278185 670961 644594 -498513 523703 259997 -128892 488292 -415637 749448
529 -2762389 49117 -635423 1515390 -387791 343755 811280 -927940 -1121350 781835 -618181
518 -713530 561469 -93212 105012 -1306766 1520211 -1897390 1258505 -306018 -2194688
509 -2194688 1464747 -296785 655285 -1112514 -627441 236429 415023 -1077103 236219
499 232563 -463878 -941953 658927 -566398 459145 -1445691 -1168444 -68975 144202 -605983
488 -376655 -498568 -212081 -551411 699430 -938462 -1789239 -666635 -396518 2015490 14400
477d19734A744438f79479a20401j318154L91320D08280h0258A151487h59461L74960
467d84501j09988G35633f66959A918286B12254L01320j46668a273684A35160J029845
457A165005i88271J98716J31941k90836A620466p87263a70152j98661D0891f43991
446A934331F52864d40335a22928l28328j16644A127935C41104M54481K63056h27080
435A16175K131451b64532j373263F87228L78661a58729H03065A01267L91890g9695
424B85316o0655R59275C59983Q65257a614802b59851F24073g85406F1362f89052
413A125493a288664K90972C48784F9446P64128k09647f24284K5929K43829q34113
403a188639H54817a382285F45535k7522k9912i97786C86974K011484b14478E72329
$$ plain form
477 -419734 1744438 -679479 -120401 -1438555 -1047235 408280 -80258 1151487 -859461 -484501
467 -484501 -594489 735633 -666959 1918286 212254 513574 366906 -1273684 135160 1165005
457 1165005 -988271 -789555 -657614 -948450 1620466 833203 -170152 -368813 40891 -643991
446 1934331 652864 -440335 -122928 -451256 -567900 1127935 341104 795585 1058641 -827080
435 116175 2247626 -264532 -1637795 687228 1065889 -158729 803065 101267 493157 -79695
424 285316 224661 1183936 359983 1225240 -1614802 -259851 624073 -785406 61362 -689052
413 1125493 -1288664 -997692 348784 69446 833574 623927 -624284 -598355 -354526 -1188639
403 -1188639 854817 -1382285 645535 618013 588101 -997786 386974 2398458 -214478 572329
392I57855a537392A11696J374023a307414c46711A91075l3290K78149a031504
382A475543m99348a806345A180690E03692b7352p16262k47330l24431A588263
372h57977k78261A639478A7642J036770d52341A472510d14434A93224q3616c73254
361A176053C9890J201401a281344F19193b4542j331298i7038A460239h73484G1022
350E95507a193420A262861D45877a153500E07309a71695q5231k16857D44110o6362
340C77748R70993M85635d12901I25773l88378a605829A17303A7300g68182c74241
329H6996J23510J81146M98775B27065J177431e9547H42266a84720o6484k40244
319d91448A70375c11425H06579d24251A119232D51914l9970e37604p52975J4585
$$ plain form
392 957855 -1537392 111696 1485719 -1307414 -346711 191075 157785 435934 -1031504
382 1475543 976195 -1806345 1180690 503692 -27352 -743614 -990944 -1315375 1588263
372 -857977 -1136238 1639478 17642 1054412 -452341 1472510 -414434 193224 109608 -373254
361 1176053 39890 1241291 -1281344 619193 -24542 -1355840 -97038 1460239 -873484 71022
350 595507 -1193420 1262861 445877 -1153500 507309 -171695 -256926 -473783 444110 377748
340 377748 1348741 1834376 -412901 925773 537395 -1605829 117303 17300 -768182 -374241
329 86996 210506 391652 890427 227065 1404496 -59547 842266 -184720 -251204 -491448
319 -491448 170375 -311425 806579 -424251 1119232 451914 411944 -537604 -1290579 -1275994
309a275994b91830C20815a259174D3062O71933B05480R63874b300910R00655B51424
298a097460M60727A707764g11833a03785f377A179267a01971B16474K16633a85142
287a072697E98123j74504a30395k070804g68486A032756f19736D78143g14129
277b09105B75445L0267J15972f98272b91240o15873B48145a359337G42438b08249
266b83848B06569E6812R83303C39132h77729L97962E47996a661871G01130b34400
255A70096a78047K2763M3250H18805c6645F25808R77202a447945f40693b64853
244h73752A061494e35298l50574E25350J61750a09053G87573j20054a30794p8793
234b09587n11722I14767h60281I18773l67533r40B15214a078703A586798G70883
$$ plain form
309 -1275994 -291830 320815 -1259174 43062 714995 205480 1169354 -2300910 -1400255 251424
298 -1097460 -636733 1707764 -711833 -103785 -6377 1179267 -101971 216474 433107 -185142
287 -1072697 598123 423619 -130395 -2201199 -768486 1032756 -619736 478143 -714129
277 -209105 275445 305712 421684 -698272 -291240 -907113 248145 -1359337 742438 -208249
266 -283848 206569 56812 1040115 339132 -877729 -479767 547996 -1661871 701130 -234400
255 170096 -178047 -155284 -112034 818805 -36645 625808 1603010 -1447945 -640693 -264853
244 -873752 1061494 -535298 -885872 525350 687100 -109053 787573 667519 -130794 -209587
234 -209587 -721309 914767 -860281 918773 551240 550300 215214 -1078703 1586798 770883
223a82156B76553a65230o56549A375781a65497B24153i93378A65442e41636A579426
212c79306J86305G02168K71633b55080F72927J17263d7050E59351a82865p93317
202i76182A311176H6408f46806A100278a022332h5949A087873D70550A46183K82556
192D28739d89596B98402f24606A234917k86609B49153g22242j64045L82946A774758
181f23372C84734a247568A5241K23706Q77834A0673a465607E45814g0191E40364
170A18001N25101k51215a141152A175073E5847O26344b59396D518b46090l41519
160e87609p1216A504218g54371q34947F28054e71818a96306m39696A165304b50165
149a068439F50807J076610a52211j341746A22256d16265j414566A694640a064312
$$ plain form
223 -182156 276553 -165230 -821779 1375781 -165497 224153 -993378 165442 -541636 1579426
212 -379306 -193001 702168 973801 -255080 672927 790190 -47050 559351 -182865 -976182
202 -976182 1311176 86408 -646806 1100278 -1022332 -85949 1087873 470550 146183 428739
192 428739 -489596 298402 -624606 1234917 948308 249153 -722242 -886287 -503341 1774758
181 -623372 384734 -1247568 15241 238947 1116781 10673 -1465607 545814 -70191 540364
170 118001 643102 391887 -1141152 1175073 55847 682191 -259396 4518 -246090 -587609
160 -587609 -658825 1504218 -754371 -1589318 628054 -571818 -196306 -636002 1165304 -250165
149 -1068439 650807 1727417 -152211 -1493957 122256 -416265 -1830831 1694640 -1064312
139G23358K47146a582166C80636g98590q29746A038526a995982I67513A79820
129A719680h72691D06878A01580O42377a4300B21899J193715h22188F92356N74048
119A266404I1287C5225a873595g60503E50441N01336b126244A391913a42147j428276
109a570423G00158C10028D340K37053e34632j87045c29860j12408J73296A85873
98A214048n77580A39072e13975A173005b58237j608814F42008e30276G48835n5598
88F93237b319412A45782M62119a295576A360547d62392I83351D79451b18008j209717
78a427725L99316b48510F35657c93262J74005l74663b36851l30678G16503i31459
67A975236C51652d76076E26065c90962c895D4376i18320E92722f8031C60488a73850
$$ plain form
139 723358 970504 -1582166 380636 -798590 -1628336 1038526 -1995982 967513 179820
129 1719680 -872691 406878 101580 743957 -14300 221899 1415614 -822188 692356 1266404
119 1266404 91287 35225 -1873595 -760503 550441 1051777 -2126244 1391913 -142147 -1570423
109 -1570423 700158 310028 4340 241393 -534632 -721677 -329860 -442268 -268972 185873
98 1214048 636468 139072 -513975 1173005 -258237 -1867051 642008 -530276 748835 693237
88 693237 -2319412 145782 607901 -1295576 1360547 -462392 983351 479451 -218008 -1427725
78 -1427725 -1028409 -248510 635657 -393262 -219257 -593920 -236851 -567529 716503 -931459
67 1975236 351652 -476076 526065 -390962 -3895 44376 -918320 592722 -68031 360488 -173850
55b87910F51173a247374C60226f4212D48627d60432C45132M87100a320981H11811
44a84308n10515A399265d8515C64897L70135a706024n38767C29764J73963f58977
33c43786O2912r234r59801R6325B08628e81786a70442r47881I72518g83929b01280
21b90218B332502H40275g62895A66768D0639P32497a069741i8919d7338B51084
10E51921a92910K2901D6113b10120A373135A77924a488752H37146e0739q24278
0h75017
$$ plain form
55 -287910 651173 -1247374 360226 -64212 448627 -460432 345132 832232 -1320981 811811
44 -184308 -694823 1399265 -48515 364897 735032 -1706024 -2244791 329764 503727 -658977
33 -343786 -280874 -290108 -1249909 -1153584 208628 -581786 -170442 -1118323 972518 -783929 -201280
21 -290218 2332502 840275 -762895 166768 40639 773136 -1069741 -98919 -47338 251084
10 551921 -192910 -170009 46113 -210120 1373135 177924 -1488752 837146 -50739 -875017
0 -875017
##PAGE= F1=14381.68482309
##FIRST=     21204.543296753, 3104.07366071428, -190822
##DATA TABLE= (F2++(Y..Y)), PROFILE
2047a90822A180006C7554c25571P0896E97977c10134p5665r5249E68652a087182
2036c91960n14898J38834K09929D27998c19768r74058G19614c02771d3463F95168
2025B69581C8301L62848c29910r58089A345785e36210I91015I4115g6930j57078
2015b34008k51068I80839a148387I49516a24746E24589b092991G37710l05690
2006D32020d35855l55769d0364m77095l13560L40850E28022D6704L38497N7127
1996D42328a96887H09468B43147j12606K21036j56203K8517a420008A351652f27266
1985e62566D85548b597283j628347q587877b469259C83437P57258J351157H2548
1975C95104n6888R8248J95359J85649c0642k95085A90514e12258i0605j96993
$$ plain form
2047 -190822 1180006 37554 -325571 -254675 597977 -310134 -385799 -481048 568652 -1087182
2036 -391960 -906858 -768024 -558095 427998 -319768 -1293826 719614 -302771 -43463 695168
2025 269581 38301 401149 -329910 -1287999 1345785 -536210 991015 94115 -76930 -234008
2015 -234008 -485076 980839 -1148387 949516 -124746 524589 -2092991 737710 432020
2006 432020 -435855 -791624 -40364 -517459 -831019 -490169 528022 46704 385201 442328
1996 442328 -196887 809468 243147 130541 351577 195374 223891 -1420008 1351652 -627266
1985 -562566 485548 -2597283 -4225630 -12813507 -2469259 383437 1140695 2491852 82548
1975 395104 338216 436464 631823 817472 -30642 -325727 190514 -512258 -90605 -287598
1965b87598A163839i70020H76802m18677h11918A661616b40900J05559l8291G66727
1954e8229C10489M72923a236534d22798p90139N32177o70358I73723g90078l03533
1944a093611M16699C09573j7425g89934G17494J436249a536916O00132F40645
1934c25013P0982o88834c36086E02212R10147E49159a521644O07653A022674C29801
1923a078733g6468B29862G9097d3793r67287A28064N22623L2848B45706O22634
$$ plain form
1965 -287598 1163839 -970020 876802 458125 -811918 1661616 -240900 -135341 -173632 766727
1954 -58229 310489 783412 -1236534 -422798 -1212937 -680760 -1351118 973723 -790078 -1093611
1944 -1093611 -676912 309573 292148 -789934 717494 2153743 -1536916 -936784 640645
1934 -325013 -254031 -942865 -336086 502212 1412359 549159 -1521644 -913991 1022674 329801
1923 -1078733 -76468 229862 79097 -43793 -1011080 128064 650687 683535 245706 868340
$$ [...]
##END NTUPLES=nD NMR SPECTRUM
##END=
