##TITLE=XTC-z189_1
##JCAMPDX= 6.0         $$ Bruker NMR JCAMP-DX V2.0
##DATA TYPE= NMR SPECTRUM
##DATA CLASS= NTUPLES
##ORIGIN= BRUKER
##OWNER= patiny
$$ 1.79 TOPSPIN		Version 3.0
$$ 2012-05-21 03:55:34.735 +0200  patiny@icmbsg005
$$ Compression mode = diff/dup
##.OBSERVE FREQUENCY= 400.13188181139
##.OBSERVE NUCLEUS= ^1H
##.ACQUISITION MODE= SIMULTANEOUS (DQD)
##.ACQUISITION SCHEME= undefined
##.AVERAGES= 16
##.DIGITISER RES= 23
##SPECTROMETER/DATA SYSTEM= spect
##.PULSE SEQUENCE= zgpr
##.SOLVENT NAME= D2O
##.SHIFT REFERENCE= INTERNAL, D2O, 1, 11.69961
##AUDIT TRAIL= $$ (NUMBER, WHEN, WHO, WHERE, PROCESS, VERSION, WHAT)
$$ ##TITLE= Audit trail, TOPSPIN		Version 3.0
$$ ##JCAMPDX= 5.01
$$ ##ORIGIN= Bruker BioSpin GmbH
$$ ##OWNER= patiny
$$ $$ /opt/data/patiny/nmr/XTC-z189_1/11/pdata/1/auditp.txt
$$ ##AUDIT TRAIL=  $$ (NUMBER, WHEN, WHO, WHERE, PROCESS, VERSION, WHAT)
(   1,<2012-05-21 03:55:33.316 +0200>,<patiny>,<icmbsg005>,<go>,<TOPSPIN 3.0>,
      <created by zg
	started at 2012-05-21 03:53:47.402 +0200,
	POWCHK enabled, PULCHK disabled,
       configuration hash MD5:
       77 C7 B7 C4 10 F4 BA 30 64 2E BB 52 82 F2 DA 41
       data hash MD5: 32K
       37 46 7E DC C6 F1 35 A2 60 09 AF E9 C0 A1 91 E6>)
(   2,<2012-05-21 03:55:33.710 +0200>,<patiny>,<icmbsg005>,<audit>,<TOPSPIN 3.0>,
      <user comment:
       ICON-NMR User ID: patiny
       data hash MD5: 32K
       37 46 7E DC C6 F1 35 A2 60 09 AF E9 C0 A1 91 E6>)
(   3,<2012-05-21 03:55:34.274 +0200>,<patiny>,<icmbsg005>,<proc1d>,<TOPSPIN 3.0>,
      <Start of raw data processing
       ef LB = 0 FT_mod = 6 PKNL = 1 SI = 16K 
       data hash MD5: 16K
       9A 0A 4C 91 BF CD 6B FD 7A 38 52 DB C4 67 DC 73>)
(   4,<2012-05-21 03:55:34.373 +0200>,<patiny>,<icmbsg005>,<proc1d>,<TOPSPIN 3.0>,
      <apk 
       data hash MD5: 16K
       9C F9 6E 30 46 21 52 39 7B A6 A1 F9 53 DE 87 37>)
(   5,<2012-05-21 03:55:34.392 +0200>,<patiny>,<icmbsg005>,<proc1d>,<TOPSPIN 3.0>,
      <abs ABSG = 5 
       data hash MD5: 16K
       6C 21 F9 2B 86 0F 68 3A 80 F2 89 08 76 AF 67 D5>)
$$ ##END=
$$ 
$$ $$ hash MD5
$$ $$ C3 82 70 2E C5 AF FA CA FE B6 91 E2 23 30 4D 7D
##$RELAX= 
##$RELAX= 
##$RELAX= 
##$RELAX= 
##$RELAX= 
##$RELAX= 
##$RELAX= 
##$RELAX= 
##$RELAX= 
##$RELAX= 
##$RELAX= 
##$RELAX= 
##$RELAX= 
$$ Bruker specific parameters
$$ --------------------------
##$DATPATH= </opt/data/patiny/nmr>
##$EXPNO= 11
##$NAME= <XTC-z189_1>
##$PROCNO= 1
##$ACQT0= -9.16730304209974
##$AMP= (0..31)
100 100 100 100 100 100 100 100 100 100 100 100 100 100 100 100 100 100
100 100 100 100 100 100 100 100 100 100 100 100 100 100
##$ANAVPT= -1
##$AQSEQ= 0
##$AQ_mod= 3
##$AUNM= <au_zgglp>
##$AUTOPOS= <57 >
##$BF1= 400.13
##$BF2= 400.13
##$BF3= 400.13
##$BF4= 400.13
##$BF5= 400.13
##$BF6= 400.13
##$BF7= 400.13
##$BF8= 400.13
##$BYTORDA= 0
##$CAGPARS= (0..11)
0 0 0 0 0 0 0 0 0 0 0 0
##$CFDGTYP= 0
##$CFRGTYP= 9
##$CHEMSTR= <none>
##$CNST= (0..63)
1 1 1 1 1 1 1 1 1 1 1 1 1 1 1 1 1 1 1 1 1 1 1 1 1 1 1 1 1 1 1 1 1 1 1 1
$$ [...]
##$TE2= 0
##$TE3= 0
##$TE4= 0
##$TEG= 300
##$TE_PIDX= 1
##$TE_STAB= (0..8)
2 2 0 0 0 0 0 0 0
##$TL= (0..7)
120 120 120 120 120 120 120 120
##$TP= (0..7)
150 150 150 150 150 150 150 150
##$TPNAME0= <>
##$TPNAME1= <>
##$TPNAME2= <>
##$TPNAME3= <>
##$TPNAME4= <>
##$TPNAME5= <>
##$TPNAME6= <>
##$TPNAME7= <>
##$TPOAL= (0..7)
0.5 0.5 0.5 0.5 0.5 0.5 0.5 0.5
##$TPOFFS= (0..7)
0 0 0 0 0 0 0 0
##$TUNHIN= 0
##$TUNHOUT= 0
##$TUNXOUT= 0
##$USERA1= <>
##$USERA2= <>
##$USERA3= <>
##$USERA4= <>
##$USERA5= <>
##$V9= 5
##$VALIST= <>
##$VCLIST= <>
##$VD= 0
##$VDLIST= <>
##$VPLIST= <>
##$VTLIST= <>
##$WBST= 1024
##$WBSW= 4
##$XGAIN= (0..3)
0 0 0 0
##$XL= 0
##$YL= 0
##$YMAX_a= 8596215
##$YMIN_a= -5119629
##$ZGOPTNS= <>
##$ZL1= 120
##$ZL2= 120
##$ZL3= 120
##$ZL4= 120
##$ABSF1= 11.69961
##$ABSF2= -2.293603
##$ABSG= 5
##$ABSL= 3
##$ALPHA= 0
##$AQORDER= 0
##$ASSFAC= 0
##$ASSFACI= 0
##$ASSFACX= 0
##$ASSWID= 0
##$AUNMP= <save_auto_nonLDAP.pm>
##$AXLEFT= 0
##$AXNAME= <>
##$AXNUC= <1H>
##$AXRIGHT= 0
##$AXTYPE= 0
##$AXUNIT= <>
##$AZFE= 0.1
##$AZFW= 0.1
##$BCFW= 0
##$BC_mod= 0
##$BYTORDP= 0
##$COROFFS= 0
##$CY= 15
##$DATMOD= 1
##$DC= 0
##$DFILT= <>
##$DTYPP= 0
##$ERETIC= no
##$F1P= 0
##$F2P= 0
##$FCOR= 0.5
##$FTSIZE= 16384
##$FT_mod= 6
##$GAMMA= 0
##$GB= 0
##$INTBC= 1
##$INTSCL= 1
##$ISEN= 128
##$LB= 0
##$LEV0= 0
##$LPBIN= 0
##$MAXI= 10000
##$MC2= 0
##$MEAN= 0
##$ME_mod= 0
##$MI= 0
##$NCOEF= 0
##$NC_proc= -6
##$NLEV= 6
##$NOISF1= 0
##$NOISF2= 0
##$NSP= 0
##$NTH_PI= 0
##$NZP= 0
##$OFFSET= 11.69961
##$PC= 1
##$PHC0= 87.91975
##$PHC1= 6.275613
##$PH_mod= 1
##$PKNL= yes
##$PPARMOD= 0
##$PPDIAG= 0
##$PPIPTYP= 0
##$PPMPNUM= 2147483647
##$PPRESOL= 1
##$PSCAL= 0
##$PSIGN= 0
##$PYNMP= <proc.py>
##$REVERSE= no
##$SF= 400.13
##$SI= 16384
##$SIGF1= 0
##$SIGF2= 0
##$SINO= 0
##$SIOLD= 16384
##$SPECTYP= <>
##$SREGLST= <1H.CDCl3>
##$SSB= 0
##$STSI= 16384
##$STSR= 0
##$SW_p= 5599.10414333707
##$SYMM= 0
##$S_DEV= 0
##$TDeff= 32768
##$TDoff= 0
##$TI= <>
##$TILT= no
##$TM1= 0
##$TM2= 0
##$TOPLEV= 0
##$USERP1= <>
##$USERP2= <>
##$USERP3= <>
##$USERP4= <>
##$USERP5= <>
##$WDW= 1
##$XDIM= 16384
##$YMAX_p= 395879092
##$YMIN_p= -6650087
##$CURPLOT= <Cups-PDF>
##$CURPRIN= <$Cups-PDF>
##$DFORMAT= <normdp>
##$LAYOUT= <+/1D_X+nopp.xwp>
##$LFORMAT= <normlp>
##$PFORMAT= <normpl>
$$ End of Bruker specific parameters
$$ ---------------------------------
##NTUPLES= NMR SPECTRUM
##VAR_NAME=  FREQUENCY,     SPECTRUM/REAL,   SPECTRUM/IMAG
##SYMBOL=    X,             R,               I
##VAR_TYPE=  INDEPENDENT,   DEPENDENT,       DEPENDENT
##VAR_FORM=  AFFN,          ASDF,            ASDF
##VAR_DIM=   16384,         16384,           16384
##UNITS=     HZ,            ARBITRARY UNITS, ARBITRARY UNITS
##FACTOR=    0.3417421962486, 1,             1
##FIRST=     5598.76240114082, 8808,         -124970
##LAST=      0,             -65977,          -219658
##MIN=       0,             -6650087,        0
##MAX=       5598.76240114082, 395879092,    0
$$ Real data points
##PAGE= N=1
##DATA TABLE= (X++(R..R)), XYDATA
$$ [...]
10871C10006f2368B31238e2346B5980R8062R8146a18869E8507b43495c5153C0208
10859A02139e4002j15233C10109j25330K4371J87088J34728j50138K53425l01386
10849C32867n6339K50859j54022p4291J11182A58648a5436B64820j29658E2369
10838@I2800P0216b6445B54276D4143P5021d939j78347H4874h2811A998K38655
10826B40653a01784b3832n8344C4750r0J72025a25111l2756b0342Q282c730A79998
10813b11700g5658j85348A2484O8647N0692h1208j9870L3693P223C5184e155j51919
10801a57074B93535a9703j45802A63847l545C9840Q8727J51916N8074j66279j1191
10790A61087m8162D7415a07181D7498K3641O0513k6091K26548D7478R1559g7876
$$ y = [310006, -62368, 231238, -52346, 25980, 124042, 222188, -118869, 58507, -243495, -35153, 30208, 102139, -54002, -169235, 310109, 184779, 209150, 396238, 530966, 380828, 634253, 332867, 276528, 527387, 373365, 299074, 410256, 158648, -15436, 264820, 135162, 52369, 0, 92800, 163016, -26445, 254276, 44143, 119164, -4939, -183286, 84874, -82811, 1998, 240653, -101784, -23832, -82176, 34750, 34660, 206685, -125111, -157867, -20342, -12060, -3730, 179998, -211700, -75658, -261006, 12484, 81131, 131823, -81208, -101078, -67385, -60162, 35184, -5155, -157074, 293535, -19703, -165505, 163847, 160302, 39840, 128567, 280483, 338557, 172278, 161087, 112925, 47415, -107181, 47498, 71139, 131652, 105561, 332109, 47478, 139037, -77876]
10778A84637p9621a73340A28062l5830K6100b4161B88645A16140K35904p3700
10768B78344p7281G161L48898m5700a20401H9182J6503Q877l8571L04725I3452
10756g4574L2504J2862l19272e4732A7656a61246I4558e6600J0995A25505J91
10745A25696J12103N8249M2337A08098K1201a47372c2515D7537K6208a37234e7257
10733I8197hk3985q3475m4987A29833K0740c4577D1804J97254B9988N8142c3302
10720A65803A8200R2396N9196f4836A60500E3890o439Q2227J01086I6800i4396
10708B02708a7381H5979L5921a3082r0127D50290j39499J18739k03845H6306J84483
10697B70789l0953m5155K76959j69882J59188n026R0937J22651O22917J14267
$$ y = [184637, 105016, -173340, 128062, 92232, 118332, -24161, 288645, 116140, 352044, 278344, 201063, 7161, 356059, 310359, -120401, 89182, 105685, 114562, 75991, 380716, 93452, -74574, -42070, -29208, -348480, -54732, 17656, -161246, 94558, -56600, -45605, 125505, 125696, 237799, 296048, 338385, 108098, 129299, -147372, -32515, 47537, 73745, -137234, -57257, 98197, -8, -23993, -107468, -152455, 129833, 150573, -34577, 41804, 239058, 29988, 88130, -33302, 165803, 18200, 110596, 169792, -64836, 160500, 53890, 47451, 129678, 230764, 96800, -94396, 202708, -17381, 85979, 121900, -13082, -103209, 450290, 310791, 429530, 225685, 86306, 270789, 239836, 194681, 471640, 301758, 460946, 455920, 546857, 669508, 1292425, 1406692]
10687A406692j06643K06450L49799K66218N23007O03479J145603L181777O572565
10678A4148947J0612990J0301265L169270r860828j2533897p751825k957642j322803
10670C805477n68138n09162l84105k10308K92285M71641J50560k60674J46368
10661B933944R2803Q86020Q58912J503074L786925Q618741J5553117J7328628
10653E1562164Q301665j1572807j9667742A4067522o040081k585899j226710j276637
10645B938195l06432o03672K06559l44868m10999j14822l38953K57843m51462
10636H31389J31191k04003L28242j66710K42655j4222K08905R0055O46409K69250
10626B363161O65292K54568Q19123Q86111J275873K730240N083624Q821545J2270788
$$ y = [1406692, 1300049, 1506499, 1856298, 2122516, 2645523, 3249002, 4394605, 7576382, 14148947, 24761937, 35063202, 38232472, 28371644, 15837747, 8085922, 5128280, 3805477, 3237339, 2728177, 2344072, 2133764, 2426049, 2897690, 3048250, 2787576, 2933944, 3026747, 3912767, 4771679, 6274753, 10061678, 18680419, 34233536, 51562164, 59863829, 48291022, 28623280, 14067522, 8027441, 5441542, 4214832, 2938195, 2631763, 2028091, 2234650, 1889782, 1478783, 1363961, 1025008, 1282851, 831389, 962580, 758577, 1086819, 920109, 1162764, 1148542, 1357447, 1447502, 2093911, 2363161, 3028453, 3283021, 4102144, 4988255, 6264128, 8994368, 14077992, 22899537, 35170325]
10617C5170325J0082168L980033l417780l100411M537705O635024O39222j1533208
10609D2993078j5210716j1747286n957666l203589j725989j123146p02529n76395
10601B745762p00146j40880n82472k69483l25794M4244j88322k72233J41019P1523
10591E23218B45581K04864n0981j41512N8425J75026r8101k4919J6524n3921K91154
10580F22140C04292J83817q4163J18579J43199K19193M6965J47256N8640J71395
10570A309173K26765L54214L17746M71630L66912Q27440R87986K601060N538855
10561A3001781Q601295R531233O299586J11251o211700j617823J092772L085509
10553C3893904k705355p714763q218732o166787l177899j418890o45790p50326
$$ y = [35170325, 45252493, 49232526, 45814746, 42714335, 47252040, 53887064, 54526286, 42993078, 27782362, 16035076, 10077410, 6873821, 5147832, 4024686, 3322157, 2745762, 2045616, 1904736, 1322264, 1052781, 726987, 771231, 582909, 310676, 451695, 523218, 245581, 450445, 399464, 257952, 316377, 491403, 393302, 368383, 384907, 330986, 622140, 304292, 488109, 403946, 522525, 665724, 884917, 931882, 1079138, 1137778, 1309173, 1535938, 1890152, 2207898, 2679528, 3046440, 3873880, 4861866, 7462926, 13001781, 21603076, 31134309, 37433895, 37545146, 31333446, 29715623, 30808395, 33893904, 31188549, 23473786, 15255054, 9088267, 5910368, 4491478, 3845688, 3095362]
10545C095362j57422J86009N271M90126K61624J428639L058788N429769O613786
10536B0411952N593142O39772l027623k313249K92564K824663j254977m463113
10528A8703131o756192n175580k564809j339820q23786k54430o80079K1565k53840
10519H76160l1872k93585J06723j06736k01881j43387f3757C17173G0955e4184
10508F4829k0167M6399b33722h3331Q028B95026i3349l8188B68597g9889k2247
10497a02136A27345a0911N427j96179e7107B49214a52759D9505c0836n6681c4376
10485A34726h9857K7600a3300A8781j488b24776A06709a43314f7912F3028b90590
10473a44013j38960F4974L4741h6813I5165l1071h6237J9389m1038M8331I389
$$ y = [3095362, 2937940, 3123949, 3129220, 3619346, 3880970, 5309609, 8368397, 13798166, 20411952, 26005094, 26644866, 23617243, 21303994, 21596558, 24421221, 23166244, 18703131, 11946939, 6771359, 4206550, 2866730, 2042944, 1788514, 1108435, 1130000, 876160, 844288, 550703, 657426, 550690, 348809, 205422, -63757, 317173, 70955, -54184, 64829, 44662, 91061, -233722, -83331, -75303, 295026, -93349, -131537, 268597, -79889, -102136, 127345, -10911, -5484, -201663, -57107, 249214, -152759, 49505, -30836, -87517, -34376, 134726, -89857, -62257, -13300, 18781, 17293, -224776, 106709, -143314, -67912, 63028, -290590, -144013, -282973, 64974, 99715, -86813, 95165, 64094, -86237, -66848, -107886, -59555, 9389]
10461b09554A2185d0404q6238j8112A3266b58833C43886i0282E4546a02885Q01
10450a02084n1927A38547f1790q5623G468N5532e7979l23930R6393M0390a07928
10438E7148a72955E2072O9937a05933A0487f8376B33104n5246K01842K16160g7312
10426c5438A77025a4909k81695a7727q0339G9984a53073K6761O1372m0340j53275
10415b58555K5549J13290o5957A6370M0372R3151L1402l864J40194j08053C9835
10403B68964f7720G8309b68914C8366a24299A01140o733b48288c0583A08818d7121
10391a75239d4398k98996a35873f2069n5393A03699a1368G6316O5347d9594A12845
10379h906E1239J90317C7567L68144j26688I9586J92566l5490l5600J53311j86075
$$ y = [-209554, 12185, -40404, -126642, -144754, 13266, -258833, 343886, -90282, 54546, -102885, -102084, -154011, 138547, -61790, -147413, 7468, 63000, -57979, -381909, -285516, -245126, -107928, 57148, -172955, 52072, 122009, -105933, 10487, -68376, 233104, 177858, 379700, 595860, -77312, -35438, 177025, -14909, -296604, -17727, -98066, 79984, -153073, -126312, -64940, -105280, -258555, -233006, -119716, -185673, 16370, 56742, 149893, 181295, 177431, 317625, 209572, 39835, 268964, -67720, 78309, -268914, 38366, -124299, 101140, 94407, -248288, -30583, 108818, -47121, -175239, -44398, -343394, -135873, -62069, -117462, 103699, -11368, 76316, 141663, -49594, 112845, -8906, 51239, 241556, 37567, 405711, 279023, 99586, 292152, 256662, 221062, 374373, 188298]
10368A88298H2503a68864O1016q3745N9859h936A60536h5232j54141M3162E3673
10356b44112B76186j02511k0918A2982a94806O3483l3333L3036j4077J6642M8658
10345h0397L4529j36995K815p6133L1641R2377j3201F4238d878k04158H9639a22653
10332a75441B12131J961A8103L4464a88563F2232k006L59432A39922C8981J42219
10321A81200a09984A71170E2536J60378K1154G7945H481P7822p056g5106h056
10309i0991B66432A818d5355j10854N4169I0236P0478k8422K62678A2743J81234
10298A93977b4748G0007R0769J85598c877B2935K46394a01248H3956p529a1847
10286C0156h4103K950A24914b88376h8212O303n2186l50A0975a41818k5921o5425
$$ y = [188298, 82503, -168864, -107848, -191593, -131734, -8936, 160536, -85232, -239373, -196211, 53673, -244112, 276186, 173675, 152757, 12982, -194806, -131323, -164656, -131620, -145697, -129055, -80397, -45868, -182863, -180048, -256181, -224540, -132163, -145364, 64238, -4878, -209036, 89639, -122653, -175441, 212131, 214092, 18103, 52567, -188563, 62232, 60226, 419658, 139922, 38981, 181200, -109984, 171170, 52536, 212914, 234068, 77945, 8481, 86303, 79247, -75106, -8056, -90991, 266432, 1818, -45355, -156209, -102040, 90236, 160714, 132292, 394970, 12743, 193977, -24748, 70007, 160776, 346374, -3877, 22935, 269329, -101248, 83956, 76427, -11847, 30156, -84103, -81153, 124914, -288376, -88212, -81909, -134095, -134445, 10975, -141818, -167739, -233164]
10274b33164b1180k73019G4561e0842A9439d2190E8970i8623D2974a21406d548
10262b00218H8586a08018A11865a39929G008J63635a26588q7152j23975h9118
10251g812A32516K4746n130F7077a74473O8212l2748J5151k891m8922M017D983
10238g9791E1600b34444A69135k9786B3624b90644C6263J21636a25033j76800
10228c01833a01515m9302A89474b89360M1637A6267a2069j3460j19804k76134
10218d21467a20143j1208o5705j56095c8238F4896a68564M860P2439L6435D1857
10206A67804C1951a08912A5047a08773C05195a91846A04917g651A971a14491n3287
10195a67778B6997J10968b874k65347f6706n6863B6931e7753j37166B6890b70665
$$ y = [-233164, -21180, -294199, 74561, -50842, 19439, -42190, 58970, -98623, 42974, -121406, -4548, -200218, 88586, -108018, 111865, -139929, 7008, 170643, -126588, -213740, -337715, -89118, -7812, 132516, 157262, 152132, 67077, -174473, -106261, -139009, -123858, -126749, -175671, -171654, 4983, -79791, 51600, -234444, 169135, 139349, 23624, -290644, 36263, 157899, -125033, -301833, -101515, -150817, 189474, -289360, -247723, 16267, -12069, -25529, -145333, -421467, -120143, -131351, -197056, -353151, -38238, 64896, -168564, -163704, -91265, -54830, 41857, 167804, 31951, -108912, 15047, -108773, 305195, -191846, 104917, -7651, 1971, -114491, -167778, 26997, 137965, -2874, -268221, -66706, -123569, 26931, -57753, -194919, 26890, -270665]
10183b05910C7248J9363c9061C4815a05003i388A03944b8406D340J41171D4415
10171B4178O9455a34451m2768E4826a27109M8544k58866i1525a6608k52278A04614
10159c2627j1352k02113i8995O986F8440K5232a62070G7308C3312h072m211p4508
10147h6791k81365R1857N6340A6007a14873L6546o2412o8647b3547I8635c7866
10135d0225D2278f3562A8811d1293p120j14515F8076j4981b55393A00956g3371
10123a07890d6286K2076d46j7789A8449e4996E0189Q5694c1740G4715e8256j73309
10111b31565B39497b8724j60260A10789a77007b4629B08751a24520k2527O6651
10101h0396A69564c38271B5706A643i2912C351N0729g0896l946K7097G6075e6125
$$ y = [-205910, 37248, 56611, -39061, 34815, -105003, -9388, 103944, -28406, 4340, 145511, 44415, 24178, 93633, -134451, -177219, 54826, -127109, -78565, -337431, -91525, -16608, -268886, 104614, -32627, -43979, -246092, -98995, -92009, 68440, 93672, -162070, 77308, 33312, -8072, -12283, -86791, -368156, -276299, -219959, 16007, -114873, -78327, -140739, -209386, -23547, 98635, -37866, -40225, 42278, -63562, 18811, -41293, -48413, -162928, 68076, 53095, -255393, 100956, -73371, -107890, -46286, -24210, -446, -18235, 18449, -54996, 50189, 135883, -31740, 74715, -58256, -231565, 239497, -28724, -188984, 110789, -177007, -24629, 208751, -124520, -147047, -80396, 169564, -338271, 25706, 1643, -92912, 3351, 54080, -70896, -74842, -47745, 76075, -56125]
10088i5369B2441j333N2571d19573G5581J22076a98125B338a6638F7340a11669
10076A5667J59913a97188A2091l23a24702B33776D2389i1980C6379L9157J17220
10065A92756c56949B60096d1707A19114k3731b43008F7714g4119a7797A44371
10054a01241B50812d1535k8552K9396r0721b6707o8552j39887A5936N0752b01160
10042a10280n805k584L8866n8878a4587A27302J28701b14187A8637b31698e9202
10030A60131g8372q6138j8876D9458J96974f3967G7973P500B5174a77819g945
10018a33834K1945q1695O3889M5697j31599g9061p0668E9676a2996l5125C7456
10006a4217l06160A08747a2573j79909h5885J4626j33379j03742C2186l298J17427
$$ y = [-95369, 22441, 21108, 73679, -419573, 75581, 197657, -198125, 2338, -16638, 67340, -111669, 15667, 175580, -197188, 12091, 11768, -124702, 233776, 42389, -91980, 36379, 75536, 192756, -356949, 260096, -41707, 119114, 95383, -243008, 67714, -74119, -17797, 144371, -101241, 250812, -41535, -70087, -40691, -131412, -26707, -95259, -235146, 15936, 66688, -201160, -110280, -116085, -118669, -79803, -138681, -14587, 127302, 256003, -214187, 18637, -231698, -59202, 160131, -78372, -164510, -183386, 49458, 246432, -63967, 77973, 85473, 25174, -177819, -7945, -133834, -111889, -193584, -129695, -83998, -215597, -79061, -149729, 59676, -12996, -48121, 37456, -14217, -320377, 108747, -12573, -192482, -85885, -71259, -204638, -308380, 32186, 28888, 146315]
9995A46315c397F0143c01148A35968C314d1888A79940J6917b48252A59883p0497
9984H9386f10r8616o0084e4071B79236e8287K0587j8337E8837H533a81174j07915
9972b89089E6096J70736b42381L5267D1617o63a61249c6897H9810a07869A70347
9960G0120b72717E5349b5569H5362e4161F7766c59834b8105r6029j00559A0328
9948c1002C13322E260a34486M5510j68345A42351K0816H0525l0519a10832n5096
9937a65928e6364j8089o9733A53615B9724a86028C2336e1233I6127B1911b95460
9925i4791D4452d2715C6266i3299q865j9210C30545a78302o9643C9975N4628B3723
9912a60832C5254j4083Q1669Q6445a19306e7782m2216j53251L4758J0446a5883
$$ y = [146315, -3397, 60143, -301148, 135968, 3314, -41888, 179940, 196857, -248252, 159883, 89386, -610, -99226, -159310, -54071, 279236, -58287, -37700, -56037, 58837, 8533, -181174, -289089, 56096, 226832, -242381, -207114, 41617, 40954, -161249, -36897, 89810, -107869, 170347, 70120, -272717, 55349, -25569, 85362, -54161, 67766, -359834, -28105, -124134, -224693, 10328, -31002, 313322, 5260, -134486, -88976, -257321, 142351, 163167, 80525, 50006, -110832, -165928, -56364, -74453, -144186, 153615, 29724, -186028, 32336, -51233, 96127, 21911, -295460, -94791, 44452, -42715, 36266, -93299, -102164, -121374, 330545, -178302, -247945, 39975, 94603, 23723, -160832, 35254, 21171, 102840, 189285, -119306, -57782, -99998, -253249, -218491, -208045, -15883]
9900d9347n0808c514A60235b93418A44511C7100J73897A1627K05006h8240A20932
9888g9884A1421b00780P3447H2814K0218b9736j80103p198A16325J68801B379
9876a26999k6372C4659b64798B83822c03922i9987C6477J80590r5222e6348A10291
9864b96311D769L084b5905J921A42185g2090n8786l8304D00317B652h9267A52245
9851D4012O6330d7I1209M1950K18903l707P5171M51317L56409L9455j99073D15352
9838C60668A19252n6418j1785f8434A50955P713d1875m6121j54997H0751b14633
9826C4573J6835N5260N8300k1325F8934b11711d0796j62863f7728E8411a1035
9814c8802q0229A92598a5737B27342c4327j27480b4196A93316A2494b21216f1904
$$ y = [-49347, -100155, -3514, 160235, -293418, 144511, 37100, 210997, 11627, 216633, -88240, 120932, -79884, 11421, -200780, -127333, 82814, 103032, -29736, -209839, -217037, 116325, 285126, 2379, -126999, -153371, 34659, -264798, 283822, -303922, -99987, 36477, 217067, 121845, -56348, 110291, -296311, 4769, 7853, -25905, -23984, 142185, -72090, -130876, -169180, 400317, 2652, -89267, 152245, 44012, 110342, -47, 91209, 133159, 352062, 348355, 423526, 874843, 1231252, 1270707, 1071634, 415352, 360668, 119252, 62834, 51049, -68434, 150955, 158668, -41875, -87996, -242993, 80751, -214633, 34573, 51408, 106668, 164968, 143643, 68934, -211711, -40796, -203659, -67728, 58411, -11035, -38802, -119031, 192598, -15737, 227342, -34327, -161807, -24196, 193316, 12494, -221216, -61904]
9802E3709m602O0011N4195D0259b5939F9533a24071c3012F8794a8795j65402j6976
9790b01173B70814a7996A3624b27389N0972B16100g4659A15844e8801r1603J4268
9779a36136B9638a96266A08451b15339A44497H651a34041B2732o190J7491a8102
9767I5282a2149k5887j52642E2278b50286f1975k24692H8924N5297a80161O7265
9756a12896A8514b7216l6397b4605j9056A38430a65930F7259a16622A02720g4615
9744e2662D6359b32427f5245I0744B4005a09655j64207C3632h6692A86119l1023
9733A55096D7134a98380b6849o9761A11376g9870A6217J87704a21324l02714A62698
9721a15366c2626C2572M1244N3516B8333a1434A38271J10673A04714O0278A0187
$$ y = [53709, 49107, 109118, 163313, 40259, -25939, 69533, -124071, -33012, 68794, -18795, -184197, -201173, 270814, -17996, 13624, -227389, -176417, 216100, -74659, 115844, -58801, -150404, -136136, 29638, -196266, 108451, -215339, 144497, 8651, -134041, 22732, 16542, 34033, -18102, 95282, -12149, -38036, -190678, 52278, -250286, -61975, -286667, 88924, 144221, -180161, -112896, 18514, -27216, -63613, -24605, -43661, 138430, -165930, 67259, -116622, 102720, -74615, -52662, 46359, -232427, -65245, 90744, 24005, -109655, -273862, 33632, -86692, 186119, 155096, 47134, -198380, -26849, -96610, 111376, -79870, 16217, 203921, -121324, -424038, 162698, -115366, -32626, 32572, 73816, 127332, 28333, -11434, 138271, 248944, 104714, 164992, 10187]
9709A02012B058J03827C848b32029a11753D3188j2577J32818o8450g7747p833
9698h5580o2822C3841N9612a41712b1182n6934j4875l1586C6584O5704k1167C9801
9685h1462J8924B49951p2202C831R0693a46833d405A10755K65746d5896m2869
9674h8765H2412b7484B78919i710l0209E2588J77887C7206f1451A33359D9665
9662e2640A45367J22104A32061a18810A47285C8668J91549m530d7628a1342k4353
9651c5695B02085m7540j6273k4109E5658J7296c3293A23737K74537H4302K01238
9640B85540F2730p625J2543A7715g744q4581o336H9217J63206A101K8846h8074
9627A15993J44434C9672J32367E9372L35349l6012j52944Q019K08325j17626J65129
$$ y = [102012, 2058, 105885, 3848, -232029, -111753, 43188, 30611, 163429, 94979, -77747, -85580, -148402, 33841, 93453, -141712, -21182, -78116, -92991, -124577, 36584, 102288, 81121, 39801, -81462, -62538, 249951, 177749, 3831, 94524, -146833, -4405, 110755, 376501, -45896, -88765, 82412, -27484, 278919, -9710, -39919, 52588, 230475, 37206, -61451, 133359, 49665, -52640, 145367, 267471, 132061, -118810, 147285, 38668, 230217, 225687, -47628, -11342, -35695, 202085, 154545, 138272, 114163, 55658, 72954, -33293, 123737, 398274, 84302, 285540, 62730, 55105, 67648, 17715, -7744, -92325, -98661, 89217, 252423, 1101, 29947, -88074, 115993, 260427, 39672, 172039, 59372, 394721, 358709, 205765, 213784, 422109, 304483, 469612]
9616D69612N5864j46451K68888Q9198J33990N9291J72396K7049L63903Q2805O3983
9605A640528L48477L59452M96488Q29619P30564J080455Q91471J509414K037699
9596I924167K832157M638415P149863J2566006K7432713O0608566Q4571077N4808033
9588B64530997j4831012A23875172n9247382k4022240j4803012q135783m873074
9581A2793681k999644k234220j522480j488118q23940l36912p64501n66113l39393
9572A718360k01627k64825j46504j87184P3836k30466j68574k4992B25999M75616
9562G01615k12913m9430j49980L28903J07854C34704O4294I2299J41118r3063
9552A40354o8902J41485K948O9358F2981O4641k4732m3334K67856A12053A5270
$$ y = [469612, 525476, 379025, 647913, 737111, 871101, 930392, 1102788, 1129837, 1493740, 1576545, 1640528, 1989005, 2348457, 2844945, 3674564, 4405128, 5485583, 6377054, 7886468, 9924167, 12756324, 17394739, 24544602, 37110608, 64543321, 125151887, 209722964, 264530997, 249699985, 123875172, 64627790, 40605550, 25802538, 17666755, 12793681, 9794037, 7559817, 6037337, 4549219, 3725279, 3388367, 2623866, 2057753, 1718360, 1516733, 1251908, 1105404, 918220, 992056, 761590, 593016, 568024, 225999, 701615, 488702, 439272, 289292, 618195, 726049, 334704, 398998, 92299, 233417, 140354, 71452, 212937, 215885, 285243, 62981, 127622, 102890, 59556, 327412, 112053, 15270]
9540E4857J28067a81338A39211a27575E2965M3878M2699R313Q9492L4798o2978
9529B10167D8852b92506B4975b8622E7782L6119a81371b3331D0278b1182j22850
9518a44032a1121k02240a1443j54587f8335l6797E0927O37J56076a11056d2941
9506C0828a1037D9971a41323J495n3186n0831F6993a92527d7059o4543b763n5451
9494e8214j5040r9165B4267a0508D418a12234A18238a00413A79140f3555j6812
9483h0367A46635g9369I3238g4419H0369b11816j00125j064A07473a71817j2924
9472a84741j06337O7127A83086r759a65984d0859j97666D9522L6684N8472F7643
9460a46942q7102P6340j73921a54187M5648m7301J4423N3083C13523i8187m3344
$$ y = [54857, 182924, -181338, 139211, -127575, 52965, 96843, 139542, 148855, 238347, 273145, 210167, 48852, -292506, 24975, -28622, 57782, 93901, -181371, -23331, 40278, -21182, -144032, -11121, -213361, -11443, -166030, -68335, -105132, 50927, 51564, 207640, -111056, -42941, 30828, -11037, 49971, -141323, -139828, -193014, -243845, 66993, -192527, -47059, -111602, -2763, -58214, -73254, -172419, 24267, -10508, 4418, -112234, 118238, -100413, 179140, -63555, -80367, 146635, -79369, 93238, -74419, 80369, -211816, -311941, -313005, 107473, -171817, -184741, -291078, -223951, 183086, 173327, -165984, -40859, -238525, 49522, 86206, 144678, 67643, -146942, -234044, -157704, -331625, -154187, -108539, -155840, -141417, -88334, 313523, -98187, -141531]
9449a41531j55054a7589k03594c9752j54969A73269b36913B1286CJ02116h7982
9437h3757n9188r5335A39107n3719d1539C5756b94600a07404G9133d0793C9838
9425b80489J0298C05980g539b314D3483a71978e9994p8997N2648j96487e8956
9413b48647B438b4403j47634c12n8928k6092A67764a66527h2680a5509o7885l8248
9401a21642C1002K8234i2359p1309a4083A17615C801K47946b0552j27420m1811
9390a89783N5921I9361i6340A20847a22806N3775A91426b10637A04836F454Q1187
9379H7641g2282G0739e3376D5611a21317A59279a0161r7833j3718N2550m2247
9368a11409E086K20445C5606i7606c9033D2801g6362G2894a76274o9014A6712
$$ y = [-141531, -296585, -17589, -221183, -39752, -194721, 173269, -236913, 21286, 3, 102119, -87982, -83757, -142945, -238280, 139107, 85388, -41539, 35756, -294600, -107404, 79133, -40793, 39838, -280489, -270191, 305980, -7539, -2314, 43483, -171978, -59994, -138991, -86343, -282830, -58956, -248647, 2438, -24403, -172037, -312, -59240, -85332, 167764, -166527, -82680, -15509, -83394, -121642, 31002, 59236, -92359, -163668, -14083, 117615, 3801, 251747, -20552, -147972, -189783, -133862, 99361, -96340, 120847, -122806, -69031, 191426, -210637, 104836, 6454, 87641, -72282, 70739, -53376, 45611, -121317, 159279, -10161, -107994, -121712, -69162, -111409, 5086, 225531, 35606, -97606, -39033, 42801, -76362, 72894, -176274, -245288, 16712]
9356a12735A68178E6841a14027j55093J34556d0468k11855F7055a69039c0158
9345B7614J2763b2249j31934K4699l4355F9857b7002H9295e0115m0781L8229D0687
9332B0199J09489O02139K87661K80914k17551m71525j49672F6766P6589J38969
9322B82324k1172j14223p850H843a02462j03857I3627C0127f8416B26589A7859
9310C8313a56937g025j00109F4842e4737b1274j12082C7646b36160Q5692j22294
9299b72762f7708b3933m1733k00935C3552O4689b22283B04234a52478A18429a02780
9287a95512B00216f9603G8649c0380j21839J632H8779d3673k30612e3034B26248
9275h9409b6957F9606a05016j3570E5613K26282F6538K7610e7348k9017K1416
$$ y = [-112735, 168178, 56841, -114027, -269120, -134564, -40468, -252323, 67055, -169039, -30158, 27614, 40377, -22249, -154183, -129484, -163839, 69857, -27002, 89295, -50115, -90896, -52667, 40687, 20199, 129688, 731827, 1019488, 1300402, 1082851, 611326, 461654, 66766, 143355, 282324, 261152, 146929, 139079, 8843, -102462, -206319, 93627, 30127, -68416, 226589, 17859, 38313, -156937, -7025, -107134, 64842, -54737, -21274, -133356, 37646, -236160, -150468, -272762, -67708, -23933, -65666, -266601, 33552, 98241, -222283, 204234, -152478, 118429, -102780, -195512, 200216, -69603, 78649, -30380, -152219, -150587, 88779, -43673, -274285, -53034, 226248, -89409, -26957, 69606, -105016, -118586, 55613, 281895, 66538, 94148, -57348, -86365, -64949]
9264f4949o198I8023P670e4048j49539j17746d0817A20552B9991a27037b1469
9252a81765l5613A34916d483j733j19957D0895g8594q5147H5781a25350d6209
9240C0323J09810M7629a34575A2426O182h1807H5127d69882d7226r2278k8003
9229a67507l0152J8544g2091l8437A92766b925q6490k71859A15250k9416a74720
9217i2142A08788l1029a1711m3791K418n4016b1752I2177a5533F5704b6805B46907
9204A22961J56405p4577q2945A6015P2129F856f1615I2803f2249j4704A55341
9192H3995a09312p6440j02543d6398A3358J53070c39433E7248P3474g9495A29987
9180C23444B8069h5427B4862a95380B0097J48083h7453A42122b38089g1058j7378
$$ y = [-64949, -71147, 98023, 105693, -54048, -203587, -321333, -40817, 120552, 29991, -127037, -21469, -181765, -217378, 134916, -4483, -6216, -126173, 40895, -78594, -163741, 85781, -125350, -46209, 30323, 140133, 187762, -134575, 12426, 18608, -81807, 85127, -469882, -47226, -139504, -167507, -197659, -179115, -72091, -110528, 192766, -2925, -89415, -361274, 115250, 85834, -174720, -92142, 108788, 77759, -11711, -55502, -53084, -107100, -21752, 92177, -15533, 65704, -26805, 246907, 122961, 279366, 204789, 121844, 16015, 88144, 6856, -61615, 92803, -62249, -76953, 155341, 83995, -109312, -185752, -288295, -46398, 13358, 166428, -339433, 57248, 130722, -79495, 129987, 323444, 28069, -85427, 24862, -195380, 20097, 168180, -87453, 142122, -238089, -71058, -88436]
9169h8436H467K1805a80940B22418b3591A63155a64033I9621j7373g5975A29073
9157B17249f7262J5871e367j1463o1100o3882j0659a6025n3993C16472d1067A2912
9144a39077M3798L7843n0857k4638H3936b42926k4832M135P5478L1178C4384a14792
9131b15203B2982a69415g4534A42057a9768m2865j2965j48645O0307d060A221
9119a71328G542e0419q1413M6435o6117A89153a9191a680k48760A52569D0773
9107B06813I6094h7211r1609C1235J7075i4689b3920q145A55874f9090G5416P8899
9095A54315b2224F9064g3824C8865a67441j03067B506K30277a33382Q32p3561
9084b06111I7049b9081k53337N7961N8679f5878G2549M7430b12467D1250b34035
$$ y = [-88436, 8467, 30272, -180940, 222418, -23591, 163155, -164033, 99621, 82248, -75975, 129073, 217249, -67262, -51391, -5367, -16830, -77930, -141812, -152471, -16025, -70018, 316472, -41067, 12912, -139077, -95279, -57436, -108293, -132931, 83936, -242926, -267758, -263623, -188145, -156967, 34384, -114792, -215203, 22982, -169415, -74534, 142057, -19768, -62633, -75598, -224243, -163936, -4060, 1221, -171328, 7542, -50419, -131832, -85397, -151514, 189153, -19191, -1680, -250440, 152569, 40773, 206813, 96094, -87211, -178820, 31235, 48310, -94689, -23920, -32065, 155874, -69090, 75416, 154315, -22224, 69064, -73824, 38865, -167441, -270508, 2506, 232783, -133382, -132550, -206111, 97049, -29081, -282418, -224457, -165778, -65878, 72549, 119979, -212467, 41250, -234035]
9072b3527i938o7271j37723D5252e8894q356k5296j74849G8472M677a20981R079
9060a11902D021K8142a44192q7288R7013l6274M6866C6883a85798A93923a38269
9048D852J1507N159a11095N2769f077m8167l47012H5679G528K0024L3038g0638
9035f3494A4923i7601l1656N8373A68206k5332a32791e6220B50401P5455b39476
9023h6062k366n0801G6c0426j90884C6282Q7565a84689C18815j29210k9663a11216
9010a20504B6311a98298A0464f0258k2889D3046N550j4775J7086O6691O1736h8659
8997A78866O0720f5263m9930c2650A93830n6271h393C0245a7052m8720F3462M0337
8985A03799e4821j35466e6861A77402o0512J35249i2925A11678j6698a15318F7807
$$ y = [-23527, -9938, -77209, -214932, 45252, -58894, -67250, -92546, -267395, 78472, 83149, -120981, -111902, 4021, 32163, -144192, -231480, -134467, -170741, -123875, 36883, -185798, 193923, -138269, 4852, 16359, 21518, -111095, -58326, -6077, -54244, -401256, 85679, 7528, 27552, 60590, -70638, -63494, 14923, -97601, -129257, -70884, 168206, 142874, -132791, -56220, 250401, 325856, -239476, -86062, -88428, -139229, 76, -30426, -221310, 36282, 123847, -184689, 318815, 189605, 159942, -111216, -120504, 26311, -198298, 10464, -60258, -83147, 43046, 48596, 33821, 50907, 117598, 179334, -88659, 178866, 239586, -65263, -115193, -32650, 193830, 137559, -8393, 30245, -17052, -65772, 63462, 103799, -54821, -190287, -56861, 177402, 116890, 252139, -92925, 111678, 94980, -115318, 67807]
8973H0466J64402a47617q9810B29826h2005B46582Q7105h338A36677N2428r0449
8962I8656J66552p6789G050M1105J7375k628J56K56467O6790j51466J6393J46070
8950C97312J18433B24348j6826K98536j04781l2307M39j10779K95421L40049l9655
8939H54445N30686Q21716J347092J406567N47154k76886j392774j401568n55810
8930A880622m84838J13381K37212O28022Q55910J567603Q41432j73675j118824
8921D346845j326882j242875l59741l48037l29203o407C58136O9015l5663R0636
8911D82124j99696O167J19961r6562R561j4126A25155j7658a17780B04553G6935
8899B43274m8487C7287P2831O8443J8651o2946P0698a29140A47037A114J08651
$$ y = [80466, 244868, -147617, -237427, 229826, -82005, 246582, 333687, -8338, 136677, 189105, 98656, 265208, 188419, 7050, 48155, 65530, 62902, 63058, 319525, 386315, 234849, 251242, 397312, 515745, 224348, 207522, 506058, 401277, 368970, 369409, 258630, 554051, 894100, 854445, 1385131, 2206847, 3553939, 4960506, 5507660, 5230774, 3838000, 2436432, 1880622, 1395784, 1509165, 1746377, 2374399, 3230309, 4797912, 5639344, 5465669, 4346845, 3019963, 1777088, 1417347, 1069310, 740107, 733700, 358136, 427151, 391488, 482124, 282428, 288595, 408556, 311994, 321555, 307429, 125155, 107497, -117780, 204553, 76935, 243274, 194787, 37287, 110118, 178561, 197212, 134266, 204964, -129140, 147037, 1114, 109765]
8888A09765L4070K9448c02354J43336D083a34348c4900A73287d4320G8025d6270
8876d9452j53292h4944j27740I7824J44952a56506n3675c0375I2642B3575d1419
8864C3004b92691C96672a35119j29335H3668K60007A39382e05q7710A08436J918
8853A10354N4702b26369Q1805O1490J508H2565a93773B84601b06754A31937c5340
8841b02644D9518c8057O576j19763f2014j76699g733A65829n3175p954a07352
8829a08228A9288b35302J08565a6980j35842d6021E1280a78311b2896H0116c0274
8817b17076A60012h7222j16418A8372N2992R5830b73216a21383B677J17090n4381
8806F5386M6507b05463B5445J800b8102H0971b88160a09123B9549G952J19384
$$ y = [109765, 143835, 173283, -302354, -159018, 4083, -134348, -34900, 173287, -44320, 78025, -46270, -49452, -202744, -84944, -212684, 97824, 242776, -156506, -210181, -30375, 92642, 23575, -41419, 33004, -292691, 396672, -135119, -264454, 83668, 343675, 139382, -505, -88215, 108436, 110354, 165056, -226369, -144564, -83074, -81566, 82565, -193773, 284601, -206754, 131937, -35340, -202644, 49518, -38057, -31481, -151244, -62014, -238713, -7733, 165829, 112654, 104700, -107352, -108228, 19288, -235302, -126737, -16980, -152822, -46021, 51280, -178311, -22896, 80116, -30274, -217076, 160012, -87222, -203640, 18372, 71364, 167194, -273216, -121383, 2677, 119767, 65386, 111893, -205463, 25445, 27245, -28102, 80971, -288160, -109123, 29549, 7952, 127336]
8795A27336a60058a5495m8161A95748g279A13937g1941j17248J57B3086N5429
8784G8515l4696g0717K0232n2048L6809k9870A9948f7292C924R6720h2455k02955
8772b85410c8398B3833o352e3758l4304d0178G2397a624n2494A4276L52347A81066
8759i19D2133Q51G145b00817B46110n2181l9063K7244k5395J0192F008a24147
8746I1436N0327K23376A53440G417K26993o7358b6984p8398E37488k68044J2572
8735B82016N6419M47453l23281L10908J76098J20320K84713K01746K99123J111327
8725B966842J80700O99892J437557K492228N039480R336845J2532114J1234680
8717D5920338L424869o468050j2199609j0930292o607609k161279M49155L906549
$$ y = [127336, -160058, -15495, -63656, 195748, -7279, 113937, -71941, -189189, -189032, 23086, 78515, 43819, -70717, -50485, -102533, -65724, -95594, 19948, -67292, 3924, 100644, -82455, -285410, -38398, 23833, 17481, -53758, -88062, -40178, 72397, -1624, -54118, 14276, 366623, 181066, -919, 42133, 42984, 7145, -200817, 246110, 193929, 154866, 182110, 156715, 166907, 6008, -124147, 91436, 141763, 365139, 153440, 7417, 234410, 167052, -26984, -105382, 537488, 269444, 282016, 338435, 785888, 462607, 773515, 949613, 1069933, 1354646, 1556392, 1855515, 2966842, 3147542, 3847434, 5284991, 7777219, 12816699, 22153544, 34685658, 45920338, 49345207, 42877157, 30677548, 19747256, 13139647, 10978368, 11427523, 15334072]
8709A5334072P650596J1662088J1050485L771794n899468j2894747j2163967q062268
8701A0448585l852764k034089q21719r77199o84299k56790m89278j69808j90704
8692I71935l08576K7470k96804j21529R6756P9499o7809E9321L12345A48929M7410
8681A96339k1515j9123q726J8905Q3702J65662A6351g9852K5067D7310C758g5992
8668A48410a23335L7662D2750K5308L4584N3080a10956A3160L5451a24628C52338
8656C3485K43164I8009c6070q0959r7472l610d3763J3824L886A52462k9097a12559
8643b40979B9137e4369n0981F0925Q3456L7232g0775j03960m803Q5129C0077h7194
8630d9885o6728k36237A11620J0407i7814D2225e7909n2520G9586A1322a15510
$$ y = [15334072, 22984668, 34646756, 45697241, 49469035, 43569567, 30674820, 18510853, 10448585, 6595821, 4561732, 3740013, 2762814, 2078515, 1821725, 1332447, 1162639, 971935, 663359, 690829, 394025, 272496, 369252, 448751, 380942, 59321, 371666, 148929, 196339, 174824, 155701, 146975, 165880, 249582, 415244, 16351, -79852, -54785, 47310, 3758, -75992, 148410, -123335, -85673, 42750, 68058, 102642, 155722, -110956, 13160, 48611, -124628, 352338, 33485, 276649, 98009, -36070, -117029, -214501, -218111, -43763, -29939, -26053, 152462, 123365, -112559, -240979, 29137, -54369, -105350, 60925, 144381, 181613, -70775, -174735, -179538, -94409, 30077, -87194, -49885, -116613, -352850, 111620, 122027, -97814, 42225, -57909, -110429, 79586, 11322, -115510]
8618a89604M6819e25r4252j23328j8762O2165d9171j08372n7060A0977f6643A16877
8605A52151b7378o7042q2583A8265e7347l03948e369k53904e1842k2027f119G2144
8592a78724P2596A24826g029l0009o4574k07068L6936A18786a32754b7239l1755
8581e8994k00929J22068C9646a00638J278q9983g7902b4321j36429K3905L8440
8570i8405D9076f5495C5926a76750j2778D6009R5225b15111N1937P3399K0480
8559f9295h792A05354c3100A78803a23217q6063c2120k11101M1640a0706l0507
8548d1213F9757a25839j9635a1188l4236A14276a65212g1787j08849O6503I4729
8536d549A13685b62674a19853L5132L503k8691A30163e2756j67140d865E3220
$$ y = [-189604, -142785, -525, -94777, -218105, -236867, -174702, -49171, -157543, -214603, 10977, -66643, 116877, 152151, -27378, -94420, -177003, 18265, -57347, -361295, -5369, -259273, -51842, -73869, -6119, 72144, -178724, -106128, 124826, -7029, -37038, -101612, -308680, -271744, 118786, -132754, -27239, -58994, -259923, -137855, 39646, -100638, -99360, -189343, -77902, -24321, -160750, -136845, -98405, 49076, -65495, 35926, -176750, -189528, 46009, 141234, -215111, -163174, -89775, -69295, -8792, 105354, -33100, 178803, -123217, -209280, -32120, -243221, -201581, -10706, -41213, 69757, -125839, -145474, -11188, -45424, 114276, -165212, -71787, -180636, -114133, 94729, -4549, 113685, -262674, -119853, -84721, -81218, -109909, 130163, -52756, -219896, -4865, 53220]
8524D6135b10390d5412q0050J7775n1569m2797k8906c1576n5846j53051F5300
8512b00864A0289b41494D4478e2072r3965J5938K7025d5905l52962A54984a31397
8500H920c08687Q8658A35318i7634q8223b5830j43052A81560g0473J6586p23j0738
8488f5348F5c2495C1881J28880a13705I4816d1477j98721o8352b6928j70062M37
8476a96553R4122A53311i7055d7908D6610Q8181h7740E7286J23546J09606G0870
8464c4521j34011k2957a6489p6784L2202j3612a6974I8656e1406I7652R564J53953
8452B61169A04310J24685a47462M0354H1519B5183E162K8761b1596H9702l9936
8441D9766e0896B2834J08185a26103n1396e6832A9616b02668h5391b5827l0962
$$ y = [46135, -210390, -45412, -125462, -107687, -159256, -202053, -230959, -31576, -87422, -240473, 65300, -200864, 10289, -241494, 44478, -52072, -146037, -130099, -103074, -45905, -398867, 154984, -131397, 8920, -308687, -220029, 135318, -97634, -185857, -25830, -168882, 181560, -70473, -53887, -54610, -65348, 65, -32495, 31881, 160761, -113705, 94816, -41477, -240198, -308550, -26928, -196990, -196553, -102431, 153311, -97055, -47908, 46610, 134791, -87740, 57286, 180832, 290438, 70870, -34521, -168532, -191489, -16489, -93273, -61071, -74683, -16974, 98656, -51406, 97652, 107216, 261169, 104310, 228995, -147462, -107108, 81519, 25183, 5162, 33923, -21596, 89702, 49766, -50896, 22834, 131019, -126103, -177499, -56832, 19616, -202668, -85391, -25827, -56789]
8430e6789K8163D3944i9572j16334g797E8102I178a7773A27781d0698k6090f112
8417I774b10476g8215j51755R8159m7100A0611a11501a3593j56176f4942B33679
8405b46115a980r7267L6304j8071B2520c5385j90891a04577k17281a26085b7725
8393B57961b09511g7230B2736b84483J15197l2632m9590a7801j8890A27460b18981
8381a59775A75773a60173j2096o6098d3123n7540J59n5043f7110j13222I908g4369
8368G810P0054b1496l9534l8623j13499B5899b3749E8735A1710b86583P4526F5451
8355h0016p34k8509d9389j99191b0768m216O795o3070j3319j12057A45131E0856
8342f868k36679J08769K0751l37234h6459A8654b09689h6076m069E9919a79505
$$ y = [-56789, -28626, 43944, -99572, -215906, -7797, 58102, 9178, -17773, 127781, -40698, -66788, -6112, 9774, -210476, -78215, -229970, -131811, -178911, 10611, -111501, -13593, -169769, -64942, 233679, -246115, -1980, -99247, -62943, -81014, 22520, -35385, -226276, -104577, -321858, -126085, -27725, 257961, -209511, -77230, 22736, -284483, -169286, -201918, -251508, -17801, -36691, 127460, -218981, -159775, 175773, -160173, -172269, -238367, -43123, -100663, -100504, -155547, -67110, -180332, 9908, -74369, 7810, 77864, -21496, -61030, -99653, -213152, 25899, -23749, 58735, 11710, -286583, -212057, 65451, -80016, -80750, -109259, -49389, -248580, -20768, -24984, -18189, -81259, -94578, -206635, 145131, 50856, -6868, -243547, -134778, -114027, -451261, -86459, 18654, -209689, -86076, -90145, 59919, -179505]
8330i392l03278J06518f3022o1121H7919b7218a3253d760A1983a90471f4938l38973
8318d03911d9424j79077M5250F7754A5374a80245a0363j92955q675E2135g1204
8306b9786m23879f480B8172J32476A525a34181J2235E430a97832A99816j5414
8295A84402d4431h284m0812n0412o1527d3079C1094J68975E7981L07179A8642
8283a73256j67906C05450C3718C340N3872a12115B0200h7463G9982K5948M1983
8272A47913a36643K7136A63050l7018g6422n7220N9096F0882J8857B6393g4847
8260B4389L2518L9976a13274B95305B2367b99129F2873J70852m173a49838I8225
8248B01171E0975J15155m3244J51758E6327J56690o8801D3620J09425J02929n6167
$$ y = [-9392, -312670, -206152, -63022, -124143, 87919, -27218, -13253, -4760, 11983, -190471, -64938, -403911, -49424, -228501, -183251, 67754, 15374, -180245, -10363, -203318, -211993, 52135, -71204, -29786, -453665, -6480, 28172, 160648, 1525, -134181, -121946, 5430, -197832, 199816, 184402, -44431, -8284, -49096, -99508, -161035, -43079, 31094, 200069, 57981, 365160, 18642, -173256, -341162, 305450, 33718, 3340, 57212, -112115, 20200, -87463, 79982, 105930, 147913, -136643, -109507, 163050, 126032, -76422, -133642, -74546, 60882, 79739, 26393, -74847, 24389, 56907, 96883, -113274, 295305, 22367, -299129, 62873, 233725, 229552, -149838, 98225, 201171, 50975, 166130, 122886, 274644, 56327, 213017, 144216, 43620, 153045, 255974, 199807]
8237A99807J99635O6691j73053j5859K25123o1095p4886K79074k50900J5289k0788
8226C89038L32637k53778J53566N1825O022j17272l1733R0754J60936j21314k77030
8215C83651K21256m1546j58542j27017K16688B34203K89918r5149M9578B6259
8204E53409j87636j09932G1394N8781d4422I180g5785J4668F816b85969j181631
8193a467600B482834d410931k239156a013170A524344m75386C48868o7237j22208
8184A59423J94510j36347J94544j27624Q9442J37284p6583k341R3396o0864B11854
8172B49206J74450j40585L28127J32937k26507r6602J48344j55108K80908N8133
8162G53303j28946p2041R0889Q4672n1781J6524M7256j27057P5328N0503q2499
$$ y = [199807, 399442, 466133, 293080, 277221, 502344, 441249, 366363, 645437, 394537, 409826, 389038, 721675, 467897, 621463, 673288, 679310, 562038, 530305, 621059, 781995, 660681, 383651, 604907, 563361, 404819, 277802, 494490, 234203, 524121, 428972, 478550, 26259, 553409, 365773, 255841, 71394, 130175, -44422, 9180, -75785, -61117, 6816, -285969, -1467600, 2482834, -4410931, -6650087, -1013170, 1524344, 1048958, 348868, 281631, 159423, 353933, 217586, 412130, 284506, 373948, 511232, 434649, 432308, 525704, 464840, 211854, 249206, 423656, 283071, 611198, 744135, 517628, 421026, 569370, 414262, 695170, 753303, 624357, 552316, 643205, 727877, 676096, 692620, 739876, 612819, 688147, 738650, 656151]
8151F56151J79603O7691k19988J88376k69975J09217l0039j8698j6221j69298
8141D76819J11385N8499j62760L02353l0940j57740O0486j29839m6204J23853
8131F05912q1963J68529l08446K11226j35589o1641J30499B38476J46926k430
8121C82972J4421n0217j14553Q0834J616p9078K0182o3493K22100n7453l3786
8110C23545n8140J28239d6005I2037K06057j20173N032J60229j12503J182J22201
8099C54062A69056K81030j30485A51938K03152A61731r269J92884O0928J65105
8089E71379R3200k15590Q1128O0910J46369O3779J79728J74397K06859j02573
8079A259586N49959N50616O48941K93959J195294J716363L537924O885691J1994253
$$ y = [656151, 835754, 903445, 683457, 871833, 601858, 711075, 681036, 662338, 646117, 476819, 588204, 646703, 483943, 786296, 755356, 597616, 658102, 528263, 482059, 605912, 523949, 692478, 384032, 595258, 459669, 398028, 528527, 238476, 385402, 382972, 397393, 347176, 232623, 313457, 315073, 235995, 256177, 192684, 414784, 357331, 323545, 265405, 393644, -46005, 92037, 298094, 177921, 182953, 343182, 230679, 231861, 354062, 169056, 450086, 319601, 151938, 355090, 161731, 152462, 345346, 406274, 571379, 664579, 448989, 530117, 591027, 737396, 801175, 980903, 1155300, 1362159, 1259586, 1809545, 2360161, 3009102, 3303061, 4498355, 6214718, 9752642, 16638333, 28632586]
8070B8632586J1964650R12244j1089147j3897547p125240k874775j662791r55863
8062C904117n04827l00832m96750L8944j87072L41553J62920K86579O11933J82439
8052D039004J153214J380419K388951O138950J0535150J3854216N569772p063194
8044C7996482j7038646r299819m377987k078338j231465p24623q04609m49667
8036A991328k70414P1986m06473k53747o7031q7033k58111L43205m25134B97875
8025C62575l1769K6647J50467j75236p6723A09120K40587n5918j24884o1819J75451
8014B82537A12897b0919B28159r5795J2097L6625e2882B81385C6588k173A1558
8002H0238J01152h9091j09373B01927k5794B4816Q7770b7100A16085f6852b1343
$$ y = [28632586, 40597236, 41509480, 30420333, 16522786, 9397546, 6522771, 4859980, 3904117, 3399290, 3098458, 2601708, 2640652, 2453580, 2795133, 2958053, 3244632, 3856565, 4039004, 5192218, 6572637, 8961588, 15100538, 25635688, 39489904, 45059676, 37996482, 20957836, 11658017, 7280030, 5201692, 3970227, 3245604, 2440995, 1991328, 1720914, 1792900, 1386427, 1132680, 1065649, 978616, 720505, 1063710, 638576, 297875, 362575, 330806, 357453, 507920, 332684, 255961, 109120, 349707, 293789, 168905, 107086, 282537, 112897, -20919, 228159, 132364, 144461, 181086, -52882, 281385, 36588, 34415, 11558, 80238, 181390, -89091, -198464, 201927, 176133, 24816, 112586, -27100, 116085, -66852, -21343]
7990b5117A02084c9951B04198c1087l0235L244b5205m671A712h255j21968l8924
7978a69147N5628C30884a33824A44258a54342a044j02355A29270b7151o5643f677
7966a9492A30563I998c2395p0380d4238r3423j98905e1331j60614b6907j3923
7955d0830H6401a03839j04904D2223g3105G8828J23473f3268I2417O8805R8240
7944B59462a76249H526d9386j31319B15402a2097A09528k7673N7706B5754L422
7933B9176h0510B05545e6621D9865J48383c2772A76014i405A66374d2486D928
7921b98056B89263E7690a13120A33140o1134O9469a32466A86940b4649I717c0052
7909H8724d7214j612B29398a25190N3261A59071P671P0455b8160A66655J7486
$$ y = [-25117, 102084, -39951, 204198, -31087, -61322, -58078, -25205, -29876, 1712, -8255, -130223, -169147, -113519, 330884, -133824, 144258, -154342, -1044, -103399, 129270, -27151, -92794, -6677, -19492, 130563, 9998, -32395, -102775, -44238, -137661, -336566, -51331, -211945, -26907, -40830, 86401, -103839, -208743, 42223, -73105, 78828, 202301, -63268, 92417, 161222, 259462, -176249, 8526, -49386, -180705, 215402, -12097, 109528, 81855, 139561, 25754, 29176, -80510, 205545, -56621, 49865, 198248, -32772, 176014, -9405, 166374, -42486, 4928, -298056, 289263, 57690, -113120, 133140, 72006, 141475, -132466, 186940, -24649, 9717, -30052, 88724, -47214, -48826, 229398, -125190, -71929, 159071, 166742, 237197, -28160, 166655, 184141]
7898A84141l503p6400J1927R228C9063J09625m6845a14573B12112B7429J09166
7887A36595c1569C2568O154A0152K86320f8183A97627Q1896b29074a01605A60510
7875d1255A57662J7128P693b62504B01676D7843J63165d0288A61598J09089j07205
7864A63482M092C9154K85778E1940K25094A07978N8654K07952o2427o4226k5002
7853B22929j8362J6003A08243J21721M61129j28697J09400k64373M40191k74447
7843E73167O7611J44516J74360J84120k3034K33346J71962L35865L00066K05144
7833B367123L86697P66550J058976N91223R44728J631676J777423K883724M620009
7824A7028129P759367J5195609K3714517K8057090K0565970n94941k2009825l2130278
$$ y = [184141, 180638, 104238, 116165, 125393, 39063, 148688, 101843, -114573, 212112, 27429, 136595, -31569, 32568, 38722, 10152, 296472, -68183, 197627, 279523, -229074, -101605, 160510, -41255, 157662, 174790, 182483, -262504, 201676, 47843, 211008, -40288, 161598, 270687, 163482, 167574, 39154, 324932, 51940, 277034, 107978, 166632, 374584, 312157, 247931, 222929, 204567, 220570, 108243, 229964, 691093, 562396, 671796, 407423, 847614, 573167, 640778, 785294, 959654, 1143774, 1120740, 1354086, 1526048, 1861913, 2161979, 2367123, 2753820, 3520370, 4579346, 5170569, 6115297, 7746973, 9524396, 12408120, 17028129, 24787496, 39983105, 63697622, 91754712, 112320682, 111725741, 89715916, 57585638]
7816E7585638k3098308j1991797n833555l427723k371891j425001j026699j22101
7808H288563K751L31581R46203Q61212J831572L103127M856952R645263J7237173
7799D7104397K6514593K8123103J7781771o782536k6539792l3256060k1337327
7792C1608149j0842075n789161l615537k559827j881074j489323r49810j123539
7784C357803l97988l81506k68238m34651j65593l01446q8962k84012Q9411l03055
7774H21763N2900k25413K212N03338n60862l9404K09325l14023K16379j48857
7764E17358P7906A30960L53921j96575K8056J81655p1537A61311A6142K91961
7754C08103o3879J93951q8167j00478l7992N9341m183J19181i2337A3480P6431
$$ y = [57585638, 34487330, 22495533, 16661978, 13234255, 10862364, 9437363, 8410664, 8288563, 8291314, 8622895, 9569098, 10430310, 12261882, 15365009, 20221961, 29867224, 47104397, 73618990, 101742093, 119523864, 112741328, 86201536, 52945476, 31608149, 20766074, 14976913, 11361376, 8801549, 6920475, 5431152, 4481342, 3357803, 2959815, 2578309, 2310071, 1875420, 1709827, 1408381, 1319419, 1035407, 1124818, 821763, 874663, 649250, 651462, 1154800, 593938, 554534, 763859, 449836, 666215, 517358, 595264, 130960, 484881, 288306, 316362, 498017, 426480, 161311, 16142, 308103, 244224, 438175, 350008, 249530, 211538, 270879, 266696, 385877, -92337, 13480, 89911]
7743H9911H34Q6850f2920B36902C3717J75799N4586o5981H7767R1697e4222H1737
7730G3593K4399C4250a79624F4770J3333m537a61750C8330J3567J65203j05003
7719A12097f618C3843a483B32336I8629N4933P2796a17539e8611A02664a07658
7707a48463c2528Q759j23407d4175C0987c5785r1230d1199G0024i8832A63637
7695b03291g5627L0892E8303K5189a34596I7555a91737H8892B6005b9308o1434
7684i0742b7757A93891d5212p8189A24694P8187c6785n5069k74r6708I6672g6259
7671F5024n592a62971c930l50208F9728i7927D8229e1369j7635n2642k59q5634
7659b07539h4475a4924B8513P2635c13105B66534f5746a7697B91793a37957D0818
$$ y = [89911, 834, 87684, -62920, 236902, 33717, 209516, 264102, 198121, 87767, 179464, -54222, 81737, 73593, 97992, 34250, -179624, 64770, 78103, 73566, -161750, 38330, 51897, 217100, 112097, -6618, 33843, -1483, 232336, 98629, 153562, 226358, -117539, -58611, 102664, -107658, -148463, -32528, -23769, -147176, -44175, 30987, -35785, -127015, -41199, 70024, -98832, 163637, -203291, -75627, -44735, 58303, 83492, -134596, 97555, -191737, 88892, 26005, -29308, -90742, -27757, 193891, -45212, -123401, 124694, 202881, -36785, -91854, -92128, -188836, 96672, -76259, 65024, 59432, -162971, -3930, -354138, 69728, -97927, 48229, -51369, -69004, -121646, -121905, -207539, -84475, -14924, 28513, 101148, -313105, 266534, -65746, -17697, 291793, -137957, 40818]
7647e0392n6222A82735F5168J3223R6135L7464H2611a2972A03072B026d5386F2180
7634B4840f1276B8514a00883J2166C1520g4324E6311a5711j92082G9632J1794
7623I1426O8899L8039I8445J45655A3484K05531F8021J34399L2972b33935A0052
7611A2542b39338c3868B00404o4454A0265a31343b5944C7973K21839d1582C0111
7599G4004b923B50739b08403f8333p922p1550f4650A07157j2668g7366D0114J19294
7587A59408a0376F5470J98151j7271l3659P3209K05492k8170J90746j39255k7248
7576D87465G9819J23468q3248n7696K18380G8882k0582J92882H2347K48281E350
7564D5874J07313J61174q7278j02670L60295o8606J32789O7275J9926j04975K5205
$$ y = [-50392, -106614, 182735, 65168, 78391, 174526, 211990, 82611, -12972, 103072, 2026, -45386, 62180, 24840, -61276, 28514, -100883, -88717, 31520, -74324, 56311, -15711, -207793, 79632, 91426, 160325, 198364, 98445, 244100, 13484, 219015, 68021, 202420, 235392, -233935, 10052, 12542, -239338, -33868, 200404, 135950, 10265, -131343, -25944, 37973, 259812, -41582, 30111, 74004, -2923, 250739, -208403, -68333, -76255, -147805, -64650, 107157, 94489, -77366, 40114, 159408, -10376, 65470, 263621, 246350, 212691, 285900, 491392, 463222, 653968, 514713, 487465, 79819, 203287, 120039, 62343, 280723, 78882, 58300, 251182, 82347, 330628, 5350, 45874, 153187, 314361, 227083, 124413, 484708, 416102, 548891, 616166, 636092, 531117, 556322]
7553E56322p0666B20904J330L20251n6446A29566Q2265P5745M89327P9702K65055
7542A121660J342490J648250J131220k14313j815628A589149m88948k97737k12288
7533E90176M5320k21012m5845p314K96591j49565O2611k24552m0123M00812p0309
7522F36790K019K42132q6852J63141M04041Q83992J563209K417400N97865j252303
7512E571434k635003j370669m81619l36347B13169M06915B79502J67979j76554
7503B70927p8446G5798L92074A77441p7571J00335n8743B0198Q9325a16511A33914
7491C5889J31954q2589Q0675O0186H8547a2538A01530d1674A93694n6195O3461
7480B00960o9215E7495J56822B9569R4401b1868G6164a78833A00459m2208K3224
$$ y = [556322, 485656, 220904, 222234, 542485, 486039, 129566, 211831, 287576, 776903, 856605, 1121660, 2464150, 4112400, 5243620, 5029307, 3213679, 1589149, 1100201, 802464, 590176, 635496, 414484, 368639, 361325, 657916, 508351, 570962, 346410, 306287, 707099, 636790, 638809, 880941, 794089, 957230, 1361271, 2245263, 3808472, 6225872, 6823737, 5571434, 2936431, 1565762, 1084143, 747796, 213169, 620084, 279502, 447481, 270927, 192481, 75798, 467872, 177441, 99870, 200205, 141462, 20198, 109523, -116511, 133914, 35889, 167843, 85254, 165929, 226115, 88547, -12538, 101530, -41674, 193694, 137499, 200960, 131745, 57495, 214317, 29569, 123970, -21868, 76164, -178833, 100459, 58251, 81475]
7469H1475R6768k8289J36770D8106f6822B05659o3516p467k4096J75780O4103
7458C50463j37929O9161D8442J15445J36122l1027r8685J66269J96579A60644
7447E00250A08224L60944A67587C8175A3183K33047j19689j1754J50288J21343
7437C86418n3653o5657A26261l0850a20618C35829j05811j13375L49592O3719
7427E29954P7275O398j89833p939j62655K50395l1594J6703J68582l01789K52129
7416F07626P4910j58469M8997J7261J84216J64137J7295K9940k79051N734P1941
7405G84537l0113j38091R6390j74834J68106j14109K4228j12076j1985j04688
7395C87365j29477J31676L4712k8688p3684K18977A69995l4014d3131B86467m4985
$$ y = [81475, 178243, 149954, 286724, 48106, -66822, 205659, 142143, 134676, 110580, 286360, 350463, 212534, 281695, 48442, 163887, 300009, 268982, 170297, 336566, 533145, 160644, 500250, 108224, 469168, 167587, 38175, 13183, 246230, 126541, 114787, 265075, 386418, 332765, 267108, 126261, 95411, -120618, 335829, 230018, 116643, 466235, 529954, 607229, 613627, 423794, 415855, 253200, 503595, 472001, 488704, 657286, 355497, 607626, 682536, 524067, 573064, 590325, 774541, 938678, 955973, 985913, 706862, 712596, 784537, 754424, 616333, 712723, 537889, 705995, 591886, 616114, 504038, 492053, 387365, 257888, 389564, 424276, 395588, 321904, 540881, 169995, 135981, -43131, 286467, 241482]
7384B41482H1340M9103K53531n2126A01027M8178J17666K12167j12057L1201j8981
7373C79201J16661L4588B53844O2910p731J36450j22986L7883O7238P3296J93489
7362F94393L74031J064577Q80880j867p30829n82384G56417r1675k91809K99851
7352F72784K6618j76334j18844K7203L42843l28975j53739L09041J25229J6090
7342G41916j60284L4451N09812L24363K31017J224855J706469R38797J78286j352463
7332D377219j642209j105230n64099m5810m715r5312j61466J0512k3283l9663
7322G05944L376K62962D70875M12144k84579K1352K3236l3872K95682J07779N10882
7311A523499O83448Q31377P3271o82467r14228k98042n13577n921k1121J11315
$$ y = [241482, 81340, 130443, 383974, 331848, 101027, 149205, 266871, 479038, 366981, 398182, 379201, 495862, 530450, 253844, 316754, 309023, 445473, 322487, 360370, 427608, 500904, 694393, 1068424, 2133001, 3013881, 3012014, 2281185, 1698801, 756417, 664742, 372933, 672784, 699402, 523068, 404224, 431427, 774270, 445295, 291556, 600597, 725826, 741916, 581632, 616083, 1125895, 1450258, 1681275, 2906130, 4612599, 5551396, 5729682, 4377219, 2735010, 1629780, 1065681, 1019871, 1015156, 919844, 758378, 768890, 745607, 705944, 709320, 972282, 470875, 883019, 598440, 619792, 643028, 609156, 904838, 1012617, 1523499, 2206947, 3038324, 3111595, 2429128, 1514900, 1216858, 703281, 697360, 676239, 787554]
7301G87554j34688J35890O3209k81050L45614k71424j3679J15828C72842J28267
7291E01109j54427N9929k1301K05907o7515N1481n9776Q3998J93063J41900J64094
7280A098462r2021j79171j32707L00094k48260J09164l9482L32330J11060j43822
7270A115647J62922K3761j24918N21849k22856J53479J80615J98732K29144K6521
7260B264896K96686L55934L46969Q62686L87301J210735J180504K030745L508062
7251A2444518N428974Q849663R829326P314075K11637n780657m729672O76414
7243C4244278O340948P389826J978258o500858j0141700p043539k532111m76494
7235B3258608n91290k322294l109379k624993m39985J147393K120547J256746
$$ y = [787554, 652866, 788756, 851965, 570915, 916529, 645105, 631426, 747254, 372842, 501109, 346682, 406611, 385310, 591217, 523702, 575183, 515407, 599405, 792468, 934368, 1098462, 1006441, 827270, 694563, 994657, 746397, 855561, 816079, 1148409, 1259469, 1115647, 1278569, 1302330, 1177412, 1699261, 1476405, 1629884, 1810499, 2009231, 2238375, 2264896, 2561582, 2917516, 3264485, 4127171, 4514472, 5725207, 6905711, 8936456, 12444518, 17873492, 26723155, 36552481, 43866556, 44078193, 38297536, 33567864, 34244278, 40585226, 47975052, 49953310, 43452452, 33310752, 26267213, 23735102, 23258608, 22667318, 20345024, 17235645, 14610652, 14170667, 15318060, 17438607, 18695353]
7227A8695353j34388j307746j299470j33644L090888P355641J2490570J1649323
7219E0406527Q576214n206004n420541r357060J153336R384249J3701104J0729790
7211G3967615R05808p387517n574773L409607J0163357P947191K56848p388392
7203G6299744m206793Q611947K0749241K4255295J5571424q48477j6920590k5106439
7195I8405352k3993667j2705424Q43049J3296745K1635465K2911579J3349590
7188A33742689k636941j8106809k8889256k8989738j9948638j0311608n670697
7181A9189002l968550k614104j840299j359172r65532M89094J094029J691372
7173A1715840J173005q32617j984766j791397o40041O55167J562142J593925l13170
$$ y = [18695353, 18560965, 17253219, 15953749, 15820105, 18910993, 26266634, 38757204, 50406527, 58982741, 53776737, 48356196, 38999136, 40152472, 49536721, 63237825, 73967615, 74873423, 67485906, 61911133, 65320740, 75484097, 83431288, 83688136, 76299744, 72092951, 80704898, 101454139, 125709434, 141280858, 140432381, 123511791, 98405352, 74411685, 61706261, 62549310, 75846055, 97481520, 120393099, 133742689, 131105748, 112998939, 84109683, 55119945, 35171307, 24859699, 19189002, 15220452, 12606348, 10766049, 9406877, 8441345, 8930439, 10024468, 11715840, 12888845, 12056228, 10071462, 8280065, 7640024, 8295191, 9857333, 11451258, 11138088]
7164A1138088j963771j986938j314201m87081o19477p13925j75476J51305M76701
7155D505225L10129J19553q29576l85900K33907M21913O97320N53829L68335J066533
7145G061268J117015J579156K050191K411370L925014P334182J0141528J0677170
7137D6296894N430554l279192q598191o569902n64853M703512O490830N149584
7129D9059236M53015k135221n76892L713322K890511k238023q967930r743992
7121C2454026o886289l964889j823341l59240J108293M902680R084607J1562988
7113D6078835R265883L28408p756347j2071493r836964o742044m221841l068685
7105A1975752j750247j514030n93736l12750l04226M12283j52625R1172J11768
$$ y = [11138088, 9174317, 7187379, 5873178, 5386097, 4766620, 4052695, 3877219, 4028524, 4505225, 4815354, 4934907, 4105331, 3719431, 3953338, 4375251, 5072571, 5626400, 5994735, 7061268, 8178283, 9757439, 11807630, 14219000, 18144014, 25478196, 35619724, 46296894, 51727448, 48448256, 39850065, 33280163, 32715310, 37418822, 43909652, 49059236, 49512251, 47377030, 46800138, 50513460, 53403971, 51165948, 42198018, 32454026, 25567737, 21602848, 19779507, 19420267, 20528560, 25431240, 34515847, 46078835, 55344718, 55673126, 47916779, 35845286, 26008322, 19266278, 15044437, 11975752, 10225505, 8711475, 8117739, 7804989, 7500763, 7913046, 7760421, 7851593, 7963361]
7096G963361M96136P01966O19878J425072K923481M266324P597610R725616R197240
7087D4916684M753471m91089k482151m014435o996133q181006l822427J19317
7079B3802231L194490N295853P284399P809036Q566217Q613757M309052l386942
7071F5488093j0621359r425217p365425n465449m391830j876500R51525L710573
7063C1004411O891331J0967649J5446087J9048080J4114775j036975j8041622
7056G8393736j9972204j0158083l479279k632969l636857j513127J605502K157233
7048D0763952r58871l353716j055436M455952N320723J598420r94678L272658
7040D9049004J1500007J2902358M507054r018831j6541376j5045793r694865n266678
$$ y = [7963361, 8459497, 9161463, 9781341, 11206413, 14129894, 18396218, 25993828, 35719444, 44916684, 49670155, 49179066, 46696915, 42682480, 35686347, 27505341, 23682914, 23802231, 26996721, 32292574, 39576973, 47386009, 55952226, 64565983, 68875035, 65488093, 54866734, 45441517, 38076092, 32610643, 28218813, 26342313, 27293838, 31004411, 37895742, 48863391, 64309478, 83357558, 97472333, 96435358, 78393736, 58421532, 48263449, 44784170, 42151201, 38514344, 37001217, 38606719, 40763952, 39805081, 36451365, 35395929, 39851881, 45172604, 46771024, 45776346, 49049004, 60549011, 73451369, 77958423, 68939592, 52398216, 37352423, 27657558, 22390880]
7032B2390880k536938j075826l31149J198619J987242M063890P040968J1048384
7024D3786070J4222067J3927152Q845188K032769k166360k958857K323830J3333740
7016I3345599J6057686P104761n247216r497535r01764M420226k20018r594857
7008I5466882j6124359j8347144j1635440m557808J960522R738514J7346982K2710063
7000I6558212J9181705Q546843q842677k2086420k7994465k0021466j1324082
6993C4017650p277473n392875l925007k728903j985890j231878n17216m61689
6985A0496719j7856L96369N38720J619861J441501K746556L475635M976012Q936521
6976C4610038J3605188J7993978J8924025J5830286Q470372Q62104m767870m026060
$$ y = [22390880, 19853942, 18778116, 18446967, 19645586, 21632828, 25696718, 32737686, 43786070, 58008137, 71935289, 80780477, 82813246, 80646886, 77688029, 80011859, 93345599, 109403285, 116508046, 111260830, 101763295, 100861531, 105281757, 105061739, 95466882, 79342523, 60995379, 49359939, 44802131, 46762653, 56501167, 73848149, 96558212, 115739917, 124286760, 115444083, 93357663, 65363198, 45341732, 34017650, 26740177, 21347302, 17422295, 14693392, 12707502, 11475624, 10958408, 10496719, 10478863, 10875232, 11413952, 13033813, 14475314, 17221870, 20697505, 25673517, 34610038, 48215226, 66209204, 85133229, 100963515, 109433887, 110295991, 105528121, 101502061]
6968A01502061k760299k404584l143222o645328j1134230j5382171r903527n414372
6960D4714328l820857m400354m753537n652522m538399j006468J851042L652343
6952B6045576M982031N332382M920325L559074M97148l622013m604556n161636
6944C1948331n508310l544368k36931J172758J931063J914888R68652m79313k949216
6935B5217554l145915m109173m502709l285382j874966j390080p90513n27598
6927E591218k80155Q3215P76969Q19751J774084K798090K586118J217020m74957
6918A4891353j871806j928429r88176M11715J565688L556532O675664R324548
6910C1637089Q969835O210438L129750P108567L336436l763828o584091M819128
$$ y = [101502061, 98741762, 96337178, 93193956, 86548628, 75414398, 60032227, 50128700, 44714328, 40893471, 36493117, 31739580, 26087058, 21548659, 20542191, 22393233, 26045576, 31027607, 36359989, 41280314, 44839388, 45336536, 41714523, 37109967, 31948331, 26440021, 22895653, 22658722, 23831480, 25762543, 27677431, 28646083, 28166770, 25217554, 22071639, 17962466, 13459757, 10174375, 8299409, 6909329, 6118816, 5591218, 5311063, 5394278, 6171247, 6990998, 8765082, 11563172, 14149290, 15366310, 14891353, 13019547, 11091118, 10102942, 10514657, 12080345, 15636877, 22312541, 31637089, 40606924, 46817362, 49947112, 57055679, 60392115, 56628287, 50044196, 54863324]
6902E4863324J0578730Q619338J796552O86038N707492J4998049R884546n601059
6894A01533010j8763678j7795267j5364517j0584376q064970n277017j791233
6887B3891952n17934J531889M161938R329546J7097716K3595680K0325982R186024
6879A08602793J515195J3069826K2109789K1631237J4120962Q517411q624365
6872A80942848k6269172k0284711j0071069j529793R845461J22167k2263483l7986374
6864G2505874k5030679j2290614n970901k513573K9861K606402P028936J2743629
6856D9108935J6208989J3712630O308914o115815j4853967j9829205j1559606
6849C2980875k995728K131914K874158l80002n116202p427343n254220k415232
$$ y = [54863324, 65442054, 74061392, 75857944, 76543982, 82251474, 97249523, 107134069, 101533010, 82769332, 64974065, 49609548, 39025172, 30960202, 25683185, 23891952, 23374018, 24905907, 29067845, 38397391, 55495107, 79090787, 99416769, 108602793, 110117988, 123187814, 145297603, 166928840, 181049802, 189567213, 180942848, 154673676, 134388965, 124317896, 122788103, 132633564, 132755731, 110492248, 72505874, 47475195, 35184581, 29213680, 26700107, 26729968, 29336370, 36365306, 49108935, 65317924, 79030554, 85339468, 79223653, 64369686, 44540481, 32980875, 29985147, 32117061, 34991219, 34611217, 29495015, 22067672, 16813452, 14398220]
6841A4398220j74020O98134J478045K670242L955508M645406L915028K394128
6833C3980691K469795N553464O907866M944417n9697n544388q197402p632691
6825C2422055m957512j711592J568065L233216L075671K78418k787943k750321
6817B8370057j356873J117531L330463L680498K280097L166593O785378Q374865
6809E5748609j6781j0322014j0843027n115384k955537k045845n74283J937653
6801B5813391O140176J0307520J0115569j72475j1368341j3437118o053043j131161
6793B0214518K19329M16621p44709j691649j608623j24659Q96611J134348J319130
6784B0030917K958629P574093J3738035J5077275N688345j0778511j4923810j0828920
$$ y = [14398220, 14224200, 14922334, 16400379, 19070621, 23026129, 27671535, 31586563, 33980691, 36450486, 42003950, 48911816, 53856233, 53796536, 48252148, 40054746, 32422055, 27464543, 25752951, 27321016, 30554232, 33629903, 33908321, 31120378, 28370057, 27013184, 28130715, 31461178, 35141676, 37421773, 40588366, 47373744, 55748609, 55731828, 45409814, 34566787, 29451403, 26495866, 24450021, 23875738, 25813391, 31953567, 42261087, 52376656, 52204181, 40835840, 27398722, 21345679, 20214518, 20433847, 20850468, 20105759, 18414110, 16805487, 16680828, 17577439, 18711787, 20030917, 22989546, 30563639, 44301674, 59378949, 65067294, 54288783, 39364973, 28536053]
6776B8536053m774262r13748J823971R277378J7387320J9957539J0919598j0457754
6768G1756095k4365572j8228610p407783l589945j928737k245307q46012M11592
6760A3555721K925039O032807Q365444N194613j884801p577223m729048M27544
6752B2310096N875107Q618220R640685Q743065M715079l566955j3075758j2395146
6744C0864393m350369L500638N654118J563107o023773r912196o433903k647443
6736A2214572q72899k82310j046525l30961R50092K293349M719918O031557M861281
6727B8538074P86070j57963N695988J2829599N602006l227125j6172226j441692
6719C2452731L556418j009048p969893r580145o048774k569230m16658P28994
$$ y = [28536053, 23761791, 22848043, 24672014, 33949392, 51336712, 71294251, 82213849, 71756095, 47390523, 29161913, 21754130, 18164185, 16235448, 13990141, 13144129, 13555721, 16480760, 22513567, 30879011, 36073624, 34188823, 26611600, 21882552, 22310096, 28185203, 36803423, 46444108, 55187173, 59902252, 56335297, 43259539, 30864393, 26514024, 30014662, 35668780, 37231887, 31208114, 21295918, 14862015, 12214572, 11341673, 11059363, 10012838, 9681877, 10631969, 12925318, 17645236, 23676793, 28538074, 29324144, 29166181, 34862169, 47691768, 53293774, 50066649, 33894423, 32452731, 36009149, 35000101, 27030208, 17450063, 11401289, 8832059, 8415401, 9144395]
6711I144395J826444L015509K303615o12679k796905k622709j960914j541779
6703F754977k012659p16097n94436n5171j45790K78698K50580O32709Q69291J014403
6693F276505K407547L869611N397800N909020K446354j127978k044113k476498
6685B0658248l879050m926019k917415j003772L24217l92594j143020j234159
6677E486436n07480k1596O13615J520511K627063L976981M575329M173468K361852
6668B4806179J814265k12893l667864o892686n607909k898149j963930n27605
6660D849408p63778j57329k83171O67118Q74894J354972K186276J667448J167045
6651A1562883Q79512J186658J903649J482040j423769l745466m348203k345790
$$ y = [9144395, 10970839, 13986348, 16289963, 15677284, 12880379, 10257670, 8296756, 6754977, 4742318, 4026221, 3431785, 3376614, 3230824, 3509522, 3760102, 4392811, 5262102, 6276505, 8684052, 12553663, 17951463, 23860483, 26306837, 25178859, 23134746, 20658248, 16779198, 11853179, 8935764, 7931992, 8256209, 7863615, 6720595, 5486436, 4978956, 4957360, 5570975, 7091486, 9718549, 13695530, 18270859, 22444327, 24806179, 26620444, 26407551, 22739687, 15847001, 10239092, 7340943, 5377013, 4849408, 4085630, 3928301, 3645130, 4312248, 5187142, 6542114, 8728390, 10395838, 11562883, 12442395, 13629053, 15532702, 17014742, 15590973, 11845507, 7497304, 5151514]
6643E151514j373044q17359m19543k59019o00634j39065j88834j68790J20995
6634A306221l1999O53948K06793N82765R92354R16235M86868k05668m80057q35923
6624C591537l34782p86295p11415j16420m64421J05647k08606j30507k21201k43136
6614D80401K00661j11932k21722O8610p7459J36136k08610M76194j87668k31670
6604C22941J84641k3696O2953j95244J6568J14497J27525P2546n4304L7900o2777
6593F03550n8792K9953o7004K13131C49778P7974J47513j51901J60987j49647
6583D34704R1238B61669J68743j48676J08712j15971L9541o4041J23148j43512
6573B29613I8335J31691l184K20958m0724j34023m4732K29257q0504N9054A62112
$$ y = [5151514, 3778470, 2961111, 2541568, 2282549, 1681915, 1542850, 1354016, 1185226, 1306221, 1274222, 1928170, 2134963, 2717728, 3710082, 4626317, 5113185, 4907517, 4427460, 3591537, 3256755, 2470460, 1759045, 1642625, 1178204, 1283851, 1075245, 944738, 723537, 480401, 681062, 569130, 347408, 416018, 338559, 474695, 266085, 742279, 554611, 322941, 507582, 483886, 546839, 351595, 368163, 482660, 610185, 682731, 628427, 666327, 603550, 544758, 574711, 507707, 720838, 349778, 427752, 575265, 423364, 584351, 434704, 525942, 261669, 430412, 281736, 390448, 274477, 314018, 249977, 373125, 229613, 98335, 230026, 226842, 447800, 407076, 273053, 228321, 457578, 377074, 436128, 162112]
6561C02764K60880B58119n4076K07935A73263L34236o7255A78623M1306J40200
6551C60129K29171B34809O9115q9827O0012J459E2224K09599m2032L2355K69106
6540E21252N5363B57081J98293B14435K44645r4751p609K86038J43792L57631
6530A144181K58094k12224K7789m91131J52255j30692M46477Q9113J73502p4832
6520A382532P53837K48331P42994J262660K269181O218355J1479798J5890843
6512D0248531L974410p534265A6880282q112528k997839j513247j269076q57644
6504B129948j73595m42949l56914n2833K8963m43656R480R6026j84177J21676
6494G31969P0342L06508j85350K23053L98196O30435k20953K99095n08409k41940
$$ y = [302764, 563644, 258119, 204043, 411978, 173263, 507499, 440244, 178623, 219929, 360129, 589300, 234809, 303924, 214097, 274109, 275568, 52224, 261823, 219791, 252146, 521252, 576615, 257081, 455374, 214435, 459080, 364329, 356720, 642758, 786550, 1144181, 1402275, 1190051, 1217840, 726709, 878964, 748272, 1194749, 1283862, 1457364, 1382532, 2136369, 2384700, 3127694, 4390354, 6659535, 12877890, 24357688, 40248531, 44222941, 36688676, 16880282, 8767754, 5769915, 4256668, 2987592, 2129948, 1956353, 1513404, 1156490, 1103657, 1132620, 688964, 698444, 794470, 610293, 731969, 802311, 1108819, 923469, 1146522, 1544718, 2175153, 1954200, 2253295, 1744886, 1502946]
6484A502946L1915k92412L5258l31476N61109K88134L23264L91506N77761R62908
6474D050913J116150K912926N616321Q298622Q622171L105783m840656o835269
6466B2046961n063543k035834q7212l33202j858263l389843k740715j411534l38929
6457D787886m16746K37941O9250N03840J472697K071340L124457M359281O058032
6448B2267978P692113Q218952O456552L179969n91306q40355n209291p181658
6440C3992954r160716n947872m921815m299284k428608j548707m43948n86712
6432D655292l60259J77299K24851Q47259J892795K559873K025404R74996o47870
6423A2349640P53211K906537N976846N706668J976468n099338r350099o610726
$$ y = [1502946, 1534861, 1242449, 1277707, 946231, 1507340, 1795474, 2118738, 2510244, 3088005, 4050913, 5167063, 8079989, 13696310, 21994932, 30617103, 33722886, 28882230, 22046961, 16983418, 14947584, 14860372, 14527170, 12668907, 9279064, 6538349, 5126815, 4787886, 4371140, 4609081, 4678331, 5182171, 6654868, 8726208, 11850665, 16209946, 22267978, 29960091, 38179043, 44635595, 47815564, 47224258, 46383903, 41174612, 33992954, 24832238, 18884366, 13962551, 9663267, 7234659, 5685952, 5242004, 4655292, 4295033, 4472332, 4697183, 5544442, 7437237, 9997110, 12022514, 12997510, 12349640, 13102851, 16009388, 21986234, 27692902, 29669370, 24570032, 15219933, 8609207]
6415H609207l489315j285217r42611l07169m14172j91795m50101j67632m70651
6406H90544O3458J48379J4965J09949J64340L07603l0124l45833n32116N3176
6396H44341B99830M3930K11840j43288j49175J85147J1777H5770J30515K7121
6386B43406M6792l7412I1245J94180K30710k54843q9405J64993E9148J46382I5069
6374A32879K72350A73882J49818A22143j629J42349O6923f2818A70306K7968r5698
6363A02576A7440c6256B328K34500E03K08432F1459N6140b19376A62824G7970
6351B45338o5547a7064H2162J77936p7927J43825g2252m7066B18427c0543A48845
6339F6858M4332P7470j3352E6655K11585A1585J61126Q0552J46898A10199M8054
$$ y = [8609207, 5119892, 3834675, 2892064, 2584895, 2170723, 1978928, 1528827, 1361195, 890544, 954002, 1102381, 1117346, 1227295, 1391635, 1699238, 1669114, 1323281, 791165, 844341, 299830, 343760, 555600, 412312, 263137, 448284, 460061, 85770, 216285, 243406, 290198, 252786, 91245, 285425, 516135, 261292, 171887, 336880, 59148, 205530, 95069, 132879, 405229, 173882, 323700, 122143, 120514, 262863, 329786, -62818, 170306, 198274, 102576, 17440, -36256, 2328, 236828, 503, 208935, 61459, 117599, -219376, 162824, 77970, 245338, 179791, -17064, 82162, 260098, 182171, 325996, -72252, -119318, 218427, -30543, 148845, 66858, 111190, 188660, 175308, 56655, 268240, 11585, 172711, 253263, 400161, 110199, 158253]
6328A58253J5757B7762d9719c49D9391O2771a22373C35465E1486J21272n508K96447
6316D63697A86181M265q3648L4187e712D10011M7570e420C16049d8711B53854
6304B09648L2354l641q1477K88973j11850L33221j02614K22909Q0531l9269q0414
6293G48371C58065o4781j01848M4462a94620B55618r4647J25119q8761a803B02424
6281B0163J47981J62122A59348K73786o2670L01203K30268r4645j97981k78273
6271C31036j57410P0760K62353B53294K21353j76088p7818J6709B6949M05069
6261D32018j81088R515j607L18700k34060r6391J07550M33081k42588M8291B13568
6249B56878L86471j32485L02972J12375l12728B21092L85738j16456A74163L36386
$$ y = [158253, 174010, 27762, -49719, -349, 49391, 112162, -122373, 335465, 51486, 172758, 167250, 463697, 186181, 190446, 106798, 140985, -5712, 410011, 457581, -5420, 316049, -48711, 253854, 209648, 242002, 238361, 156884, 445857, 334007, 667228, 564614, 787523, 868054, 828785, 748371, 358065, 293284, 191436, 235898, -194620, 255618, 160971, 286090, 197329, -1803, 202424, 20163, 168144, 330266, 159348, 433134, 370464, 671667, 901935, 807290, 609309, 331036, 173626, 244386, 506739, 253294, 474647, 298559, 220741, 237450, 26949, 432018, 250930, 260445, 258838, 577538, 343478, 247087, 354637, 787718, 545130, 593421, 213568, 256878, 643349, 510864, 813836, 926211, 613483, 221092, 606830, 490374, 174163, 510549]
6239E10549k39133J36940N2896j75413J30452K34779j04351l326J2137L6880j52503
6228D39907L7676L02303J18979J45703l13232k75426j92230J50177j23938j9409
6218B70510q5337H7044L03336q7941F4813R4063Q4580K656M11360j82169A24034
6206E15706r4875j13996P2310K17652k41051A52049J98762d4826D2159i294j70382
6195a79676e043C36630l3179r6335J1436O3535o9204n7619K2745M2461p6979F2431
6182I4058N6170C7681L8922M7876h6478l5526C9583Q4917J98668j24593O1852
6171B60427K4620J87442J30669j1025B83834J71063j57424A22981J17652n5896
6161A84737J35165p8312o8078J28188C049L15268J69485r6579L45013J36367J34721
$$ y = [510549, 271416, 408356, 461252, 285839, 416291, 651070, 546719, 543393, 555530, 592410, 439907, 477583, 779886, 898865, 1044568, 731336, 455910, 263680, 413857, 289919, 270510, 185173, 87044, 390380, 302439, 64813, 158876, 243456, 246112, 657472, 475303, 124034, 515706, 420831, 306835, 379145, 596797, 355746, 152049, 350811, -44826, 42159, -9294, -179676, -5043, 336630, 303451, 207116, 218552, 282087, 212883, 155264, 178009, 220470, 143491, 62431, 94058, 150228, 37681, 76603, 124479, -86478, -122004, 39583, 124500, 323168, 198575, 260427, 285047, 472489, 603158, 592133, 283834, 454897, 297473, 122981, 240633, 184737, 319902, 241590, 173512, 301700, 3049, 318317, 487802, 391223, 736236, 872603, 1007324]
6150A007324J77354L11228O4760Q63991J779334L447127L307750j14132l651885
6141G192851C174952j214931p65816k00745l76895Q6294j43220j71846O2463K5891
6131D76147M08205j24734J35141N502j42939J2496j00534R2428k05423J64580
6121G20869N35111J55552J68121L86645M54956M61467J121950K131327L588593
6112I724591N196253M377603J480380k286962m943832m889009l134897j767019
6104C757108p96830j21547k67827K35397k17075M7363K38593K74375M75075J806514
6094E431146L211710M130460M560172J766834j642293l866645m772385l151653
6086E667346j962544m91000n34172k55509J29135k07939J69077L24452K46917
$$ y = [1007324, 1184678, 1495906, 1560666, 2424657, 4203991, 7651118, 10958868, 10844736, 7192851, 3174952, 1960021, 1194205, 993460, 616565, 702859, 559639, 387793, 450256, 476147, 884352, 759618, 894759, 900261, 757322, 769818, 669284, 761712, 556289, 720869, 1255980, 1411532, 1579653, 1966298, 2421254, 2882721, 4004671, 6135998, 9724591, 14920844, 19298447, 20778827, 18491865, 13548033, 8659024, 5524127, 3757108, 2960278, 2838731, 2570904, 2806301, 2589226, 2636589, 2875182, 3149557, 3624632, 5431146, 8642856, 12773316, 17333488, 19100322, 17458029, 13591384, 8818999, 5667346, 3704802, 3213802, 2679630, 2424121, 2553256, 2345317, 2514394, 2838846, 3085763]
6077C085763K59013P48599Q72055J315942L838618N314287Q155916P175099K855094
6068C3620386k867181p358304p412667n747155l014606j173840q80621n4176n23423
6059D588413K8558R9009L44022O14925J200781K576951M527836P017088P197778
6050B8195361L630219j875224o694773p706827n850972k861182j939225r84218
6042C913159m50133l88017n38720n14615p04349K87333m87899J72524N6211r2726
6032A252768j69710l54184l08117Q1622j48846Q7976j00510k1811A26145J30049
6022B56194Q2937N0893H8428K70429H6398J76856N8780k199A58084J88182q6544
6011B59722P5725A08025J30027E3924O9329J5231M5352p1310N7140j7909a29748
$$ y = [3085763, 3344776, 4093375, 4965430, 6281372, 10119990, 15434277, 23590193, 30765292, 33620386, 30753205, 23394901, 15982234, 10235079, 7220473, 6046633, 5166012, 5111836, 4588413, 4616971, 4715980, 5060002, 5674927, 6875708, 9452659, 13980495, 20997583, 28195361, 31825580, 29950356, 23255583, 15548756, 9697784, 6836602, 4897377, 3913159, 3463026, 3075009, 2536289, 2021674, 1317325, 1604658, 1116759, 1289283, 1345494, 1252768, 1083058, 728874, 420757, 502379, 353533, 441509, 340999, 319188, 126145, 256194, 339131, 390024, 88428, 358857, 86398, 263254, 322034, 319835, 158084, 346266, 259722, 335447, 108025, 238052, 53924, 123253, 138484, 183836, 112526, 169666, 151757, -129748]
5999C92653A62314C3972M0185Q1125k7496J04131I2524K47701K00363A92624Q5107
5988B77731j00849K2560j6558K2001J0854n8985C1910K65028D0957J86228L8819
5977B66004J23956A85799L44049j41597K21700n3158r4025K10402l7896K92084
5967I27358J11343L58779M54579N61044L58338J012684N59709J667163K943642
5958H954639O187668Q513150Q197526L918178k743165p900668q402223o710368
5950A0014737l082724j805982o19012n75080m08895l90190k40165J30814j52954
5941B870549K66306N52268K63688J113505J575006L481425O243505P903868O804422
5932C1074542J376326m351704q180499p684040m078881k625802r55141n28450
$$ y = [392653, 162314, 33972, 74157, 155282, 127786, 231917, 92524, 340225, 540588, 192624, 277731, 176882, 199442, 182884, 204885, 215739, 156754, 31910, 296938, 40957, 227185, 266004, 389960, 185799, 529848, 388251, 609951, 556793, 462768, 673170, 635274, 927358, 1038701, 1397480, 1852059, 2413103, 2771441, 3784125, 4343834, 6010997, 8954639, 15142307, 23655457, 31852983, 35771161, 33027996, 25127328, 16725105, 10014737, 6932013, 5126031, 4507019, 3931939, 3523044, 3132854, 2892689, 3023503, 2870549, 3136855, 3689123, 3952811, 5066316, 6641322, 10122747, 16366252, 24270120, 31074542, 32450868, 28099164, 19918665, 12234625, 8155744, 5529942, 4574801, 4046351]
5924D046351l78434j58118k47597o2437J55455L57096J484163K975846M521696
5915A2694021M938333L225980j114039m123014n340083m046456k252448r07889
5907C074405l24730n19432j21822k50888L4292n6214J4586q145K56225L85266
5897B483543M23858Q00445J888900L425784M891719M669158J216144k399848m986167
5888A2413536m277796k898142j513138p41729q10228m97027n6599j85589k56006
5879A177282j57780k62200k9235n5116k06665K1334j9790L7669B04556J05040
5869C09596A37247M672L92320k19767M07591O3658K39101k29384l74008j52787
5859B68643M3480j21714K7293M2597o7853Q7159j14688K05720A73494Q9344P3549
$$ y = [4046351, 3667917, 3509799, 3262202, 3199765, 3355220, 3712316, 5196479, 8172325, 12694021, 17632354, 20858334, 19744295, 15621281, 10281198, 6234742, 3982294, 3074405, 2749675, 2230243, 2108421, 1857533, 1891825, 1835611, 1850197, 1842052, 2098277, 2483543, 2907401, 3707846, 5596746, 9022530, 13914249, 18583407, 19799551, 17399703, 12413536, 8135740, 5237598, 3724460, 2982731, 2172503, 1675476, 1618877, 1433288, 1177282, 1019502, 757302, 728067, 672951, 466286, 487620, 467830, 505499, 204556, 309596, 137247, 141919, 534239, 314472, 722063, 785721, 1024822, 795438, 421430, 268643, 312123, 190409, 217702, 260299, 192446, 279605, 164917, 370637, 173494, 262838, 336387]
5848C36387J34782j50369M20951C54736L3084F051M46187b07548B52170k5952
5838B26218k7331n1276e5439A02030K2377a92720A78098J10380B4059B854J35227
5827A38081J4190a12866E84357B58302M21145p7621j98081P2739D8161J75079
5817B23240J61110A52801b20437A48917L67895A47153C8279j4410Q1029b3649
5806C5108K32956n9222a73868C02755b9590C223L34041E3410J76236j14699M9130
5795A64077Q6980D2200K01739G5412e4478A08341j133J10864N608A06040K42018
5784C48058j16322n5546l665l572R3975j6611L40351k12670P8483N18522j90176
5773G80827L1314M52575Q4800j663M64436J16063L11465M30797P01357M94262
$$ y = [336387, 471169, 320800, 741751, 354736, 387820, 6051, 452238, -207548, 252170, 226218, 198887, 147611, -55439, 102030, 124407, -192720, 178098, 288478, 24059, 2854, 138081, 152271, -112866, 584357, 258302, 679447, 601826, 403745, 476484, 48161, 223240, 384350, 152801, -220437, 148917, 516812, 147153, 38279, 23869, 104898, -23649, 35108, 268064, 208842, -173868, 302755, -29590, 3223, 337264, 53410, 229646, 114947, 164077, 251057, 42200, 243939, 75412, -54478, 108341, 107208, 218072, 223680, 106040, 348058, 231736, 176190, 172525, 168953, 262928, 246317, 586668, 373998, 452481, 971003, 780827, 812141, 1264716, 1349516, 1347853, 1812289, 1928352, 2239817, 2670614, 3371971, 3866233]
5763C866233J058263R91318J259278J583407J947469K773760L958740N566920
5755B3005388P683444J2226339K7489467P1341410J18855811J24675609J0601624
5748C95879092j23273413A28510414o0090725k3222299j1895737q534838n887358
5741A8879457m142656l451380j903045j717550j306016j006743j142742l86204
5733C823121p15238l18167l80574o9308o09341M40635n65555k01312O4254m20878
5723A047637K94294J1696j21237j66178K9899p5896j7664J5102j63253k27479
5713F26921J44211k56654M9796j03660K75020L6427j63612l5945N4413k61978
5703C64939R9226m2853N4359j09260K32236A72531K14786j62502n1584J07902
$$ y = [3866233, 4924496, 5915814, 7175092, 8758499, 10705968, 13479728, 17438468, 23005388, 30688832, 42915171, 70404638, 141746048, 260601859, 385277468, 395879092, 272605679, 128510414, 68419689, 45197390, 33301653, 24766815, 18879457, 14736801, 11285421, 9382376, 7664826, 6358810, 5352067, 4209325, 3823121, 3107883, 2789716, 2409142, 2339834, 1730493, 2171128, 1605573, 1404261, 1468515, 1047637, 1341931, 1353627, 1232390, 1066212, 1096111, 1020215, 1002551, 1017653, 854400, 626921, 771132, 514478, 564274, 460614, 735634, 772061, 608449, 572504, 626917, 364939, 464165, 421312, 475671, 366411, 598647, 172531, 387317, 224815, 173231, 281133]
5693B81133J34264B03663Q57K34721G4177K86861J68273b0070A87734H0439K6389
5682A06828J58821j25418J49195G3725A7733J90961A03066l9326J09560b00209
5671A93271l5331K01496a98985F9502N8800l5172R5287q4382e1148b0470B90637
5659B6134b02017B2852J54079B1175b52492B64797p1523G8497N7867k2890c7064
5647a41143D5596O4111p749J12947H8860g892A19456f3976a4909r6540m4519b0834
5634a25131G2970Q9473b03874A82944O5149j16944J72859j9392a33143A07538
5623a66400b03B64916p0451D1137P5510D2974J99871m3924E7752a40790H7222
5611c8660B217J33928k4600b7948j7440B51015j07957c35A81678G6674K7056i7666
$$ y = [281133, 415397, 203663, 204520, 439241, 74177, 361038, 529311, -20070, 187734, 80439, 106828, 265649, 140231, 289426, 73725, 17733, 208694, 103066, 63740, 173300, -200209, 193271, 157940, 359436, -198985, 69502, 128302, 93130, 188417, 104035, -51148, -20470, 290637, 26134, -202017, 22852, 176931, 21175, -252492, 264797, 193274, 78497, 136364, 113474, -37064, -141143, 45596, 109707, 101958, 214905, 88860, -7892, 119456, -63976, -14909, -111449, -155968, -20834, -125131, 72970, 162443, -203874, 182944, 248093, 131149, 304008, 284616, -133143, 107538, -166400, -203, 264916, 194465, 41137, 116647, 42974, 242845, 198921, 57752, -140790, 87222, -38660, 2217, 136145, 111545, -27948, -45388, 251015, 143058, -335, 181678, 76674, 103730, -97666]
5598C3745A4758f1840B52067F1918N3827C7653b47128A1260c022j63783E4753
5586A32712a81560b547n0956j03029i281A61251d8153B56886A03923b9640I5327
5574g9256B22345e4126A43597j0911l3934g9931P002o5538A25868H429L8448b1009
5561D2302a17497J0324D3304a18743B43624H0552b6725A73356A5703K00470a11836
5549a31861B76991A7611K89595j41515a19752G1383J34557m0872K37605J99000
5539F01673O67226Q7020J025140n90049q71434D58410j99171J39588j02688n5430
5529B40709n1679b7245G1740A4785J99370f3037A83923D4942a14994G3803a11907
5517C32918b5247A3179g9224o0860A59532b11652R8513B31139B5716a15109c5089
$$ y = [33745, 14758, -61840, 252067, 61918, 115745, 37653, -247128, 11260, -3022, -166805, 54753, 132712, -181560, -2547, -53503, -156532, -9281, 161251, -48153, 256886, 103923, -29640, 95327, -79256, 222345, -54126, 143597, 132686, 98752, -79931, -72929, -138467, 125868, 8429, 46877, -21009, 42302, -117497, -107173, 43304, -118743, 243624, 80552, -26725, 173356, 15703, 216173, -111836, -131861, 276991, 17611, 307206, 165691, -119752, 71383, 205940, 165068, 402673, 601673, 1268899, 1355919, 2381059, 1791010, 919576, 458410, 259239, 398827, 296139, 240709, 189030, -27245, 71740, 14785, 214155, -63037, 183923, 44942, -114994, 73803, -111907, 332918, -25247, 13179, -79224, -140084, 159532, -211652, -113139, 231139, 25716, -115109, -35089]
5505E9800L5094k9909a653k59393B57827a80509c8778k1964K8772o6033G4631
5493e2259o1784q8322N5185d0465I1531j1412l7730a18537F467K01950a54441
5481A08290k5686K4411m0939R1021G8064B6190a2507A00254R8955l1164c3698
5469C4853Q4188i556j90444E2277i7915b4047A98224a370j3624A02778L2552h1122
5456a45761K7458A74973n6570m3607e4930b1708l3429h508j64646A20594n7537
5445F3057L9285e749E7069J72478E0714J1493a58757n3132C42297j51425n3115
5434A37757I686f1034I47K6947b29013d0822G43h5514F8175c06765f6723A05755
5421b9231o0660A78651c1517n0189k39060b1754B6968J134Q725O9429I559P5590
$$ y = [59800, 94894, 64985, -1653, -261046, 257827, -180509, -38778, -60742, -31970, -98003, 74631, -52259, -114043, -202365, -147180, -40465, 91531, 80119, 42389, -118537, 6467, 208417, -154441, 108290, 82604, 107015, 66076, 157097, 78064, 26190, -12507, 100254, 199209, 168045, -33698, 34853, 119041, -9556, -200000, 52277, -97915, -24047, 198224, -1370, -14994, 102778, 135330, -81122, -145761, -118303, 174973, 118403, 74796, -54930, -21708, -55137, -8508, -173154, 120594, 63057, 102342, -5749, 57069, 229547, 50714, 62207, -158757, -211889, 342297, 190872, 137757, 9686, -61034, 947, 27894, -229013, -40822, 743, -85514, 68175, -306765, -66723, 105755, -29231, -89891, 178651, -31517, -81706, -320766, -21754, 26968, 28102, 36827, 106256, 9559, 85149]
5409H5149B7973N8468h3586E3134M9252R8720a43486C4752a66958n3801B11322
5397A13804c42653A05320N8099p4450K4948c471A09114A4575K5747e1620A02125
5385B41656a52653B09462R9650A32115a63848E2178O066J21147E1431f9327I9985
5373G3988p968P8886m2665N0346b6116B8073K14811D9606a2081B60958i0977H2678
5360E0419j2755b355A54411a00147M7370n7061B0076h732j94150b2220m974C79256
5347B30251J01257A00009C277N6948B6230a75763b7362Q40A69082m7258a35271
5335a10984A56999a52486E6434M7331J56928A930g9918H196f5304b90j44548J5504
5323a29334A8267a22292B11855E360L06862i7194L092H9243a50673O5236k9248
$$ y = [85149, 27973, 86441, -83586, 53134, 102386, 201106, -143486, 34752, -166958, -220759, 211322, 113804, -342653, 105320, 163419, 88969, 113917, -3471, 109114, 14575, 40322, -51620, 102125, 241656, -152653, 209462, 309112, 132115, -163848, 52178, 58244, 179391, 51431, -69327, 99985, 73988, 66020, 144906, 102241, 152587, -26116, 28073, 242884, 49606, -12081, 260958, -90977, 82678, 50419, 37664, -2355, 154411, -100147, -52777, -109838, 20076, -8732, -202882, -22220, -27194, 379256, 230251, 331508, 100009, 3277, 60225, 26230, -175763, -27362, -26522, 169082, 121824, -135271, -110984, 156999, -152486, 56434, 103765, 260693, 1930, -79918, 8196, -65304, -290, -144838, -129334, 18267, -122292, 211855, 5360, 312222, -97194, -94102, 89243, -150673, -85437, -114685]
5312a14685B37254f7351A72876a88820b4175o5996A42131j0071o0753N7775c29669
5300B5383a9062k51565B3837P6917h9810b7138C3520K0587b41915A37706J30512
5289B68218g2482p7689a1463F9901c24742a58654j3885c7558k01849A00599b39002
5277A80953a38679Q297d1293j39060f0519A76178j6091h2960F1940B6765L893
5266C0658j809a11172A26495b6339E4333c1809l39142A78448D4264L0471j7640
5255E7095A5223J4440l584b11353D7729Q2579l5039a67926A37980o144a52623
5243d7840A43535c5999H8056M3356g2826j1492K6733m6829j08917A72184M1253
5232B13437i8357C1483b66199B96940I4924b48158A4500N568a19974A52918p2903
$$ y = [-114685, 237254, -67351, 172876, -188820, -24175, -90171, 142131, 132060, 71307, 129082, -329669, 25383, -19062, -270627, 23837, 100754, -89810, -27138, 33520, 54107, -241915, 137706, 268218, -72482, -150171, -11463, 69901, -324742, -158654, -172539, -37558, -239407, 100599, -239002, 180953, -138679, -130382, -41293, -180353, -60519, 176178, 160087, -82960, 61940, 26765, 30658, 28849, -111172, 126495, -26339, 54333, -31809, -370951, 178448, 44264, 74735, 57095, 15223, 29663, 26079, -211353, 47729, 130308, 95269, -167926, 137980, 131836, -152623, -47840, 143535, -35999, 88056, 131412, -72826, -84318, -57585, -104414, -213331, 172184, 213437, -98357, 31483, -266199, 296940, 94924, -248158, 14500, 20068, -119974, 152918, 80015]
5221H0015k5009k6505a6837B27796a02624c5103j84564D2955N4505L65984F9148
5209a06633D1243J29373h2916A41987p693a26171c3015k2924H372P8329c6954
5197a1831p4195B63349b46824A55708C1338K2423B0222F300J00350b35336A82499
5185C13821a07207C9116f9768A5515h048l1873p040k24359A85679a0455q2442
5174i2897p9308Q1568A459Q627P5488Q3531a26673j1234f0119J9347k5807A49603
5161d2092A67561J867E0110J06077a0755j02510A30561a81824I4208o398q388
5150G9422B5884a76520j13175E0480e7216A23791B0418c5198k12414b1121E2102
5138A19910J05470a04703j2155B4745J13915b67922a27451B3095a5785D5546a9658
$$ y = [80015, 55006, 28501, -16837, 227796, -102624, -35103, -219667, 42955, 97460, 463444, 69148, -106633, 41243, 170616, -82916, 141987, 134294, -126171, -33015, -55939, 8372, 86701, -36954, -11831, -86026, 263349, -246824, 155708, 31338, 53761, 20222, 6300, 106650, -235336, 182499, 313821, -107207, 39116, -69768, 15515, -8048, -39921, -46961, -271320, 185679, -10455, -92897, -172205, -90637, 1459, 10086, 85574, 169105, -126673, -137907, -60119, -40772, -66579, 149603, -42092, 167561, 169428, 50110, 156187, -10755, -113265, 130561, -181824, 94208, 87810, 79422, 25884, -176520, -289695, 50480, -57216, 123791, 20418, -35198, -247612, -21121, 52102, 119910, 225380, -104703, -116858, 24745, 138660, -267922, -127451, 23095, -15785, 45546, -19658]
5126f1389A21206b28146i3612q2525O3371J4017M3759j91121A24855M1693g6926
5114d7930I7639L2885f4276j85552e0012A22367P092F1474Q005b64681A96420
5102B38297G8161a44150A23626g1854r1663k0924B753R0574f0677q2873E9742
5090b83626C4634a35509d5701O054m2378j48116C5368r370J01168b82855I2944
5078c1474l5307A51971b16450D2472i598A10475k0999B2421b13962f6084G0593
5066b45244Q5906A87905b74892B0031a12273C6920H355L2069h4065j1964M0232
5055e5797D4096b38873C4298M5556a38786E4086b89245J35597g5372o7915j08328
5044b51615E5557d5381B19198b8198F5868a00998q6506h3466J5340n7349H5636
$$ y = [-61389, 121206, -228146, -93612, -176137, -112766, -98749, -54990, -246111, 124855, 166548, -76926, -47930, 97639, 130524, -64276, -249828, -50012, 122367, 129459, 61474, 69479, -264681, 196420, 238297, 78161, -144150, 123626, -71854, -163517, -184441, 2753, 93327, -60677, -143550, 59742, -283626, 34634, -135509, -45701, -39647, -82025, -230141, 35368, 25998, 127166, -282855, 92944, -31474, -66781, 151971, -216450, 42472, -9598, 110475, 89476, 22421, -213962, -66084, 70593, -245244, -159338, 187905, -274892, 20031, -112273, 36920, 8355, 40424, -84065, -96029, -55797, 44096, -238873, 34298, 79854, -138786, 54086, -289245, -153648, -75372, -143287, -251615, 55557, -45381, 219198, -28198, 65868, -100998, -187504, -83466, -68126, -125475, 85636]
5032C8116a68671H7037b07316A23327k5270b430B75849E3285J14808a49846A15138
5020H040a79002f5580I7225a29829k02394B03605q1739M9611H4685L5358n0829
5009F9214d1515k5880j35977A19593a32466C47483C8724a85314A53014j3423l3962
4998A05629O6806d6767D7973I202K0416J24059a61607C1953j3310b34923D7864
4986A76826d7790A74398e5275m7833B43401j20624C6601a74762F0997J60140l627
4975B17510m7831J5213j5691a39461h394D0046N2420J37224C6640j5226R2213
4964A13627a80403D8632J70478g4726j8495k0586R492A09037b80441a21028N3902
4953f7126m7359j27775b6969A19709L294B3414M7105a22012A23792a42093e0215
$$ y = [38116, -168671, 87037, -207316, 123327, 98057, -2430, 275849, 53285, 168093, -149846, 115138, 8040, -179002, -65580, 97225, -129829, -332223, 203605, 121866, 171477, 84685, 120043, 69214, -41515, -67395, -203372, 119593, -132466, 347483, 38724, -185314, 153014, 139591, 105629, 172435, -46767, 47973, 9202, 29618, 153677, -161607, 31953, 18643, -234923, 47864, 176826, -47790, 174398, -55275, -103108, 243401, 122777, 36601, -174762, 60997, 221137, 217510, 169679, 184892, 169201, -139461, -8394, 40046, 92466, 229690, 36640, 21414, 113627, -180403, 48632, 219110, -74726, -93221, -113807, -104315, 109037, -280441, -121028, -67126, -114485, -242260, -26969, 119709, 123003, 23414, 70519, -122012, 123792, -142093, -50215]
4941b54231M8749O0015a1232l9983k11967a24309A78846a60941j9206A53728a29295
4929F2082a84494i943D7304i0469A91270L5961b58701f3050A05847R5775d7344
4917a7577E5538b25244g2128A396K132c4767E6353D12M1491M9318J8591b8512
4904a72067F8429a5376N270A1397h0033C03613h1753D65676e9981i384j08753
4893a18137B0a04790j71688I3570c82521a14201A27600m8109J4519b5701H9893
4881a11305B26748C0978J07396h6994p4935r725H0188f9242k4239a9629A5964
4869H975d334j4222k129n8259k7240m8953A26607n4404K82992a44820E8809b28632
4856A48345B1618J12722a682A486e6521m0125J6911A0831h1107n0808N2831n2723
$$ y = [-254231, -205482, -145467, -11232, -51215, -263182, -124309, 178846, -160941, -180147, 153728, -129295, 62082, -184494, -9943, 47304, -90469, 191270, 227231, -258701, -63050, 105847, 201622, -47344, -17577, 55538, -225244, -72128, 1396, 3528, -34767, 56353, 412, 41903, 91221, 109812, -28512, -172067, 68429, -15376, -10106, 11397, -80033, 303613, -81753, 465676, -59981, -9384, -118137, 20, -104790, -276478, 93570, -382521, -114201, 127600, 79491, 94010, -25701, 89893, -111305, 226748, 30978, 138374, -86994, -161929, -171654, 80188, -69242, -93481, -19629, 15964, 8975, -4334, -18556, -20685, -78944, -106184, -155137, 126607, 72203, 355195, -144820, 58809, -228632, 148345, 21618, 134340, -1682, 1486, -56521, -96646, -79735, 10831, -81107, -131915, -79084, -131807]
4844a31807L9128E1845d2207A51422A4706a19071j27360M9095H3284a06975b4924
4832a7947B23246o7008N6349a0188j75225G1251J1790e8784A23161a66887e8877
4820b26463f6116b3862B71026j26278H601a91107L4127c2123A02414K50264m2409
4809C10269a37394j65617h2999o30p0687g3449D5917b6441A50100b2546m8593
4798g1139B36853c2566H3624k4340A3362b919A66958h3188B05300p1027E2127
4786a00489j16056a00821B5500O3271k7720n713P5014l0001i0034j721j90659
4775b82414a553B7371P7957l5347e4023n8634k0833a2764o2562b4055k7589j92693
4763b44337A30216l0887b22595g1247A24452k4857a5473l1532r5932K4823K3332
$$ y = [-131807, -92679, 51845, -42207, 151422, 14706, -119071, -246431, -197336, 83284, -106975, -24924, -17947, 223246, 156238, 212587, -10188, -185413, 71251, 83041, -58784, 123161, -166887, -58877, -226463, -66116, -23862, 271026, 144748, 8601, -191107, -156980, -32123, 102414, 352678, 310269, -137394, -303011, -82999, -83629, -154316, -73449, 45917, -26441, 150100, -22546, -71139, 236853, -32566, 83624, 59284, 13362, -2919, 166958, -83188, 205300, 134273, 52127, -100489, -216545, -100821, 25500, 88771, 61051, 55338, 130352, 100351, -90034, -91755, -282414, -1553, 27371, 105328, 69981, -54023, -112657, -133490, -12764, -75326, -24055, -51644, -244337, 130216, 99329, -222595, -71247, 124452, 99595, -15473, -47005, -142937, -118114, -94782]
4752i4782C2965K16327j09222m3851N3826c00007a04821B56075I8387a89740D2405
4740D5846b06356C3918R1311R63b2984k6005B821b10313d6878A18601E6299A3351
4727B34415A04716d0792A13815k8451d4335k9716k46761f9015B9148e8080E6356
4715e9888a0194j05275n1846L2904A4910J87864F3300k0358J28078h6002j00580
4704a86582A48711a18518D7966a17304H4202a92072I2987Q3179a78830L6569c183
4692c7768I6376c3709o6300B0362L3334d1636j39208M1468c8890j88626j55391
4681c82907A10429A5448a14562J6021A21184K7958k5171a15780D1655q393M5122
4670G8384A1709a14842n9187d4151A29110D0421h6003F853a01075N887p4291H5338
$$ y = [-94782, 32965, 249292, 140070, 96219, 150045, -300007, -104821, 256075, 98387, -189740, 42405, 45846, -206356, 33918, 125229, 126192, -22984, -48989, 2821, -210313, -46878, 118601, 56299, 13351, 234415, 104716, -40792, 113815, 85364, -44335, -74051, -320812, -69015, 29148, -58080, 56356, -59888, -10194, -115469, -167315, -134411, 14910, 202774, 63300, 42942, 171020, -86002, -186582, 148711, -118518, 47966, -117304, 84202, -192072, 92987, 176166, -178830, -142261, -3183, -37768, 96376, -33709, -100009, 20362, 53696, -41636, -180844, -139376, -38890, -227516, -382907, 110429, 15448, -114562, -98541, 121184, 149142, 123971, -115780, 41655, 33262, 78384, 11709, -114842, -174029, -44151, 129110, 40421, -86003, 6853, -101075, -95188, -169479, 85338]
4657a20991j00256N9423C3748P1637B8711a0933A60849a22986d538k557r6425
4646a03520b8820A7416d06196A00647a82636P192H9623a95509i0158K5974I0192
4634a02273a2218A14190f8407B1787a39036O8120a9026q7761B0935a70792j6485
4623a87277A1024h9563j11968B8447K20119b0153o2689j5369A39582a22906o6827
4612a89733c0289I2920b41581A9841K430a90678a1356j54664d365D2942b1830
4600C2189i7624r1017m0217E0496c47728H486K16354j04966g7706j06753b623
4588a06597b1733G6344Q6975p0244a34962D8981b2849k70009h5823j01205O448
4577a80580G4816c530l2158j06650o8168k6766e8622C9375a73267B5890e8305
$$ y = [-120991, -221247, -161824, 33748, 105385, 28711, -10933, 160849, -122986, -4538, -7095, -103520, -28820, 17416, -406196, 100647, -182636, -175444, 89623, -195509, -90158, -64184, 90192, -102273, -12218, 114190, -68407, 21787, -139036, -70916, -19026, -106787, 20935, -170792, -187277, 11024, -89563, -201531, 28447, 248566, -20153, -82842, -98211, 139582, -122906, -189733, -30289, 92920, -241581, 19841, 22271, -190678, -11356, -166020, -4365, 42942, -21830, 32189, -97624, -188641, -228858, 50496, -347728, 8486, 224840, 119874, -77706, -184459, -2623, -106597, -21733, 76344, 163319, 93075, -134962, 48981, -22849, -292858, -85823, -187028, -180580, 74816, -3530, -35688, -142338, -210506, -237272, -58622, 39375, -173267, 25890, -58305]
4565c00389C10861a27166a6211l874n8475A1276a91909d3567l8416A80986i1592
4553A4758b68952d1913J9392B1549O1195b34306A5756J00560c1270k30970P9207
4542a83033o7591A08659d6461A3905g6807D9595B0107R9219K2703a16550J0419
4531a06131A52462d5219B6016J16816d5792A25323H45b04803f4310o5397N5138
4520g4569O854A22890D21J21380h031A06950g1360A03266B8023G524i9351b9782
4507B31803I692a39523r346j13512h0585C5845h0005j15897Q0435I559b10619
4495c7648A2871b78710L6080I1174e1792j78673B19230C9085J98644a77q9951
4484i0128A07785b8249o1586j31130N1505A40777b5471B31060a82400A46471B0213
$$ y = [-300389, 310861, -127166, -16211, -20085, -78560, 11276, -191909, -43567, -81983, 180986, -91592, 14758, -268952, -41913, -22521, 21549, 82744, -234306, 15756, 116316, -31270, -262240, -183033, -250624, 108659, -46461, 13905, -76807, 49595, 20107, 119326, 142029, -116550, -106131, 152462, -45219, 26016, 142832, -45792, 125323, 845, -204803, -64310, -129707, -74569, -67715, 122890, 421, 121801, -8031, 106950, -71360, 103266, 28023, 7524, -99351, -29782, 231803, 9692, -139523, -148869, -262381, -80585, 35845, -80005, -195902, -115467, 9559, -210619, -37648, 12871, -278710, -242630, 91174, -51792, -230465, 219230, 39085, 237729, -177, -90128, 107785, -28249, -89835, -220965, -169460, 140777, -25471, 231060, -182400, 146471, 20213]
4472e6028A7820i3714b1796A90633B4077a35578B9732P3972b18020g4371A22142
4460a83551A15587a03124A70886e1766F0950f7731l5600n4857A66116a24052A54125
4448c1285l33555f4331j17394o5342g1490J4980b8185l2389A09503a13543k9822
4437a43365K7404b6579k39403c7184R785j7377l58533F6577a31173A83834a26671
4425A20677J3989e8382F5716e3582m997j71764P3137B10992g79o888B3178a10577
4412a64276a7427B09814B1069N3083a56853n4479Q3979A31033a18881J7609L342
4401i7930e073j74600E0683h0952I4392b92761F4204O8805b80082J32980O5394
4390h1708D4038a31744B91887n197j31297d2413A03725Q507B6682c4084M142j1162
$$ y = [-56028, 17820, -93714, -21796, 190633, 24077, -135578, 29732, 103704, -218020, -74371, 122142, -183551, 115587, -103124, 170886, -51766, 60950, -67731, -103331, -158188, 166116, -124052, 154125, -31285, -364840, -64331, -181725, -247067, -71490, -56510, -28185, -60574, 109503, -113543, -143365, -115961, -26579, -265982, -37184, -27399, -44776, -403309, 66577, -131173, 183834, -126671, 120677, 134666, -58382, 65716, -53582, -58579, -230343, -157206, 210992, -779, -7667, 23178, -110577, -164276, -17427, 209814, 21069, 74152, -156853, -211332, -127353, 131033, -118881, -101272, -97930, -5073, -179673, 50683, -80952, 94392, -292761, 64204, 133009, -280082, -147102, -81708, 44038, -131744, 291887, 286690, 155393, -42413, 103725, 112232, 26682, -34084, -29942, -41104]
4378d1104k12154F8702a83303i424j38078H8735b885A46767a9963E8591f7771
4366i4726j10759N7291F5912h1548c8795m0409c1545k35248H9084a17376A07998
4354A9602a44898A10281b40526J03848m1863G4214a7072A32172e2868A21421i236
4342i3920c9227Q400k8035M438j1550p218A19133C4739c9944a2407H9168a31854
4329a4096j07447A13230g1559C3656a70136f0348A37568c0685j3768j69450C8552
4317B7867a93558l245c4614J6242H1044J24842C1332N4241J21161q2128g4530
4305C872a30501M7773A10274b88497G9872l2935M4227a03628L0466k90450e6182
4293a48767C4645J7047b00395M9504b7495M43B3813R1738M19290L67248k33140
$$ y = [-41104, -253258, 68702, -183303, -9424, -147502, 88735, -2885, 146767, -19963, 58591, -67771, -94726, -205485, -148194, 65912, -81548, -38795, -79204, -31545, -266793, 89084, -117376, 107998, 19602, -144898, 110281, -240526, -136678, -178541, 74214, -17072, 132172, -52868, 121421, -9236, -93920, -39227, -30827, -58862, -54424, -65974, -73192, 119133, 34739, -39944, -12407, 89168, -131854, -14096, -121543, 113230, -71559, 33656, -170136, -60348, 137568, -30685, -44453, -213903, 38552, 27867, -193558, -196803, -34614, -18372, 81044, 205886, 31332, 85573, 206734, 124606, -74530, 3872, -130501, -82728, 110274, -288497, 79872, 46937, 91164, -103628, -73162, -363612, -56182, -148767, 34645, 51692, -200395, -150891, -27495, -27052, 23813, 115551, 534841, 902089, 668949]
4282F68949j84291M9599k0018A11715J15981m9058E6645b49542A31862J70222
4272C02084G9916b6559m2624A00814L7031J72779L6387K51753M51203k30300k29844
4261E89823k68728j25720p6798c7086A57273a59741N365H0720Q6551P536n8627
4250A16180K470a0809k5344A16599f6991j5422K5354A70176E9011a43837A4771
4238A82645a143H473b91163H0294h1325f400A68220d1049j11742J2770C1927a24958
4225a54063f9410B29847h2634c1287j4652I0640b19191F0158B612J98423o7144
4214A33891A6263i2727A35284A2112a0336A2152L17828h2268B75329b28492A58734
4202A168K68457h1475C9517a00148A49794j3417b73914h708j99974F0596h3887
$$ y = [668949, 484658, 534257, 514239, 111715, 227696, 178638, 56645, -249542, 131862, 302084, 79916, -26559, -69183, 100814, 137845, 310624, 347011, 598764, 1049967, 819667, 589823, 321095, 195375, 118577, -37086, 157273, -159741, -154376, 80720, 167271, 174807, 116180, 118650, -10809, -36153, 116599, -66991, -82413, -57059, 170176, 59011, -143837, 14771, 182645, -1143, 8473, -291163, 80294, -81325, -6400, 168220, -41049, -152791, -140021, 31927, -124958, -154063, -69410, 229847, -82634, -31287, -45939, 90640, -219191, 60158, 2612, 201035, 133891, 16263, -92727, 135284, 12112, -10336, 12152, 329980, -82268, 275329, -228492, 158734, 1168, 269625, -81475, 39517, -100148, 149794, 136377, -273914, -8708, -208682, 60596, -83887]
4190D9091J86157C2028b01508h0171P913B04039a06237B48689H142i7516n6454
4179a53970j16136B47627A03999k1571a61838J2711B1282Q2342e3901q302B77132
4167b2166E4447L7408m0542R1253h7215q7252d3537A9452b73529I6731R5487k4157
4155A68061o0882g7359B51446r4108L9730G9223J13688j8286K24950A79052J98856
4144C77908J39680N09464O42223Q14099j63616r6466r60745j75324j21787k60941
4134G04495q2038J06128L6833k5033k11192o9126L01860J36152J68903p3163N18145
4123A511964M55027R17996N15447k42761n97672k98012j60227J39594m4963O15441
4113B811834K24423M85964N47726N43000Q23683J147459J526155K808086K798341
$$ y = [49091, 235248, 32028, -201508, -80171, -72258, 204039, -106237, 248689, 8142, -97516, -153970, -270106, 247627, 103999, 82428, -161838, -149127, 21282, 103624, -53901, -62203, 277132, -22166, 54447, 91855, 51313, 142566, -87215, -174467, -43537, 19452, -273529, 96731, 192218, 168061, 107179, -77359, 251446, 157338, 197068, 79223, 192911, 174625, 399575, 179052, 377908, 517588, 1027052, 1669275, 2483374, 2319758, 2223292, 1262547, 1087223, 965436, 704495, 622457, 728585, 765418, 740385, 529193, 460067, 761927, 898079, 1066982, 993819, 1511964, 1966991, 2884987, 3400434, 3157673, 2560001, 2261989, 2101762, 2241356, 2196393, 2811834, 3036257, 3522221, 4069947, 4612947, 5436630, 6584089, 8110244, 10918330, 13716671]
4104A3716671M168635N831874J0430322K3473911M2896892N4099116L1625996
4097A86243417j8170162o0554779m5789122k1517615r862476m813818l607751
4090B1927694l020669j981621q96918J68278K149783K856958M199340P751127
4082C3153972J6833719L4742276N0924739M3546904n60465n0839817n5559361
4075G2241967k9257196j3097107o455756l166137j778538j927264k023985k739268
4067A1796716k578619k117106j500308j168871k60534q53976l32753n9647n79085
4058B345817R7228j13996l36128J54049J44179M07935M79614J131820J186916
4049E497434L18829n63610j508546j345974p04942K5362m51973j42717k6283j65747
$$ y = [13716671, 17885306, 23717180, 34147502, 57621413, 100518305, 154617421, 186243417, 168073255, 107518476, 61729354, 40211739, 30349263, 25535445, 21927694, 18907025, 16925404, 16028486, 16196764, 18346547, 21203505, 25402845, 33153972, 49987691, 84729967, 135654706, 179201610, 178641145, 127801328, 72241967, 42984771, 29887664, 23431908, 20265771, 18487233, 16559969, 14535984, 11796716, 9218097, 7100991, 5600683, 4431812, 4171278, 3317302, 2984549, 2924902, 2345817, 2443045, 2329049, 1992921, 2146970, 2291149, 2699084, 3178698, 4310518, 5497434, 5816263, 5252653, 3744107, 2398133, 1693191, 1718553, 1266580, 1123863, 1097580, 931833]
4039I31833M6465j57556M8167j13991k78795O627j12589L35049j30646A75834
4028F20760k91893J35439q6389K34914m8125j74299j38564o7338O5119k8630J13410
4017C34404K1682A77959J11859J20062K38182C1083K57255j17039J74599A48662
4006A86678B2612K82172j51475N4392N4679d109j25726E84072e4695B35306K9288
3995B64594e5387A57414J51746B8212J81929K14528G4602l3660e832j54884B35191
3983B52087d451A02573K00144L3309A05500i2732D36828a01349C30866I3464e1283
3971C19148l8561A35472M8683J18344e2292C32166j16139k9346e9566b58o7335
3960f7593D07536c2370A21745j0635L7784C9640K89247F4927P2908P6587h4006
$$ y = [931833, 978298, 820742, 868909, 754918, 476123, 482750, 370161, 705210, 574564, 175834, 620760, 328867, 464306, 377917, 612831, 564706, 390407, 251843, 184505, 249624, 220994, 334404, 356086, 177959, 289818, 409880, 648062, 31083, 288338, 171299, 345898, 148662, 186678, 22612, 304784, 153309, 207701, 262380, -4109, -129835, 584072, -54695, 235306, 264594, -55387, 157414, 309160, 28212, 210141, 424669, 74602, 40942, -5832, -160716, 235191, 252087, -4451, 102573, 302717, 336026, 105500, -92732, 436828, -101349, 330866, 93464, -51283, 319148, 280587, 135472, 184155, 302499, -52292, 332166, 216027, 186681, -59566, -258, -67593, 407536, -32370, 121745, 111110, 148894, 39640, 328887, 64927, 137835, 214422, -84006]
3948I0358L01180A51149n1841J25076J72524D322M0567K90703H3657Q8843m6694
3937A25806l9743a9484j521f621n5914D6802M3318R2764O6879C5059O4831O7161
3925A67051A4757P1652K8182j3458a91421F4452J19913o9987P3221A9873N534
3914B5407R6089J56081r6372R0079K35824L00746Q9425L6174m38740P731I0727
3902C50178j38103D4417j2910O2615K59322H2313K29996j40405J76767n8530r1551
3891A98590N64025M122J57430J54183l92121C01026L8650k3226A50988L6376q0865
3880A06499b7137A32923a3183j11091L810B78294J7989d161f22A45163m6307N1603
3868A50459m6335j8223a05202B9134Q9359B3108J31969E9732R9309p1151A9979
$$ y = [90358, 391538, 151149, 99308, 224384, 396908, 4322, 44889, 335592, 83657, 172500, 125806, 86063, -19484, -21005, -6621, -62535, 46802, 90120, 182884, 249763, 35059, 99890, 167051, 14757, 86409, 114591, 101133, -191421, 64452, 184365, 114378, 187599, 19873, 25407, 121496, 277577, 181205, 271284, 507108, 807854, 897279, 933453, 494713, 502444, 90727, 350178, 212075, 44417, 31507, 94122, 353444, 82313, 312309, 171904, 348671, 290141, 198590, 762615, 766737, 924167, 1078350, 686229, 301026, 339676, 316450, 150988, 187364, 106499, -27137, 132923, -13183, -124274, -120464, 278294, 296283, -4161, -622, 145163, 98856, 150459, 104124, 85901, -105202, 29134, 118493, 23108, 155077, 59732, 159041, 87890, 19979]
3856G4768J43687F4501b11037a2003A40157D0546a36490f1586A0732d2263B8128
3844B17927H9564c1476A29027D5466a76447K102A29084b34645b3337j70028G771
3832G9383C048f9828G9564h4541F7382e681m4327o576K6469C7326c9774A56552
3819b56219i326n3336K931j612A47496a3463B7385b86345A38065L6623a28228
3807a72034o7745b9692e445j40923J9845A9700J78161B5103p67a10446A28507
3795H0865B9288a33970p2742B41626a49580B49100g3749B9355L5179J46503D6567
3783C1525O2301B7116g4766F9501J30615a24997j515d2503k06837k2494h5190
3771a75012A98987b0355A54635P5769A0898g9100r2720I4180J58452A3666a55012
$$ y = [74768, 218455, 64501, -211037, -12003, 140157, 40546, -136490, -61586, 10732, -42263, 28128, 217927, 89564, -31476, 129027, 45466, -176447, -174345, 129084, -234645, -23337, -193365, 7771, 79383, 3048, -69828, 79564, -84541, 67382, -5681, -50008, -56584, -30115, 37326, -39774, 156552, -256219, -9326, -62662, -59731, -61343, 147496, -13463, 27385, -286345, 138065, 174688, -128228, -172034, -239779, -29692, -5445, -146368, -126523, 19700, 197861, 25103, 24336, -110446, 128507, 80865, 29288, -133970, -206712, 241626, -149580, 249100, -73749, 29355, 64534, 211037, 46567, 31525, 93826, 27116, -74766, 69501, 200116, -124997, -126512, -42503, -249340, -271834, -85190, -175012, 198987, -20355, 154635, 230404, 10898, -79100, -171820, 94180, 252632, 13666, -155012]
3759C00061e3936a4537n924B45253E8001a38211A19549J99145a80595A314b6375
3747F4840N995a22527D2048M347a23844A33947c7706a5934F6150a66849e8793
3735A77281a46340O253c3101A86393F967c7321D04058a9454j62116L3182O8573
3724g9815H5513a21659E7293c785o9005j66372d2221C0030i5644A94957a72708
3712H2484g9741A13927d3392a8381d993C5745c1712q9383J391n4070B2097a20503
3699A4844g7645o022p9972C3941P6996d3083a2899k8947n3673A84896D0373b5163
3686G5661g0585A10374c3977G5056G796b45593A67980e6270A04537I364C347J78682
3674A82029C7655b06282P9101A18149i9112b4854G8984a59167j8418k4486K3811
$$ y = [300061, -53936, -14537, -20461, 245253, 58001, -138211, 119549, 318694, -180595, 1314, -26375, 64840, 70835, -122527, 42048, 46395, -123844, 133947, -37706, -15934, 66150, -166849, -58793, 177281, -146340, -140087, -33101, 186393, 6967, -37321, 404058, -19454, -181570, -148388, -79815, 85513, -121659, 57293, -3785, -72790, -239162, -42221, 30030, -95644, 194957, -172708, 82484, -79741, 113927, -43392, -18381, -4993, 35745, -31712, -121095, -119704, -173774, 22097, -120503, 14844, -77645, -83667, -163639, 33941, 110937, -43083, -12899, -41846, -95519, 184896, 40373, -25163, 75661, -70585, 110374, -33977, 75056, 7796, -245593, 167980, -56270, 104537, 9364, 3347, 182029, 37655, -206282, -127181, 118149, -99112, -24854, 78984, -159167, -177585, -202071, -178260]
3663a78260c1754F104B775a08138A21784j996n7260M2504Q3687c7182E8542P682
3651F6224k0396c9533M9C7385J3260L1086A3481b02881D5284J0182a56127H1527
3638a48222A34636E1062K25078b21226A25659a09803M6194A93110a10040r9554
3628b09594B15317A9349J23738G258b35153A00793B5073J51574L4136p9105j9565
3617A12113k1808C7195a06640F2486M734h8571J8942n3189C7913E143a32428F162
3604d7587j99579J05190B3382b58633A26471a87884A2650i5365b608C0341J8440
3593D8781k2091C997g0083L3325A12797C1195i9031k9479L4457M0436B0457N7125
3581G7582P2468a71454d8232G4339b8217p5013I6795d10H3394J24254b07475f6919
$$ y = [-178260, -31754, 6104, 2775, -108138, 121784, 119788, 62528, 105032, 188719, -37182, 58542, 66224, 45828, -39533, -39484, 37385, 50645, 81731, 13481, -202881, 45284, 55466, -156127, 81527, -148222, 134636, 51062, 276140, -221226, 125659, -109803, -63609, 193110, -110040, -209594, 215317, 19349, 143087, 7258, -235153, 100793, 25073, 176647, 210783, 131678, 112113, 90305, 37195, -106640, 62486, 67220, -88571, -69629, -122818, 37913, 5143, -132428, 6162, -47587, -247166, -141976, 23382, -258633, 126471, -187884, 12650, -95365, -2608, 30341, 48781, 26690, 3997, -70083, -36758, 112797, 31195, -99031, -128510, -94053, -53617, 20457, 77582, 150050, -171454, -48232, 74339, -28217, -103230, 96795, -410, 83394, 207648, -207475, -66919]
3568A5357j249E801a33482A33072n0872a08516A56079G1458J0097C9086j8360
3557B0726k968a1847j21161A00179A7309O5965f185A20225B6059a75277A39603
3545G8407C6073f3734o559H4683l669C8910g1887C7821b57227A48115a76559c8794
3532b12327f494a581m6895H7590B2379a74614J2908e5427n9253b7275C5878L7563
3520G3441b66782p867A19950C7824Q06a14271G9224J16548a46541c2111m1976
3509g4087H1202a371j04576A96521i9900H9529L0925i9034D9264J76974B1748
3497D2668J06908P3413a3166j73431A24512A3451J49884c19027A1578K99949a59815
3485B59308a26711A58229e5700b4580I2310a38193e6645H8434N1623F1367a98996
$$ y = [15357, 14108, 5801, -133482, 133072, 82200, -108516, 156079, 71458, 81555, 39086, 20726, 17758, -11847, -133008, 100179, 17309, 83274, -6185, 120225, 26059, -175277, 139603, 78407, 36073, -63734, -70293, 84683, 81014, 38910, -71887, 37821, -257227, 148115, -176559, -38794, -212327, -6494, -1581, -48476, 87590, 22379, -174614, -161706, -55427, -114680, -27275, 35878, 73441, -266782, -274649, 119950, 37824, 38630, -114271, 79224, 195772, -146541, -32111, -74087, 81202, -1371, -105947, 196521, -99900, 89529, 120454, -99034, 49264, 226238, 21748, 42668, 149576, 222989, -13166, -186597, 124512, 13451, 163335, -319027, 11578, 311527, -159815, 259308, -126711, 158229, -55700, -24580, 92310, -138193, -56645, 88434, 140057, 61367, -198996]
3473c523H5791e6220E3769b88332A53442O6854f8092A88036P0116a41196j6160
3462a57356A0537N2786h1686j28592i5459N078G5935a47652O9391b7464k8899
3451e6363j48850Q2746A19028a77396P8844A14893b1929o2055a1370E4007a67910
3439d8541l9226F2441K1302b36768d6224m2596k3061l4994A50441a8730A80046
3427D2989b5978E3246a41377k77831c9429p2713c3763C0616a93049C765a08958
3415g0221B3360i7564c2306E807J60503H462h5580f086l91596A83026C7079a17375
3402a24109j09582a1920B44075b4645H303f551k08616B89093G906K5152b75331
3390g2436Q589B0754P9720B5768J28928o1292D1861g1528k8341J883q3767F5284
$$ y = [-3523, 85791, -56220, 53769, -288332, 153442, 220296, -68092, 188036, 258152, -141196, -157356, 10537, 63323, -81686, -210278, -95459, -90381, 75935, -147652, -78261, -27464, -56363, -205213, -122467, 119028, -177396, -98552, 114893, -21929, -83984, -11370, 54007, -167910, -48541, -87767, 62441, 83743, -236768, -46224, -88820, -111881, -146875, 150441, -18730, 180046, 42989, -25978, 53246, -141377, -419208, -39429, -112142, -33763, 30616, -193049, 3765, -108958, -70221, 23360, -97564, -32306, 5807, 166310, 8462, -85580, -6086, -397682, 183026, 37079, -117375, -124109, -233691, -11920, 244075, -24645, 8303, -6551, -215167, 289093, 7906, 33058, -275331, -72436, -63847, 20754, 100474, 25768, 154696, 93404, 41861, -71528, -99869, -97986, -181753, 65284]
3377f8310J7113C10370A15639a32209o7896d7929j0614A83693b12331E810b23656
3365a52102C81808a77384B7349a74151K6673b9418p2924l0207p701A65121D6071
3353B6095a52742E1232N5936M03A6610J07984H157a75636H5139N2456a36248H6916
3340H3135d8338B65141c9601j05475L4517A13053h5480d1445k32448B0889e7891
3328a00281K532I9332a37998J6436L6238m7898G4174A0268R7368R7310J12209
3317C17155a29328a4252A43295c10325A26504i0j6931E6083k1556M6864i4415
3305e4491l8350o7014J0904a3762G1979b53724h490B78186D3295J74304a79703
3293F3556A5799i583j63569B1400a62891k271E6449b52350f1344a5714D556h0289
$$ y = [-68310, -51197, 310370, 115639, -132209, -200105, -47929, -58543, 183693, -212331, 5810, -223656, -152102, 381808, -177384, 27349, -174151, -147478, -29418, -102342, -132549, -140250, 165121, 46071, 26095, -152742, 51232, 107168, 107571, 16610, 124594, 8157, -175636, 85139, 137595, -136248, 86916, 83135, -48338, 265141, -39601, -145076, -110559, 113053, -85480, -41445, -273893, 20889, -57891, -100281, -97749, 99332, -137998, -121562, -85324, -133222, 74174, 10268, 107636, 204946, 317155, -129328, -14252, 143295, -310325, 126504, -90, -17021, 56083, 34527, 81391, -94415, -54491, -92841, -159855, -148951, -13762, 71979, -253724, -8490, 278186, 43295, 217599, -179703, 63556, 15799, -9583, -173152, 21400, -162891, -165162, 56449, -252350, -61344, -15714, 4556, -80289]
3280a44333q9219g7472b6863n2721j02852P3041a4863B3220K36318c4445o0127
3269i4572B5704i881G9458J9229C8270M7346e4607B00489G7140f2428A66586f7355
3256b33040g7079B33406b08622c2189j68191A50051e9365c216j02991A52092D3886
3244g9059a0222o0482m7504A11005g7733D710K16539A2056c8222k5036q654O433
3232f5479A5066P9668n961L707k7443c418j76772N2231H9667a62046B65213b08302
3219g9840a7415l37444d3443A1816a02587h198k11989J3933A71556b18953h6322
3207b6790m2993r0668L8365B9581J12665H417e0918K200k8019k4523J4004I3166
3194b3072n5637K2972J7098k14390Q4659a8336E5446J5644a488I1155b68r4931
$$ y = [-144333, -233552, -77472, -26863, -79584, -182436, -109395, -14863, 23220, 259538, -34445, -94572, 25704, -9881, 79458, 98687, 38270, 85616, -54607, 200489, 77140, -62428, 166586, -67355, -233040, -77079, 233406, -208622, -32189, -200380, 150051, -59365, -3216, -106207, 152092, 43886, -79059, -10222, -70704, -118208, 111005, -77733, 4710, 221249, 12056, -38222, -63258, -71912, -65479, 15066, 94734, 88773, 92480, 65037, -3418, -180190, -127959, 89667, -162046, 265213, -208302, -79840, -17415, -354859, -43443, 11816, -102587, -8198, -220187, -206254, 171556, -218953, -86322, -26790, -69783, -160451, -122086, 29581, 142246, 8417, -50918, -48718, -76737, -101260, -87256, 93166, -23072, -78709, -55737, -38639, -253029, -168370, -18336, 55446, 71090, -1488, 91155, -268, -95199]
3182i5199j1427j85414B29528c054j21497k679A44528f7513B19120b30383b8480
3170d6835A63004b1675A45445E1382M7891a17252b1363j28858f8733g729B1254
3158a37762B16783a53115j42171D1692K2668p507b8096A67275o1798J01926g4942
3146a79940C1096J35717q59L3880a46682c9534A08426a05005k32267f9790C39419
3134A36953a54315b8788l032k38473d3827m5514m5173M1999b1992l54150a67238
3122h2014A97288a8390j42584F8964J57353J6170f6622A40061J01257h7167n5885
3111a43052A85592a54035j3874j719d9920m4942A81318b03276C6229K6486g67
3099B4505J65571a44169A50507h3173K3378b8937a161G4993g683k1569B35661
$$ y = [-95199, -106626, -292040, 229528, -3054, -124551, -127230, 144528, -67513, 219120, -230383, -28480, -46835, 163004, -21675, 145445, 51382, 99273, -117252, -21363, -150221, -68733, -7729, 21254, -137762, 216783, -153115, -295286, 41692, 64360, 56853, -28096, 167275, 105477, 207403, -74942, -179940, 31096, 166813, 165954, 199834, -146682, -39534, 108426, -105005, -337272, -69790, 339419, 136953, -154315, -28788, -31820, -270293, -43827, -89341, -134514, -92515, -21992, -376142, -167238, -82014, 197288, -18390, -160974, 68964, 226317, 242487, -66622, 140061, 241318, -87167, -143052, 185592, -154035, -167909, -169628, -49920, -94862, 181318, -203276, 36229, 62715, -767, 24505, 190076, -144169, 150507, -83173, -59795, -28937, -1161, 74993, -7683, -29252, 235661]
3087a55060d7792k8713j07195A32842Q543m5568c568l26543D6617a20187o792
3076a26979A19281i8187o630G7199r118A5430K5850a77712A10748a37693H51M9347
3064E0198R3618f0047n3569A22149h9116A68464a72066h2104J7036B10407h6343
3052F4229e5108I0744a21497M9299K3438j96588G8148A8954J32387a219A22411
3040h1789j02796D3866b99859f8479I4831b9072B0222c32094A77963B9815J45880
3029A75695f1348k2135j9642c1791j07572O8644A55752a45523d526j8300B7775
3017A91494R0714D5621b5636A59687F5066q717a01648L430J6152A96835A9391
3005a79188d673j77216r5398A25374b44369A93484c4725r7990r142F0370a9520
$$ y = [-155060, -47792, -76505, -183700, 132842, 141385, 95817, -3568, -330111, 46617, -120187, -126979, 119281, -98187, -104817, 77199, 68081, 15430, 41280, -177712, 110748, -137693, 851, 50198, 143816, -60047, -113616, 122149, -89116, 168464, -172066, -82104, -65068, 210407, -86343, 64229, -55108, 90744, -121497, -72198, -48760, -245348, 78148, 18954, 151341, -1219, 122411, -81789, -184585, 43866, -299859, -68479, 94831, -29072, 20222, -332094, 177963, 29815, 175695, -61348, -83483, -103125, -31791, -139363, -70719, 155752, -145523, -4526, -22826, 27775, 191494, 282208, 45621, -25636, 159687, 65066, 56349, -101648, -98218, -82066, 196835, 19391, -179188, -4673, -181889, -277287, 125374, -244369, 193484, -34725, -132715, -141857, 60370, -19520]
2993a26697j21923a6046l0111r4194d6819D8729a50579a6999j21011K1518C441
2981b5007E4019a76705C9798K8762k5622c5799J7371I4100d3619m9796A1151a08057
2968g9721b9036k05689D9484J6592c27409O0069a18784N5249j21390n818c0866
2956H1656C1953i8996o9864O5557E7459C361J82390b4869P492l51285d9295F8725
2943D127a18624n5894A60503l5848a10723d873A11305m2441L8011C8615a76864
2931c1067F8779a64745D4373c4061A03766f9993A31708L9974a77887A39159a83670
2919A5599a92020D3049C991J00737g2301o1337B44461A00934a63560j20164a18908
2907a29146D7069a69956j0645a377F5571b17885A82009N0731a7875A5990a75266
$$ y = [-126697, -248620, -16046, -46157, -140351, -46819, 48729, -150579, -16999, -138010, -116492, 3441, -25007, 54019, -176705, 39798, 68560, 42938, -35799, -18428, 94100, -43619, -93415, 11151, -108057, -79721, -29036, -234725, 49484, 66076, -327409, -267340, -118784, -63535, -184925, -190743, -30866, 81656, 31953, -98996, -168860, -103303, 57459, 3361, 185751, -24869, -17377, -368662, -49295, 68725, 4127, -118624, -174518, 160503, 124655, -110723, -4873, 111305, 68864, 106875, 38615, -176864, -31067, 68779, -164745, 44373, -34061, 103766, -69993, 131708, 171682, -177887, 139159, -183670, 15599, -192020, 43049, 3991, 104728, -72301, -133638, 244461, 100934, -163560, -283724, -118908, -129146, 47069, -169956, -180601, -1377, 65571, -217885, 182009, 232740, -17875, 15990, -175266]
2895G3461J13383C6456a98557A68a7924B3878J61370J41313D3847a3278n6427
2884f9705f89j6986A81942c8910n2155A50668c5774A29642D0796J98434n7509
2873A81721g6698F5323h674D3185A580a19085I2750J45036b4219j89402A49636
2861a19194l0082b8893l9605o1828A99980a37379k7409B2064R0521b07425C06055
2849G6091J41490a727k13024c015C8274c4715G1948c7046E8201a20495o4787f4016
2836c9376A1626K9862M1737c1132l8001A14716h7067H5299L542C7168a76828G2058
2823a1885A18369B5810M9450b11034a4957j65699K4200b0844j10927A82193b583
2811B17207F0082A2347a0469A14361C1013a91626j453c7257o9464A36462a57586
$$ y = [73461, 186844, 36456, -198557, 168, -17924, 23878, 185248, 326561, 43847, -13278, -69705, -689, -17675, 181942, -38910, -91065, 150668, -35774, 129642, 40796, 239230, 181721, -76698, 65323, -8674, 43185, 1580, -119085, 92750, 237786, -24219, -213621, 149636, -119194, -149276, -28893, -68498, -130326, 199980, -137379, -164788, 22064, 112585, -207425, 306055, 76091, 217581, -1727, -214751, -3015, 38274, -34715, 71948, -37046, 58201, -120495, -185282, -64016, -39376, 11626, 41488, 83225, -31132, -69133, 114716, -87067, 85299, 88841, 37168, -176828, 72058, -11885, 118369, 25810, 75260, -211034, -14957, -180656, -156456, -20844, -131771, 182193, -2583, 217207, 60082, 12347, -10469, 114361, 31013, -191626, -193079, -37257, -106721, 136462, -157586]
2799c34035Q2317F7515m67a25496e6701c384A46509J42599G5148g363l0854E1291
2786g5874o717A35506J1753B527O4497h1481a2440B79979a20979a5090C9397c7875
2773B4240m220a96407f5735B33457g0048J8441J6452F5862J6071h3482E833b2733
2760C0087b2598C8351A0299J11494D5959b091A21454a89642k5207F723B719a18359
2747B14760a17778J9229A07547B1481J62254H1706f2291l4371L2969k8283I4020
2735A53J30889D4399K3724a39537d7919A63103a06557a381j85065h1609j34229
2724b15838N4593E4773a10867e2435A59824D0941L0069c9067B5775a27959a4670
2712A28407E6252G041c2413A02670k8009a27335h431D9185e3917k71296A96168
$$ y = [-334035, -251718, 67515, 67048, -125496, -56701, -3384, 146509, 289108, 75148, -7363, -38217, 51291, -75874, -82591, 135506, 147259, 2527, 67024, -81481, -12440, 279979, -120979, -15090, 39397, -37875, 24240, 20020, -196407, -65735, 233457, -70048, -51607, -35155, 65862, 81933, -83482, 5833, -22733, 30087, -22598, 38351, 10299, 121793, 45959, -2091, 121454, -189642, -214849, 6723, 2719, -118359, 214760, -117778, -98549, 107547, 21481, 183735, 81706, -62291, -96662, -63693, -91976, 94020, 153, 131042, 44399, 68123, -139537, -47919, 163103, -106557, -1381, -186446, -81609, -215838, -161245, 54773, -110867, -52435, 159824, 40941, 71010, -39067, 25775, -127959, -14670, 128407, 56252, 7041, -32413, 102670, 74661, -127335, -8431, 49185, -53917, -325213, 196168]
2700a2419F8090a03328E0169a53195a9874k92056c3124q1605D1653q233b6525
2688F7900K5029l345A0727b9635k44226A42369o4386Q0164b4839k03470d9083
2676b450I7741c26203J42144K2220B7130b41333E4250J8360M9835a9224j14497
2665a33721C6461A0439M9799J90094b14993I7430a74209e2035G4400l4644a27193
2653H5743J5277C3822a9980m3815A10255c30333D32518i124B6863m009a18355
2641F1516b42800B630d72525g6818m178r1954c8256p247F5761a31508J7813m9195
2629a62890A64847b107A68858D731L2580K27833I336e6223j13666G5689a08658
2617g8406r7586B17617A04275N6705a61926P9722H4732h3998l2458J8543j33643
$$ y = [-12419, 68090, -103328, 50169, -153195, -19874, -311930, -33124, -114729, 41653, 33420, -26525, 67900, 92929, 89584, 10727, -29635, -273861, 142369, 77983, 158147, -24839, -228309, -49083, -2450, 97741, -326203, -184059, -161839, 27130, -241333, 54250, 72610, 122445, -19224, -133721, 36461, 10439, 60238, 250332, -214993, 97430, -174209, -52035, 74400, 39756, -127193, 85743, 101020, 33822, -19980, -63795, 110255, -330333, 432518, -9124, 26863, 22854, -118355, 61516, -242800, 2630, -472525, -76818, -80996, -172950, -38256, -45503, 65761, -131508, -113695, -162890, 164847, -2107, 168858, 4731, 37311, 265144, 9336, -56223, -169889, 75689, -108658, -78406, -175992, 217617, 104275, 160980, -161926, -82204, 84732, -83998, -116456, -97913, -231556]
2606b31556c8077B9438N2174D832b50506J04044B8407K7842A2646a57977b2567
2594B122R638J89017a53580C6016e0518A36431O5048B7846a47855f5784A60916
2582E3159b7073m9919L6213A75957c42034A47152n4534b24114D70503i7742J7599
2571h0143j12364C0877a99464i1473b8115k05754c3828C9823g2976A43884L0055
2560A73939a93540a5420j14653l9450a3189b987j23835d139r6183G5459N3111
2549A28570m2241b9869D0317B828K6042d4134m6992A2084Q3507M1399a69880g8041
2536F1074b039l1187C3325n174J46278H2427b8752n4108a3331j03111C02203D0052
2523f0987n3049J4316p89I2614m5956a13102A8250M0659L5753c1404r6872l7463
$$ y = [-231556, -38077, 29438, 81612, 4832, -250506, -146462, 28407, 56249, 12646, -157977, -22567, 2122, 11760, 200777, -153580, 36016, -50518, 136431, 201479, 27846, -147855, -65784, 160916, 53159, -27073, -76992, -40779, 175957, -342034, 147152, 92618, -224114, 470503, -97742, -80143, -192507, 30877, -199464, -91473, -28115, -233869, -33828, 39823, -72976, 143884, 173939, -193540, -15420, -130073, -169523, -13189, -2987, -126822, -4139, -100322, 75459, 128570, 86329, -29869, 40317, 2828, 28870, -44134, -91126, 12084, 95591, 136990, -169880, -78041, 61074, -2039, -33226, 33325, 28151, 174429, 82427, -28752, -82860, -13331, -116442, 302203, 40052, -60987, -114036, -99720, -100509, 92614, 46658, -113102, 18250, 58909, 94662, -31404, -128276, -165739]
2511a65739A88464k0534a29918G342e3234G4405b00723A39111k2597b15572n5426
2500b70998p019Q4349e2842j06037A09429J69668b04385A48641a80085b9352k76055
2489c05407a44201A07140H696e4131A52584b15832E9641B9612a0240j61438a1336
2477c19587i5412M1223O172j91428K8474f5857r9985n8957A61323B5357J12076
2466A37433a15805h621A26332f5146p1833e5021m1055F752c9681A5354L111a10463
2453C0705J17972k2248h4724A23686f7644A07327C3161K35725I518a64184A02439
2441i4310j8210j34725i1931G7020C4054j2435b21287Q7598D6486h729B75454
2429F2652o780b5995A66537g3312A13816f9220j5381L2430n3405B16475b79633
$$ y = [-165739, 188464, 167930, -129918, 7342, -53234, 74405, -200723, 139111, 116514, -215572, -270998, -278017, -193668, -52842, -158879, 109429, 279097, -204385, 148641, -180085, -29352, -305407, -144201, 107140, 8696, -54131, 152584, -215832, 59641, 29612, -10240, -171678, -11336, -319587, -95412, -54189, -48017, -239445, -210971, -65857, -165842, -224799, 161323, 25357, 137433, -115805, -8621, 126332, -65146, -136979, -55021, -96076, 6752, -39681, 15354, 18465, -110463, 30705, 148677, 126429, -84724, 123686, -67644, 107327, 33161, 268886, 9518, -164184, 102439, -94310, -112520, -247245, -91931, 77020, 34054, 21619, -221287, -133689, 46486, -8729, 275454, 62652, 55872, -25995, 166537, -73312, 113816, -69220, -84601, -52171, -105576, 216475, -279633]
2417a9486A47216i8424k4895N7004H4398i974n9465F4432c9778E9980D38a04312
2404D7601r195g3820n4562B00775a42935A0956b52175O9366B245d2651B08046
2392f0376j68444E2592a06766H4457a93242d2857G3765K2867a87351g262k2082
2381b9344l2108j25206F4651a06706j41045J12197N0124L2674o2659o6151C1098
2369B6103a44719A11427P079a2165A05796l6990a39867L050B5607a26826A87738
2357A9225O1158M562K6302b26554E1004a2867j39469j8139b4608m1340k2947C764
2344D1839h7059B3912P2071D4658L8959a15818b5374p9224j7990K9236o6727a5758
2331a06448k6230E4182N3243j1259J43539A01135j2457c6782H4292B2077O3118
$$ y = [-19486, 147216, -98424, -123319, -66315, 84398, -9974, -69439, 64432, -39778, 59980, 438, -104312, 47601, 38406, -73820, -128382, 200775, -142935, 10956, -252175, -182809, 2245, -42651, 208046, -60376, -228820, 52592, -106766, 84457, -193242, -42857, 73765, 96632, -187351, -7262, -29344, -61452, -186658, 64651, -106706, -247751, -135554, -85430, -52756, -115415, -181566, 31098, 26103, -144719, 111427, 118506, -12165, 105796, 68806, -139867, -136817, 25607, -126826, 187738, 19225, 80383, 84945, 111247, -226554, 51004, -12867, -152336, -170475, -24608, -65948, -88895, 3764, 41839, -87059, 23912, 95983, 44658, 83617, -115818, -25374, -104598, -122588, -93352, -160079, -15758, -106448, -132678, 54182, 107425, 96166, 239705, 101135, 88678, -36782, 84292, 22077, 85195]
2320H5195l2953b36654J8798A8519a88263B89386h5933A13573h8777C4979f1798
2308b12145B52740i6912j30337D9692a43074f3468n9105j8607H524b3822F800
2296A68234b62380A51576a5642j9348B20687i1387G3011A024b56900d351n3338
2285e7689F4515J75995P801o2340g9052I7596i013I1721C7151a5402I7189a9061
2272i392H6855J42434f9975B1384a85525B1613c7202j52364f8759b4515j68743
2261a93258M5527f7846k8899F8233c3541B7772b29959e0793A02008a87023A73003
2249a23003d1612A04287j8061a27180M9542F9066f61D6165K96757a664j26532
2238a28196A0028K07267F1249d363o7327A36991F6714f7373k0051c4393j12480
$$ y = [85195, 52242, -236654, -217856, 18519, -188263, 289386, -85933, 113573, -88777, 34979, -61798, -212145, 252740, -96912, -227249, 49692, -143074, -63468, -122573, -141180, 8524, -23822, 6800, 168234, -262380, 151576, -15642, -34990, 220687, -91387, 73011, 1024, -256900, -4351, -57689, 64515, 240510, 248311, 185971, -79052, 97596, -9013, 91721, 37151, -15402, 97189, -19061, -9392, 86855, 229289, -69975, 21384, -185525, 21613, -37202, -189566, -68759, -24515, -193258, -147731, -67846, -96745, 68233, -33541, 27772, -229959, -50793, 102008, -187023, 173003, -123003, -41612, 104287, 86226, -127180, -77638, 69066, -661, 46165, 342922, -1664, -128196, 10028, 217295, 61249, -4363, -71690, 136991, 66714, -67373, -87424, -34393, -146873]
2227a46873B3888i3478K2378j39138B99776e6068F9343A3564L6651q090g0115
2215b0484A63021a55973C7078a86327A32132R3786d1477A37494d57524e0323B05169
2203a66729b6825A8485N6720a84333B40827d1114j55743c7930j37802F1365a1381
2191d5554I0606a02964G0848p016j0196Q4970A8003e0994j98331c1891C7346a06062
2178b8484C95710F9562B6958i5787b9013j60439F1062c6686j22210A06228a5245
2166D2434M4743b28955h7683B4256O4686i3883k0069A5733O5321c3152m1407j22482
2154a97041G9647A6990a05829L5358K1696n3778D2551d7986G2739i580B5172L1518
2142E6690k2478K0486e7903C5893d985m3034B26259g8283E8909b91854J38914
$$ y = [-146873, 23888, -93478, -71100, -210238, 299776, -56068, 69343, 13564, 50215, 42125, -70115, -20484, 163021, -155973, 37078, -186327, 132132, 225918, -41477, 137494, -457524, -50323, 205169, -166729, -26825, 18485, 75205, -184333, 240827, -41114, -196857, -37930, -175732, 61365, -11381, -45554, 90606, -102964, 70848, 63832, 53636, 138606, 18003, -50994, -249325, -31891, 37346, -106062, -28484, 395710, 69562, 26958, -95787, -29013, -189452, 61062, -36686, -158896, 106228, -15245, 42434, 87177, -228955, -87683, 24256, 88942, -93883, -113952, 15733, 81054, -33152, -74559, -197041, 79647, 16990, -105829, -70471, -48775, -102553, 42551, -47986, 72739, -9580, 25172, 56690, 34212, 54698, -57903, 35893, -4985, -48019, 226259, -78283, 58909, -291854, -152940]
2131a52940g2194b4321o8871E1641a20721d7008B9813i7942A1211P8053j2354
2120G6910a53319E415R6045c62760D5128N3588m4236J74190D5910K2100a25233
2108A38678R9840a15530A5053K15691d0944j05929B45354i8926A44081F0175f2860
2096g6709c0350l1068H8930a04410I6387J9975a20950F8536b14659E2987i1442
2084a82523O7711M8380l416A22599L3003a91070f0105A00375m4806a47344e5028
2072a20461A82461b01049D1473O9311B8423J1010b9513E7106j6161a9834j00310
2061a20144E7648i8687c409E4180K6376P2700A5568a61913P4817c1510A29462
2049b0118m2059A21655D7243A9391i0971H8752i9940A2331b7639p6972B7041a00863
$$ y = [-152940, -72194, -24321, -93192, 51641, -120721, -47008, 29813, -97942, 11211, 89264, 76910, -153319, 5415, 101460, -362760, 45128, 98716, 54480, 228670, 45910, 68010, -125233, 138678, 238518, -115530, 15053, 230744, -40944, -146873, 245354, -98926, 144081, 60175, -62860, -76709, -30350, -61418, 88930, -104410, 96387, 116362, -120950, 68536, -214659, 52987, -91442, -182523, -114812, -66432, -69848, 122599, 155602, -191070, -60105, 100375, 55569, -147344, -55028, -120461, 182461, -201049, 41473, 110784, 28423, 39433, -29513, 57106, 40945, -19834, -120144, 57648, -98687, -3409, 54180, 80556, 153256, 15568, -161913, -87096, -31510, 129462, -20118, -62177, 121655, 47243, 19391, -90971, 88752, -99940, 12331, -27639, -104611, 27041, -100863]
2036I3237B6121Q6578f9050J3584A30007J064a37353A39303h6801p4406j46132
2025c07339i8859C1320A1804O4327b10317B11135e8618j20352H129O0632h6744
2013I3929a59483B605a47190a962j1321k4021A73414E2351a007n230j76767n6279
2001b39283d7581B74221F1153B9996r05e1512j19584A00616a95874e6524C292
1989C05012p1562A7123J2526b27223n8047A6638N9877d7265C9750j5404N1842
1978G6188a03210A00497g6948p8849G0809J8763j3443a79719N6099d2287A61410
1966c4232j30784A38677i6002b9826J2171A25479m0168a56870M2963F7370g5699
1954c0984d110k698j54449O4165A59682a68662D4245b1643A0853c9599k01110
$$ y = [93237, 26121, 112699, -69050, -55466, 130007, 131071, -137353, 139303, -86801, -161207, -307339, -98859, 31320, 11804, 76131, -210317, 211135, -58618, -178970, 8129, 68761, -86744, 93929, -159483, 2605, -147190, -1962, -13283, -37304, 173414, 52351, -1007, -6237, -183004, -239283, -47581, 274221, 61153, 29996, 29091, -51512, -171096, 100616, -195874, -56524, 3292, 305012, 233450, 17123, 29649, -227223, -285270, 16638, 76515, -47265, 39750, 24346, 76188, -103210, 100497, -76948, -155797, 70809, 89572, 76129, -179719, -123620, -42287, 161410, -34232, -165016, 138677, -96002, -29826, -17655, 125479, 85311, -156870, -113907, 67370, -75699, -30984, -4110, -6808, -161257, -97092, 159682, -168662, 44245, -21643, 10853, -39599, -240709]
1943b40709G4628i2133A99119G5691a03008A62951a30939M0098p7733C2005d8564
1931c02691A17655i1146E0613j2073K1273D904d8013A30774g7113B20285D1744
1919a1079o7347L8555J2375B30001j13093a59905c3492j04A2820a1121E2095c3204
1906b9134j696B12600D0210c7949a1180G8708a9283e252j75204g0166j0940n5702
1894a36808b7461l4043K8117j3503A3598f6168j12072C6323L8088k7401j2279
1883C4731b6591C276J80014i9319c9884j12021R593j69594b2304j40328P3554
1872h9078L3249j62132O0809b9576j25254A18048J07640a67140q3152R6947A50534
1860A33573e6088A27723a94862A32517a96843F9272J39921C0200J57870G8736
$$ y = [-240709, 74628, -92133, 199119, 75691, -103008, 162951, -130939, -90841, -168574, 32005, -48564, -302691, 117655, -91146, 50613, 38540, 59813, 4904, -48013, 130774, -77113, 220285, 41744, -11079, -78426, -39871, -27496, 230001, 116908, -159905, -33492, -33596, 12820, -11121, 52095, -33204, -29134, -30830, 212600, 40210, -37949, -11180, 78708, -19283, -5252, -180456, -70166, -81106, -136808, -27461, -61504, -33387, -46890, 13598, -66168, -178240, 36323, 74411, 47010, 34731, -26591, 3276, 183290, -99319, -39884, -151905, -142312, -311906, -22304, -162632, -89078, -55829, -217961, -157152, -29576, -154830, 118048, 225688, -167140, -250292, -153345, 150534, 133573, -56088, 127723, -194862, 132517, -196843, 69272, 209193, 30200, 188070, 78736]
1849A94444q6479a32305J7297a0209B1580a51765B46661A15777J16669I6619l7225
1838E9394a17404b4013N894k08790C1887L4945a54224b5575m09198B35452f718
1826B4890d3177F7537M086N5063Q930L2378H0693i0199j00463C17015a22064c3624
1813B1653g8878A12294J8028o2958J29901g0961C1429J14058k5381o754J57203
1802B70555b25773Q3081k645a2719o6348A13925c1198G4938J8401h7875c2743
1790B6602b58651N2479d6187A64188c5985H0175J65461H8704f3284A92547a7692
1778a70529d1191a2541j65321C7283c1591D0135a88160B6359j0039J69039l5640
1767A49719a07150o2352A04202A777d40753C39623c2657q6741J2186j93854F2084
$$ y = [194444, 107965, -132305, -115008, -10209, 21580, -151765, 246661, 115777, 232446, 96619, 59394, -117404, -24013, -18119, -226909, 31887, 66832, -154224, -25575, -434773, 235452, -6718, 24890, -43177, 67537, 71623, 126686, 135616, 167994, 80693, -90199, -190662, 317015, -122064, -33624, 21653, -78878, 112294, 130322, 67364, 197265, -70961, 31429, 145487, 120106, 113352, 270555, -225773, -142692, -145337, -12719, -79067, 113925, -31198, 74938, 93339, -87875, -32743, 26602, -258651, -206172, -46187, 164188, -35985, 80175, 245636, 88704, -63284, 192547, -17692, -170529, -41191, -12541, -177862, 37283, -31591, 40135, -188160, 26359, 16320, 185359, 149719, -107150, -169502, 104202, 1777, -440753, 339623, -32657, -119398, -107212, -301066, 62084]
1755b12560l5187F4290a54470f1743A82568p1509j5790i3713A91093B8721J75806
1744B04527a85931A0957J1564g5612E8339b71020I2367A0514g8471j93489A26883
1732b1266j08483N4847j54230D7157E239J0069a34844A42668q0J25023E9518A3427
1719a29121m0453O8770D8846L9870e1589L103k5866b7712l6457p6730a4707o5772
1707h0479A14332f3921F524b95018A7009J41161a52637A33348a00473E3679a19760
1695a76777E0080d8600q219C1138J61959e4444r3545L9255M6341C10194a6554
1683A96456a03099B2004F425c558o0362b133k0778D3587a22412k6081c9367A53601
1670B9375J7939O4930a24842b4715B36087F038a16185B5016b6039o9355m3593
$$ y = [-212560, -247747, 64290, -154470, -61743, 182568, 111059, 95269, -93713, 191093, 28721, 204527, -185931, 10957, 22521, -75612, 58339, -271020, 92367, 10514, -78471, -271960, 126883, -21266, -129749, -74902, -229132, 47157, 5239, 15308, -134844, 142668, 142588, 267611, 59518, 13427, -129121, -169574, -100804, 48846, 88716, -51589, -48486, -74352, -27712, -64169, -140899, -14707, -80479, 114332, -63921, 6524, -295018, 17009, 158170, -152637, 133348, -100473, 53679, -119760, -176777, 50080, -48600, -56819, 31138, 193097, -54444, -147989, -108734, -62393, 310194, -16554, 196456, -103099, 22004, 6425, -3558, -63920, -2133, -22911, 43587, -122412, -148493, -39367, 153601, 29375, 47314, 112244, -124842, -24715, 236087, 6038, -116185, 25016, -26039, -95394, -138987]
1659a38987B00201N8393a15109j10667I1550K9004K35611e4334B71788F2051f165
1647c1185n329C02883a35131r266c7673G3739a8128p0969A16759J48607r4371
1636A70995b105q8470b4561j11686F3095O4448k8396N1458a37310C3193N9104
1625I2297g8852B1074a74k91725a16206j19597B39455E7746f4344C2736a34699
1613A41649E0693L03528b65012c6934B9942a81443B34448a76411G1396g9324b3571
1601E2403K13354a14504J1156B35191B4170C528N0930a01185D886K13765D7563
1589A43097b7435J2701C8461a36848M1221D5644K1087J50257g4108A32236C7630
1577E0689J1135Q6337d9143k17830h5396l6656A27196A4251i7530D0558j5793
$$ y = [-138987, 200201, 258594, -115109, -225776, 91550, 120554, 356165, -54334, 271788, 62051, -6165, -31185, -36514, 302883, -135131, -144397, -37673, 73739, -18128, -89097, 116759, 265366, 170995, -2105, -90575, -24561, -136247, 63095, 127543, 99147, 150605, -137310, 33193, 92297, -78852, 21074, -174, -291899, -116206, -235803, 239455, 57746, -64344, 32736, -134699, 141649, 50693, 354221, -265012, -36934, 29942, -181443, 234448, -176411, 71396, -79324, -23571, 52403, 265757, -114504, -103348, 235191, 24170, 3528, 54458, -101185, 4886, 218651, 47563, 143097, -27435, -14734, 38461, -136848, -95627, 45644, 66731, 216988, -74108, 132236, 37630, 50689, 61824, 148161, -49143, -266973, -85396, -122052, 127196, 14251, -97530, 40558, 24765]
1566B4765a32005p5425D8808j999J20742D9940M291I404J12082e4342b88A66992
1553h7327b4199k5306j66225A20990n2346g6541j15570h7629A24787c6079p0859
1542a06938a873j97917I6997D7096c4115D8978a04526m3973A41995m4679I851
1530I431J04157K9799i0189B46717a41089H807J33131B6381b7316I8437L0143
1519A28580n2689N9999b1970A45215R5359a5335k8888E7699a59827c3063n6042
1508h9105E9509A8349B521a7453A34881A171J98802a41695B2407J11739k5935
1497A08211a22779k9203c8923A73299D8320b7233o2970A59504M8176f9808g343
1485b08706h7564A98602m0445a13184J2015e0318k70362g1962j1012l407B15271
$$ y = [24765, -132005, -207430, 48808, 46809, 167551, 49940, 54231, 9404, 121486, -54342, -288, 166992, -87327, -24199, -49505, -215730, 120990, 68644, -76541, -192111, -87629, 124787, -36079, -106938, -1873, -199790, 96997, 47096, -34115, 48978, -104526, -148499, 141995, 97316, 9851, 9431, 113588, 143387, -90189, 246717, -141089, 8807, 141938, 26381, -27316, 98437, 128580, 75891, 135890, -21970, 145215, 240574, -15335, -44223, 57699, -159827, -33063, -89105, 59509, 18349, 2521, -17453, 134881, 1171, 199973, -141695, 22407, 134146, 108211, -122779, -151982, -38923, 173299, 48320, -27233, -90203, 159504, 207680, -69808, -7343, -208706, -87564, 198602, 158157, -113184, -101169, -50318, -320680, -71962, -82974, -86381, 215271]
1473b1919A1518J35983m4545D260J02359a04252K8300c0435B9494b61626A3505
1461a40693A48420F5955b4678k33492q1437A50181a50309A82750h3734q6872e9999
1449h9565j19729A53013b42695Q3549e9736K4913j34067B60960b10851A87859
1438I0920k6689g6908k1387J0577a5954k5326A38966A265c222C16655A44960c10135
1425G3361B9634J00079O2077q6719b52395a18274A49167C7240L8301l7592f2685
1413f3619I8450K25487e5546p7927G7506b44520C3768J8823L8726e7582A84488
1401h7963r0005g7642C9777J0558a89972i2595o3694A7185d9789F6571h3692l8904
1389a22596c7268j09914C185J97627C1667a64297o8154d8781I9845m5395i4559
$$ y = [-21919, 11518, 147501, 102956, 4260, 106619, -104252, -75952, -30435, 29494, -261626, 13505, -140693, 148420, 65955, -24678, -258170, -339607, 150181, -150309, 182750, -83734, -170606, -59999, -89565, -209294, 153013, -242695, -159146, -59736, -34823, -168890, 260960, -210851, 187859, 90920, 64231, -76908, -98295, -87718, -15954, -41280, 138966, 1265, -3222, 316655, 144960, -310135, 73361, 29634, 129713, 191790, 105071, -252395, -118274, 149167, 37240, 75541, 37949, -62685, -63619, 98450, 323937, -55546, -133473, 77506, -244520, 33768, 52591, 91317, -57582, 184488, -87963, -177968, -77642, 39777, 50335, -189972, -92595, -156289, 17185, -49789, 66571, -83692, -122596, -37268, -147182, 3185, 200812, 31667, -164297, -232451, -48781, 99845, 54450, -94559]
1377A14542i1285n67J224F4032A5698c8698p6920A1968b13628k6427d6876B32711
1364a1172r3544A7763P0134r263J20063m8009d7517B38601h0748A27809a47802
1352B97009d5718j5086b9642E9138a81071g9595I3398O0165m1221g4274k55829
1341c30103A17240b19287g8886A63247i6910d7861B32049e539A0506c0566H1830
1329B18811q816G8606b1467E1143a70786D4896j7326K3736a06700E5314b99304
1317i0560I0352e6558b7345n9619A51065o9720a823H4205h6909e198C1007i071
1304e9809E5219i2419a9881p393H0892L4300a05666o4226A51242D1137b90866
1292d0094H8301C8079j1665M3697P0808J7848a73077F8461J084O0792E7725i8898
$$ y = [114542, -91285, -91852, -90628, 64032, 15698, -38698, -115618, 11968, -213628, -240055, -46876, 232711, -11172, -104716, 17763, 87897, 78634, 198697, 150688, -47517, 238601, -80748, 127809, -147802, 297009, -45718, -60804, -29642, 59138, -181071, -79595, 93398, 153563, 112342, -74274, -330103, 117240, -219287, -78886, 163247, -96910, -47861, 232049, -5539, 10506, -30566, 81830, 218811, 209995, 78606, -21467, 51143, -170786, 44896, 27570, 51306, -106700, 55314, -299304, -90560, 90352, -56558, -27345, -86964, 151065, 81345, -1823, 84205, -86909, -5198, 31007, -9071, -59809, 55219, -92419, -19881, -27274, 80892, 115192, -105666, -169892, 151242, 41137, -290866, -40094, 88301, 38079, 26414, 70111, 140919, 158767, -173077, 68461, 69545, 130337, 57725, -98898]
1279H2487J74359I6112d8544A08204J6547l2521k4326a27419l3280C432J13495
1268A16927L2875O9898J8531a48812A28235J74127j8315d2087B0681P1297D5534
1256i3251C15339E5434a25138A72059a75634O2036k8571M9071B7526a52647p9554
1245b32201c0893l57690a8821C8640e4413A21761b0509j49840c4554l7725G3970
1233G2727a17551E7290b5841B00434o6907b25148A20716a74741j1298A73912a91847
1221B70132p2061E5888a49486j62539f8699A31154B6122a8455B25090i9155H2
1209a17273E7812M8888B9740K03278r1680o4342d3535l2239B9606e5401l54619
1198d10020A08716D5482B1537a54645A99739a55430i002A02439a8988j8032j58378
$$ y = [82487, 256846, 96112, -48544, 108204, 124751, 92230, 67904, -127419, -160699, 3432, 116927, 149802, 219700, 238231, -148812, 128235, 302362, 284047, -42087, 20681, 91978, 45534, -93251, 315339, 55434, -125138, 172059, -175634, -113598, -142169, -93098, 27526, -152647, -232201, -30893, -388583, -18821, 38640, -54413, 121761, -20509, -170349, -34554, -72279, 73970, 72727, -117551, 57290, -25841, 200434, 133527, -225148, 120716, -174741, -186039, 173912, -191847, 270132, 198071, 55888, -149486, -312025, -68699, 131154, 26122, -18455, 225090, -99155, 82, -117273, 57812, 106700, 29740, 233018, 141338, 76996, -43535, -75774, 29606, -55401, -410020, 108716, 45482, 21537, -154645, 199739, -155430, -9002, 102439, -18988, -37020, -195398]
1187a95398F6000k2135A2970R371g679j76668A26474e2463j3200B22817d0134
1175g6105k9433A41248d7263j70221E6840M4578K628M7392p2710e1568l7353E9741
1162F8853O4831E4563a34546H4146a5198o6364B9487M4919B7546M1583h6842K9241
1150e7601A7934J00411D4642i3602A11522e395F0432j6834c6611j12259A42049
1138C88546a28984j02528A32516M9146l0888l360d431l0272D5754J68654a11846
1126E8427k5571P6968B4674H34M9734O1911c1955B5893d2577q3896n6440b6800
1113f8594a3495A5189b18678A0342b0007o248h741l2088F5834L3304b61560B59913
1100a80274N861e1665C3091a1506B4394J49577b30525a12524M1170o3904o4111
$$ y = [-195398, 66000, 43865, 12970, 22341, -7679, -184347, 126474, -52463, -65663, 222817, -40134, -76105, -105538, 141248, -47263, -217484, 56840, 101418, 104046, 151438, 78728, -51568, -88921, 59741, 68853, 133684, 54563, -134546, 84146, -15198, -81562, 29487, 74406, 27546, 69129, -86842, -57601, 17934, 118345, 44642, -93602, 111522, -5395, 60432, 43598, -36611, -148870, 142049, 388546, -128984, -231512, 132516, 181662, 150774, 147414, -4431, -34703, 45754, 214408, -111846, 58427, 32856, 109824, 24674, 834, 50568, 112479, -31955, 25893, -42577, -126473, -182913, -26800, -68594, -13495, 15189, -218678, 10342, -20007, -26255, -8741, -40829, 65834, 99138, -261560, 259913, -180274, -174413, -51665, 33091, -11506, 24394, 173971, -230525, -112524, -71354, -135258, -199369]
1089a99369b1700J0099j2905k73698G5838b8237l2365D8902b13436B09469C1545
1077A79591K0747b0366j49115d5379G734b15885C9009r822a12398H1785j9299
1066F2486J578N9329c6954A66708b248p4862F264R3091D1921B77R7091b8326j01068
1053a29394N0904n2118N5938p9055o6866O6190L2881B14863g2998K9714I1917
1041c1126p8966E2066b4414I7463h1152E333a71782A5433i8915A65900p1442B5020
1028A35842b13121a01303a3424A9939a71115B4885a5403B9853a57900E19J86367
1017A86886o6608l5687J30006q2465A27e333a439q8314L2477q6k1542A32555m5336
1004H7219a5880C03317d9097q9238B46176E244Q7298D0131J02386K2501E738d7722
$$ y = [-199369, -21700, -11601, -24506, -298204, 75838, -28237, -60602, 48902, -213436, 209469, 31545, 179591, 200338, -20366, -169481, -45379, 7734, -215885, 39009, 29187, -112398, 81785, 62486, 64064, 123393, -36954, 166708, -2248, -77110, 6264, 99355, 41921, 277, 97368, -28326, -129394, -78490, -130608, -74670, -153725, -220591, -154401, -121520, 214863, -72998, -43284, 91917, -31126, -110092, 52066, -24414, 97463, -81152, 5333, -171782, 15433, -98915, 165900, 94458, 25020, 135842, -213121, -101303, -13424, 19939, -171115, 24885, -15403, 29853, -157900, 519, 186886, 120278, 84591, 214597, 132132, 127, -5333, -1439, -89753, -57276, -57362, -78904, 132555, 87219, -15880, 303317, -49097, -138335, 246176, 5244, 92542, 40131, 142517, 165018, 5738, -47722]
991g357C8658K26357a44639a6880j8053r86A48196N6065H7408a14327j63606A71948
978A01112l8544a23108J1094K2900I78a28712j03448P6481m376h947A8427J47358
966A65785d5924A7121h9403A68890b8705B51551a47331j62203i4872d0355B23979
954H0071a37015k9411c9764A02518a39019A57194a52547J531P5399A02732b1605
942A65829O3838b30992A81245E2120j1276b4919F5873h1400A44361a5655A31490
930c0891A06256l2302b73081a9260k2384A2173b8805D6385L05383H4316B1258
918f0852a3800A03007B3800a60271A43547R4050a15766D41724h7165A34199e9756
906D4997J08598g3798p9626B53118C3761A0357Q8072b22110f4648l0124A53373
$$ y = [-7357, 38658, 265015, -144639, -16880, -34933, -35919, 148196, 204261, 87408, -114327, -277933, 171948, 101112, 62568, -123108, -112014, -89114, 978, -128712, -232160, -155679, -160055, -8947, 18427, 165785, -45924, 17121, -89403, 168890, -28705, 251551, -147331, -309534, -94872, -40355, 223979, 80071, -137015, -166426, -39764, 102518, -139019, 157194, -152547, -151016, -75617, 102732, -21605, 165829, 229667, -230992, 181245, 52120, 40844, -24919, 65873, -81400, 144361, -15655, 131490, -30891, 106256, 73954, -273081, -19260, -41644, 12173, -28805, 46385, 351768, 84316, 21258, -60852, -13800, 103007, 23800, -160271, 143547, 237597, -115766, 441724, -87165, 134199, -59756, 44997, 153595, -73798, -153424, 253118, 33761, 10357, 98429, -222110, -64648, -94772, 153373]
894h4120j6624k03953h160o0729K0321C4940A0816L0171a48877F3804J88802I4035
881H1434a65123d933l8048G0769J65922C1533D89b5647r2580B27268E0258c2680
868A28115E3719N947Q6936L7394d4349A35034a83136r816g1185H1528J55204d0553
855a51362A44196m2899O1188C2619J47679n4949a06854F0734k4491a06242c9804
843D23P4248f0549k40086a16453b8294j93846A21827J09754A12199d3800E7947
831c0876j8703j74231e2972j85300A66614J68565D1415R4246o5192J07749a15250
819a19621J7207d1868H0109c8025B24392j10166j595a39685n1655B59015I5737
807B92099f3037m2681K2218A33445h7162H0978a16584A53120G215f0849A95865
$$ y = [-84120, -100744, -304697, -8160, -68889, -48568, 34940, 10816, 40987, -148877, 63804, 252606, 94035, 81434, -165123, -4933, -42981, 70769, 236691, 31533, 489, -25647, -118227, 227268, 50258, -32680, 128115, 53719, 59666, 146602, 183996, -44349, 135034, -183136, -192952, -71185, 81528, 236732, -40553, -151362, 144196, 101297, 162485, 32619, 180298, 125349, -106854, 60734, 36243, -106242, -39804, 423, 74671, -60549, -300635, -116453, -28294, -222140, 121827, 231581, 112199, -43800, 57947, -30876, -49579, -223810, -52972, -238272, 166614, 335179, 41415, 135661, 70469, 178218, -115250, -119621, -102414, -41868, 80109, -38025, 224392, 114226, 112631, -139685, -191340, 259015, 95737, 292099, -63037, -105718, -83500, 133445, -87162, 80978, -116584, 153120, 7215, -60849, 195865]
795E2384h5619C6802F068h0573E758J3071k493a96740M3877N692A44414b20756
782B23681i2270A44523E1449R7674C969b36816A25074j2179P5709r0985e4117
770B8539H068M6065a8576H84K13659e2174B61664h8566G6746R6267n879H3449
757b46614K7195c5121j90794i0259B57436f0024D4856N2835b9672A62296J08851
746B71147B6570a38119k18903D9841R538h6657a2572A06324h5932F728N8392a17119
733A3049J18695a48948G9171e9649K2860j4215B2607J11786O8464F527a8314D3525
720i9083A02874b077q7859L156G3639c6073B46229c9806K719A06193l8722a4982
707A27882c4403B4263K8855f012l9431F3363k0981J01702a0732j04517B40794
$$ y = [52384, -85619, 36802, 6068, -80573, 5758, 18829, 16336, -196740, -152863, -147171, 144414, -220756, 223681, -92270, 144523, 51449, 149123, 3969, -236816, 125074, 112895, 188604, 97619, -54117, 28539, 8068, 54133, -18576, 884, 214543, -52174, 261664, -88566, 76746, 173013, 167134, 83449, -246614, -219419, -35121, -225915, -90259, 257436, -60024, 44856, 97691, -29672, 162296, 271147, 26570, -138119, -357022, 49841, 59379, -86657, -12572, 106324, -85932, 6728, 65120, -117119, 13049, 131744, -148948, 79171, -59649, -36789, -51004, 22607, 134393, 202857, 6527, -18314, 43525, -99083, 102874, -2077, -89936, -86780, 73639, -36073, 246229, -39806, -37087, 106193, 67471, -14982, 127882, -34403, 24263, 53118, -6012, -45443, 63363, 42382, 144084, -10732, -115249, 240794]
695h4904o9269O5738A07444J62504j14285n8039m4945A0771Q1411C6480j2074
684B4406R0882d1083j7841d515A44731a35756G1723G87O6479A6506P4062D1192
671I2676K7052d7254a4349g63k20891a0492j98525j6883F031L7431j1627f8672
658a9442k06521e6470F4482k098e2513q337B8004N7772k7849e5434C46566a05470
645c4101H8263a85512B8885O7107B2280L9951O5360a9327D172h5628j9453A16206
632a20423l5046A26742K385b35911A71617E2099e5320A16453a41357p4077B721
620H556M3722K08057d3482H8707N489d5908a4252E4207J4140O188P5526K5812
608A75873a25895a1793A45011g9945A81691o0707C4632a04705k4502L3550B06692
$$ y = [-84904, -154173, -88435, 107444, 269948, 155663, 97624, 52679, 10771, 92182, 36480, 24406, 115288, -41083, -58924, -4515, 144731, -135756, 71723, 787, 67266, 16506, 90568, 41192, 92676, 119728, -47254, -14349, -763, -221654, -10492, -209017, -225900, 6031, 43462, 31835, -68672, -19442, -225963, -56470, 64482, 62384, -52513, -60850, 28004, 85776, 57927, -55434, 346566, -105470, -34101, 88263, -185512, 28885, 95992, 22280, 62231, 127591, -19327, 4172, -85628, -105081, 116206, -120423, -155469, 126742, 129127, -235911, 171617, 52099, -55320, 116453, -141357, -215434, 2721, 8556, 52278, 260335, -43482, 88707, 94196, -45908, -14252, 54207, 68347, 74535, 150061, 175873, -125895, -11793, 145011, -79945, 181691, 120984, 34632, -104705, -129207, -95657, 206692]
596e6263k2428l0400A17500F353g3687A810M528J05503a3512m1362F9340d0495
583D9225N3342a48198G2730e3327B13637O212n3119j7369g546B18822b1092A56022
570a43201J5188E3040a25370d1749j55232B08593e3335F2407c9907A56526g5488
558a4818A26004q887O0882B086K8657b06743C2757K0521L6728c6476q8898H4020
545C0712K3496L5717d0753p8461r7823O1157a9756r567m0277r4805E4672f5247
532B63923L4812A12269h139C474J61291l3151A4458J80919G1684J5775d6768F8261
519A28532b9531l4093A09970a36387e8730B0341J448b0289j44076d0583J8785
508b1798E5027K2968a0741j46475E6491k3870b0098A78333n3641a05143H3593
$$ y = [-56263, -78691, -109091, 117500, 6353, -73687, 1810, 6338, 111841, -13512, -54874, 69340, -40495, 49225, 102567, -148198, 72730, -53327, 213637, 219849, 166730, 149361, -7546, 218822, -21092, 156022, -143201, -128013, 53040, -125370, -41749, -196981, 208593, -53335, 62407, -39907, 156526, -75488, -14818, 126004, 117117, 177999, 2086, 30743, -206743, 32757, 53278, 90006, -36476, -125374, 84020, 30712, 54208, 89925, -40753, -119214, -217037, -155880, -19756, -29323, -69600, -164405, 54672, -65247, 263923, 298735, 112269, -8139, 3474, 164765, 131614, 14458, 195377, 71684, 87459, -46768, 68261, 128532, -29531, -63624, 109970, -136387, -58730, 20341, 21789, -20289, -164365, -40583, -21798, 55027, 77995, -10741, -157216, 56491, 32621, -20098, 178333, 124692, -105143, 83593]
496b188A13239a00622j07162A48283A2552Q9614L2808O0949H5870L9467n568n8493
484F1276j6533j1386K44849a36593I3296C7888N5577J20660n6166d1776F3332
472a32501D4798J41876G6434J53344b23577C1893r066c598A44927H270a8356E56
459h5166D9749P0533k4476g3633F7614N8980b6864F001b2366p7132A90107i6388
446A53845f120B89858g3381C3187d7345j6023F37a48450f4221D3171L7800e9868
433b6023N545K674A0602P1594A617N0854M7055a08618J7025B5169a5882A68856
420E1701a03292b8894H1071f056I4978A5065b36440a9694r947a4685A05982b51133
407D1971a77084A89375D8593a37592H6131a4811I2470J66522a87467A13057m7972
$$ y = [-2188, 113239, -100622, -207784, 148283, 12552, 102166, 134974, 195923, 85870, 125337, 119769, 61276, 44743, 33357, 278206, -136593, 93296, 37888, 93465, 214125, 157959, -41776, 63332, -132501, 44798, 186674, 76434, 229778, -223577, 31893, 22827, -3598, 144927, 8270, -18356, 556, -85166, 49749, 120282, 95806, -73633, 67614, 126594, -26864, 6001, -22366, -99498, 190107, -96388, 153845, -6120, 289858, -73381, 33187, -47345, -63368, 637, -148450, -64221, 43171, 80971, -59868, -26023, -20478, -17804, 10602, 82196, 1617, 52471, 99526, -108618, -91593, 25169, -15882, 168856, 51701, -103292, -28894, 81071, -6056, 94978, 15065, -236440, -19694, -29641, -14685, 105982, -251133, 41971, -177084, 189375, 48593, -137592, 86131, -14811, 92470, 258992, -187467, 113057, 65085]
396F5085h8270D5245e7153A45785o7077k0822M0243i3677A96848G608O9208a65106
383d0406H8930J70882j26645a09346B808a39815A09405M622m2612B7252a0805
371a07726k7767b9129H5844g3333A72765c1618r572k5405C3971J17330M4132h9829
358a07353n6096A61912C1289a06810g546B86173D7815j0039i0112C9602J87701
347B27303j7147I1788a84614B22166a92714i972n5257I1256C7645M2821a39327
335a33824A1605d7641H7270g2834J6398k9857C3818b9273C04Q7245c2976n4820
323h7796A50673G4941L1692e1703g038r7113j64240c7617C53215C1418e533D7418
310a03738R069C26219C3539R3002j8440D6081M3007I631K97835A05121b56842
$$ y = [65085, -88270, 45245, -57153, 145785, 78708, 57886, 98129, -93677, 196848, 7608, 76816, -165106, -40406, 88930, 259812, 133167, -109346, 2808, -139815, 109405, 114027, 71415, 27252, -10805, -107726, -135493, -29129, 85844, -73333, 172765, -31618, -41190, -66595, 33971, 151301, 195433, -89829, -107353, -163449, 161912, 31289, -106810, -7546, 286173, 47815, 37776, -90112, 39602, 227303, 210156, 91788, -184614, 222166, -192714, -9972, -65229, 91256, 37645, 80466, -139327, -133824, 11605, -47641, 87270, -72834, -56436, -86293, 33818, -29273, 304, 87549, -32976, -87796, 150673, 74941, 106633, -51703, -7038, -104151, -268391, -37617, 353215, 31418, -5533, 47418, -103738, -94669, 326219, 33539, 126541, 108101, 46081, 89088, 9631, 307466, 105121, -256842]
298a17868b5942e087B3602d0137A49685m7376l1066a61989A75258f532H4840b13471
285B1876P1582k9083J38871a4064q5986Q594C5376q500J10141a3767p723A2253
272I219a38767C07185A29003d2397k44347f7499A0916N4417R3432h03A01964m7873
260E4091j3146a41429A46725j6564A8456L61209D7092d5910D485J69771n1779
249A22477g781m4268G6865J43465G9544H817a53419B89458a39331B1174f8853
237A60469A7660a4800G2873k3361b26510j19847A07897d8002A37178b0092k38040
226b58132I8564J5203n1340K18073b78877K1129i7590M6728j4368A33769D7205
214b09405J3588d5872A41683m1693k0789e5975k5427I7182c15208J42170A15458
$$ y = [-117868, -25942, -5087, 23602, -40137, 149685, 102309, 71243, -161989, 175258, -6532, 84840, -213471, 21876, 93458, 64375, 203246, -14064, -100050, -91456, 35376, 26876, 137017, -13767, -21490, 12253, 9219, -138767, 307185, 129003, -42397, -286744, -67499, 10916, 65333, 158765, -803, 101964, 54091, 40945, -141429, 146725, 130161, 18456, 379665, 47092, -45910, 4485, 174256, 122477, -7781, -52049, 76865, 220330, 79544, 8817, -153419, 289458, -139331, 21174, -68853, 160469, 17660, -14800, 72873, 49512, -226510, -346357, 107897, -48002, 137178, -20092, -258132, 98564, 113767, 62427, 280500, -278877, -257748, -97590, -50862, -65230, 133769, 47205, -209405, -195817, -45872, 141683, 99990, 79201, -55975, -81402, 97182, -315208, -173038, 115458]
202f700r9733A96763p9731a44500j4556c2650j1992k1380A37842a19857f699j0826
190a7525o2229G3356a41697d0383B63532A14908k8241f4271r5054F258J840N6073
178F4171C347O7926d2227M419C6161b6068o7176B07226f213H8075L6224j3105
166A11194J1072K0243A2983M6070j1085O2757e0534C9786f4639m4452B62617a70297
153a0666m9156B2101a14758p1877G7956Q1436c0692B1073J44786a62818P2993
142h9825A8493J16361l8542f0162b180o2581A80305N4797h6811c8209A7919J83365
130B01284o1339a19668b4270p8176B53291H5353e6408j33086O5366o5726c7930
118i9136C2794P4635b34337g400o8966j5349D6682D717P9417Q4437o0784J26223
$$ y = [-6700, -106433, 196763, 117032, -144500, -159056, -32650, -44642, -66022, 137842, -119857, -6699, -17525, -79754, 73356, -141697, -40383, 263532, 114908, 86667, -64271, -159325, 6258, 8098, 64171, 3347, 71273, -42227, -37808, 36161, -26068, -93244, 207226, -6213, 88075, 124299, 111194, 122266, 142509, 12983, 59053, 47968, 110725, -50534, 39786, -64639, -109091, 262617, -170297, -10666, -59822, 22101, -114758, -186635, 77956, 159392, -30692, 21073, 165859, -162818, -89825, 18493, 134854, 96312, -60162, -2180, -64761, 180305, 235102, -86811, -38209, 17919, 201284, 139945, -119668, -24270, -102446, 253291, 85353, -56408, -189494, -124128, -189854, -37930, -99136, 32794, 107429, -234337, -7400, -76366, -91715, 46682, 4717, 84134, 168571, 107787, 234010]
106B34010f6197q9017C1124R8642R955h8963F519J25043n8606a93158J8968I7656
93D1430K0574a20478D6370g1164J598E5951M2623h1576I5091j0967a37240M2079
81i5161j2447C8272a4222C2300a58461F8406e2183j95644G5649C7608h7496A8153
68A47647a12331J4629A6668a95597P2751h92j31918K3545L519C9057d5262o06
56d5868H7754a08255E406K798L4183n635a1712A7096a28798g705j20852a1955
43a32048L6526K2285A6445a18653A28622i23k30203h9455l2852n115N335B2517
30C5738a29961j9540N9817L4697G0716a51307o6040Q4643K0763A10557a65888
18b8043f392m8868k2773a6525P711k004G5139R401h8660m0818d5592J3636A4848
$$ y = [234010, -66197, -155214, 31124, 129766, 139721, -88963, 6519, 131562, 72956, -193158, -174190, 97656, 41430, 62004, -120478, 46370, -71164, -69566, 55951, 98574, -81576, 95091, 84124, -137240, -95161, -107608, 38272, -14222, 32300, -158461, 68406, -52183, -247827, 75649, 37608, -87496, 18153, 147647, -112331, -97702, 16668, -195597, -122846, -892, -132810, -109265, -105746, 39057, -45262, -45868, 87754, -108255, 5406, 8204, 42387, 36752, -11712, 17096, -128798, -7705, -128557, -11955, -132048, -95522, -73237, 16445, -118653, 128622, -923, -231126, -89455, -122307, -127422, -122087, 22517, 35738, -129961, -149501, -89684, -54987, 70716, -151307, -217347, -132704, -111941, 110557, -165888, -28043, -6392, -55260, -78033, -16525, -8814, -10818, 75139, 84540, -88660, -129478, -45592, -31956, 14848]
4C8899O21A5401d5303k0674
0f5977
$$ y = [38899, 39520, 15401, -45303, -65977]
$$ Imaginary data points
##PAGE= N=2
##DATA TABLE= (X++(I..I)), XYDATA
$$ [...]
##END NTUPLES=NMR SPECTRUM
##END=
