##TITLE=XTC-1706e_2
##JCAMPDX= 6.0         $$ Bruker NMR JCAMP-DX V2.0
##DATA TYPE= nD NMR SPECTRUM
##DATA CLASS= NTUPLES
##NUM DIM= 2
##ORIGIN= BRUKER
##OWNER= patiny
$$ 1.79 TOPSPIN		Version 3.0
$$ 2012-05-20 15:41:26.830 +0200  patiny@icmbsg005
$$ Compression mode = diff/dup
##.OBSERVE FREQUENCY= 400.13188181139
##.OBSERVE NUCLEUS= ^1H
##.ACQUISITION MODE= SIMULTANEOUS (DQD)
##.ACQUISITION SCHEME= Echo-Antiecho
##.AVERAGES= 2
##.DIGITISER RES= 23
##SPECTROMETER/DATA SYSTEM= spect
##.PULSE SEQUENCE= hsqcetgpsisp2.2
##.SOLVENT NAME= D2O
##.SHIFT REFERENCE= INTERNAL, D2O, 1, 11.697
##AUDIT TRAIL= $$ (NUMBER, WHEN, WHO, WHERE, PROCESS, VERSION, WHAT)
$$ ##TITLE= Audit trail, TOPSPIN		Version 3.0
$$ ##JCAMPDX= 5.01
$$ ##ORIGIN= Bruker BioSpin GmbH
$$ ##OWNER= patiny
$$ $$ /opt/data/patiny/nmr/XTC-1706e_2/13/pdata/1/auditp.txt
$$ ##AUDIT TRAIL=  $$ (NUMBER, WHEN, WHO, WHERE, PROCESS, VERSION, WHAT)
(   1,<2012-05-20 15:41:25.771 +0200>,<patiny>,<icmbsg005>,<go>,<TOPSPIN 3.0>,
      <created by zg
	started at 2012-05-20 15:22:44.569 +0200,
	POWCHK enabled, PULCHK disabled,
       configuration hash MD5:
       77 C7 B7 C4 10 F4 BA 30 64 2E BB 52 82 F2 DA 41
       data hash MD5: 1K * 256
       DB 38 DA DF 4E C7 8B 13 B6 AC 62 58 EE 10 64 8F>)
(   2,<2012-05-20 15:41:25.871 +0200>,<patiny>,<icmbsg005>,<audit>,<TOPSPIN 3.0>,
      <user comment:
       ICON-NMR User ID: patiny
       data hash MD5: 1K * 256
       DB 38 DA DF 4E C7 8B 13 B6 AC 62 58 EE 10 64 8F>)
(   3,<2012-05-20 15:41:26.643 +0200>,<patiny>,<icmbsg005>,<proc2d>,<TOPSPIN 3.0>,
      <Start of raw data processing
       xfb same F2: SI = 1K WDW = 4 SSB = 2 FT_mod = 6 PKNL = 1 PHC0 = 0 PHC1 = 0 F1: SI = 1K ME_mod = 2 NCOEF = 32 WDW = 4 SSB = 2 FT_mod = 6
       data hash MD5: 1K * 1K
       35 CC A4 76 34 D3 61 75 9C EE 97 51 1F 4F FB C2>)
(   4,<2012-05-20 15:41:26.731 +0200>,<patiny>,<icmbsg005>,<proc2d>,<TOPSPIN 3.0>,
      <abs2 F2: ABSG = 5 ABSF1 = 11.697 ABSF2 = -2.290992
       data hash MD5: 1K * 1K
       21 62 0D 7C 26 7E 6D FA A0 3F 85 5C 83 74 0A B7>)
(   5,<2012-05-20 15:41:26.818 +0200>,<patiny>,<icmbsg005>,<proc2d>,<TOPSPIN 3.0>,
      <abs1 F1: ABSG = 5 ABSF1 = 179.9984 ABSF2 = -40.017
       data hash MD5: 1K * 1K
       BB DB 05 F3 4C E8 BF C1 43 75 20 DA 0F 4A 28 8D>)
$$ ##END=
$$ 
$$ $$ hash MD5
$$ $$ DF FE 70 8F 51 F5 D4 C1 2A E5 3A A5 68 73 0B 55
##$RELAX= 
##$RELAX= 
##$RELAX= 
##$RELAX= 
##$RELAX= 
##$RELAX= 
##$RELAX= 
##$RELAX= 
##$RELAX= 
##$RELAX= 
##$RELAX= 
$$ Bruker specific parameters
$$ --------------------------
##$DATPATH= </opt/data/patiny/nmr>
##$EXPNO= 13
##$NAME= <XTC-1706e_2>
##$PROCNO= 1
##$ACQT0= 0
##$AMP= (0..31)
100 100 100 100 100 100 100 100 100 100 100 100 100 100 100 100 100 100
100 100 100 100 100 100 100 100 100 100 100 100 100 100
##$ANAVPT= -1
##$AQSEQ= 0
##$AQ_mod= 3
##$AUNM= <au_zg>
##$AUTOPOS= <44 >
##$BF1= 400.13
##$BF2= 100.612769
##$BF3= 400.13
##$BF4= 400.13
##$BF5= 400.13
##$BF6= 400.13
##$BF7= 400.13
##$BF8= 400.13
$$ [...]
##$REVERSE= no
##$SF= 400.13
##$SI= 1024
##$SIGF1= 11.697
##$SIGF2= -2.290992
##$SINO= 0
##$SIOLD= 1024
##$SPECTYP= <>
##$SREGLST= <13C.H2O+D2O>
##$SSB= 2
##$STSI= 1024
##$STSR= 0
##$SW_p= 5597.01492537312
##$SYMM= 0
##$S_DEV= 848770
##$TDeff= 1024
##$TDoff= 0
##$TI= <>
##$TILT= no
##$TM1= 0
##$TM2= 0
##$TOPLEV= 100
##$USERP1= <>
##$USERP2= <>
##$USERP3= <>
##$USERP4= <>
##$USERP5= <>
##$WDW= 4
##$XDIM= 1024
##$YMAX_p= 99879916
##$YMIN_p= -476396150
##$CURPLOT= <Cups-PDF>
##$CURPRIN= <$Cups-PDF>
##$DFORMAT= <normdp>
##$LAYOUT= <+/2D_inv.xwp>
##$LFORMAT= <normlp>
##$PFORMAT= <normpl>
$$ Bruker specific parameters for F1
$$ ---------------------------------
##$ACQT0= 0
##$BF1= 100.612769
##$FnMODE= 6
##$NUC1= <13C>
##$O1= 7041.95747781
##$SFO1= 100.619810957478
##$SW= 220
##$SW_h= 22136.3584106452
##$TD= 256
##$ABSF1= 179.9984
##$ABSF2= -40.017
##$ABSG= 5
##$ABSL= 0
##$ALPHA= 0
##$AQORDER= 0
##$ASSFAC= 0
##$ASSFACI= 0
##$ASSFACX= 0
##$ASSWID= 0
##$AUNMP= <>
##$AXLEFT= 0
##$AXNAME= <F1>
##$AXNUC= <13C>
##$AXRIGHT= 0
##$AXTYPE= 0
##$AXUNIT= <>
##$AZFE= 0.1
##$AZFW= 0.5
##$BCFW= 0
##$BC_mod= 0
##$BYTORDP= 0
##$COROFFS= 0
##$CY= -3
##$DATMOD= 1
##$DC= 0
##$DFILT= <>
##$DTYPP= 0
##$ERETIC= no
##$F1P= 0
##$F2P= 0
##$FCOR= 0.5
##$FTSIZE= 1024
##$FT_mod= 6
##$GAMMA= 0
##$GB= 0
##$INTBC= 1
##$INTSCL= 1
##$ISEN= 128
##$LB= 0
##$LEV0= 0
##$LPBIN= 512
##$MAXI= 10000
##$MC2= 5
##$MEAN= 0
##$ME_mod= 2
##$MI= 1
##$NCOEF= 32
##$NC_proc= -10
##$NLEV= 6
##$NOISF1= 0
##$NOISF2= 0
##$NSP= 0
##$NTH_PI= 0
##$NZP= 0
##$OFFSET= 179.9984
##$PC= 4
##$PHC0= 0
##$PHC1= 0
##$PH_mod= 0
##$PKNL= no
##$PPARMOD= 1
##$PPDIAG= 0
##$PPIPTYP= 0
##$PPMPNUM= 100
##$PPRESOL= 1
##$PSCAL= 1
##$PSIGN= 0
##$PYNMP= <>
##$REVERSE= no
##$SF= 100.612769
##$SI= 1024
##$SIGF1= 179.9984
##$SIGF2= -40.017
##$SINO= 0
##$SIOLD= 1024
##$SPECTYP= <>
##$SREGLST= <>
##$SSB= 2
##$STSI= 1024
##$STSR= 0
##$SW_p= 22136.3584106452
##$SYMM= 0
##$S_DEV= 848770
##$TDeff= 512
##$TDoff= 0
##$TI= <>
##$TILT= no
##$TM1= 0
##$TM2= 0
##$TOPLEV= 0
##$USERP1= <>
##$USERP2= <>
##$USERP3= <>
##$USERP4= <>
##$USERP5= <>
##$WDW= 4
##$XDIM= 128
##$YMAX_p= 99879916
##$YMIN_p= -476396150
$$ End of Bruker specific parameters
$$ ---------------------------------
##NTUPLES= nD NMR SPECTRUM
##VAR_NAME=  FREQUENCY1,    FREQUENCY2,      SPECTRUM
##SYMBOL=    F1,            F2,              Y
##.NUCLEUS=  13C,           1H
##VAR_TYPE=  INDEPENDENT,   INDEPENDENT,     DEPENDENT
##VAR_FORM=  AFFN,          AFFN,            ASDF
##VAR_DIM=   1024,          1024,            1024
##UNITS=     HZ,            HZ,              ARBITRARY UNITS
##FACTOR=    21.6175375103957, 5.46583488805969, 1
##FIRST=     18110.137220953, 5591.54909048506, -345006
##LAST=      -4004.60365218182, 0,           -414519
##MIN=       -4004.60365218182, 0,           -476396150
##MAX=       18110.137220953, 5591.54909048506, 99879916
##PAGE= F1=18110.13722095
##FIRST=     18110.137220953, 5591.54909048506, -345006
##DATA TABLE= (F2++(Y..Y)), PROFILE
$$ [...]
##PAGE= F1=3085.948651228
##FIRST=     18110.137220953, 5591.54909048506, 613682
##DATA TABLE= (F2++(Y..Y)), PROFILE
187c71370j01357J52612F19578Q34256l6402n04451J37712j19970j32155p5217
177G23351A59631b54941m171k1949J5554B79868L65341L50738M06121n4286l41979
166A005803q9679m13733r7939P92822P28206n30485e5530q69583L63594K28816
156c32703C3639J36955m4904b3989k14456j12808O394A13878Q97039N51060F50708
144h00707l54096J24085m93673K90447d77189H6966A7954i82298j250758K83258
134a949798f87490J27698o42761j83247e27942I9783J20546N4426r0131M21345
124F05969K03776j88029g8610q54264j30746b87021H75863J53166A12090a296615
113a818541g24717B83113b16935p18820P6501D73718R71590n82121I0520b22886
$$ y = [-371370, -472727, -320115, 619578, 1453834, 1417432, 912981, 1050693, 930723, 798568, 723351, 159631, -254941, -259112, -281061, -265507, 279868, 645209, 995947, 1402068, 1347782, 1005803, 916124, 502391, 404452, 1197274, 1925480, 1394995, -55530, -925113, -561519, -332703, 33639, 170594, 125690, -23989, -238445, -351253, -344859, 113878, 1010917, 1561977, 650708, -800707, -1154803, -1030718, -1524391, -1233944, -477189, 86966, 17954, -982298, -2233056, -1949798, -687490, -559792, -1202553, -1385800, -527942, 99783, 220329, 274755, 184624, 605969, 809745, 621716, -78610, -932874, -1063620, -287021, 875863, 1029029, 112090, -1296615, -1818541, -724717, 283113, -216935, -935755, -859254, 473718, 1445308, 863187, 90520, -222886]
102e79341K62089F80294P01159o0359n87301M5116J15840r183B65502h50352p40343
91a590695g71530C40410i3635j042359j77345N61214K63922R2143j37701o99693
81a233454m58460Q22308B23306N74472J06816k54253R6306P31392l1579D01946
70A54157P54395o2461B57274a04320k43734k15456o18839j36700e68260C30863
59c34228m83591M03521H68309J234675r05061e09572l64070a56772K0337b822
48E25123P4953B74827h0587j74325o66493L57530d3697k13631q27903l70410M12594
37a043047J65511l76582K37484c51660m82966n15108d58481C53423b7647k84036
27c11683F89326Q89429n1827G19063A59697L0255J018590M60111p92620l75846
$$ y = [-579341, -317252, 680294, 1381453, 1321094, 733793, 778909, 894749, 885566, 265502, -850352, -1590695, -771530, 340410, -93635, -1135994, -1313339, -752125, -488203, -396060, -533761, -1233454, -1691914, -869606, 223306, 797778, 904594, 650341, 746647, 1478039, 1446460, 401946, 154157, 908552, 846091, 257274, -104320, -348054, -563510, -1182349, -1319049, -568260, 330863, -334228, -817819, -414298, 868309, 2102984, 1197923, -509572, -873642, -156772, -136435, -2822, 525123, 600076, 274827, -80587, -254912, -921405, -563875, -43697, -257328, -1085231, -1455641, -1043047, -877536, -1254118, -1016634, -351660, -834626, -1349734, -458481, 353423, -27647, -311683, 689326, 1578755, 1526928, 719063, 159697, 189952, 1208542, 1668653, 876033, 500187]
17E00187n6884b1116j99568h11j62169p573D26813M46156l87123A59810K53812
6D13622K17636I8947e27264N2072a30298B55820
$$ y = [500187, 443303, -21116, -220684, -811, -162980, -170553, 426813, 872969, 485846, 159810, 413622, 631258, 98947, -527264, -475192, -130298, 255820]
##PAGE= F1=3064.331113718
##FIRST=     18110.137220953, 5591.54909048506, 542093
##DATA TABLE= (F2++(Y..Y)), PROFILE
1023E42093E2660c32810D8848R29153P94820N3611E91117i42221J32683a24151
1012a68045k71870A79573Q34759n143m20384h1463j023172l17757L34865M81801
1002f05726A0541M76300n5660A76616a34598O4945D83616L57684K51133k58072
992H34361b62705k90748B05310K40468N8415c05669o44956d40766b13413o19361
982h32774Q695M1805J45907B51485Q81135k60205A98735c19694a56014B31660
971a72116j098720Q7038e00735j57380k16930h8221F54825C1344g36622j96269
961i32891k00593d66914A052763P43292p32684b08471p18581L11388C32842K52664
951E85506a14058n62458k30767L1023J07893l4888M208j15919o6827M09053C04779
$$ y = [542093, 52660, -332810, 48848, 978001, 1772821, 1826432, 591117, -942221, -809538, -124151, -168045, -439915, 179573, 1014332, 1009189, 588805, -81463, -1104635, -1422392, -1087527, -605726, 10541, 486841, 431181, 176616, -134598, -69653, 483616, 841300, 1092433, 834361, -262705, -553453, 205310, 445778, 504193, -305669, -950625, -440766, -213413, -832774, -824079, -782274, -636367, 251485, 1132620, 872415, 198735, -319694, -156014, 231660, -172116, -1270836, -1183798, -500735, -658115, -875045, -88221, 654825, 31344, -736622, -932891, -1133484, -466914, 1052763, 1796055, 1063371, -208471, -927052, -615664, 332842, 585506, -114058, -676516, -907283, -876260, -768367, -803255, -799047, -914966, -981793, -572740, 304779]
939A654477N71606n99310B18532h05183K70582F90133K70750l41778F178d49017
928c50276C40973L61864L35092N27602O55856j22555q06577B38775b07846m37147
918f44993J27471F91346K81803B62613M10547N60207m54461i7331j88430E92191
907A337860l64932A77254p5069N18305o1149a54042p26645o94724K65700d53496
896a63404r30447j71851i1210C47486o7692A02530Q7751a92897o38286n32718
886a363901J91928M04860c15964F75829M12897n10002a86397r13894k90401N70827
876h19865i5946n00864p30621n4278J05841j4960O39677D40088O09274j67517
866H81845B83768b06703m8886l80731j50169L12524B79895O98167j72799C11233
$$ y = [1654477, 2226083, 1626773, 218532, -805183, -534601, 690133, 960883, 619105, 6178, -449017, -350276, 340973, 702837, 1037929, 1565531, 2221387, 2098832, 1292255, 238775, -207846, -644993, -517522, 691346, 973149, 262613, 673160, 1233367, 778906, -97331, -285761, 592191, 1337860, 972928, 177254, 102185, 620490, 559341, -154042, -880687, -1575411, -1309711, -453496, -163404, -1093851, -1265702, -91210, 347486, 279794, 102530, 190281, -192897, -831183, -1363901, -1171973, -767113, -315964, 675829, 1088726, 578724, -186397, -1100291, -1390692, -819865, -95946, -596810, -1327431, -1381709, -1275868, -1290828, -651151, 440088, 1049362, 881845, 283768, -206703, -255589, -636320, -786489, -473965, 279895, 978062, 805263, 311233]
855B60384r5933M7038N00255r2380c88894J49509I86074J064148k86325F95673
844a74724j61479J40819k14357n8391a28075F50205J41913B40788b03568I9611
833A48231d78002l24761b30425C06424j06016o0684J82411B9281e74162N764A11830
821B78925a7799C77864J156496M37148m56749n56667A38687J25839J81335O7433
811E13294K32568K17063m56565d74726o96891k581e24115B0290a42507p13735
801h56242j008951q19480P26489A5913O16625D6482c9022m8282M1417I5913i2090
789h96914k34633N45416E95029J009522K3750p97719e7351r01115n60814J35727
779a383553a10445A380945L27103G84533c55281p92495K97870B7791K48286J76647
$$ y = [260384, 164451, 211489, 711744, 619364, -388894, -239385, 986074, 2050222, 1763897, 695673, -174724, -336203, -195384, -409741, -468132, -128075, 650205, 792118, 240788, -203568, 99611, 148231, -478002, -802763, -230425, 306424, 200408, 139724, 322135, 29281, -574162, -568398, 111830, 278925, -17799, 377864, 1534360, 1971508, 1514759, 958092, 138687, 264526, 445861, 513294, 745862, 962925, 506360, -474726, -1171617, -1174198, -524115, 20290, -142507, -856242, -1865193, -2684673, -1958184, 15913, 632538, 46482, -39022, -87304, -45887, 95913, -92090, -896914, -1131547, -586131, 595029, 1604551, 1628301, 830582, -57351, -958466, -1519280, -1383553, -110445, 1380945, 1708048, 784533, -355281, -1147776, -849906, 27791, 276077, 452724]
769D52724L10371C43044i31301p16090M90881d1905B73181d99849l70513d08235
758C16531K96623B8169h35662j68834L26355R741c21504D42805J77584D1386h27310
746a200791L60492a37780G72188M59868m07260l45357a0975j407737j17065D39981
735A562437o80824a63205q74711p25583m39803O49393c30705C53160j70263e0285
724e10028j90995C9656P35391q8993j84382c36934j255801N33190I2443d35404
713g90798L18525e6760B04102d7591m91425F91392J718721l04291I33546B04358
702H94483Q98654k95916F61004J88270R90999j12722E56228C8978O62020R05119
692A606117k29794C45213A12650M18219K23680j43303A4044b39228j05563o75716
$$ y = [452724, 763095, 343044, -931301, -1647391, -1156510, -41905, 273181, -499849, -870362, -408235, 316531, 613154, 28169, -835662, -1004496, -678141, -668400, -321504, 442805, 620389, 41386, -827310, -1200791, -840299, -137780, 772188, 1232056, 824796, 479439, -10975, -1418712, -1535777, 439981, 1562437, 881613, -163205, -1037916, -1763499, -2203302, -1553909, -330705, 353160, 182897, -50285, -510028, -701023, 39656, 775047, 686054, 501672, -336934, -1592735, -1059545, 92443, -435404, -790798, -472273, -56760, 204102, -47591, -539016, 691392, 2410113, 2105822, 933546, 204358, 894483, 1793137, 1497221, 661004, 849274, 1840273, 1727551, 556228, 38978, 700998, 1606117, 1376323, 345213, 112650, 530869, 754549, 611246, 14044, -239228, -344791, -1020507]
682a020507l79643J10136J84147A10822J081275j63292j83597J17037j17684l06965
672E37596L0415I5574L05975R66725n7492p9118B64297a123552M16006H28530
661E90928e92894p08841j35289q7334n95367l28248N50796g21667A42952M22875
651E65827c46850j706693l74471i27686E46298J086883O06493k47192o68347n20117
641H04018A98413d08814j63651a59447B48251a96954l39444B47961O11128J65071
631A024160l88714A06311j1554L19733B00774e98901r24550K87553C77563J073402
621A450965o60272i9058C09006Q78513M73426O69515J9418n99067m79048k62299
611A009464l46481K38559D25695a187770o49916g47155H8607d90265r10838a45867
$$ y = [-1020507, -1400150, -1290014, -1105867, 110822, 1192097, 1028805, 845208, 962245, 844561, 537596, 568011, 95574, 401549, 1368274, 1310782, 1231664, 264297, -1123552, -707546, 828530, 590928, -592894, -1301735, -1437024, -1524358, -2119725, -2447973, -1897177, -721667, 142952, 565827, -346850, -2053543, -2428014, -927686, 546298, 1633181, 2239674, 1992482, 1324135, 804018, 198413, -408814, -572465, -159447, 248251, -196954, -536398, 247961, 859089, 1024160, 635446, 106311, 94757, 414490, 200774, -598901, -1523451, -1235898, 377563, 1450965, 790693, -99058, 309006, 1187519, 1660945, 2330460, 2349878, 1750811, 1271763, 1009464, 662983, 901542, 425695, -1187770, -1837686, -747155, 88607, -490265, -1401103, -145867]
600A283976A71570a663558J89589a04834F01251J23697L73819l12651a95085j096315
590a291400l98114Q33759A60481K84780J49073B63903a056884o12149h31606a28482
579b61373A28503O24340B61742a41819n3484P9946E54421J132408J9572B97225
568a242340O21082C92533J53500M07343J93081b3957p08420b78582C89147J97886
558E87033K46808m12525a081655l67901f67516A06391K56697N79502p8652l65723
548D98215J357L88969N90341Q477a99594j276262L15410B96558P53323d295j054431
537a058726j92608l0170e31867F93320L41k53476k6489e47966k169611m37245
527c154822a194526d7007l03324q4096J96026C5588L2082e44219k91419Q9958
$$ y = [1283976, 171570, -1663558, -1473969, -104834, 601251, 724948, 1098767, 786116, -195085, -1291400, -1689514, -855755, 160481, 445261, 594334, 263903, -1056884, -1669033, -831606, -128482, -261373, 128503, 752843, 261742, -141819, -195303, -115357, 554421, 1686829, 1706401, 297225, -1242340, -621258, 392533, 546033, 953376, 1146457, -23957, -732377, -278582, 389147, 587033, 833841, 421316, -1081655, -1449556, -667516, 106391, 363088, 942590, 863938, 498215, 499572, 888541, 1478882, 1487359, -199594, -1475856, -1160446, 296558, 1049881, -4295, -1058726, -1251334, -1281504, -531867, 693320, 693661, 440185, 413696, -547966, -2717577, -3154822, -1194526, -47007, -350331, -434427, -238401, 35588, 67670, -544219, -835638, -745680]
517g45680b20408C45004M09808B45004a283021q65151J010145a05690k34273o33843
507i73806c06747H31474O08920m12906b71080q84929K97082L36172K22055g0616
496E4787h5267A25707L66630L70244J41337B26824a069067J98060E47916j68035
486C79881h92891n10893K90741L34902a84679G42081M83117n93470k77964P67997
476A121761e65656o95610L63722K96815K48777A03479a67793j993824j438248
467c599865Q32251a163131a59249q73223p78846e97961D72521d35355n50736M2168
457i43923m65p71002j7461g48552J48832j248545o78393k84221k07780m24855
447c443514j076497O88261i86591H96862D01107a029181j347447j151690n86363
$$ y = [-745680, -220408, 345004, 754812, 245004, -1283021, -2148172, -1138027, -105690, -339963, -973806, -306747, 831474, 1440394, 1027488, -271080, -1156009, -858927, -522755, -300700, -70616, 54787, -85267, 125707, 492337, 862581, 1003918, 226824, -1069067, -871007, 547916, 379881, -892891, -1403784, -1113043, -778141, -184679, 742081, 1225198, 631728, 353764, 1121761, -565656, -1261266, -897544, -600729, -351952, 103479, -167793, -2161617, -3599865, -2767614, -1163131, -159249, -1032472, -1811318, -597961, 472521, -435355, -986091, -943923, -944388, -1715390, -1732851, -748552, -599720, -1848265, -2526658, -2810879, -3018659, -3443514, -4520011, -3831750, -986591, 896862, 401107, -1029181, -2376628, -3528318, -4114681]
438d114681J015955a378974L98233p40923q40793L83258J054606l00771j114988
429b540352n58875N62095K17656j08825J94505n33435q78039J85627K14355o06569
419c851857J24685J278811j387074o04014k503173j2653612p786625a2971342
410F939619K598652k184016j330691j056199k62794J30684Q1011r59710j477497
401B479059L2766j130004C42472F7185K2460K64557M96202j54841p1685M20764
391A044642M19004m44461d73446p03655d63520A29613J15373R0588b11611n20374
381g31985k30498J92801p63043k76070N95230e74764o62346m04668L86598N49845
371g05335a59955q17844k652824o61494O49447j217638j477415j015726R18874
$$ y = [-4114681, -3098726, -1378974, -980741, -1721664, -2562457, -2179199, -1124593, -1425364, -2540352, -3099227, -2537132, -2319476, -2428301, -2233796, -2767231, -3645270, -3459643, -3245288, -3851857, -3727172, -2448361, -3835435, -4439449, -6942622, -19596234, -27382859, -12971342, 6939619, 9538271, 7354255, 6023564, 4967365, 4704571, 4835255, 4916266, 3956556, 2479059, 2511825, 1381821, 342472, 67185, 89645, 354202, 850404, 695563, 623878, 1044642, 1463646, 1019185, -473446, -1177101, -463520, 129613, 244986, 335574, -211611, -731985, -962483, -769682, -1532725, -1808795, -1213565, -574764, -1237110, -1641778, -1255180, -705335, -159955, -977799, -3630623, -4292117, -3642670, -4860308, -6337723, -7353449, -6434575]
362f434575n524521j7092613l074545a0452000F761371j158151k373910J112841
354D342151M11571j642752j166450J16529Q5027m70729l30238l55519J29745Q15740
344A935075O5572o40563Q7603j09603n54135d68811j55127E82130Q36981K52286
334A671397K77062L60421j84488j7085k89221m12533j10562k87673F2070a10544
323D64421L04791A73040b96542a8451F75351M41594N60204L32506o54943o76418
313F78294J97128N11212M42733k07789k45274j29115n92889a47157D3104N35548
303E78652e83968j132874L8888K50326f61376H1822a293617j929779J18083a328057
292d77780A03317K39063L3723L50277M00494k66411B54287c54515a40825B00889
$$ y = [-6434575, -11959096, -29051709, -32126254, -10452000, 6761371, 5603220, 3229310, 4342151, 4753722, 3110970, 1944520, 2061049, 2146076, 1675347, 1345109, 989590, 1119335, 1935075, 2000647, 1360084, 1447687, 1338084, 783949, -468811, -623938, 582130, 1419111, 1671397, 1948459, 2308880, 2124392, 2107307, 1818086, 1405553, 1294991, 1007318, 62070, -110544, 464421, 769212, 173040, -296542, -18451, 675351, 1116945, 1677149, 2009655, 1354712, 678294, 875422, 1386634, 1829367, 1621578, 1376304, 1247189, 654300, -147157, 43104, 578652, -583968, -1716842, -1677954, -1427628, -661376, 81822, -1293617, -3223396, -3105313, -1328057, -477780, 103317, 342380, 376103, 726380, 1126874, 860463, 254287, -354515, -140825, 200889]
281D38796L36643k19432j92889O99754j74C20993e65508r33175L05821C79274
270G38568C54676N1582b47725p28043K48576b87516K4849l0409R8939C10723N37430
259H48153m19253L357L38258K77785J43229O2489J50997j28723n80935a10265
248c42764P8028O0888K9279k362m32596b51859B74602c26067p08628N10652A41924
236a98578m71081m80730q06070P68291A25270L88875A27624b54646D79840J058289
226A538129o86456c60923J46022F2615b6297j20044l85582l06837j15513c60828
215h4841k75586B88783Q21819C96930e35118K66308D11948d8739l70211k29466
205f48416j80316K53092A54608Q32788M55422D10940a122972d42313F19418B83074
$$ y = [438796, 775439, 556007, 363118, 1062872, 1062698, 320993, -565508, -1498683, -1192862, 379274, 738568, 354676, 406258, -247725, -975768, -727192, -287516, -262667, -293076, -194137, 310723, 848153, 428900, 432257, 770515, 1048300, 1191529, 1254018, 1405015, 1276292, 695357, -110265, -342764, -264736, -203848, -174569, -176931, -609527, -251859, 274602, -326067, -1034695, -524043, 141924, -198578, -669659, -1150389, -1956459, -1188168, 125270, 514145, 127624, -254646, 479840, 1538129, 851673, -360923, -214901, 62615, -26297, -146341, -531923, -838760, -954273, -360828, -84841, -360427, 288783, 1110602, 396930, -535118, -268810, 411948, -48739, -418950, -648416, -828732, -575640, 154608, 987396, 1442818, 410940, -1122972, -442313, 619418, 283074]
194B69569Q08969j93444m02578M3606B40478a89830o1976j29703J05274F13189
183A491263j85108D80642P0810q7551q0959K34520j85480j61237M6612J5678p9406
172B53629K13787J48116K12269J45438k89133j69139J85404C24086c2154G06183
161A535748m29886c02149o51738c52739i7011j789j12997K8171q0764K9786k71113
150e05717l66655b29486A150321P19619E20312a462833o35077J69875l34466L84447
140a878054h35130A33599J00403g97905j596627K03970e24262e6358r84684p41551
130a782593P56979a32949I3305A2006g4337E72504K63500l28169c05448o63256
120i68704K49325B46807Q73939k61569d49374j312136k77488h12925C09282c19462
$$ y = [269569, 1078538, 885094, 482516, 526122, 240478, -189830, -251806, -381509, -276235, 613189, 1491263, 1306155, 480642, 551452, 463901, 382942, 617462, 431982, 270745, 317357, 333035, 253629, 467416, 615532, 827801, 973239, 684106, 514967, 700371, 324086, -32154, 706183, 1535748, 1105862, -302149, -953887, -352739, -97011, -98800, -211797, -183626, -264390, -234604, -505717, -872372, -229486, 1150321, 1869940, 520312, -1462833, -2097910, -1928035, -2262501, -1878054, -835130, 133599, 234002, -797905, -2394532, -2190562, -524262, -56358, -1041042, -1782593, -1025614, -132949, 93305, 12006, -74337, 572504, 836004, 507835, -305448, -968704, -719379, 246807, 1120746, 859177, -449374, -1761510, -2038998, -812925, 309282, -319462]
109a367018l7947A162J022631E04981c50243o44607l96123O05129D31941O88364
99A120305j97278G5020J85318N58873L55437n36370e91747q56801P01661B34820
88c45539j210315j65902O58996K71413r9048m28343p28228m76923P43485e34789
77B74978L17583B54087L76893J004579j56747B84629K4705P14191k77673A18876
66a46345k46509k14672p20208l89998N85653d2589a7703k52435P0736G61979J161076
55A923055H62404a042568m89818e01054b01476O2403D00173J15136A36351c85007
44d51431j02439a45100N0904p30991o40573K39241M76932K48900n15199J74437
34h41449c07463n99715m08627f5639G22261b84970n81145D38912J209579R7769
$$ y = [-1367018, -1404965, 1162, 1023793, 504981, -350243, -994850, -1390973, -785844, 431941, 1120305, 923027, 75020, 260338, 819211, 1174648, 638278, -591747, -1448548, -746887, 234820, -345539, -1555854, -1721756, -1062760, -791347, -890395, -1318738, -2046966, -2523889, -1780404, -534789, 274978, 592561, 254087, 630980, 1635559, 1478812, 284629, 309334, 1023525, 745852, 118876, -146345, -392854, -607526, -1327734, -1717732, -1132079, -42589, -17703, -270138, -199402, 761979, 1923055, 862404, -1042568, -1532386, -501054, -201476, -139073, 400173, 515309, 136351, -385007, -451431, -553870, -145100, -94196, -825187, -1465760, -1226519, -749587, -500687, -1015886, -841449, -307463, -907178, -1315805, -65639, 722261, -284970, -866115, 438912, 1648491, 1746260]
24A746260o66291E13286j07080Q55834P34655k43945l02888l80943B31721b11563
13A19865L84940O1265L42756L96447j21386l64456k02947k8560A64356b06361
2C8525K82356M112
0C24993
$$ y = [1746260, 1079969, 513286, 406206, 1262040, 1996695, 1752750, 1449862, 1068919, 231721, -211563, 119865, 504805, 566070, 908826, 1305273, 1183887, 819431, 616484, 587924, 164356, -206361, 38525, 320881, 324993]
##PAGE= F1=3042.713576207
##FIRST=     18110.137220953, 5591.54909048506, 475750
##DATA TABLE= (F2++(Y..Y)), PROFILE
1023D75750B4871a67119B16614Q09669N99921J8842G51842c50304J31420C10740
1012B71257n4098L89965M81366n3563l55687D6903i33385k25659N16128b83475
1001c7634C9777c84129j37049J71375B14144Q38795M8342k30633k88859d2355
990b03901C75366J17936K52928B14302f80176j1128O2245o57599j25628R371K4243
979a378672b59259A251967J58916m62293k64403J6704j9740d7107j371288j22465
969a540860f08378J96907l37954L15077A31817a98051l65766k15783l72575e60309
958G51575P39789n09511c0166p74927J06973B69934N77234A86008f57697j16917
948g74614L28660q9281k72837P4959j82105m99340L22165A14144J422915M91749
$$ y = [475750, 24871, -167119, 216614, 1026283, 1626204, 1645046, 751842, -350304, -218884, 310740, 271257, 217159, 607124, 1088490, 1034927, 679240, 46903, -933385, -1159044, -642916, -283475, -37634, 39777, -384129, -521178, -349803, 214144, 1052939, 1101281, 870648, 581789, -42355, -203901, 375366, 493302, 746230, 214302, -680176, -691304, -629059, -1286658, -1412286, -1402915, -1378672, -259259, 1251967, 1410883, 948590, 684187, 700891, 681151, -47107, -1418395, -1540860, -608378, -411471, -749425, -434348, 131817, -198051, -563817, -779600, -1152175, -560309, 751575, 1491364, 981853, -30166, -805093, -698120, 269934, 847168, 186008, -657697, -774614, -445954, -535235, -808072, -733113, -915218, -1414558, -1092393, 114144, 1537059, 2028808]
938B028808o80767f2043j195740k0184c57679B95263K551h7080j59243A804O77648
927F79452L65258J1031L22624O52107k97798G22174b99009l83859l23935L78155
917f28648H54978L92151B39142K61294Q00573k88020C4128f15441J88477E746
906C10313C0241f0544B43535K29112B11927h41148j376623R4506R31143L27300
896h64822p63461K19432a47300G0185b33847j70389J81400k28574n57910m54951
886a464271L56961K47545j2157g8966E40531A89252d94067p62009k76454M88391
876a044139c29189m23941o22470N8215J8291l25189K40689c81912C50465j12791
866B37674b87435k70943O1003l32291O7277c79477B29159M24842k79784A41180
$$ y = [2028808, 1348041, -62043, -1257783, -1277967, -357679, 295263, 297814, -87080, -246323, 1804, 679452, 1044710, 1055741, 1378365, 2030472, 1732674, 722174, -299009, -682868, -1006803, -628648, 854978, 1247129, 239142, 500436, 1301009, 1012989, 34128, -615441, -426964, 5746, 310313, 30241, -60544, 243535, 472647, 211927, -841148, -2217771, -2123265, -1192122, -864822, -1628283, -1408851, -147300, 70185, -233847, -404236, -222836, -451410, -1009320, -1464271, -1107310, -859765, -871922, -78966, 540531, 189252, -494067, -1256076, -1532530, -1044139, -329189, -753130, -1375600, -1317385, -1299094, -1624283, -1383594, -381912, 350465, 237674, -287435, -558378, -497375, -829666, -762389, -379477, 229159, 654001, 374217, 141180]
855E02980J99651j89329o2792a04450p82323d36405I70071J119789q1931p31809
845A276120n94156B76229a72476p77706j74973d17502E68901K29381B32056a59201
834B83939J91282c40046o84617L33324h5555k77985j67725A58821K5975e82967
823g20624A13073L17746j87064M38017Q47608R7263m33535m83450D2416J15293
813A57709N0589L71106K69910K73975r4829B30753i06609l55906d16536E63206
802D40657g43202j499695o61681J000039B09116O40606B37037J17476M5706j11869
792B88350J75430J05614b63100n23141L52162F54033J284988M12928r34762A48243
781h37139l87212J50741a14966A104249J92292B30030h59435l45522d10903F54718
$$ y = [502980, 702631, 513302, 450510, -104450, -886773, -436405, 970071, 2089860, 2007929, 1276120, 681964, 276229, -172476, -950182, -1125155, -417502, 568901, 798282, 232056, -159201, 283939, 475221, -340046, -1024663, -691339, -85555, -363540, -531265, 158821, 184796, -582967, -720624, 113073, 430819, 243755, 681772, 1529380, 1626643, 1193108, 709658, 42416, 157709, 208298, 579404, 849314, 1123289, 1028460, 230753, -906609, -1262515, -416536, 563206, 440657, -743202, -2242897, -2904578, -1904539, 209116, 849722, 237037, 354513, 400219, 288350, 463780, 569394, -263100, -786241, -434079, 654033, 1939021, 2351949, 1417187, 148243, -837139, -1224351, -1073610, -114966, 1104249, 1296541, 230030, -859435, -1204957, -410903, 654718]
770G41290j3497K42020D53282f66729m96484L28844c43363R6937m12177K11499
760d47104E794N91668P3319f2026o33214o1032L02412N1110a08222C16181K27906
749E44087B31888g59360l68791N14580a48748E27957P49164l19530B16434f52769
738a831144P907G1720J142159o06184e4320n56331o10411l34528K49425c11785
727D63304K8970P117j27365B3858L89260O98011N7654k50660B938a162639d84309
715G50971B21212a92898A6770K17997l8780b46325n13372F11186J841618l32810
705B119994I67358C23059M80341L96675k21990l51773M49144R56981k21932G91337
694D32148O17666O73837j36980p77483C01719l6895O85673M07098m87473k60147
$$ y = [741290, 727793, 969813, 453282, -666729, -1163213, -834369, -343363, -246426, -658603, -447104, 5794, 597462, 670781, -62026, -695240, -756272, -453860, -402750, -108222, 316181, 544087, 231888, -759360, -1128151, -613571, -148748, 527957, 1277121, 957591, 216434, -652769, -1831144, -1823237, 71720, 1213879, 607695, -54320, -610651, -1221062, -1555590, -1306165, -311785, 463304, 492274, 499391, 372026, 23858, 413118, 1111129, 1168783, 918123, 2938, -1162639, -484309, 750971, 221212, -192898, 16770, 234767, 195987, -246325, -759697, 611186, 2452804, 2119994, 967358, 323059, 803400, 1200075, 978085, 626312, 1075456, 2032437, 1810505, 791337, 432148, 1049814, 1723651, 1586671, 809188, 301719, 264824, 950497, 1357595, 870122, 609975]
684F09975m9719a73303r20184l29540Q0754e0846A280193J15886k66953n9349
674A069777K762q9091J71131l65816K32742Q83283k44317p77604a52105r23533
664a075638M45502H37531J10424B93381d24422n55174j40751l27470n50357N81312
654a416862b613H38193R3516a73674j854377l95152g46676I06468J042836O44362
644B593666k2274o66663m31318m42705m81835k61488A06655c36413k75519a64959
633F38616K67047l4208k52933A39809J39735K67526B40746c57469q11585L3941
623a135113A685P88973l11207A17770N86639J004959P61387L09017j044299o37911
613A097562L86532O6521l85188Q4395n91742a052898n07169c88830D58078a06430
$$ y = [609975, 560256, -173303, -1093487, -1423027, -1342273, -50846, 1280193, 1396079, 1129126, 1069777, 1072539, 983448, 1154579, 788763, 1021505, 1904788, 1660471, 882867, -152105, -1075638, -630136, 837531, 947955, 293381, -424422, -979596, -1120347, -1447817, -1998174, -1416862, -2613, 838193, 931709, -173674, -2028051, -2423203, -746676, 906468, 1949304, 2593666, 2571392, 1904729, 1473411, 1030706, 548871, 287383, 106655, -336413, -611932, -164959, 638616, 905663, 871455, 618522, 139809, 279544, 547070, 240746, -357469, -1169054, -1135113, 1685, 790658, 479451, 117770, 704409, 1709368, 2470755, 2779772, 1735473, 1097562, 1484094, 1550615, 1165427, 1249822, 658080, -1052898, -1560067, -388830, 458078, -106430]
602a085023h4332A131884b70225k006010L66306b74277D15368K12347M64942D18738
591e62565p91885K5522d21627E45081j3991B60633j29531e62727k88955b55544
580A0c53557A18580P06533k08378j12374j05073a9062G7759J073179M67115D57973
568a034121d91572B80433q9503K22008N21952A90839a05334C95826N53378J27393
558A076597P0188n08323h69704n98383O42166C19153J36951J79B02939d55991
547d06795F96969J038542o1131d12004j349274L83964g5777E11776c27860q58913
537a186773j03639j04086K88412b89347A00356J80696N4566d59760j766441m94210
527b720411a257398N94341o47276j25408L06160N2314n51195n1861L61319M08916
$$ y = [-1085023, -84332, 1131884, -270225, -2276235, -1909929, -274277, 415368, 627715, 1092657, 418738, -562565, -1354450, -1328928, -421627, 545081, 531090, 260633, 131102, -562727, -851682, -255544, 10, -353557, 118580, 825113, 616735, 504361, 399288, -19062, 77759, 1150938, 1618053, 457973, -1034121, -491572, 280433, 190930, 412938, 934890, 190839, -105334, 395826, 949204, 1076597, 1146785, 638462, -869704, -1468087, -825921, 319153, 456104, 456283, 202939, -455991, -406795, 696969, 1735511, 1674380, -412004, -1761278, -1377314, -75777, 511776, -327860, -1186773, -1290412, -1394498, -1106086, -289347, 100356, 281052, 335618, -459760, -2226201, -2720411, -1257398, -663057, -1310333, -1435741, -1129581, -1077267, -1628462, -1680323, -1319004, -910088]
517i10088b82418I2551L7032c60412j284007n87882g16331B30614e46464j435854
507a982318J71959f04606D19559A51731a212622k98189e70584h3374B782e0607
496d91575p33135N1073M73015a68411A01636b23251r22937m4078e52228m04692
486i56920p37587k6787J35309k56878K62439g83597H5610e51742j084048P5310
476a560480o04869L3579N98479L78952O498k4034n86293j951648j824406L54365
466e179857K109743J070370r72006p97849J361325R81668o06725p67356l28432
457c129119k10976o44685J56607J285466J17373j417747n72206l25610q02922
448e543819m83457m86358J029359b407582f90386l42723j222638j321340j119539
$$ y = [-910088, -282418, 92551, 129583, -360412, -1644419, -2232301, -716331, 230614, -546464, -1982318, -1810359, -604606, 419559, 151731, -1212622, -1510811, -570584, -83374, 2782, -50607, -491575, -1224710, -1173637, -700622, -168411, 101636, -223251, -1146188, -1190266, -552228, -956920, -1694507, -1721294, -1585985, -1842863, -1580424, -783597, 85610, -551742, -1635790, -1560480, -2165349, -2131770, -1533291, -1154339, -1147841, -1171875, -1758168, -3709816, -5534222, -5179857, -3070114, -1999744, -2971750, -3769599, -2408274, -1426606, -2033331, -2800687, -3129119, -3340095, -3984780, -3828173, -2542707, -2425334, -3843081, -4415287, -4740897, -5543819, -6027276, -6513634, -5484275, -2407582, -690386, -1033109, -2255747, -3577087, -4696626]
439d696626n54694N22415J051908J80314o51884l27931L69557O60519j039811
430d486233j301776l67896P24178M79243p49394p98709j159790p87152r33108
421i380637j96087j54163n02986j84666m388592k415802j9727102p4554278l8400188
412a49904501f5941708B3832588Q334473j3508280l694884l460402j145267q63510
404I494718q40014j670458k363459n20744j053196o71550m55357k25909L06260
395B000291P29401P1395j55011M53107J24429j054836D62847b92561B36739L20498
385E57237k04351J75576B29351c18481j35153K16391j142900r94685L77632R17274
375a079922k59956o62432K0369M14280L07786j202401k593102r18291m06532k313516
$$ y = [-4696626, -5251320, -4728905, -3676997, -3496683, -4148567, -4476498, -4106941, -3446422, -4486233, -5788009, -6155905, -5431727, -4952484, -5701878, -6500587, -7660377, -8447529, -9380637, -9576724, -9730887, -10233873, -10418539, -14807131, -17222933, -36950035, -111504313, -149904501, -65941708, 23832588, 32167061, 18658781, 14963897, 11503495, 10358228, 9494718, 8654704, 6984246, 4620787, 4100043, 3046847, 2375297, 1919940, 1694031, 2000291, 2729692, 2801087, 2646076, 3099183, 3223612, 2168776, 462847, -292561, 236739, 557237, 352886, 528462, 229351, -318481, -453634, -237243, -1380143, -2374828, -1997196, -1079922, -1339878, -2002310, -1981941, -1567661, -1259875, -2462276, -5055378, -5973669, -6380201, -8693717]
365h693717k280293l271585m99176k0981538n6377080r908590b9587116B4136440
356B0460273o936480j57886j574273k217711j676554j40371r94974j706843j549944
347C505237o81027Q01536J531845j54851o50833j37555n51343q13964n31912j08915
337B208218J69773K02520L65900P80568K10775m42550n2179L4401k28082p9293
327C170051p77847H72887m20062O01642N51987n37276C80372J17569Q13309Q11258
317B122508N89367L94675m95057n48028o0671N61179P62630j79806k21467o96066
307B229264r54736n85345M13845M02584B43455a240684J03705b74249H16658N5268
297H71926d65822r67439M12237D96203N19892k86133l12261M3559Q60063O32389
$$ y = [-8693717, -10974010, -14245595, -14744771, -35726309, -92103389, -102011979, -29587116, 24136440, 20460273, 13523793, 13365907, 11791634, 9573923, 7897369, 7756998, 6762024, 5055181, 3505237, 2824210, 3625746, 5157591, 5002740, 4351907, 4214352, 3663009, 2849045, 2317133, 2208218, 2377991, 2580511, 2946411, 3726979, 3937754, 3495204, 3443025, 3477426, 3249344, 3170051, 2392204, 872887, 452825, 1054467, 1606454, 1069178, 380372, 497941, 1311250, 2122508, 2711875, 3106550, 2611493, 2063465, 2002794, 2563973, 3326603, 3146797, 2925330, 2229264, 1274528, 689183, 1103028, 1505612, 243455, -1240684, -1136979, -274249, 816658, 871926, -465822, -1433261, -1021024, 496203, 1016095, 729962, 417701, 461260, 1321323, 1953712]
287A953712l46360o57055D48696r6133J64548R4857M13219K66057L0504N03985
277A825733m10763E18681c22424o21806L43966E04684J02370B47617j6090a81028
266c55490G5228N58360K36032k48800j05116N91544O71659k32451n57195k0159
256I69102L7391J1968p488L38026K37152l41155n94217J22287K21204l84131Q8227
245F98366J63437A7874J6915M29441a10362o04158a36614D40409B06979i5559
234f46574q46217O84846B33122P6434a81976m67264B59915J340378m56523A82308
223B14566o0550b06607l02245n78876k87147q2140d23684E76511A62156l4844
213A27312M14704d28183q90435f30668B57853b23023n69875L6009b71017B65769
$$ y = [1953712, 1607352, 950297, 448696, 352563, 517111, 611968, 1025187, 1291244, 1321748, 1825733, 1414970, 518681, -322424, -944230, -600264, 504684, 607054, 247617, 231527, -181028, -355490, 75228, 633588, 869620, 620820, 515704, 1107248, 1778907, 1546456, 989261, 969102, 1006493, 1018461, 1010973, 1348999, 1586151, 1244996, 650779, 773066, 994270, 610139, 698366, 861803, 17874, 34789, 464230, -110362, -714520, -136614, 440409, 206979, -95559, -646574, -1492791, -807945, 233122, 309556, -181976, -649240, 259915, 1600293, 1143770, 182308, 214566, 154016, -206607, -508852, -1087728, -1374875, -1457015, -423684, 576511, 162156, 127312, 542016, -428183, -1318618, -630668, 257853, -223023, -792898, -756889, -271017, 265769]
202F71190L62462l0387G3787h32251b72241A55670c37948J62743G30593l5780
192F94813k44739l8383B9899c32345K3298j34338J00360D30916P63871l85124
182H09663a43349M941K8185c6996D53733J51475J08084J70440J95320k1473k53614
171H03965k64263o8420r7133H4176J11710M16279j64594a52600B07984O01472
161H09456j95155e35700m37551a94333A88605a74178l39506R0549J23671b6659
150d22741p51456e01956A160404P76514C33373a860422p33278K35866r3321L42588
140b108567a025720G5137L23312d46634j611347L7568c16144B49727i26501j114760
130b041261M84652f09792c04848n5446J49786G16032K59482D28876d32178m29860
$$ y = [671190, 1033652, 1003265, 73787, -832251, -272241, 155670, -337948, -175205, 730593, 694813, 450074, 411691, 29899, -332345, -309047, -443385, -343025, 430916, 1194787, 809663, -143349, -138408, -110223, -36996, 453733, 605208, 713292, 883732, 1079052, 1057579, 803965, 539702, 471282, 374149, 84176, 195886, 612165, 447571, -152600, 207984, 809456, 614301, -535700, -973251, -194333, 188605, -174178, -513684, -423135, -299464, -26659, -422741, -1174197, -501956, 1160404, 1936918, 333373, -1860422, -2593700, -2357834, -2451155, -2108567, -1025720, 75137, 398449, -446634, -2057981, -2020413, -316144, 249727, -926501, -2041261, -1556609, -609792, -304848, -360294, -210508, 716032, 975514, 428876, -432178, -862038]
120h62038a21305A003922L48200F06316i81006j099520m0694g50272D57916a07867
109a426369l35962e43063D05096b1177q88436r12445m07376Q45127e51G48803
98E05959e09051J72445E18184N70188m72539e51597q07647f43759B11829b99248
87a488803k86962M80983K54479k27678o51588p24500n24323O23375a112356i8865
76C64395C5586N09703Q93636l46486a21951I009O12029B92768b21157p2226l5778
65c29161o7494o84216o83392L26974d31606A52885Q4757G9130M82673R20656F04440
53a139968m01113d09933E8280e7863B98053K8294a32864o94422n1402b65342C49961
41a33962j172885l02078g24127a27841E1617g36876n0386L54255m97213o7387
$$ y = [-862038, -121305, 1003922, 1352122, 606316, -981006, -2080526, -2121220, -750272, 457916, -107867, -1426369, -1762331, -543063, 405096, -21177, -909613, -1822058, -2229434, -1384307, -551, 748803, 505959, -509051, -336606, 518184, 1088372, 615833, -551597, -1359244, -643759, 211829, -299248, -1488803, -1775765, -1294782, -1040303, -1267981, -1919569, -2644069, -3168392, -2545017, -1112356, -98865, 364395, 35586, 545289, 1438925, 1092439, -121951, 9009, 621038, 292768, -221157, -293383, -329161, -396655, -1080871, -1764263, -1437289, -431606, 152885, 237642, 79130, 561803, 1482459, 604440, -1139968, -1541081, -409933, 58280, -57863, 298053, 326347, -132864, -827286, -878688, -265342, 349961, -133962, -1306847, -1608925, -724127, -127841, 51617, -736876, -787262, -433007, -930220, -997607]
31i97607E65603O85495c92923r71973a8823A324356J25598l84339l43286j40333
21E81996N62792P82617K01433k37865o25798B45278c83021C0012R39566J64332
11A133910k6596K75838K01839l18133o15557j85987j57477o7344L36431Q8771
1F65695B55559
$$ y = [-997607, 565603, 1251098, -392923, -1364896, -18823, 1324356, 1449954, 1065615, 722329, 581996, 1144788, 1927405, 2128838, 1890973, 1265175, 245278, -383021, 30012, 969578, 1133910, 1107314, 1383152, 1584991, 1266858, 651301, 465314, 307837, 240493, 576924, 665695, 255559]
##PAGE= F1=3021.096038697
##FIRST=     18110.137220953, 5591.54909048506, 334011
##DATA TABLE= (F2++(Y..Y)), PROFILE
1023C34011b4548l2526C06848O80485M34795K8682n60404A57805K9071L94998
1013E81874O5866J5115K3864M3986p591j61641a2663p52218L9254g9669H711b10839
1000e52811n59511J78590c19191F20841J033175k02640o61089C93611A49027n0171
990I8856M16365R4917L71459k99803c52708m31495q6448n98520k01152j8991p8149
979a767463g10505A037092N23019j87762R6011o425k99427C28532a069062n27521
969a596583g69935b66881k58029j29004K48988j11637l0081j86313m05861e68494
958E13352N61235m39961g7321o06533O7340B75316P03406C78713e10399O2457
948d47942A26899a86381m71505J95876j40051q31951J47324D913J152553K53015
$$ y = [334011, -24548, -57074, 306848, 987333, 1422128, 1450810, 890406, 157805, 186876, 581874, 647740, 662855, 686719, 730705, 723114, 561473, -12663, -764881, -725627, -79669, 8711, -210839, -552811, -1112322, -933732, -319191, 620841, 1654016, 1451376, 790287, 393611, 149027, 98856, 515221, 610138, 981597, 681794, -352708, -784203, -870651, -1469171, -1670323, -1689314, -1767463, -710505, 1037092, 1560111, 1372349, 1468360, 1461935, 1162508, 328532, -1069062, -1596583, -769935, -266881, -524910, -653914, -404926, -516563, -546644, -732957, -1138818, -568494, 513352, 1074587, 634626, -77321, -683854, -616514, 275316, 978722, 378713, -510399, -447942, 126899, -186381, -657886, -462010, -602061, -1434012, -1286688, 4913, 1157466, 1410481]
938A410481n96129b89158j119893l35329N13089b84408D1075a4473B26235K24216
928D50451M12144K82592k77805O2617N73443l36536a02317p51585j39582j28788
918a122272N40946H17047L39790a16217G338J074838J33439D26576f76864m84233
908a161097J26820b37345f3654j17098h2454C84225J47373f99693j923483k18897
898b842073J046086N40547m57726M47400a11981c7665l72444j33964K13772p9032
888d09333m62634l25710M00216n6193l93368e36679B60198H3383e99836o59543
878a259379k62676K87343e46798j88127m54207J07211n1746n85386k82837P29207
868a272683d42486j83546n20948O9767K84252k69784J90935d17813A31467L02054
$$ y = [1410481, 814352, -289158, -1409051, -1744380, -1231291, -284408, 41075, -14473, 226235, 450451, 862595, 1145187, 867382, 929999, 1503442, 1166906, -102317, -853902, -993484, -1122272, -581326, 817047, 1156837, -116217, 7338, 1082176, 1215615, 426576, -676864, -1161097, -1034277, -237345, -63654, -180752, -82454, 384225, 531598, -699693, -2623176, -2842073, -1795987, -1255440, -1713166, -1265766, -111981, -37665, -410109, -544073, -330301, -409333, -871967, -1197677, -797461, -853654, -1247022, -536679, 260198, 83383, -599836, -1259379, -1522055, -1234712, -546798, -734925, -1189132, -1081921, -1133667, -1719053, -2001890, -1272683, -442486, -626032, -1146980, -1077213, -792961, -1062745, -871810, -417813, 131467, 433521]
858D33521H8072B9783N83590L02305k91296I7232g37646k67719c16685I62361
847A910725K48884k50094l45200n92684A67893a054046m34127d60352F49689J27640
837G77329A18992e3525D99193J66325a98965r24576P7618d55347n02548k38754
827a196649B6845N43601a21389k67560D56253L07692l18902L24536N58331k04534
817A123376m84606B35185b46965M9373A7089O45444K77805J75865K32929m52512
807H96620e03416p04916c08186I58472k9941f11553j811822l30888J292579C76050
796H63445B28980K11405J80723n6477K75205L28926D14181c28004J03585E80561
785B006910P45466j081416C6564g93381o6616J40617a83753F77520n521c27189
$$ y = [433521, 88072, 29783, 613373, 915678, 624382, 97232, -737646, -1005365, -316685, 962361, 1910725, 2159609, 1909515, 1564315, 971631, 167893, -1054046, -1488173, -460352, 649689, 777329, 118992, -53525, 499193, 665518, -198965, -1123541, -1045923, -455347, -957895, -1196649, 26845, 570446, -121389, -388949, 456253, 763945, 445043, 769579, 1327910, 1123376, 638770, 235185, -246965, -197592, 17089, 662533, 940338, 1116203, 1349132, 896620, -503416, -1208332, -308186, 958472, 928531, -611553, -2423375, -2754263, -1461684, 376050, 863445, 228980, 440385, 621108, 564631, 839836, 1168762, 414181, -328004, -224419, 580561, 2006910, 2752376, 1670960, 36564, -793381, -859997, -719380, -183753, 677520, 671999, -327189]
774a042793J52912A90647J001015j80335k60804J11055C25387c95780q7937J41884
764c41833j72752p1702J38045B40542K26471L45584q9291A6763c25348K8576h0312
752b0716G3105B8221J40516C9463h91206k28080d98832J87262E5885J049991j04502
741A001374e5792j150906p91597J7057e86493E46323j06071B09620i5937m34409
731e30346k45136j34061b70744E34558J56629R8960J90978l93978J44279M95516
721A226942l3420j94588C47279e64672A61151J210740m90310C45314K4053M7167
711D16534H9486c90815k47322E51218J444926l10573G75868B78837J49628j69688
701B58777p5318L09251P54880Q05533l33033q26955l00463M43000M05632L3879
$$ y = [-1042793, -889881, 190647, 1191662, 1011327, 750523, 861578, 325387, -395780, -483717, -341833, -514585, -586287, -448242, 240542, 467013, 812597, 723306, 16763, -325348, -296772, -80312, -20716, 73105, 28221, 168737, 39463, -891206, -1119286, -498832, -311570, 55885, 1105876, 1001374, -55792, -1206698, -1998295, -1981238, -586493, 546323, 440252, 209620, -95937, -530346, -775482, -909543, -270744, 534558, 691187, 790147, 981125, 587147, 731426, 1226942, 1193522, 998934, 347279, -564672, 161151, 1371891, 881581, 345314, 369367, 416534, 89486, -390815, -638137, 551218, 1996144, 1685571, 775868, 278837, 428465, 258777, 183459, 492710, 1247590, 2053123, 1720090, 893135, 592672, 1035672, 1441304, 1475183]
691A475183m84937C27343B5019Q38607Q12974l04414j72291N8579E81832g23047
680a550878k7982b50726A292939L78817k76705j58893J23064k03514J423j61953
670I95178K65497P53259m12540B72240d95258k55096b52146I44895K43893k16244
660I72544B91395e73224j44432p4963o35048N91370D66776O57903k37777a99330
649a880331m23724g93361G82736R57136O92967J07580o64338l25555r9239j32558
639A318729k17936C17386a066442m01596a75081H82538m9558m07770A67248a54801
628A55983P1702a55148j48789m71136j84433M45426b50830l6564h5740D77387
617A511754J231686M5472A024318D02965Q76900J89868l34781M0730n30824i33601
$$ y = [1475183, 990246, 327343, 25019, 863626, 1676600, 1372186, 1199895, 1258474, 581832, -723047, -1550878, -1578860, -250726, 1292939, 1671756, 1395051, 1236158, 1359222, 1155708, 1157131, 995178, 1260675, 2013934, 1601394, 272240, -495258, -750354, -252146, 944895, 1188788, 972544, 291395, -573224, -717656, -792619, -1427667, -836297, 466776, 1124679, 886902, -199330, -1880331, -2304055, -793361, 782736, 1739872, 2432839, 2540419, 1876081, 1550526, 1451287, 1318729, 1100793, 317386, -1066442, -1468038, -175081, 882538, 832980, 425210, 167248, -154801, 155983, 227685, -155148, -303937, -775073, -959506, -514080, -250830, -287394, -85740, 477387, 1511754, 2743440, 2788912, 1024318, 402965, 1279865, 1469733, 1134952, 1175682, 644858, -933601]
606a338754b32234F03262B18980f87778b11579E89305i44877k047559P04912d30960
595A30187J92622M39878a28024q71071l83416M68737a43231F26062j97624a55300
584b12063l2478a11228A19830a09104m27315B1375O56873p9167J47225p199C5381
572d53938C59852O84100B62495h40002L51066b5188q6373N3857C91951A42121
561C86048N80123L50312r0147k51590C37642i01381o81143N13358A21893K5060
551A46953c73697k95000q35732J62699A97830J253647k10287h48719j148472M25899
541a571292e71488a14821n04933o59633j71530j89156j02828L78267d88925B06993
530B94052c23133j250585n22889Q49461L815r87426k89702K39762m70920q14329
$$ y = [-1338754, -232234, 603262, 218980, -687778, -211579, 589305, -944877, -2992436, -2287524, -430960, 130187, 322809, 762687, -128024, -999095, -1382511, -913774, -143231, 626062, 428438, -155300, -212063, -244541, -111228, 119830, -109104, -536419, 21375, 678248, 599081, 746306, 739107, 35381, -453938, 359852, 1043952, 262495, -840002, -488936, -25188, -111561, -57704, 391951, 142121, 386048, 966171, 1316483, 1226336, 974746, 337642, -901381, -1582524, -1069166, 121893, 146953, -373697, -668697, -1504429, -1341730, 197830, 1451477, 1241190, -848719, -1997191, -1571292, -571488, -114821, -619754, -1279387, -1450917, -1640073, -1742901, -1364634, -488925, 206993, 294052, -323133, -1573718, -2096607, -1247146, -1243331, -2230757, -2520459, -2280697, -2751617, -3565946]
520c565946R29238Q99794M58814N07976K02283j13014k51048r64561n14958g35374
509I4895a089865j981717l53416J309994g28001k46669j329626L31488e54886
499E5468j00a63272q87443j513813l34714O53167P77974M17881K18747l27360
489a158833k88730j91064o00841k41205M36710M1682p85072k75267M36324J135250
479a491046m98337j633606o09712O83413N76444N35181K03594k6083j70193p45584
469c175929j638359j787080j34915K116040N77605j254441l55690J662835Q83896
460c106038j58345p94612o75496n70733m95769L57161J529498K14660j377478
451e077152n51658n61865j210816k32104K53918R57079K591061J347506l2402
$$ y = [-3565946, -2636708, -1736914, -1278100, -770124, -567841, -680855, -931903, -1896464, -2411422, -735374, 94895, -1089865, -3071582, -3424998, -2115004, -728001, -974670, -2304296, -1972808, -554886, 55468, 55368, -163272, -1050715, -2564528, -2899242, -2246075, -1468101, -1050220, -831473, -1158833, -1447563, -1638627, -2239468, -2480673, -2043963, -2002281, -2787353, -3062620, -2626296, -1491046, -1989383, -3622989, -4232701, -3549288, -2972844, -2437663, -2234069, -2260152, -2430345, -3175929, -4814288, -6601368, -6736283, -4620243, -4042638, -5297079, -5652769, -3989934, -3106038, -3264383, -4058995, -4734491, -5305224, -5800993, -5443832, -3914334, -3699674, -5077152, -5628810, -6190675, -7401491, -7633595, -7379677, -6422598, -3831537, -2484031, -2516433]
442b516433q76277j028940r98827n34065j3547J18927n952l03360O662O7210j59307
431f243909j860261j602702J03209R84652N19230j441382j625140j436700j029480
422a3632483k457488r88400n16391k126114k497901q859682m626777m2704730
414g8409966j58049433q0854228a40183892D3352540J4915917k7977073o055583
407B4235801o415029k277376j782292j581900j983368k412625m98248j377490
399E907473j263217r48910k31217K97567N29982J7870m6627Q15466q1045j608259
389C389083A498105E61166L13973J90872n08947P2448j45029a02372A26751L02249
379D29000h81978j728169j00890J136218K82651p69135l57350K85790m6749j516666
$$ y = [-2516433, -3392710, -4421650, -5420477, -5954542, -5968089, -5849162, -5855114, -6158474, -6151812, -6084602, -6243909, -8104170, -9706872, -9603663, -8619011, -8099781, -9541163, -11166303, -12603003, -13632483, -16089971, -17078371, -17594762, -19720876, -22218777, -31078459, -35705236, -78409966, -236459399, -317313627, -140183892, 43352540, 58268457, 30291384, 24235801, 17820772, 15543396, 13761104, 12179204, 10195836, 7783211, 7284963, 5907473, 4644256, 3695346, 3464129, 3761696, 4291678, 4309548, 4262921, 5078387, 4997342, 3389083, 1498105, 561166, 875139, 1066011, 557064, 629512, 484483, -102372, 126751, 429000, -881978, -2610147, -2711037, -1574819, -1292168, -2061303, -2418653, -2132863, -2179612, -3696278]
369c696278k216128j286187j698745k852971k306709n256127k387402l8077531
361e9778078j00033264j8633578e0722541D3625338n772115j3652288k532649
354B1668286l508087j889267k510389p78191j482586k420508k542503j202810
346E333945J119405J624987l21642p68245m82779p29015p84113M08006o3589j107830
336D229130m88127M21706R83401J57372l83248l21039K62074O8863j47643j321018
326C461471A622807m78173O21292N55884m45197n94014L7855R29871Q58113K95398
316C403836L80856m967k93702m52060M13419J125332J9012m14458j232175j331213
306A613880m38031O72677M74907q91032g3909q8856A044544J150210p06257B23010
$$ y = [-3696278, -5912406, -7198593, -8897338, -11750309, -14057018, -19313145, -21700547, -59778078, -159811342, -178444920, -50722541, 43625338, 37853223, 24200935, 21668286, 18160199, 16270932, 13760543, 12982352, 11499766, 9079258, 6536755, 5333945, 6453350, 8078337, 7756695, 6988450, 6505671, 5776656, 4992543, 5400549, 5336960, 4229130, 3741003, 4162709, 5146110, 5303482, 4920234, 4599195, 4861269, 4930132, 4782489, 3461471, 1622807, 1144634, 1765926, 2321810, 1876613, 1282599, 1320454, 2250325, 3108438, 3403836, 3784692, 3779725, 3486023, 3033963, 3447382, 4572714, 4591726, 4177268, 2945093, 1613880, 1175849, 1848526, 2323433, 1432401, -73909, -162765, 1044544, 2194754, 1488497, 223010]
295C31192J049911R01902J23742j034680C58727j79077J267744R62144j73952
286B235586m68976l24243o12151j40979q1503N04436R00701M02679P8219q31111
276A662658G51355B78968C5944J38668K23199j77664k2774O8668h4352b7391D54118
264A091555M95888j91371k69409L50397M54938Q2693p15311l02315k04229k39904
254E52932j44259N35891O57842q3338l32602M34621O16285m10831l0631k50902
244A545008D33790A46583L61935B32425g6227D77480L04332j20183j81123b91637
233i56318b43689D23252A82343d81447o23286a19261A442877j85560D63327j72112
223B91215A05677d44506n22785n48779j33609Q6794b37699A167606n77850A6118
$$ y = [331192, 1381103, 2283005, 2406747, 1372067, 358727, 179650, 1447394, 2409538, 2235586, 1766610, 1442367, 830216, 689237, 607734, 1112170, 2012871, 2415550, 2493769, 1662658, 751355, 278968, 35944, 174612, 397811, 220147, 197373, 266041, -84352, -27391, 454118, 1091555, 1587443, 1396072, 1126663, 1477060, 1931998, 2014691, 1299380, 997065, 792836, 552932, 408673, 944564, 1602406, 1519068, 1186466, 1621087, 2237372, 1826541, 1795910, 1545008, 433790, 146583, 508518, 232425, -76227, 477480, 781812, 661629, 480506, -291637, -956318, -243689, 423252, 182343, -481447, -1104733, -119261, 1442877, 1257317, 463327, 291215, 105677, -444506, -967291, -1516070, -1649679, -1562885, -237699, 1167606, 589756, 16118]
212c2072j167502o68432Q95842a96076n00922n53507M10647B14464O60866N8732
202I34062j10585B35213d71617j22545b40380k61969n33630M47698C73220J20199
192D93419q9142j68017c99957l76011J50989p7755J07479a2795E53017H6781g77801
180h75303J48622L10670B46488L43281K65549L09254M52551J24750p08856C31499
169c457k86043j56373a02029D02955J39845a09104j87904J27343g5230p03007
159g78237k35127a19264C97936b42941n42206J24242a95522B39627b58516j038083
149a296599N43483I54760P30742E0129b039298n86206M20627J74397J88468Q04692
139a037320a88505C31135a03933j235152j51545a80699A81580i22403j160063
$$ y = [-32072, -1199574, -1868006, -972164, -196076, -696998, -1250505, -839858, 214464, 875330, 934062, 823477, 235213, -471617, -594162, -240380, -502349, -1035979, -588281, 373220, 493419, 404277, 236260, -399957, -775968, -624979, -702734, -595255, -12795, 553017, 86781, -777801, -875303, -726681, -416011, 246488, 589769, 855318, 1164572, 1617123, 1741873, 1033017, 331499, -3457, -289500, -445873, -102029, 402955, 542800, -109104, -297008, -169665, -75230, -778237, -1013364, -119264, 397936, -242941, -785147, -660905, -195522, 239627, -258516, -1296599, -753116, 954760, 1685502, 50129, -2039298, -2625504, -2204877, -2030480, -1842012, -1037320, -188505, 331135, -103933, -1339085, -1490630, -180699, 181580, -922403, -2082466]
130b082466J11195P58940L48079J50364a58855I60547J20553C07825d81513j88525
120f70038E41266J248179j92681C46391a388179q77958J58174e94898F48963C06138
109a126369p42394Q39829b52223l81017q99229j021356l39748R69481d83830C15295
98G5484i86123K6132A3746O54600B28965g59568o26008e86476A13962a86838q81617
87a068455m04266N5898J93386k03195o95287o98191o10752M45082a422544b23283
76C13284A18510N01375M74370E01439f04883K3695a42454k13026k53603J40107
66d68976b06423b2510m52913q47242l9886O30503A05561M98476k02832n3400N81034
55I28839m42416h38275r4808A14934M39801B54789Q9333A68652d36417q36887
$$ y = [-2082466, -1971271, -1212331, -864252, -713888, -158855, 960547, 1081100, 307825, -481513, -670038, 541266, 1789445, 1596764, 346391, -1388179, -2266137, -2107963, -594898, 648963, 306138, -1126369, -1868763, -1028934, -252223, -633240, -1532469, -2553825, -2893573, -1924092, -483830, 315295, 75484, -986123, -959991, 13746, 668346, 228965, -759568, -1385576, -586476, 113962, -186838, -1068455, -1472721, -1416823, -1223437, -1426632, -2121919, -2820110, -3430862, -2985780, -1422544, -223283, 313284, 118510, 619885, 1094255, 501439, -604883, -581188, -142454, -355480, -609083, -468976, -206423, -22510, -475423, -1322665, -1362551, -732048, 105561, 604037, 401205, 347805, 928839, 486423, -838275, -933083, 114934, 554735, 254789, 344122, 168652, -436417, -1273304]
45a273304l2601f3138G95751a44962j358413P5765h3352F98776n2600c83693l85844
34g69537J05421k40785L83035A223108N96262b43698j368560d95848G59926K5493
24G85419j00979L4981p7210K24736O19435M59009j18886o82157A12034f56816
13a97444A164403L51132l59271R8115M26240k33293E96196k33695J55157K16884
3G34542L32567j67908A35708
$$ y = [-1273304, -1305905, -63138, 795751, -144962, -1503375, -1427610, -83352, 698776, 646176, -383693, -769537, -664116, -904901, -521866, 1223108, 1819370, -243698, -1612258, -495848, 759926, 785419, 684440, 719421, 642211, 866947, 1486382, 1945391, 1826505, 1144348, 112034, -656816, -197444, 1164403, 1515535, 1156264, 1254379, 1680619, 1447326, 596196, 362501, 517658, 734542, 1067109, 899201, 135708]
##PAGE= F1=2999.478501186
##FIRST=     18110.137220953, 5591.54909048506, 129988
##DATA TABLE= (F2++(Y..Y)), PROFILE
1023A29988a03932c0613B95374N76837L32626N2218l05225D40923j22944L13883
1013F31862K65986j86l60176A22662P6517R5632b40843m24514b25423D74574B35503
1001d06048o63293m10415N56900a16119H97229J061373k79665H01837B86243p3993
991B12250N4461L75601J60373L46923j89239d7467o62435k23268m50206j38215
981a521591k5605j17252P27979E63780P18838J29517M76533R9518m30272G74315
970d66031r64569M45966b49710J8943m44230j18301N180J35324j68391l23571
960a144756e29003C79054K57989A13516c50476k65388J48474B23326O23146C86044
949b72669b0248F81945A92210d20701e4367A4573i49488j28682b2107F34997n1196
$$ y = [129988, -103932, -30613, 295374, 872211, 1204837, 1257055, 951830, 440923, 317979, 631862, 897848, 897662, 537486, 122662, 199179, 294811, -240843, -665357, -225423, 474574, 235503, -406048, -1069341, -1479756, -922856, -116119, 897229, 1958602, 1678937, 801837, 286243, 212250, 266711, 642312, 802685, 1149608, 960369, -47467, -709902, -933170, -1383376, -1521591, -1547196, -1664448, -936469, 563780, 1282618, 1412135, 1888668, 1988186, 1557914, 774315, -466031, -1430600, -984634, -249710, -230767, -674997, -793298, -788118, -652794, -821185, -1144756, -529003, 379054, 637043, 113516, -350476, -615864, -467390, 223326, 846472, 386044, -272669, -20248, 681945, 192210, -420701, -54367, 14573, -949488, -1078170, -22107, 634997, 583801]
938E83801B06003d03310q13115o01474J61869f16654i7174B09329O71272L8323
928I18924k6637J20486m63791j78777M94562k28776h44724m39563J48856N4458
918a080973d93505E93553J54674f74204L1352F38907O78196l62844d04532r34337
908a338869q6823e31962a29571j21168J0549C69771L64363e14096k158725n36861
898c209682J166179Q77626j25404M35482G8969M7959a67858j51261J17502K1708
888a79909l15557k00343K83757l46104n17364e16992C43612l5969c96084o39125
878a035209k89081K3008O09338P2712k25067J43484j33670q00751p32742M35090
868a932888Q92376l57031o03321L79436N41740j71531J98768M56512g9526B49495
$$ y = [583801, 206003, -403310, -1216425, -1817899, -1656030, -616654, -97174, 209329, 880601, 918924, 892287, 1012773, 548982, 370205, 864767, 635991, -844724, -1284287, -1135431, -1080973, -493505, 593553, 748227, -674204, -642852, 638907, 1317103, 954259, -404532, -1338869, -1425692, -531962, -129571, -250739, -240190, 369771, 734134, -514096, -2672821, -3209682, -2043503, -1165877, -1291281, -855799, 78969, 126928, -167858, -319119, -201617, -179909, -495466, -695809, -412052, -758156, -1275520, -516992, 343612, 307643, -396084, -1035209, -1324290, -1301282, -691944, -619232, -844299, -700815, -834485, -1635236, -2367978, -1932888, -1040512, -1397543, -2000864, -1621428, -1079688, -1251219, -1052451, -595939, -79526, 249495]
857c1235N947E12963K37100j83129a93418q47279L05903I7190R13609N78311N49347
846B138457K66531j61273o41546G75454f64405p55605b15805I66519j48117a0677
835F0497N38545J200i1181r74253r2213N63146o98852l09676c0998A076482m26515
824F49967B86260P12403J42390E17860R9874L76428l22507A50795a54328l38694
814d93022l1634E0660P74547J94593j00085L68754p9679h2955q58053a68347A100063
802A156134e37841j777486J49566g14134D54763J65869A8286K63998L92562J64212
792H39058L67828L96599o19583A44947c4272C75768J448957R86653j204356c39311
781h50918L51380O7744Q5569A94424D3345f46520j29416b78827G58062P09688
$$ y = [-31235, -25288, 512963, 750063, 566934, -193418, -1040697, -734794, 97190, 1010799, 1589110, 2138457, 2404988, 2243715, 1602169, 775454, -664405, -1420010, -215805, 966519, 818402, -10677, 60497, 599042, 600242, -91181, -1065434, -1157647, -594501, -1293353, -1603029, -30998, 1076482, 649967, 286260, 998663, 1141053, 517860, 617734, 994162, 671655, 150795, -154328, -493022, -524656, 50660, 825207, 1019800, 919715, 1288469, 1208790, -82955, -941008, -168347, 1100063, 1156134, -537841, -2315327, -2165761, -714134, 454763, 620632, 18286, 282284, 674846, 839058, 1206886, 1603485, 983902, 144947, -34272, 375768, 1824725, 2811378, 1607022, -339311, -850918, -499538, -431794, -346225, 194424, 43345, -646520, -775936, -278827, 758062, 1467750]
771A467750m63760m80173l921A25669i3719A96743m3407d63600r2203A79358Q76659
760A056017j45691N4650j33118C18861j00672P2888J36238O0187B25506c57258
749d32367m4211o84876K1701d42313l2758N4956H06123J55348b34781j205221
739a440002l86570p1890O51292b13907D08569J84993j85010H8714a15762l05449
729d21211a57172E38041J09125R6756M81263l25509J3030J94409l05382k2160
719G79573j54426d802F50510J141856l95245o94953j82985l9354a3435l21556
709c34991i1336G28312O14315l59653D83301A68962f0074n97594R3921C96007
698A417581N34732l94058n94106l08795J69317J36993J85843k22512C41624D5007
$$ y = [1467750, 1003990, 523817, 519896, 125669, -93719, 196743, 153336, -463600, -555803, 179358, 1056017, 910326, 964976, 831858, 318861, 218189, 291077, 427315, 487502, 225506, -357258, -432367, -476578, -1161454, -1139753, -442313, -475071, -420115, 806123, 961471, -234781, -1440002, -1826572, -1898462, -1247170, -213907, 408569, 593562, 408552, 88714, -115762, -421211, -157172, 538041, 647166, 743922, 1225185, 899676, 912706, 1107115, 801733, 779573, 625147, -4802, 650510, 1792366, 1397121, 702168, 519183, 479829, -13435, -334991, -91336, 728312, 1342627, 982974, 483301, 168962, -60074, -657668, -563747, 396007, 1417581, 1952313, 1558255, 964149, 655354, 824671, 961664, 1147507, 924995, 341624, 45007]
687F52073R76918l8040q4373R8710n39846c17856j210734j49548c60305A321543
676A878978k34965j22109K55607o32768m68755M7820L89392O35346m95314b89276
665f21582a58800C92000P41765J46780M5916o08812b91410p9180a46601m43864
655e90465a37418F61155K72178D27207c91849j159354m27260i60638B54136Q92339
645A146475Q27687J50895o78586k74376K57582K88221l0699E04137a562670p01704
635b264374c85547A025111l19972a35918l52938m0157i9037j84605l98823c06726
624c24156l21032k39625l03106N5365e37846a71005G69552J697085M189E87150
613C3536P86650O8606j64364K05160l74185g84755l82918b44624E33456o2214
$$ y = [652073, 1628991, 1590951, 1506578, 1605288, 1065442, -317856, -1528590, -1678138, -360305, 1321543, 1878978, 1644013, 1521904, 1777511, 1144743, 675988, 723808, 1113200, 1748546, 1253232, -289276, -621582, -158800, 392000, 1133765, 1280545, 1326461, 717649, -291410, -370590, -146601, -590465, -137418, 661155, 933333, 427207, -391849, -1551203, -1978463, -960638, 254136, 1146475, 1974162, 2125057, 1446471, 1172095, 1429677, 1717898, 1687199, 504137, -1562670, -2264374, -385547, 1025111, 705139, -135918, -488856, -529013, -99037, -283642, -682465, -306726, -324156, -645188, -884813, -1187919, -1132554, -537846, -171005, 769552, 2466637, 2470826, 587150, 33536, 820186, 888792, 724428, 929588, 555403, -784755, -1167673, -244624, 533456, 471242]
603D71242a92937p6988G1696a316477j857563R71803d45428a25567A5748L69019
593C84767d94423p03687M9071c70037I1544M38860k43388d14050j11950a4570
582E49018j77371b72440l30731h29E31796p1644K67957J32968A45422g52820c24629
570B73544f9318m78590R6529J11817J21243j2672j5127f5254G33920O80902J49289
559A564111l80920E18180b53617p71374n19501M49613b10474q9401p78366k56872
549a335113p65721K73942c87343G49110l30330a205642p02498L72221N83372L80474
539e72073j51150m44145k46317k24641l42915M6671g39486C10784N4517c1118
528g67920n15528L50856l92408j274810n73089M8252r06774n73951J671203J068861
$$ y = [471242, -192937, -269925, 71696, -1316477, -3174040, -2202237, -445428, -125567, 15748, 384767, -494423, -1198110, -1149039, -370037, 91544, 530404, 287016, -414050, -526000, -14570, 549018, 371647, -272440, -603171, -829, 531796, 460152, 728109, 861077, 145422, -752820, -324629, 273544, -69318, -547908, -451379, -339562, -218319, -230991, -246118, -65254, 733920, 1414822, 1564111, 1183191, 518180, -253617, -1024991, -1544492, -1094879, -210474, -299875, -1078241, -1335113, -2100834, -1826892, -387343, 749110, 418780, -1205642, -1908140, -1535919, -952547, -572073, -723223, -1167368, -1413685, -1638326, -1981241, -1934570, -739486, 310784, 365301, -31118, -767920, -1283448, -932592, -1325000, -2599810, -3172899, -3124647, -4031421, -4605372, -2934169, -1865308]
518a865308K38677K56234R0059j581J16288o67876o29783a026204b99069j292446
508a591515k016906n87229J299651J407995l20961j143227O65034g50874a0061
498D4271a40018r98647k092088q37548P10874R58553N40067O48814K86983m88623
488a411633q45058p34759Q9053P72820M5466j071648p45777J16746J193016k60369
478b852143j709976q17327J400448P63174J92375j88746R8699O1190o04789j183048
468d840143j378430m16420J567370j34587j450552L19589J845247P38514J86824
459c562588n49560q18119r18436m38316M84683J617813L67277j246964o68618
450e732828q60166j245384K21424P95544O08263J617468R09384K39139n09724
$$ y = [-1865308, -1626631, -1370397, -1280338, -1281919, -1165631, -1833507, -2463290, -1026204, -299069, -1591515, -3608421, -4195650, -2895999, -1488004, -1808965, -2952192, -2287158, -750874, -10061, 44271, -140018, -1138665, -3230753, -4068301, -3357427, -2398874, -1858807, -1209993, -923010, -1411633, -2256691, -2991450, -2902397, -2129577, -2084111, -3155759, -3901536, -3784790, -2591774, -2852143, -4562119, -5379446, -3978998, -3215824, -3023449, -3212195, -3113496, -3052306, -3657095, -4840143, -6218573, -6634993, -5067623, -5202210, -6652762, -6333173, -4487926, -3749412, -3562588, -4112148, -4930267, -5848703, -6287019, -5802336, -4184523, -3817246, -5064210, -5732828, -6592994, -7838378, -7616954, -6821410, -6213147, -4595679, -3686295, -3447156, -3956880]
441c956880n80496q30403n78718l39606n10445L9272J80749o0104m73993j181712
431h292336k313713j672743L31050R74892K91959j778064j772004j284367j419510
422a6934836l271821j797080j839019m106917m264683j2551633n461202n7900736
414a08127927k16231034j11536595a94121479E6455717J8583136l7093834p109854
407C0835165q598965l291092k383444j957070j726240j351973N37548j930519
399A0133410l353693j745682q124L34267m9338l03689K60614J369653k26795j956783
389D453840j929644j174002J8423J54499o04842k17555j87415f7917F28827L79370
379A008197b20477k104345o69443J188449P51990o41346o00570K24571m13076
$$ y = [-3956880, -4537376, -5367779, -5946497, -6286103, -6796548, -6757276, -6576527, -6636631, -7110624, -8292336, -10606049, -12278792, -11947742, -10972850, -10680891, -12458955, -14230959, -15515326, -16934836, -20206657, -22003737, -23842756, -27949673, -32214356, -44765989, -50227191, -108127927, -324358961, -435895556, -194121479, 56455717, 75038853, 37945019, 30835165, 22236200, 18945108, 16561664, 14604594, 12878354, 11526381, 12063929, 10133410, 6779717, 5034035, 5025911, 5360178, 5310840, 5007151, 5267765, 6637418, 6410623, 4453840, 2524196, 1350194, 1368617, 1523116, 918274, 700719, 513304, -67917, 628827, 1008197, -220477, -2324822, -2994265, -1805816, -1053826, -1695172, -2295742, -2071171, -2484247]
370b484247j656811j766129j556550k614659k701219j618455n865896l393329
362b3657295m6275783j21864973k3817194f1204256E4066555o222225j8675426
355B9168904m491191m240118r58427l163950j564670r67528k043925k525317j497639
346G716139P92138Q56060m20621q84983n46492m76518m81303Q45800k0020j759208
336E620992r79346K35853P30360L13363o519n24769L00095K75008l39024j592045
326D033968j748231l44273O21804L08033l69660k42614Q193R53141O49461j27298
316C742524K35774N71559R274p33715J07534J228225J97148p26600j416042j462210
306A753471l67381P79503O59772k81503j145133l10337J096076P56913j130322
$$ y = [-2484247, -4141058, -5907187, -7463737, -10078396, -12779615, -14398070, -20263966, -23657295, -69933078, -191798051, -215615245, -61204256, 54066555, 47844330, 29168904, 24677713, 20437595, 19479168, 16315218, 14750548, 13783020, 11739095, 9213778, 7716139, 8508277, 9364337, 8943716, 8058733, 7512241, 7035723, 6554420, 7400220, 7380200, 5620992, 4641646, 4877499, 5607859, 5921222, 5914703, 5389934, 5690029, 5965037, 5626013, 4033968, 2285737, 1941464, 2563268, 2871301, 2501641, 2259027, 2267220, 3220361, 3869822, 3742524, 3978298, 4549857, 4559131, 3825416, 3932950, 5161175, 5358323, 4631723, 3215681, 1753471, 1386090, 2165593, 2825365, 2543862, 1398729, 1088392, 2184468, 2941381, 1811059]
297A811059F31918P88496J711653K66158k21959j295128C00646b27841A149165
287B366112K07037m7526j92717j073427m20108k24253N30902J425570Q29701l50139
277C051152j153361p75193J65746J36536l29088B41387a72506C72823L28980B10273
266F9200L95342O78612O60536P6002k94805j09437j9963K78333m85331m45394
256H03095l13279D5542b18583D42843R64859J18128j05071O27121J065657l7930
246C075607l14895r88836F37144A87869L39346K30886J37837M03113k1455l436
236A274160j76269D0404b80245E86955K72347B96035e85376p00207c01943A320045
225A373420F05843A34725h5447o52788o35258k07912J37470K70737A73295J355638
$$ y = [1811059, 631918, 1420414, 3132067, 3398225, 3176266, 1881138, 300646, -227841, 1149165, 2366112, 2573149, 2525623, 2332906, 1259479, 839371, 615118, 1146020, 2571590, 3401291, 3051152, 1897791, 1122598, 1288344, 1424880, 1095792, 241387, -172506, 372823, 701803, 210273, 69200, 464542, 1143154, 1803690, 1879692, 1584887, 1475450, 1455487, 1733820, 1248489, 803095, 489816, 45542, -218583, 442843, 1407702, 1525830, 1420759, 2047880, 3113537, 3075607, 2760712, 1771876, 637144, 187869, 527215, 758101, 895938, 1299051, 1277596, 1274160, 1097891, 40404, -280245, 586955, 859302, 296035, -585376, -1285583, -301943, 1320045, 1373420, 605843, 134725, -85447, -738235, -1373493, -1581405, -1443935, -1173198, 173295, 1528933]
215A528933o80967D2361c82139j198920l46237Q40887M86360n15947l78991P26865
205g68122E31915N84882j36586m15137d81218m81388d72627J21274p65515l96227
195a513095f81197C41858J92678l9510A70892g82573m61364L01153P1983R2064
185g78737L13184i7817l23281o35772k41983K01213e28041B36273L46785K46505
175H29563M23696O80252K01033j003460A66802b84389m19453m7734c56302F3243
164D88923G0775f22868m37453L40406j48970m1248D0821N50208b03940p21373
154i25313J48078A14849M83498c3890j178298L37802F90906O30079a36768j731382
144a868150k49583O83756L81160J9036K84561K60442A02042J18428c43986k83718
$$ y = [1528933, 847966, 42361, -382139, -1581059, -1927296, -1086409, -600049, -1115996, -1494987, -768122, 531915, 1116797, 980211, 565074, -481218, -962606, -472627, -351353, -1116868, -1513095, -681197, 341858, 534536, 495026, 170892, -782573, -1243937, -942784, -870801, -778737, -465553, -97817, -421098, -1056870, -1298853, -1097640, -528041, 236273, 583058, 829563, 1253259, 1933511, 2134544, 1131084, 166802, -284389, -703842, -751576, -356302, 63243, 488923, 70775, -622868, -1060321, -719915, -868885, -910133, 40821, 591029, -203940, -925313, -777235, 114849, 598347, -33890, -1212188, -874386, 690906, 1320985, -136768, -1868150, -2117733, -1433977, -1052817, -1033781, -749220, -488778, 102042, 220470, -343986, -627704]
134f27704d9587p9149p61898q73843k47458L98153L53734M74024A89161J114480
124A303641j54771B13211d04588L9486A166185J316276n42842B51455a512537
114b234438L15822b92340I37691p4231d77186j109736L82013N43022m28455r05625
104a995967r36297j78795R90451g59527A2045b22863j034930j87727e00216A74728
93b48618p79775l94530e85568g7727l7865l17770m13133n00698Q9536J1744n30362
82a776275o50963p24294J94649a424037h8901D86693P0314M19682n7969H6146
71h47466k69965J98527J671Q8460K92425e3408C89919q9097d66301m30547O5962
60h30886a28636G77887n0256B00848K49877O4945c00134c134H80047K03436l89393
$$ y = [-627704, -49587, -128736, -890634, -1764477, -2011935, -1613782, -1260048, -786024, 189161, 1303641, 1148870, 213211, -404588, -365102, 1166185, 2482461, 1939619, 251455, -1512537, -2234438, -1918616, -292340, 937691, 863460, -477186, -1586922, -1204909, -661887, -1090342, -1995967, -2932264, -3111059, -2120608, -759527, 12045, -222863, -1257793, -1445520, -500216, 174728, -248618, -1028393, -1422923, -585568, -77727, -115592, -433362, -846495, -1347193, -1257657, -1245913, -1776275, -2427238, -3151532, -2956883, -1424037, -88901, 486693, 557007, 976689, 918720, 86146, -847466, -1117431, -918904, -917233, -828773, -536348, -53408, 389919, 300822, -466301, -896848, -830886, -128636, 777887, 727631, 200848, 450725, 515670, -300134, -3134, 880047, 1083483, 694090]
49F94090j16503A35549f83597r16673Q1032E9994R86234a24459j187329L74085
39i37703E22373R35778l33082C8348f92932j93228L6175a12021A623308O05854
29B229162A28198a538701P02427A45899a9954B4644M32113N9708n2683L55201
19H18983N30077Q0995n33348d4054q66671M46717A071001N96789n20670q2003
9A065117M53155j82974D69352j91192L76529M03502K66134l69265d639
$$ y = [694090, 577587, 135549, -683597, -1600270, -1519238, 59994, 1046228, -124459, -1311788, -937703, 522373, 1458151, 1125069, 38348, -692932, -886160, -849985, -112021, 1623308, 2229162, 128198, -1538701, -836274, 145899, -19954, 24644, 456757, 516465, 463782, 818983, 1349060, 1430055, 896707, -44054, -910725, -464008, 1071001, 1667790, 1147120, 1065117, 1518272, 1335298, 469352, 278160, 654689, 1058191, 1324325, 955060, -4639]
##PAGE= F1=2977.860963676
##FIRST=     18110.137220953, 5591.54909048506, 38464
##DATA TABLE= (F2++(Y..Y)), PROFILE
1023C8464g8247D3160K74161N08852K81527M5545j66461m52037k58328K90518
1013E66937N22166P645D30825d01650J29815E8775d72354j22049B78554O79785
1003I58339D36850d75043p91820k5025d40196A84492P03860Q97656j53372p87828
993H44808B65344A16000J55350N10008K60289J71589k19290A82469d98333l49277
983h47610k56651O8327K430p0550K53335a4144F59256M32008P62576K90877m32169
972A712548o73162C5382a212415k3144c50991F0808e09843m09918K8600O8347
962h22814k45932k04197e59254B86508o2629d95281l33806J41523K52227h3572
951C05050A18781g2195C13247O74560D32396b55823B75164M01668a94690m56826
$$ y = [38464, -78247, 43160, 317321, 826173, 1107700, 1153245, 986784, 534747, 276419, 566937, 1089103, 1096748, 430825, -401650, -271835, 58775, -472354, -594403, 278554, 958339, 436850, -475043, -1266863, -1291888, -440196, 184492, 888352, 1786008, 1632636, 844808, 265344, 116000, 271350, 781358, 1041647, 1213236, 993946, 182469, -498333, -847610, -1104261, -1035934, -1033504, -1104054, -850719, -14144, 659256, 1091264, 1853840, 2144717, 1712548, 1039386, 35382, -1212415, -1235559, -350991, 60808, -509843, -919761, -891161, -822814, -1068746, -1272943, -559254, 286508, 223879, -495281, -829087, -687564, -435337, -83572, 305050, 118781, -72195, 313247, 987807, 432396, -255823, 275164, 676832, -194690, -651516]
941f51516a02856B7920b51892p7948r1879m03373p91412n6038g61498b21373D04020
929A460001k23504n00037r2159A02532b44055B37943k0934a286287k88649L03993
919a270943J30304N22099A23427D4053a341243J3187f469A125806J57171h847
908a070289j74250N92689c16648p7105R7426C32341L13435d71333j993944p06982
898c172259J216000g60599J06374K22808B76959J39316j34500A0771h7576c8159
887a47071j35715L6313m74206l32297a86143E91269M6967c1383o98633l70460
877a100476k12026M67631K14800L2754K17881k38521r80729r34599K94728Q70780
867a367777n99921p25538N46006P45847l7930J12928L55479M34056a32263o9906
$$ y = [-651516, -102856, 27920, -251892, -329840, -421719, -825092, -1616504, -1672542, -761498, -221373, 404020, 1460001, 1236497, 736460, 644301, 102532, -244055, 237943, 217009, -1286287, -1574936, -1270943, -1140639, -618540, 123427, 44053, -1341243, -1328056, -6469, 1125806, 1282977, -8847, -1070289, -1244539, -651850, -316648, -393753, -296327, 332341, 645776, -471333, -2465277, -3172259, -1956259, -760599, -654225, -431417, 276959, 416275, 281775, 10771, -87576, -38159, -147071, -282786, -246473, -720679, -1052976, -186143, 591269, 638236, -31383, -730016, -1100476, -1312502, -844871, -630071, -597317, -379436, -617957, -1598686, -2533285, -2238557, -1367777, -1967698, -2693236, -2147230, -1401383, -1439313, -1326385, -970906, -536850, -132263, -202169]
857b02169j0606G3705J53505J16314c87569o31931c30520E30763M51186J19732
847A101681O97314O87352p2123n30507n28266b9849j018343A32672J210426n04980
837H38118a76446C8930L65247A80605a46465q27446j12837d83373p88197m29389
827a700959a03408A412680r6270m10662M69849j02113C39227j56520L25166j94275
817C13598a30675j68342k83960r1216B31138P43804O202D69848K30308J99060
807H99216A40689e58313g8001H83585O9996f91455j379024P13216A5907K88593
797C04500F5909d12228d7308F10902M24286L81544L02773m83592D42319b347A7349
785A400992J131736j240896h37826j96548c08114q1947k82021c00758j28654k17007
$$ y = [-202169, -212775, 73705, 227210, 343524, -387569, -1019500, -330520, 530763, 981949, 1101681, 1798995, 2486347, 2414224, 1883717, 1355451, -29849, -1048192, 132672, 1343098, 838118, -176446, 38930, 404177, 180605, -146465, -973911, -1086748, -483373, -1271570, -1700959, -103408, 1412680, 1316410, 905748, 1375597, 1273484, 339227, 182707, 507873, 313598, -130675, -299017, -582977, -674193, 231138, 974942, 981144, 469848, 700156, 899216, 140689, -558313, -78001, 883585, 953581, -691455, -2070479, -1357263, 15907, 304500, 65909, -412228, -47308, 610902, 1035188, 1416732, 1719505, 1235913, 442319, -2347, 17349, 1400992, 2532728, 1291832, -837826, -1034374, -308114, -390061, -672082, -300758, -429412, -646419]
775f46419a91896C68653O75368K76501F39644E4483k6073d1370A90327M64420
765F54747j80790b24132M7563I84948P34340n12583j91410n7254k29310J6960
755G45691O4846J14729M3831B69047g99732l65212m6613k98387L26234d29157
744e54637j74128D72873L70168b88732j015288p8914j99302q0828P93260C71703
733I36305j55285l45936j81329E8229A1153M03826j20870Q7650P14081j76295
723I19545k3774p9663B28657K00173L55893C31005M69365J078109k51797G78904
712D31944K979c5309j3760G27462M47324l61756B59864m8755G7019d81057p71813
701a252870K29218C99192J177875K00180l64336l25449l29166j20981j02014K08651
$$ y = [-646419, -191896, 368653, 1044021, 1320522, 639644, 54483, 28410, -41370, 190327, 654747, 473957, -224132, -176569, 984948, 1719288, 1206705, 1015295, 958041, 728731, 745691, 810537, 925266, 969097, 269047, -799732, -1164944, -1211557, -1509944, -1183710, -429157, -554637, -728765, 472873, 843041, -288732, -1304020, -1382934, -1582236, -1663064, -869804, 371703, 936305, 781020, 435084, 253755, 58229, 11153, 414979, 294109, 381759, 1095840, 919545, 895771, 816108, 228657, 428830, 784723, 331005, 800370, 1878479, 1626682, 778904, 431944, 434923, -35309, -49069, 727462, 1174786, 813030, 259864, 211109, 77019, -481057, -1252870, -1023652, 399192, 1577067, 1777247, 1412911, 1087462, 758296, 637315, 535301, 743952]
691G43952l8555k42038r2529R7913Q90360K90075p4902k6680l57026I0809a244913
679a528223b84588A432533O32725j84327L1711M03622A116069A7205J71169N64882
669G53256N74978m82163e66641N0827E31612N94101K21578q1727J25983n19500
659H72047a19288M1267E10168j0927J53671M4761k77768b65135l73626m02899
649a041660l72006L43607d08029D78809J039986J52380o83922k98299M41074N93233
639A723261K46097G27036a533683r81850e35523A142457n31338e92607m10011
630a002618L60843a77613l92659l34627a26622B60335a09280p36226p26362l7661
620a609529P01731Q5040i5608A855521K17420F55323B21384K01636A72393Q2192
$$ y = [743952, 705397, 463359, 370830, 468743, 1359103, 1649178, 1574276, 1547596, 1190570, 90809, -1244913, -1528223, -284588, 1432533, 2065258, 1880931, 1912642, 2316264, 1116069, 17205, 188374, 753256, 1328234, 846071, -566641, -515814, 531612, 1125713, 1347291, 1265564, 1391547, 872047, -119288, -78021, 510168, 499241, 652912, 697673, 419905, -265135, -638761, -1041660, -1413666, -1070059, -408029, 478809, 1518795, 1671175, 987253, 688954, 1130028, 1723261, 1969358, 727036, -1533683, -2515533, -535523, 1142457, 611119, -592607, -1002618, -641775, -177613, -570272, -904899, -126622, 260335, -109280, -845506, -1571868, -1609529, -907798, -822758, -95608, 1855521, 2072941, 655323, 221384, 423020, 172393, 254585]
610B54585N80725j98154e09878m42534b74282C86654L30348k74469c132m4104
600d7236r45384j313782R29539a88099k349h7878B32850d21988n02782M00746
590e24024C50109R8318N4038j78608c06206k45730B92246R18438n20200b21846
579c33291B39571M07128j11723J91839J96560D42124e54914J3559K26446N2284
569b62625e8413j20904k36450a2313B6907f24131b08965A011817P53088L9535
559A804440o24194A11078g45522k16402j10592L92025L37543j91748o45696j56163
549a336555m55209K38591g38225c618l10178q08036j33426J66969R7519L47959
539f42811J33133k15231j63634j14705m02455j66144d43238F25211M122j13585
$$ y = [254585, 835310, 637156, -509878, -952412, -274282, 386654, 717002, 442533, -3132, -47236, -992620, -2306402, -1376863, -188099, -190448, -87878, 232850, -421988, -924770, -524024, 350109, 448427, 502465, 323857, -306206, -551936, 292246, 1210684, 690484, -221846, -333291, 239571, 646699, 534976, 726815, 923375, 442124, -554914, -541355, -314909, -262625, -58413, -179317, -415767, -12313, 26907, -624131, -208965, 1011817, 1764905, 1804440, 1180246, 111078, -745522, -961924, -1072516, -680491, -342948, -534696, -1180392, -1336555, -1791764, -1553173, -738225, -3618, -313796, -1121832, -1255258, -1088289, -990770, -642811, -509678, -724909, -888543, -1003248, -1405703, -1571847, -443238, 625211, 629333, 515748]
529E15748A65235c25439J36066m77753j471489r16507j45360q87047L390J731077
519b353062Q03816j41752J9085J07860L05528M38188n04879q54401R20908f16570
508a702214j556645l80141J120118R89670m23338q17815N70963i25689d1201B16762
497B54500d50716k154776j234919M82637R23569N66974Q27861c07676o00432j204865
487b112973p99496K25212R28725J53284j023236r34456l2839J038065m5244j364916
477c967874m92889J285179O43431k76563o69760K40313N21758j75505p19065q23807
467d434782m18636O99104o75085j309235Q68137J677692N05798L25586n1355o82496
457c495272j133657n08154M80544J512892M72958j162690q58899j033629r05221
$$ y = [515748, 165235, -325439, -189373, -667126, -2138615, -3055122, -3200482, -4087529, -4084139, -2353062, -1549246, -1690998, -1671913, -1564053, -1258525, -820337, -1325216, -2179617, -1258709, -616570, -1702214, -3258859, -3639000, -2518882, -1529212, -1952550, -2770365, -2199402, -925689, -41201, 216762, 254500, -450716, -2605492, -3840411, -3357774, -2434205, -1867231, -1039370, -307676, -908108, -2112973, -2912469, -2687257, -1758532, -1605248, -2628484, -3562940, -3595779, -2557714, -2602958, -3967874, -4460763, -3175584, -2532153, -2808716, -3478476, -3238163, -2716405, -2891910, -3610975, -4434782, -4853418, -4154314, -4829399, -6138634, -5270497, -3592805, -3087007, -2761421, -2812776, -3495272, -4628929, -5137083, -4656539, -3143647, -2670689, -3833379, -4692278, -5725907, -6631128]
448f631128N33052P13580K67671Q63084N36885L25983j87563j16538o86487p29578
438e111039l45805m23364L82708O00319m85327j081272j970350k135776j282956
429a1852862L4172M78281r6434j486195j094395r46233j604986k622715k055042
420b1246409l175528n106306m294373j2957653l924579n4877670k10725751j09900167
412d26208436a90559770E6507896J6968317l5010313o168793q620155l722521
405A9954431k683450k164019j132330n12085R31680j749441m379330j894684k0146
396F350626K52376q74083q04602O53577J761888l47375j935356j716309j353303
387A987439m05922O8116l58724n80659B49607b08454H00778L94548B89040a613444
$$ y = [-6631128, -6098076, -5384496, -5116825, -4253741, -3716856, -3390873, -3578436, -3694974, -4381461, -5111039, -5456844, -5880208, -5497500, -4897181, -5382508, -6463780, -8434130, -10569906, -11852862, -11818690, -11340409, -11436843, -12923038, -14017433, -14963666, -16568652, -19191367, -21246409, -24421937, -29528243, -33822616, -46780269, -50704848, -105582518, -316308269, -426208436, -190559770, 56507896, 73476213, 38465900, 32297107, 23676952, 19954431, 17270981, 15106962, 13974632, 13462547, 14394227, 12644786, 8265456, 6370772, 6350626, 6603002, 5728919, 4924317, 5577894, 7339782, 6992407, 5057051, 3340742, 1987439, 1581517, 1649633, 1290909, 710250, 249607, -208454, 800778, 1195326, 289040, -1613444]
376b678461J053426g02071l35533n69053K74123o73233j579964j442381j513612
367f541724k700610k153214p95599m957196k884859m0231266j07202129k1343331
359a88809928e3730058D8569750n147723j8097424m475635l435073l50204l117036
351A3946655j908735L8554r26744j401896j082370L9319m25153n17847p16596
342G045187j22918L6513j55022M22043Q0317j305632j130649k07793K02445N63840
332E428331M27178l66682K21194K31701n49854j345572j261380j02885N51298
323C233329j12304l57549J69687k1362Q61948M42807m56258j25445Q51657L18433
313D804943o83600k98414Q75828K37858q66104j136219j218431l51337O62108
$$ y = [-2678461, -1625035, -702071, -1037604, -1606657, -1332534, -2005767, -3585731, -5028112, -6541724, -9242334, -11395548, -12191147, -17148343, -20033202, -60264468, -167466597, -188809928, -53730058, 48569750, 43422027, 25324603, 20848968, 17413895, 17063691, 13946655, 12037920, 12076474, 11149730, 9747834, 8665464, 8704783, 8279630, 7761783, 7045187, 6922269, 6958782, 6803760, 7225803, 7306120, 6000488, 4869839, 4662046, 4864491, 5428331, 5855509, 5488827, 5710021, 5941722, 5391868, 4046296, 2784916, 2682031, 3233329, 3121025, 2763476, 2933163, 2911801, 3773749, 4216556, 3760298, 3634853, 4486510, 4804943, 4121343, 3822929, 4698757, 4936615, 4070511, 2934292, 1715861, 1364524, 2026632]
304B026632Q50573K65409o58029l96978N56176L3441r97048F26198Q07070K008788
294C442056R432m30075j016630B51476e92901E08899J249430O34362M81539j37953
284B736277j246730n35770k96189M27165J626926J132035n99892j289227m63047
275A491548R00126M54474r39152G5556d79970F84045O96668F23317a3849A90426
264H37457O28747L96692j23734n61168n59470K20954j18555B49795A9885d16104
253f94386c6265I86188K09789K7541O86257J336440M39475o34566A492476E63105
242A19247L52702P91514N69497J09658k17233J42692l02786C05951O6008J077200
232A449159o1976D98507e73166n62160a95202A240984J64005E67408b09217l28452
$$ y = [2026632, 2877205, 3142614, 2484585, 2087607, 2643783, 2677224, 1680176, 626198, 1433268, 3442056, 3451488, 3021413, 2004783, 251476, -592901, 508899, 1758329, 2392691, 2874230, 2736277, 1489547, 953777, 657588, 1084753, 2711679, 3843714, 3243822, 1954595, 1491548, 2391674, 2846148, 1906996, 75556, -479970, 684045, 1380713, 623317, -13849, 190426, 837457, 1466204, 1862896, 1739162, 1177994, 618524, 839478, 720923, 249795, 19885, -416104, -694386, -36265, 986188, 1195977, 1223518, 1909775, 3246215, 3685690, 3051124, 1492476, 563105, 119247, 471949, 1263463, 1832960, 1942618, 1725385, 1868077, 1565291, 305951, 371959, 1449159, 1387183, 498507, -573166, -1135326, -195202, 1240984, 1404989, 567408, -209217, -537669]
222e37669p01794m91696L73916M18325L42262E36245R57329o78627G2904e50791
211a583998m4845N85854J92058n19714j51243f81810D43009L74539q7677B57017
200a022301l55571f77389n9302r21150r4498d92492F34404J40710j38879A54393
189a069240n83957M44321L12900L8957j1180K32911K7646l91187l99953J53393
179a245389d84711C40530J99936P9904N16714Q01434P2839I30421I74c61393n14410
168h75803q9223K33971K03341F8926M3364h60463r19267M78515L84694J37866
158g78655A69856M32219b19702q47907J95851D25401M35307A0285a189315J81816
148a007499C34484N37301b54593j213483J45065d43635b009o4975k83306m66407
$$ y = [-537669, -1239463, -1731159, -1357243, -938918, -596656, 536245, 1493574, 814947, 72904, -550791, -1583998, -1628843, -1042989, -850931, -1370645, -1521888, -681810, 443009, 817548, 729871, 257017, -1022301, -1377872, -677389, -736691, -1657841, -1752339, -492492, 634404, 775114, 636235, 154393, -1069240, -1653197, -1208876, -895976, -857019, -868199, -635288, -607642, -998829, -1398782, -1245389, -484711, 340530, 540466, 620370, 1137084, 1938518, 2011357, 930421, 974, -361393, -875803, -965026, -731055, -527714, 68926, 112290, -860463, -1779730, -1301215, -916521, -778655, 169856, 602075, -219702, -1067609, -871758, 425401, 860708, 10285, -1189315, -1007499, 334484, 871785, -254593, -1468076, -1323011, -443635, -2009, -66984, -350290, -816697]
138h16697c38243C34675J90609B16369e0646n85668k51344l88711m79265O762
128a748872L26431f23102F16023Q83442m91469B7923c91906a53316A471122J307903
118B779025o14070B06452a496991o31528M42130g900A168612J16981B30649a050964
107a087376K81312n53849r03671o91240N0946R33564h07048a52956k55950j010756
97a419662l78554Q36347b65068l92358o06002k11919P27949L01950K17246A35445
86a52903j030455l7251L78741k07215n65262q31344j25742J272964E0174O30222
76F80396M37676L64716m72188D7649g36705o55225p8223K22236M18113L32170
66d97634d805F10635K80172D31801b63463m94304K38745F69573K33128G1539K9127
$$ y = [-816697, -338243, 334675, 525284, 216369, -50646, -636314, -887658, -1276369, -1755634, -1748872, -1422441, -623102, 616023, 1499465, 1007996, 27923, -391906, -153316, 1471122, 2779025, 2164955, 206452, -1496991, -2128519, -1686389, -7900, 1168612, 1285593, 230649, -1050964, -1087376, -806064, -1359913, -2263584, -2954824, -2903878, -1970314, -807048, -152956, -408906, -1419662, -1798216, -961869, -265068, -657426, -1263428, -1475347, -747398, -445448, -228202, 135445, -152903, -1183358, -1220609, -841868, -1049083, -1614345, -2445689, -2571431, -1298467, 50174, 680396, 1118072, 1482788, 1010600, 47649, -736705, -1391930, -1470153, -1247917, -829804, -497634, -4805, 610635, 890807, 431801, -263463, -757767, -519022, 669573, 902701, 71539, 100666]
55A00666M58648A76125N72252P45887j40652l39096j58754A78149h61515r07463
45a768978L08888G5951Q96101a01228o86161b70430I43728R24263m74263D78404
34d99507m75475K02168D7269J523259P47097E94821a179586K54394b99320l71325
24f70645j1164A3184K28491E9843J34523M82772L45152k38882b4706r02544L47857
13e79393H31788Q13309m43720j82236K94311k17884C88485r4761M00651M09807
3A104182J90921l77167g770
$$ y = [100666, 559314, 176125, 748377, 1494264, 1353612, 1014516, 855762, 178149, -861515, -1768978, -1460090, 75951, 972052, -101228, -787389, -270430, 943728, 1867991, 1393728, 478404, -499507, -974982, -772814, 47269, 1570528, 2317625, 594821, -1179586, -925192, -299320, -670645, -681809, 13184, 241675, 59843, 194366, 677138, 1022290, 783408, -24706, -927250, -579393, 831788, 1645097, 1201377, 1019141, 1313452, 1095568, 388485, 293724, 694375, 1104182, 1295103, 917936, -7770]
##PAGE= F1=2956.243426166
##FIRST=     18110.137220953, 5591.54909048506, 71106
##DATA TABLE= (F2++(Y..Y)), PROFILE
1023G1106C1612J24584K16889M70164K53632j2775j44060D41433A21052L08537
1013D29589P80791J32030E11540f40341J09683e0888n44599M9768F65456O19864
1003A285320F08767c74626o98424M65237C72665J08192Q5604N88981J15372m15670
993H55144B98436a12501A39768P97697L32718r3019l40049C41651a86234m55961
983f42195p5239L52972P1010N6432j93825l2463g2195E60594Q63309M98508l41562
972A580849n74003B38680a010638l69835d27189C65236a36690n17075r713k18036
962h81514m75189j41472f65122B48884c4333r67122l24770N05968K86424j03551
952f37384Q4943K36085I2864M10715M96750m87217a73109D35043P24065E39454
$$ y = [71106, 31612, 156196, 373085, 843249, 1096881, 1084106, 940046, 441433, 121052, 429589, 1210380, 1342410, 511540, -640341, -530658, -50888, -595487, -545719, 665456, 1285320, 608767, -374626, -1073050, -607813, 372665, 480857, 566461, 1155442, 1270814, 855144, 298436, -112501, 139768, 937465, 1270183, 1177164, 837115, 341651, -186234, -642195, -717434, -364462, -293452, -237020, -430845, -463308, -72195, 560594, 1423903, 1922411, 1580849, 1006846, 238680, -1010638, -1380473, -427189, 365236, -136690, -653765, -663478, -881514, -1356703, -1498175, -665122, 248884, -34333, -1001455, -1326225, -820257, -533833, -637384, -552441, -316356, 92864, 503579, 1000329, 513112, -173109, 435043, 1159108, 539454]
941a99603n3802k31907l13647K48998b32126o7709r22652j69338O45064c17295
930E18543J327101m32649E51561B42959c13473m35812b07524C2640a198608l90291
920a588899J94311M3130L70492d76979k50997j125196Q9343f22756F73275O15086
910A288361C79188e17483j60229P4784J8712K1044b24359B94740J9795e52359
899b012350o42004J113700b23261f6011o2876D28147L16950L4117B96058e5609
888c4905H5964g6566k58499l74747P6899B92473N64439P8475C99019d07343m81981
877h89324l21834K78085J44752K54162a76472l38477j115877q14603M04329P07169
867a333931q74627q00002N44786Q33403J00853j5692J69184K59373L94891J99371
$$ y = [-199603, -253405, -485312, -798959, -549961, -232126, -299835, -1222487, -1391825, -746761, -317295, 518543, 1845644, 1412995, 551561, 242959, -313473, -749285, -207524, 32640, -1198608, -1588899, -1394588, -1351458, -980966, -476979, -727976, -1853172, -1763829, -622756, 673275, 1288361, 379188, -517483, -677712, -602928, -584216, -563172, -224359, 294740, 314535, -552359, -2012350, -2654354, -1540654, -223261, -66011, -128887, 428147, 745097, 779214, 296058, -55609, -34905, 85964, -76566, -335065, -709812, -632913, 292473, 856912, 935387, 399019, -407343, -889324, -1211158, -933073, -788321, -534159, -176472, -514949, -1630826, -2445429, -2041100, -1333931, -2208558, -3008560, -2463774, -1630371, -1529518, -1545210, -1376026, -1116653, -721762, -522391]
857e22391n1683k757K32071A55782c54567l26992D8908P65616M2735k82223O53066
846A228102R08309p8295l14359l3550F21319d94283D71408J158408p99745b79504
835g3144d967m17440R6309n37827J0567a13805p40063o21752a70316A431894J55376
824A587270l99872J76333l14926a6880l57746a5411A12069a00126K525l22974
814d20575j28503D35869O22567k31784a23917j48024D6599O3847a37584d3830
803D02488k8861a092012p43522e78454D84871e6215n99299k66480c54428E47927
792A119518K74478J15065l94139D77953a41275k52500H65378J190463I22160a183846
781a234093c49168k87121m67701M16578J10052K56385D95905L40507J16095j92176
$$ y = [-522391, -574074, -576831, -344760, 155782, -354567, -681559, 48908, 814524, 857259, 575036, 1228102, 2136411, 2058116, 1743757, 1710207, 621319, -494283, 471408, 1629816, 830071, -279504, -73144, -4967, -422407, -326098, -863925, -853358, -113805, -853868, -1475620, -170316, 1431894, 1587270, 1187398, 1363731, 1048805, -16880, -374626, -15411, 112069, -100126, -97601, -420575, -549078, 435869, 1058436, 826652, -123917, -271941, 46599, 110446, -137584, -43830, 402488, 373627, -1092012, -1835534, -578454, 484871, -56215, -655514, -921994, -354428, 547927, 1119518, 1393996, 1509061, 1114922, 477953, -141275, -393775, 865378, 2055841, 922160, -1183846, -1234093, -349168, -636289, -1103990, -687412, -577360, -320975, 495905, 836412, 952507, 760331]
771G60331a6835n22325Q0872h5437D38450L83655k23758A49576K50346J216405
761A616327L82686p11873l12783Q4734K6728k813J9684J55355k9740A42745a215644
749a863371j15563J41547O13356d52236p6125k52001B12745M75537b25591o75178
739i00769R1983k98516n84970M09051A51056Q82471j05927D39612j27897J09464
729D21179A59095l2809c03798J31066F72796k119Q473j97518b00921A80138O30499
718H10637C41492J98860J033307r2645E25257I9318J83004B5911L28915J139820
708A494646K07372E71327b92037A671K708g45543p09412K89300D18680J179501
698A598181r3491k30213m0098l05166l17027k94153K1105L6589K73915J64506
$$ y = [760331, -16835, -539160, -458288, -85437, 438450, 822105, 598347, 149576, 399922, 1616327, 1999013, 1287140, 974357, 1059091, 1085819, 1083006, 1102690, 1258045, 1228305, 142745, -1215644, -1863371, -1978934, -1837387, -1224031, -452236, -528361, -780362, 212745, 688282, -225591, -900769, -808786, -1107302, -1692272, -1283221, 151056, 1033527, 927600, 439612, 311715, 421179, 159095, 126286, -303798, -172732, 672796, 670677, 679150, 481632, -200921, 180138, 810637, 341492, 540352, 1573659, 1481014, 525257, 99318, 282322, 25911, 354826, 1494646, 1702018, 571327, -292037, 1671, 4379, -745543, -1454955, -1165655, 418680, 1598181, 1504690, 1274477, 1234379, 929213, 612186, 318033, 339138, 375727, 649642, 814148]
688H14148C43743O19957O16085j63324l38432j54923C99107g68034m05451g5771
677A560523O31183j66833K07305N56923A143054e38746J52193C60734N90250m23187
667E27797e82105K22164I76306O17304j78286k76465R1944m29446f6730I7059
656A054936M87746j92336F54847b12599p86238J00023L78352k44075l01760R5278
646i71019c7932A198011J63470o21926l63116L29780O42333N21893I13580a028858
635b113083e30059A179318E05899h88436k94490c56259G9292c96692k16293C14012
624I19520l59858d05675r08782k26066N32326j85997M24375A106344O03410o17199
614A092555k60829B62933d03128h8697I66792m9751a76957n37435b76050B07200
$$ y = [814148, 343743, 963700, 1579785, 1416461, 1078029, 923106, 399107, -768034, -1173485, -75771, 1560523, 2191706, 2024873, 2232178, 2789101, 1143054, -538746, -386553, 360734, 950984, 527797, -582105, -359941, 976306, 1593610, 1415324, 1138859, 1230803, 801357, -66730, 97059, 1054936, 1542682, 1350346, 654847, -212599, -998837, -898814, -520462, -764537, -1066297, -971019, -37932, 1198011, 1361481, 739555, 376439, 706219, 1348552, 1870445, 913580, -1028858, -2113083, -530059, 1179318, 505899, -888436, -1182926, -356259, 79292, -396692, -612985, 314012, 919520, 559662, -405675, -1314457, -1540523, -1008197, -1194194, -769819, 1106344, 1709754, 1092555, 831726, 262933, -403128, -88697, 966792, 917041, -176957, -714392, -276050, 207200]
603I04047K00789n22507B71023g4107m58085i169B55883h6007b2522B77073d6357
591b92951C01074P76963j80353k77923o3316I6756c03260F40389J143960o90130
581A094219I5732J28661M71278L37632j26432n9156J09303j02138I3106b49245
570e78590b75929E02218j97467b17606C80960J60677e92361b10537A164334P33199
560A897533P0933p01956g9564q38738L08632a92443C5728b17879k35350j57175
550f10404M6794p1797n3602m3080K24688j09824J03779a24190j97432m00215L33414
539c88423h9435M294G3884J96865e1280l50101B38609P38334R536K00534j92017
528I94996m81161K32785k97184a086680j199865k12776l26260N61865J129639
$$ y = [904047, 1104836, 582329, 271023, -74107, -532192, -9169, 255883, -86007, -22522, 277073, -46357, -292951, 301074, 1078037, 897684, 619761, 556445, 96756, -303260, 640389, 1784349, 1094219, 95732, 224393, 695671, 1033303, 906871, 847715, 957018, 854880, 93106, -249245, -578590, -275929, 502218, 304751, -217606, 380960, 541637, -592361, -210537, 1164334, 1897533, 1968466, 1266510, -79564, -918302, -609670, -192443, 35728, -217879, -453229, -610404, -563610, -635407, -689009, -732089, -507401, -617225, -513446, -124190, -321622, -721837, -388423, -89435, -85141, 73884, 270749, -51280, -401381, 238609, 976943, 986479, 1187013, 994996, 513835, 746620, 449436, -1086680, -2286545, -2499321, -2825581, -2263716, -1134077]
519a134077K17751n21767p6135L18720e15627C5150e07973j087918L48723N43469
509g03699o87751q26217J38059Q22048K91672m77638m25911J62757P69140H0350
498F20735L52613j05832g82496j363221j8613O49455M51352c37366E63532c4764
487a305392p83530K23629R10266L40265o63563p87550p0775P18144N3283q16882
477b182105P2883O68938L94784o82667j096482K69201R73355L87374l32195l76294
467a903208k59715j17982q06170p91614J025580J139989J98582L12697N81702
458f20139l28098j186798o63657L60554a169531M72465j159799r90638r62110
449c809613k63234P67393J59089j37790M20898K12559K66174J01131K70194o16616
$$ y = [-1134077, -916326, -1438093, -1514228, -1195508, -515627, 35150, -507973, -1595891, -1247168, -703699, -1391450, -2217667, -2079608, -1257560, -965888, -1443526, -1869437, -1706680, -937540, 80350, 620735, 973348, 867516, -782496, -2145717, -2164330, -1514875, -1063523, -337366, 563532, -34764, -1305392, -2088922, -1865293, -955027, -614762, -1278325, -2065875, -2136650, -1418506, -1365223, -2182105, -2109222, -1440284, -1045500, -1728167, -2824649, -2555448, -1582093, -1194719, -1526914, -1903208, -2162923, -2280905, -3087075, -3878689, -2853109, -1713120, -1514538, -1201841, -620139, -948237, -2135035, -2798692, -2438138, -1169531, -697066, -1856865, -2847503, -3809613, -4072847, -3305454, -3146365, -3284155, -2863257, -2650698, -2384524, -2283393, -2013199, -2629815]
439b629815r94143j03092L84987R15024Q07907r76983j560536k151778j432402
430g740831o03562n72655l21226m51247o87470n4576p44957j383308r25093j517677
420a5002602l215326m173624k778967r640861r64872l6150507j46789550p7296681
412b96012990a31094169D4645587J1161722k3876270l788706o094267l154641
405A8893425k690408k438456o35226o79499k58831r86228k605414j164113m51084
396F984166j16476j500636j192168R08745J620636l71836j376722j198251j351340
387B406118r42025j97922J34340E84813b82783j52437E51189L84964m13204f92093
376a758833Q01496b85154m7266j77596e2155p40149j321694j259482j103913k000195
$$ y = [-2629815, -3623958, -3727050, -3342063, -2427039, -1619132, -2596115, -4156651, -6308429, -7740831, -8344393, -8917048, -9238274, -9689521, -10376991, -10431567, -11176524, -12559832, -13484925, -15002602, -18217928, -22391552, -25170519, -34811380, -35776252, -71926759, -218716309, -296012990, -131094169, 44645587, 55807309, 31931039, 28142333, 22048066, 18893425, 16203017, 13764561, 13129335, 12449836, 12191005, 11204777, 8599363, 7435250, 6984166, 6867690, 5367054, 4174886, 5083631, 6704267, 6332431, 4955709, 3757458, 2406118, 1464093, 1266171, 1400511, 584813, -282783, -435220, 551189, 936153, 522949, -692093, -1758833, -957337, -285154, -332420, -510016, -52155, -792304, -2113998, -3373480, -4477393, -6477588]
366f477588j670642m18314l311379j475283k4693630o6597222j2532104c3019650
357C1123451l709440j1836860k454305j871261o70046k312880j406624N52156
349G414191p7878N8665N2290n05850j461702o74701j72390N83505M46489q9708
339E572911m70907L02504j26713r98081o78577k11308O82464O29458J34685J84961
329E021397n2436o27308o02788n50538J18936L60238n65376m26194M12635p5082
319C013484P43119N05743n76306p32548N66248O16750k45707p20037J47330J66661
309C484737o14519n45933o68028l60147L75779R66374N63469l60904l92815j58258
299B289755o11873m41253C81448L01541J782656K57384m87146m62142C49353f45705
$$ y = [-6477588, -8148230, -8566544, -11877923, -13353206, -38046836, -104644058, -117176162, -33019650, 31123451, 27414011, 15577151, 13122846, 11251585, 10581539, 8268659, 6862035, 7414191, 7336313, 7394978, 7447268, 6941418, 5479716, 4805015, 4632625, 5216130, 5662619, 5572911, 5102004, 5404508, 5277795, 4279714, 3601137, 3389829, 4072293, 4701751, 4836436, 5021397, 4968961, 4341653, 3738865, 3188327, 3307263, 3667501, 3102125, 2675931, 3088566, 3013484, 3756603, 4262346, 3686040, 2953492, 3519740, 4136490, 3890783, 3170746, 3318076, 3484737, 2870218, 2324285, 1656257, 1296110, 1671889, 2638263, 3201732, 2840828, 2448013, 2289755, 1677882, 1236629, 381448, 682989, 2465645, 2723029, 2235883, 1773741, 349353, -645705]
288a35038H80954R23169R22397j05254j054407m29800k98460J81293J438727J154428
278C613047o36277j182436K1203J515545O56939j477028G5414e01539A111029
268B140309r92637D244c8503D46222L93586O27673K23954p83002e8305n6173b7067
256d73416J534j49187j37920b31768E62201J73980O6038O56221J290653O66691
246C415784q31022I86488C99024H7878L81627J218458P77826k67541j63600L34352
236B369000m99755F20202L75905J219868k97949G17970d07628j48893C35134R86607
226A321741O5459D87105d69190n91283p36883m8814h46716b85271c9987H14784
215A303713n96243A79471d43460p42537J19470K67980J0968n07585K8492e82203
$$ y = [-135038, 880954, 1804123, 2726520, 2621266, 1566859, 1137059, 838599, 1019892, 2458619, 3613047, 2976770, 1794334, 1815537, 3331082, 3988021, 2510993, 75414, -501539, 1111029, 2140309, 1147672, 4244, -38503, 446222, 839808, 1467481, 1691435, 908433, -58305, -114478, -27067, -473416, -471882, -621069, -758989, -231768, 562201, 736181, 802219, 1458440, 2749093, 3415784, 2584762, 986488, 399024, 87878, 469505, 1687963, 2465789, 2198248, 2034648, 2369000, 1869245, 620202, 996107, 2215975, 1918026, 717970, -407628, -556521, 335134, 1321741, 1387200, 487105, -469190, -1060473, -1797356, -1846170, -846716, -285271, -39987, 814784, 1303713, 707470, 179471, -443460, -1185997, -1066527, -798547, -787579, -1295164, -1266672, -582203]
204A0504J54770K00177F8797a188999l83595M73411j28688p21547K75198c0123
193A254977j4767l54476B74460a086441o97056N42497N90051l5075l38358J82212
183h42170c84821k38621n26724K1755c33102E21165N902j32061O24655Q18405
173A838066k66749E57270f3961j16860n86820l03777n5283n3318e79563c5757
162i78986j181552N04874P57275K71453B50892K08955b80278q68830K73320F72370
151A009873a42187j176637J76968F164M92866b23454o39007d01468D52993L04450
141G57443l0144D9736a019679K01845B49924P95125k37680a55102r47021K62707
131h39416Q6081n23624k61120K72490b63628I76527M90888F86460b01748k64733
$$ y = [10504, 165274, 365451, 68797, -1188999, -1572594, -1099183, -1227871, -1949418, -1674220, -30123, 1254977, 1240210, 885734, 274460, -1086441, -1783497, -1241000, -650949, -686024, -1024382, -842170, -384821, -623442, -1150166, -1128411, -333102, 521165, 527067, 395006, 1019661, 1838066, 1571317, 557270, -63961, -180821, -767641, -1071418, -1126701, -1180019, -579563, -35757, -978986, -2160538, -1655664, -898389, -626936, 250892, 459847, -280278, -1149108, -875788, 672370, 1009873, -142187, -1318824, -1141856, 6164, 499030, -223454, -862461, -401468, 452993, 757443, 727299, 49736, -1019679, -817834, 249924, 1045049, 807369, -155102, -1102123, -839416, -753335, -1276959, -1538079, -1265589, -263628, 976527, 1467415, 686460, -201748, -466481]
121d66481h5553A394730J206382m65001A37142a441769n43288N33209A84664J085558
111A270222J65073o39646c73202l36511J9279o90479q75284l75489K94903Q20985
101a515798f17719a30190l06636j038398m69223P09569d97561l20160m87463j57756
91a462940M33738J21409M40286E14883q6494i69381j64855c49485J68907m19605
81f00183q90520m92362P81367d0371F75550Q35319M19895o01579D26654b97050
70a303914l43161L63857f33735K43809a48902D95971N42638o6552B57877e89346
59i57537B66164N15477a34038l7943D54529j30520N70507O79873m15048j90124
49I69217m2556A42504a016474q04386N72787g3391E24478a33234j2071C45460
$$ y = [-466481, -85553, 1394730, 2601112, 2136111, 137142, -1441769, -1985057, -1451848, 184664, 1270222, 1435295, 795649, -373202, -709713, -690434, -1380913, -2256197, -2631686, -2336783, -1515798, -617719, -130190, -436826, -1475224, -1944447, -1234878, -497561, -817721, -1305184, -1462940, -1029202, -907793, -467507, 514883, 428389, -969381, -1134236, -349485, -180578, -600183, -1490703, -1983065, -1201698, -40371, 675550, 1510869, 1930764, 1329185, 426654, -297050, -1303914, -1647075, -1283218, -633735, -389926, -148902, 495971, 1038609, 972057, 257877, -589346, -957537, 266164, 781641, -134038, -171981, 454529, 324009, 894516, 1574389, 1159341, 969217, 926661, 142504, -1016474, -1820860, -1248073, -73391, 524478, -133234, -145305, 345460]
38A071383O87684l49666o12000b62959o58276J84131a71655I73735R68623H96917
27g51717q2459L15225n01136k32905e52789a97736j43513M6639A03941O20382
17G24323J06289A60682g00555J48896D71516Q92571j62284j42292N0524l39847
7G70188B85555J4573J94492J64881J52474j04967E4335
$$ y = [1071383, 1759067, 1409401, 797401, -262959, -921235, -737104, -171655, 973735, 1942358, 896917, -751717, -834176, -518951, -1020087, -1252992, -552789, -197736, -341249, -294610, 103941, 724323, 830612, 160682, -700555, -551659, 471516, 1364087, 1201803, 1059511, 1110035, 770188, 285555, 300128, 494620, 659501, 811975, 707008, 54335]
##PAGE= F1=2934.625888655
##FIRST=     18110.137220953, 5591.54909048506, -54168
##DATA TABLE= (F2++(Y..Y)), PROFILE
1023e4168j2190C4428J59087M44530K28950j07932k03225e00k88295D9474R89433
1012A038907M00611F12217g19004J5155a82410n48285M7058F70454N70419E74352
1001c03169m37649A55786R52119n43827f6019A71139M06872J06824B20799e06491
990a60202I87403L39888l40373m57866j48390H9571d40307M8260B26960J72158
980C99118K27434A67674f58593l6479d2563G10155O51097j93826m99893A17543
969h31821m52860c43157F93392k81511A0576f3725o31094q40922j97796g95455
958B94570c7621j207680l76121P63565K14748o10171k01400g06876B95282L18660
948F13942K11876l13663h3109D53747Q78503l29566A30273c84799l13052j18871
$$ y = [-54168, -66358, 34428, 193515, 638045, 866995, 759063, 555838, -500, -288795, 49474, 1038907, 1439518, 612217, -719004, -703849, -182410, -730695, -683637, 670454, 1240873, 574352, -303169, -740818, 155786, 1107905, 564078, -66019, 171139, 578011, 684835, 220799, -506491, -160202, 987403, 1327291, 986918, 529052, 380662, 89571, -440307, -392047, 226960, 399118, 626552, 167674, -658593, -695072, -42563, 710155, 1361252, 1167426, 667533, 117543, -831821, -1284681, -343157, 693392, 411881, 10576, -63725, -694819, -1535741, -1733537, -795455, 294570, -37621, -1245301, -1621422, -857857, -643109, -1253280, -1454680, -706876, 295282, 613942, 825818, 512155, -83109, 453747, 1332250, 1002684, 130273, -384799, -697851, -816722]
938h16722b56327C11852N3667f68291k69553L75383b69988F27828J437328m72472
928A592684E86283A14827d49415m96285c36360B12634d48123o72017j97395j96703
918a514238J62736L95587k62048o56963K62781P60592B30460R09718l46474B24030
907A20165b92702m08581J51133I7580L16144A8242e12697o91099l69762g58565
896C66346L1053A13425N11634N32376J58507E93520F4218n460L06531I7363c98665
884d91480D3907Q53005K71379Q6627l15999B2911e45123k48337P9544j39451L64365
873d89002F8034c03022j173019m28869P26762L78996j134273p41073M38625P85580
863a450293J92030j34552l6872J7845K24781L71621p7341j41064d70592C58827
$$ y = [-816722, -256327, 311852, 365519, -668291, -937844, -562461, -269988, 627828, 2065156, 1592684, 586283, 114827, -449415, -945700, -336360, 212634, -448123, -1120140, -1317535, -1514238, -1351502, -955915, -1217963, -1874926, -1612145, -851553, 230460, 1140178, 793704, 224030, 120165, -292702, -701283, -550150, 97580, 413724, 18242, -512697, -1203796, -1573558, -758565, 366346, 397399, 113425, 625059, 1157435, 1315942, 593520, 64218, 58758, 365289, 97363, -398665, -491480, 43907, 896912, 1168291, 1254918, 938919, 22911, -545123, -793460, -713916, -853367, -489002, 68034, -303022, -1476041, -1904910, -1178148, -799152, -1933425, -2674498, -2235873, -1450293, -1258263, -1392815, -1429687, -1411842, -1187061, -815440, -892781, -1033845, -470592, 358827]
852A29912C8206M46093N49506k08676C18322M70746Q96794j44210j07234M57194
842A891612o44499B49633O30642R74196q99824f6090A0401b57235n24570c64008
831e54806K10240E71311b2331q45482b7865A278943K28021l31400j03420m04242
821F67902b29415m35463b71268B26188J29685J69161A01977g8112F55308N03140
811A158448m15991e33753o19970K83294B3494L38800G3259b9426k27762j249142
801a506330p1761H9143O37591c58868q02485k4969c35855G02149M98636M9947
791A250732o5459l78520C61255b69759l32645D91722J172529H00059a040261j48745
781a189006d77069m94792m25085O61792b31524C22399Q35937n1999m76505B4809
$$ y = [129912, 38206, 484299, 1033805, 825129, 318322, 789068, 1685862, 1541652, 1434418, 1891612, 1247113, 249633, 880275, 1854471, 954647, -66090, 10401, -257235, -781805, -364008, -554806, -344566, 571311, -22331, -867813, -27865, 1278943, 1506964, 1175564, 1072144, 667902, -229415, -664878, -271268, 226188, 355873, 525034, 101977, -78112, 655308, 1158448, 742457, -533753, -1153723, -870429, 23494, 362294, 73259, -29426, -257188, -1506330, -1578091, 89143, 726734, -358868, -1161353, -1186322, -335855, 702149, 1200785, 1250732, 1185273, 806753, 361255, -269759, -602404, 491722, 1664251, 800059, -1040261, -1189006, -477069, -971861, -1396946, -735154, -231524, 322399, 1158336, 1106337, 629832, 24809]
770g10335k93514K93034I3758O24016J34470j50211m8720L49136Q23605L0332
760A856386o44075k66464K12423J44283j15855k9743K05353k04066a18905j340586
750a459491q39060k24501N26669Q05883d89360O9533j59448A22406M53925f9939
739d00794J68443l26747p70627o2806c28862G41429O6397A88984l1891M23684
729E80777A82419c11441o49876K19399I0538J38992Q8595q7410b45000A99072
718G01206A7245h0950I06106L4656e7355m20389a7399G0552N83355J192918J24962
707A971787E24625f49410b34590O3500p57238n24710K56298B17353J013541k35181
697I95713j1910K26249j98916l25555B49875a39987j6510F34827L60042A09227
$$ y = [-710335, -1003849, -710815, 93758, 717774, 852244, 702033, 653313, 1002449, 1826054, 1856386, 1212311, 945847, 1158270, 1302553, 1186698, 1156955, 1362308, 1158242, -118905, -1459491, -2298551, -2523052, -1996383, -1190500, -489360, -419827, -579275, 122406, 576331, -69939, -400794, -232351, -559098, -1329725, -1392531, -328862, 741429, 807826, 188984, 157093, 580777, 182419, -311441, -961317, -741918, 90538, 229530, 318125, 230715, -245000, 199072, 701206, 17245, -80950, 906106, 940762, -57355, -477744, -17399, 70552, 653907, 1846825, 1971787, 524625, -649410, -234590, -171090, -928328, -1453038, -1196740, 217353, 1230894, 995713, 983803, 1210052, 1011136, 685581, 249875, -139987, -156497, 634827, 994869, 109227]
686C75426Q46664l05411A56725M5684J67023d27986m76235a0018A434243N99523
676B033766k06234K76768O96273A048730i90842p660i3123E77067A75751f96908
665e55411F90470N88598k92655k88141M8130l43778c22040a14436A092299Q41944
655A934243m17790C52687i79987q42947M38112d21227o6921p38110l03670e48623
644G36137K08829m37369I7210B0699M05156P05188m59417f19233r67522f99752
633G54133A2496a356670M9759e1907C50184g4697j09419F16438N80307l41429
623H55316a04003q54195l88988J91021l91723P7975C1559R99627J75401m5239
613A161348g458j060194M44487H13582L8409c18898n86599K54870K54311E47768
$$ y = [375426, 1222090, 916679, 156725, 202409, 369432, -427986, -904221, -10018, 1434243, 2033766, 1827532, 2104300, 2800573, 1048730, -990842, -998502, -93123, 577067, 175751, -696908, -555411, 690470, 1279068, 986413, 698272, 746402, 402624, -322040, -114436, 1092299, 1934243, 1516453, 352687, -979987, -1822934, -1384822, -421227, -488148, -1226258, -1529928, -548623, 736137, 944966, 507597, 97210, 20699, 425855, 1131043, 671626, -619233, -1586755, -699752, 754133, 12496, -1356670, -1306911, -51907, 350184, -74697, -184116, 616438, 1196745, 855316, -104003, -958198, -1347186, -1156165, -1547888, -1469913, 31559, 1031186, 1206587, 1161348, -7458, -1067652, -623165, 813582, 851991, -318898, -905497, -650627, -396316, 547768]
602A229287l28978D26711J68239M23739n6514B81121c43902l3520a48841k4290
592a73131f9169E50968N86481k82605C82052L3374A05448d43310C95339J222279
582A617618o26218H1198K79364L38958L40866q2702l90895j30688K79994k87328
572D28767a57260r21934L48717D11875p9792c69446B09883K71250g31130J16200
562f14930E75943N75277K31421n48610e67977p02998e71691B68211j15424e53495
551g20375b29519A40290J40657b70864p15480j74133K01642a31221E79090h8804
540i36078L10737b82409a02247E65650O61768k03239D20543r1812K20114J13743
530F62588M53358l06561B92529N25910m755f22968j283437r0293N27532f34182
$$ y = [1229287, 900309, 426711, 594950, 1018689, 962175, 281121, -343902, -377422, -148841, -173131, -69169, 550968, 1137449, 854844, 382052, 415426, 105448, -443310, 395339, 1617618, 991400, 81198, 360562, 699520, 1040386, 957684, 566789, 436101, 716095, 428767, -157260, -1079194, -730477, 411875, 332083, -369446, 209883, 481133, -731130, -614930, 575943, 1151220, 1382641, 834031, -567977, -1270975, -571691, 268211, 152787, -553495, -720375, -229519, 140290, 280947, -270864, -986344, -1160477, -958835, -131221, 579090, -88804, -936078, -625341, -282409, -102247, 565650, 1227418, 1024179, 420543, 328731, 548845, 662588, 1115946, 809385, 292529, 818439, 813684, -622968, -1906405, -1996698, -1469166, -634182]
519d05025m84217p68722J1675P18320F4786L87562c16913j248182p8507L84210
509a259392k86351r7304O84434M78433m05822m35968n6672k98477K34868c46641
498D36915O24128N83862q08502c93091n77601K65776K00142a03088F88231B05155
487i16402o78166J71563f61830a08461j21177m21188j47972K95610O844k87758
477g84102b31156R5465E4349h50853j370970J46724h65977a227n1445j84977j59198
466c96847n97743n35482r9201P61781M22313j08647b66594I03641Q7061a42538
455i66858K06966B52838L90358e52539j020224o71801N24779f16906m53891p17710
445a788507N5271n6860J59903L68282N33683o28321j327812J75782a039572C87311
$$ y = [-405025, -889242, -1657964, -1646289, -927969, 64786, 452348, -316913, -1565095, -1643602, -1259392, -1545743, -1643047, -958613, -480180, -886002, -1321970, -1378642, -1677119, -1442251, -346641, 436915, 1061043, 1644905, 836403, -393091, -970692, -704916, -504774, -103088, 688231, 205155, -916402, -1594568, -1423005, -661830, -108461, -229638, -650826, -798798, -503188, -496344, -784102, -231156, -135691, 54349, -850853, -2221823, -2075099, -865977, -1227, -52672, -237649, -396847, -994590, -1530072, -1629273, -867492, -445179, -553826, -266594, 903641, 990702, -142538, -966858, -759892, 252838, 643196, -552539, -1572763, -2244564, -1719785, -616906, -1070797, -1788507, -1733236, -1790096, -1630193, -1261911, -728228, -1356549, -2684361, -2508579, -1039572, 387311]
434A212771C4522a760894j702047o03480q0964j000537r35205o21193J18471O27706
424e958143p65012r11829N13785n16595j593120j737008j098683m721045J337762
415a5449888j4780868o7905118l5657885e6056789B7581487M630173j1611850
408B0599810j361798k173893j586056k221362k475751k68478L89385K48509j926185
399I224181k502592j560051m72803l86033j184676r82172Q08630R08710j69352
390C683842l33073m44661j079041C73037b63476B44134e15162j155204L18904
381a351462f49962a75592P7753m26792o42028N47150O2790J906b2000G47239A51551
369h16192j055305n27145j060001j505991o00942j853104l02739r752583k5881857
$$ y = [1212771, 34522, -1760894, -3462941, -4066421, -4147385, -5147922, -6083127, -6704320, -6585849, -5958143, -6723155, -7634984, -7121199, -7637794, -9230914, -10967922, -12066605, -16787650, -15449888, -30230756, -98135874, -133793759, -56056789, 27581487, 32211660, 20599810, 19238012, 17064119, 15478063, 13256701, 10780950, 10512472, 10901857, 11150366, 9224181, 6721589, 5161538, 4688735, 4302702, 3118026, 2135854, 2944484, 3853194, 3683842, 3350769, 2906108, 1827067, 373037, -263476, 244134, -515162, -1670366, -1351462, -649962, -175592, -97839, -524631, -1166659, -619509, -556719, -554813, -22000, 747239, 151551, -816192, -1871497, -2398642, -3458643, -4964634, -5565576, -7418680, -7721419, -17474002, -43355859]
360d3355859l123312a2345308A2385951k783127m030433n839o98065j529400j179928
351B159159k91462R3570k00725Q80044J262103l68434j653917q46358M44873J106651
341B585504M87837l29798r97755O20400Q18526p83697q48136k21008N43884N04426
331B380183O36369K93297l92218m95872L28742J41791K12823M6614q96580n43899
321A711250L53322j40989P34999R22930n22230j483626k30004Q67429M27965j023278
311A617768o27014Q8458n4488N7418k7428l73437N1494R76924N94170l58466m59700
300A485699p16780c197A77864d07356l09811E05082P44678m51472J2404A12921
289h24022j97586d21020E50853J103372k4312o00762j44104k60355j50007R68948
$$ y = [-43355859, -46479171, -12345308, 12385951, 9602824, 5572391, 5566552, 4868487, 3339087, 2159159, 1867697, 1961267, 1760542, 2640586, 3902689, 3534255, 1880338, 1033980, 1478853, 2585504, 3073341, 2743543, 1745788, 2366188, 3184714, 2401017, 1552881, 1331873, 1875757, 2380183, 3016552, 3309849, 2917631, 2421759, 2750501, 2892292, 3105115, 3151729, 2255149, 1711250, 2064572, 1923583, 2658582, 3581512, 3059282, 1575656, 1345652, 2213081, 2641046, 1617768, 990754, 1079212, 1024724, 1082142, 1054714, 681277, 732771, 1709695, 2303865, 1945399, 1485699, 768919, -3197, 177864, -407356, -717167, 505082, 1249760, 798288, 810692, 112921, -824022, -1021608, -421020, 550853, 1654225, 1629913, 1029151, 885047, 624692, 474685, 1443633]
279A443633Q76317n56460q39690N96692J854913P22248j733548a50174m78727
270f28901A088523J171021j036081a52130k91257J60184M2307D77898O45823D50705
259f59395m06547o662m13922K63986L31933J33285L29638f4273c1437C8790O05692
248F44482R51631M68982q23008A42595g1661j15101B24277J367083O39438n88743
238A642055J29534N46188o56011F75823N49015J190001m57410E04918d35625E6934
227I20105L52359k54043A54251g55050r38813p71530N81743d41523B5688L8438
217F4126P15260K28907E02696A77869b75493m71211Q6121L3416k8929m77147J07493
206a025750L01549j06910L5736a39155N3394j047869n56835k5514p1287l10810
$$ y = [1443633, 2319950, 1763490, 923800, 1520492, 3375405, 4097653, 2364105, -150174, -628901, 1088523, 2259544, 1223463, -152130, -443387, -283203, -240896, 477898, 1123721, 450705, -659395, -1065942, -1072604, -1486526, -1222540, -890607, -757322, -427684, -64273, -31437, 38790, 644482, 1596113, 2065095, 1242087, 142595, -71661, -186762, 224277, 1591360, 2230798, 1642055, 1771589, 2317777, 1661766, 675823, 1224838, 2414839, 1957429, 504918, -435625, 56934, 920105, 1272464, 1018421, 154251, -755050, -1693863, -2465393, -1883650, -441523, 25688, 64126, 779386, 1008293, 502696, 177869, -275493, -746704, -660583, -627167, -656096, -1133243, -1025750, -724201, -831111, -795375, -139155, -85761, -1133630, -1690465, -1715979, -1787266, -2098076]
196b098076N67811C68824J485234j94606n92869C91205i30972p51421N56897c20005
185d02835n91379J94149b841k14460n80369j38551c11095E22828j09090A49023
174I35965Q10233o75599A26603g3344I3493e37055n98534l14365k52748M41957
164a260745c94822o40439j156857M68829h52911L15574A99735L694c56825p38302
154a095127L35529G82731K43291d30259j169362L45727b05843B89405c5575r4216
144a29791D94582N55312j8081P2499C55660i79212j40894F9256J090637j31768
134A028125b77283j000537O28559b87706l87628k98597K03510B34054R91330O9680
124A295064C59925c13490j52036c9343A100374J016258k37733E5268a344630l75228
$$ y = [-2098076, -1530265, 368824, 1854058, 1659452, 1066583, 391205, -930972, -1682393, -1125496, -320005, -402835, -994214, -800065, -2841, -217301, -797670, -936221, -311095, 522828, 413738, 149023, 935965, 1746198, 1070599, 126603, -73344, 93493, -537055, -1135589, -1449954, -1702702, -1260745, -394822, -1035261, -2192118, -1723289, -852911, -537337, 199735, 203429, -356825, -1095127, -759598, 782731, 1026022, -430259, -1599621, -1253894, -205843, 289405, -35575, -129791, 494582, 1049894, 1031813, 1104312, 355660, -979212, -1120106, 69256, 1159893, 1028125, -277283, -1277820, -649261, -287706, -675334, -973931, -770421, 234054, 1225384, 1295064, 359925, -313490, -465526, -39343, 1100374, 2116632, 1878899, 55268, -1344630, -1719858]
114a719858N64244C27926R59056R3729j82544D07713h4446k14243p49616q01096
104a849401r2122M97377O70443a38393B08380a56588j099399m22698N95824c25731
93e26754l98229k56362Q421M027e32566H63295J03521e65966k75630B42859M85098
82G27957k06260c42596q52076J36779c10630D85486J165368O18040m01087o45297
72A222510D70205g38942n42641L81542a57046N5598k20496B16228O66466K28903
62A111597m80722b34648q76268a57670D91503c10136J7777B77901o8294K76573
52D86180O46700m46614m8265J14334E4756a011800o29242P39971b23385A593e9776
40E45638L42297J94770L11247M75l48949F7658f10990R31N9812A26468J156445
$$ y = [-1719858, -1155614, 327926, 1286982, 1380711, 1198167, 407713, -84446, -298689, -1048305, -1849401, -1941523, -1444146, -773703, -138393, 208380, -156588, -1255987, -1678685, -1082861, -325731, -526754, -924983, -1181345, -1172924, -1168897, -532566, 863295, 966816, -565966, -841596, 242859, 727957, 521697, -342596, -1194672, -1057893, -310630, 485486, 1650854, 2268894, 1867807, 1222510, 470205, -738942, -1281583, -900041, -157046, -101448, -321944, 216228, 882694, 1111597, 630875, -234648, -1110916, -157670, 491503, -310136, -292359, 277901, 209607, 486180, 1132880, 686266, 638001, 752335, 54756, -1011800, -1641042, -901071, -223385, 1593, -59776, 545638, 887935, 1082705, 1393952, 1394427, 1045478, 67658, -610990, -610059, -550247, 126468, 1282913]
29A282913k88347c18820k27946J51245m80723n06265M05928L45730o362P6549
19e60664b28014F23192M25122E19028b32932j28346A13922P72618K07369L7202
9A131111j49829D84422A72637J04912I7401b42112g8905C40830A27688
$$ y = [1282913, 994566, -318820, -546766, -395521, -876244, -1382509, -976581, -630851, -637213, -560664, -228014, 623192, 1048314, 519028, -232932, -361278, 113922, 886540, 1093909, 1131111, 981282, 484422, 172637, 277549, 97401, -242112, -78905, 340830, 127688]
##PAGE= F1=2913.008351145
##FIRST=     18110.137220953, 5591.54909048506, -129745
##DATA TABLE= (F2++(Y..Y)), PROFILE
1023a29745l1206M8518c1623C67741J92868k09141E3584e02954k00812L33620
1013c70146G27871P48507o71787e59580j31907b30775n38788j14182C71910N56353
1003I28263D08290b67490j37330G20833Q29957D84025g02854n9408a78391C98890
992C6679i23836M30677I30566K72698m75499B33207J19376q2925c03774Q5270
982b18504E62898K72287L71584m82302e82277m67095M58058a20539E65746k8191
972E37555A14743b09389m45286k70469h8652I76151O325j27866j53165c35189
961a588277l81316i81882C21888I4588a303566m06183h08263O3822j075025m14348
951b233814a019580D26678J41049j19342j11841h8232B21160P64669j22480E4307
$$ y = [-129745, -160951, -112433, -31623, 367741, 560609, 351468, 53584, -502954, -703766, -370146, 727871, 1476378, 804591, -559580, -691487, -230775, -769563, -883745, 371910, 928263, 408290, -267490, -404820, 720833, 1550790, 484025, -702854, -762262, -178391, 398890, 36679, -923836, -493159, 930566, 1203264, 727765, 233207, 352583, 269658, -303774, -218504, 562898, 835185, 1206769, 724467, -582277, -1049372, -591314, -120539, 565746, 537555, 114743, -209389, -654675, -925144, -88652, 976151, 982476, 854610, 701445, -335189, -1588277, -1969593, -981882, 321888, 94588, -1303566, -1709749, -808263, -744441, -1819466, -2233814, -1019580, 426678, 567727, 448385, 336544, -88232, 221160, 985829, 863349, 54307]
940f03886j24015K24697C20460O76380q2894b46241m41834K01838K31535E45880
929A911001k99819G01611A71580d27094o09287d51408D74800Q8959c88050p62169
919a150219n20640q5866L26069p3635n7721M99461K63578b39893G81188J90951
909I72139k48453o7165b8951p83045K59734C50343Q6056c27252j44981J20698
899c51535k7440c7464E94500j98907B1310N42176P33790K23489F18469F8016L9679
888A07695L84332I1842e03486K36782E89318O43829m0744R7792p5508B27717c45293
876c50393p9968n47111L14470A15948a55901j114118O3810a02420o9009j320786
866a492215n08954L33669O26954J79491k16341j82867k00085o3134L12513r6256
$$ y = [-603886, -727901, -503204, 320460, 996840, 913946, -246241, -688075, -486237, -254702, 545880, 1911001, 1611182, 701611, 171580, -427094, -1036381, -451408, 474800, 563759, -388050, -1150219, -1670859, -1756725, -1430656, -1504291, -1562012, -1062551, -798973, -239893, 781188, 972139, 723686, 656521, -28951, -811996, -552262, 350343, 436399, -327252, -472233, -351535, -378975, -37464, 594500, 395593, 21310, 563486, 1297276, 1520765, 618469, 68016, 107695, 492027, 91842, -503486, -266704, 589318, 1233147, 1192403, 1290195, 1214687, 227717, -345293, -350393, -430361, -977472, -663002, 115948, -155901, -1270019, -1206209, -102420, -171429, -1492215, -2001169, -1667500, -1040546, -861055, -1077396, -1260263, -1460348, -1523482, -1210969, -1307225]
856a307225k9149b68252G29407j1536j9747J868K45733k79084A62178K68765P12189
845A143132k14277l4463P42455j73916o83939K88036O43737p49507B39646q3088
835A56558c92749n46290c99526J34519A28523J014145m38065b82613A26370P09604
825H35974J07637k13067l14949G4378c57498l55912L52636C85671M67457K79351
815A132479n32034k86190K56900M44046m46769g91892r78822J52186a89355F46923
804F8652d45896m49215j048958M58515C74495K64428e83823p94194J58495i4347
793I27958J99434k42389j52819B97992h696m37490k02489B55902J087197m63069
783H80030d84732m34203K27171o35239j80223d88247D11310N72208N46344m42763
$$ y = [-1307225, -1336374, -268252, 729407, 717871, 698124, 699992, 945725, 666641, 162178, 430943, 1143132, 928855, 894392, 1636847, 1462931, 778992, 1067028, 1710765, 961258, 239646, 156558, -392749, -939039, -399526, -265007, 128523, 1142668, 704603, -282613, 126370, 835974, 943611, 730544, 415595, 74378, -357498, -713410, -360774, 385671, 853128, 1132479, 600445, 314255, 571155, 1015201, 568432, -791892, -1770714, -1618528, -189355, 646923, 68652, -445896, -895111, -1944069, -1485554, 374495, 638923, -583823, -1378017, -1219522, -94347, 927958, 1127392, 885003, 732184, 297992, -8696, -446186, -648675, 255902, 1343099, 880030, -484732, -918935, -691764, -1327003, -1507226, -488247, 411310, 983518, 1529862, 1087099]
773A087099A31229g70402n65519M9669N41693C45591N73920j09648K9179K79328
763A118370K02272R7569j41519l11906n2940K64536P1639k39816l8257J90168
753A160116m82733e09020r83708q74140l30830P70818Q45243M97366K30167O8732
743b85372A88407L45922I7927C614K44320b2391o86297n13331K50903F9984L85225
732D55209a22359d0948E34596D5909g53618o22101K90395d22711b07735i24B35285
720B39939L59337k1078d35583l39404A39673R7713g29337l59404c27087A48377
709H33268R33566J32648F24251g13185K94778M5487n78826l33397J43851a72495
698E36876j53645K52390M40122N009j08097D51604d90577j97895D43785M77026
$$ y = [1087099, 131229, -770402, -1335921, -1286252, -744559, 345591, 919511, 809863, 839042, 1118370, 1320642, 1418211, 1276692, 964786, 911846, 1176382, 1248021, 1008205, 969948, 1160116, 677383, -509020, -1492728, -2366868, -2697698, -1926880, -1081637, -584271, -354104, -285372, 188407, 534329, 97927, 3614, 247934, -22391, -708688, -1222019, -971116, 69984, 455209, -122359, -40948, 534596, 45909, -753618, -1375719, -1085324, -422711, -207735, -924, 235285, 239939, 599276, 578198, -435583, -774987, 139673, 237386, -729337, -1088741, -327087, 148377, 833268, 1766834, 1899482, 624251, -713185, -418407, -372920, -951746, -1285143, -1141292, -172495, 536876, 383231, 635621, 1075743, 1080752, 972655, 451604, -490577, -688472, 443785, 920811]
688I20811a02292p1143G29115C14441h15685K37704A84270b06562m52023B1635
677A195936N84183k88709J57013Q12111A019405a072378k42076b72661E23948
667E0274h10768j08913i6700C74606n7106m5915R4421A20930e05747J07610H13194
655A743017l95656A35909a396800q72953N52295d97031J09342q78767m20683g07766
644C95575K81669j08643A78054d65905j0768B75874M6136b59434p01216K05250
634g55400B33014d97483j133964N62844D68620M26269k79373p6323M86240L53228
624A378661l50682B22579c98284m30018j82402n29758k46839g96622D51114P01171
614A152285J90648b2371j320957M41039F41387L4761e84429m98461J57428K52
$$ y = [920811, -102292, -173435, 729115, 314441, -815685, -577981, 184270, -206562, -658585, 21635, 1195936, 1780119, 1491410, 1648423, 2460534, 1019405, -1072378, -1314454, -272661, 523948, 50274, -810768, -919681, -96700, 374606, 317500, 271585, 366006, 120930, -505747, -398137, 813194, 1743017, 1347361, 135909, -1396800, -2269753, -1717458, -497031, -387689, -1266456, -1687139, -707766, 395575, 677244, 568601, 178054, -465905, -476673, 275874, 322010, -259434, -960650, -755400, 233014, -497483, -1631447, -1068603, 468620, 894889, 615516, 539193, 1025433, 1378661, 1027979, 222579, -398284, -828302, -1010704, -1540462, -1787301, -796622, 451114, 1152285, 1342933, -22371, -1343328, -902289, 641387, 676148, -584429, -1082890, -925462, -925210]
604i25210I5696J097392L0179n52250L86342R48730m86531B47409e37959k37536
594g75495P806J49745e3628D99855M25640j91952B35788O6960C9886f58616g0656
582A108281l39083H9929K88524K49856M00587J0382C71042g9863D61432K63560
572G24992C0478a370681K10476A32789K13316d07776i3054B20572f09870k33782
562h43652a42307A40785M61656j68650g58906m77237c49084F00374A51i16165
551h71401A72788P18315K2272i1979q67473k99336M81753C97062P54744A5189
540a163684K72053L06863b91255I08472J130865j54946r30582B02053b3971B74982
529H04534A44751d55793C83183K49378e37083j074015K00078a29861F72334A14788
$$ y = [-925210, 95696, 1193088, 1223267, 671017, 1057359, 2006089, 1519558, 247409, -537959, -775495, -767689, -617944, -53628, 499855, 925495, 733543, 235788, 302748, 39886, -658616, -70656, 1108281, 769198, 89929, 378453, 628309, 1028896, 1039278, 371042, -79863, 461432, 724992, 30478, -1370681, -1160205, 132789, 346105, -407776, -93054, 220572, -609870, -843652, -142307, 140785, 602441, 433791, -758906, -1236143, -349084, 600374, 151, -916165, -871401, 172788, 891103, 913375, -91979, -959452, -1258788, -777035, 397062, 1151806, 15189, -1163684, -891631, -584768, -291255, 908472, 2039337, 1884391, 953809, 202053, -23971, 274982, 804534, 144751, -455793, 383183, 632561, -537083, -1611098, -1411020, -129861, 672334, 114788]
518i73519q24126K25871c69572H01465K5231b52070j291274k66775J40633k9769
508a699255M64249a94805g2404q90825k92505K40040n55362j44199f41647B35312
497I73363J134092N198r61947B56186l0378A04087m3422M87777B73776e75516
486a065992J40003c85279C42883M28040l3652l60093j63756F7098J07791Q14105
476I88994q2320J15560H6498a369590m7982b70655H07496J34310k41463k83074
466D17269b56701o3501A51036K63169k05531a01296B67084J541815L90301j059258
456A139942B16100J12988Q75107K99629B78408g26678l01465A81399J391523F06174
445f69506j25189j35022P3279b72996C86995c10321j648616K33823D36679J744307
$$ y = [-973519, -1797645, -1571774, -369572, 801465, 826696, -252070, -1543344, -1810119, -1669486, -1699255, -1235006, -194805, -72404, -963229, -1255734, -1015694, -1571056, -1715255, -641647, 235312, 973363, 2107455, 2112653, 1150706, 256186, 225808, 104087, 60665, 548442, 273776, -575516, -1065992, -925989, -385279, 342883, 770923, 737271, 377178, 213422, 67098, 174889, 988994, 906674, 1022234, 86498, -1369590, -1417572, -270655, 807496, 941806, 700343, 417269, -256701, -320202, 151036, 414205, 208674, -101296, 267084, 1808899, 2199200, 1139942, 216100, 329088, 1204195, 1503824, 278408, -726678, -1028143, 181399, 1572922, 606174, -669506, -794695, -929717, -856438, -272996, 386995, -310321, -1958937, -1725114, 436679, 2180986]
435B180986Q51974q89927C55584f47756n9473l239r25694r78792o09397M22540
425b801811O35841p98065n74952O57415L27715O57339O30193m46255r49944i10005
414c223295j6145498p557777f613616A3384573K34451m636237l6098J076593K36024
405A0259306j280730j658041L86417M588700N295169n519262C497625h07120a29472
395a7071C53383J9427K99499R436K00176O78067K96356n75957d61263j083171
385a544434L66916m34656j028691P80915M84424f34278K96120L666o104C8763
374f08990k43574D78897J140560l07733o05966D2333a04194n46681j556636j009065
364c216576r92129O1751j892718l590836J879061e34210B092944a33012F09057
$$ y = [2180986, 3032960, 2143033, 355584, -647756, -707229, -710468, -1636162, -2614954, -3224351, -2801811, -2165970, -2964035, -3538987, -2881572, -2553857, -1896518, -1266325, -1712580, -2662524, -910005, -3223295, -19368793, -26926570, -6613616, 13384573, 13619024, 8982787, 8946689, 10023282, 10259306, 8978576, 7320535, 7706952, 12295652, 17590821, 12071559, 3497625, -807120, -129472, -17071, 353383, 372810, 672309, 681745, 881921, 1559988, 1856344, 1280387, -461263, -1544434, -1177518, -1612174, -2640865, -1859950, -1375526, -634278, -338158, -334492, -340596, 38763, -608990, -852564, 478897, 1619457, 1311724, 705758, 42333, -104194, -650875, -2207511, -3216576, -4208705, -4146954, -6039672, -9630508, -7751447, -534210, 2092944, -133012, 609057]
354A806974m63173f10790k02064f9473q77819j042653P30998D79748K79145b58559
343a147729d74315F03476J75831A74628d65442D23347Q03217E35306c8088I8724
332C19467J68300P81432N10281n58573k38738J022509O14882J32821l35152r94307
322A422922o38741K6604k04945R08216J520768m24577D53769g14684B72519J061392
312A333911B80414h07110N4706b99923A14813M55153A77206g468H89967M45303
302A335270n04125A64711g63597l64700e54928l12951o34557O94110B12005b04535
291c319A44608e89253p87925J62270d15247E40796J06456j07020J93582k28796
281E05018C3642M28530M30319C99420B6390J094130J875400O73073j617481d6559
$$ y = [1806974, 1343801, -610790, -812854, -69473, -947292, -1989945, -1258947, 479748, 758893, -258559, -1147729, -474315, 603476, 779307, 174628, -465442, 423347, 1226564, 535306, -38088, 98724, 319467, 487767, 1269199, 1779480, 1220907, 982169, 2004678, 2619560, 2752381, 2417229, 1422922, 784181, 810785, 605840, 1514056, 3034824, 2610247, 453769, -714684, 272519, 1333911, 280414, -807110, -752404, -299923, 114813, 569966, 177206, -7468, 889967, 1335270, 831145, 164711, -763597, -1128297, -554928, -867879, -1502436, -808326, 212005, -204535, -3319, 144608, -589253, -1377178, -1214908, -415247, 540796, 647252, 540232, 733814, 505018, 33642, 462172, 892491, 399420, 26390, 1120520, 2995920, 3668993, 2051512, -46559]
270c42972A073852J016914q17041G2235d24510l02081l01412c19824F58236l04872
260C53364f06700o80051l20366l64206M25315g57665c27378J48796j09663j74109
250d62354J00516B20603M65914p7050e6532l68434J05640Q1673A88005J178800
240A366805J90744p08280N31657O97121o87850n50742N94762R47823o15053A78968
229c11578H91245Q47140l12082G07812a4677o41575j203433p94755J165873E4048
218A94074E0365Q14464K73100m84163k13939j88018a21875j33529m0297J4243
208b81458m40389Q4094j89812p60388M4848c70719A29767f51315q27208n37930
198b016453O7207P6071O38643G26853J684121l07329p54353o50236d22468p20856
$$ y = [-342972, 1073852, 2090766, 1273725, 72235, -424510, -726591, -1028003, -319824, 658236, 353364, -606700, -1286751, -1607117, -1971323, -1546008, -757665, -327378, -178582, -288245, -462354, -361838, 220603, 686517, 609467, -56532, -424966, -319326, -237653, 188005, 1366805, 1557549, 849269, 1380926, 2078047, 1390197, 839455, 1434217, 2382040, 1766987, 178968, -311578, 891245, 1738385, 1426303, 707812, -14677, -656252, -1859685, -2654440, -1488567, 54048, 194074, 50365, 864829, 1137929, 653766, 439827, 251809, -121875, -255404, -295701, -281458, -721847, -637753, -827565, -1587953, -1543105, -370719, 129767, -651315, -1478523, -2016453, -1949246, -1873175, -1234532, 726853, 2410974, 2103645, 1349292, 699056, -422468, -1143324]
188a143324M43700A39117o2009f25969K08450E00263B15697c35264k75089K57399
178c52954C74574o6303F5077R96808Q60417r58457a4682I3805L50523a82283q29994
167a012277m09231l38490J62354g27920j93211q68821M22526f64572K28405I6572
156C2274b49539m70173K87549H11523J81690f42635j185820O07456a95750B97857
145B93674L54737O40001N9466m55118J35915m96467f71407m29903h7830I55802
134H76978c59323p07895c04795C4976a11017r6369h0140G18106O06948k45307
124A079747A43829b35345p333H7431O56269P66208o6230i1864j172294r6059M95642
113h64575C60424Q04338j5403K21985k77263n30764A72135e01586o87242P7296
$$ y = [-1143324, -699624, 139117, 77108, -625969, -417519, 500263, 215697, -335264, -610353, -352954, 374574, 308271, 65077, 1061885, 1922302, 963845, -14682, 93805, 444328, -182283, -1012277, -1421508, -1759998, -1597644, -727920, -921131, -1789952, -1367426, -664572, -436167, 96572, 32274, -249539, -719712, -432163, 811523, 993213, -642635, -1828455, -1220999, -195750, 297857, 293674, 648411, 1288412, 1347878, 892760, 1028675, 532208, -671407, -1101310, -87830, 955802, 876978, -359323, -1067218, -304795, 34976, -111017, -207386, -80140, 718106, 1325054, 1079747, 143829, -235345, -242678, 87431, 743700, 1509908, 1443678, -91864, -1264158, -1360217, -864575, 360424, 1164762, 1149359, 1371344, 1094081, 563317, 172135, -501586, -1188828, -1111532]
103a111532d90315B290M31740K97581C32723g89007k62611M78204A08437D8651
92b48354m70144m29948l0484c65785A173993K12139f1401l64101G29331O58251
82A387582M9069F96821d35648n20940J67424C836J330298R24452M8399k80479
72B026506q09346B0237f20858K75305C70793j68120e55306b02705E04474L16009
62H20483j26663A37808i46767M26829A4025e59804J12579f0833j25480j61197
52c47510B28108F4263k5864J42122b37763p02586m23915f62188K73218j5543H7115
40A042755J54481j85600o238L79251k62400C42138a79184k43887m96064K13673
30g05462D92496L27277b5518j91419d6338k69800o85095j15529J27317J00882
$$ y = [-1111532, -490315, 2290, 434030, 731611, 332723, -789007, -1051618, -573414, 108437, 48651, -248354, -718498, -1148446, -1178930, -365785, 1173993, 1386132, -61401, -425502, 729331, 1387582, 1436651, 696821, -435648, -956588, -789164, 3836, 1334134, 2258586, 2306985, 2026506, 1217160, 20237, -620858, -345553, 370793, 202673, -555306, -202705, 504474, 820483, 693820, 137808, -946767, -519938, 14025, -559804, -447225, -60833, -186313, -347510, 228108, 64263, 38399, 180521, -237763, -940349, -1364264, -662188, -388970, -404513, 87115, 1042755, 1197236, 1011636, 1005398, 1384649, 1122249, 342138, -179184, -423071, -919135, -705462, 492496, 819773, -25518, -216937, -46338, -316138, -1001233, -1116762, -989445, -888563]
20h88563J30469L08250E70849O95816l64684B98562a14662q0975B96590N33197
10H29787K96080k10040C17987H0866J71573c20584r82729K02011e5396B10900
$$ y = [-888563, -758094, -449844, 570849, 1266665, 901981, 298562, -114662, -195637, 296590, 829787, 1125867, 915827, 317987, 80866, 252439, -320584, -1303313, -1101302, -55396, 210900]
##PAGE= F1=2891.390813634
##FIRST=     18110.137220953, 5591.54909048506, 8152
##DATA TABLE= (F2++(Y..Y)), PROFILE
1023H152e8271l5759m3668A73973J51788E4727c13294m76382j25494K62286D33327
1011A498858m03684a69394k88049a27379n32157l62101f6910E05728B01903b62330
1000a88172I06695O92780C64196a011464k39362N58142A27386a78062j009093
991a187155N04968H30552J60225m45486A27011K24938J0188b35887M0102F23403
980I61097M15798l13019b86466p48968J05098J15417b32571a10832k96657n5630
970d63119J05532N5889C30990Q84241K75595J68067k52395A07154a456772o30965
960b087737R52340C28013n7268a230887l53645f31927q8532j389767n26776a156722
949D89726n1715A1893L0835a66070p002B37202n2816c94810m52150K10792f7816
$$ y = [8152, -58271, -94030, -137698, 173973, 325761, 54727, -313294, -789676, -915170, -652884, 433327, 1498858, 1095174, -169394, -457443, -127379, -659536, -1021637, -66910, 505728, 201903, -262330, -188172, 906695, 1599475, 364196, -1011464, -1250826, -692684, 127386, -178062, -1187155, -682187, 830552, 990777, 545291, 127011, 351949, 362137, -235887, -195785, 623403, 961097, 1376895, 1063876, -286466, -1035434, -930336, -814919, -232571, -110832, -407489, -463119, -357587, -301698, 330990, 1215231, 1490826, 1658893, 1406498, 107154, -1456772, -2087737, -1135397, 328013, 270745, -1230887, -1584532, -631927, -720459, -2110226, -2637002, -1156722, 489726, 438011, 11893, 42728, -166070, -173072, 237202, 184386, -394810, -846960, -636168, -67816]
937I54858O97265m00605e0701o97936J43308K92256B62519J132159L3477o19194
927H08961C61966b79119q27542M07052F71566Q26708D50438h49808q24681l70640
917b045129J74844K78620N51241c14651k33279o8640C86991N25585o9455q1926
907G61195G9333i00153K81356C80324r0183f38491K56730D07036K09446k10126
897D06356l318c1659l63460A86621Q81907K52428C66615d3254A45046L37639c468
885e31355g5593H42121L72751l07711J18192R5853A25593c46510b7995j60020
875a88015r28811J15666c1803j5633r22796M74187H37032C08398a066980j31846
865a198826L19427M09121L0323k70499k19389k83129l18898J807j62892K73572
$$ y = [954858, 1652123, 1251518, -50701, -748637, -605329, -313073, 262519, 1394678, 1428155, 808961, 361966, -279119, -1106661, -699609, 671566, 1498274, 450438, -849808, -1674489, -2045129, -1870285, -1591665, -1040424, -314651, -547930, -616570, 386991, 912576, 843121, 761195, 79333, -900153, -618797, 380324, 290141, -638491, -381761, 407036, 616482, 406356, 403038, -31659, -395119, 186621, 1068528, 1320956, 366615, -43254, 145046, 482685, -3468, -531355, -75593, 842121, 1214872, 907161, 1025353, 1121206, 125593, -346510, -27995, -188015, -1116826, -1001160, -31803, -47436, -970232, -496045, 837032, 308398, -1066980, -1198826, -879399, -470278, -439955, -710454, -929843, -1212972, -1531870, -1530063, -1692955, -1419383]
855a419383I4985R77357Q1236r1660l77349q1704k19192F9838J70799M85677k45901
844D80413j76865O96587K11598k52528M8882K29701m08409k83977j80192c55890
833h89792d12189b3110D62893R18611l64679I9856J70836m940A31309o4059c64689
821e43754J96712j32056K05936D81940O72689K94215o09051C85874A64367M41609
811F05976k89024h29515j048433k356d01011F41475i0543p00916n81014q54634
801b227107P55240C34972P4863e73738o12566J97638B87742Q83120k28208D09212
790B85571b52391k83866o0299R2716B00378R40535q341C53412c98225m10307o58497
779a467029J68671D8839J115983L20312J08617o77677c27983j063383l06842M18120
$$ y = [-1419383, 94985, 1072342, 1153578, 1061918, 684569, 602865, 383673, 69838, 240637, 726314, 480413, 303548, 1000135, 1211733, 959205, 1008087, 1237788, 829379, 545402, 365210, -355890, -889792, -412189, -23110, 462893, 1381504, 1016825, 99856, 270692, 265752, 131309, 67250, -364689, -543754, -347042, -479098, -273162, 481940, 1154629, 1448844, 839793, 385874, 164367, 605976, 316952, -829515, -1877948, -1880304, -401011, 641475, -90543, -791459, -1372473, -2227107, -1471867, 334972, 409835, -573738, -1186304, -988666, 287742, 1170862, 942654, 409212, 285571, -252391, -536257, -596556, -503840, 200378, 1140913, 1132572, 353412, -398225, -808532, -1467029, -1298358, 48839, 1164822, 1485134, 1593751, 916074, -327983, -1391366, -1698208, -1280088]
769a280088e42286E96797M48230j88962K66527L74772k23395E74855q3706J72688
759F63837K77395K21093j70019l00125K5159N1034d9927q30855l67482p34446
749a982710l84888Q35659P00576J43301L11410c2808C95324K24434B57457j786
739B55671L98595j49079B4052h06819o87397P42128a780k90807a19168C73455
728a82046p89819k90825K58891L58544K19973g9292E86089N82684J34131E50170
717g65698m52023d17130Q7562q69992k85969d87931C25593O43929M81111J17757
707A568390G70771d95587Q019l0327k69532j88264j7957L57947c08684J32273
697a76411C33963N74510K82593K83964n47487e61262m93848A26161N68405a88174
$$ y = [-1280088, -542286, 596797, 1045027, 856065, 1122592, 1497364, 1273969, 574855, 491149, 663837, 941232, 1162325, 992306, 692181, 717340, 768374, -49927, -880782, -1248264, -1982710, -2367598, -1531939, -831363, -688062, -376652, -32808, 395324, 619758, 257457, 255671, 654266, 505187, 24052, -806819, -1494216, -752088, -1780, -292587, -119168, 373455, -182046, -971865, -1262690, -1003799, -645255, -425282, -79292, 586089, 1168773, 1302904, 550170, -765698, -1217721, -417130, -329568, -1199560, -1485529, -487931, 325593, 969522, 1450633, 1568390, 770771, -495587, -487568, -517895, -787427, -975691, -993648, -635701, -308684, -176411, 333963, 908473, 1191066, 1475030, 927543, -561262, -1055110, 126161, 694566, -188174]
686e20908B23444a98263j276331M14587B6147h4489l18603A07159Q72263N98414
676A577836l78478j45689Q96749q33567g75625m57697e7122H90937B50282h30271
665a222407K23554K44313c20001H0082K70960j15657c64395j56487C92868P58365
655A151233j21472A60158a267190q69897M67177e26866K15919p64148k66850d44257
644B57781L42337L16685l07280e62420m10679b93966F8053A040d12147k03031
634f15178a47336o47925p38254d56078A135030N23344j05825j48986J13940K2657
624A540160m03919E45057B67042e9121m93012o44159m81694N41588A21305Q72390
614I93695M03425B47335a127886L32597D92044j01889h25409k26292J38203k51340
$$ y = [-520908, 223444, -198263, -1474594, -1060007, 26147, -84489, -403092, 107159, 979422, 1577836, 1199358, 1053669, 1950418, 1116851, -775625, -1233322, -57122, 890937, 250282, -830271, -1222407, -998853, -754540, -320001, 80082, 351042, 235385, -364395, -520882, 392868, 1151233, 1029761, 160158, -1267190, -2137087, -1669910, -526866, -310947, -1075095, -1341945, -444257, 257781, 600118, 916803, 609523, -562420, -973099, -293966, 68053, 1040, -412147, -615178, -147336, -795261, -1533515, -456078, 1135030, 1658374, 1552549, 1403563, 1517503, 1540160, 1136241, 545057, 267042, -59121, -552133, -1196292, -1677986, -1136398, 121305, 993695, 1397120, 247335, -1127886, -795289, 492044, 390155, -825409, -1051701, -913498, -1164838]
604a164838b41223A148164M21519n52337K44905Q82867n50420B89634e06623n54599
594a061222m10529J80476b14110B86224L73419K8600B97954K0755a7591q74660
584h92251K49590D20187P4435A30049J85188K66105M75324J08031C81670c70784
573B39036P22863B85132a383416k2741a16167D69026b28112j24095g8313j55576
563b33889m80899L0545r5165a06015B50268d99293k30470A11724O58380c18996
552a203948L72448D80086Q72808l99561a44627m20994j29247a12136I92485N47946
542A540431E3457a298691K22349K51917L47226A074935J410398k39412A021718
532b9558l75020G4801L39952g36652p10746d24232c2878p82172n93958N64652
$$ y = [-1164838, -241223, 1148164, 1569683, 1017346, 1262251, 2145118, 1594698, 289634, -506623, -1061222, -1471751, -1291275, -214110, 286224, 659643, 688243, 297954, 318709, -17591, -892251, -642661, 420187, 494622, 130049, 315237, 581342, 1056666, 1164697, 381670, -370784, 239036, 961899, 285132, -1383416, -1406157, -116167, 469026, -228112, -352207, -78313, -233889, -714788, -684243, -779408, -106015, 250268, -499293, -729763, 111724, 770104, -318996, -1203948, -831500, 480086, 1352894, 953333, -144627, -565621, -694868, -112136, 992485, 1540431, 53457, -1298691, -1076342, -824425, -477199, 1074935, 2485333, 2245921, 1021718, -29558, -404578, 74801, 414753, -736652, -1447398, -424232, -32878, -815050, -1409008, -844356]
522h44356G93814O10273D12449a026795p17142M40699B74727J199710l55643b00496
511a425106k59678j70318L5905Q38754A73894g9674j124988q5243M66619m89772
501a313058k91585f81017G6747O43413J389114M91222o79785p81687j12614m29231
491E97179H4116J13318q873c33579k57699J52624a41699F58324Q22795K08665
481A689784o69371D26154H9560L66640R08537J42163J49166G96402e68528j64165
471g32693A14976R57487K40647m24288B47533b46835A03363P11489k11157D9290
460b77496B93395J590202M72738j022232C83686J16853R12503K64207D57441e49020
449e71818I97030J391330A008795e56628R3531P0828O7165C70040O69875B64823
$$ y = [-844356, 793814, 1404087, 412449, -1026795, -1743937, -1303238, 274727, 1474437, 1118794, -200496, -1425106, -1684784, -1855102, -1819197, -980443, 173894, -79674, -1204662, -1289905, -823286, -1313058, -1604643, -681017, 76747, 720160, 2109274, 2600496, 1920711, 1139024, 1026410, 597179, 84116, 197434, 188561, -333579, -591278, -438654, -141699, 658324, 1481119, 1689784, 1020413, 426154, 89560, 456200, 1364737, 1506900, 1656066, 796402, -568528, -732693, 114976, 1072463, 1313110, 888822, 247533, -246835, 103363, 814852, 603695, 49290, -277496, 293395, 1883597, 2356335, 1334103, 383686, 500539, 1413042, 1677249, 457441, -549020, -571818, 997030, 2388360, 1008795, -556628, -463097, -392269, -325104, 370040, 1039915, 264823]
438a615849j05860B38547J816116J132277j85980A368496n98383L6547k21164
429E85496A70480c53329n75366J32440L31613o00622o37307l94709O13233E64217
418B095548q19406N11632Q63715j32881j000964Q59465K794915q80548j548933
409B742543f00632J073A452107J077881o02579k19806J263804N683022O074112
400A4728541o369321g53304l966896J350936R78260b66408H43356C84586b99196
390C4969Q64148O70272r0514b41671j347526l06624n3344m00547R58072O64528
380g27112C37954J7497j65713M74209L16448a19603n54061A166896J426326K710
370B595932k88290j06431k41278p54524c47733j261396o15153n9084k62398O44902
$$ y = [-1615849, -1721709, 238547, 2054663, 3186940, 3000960, 1368496, 770113, 806660, 585496, 170480, -353329, -928695, -796255, -464642, -1065264, -1702571, -2097280, -1484047, 564217, 2095548, 1276142, 1787774, 2651489, 2518608, 1517644, 2377109, 5172024, 4291476, 2742543, -600632, -599559, 1452107, 2529988, 1927409, 1707603, 2971407, 8654429, 14728541, 8359220, -753304, -4720200, -3369264, -2391004, -266408, 843356, 384586, -299196, 34969, 899117, 1569389, 1478875, -241671, -1589197, -1895821, -1949165, -2349712, -1391640, -727112, 337954, 355451, 189738, 663947, 980395, -119603, -673664, 1166896, 2593222, 2595932, 2307642, 2201211, 1959933, 1205409, -347733, -1609129, -2224282, -2283366, -2545764, -1900862]
360a900862G5048J946397G94221f62664F38157Q33876F15847g95416c37277H37350
349f57616j726208J12941a029550b64835j14015o77032L39099b27832k43468n50725
339a022025L48397B76070o5577e68278m3701f3681r8701j74508A92309P19688
329I11997m46617n1179J192452Q01721p8584o89441H15836A94879a91152k71182
319d62334G38426J979676l97594a78192j784474Q94735C52537c65128j074415
310a439543O181N43232M43152A84213b41051k58276B78128K40004c8075q69353
300i07428q33032L08717O84655j33661n34742M71800a33710m47479J53810C70745
289a36146j082299j36568N23234b74237e8820A60965M37513k36703c21492L0895
$$ y = [-1900862, 75048, 2021445, 794221, -662664, 638157, 1472033, 615847, -795416, -337277, 837350, -657616, -2383824, -2270883, -1029550, -264835, -378850, -1055882, -716783, -227832, -471300, -1022025, -673628, 276070, 210493, -568278, -611979, -63681, -162382, -336890, 192309, 911997, 465380, 414201, 1606653, 2408374, 2329790, 1640349, 815836, 194879, -191152, -462334, 738426, 2718102, 2320508, -178192, -1962666, -1067931, 352537, -365128, -1439543, -1433362, -890130, -446978, 184213, -241051, -499327, 278128, 518132, -38075, -907428, -1740460, -1431743, -747088, -880749, -1415491, -943691, -133710, -581189, -427379, 370745, -136146, -1218445, -1355013, -831779, -274237, -58820, 160965, 598478, 361775, -321492, -290597]
279b90597L6840m96982K5730F07140J661298N83910j192214B83852q3264Q00988
269A001576N75155l93822E11065a05714q11757n29016O78365C01022J27065a42451
258i25479o31414k44372M17471d04215B15601O1301a71690l95936J75377B18470
247B46439d82006m98394K22824L33468a77997B40176P07798l73606B8706Q85743
237I14449O96343n89590r4307N82257N50731q35068c19420J45884A595920Q17099
227B413019q14890D31121a14296k65395j227870p71417h99130C89543I9797f0252
216A033263M91553n58164j54927R4701C86654f2228b4269C4050c72012N548o34833
205a001297j205111J33674d32724E46590b9324j118981q42867K10635K35925M20528
$$ y = [-290597, -253757, -750739, -725009, 607140, 2268438, 2852348, 1660134, 283852, 200588, 1001576, 1576731, 1182909, 511065, -105714, -917471, -1446487, -768122, 301022, 428087, -142451, -925479, -1556893, -1801265, -1383794, -404215, 215601, 276902, -171690, -567626, -392249, 218470, 246439, -482006, -980400, -757576, -424108, -177997, 240176, 947974, 574368, 28706, 914449, 1610792, 1021202, 926895, 1509152, 2059883, 1224815, -319420, -173536, 1595920, 2413019, 1598129, 431121, -114296, -379691, -1607561, -2378978, -899130, 389543, 99797, -60252, 1033263, 1524816, 966652, 811725, 906426, 386654, -62228, -24269, 34050, -372012, -366464, -1001297, -2206408, -2072734, -432724, 546590, -29324, -1148305, -1991172, -1780537, -1544612, -1124084]
195a124084F97990J832385k81947p66182n25795A51291d49092J77940C34586M6894
185C81480b50523h2129G18541C55919i8451l54667k27360a56503b2911o7737A109139
173B104958r80435B6772J37069L51498c0291q78243k94457k99837j68754N71566
163a100016K54578m07337L92999L36478J1697b18755N5609f1281j43540M4750
153a60071E53886J63825h49347j165055Q28883a80646B46193J94162O74728N83328
143A698411m52558C56365P8614n9817d14408n78776c60542C90680j37665e89949
132g50605f6841a1111H8747K63716N5865M50908K47072l68604h9625n6926A21865
120B07530R0103N21804P393d47278r07587K48465L14762A10531O47668p2327M98523
$$ y = [-1124084, 697990, 2530375, 2248428, 1482246, 956451, 151291, -449092, -271152, 334586, 381480, -250523, -82129, 718541, 355919, -98451, -453118, -680478, -156503, -22911, -90648, 1109139, 2104958, 1124523, 26772, 163841, 515339, -30291, -908534, -1202991, -1502828, -1671582, -1100016, -845438, -1252775, -859776, -523298, -511601, -218755, -163146, -61281, -204821, -160071, 553886, 717711, -849347, -2014402, -1185519, -180646, 246193, 440355, 1115083, 1698411, 1245853, 356365, 434979, 375162, -414408, -993184, -360542, 390680, 253015, -589949, -750605, -66841, -11111, 88747, 352463, 408328, 859236, 1106308, 737704, -89625, -146551, 121865, 207530, 297633, 819437, 826830, -447278, -1354865, -1106400, -791638, 110531, 758199, 685872, 1184395]
109A184395J85703n02217C91400g3174n69400J08503A35666L05009L16946L70124
99A127745l72475b67987o1067a6031D42684O5523j52839c53169p46277K1243a12220
87A321559K25254C38850h9984H62751O64024K92821n37345B3875a003470m33460
77a436930O33703D67151J253981N92681M9070q11995E75141f1123A8826O31544
67F50370C10181h93775J66038C5018K15223J37236n9663e90431j98919J69865
57f19485l45917J55672K04526j93857n14926M42645L45461j80807q4695k0958
47h12341r9554k36686M38787J38522N4429B60994R24181M523l08424q5182N55545
36A351637l73222D38614B04197b14804q86759j59153b20830D47816I5625B9136
$$ y = [1184395, 1370098, 867881, 391400, -73174, -642574, -534071, 135666, 440675, 757621, 1127745, 755270, -267987, -329054, -16031, 442684, 508207, 355368, -353169, -1099446, -1078203, -112220, 1321559, 1546813, 338850, -89984, 862751, 1526775, 1819596, 1282251, 23875, -1003470, -1436930, -803227, 467151, 1721132, 2313813, 2362883, 1550888, 575141, -61123, 18826, 650370, 310181, -893775, -727737, 35018, 250241, 387477, 327814, -590431, -789350, -619485, -965402, -809730, -605204, -799061, -1313987, -871342, -525881, -706688, -791383, -812341, -911895, -1148581, -709794, -571272, -516843, 260994, 1185175, 1189698, 881274, 796092, 1351637, 978415, 438614, 204197, -214804, -1101563, -1260716, -220830, 447816, 95625, 29136]
25C53589J15378a89613p03863l22658L7259J01133L17947C87757R32902j64796
15A155863m58339G7110d27378J74370D67695N29308j19682C08948G4476K20780
5B95256e22401j526203K12416c08459C24694
$$ y = [353589, 468967, -189613, -893476, -1216134, -1178875, -1077742, -759795, 387757, 1320659, 1155863, 697524, 77110, -427378, -253008, 467695, 997003, 877321, 308948, 74476, 295256, -522401, -2048604, -1836188, -308459, 324694]
##PAGE= F1=2869.773276124
##FIRST=     18110.137220953, 5591.54909048506, 412327
##DATA TABLE= (F2++(Y..Y)), PROFILE
1023D12327p1936j46657c8812A38311J25691A0941c47913l46491j25126J19896
1013f99634B68127J251889p6803C82272b4302A48455d06091o06428d54473A31474
1002C7332b56530a24671G21548N86621C43675g77227l03277L20197A631c05001
991a148648N73088G97470M9934k63176k61415J44272m1427a96442o0283E22784
980H78799L13085p9524A30461f50832k76175j97018L70671K26029r9481K53237
970c73569A74311L47955L47903N84507M65935L42116l87587E40032a087021q41789
960a928810Q19525C71537O6179a047858k16501c05055j56737j462230n35121a020124
949E57948j79332b65610N1004m914k92792l0371q8876k83765l6580d40386C29869
$$ y = [412327, 340391, 193734, -38812, 138311, 264002, 10941, -347913, -694404, -819530, -699634, 268127, 1520016, 1443213, 382272, -24302, 148455, -406091, -1012519, -454473, 131474, 37332, -256530, -124671, 721548, 1308169, 343675, -777227, -1080504, -760307, 1631, -305001, -1148648, -575560, 797470, 847404, 584228, 322813, 467085, 425658, -196442, -256725, 522784, 878799, 1191884, 1112360, 130461, -650832, -927007, -1124025, -753354, -527325, -626806, -373569, 174311, 522266, 870169, 1454676, 1920611, 2262727, 1875140, 540032, -1087021, -1928810, -1109285, 371537, 437716, -1047858, -1264359, -305055, -461792, -1924022, -2459143, -1020124, 557948, 378616, -265610, -214606, -219520, -512312, -542683, -631559, -915324, -951904, -440386, 329869]
937A483063O79026p43747b577r67304J37808c98867a06360F99142L95487k33670
927H60959k12054B0257a107068R8920G99496J365887q86693c24917j011507o86031
917b022455j15330O96328d04726D36301a91147n53683A99453N80491r5697j40692
907E43555H9459h65264J64754A88705D0238g66228a28791A050164K16588E72965
896B5514e79607l42494c58617E95971K86860B2904a60706B36977K13948i596l24786
885c34382A21547P05941J52678m67652J27808J29239a68699k88702A27426a7963
874a152280j52144b30174A24793d98458A65361J269391E62082g02060L02109B3809
863B11745c1571l33402j61679j63931l63378m31493l34849N65359C75927Q14214
$$ y = [1483063, 2162089, 1418342, -2577, -969881, -832073, -398867, -106360, 699142, 1094629, 860959, 648905, 20257, -1107068, -1008148, 799496, 2165383, 1278690, -324917, -1336424, -2022455, -2137785, -1441457, -404726, 436301, -191147, -744830, 199453, 779944, 684247, 543555, 89459, -865264, -700510, 188705, 40238, -766228, -128791, 1050164, 1266752, 572965, 25514, -579607, -922101, -358617, 595971, 882831, 22904, -160706, 236977, 450925, -9596, -334382, 121547, 827488, 980166, 512514, 640322, 769561, -168699, -457401, 127426, -17963, -1152280, -1304424, -230174, 124793, -498458, 165361, 1434752, 562082, -702060, -399951, 23809, 211745, -31571, -364973, -526652, -690583, -1053961, -1485454, -1820303, -1254944, 375927, 1190141]
853A190141P7229j91854n22466B02297H4514m0787K47266L66326k33187a05943
842B16111M42692J92218j5354j32888l0460J39939j72914a44621n50172L47274
832c47519B12333M64273N96324m11095B83427J58026a80636l75892Q7807m62494
822i31215k8135a82976c299j6551D87347O68672K12806o41251I0650d00839D7828
810E1927f27047p63944j26792d65620D02617c66860o84389n26402o05800Q29260
800a354191A87003J00083b38406l76411M6892F60739P14307o22542a1063k7428
790c8491o54836l82656M07395b08360C00329P43576M02107k12383C04835f58471
779a216481M88656G73942J034070r1244k75199o84440e80652j102524j6519P16269
$$ y = [1190141, 1267370, 1075516, 553050, 202297, 84514, 43727, 290993, 657319, 424132, -105943, 216111, 658803, 851021, 835667, 702779, 672319, 812258, 639344, -144621, -694793, -347519, 212333, 676606, 1272930, 861835, 283427, 441453, -180636, -556528, -468721, -931215, -959350, -182976, -3299, -19850, 487347, 1156019, 1368825, 727574, 90650, -400839, 47828, 51927, -627047, -1390991, -1517783, -465620, 402617, -366860, -1051249, -1577651, -2183451, -1354191, 187003, 287086, -238406, -614817, -567925, 660739, 1375046, 752504, -11063, -38491, -693327, -1075983, -668588, -208360, 300329, 1043905, 1446012, 1233629, 304835, -658471, -1216481, -727825, 773942, 1808012, 1716768, 1441569, 757129, -580652, -1683176, -1699695, -983426]
769i83426a71961G71041L12153l9538M96994K11501q12443c36133J07279D06345
758A045298J10160m96874k61371J60880k15404g80475l31210L36515m52942l42151
748a570263P46170L85738l23072K39926C0892O02462J63920C51209j4480O50296
738I87025q63l19640b80165j385926K17654d72382J56786h2933A53038d33790
727h33894K61948P0449k5349J70672A19020J041042J015378j96366E77041h60146
716a262077f12969K3539p22370k27120d39253E90833N30248J6422p573l10280
706H19650a64606l07392j25632P4051o6080j86008k82538m9832N16007A19601
695G40340N74694P23269n14040c46136q69886b84751D10351a45158n04020b54812
$$ y = [-983426, -171961, 771041, 1083194, 1043656, 1540650, 1752151, 939708, -336133, -228854, 406345, 1045298, 1155458, 658584, 397213, 558093, 342689, -780475, -1111685, -775170, -1228112, -1570263, -824093, -438355, -761427, -521501, 30892, 633354, 797274, 351209, 336729, 987025, 986162, 666522, -280165, -1666091, -1448437, -472382, -315596, -82933, 153038, -433790, -833894, -571946, -501497, -526846, -356174, 119020, 1160062, 2175440, 1979074, 577041, -860146, -1262077, -612969, -589430, -1311800, -1538920, -439253, 590833, 1121081, 1137503, 1129930, 819650, -164606, -471998, -597630, -523579, -589659, -775667, -1058205, -1108037, -592030, 119601, 740340, 1315034, 2038303, 1524263, -346136, -1216022, -284751, 410351, -145158, -649178, -254812]
684e66491j090831N68388b5913m4184j00339B53066N87583O19251m33595E02599
673A443047j95415c44432n73021D08437J109113F84067g03663n85947l48870o6033
663a704513g42678A60301N40452M4585A25561d07235c7794C99766K83032l27934
653C54864g44337q01816L11519c92356a96151n26830L3796F1670J92774L46345
643F00789P30031k20627c71877n94560d13810c4420I1909a12310k49932M9234
633c13008n15108k52145C20492J392259O45537M0839l05874k05024l08880m91932
623A087417l59302J30140j22377A4452g70105n68332K87752e932G63707N41956
613A305663F00250f03423J89020C10055g5877r47871J95935J58930m75725d50207
$$ y = [-566491, -1657322, -1088934, -25913, -70097, -170436, 253066, 840649, 1459900, 1026305, 502599, 1443047, 1247632, -344432, -917453, 408437, 1517550, 684067, -703663, -1289610, -1638480, -1704513, -742678, 160301, 700753, 745338, 125561, -407235, -37794, 399766, 682798, 354864, -744337, -1546153, -1234634, -392356, -196151, -722981, -689185, 61670, 254444, 600789, 1330820, 1110193, -371877, -966437, -413810, -34420, 91909, -112310, -362242, -313008, -828116, -1080261, 320492, 1712751, 2358288, 2399127, 2093253, 1888229, 1579349, 1087417, 728115, 858255, 735878, 14452, -770105, -1338437, -1050685, -5932, 763707, 1305663, 600250, -603423, -414403, 310055, -75877, -1023748, -827813, -668883, -1144608, -450207]
602A068279P42926m55312j43711L05328k84276C88439b88579r28007r58298J14855
592b060029e42172e820D34801K79080k34138r4036a00322j081041j18967c69277
581I8882m6893O6074M02576N25932J63122E07051d50696C9100R87595D67326a230391
569a454999b46883F51290G7744e12982J83702A98507b95636o40556m81669f32210
$$ y = [1068279, 1811205, 1355893, 1212182, 1517510, 1233234, 388439, -288579, -1216586, -2174884, -2060029, -542172, -5820, 434801, 713881, 479743, 385707, -100322, -1181363, -1300330, -369277, 98882, 51989, 118063, 520639, 1046571, 1209693, 507051, -450696, 39100, 1026695, 467326, -1230391, -1454999, -246883, 651290, 77744, -512982, -329280, 198507, -295636, -936192, -1417861, -632210]
$$ [...]
##END NTUPLES=nD NMR SPECTRUM
##END=
