##TITLE=XTC-966_2
##JCAMPDX= 6.0         $$ Bruker NMR JCAMP-DX V2.0
##DATA TYPE= nD NMR SPECTRUM
##DATA CLASS= NTUPLES
##NUM DIM= 2
##ORIGIN= BRUKER
##OWNER= patiny
$$ 1.79 TOPSPIN		Version 3.0
$$ 2012-05-19 16:53:00.768 +0200  patiny@icmbsg005
$$ Compression mode = diff/dup
##.OBSERVE FREQUENCY= 400.132327993493
##.OBSERVE NUCLEUS= ^1H
##.ACQUISITION MODE= SIMULTANEOUS (DQD)
##.ACQUISITION SCHEME= Echo-Antiecho
##.AVERAGES= 4
##.DIGITISER RES= 23
##SPECTROMETER/DATA SYSTEM= spect
##.PULSE SEQUENCE= hmbcetgpl3nd
##.SOLVENT NAME= D2O
##.SHIFT REFERENCE= INTERNAL, D2O, 1, 9.27001
##AUDIT TRAIL= $$ (NUMBER, WHEN, WHO, WHERE, PROCESS, VERSION, WHAT)
$$ ##TITLE= Audit trail, TOPSPIN		Version 3.0
$$ ##JCAMPDX= 5.01
$$ ##ORIGIN= Bruker BioSpin GmbH
$$ ##OWNER= patiny
$$ $$ /opt/data/patiny/nmr/XTC-966_2/14/pdata/1/auditp.txt
$$ ##AUDIT TRAIL=  $$ (NUMBER, WHEN, WHO, WHERE, PROCESS, VERSION, WHAT)
(   1,<2012-05-19 16:52:58.796 +0200>,<patiny>,<icmbsg005>,<go>,<TOPSPIN 3.0>,
      <created by zg
	started at 2012-05-19 16:30:51.680 +0200,
	POWCHK enabled, PULCHK disabled,
       configuration hash MD5:
       77 C7 B7 C4 10 F4 BA 30 64 2E BB 52 82 F2 DA 41
       data hash MD5: 4K * 128
       29 59 F5 1D DD 15 CA 92 F8 33 6F 0D 22 D9 B1 56>)
(   2,<2012-05-19 16:52:58.859 +0200>,<patiny>,<icmbsg005>,<audit>,<TOPSPIN 3.0>,
      <user comment:
       ICON-NMR User ID: patiny
       data hash MD5: 4K * 128
       29 59 F5 1D DD 15 CA 92 F8 33 6F 0D 22 D9 B1 56>)
(   3,<2012-05-19 16:52:59.876 +0200>,<patiny>,<icmbsg005>,<proc2d>,<TOPSPIN 3.0>,
      <Start of raw data processing
       xfb same F2: SI = 2K WDW = 3 SSB = 4 FT_mod = 6 PKNL = 1 F1: SI = 1K ME_mod = 2 NCOEF = 32 WDW = 4 SSB = 2 FT_mod = 6 PHC0 = 0 PHC1 = 0
       data hash MD5: 2K * 1K
       FA 44 4B FB CA 0F 1A 21 05 B6 BE F8 19 7C 54 F9>)
(   4,<2012-05-19 16:52:59.985 +0200>,<patiny>,<icmbsg005>,<proc2d>,<TOPSPIN 3.0>,
      <abs2 F2: ABSG = 5 ABSF1 = 9.27001 ABSF2 = 2.366176
       data hash MD5: 2K * 1K
       23 A8 7F B2 FE 28 5E 8A AC C4 F6 DE 25 97 40 6D>)
(   5,<2012-05-19 16:53:00.157 +0200>,<patiny>,<icmbsg005>,<proc2d>,<TOPSPIN 3.0>,
      <abs1 F1: ABSG = 5 ABSF1 = 210.754 ABSF2 = -11.10083
       data hash MD5: 2K * 1K
       67 F6 2E DB 5D 39 57 22 65 76 B9 27 3B 49 0C 60>)
$$ ##END=
$$ 
$$ $$ hash MD5
$$ $$ 2D 14 2B 22 EF 68 ED B0 6D D0 51 70 42 94 54 6B
##$RELAX= 
##$RELAX= 
##$RELAX= 
##$RELAX= 
##$RELAX= 
##$RELAX= 
##$RELAX= 
##$RELAX= 
##$RELAX= 
##$RELAX= 
##$RELAX= 
$$ Bruker specific parameters
$$ --------------------------
##$DATPATH= </opt/data/patiny/nmr>
##$EXPNO= 14
##$NAME= <XTC-966_2>
##$PROCNO= 1
##$ACQT0= 1000000
##$AMP= (0..31)
100 100 100 100 100 100 100 100 100 100 100 100 100 100 100 100 100 100
100 100 100 100 100 100 100 100 100 100 100 100 100 100
##$ANAVPT= -1
##$AQSEQ= 0
##$AQ_mod= 3
##$AUNM= <au_getlinv>
##$AUTOPOS= <23 >
##$BF1= 400.13
##$BF2= 100.612769
##$BF3= 400.13
##$BF4= 400.13
##$BF5= 400.13
##$BF6= 400.13
##$BF7= 400.13
##$BF8= 400.13
$$ [...]
##$SIGF1= 9.27001
##$SIGF2= 2.366176
##$SINO= 0
##$SIOLD= 2048
##$SPECTYP= <>
##$SREGLST= <1H.DMSO>
##$SSB= 4
##$STSI= 2048
##$STSR= 0
##$SW_p= 2762.43093922652
##$SYMM= 0
##$S_DEV= 1106842
##$TDeff= 4096
##$TDoff= 0
##$TI= <>
##$TILT= no
##$TM1= 0
##$TM2= 0
##$TOPLEV= 100
##$USERP1= <>
##$USERP2= <>
##$USERP3= <>
##$USERP4= <>
##$USERP5= <>
##$WDW= 3
##$XDIM= 2048
##$YMAX_p= 105857065
##$YMIN_p= -168032150
##$CURPLOT= <Cups-PDF>
##$CURPRIN= <$Cups-PDF>
##$DFORMAT= <normdp>
##$LAYOUT= <+/2D_inv.xwp>
##$LFORMAT= <normlp>
##$PFORMAT= <normpl>
$$ Bruker specific parameters for F1
$$ ---------------------------------
##$ACQT0= 0
##$BF1= 100.612769
##$FnMODE= 6
##$NUC1= <13C>
##$O1= 10043.8343986724
##$SFO1= 100.622812834399
##$SW= 221.832681201688
##$SW_h= 22321.4283611104
##$TD= 128
##$ABSF1= 210.754
##$ABSF2= -11.10083
##$ABSG= 5
##$ABSL= 0
##$ALPHA= 0
##$AQORDER= 0
##$ASSFAC= 0
##$ASSFACI= 0
##$ASSFACX= 0
##$ASSWID= 0
##$AUNMP= <>
##$AXLEFT= 0
##$AXNAME= <F1>
##$AXNUC= <13C>
##$AXRIGHT= 0
##$AXTYPE= 0
##$AXUNIT= <>
##$AZFE= 0.1
##$AZFW= 0.5
##$BCFW= 0
##$BC_mod= 0
##$BYTORDP= 0
##$COROFFS= 0
##$CY= -3
##$DATMOD= 1
##$DC= 0
##$DFILT= <>
##$DTYPP= 0
##$ERETIC= no
##$F1P= 210.76350402832
##$F2P= -11.0913240743493
##$FCOR= 0.5
##$FTSIZE= 1024
##$FT_mod= 6
##$GAMMA= 0
##$GB= 0
##$INTBC= 1
##$INTSCL= 1
##$ISEN= 128
##$LB= 0
##$LEV0= 0
##$LPBIN= 256
##$MAXI= 10000
##$MC2= 5
##$MEAN= 0
##$ME_mod= 2
##$MI= 1
##$NCOEF= 32
##$NC_proc= -10
##$NLEV= 6
##$NOISF1= 0
##$NOISF2= 0
##$NSP= 0
##$NTH_PI= 0
##$NZP= 0
##$OFFSET= 210.754
##$PC= 4
##$PHC0= 0
##$PHC1= 0
##$PH_mod= 1
##$PKNL= no
##$PPARMOD= 1
##$PPDIAG= 0
##$PPIPTYP= 0
##$PPMPNUM= 2147483647
##$PPRESOL= 1
##$PSCAL= 1
##$PSIGN= 0
##$PYNMP= <>
##$REVERSE= no
##$SF= 100.612769
##$SI= 1024
##$SIGF1= 210.754
##$SIGF2= -11.10083
##$SINO= 0
##$SIOLD= 1024
##$SPECTYP= <>
##$SREGLST= <>
##$SSB= 2
##$STSI= 1024
##$STSR= 0
##$SW_p= 22321.42836111
##$SYMM= 0
##$S_DEV= 1106842
##$TDeff= 256
##$TDoff= 0
##$TI= <>
##$TILT= no
##$TM1= 0
##$TM2= 0
##$TOPLEV= 0
##$USERP1= <>
##$USERP2= <>
##$USERP3= <>
##$USERP4= <>
##$USERP5= <>
##$WDW= 4
##$XDIM= 128
##$YMAX_p= 105857065
##$YMIN_p= -168032150
$$ End of Bruker specific parameters
$$ ---------------------------------
##NTUPLES= nD NMR SPECTRUM
##VAR_NAME=  FREQUENCY1,    FREQUENCY2,      SPECTRUM
##SYMBOL=    F1,            F2,              Y
##.NUCLEUS=  13C,           1H
##VAR_TYPE=  INDEPENDENT,   INDEPENDENT,     DEPENDENT
##VAR_FORM=  AFFN,          AFFN,            ASDF
##VAR_DIM=   1024,          2048,            2048
##UNITS=     HZ,            HZ,              ARBITRARY UNITS
##FACTOR=    21.7982698838965, 1.3488432320442, 1
##FIRST=     21204.543296753, 2761.08209599448, -123827
##LAST=      -1095.08679447308, 0,           -462058
##MIN=       -1095.08679447308, 0,           -168032150
##MAX=       21204.543296753, 2761.08209599448, 105857065
##PAGE= F1=21204.54329675
##FIRST=     21204.543296753, 2761.08209599448, -123827
##DATA TABLE= (F2++(Y..Y)), PROFILE
$$ [...]
##PAGE= F1=5836.763028606
##FIRST=     21204.543296753, 2761.08209599448, -77318
##DATA TABLE= (F2++(Y..Y)), PROFILE
1019E49314a043762B032805E59895c13237o52868j521573I44480b3475A260500
1009a741022C47463O12997B03943l4520b715144d3769n22046a65950j490946B643708
998b127446C09353i9261j470382e3823H70457a151834K17694J23190B611961i93913
987h82872G79486J88959J025408d56351l14951A209163a099891E20736i95204
977B082303i6633n92704j083695H51314f33212A776585b93536h2575H65575d85508
966G49555b28295A628115j30527a94482j62177n0755q87100A784586a637468l32216
956a969684F18959I5479c74482R4090j921250I56427l91171a185654N14177A390874
945A91592J369826b608706A298492o03871d61772j038047A049542P34667h83023
$$ y = [549314, -1043762, 2032805, 559895, -313237, -966105, -2487678, 944480, -23475, 1260500, -1741022, 347463, 960460, 203943, 169423, -2715144, -43769, -565815, -165950, -1656896, 2643708, -2127446, 309353, -99261, -1569643, -53823, 870457, -1151834, -934140, -810950, 2611961, -993913, -882872, 779486, 968445, 1993853, -456351, -771302, 1209163, -1099891, 520736, -995204, 2082303, -96633, -689337, -1773032, 851314, -633212, 1776585, -293536, -82575, 865575, -485508, 749555, -228295, 1628115, 1497588, -194482, -356659, -407414, -1294514, 1784586, -1637468, -1969684, 618959, 95479, -374482, -280392, -2201642, 956427, 565256, -1185654, -671477, 1390874, 191592, 1561418, -2608706, 1298492, 694621, -461772, -1499819, 1049542, 1784209, -883023]
935d55618R5379q70573e18907A892644H52856C5819N266a28597o49319l57258
925a135174d09453a49359f2947j369522a52547A51102M84139B87545f88893A362743
914A917640a051275k10110q57126B113116f79773i6065A978533b457784A866017
904A09222a523361B80438J265334g19759H89037h21680J14821A486470b094825
894A223915c56040j342647B309922a248438J8484H22047e10564J524a8609j991642
884b010251B135834A003158f05779j678519A593491J347324a327255b09953r07738
875a117691A382255C9166J014091A94428b755406h16166I13986E6639O13457f39116
864a299301A758907h67487b65917G71446J183631B63280E5673J786171a121378
$$ y = [-455618, -360239, -1230812, -518907, 1892644, 852856, 35819, 41085, -128597, -777916, -1135174, -409453, -149359, -62947, -1432469, -152547, 151102, 635241, 287545, -688893, 1362743, 1917640, -1051275, -1261385, -2118511, 2113116, -679773, -96065, 1978533, -2457784, 1866017, 109222, -1523361, 280438, 1545772, -719759, 889037, -821680, -706859, 1486470, -2094825, 1223915, -356040, -1698687, 2309922, -1248438, -1229954, 822047, -510564, -509040, -18609, -2010251, 2135834, 1003158, -605779, -2284298, 1593491, 2940815, -1327255, -209953, -1117691, 1382255, 39166, 1053257, 194428, -2755406, -816166, 913986, 56639, 670096, -639116, -1299301, 1758907, -867487, -265917, 771446, 1955077, 263280, 55673, 1841844, -1121378]
854a980887A79777b597793A093307E22836e84628G79863a269915D66186J219607
845A685793i28891I72827F2585e23023r56195I78897i11567a2977p91843G2609
834H77490l42773O60352a206059m26399I96994a29052D78880K614248c222804
824A10946b93189G60685l56016L62228e11966A717937G47072f75893j72130j327692
814b175715A134755h45773F49060a604936c20038b9561A929346d80087I63527
804b14585F03177d70111k32843A804104b690828i12320j798464B337736p11588
795A626148c448867B428020a205611A80106J738520p35296k54811a478573O06095
786h72478a89677j125947E13037F1647f5581I76793a596464N7466C367324a422555
$$ y = [-1980887, 179777, -2597793, 1093307, 522836, -584628, 779863, -1269915, 466186, 1685793, -928891, 972827, 62585, -523023, -1479218, 978897, -911567, -12977, -804820, 72609, 877490, 534717, 1195069, -1206059, -1632458, 996994, -129052, 478880, 3093128, -3222804, 110946, -293189, 760685, 404669, 766897, -511966, 1717937, 747072, -675893, -848023, -2175715, 1134755, -845773, 649060, -1604936, -320038, -29561, 1929346, -480087, 963527, -214585, 603177, -470111, -702954, 1804104, -2690828, -912320, -2710784, 2337736, 1626148, -3448867, 2428020, -1205611, 180106, 1918626, 1183330, 928519, -1478573, -872478, -189677, -1315624, 513037, 61647, -65581, 976793, -1596464, -1538998, 3367324, -1422555]
775A13009b57796A863867e36895F20803j002d71591A264120A34963K90223d1374
764a31534j438725O00469D8837a816509F50650f57004K44746C45288A00612C0585
753I2353g40829k512866A560737D7828K61573c180565a46437A823484a55494p43229
743h98723A669076f42621A894551B30471p825b975577E2284R45113L61828l13203
733A046022C04193i67310o06703P7808A311288C11207b282421a104432A599819
723e39640j429964A206267A51241M87521g10013E92002b041732B22888L39573
714E62461a050698e10031F98820K668097b583526F94241d10213m62939l42635
705a215787A321712o54256A43579L87052j42568K256205a223612E35632b47838
$$ y = [113009, -257796, 1863867, -536895, 620803, 619801, -471591, 1264120, 134963, 425186, -41374, -131534, -1570259, -969790, 48837, -1816509, 650650, -657004, -412258, 345288, 100612, 30585, 92353, -740829, -3253695, 1560737, 47828, 309401, -3180565, -146437, 1823484, -155494, -898723, 1669076, -642621, 1894551, 230471, 222646, -2975577, 52284, 997397, 1359225, 1046022, 304193, -967310, -1574013, -1496205, 1311288, 311207, -2282421, -1104432, 1599819, -539640, -1969604, 1206267, 151241, 638762, -710013, 592002, -2041732, 222888, 562461, -1050698, -510031, 698820, 3366917, -2583526, 694241, -410213, -873152, -1215787, 1321712, 667456, 143579, 530631, 388063, 2644268, -1223612, 535632, -247838]
695B00348d20384A262188b406252i23198B94753J865637H61490a299940B45260
685a241718d17658A153912f45669k7216a20140L5637j165782C121122e20456h7858
674F99931a006269b89140A147910D26276i9553A715898b936042G34121j86111
665E48010J083523a159497L22630B195134F51519h76402q39860b69610j062125
656a331735i4503p87460j38073A841924q15893a583826a04085G47231b150776
646a053224H79517a5422A301552d04342A738018g06126B229230b262261F91606
636a487902d43073a23596o26593b83041A075028N13795e15732l03250G99973K663088
626C463061j316146b634891D214412j344561a446732m42020B522514i55863j48919
$$ y = [200348, -420384, 1262188, -2406252, -923198, 294753, 2160390, 861490, -1299940, 245260, -1241718, -417658, 1153912, -645669, -672885, -120140, -84503, -1250285, 3121122, -520456, -87858, 699931, -1006269, -289140, 1147910, 426276, -99553, 1715898, -2936042, 734121, 548010, 1631533, -1159497, -836867, 2195134, 651519, -876402, -1716262, -269610, -1331735, -94503, -881963, -1020036, 1841924, 1026031, -1583826, -104085, 747231, -2150776, -1053224, 879517, -15422, 1301552, -404342, 1738018, -706126, 2229230, -2262261, 691606, -1487902, -443073, -123596, -750189, -283041, 1075028, 1588823, -515732, -818982, 799973, 3463061, 2146915, -2634891, 4214412, 2869851, -1446732, -1888752, 2522514, -955863, -1104782]
617a104782B776616a288126I36886b242879C595347K181459a898924j012140i17575
607a103095k008202J1482B447533K12990b240319A482708d59310A022823J372274
598B395097C39716J848777N6353d17433B943155g84195o05287B436106i02285
588C80992L09718i53511B698060b048569R36631A366920a159600A379085a438693
578b588401h83223j731772D39221j38044f45193A978286r17374a374176l090589
569d464765c96791a783A981931F65717B93833e59803p42841A724454c05492A173022
558f80433r28971C223451L08970q55700A086824c45311C439695i37145m695159
549e632304J431274B57786a371516D368385J93673A372137m16423j83817h46970
$$ y = [-1104782, 2776616, -1288126, 936886, -2242879, 3595347, 5776806, -1898924, -2911064, -917575, -1103095, -3111297, -3099815, 2447533, 2660523, -2240319, 1482708, -459310, 1022823, 2395097, 339716, 2188493, 2244846, -417433, 2943155, -784195, -1389482, 2436106, -902285, 380992, 690710, -953511, 2698060, -2048569, -1111938, 1366920, -1159600, 1379085, -1438693, -2588401, -883223, -2614995, 439221, 301177, -645193, 1978286, 1060912, -1374176, -4464765, -396791, -1783, 1981931, 665717, 293833, -559803, -1302644, 1724454, -305492, 1173022, -680433, -1609404, 3223451, 3532421, 2676721, 1086824, -345311, 3439695, -937145, -5632304, -4201030, 257786, -1371516, 4368385, 4562058, 1372137, 955714, 771897, -846970]
539A685801a161766j017035a36953M8696n33161r25274A137931m98451B52068
529a620623g60413I14029a454097A031630C79880j70086i8444G62832a838309
519a34940k923142J355088a41484F74553M40359j39719g80928F51138e3420B631831
508E39196a973045C508145g4174j320896A232028D8896K51087L40563a919264
498E05075c86368A703113a821207B221996a219008b81885k62898q62243B285001
488a343285F85365a490885A069389K44149a644259A23655J446562a146334A970472
478D89919a609211A242111h72427J81038A14589J173620a137065E17817a901765
468A399503d66506A265784g83700H43073a425525G0178K45021R84971b18501E97020
$$ y = [1685801, -1161766, -2178801, -136953, -88257, -621418, -1546692, 1137931, 639480, 252068, -1620623, -760413, 914029, -1454097, 1031630, 379880, 209794, -98444, 762832, -1838309, -134940, -3058082, -1702994, -141484, 674553, 1114912, 975193, -780928, 651138, -53420, 2631831, 539196, -1973045, 3508145, -74174, -1395070, 1232028, 48896, 299983, 640546, -1919264, 505075, -386368, 1703113, -1821207, 2221996, -1219008, -281885, -544783, -1407026, 2285001, -1343285, 685365, -1490885, 1069389, 1313538, -1644259, 123655, 1570217, -1146334, 1970472, 489919, -1609211, 1242111, -872427, -691389, 114589, 1288209, -1137065, 517817, -1901765, 1399503, -466506, 1265784, -783700, 843073, -1425525, 70178, 315199, 1300170, -218501, 597020]
457A479231p09588i44633B40853e03054B396714r90712C53778f47192l73626m352
447a025170B697388e20080b39713j778698h52926A753037a121290C083530a528629
437c486975B6059a724887A196972a384521A081956a151141k64945c2558A095885
427h28063a05568k77422o92326b00482j173105f79552b64140A129042d97560A756400
416c63443G81614D1192c64691F07568J003678a097824b31525A47758J849019g20836
405b501001Q94478C190055e52308a86179q66927r29049A501825c9337D44189A62060
394D67496a207808N99419A985535A28040M42011g2498D99554g71444b66658m22134
384f88792a82330j095529A049271D17607g25684m22895a97784A8139d49541C111590
$$ y = [1479231, 769643, -944633, 240853, -503054, 2396714, 1406002, 353778, -647192, -1020818, -1025170, 2697388, -520080, -239713, -2018411, -852926, 1753037, -1121290, 3083530, -1528629, -3486975, 26059, -1724887, 1196972, -1384521, 1081956, -1151141, -1416086, -32558, 1095885, -828063, -105568, -382990, -1075316, -200482, -1373587, -679552, -264140, 1129042, -497560, 1756400, -363443, 781614, 41192, -364691, 607568, 1611246, -1097824, -231525, 147758, 1996777, -720836, -2501001, -1606523, 3190055, -552308, -186179, -1053106, -1982155, 1501825, -39337, 444189, 162060, 467496, -1207808, -608389, 1985535, 128040, 570051, -72498, 499554, -771444, -266658, -688792, -182330, -1277859, 1049271, 417607, -725684, -1148579, -197784, 18139, -449541, 3111590]
373a349101F66759b71095j381308E79726P34182a517416b33505j95160n67931
364i96596n0195C68571a72973B0363J270153n26159g92919b10146m54033l72695
354a036874G03311h23259I10550R24987h4578A88554M57143a2276j78762F85144
343E10793j37958K590684i73217j85189L49367n0477A825015A45142D5473a02683
332f56840q94507A15313b010895A069447B32112P03287C01977j26079J067880
323A243778g67787c15614A599294d10633B679441H55927a621291G15421f35254
313i61223D08932b247269A57771g47663m54375d14455F33627i78664f6407q1434
303a47841A686457e99162D84355f2281m84388j455017A427022a343243C40694
$$ y = [-1349101, 666759, -271095, -1652403, 579726, 1313908, -1517416, -233505, -428665, -996596, -1046791, 368571, -172973, 20363, 1290516, 764357, -792919, -210146, -664179, -1036874, 703311, -823259, 910550, 1835537, -84578, 188554, 645697, -12276, -191038, 685144, 510793, 372835, 2963519, -973217, -1158406, -809039, -859516, 1825015, 145142, 45473, -102683, -656840, -1551347, 115313, -2010895, 1069447, 232112, 935399, 301977, 175898, 1243778, -767787, -315614, 1599294, -410633, 2679441, 855927, -1621291, 715421, -635254, -961223, 408932, -2247269, 157771, -747663, -1202038, -414455, 633627, -978664, -66407, -147841, 1686457, -599162, 484355, -62281, -546669, -2001686, 1427022, -1343243, 340694]
293g32174l842972i440A099323B87690L150083A18468J684250a238166A791034
283a014973H21486a206311j099537B911416a69671D351771d7957m80620p68168
274a296745l710382a491345B22017L541842A96212O065K048669c388481M02342
265b986139E215341i62152A298524a200710H8620c225842B579949j044580E95419
255b80144F56441K47917b444146J029260A970780c09986j042428A289137B35939
245c6666I04919Q68782a036359D0955K98782a378872B627672a283147o29849G50501
234a454192C013397B44214a937922A049005b22696l3480A705463q40044a477032
224C034339b577039A948820d95844k33219E45175f81055j078544A519609c833382
$$ y = [-732174, -4575146, -9440, 1099323, 287690, 3437773, 118468, 1802718, -1238166, 1791034, -1014973, 821486, -1206311, -2305848, 2911416, -169671, 4351771, -47957, -528577, -1296745, -5007127, -1491345, 222017, 3763859, 196212, 202277, 2250946, -3388481, -2986139, 5215341, -962152, 1298524, -1200710, 88620, -3225842, 2579949, 1535369, 595419, -280144, 656441, 904358, -2444146, -1414886, 1970780, -309986, -1352414, 1289137, 235939, -36666, 904919, 1773701, -1036359, 40955, 339737, -1378872, 2627672, -1283147, -1912996, 750501, -1454192, 3013397, 244214, -1937922, 1049005, -222696, -256176, 1705463, 865419, -1477032, 3034339, -2577039, 1948820, -495844, -729063, 545175, -681055, -1759599, 1519609, -3833382]
214f81295B917403G02403a012613B226972d70258j166334e012E95886A79394J813263
204A992657h0584A119290b00617A61954e92302J20321D5793a84655A376563B80888
193A55186m8339J088533J478317b430522e19566j786803M32146A460130J847814
184C307944b112200H76841L16673B70705a129984j13736D55423a409857f01370
174D52567a315679B3160K69640a357187C013192C40826a242294F05950J382088
165A988038H9943P75201J043134l85798J198583R10081L983223J2779267Q875674
156B9269308a4975156j40232742N4517797F205909Q4703460B5234294A2558336
148H875663l206854k388169N95875o83081h24235K90475B415922p96795m38059
$$ y = [-681295, 2917403, 702403, -1012613, 2226972, -470258, -1636592, -5012, 595886, 179394, 1992657, -80584, 1119290, -200617, 161954, -592302, -471981, 45793, -184655, 1376563, 280888, 155186, 106847, 1195380, 2673697, -2430522, -519566, -2306369, -1874223, 1460130, 3307944, -2112200, 876841, 1193514, 270705, -1129984, -1243720, 455423, -1409857, -601370, 452567, -1315679, 23160, 292800, -1357187, 3013192, 340826, -1242294, 605950, 1988038, 89943, 865144, 1908278, 1522480, 2721063, 3631144, 7614367, 20393634, 29269308, -14975156, -155207898, -100690101, 6205909, 90909369, 25234294, 12558336, 8875663, 5668809, 3280640, 3876515, 3193434, -824235, -533760, 2415922, 1619127, 1181068]
139A181068O7722j21180P33383C92579h42772j03518o53581F79882J46263a047374
128A832919m69998a21800B228634a741752P02169n97978B191321c10765j98442
119e09207C10709a526881C98145e70929k13431I22712a57856A4792d97383j41640
109f39023D87300a552300B32460O22002h20849B134345c53459F07848D8384e58070
98b18749j495694Q04478B9159J194440m30113a028004d74535A155652a175807
88I86262M68917B3282P31590a532441A228795A978h26728A064450i7807D12460
77c040913b99309J7831k739708B096401r68935b92377l1773I0782g34959E3227
66a065892a96577j212179A786927A44902J814572a15821p54173B66772i92530
$$ y = [1181068, 1248790, 1127610, 1860993, 392579, -842772, -946290, -1599871, 679882, 826145, -1047374, 1832919, 1362921, -121800, 2228634, -1741752, -1039583, -1637561, 2191321, -310765, -509207, 310709, -1526881, 398145, -570929, -784360, 922712, -157856, 14792, -497383, -639023, 487300, -1552300, 232460, 854462, -820849, 2134345, -353459, 607848, 48384, -558070, -218749, -1714443, -909965, 29159, 1223599, 793486, -1028004, -474535, 1155652, -1175807, 986262, 1455179, 23282, 754872, -1532441, 1228795, 1978, -826728, 1064450, -97807, 412460, -3040913, -299309, -281478, -3021186, 2096401, 1127466, -292377, -324150, 90782, -734959, 53227, -1065892, -196577, -1408756, 1786927, 144902, 1959474, -115821, -869994, 266772, -992530]
56D16980K47683p3315M25566a127284B114366E95447a114634E47117B07507a990509
45A022369h49081F44241a189542q05669B218199D1026L65781K68415d53079C53952
34b038343B186003e39653k89544B43861f85862j202331E93314b263749B141712
24a257697J76963D09081e64473H48999d04422B52383i15463A28880h29774I62805
13a412884M32170A455366f04502j624970A644055G065a001809N4703A102243c21347
2b04619A264246c22605
$$ y = [416980, 664663, 591348, 1016914, -1127284, 2114366, 595447, -1114634, 547117, 207507, -1990509, 1022369, -849081, 644241, -1189542, -1995211, 2218199, 41026, 406807, 675222, -453079, 353952, -2038343, 2186003, -539653, -829197, 243861, -685862, -1888193, 593314, -2263749, 2141712, -1257697, -1080734, 409081, -564473, 848999, -404422, 252383, -915463, 128880, -829774, 962805, -1412884, -980714, 1455366, -604502, -2229472, 1644055, 7065, -1001809, -947106, 1102243, -321347, -204619, 1264246, -322605]
##PAGE= F1=5814.964758722
##FIRST=     21204.543296753, 2761.08209599448, 137512
##DATA TABLE= (F2++(Y..Y)), PROFILE
2047A37512J22925m0680R4494a523909e86082C01266h17333A05897L91743b69321
2036E52138P86680A77604H597g04013E55139f33315A362596b615637A267786g52947
2025d186p50828A482295b46170R0769B163734m37972c94034j158959d76487A260147
2014a35934A01673a257348n38320h90324B269230E0680K184621C49510f56097
2004a156272n98183B548528c354007h99493J59544A358739m89570f03615k433198
1995c036813B307308f0486B89860K31183i07762G6125Q18984d18812o08857o71611
1985a699280g10353C730651g86682c7409A86503Q99158j33077b70498A943130
1975A413572c42994A161669f48431m80278L11865C33459b1633j544021A144646
$$ y = [137512, 260437, 219757, 314251, -1523909, -586082, 301266, -817333, 105897, 497640, -269321, 552138, 1338818, 177604, 8597, -704013, 555139, -633315, 1362596, -2615637, 1267786, -752947, -4186, -755014, 1482295, -246170, -155401, 2163734, 1725762, -394034, -1552993, -476487, 1260147, -135934, 101673, -1257348, -1795668, -890324, 2269230, 50680, 2235301, 349510, -656097, -1156272, -1754455, 2548528, -3354007, -899493, -739949, 1358739, 869169, -603615, -3036813, 2307308, -60486, 289860, 521043, -907762, 76125, 895109, -418812, -1027669, -1699280, -710353, 3730651, -786682, -37409, 186503, 1085661, 952584, -270498, 1943130, 1413572, -342994, 1161669, -648431, -1128709, -816844, 333459, -21633, -1565654, 1144646]
1965A79477a138724C65124a873856F77055a507452A67518a10789D95997a806124
1955A252128b143168G9833J91428K083092m19911n05842d08219q13096A068573
1945B745448q45228a568664I79191f18089C97874g15121A938880a499005N9330
1936a439675A946195c624233G85273A48316R37051a469262A044988f80135c3402
1926d16868m35416A80262J99164M01350e75606p39670d80863D14654J854762a631060
1915a13707H72417a40414j108817n55683B14175J902042i24914E92593k25409
1906C67184j49602e40328a02056p54340l76404M41563A676439d82707o46988A158890
1895c28690A648967A12346N16289f44241R2674B362741b294895B376433p29282
$$ y = [179477, -1138724, 365124, -1873856, 677055, -1507452, 167518, -110789, 495997, -1806124, 1252128, -2143168, 79833, 271261, 2354353, 1934442, 1428600, -408219, -1221315, 1068573, 2745448, 1900220, -1568664, 979191, -618089, 397874, -715121, 1938880, -1499005, -1439675, 1946195, -3624233, 785273, 148316, 1085367, -1469262, 1044988, -680135, -33402, -416868, -852284, 180262, 379426, 780776, -575606, -1315276, -480863, 414654, 2269416, -1631060, -113707, 872417, -140414, -1249231, -1804914, 214175, 2116217, -924914, 592593, 367184, 217582, -540328, -102056, -856396, -1232800, -791237, 1676439, -482707, -1129695, 1158890, -328690, 1648967, 112346, 628635, -644241, -551567, 2362741, -2294895, 2376433, 1647151]
1886A647151K50244B19466M6504g72987F81315c45932k290881C5021a165365F46023
1875G99271f22860H7229M14474C1571J372812e86857n46424A561541f95134A91046
1864A142519e69009A20626e88338m02295q6009H78125l48085h11195A641698F63407
1853b291351N95983A627491m49251d22603g3820A75261J068604o05000p8640K52222
1843H12447g40660a21468n63876q24083K54840b4455A217375a552570I60000a802792
1832h55546G55436b648018a68353o91547L83381A612818q05196a212208C04639
1822b20242A321368b99559j386559A043287f32790A136868c492392C15268Q09771
1813A125039k01907b63415j116752p31189f9254B27647N90280b93986B53644b069466
$$ y = [1647151, 1897395, 219466, 265970, -772987, 681315, -345932, -2636813, 35021, -1165365, 646023, 799271, -622860, 87229, 501703, 31571, 1404383, -586857, -1133281, 1561541, -695134, 191046, 1142519, -569009, 120626, -588338, -990633, -1076642, 878125, 530040, -811195, 1641698, 663407, -2291351, -1695368, 1627491, 1178240, -422603, -73820, 175261, 1243865, 638865, 560225, 812447, -740660, -121468, -685344, -1509427, -1254587, -24455, 1217375, -1552570, 960000, -1802792, -855546, 755436, -2648018, -168353, -859900, -476519, 1612818, 807622, -1212208, 304639, -220242, 1321368, -299559, -1686118, 1043287, -632790, 1136868, -3492392, 315268, 1125039, 923132, -263415, -1380167, -2111356, -69254, 227647, 817927, -293986, 253644, -2069466]
1802A962375b488888A012552P73302b406813A30375K84965M96196d17833j17146
1793e34979k94337J45680a39336j682103E64d00664B172586C40781j65804b265037
1782e3256j218024p53315c57036D45443J03509J264105b37408j027777E5548M69478
1772E25026J174155b111981c81391H04524k15027c97168B23013b5B850412D16159
1761e27701M8618p77331j736711A081199l36222a38201I90020Q76169a988053
1751d02023j61217j47210k34449A21246h49947E97974a496134A971260A96655
1741B82506j27181h68638A469013R18196H70203f51288F68967a93286j070311
1732a263597E77846P11852k05386e31885o47695A616180a66287n79184B261857
$$ y = [1962375, -2488888, 1012552, 1785854, -2406813, 130375, 415340, 911536, -417833, -534979, -829316, -683636, -139336, -1821439, 564, -400664, 2172586, 340781, 174977, -2265037, -53256, -1271280, -2024595, -357036, 445443, 548952, 1813057, -237408, -1265185, 55548, 525026, 1699181, -2111981, -381391, 804524, 589497, -397168, 223013, -25, 2850412, 416159, -527701, -479083, -1256414, -2993125, 1081199, 744977, -138201, 990020, 1866189, -1988053, -402023, -563240, -710450, -944899, 121246, -849947, 597974, -1496134, 1971260, 196655, 282506, 155325, -868638, 1469013, 2387209, 870203, -651288, 668967, -193286, -1263597, 577846, 1289698, 1084312, -531885, -1179580, 1616180, -166287, -745471, 2261857]
1722A31643a920308D374432b673304c36713R7237C57543j3781e06600b06896I5955
1711A79113d35491p21933d38900F2821R1112a397422H00148b377455A65930g46806
1700A193852n06156a50211A075909B62774a593213O66790J87488I24410h2984
1690a018873D62812j04191a202167i9646D71830b31776l29089m09252B679309
1680c080353a76468j174638D20785h49138c17970A636994P2808P3383d23920q19567
1670a243487A676895G10990b434678A182694J92153j28508P49327a240336L8067
1661a202269C6222b434959b02374r75291B145998F40535j89672i22913I10281
1651E19515a141769A535257d27458C05972k3305b66938m325462A466688A92556
$$ y = [131643, -1920308, 4374432, -2673304, -336713, -239476, 357543, 343762, -506600, -206896, 95955, 179113, -435491, -1157424, -438900, 62821, 153933, -1397422, 800148, -2377455, 165930, -746806, 1193852, 687696, -150211, 1075909, 262774, -1593213, -926423, -738935, 924410, -82984, -1018873, 462812, 358621, -1202167, -99646, 471830, -231776, -560865, -970117, 2679309, -3080353, -176468, -1351106, 420785, -849138, -317970, 1636994, 1709802, 1783185, -423920, -1243487, 1676895, 710990, -2434678, 1182694, 1374847, 1246339, 1995666, -1240336, -1202269, 36222, -2434959, -202374, -1177665, 2145998, 640535, 450863, -922913, 910281, 519515, -1141769, 1535257, -427458, 305972, 282667, -266938, -4592400, 1466688, 192556]
1641H46944f37082A175491a63351n05899L02945l13937D93421M60640a77836n53129
1631g30965j01683A817872a948690A92960m1863e6220j11998j921349f21648i1752
1620e89097B530039j056851f43690o15316C2884J90953L1134c72659A356574a564116
1609E27091L646941B6896J138541a82404g5833j471365N31108B43637J858884
1600B102521D3986d83449b30041A901691a501636K52005j456020A839539n43029
1591A296510b109198G78286B95090d08800A313203N90216a960491A168010a608343
1581H95184O36134i4766B037365g24158f3424B47434J121797J096354L19696b71218
1570f80244M686j593997A275738K32801i69896k893m3967A123174B35077b82948
$$ y = [846944, -637082, 1175491, -163351, -669250, -366305, -680242, 493421, 954061, -177836, -730965, -832648, 1817872, -1948690, 192960, 151097, -56220, -168218, -2089567, -621648, -91752, -589097, 2530039, 1473188, -643690, -1259006, 32884, 223837, 254971, -372659, 1356574, -1564116, 527091, 4174032, 26896, 1165437, -182404, -75833, -1547198, -1016090, 243637, 2102521, 43986, -483449, -230041, 1901691, -1501636, -1249631, -2705651, 1839539, 1296510, -2109198, 778286, 295090, -408800, 1313203, 1903419, -1960491, 1168010, -1608343, 895184, 1531318, -94766, 2037365, -724158, -63424, 247434, 1369231, 2465585, 2785281, -271218, -680244, -675558, -2269555, 1275738, 1508539, -969896, -972789, -1016756, 1123174, 235077, -282948]
1559G46646h33666J40619H92894A48437h39740G123J032499C87035i48773C72414
1548e8201C89782a971640G61310b570931A452754b111295R19981e11580F51275
1538E9543h30626A708675c32228j010243Q7981G15839L47511C31710g83489A950614
1527a530432A92340d19093p70500B420946A10370L56414e16010D61593a950634
1517a547273A579078b912101H13988O66923A95517a22620p91574c41479A045114
1507g62682E83861B14925L72006a317959F76314J99985A8579J240493D29319a166654
1496c00114A301889i23021p09054b64588k74110o49824a19657A432338h44118
1486A452150n56024A50098J33585d37294a00506l027672F0954J19029b144306
$$ y = [746646, -833666, -693047, 892894, 148437, -839740, 7123, 1039622, 387035, -948773, 372414, -58201, 389782, -1971640, 761310, -2570931, 1452754, -2111295, -1191314, -511580, 651275, 59543, -830626, 1708675, -332228, -1342471, -1254490, 715839, 1063350, 331710, -783489, 1950614, -1530432, 192340, -419093, -1189593, 2420946, 110370, 466784, -516010, 461593, -1950634, -1547273, 1579078, -2912101, 813988, 1480911, 195517, -122620, -914194, -341479, 1045114, -762682, 583861, 214925, 586931, -1317959, 676314, 876299, 18579, 1259072, 429319, -1166654, -300114, 1301889, -923021, -1632075, -264588, -538698, -1188522, -119657, 1432338, -844118, 1452150, 896126, 150098, 283683, -437294, -100506, -3128178, 60954, 179983, -2144306]
1476B63828K092272E19586A10844b891776H98724d07712A783892E06294c53145
1466a369814D34682j99239c62160A861513d10099p2142A590738i96272A177496
1456b86112A095400a372576A309686a402119A182685M93992o99801h42800q65622
1447a708422A148076j6382a973328e08588F90093c68414m77412b81537A364160
1437a009004j486726g97438A217753O0818b343725G38173c86248p2543H56154
1427g25448n18817m44644A379842F7028a14105k607141A362038a132627I9470
1417B774694c48807l26170n49825E33559J83372N45113n21341d84663n65385G72382
1406a233971f7494A736494F53385f32889o50290D26198a122225A444885o83308
$$ y = [263828, 2356100, 519586, 110844, -2891776, 898724, -407712, 1783892, 506294, -353145, -1369814, 434682, 235443, -362160, 1861513, -410099, -482241, 1590738, -996272, 1177496, -286112, 1095400, -1372576, 1309686, -1402119, 1182685, 1676677, 976876, -842800, -1708422, 1148076, 1131694, -1973328, -508588, 690093, -368414, -845826, -281537, 1364160, -1009004, -2495730, -797438, 1217753, 1278571, -2343725, 738173, -386248, -458791, 856154, -725448, -1244265, -1688909, 1379842, 67028, -114105, -2721246, 1362038, -1132627, 99470, 2774694, -348807, -674977, -1224802, 533559, 716931, 1262044, 740703, -484663, -1050048, 772382, -1233971, -67494, 1736494, 653385, -632889, -1283179, 426198, -1122225, 1444885, 761577]
1397G61577J5391J7475c257386a009873a74461I95224a076970A087213N88986
1388A676199d15875j570749b78745r1434G3309a9265D52205a444065B77861c34029
1377a145172F79016a666843A524476a665298M13253j573746i09464J00517b36177
1367A092234c35380A92587b047889G46501b395170d80891A490469l57215L99962
1358A533216f36469p48287O09628H82305D21696b82165j71617B079556B01538
1348C98809f5280A627011a672419H06380O20328k39317b875980H45831D22645
1338c95699o58267d68974m11744B513330E42323B65668g50041E45380b43557m85124
1328g28681j099311H19123l55956A60020i26757D37604k05767J193862D70901
$$ y = [761577, 776968, 794443, -3257386, -1009873, -174461, 995224, -1076970, 1087213, 1676199, -415875, -1986624, -278745, -370179, 73309, -19265, 452205, -1444065, 277861, -334029, -1145172, 679016, -1666843, 1524476, -1665298, -1252045, -2825791, -909464, -808947, -236177, 1092234, -335380, 192587, -2047889, 746501, -2395170, -480891, 1490469, 1133254, 1533216, -636469, -1384756, -775128, 882305, 421696, -282165, -453782, 2079556, 201538, 398809, -65280, 1627011, -1672419, 806380, 1426708, 1187391, -2875980, 845831, 422645, -395699, -1053966, -468974, -880718, 2513330, 542323, 265668, -750041, 545380, -243557, -728681, -1827992, 819123, 463167, 160020, -926757, 437604, 231837, 1425699, 470901]
1318F39162a120370n79922F86518b107400A355402F53300A77021b411759G18164
1308a057676J07320B13972a299784O6974A163102a547996M42709A713536p29380
1299I84156a008393F70492b619461A344917p8643i18412A765700a27082B39516
1289G71504M08102B70947f00634a24088m53397J33674C43010N61221a600087d62660
1278D44144k15940e66306l00559b94916D12441g63505d3657n93792r29344M77542
1268a089251d2028B722384d55599p57871b56556H32659a202013n55997A421085
1258C8994P10166c48916j250117O01528A728010a022441j13557E77498c29890
1248I29943a648574d71082j229143A215265K22960a912761E2950Q62510B55323
$$ y = [639162, -1120370, -1700292, 686518, -2107400, 1355402, 653300, 177021, -2411759, 718164, -1057676, -950356, 213972, -1299784, -1232810, 1163102, -1547996, -1105287, 1713536, 984156, -1008393, 670492, -2619461, 1344917, 1266274, -918412, 1765700, -127082, 239516, 771504, 1179606, 270947, -600634, -124088, -577485, -443811, 343010, 904231, -1600087, -462660, 444144, 228204, -566306, -866865, -294916, 412441, -763505, -43657, -637449, -1566793, -1089251, -42028, 2722384, -455599, -1213470, -256556, 832659, -1202013, -1758010, 1421085, 38994, 749160, -348916, -1599033, -997505, 1728010, -1022441, -1135998, 577498, -329890, 929943, -1648574, -471082, -1700225, 1215265, 1438225, -1912761, 52950, 915460, 255323]
1238A842207f06037A024269b250925A322728m46443D20057f34556K06319A62819
1228a69414q28919k188622A365113i94896o99795c90022H02816a185590B251939
1218h44741A896595E61306g42292I70410a150739F33836d54565B25189L98307
1209F23496a213443B275125j106115a32488A156826C29207A57906a06632B943628
1199A62382L72713H5269J863859a108556q40387E16186j39973J757435c91051
1189a3599E52844i7932n10682E71157j0969l1332J81878L59478a598790H16556
1178E4680J533058a40670j750396b80065F97876l19206M25458b53437A753936
1168a907950A710863c728319R40893A773613a656839e26838A279485N92214d00714
$$ y = [1842207, -606037, 1024269, -2250925, 1322728, 876285, 420057, -634556, -428237, 162819, -169414, -998333, -3186955, 1365113, -994896, -1694691, -390022, 802816, -1185590, 2251939, -844741, 1896595, 561306, -742292, 970410, -1150739, 633836, -454565, 225189, 623496, -1213443, 2275125, 1169010, -132488, 1156826, 329207, 157906, -106632, 2943628, 162382, 535095, 85269, 1949128, -1108556, -1948943, 516186, 376213, 2133648, -391051, -13599, 552844, -97932, -608614, 571157, 560188, 528856, 710734, 1070212, -1598790, 816556, 54680, 1587738, -140670, -1891066, -280065, 697876, 378670, 804128, -253437, 1753936, -1907950, 1710863, -3728319, -2787426, 1773613, -1656839, -526838, 1279485, 1871699, -400714]
1158e18606A401689a482075E68398R17515a513488A377700b253778B650508c317806
1148A257319c72023o33618A456036p00131c601106C503095f6382A565727a447553
1138a642710A400419h44110F03048c92248F12214b526821a6900A949624E70486
1128b49608D49622b76630A031973b556191B34630L90314d06088E52709c78680
1118G66509O65317a048631k89768b16726D80550a571499A140256a489208D04710
1108f24672p36958A48102O2210n0719f88919A906589E05254J441286f27418C57121
1097I03667h98508A368572b446880a070716A803809F66422d42583k23358l11154
1088i77095A080753E00880J637749a513338I20755b15122j992884A751603b15184
$$ y = [-518606, 1401689, -1482075, 568398, 1485913, -1513488, 1377700, -2253778, 2650508, -3317806, 1257319, -372023, -1005641, 1456036, 755905, -3601106, 3503095, -66382, 1565727, -1447553, -1642710, 1400419, -844110, 603048, -392248, 612214, -2526821, -16900, 1949624, 570486, -249608, 449622, -276630, 1031973, -2556191, 234630, 624944, -406088, 552709, -378680, 766509, 1431826, -1048631, -1338399, -216726, 480550, -1571499, 1140256, -1489208, 404710, -624672, -1361630, 148102, 210312, 159593, -688919, 1906589, 505254, 1946540, -627418, 357121, 903667, -898508, 1368572, -2446880, -1070716, 1803809, 666422, -442583, -665941, -977095, 1080753, 500880, 2138629, -1513338, 920755, -215122, -2208006, 1751603, -215184]
1078A453747m07645a341872A003121C97857Q74482c555711a353537B021953k76357
1069A745596m04575b192816B031345D6679c73607A835950b03658A737264c46867
1059a171029A189263i32637E26749a570349J7238E11447m0554j4595R08037a074295
1048A490547c015568i06785j08924B291663B65933G197c055439F94459B07066
1038D76175J13923b066471g50199A334076i47613H42335a049742F98084d33748
1028E52311a421309H41674K15982a34903B269748a104803A060050n24961A23401
1018h96274A771254m77486d27774l17115j528994F35921b16827A402968a635150
1008d1201A123442C10724c28786k425515b76765k08201d2875k047136B613525
$$ y = [1453747, 1046102, -1341872, 1003121, 397857, 1272339, -3555711, -1353537, 2021953, 1745596, 1341021, -2192816, 2031345, 46679, -373607, 1835950, -203658, 1737264, -346867, -1171029, 1189263, -932637, 526749, -1570349, -1553111, 511447, 470893, 456298, 1364335, -1074295, 1490547, -3015568, -906785, -1015709, 2291663, 265933, 7197, -3055439, 694459, 207066, 476175, 590098, -2066471, -750199, 1334076, -947613, 842335, -1049742, 698084, -433748, 552311, -1421309, 841674, 1057656, -134903, 2269748, -1104803, 1060050, 535089, 123401, -896274, 1771254, 1293768, -427774, -744889, -2273883, 635921, -216827, 1402968, -1635150, -41201, 1123442, 310724, -328786, -2754301, -276765, -484966, -42875, -2090011, 2613525]
998b340560E40527b71920j146947a05568G40339i63335Q1635k84905C155000a433615
987d77823E37919J70307J387209c30137p85146A486534a114360G23238a203165
977B575428a76471n9731j490171E52932i89367A827967c99907a89477A091730
967i90463D33700C524J539946k5492b99022Q3213l65884r22043B287957a811543
956a920150F00566b8736A1999c77843j823774I81886l56447a299537e15498A208221
945A11116J605611b529309A724344B17796f38478j222248A248446N73363i04925
935A633c82626l56218q7875A875481p04222e2304B22885d62753k48989n00507
925a212249b95423O0045d4257j427073e47952C99259L92112a7326o16193A391530
$$ y = [-2340560, 540527, -271920, -1418867, -105568, 740339, -963335, -881700, -1166605, 3155000, -1433615, -477823, 537919, 708226, 2095435, -330137, -1115283, 1486534, -1114360, 723238, -1203165, 2575428, -176471, -236202, -1726373, 552932, -989367, 1827967, -399907, -189477, 1091730, -990463, 433700, 3524, 1543470, 1517978, -299022, -215809, -581693, -1503736, 2287957, -1811543, -1920150, 600566, -28736, 11999, -377843, -2201617, 981886, 625439, -1299537, -515498, 1208221, 111116, 1716727, -2529309, 1724344, 217796, -638478, -1860726, 1248446, 1821809, -904925, 1633, -382626, -738844, -826719, 1875481, 1171259, -52304, 222885, -462753, -711742, -1212249, -295423, -235378, -44257, -1471330, -547952, 399259, 791371, -17326, -633519, 1391530]
914A995837a047906j52292r40628B304055h65064a35791B734451b663597A651806
904A64515a678463D45722J209384g55434A588236h15108o9481A455636a912048
894A427783e20991j372380B266078a092072J3716E40662j63240d98116I9408a387979
883A968658q52247h56053j486922A530609J496176a346587g6037j244883A144693
873B75462J184638d9310k564076i20003A115993b42504F59318d28375j797178
864b225553A689034g42060d0624H82531Q96116B54512n6896J695895g75721r77925
854a753646C67011b731467A515943G0238e95448G63556a194006F68511J486164
845B154675g72959F45896A83331f08598j066318A079053i47651b23339n40318
$$ y = [1995837, -1047906, -1200198, -2140826, 2304055, -865064, -135791, 2734451, -2663597, 1651806, 164515, -1678463, 445722, 1655106, -755434, 1588236, -815108, -884589, 1455636, -1912048, 1427783, -520991, -1893371, 2266078, -1092072, -1078356, 540662, 377422, -498116, 99408, -1387979, 1968658, 1116411, -856053, -2342975, 1530609, 3026785, -1346587, -76037, -1320920, 1144693, 275462, 1460100, -49310, -2613386, -920003, 1115993, -242504, 659318, -428375, -2225553, 1689034, -742060, -40624, 882531, 1778647, 254512, 197616, 1893511, -775721, -1753646, 367011, -2731467, 1515943, 70238, -595448, 763556, -1194006, 668511, 2154675, -772959, 645896, 183331, -608598, -1674916, 1079053, -947651, -223339, -763657]
836g63657g1784A414285o57009M42871i98819n67742A478543b29676B09139K994130
826C203269c053942B99750c23896H85870A2835R58068b40075B069099H26641g09250
815c76313k041108A214306f42566A030419a288817O39349K41864B314841f44077
805A454236b99194C95901c35392o8948B022846b640794h89545j718810B002959
795A660057c272674B322606a179611D44759J438477p31041j07531a050270Q2256
786i68014c24353p84746H03803B9327F985R30872f70221j232246C127155a188714
775D87168f68697B257012h00803D81228K90389d96575A174135A72375L91824a90417
764b96568j262442d97335I0492a861445D70635i17389c513B49529f8292D8909
$$ y = [-763657, -71784, 1414285, 757276, 1200147, -998819, -1566561, 1478543, -229676, 209139, 3203269, -3053942, 299750, -323896, 885870, 12835, 970903, -240075, 2069099, 826641, -709250, -376313, -2417421, 1214306, -642566, 1030419, -1288817, -649468, -407604, 2314841, -644077, 1454236, -299194, 395901, -335392, -404340, 2022846, -2640794, -889545, -2608355, 2002959, 1660057, -3272674, 2322606, -1179611, 444759, 1883236, 1152195, 1044664, -1050270, -968014, -324353, -1109099, 803803, 29327, 6985, 937857, -670221, -1902467, 3127155, -1188714, 487168, -668697, 2257012, -800803, 481228, 771617, -496575, 1174135, 172375, 564199, -190417, -296568, -1559010, -497335, 90492, -1861445, 470635, -917389, -3513, 249529, -68292, 48909]
753A41907D4169c141088A326696A96176b94491l017331F0590J694736a25160l88466
743e13626A490444e41649A865674E15715A19665b771423b15537I81196K46K05394
733A186836e1427r18060m87048J62362A146317b36905j835891R67770A623384
723f25290j117477A168937D63752J09875c40960E42433a662209A61896K34861
714C96757i94984L70788I12458K191456b104086F78096g07000l94662J13817A274638
703A215250A86635P01443k04378J577820a235651B82974C4355A6023c66793A480621
692b403927a173288C97625J713162H12943a516049D07213a064526K99928A200127
682g50973K40203a28643j00753j018839C071092a52455B12216K93091i80355c24846
$$ y = [141907, 44169, -3141088, 1326696, 196176, -294491, -3311822, 60590, 1755326, -125160, -513626, 1490444, -541649, 1865674, 515715, 119665, -2771423, -215537, 981196, 981442, 1186836, -51427, -969487, -1456535, -1294173, 1146317, -236905, -2072796, -1105026, 1623384, -625290, -1742767, 1168937, 463752, 573627, -340960, 542433, -1662209, 161896, 396757, -994984, -624196, 912458, 3103914, -2104086, 678096, -707000, -1101662, -987845, 1274638, 1215250, 186635, 888078, 683700, 2261520, -1235651, 282974, 34355, 16023, -366793, 1480621, -2403927, -1173288, 397625, 2110787, 812943, -1516049, 407213, -1064526, -764598, 1200127, -750973, -510770, -128643, -229396, -1248235, 3071092, -152455, 212216, 505307, -980355, -324846]
671I94177l28412b5599A329409b507007E82369J6904P73416a196071J63589A802702
660F36568a057166k44881c05448j339784E9700f14819l13523A725935n06053a797149
649a54019F80178b077251Q11138I43894C5891J236291e18592B002763g80220A958089
638b065218E50813a077524L34519b49607j1146r4802H25092R79448c88428p23363
628a111791A162730K364512j458615b700018C854569q81132a662108j40451B436393
618h41225n86621C593996a713026H48722b020889C613159K443367a889828j245034
609c134862a182935K6307k042929k60853B640962N94113b410765A525721f52141
599A379148J496450B50509J519702k4190b34992B374732g1819j243636A924462
$$ y = [994177, 665765, -25599, 1329409, -2507007, 582369, 599273, 1372689, -1196071, -1032482, 1802702, 636568, -1057166, -1302047, -305448, -1645232, 59700, -614819, -928342, 1725935, 1219882, -1797149, -154019, 680178, -2077251, -1266113, 943894, 35891, 1272182, -518592, 2002763, -780220, 1958089, -2065218, 550813, -1077524, -743005, -249607, -260753, -355555, 825092, 1804540, -388428, -1111791, 1162730, 3527242, 2068627, -2700018, 3854569, 2973437, -1662108, -1802559, 2436393, -841225, -1427846, 3593996, -1713026, 848722, -2020889, 3613159, 6056526, -1889828, -3134862, -1182935, -1156628, -3199557, -3460410, 2640962, 3235075, -2410765, 1525721, -652141, 1379148, 2875598, 250509, 1770211, 1746021, -234992, 2374732, -71819, -1315455, 1924462]
589g04008G3177P92313a398830B847122b069058P15040H98962e47464A500689
579a542396p58104h42713j339410C25466j17321d06362B159716A005234a000041
569d398068f50454B14548J727670H45065A23877g28518m91128A373472e3374H33727
558h54425j137789C676858k79284q72717G51652c58492C269738h60875m833580
549e694455J275366A17081a685066D646657K69721A530245n30462j05714d27922
539A562039h55141j595112a42323E4690b84536j567975A534371G04844B75115
529a506456N14242G91216a284586A420672A98777L00237A00740K58569a635841
519b27033k864295J365634C15888J22982P68532k4879i68678G76144I9532K344071
$$ y = [-704008, 73177, 865490, -1398830, 2847122, -2069058, -1354018, 898962, -547464, 1500689, -1542396, -2300500, -842713, -2182123, 325466, 208145, -406362, 2159716, 1005234, -1000041, -4398068, -650454, 214548, 1942218, 845065, 123877, -728518, -1219646, 1373472, -53374, 833727, -854425, -1992214, 3676858, 3397574, 2524857, 751652, -358492, 3269738, -860875, -5694455, -4419089, 117081, -1685066, 4646657, 4916378, 1530245, 999783, 894069, -427922, 1562039, -855141, -2450253, -142323, 54690, -284536, -1852511, 1534371, 704844, 275115, -1506456, -992214, 791216, -1284586, 1420672, 198777, 499014, 100740, 359309, -1635841, -227033, -3091328, -1725694, 315888, 438870, 1207402, 1182523, -968678, 776144, 99532, 2443603]
509B443603D94479a985827C408903D35614a520854I73574B42497J12038L82144
500G36679a980192F19896d00334A566833a664235B400552a151475b2027q24199
491h46226p24146A926858a420735I60117a975185A327920l61783a404814A6237
481A558657a277539B702908B21916a916587A279468d90945j54518B14610J202110
472A416720i63002C68884a936729A398622c07989A109124a107318H64842a541419
462d34740C27579R67668b79416F46867J211279G43393i95823C17103d55690B342871
451A585661C59051g63478p7445a96894B427485g53876b38843j866592a031573
441B191688h48811C553012a306633k472914H3786a497598A126503a211285D19006
$$ y = [2443603, 494479, -1985827, 3408903, 435614, -1520854, 973574, 242497, 354535, 736679, -1980192, 619896, -400334, 1566833, -1664235, 2400552, -1151475, -22027, -846226, -1570372, 1926858, -1420735, 960117, -1975185, 1327920, 966137, -1404814, 16237, 1558657, -1277539, 2702908, 221916, -1916587, 1279468, -490945, -645463, 214610, 1416720, -963002, 368884, -1936729, 1398622, -307989, 1109124, -1107318, 864842, -1541419, -434740, 327579, 1295247, -279416, 646867, 1858146, 743393, -995823, 317103, -455690, 2342871, 1585661, 359051, -763478, -840923, -196894, 2427485, -753876, -238843, -2105435, -1031573, 2191688, -848811, 3553012, -1306633, -3779547, 83786, -1497598, 1126503, -1211285, 419006]
431e64300l68645B47391K09125f89700J75370b49148o99168c12029q26389K98079
421h40339A78843O99560h04458A841831c77507A020525a42876E2787L93262J176633
411A622682a133662c26365B35839J599058c08054k024019Q68637B767829c69330
401a98468q49112n51598A796244I4443f899C63065A24525a364008f65770A748197
390B46492M07406B22141M9445g51793a18366j03549Q8868j113267I90762C65524
379h12044n63923I5015a34482l70277C146738a187322D73637d49575j260185C95672
368A195015a881472c24148e5700o64816j98980A48706m7405L65307Q52468n49807
358G69269e09060d4267o90087j60200H10289a007207A124942O35245b63247M9217
$$ y = [-564300, -932945, 247391, 456516, -689700, -514330, -249148, -948316, -312029, -1138418, -840339, 178843, 878403, -804458, 1841831, -377507, 1020525, -142876, 52787, 446049, 1622682, -1133662, -326365, 235839, 1834897, -308054, -2332073, -1463436, 2767829, -369330, -198468, -1047580, -1599178, 1796244, 94443, -6899, 363065, 124525, -1364008, -665770, 1748197, 246492, 653898, 222141, 271586, -751793, -118366, -221915, -133047, -1246314, 990762, 365524, -812044, -1375967, 95015, -134482, -504759, 3146738, -1187322, 473637, -449575, -1709760, 395672, 1195015, -1881472, -324148, -55700, -720516, -919496, 148706, 101301, 466608, 1319076, 769269, -509060, -44267, -734354, -894554, 810289, -1007207, 1124942, 1760187, -263247, -214030]
348b14030D66471F455d19385H94391k95835J32118J363001f31297k19494J09392
338g41399j81334A945920E6691M40834b47164m30585j225565B39604b333400A271670
327A35628O94964C18554b529A231563d80998a39558A585681i52469B391446F81988
316a591799I05046b80880r55269D41743b411411C43907h89970l60852c87962G68400
305d80850D6195b16907A492819d08730a26532f1154l69374j525210A023140a419841
294A72643a88579m442307e36963A356436a37586D384639h94273B199123a306994
284A884328a274447A179950a096120j362699C221755a83499D621811f57061b90334
274a750582l315540a584333A91953L300323F9484K49586J630247c120553l33461
$$ y = [-214030, 466471, 6455, -419385, 894391, 598556, 730674, 2093675, -631297, -850791, -741399, -922733, 1945920, 56691, 497525, -247164, -677749, -1903314, 239604, -2333400, 1271670, 135628, 830592, 318554, -2529, 1231563, -480998, -139558, 1585681, -952469, 2391446, 681988, -1591799, 905046, -280880, -1236149, 441743, -2411411, 343907, -889970, -1250822, -387962, 768400, -480850, 46195, -216907, 1492819, -408730, -126532, -61154, -430528, -1955738, 1023140, -1419841, 172643, -188579, -4630886, -536963, 1356436, -137586, 4384639, -894273, 2199123, -1306994, 1884328, -1274447, 1179950, -1096120, -2458819, 3221755, -183499, 4621811, -657061, -290334, -1750582, -5066122, -1584333, 191953, 3492276, 69484, 319070, 1949317, -3120553, -3454014]
265c454014E528293e27592A238138a325046H3533c520831B654343j075036p42270
256H37037D2714L48303N71124b567195J176670A947783d68558q73563A186775
246A42343K11410M36459J022291h68265A35435M4343a203490B655146a940213
236a866900G71246a279250C181002D65505b392919A245020b50755j39513A663348
226E62130a136232C214835b618237B022804f28373K289B56790f81914j064478
217a746392A627332c749729h11851B799055F90807a083409B150184d82426j264671
208a747097A12177J67611R21166P16902i2454A034270a62397E72171i69209e1380
197i4025M4850A054107C60729I9666k4612J272659J167702b610449e49355j495573
$$ y = [-3454014, 5528293, -527592, 1238138, -1325046, 83533, -3520831, 2654343, 1579307, 837037, 42714, 391017, 962141, -2567195, -1390525, 1947783, -468558, -1342121, 1186775, 142343, 353753, 790212, 1812503, -868265, 135435, 179778, -1203490, 2655146, -1940213, -1866900, 771246, -1279250, 3181002, 465505, -2392919, 1245020, -250755, -390268, 1663348, 562130, -1136232, 3214835, -2618237, 2022804, -628373, -626084, 256790, -681914, -1746392, 1627332, -3749729, -811851, 2799055, 690807, -1083409, 2150184, -482426, -1747097, 112177, 279788, 1200954, 1917856, -92454, 1034270, -162397, 572171, -969209, -51380, -94025, -49175, 1054107, 360729, 99666, 75054, 1347713, 2515415, -2610449, -549355, -2044928]
187b044928k8287A002960K329946a791486H25171L84774C22539a131383j0614
178a141997a62731j337659c28590B28993a061503A36812K26757a338608B770728
168H37503a477557A69114K021196B24325L00815J426008l60010Q17141J715334
159D123613L886327J3368199R871032a6624118j51200371N9125660F268303R1533177
151I7801480B7765750j3388570n205046j460978C016866O19434l48621g83415
142f74701B523344o63399r01780L01991M55732l5701A70278a019082M8904j094550
132b064728A045677k18661a022769A725620l59195h6269A984027a689089O05343
123a083746l7588B246167g37461J39573C59219a657872F57155i21186K23766H36041
$$ y = [-2044928, -2073215, 1002960, 3332906, -1791486, 825171, 1209945, 322539, -1131383, -1141997, -162731, -1500390, -328590, 228993, -1061503, 136812, 363569, -1338608, 2770728, 837503, -1477557, 169114, 2190310, 224325, 525140, 1951148, 1591138, 2408279, 4123613, 8009940, 21378139, 31249171, -16624118, -167824489, -108698829, 6268303, 97801480, 27765750, 14377180, 9172134, 7711156, 3016866, 3636300, 3287679, -783415, -674701, 2523344, 1859945, 958165, 1260156, 1715888, 1680187, 170278, -1019082, -970178, -2064728, 1045677, 827016, -1022769, 1725620, 1366425, -86269, 1984027, -1689089, -1083746, -1121334, 2246167, -737461, -597888, 359219, -1657872, 657155, -921186, -697420, 836041]
112g66891c8713j04258q15322G68682a537118D7144P94971i57061B369533e84125
101G35252E1909g53386c11864j694122e34738a70047A178465k02085a290243b86198
90I56032a024862I30486K16070B25726L26835a467149A470677b00291m53088A143909
79e21748B42410c175167a71548j48074k860001B337126G10385b92885J13691A45164
68f34975a03301q11328M27480j005503A842304A36121J689680c59537o74000B08327
57a293128G62788j26461R4280p5274a454156A885565E22443a046353D67361A39757
46b024136E79615g22393E05929a305427j158457B132118B46410K82205a35983
36d17912H3976a977167B212665h69389L0632C02237d96389j649060D78731b333160
$$ y = [-766891, -38713, -142971, -958293, 768682, -1537118, 47144, 842115, -957061, 2369533, -584125, 735252, 51909, -753386, -311864, -2005986, -534738, -170047, 1178465, 976380, -1290243, -286198, 956032, -1024862, 930486, 1146556, 225726, 552561, -1467149, 1470677, -200291, -653379, 1143909, -521748, 242410, -3175167, -171548, -319622, -3179623, 2337126, 710385, -292885, -179194, 145164, -634975, -103301, -914629, -487149, -1492652, 1842304, 136121, 1825801, -359537, -1033537, 208327, -1293128, 762788, 636327, 730607, 655333, -1454156, 1885565, 522443, -1046353, 467361, 139757, -2024136, 579615, -722393, 505929, -1305427, -2463884, 2132118, 246410, 528615, -135983, -417912, 83976, -1977167, 2212665, -869389, -838757, 302237, -496389, -2145449, 478731, -2333160]
25B151071a398714L05728F82081f96632H21757e32208B0391g27444a21174p57435
15h78609I55052a456814k9635A900185g71052j298081A678223i3816r58625J76121
5h76320A083985e69837J48670A381969d22066
$$ y = [2151071, -1398714, -1092986, 682081, -696632, 821757, -532208, 20391, -727444, -121174, -878609, 955052, -1456814, -1486449, 1900185, -771052, -2069133, 1678223, -93816, -1052441, -876320, 1083985, -569837, -421167, 1381969, -422066]
##PAGE= F1=5793.166488838
##FIRST=     21204.543296753, 2761.08209599448, 352121
##DATA TABLE= (F2++(Y..Y)), PROFILE
2047C52121A12627L2067K73553a737957e33753D69567g13506C24430K47012c6005
2036C49763J108166A65851n4840h36818I06577f61971A286612b812375A002096
2026a26431m435q74749A871641c81426a59699B641903j047268a77688j346152
2017a523840e91525I23682c67690C67662a625233l07465i59587B165837E58263
2007B020977E37873e37040k06223j179070B597834c240444g48428j22716A359880
1997H15616f71054j858139A943198B06366A7468N40404h50656a98950G87367h89051
1986a135085n41939g48234C633775a206220g1665D30061K89813K62726c85717
1976B350706q29305A77390P74901e75569o75258L17037H44948C01976a735811
$$ y = [352121, 112627, 144694, 418247, -1737957, -533753, 469567, -713506, 324430, 571442, -36005, 349763, 1457929, 165851, 111011, -836818, 906577, -661971, 1286612, -2812375, 1002096, -126431, -130866, -1005615, 1871641, -381426, -159699, 2641903, 1594635, -177688, -1523840, -591525, 923682, -367690, 367662, -1625233, -1932698, -959587, 2165837, 558263, 2020977, 537873, -537040, -743263, -1922333, 2597834, -3240444, -748428, -871144, 1359880, 815616, -671054, -2529193, 1943198, 206366, 17468, 557872, -850656, -198950, 787367, -889051, -1135085, -1677024, -748234, 3633775, -1206220, -71665, 430061, 719874, 982600, -385717, 2350706, 1521401, 177390, 952291, -575569, -1250827, -933790, 844948, 301976, -1735811]
1966A059073B196a338843A52625a599699H88258a664615H0053a30162D01900a817727
1955A134108b207911A39656M7417K400688m49213m45002d04568p65532A104423
1945B689567j029989a820742A450755i40342D4821h94449B132722a381723o7780
1936a449503A282447c355236I03476C26104R15825a619203A147114g99512A22676
1926b91268j050505B76217N4164N09030e96634o70686K63501F61521J214978a836584
1915A16224Q29230b88325p18909r00840C38076J540290a106685E11368A23694
1905A09879f97311d8790p81989n39027N40526A397477b05510q22417A406644d91072
1894A894187B01983M53572d15656m28855A734783b660071B325988r94897O19425
$$ y = [1059073, 2196, -1338843, 152625, -1599699, 888258, -1664615, 80053, -130162, 401900, -1817727, 1134108, -2207911, 139656, 187073, 2587761, 2138548, 1693546, -404568, -1170100, 1104423, 2689567, 1659578, -1820742, 1450755, -940342, 44821, -894449, 2132722, -1381723, -1449503, 1282447, -3355236, 903476, 326104, 1241929, -1619203, 1147114, -799512, 122676, -291268, -1341773, 276217, 330381, 839411, -596634, -1267320, -1003819, 661521, 1876499, -1836584, 116224, 945454, -288325, -1007234, -1908074, 338076, 1878366, -1106685, 511368, 123694, 109879, -697311, -48790, -830779, -1369806, -829280, 1397477, -205510, -1027927, 1406644, -491072, 1894187, 201983, 655555, -415656, -844511, 1734783, -2660071, 2325988, 1331091, 1950516]
1885A950516C02530q8147h09787D73540c52679k218707G0321a579783E73053L89402
1875I62455f65795D7618J94070m0749Q45751d36228n25405A800232g32057C65348
1864H12150h00694E52220h89505L110j95144G61800l13944h07699A472870o98865
1854G74005b328229R19770A375809n36157e65901a74625E42425O23777E20374
1844E21138M41977a176160d01984j29458j041948K30598c36394A414786a157273
1834G93525a915699Q30775A196013b727488i8287r38803K85927A984280D42201
1824a080831I55460b91515A147934c66162r46562H40916f10926A546669c902215
1814A21051J522969F81394d17907j085220n67983b4750l1748A120294b78921C39686
$$ y = [1950516, 302530, 214383, -809787, 473540, -352679, -2571386, 70321, -1579783, 573053, 962455, -665795, 47618, 241688, 200939, 1046690, -436228, -961633, 1800232, -732057, 365348, 812150, -800694, 552220, -889505, -886395, -1081539, 761800, 447856, -807699, 1472870, 774005, -2328229, -1408459, 1375809, 839652, -565901, -174625, 542425, 1166202, 520374, 521138, 963115, -1176160, -401984, -531442, -1573390, -1342792, -336394, 1414786, -1157273, 793525, -1915699, -1084924, 1196013, -2727488, -98287, -1037090, -751163, 1984280, 442201, -1080831, 955460, -291515, 1147934, -366162, -1312724, 840916, -610926, 1546669, -3902215, 121051, 1644020, 681394, -417907, -1503127, -2071110, -24750, -56498, 1120294, -278921, 339686]
1803b126401B492343b558418I30413M84468b136764e11715F08885o1199f17785
1793a53422n63127l79774b71493j026535a47600m89919B388914C78674C0577b324403
1782d2439j054922l78850f54297B62722N06067P58624e0353j242548D7128K44597
1772B91725J693281b196931a01071E98233q6227d51927B82119L65268J839574
1763B486961F31986b61396n32575j036604j138685A322974n48223d22125A213176
1753A628761b115947a29925l82058m65000k19970C18736h01752F37093a562455
1743A829139F8768M81888g5250o95517A556579M55089r16718a093624D14835c028
1732a494061D94558J039841m03456f49728n60402A696538a25365l48604B316463
$$ y = [-2126401, 2492343, -2558418, 930413, 1414881, -2136764, -511715, 608885, 547686, -617785, -153422, -716549, -1096323, -271493, -1298028, -147600, -637519, 2388914, 378674, 30577, -2324403, -42439, -1097361, -1476211, -654297, 262722, 768789, 1527413, -50353, -1292901, 47128, 291725, 1985006, -2196931, -101071, 598233, 512006, -451927, 282119, 647387, 2486961, 631986, -261396, -793971, -1830575, -2969260, 1322974, 774751, -422125, 1213176, 1628761, -2115947, -129925, -511983, -976983, -1196953, 318736, -801752, 637093, -1562455, 1829139, 68768, 550656, -75250, -770767, 1556579, 2011668, 1094950, -1093624, 414835, -3028, -1494061, 494558, 1534399, 1130943, -649728, -1210130, 1696538, -125365, -473969, 2316463]
1722A88045a851052C710072b281757g44021I3946L79264j67246e24861J11837
1713d13024C1764N3472i47017k92267a15608k640C24071a160284E74443b691155
1702a41404n39475A352929C59507e00839A184411m71696a754972d82471l10153
1693g92624I08185a61430o02448B64954L10833a069798c98229C68019a84229o16109
1683h00338O7310B116235c452960f2239l72595A5878f39900a31346A463962J39526
1673A603488J57495a16944j151704A818054E91075b375829D57304J325886l19522
1664A463668P65976a358909J13602E319b307136D0064a166492A746879p92461
1655I54418B54941h98580F62615n7515a660298A679639d47069B16220n2847Q3346
$$ y = [188045, -1851052, 3710072, -2281757, -744021, 93946, 473210, 305964, -524861, -413024, 31764, 85236, -947017, -1239284, -115608, -118248, 324071, -1160284, 574443, -2691155, -141404, -680879, 1352929, 359507, -500839, 1184411, 712715, -1754972, -482471, -792624, 908185, -161430, -763878, 264954, 575787, -1069798, -398229, 368019, -184229, -800338, -733028, 2116235, -3452960, -62239, -434834, 15878, -639900, -131346, 1463962, 1603488, 1760983, -116944, -1268648, 1818054, 591075, -2375829, 457304, 1783190, 1463668, 2229644, -1358909, -1245307, 5319, -2307136, 40064, -1166492, 1746879, 954418, 254941, -898580, 662615, 605100, -1660298, 1679639, -447069, 216220, 163373, 246719]
1645B46719d595979A507662f8202A064446e98242A260187b84720m07770J88540
1636e03950J54347B99411N76806d8735m80170a68193B257326b089096A39514J64932
1626C04446L8877e11584j172172c85764H0019h26279B355286p34145e24360l54553
1616h78913A49830R820O2923g08152A341075a646523E04368L892963A27711J097773
1606A225484C94081a70393j762224h80359B03356J640928h748m65428K32133A686286
1595a643489J8948j026844A914435F68339b036295G88920A98469g53217A186156
1585A484944a513808A010768a785663A000266O91909b88647B272706h16581g5528
1575D98847P23867J054576L20904b01984m66676N3426j423272A250509M76142
$$ y = [246719, -4595979, 1507662, -68202, 1064446, -598242, 1260187, -284720, -692490, -503950, -349603, 299411, 876217, -48735, -528905, -168193, 2257326, -2089096, 139514, 304446, 343323, -511584, -1683756, -385764, 80019, -826279, 2355286, 1621141, -524360, -878913, 149830, 159650, 222573, -708152, 1341075, -1646523, 504368, 4397331, 127711, 1225484, 394081, -170393, -1932617, -880359, 203356, 1844284, -8748, -474176, -242043, 1686286, -1643489, -1624541, -2651385, 1914435, 668339, -2036295, 788920, 198469, -753217, 1186156, 1484944, -1513808, 1010768, -1785663, 1000266, 1692175, -288647, 2272706, -816581, -75528, 498847, 1222714, 2277290, 2598194, -201984, -668660, -615234, -2038506, 1250509, 1726651]
1566A726651h25113m12958K02530H34232C43966e00324E20504c49253l99752A193643
1555A36874h30293g4255A253392B60753g74997C62761a5618B79746a844513F73955
1544b832213A226313b069572Q13233N31572F58639k74812a314036A831351c03943
1534a350681j52735H08458J37681l19900f21218A995149a187664b39287f2977
1524h89102B663353H3557N07589d98684C13684a981258P3357A749985b653462
1514A027298M37532G29896A94660i36892g6808I34351h96417E32094A04070P01888
1504H05958a412166E39665N60846B92594Q27493l23074a299834c92041A434451
1494i25289o45675d11224p3109j013842B34096J066140e74306A241280k60024
$$ y = [1726651, -825113, -1238071, -1035541, 834232, 343966, -500324, 520504, -349253, -749005, 1193643, 136874, -830293, -74255, 1253392, 260753, -774997, 362761, -15618, 279746, -1844513, 673955, -2832213, 1226313, -2069572, -1256339, -724767, 658639, 383827, -1314036, 1831351, -303943, -1350681, -1503416, 808458, 946139, 626239, -621218, 1995149, -1187664, -239287, -62977, -889102, 2663353, 83557, 591146, -498684, 313684, -1981258, -1907901, 1749985, -2653462, 1027298, 1464830, 729896, 194660, -936892, -76808, 934351, -896417, 532094, 104070, 805958, -1412166, 539665, 1100511, 292594, 1120087, 797013, -1299834, -392041, 1434451, -925289, -1570964, -411224, -484333, -1498175, 234096, 1300236, -574306, 1241280, 981256]
1485I81256D76765a19053a2254l60128k912585A56488f0552k108920B02021K647558
1475B849579A90856F4100b864235H64670b14539A100082l39470a84055j474410
1466a658465C76512b05475j52420A812682a92159l66161A708276g20120A069637
1456c51320A045939a341386A531915a084978A301031K24081F38518h27350p20918
1447a548268A480100m42099a769429Q47425D76585a15792o54208L12311A290865
1437e39580k327715f91823A113159J82163b329146F47490a16974C7934O61548
1428F99482h21251j70533o79081A655479e3089k6974k817460A333497g41771A14861
1417B292787d03539k73731m47073F99030k64201J299584n65502d95874q04366
$$ y = [981256, 476765, -119053, -12254, -372382, -3284967, 156488, -60552, -2169472, 202021, 2849579, 190856, 64100, -2864235, 864670, -214539, 1100082, 760612, -184055, -1658465, 376512, -205475, -357895, 1812682, -192159, -558320, 1708276, -720120, 1069637, -351320, 1045939, -1341386, 1531915, -1084978, 1301031, 1525112, 638518, -827350, -1548268, 1480100, 1038001, -1769429, -922004, 476585, -115792, -770000, -457689, 1290865, -539580, -2867295, -691823, 1113159, 1295322, -2329146, 647490, -116974, 37934, 699482, -821251, -991784, -1670865, 1655479, -53089, -80063, -2897523, 1333497, -741771, 114861, 2292787, -403539, -677270, -1124343, 699030, 434829, 1734413, 1168911, -495874, -1300240]
1408a300240A266459a131363A34229J473221C48382c04719j281966E37161f60865
1398G94780K97710j51168J54572c117823i82652a83580A321792a204280A202396
1388A672981i6504k032276d75262a29871N868F45064A28690i89388A6164i4228
1377a180480D74990g01017A280093a500565L81204j638161a010064d75075J88746
1368b86329H63819c76909G72392a757595F25724b351492d70002A252834l81853
1359H70981O46255f58504p06629e50865F12653j43472a194909A63556J618168
1350A781724B09969N24201a68531A557553a852658E66566J280715q38794b458180
1340C76799L01826c60399m77806b64117j681290B921795H74378B66417e32501
$$ y = [-1300240, 1266459, -1131363, 134229, 1607450, 348382, -304719, -1586685, 537161, -660865, 794780, 1092490, 941322, 1095894, -3117823, -982652, -183580, 1321792, -1204280, 1202396, 1672981, -96504, -2128780, -475262, -129871, -124003, 645064, 128690, -989388, 16164, -94228, -1180480, 474990, -701017, 1280093, -1500565, -1119361, -2757522, -1010064, -475075, -286329, 863819, -376909, 772392, -1757595, 625724, -2351492, -470002, 1252834, 870981, 1517236, -658504, -1365133, -550865, 612653, 469181, -1194909, 163556, 1781724, 209969, 734170, -168531, 1557553, -1852658, 566566, 1847281, 1008487, -2458180, 376799, 678625, -360399, -838205, -264117, -1945407, 2921795, 874378, 266417, -532501]
1330G26066G5239f65305j098724A314860n66863B35913i53433B96635L96820J027607
1320A721062E77275m4997a459635P951H44250b433223A493900B94409g6634k275623
1310b352257B79964i20622j15924B48727a672552L77540A398185a425331O78763
1301g46568A580436n63300a293810F90994b409296A956568n85100a201313A807818
1291c9222D24286K55983P25368B18367i59464a13844k72298k95821A58221J237604
1281A395825a909906a35996E10371A37396b15992l14516o03134C30154h76943
1271A35594g46957n76777K77965B58388K178798a34878j063243N94754A162846
1261a195309K1860A507953D37965k628i88399o27438N64374A797650a512914m1940
$$ y = [726066, 75239, -665305, -1764029, 1314860, 747997, 235913, -953433, 296635, 693455, 1721062, 577275, 532278, -1459635, -1451684, 844250, -2433223, 1493900, 294409, -76634, -2352257, 279964, -920622, -1036546, 248727, -1672552, -1295012, 1398185, -1425331, -746568, 1580436, 1017136, -1293810, 690994, -2409296, 1956568, 1371468, -1201313, 1807818, -39222, 424286, 680269, 1405637, 218367, -959464, -113844, -386142, -681963, 158221, 1395825, -1909906, -135996, 510371, 137396, -215992, -530508, -1133642, 330154, -876943, 135594, -746957, -1323734, -1045769, 258388, 2437186, -134878, -1198121, -603367, 1162846, -1195309, -1173449, 1507953, 437965, 435337, -988399, -1615837, -1051463, 1797650, -1512914, -1554854]
1251a554854I81365e21450I72212a622583g63330o66283A071506M0555a677537
1241a44500F76902j79713J349533c87437A018613b237721A455259m01071D72916
1231i51355j78385B99921b14099q17346k099371A486458d72210p46287B263R02460
1221I04723a095541B154177i18661B105666C50550g45100A401337a096691G29534
1211c12990Q6305H23186a234613A689225k06839d31910F85270j19095k4870a87560
1200C226122a15661G60542c1894A931603h72267j664792E07553K0973J775429
1191B303955d53614A21167N33309A29665f80187H66744l72671O3417O44389j6357
1181A185522a393439H29321a25094A847154a77052k213022a11027E40904j7130
$$ y = [-1554854, 981365, -521450, 972212, -1622583, -763330, -1429613, 1071506, 1112061, -1677537, -144500, 676902, 497189, 1846722, -387437, 1018613, -2237721, 1455259, 1054188, 472916, -951355, -1129740, 299921, -214099, -1031445, -3130816, 1486458, -472210, -1218497, 2263, 904723, -1095541, 2154177, -918661, 2105666, 350550, -745100, 1401337, -1096691, 729534, -312990, -226685, 823186, -1234613, 1689225, 1482386, -431910, 685270, 566175, 541305, -187560, 3226122, -115661, 760542, -31894, 1931603, -872267, -2537059, 507553, 528526, 2303955, -453614, 121167, 654476, 129665, -680187, 866744, 494073, 557490, 1201879, 1185522, -1393439, 829321, -125094, 1847154, -177052, -2390074, -111027, 540904, 523774]
1172E23774N30964c40724A930871b291386A661683c185616Q78964A639207a808935
1162d26996E33071J963458e45111j3723A336541a333393D83165J049014a639389
1152A453313b385139B738187c013793A374495a38131n19999A660807p74658c841939
1142C210521d4632A871895a859831M45376A752412d29068C10589h77906E30149
1132b373231D2542J852342C64894a54454E82375c56899A430769b831257G64258
1122D70835a57158G31060e72135I24996O03305f65082o54812C2524N76613a612716
1111A307643a613891C39023i43166p77318C79606A70824E8290f84261B003276
1101F97335J361849A17669K76190M61703i15292A457391b223651h12328B053583
$$ y = [523774, 1054738, -340724, 1930871, -2291386, 1661683, -3185616, -2306652, 1639207, -1808935, -426996, 533071, 2496529, -545111, -558834, 1336541, -1333393, 483165, 1532179, -1639389, 1453313, -2385139, 2738187, -3013793, 1374495, -138131, -658130, 1660807, 886149, -3841939, 3210521, -44632, 1871895, -1859831, -1414455, 1752412, -429068, 310589, -877906, 530149, -2373231, 42542, 1894884, 364894, -154454, 582375, -356899, 1430769, -2831257, 764258, 470835, -157158, 731060, -572135, 924996, 1528301, -665082, -1319894, 32524, 609137, -1612716, 1307643, -1613891, 339023, -943166, -1720484, 379606, 170824, 58290, -684261, 2003276, 697335, 2059184, 117669, 393859, 855562, -915292, 1457391, -2223651, -812328, 2053583]
1091E21640d09058l92284j85649A211349C08702J891546a745905A053808c5192
1081b463767A915723d16599A343309m63097a017885H26582q0117L78557c783635
1071a409577B337687j061126j39397b161441B702480d3364q8541B585322b35151
1061A821126a96149j222024A108412d97246D79388a621740L70185a75775E47392
1051E14346J329262a910136A671783c277440h13566k62956B344384D19211C5152
1041b844760I04774C72377k9477J9313b052250f59746A810758a128124A132738
1031i13777A064747e09779F37458a248789I47554J19204b87369B262074a024638
1021G56601Q5125b12146m94533A450687O51268e26689M6987j468554C20605c51108
$$ y = [521640, -409058, -801342, -986991, 1211349, 308702, 2200248, -1745905, 1053808, -35192, -2463767, 1915723, -416599, 1343309, 880212, -1017885, 826582, 746465, 1125022, -3783635, -1409577, 2337687, 1276561, 1137164, -2161441, 2702480, -43364, -131905, 2585322, -235151, 1821126, -196149, -1418173, 1108412, -497246, 479388, -1621740, -1251555, -175775, 547392, 514346, 1843608, -1910136, 1671783, -3277440, -813566, -1076522, 2344384, 419211, 35152, -2844760, 904774, 372377, 342900, 362213, -2052250, -659746, 1810758, -1128124, 1132738, -913777, 1064747, -509779, 637458, -1248789, 947554, 1066758, -287369, 2262074, -1024638, 756601, 841726, -212146, -706679, 1450687, 2101955, -526689, -479702, -1948256, 320605, -351108]
1010A499324a464726c72561A280013D06907g32210j868683e25117J84070C4353
1000b464783B544482b478739G73919d03479q63743a29269F64003g41911K0434
991g21477p23239C463633a681303f1506B48366K00504J721897a12425j306277
982a418702A661785a071910I02655a311703B920849b97888B12610a635017B92480
972a265203A848686d68555J33881A309307a554033B17242K3361J140318P4829
963A455750c32512h5110o49094q76303B741232a810764O85E69411a89992D77238
952d28225j720694A014456l31936a389786c58137I85515A09549J689533b387954
942B080032a40866o14280j428487A451183M61865i07645D90790d65739a61229
$$ y = [1499324, -1464726, -372561, 1280013, 406907, -732210, -2600893, -525117, -341047, 34353, -2464783, 2544482, -2478739, 773919, -403479, -1267222, -129269, 664003, -741911, -721477, -1444716, 3463633, -1681303, -61506, 248366, 448870, 2170767, -112425, -1418702, 1661785, -1071910, 902655, -1311703, 2920849, -297888, 212610, -1635017, 292480, -1265203, 1848686, -468555, -334674, 1309307, -1554033, 217242, 240603, 1380921, 1455750, -332512, -85110, -734204, -1610507, 2741232, -1810764, -1810079, 569411, -189992, 477238, -428225, -2148919, 1014456, 682520, -1389786, -358137, 985515, 109549, 1799082, -2387954, 2080032, -140866, -755146, -2183633, 1451183, 1913048, -907645, 490790, -465739, -161229]
932a096325A795733l44621a41957C92070h19727J48152n59150a32301p7718e6271
921a420546N13537F36051K73794b64355k91123A332460O09112i64528j02990j086033
911b153551B343923i64792a46099C456338b809613A365331B64483a749671E91349
901A658352g78853B220452h16758k10007A405844a735382A637585g00245j318257
892b018502B189814h50599l2379B83141R06126d88601A89784f97045A745025o36961
882A108064a081454j171839A394338J567995a267529G0284a532652H82159m05354
873D76805J345999b98622k086166h17030A327994f66078F84592b59987k895847
864c155834A534628e70769A58164Q28551N54447B04376J36736J597813d29895
$$ y = [-1096325, 1795733, 1451112, -141957, 392070, -819727, -671575, -1230725, -132301, -210019, -56271, -1420546, -907009, 636051, 909845, -264355, -555478, 1332460, 1941572, -964528, -1067518, -2153551, 2343923, -964792, -146099, 3456338, -2809613, 1365331, 264483, -1749671, 591349, 1658352, -778853, 2220452, -816758, -1026765, 1405844, -1735382, 1637585, -700245, -2018502, 2189814, -850599, -882978, 283141, 1189267, -488601, 189784, -697045, 1745025, 1108064, -1081454, -2253293, 1394338, 2962333, -1267529, 70284, -1532652, 882159, 476805, 1822804, -298622, -2384788, -817030, 1327994, -666078, 684592, -259987, -3155834, 1534628, -570769, 158164, 986715, 1541162, 204376, 341112, 1938925, -429895]
854a527305E28498b676334A846418c29326k78595F99082a005070I44093J588242
845B532335e45509B25738K930f95346j092125A188282i74318d47672k15717b50374
834A798110q65326K26233g93706p78216A907437c06948a08285C216449b549568
824D92315c85090A023210c88422A075432F4847K351880H06265g70591D3494b501974
813A278576c73694A323302a057115R9558K61296B560853g52222A860237d01044
803B70912b58134a5891B173760b532213g79204j673872A662360q5441b904074
793B159989a144836F65475J196203q05708O0149e92716m37098d56989m01915I91227
782C2572N5809R01574B22997b183120B769195h29563H37752a043897B528686a004631
$$ y = [-1527305, 528498, -2676334, 1846418, -329326, -607921, 699082, -1005070, 944093, 2532335, -545509, 225738, 228668, -695346, -1787471, 1188282, -974318, -447672, -663389, -250374, 1798110, 932784, 1159017, -793706, -1571922, 1907437, -306948, -108285, 3216449, -2549568, 492315, -385090, 1023210, -388422, 1075432, 64847, 2416727, 806265, -770591, 43494, -2501974, 1278576, -373694, 1323302, -1057115, -957557, -696261, 2560853, -752222, 1860237, -401044, 270912, -258134, -15891, 2173760, -2532213, -779204, -2453076, 1662360, 1576919, -2904074, 2159989, -1144836, 665475, 1861678, 1055970, 1116119, -592716, -1029814, -456989, -858904, 991227, 32572, 88381, 989955, 222997, -2183120, 2769195, -829563, 837752, -1043897, 2528686, -1004631]
771C11069N73027e29847A084593A25845N83406c32520j42144j034013a04583A17265
760a904400B71514a070256C03799A31830b72353G5749J03313P49129b961328A034141
749B67913h85980k428558B59860J303107a12313k3400A265034d34948A720451
739H37923b5519k385858d03428I34924l19705O41191d30196n36852m30487N24035
729h73500G85772g45981j073128O63501A564585f98412p77879A126370m91321
720F35049n9848F9519L31134a186732H9449J00750i74887K44809A097152J673780
710B770932a552128F31780i29432m05500N61307A095568O05904B24551Q93053
701A117604k13568Q82440a218601A21202J47161a56095j36585A642631b273991
$$ y = [311069, 884096, -529847, 1084593, 125845, 709251, -332520, -474664, -1508677, -104583, 117265, -1904400, 271514, -1070256, 303799, 131830, -272353, 75749, 179062, 928191, -2961328, 1034141, 267913, -885980, -3314538, 259860, 1562967, -112313, -135713, 1265034, -434948, 1720451, 837923, -25519, -2411377, -403428, 934924, 615219, 1256410, -430196, -967048, -1397535, -873500, 785772, -745981, -1819109, -1155608, 1564585, -698412, -1476291, 1126370, 635049, 575201, 69519, 400653, -1186732, 89449, 190199, -974887, -730078, 1097152, 2770932, -1552128, 631780, -929432, -1334932, -773625, 1095568, 1701472, 224551, 1117604, 904036, 1786476, -1218601, 121202, 268363, -156095, -292680, 1642631, -2273991]
691a447118D39211J590244F92851a678555E07511h27967j46050A249468h62875
681c83783a62567j92650q55454B853299A69742L44297j81045i52111d47460G97458
670A006782d3550H34882a817288D07062K01431M15379a127321j06851A396438
660F26071a221242M05480c46123j563550A54470c33346m95904A507043j01955
651A405088a944474b41581E75522a941120N86265H89468G9414J123637f91640
641B037856g93889A609582a872368C42091g22539k23290c83724C80446d66914
631E20894J373518b55286j091780A462605J945383j609495b550970C286592l86386
622B900206a840365K52686B216672g05821r76484D142074b064722F58469a731510
$$ y = [-1447118, 439211, 2029455, 692851, -1678555, 507511, -827967, -974017, 1249468, -862875, -383783, -162567, -355217, -1210671, 2853299, 169742, 514039, 332994, -952111, -447460, 797458, 1006782, -43550, 834882, -1817288, 407062, 608493, 1023872, -1127321, -1234172, 1396438, 626071, -1221242, -815762, -346123, -1909673, 154470, -333346, -829250, 1507043, 1405088, -1944474, -241581, 575522, -1941120, -1354855, 889468, 79414, 1203051, -691640, 2037856, -793889, 1609582, -1872368, 342091, -722539, -945829, -383724, 380446, -466914, 520894, 1894412, -255286, -1347066, 1462605, 3407988, 1798493, -2550970, 3286592, 2900206, -1840365, -1587679, 2216672, -705821, -1682305, 4142074, -2064722, 658469, -1731510]
612C450566K576492a844096j592519a372734J35190j869745o64689B755137Q62930
603C618067b613954A493449h56420A672797J511333A43483J081967p6159e5795
593A887613E79521a225511A424571e69149b57124A018638a850616B817172b060097
583a606868D74681C1788J544285a554495l88023g67511q95278B42908E6870b37742
572B270213H93769e98166l395827i15299C76164J465601H90696g3861q14303k47893
562a136057I91457A51585L78590i14895j421880C970043q66220q58539C56399
552d00108C098664g60189m729541J033123c2327j925070D729340K72376A702759
542A075122j00813e1857A401226e05352k073516a52808B11229a0448j996638A848233
$$ y = [3450566, 6027058, -1844096, -3436615, -1372734, -1237544, -3107289, -3771978, 2755137, 3618067, -2613954, 1493449, -856420, 1672797, 3184130, 143483, 1225450, 1149291, -55795, 1887613, 579521, -1225511, 1424571, -569149, -257124, 1018638, -1850616, 2817172, -2060097, -1606868, 474681, 31788, 1576073, -1554495, -1942518, -767511, -1662789, 242908, 56870, -237742, 2270213, 893769, -598166, -3993993, -915299, 376164, 1841765, 890696, -73861, -888164, -1136057, 991457, 151585, 530175, -914895, -2336775, 3970043, 3103823, 2245284, 356399, -400108, 3098664, -760189, -5489730, -4456607, -32327, -1957397, 4729340, 5001716, 1702759, 1075122, 974309, -51857, 1401226, -505352, -2578868, -152808, 211229, -10448, -2007086, 1848233]
531G20079l47018a330500J65664F57874a099050A797920b5831G06204B86760h4441
520a396578c50050k708893J299113F81437A65302J050387K03782a196093I48075
510C17066J902854C65443a985990C118298I49980a626372F65952k50368j2526
501D03058M30039a984381F86398d15762A358183a470366B474036a095338B48660
491a201311l69714A465127a501843A180117b390625A552252F95298a169126a17972
481A437472a220194C304574a32540k021164A284049a02304n16815B85852J249677
472A535529g47741A76115a964221A372781a08342I69819a609472H42554a658934
462i43626C22433Q62986c21784G16907J389385F65868a019671D18743e15313B182075
$$ y = [720079, 373061, -1330500, -1164836, 657874, -1099050, 1797920, -25831, 706204, 286760, -84441, -1396578, -350050, -3058943, -1759830, 681437, 165302, 1215689, 1419471, -1196093, 948075, 317066, 2219920, 365443, -1985990, 3118298, 949980, -1626372, 665952, 415584, 403058, 833097, -1984381, 686398, -415762, 1358183, -1470366, 2474036, -1095338, 248660, -1201311, -1571025, 1465127, -1501843, 1180117, -2390625, 1552252, 695298, -1169126, -117972, 1437472, -1220194, 3304574, -132540, -2153704, 1284049, -102304, -619119, 285852, 1535529, -747741, 176115, -1964221, 1372781, -108342, 969819, -1609472, 842554, -1658934, -943626, 322433, 1185419, -321784, 716907, 2106292, 665868, -1019671, 418743, -515313, 2182075]
451A717730C48452h97880L01017F63552J391256i70753b83441j812868Q57427
442a238882B503296f18467C927538a046020k918069F1438a208621A016396a007288
432b49997F6234e04872F24062b65179k98126l10879a63218p00270c87517n43748
422i31265j12969E38452Q3896a065553A821116c68905A238070c46921D19279j24261
412B95018J309719a150115c74433B15447J350502A77473b201690R38772B110925
402a70694j6614q21325q1418A993984B30967c68180E58752a69767j374169g06302
391A360725C45285N25748m32321D7397g24338a2261B23938d9034j060735I09912
380C02024i08921o55046B68394b77833k46364C064490a029691B94646f31911j060660
$$ y = [1717730, 348452, -897880, -596863, 663552, 2054808, -970753, -283441, -2096309, -1238882, 2503296, -618467, 3927538, -1046020, -3964089, 61438, -1208621, 1016396, -1007288, -249997, 66234, -504872, 624062, -265179, -563305, -874184, -163218, -863488, -387517, -931265, -1044234, 538452, 622348, -1065553, 1821116, -368905, 1238070, -346921, 419279, 295018, 1604737, -1150115, -374433, 215447, 1565949, 177473, -2201690, -1262918, 2110925, -170694, -187308, -1008633, -1090051, 1993984, 230967, -368180, 558752, -169767, -1543936, -706302, 1360725, 345285, 871033, 438712, 47397, -724338, -12261, 223938, -49034, -1109769, 909912, 302024, -908921, -1563967, 268394, -277833, -524197, 3064490, -1029691, 294646, -631911, -1692571]
370a692571A91459Q20803b175552d27849B77684b31230n58053i1889C69819M79506
360H49325N63879F72508b25215A33728h14239J24422I61132a200096A253466L78229
350A631695d27641k11150B51168A0473f62540A077961m06864L50248J69399b44774
339e29610j43022k53850A998007A7590R74651d06666l15342j534834D23729b518354
328A382419D331P25048l20793c36937A160593b25869B5064J521993a431899A997507
317E05763a529778A039842E2523a505620D49366b429024E32800i63408l68954
308a332362c65959I25487d0026A88155b90802A176185b29885n10491a5133k66325
298b81458j577758E94033a426928A6260L46479d506124i91251A628760e10068
$$ y = [-1692571, 191459, 1012262, -2175552, -427849, 277684, -231230, -789283, -91889, 369819, 849325, 1413204, 672508, -225215, 133728, -814239, -689817, 961132, -1200096, 1253466, 1631695, -427641, -638791, 251168, 10473, -662540, 1077961, 671097, 1021345, 1190744, -244774, -529610, -672632, -926482, 1998007, 17590, 992241, -406666, -722008, -2256842, 423729, -2518354, 1382419, 4331, 729379, 408586, -336937, 1160593, -225869, 25064, 1547057, -1431899, 1997507, 505763, -1529778, 1039842, 52523, -1505620, 449366, -2429024, 532800, -963408, -1332362, -365959, 925487, -40026, 188155, -290802, 1176185, -229885, -740376, -15133, -281458, -1859216, 594033, -1426928, 16260, 362739, -4506124, -991251, 1628760, -510068]
288E038562a725253B408875a284254A871028a506454A525046a029932j519869
280b549801C419842g8083D811767a308838h6583k151694k773284a560834A70714
270C212359F0858L95205J139757b623355j286120E740634c6467A238490a382497
260I1839c744915B687483j155417l49860B61565A15331Q72290b550216J244392
251a305824A918360e67827o60719A114909E5740O99829j22207J169171e22100
241B23632G9707i19666B669948b517941P56899G82749a077617C293930G14787
231b619856A396936b34387l39162A606106B34130f69173C127259b543273B039560
221f45599J34318B5504f86839r73939A760270c663238h56564B589530G22593a086652
$$ y = [5038562, -1725253, 2408875, -1284254, 1871028, -1506454, 1525046, -1029932, -2549801, 3419842, -78083, 4811767, -1308838, -86583, -2238277, -5011561, -1560834, 170714, 3212359, 60858, 456063, 1595820, -2623355, -3909475, 5740634, -36467, 1238490, -1382497, 91839, -3744915, 2687483, 1532066, 1182206, 261565, 115331, 987621, -2550216, -1305824, 1918360, -567827, -1228546, 1114909, 55740, 755569, 633362, 1802533, -522100, 223632, 79707, -919666, 2669948, -2517941, -1761042, 782749, -1077617, 3293930, 714787, -2619856, 1396936, -234387, -573549, 1606106, 234130, -669173, 3127259, -2543273, 2039560, -645599, -511281, 25504, -686839, -1660778, 1760270, -3663238, -856564, 2589530, 722593, -1086652]
210A985507d25437j398977B81694a2267B205248m51344c2245I18471B5120R71661
200I96781a276963D08785b22742G3563O87403k88252a998G5296J394407O59311
190B129014b708699e43206j029350n80167E34539K698858a335858G37069N37576
181A274645C51834a078848J25898K04297o68563C4990m281g31929C48764K2313
171C71077a262914B437901j107506a634463b59563B379385C92855j73260J695133
162A914728k77917L99292K587013L172629J2944855J0215469a7090452j50935855
154a68026307N8995963F059152R1625966B8357000j2967611o364655K75238B736297
145C289321k6653f24793j40612B563384l96125G88220N02190J082235r04918D418
$$ y = [1985507, -425437, -1824414, 281694, -12267, 2205248, 1753904, -32245, 918471, 25120, 996781, -1276963, 408785, -222742, 73563, 760966, 472714, -1998, 75296, 1469703, 2129014, -2708699, -543206, -1572556, -2152723, 534539, 3233397, -1335858, 737069, 1274645, 351834, -1078848, -952950, -748653, -1417216, 34990, 30709, -731929, 348764, 371077, -1262914, 2437901, 1330395, -1634463, -259563, 2379385, 392855, 219595, 1914728, 1636811, 2036103, 4623116, 7795745, 20740600, 30956069, -17090452, -168026307, -109030344, 6059152, 97685118, 28357000, 15389389, 9024734, 9299972, 2736297, 3289321, 3262668, -624793, -765405, 2563384, 2167259, 788220, 1290410, 2372645, 1467727, 4418]
134a162802K27018j352550A325865m73120i33660A604862k17466A2280J611411
125A623691a568771M92943d23870B340509a143525N01665D39024a746712A001092
115a197386e07214G70103a330468e0242B56514a172599A113879a393637a38402
105I72736a018395B590003g35342H59556A14921h90119b98112j878976g4850k02719
95b77569A110741J23813a409238c1546H12630g77188H31774o528l99964J6648
85D41930a334187A692126c17940j12642A275077h98871A59612c257375H4157b93723
74c174741B586845C44271b40478A5611K56342d05041a68512n16466K1871p74300
64a437407A882346B46085J420208e03634m95521B49564a509284A154661n02177
$$ y = [-1162802, -935784, -2288334, 1325865, 852745, -933660, 1604862, 1387396, 12280, 1623691, -1568771, -1075828, -423870, 2340509, -1143525, -641860, 439024, -1746712, 1001092, -1197386, -507214, 770103, -1330468, -50242, 256514, -1172599, 1113879, -1393637, -138402, 972736, -1018395, 2590003, -735342, 859556, 114921, -890119, -298112, -2177088, -74850, -277569, 1110741, 1234554, -1409238, -31546, 812630, -777188, 831774, 825246, 425282, 441930, -1334187, 1692126, -317940, -430582, 1275077, -898871, 159612, -3257375, 84157, -293723, -3174741, 2586845, 344271, -240478, 15611, 271953, -405041, -168512, -684978, -663107, -1437407, 1882346, 246085, 1666293, -503634, -999155, 249564, -1509284, 1154661, 652484]
55F52484K77497C81457a634353A588424E47500h53203D58486A12104a933808A87623
44d95743C91106a290005j359534B072326E15819J96509g21345c39206b5133j683243
34a708376B216876a068155K85179D42117b58446j921910C98822b211627B169714
24a403920M15661I06228f58017H35112e89647f7184k80978J36803n55668A015244
13a379893m69691B311029h20693r42913A759544a16322q45715L67494A076139
3g00006J33896A557171c71125
$$ y = [652484, 929981, 381457, -1634353, 1588424, 547500, -853203, 458486, 112104, -1933808, 187623, -495743, 391106, -1290005, -2649539, 2072326, 515819, 712328, -721345, -339206, -25133, -1708376, 2216876, -1068155, -782976, 442117, -258446, -2180356, 398822, -2211627, 2169714, -1403920, -988259, 906228, -658017, 835112, -589647, -67184, -348162, -211359, -767027, 1015244, -1379893, -1849584, 2311029, -820693, -1763606, 1759544, -116322, -962037, -594543, 1076139, -700006, -566110, 1557171, -371125]
##PAGE= F1=5771.368218954
##FIRST=     21204.543296753, 2761.08209599448, 586696
##DATA TABLE= (F2++(Y..Y)), PROFILE
2047E86696b030A24420M39686a801911e23838F63381e71629E34465J14582B35586
2036A83142J413256A63360P3979i30148A147542f41829A269802b820468F92877
2026D85878a89949r92486B116752d65893i7062C062751A436948I6277a437580
2016f92489E87496e52396F74940a963975L0100R25545B020245r17301O38619G71141
2005c19900O696j681587B487318b953916d55349m96978A403596o53653f80236
1995a943873A488157F12626b66028F16834g54336K38390F61746a310172J35424
1986a174748l74693f75713C366943a557117a50821G01645k92912O31854d76225
1976B755315j136960G27097R7208e00051q21845M13332A233200n44495a818570
$$ y = [586696, -2030, 124420, 564106, -1801911, -523838, 663381, -571629, 534465, 649047, 235586, 183142, 1596398, 163360, 237339, -930148, 1147542, -641829, 1269802, -2820468, 692877, 485878, -189949, -1182435, 2116752, -465893, -97062, 3062751, 1436948, 96277, -1437580, -692489, 587496, -552396, 674940, -1963975, -1933875, -1008330, 2020245, 1102944, 1741563, 771141, -319900, -313204, -1994791, 2487318, -2953916, -455349, -952327, 1403596, 749943, -680236, -1943873, 1488157, 612626, -266028, 616834, -754336, -515946, 661746, -1310172, -1174748, -1549441, -675713, 3366943, -1557117, -150821, 701645, 408733, 1040587, -476225, 2755315, 1618355, 727097, 824305, -500051, -1321896, -908564, 1233200, 688705, -1818570]
1966I80184f6510j332437c7626j220667A095257a746010E3468a15329C50023a739918
1955I95442b201195B18311G7173K582727k98006m32704c45440p26833A155743
1945B473615j042351a989659A901419a216052b74687o81474B405436a215870j80484
1936a396354F70921b840637A047050C89816J055772a673695A290263h92034C22259
1926i8231j596079C73641j03019O58989e90176n96181k61468I30766N21616a965138
1915C72869O15080c01858m43576j176229D88330J067335a229838D64557f8684
1905A355g14337D1743g42590o94003O89230A077950C7721h50526A657872e80095
1894B056504B92569M14058a33361r94448A163870b843037B181166I16775J042172
$$ y = [980184, -66510, -1398947, -37626, -1258293, 1095257, -1746010, 53468, -115329, 350023, -1739918, 995442, -2201195, 218311, 77173, 2659900, 2361894, 1929190, -345440, -1072273, 1155743, 2473615, 1431264, -1989659, 1901419, -1216052, -274687, -956161, 2405436, -1215870, -1396354, 670921, -2840637, 1047050, 389816, 1445588, -1673695, 1290263, -892034, 322259, -98231, -1694310, 373641, 270622, 929611, -590176, -1186357, -1447825, 930766, 1452382, -1965138, 372869, 987949, -301858, -745434, -1921663, 488330, 1555665, -1229838, 464557, -68684, 1355, -714337, 41743, -742590, -1436593, -747363, 1077950, 37721, -850526, 1657872, -580095, 2056504, 292569, 706627, -133361, -1127809, 1163870, -2843037, 2181166, 916775, 1958947]
1885A958947D26083k05120h18818B50653c67374j997572A40723a846009E14092
1875A113891f24587A08550b6298C84498K59754b85262m20010A989582f27612E36764
1864D95093i09435I35592a151432M30405l59807F88088C36652g39408A185827
1854H62070b312269a029583A151967D43916f24471K87060H79323J97654C92202
1844E01961O19917a530865f23774c11368j237504J96382f54747A572061g81798
1834G22233a993353P56930A604008b721172A7008a168254K56353B278711A30478
1824i24121A458988b99775I81745d45413l44077F60580e29313A853133d202184
1814f8539B106580D71278e27072j024024m29589D7519c10545A401045b15659D36151
$$ y = [1958947, 426083, 220963, -818818, 250653, -367374, -2364946, 140723, -1846009, 514092, 1113891, -624587, 108550, -26298, 384498, 644252, -285262, -705272, 1989582, -627612, 536764, 495093, -909435, 935592, -1151432, -721027, -1080834, 688088, 336652, -739408, 1185827, 862070, -2312269, -1029583, 1151967, 443916, -624471, -337411, 879323, 1076977, 392202, 501961, 1121878, -1530865, -623774, -311368, -1548872, -1352490, -654747, 1572061, -781798, 722233, -1993353, -1236423, 1604008, -2721172, 17008, -1168254, -911901, 2278711, 130478, -924121, 1458988, -299775, 981745, -445413, -789490, 660580, -529313, 1853133, -4202184, -68539, 2106580, 471278, -527072, -1551096, -1980685, 47519, -310545, 1401045, -215659, 436151]
1803b089586B873689b435272H42173Q4551a804186P16070H35547B01241g99779
1793B34344e89360q71989c67551m24733b87590n61221B626335D47607d2571k168743
1783b211314f5535p61073j19504P6933D7022R79617J29577A61355a256539I1913
1772I3211K067003b137129A81253J68066M7296d76083C01005Q60619R70639H91355
1761d4430j029243j057760p30565A501487p02074g28576A413846p5466b182205
1751A38339d27006q29202r0784E25954g16282G71054a530510A662994a01547H52169
1740b81372l45764A549462J2061l46225a462704A60977J79708a643019C08512
1730A690737n68888g33898m44124A825827d8750k30005B348089B26657a700892
$$ y = [-2089586, 2873689, -2435272, 842173, 926724, -1804186, -1088116, 835547, 201241, -799779, 234344, -589360, -1461349, -367551, -792284, -287590, -848811, 2626335, 447607, -42571, -2211314, -65535, -826608, -946112, -869179, 47022, 1026639, 1156216, 161355, -1256539, 91913, 93211, 2160214, -2137129, 181253, 349319, 396615, -476083, 301005, 1161624, 2132263, 891355, -44430, -1073673, -2131433, -2861998, 1501487, 799413, -728576, 1413846, 1338380, -2182205, 138339, -427006, -1256208, -1346992, 525954, -716282, 771054, -1530510, 1662994, -101547, 852169, -281372, -627136, 1549462, 1561523, 1215298, -1462704, 160977, 340685, -1643019, 308512, 1690737, 1121849, -733898, -1178022, 1825827, -48750, -278755, 2348089, 226657, -1700892]
1720B792159a674655M69367D74680J24448B51849e13840j23805B4187g16j380028
1710a380744R2450A41323c31923E07185h63965C50894b862610c89574k28174A524786
1699i6565p48786A320306k75966a934222F0625f89595G90970b21272l04222G7055
1688H18888i72728L02805B10061h7289q62888d29759A489004c683986G5009M90492
1678E65501c39340Q91I7176J084236K61384K88735A31278a239021A923635D43832
1667b294859b59389B175785o32689Q71181a457383K50555e5842k012559C15200
1657a128975A210420J58488C1161h31739D70596K11496b103864A754477d94950
1647A29013A0727P66187d388974A514274c19810A280465d94747A403546d20941
$$ y = [2792159, -1674655, -1205288, 474680, 599128, 251849, -513840, -637645, 24187, -716, -1380744, -1288294, 141323, -331923, 507185, -863965, 350894, -2862610, -389574, -617748, 1524786, -96565, -845351, 1320306, 1044340, -1934222, 60625, -689595, 790970, -221272, -525494, 77055, 818888, -972728, -669923, 210061, -87289, -950177, -429759, 1489004, -3683986, 75009, 565501, -339340, -338449, 97176, 1181412, 1442796, 1731531, 131278, -1239021, 1923635, 443832, -2294859, -259389, 2175785, 1543096, 2414277, -1457383, -1206828, -55842, -2068401, 315200, -1128975, 1210420, 1368908, 31161, -831739, 470596, 682092, -2103864, 1754477, -494950, 129013, 10727, 776914, -4388974, 1514274, -319810, 1280465, -494747, 1403546, -420941]
1637f51961l4602a4349F8322O83496H1176c34454C94448K198998b107415F8815
1626D83618K25222g57412m02990i4656B10173a012071B009961j35923d23374j02703
1616e26077B60380B6617K10963a003171A267605a718896C92810M071749B16088
1606A271361l06111b75710j855117g50063A53017J428714I2632d70617b28776
1596A399134a734506k28732m54674A910245A12113a892964G62277A41945a060001
1586I16934J85987a006980G93604a944773A065619O42393d92019B458794h49553
1576a58162G59733K74373R60676K97651a64435m58916Q7655j110514A128498P90479
1566A918977g05922o72400L57976E23468p3995g48975C04701D6969h76407A482999
$$ y = [-651961, -686563, -14349, 68322, 751818, 81176, -334454, 394448, 2593446, -2107415, 68815, 483618, 708840, -757412, -1160402, -94656, 210173, -1012071, 2009961, 1874038, -423374, -526077, 260380, 26617, 237580, -1003171, 1267605, -1718896, 392810, 4464559, 216088, 1271361, 965250, -275710, -2130827, -750063, 153017, 1581731, 92632, -470617, -228776, 1399134, -1734506, -1963238, -2417912, 1910245, 112113, -1892964, 762277, 141945, -1060001, 916934, 1102921, -1006980, 793604, -1944773, 1065619, 1708012, -492019, 2458794, -849553, -158162, 759733, 1034106, 1994782, 2292433, -164435, -623351, -535696, -1646210, 1128498, 1918977, -705922, -1378322, -1020346, 523468, 449473, -748975, 304701, 46969, -876407, 1482999]
1555A55771g77463a63428A349693A63386e80271C64530E6085K6841a663155F19110
1544b903615A002100a918635O10161L39294F54100R9119a723462A884515c52261
1534a237638n40813H39226n1655O1363d24947A969344g45929J88586C49455e90711
1523B883524C9734O32155d98008A00775a878842l86182A891633b440479A175902
1513A405764k84946E13730i56836B22626N55899i85307D40285a9731I55259a426598
1502C99876Q78354E69370M03006J32720a413879e42495A522546i43237n28456
1493a471693e82359K25275j439707E68188N00953b49120I97206M745k72041e30834
1482D32071e98090k593843B54992b86972j818102A05264L232484a07350A9210
$$ y = [155771, -777463, -163428, 1349693, 163386, -580271, 364530, 56085, 82926, -1663155, 619110, -2903615, 1002100, -1918635, -1308474, -969180, 654100, 753219, -1723462, 1884515, -352261, -1237638, -1778451, 839226, 787571, 848934, -424947, 1969344, -745929, -557343, 349455, -590711, 2883524, 39734, 671889, -498008, 100775, -1878842, -2265024, 1891633, -2440479, 1175902, 1405764, 1120818, 513730, -956836, 222626, 778525, -985307, 440285, -19731, 955259, -1426598, 399876, 1278230, 569370, 972376, 1105096, -1413879, -542495, 1522546, -943237, -1471693, -582359, -357084, -1796791, 568188, 1069141, -249120, 997206, 1001951, 729910, -530834, 432071, -598090, -3191933, 254992, -286972, -2105074, 105264, 3337748, -107350, 19210]
1472b845219H81156i4244D48795N26515B443a974406C33577f83955b75497A674808
1461b5543n91699A718579e01242I59584d54790I65054a332494A699098g52963
1451A397045n7975B76812h16342n36459A739977H68160a573112K74211B49729
1441A26591f73974J545A236079h5304l114087f71992I92670L30424b245365D92932
1430A31917L51373q649i53956K46874q74061A857381a49896N4704k948747A302487
1419c54785F0101J693477d42827j91212l56717H78008E3472K033320o71826e16365
1408a500346A786066a059930C09324J126592h091I8113a924763F21351b36631
1398A09016J262066l51665K52594b727978i15836b33945A614007a344830A191141
$$ y = [-2845219, 881156, -94244, 448795, 975310, 2443, -1974406, 333577, -683955, -275497, 1674808, -25543, -617242, 1718579, -501242, 959584, -454790, 965054, -1332494, 1699098, -752963, 1397045, 1339070, 276812, -816342, -1352801, 1739977, 868160, -1573112, -1298901, 249729, 126591, -673974, -672429, 1236079, -85304, -3199391, -671992, 992670, 1323094, -2245365, 492932, 131917, 483290, 474641, -953956, -707082, -1581143, 1857381, -149896, -95192, -3043939, 1302487, -354785, 60101, 1753578, -442827, -634039, -990756, 878008, 53472, 2086792, 1414966, -516365, -1500346, 1786066, -1059930, 309324, 1435916, -8091, 98113, -1924763, 621351, -236631, 109016, 1371082, 1019417, 1272011, -2727978, -915836, -233945, 1614007, -1344830, 1191141]
1388A606586B34376b237257g60515A89102b75599A220999b73064k74842K66583
1379b81323A34928a221111B50092p7103P34620a365284L98999j662105a075685
1369a66078j46321E48106d10959A326690a431898D57238b254267d87035A055402
1359E55883R15259g16452n93172c18974A86200K81751b012509F47244P98104B05562
1348I71576b95334A431680b046709C31291J917604G75845b032787a17039I08841
1338c26709l36842b3455k979709C193151A194801B55063c05693H28837C58163
1328f54341j037858A708145p45810B83580a059824G2072J017332Q96477F03509
1318D94096a819386N15814I38479b747064A595427d1236l21483j891496b98200
$$ y = [1606586, 234376, -2237257, -760515, 189102, -275599, 1220999, -273064, -547906, -281323, 134928, -1221111, 250092, 172989, 907609, -1365284, -966285, -2628390, -1075685, -166078, -312399, 548106, -410959, 1326690, -1431898, 457238, -2254267, -487035, 1055402, 555883, 1471142, -716452, -1309624, -318974, 186200, 467951, -2012509, 647244, 1445348, 205562, 971576, -295334, 1431680, -2046709, 331291, 2248895, 775845, -2032787, -117039, 908841, -326709, -663551, -23455, -3003164, 3193151, 1194801, 255063, -305693, 828837, 358163, -654341, -1692199, 1708145, 962335, 283580, -1059824, 72072, 1089404, 1985881, 603509, 494096, -1819386, -1303572, 938479, -2747064, 1595427, -41236, -362719, -2254215, -298200]
1308g72166l72219C02169b022284O75275A484758a243897e10275A417931m28283
1299I89648a548445F58764b017363B444833j065947a465207A801330B2825N15874
1290E38699l4013J049850A06458a316734a72877k9355p54029c0095A864557b201274
1279B48681K81286A1794J68899b97480j572397A93305a005852B68800h71188k18313
1269a089501M6570D05010J618523A99348a223533K99554A435863a176986e85705
1259A473761o19308H0327a461437j33556M85284A816416b138490J83511A365064
1249g33361I69515a525738M94378j06517H71117o7445a389771c05737C81709K96271
1239F77980J100316b28286I08640b167612A347838j85263E07113a317624m57366
$$ y = [-772166, -1144385, 302169, -2022284, -1347009, 1484758, -1243897, -510275, 1417931, 989648, -1548445, 658764, -2017363, 2444833, 1378886, -1465207, 1801330, 22825, 538699, 504686, 1554536, 106458, -1316734, -172877, -202232, -956261, -30095, 1864557, -2201274, 248681, 529967, 11794, 180693, -297480, -1869877, 193305, -1005852, 268800, -871188, -1089501, -1042931, 405010, 2023533, 199348, -1223533, -923979, 1435863, -1176986, -585705, 1473761, 854453, 80327, -1461437, -1594993, -1109709, 1816416, -2138490, -1954979, 1365064, -733361, 969515, -1525738, -1031360, -1137877, 871117, 803672, -1389771, -305737, 381709, 677980, 1778296, -228286, 908640, -2167612, 1347838, 1162575, 507113, -1317624, -1774990]
1230a774990C95636b84528p93577j895070A534963H9111g36843C97574N22084
1221I19658a041209B014358a007960B256190A16470g91577A839008a086528G81493
1211a42348n91230I58848a204057I00554Q37953g20481A35162O54614P5662a62533
1200C271745c70495H39627a40039A813338f20526k512931D34449K08170J681870
1191B324489e77272A75958N31003C40507h27997A151985D04833R8806J037264
1182A540903l29678a175336G53491b94558A990279b75936k453829a5767C65411
1172F21943O22432c30504A904906b421830A492656b605607R47835A404669a995918
1162c60253Q6323B991734f96422J09180A020691a105408B03390J315909a789948
$$ y = [-1774990, 395636, -284528, -1078105, -2973175, 1534963, 89111, -736843, 397574, 919658, -1041209, 2014358, -1007960, 2256190, 116470, -791577, 1839008, -1086528, 781493, -142348, -733578, 958848, -1204057, 900554, 1738507, -720481, 135162, 789776, 865438, -162533, 3271745, -370495, 839627, -140039, 1813338, -620526, -3133457, 434449, 642619, 2324489, -577272, 175958, 706961, 340507, -827997, 1151985, 404833, 503639, 1540903, 1211225, -1175336, 753491, -294558, 1990279, -275936, -2729765, -15767, 365411, 621943, 1244375, -330504, 1904906, -2421830, 1492656, -2605607, -1657772, 1404669, -1995918, -360253, -273930, 2991734, -696422, -587242, 1020691, -1105408, 203390, 1519299, -1789948]
1152A564959b477439B665571b722115A340269A05839b85463A781063p03621c959592
1142B685746g2216B059800b263156J051735B007292b0429p429j278042C70248
1132b203412E9627J700820A18637i1506F57059d73901A875470c069543A210108
1122B67987E0968P82249h72209A012330O71429a99941j048568A91245M72211a686307
1111A427847a615296A68160a161036q67968E46769A24913a21807n49846A970586
1101H01339J164221H02926l70115L10525i28576A471797a932127d95518B172029
1091C23297d61005m41724o3906A261856G5657K040710a918471A121767A43336
1081b641729A956830f88902A125788E44364e54155E01458N18872o2650c835347
$$ y = [1564959, -2477439, 2665571, -2722115, 1340269, 105839, -285463, 1781063, 1077442, -3959592, 2685746, -72216, 2059800, -2263156, -1211421, 2007292, -20429, -27858, -1305900, 370248, -2203412, 59627, 1760447, 118637, -91506, 657059, -473901, 1875470, -3069543, 1210108, 267987, 50968, 833217, -872209, 1012330, 1683759, -199941, -1248509, 191245, 663456, -1686307, 1427847, -1615296, 168160, -1161036, -2029004, 546769, 124913, -121807, -671653, 1970586, 801339, 1965560, 802926, 432811, 743336, -928576, 1471797, -1932127, -495518, 2172029, 323297, -461005, -902729, -966635, 1261856, 75657, 2116367, -1918471, 1121767, 143336, -2641729, 1956830, -688902, 1125788, 544364, -554155, 501458, 1020330, 957680, -3835347]
1071a427398B549029F44205K55514b128545C380768a69895B2358L156215b81799
1061A731709a00218j545596I28424f9852D23813a659996P11882N3443F28895j34087
1051D94808J644986b778859A809677c438538g20903l99797B304014D95476A5875
1041b599754A082538D90665A17549k9416b025679d88197B120025a332778A427124
1031g53574A271896e29620G20923a117045A004367j0060d68154B146264i68567
1021C69055P20960d90062m2009A042500J823101f70245b27976j349595d0251m22672
1011d62923A488465a262580N93613A365011D48818a065329j239989h19838a93783
1001A9027b793760B387196b579607I64115e26787o55048a65324F01571e32204
$$ y = [-1427398, 2549029, 644205, 899719, -2128545, 3380768, -169895, 22358, 3178573, -281799, 1731709, -100218, -1645814, 928424, -69852, 423813, -1659996, -948114, -894671, 628895, 494808, 2139794, -2778859, 1809677, -3438538, -720903, -1120700, 2304014, 495476, 15875, -2599754, 1082538, 490665, 117549, 88133, -2025679, -488197, 2120025, -1332778, 1427124, -753574, 1271896, -529620, 720923, -1117045, 1004367, 994307, -468154, 2146264, -968567, 369055, 1090015, -490062, -532071, 1042500, 2865601, -670245, -227976, -1577571, -40251, -462923, 1488465, -1262580, -668967, 1365011, 448818, -1065329, -2305318, -819838, -193783, 19027, -2793760, 2387196, -2579607, 964115, -526787, -1181835, -165324, 601571, -532204]
991e29117j126825C437754a743831B92813a14818A69478J998851I5117a694706
981A697498a013429I98108a352271C051118d86850E83828a543343E4256a472049
971A789831e33537k2151A447599b161714F8180L72615O67568J70853c30354g033
960i02581p34595C067145a664380m4371D96543d15584I65751d67551j619198A010375
949F95241a478100b45445F95440A53835J608230b238322B316976c76694m56440
940h33134j637473A605787M33968i17227I47665f49260D34764a341694A629052
930A639882b57496E14451a215259N37701n62454D3813i5173l3122j189445Q9218
920a228522H14987J30748d53628m4055A164980N65060h41625o9853j272347B185717
$$ y = [-529117, -1655942, 3437754, -1743831, 292813, -114818, 169478, 2168329, 95117, -1694706, 1697498, -1013429, 998108, -1352271, 3051118, -486850, 583828, -1543343, 54256, -1472049, 1789831, -533537, -555688, 1447599, -2161714, 68180, 440795, 1108363, 1279216, -330354, -7033, -902581, -1637176, 3067145, -1664380, -1708751, 496543, -415584, 965751, -467551, -2086749, 1010375, 695241, -1478100, -245445, 695440, 153835, 1762065, -2238322, 2316976, -376694, -833134, -2470607, 1605787, 2039755, -917227, 947665, -649260, 434764, -1341694, 1629052, 1639882, -257496, 514451, -1215259, -677558, -1240012, 43813, -95173, -128295, -1317740, -1228522, 814987, 945735, -453628, -497683, 1164980, 1730040, -841625, -911478, -2183825, 2185717]
909i87402a57568D037266b894318A001152C82318a757532F77933Q49072h10212
899B683552h47011l06593A307800a589506A788879i13569j182039B055471e66728
889f82194D3824J778785d99966B15518b7213A450746m95816a282480p61271A167348
878B734499a124609A94676a755746E86480J9114J495718e53675j569740e41283
868A532996a225924G42172a75294l836828A289495c83763C00492P56219J82695
859A239406A07327L47565J489236a13890j232291F31243b431686B032870f64716
849f43460E77983g35699A260591J486976b78774J3093A98284g91674j034622A289855
838a006875L20890J67109N1412A993273r55812K1064f16641j044590B237607c66811
$$ y = [-987402, -157568, 4037266, -2894318, 1001152, 382318, -1757532, 677933, 1527005, -810212, 2683552, -847011, -1153604, 1307800, -1589506, 1788879, -913569, -2095608, 2055471, -566728, -682194, 43824, 1822609, -499966, 215518, -27213, 1450746, 954930, -1282480, -2043751, 1167348, 2734499, -1124609, 194676, -1755746, 586480, 605594, 2101312, -553675, -2123415, -541283, 1532996, -1225924, 742172, -175294, -4012122, 1289495, -383763, 300492, 1056711, 1239406, 107327, 454892, 1944128, -113890, -1346181, 631243, -2431686, 2032870, -664716, -643460, 577983, -735699, 1260591, 2747567, -278774, -265681, 198284, -791674, -1826296, 1289855, -1006875, -685985, -518876, -467464, 1993273, 1037461, 1058525, -616641, -1661231, 2237607, -366811]
827d86866C119922a761814F73060d93803A148908g90147A076316C74789K341205
818B715994F60197h56731C56098b444862A320510f8441A489726i42358k85350
809a227708L45626B610086h21911B134588e11458B20954b47048D32110J796718
800B228828b378521e88544j693197A320994O2475b384826A967051a107347H15901
790A846050H70604K58749a61515q89599M67584n125A063445E0606J15529R22712
780A088847r5437b389075B319854c70520A131744a363135B631661a145954A20198
770I58317e68331I86798H470Q36823d74456j75333p85327A67428l6278a948216
759F3376a097135D64415D212d93758A10614R1357J613468b719261F93486B64677
$$ y = [-486866, 3119922, -1761814, 673060, -493803, 1148908, -790147, 1076316, 374789, 2715994, 660197, -856731, 356098, -2444862, 1320510, -68441, 1489726, -942358, -1227708, -882082, 2610086, -821911, 2134588, -511458, 220954, -247048, 432110, 2228828, -2378521, -588544, -2281741, 1320994, 1383469, -2384826, 1967051, -1107347, 815901, 1846050, 870604, 1129353, -161515, -1051114, -583530, -588655, 1063445, 50606, 166135, 1088847, 993410, -2389075, 2319854, -370520, 1131744, -1363135, 2631661, -1145954, 120198, 958317, -568331, 986798, 8470, 845293, -474456, -649789, -1435116, 167428, 131150, -1948216, 63376, -1097135, 464415, 4212, -493758, 110614, 201971, 1815439, -2719261, 693486, 264677]
748a396762j797954D51366P99557a12938B19168P76706c23478A472517k88606
739A183911b08543j708545d95439H71561B85339R75009h03155j49902m49877b58470
728B65856a167645l60817K56936A433062g41937m51444A088431m28288j1142j36384
718E12617A82210f38712A1222b4047r64239J69565A256618J146464i62671E63078
707a041849n08343e79041G99768J310684B47540R60008j58943K12222a178417
697F0234L82526b97258R7564A745749b033965L16531D17682J516652E11800a761426
686E56052e34982m87713A309014i67002b90671P3639k21401o94789B500013D32264
675H17185A90332i09998K74389E80174Q45494a49454B76058i53349B16172L73396
$$ y = [-1396762, -3194716, 451366, 1250923, -112938, 219168, 995874, -323478, 1472517, 1183911, -208543, -1917088, -495439, 871561, 285339, 1260348, -803155, -953057, -1402934, -258470, 265856, -1167645, -1528462, -1271526, 1433062, -741937, -1193381, 1088431, 660143, 649001, 512617, 182210, -638712, 11222, -24047, -988286, -818721, 1256618, 2403082, -962671, 563078, -1041849, -1550192, -579041, 799768, 2110452, 247540, 1207548, 1048605, 1260827, -1178417, 60234, 442760, -297258, -199694, 1745749, -2033965, -1717434, 417682, 1934334, 511800, -1761426, 556052, -534982, -1022695, 1309014, -967002, -290671, -217032, -438433, -1133222, 2500013, 432264, 817185, 190332, -909998, -635609, 580174, 1425668, -149454, 276058, -953349, 216172, 589568]
665E89568N0664i23991n05856A033131l90915a361162b86388q1676j724548A85658
654d4791o74340A210221L69927a996794c46280D55289a733974M33887G45611A29402
643A119112i04273A894708g33576A204112a670485I4529d33309o01534e05252
633A116966e92100B03080J663227a03159j400239A691729J457996A380893b182746
623B615056O7721a957859O82845A914320e49265j278408D418820b275121C94674
613a379325C142708K561613a773057j952423a464628J54687j516458j149851B817124
603C755259b822426A401467a030888A898808J398856D9148N63286q4806A25131
593A532335m18653a106976I93530d81020q2353A161674b262054B646758b002198
$$ y = [589568, 640232, -923991, -1429847, 1033131, 642216, -1361162, -286388, -368064, -2092612, 185658, -44791, -719131, 1210221, 1580148, -1996794, -346280, 455289, -1733974, -1300087, 745611, 129402, 1119112, -904273, 1894708, -733576, 1204112, -1670485, 94529, -433309, -1034843, -505252, 1116966, -592100, 203080, 1866307, -103159, -1503398, 1691729, 3149725, 1380893, -2182746, 2615056, 2682777, -1957859, -1275014, 1914320, -549265, -1827673, 4418820, -2275121, 394674, -1379325, 3142708, 5704321, -1773057, -3725480, -1464628, -1309941, -2826399, -3976250, 2817124, 3755259, -2822426, 1401467, -1030888, 1898808, 3297664, 49148, 612434, 527628, 125131, 1532335, 1113682, -1106976, 993530, -481020, -563373, 1161674, -2262054, 2646758, -2002198]
583a843240A72168L74157J064619a465295m7593f50147m37888B20606a14869k6260
573a41129B339560G57500a78897l107529a140101E02058J194852H26968b57288
563a008844k3866F38530l18479p075h57325j721072D093968j402314q26208c6997
552d34822B949016e94878m435405P36509a17304k026297D629367J72790A905795
542A194116j61206B89961R41924a18080k413593a46474C94302j84041a993916
532B080410G07975j59060a080302j66265E49790h81085B174651b50355H39181
522D65556e18514n94624d63543k494494J194444I15426a07268A174530N13687
513A688217a427792A184295n65652J384108A72535a923658B670639j235616a681710
$$ y = [-1843240, 172168, 546325, 1610944, -1465295, -1512888, -650147, -1088035, 220606, -114869, -141129, 2339560, 757500, -178897, -3286426, -1140101, 502058, 1696910, 826968, -257288, -1008844, -1032710, 638530, 320051, 312976, -857325, -2578397, 4093968, 2691654, 1865446, -36997, -434822, 2949016, -594878, -5030283, -4293774, -117304, -2143601, 4629367, 4802157, 1905795, 1194116, 1032910, 289961, 1231885, -118080, -2531673, -146474, 394302, 210261, -1993916, 2080410, 707975, 548915, -1080302, -1246567, 549790, -881085, 2174651, -250355, 839181, 465556, -518514, -1113138, -463543, -2958037, -1763593, 915426, -107268, 1174530, 1688217, -1427792, 1184295, 618643, 2002751, 172535, -1923658, 2670639, 1435023, -1681710]
503C49609K17883j09067M95034a906641G35532d09847A112878a236915B457760
493a034303E45033a560884J69521I81861a564041A339509b697599A747493E39716
483i29291b41552A248088i41037C743441e28579j762312A286924B73998e84021
473C31553J326592d90005b6369j931665A342618A38426P72273b238153H07506
463a762104L78033C28561O76662c17282H21114J420613E59997i91817E77764g06029
452A950751j38879C43105a006976b99890A478467J55832a134304c45613j648282
443a993895N52307B701442d32371D208292g33730l265734a5448q34487H86898
433g56309j01053G09465a47048A076412i95394d32410o98325a08046p00098c85919
$$ y = [349609, 567492, 458425, 953459, -1906641, 735532, -409847, 1112878, -1236915, 2457760, -1034303, 545033, -1560884, -1391363, 981861, -1564041, 1339509, -2697599, 1747493, 539716, -929291, -241552, 1248088, -941037, 3743441, -528579, -2290891, 1286924, 273998, -584021, 331553, 1658145, -490005, -26369, -1958034, 1342618, 138426, 910699, -2238153, 807506, -1762104, -1384071, 328561, 1005223, -317282, 821114, 2241727, 559997, -991817, 577764, -706029, 1950751, 1811872, 343105, -1006976, -299890, 1478467, 1634299, -1134304, -345613, -1993895, -1441588, 2701442, -432371, 4208292, -733730, -3999464, -15448, -849935, 886898, -756309, -857362, 709465, -147048, 1076412, -995394, -432410, -1130735, -108046, -808144, -385919]
422g38562n19901G89091l84578a254562A707326c15610A438355e33102G22224
412A92270J376806a123571c58401A22087J098382m98590b094412a000349A302542
402E4153a38171p78357M22037B091624C70759e97541G49975c85495j325031g10778
391H80853D37207P69654E97822a46243n26538E7449N58674F5833h54160H32864
380B50357a000183o70804C38378c85667j02597B891186h86835A65988g90327p84791
370a575118g773G97715b361922e23959E64112j32775f60268c21777F38886N16310
360A155196M21537E01585D8264K70711h81679d24538A163857a372938A288311
350A468014e57193m74874B4878D907h91647A224927m84832M83016C48005A64380
$$ y = [-738562, -1258463, 789091, 404513, -1254562, 1707326, -315610, 1438355, -533102, 722224, 192270, 1569076, -1123571, -358401, 122087, 1220469, 721879, -2094412, -1000349, 1302542, 54153, -138171, -916528, -494491, 2091624, 370759, -597541, 749975, -385495, -1710526, -710778, 880853, 437207, 1206861, 597822, -146243, -672781, 57449, 616123, 65833, -854160, 832864, 250357, -1000183, -1670987, 338378, -385667, -488264, 2891186, -886835, 165988, -790327, -1575118, -7773, 797715, -2361922, -523959, 564112, 431337, -660268, -321777, 638886, 1155196, 1576733, 501585, 48264, 318975, -881679, -424538, 1163857, -1372938, 1288311, 1468014, -557193, -1032067, 24878, 4907, -891647, 1224927, 740095, 1223111, 348005, 164380]
339b20004l78438k61639A985696C3629J458405e62970k13708j787267F62955b532747
328A390217a31902F38791p3076g59086A041307b4159A72258J317921a828118A549404
317C40010a428808A106743C50972a759371D34365b267373G14832i56482m86329
308a442811c36745A080799B95783N5369c63393G45414g0543j225150G2931a01519
297a726721A81529a354229a18781H61215d238596a328295A892594g91395E320875
287b274949B394746a200308A748873a708376A832541a042376j538758C475887
278A35447M792981a936770E7452b738124k136084a443232A47248K788725A85474
268F03711O16034a941526k383518E798890D59957Q34688a379652H4628c886276
$$ y = [-220004, -598442, -860081, 1985696, 33629, 1492034, -562970, -776678, -2563945, 662955, -2532747, 1390217, -131902, 638791, 565715, -759086, 1041307, -24159, 172258, 1490179, -1828118, 1549404, 340010, -1428808, 1106743, 350972, -1759371, 434365, -2267373, 714832, -956482, -1442811, -336745, 1080799, 295783, 351152, -363393, 745414, -70543, -1295693, 72931, -101519, -1726721, 181529, -1354229, -118781, 861215, -4238596, -1328295, 1892594, -791395, 5320875, -2274949, 2394746, -1200308, 1748873, -1708376, 1832541, -1042376, -2581134, 3475887, 135447, 4928428, -1936770, 57452, -2738124, -4874208, -1443232, 147248, 2935973, 185474, 603711, 1219745, -1941526, -4325044, 5798890, 459957, 1294645, -1379652, 84628, -3886276]
258B665562j287573J94017C49813a58666I60835b414134a174772A862279f09684
248a024677A087500c0074A127536D16792J315773e0713B85155B2987e51702B643618
237b980594J353187G68891h84124C327687I51773b605621A476104a91481o32058
228h23539A526029a19314j1215B790809b381876A979845e68423J48982a64441
218g16086q67826A864314c575148h47338B284721G76185a045433A725548c42227
208a895643D46884b85198C047793A483687G3824O62183C25596J052583a516737
198H35309c64804A37255L45133Q6808a48609H6845J417670O234b752261e40889
187i40760j213992E4623K935516h49773F04142P34757C05945a005504K66241n42317
$$ y = [2665562, 1377989, 1572006, 349813, -158666, 960835, -2414134, -1174772, 1862279, -609684, -1024677, 1087500, -30074, 1127536, 416792, 1732565, -50713, 285155, 22987, -551702, 2643618, -2980594, -1627407, 768891, -884124, 3327687, 951773, -2605621, 1476104, -191481, -823539, 1526029, -119314, -130529, 2790809, -2381876, 1979845, -568423, -419441, -164441, -716086, -1583912, 1864314, -3575148, -847338, 2284721, 776185, -1045433, 1725548, -342227, -1895643, 446884, -285198, 3047793, 1483687, 73824, 736007, 325596, 1378179, -1516737, 835309, -364804, 137255, 482388, 569196, -148609, 86845, 1504515, 1510749, -2752261, -540889, -940760, -2154752, 54623, 2990139, -849773, 604142, 1338899, 305945, -1005504, -739263, -1281580]
177a281580P9326D10152a70813k19487E99313B68604a168678A985049k39163a739491
166f97234B503078E40186h1163A751778j36497j7645L374728K011047J1544102
157A8527513R929672a6326486j39531416N4099981E542606Q5021267B6830500
149A5280452o870912J716699B423806L46625K75238d02128m69073B474582l6305
140B438277F30362O46159J649986A190279a57597j159588L95931j422764A433389
130H43673h46710A408261m8796I8419J010093a439704L63823C22602K051778a559725
119g05299D73666a856520A333700a454867b96623F74993a873086g9428E95874
109a351334A420743a217277c69765A166564a077744B702489h79820I02963A63770
$$ y = [-1281580, -1202254, 410152, -170813, -390300, 599313, 268604, -1168678, 1985049, 1745886, -1739491, -697234, 2503078, 540186, -81163, 1751778, 1615281, 1597636, 4972364, 6983411, 18527513, 28457185, -16326486, -155857902, -101757921, 5542606, 90563873, 26830500, 15280452, 8409540, 10126239, 2423806, 2770431, 3045669, -402128, -871201, 2474582, 2438277, 630362, 1276521, 2926507, 1190279, -157597, -1317185, -921254, -2344018, 1433389, 843673, -846710, 1408261, 1359465, 98419, 1108512, -1439704, -1075881, 322602, 2374380, -1559725, -705299, 473666, -1856520, 1333700, -1454867, -296623, 674993, -1873086, -79428, 595874, -1351334, 1420743, -1217277, -369765, 1166564, -1077744, 2702489, -879820, 902963, 163770]
99a043018b53658k059184C62366c67954I41370N47329a473021A82854M55536e12861
88E97546j62541Q5265j84238a233213A773576d13617J45679A362714a284492G8717
77c381275C65171b99575k800317B737009b8373k11679A37664K29151a40156p2173
67b12329k80949l02768n38570A803468C70269J011823f38521k26173B87283a724938
56A457562F14077M56785A12576a770010A155921E69010f60687D09080F960a831967
45b07157r3014B07086a262907j378751A926965G20180J08092a165467c43509i9588
34a366364B071821a232215M55740E29545a00683k003978B31703b002836B051224
24a394115M98388I43885e70757G61388f98065a29712F2969b64280l67331I96680
$$ y = [-1043018, -253658, -2312842, 362366, -367954, 941370, 1488699, -1473021, 182854, 638390, -512861, 597546, 435005, 520270, 336032, -1233213, 1773576, -413617, -267938, 1362714, -1284492, 78717, -3381275, 365171, -299575, -3099892, 2737009, -28373, -240052, 137664, 366815, -140156, -212329, -493278, -796046, -1334616, 1803468, 370269, 1382092, -638521, -864694, 287283, -1724938, 1457562, 614077, 1070862, 112576, -1770010, 1155921, 569010, -660687, 409080, 6960, -1831967, -207157, -300171, 207086, -1262907, -2641658, 1926965, 720180, 828272, -1165467, -343509, -99588, -1366364, 2071821, -1232215, -776475, 529545, -100683, -2104661, 231703, -2002836, 2051224, -1394115, -895727, 943885, -570757, 761388, -698065, -129712, 62969, -264280, -631611, 996680]
13a314351q54602B504304h92399n74360A747971a90766o85465b55306I32697h38109
2g64966A628340c17812
$$ y = [-1314351, -2168953, 2504304, -892399, -1466759, 1747971, -190766, -876231, -255306, 932697, -838109, -764966, 1628340, -317812]
##PAGE= F1=5749.56994907
##FIRST=     21204.543296753, 2761.08209599448, 827468
##DATA TABLE= (F2++(Y..Y)), PROFILE
2047H27468g3147A48623O10354a728715e39396H71313c93660G28751J144k03214
2037E26681D7484J700814A80877J95136i94306A302702e76302A283398b632358
2027C57770O76258a77690j096343B214847d95680B5481L377591A257246D04661
2017a302268N24563B89769f67178I67576b234198M34660P63502A852235k25850
2008A626385k08670l82976b7293A15794a962796B235037b550384f2088r06519
1999i68607A483282F71723f19652p23883A001109R0684e38189F86575f32216j96618
1989h28834E22539a657015N10084j72899e05111B956469a821079b75925I80584
1979A68462R57804e36100C136483j434342m45376m59071d25131r08717N92823
$$ y = [827468, -73147, 148623, 758977, -1728715, -539396, 871313, -393660, 728751, 729895, 526681, 47484, 1748298, 180877, 376013, -994306, 1302702, -576302, 1283398, -2632358, 357770, 1034028, -177690, -1274033, 2214847, -495680, 25481, 3403072, 1257246, 404661, -1302268, -777705, 289769, -667178, 967576, -2234198, -1799538, -1036036, 1852235, 1626385, 1417715, 1034739, -27293, 115794, -1962796, 2235037, -2550384, -62088, -968607, 1483282, 671723, -619652, -1343535, 1001109, 1091793, -538189, 686575, -632216, -828834, 522539, -1657015, -1146931, -1319830, -505111, 2956469, -1821079, -275925, 980584, 168462, 1126266, -536100, 3136483, 1702141, 1256765, 797694, -425131, -1333848, -741025]
1970g41025A467750l73813a814488I13804b3383j279846a85099p15044A283828
1960a745189H2269g2484C46182a580636H35816b136697C20505e4931B575576O215
1950B581791m64983b44227o99017A244351Q84833q98654b068426B301129a399611
1940e38469l76040B737672i83255k91216A70071b171065A206585C34649J350225
1931A684874a624647A477106i48433E49620A43964a873730D77136B04625Q41878
1922A046503e54847n26257p02843A190133j32233a997358F38935L49279a96441
1912d87733j363242F52478N21154a299215D38514a98256i2894n02993A62804f03816
1901a445835e47352G25587B35872f21808A902615e84571B113000C84330L92238
$$ y = [-741025, 1467750, 1093937, -1814488, 913804, -23383, -1303229, -185099, -900143, 1283828, -1745189, 82269, -72484, 346182, -1580636, 835816, -2136697, 320505, -54931, 2575576, 2581791, 2116808, -244227, -943244, 1244351, 2129184, 1230530, -2068426, 2301129, -1399611, -538469, -914509, 2737672, -983255, -1274471, 170071, -2171065, 1206585, 334649, 1684874, -1624647, 1477106, -948433, 549620, 143964, -1873730, 477136, 204625, 1046503, -554847, -1081104, -1783947, 1190133, 1057900, -1997358, 638935, 988214, -196441, -487733, -1850975, 652478, 1173632, -1299215, 438514, -198256, -92894, -595887, 162804, -603816, -1445835, -547352, 725587, 235872, -621808, 1902615, -584571, 2113000, 384330, 776568]
1892G76568A88333a379027F91245b837637A965092D48359J463439E81038B64180
1882g93699B2276d01105j646476B46347a925641D71688P65550e04340B71971b92837
1871E71655B24276a12544k84513B113160c93260G02510B05552h63711A227285
1861a363768d99348n80339F65557A93035f17864G85608J41179b248142e87631
1851I58374D1682e87562L4504A168606j88769B54458K52021P91891a785637g76065
1840d2385j400719J59916L22416A674524d90513G47156b015857P05983A948765
1830b626732A67593a245757K98102B502042a06529o43094A777225b43260H22452
1820e16706a43302E17607c99891B050209d348920b37171B449978C02972e88052
$$ y = [776568, 188333, -1379027, 691245, -2837637, 1965092, 448359, 1911798, 581038, 264180, -793699, 22276, -401105, -2047581, 246347, -1925641, 471688, 1237238, -504340, 271971, -292837, 571655, 224276, -112544, -397057, 2113160, -393260, 702510, 205552, -863711, 1227285, -1363768, -499348, -1079687, 665557, 193035, -617864, 785608, 926787, -2248142, -587631, 958374, 41682, -587562, -553058, 1168606, 979837, 254458, 506479, 1298370, -1785637, -776065, -42385, -1443104, -1283188, -960772, 1674524, -490513, 747156, -2015857, -1309874, 1948765, -2626732, 167593, -1245757, -947655, 2502042, -106529, -749623, 1777225, -243260, 822452, -516706, -143302, 517607, -399891, 2050209, -4348920, -237171, 2449978, 302972, -588052]
1810a514536l43890A59219e23399A636377a13657E44708a960978C097436b115016
1800G50052C58656a439798q0259A070860i5876q57782F07906d62087j270707d30988
1789c50691n8793o02310B845865E47538d0412j870558a15320l39933M792n42230
1779i92691a77480A295821n51437l63775a150163A89838d9481B218042a950879
1769D49861E9588K05874d62503B97862J172658L42136o29620A22665a293107q43137
1759b136244n37600A609165p81027a050198A573456n47843b174582C78439c09475
1749a526860J52231G45835f08362A004346a394340A488381b92949A170306d50410
1739d15209A474653l93933J54034a709933g2933H53855a699134F1897J709030
$$ y = [-1514536, -1858426, 159219, -523399, 1636377, -113657, 544708, -1960978, 3097436, -2115016, 750052, 358656, -1439798, -1520057, 1070860, -95876, -953658, 607906, -462087, -1732794, -430988, -350691, -409484, -1011794, 2845865, 547538, -40412, -1910970, -115320, -455253, -450461, -992691, -177480, 1295821, 744384, 380609, -1150163, 189838, -49481, 2218042, -1950879, 449861, 59588, 265462, -462503, 297862, 1470520, 1812656, 1183036, 122665, -1293107, -2136244, -2673844, 1609165, 828138, -1050198, 1573456, 1025613, -2174582, 378439, -309475, -1526860, -1374629, 745835, -608362, 1004346, -1394340, 1488381, -292949, 1170306, -450410, -415209, 1474653, 1080720, 1234754, -1709933, -72933, 853855, -1699134, 61897, 1770927]
1730A770927o94057g77925l01434A990747F4928a51471B353883B46204a475755
1720A755455h91071p83111H86174j51209A96372d64148m03012F7970f8034j623989
1710a692023M03821C25492e62732F83512e24850A44039b859261e56190P158A713641
1699f09944n55635A473259k27336b125766F70234d49647E96967b51185n7361g4178
1688A087618i13132L6200A8706M0477i95693g5573H73677c740250B35078J319527
1678A554605f22691D6548L04568M83159M18946M39431C24817a140365A985588
1668B92732b196668h63179B538296j052190J062845a517303M41715a37540j590008
1659a727548F10903a054141E98867J232952a89612n26997C49575M13203b439905
$$ y = [1770927, 1076870, -777925, -1079359, 1990747, 64928, -151471, 2353883, 246204, -1475755, 1755455, -891071, -1674182, 886174, 734965, 196372, -464148, -867160, 67970, -68034, -1692023, -1288202, 325492, -562732, 683512, -524850, 144039, -2859261, -556190, -549032, 1713641, -609944, -1165579, 1473259, 1245923, -2125766, 670234, -449647, 596967, -251185, -308546, -74178, 1087618, -913132, -876932, 18706, 59183, -995693, -75573, 873677, -3740250, 235078, 1554605, -622691, 46548, 351116, 834275, 1253221, 1692652, 324817, -1140365, 1985588, 292732, -2196668, -863179, 2538296, 1486106, 2548951, -1517303, -1075588, -137540, -1727548, 610903, -1054141, 598867, 1831819, -189612, -716609, 349575, 762778, -2439905]
1649A757364e54435E5452a57052A290849c992189A502519e41044A490499c18224
1639A594726e56373K7062l62485C03501a73316F23347B13875a53399H18046J995950
1629B813996a989644A594O85221L41218h73935L21609B49544N5398a116809A555864
1618B215963c30880J31174C62753a54351C02426a225496A157020a758603B01969
1608D375001C17026R66779K03429c71486j731366f16481A17216J222023C46261
1598d61570a82466A093442a752554m57684K06443A842877b98119j394692G21729
1588A42189a272715E60904K42415d70150E44956b036958A099479N02396f91279
1578B605267g83613b76259A036445k11316Q59458K30502a46523l87236J55797
$$ y = [1757364, -554435, 55452, -157052, 1290849, -3992189, 1502519, -541044, 1490499, -318224, 1594726, -556373, -529311, -891796, 303501, -173316, 623347, 213875, -153399, 818046, 2813996, -1989644, 1594, 686815, 1028033, -873935, -552326, 249544, 304942, -1116809, 1555864, 2215963, -330880, -199706, 362753, -154351, 302426, -1225496, 1157020, -1758603, 201969, 4375001, 317026, 1283805, 1487234, -371486, -2102852, -616481, 117216, 1339239, 346261, -461570, -182466, 1093442, -1752554, -2210238, -2003795, 1842877, -298119, -1692811, 721729, 142189, -1272715, 560904, 803319, -470150, 544956, -2036958, 1099479, 1601875, -691279, 2605267, -783613, -276259, 1036445, 825129, 1684587, 1915089, -146523, -533759, -377962]
1569c77962p52020I56476J132331f02234p70731M12657B36731L23008i92484A31395
1558C62703a044049A757719B22899f70480b32884A345362A09315c50701C92714
1548A73484a67102j264436F22637b784586H05868a635320L16984J12393F44357
1538A156433a987960A888984d39508n57440j051303H30427k08203L91697a86859
1528A896703b18570m89254H11159c05653C094948E619P19774e06481a24019j489199
1518a613218r63964B009598b251785A259050P1109K7458n36018i53273E50852
1508F07455i98855C24126a30310A052220a377437B97352J123145n70903j696N25173
1498A373071a522098g03366A572145i49499m02890O24644a56068j878486H82365
$$ y = [-377962, -1129982, 956476, 2088807, -602234, -1372965, -960308, 236731, 559739, -992484, 131395, 362703, -1044049, 1757719, 222899, -670480, -232884, 1345362, 109315, -350701, 392714, 173484, -167102, -1431538, 622637, -2784586, 805868, -1635320, -1318336, -1205943, 644357, 1156433, -1987960, 1888984, -439508, -996948, -2048251, 830427, 622224, 1013921, -186859, 1896703, -218570, -707824, 811159, -305653, 3094948, 5619, 725393, -506481, -124019, -1613218, -2577182, 2009598, -2251785, 1259050, 1330159, 1357617, 821599, -953273, 550852, 607455, -998855, 324126, -130310, 1052220, -1377437, 297352, 1420497, 849594, 847898, 1373071, -1522098, -703366, 1572145, -949499, -1352389, -727745, -156068, -2034554, 882365]
1488G85507A44327O07420K30719n6989i13039H98971g51705k142859C64503d50396
1477a929436F061L794047c32368A313b823199I64538c7026o0796A160998B17233
1466b275317C33109a144702i8531A484900I7750f21495A639683b81969H58513
1456e62442H78115a325356A817925d00560A486767l21236d7625p34198l30762
1447a112585A928436F53601a370874k28606E1150L05453e35648l55548A224075
1437C39410c443257g08795H96075M96147b076726C05850P7124M83414B16486a096682
1426c68454j039295B000714a80886O0894l008817A291339A9934c0982A250615
1416d11975j16507k87061A101057c80423B329644r05130e09052j103918B309446
$$ y = [785507, 144327, 751747, 982466, 925477, -913039, 898971, -751705, -2894564, 364503, -450396, -1929436, 6061, 3800108, -332368, 1313, -2823199, 964538, -37026, -97822, 1160998, 217233, -2275317, 333109, -1144702, -98531, 1484900, 97750, -621495, 1639683, -281969, 858513, -562442, 878115, -1325356, 1817925, -400560, 1486767, 1165531, -47625, -781823, -1112585, 1928436, 653601, -1370874, -1599480, 51150, 356603, -535648, -891196, 1224075, 339410, -3443257, -708795, 896075, 1392222, -2076726, 305850, 382974, 866388, 216486, -1096682, -368454, -1407749, 2000714, -180886, -119992, -3128809, 1291339, 19934, -30982, 1250615, -411975, -528482, -815543, 1101057, -380423, 2329644, 1424514, -509052, -1612970, 2309446]
1406i91713D75721P63174c70056E66946b248362G00267A44077e47431A609822
1396A032942L06053b075753g83448b97916A871844a462682A072503M42692E81699
1386b282357a083745E92006c59020A692361f91835a46064m24667C59481a235721
1376E0061Q44669m31423a239406M87102j674591a076185A19340b89668A93331
1366d12368A841606a093504B85176b065004e04102I22348B24276J197024g85685
1356a190518d9087l03547D47499b622763I59780J73153B23082Q74767d11543A280947
1345b205089A38834K461745E50346a600889e76315A118255b69898k49425B63015
1335c868888C307939A510070B54618e5256H59380k36906f73624r15035B003432
$$ y = [-991713, 475721, 1238895, -370056, 566946, -2248362, 700267, 144077, -547431, 1609822, 1032942, 1338995, -2075753, -783448, -297916, 1871844, -1462682, 1072503, 1515195, 581699, -2282357, -1083745, 592006, -359020, 1692361, -691835, -146064, -570731, 359481, -1235721, 50061, 894730, 463307, -1239406, -752304, -2426895, -1076185, 119340, -289668, 193331, -412368, 1841606, -1093504, 285176, -2065004, -504102, 922348, 224276, 1421300, -785685, -1190518, -49087, -352634, 447499, -2622763, 959780, 1132933, 223082, 1097849, -411543, 1280947, -2205089, 138834, 2600579, 550346, -1600889, -576315, 1118255, -269898, -519323, 263015, -3868888, 3307939, 1510070, 254618, -55256, 859380, 622474, -673624, -1588659, 2003432]
1325A111490C18736a205878a92381A423264P87335E74148K1019b161628R18949
1316a242679I85173b991930A684402c17015l06190j498712i41313L52068o53709
1307a242954C97562b315446R59364A462581i88533c74114A247022l18599a724681
1297F18220a456782B796499A314913a665483A774578G9865N21033B84354J368505
1288A652859c1502j582147b82989a0742j211057a81254B302028b413957F85384
1278E35980a03417F19533a53098k228812C4240a121670C79355i79789J23947j98896
1268a054738D08660J140889E46682a273748J04877A656854a127501i340A350658
1258A276565b83322j413852J93651L62540A807853b817914N46984A716157i23788
$$ y = [1111490, 318736, -1205878, -192381, 1423264, 2210599, 574148, 595167, -2161628, -1242679, 985173, -2991930, 1684402, -317015, -623205, -2121917, -941313, -589245, -1242954, 397562, -2315446, -1356082, 1462581, -988533, -374114, 1247022, 928423, -1724681, 618220, -1456782, 2796499, 1314913, -1665483, 1774578, 79865, 600898, 284354, 1652859, -31502, -1613649, -282989, -10742, -1221799, -181254, 2302028, -2413957, 685384, 535980, -103417, 619533, -153098, -2381910, 34240, -1121670, 379355, -979789, -855842, -1054738, 408660, 1549549, 546682, -1273748, -1168871, 1656854, -1127501, -9340, 1350658, 1276565, -283322, -1697174, -1503523, -1140983, 1807853, -2817914, -2270930, 1716157, -923788]
1248I52551a343335J20885M05320F45902r4357a045988c96668H2300P21068Q58331
1238A661699a14972G16873b027695A052803J76925E52543a683926o10219D69489
1228c44611p58025j590636A536881F63285b68531H09703O5428i97492A879233
1218a083047B347408a03587p54208B293782a099478H08170G7034a211436A039853
1208a064313a0657A944893i39668d26994I95567J24212h387C104973e51595G77660
1197b12955A638677c47306l315570C20000M00524J477673g23313A75291N63253
1188G38544j88484a012520A436458C08456R1071J338492n81974i32528F29457
1178d39812B024556d05588k466667D4961J55610M86946P08562b19117A693147
$$ y = [952551, -1343335, -1222450, -817130, 645902, 551545, -1045988, -396668, 82300, 803368, 1661699, -114972, 716873, -2027695, 1052803, 1229728, 552543, -1683926, -2294145, 469489, -344611, -1102636, -2693272, 1536881, 663285, -268531, 809703, 875131, -997492, 1879233, -1083047, 2347408, -103587, -857795, 2293782, -1099478, 808170, 77034, -1211436, 1039853, -1064313, -10657, 1944893, -939668, -426994, 995567, 1119779, -8387, 3104973, -551595, 777660, -212955, 1638677, -347306, -3662876, 320000, 720524, 2198197, -723313, 175291, 738544, 550060, -1012520, 1436458, 308456, 399527, 1738019, 1156045, -932528, 629457, -439812, 2024556, -405588, -2872255, 44961, 200571, 687517, 1396079, -219117, 1693147]
1168b247849A240973b000083h96148A107463b186510b92909p46386C323641h24625
1158e72526E04144h00491b34110A459828a927938A736638b493229B464161b423978
1148A175702C70325A04795J734876n06231c949004B003512a28608B136616b607546
1138a028214B162864C77234c66040j266405A86351a992811D7468J535998a23595
1128c2963F89683f00712B366376c221826A552103E0063J73183O42800a221989
1118A028360Q80232B84663a102606B67863L96534a750506A501466a474260i5592
1108a238605j004466F41282A03573c47529k66646A820449H24961Q63310k99373
1099A388898D94038R5137i12062A425630a587805a17725B172828A19759e81591
$$ y = [-2247849, 1240973, -2000083, -896148, 1107463, -2186510, -292909, -1039295, 3323641, -824625, -572526, 504144, -800491, -234110, 1459828, -1927938, 1736638, -2493229, 2464161, -2423978, 1175702, 370325, 104795, 1839671, 1333440, -3949004, 2003512, -128608, 2136616, -2607546, -1028214, 2162864, 377234, -366040, -1632445, 186351, -1992811, 47468, 1583466, -123595, -32963, 689683, -600712, 2366376, -3221826, 1552103, 50063, 223246, 866046, -1221989, 1028360, 1908592, 284663, -1102606, 267863, 664397, -1750506, 1501466, -1474260, -95592, -1238605, -2243071, 641282, 103573, -347529, -614175, 1820449, 824961, 1688271, 1388898, 494038, 589175, -912062, 1425630, -1587805, -117725, 2172828, 119759, -581591]
1089i41641M4153A244594a13558A923588b006294A143095C36653b718305A887803
1079a006534H61261H7315B1543O4885J152973m31847c676865a390062B660871
1069g1171F68451b073304C995752c05800A02244L481186c22609A483276d1535
1059a810668F71065C29174N9969a673020f47299r34398G23244l06982J840005
1050B256267c540987A927642c527331f21267n09941B197135E03484d5465k274203
1041b319668A230546E65067a65234k7857j788370b20408B266887a528949A710543
1031e63263A328085d81982H12097a022935A019068j55363f55191A950059i24988
1021g0522A268282f87601L21369E85234K946657h54242A6797a177867d22003j11851
$$ y = [-941641, -897488, 1244594, -113558, 1923588, -2006294, 1143095, 336653, -2718305, 1887803, -1006534, 861261, 87315, 21543, 86428, 1239401, 807554, -3676865, -1390062, 2660871, -71171, 668451, -2073304, 3995752, -305800, 102244, 3583430, -322609, 1483276, -41535, -1810668, 671065, 329174, 389143, -1673020, -647299, -1581697, 723244, 416262, 2256267, -3540987, 1927642, -3527331, -621267, -1131208, 2197135, 503484, -45465, -2319668, 1230546, 565067, -165234, -193091, -1981461, -220408, 2266887, -1528949, 1710543, -563263, 1328085, -481982, 812097, -1022935, 1019068, 863705, -655191, 1950059, -924988, -70522, 1268282, -687601, -366232, 585234, 3531891, -854242, 16797, -1177867, -422003, -533854]
1011e33854A381461a007182J08234A373432D56411a303869n79720P54060d5299
1001g2109k962065B155245b627925A125563f20273n45540a97454E64904c23594
991c33335j431766C068759a597351E68369e17495i7265B095412B51218a901732
981A622403i26629A005500a310012B970243g11657H65016a444744a30228j450208
972a580436A654131e78977k53939A492805b749251f935F17414J35690K59721b85292
961B5819a075460m90317C243587a368120k65067D00943f81657A463787d87538
951b012858I74105l06292a544030a76288C60150j13342J364751b087369B440617
941d70346l84822j827693A705252N02388i18458A349933i20783A016608a539599
$$ y = [-533854, 1381461, -1007182, -898948, 1373432, 456411, -1303869, -1883589, -1129529, -45299, -72109, -3034174, 2155245, -2627925, 1125563, -620273, -1165813, -197454, 564904, -323594, -333335, -1765101, 3068759, -1597351, 568369, -517495, -97265, 2095412, 251218, -1901732, 1622403, -926629, 1005500, -1310012, 2970243, -711657, 865016, -1444744, -130228, -1580436, 1654131, -578977, -832916, 1492805, -2749251, -6935, 617414, 753104, 1012825, -285292, 25819, -1075460, -1565777, 3243587, -1368120, -1633187, 400943, -681657, 1463787, -487538, -2012858, 974105, 667813, -1544030, -176288, 360150, 246808, 1611559, -2087369, 2440617, -470346, -855168, -2682861, 1705252, 2207640, -918458, 1349933, -920783, 1016608, -1539599]
931A396228L35385c80932E96037a622644g07494n44394B34957A14252b47477r21277
921a168754l11197I28331l3786e54412Q7227I10499M77333f90797n8274j472640
911b221711A840680i16489a67782D418920b890481E91413p1734a695141G01013
901A282633h39195B928728h94379l62022A164734a470548A851800a146817r74209
892b121026A870331b58558k28042a57550B223629e24539A72992L85331N43211
883A101534m28322a434505k95852H61555J511866i33056B86990a967292B72715
873F50521J634245g93785j060395a29615A734859a896650H41540a86953m505074
864d692027I73189a94383C78775P06070j93139a9022E27061J367146A59830a232328
$$ y = [1396228, 1731613, -380932, 596037, -1622644, -707494, -1251888, 234957, 114252, -247477, -1168754, -1479951, 928331, 894545, -554412, -467185, 910499, 1387832, -690797, -749071, -2221711, 1840680, -916489, -167782, 4418920, -2890481, 591413, 519679, -1695141, 701013, 1282633, -839195, 2928728, -894379, -1256401, 1164734, -1470548, 1851800, -1146817, -2121026, 1870331, -258558, -486600, -157550, 2223629, -524539, 172992, 558323, 1101534, 673212, -1434505, -1730357, 861555, 2373421, -933056, 286990, -1967292, 272715, 650521, 2284766, -793785, -1854180, -129615, 1734859, -1896650, 841540, -186953, -4692027, 973189, -194383, 378775, 1084845, 891706, -19022, 527061, 1894207, 159830, -1232328]
853F62484b000558B050153i16320K10047D11833d14626A595341J159935D925g82304
842A14086h94144r00863A378958a048496J23607c37295l76751A994095r32089
833A062006j63226d80742j347218B445022d07422n17788B917219g79911H33013
823f54172A246921a181595I90936l24478K262307C79674i59566E20067b269938
813A338530B45297J261395i57740m86453M82423B427038h71057B239189f12795
803B29462b96467I00004J268542b199282c38930j799930I79533J12843a772059
793A767265a075128H75221R43337E80091M91533A89832a030610L26589c27838
783A015549E6739J65636R57971L81143b539799A804251A45819J187781a618759
$$ y = [662484, -2000558, 2050153, -916320, -706273, 411833, -414626, 1595341, 2755276, 4925, -782304, 114086, -894144, -1795007, 1378958, -1048496, -924889, -337295, -714046, 1994095, 1062006, 898780, -480742, -1827960, 2445022, -407422, -925210, 2917219, -779911, 833013, -654172, 1246921, -1181595, 990936, 666458, 2928765, 379674, -959566, 520067, -2269938, 1338530, 245297, 1506692, -957740, -1444193, -961770, 2427038, -871057, 2239189, -612795, 229462, -296467, 900004, 2168546, -2199282, -338930, -2138860, 979533, 1092376, -1772059, 1767265, -1075128, 875221, 1818558, 580091, 1071624, 189832, -1030610, -704021, -327838, 1015549, 56739, 222375, 1180346, 1561489, -2539799, 1804251, 145819, 1333600, -1618759]
773B526881a234576h9329I88843f16825H58457a73395I48471f32832j83479n51630
763a367941B85709A22607b003321a55697q51446D37475a33745n89853A39420N5647
753A95067K399447b437896C04077j26153a785533j200998F20406K00082a38449
743E21537J51251b23692A125788L82677d38725r07574e05644G86757a0232A192467
732a160364K19274n44468D66345c78590j106860K57122k45598A221855g64894
722i37879A037457n12914K44163J86884a15825M0837j6495j45602q16171J45777
712i07479A370230O34069c96268D56116a048315p05557d33024C87035K023643
703B410678B20293R15345m2983l92473a150702G1320M48295d21971a20556A763255
$$ y = [2526881, -1234576, -89329, 988843, -616825, 858457, -173395, 948471, -632832, -816311, -1367941, 285709, 122607, -2003321, -155697, -1007143, 437475, -133745, -723598, 139420, 195067, 2594514, -2437896, 304077, 177924, -1785533, -2986531, 620406, 820488, -138449, 521537, 672788, -223692, 1125788, 1508465, -438725, -1346299, -505644, 786757, -10232, 1192467, -1160364, -941090, -1485558, 466345, -378590, -1485450, -1228328, -1473926, 1221855, -764894, -937879, 1037457, 524543, 768706, 955590, -115825, -74988, -91483, -237085, -1053256, -907479, 1370230, 2004299, -396268, 456116, -1048315, -1753872, -433024, 387035, 2410678, 220293, 1135638, 1092655, 700182, -1150702, 71320, 519615, -421971, -120556, 1763255]
692a741917k43965C04073J507347B53664a778065E34759b25744p15956A348432
682a083471b57779o1574j73445n56048B020473E90192M94866D9240h78512j6142
672h94654C29403J524045c67848L2356f1909a9399E23285B38874f07962j037061
662a645023G25957o0237a517601B18760c87768j820137A18777Q0197f34152H30718
651A694907a973145d87481C00313a493006L53064E05155A55679Q46125a177798
641A603631f39754G22400a486354b01833n2581p98173M13159A827393g47807a32068
630A691138C4825a610653A801980R57026H34921a666974A897913M21460b041016
620i46555A541370d21340j456803D412251b331161E0607a022806B690700K387929
$$ y = [-1741917, -1985882, 304073, 1811420, 253664, -1778065, 534759, -225744, -941700, 1348432, -1083471, -257779, -319353, -492798, -1048846, 2020473, 590192, 1085058, 49240, -878512, -894654, 329403, 1853448, -367848, -335492, -61909, -19399, 523285, 238874, -607962, -1645023, 725957, 665720, -1517601, 218760, -387768, -2207905, 118777, 198974, -634152, 830718, 1694907, -1973145, -487481, 300313, -1493006, -1139942, 505155, 155679, 1001804, -1177798, 1603631, -639754, 722400, -1486354, -201833, -254414, -1052587, -639428, 1827393, -747807, -132068, 1691138, 34825, -1610653, 1801980, 2759006, 834921, -1666974, 1897913, 2319373, -2041016, -946555, 1541370, -421340, -1878143, 4412251, -2331161, 50607, -1022806, 2690700, 5078629]
611E078629a732697k210197a497202J11172j033512j651910B809762P60812c054787
601A216894a184882B004058J151819e6396J332m3716B59055J022363J55657a001930
590F16685d68847l83519A251010b640245B329080a932886j56562c535I19777O36101
580A555878a328498K58700N27647k102B25053c22434J55520B341016E70446A89988
569b409309J075067E56934R16478F29315d45727o73185J67750C14693R3511A62355
558g46807j968398D001698j850033p87329d29220n7996B771095c92732m018306
549d411038M25543a30324k135002D320780m3139B091039p89381k69923m81293
540E50442M71652B36140b351116a61122E52344k20765a876713B175567F31357
$$ y = [5078629, -1732697, -3942894, -1497202, -1386030, -2419542, -4071452, 2809762, 3570574, -3054787, 1216894, -1184882, 2004058, 3155877, -56396, -55064, -98780, 259055, 1281418, 1437075, -1001930, 616685, -468847, -852366, 1251010, -2640245, 2329080, -1932886, -2089448, -3535, 919777, 1555878, -1328498, -1069798, -542151, -544253, 225053, -322434, -166914, 2341016, 570446, 189988, -2409309, -1334242, 556934, 1473412, 629315, -445727, -1118912, -951162, 314693, 408204, 162355, -746807, -2715205, 4001698, 2151665, 1364336, -429220, -487216, 2771095, -392732, -4411038, -3985495, -130324, -2265326, 4320780, 4277641, 2091039, 1301658, 1031735, 550442, 1022094, 236140, -2351116, -161122, 552344, 331579, -1876713, 2175567, 631357]
530G37348h15115m59380D41530f78762B498127d96324H48230k66935i55746J11351
520h44395K54369k259250J093733I37050d05291A058940Q67850a691885A431487
510I47314Q18417a16602j694312B046558k47106a723812A01O35256j66474N86874
500A055757a793551G34526d25258H00364a027143B310925a017010H14946a937441
490a098006D91230a650642A374041b932258A851403D59808g41289L59974I74611
480e02096C942659i75825j397808A252727E55585e74892B97371J433125b52829
470b69055j687120A262165C68368N51544b979201G23352a900385J49843C06925
460G29876c05828I04601J326699C86848i55646G56650a102989A622997J91146
$$ y = [737348, -815115, -1274495, 441530, -678762, 2498127, -496324, 848230, 581295, -955746, -844395, -590026, -2849276, -1755543, 937050, -405291, 1058940, 1926790, -1691885, 1431487, 947314, 1765731, -116602, -1810914, 2046558, 1799452, -1723812, 101, 635357, 468883, 1055757, -1793551, 734526, -425258, 800364, -1027143, 2310925, -1017010, 814946, -1937441, -1098006, 491230, -1650642, 1374041, -2932258, 1851403, 459808, -741289, -381315, 974611, -502096, 3942659, -975825, -2373633, 1252727, 555585, -574892, 297371, 1730496, -252829, -269055, -1956175, 1262165, 368368, 919912, -2979201, 723352, -1900385, -1750542, 306925, 729876, -305828, 904601, 2231300, 386848, -955646, 756650, -1102989, 1622997, 1814143]
451A814143B96117a114376b6907B118704r60648a278791d60124j414313K02299
442a672138B749198c53598D332864d24499l495951a78253l08009F94257e06486
432a409227A264611G2605J432514a722045c45316r53796a27190p01852c40390
422f07428r02049H52618B00423a416177A459208b63285A563074g26333H90334
412A07384J358528a095594c28192f5938G73150M65968b050047g34183C79990j28797
402B51193a00006p14909G2501J960987D52099g27511H75725e62740j325475g22795
391C12729J61768J099331F64025c45032k97131D1478Q41709A45467e37566G25572
380A73755a128456n95473B76554d92019N0080B604146h25546F2148i58725m42986
$$ y = [1814143, 296117, -1114376, -26907, 2118704, 1158056, -1278791, -460124, -1874437, -1672138, 2749198, -353598, 4332864, -424499, -3920450, -178253, -486262, 694257, -506486, -1409227, 1264611, 72605, 1505119, -1722045, -345316, -1299112, -127190, -829042, -340390, -607428, -1509477, 852618, 200423, -1416177, 1459208, -263285, 1563074, -726333, 890334, 107384, 1465912, -1095594, -328192, -65938, 773150, 1239118, -2050047, -734183, 379990, 251193, -100006, -814915, 72501, 2033488, 452099, -727511, 875725, -562740, -1888215, -722795, 312729, 474497, 1573828, 664025, -345032, -642163, 41478, 883187, 145467, -537566, 725572, 173755, -1128456, -1723929, 276554, -492019, -441939, 2604146, -825546, 62148, -958725, -1401711]
370a401711b33676E31764b467371f48262G43150L98534e91819K6804H59148M66894
360A326042M20677B38326J0904K02472i67911a62026A360009a550131A177928
350A236568f89278p04642b38569e7398j074059A274090n08068N04342d09078E18609
339B031e64012k06903A866897E3262J855719g45902j31779j950498H93921b404432
328A243802b91828E16542K10460a228151H42305F1569J90796J122963b173366
318A063752A54201a330605A057558m97585b031909C58066a953723H36040i05388
308a617725c31182A171575D50787L0770d69753A85004B4121a776845A56279F7884
297a613701b14930j021331b61902A215211c913684a554917B087708i95053E181436
$$ y = [-1401711, -233676, 531764, -2467371, -648262, 743150, 1141684, -591819, -565015, 859148, 1326042, 1746719, 238326, 249230, 451702, -967911, -162026, 1360009, -1550131, 1177928, 1236568, -689278, -1393920, -238569, -57398, -1131457, 1274090, 766022, 1270364, -409078, 518609, 2031, -564012, -770915, 1866897, 53262, 1908981, -745902, -877681, -2828179, 893921, -2404432, 1243802, -291828, 516542, 727002, -1228151, 842305, 61569, 252365, 1375328, -2173366, 1063752, 154201, -1330605, 1057558, 559973, -2031909, 358066, -1953723, 836040, -905388, -1617725, -331182, 1171575, 450787, 481557, -469753, 185004, 24121, -1776845, 156279, 67884, -1613701, -214930, -1236261, -261902, 1215211, -3913684, -1554917, 2087708, -995053, 5181436]
287b528876B111094a124867A491392a910745B049315a190832j402717C337313
278D06584M542952b499706I1513c256164j458173a292757H4655K557586D08367
268G23522R7095a184811l509312E634897H81947M87292a350995G558c959420B553966
257A087326Q35280B74412d41254H44110b210828a037018A742926f24059j46676
248g70735A090000a40630A413575A11023J468051D61819j75899b9916j17400B537334
237c319030a512570G00979g44833C252704A126266b384811A448486a51240j006575
228a157815A406920e04844D04192J846656b178489A825976d32337M3212N1787
219c37338m54092q04299A885309c485209h22845A887743H24827i86158A372757
$$ y = [-2528876, 2111094, -1124867, 1491392, -1910745, 2049315, -1190832, -2593549, 3337313, 406584, 4949536, -2499706, 91513, -3256164, -4714337, -1292757, 84655, 2642241, 408367, 723522, 820617, -1184811, -4694123, 5634897, 881947, 1369239, -1350995, 7558, -3959420, 2553966, 1087326, 1922606, 274412, -441254, 844110, -2210828, -1037018, 1742926, -624059, -770735, 1090000, -140630, 1413575, 111023, 1579074, 461819, 285920, -29916, -147316, 2537334, -3319030, -1512570, 700979, -744833, 3252704, 1126266, -2384811, 1448486, -151240, -1157815, 1406920, -504844, 404192, 2250848, -2178489, 1825976, -432337, -389125, -337338, -791430, -1595729, 1885309, -3485209, -822845, 1887743, 824827, -986158, 1372757]
209b79715j710762E51709e41906C618877A103051B01907K59427K30810R74308
200A666452a689654A164014e35601A08296J01090M03843c27116I6920J314651
191A411571p03085b758908e69429b14118j896639d25170B610413d16486D35676
181A369092A56316i27230L81891j180744Q38710G37411c81826g9097H48455D8220
170a070170A420780O25683a798323O63788B542106F40670c78126A458422N5037
161A513459l94239L934709O60300R386206R152848a4473921j19152624M5336999
153h8289546D762581P2980553B3441527r470869o562592K636655B095621j7428
145B078193N48942a32988q76523B248226L65326D89186P16409K060400H68644
$$ y = [-279715, -1990477, 551709, -541906, 3618877, 1103051, 201907, 461334, 692144, 1666452, -1689654, 1164014, -535601, 108296, 209386, 613229, -327116, 96920, 1411571, 708486, -2758908, -569429, -214118, -2110757, -425170, 2610413, -416486, 435676, 1369092, 156316, -927230, -545339, -1726083, -887373, 737411, -381826, -79097, 848455, 48220, -1070170, 1420780, 2046463, -1798323, -1134535, 2542106, 640670, -378126, 1458422, 1513459, 1119220, 5053929, 5714229, 15100435, 24253283, -14473921, -133626545, -88289546, 4762581, 77743134, 23441527, 13970658, 7408066, 10044721, 2095621, 2078193, 2627135, -132988, -1009511, 2248226, 2613552, 489186, 1205595, 3265995, 868644]
135c18112j154079N23927j320372A352024n56662g73780A137742J37590A54498
125D71710a300781K17179A042804J270985a952904g87567D53614a979523A625423
115a684013h1811E71106b352564a20133H51642a498086A664226a031487M15667
106f15820A408925a131909B698417a014255H72474B05366a201669a80679k235858
97b416537G49630d33214F87878J057355a487492C41075R2689b28539B37128A8343
86E10026B39441a167579A705360d58134a68852A411536a629892A2283c534897
76F66600c29253k619819B793018c59539P1997A78367K56700A70699a95834j44748
66c40582n09388l11433A624330E14034M87882g39754J15813C36530a902351A662560
$$ y = [-318112, -1472191, -948264, -2268636, 1352024, 795362, -773780, 1137742, 1275332, 154498, 471710, -1300781, -1083602, 1042804, 2313789, -1952904, -787567, 453614, -1979523, 1625423, -1684013, -81811, 571106, -2352564, -120133, 851642, -1498086, 1664226, -1031487, -615820, 1408925, -1131909, 2698417, -1014255, 872474, 205366, -1201669, -180679, -2416537, 749630, -433214, 687878, 1745233, -1487492, 341075, 433764, -228539, 237128, 18343, 510026, 239441, -1167579, 1705360, -458134, -168852, 1411536, -1629892, 12283, -3534897, 666600, -329253, -2949072, 2793018, -359539, -287542, 178367, 435067, 170699, -195834, -340582, -849970, -1161403, 1624330, 514034, 1001916, -739754, -623941, 336530, -1902351, 1662560]
55E48253O13393a12210j727967F57171m5184d66467C39426a53051j548265e39325
44a34437A250a213562j203886A726587q51758J7942a434951d04935a27246q21110
34i48356A811228a313790N31825E82710D528a890452A4318a663092A812762a333359
23g86897H33656d04136F38058h10473a27162E03589b46815j98545I26935a221911
12b375512B493885i53325k03120A683952b66751m96534A52069N48003i33330k4497
2i57827A624046b27695
$$ y = [548253, 1161646, -112210, -1840177, 657171, 611987, -466467, 339426, -153051, -1701316, -539325, -134437, 1250, -1213562, -2417448, 1726587, 874829, 892771, -1434951, -404935, -127246, -948356, 1811228, -1313790, -781965, 582710, 4528, -1890452, 14318, -1663092, 1812762, -1333359, -786897, 833656, -404136, 638058, -810473, -127162, 503589, -246815, -445360, 926935, -1221911, -2375512, 2493885, -953325, -1156445, 1683952, -266751, -763285, 152069, 700072, -933330, -957827, 1624046, -227695]
##PAGE= F1=5727.771679186
##FIRST=     21204.543296753, 2761.08209599448, 983572
##DATA TABLE= (F2++(Y..Y)), PROFILE
2047I83572a69834A24967Q05296a615905f33823A007095b59063H26595q8489L611
2037G41717a39132A827379A54218K84323a114231A329327e44893A221958b333757
2027e4951A404289a69577j178287B109563e43510A23202L451922I88476l41561
2018F46915a199479K80498e367p62300A122838b475081Q61239M99317A613408
2008B004909j002340K37190B43155K15453a895118A806708b156701C06373i80287
1998A517633E11992e50566l08285D73271J031998h46477F82979e67585n84199
1989a151784C06102a979695Q55336N5834c23599B376838b056002e10351A177939
1979f0961A167668f28523C404223j700836n0433H15529d18984r28756e12933A477613
$$ y = [983572, -169834, 124967, 930263, -1615905, -633823, 1007095, -259063, 826595, 738106, 741717, -139132, 1827379, 154218, 438541, -1114231, 1329327, -544893, 1221958, -2333757, -54951, 1404289, -169577, -1347864, 2109563, -543510, 123202, 3575124, 988476, 646915, -1199479, -918981, -5367, -767667, 1122838, -2475081, -1613842, -1114525, 1613408, 2004909, 1002569, 1239759, 243155, 458608, -1895118, 1806708, -2156701, 306373, -980287, 1517633, 511992, -550566, -858851, 473271, 1505269, -846477, 682979, -567585, -1151784, 306102, -1979695, -1124359, -1068525, -323599, 2376838, -2056002, -510351, 1177939, -60961, 1167668, -628523, 3404223, 1703387, 1652954, 815529, -418984, -1347740, -512933, 1477613]
1968A404599a797114G98905E8603a115971c37739l00066A374242a729239I1276
1958g5772C25904a418970E94139b098204C84191b68581B292508M18568n34117
1949B176959a74525o91906A324390L10482o32226b120563B561417a523978P30542
1940g93436o0131C033572g33891m12084b52031j246062A307241A08653J774103
1931A882756a536776A644671a027693G23211C49755a917632E24604G5010J044827
1922A119837e51789m72239j031249A347744o54678a982641H33208M0499e6988
1912c17910j451175G54824m6810a384028C57382c21035J02252k04409B46121d86316
1901a475800c01309B95086K9134d29758B068827e58510A990312D18528L80750
$$ y = [1404599, -1797114, 798905, 58603, -1115971, -337739, -637805, 1374242, -1729239, 91276, -75772, 325904, -1418970, 594139, -2098204, 384191, -268581, 2292508, 2711076, 2176959, -174525, -866431, 1324390, 1634872, 1002646, -2120563, 2561417, -1523978, -793436, -853567, 3033572, -733891, -1145975, -252031, -1498093, 1307241, 108653, 1882756, -1536776, 1644671, -1027693, 723211, 349755, -1917632, 524604, 75010, 1119837, -551789, -1024028, -2055277, 1347744, 693066, -1982641, 833208, 873707, -56988, -317910, -1769085, 754824, 708014, -1384028, 357382, -321035, -218783, -423192, 246121, -486316, -1475800, -301309, 295086, 324220, -429758, 2068827, -558510, 1990312, 418528, 799278]
1892G99278l27887a639157B84337b716656A639531h0419A742441F97160B59690
1882g89639b59811k60055j200935C26663a859209C89271Q69821c75580D73705
1872f05768F92100b40210D1146a29782B101682a07211H02304a04056o02601A337068
1861a576169b87306q52871F43201c8208m78518B32830O79174b202619a69787G33705
1850c64983j41850l52167A341577n17289E1816M28254R66474a986380i08623B00172
1839a326220J29622r0261A657990c80454H02542b023742O58730B157441b502673
1829B88240a320507M08086B610417c09966l09462A842551a81308F16640f12539
1819E26574j54790b91485B093525d364472d23268B557920A30167f54450p88488
$$ y = [799278, 471391, -1639157, 284337, -2716656, 1639531, -80419, 1742441, 697160, 259690, -789639, -259811, -519866, -1720801, 326663, -1859209, 389271, 1259092, -375580, 473705, -605768, 692100, -240210, 41146, -129782, 2101682, -107211, 802304, -104056, -706657, 1337068, -1576169, -287306, -1140177, 643201, -38208, -516726, 232830, 912004, -2202619, -169787, 733705, -364983, -506833, -859000, 1341577, 824288, 51816, 480070, 1446544, -1986380, -908623, 200172, -1326220, -1196598, -1286859, 1657990, -380454, 802542, -2023742, -1365012, 2157441, -2502673, 288240, -1320507, -912421, 2610417, -309966, -619428, 1842551, -181308, 616640, -612539, 526574, 371784, -291485, 2093525, -4364472, -423268, 2557920, 130167, -654450, -1442938]
1810a442938l32243B66632g41277A751578c4432F14164a799999C121848a665423
1800F03776b91682q32264o70967A243787c74169p47902H95539c96430j522320
1791a918750e20917e7487m98600o01907B958179F24473b0122j457676b32539d7727
1780e3775j021605d36108A499743B85251K54677a024161B84365a72369B110657
1770a714706F41328c17487I4764d55358B43534J242879N678m7734A91583a483598
1759a911514n48585A593645p74623a422065A626831F69289b132313E19983b11223
1749a814232M95142I33321e49693A284384a205310A270885e29902A439065f23485
1739a62704A318608E63214N54232a853277c14667A479073a707462b45042A746139
$$ y = [-1442938, -1775181, 266632, -741277, 1751578, -34432, 614164, -1799999, 3121848, -1665423, 603776, -291682, -1123946, -1794913, 1243787, -374169, -1122071, 895539, -396430, -1918750, -520917, -57487, -556087, -1157994, 2958179, 624473, -20122, -1477798, -232539, -47727, -53775, -1075380, -436108, 1499743, 285251, 539928, -1024161, 284365, -172369, 2110657, -1714706, 641328, -317487, 94764, -455358, 243534, 1486413, 1492091, 1444357, 191583, -1483598, -1911514, -2460099, 1593645, 819022, -1422065, 1626831, 669289, -2132313, 519983, -211223, -1814232, -1319090, 933321, -549693, 1284384, -1205310, 1270885, -529902, 1439065, -623485, -162704, 1318608, 563214, 1117446, -1853277, -314667, 1479073, -1707462, -245042, 1746139]
1729I74601h25985j37199B124354A67207a22388B279297B00351a233355G02594
1719c8586k103669A260061m26952A05140d18192p14474A09104a53317j746129
1710a899446O27281C95234h36466G87290b04481g9922k634999f75381J61323A875289
1699a154263l33410A585049l08682b364211A259095a53692C14215b89054J27226
1690a61828m9593A335353i33626r5825b26962B07138i74948B65847L7028c654609
1679C71881K017247h75789D51990J16759j35296N84096N76898D27813a009387
1669A957341A16719b125405Q03857B811174A266779J325230a568023O78570b70632
1659a347814H69337i79671f4361B243352d21073j72652B63963N49399b691358
$$ y = [974601, -825985, -963184, 2124354, 167207, -122388, 2279297, 200351, -1233355, 702594, -38586, -2142255, 1260061, 833109, 105140, -418192, -1132666, 109104, -153317, -1899446, -1272165, 395234, -836466, 787290, -204481, -79922, -2714921, -675381, -514058, 1875289, -1154263, -1487673, 1585049, 1276367, -2364211, 1259095, -153692, 314215, -289054, -161828, -211421, 1335353, -933626, -1029451, -226962, 207138, -974948, 265847, 302875, -3654609, 371881, 2389128, -875789, 451990, 568749, 433453, 1017549, 1594447, 427813, -1009387, 1957341, 116719, -2125405, -1321548, 2811174, 1266779, 2592009, -1568023, -889453, -270632, -1347814, 869337, -979671, -64361, 2243352, -421073, -593725, 263963, 813362, -2691358]
1649A645030f50176c1758l32153A713120c489593A443990g56398A646879a08252
1639A773182g16913c57360p78751E39917d38687D95930j87329c2695A046581J834430
1629B881011a777820h4609H64828L88327h86341E8275N39418k70786a160162A018358
1618B576224b78271F0398L54214d00349C73257a392767I90167a786623i2930D109091
1607D12007P96832O68874d79317j399916e10159G6607J020262m06280d77505a39223
1596G82232a721375o38949Q88781A690140e51744r33508F50709A66948a382497
1586A34581M47229B6755K27580b057793A071636K94009i10994B681541f26840
1576d27518A293449E79039P87906J12170a73457k60303a42033m38540G47007J450001
$$ y = [1645030, -650176, -31758, -363911, 1713120, -3489593, 1443990, -756398, 1646879, -108252, 1773182, -716913, -357360, -1136111, 539917, -438687, 495930, 308601, -32695, 1046581, 2881011, -1777820, -84609, 864828, 1253155, -886341, 58275, 597693, 326907, -1160162, 1018358, 2576224, -278271, 60398, 414612, -400349, 373257, -1392767, 990167, -1786623, -92930, 4109091, 412007, 1208839, 1877713, -479317, -1879233, -510159, 76607, 1096869, 690589, -477505, -139223, 782232, -1721375, -2360324, -1471543, 1690140, -551744, -1485252, 650709, 166948, -1382497, 134581, 581810, 26755, 254335, -2057793, 1071636, 1365645, -910994, 2681541, -626840, -427518, 1293449, 579039, 1366945, 1479115, -173457, -433760, -142033, -580573, 747007, 2197008]
1566B197008e38395p16434L67032b1708F42320a236069a2270E76632a254704A972284
1555C12796e41081K42234A226034G0965a12758D20554j11687d71289p24961F68947
1544b535112F18732a252386m4686j39003E96945R41397b091197A830790e59322
1534f72352j646547G69194l24064O54882F1575J706274C30801g01393A267832
1524g9614C268833b9765G31597e51538K03417q59048j635426B074099b094764
1514A245072j9749J82197l37271i44148H63397D14152i50440A64451b38393A081026
1503a326263B34709J268596m06012l56606Q44906a666606Q04138A553676i51938
1493a265850M30003H2238b198966A140144D60020J16746p2938M09891J31569a264847
$$ y = [2197008, -538395, -1254829, -887797, -21708, 642320, -1236069, -12270, 576632, -1254704, 1972284, 312796, -541081, -298847, 1226034, 70965, -112758, 420554, 308867, -471289, -1196250, 668947, -2535112, 618732, -1252386, -1297072, -1436075, 596945, 1538342, -2091197, 1830790, -559322, -672352, -2318899, 769194, 445130, 1100012, 61575, 1767849, 330801, -701393, 1267832, -79614, 3268833, -29765, 731597, -551538, -348121, -1207169, -2842595, 2074099, -2094764, 1245072, 1225323, 1407520, 1070249, -944148, 863397, 414152, -950440, 164451, -238393, 1081026, -1326263, 234709, 1503305, 1097293, 740687, 1585593, -1666606, -862468, 1553676, -951938, -1265850, -835847, 82238, -2198966, 1140144, 460020, 576766, 503828, 913719, 1045288, -1264847]
1482A352021h46719j650485D57720e45692j121330i6606D181849d85252b249k816223
1472b818472A089446f3376m61340A295145D31864b555233C64624a566903A43135
1462A249233A55278e70366A464790d7535G44834f73107G73366a334906A863808
1452e8194A550443n39907c11522m20823j24352B015908C96916a183500o37640
1443a821140a13993E36497c73183p39999A237207n42885c591851h00464H27684
1433A495321a849793H8699N34373N23303g1775j181206H863a179964B075905a45114
1422a41603l017133A285413C41603a55203H37638b95456q7262k45221A361229
1412h43068B450777A131147d71602j168707B783494i30765F16830L77022g23522
$$ y = [1352021, -846719, -2497204, 457720, -545692, -1667022, -96606, 4181849, -485252, -2249, -2818472, 1089446, -63376, -524716, 1295145, 431864, -2555233, 364624, -1566903, 143135, 1249233, 155278, -570366, 1464790, -47535, 744834, -673107, 773366, -1334906, 1863808, -58194, 1550443, 1010536, -311522, -732345, -856697, 2015908, 396916, -1183500, -1821140, -113993, 536497, -373183, -1113182, 1237207, 694322, -3591851, -800464, 827684, 1495321, -1849793, 88699, 623072, 1146375, -71775, -1252981, 8863, -1179964, 2075905, -145114, -141603, -3158736, 1285413, 341603, -155203, 837638, -295456, -382718, -627939, 1361229, -843068, 2450777, 1131147, -471602, -1640309, 2783494, -930765, 616830, 993852, -723522]
1402A050262b540889G61506l11319a146345A791521q13604L17218a221673e98599
1392c77612B059400a555206H43767N62378m90569b267985Q46644A044031c95183
1382B021161a092149A62834h34066E54469a224951a13505A402939b0863j107292
1373a128155d73925j698182a019197C54136b29506N4258k11276B273606g93892
1363A20752a782464e22859H44026a18379A366521h71001j45482B57872i73226
1353D08678b977613A063401j95026B66976Q06905e11923A103005b308954g602
$$ y = [1050262, -2540889, 761506, 450187, -1146345, 1791521, 977917, 1295135, -1221673, -598599, -377612, 2059400, -1555206, 843767, 1406145, 915576, -2267985, -1421341, 1044031, -395183, 2021161, -1092149, 162834, -834066, 554469, -1224951, -113505, 1402939, -20863, -1128155, -473925, -2172107, -1019197, 354136, -229506, -175248, -386524, 2273606, -793892, 120752, -1782464, -522859, 844026, -118379, 1366521, -871001, -1016483, 257872, -973226, 408678, -2977613, 1063401, 868375, 266976, 1073881, -511923, 1103005, -2308954, -7602]
$$ [...]
##END NTUPLES=nD NMR SPECTRUM
##END=
