##TITLE=Analysis number 325115
Compound Code mo 07947
Book Reference 451/195
Project Code adrs
Chemist Name evam
##JCAMPDX= 6.0         $$ Bruker NMR JCAMP-DX V2.0
##DATA TYPE= NMR SPECTRUM
##DATA CLASS= NTUPLES
##ORIGIN= Bruker BioSpin GmbH
##OWNER= nmr
$$ XWIN-NMR		Version 3.5
$$ Tue Dec 12 12:33:29 2006 GMT Standard Time (UT+0h)  MAYBRIDGE\nmr@NMR_250MHZ
##.OBSERVE FREQUENCY= 250.131544655141
##.OBSERVE NUCLEUS= ^1H
##.ACQUISITION MODE= SIMULTANEOUS (DQD)
##.ACQUISITION SCHEME= undefined
##.AVERAGES= 16
##.DIGITISER RES= 18
##SPECTROMETER/DATA SYSTEM= dpx250
##.PULSE SEQUENCE= zg30
##.SOLVENT NAME= CDCl3
##.SHIFT REFERENCE= (INTERNAL, CDCl3, 0, 16.5224)
##AUDIT TRAIL= $$ (NUMBER, WHEN, WHO, WHERE, WHAT)
$$ ##TITLE= Audit trail, XWIN-NMR		Version 3.5
$$ ##JCAMPDX= 5.01
$$ ##ORIGIN= Bruker BioSpin GmbH
$$ ##OWNER= nmr
$$ C:\u/data/dgb/nmr/ADRS/770/pdata/1/auditp.txt
$$ ##AUDIT TRAIL=  $$ (NUMBER, WHEN, WHO, WHERE, WHAT)
(   1,<2006-12-12 12:33:06.88 +000>,<MAYBRIDGE\nmr>,<NMR_250MHZ>,
      <created by zg, POWCHK disabled, PULCHK disabled
       configuration hash MD5:
       49 4B E0 1D 92 C2 6B 37 9F E6 65 BC 52 41 86 1D
       data hash MD5: 64K
       1D EF BD F3 92 EA 49 4D 3C CB 32 97 24 A2 FF A7>)
(   2,<2006-12-12 12:33:21.02 +000>,<MAYBRIDGE\nmr>,<NMR_250MHZ>,
      <Start of raw data processing
       ef LB = 0.3 FT_mod = 6 PKNL = 1 SI = 32K 
       data hash MD5: 32K
       7E CD 38 82 98 35 73 CA E9 17 92 FE DF AE 12 12>)
(   3,<2006-12-12 12:33:22.67 +000>,<MAYBRIDGE\nmr>,<NMR_250MHZ>,
      <apk 
       data hash MD5: 32K
       8B DB EF AD 84 A9 D8 C0 83 58 4E 76 BC 00 42 26>)
(   4,<2006-12-12 12:33:23.46 +000>,<MAYBRIDGE\nmr>,<NMR_250MHZ>,
      <abs ABSG = 5 
       data hash MD5: 32K
       56 D5 BA D3 66 F3 8F 15 49 AA 51 C8 81 0F EE E1>)
$$ ##END=
$$ 
$$ hash MD5
$$ A6 1A 1D E0 35 F1 4E B7 88 FD D3 89 71 DA 69 1E
##$RELAX= 
##$RELAX= 
##$RELAX= 
##$RELAX= 
##$RELAX= 
##$RELAX= 
##$RELAX= 
$$ Bruker specific parameters
$$ --------------------------
##$DU= <C:\u>
##$EXPNO= 770
##$NAME= <ADRS>
##$PROCNO= 1
##$TYPE= <nmr>
##$USER= <dgb>
##$AMP= (0..31)
100 100 100 100 100 100 100 100 100 100 100 100 100 100 100 100 100 100 
100 100 100 100 100 100 100 100 100 100 100 100 100 100 
##$AQSEQ= 0
##$AQ_mod= 3
##$AUNM= <au_zg>
##$AUTOPOS= <41 >
##$BF1= 250.13
##$BF2= 250.13
##$BF3= 250.13
##$BF4= 250.13
##$BF5= 500.13
##$BF6= 500.13
##$BF7= 500.13
##$BF8= 500.13
##$BYTORDA= 1
##$CFDGTYP= 0
##$CFRGTYP= 5
##$CHEMSTR= <none>
##$CNST= (0..31)
1 1 145 1 1 1 1 1 1 1 1 1 1 1 1 1 1 1 1 1 1 1 1 1 1 1 1 1 1 1 1 1 
##$CPDPRG= <>
##$CPDPRG1= <>
##$CPDPRG2= <>
##$CPDPRG3= <>
##$CPDPRG4= <mlev>
##$CPDPRG5= <mlev>
##$CPDPRG6= <mlev>
##$CPDPRG7= <mlev>
##$CPDPRG8= <mlev>
##$CPDPRGB= <>
##$CPDPRGT= <>
##$D= (0..31)
0 1 0 0 0 0 0 0 0 0.06 0 0 0 0 0 0 0.0002 0 0 0 0 0 0 0 0 0 0 0 0 0 0 
0 
##$DATE= 1165926785
##$DBL= (0..7)
120 120 120 120 120 120 120 120 
##$DBP= (0..7)
150 150 150 150 150 150 150 150 
##$DBP07= 0
##$DBPNAM0= <>
##$DBPNAM1= <>
$$ [...]
##$SUBNAM7= <"">
##$SUBNAM8= <"">
##$SUBNAM9= <"">
##$SW= 20.6930455092707
##$SWIBOX= (0..15)
0 0 3 0 0 0 0 0 0 0 0 0 0 0 0 0 
##$SW_h= 5175.983436853
##$TD= 65536
##$TD0= 1
##$TE= 295.16
##$TE2= 300
##$TE3= 300
##$TEG= 300
##$TL= (0..7)
0 120 120 120 120 120 120 120 
##$TP= (0..7)
150 150 150 150 150 150 150 150 
##$TP07= 0
##$TPNAME0= <>
##$TPNAME1= <>
##$TPNAME2= <>
##$TPNAME3= <>
##$TPNAME4= <>
##$TPNAME5= <>
##$TPNAME6= <>
##$TPNAME7= <>
##$TPOAL= (0..7)
0.5 0.5 0.5 0.5 0.5 0.5 0.5 0.5 
##$TPOFFS= (0..7)
0 0 0 0 0 0 0 0 
##$TUNHIN= 0
##$TUNHOUT= 0
##$TUNXOUT= 0
##$USERA1= <user>
##$USERA2= <user>
##$USERA3= <user>
##$USERA4= <user>
##$USERA5= <user>
##$V9= 5
##$VALIST= <valist>
##$VCLIST= <CCCCCCCCCCCCCCC>
##$VD= 0
##$VDLIST= <DDDDDDDDDDDDDDD>
##$VPLIST= <PPPPPPPPPPPPPPP>
##$VTLIST= <TTTTTTTTTTTTTTT>
##$WBST= 1024
##$WBSW= 4
##$XGAIN= (0..3)
0 0 0 0 
##$XL= 0
##$YL= 0
##$YMAX_a= 350974
##$YMIN_a= -392631
##$ZGOPTNS= <>
##$ZL1= 120
##$ZL2= 120
##$ZL3= 120
##$ZL4= 120
##$ABSF1= 16.52236
##$ABSF2= -4.170813
##$ABSG= 5
##$ABSL= 3
##$ALPHA= 0
##$AQORDER= 0
##$ASSFAC= 0
##$ASSFACI= 0
##$ASSFACX= 0
##$ASSWID= 0
##$AUNMP= <proc_1d>
##$AZFE= 0.1
##$AZFW= 0.1
##$BCFW= 0
##$BC_mod= 0
##$BYTORDP= 0
##$COROFFS= 0
##$CY= 12.5
##$DATMOD= 1
##$DC= 0
##$DFILT= <>
##$DTYPP= 0
##$F1P= 14.0000005364418
##$F2P= -0.99999901652339
##$FCOR= 0.5
##$FTSIZE= 32768
##$FT_mod= 6
##$GAMMA= 0
##$GB= 0
##$INTBC= 1
##$INTSCL= 1
##$ISEN= 128
##$LB= 0.3
##$LEV0= 0
##$LPBIN= 0
##$MAXI= 10000
##$MC2= 0
##$MEAN= 0
##$ME_mod= 0
##$MI= 0
##$NCOEF= 0
##$NC_proc= -3
##$NLEV= 6
##$NOISF1= 0
##$NOISF2= 0
##$NSP= 0
##$NTH_PI= 0
##$NZP= 0
##$OFFSET= 16.52236
##$PC= 1
##$PHC0= 223.2407
##$PHC1= 8.942768
##$PH_mod= 1
##$PKNL= yes
##$PPARMOD= 0
##$PSCAL= 4
##$PSIGN= 0
##$REVERSE= no
##$SF= 250.129999908721
##$SI= 32768
##$SIGF1= 0
##$SIGF2= 0
##$SINO= 400
##$SIOLD= 32768
##$SREGLST= <1H.CDCl3>
##$SSB= 0
##$STSI= 32768
##$STSR= 0
##$SW_p= 5175.98343685301
##$SYMM= 0
##$S_DEV= 0
##$TDeff= 65536
##$TDoff= 0
##$TI= <Analysis number 999999
Compound Code 99
Book Reference 9
Project Code 9>
##$TILT= no
##$TM1= 0
##$TM2= 0
##$TOPLEV= 0
##$USERP1= <user>
##$USERP2= <user>
##$USERP3= <user>
##$USERP4= <user>
##$USERP5= <user>
##$WDW= 1
##$XDIM= 32768
##$YMAX_p= 333541782
##$YMIN_p= -165490
$$ End of Bruker specific parameters
$$ ---------------------------------
##NTUPLES= NMR SPECTRUM
##VAR_NAME=  FREQUENCY,     SPECTRUM/REAL,   SPECTRUM/IMAG
##SYMBOL=    X,             R,               I
##VAR_TYPE=  INDEPENDENT,   DEPENDENT,       DEPENDENT
##VAR_FORM=  AFFN,          ASDF,            ASDF
##VAR_DIM=   32768,         32768,           32768
##UNITS=     HZ,            ARBITRARY UNITS, ARBITRARY UNITS
##FACTOR=    0.157963299565203, 1,           1
##FIRST=     4132.73786727771, 0,            0
##LAST=      -1043.2455695753, 0,            0
##MIN=       -1043.2455695753, -165490,      0
##MAX=       4132.73786727771, 333541782,    0
$$ Real data points
##PAGE= N=1
##DATA TABLE= (X++(R..R)), XYDATA
$$ [...]
$$ plain form
20146 10437 43255 58346 39534 31289 58614 47335 44873 58982 23199 7346 22075 34833
20134 34833 17156 14692 17854 -11614 -31493 -7434 34004 61192 49697 46843 50076 32279
20122 32279 92485 123701 82762 49646 26137 34310 42426 34973 30356 46644 80897 63902
20110 63902 32151 -6496 -50719 -44920 -7903 1798 3815 -7582 5780 17783 24246 -6640
20098 -6640 -18598 -6412 -6341 13222 37889 39372 33013 44423 23720 9590 24491 34517 8445
20085 8445 4291 25261 85212 68750 29970 9417 -7646 3502 28448 24314 22882 26468 44863
20072 44863 62067 62414 58910 50170 62783 98437 84497 39148 19406 33995 53070 63396
20060 63396 41974 6702 191 32041 39482 37257 21003 44638 52511 14241 -25548 -27322 -22591
$$ packed form
20146A0437L2818J5091j8812q245K7325j1279k462J4109l5783j5853J4729J2758
20134C4833j7677k464L162k9468j9879K4059M1438K7188j1495k854L233j7797
20122C2279O0206L1216m0939l3116k3509Q173Q116p453m617J6288L4253j6995
20110F3902l1751l8647m4223N799L7017R701K017j1397J3362J2003O463l0886
20098f640j1958J2186P1J9563K4667J483o359J1410k0703j4130J4901J0026k6072
20085H445m154K0970N9951j6462l8780k0553j7063J1148K4946m134j432L586J8395
20072D4863J7204L47l504q740J2613L5654j3940m5349j9742J4589J9075J0326
20060F3396k1422l5272o511L1850P441k225j6254K3635P873l8270l9789j774M731
$$ plain form
20047 -22591 29499 50712 51868 56575 9464 -34606 -48666 -14829 34635 37595 6278 -15575
20035 -15575 -29847 20278 68583 49617 7155 4839 19212 77085 77360 63214 42738 19851
20023 19851 2299 44054 57954 21983 219 2976 21150 7766 1981 26877 39480 65952
20011 65952 60389 14063 -6329 -5366 21599 32312 54552 43797 16251 4757 -6325 -1073
19999 -1073 7950 9506 12036 16304 19621 24272 5336 -7999 14003 52657 38387 15999 -20744
19986 -20744 -8478 10666 38712 40313 45436 58462 66362 84513 48526 12268 -4301 -18451
19974 -18451 -28525 -11696 8218 6848 5218 23450 25007 23117 -13525 -1212 3594 942 41765
19961 41765 62463 71692 78316 66009 21911 -47363 -43480 -37763 -16234 23689 24509 43501 64609
$$ packed form
20047b2591N2090K1213J156M707m7111m4070j4060L3837M9464K960l1317k1853
20035a5575j4272N0125M8305j8966m2462k316J4373N7873K75j4146k0476k2887
20023A9851j7552M1755J3900l5971k1764K757J8174j3384n785K4896J2603K6472
20011F5952n563m6326k0392R63K6965J0713K2240j0755k7546j1494j1082N252
19999a073R023J556K530M268L317M651j8936j3335K2002L8654j4270k2388l6743
19986b0744J2266J9144K8046J601N123J3026P900J8151l5987l6258j6569j4150
19974a8451j0074J6829J9914j370j630J8232J557j890l6642J2313M806k652M0823
19961D1765K0698R229O624j2307m4098o9274L883N717K1529L9923Q20J8992K1108
$$ plain form
19948 64609 35048 19807 15974 19655 24820 1396 -31794 -39972 -13282 16794 37250 42031 39746
19935 39746 50213 57026 58200 14335 11199 -307 -9938 9155 20208 12039 -23721 -13906 19020
19922 19020 24180 -9485 11687 55356 49593 48869 57298 68453 70003 73852 51554 65980 78910
19909 78910 39727 10504 -7598 8193 31974 29312 57422 41781 22982 11312 5262 14171
19897 14171 33864 58486 49600 33049 -463 -13454 -5332 6210 28725 33646 23063 -4225
19885 -4225 -15754 -13605 -25988 -16324 12569 7759 -1925 -12303 -18309 -5372 13530 805 6160
19872 6160 17676 50176 71630 75662 52520 50023 42066 23949 -6078 28570 48235 59129
19860 59129 37638 24666 23484 24095 9510 18433 7606 503 41789 47445 34091 25530 2332
$$ packed form
19948F4609k9561j5241l833L681N165k3424l3190q178K6690L0076K0456M781k285
19935C9746J0467O813J174m3865l136j1506r631J9093J1053q169l5760R815L2926
19922A9020N160l3665K1172M3669n763p24Q429J1155J550L849k2298J4426J2930
19909G8910l9183k9223j8102J5791K3781k662K8110j5641j8799j1670o050Q909
19897A4171J9693K4622q886j6551l3512j2991Q122J1542K2515M921j0583k7288
19885d225j1529K149j2383R664K8893m810r684j0378o006J2937J8902j2725N355
19872F160J1516L2500K1454M032k3142k497p957j8117l0027L4648J9665J0894
19860E9129k1491j2972j182O11j4585Q923j0827p103M1286N656j3354q561k3198
$$ plain form
19847 2332 25115 37944 21029 10657 -1765 18168 52824 40007 43689 64927 51281 49737
19835 49737 18180 13965 48819 54734 40073 66649 76087 49680 32853 34511 27800 13255 8887
19822 8887 -87 25462 23531 51722 59205 78642 93837 106976 75339 53399 37951 21358
19810 21358 22909 21286 37084 62200 57493 82674 84220 55047 50009 53286 24737 -14163 -137
19797 -137 -4558 -13688 21911 51381 52826 66 -15314 11517 38287 19297 2859 31458 39678
19784 39678 27466 52687 43577 31151 57909 58718 34817 -8818 33492 71305 34411 7023
19772 7023 48348 71798 61339 54565 47291 58517 40032 40189 34404 -482 -6370 27615 44613
19759 44613 82874 65517 37824 20605 35709 57792 58456 82302 81241 29373 57558 54122
$$ packed form
19847B332K2783J2829j6915j0372j2422J9933L4656j2817L682K1238j3646j544
19835D9737l1557m215L4854N915j4661K6576R438k6407j6827J658o711j4545m368
19822H887q974K5549j931K8191P483J9437J5195J3139l1637k1940j5448j6593
19810B1358J551j623J5798K5116m707K5181J546k9173n038L277k8549l8900J4026
19797a37m421r130L5599K9470J445n2760j5380K6831K6770j8990j6438K8599Q220
19784C9678j2212K5221r110j2426K6758Q09k3901m3635M2310L7813l6894k7388
19772G023M1325K3450j0459o774p274J1226j8485J57n785l4886n888L3985J6998
19759D4613L8261j7357k7693j7219J5104K2083O64K3846j061n1868K8185l436
$$ plain form
19747 54122 72370 80757 68836 76851 50410 23462 -570 8472 18951 28205 50174 43755 57168
19734 57168 77870 94905 126006 128550 94517 47947 5179 -16985 2118 26481 23221 15727
19722 15727 39827 28292 -4821 -11707 -1187 -8951 12857 50624 40243 36178 43037 71426
19710 71426 43878 31800 48632 78900 56849 47368 30610 14288 1635 12122 -19475 10665
19698 10665 45760 36630 54576 73571 49348 44742 73187 83744 76140 54085 33034 43444
19686 43444 52606 64410 66433 50542 68987 40719 9340 -1057 4985 41454 53540 54650
19674 54650 53899 46972 45664 29267 15599 1327 -795 24545 11468 6151 28098 38703 32286
19661 32286 27844 25171 802 -22872 -11647 21176 27862 29593 56952 68456 66359 49801 12086
$$ packed form
19747E4122J8248Q387j1921Q015k6441k6948k4032R042J0479R254K1969o419J3413
19734E7168K0702J7035L1101K544l4033m6570m2768k2164J9103K4363l260p494
19722A5727K4100j1535l3113o886J0520p764K1808L7767j0381m065O859K8389
19710G1426k7548j2078J6832L0268k2051r481j6758j6322j2653J0487l1597L0140
19698A0665L5095r130J7946J8995k4223m606K8445J0557p604k2055k1051J0410
19686D3444R162J1804K023j5891J8445k8268l1379j0397O042L6469J2086J110
19674E4650p51o927j308j6397j3668j4272k122K5340j3077n317K1947J0605o417
19661C2286m442k673k4369k3674J1225L2823O686J731K7359J1504k097j6558l7715
$$ plain form
19648 12086 19229 16960 27619 53227 51905 43213 13208 9497 55287 45365 34984 26853 44264
19635 44264 21600 28758 11697 44624 79168 91771 121310 126940 110445 82079 92531 60848
19623 60848 52624 38079 49796 54007 37324 50818 32446 -14057 5749 16905 -10129 34579
19611 34579 77227 68616 56817 30333 12376 35013 55986 60827 38417 24235 1657 -12677
19599 -12677 12206 66748 115597 104641 73222 48862 32686 38629 59298 62870 84047 127817
19587 127817 112069 89023 59226 54422 48563 39430 7874 702 -8273 -36733 -59712 -42531
19575 -42531 544 34466 41606 24102 28607 23379 2794 -942 11472 45838 76753 60265
19563 60265 79064 102598 103244 86987 51549 45225 55204 47401 27203 19101 23656 24979 44517
$$ packed form
19648A2086P143k269J0659K5608j322q692l0005l711M5790r922j0381q131J7411
19635D4264k2664P158j7061L2927L4544J2603K9539N630j6495k8366J0452l1683
19623F0848q224j4545J1717M211j6683J3494j8372m6503J9806J1156k7034M4708
19611C4579M2648q611j1799k6484j7957K2637K0973M841k2410j4182k2578j4334
19599a2677K4883N4542M8849j0956l1419k4360j6176N943K0669L572K1177M3770
19587A27817j5748k3046k9797m804n859r133l1556p172q975k8460k2979J7181
19575d2531M3075L3922P140j7504M505n228k0585l736J2414L4366L0915j6488
19563F0265J8799K3534O46j6257l5438o324R979p803k0198q102M555J323J9538
$$ plain form
19550 44517 73155 77902 75994 73033 49114 45071 25427 -7721 -12949 12851 53937 80841 66131
19537 66131 88394 114770 138638 121985 115811 90849 77025 46286 65011 91045 110041 120704
19525 120704 84833 79055 90269 94618 90394 91438 85690 106242 109416 112254 144336 182196 205439
19512 205439 209342 193281 189257 200604 189235 205305 220166 272287 297249 343227 369756 349527
19500 349527 311222 263365 240992 232663 264162 287260 293770 330101 362258 367593 353179 343340
19488 343340 359956 371586 370097 361634 357287 357296 425886 450655 470596 485855 474900 449721 420263
19475 420263 413357 371383 341359 341032 316489 301964 319733 345629 334968 365816 419683 414830
19463 414830 381806 364278 326214 281556 249557 235668 274634 362535 386454 382675 367244 350355
$$ packed form
19550D4517K8638M747j908k961k3919m043j9644l3148n228K5800M1086K6904j4710
19537F6131K2263K6376K3868j6653o174k4962j3824l0739J8725K6034J8996J0663
19525A20704l5871n778J1214M349m224J044n748K0552L174K838L2082L7860K3243
19512B05439L903j6061m024J1347j1369J6070J4861N2121K4962M5978K6529k0229
19500C49527l8305m7857k2373q329L1499K3098O510L6331L2157N335j4414r839
19488C43340J6616J1630j489q463m347RO8590K4769J9941J5259j0955k5179k9458
19475D20263o906m1974l0024l27k4543j4525J7769K5896j0661L0848N3867m853
19463D14830l3024j7528l8064m4658l1999j3889L8966Q7901K3919l779j5431j6889
$$ plain form
19451 350355 318415 262698 220676 237615 256276 251502 234208 220177 196725 207648 198053 170820
19439 170820 150699 151866 177846 164028 149805 156209 179227 207564 213242 223264 215582 209432
19427 209432 198209 241072 278104 324603 355624 326150 334107 298919 251127 218841 226618 240406
19415 240406 222679 190171 187287 163152 164997 185430 210687 181106 120800 122385 110595 98768
19403 98768 97496 92932 86156 109190 107112 108591 111511 140343 120159 92806 113524 118945 113031
19390 113031 106713 89163 113613 91850 124622 179857 225496 224394 219955 211927 234165 251403
19378 251403 280668 257008 256071 314289 353962 369122 354864 315178 278344 274462 304365 291067
19366 291067 280585 297365 290679 306685 332743 318495 265838 249605 219059 185435 157541 166570
$$ packed form
19451C50355l1940n5717m2022J6939J8661m774j7294j4031k3452J0923r595k7233
19439A70820k0121J167K5980j3818j4223O404K3018K8337N678J0022p682o150
19427B09432j1223M2863L7032M6499L1021k9474P957l5188m7792l2286P777J3788
19415B40406j7727l2508k884k4135J845K0433K5257k9581o0306J585j1790j1827
19403I8768j272m564o776K3034k078J479K920K8832k0184k7353K0718N421n914
19390A13031o318j7550K4450k1763L2772N5235M5639j102m439q028K2238J7238
19378B51403K9265k3660r37N8218L9673J5160j4258l9686l6834l882K9903j3298
19366B91067j0482J6780o686J6006K6058j4248n2657j6233l0546l3624k7894R029
$$ plain form
19354 166570 159526 98015 73056 84890 104697 109828 106935 82665 69863 104410 112204 119268
19342 119268 138711 149412 118942 103739 89578 92263 79050 81586 50526 37881 78003 110289
19330 110289 114718 86986 61722 82678 72234 59645 103696 96740 58394 55477 30483 12060
19318 12060 43476 42555 21047 19814 28740 14176 58148 105720 131620 105947 72246 88800
19306 88800 86574 97342 88853 76923 60235 69140 96990 108018 92687 105148 101310 78482
19294 78482 136850 159861 158883 137311 121980 124850 139492 134449 152586 155015 123203 106246 118917
19281 118917 117376 129003 118646 106482 123306 134147 136141 149865 143842 144438 116638 109586 149586
19268 149586 160711 151576 134285 115770 169191 178878 188374 158403 147458 120902 80103 77252
$$ packed form
19354A66570p044o1511k4959J1834J9807N131k893k4270j2802L4547P794P064
19342A19268J9443J0701l0470j5203j4161K685j3213K536l1060j2645M0122L2286
19330A10289M429k7732k5264K0956j0444j2589M4051o956l8346k917k4994j8423
19318A2060L1416r21k1508j233Q926j4564M3972M7572K5900k5673l3701J6554
19306H8800k226J0768q489j1930j6688Q905K7850J1028j5331J2461l838k2828
19294G8482N8368K3011r78k1572j5331K870J4642n043J8137K429l1812j6957J2671
19281A18917j541J1627j0357j2164J6824J0841J994J3724o023N96k7800p052M0000
19268A49586J1125r135j7291j8515N3421R687R496k9971j0945k6556m0799k851
$$ plain form
19256 77252 105099 140729 148587 120155 143816 163505 176563 189625 216184 264832 253361 292602
19244 292602 303892 279336 290448 277734 211937 196614 209537 187042 151581 151136 180615 228302
19232 228302 270169 237687 228980 217441 219888 195878 185595 197972 222325 257899 244702 230733
19220 230733 229179 237210 256090 293546 278901 226004 217667 205038 217042 275078 300828 249264
19208 249264 217256 222400 227200 230054 222092 239130 281925 334881 410504 431723 461259 519697
19196 519697 575371 558750 525881 448231 423818 396136 369617 313705 299966 306851 283078 252771
19184 252771 223721 232781 255890 242097 203399 230956 256603 223670 208499 230365 269197 267836
19172 267836 298341 285865 254969 265213 268018 296606 330772 352947 332533 300804 270564 251257
$$ packed form
19256G7252K7847L5630P858k8432K3661J9689J3058J3062K6559M8648j1471L9241
19244B92602J1290k4556J1112j2714o5797j5323J2923k2495l5461m45K9479M7687
19232B28302M1867l2482q707j1539K447k4010j0283J2377K4353L5574j3197j3969
19220B30733j554Q031J8880L7456j4645n2897q337j2629J2004N8036K5750n1564
19208B49264l2008N144M800K854p962J7038M2795N2956P5623K1219K9536N8438
19196E19697N5674j6621l2869p7650k4413k7682k6519n5912j3739O885k3773l0307
19184B52771k9050R060K3109j3793l8698K7557K5647l2933j5171K1866L8832j361
19172B67836L0505j2476l0896J0244K805K8588L4166K2175k0414l1729l0240j9307
$$ plain form
19160 251257 226689 208049 232251 271067 267515 269336 238707 213282 228030 234523 273155 329735
19148 329735 378220 454148 531957 610712 594307 554906 474330 410628 359860 327668 330896 331850
19136 331850 311620 301135 261458 265570 261245 241804 232507 227295 242257 230058 228026 275317
19124 275317 318596 321546 303472 307295 267862 293607 285753 317403 354096 373486 376645 367082
19112 367082 379403 405874 386268 407165 413187 398347 408522 420306 432396 428486 386373 379031
19100 379031 408573 421274 428712 455032 456541 433587 416029 394848 381363 368122 356544 367171
19088 367171 405270 434098 458389 487134 499065 467065 409766 400893 389025 368180 381340 404825
19076 404825 425718 467746 480761 492006 440306 425138 420204 375856 384974 429740 403524 387312
$$ packed form
19160B51257k4568j8640K4202L8816l552J821l0629k5425J4748O493L8632N6580
19148C29735M8485P5928P7809P8755j6405l9401q0576o3702n0768l2192L228R54
19136C31850k0230j0485l9677M112m325j9441r297n212J4962j2199k032M7291
19124B75317M3279K950j8074L823l9433K5745p854L1650L6693J9390L159r563
19112C67082J2321K6471j9606K0897O022j4840J0175J1784J2090l910m2113p342
19100C79031K9542J2701P438K6320J509k2954j7558k1181j3485j3241j1578J0627
19088C67171L8099K8828K4291K8745J1931l2000n7299q873j1868k0845J3160K3485
19076D04825K0893M2028J3015J1245n1700j5168m934m4348R118M4766k6216j6212
$$ plain form
19064 387312 404464 393176 410946 437309 449069 438491 457877 456508 434761 423765 460304 466121
19052 466121 443592 435200 434294 503474 551831 527490 516693 552412 519846 478190 476998 490444
19040 490444 504374 517739 540276 558097 607719 617552 605628 597640 608934 627485 657509 676049
19028 676049 724618 766868 789372 792620 826607 883770 911951 978955 1009033 1003553 1053468 1111132
19016 1111132 1168697 1205686 1261621 1395858 1535785 1653684 1741076 1835471 1926698 2038575
19006 2038575 2165369 2284120 2429947 2539241 2632511 2763625 2906891 3090179 3380407 3740256
18996 3740256 4181985 4737564 5563964 6844493 8824614 11353055 13981851 15782131 16216750
18987 16216750 15860687 15399407 16066248 18723655 23844336 31376400 39907092 46720864
$$ packed form
19064C87312J7152j1288J7770K6363J1760j0578J9386j369k1747j0996L6539N817
19052D66121k2529q392r06O9180M8357k4341j0797L5719l2566m1656j192J3446
19040D90444J3930J3365K2537J7821M9622R833j1924p988J1294J8551L0024J8540
19028F76049M8569M2250K2504L248L3987N7163K8181O7004L0078n480M9915N7664
19016A111132N7565L6989N5935J34237J39927J17899Q7392R4395R1227J11877
19006B038575J26794J18751J45827J09294R3270J31114J43266J83288K90228L59849
18996C740256M41729N55579Q26400J280529J980121K528441K628796J800280M34619
18987A6216750l56063m61280O66841K657407N120681P532064Q530692O813772
$$ plain form
18979 46720864 49634851 47325074 42608222 38067304 36935854 40986682 49940814 61042956
18971 61042956 71637586 77006146 75212176 68830325 60382885 51653489 45337926 42187135
18963 42187135 43243647 49201467 59191796 70670555 82078106 91484676 93297564 88207668
18955 88207668 79078981 67560258 56948580 49713473 47029010 48709457 53687726 59366934
18947 59366934 63800317 65695674 62596168 57351751 51991124 47830257 47144603 49054273
18939 49054273 51129530 50054939 46087510 41016519 37603706 38280298 44031118 54066694
18931 54066694 65605136 73628741 73831901 66827305 55391894 44441748 36866273 34152903
18923 34152903 36165511 41000170 46827987 51652090 51224044 46726685 40932043 35505087
$$ packed form
18979D6720864K913987k309777m716852m540918j131450M050828Q954132J1102142
18971F1042956J0594630N368560j793970o381851q447440q729396o315563l150791
18963D2187135J056512N957820R990329J1478759J1407551R406570J812888n089896
18955H8207668r128687j1518723j0611678p235107k684463J680447M978269N679208
18947E9366934M433383J895357l099506n244417n360627m160867o85654J909670
18939D9054273K075257j074591l967429n070991l412813O76592N750820J0035576
18931E4066694J1538442Q023605K03160p004596j1435411j0950146p575475k713370
18923C4152903K012608M834659N827817M824103m28046m497359n794642n426956
$$ plain form
18915 35505087 32464584 31750757 32625364 35445356 37711135 37367034 36497868 34439326 30503382
18906 30503382 26462508 22974991 20357284 19104974 18750388 18976250 19802881 19529434 17876922
18897 17876922 15890682 13355546 10888602 8828240 7215914 6083624 5322491 4839026
18889 4839026 4555636 4386218 4280859 4207798 4151700 4186254 4267091 4339579 4487823 4720518
18879 4720518 5119285 5756518 6776302 8467243 11185910 15502934 21491201 27784868
18871 27784868 34188199 40265515 42123887 40776042 38444547 35269449 33676273 34458082
18863 34458082 37453433 43232577 49122636 52248998 54362474 53001585 47421439 41287971
18855 41287971 34811952 29739925 27128986 26012348 26270649 27206250 26181550 23644509
$$ packed form
18915C5505087l040503p13827Q74607K819992K265779l44101q69166k058542l935944
18906C0503382m040874l487517k617707j252310l54586K25862Q26631k73447j652512
18897A7876922j986240k535136k466944k060362j612326j132290p61133m83465
18889D839026k83390j69418j05359p3061n6098L4554Q0837P2488J48244K32695
18879D720518L98767O37233J019784J690941K718667M317024N988267O293667
18871B7784868O403331O077316J858372j347845k331495l175098j593176P81809
18863C4458082K995351N779144N890059L126362K113476j360889n580146o133468
18855D1287971o476019n072027k610939j116638K58301R35601j024700k537041
$$ plain form
18847 23644509 20505165 16543725 12818203 9780535 7452534 5902699 4845103 4133184
18839 4133184 3627757 3243410 2942489 2667894 2426970 2226788 2063214 1869633 1691011
18830 1691011 1576585 1460036 1359735 1263894 1189655 1110435 1018216 936493 833043 781864
18820 781864 726773 729956 684563 623153 595765 552555 525787 488006 440067 426466 441795 474224
18808 474224 486094 426700 387770 383353 376140 363267 411804 451079 453794 460451 457102 470355
18796 470355 484840 466967 454410 458925 447869 410315 386291 380169 407212 419602 391901 365248
18784 365248 339284 312212 288866 247376 220191 226683 265827 301741 327192 324202 317376 337198
18772 337198 353371 357759 337067 418898 594768 716566 736504 736284 697154 651635 588971 547006
$$ packed form
18847B3644509l139344l961440l725522l037668k328001j549835j057596p11919
18839D133184n05427l84347l00921k74595k40924k00182j63574j93581j78622
18830A691011j14426j16549j00301r5841p4239p9220r2219q1723j03450n1179
18820G81864n5091L183m5393o1410k7388m3210k6768l7781m7939j3601J5329L2429
18808D74224J1870n9394l8930m417p213j2873M8537L9275K715O657l349J3253
18796D70355J4485j7873j2557M515j1056l7554k4024o122K7043J2390k7701k6653
18784C65248k5964k7072k3346m1490k7185O492L9144L5914K5451k990o826J9822
18772C37198J6173M388k0692Q1831J75870J21798J9938k20l9130m5519o2664m1965
$$ plain form
18760 547006 520474 507595 520162 491918 492391 506873 528694 557831 596471 603663 600421 620095
18748 620095 661288 730354 836814 997070 1187688 1312594 1431934 1515672 1540917 1507066
18738 1507066 1487541 1475859 1492017 1540219 1582046 1586489 1581248 1624818 1767661 1953105 2141704
18727 2141704 2391403 2786491 3326488 4065202 5130644 6751044 9125180 12757560 18621497
18718 18621497 27808862 40365830 54276900 64902316 68518049 64042695 52943275
18711 52943275 39955978 28228755 19610956 13989239 10471895 8183501 6649552 5606271
18703 5606271 4848203 4309661 3988851 3809776 3797161 3984422 4518129 5552845 7195021
18694 7195021 8868349 9209092 8321652 7140611 6195708 5766932 5861158 6237272 6696661
$$ packed form
18760E47006k6532j2879J2567k8244M73J4482K1821K9137L8640P192l242J9674
18748F20095M1193O9066J06460J60256J90618J24906J19340Q3738K5245l3851
18738A507066j9525j1682J6158M8202M1827M443n241M3570J42843J85444J88599
18727B141704K49699L95088N39997P38714J065442J620400K374136L632380N863937
18718A8621497R187365J2556968J3911070J0625416L615733m475354j1099420
18711E2943275j2987297j1727223q617799n621717l517344k288394j533949j043281
18703E606271p58068n38542l20810j79075j2615J87261N33707J034716J642176
18694G195021J673328L40743q87440j181041r44903m28776R4226L76114M59389
$$ plain form
18685 6696661 7099075 7077378 6690239 6124224 5420490 4765933 4261728 4018617 4085763 4387127
18675 4387127 4900859 5696412 6948592 8775876 11476167 15692586 22490239 33314409
18667 33314409 48568468 66148062 80710983 86984019 83222101 70482610 54103270
18660 54103270 38616175 26610309 18526809 13460206 10245941 8118138 6681463 5656150
18652 5656150 4865559 4275197 3842283 3527709 3343036 3216789 3241732 3452865 3910364 4819406
18642 4819406 6275126 7756021 8293257 8074424 7506077 6631917 5734347 4823219 3966981
18633 3966981 3260704 2696423 2323958 2074747 1900107 1799544 1777787 1839749 1956762 2194033
18623 2194033 2534420 3007416 3750669 4903019 6745261 9745018 14431770 20579647 26955711
$$ packed form
18685F696661M02414k1697l87139n66015p03734o54557n04205k43111O7146L01364
18675D387127N13732P95553J252180J827284K700291M216419O797653J0824170
18667C3314409J5254059J7579594J4562921O273036l761918j2739491j6379340
18660E4103270j5487095j2005866q083500n066603l214265k127803j436675j025313
18652E656150p90591n90362m32914l14574j84673j26247K4943K11133M57499R09042
18642D819406J455720J480895N37236k18833n68347q74160q97570r11128q56238
18633C966981p06277n64281l72465k49211j74640j00563k1757O1962J17013K37271
18623B194033L40387M72996P43253J152350J842242K999757M686752O147877O376064
$$ plain form
18614 26955711 31162811 31636838 27771566 21716832 15485556 10548601 7251825 5173653
18606 5173653 3868774 3027042 2456668 2036223 1733910 1516529 1342372 1200247 1123288
18597 1123288 1057162 1024022 952777 894638 851014 828272 786484 733492 706065 760368 809716
18586 809716 792151 720775 659931 588067 510045 462048 395021 334592 329982 332564 358296 400778
18574 400778 392515 363204 352550 372717 378760 375234 396107 400685 338636 291659 225425 186628
18562 186628 178881 154139 153764 163733 136170 129473 94807 60731 68850 89952 116377 111991 54492
18549 54492 33727 69892 83117 99164 88641 99358 142905 159591 153690 123193 113993 120758
18537 120758 114566 154195 201823 215262 230561 204049 180343 156395 156835 149506 156878 166390 195041
$$ packed form
18614B6955711M207100M74027l865272o054734o231276m936955l296776k078172
18606E173653j304879q41732n70374m20445l02313k17381j74157j42125p6959
18597A123288o6126l3140p1245n8139m3624k2742m1788n2992k7427N4303M9348
18586H09716j7565p1376o0844p1864p8022m7997o7027o0429m610K582K5732M2482
18574D00778q263k9311j0654K0167O043l526K0873M578o2049m6977o6234l8797
18562A86628p747k4742l75R969k7563o697l4666l4076Q119K1102K6425m386n7499
18549E4492k0765L6165J3225J6047j0523J0717M3547J6686n901l0497r200O765
18537A20758o192L9629M7628J3439J5299k6512k3706k3948M40p329P372R512K8651
$$ plain form
18524 195041 197184 170808 172648 166763 128593 126953 144364 147016 118760 93983 78402 83525 70532
18511 70532 16911 -26107 -43826 -59530 -38328 -51647 -56211 -20974 -14461 930 6318 13372
18499 13372 -9672 -40078 -3532 11038 12429 27456 37578 67315 51705 46182 25591 14839
18487 14839 30437 35683 27367 -1621 18729 33079 2231 -9352 30093 43225 30323 24464
18475 24464 45006 33452 42641 16294 -3436 15640 33485 24959 8962 29615 52988 79589
18463 79589 57547 27318 19024 36893 42574 34802 41793 23304 45745 72719 72458 112062 132151
18450 132151 162170 193659 222734 256700 283201 283554 321806 434221 532658 569069 581932 554195
18438 554195 466743 383097 387040 430618 468010 514753 554506 544679 529001 509880 432283 379155
$$ packed form
18524A95041K143k6376J840n885l8170j640J7411K652k8256k4777j5581N123j2993
18511G0532n3621m3018j7719j5704K1202j3319m564L5237O513J5391N388P054
18499A3372k3044l0406L6546J4570J391J5027J0122K9737j5610n523k0591j0752
18487A4839J5598N246q316k8988K0350J4350l0848j1583L9445J3132j2902n859
18475B4464K0542j1554R189k6347j9730J9076J7845q526j5997K0653K3373K6601
18463G9589k2042l0229q294J7869N681p772O991j8489K2441K6974k61L9604K0089
18450A32151L0019L1489K9075L3966K6501L53L8252J12415R8437L6411J2863k7737
18438E54195q7452q3646L943M3578L7392M6743L9753r827j5678j9121p7597n3128
$$ plain form
18426 379155 337830 294180 318523 320878 287854 237528 229868 224861 258395 274797 251261 215832
18414 215832 232182 205439 165445 93464 55592 31582 66744 81995 96789 112747 142387
18403 142387 166081 215752 211766 183896 163651 202162 233752 267253 300728 348404 346719 353946
18391 353946 336175 335611 325145 336533 356087 340330 337298 342644 310051 298934 260399 205533
18379 205533 181880 152494 142721 147287 154022 171146 136106 106375 86241 51874 25388 20442
18367 20442 17457 5181 37134 1843 12409 42730 71166 60677 38087 25187 20671 34652
18355 34652 73548 54473 28965 34443 75553 130604 131303 126286 125115 119667 99590 111117 102802
18342 102802 62043 82787 116799 99227 109510 115249 125302 160206 151663 170475 156226 153050
$$ packed form
18426C79155m1325m3650K4343K355l3024n0326p660n007L3534J6402k3536l5429
18414B15832J6350k6743l9994p1981l7872k4010L5162J5251J4794J5958K9640
18403A42387K3694M9671l986k7870k0245L8511L1590L3501L3475M7676j685P227
18391C53946j7771n64j0466J1388J9554j5757l032N346l2593j1117l8535n4866
18379B05533k3653k9386r773M566O735J7124l5040k9731k0134l4367k6486m946
18367B0442k985j2276L1953l5291J0566L0321K8436j0489k2590j2900m516J3981
18355C4652L8896j9075k5508N478M1110N5051O99n017j171n448k0077J1527q315
18342A02802m0759K0744L4012j7572J0283N739J0053L4904q543J8812j4249l176
$$ plain form
18330 153050 146341 99351 111272 167867 169846 126053 118894 131788 121385 92171 41701 -4034
18318 -4034 -1531 7736 8614 12568 51165 71333 24549 16848 28681 10545 -21940 -54815 -58659
18305 -58659 -43921 -69542 -93234 -110685 -68697 -37883 -55737 -64371 -58679 -47321 -55796 -24005
18293 -24005 28094 62292 28572 -23541 -65353 -109443 -84972 -42963 -11818 -35603 -45887 -41639
18281 -41639 -10204 -33297 -16806 -1943 -16805 -22179 48038 82611 80548 77065 60612 30357
18269 30357 8575 -12636 -38632 -47154 -9787 42415 73601 67616 42937 30724 -733 -37774
18257 -37774 -47657 -46012 -7432 25106 24561 26077 7771 -19924 -30730 -35390 9766 54876 52127
18244 52127 28928 22823 14281 19142 2042 11083 25933 34316 68610 28621 1610 -27876 -6494
$$ packed form
18330A53050o709m6990J1921N6595J979m3793p159J2894j0403k9214n0470m5735
18318d034K503R267Q78L954L8597K0168m6784p701J1833j8136l2485l2875l844
18305e8659J4738k5621k3692j7451M1988L0814j7854q634N692J1358q475L1791
18293b4005N2099L4198l3720n2113m1812m4090K4471M2009L1145k3785j0284M248
18281d1639L1435k3093J6491J4863j4862n374P0217L4573k063l483j6453l0255
18269C0357k1782k1211k5996q522L7367N2202L1186n985k4679j2213l1457l7041
18257c7774r883J645L8580L2538n45J516j8306k7695j0806m660M5156M5110k749
18244E2127k3199o105q542M861j7100R041J4850Q383L4294l9989k7011k9486K1382
$$ plain form
18231 -6494 2425 -17266 -29800 -20542 -20434 -14025 12376 9588 16522 3533 2744 18179 9211 4623
18217 4623 14464 -4876 -26814 -58472 -63454 -66824 -54450 -23154 34193 68789 60346 25641 -16457
18204 -16457 -10922 10168 10917 8794 3308 8719 49281 84732 87722 113433 111455 113734 190538
18191 190538 240990 283244 260824 225344 184004 119572 87803 97277 105494 83819 78844 73394
18179 73394 94959 116795 127291 79242 19707 6220 17738 28829 36505 36083 22961 25827
18167 25827 31714 41991 60825 51087 57668 23591 22130 83608 97705 78028 81756 33739 47672
18154 47672 64200 41452 68715 131869 160723 181344 188949 195294 199191 230027 295242 353164
18142 353164 419721 505452 594452 677116 662280 585547 493050 434166 386539 390643 408557 439340
$$ packed form
18231f494Q919j9691j2534R258J08O409K6401k788O934j2989p89J5435q968m588
18217D623R841j9340k1938l1658m982l370J2374L1296N7347L4596q443l4705m2098
18204a6457N535K1090P49k123n486N411M0562L5451K990K5711j978K279P6804
18191A90538N0452M2254k2420l5480m1340o4432l1769R474Q217k1675m975n450
18179G3394K1565K1836J0496m8049n9535j3487J1518J1091P676m22j3122K866
18167B5827N887J0277J8834r738O581l4077j461O1478J4097j9677L728m8017J3933
18154D7672J6528k2748K7263O3154K8854K0621P605O345L897L0836O5215N7922
18142C53164O6557Q5731Q9000Q2664j4836p6733r2497n8884m7627M104J7914L0783
$$ plain form
18130 439340 477311 513917 547170 573796 642705 708005 765615 826638 989704 1157034 1357823
18119 1357823 1592539 1943090 2402812 3034586 4045229 5555969 8079081 12758492 21703257
18110 21703257 38336530 60958962 67358968 54619440 38926811 23205480 13860533
18103 13860533 9182449 6618484 5048777 4007968 3285008 2749561 2337782 1998622 1738359
18094 1738359 1515061 1345901 1231437 1106642 1043388 973176 883107 770454 655687 596887
18084 596887 515228 436676 338848 299601 267763 260095 254228 242797 229176 219186 166684 133539
18072 133539 113707 139106 94725 46559 20564 80627 121216 107744 102032 123359 131344 109164
18060 109164 96772 83842 69936 59734 43144 1750 839 12794 19942 20635 -24138 -27722 -35522
$$ packed form
18130D39340L7971L6606L3253K6626O8909O5300N7610O1023J63066J67330K00789
18119A357823K34716L50551M59722O31774J010643J510740K523112M679411Q944765
18110B1703257J6633273K2622432O400006j2739528j5692629j5721331r344947
18103A3860533m678084k563965j569707j040809p22960n35447m11779l39160k60263
18094A738359k23298j69160j14464j24795o3254p0212r0069j12653j14767n8800
18084E96887q1659p8552r7828l9247l1838p668n867j1431j3621r990n2502l3145
18072A33539j9832K5399m4381m8166k5995O0063M0589j3472n712K1327P985k2180
18060A09164j2392j2930j3906j0202j6590m1394r11J1955P148O93m4773l584p800
$$ plain form
18047 -35522 -47056 -45118 -60599 -46496 -33271 -9617 21827 58875 79384 86431 96168 42717
18035 42717 -16359 -23425 -6774 -31231 -66789 -30898 -9451 -15790 -2039 26103 5281 -47532
18023 -47532 -67918 -35872 -24269 -20702 -33611 -20844 -9667 -4274 -41127 -63644 -54943 -38691
18011 -38691 -17977 3186 -23946 -71396 -81936 -58774 -60874 -32503 -7793 -24945 16654 5623
17999 5623 -3625 642 30671 12690 -26608 -7445 17358 44668 49762 27096 28717 5931 7572
17986 7572 26088 33148 37063 -1525 -20729 8054 18408 3431 -32712 -26071 -35716 -32606 -58652
17973 -58652 -68917 -53459 -58185 -74692 -63519 -15325 2342 -1097 -29159 -71031 -81394 -58414
17961 -58414 -49388 -86635 -107944 -85131 -73183 -76222 -57926 -50120 -32241 -63386 -106205 -73441
$$ packed form
18047c5522j1534J938j5481J4103J3225K3654L1444L7048K0509P047R737n3451
18035D2717n9076p066J6651k4457l5558L5891K1447o339J3751K8142k0822n2813
18023d7532k0386L2046J1603L567j2909J2767J1177N393l6853k2517Q701J6252
18011c8691K0714K1163k7132m7450j0540K3162k100K8371K4710j7152M1599j1031
17999E623r248M267L0029j7981l9298J9163K4803K7310N094k2666J621k2786J641
17986G572J8516P060L915l8588j9204K8783J0354j4977l6143O641r645L110k6046
17973e8652j0265J5458m726j6507J1173M8194J7667l439k8062m1872j0363K2980
17961e8414R026l7247k1309K2813J1948l039J8296P806J7879l1145m2819L2764
$$ plain form
17949 -73441 -41020 -41976 -39331 -15097 14231 17777 220 -1923 21379 7881 -9250 -38361 -38277
17936 -38277 9614 25235 15340 -21098 -49269 -30672 -9347 2301 18111 7178 -2081 -8858
17924 -8858 -11699 -22601 -33205 -37273 -32520 -63106 -94416 -79247 -84553 -96730 -84457 -86130 -81339
17911 -81339 -34742 -38725 -33648 -32596 -41902 -21332 -656 -34761 -48562 -42861 -33900 -37786 11144
17898 11144 38061 -13411 -15856 -569 -13146 -44382 -40485 -55787 -88678 -90785 -83962 -50420
17886 -50420 -20071 -25967 -50001 -66134 -83009 -46302 -28423 -29628 -38694 -62733 -99305 -92318
17874 -92318 -58391 -22960 -59830 -33381 -17027 -26449 -17337 -47758 -55211 -67197 -70271 -37504
17862 -37504 7568 -12803 -25472 -6947 21146 18337 -24835 -24674 -23326 -47765 -40000 -35986 -60105
$$ packed form
17949g3441L2421r56K645K4234K9328L546j7557k143K3302j3498j7131k9111Q4
17936c8277M7891J5621r895l6438k8171J8597K1325J1648J5810j0933r259o777
17924h858k841j0902j0604m068M753l0586l1310J5169n306j2177J2273j673M791
17911h1339M6597l983N077J052r306K0570K0676l4105j3801N701Q961l886M8930
17898A1144K6917n1472k445J5287j2577l1236L897j5302l2891k107O823L3542
17886e0420L0349n896k4034j6133j6875L6707J7879j205r066k4039l6572O987
17874i2318L3927L5431l6870K6449J6354r422R112l0421p453j1986l074L2767
17862c7504M5072k0371j2669J8525K8093k809m3172J61J348k4439P765M014k4119
$$ plain form
17849 -60105 -37501 -51146 -35018 -1701 12799 10423 17538 -4270 -24154 -29483 -37476 -35515 973
17836 973 -1408 3114 5207 -38670 -52390 -40681 -23582 -16502 11779 18722 13774 -2695 -23954
17823 -23954 -52706 -50314 -36016 -47904 -53167 -24233 1205 -9019 -33771 -48679 -68726 -50519
17811 -50519 -10286 2516 1397 -5048 6939 -6414 -19505 -11355 -24532 -51937 -15310 36201
17799 36201 58573 62842 2490 -45093 -22538 5947 4522 2421 4283 -5051 -27974 -46647 -31938
17786 -31938 -40528 -38547 -33347 -32067 -12593 18536 38535 67050 52032 25396 8341 42746
17774 42746 37560 10053 -21521 -21477 2529 -9218 -25808 -12122 14710 -16375 -49156 -42706 -54787
17761 -54787 -33082 -46911 -69463 -83998 -71763 -39415 -21513 -31242 -5011 -12046 -1133 23954
$$ packed form
17849f0105K2604j3645J6128L3317J4500k376P115k1808j9884n329p993J961L6488
17836I73k381M522K093m3877j3720J1709J7099P080K8281O943m948j6469k1259
17823b3954k8752K392J4298j1888n263K8934K5438j0224k4752j4908k0047J8207
17811e0519M0233J2802j119o445J1987j3353j3091Q150j3177k7405L6627N1511
17799C6201K2372M269o0352m7583K2555K8485j425k101J862r334k2923j8673J4709
17786c1938q590J981N200J280J9474L1129J9999K8515j5018k6636j7055L4405
17774D2746n186k7507l1574M4K4006j1747j6590J3686K6832l1085l2781O450j2081
17761e4787K1705j3829k2552j4535J2235L2348J7902r729K6231p035J0913K5087
$$ plain form
17749 23954 40404 16034 -59963 -53728 -20247 4466 40198 22681 -3371 6465 39121 55533
17737 55533 31664 25873 13091 7496 2991 1711 -777 -1653 23676 13780 26974 20283 6750
17724 6750 21672 30836 10884 -17907 -48577 -16145 -7521 -34255 -43497 -42749 -43373 -60778 -76175
17711 -76175 -80697 -54445 -65294 -57570 -24103 -5923 -50121 -37994 -21888 -30214 -51674 -29876
17699 -29876 -9700 -41511 -65858 -31273 -9849 -9783 -12073 -31899 -31073 -38646 -44863 -69712 -87160
17686 -87160 -100038 -60603 -53618 -49343 -51740 -33994 -9387 9961 13281 11101 -18522 -11520 1654
17673 1654 -43867 -45847 -14909 30863 64329 67115 66692 28208 36691 71663 76683 25907 -20329
17660 -20329 -32901 -17571 6321 27617 3757 -20535 -12765 -34560 -47897 -77446 -53681 -55715
$$ packed form
17749B3954J6450k4370p5997O235L3481K4713L5732j7517k6052R836L2656J6412
17737E5533k3869n791j2782n595m505j280k488q76K5329r896J3194o691j3533
17724F750J4922R164j9952k8791l0670L2432Q624k6734r242P48o24j7405j5397
17711g6175m522K6252j0849P724L3467J8180m4198J2127J6106q326k1460K1798
17699b9876K0176l1811k4347L4585K1424O6k290j9826Q26p573o217k4849j7448
17686h7160j2878L9435O985M275k397J7746K4607J9348L320k180k9623P002J3174
17673A654m5521j980L0938M5772L3466K786m23l8484Q483L4972N020n0776m6236
17660b0329j2572J5330K3892K1296k3860k4292P770k1795j3337k9549K3765k034
$$ plain form
17648 -55715 -8620 4892 -6448 318 9976 26132 34453 473 -4434 -38581 -42719 -31773 -12652
17635 -12652 -15359 -14769 -8827 9523 2946 -13453 -36576 -13753 22047 54067 44689 23180 -11904
17622 -11904 -21131 -23605 -19833 -35498 -64356 -66639 -65262 -37354 -20300 -10932 -35156 -51168 -44205
17609 -44205 -20510 -15945 8697 11305 3308 -10911 -41697 -37436 -25764 -12135 -12548 -26386 -21104
17596 -21104 -9111 24331 33418 43569 52218 45004 31976 28662 11943 -20843 -17977 -1242 14555
17583 14555 8551 -6732 -5285 -5747 -5241 25885 52622 21048 18743 59899 41667 30910 -988
17570 -988 5088 38615 34304 6626 5212 17349 1466 -19960 -23681 -51329 -63736 -55702 -25025
17557 -25025 -26767 -20833 -6279 -3345 25609 12068 15451 15181 3687 -18586 -26527 -21179 -77
$$ packed form
17648e5715M7095J3512j1340O766R658J6156Q321l3980m907l4147m138J0946J9121
17635a2652k707N90N942J8350o577j6399k3123K2823L5800L2020r378k1509l5084
17622a1904r227k474L772j5665k8858k283J377K7908J7054R368k4224j6012O963
17609d4205K3695M565K4642K608p997j4219l0786M261J1672J3629m13j3838N282
17596b1104J1993L3442R087J0151Q649p214j3028l314j6719l2786K866J6735J5797
17583A4555o004j5283J447m62N06L1126K6737l1574k305M1156j8232j0757l1898
17570i88O076L3527m311k7678j414J2137j5883k1426l721k7648j2407Q034L0677
17557b5025j742N934J4554K934K8954j3541L383k70j1494k2273p941N348K1102
$$ plain form
17544 -77 -17144 -48598 -58421 -55476 -21844 -7721 1745 25041 14198 -22870 -21690 -21174 -16566 -21278
17530 -21278 -62577 -75897 -29664 35701 25555 9361 -12227 -55606 -72511 -15026 -42934 -72736
17518 -72736 -37715 -14438 12948 14236 -30388 -43567 -102 14969 -13972 9173 4270 -15952
17506 -15952 -12427 -2307 -14479 -11497 -8339 -18581 -5946 10663 1541 -30594 -27932 -54169 -31963
17493 -31963 19480 42290 34819 -4053 -43921 -25731 -25667 -44442 -38871 -33963 -24421 -33449 -51134
17480 -51134 -68598 -64731 -39437 -34227 -36473 -45181 -31905 9834 39729 16122 12778 16707 14452
17467 14452 8821 -22750 -54939 -47532 -16507 -37000 -29795 -7070 -16467 15639 19745 -21489 -43053
17454 -43053 -23807 -7788 -8277 -27785 -23430 -21944 -12526 5445 20297 58586 152546 249163 340290
$$ packed form
17544g7j7067l1454r823K945L3632J4123R466K3296j0843l7068J180N16M608m712
17530b1278m1299j3320M6233O5365j0146j6194k1588m3379j6905N7485k7908k9802
17518g2736L5021K3277K7386J288m4624j3179M3465J5071k8941K3145m903k0222
17506a5952L525J0120j2172K982L158j0242J2635J6609r122l2135K662k6237K2206
17493c1963N1443K2810p471l8872l9868J8190O4j8775N571M908R542r028j7685
17480e1134j7464L867K5294N210k246q708J3276M1739K9895k3607l344L929k255
17467A4452n631l1571l2189P407L1025k0493P205K2725r397L2106M106m1234k1564
17454d3053J9246J6019m89j9508M355J486R418J7971J4852L8289R3960R6617R1127
$$ plain form
17441 340290 346092 241626 113536 50481 14424 5067 26192 -11717 -26651 -54601 -38291
17430 -38291 -1260 10722 -23332 -44703 -61615 -55771 -34969 2524 11321 32477 60758 73292
17418 73292 17788 -16767 -37415 -15867 11783 12696 150 -8051 -19092 -45634 -50154 -47790 -36358
17405 -36358 -34561 -36278 -42634 -41150 -16814 14655 23799 7807 -8503 -12531 -4155 -13204 -14250
17392 -14250 -18993 -15770 -31740 -332 36733 -4816 -36031 -48547 -41216 -37778 -53553 -72982
17380 -72982 -86327 -56560 -86583 -113653 -72651 -14306 17628 -12302 -9266 11271 2591 -42763
17368 -42763 -75101 -61612 -41174 -29223 11448 16148 -983 -3636 -22044 -18380 22593 59694
17356 59694 55541 30139 26108 8314 12065 2389 -11167 -21574 -39958 -42522 -22683 1460 -2116
$$ packed form
17441C40290N802j04466j28090o3055l6057r357K1125l7909j4934k7950J6310
17430c8291L7031J1982l4054k1371j6912N844K0802L7493Q797K1156K8281J2534
17418G3292n5504l4555k0648K1548K7650R13j2546q201j1041k6542m520K364J1432
17405c6358J797j717o356J484K4336L1469R144j5992j6310m028Q376r049j046
17392a4250m743L223j5970L1408L7065m1549l1215j2516P331L438j5775j9429
17380g2982j3345K9767l0023k7070M1002N8345L1934k9930L036K0537q680m5354
17368d2763l2338J3489K0438J1951M0671M700j7131k653j8408L664M0973L7101
17356E9694m153k5402m031j7794L751r676j3556j0407j8384k564J9839K4143l576
$$ plain form
17343 -2116 10113 -22283 -68504 -51898 -47867 -62659 -75456 -50215 -24573 -3338 15993 7031
17331 7031 12470 30885 15428 -16798 -41281 -37677 244 -284 -4274 -26467 -59004 -46759 -12187
17318 -12187 -22422 -66275 -76989 -92865 -48462 -9567 -9809 -14499 -26733 -27524 -29788 -34297 -76052
17305 -76052 -99032 -85920 -59296 -8521 -10458 -20709 -21023 -14089 -52342 -69154 -54605 -53433 -60349
17292 -60349 -50046 -30434 -37042 -45517 5760 47087 46911 19549 -45416 -63665 -50687 -48258 -63494
17279 -63494 -84854 -37682 -6753 21834 4513 2444 -10891 -21259 -37562 -73086 -79691 -72839
17267 -72839 -66372 -52028 -70561 -78142 -67303 -33912 -8006 1578 -202 7677 -17520 -16975 -12643
17254 -12643 -13953 8248 30489 -12327 -34935 -37632 -18408 2422 -24196 -57460 -62071 -62683 -14171
$$ packed form
17343b116J2229l2396m6221J6606M031j4792j2797K5241K5642K1235J9331q962
17331G031N439J8415j5457l2226k4483L604L7921n28l990k2193l2537J2245L4572
17318a2187j0235m3853j0714j5876M4403L8895k42m690j2234p91k264m509m1755
17305g6052k2980J3112K6624N0775j937j0251l14O934l8253j6812J4549J172o916
17292f0349J0303J9612o608q475N1277M1327j76k7362o4965j8249J2978K429j5236
17279f3494k1360M7172L0929K8587j7321k069j3335j0368j6303l5524o605O852
17267g2839O467J4344j8533p581J0839L3391K5906R584j780P879k5197N45M332
17254a2643j310K2201K2241m2816k2608k697J9224K0830k6618l3264m611o12M8512
$$ plain form
17241 -14171 36693 53030 44604 73081 97513 153467 198708 173457 134983 109902 105065 85533
17229 85533 42282 3754 9269 11820 -52462 -47998 -40939 -41476 -41393 -12406 12834 -12779 -30332
17216 -30332 -37303 -42491 -14732 -2279 -23213 -27172 2045 6849 -20415 -18864 -9601 -54747 -37843
17203 -37843 -13659 -8833 18480 13057 -29490 -31212 -13735 28256 72816 60181 63267 63495 35285
17190 35285 12321 23656 5913 -6826 -10501 -38206 -31572 10610 -11920 -39844 -25791 -40512
17178 -40512 -17697 -14560 -12846 -38048 -70974 -58658 -13657 23851 -25526 -60474 -64344 -26145
17166 -26145 -60143 -67810 -69030 -38236 -17054 -39477 -45353 -28380 -12999 16970 24412 20066 -2734
17153 -2734 -49774 -61400 -37897 6511 11056 33679 47867 34493 8498 14404 11916 -33258
$$ packed form
17241a4171N0864J6337q426K8477K4432N5954M5241k5251l8474k5081m837j9532
17229H5533m3251l8528N515K551o4282M464P059n37Q3K8987K5240k5613j7553
17216c0332o971n188K7759J2453k0934l959K9217M804k7264J551R263m5146J6904
17203c7843K4184M826K7313n423m2547j722J7477M1991M4560j2635L086K28k8210
17190C5285k2964J1335j7743j2739l675k7705O634M2182k2530k7924J4053j4721
17178d0512K2815L137J714k5202l2926J2316M5001L7508m9377l4948l870L8199
17166b6145l3998p667j220L0794K1182k2423n876J6973J5381K9969P442m346k2800
17153b734m7040j1626K3503M4408M545K2623J4188j3374k5995N906k488m5174
$$ plain form
17141 -33258 -37293 -18376 8663 9223 -18102 -38061 -6089 -15865 -38356 -37103 -43963 -65057 -57169
17128 -57169 -33391 -22162 -13002 9244 -1143 -9811 -35693 -68874 -86294 -45261 -13105 -720
17116 -720 17631 -1972 18921 60017 15118 -19836 -2344 -5215 17262 31360 12654 25941
17104 25941 42044 41970 28742 -2956 -57505 -42132 5174 -39201 -39638 -18390 -4814 690 4867
17091 4867 3993 -1784 2383 -2603 -41271 -63488 -24458 -10367 -17288 -43267 -44192 -23552 -8014
17078 -8014 21703 6483 -38966 -51247 -55573 -42513 -25949 1548 -15272 -46465 -38518 -6309
17066 -6309 11899 -1886 -10663 -16139 -6296 7338 8154 -5931 -22942 -47613 -41317 -42109 -57440
17053 -57440 -82177 -82953 -75168 -58164 -58497 -53987 -49658 -16468 -1650 -38006 -66368 -82811 -66339
$$ packed form
17141c3258m035J8917K7039N60k7325j9959L1972r776k2491J253o860k1094P888
17128e7169K3778J1229R160K2246j0387q668k5882l3181j7420M1033L2156J2385
17116g20J8351j9603K0893M1096m4899l4954J7492k871K2477J4098j8706J3287
17104B5941J6103p4j3228l1698n4549J5373M7306m4375m37K1248J3576N504M177
17091D867q74n777M167m986l8668k2217L9030J4091o921k5979r25K0640J5538
17078h014K9717j5220m5449j2281m326J3060J6564K7497j6820l1193P947L2209
17066f309J8208j3785q777n476R843J3634Q16j4085j7011k4671O296p92j5331
17053e7440k4737p76P785J7004l33M510M329L3190J4818l6356k8362j6443J6472
$$ plain form
17040 -66339 -8321 10807 16358 658 -10945 -19749 -19179 -14412 -12072 11651 35639 29960 16029
17027 16029 29575 24631 -3210 -19657 -32785 -39938 -38763 -11654 -18337 -43882 -41507 -61362 -61933
17014 -61933 -28588 -32181 -25843 -36134 -24001 -6450 -1752 -39701 -37778 -1708 26107 16160 -7549
17001 -7549 7838 11929 2761 -47159 -60774 -22831 -4138 -20407 -21265 -29523 -8480 -5292 -17354
16988 -17354 -14014 13099 -9618 -23111 -19227 -36354 -53423 -38041 -18967 -9719 -464 -12595
16976 -12595 -22914 -11998 -9450 -10233 -19690 -13634 -37471 -70742 -67192 -21164 -28174 -53873 -65886
16963 -65886 -59457 -27743 -48431 -33408 -482 5694 -42434 -46697 -40816 -68819 -41162 -31108
16951 -31108 -20236 -45315 -38360 -46824 -39777 -53273 -87881 -92380 -76269 2586 23639 -3968
$$ packed form
17040f6339N8018J9128N551j5700j1603q804N70M767K340K3723K3988n679j3931
17027A6029J3546m944k7841j6447j3128p153J175K7109o683k5545K375j9855n71
17014f1933L3345l593O338j0291J2133J7551M698l7949J923L6070K7815r947k3709
17001g549J5387M091r168m9920j3615L7943J8693j6269q58q258K1043L188j2062
16988a7354L340K7113k2717j3493L884j7127j7069J5382J9074R248R255j2131
16976a2595j0319J0916K548p83r457O056k3837l3271L550M6028p010k5699j2013
16963f5886O429L1714k0688J5023L2926O176m8128m263N881k8003K7657J0054
16951c1108J0872k5079O955q464P047j3496l4608m499J6111P8855K1053k7607
$$ plain form
16939 -3968 -4518 4809 -19888 -23328 -26116 -31753 -47341 -29875 3569 3352 -15563 -51054 -10080
16926 -10080 10245 11218 -12368 -44200 -49984 -50547 -71977 -84450 -67213 -82485 -72206 -32637 -20936
16913 -20936 22825 36896 25403 11209 -14031 -17934 -27004 20499 38600 -3172 -7065 25801
16901 25801 45520 37363 28710 1146 -9203 -16419 -17383 -21748 -10800 8645 18531 25780 31978
16888 31978 25546 16747 -545 11381 18815 33778 2182 -21647 -29423 -19679 -392 8489 16578
16875 16578 14453 10586 29980 12066 -22951 -32569 -21717 12314 23449 -6314 -5545 25494 517
16862 517 -23791 -30749 -42290 -16041 -20206 3552 9142 22197 54505 39414 18731 30647 12828
16849 12828 13000 10206 14756 25392 36108 22827 26778 18474 7908 -41971 -87746 -88788 -72036
$$ packed form
16939c968n50R327k4697l440k788n637j5588J7466L3444k17j8915l5491M0974
16926a0080K0325R73k3586l1832n784n63k1430j2473J7237j5272J0279L9569J1701
16913b0936M3761J4071j1493j4194k5240l903r070M7503J8101m1772l893L2866
16901B5801J9719q157q653k7564j0349p216r64m365J0948J9445R886P249O198
16888C1978o432q799j7292J1926P434J4963l1596k3829p776R744J9287Q881Q089
16875A6578k125l867J9394j7914l5017r618J0852L4031J1135k9763P69L1039k4977
16862E17k4308o958j1541K6249m165K3758N590J3055L2308j5091k0683J1916j7819
16849A2828J72k794M550J0636J0716j3281L951q304j0566m9879m5775j042J6752
$$ plain form
16836 -72036 -39770 -34821 -87459 -89909 -36941 -20548 -21853 -4211 537 -5150 1367 -2950 -19921
16823 -19921 -22346 1651 2646 -12669 -19031 -36438 -55391 -3484 18471 3825 -17398 -18577 -30302
16810 -30302 -40126 -44546 -32312 -30621 -27270 -15122 10695 22309 13372 -12394 -50595 -48998 -38421
16797 -38421 -51865 -72995 -99698 -119769 -134963 -87207 -38109 -36842 -12636 -16068 -32368 -32604
16785 -32604 -7065 22895 8122 2007 9741 19608 -7869 -39618 -47743 -11518 12352 -13941
16773 -13941 -3595 -9112 881 -22122 -42967 -31154 11238 33661 52148 33779 18765 7872
16761 7872 17005 -9322 -33205 -27287 -7710 11278 3956 -34222 -33360 -27686 2587 -325 -3381
16748 -3381 9075 -10667 -47602 -12633 8717 5209 2901 10220 7235 8216 28277 20752 10957
$$ packed form
16836g2036L2266M949n2638k450N2968J6393j305J7642M748n687O517m317j6971
16823a9921k425K3997R95j5315o362j7407j8953N1907K1955j4646k1223j179j1725
16810c0302r824m420J2234J691L351J2148K5817J1614q937k5766l8201J597J0577
16797c8421j3444k1130k6703k0071j5194M7756M9098J267K4206l432j6300k36
16785c2604K5539K9960j4773o115P734R867k7477l1749q125L6225K3870k6293
16773a3941J0346n517R993k3003k0845J1813M2392K2423J8487j8369j5014j0893
16761G872R133k6327k3883N918J9577J8988p322l8178Q62N674L0273k912l056
16748c381J2456j9742l6935L4969K1350l508k308P319k985R81K0061p525r795
$$ plain form
16735 10957 9220 39011 36402 14121 19023 20333 7130 -17512 -21434 -23877 -67098 -46556 -29358
16722 -29358 -18354 -19060 -18418 6156 3391 -934 -13321 -43685 -29626 -8387 10830 100 -45286
16709 -45286 -50275 -18301 -25821 -26889 -15808 -5518 -4935 -27664 -8851 -3688 -18454 -24304 -22386
16696 -22386 -34630 -25376 -12655 14006 4627 26028 42171 37195 -1722 -32200 -31918 -22882 17676
16683 17676 55185 44248 33144 -9074 -17750 -5153 -21819 -32014 -11886 -4376 6235 1349
16671 1349 9461 11319 45482 52891 36852 51466 51836 27126 22571 5167 -8727 -5107 12238
16658 12238 -943 33149 919 -20397 -29287 -28505 -2411 5269 17574 2040 -28202 -23967 -26709
16645 -26709 -14854 -5902 1980 20856 17263 4423 -31359 -6128 15233 4268 -12818 -7579
$$ packed form
16735A0957j737K9791k609k2281M902J310j3203k4642l922k443m3221K0542J7198
16722b9358J1004p06O42K4574k765m325j2387l0364J4059K1239J9217j0730m5386
16709d5286m989L1974p520j068J1081J0290N83k2729J8813N163j4766n850J918
16696b2386j2244R254J2721K6661r379K1401J6143m976l8917l0478K82R036M0558
16683A7676L7509j0937j1104m2218q676J2597j6666j0195K0128P510J0611m886
16671A349Q112J858L4163P409j6039J4614L70k4710m555j7404j3894L620J7345
16658A2238j3181L4092l2230k1316q890P82K6094P680J2305j5534l0242M235k742
16645b6709J1855Q952P882J8876l593j2840l5782K5231K1361j0965j7086N239
$$ plain form
16633 -7579 -4879 9292 45957 51708 -5778 -49138 -46408 -31427 -10856 -13500 -12537 -1524 -26971
16620 -26971 -19933 16673 23889 -197 -17616 -26205 -4165 16087 11840 13356 15975 20268 10754
16607 10754 41934 55934 43971 36294 32875 7760 -6104 -19687 -32730 -42803 -11244 17265
16595 17265 3891 -20423 -14355 -22766 -9114 18436 24963 36487 32186 5357 -18037 -16569 5001
16582 5001 708 -1937 3803 7932 22876 26037 9154 12397 19451 -11998 -24314 -14159 -6827
16569 -6827 -12399 -10620 -53096 -65048 -63115 -36558 -30443 -41985 -42211 -45096 -21031 10901 13544
16556 13544 35334 70246 41638 50860 24170 -421 -19871 -12568 -13184 -10232 -9363 -21664 -57106
16543 -57106 -54896 -9986 -11382 -37258 -18102 7977 7609 -12514 -16753 7371 -323 -3258 -20912
$$ packed form
16633g579K700J4171L6665N751n7486m3360K730J4981K0571k644R63J1013k5447
16620b6971P038L6606P216k4086j7419q589K2040K0252m247J516K619M293r514
16607A0754L1180J4000j1963p677l419k5115j3864j3583j3043j0073L1559K8509
16595A7265j3374k4314O068q411J3652K7550O527J1524m301k6829k3394J468K1570
16582E001m293k645N740M129J4944L161j6883L243P054l1449j2316J0155P332
16569f827n572J779m2476j1952J933K6557O115j1542k26k885K4065L1932K643
16556A3544K1790L4912k8608R222k6690k4591j9450P303o16K952Q69j2301l5442
16543e7106K210M4910j396k5876J9156K6079l68k0123m239K4124p694k935j7654
$$ plain form
16530 -20912 -3616 -22306 -13308 2633 9609 32288 26758 15456 -4793 -33596 -35324 10766
16518 10766 22207 37337 21334 1574 -2687 -11372 14947 13988 11073 3723 14081 -22552 -14883
16505 -14883 -14967 -42873 -36688 -32793 -50409 -41668 -3872 12270 -1965 -2684 26756 43992 38226
16492 38226 27358 18818 31563 52721 66707 66926 33186 13474 7086 7300 14530 -10335 -1459
16479 -1459 -2663 6632 48164 54977 27475 15349 1808 -818 9247 16586 71341 66838 18402
16466 18402 -7832 -19182 -36908 -23586 -21160 -40309 -19139 -28451 -57285 -48565 -33516 -11575
16454 -11575 -5225 -13149 -10333 2109 -20815 -32212 -27348 -38681 -7404 13396 33 -26098
16442 -26098 -18932 -11762 -10647 37545 39470 7688 11992 15755 -24235 -53409 -70414 -81587 -40875
$$ packed form
16530b0912J7296j8690Q998J5941O976K2679n530j1302k0249k8803j728M6090
16518A0766J1441J5130j6003j9760m261q685K6319r59k915p350J0358l6633P669
16505a4883q4k7906O185L895j7616Q741L7796J6142j4235p19K9440J7236n766
16492C8226j0868q540J2745K1158J3986K19l3740j9712o388K14P230k4865Q876
16479a459j204R295M1532O813k7502j2126j3541k626J0065P339N4755m503m8436
16466A8402k6234j1350j7726J3322K426j9149K1170r312k8834Q720J5049K1941
16454a1575O350p924K816J2442k2924j1397M864j1333L1277K0800j3363k6131
16442b6098P166P170J115M8192J925l1782M304L763l9990k9174j7005j1173M0712
$$ plain form
16429 -40875 -18081 5928 39355 39389 21987 16159 -8115 -24291 -42386 -95017 -105155 -60926
16417 -60926 -29995 -27732 -11881 -30437 -24679 -14857 -16390 -11050 -21737 -22354 838 15310 27891
16404 27891 16212 6183 16559 27736 9052 -46592 -42248 -44782 -35022 -24756 -24086 -30217 -12460
16391 -12460 10565 19503 13604 -15013 -12201 13649 10626 11886 9760 -9478 16573 23704 22404
16378 22404 22776 54744 78160 67196 55510 21471 -949 17178 19789 3496 -6044 -32324
16366 -32324 -35559 -25282 -34350 -31325 -32888 -26803 -26197 5239 4790 -1156 2317 5183 10515 14778
16352 14778 16520 19575 18439 23488 45533 44906 43089 33502 36332 18484 4381 -1565 25078 57137
16338 57137 57877 41128 36590 32838 27997 21674 -20532 -44546 -44976 -66596 -39965 -18022 -26547
$$ packed form
16429d0875K2794K4009L3427L4j7402n828k4274j6176j8095n2631j0138M4229
16417f0926L0931K263J5851j8556N758R822j533N340j0687o17K3192J4472J2581
16404B7891j1679j0029J0376J1177j8684n5644M344k534R760J0266O70o131J7757
16391a2460K3025Q938n899k8617K812K5850l023J260k126j9238K6051P131j300
16378B2404L72L1968K3416j0964j1686l4039k2420J8127K611j6293r540k6280
16366c2324l235J0277r068L025j563O085O06L1436m49n946L473K866N332M263
16352A4778J742L055j136N049K2045o27j817r587K830j7848j4103n946K6643L2059
16338E7137P40j6749m538l752m841o323m2206k4014m30k1620K6631K1943q525
$$ plain form
16325 -26547 -33829 -13329 -10883 -32195 -35901 -31269 -34360 -31247 -18586 -28263 -47205 -32844 -42920
16312 -42920 -26585 -4828 17414 20165 12635 9654 4182 -32661 -44500 -25414 -53650 -102374
16300 -102374 -85803 -51201 -36139 -17041 20854 44575 48323 23771 10794 31406 37474 40344
16288 40344 46495 21625 -11014 -11934 9808 13321 -4157 -46964 -53535 -25844 -8837 -30017 -64522
16275 -64522 -40821 1467 3548 -36528 -82612 -92541 -63078 -47158 -14910 -4737 -7930 -9603
16263 -9603 4512 3721 22284 3489 -32068 -37190 -46627 -35145 -16207 5539 15515 -205 -13878
16250 -13878 16075 -4351 -7513 17160 5671 -996 24229 21487 -4779 -46493 -19385 25877
16238 25877 37535 18042 4114 4496 14287 13098 2227 -15936 -12531 -31227 -43946 -59016 -44400
$$ packed form
16325b6547p282K0500K446k1312l706M632l091L113J2661r677j8942J4361j0076
16312d2920J6335K1757K2242K751p530k981n472l6843j1839J9086k8236m8724
16300a02374J6571L4602J5062J9098L7895K3721L748k4552j2977K0612O068K870
16288D0344O151k4870l2639r20K1742L513j7478m2807o571K7691J7007k1180l4505
16275f4522K3701M2288K081m0076m6084r929K9463J5920L2248J0173l193j673
16263i603J4115p91J8563j8795l5557n122r437J1482J8938K1746R976j5720j3673
16250a3878K9953k0426l162K4673j1489o667K5225k742k6266m1714K7108M5262
16238B5877J1658j9493j3928L82R791j189j0871j8163L405j8696j2719j5070J4616
$$ plain form
16225 -44400 -43370 -69399 -90396 -66398 -70391 -64881 -43651 -17170 -5429 -15165 -35448 -54876
16213 -54876 -54614 -78750 -39562 6033 32710 54202 40506 37380 38075 58724 85144 87525 49202
16200 49202 25318 -2458 -10653 -13186 -14552 -20142 -4452 2356 5944 -22904 -35412 1088 24442
16187 24442 11543 -12768 -12180 13253 183 -1142 10913 10632 3826 -3674 -13594 10405 16136
16174 16136 -12389 -13868 -7157 3190 -9796 -5241 -1633 -23909 -36964 -51793 -49858 -76245 -73113
16161 -73113 -44139 -8524 12835 -20712 -17197 -1204 -14994 -21039 -30833 -27770 -1463 35888
16149 35888 29217 -5404 -12510 -33782 -46555 -36600 -13136 -18761 -32639 -41687 -50930 4727 33727
16136 33727 14588 48909 41345 38725 48240 42884 32135 36460 8710 222 -30607 -52985 -36805
$$ packed form
16225d4400J030k6029k0997K3998l993N510K1230K6481J1741r736k0283j9428
16213e4876K62k4136L9188M5595K6677K1492j3696l126O95K0649K6420K381l8323
16200D9202k3884k7776q195k533j366n590J5690O808L588k8848j2508L6500K3354
16187B4442j2899k4311N88K5433j3070j325J2055k81o806p500r920K3999N731
16174A6136k8525j479O711J0347j2986M555L608k2276j3055j4829J935k6387L132
16161g3113K8974L5615K1359l3547L515J5993j3790o045r794L063K6307L7351
16149C5888o671l4621p106k1272j2773R955K3464n625j3878r048r243N5657K9000
16136C3727j9139L4321p564k620R515n356j0749M325k7750q488l0829k2378J6180
$$ plain form
16123 -36805 -36740 -43517 -40838 -16426 -17426 -1354 14327 -22366 -52504 -14339 -1376 16982 25490
16110 25490 18514 -14272 -8539 -4504 14042 25615 7281 14436 11966 -33871 -33854 -30503 3225
16097 3225 1768 -39041 -42272 -16424 -10233 152 2633 3419 21398 32248 34209 21875 11986
16084 11986 -17954 -28181 -32588 -32656 -38514 -64967 -26257 -4823 21320 26588 13742 -7385 -25315
16071 -25315 -37675 -50377 -61293 -65127 -60800 -60963 -65854 -62070 -26548 3758 2630 17327 35289
16058 35289 10752 -10799 15856 -10844 -21183 5650 2469 887 -24330 -28858 -34990 -39514 -14866
16045 -14866 15459 29478 24080 8686 32488 11780 -2568 656 -46263 -30399 -15532 -23498
16033 -23498 -4489 -11239 -38547 -31444 16465 26526 23681 21704 26840 47277 35524 10875 -2600
$$ packed form
16123c6805O5o777K679K4412j000J6072J5681l6693l0138L8165J2963J8358Q508
16110B5490o976l2786N733M035J8546J1573j8334P155k470m5837J7L351L3728
16097C225j457m0809l231K5848O191J0385K481P86J7979J0850J961j2334r889
16084A1986k9940j0227m407o8n858k6453L8710K1434K6143N268j2846k1127j7930
16071b5315j2360j2702j0916l834M327j63m891L784L5522L0306j128J4697J7962
16058C5289k4537k1551K6655k6700j0339K6833l181j582k5217m528o132m524K4648
16045a4866L0325J4019n398j5394K3802k0708j4348L224m6919J5864J4867p966
16033b3498J9009o750k7308P103M7909J0061k845j977N136K0437j1753k4649j3475
$$ plain form
16020 -2600 -19356 -33012 -32800 -33480 -24620 -14389 2867 21483 21889 9510 7057 4055 15937 8683
16006 8683 30793 45566 35186 34872 24462 11059 -14283 -23967 -50538 -42385 -18662 -12654 -11779
15993 -11779 -21669 -21288 1398 -1372 26986 43661 40752 33265 -2497 -28318 -39984 -10509 -9729
15980 -9729 -19338 -35454 -30596 -21661 -35348 -62043 -71895 -46949 -52852 -41677 -32258 882 21543
15967 21543 4085 21478 65285 42983 18958 5672 8485 12262 21046 13629 -1803 29909
15955 29909 25628 -7757 2956 2773 19907 -6204 -32733 -31797 -22814 -22871 -18390 -27438 -14828 -18746
15941 -18746 -43869 -42310 -34775 -27900 -50684 -45503 -27328 -21368 -33193 -24720 8246 22583 45955
15928 45955 30880 -2612 8964 -1106 37358 26300 19308 -4443 -4089 -27187 -45455 -50022
$$ packed form
16020b600j6756j3656K12o80Q860J0231J7256J8616M06j2379k453l002J1882p254
16006H683K2110J4773j0380l14j0410j3403k5342r684k6571Q153K3723O008Q75
15993a1779r890L81K2686k770K8358J6675k909p487l5762k5821j1666K9475P80
15980i729r609j6116M858Q935j3687k6695r852K4946n903J1175R419L3140K0661
15967B1543j7458J7393M3807k2302k4025j3286K813L777Q784p417j5432L1712
15955B9909m281l3385J0713j83J7134k6111k6529R36Q983n7M481r048J2610l918
15941a8746k5123J559P535O875k2784N181J8175N960j1825Q473L2966J4337K3372
15928D5955j5075l3492J1576j0070L8464j1058o992k3751L54k3098j8268m567
$$ plain form
15916 -50022 -56754 -70650 -40992 6692 -14763 -13457 -11976 -19368 -15205 -17821 -18457 2483 -3689
15903 -3689 -22944 -18129 -20607 -19245 -8735 -5016 -28020 8067 25689 28139 40591 25739 -3256
15890 -3256 -23641 28856 -5215 -55479 -62702 -48619 -18875 -8895 3410 15776 759 24552
15878 24552 36743 50026 72625 48544 -9176 3420 36657 55501 72798 63158 22635 -7734
15866 -7734 -18358 15321 34242 10708 29698 41156 8133 -23505 -43453 -14792 42732 41497
15854 41497 21949 7390 -19691 -46205 -45858 -57565 -29088 -10222 -6109 -15790 -19772 -14766 -13146
15841 -13146 -26682 -40432 -27365 21792 29539 23795 28148 45678 23340 15699 17081 25725 14546
15828 14546 -6252 -26771 -33121 -54184 -46522 -9785 -1964 11228 6418 -16980 -5182 -7843 -9506
$$ packed form
15916e0022o732j3896K9658M7684k1455J306J481p392M163k616o36K0940o172
15903c689j9255M815k478J362J0510L719k3004L6087J7622K450J2452j4852k8995
15890c256k0385N2497l4071n0264p223J4083K9744R980J2305J2366j5017K3793
15878B4552J2191J3283K2599k4081n7720J2596L3237J8844J7297r640m0523l0369
15866g734j0624L3679J8921k3534J8990J1458l3023l1638j9948K8661N7524j235
15854D1497j9548j4559k7081k6514L47j1707K8477J8866M113r681l982N006J620
15841a3146j3536j3750J3067M9157P747n744M353J7530k2338p641J382Q644j1179
15828A4546k0798k0519o350k1063P662L6737P821J3192m810k3398J1798k661j663
$$ plain form
15815 -9506 -6295 14633 50115 40156 11425 25138 45833 42508 18701 22906 3809 -14266 12728
15802 12728 -538 -23913 -39969 -42803 -22307 -8154 36346 50701 44153 38030 14644 -3425
15790 -3425 -25572 -10571 3356 27817 29242 9631 -28798 -45368 -29118 -10357 -10916 -22867
15778 -22867 6214 -11255 -24050 -34519 -33156 -932 -1655 -27008 -33849 -19633 -14947 -13554 -11637
15765 -11637 -5995 -12889 -15114 -12565 -18686 -44614 -74816 -60733 -46117 -14486 4043 -1472 21644
15752 21644 64274 75667 56861 24328 -9252 -44249 -18986 -23655 -61519 -54298 -31616 -11754
15740 -11754 14533 32049 34151 36334 31829 -8550 -35275 -41050 -22135 -21118 -31724 -20015 -29987
15727 -29987 -48338 -71121 -45684 -18379 -6581 -6909 5104 27048 -6387 -29133 -23775 -30584
$$ packed form
15815i506L211K0928L5482r959k8731J3713K0695l325k3807M205j9097j8075K6994
15802A2728j3266k3375j6056k834K0496J4153M4500J4355o548o123k3386j8069
15790c425k2147J5001J3927K4461J425j9611l8429j6570J6250J8761n59j1951
15778b2867K9081j7469j2795j0469J363L2224p23k5353o841J4216M686J393J917
15765a1637N642o894k225K549o121k5928l0202J4083J4616L1631J8529n515K3116
15752B1644M2630J1393j8806l2533l3580l4997K5263m669l7864P221K2682J9862
15740a1754K6287J7516K102K183m505m0379k6725n775J8915J017j0606J1709r972
15727b9987j8351k2783K5437K7305J1798l28J2013K1944l3435k2746N358o809
$$ plain form
15715 -30584 -11710 -7858 -10474 8385 2546 -11692 -7709 17898 58856 41074 20328 -16899
15703 -16899 -1995 39146 27302 37436 24494 16888 -13448 6691 15575 23150 15149 -1531
15691 -1531 -45262 -86211 -93278 -68288 -58100 -9859 -20070 -32397 -17725 708 3172 19382
15679 19382 343 -16837 11709 6617 -5646 15046 31127 30607 3413 24506 49392 67102
15667 67102 74214 101010 108263 74511 31407 9536 21922 10773 5992 16983 -16994 -26601
15655 -26601 -12402 20298 46727 19933 -2346 -2478 2728 8513 2733 -4543 -5433 -14894 -3038
15642 -3038 20278 28946 16184 -24726 -52351 -44125 -30091 -41277 -34249 -21024 -18538 -2170 -4801
15629 -4801 5876 -1351 -7790 26132 23119 -235 -18443 -41022 -48779 -33965 -40858 -41719 -80262
$$ packed form
15715c0584J8874L852k616J8859n839j4238L983K5607M0958j7782k0746l7227
15703a6899J4904M1141j1844J0134j2942p606l0336K0139Q884P575q001j6680
15691a531m3731m0949p067K4990J0188M8241j0211j2327J4672J8433K464J6210
15679A9382j9039j7180K8546n092j2263K0692J6081n20k7194K1093K4886J7710
15667F7102P112K6796P253l3752m3104k1871J2386j1149m781J0991l3977r607
15655b6601J4199L2700K6429k6794k2279j32N206N785n780p276q90r461J1856
15642c038K3316Q668j2762m0910k7625Q226J4034j1186P028J3225K486J6368k631
15629d801J0677p227o439L3922l013k3354j8208k2579p757J4814o893q61l8543
$$ plain form
15616 -80262 -62858 -34539 -16041 17162 16703 6266 6134 30583 59879 57929 51291 29437 8942
15603 8942 -7470 36428 87474 100784 84340 51246 45028 32253 24624 -1521 446 26547
15591 26547 31737 -14243 -29335 3181 8670 -11697 -11656 12930 23299 -15853 713 28225 30864
15578 30864 32931 26524 24536 -522 -22576 -26568 -9686 7133 44012 54116 55361 56344 61071
15565 61071 25541 28059 33382 39591 21818 -12097 -60189 -19819 1335 -11150 -23269 2454
15553 2454 7286 49911 59808 33379 19891 523 -1763 28263 32666 11884 -30711 -32625 -13086
15540 -13086 -22712 -52693 -53333 -41714 -20243 -13582 -6107 2175 -2339 -7617 -4347 35908 47683
15527 47683 14353 26518 -8371 -11467 -15054 -5617 47943 59128 20153 5274 -6143 -40577
$$ packed form
15616h0262J7404K8319J8498L3203m59j0437j32K4449K9296j950o638k1854k0495
15603H942j6412M3898N1046J3310j6444l3094o218j2775p629k6145J967K6101
15591B6547N190m5980j5092L2516N489k0367M1K4586J0369l9152J6566K7512K639
15578C0864K067o407j988k5058k2054l992J6882J6819L6879J0104J245R83M727
15565F1071l5530K518N323O209j7773l3915m8092M0370K1154j2485j2119K5723
15553B454M832M2625R897k6429j3488j9368k286L0026M403k0782m2595j914J9539
15540a3086r626k9981o40J1619K1471O661P475Q282m514n278L270M0255J1775
15527D7683l3330J2165l4889l096l587R437N3560J1185l8975j4879j1417l4434
$$ plain form
15515 -40577 -30218 -19178 -38398 -39327 -35543 -24780 -17667 -3413 11699 41207 32510 35915 18868
15502 18868 -15990 16433 39375 43622 24153 1540 -27885 -7181 20288 44629 32974 2743
15490 2743 14401 -7299 -38744 -24114 17402 33208 47264 31502 -7844 -36245 -35025 -5497
15478 -5497 6511 -22569 -45747 -15518 -2573 -7794 -7961 -8525 -16770 -40093 -42366 -46128 -51185 -8000
15464 -8000 18727 -3357 -20331 -29663 -31548 10677 40491 16566 16209 13559 19380 25150 37477
15451 37477 22732 919 5978 3787 19626 56361 26231 23324 20766 6539 -4075 -39866
15439 -39866 -22789 -14420 2581 -16845 -42721 -40823 -12075 3172 14806 31770 41665 20777
15427 20777 35214 87329 75040 53257 39961 33468 13526 6562 23327 21892 -5862 9200
$$ packed form
15515d0577J0359J1040j9220r29L784J0763P113J4254J5112K9508q697L405j7047
15502A8868l4858L2423K2942M247j9469k2613k9425K0704K7469K4341j1655l0231
15490B743J1658k1700l1445J4630M1516J5806J4056j5762l9346k8401J220K9528
15478e497J2008k9080k3178L0229J2945n221j67n64q245k3323k273l762n057M3185
15464h000K6727k2084j6974r332j885M2225K9814k3925l57k650N821N770J2327
15451C7477j4745k1813N059k191J5839L6735l0130k907k558j4227j0614l5791
15439c9866J7077Q369J7001j9426k5876J898K8748J5247J1634J6964R895k0888
15427B0777J4437N2115j2289k1783j3296o493j9942o964J6765j435k7754J5062
$$ plain form
15415 9200 16807 12803 -35948 -57653 -42637 -36301 6446 75586 56704 51127 59958 91746 75515
15402 75515 29321 -15940 -12140 21489 6975 11504 1754 44558 77636 61990 18273 -51360
15390 -51360 -25773 6556 11753 -4037 25814 45587 54680 30808 -3082 2873 -7145 -40322
15378 -40322 -30678 22710 56247 43409 -34372 -45026 -32611 -52589 -49308 -37806 -29839 -13785
15366 -13785 -14357 -12864 -46939 -56613 -18009 -30914 -16981 -15835 -12104 -14889 2999 30020 3023
15353 3023 -16964 -18077 -19922 -25399 -32355 -12434 8623 21824 9742 3942 -1089 -8519 -18209
15340 -18209 -7056 -13796 -10933 -14754 -32761 -30152 -4799 26011 20802 37460 44379 5351 -31062
15327 -31062 -15931 3580 -40522 -38266 -3849 17630 5084 -15880 -27486 3360 13449 18467
$$ packed form
15415I200P607m004m8751k1705J5016O336M2747O9140j8882n577Q831L1788j6231
15402G5515m6194m5261L800L3629j4514M529r750M2804L3078j5646m3717o9633
15390e1360K5587L2329N197j5790K9851J9773R093k3872l3890N955j0018l3177
15378d0322R644N3388L3537j2838p7781j0654J2415j9978L281J1502P967J6054
15366a3785n72J493l4075r674L8604j2905J3933J146L731k785J7888K7021k6997
15353C023j9987j113j845n477o956J9921K1057J3201j2082n800n031p430r690
15340a8209J1153o740K863l821j8007K609K5353L0810n209J6658O919l9028l6413
15327c1062J5131J9511m4102K256L4417K1479j2546k0964j1606L0846J0089N018
$$ plain form
15315 18467 18250 -11237 -18814 -16287 -11484 -27268 -13623 -8011 -3727 12388 -16839 -60921 -32295
15302 -32295 24421 42450 -5110 -14419 6067 9724 42828 34646 -7409 -13351 9550 -8386
15290 -8386 9307 9291 28492 49209 78947 101113 92314 61984 32910 25122 14327 22559 33714
15277 33714 13438 -25579 -49738 -34055 -41895 -19664 -11424 24901 3529 -13523 -733 11539
15265 11539 7171 14445 6543 10779 10741 22033 18615 10836 3076 15207 778 -29429 -29362 3560
15251 3560 24469 25206 25176 28175 42152 12062 1187 38394 34440 33087 54494 42033 37792 37494
15237 37494 48712 50269 19788 27414 21964 21535 30444 10713 17216 7873 4434 -12400 4115
15224 4115 4850 -8691 -45307 -76959 -96059 -78472 -37394 -22907 -33036 -2704 40046 50290
$$ packed form
15315A8467k17k9487p577K527M803j5784J3645N612M284J6115k9227m4082K8626
15302c2295N6716J8029m7560r309K0486L657L3104q182m2055n942K2901j7936
15290h386J7693j6J9201K0717K9738K2166q799l0330k9074p788j0795Q232J1155
15277C3714k0276l9017k4159J5683p840K2231Q240L6325k1372j7052J2790J2272
15265A1539m368P274p902M236l8J1292l418p779p760J2131j4429l0207O7L2922
15251C560K0909P37l0K999J3977l0090j0875L7207l954j353K1407j2461m241k98
15237C7494J1218J557l0481P626n450m29Q909j9731O503r343l439j6834J6515
15224D115P35j3541l6616l1652j9100J7587M1078J4487j0129L0332M2750J0244
$$ plain form
15212 50290 14655 -32250 -50765 -25434 -45354 -56417 -40487 4290 26534 20802 4637 -2944
15200 -2944 -14963 -16227 -26330 -35452 -23069 2792 -9152 -11430 -3080 23009 32317 29680 31919
15187 31919 28821 25501 30102 21189 21748 12740 37544 71486 79781 88372 79289 83426 105536 86373
15173 86373 63116 85674 97142 79063 81165 51827 29681 42032 19482 16901 24697 17586
15161 17586 34943 43801 30482 -2653 -13725 -11554 -35379 -37597 -42779 -31834 -40360 -33940 -17795
15148 -17795 -4074 10359 21266 40784 72694 104107 64310 35479 26179 43641 23822 15445
15136 15445 27065 8169 -9431 -24345 1347 13099 -17471 -18368 -4846 -38332 -51222 -15747
15124 -15747 31753 31929 9078 -15472 -10031 4975 -17441 -12601 -14638 -8678 6155 -21586 -31473
$$ packed form
15212E0290l5635m6905j8515K5331j9920j1063J5930M4777K2244n732j6165p581
15200b944j2019j264j0103r122J2383K5861j1944k278Q350K6089R308k637K239
15187C1919l098l320M601q913N59r008K4804L3942Q295Q591r083M137K2110j9163
15173H6373k3257K2558J1468j8079K102k9338k2146J2351k2550k581P796p111
15161A7586J7357Q858j3319l3135j1072K171k3825k218n182J0945q526O420J6145
15148a7795J3721J4433J0907J9518L1910L1413l9797k8831r300J7462j9819q377
15136A5445J1620j8896j7600j4914K5692J1752l0570q97J3522l3486j2890L5475
15124a5747M7500J76k2851k4550N441J5006k2416M840k037N960J4833k7741r887
$$ plain form
15111 -31473 -22853 -16010 -43049 -26167 -3043 -23429 -28884 -41337 -40793 -42012 -22498 -32357 -57281
15098 -57281 -43042 -3483 22612 33094 40478 19766 6174 29915 50650 74182 43590 28381
15086 28381 17805 21743 23723 187 -35258 -59152 -49210 -23950 7964 26829 38661 9431
15074 9431 -21575 -25748 -14839 14556 2688 925 33722 41631 35071 -20090 -38062 -45333 -23910
15061 -23910 11870 19940 49305 23981 11399 44049 34335 109 2989 30261 34529 57521
15049 57521 85157 65614 25902 9789 -9374 -11006 9557 34328 -3337 -28462 -14263 -9408
15037 -9408 -2753 -19953 -2810 11380 9379 16045 42483 30402 23054 55176 84325 68376 22873
15024 22873 23743 36600 25945 2255 9898 6273 14207 24877 28835 41325 12061 -6685 33497
$$ packed form
15111c1473Q620O843k7039J6882K3124k0386n455j2453N44j219J9514r859k4924
15098e7281J4239L9559K6095J0482P384k0712j3592K3741K0735K3532l0592j5209
15086B8381j0576L938J980k3536l5445k3894R942K5260L1914J8865J1832k9230
15074I431l1006m173J0909K9395j1868j763L2797P909o560n5161j7972p271K1423
15061b3910L5780Q070K9365k5324j2582L2650r714l4226K880K7272M268K2992
15049E7521K7636j9543l9712j6113j9163j632K0563K4771l7665k5125J4199M855
15037i408O655j7200J7143J4190k001O666K6438j2081p348L2122K9149j5949m5503
15024B2873Q70J2857j0655k3690P643l625P934J0670L958J2490k9264j8746M0182
$$ plain form
15011 33497 57724 44622 60353 77589 114333 159755 268219 495213 777102 825800 659154
15000 659154 452052 252713 168933 140540 115771 85952 50361 37041 40713 83947 80552
14989 80552 60283 34164 49185 66083 49683 18217 8457 20628 50857 56758 62047 66580
14977 66580 89762 125198 78543 40164 43309 36252 62729 54410 79572 66398 43261 28684
14965 28684 37943 22105 41565 49023 33314 15202 43227 57457 49413 63149 55311 62568 31469
14952 31469 1330 17678 7698 10173 -8600 -25875 -7991 19154 7884 24137 33091 51985
14940 51985 34737 32193 7591 3004 27027 23086 -7255 8600 -13240 -16008 5863 20898
14928 20898 55347 68199 56177 45071 -252 -15328 3308 -11376 -11897 2059 1039 20624
$$ packed form
15011C3497K4227j3102J5731J7236L6744M5422J08464K26994K81889M8698j66646
15000F59154k07102j99339q3780k8393k4769k9819l5591j3320L672M3234l395
14989H0552k0269k6119J5021J6898j6400l1466r760J2171L0229N901N289M533
14977F6580K3182L5436m6655l8379L145p057K6477q319K5162j3174k3137j4577
14965B8684R259j5838J9460P458j5709j8112K8025J4230q044J3736p838P257l1099
14952C1469l0139J6348r980K475j8773j7275J7884K7145j1270J6253Q954J8894
14940E1985j7248k544k4602m587K4023l941l0341J5855k1840k768K1871J5035
14928B0898L4449J2852j2022j1106m5323j5076J8636j4684n21J3956j020J9585
$$ plain form
14916 20624 56665 65491 57771 48705 18098 -4102 -1096 10305 11928 -1838 13551 9643 -12363
14903 -12363 -39375 8707 54323 43507 28289 63284 60139 61712 39772 35865 38342 19205
14891 19205 29868 47021 36273 16410 46123 55281 51605 63670 67065 50186 25233 50548
14879 50548 48565 34896 33022 -948 -18977 22901 31672 33241 38826 42739 24119 7176 -12071
14866 -12071 13054 20528 16477 22752 37926 26743 761 -2692 -11811 15536 34098 14473 35821
14853 35821 32796 13646 20240 19232 -9950 -2250 10041 -2183 -26669 -38811 -22066 -14079 -16273
14840 -16273 -29697 -19410 -13906 -20912 -11456 1160 2916 -20917 -32945 -8662 -395 35422 63262
14827 63262 53903 61254 37291 4887 23957 53998 67788 81504 77443 49787 66271 67467
$$ packed form
14916B0624L6041Q826p720r066l0607k2200L006J1401J623j3766J5389l908k2006
14903a2363k7012M8082M5616j0816j5218L4995l145J573k1940l907K477j9137
14891A9205J0663J7153j0748j9863K9713R158l676J2065L395j6879k4953K5315
14879E0548j983j3669j874l3970j8029M1878Q771J569N585L913j8620j6943j9247
14866a2071K5125P474m051O275J5174j1183k5982l453r119K7347J8562j9625K1348
14853C5821l025j9150O594j008k9182P700J2291j2224k4486j2142J6745P987k194
14840a6273j3424J0287N504p006R456J2616J756k3833j2028K4283Q267L5817K7840
14827F3262r359P351k3963l2404J9070L0041J3790J3716m061k7656J6484J196
$$ plain form
14815 67467 112915 149238 149179 125920 124447 170840 175334 256472 403253 542040 779603 1063251
14803 1063251 1318271 1542775 1695269 1750357 1692218 1511370 1254298 983057 760470 569800
14793 569800 430923 354071 325188 265594 205328 170387 139418 135731 98865 85979 69268
14782 69268 77657 77178 108220 103486 58449 54986 105502 102855 58871 68810 99568 141660 124100
14769 124100 84586 40766 47186 87034 72436 25070 -1198 -15839 6746 50740 36658 -2101
14757 -2101 19835 58364 53318 30210 8210 17466 29615 33917 29358 8648 -3790 16311 19098
14744 19098 40263 51299 47494 79717 91985 27454 33347 30194 64403 68375 53765 90694
14732 90694 105641 74605 25265 23057 53435 66707 61063 24230 -3946 17497 41925 29010
$$ packed form
14815F7467M5448L6323n9k3259j473M6393M494Q1138J46781J38787K37563K83648
14803A063251K55020K24504J52494N5088n8139j80848k57072k71241k22587j90670
14793E69800j38877p6852k8883n9594o0266l4941l0969l687l6866j2886j6711
14782F9268Q389m79L1042m734m5037l463N0516k647m3984R939L0758M2092j7560
14769A24100l9514m3820O420L9848j4598m7366k6268j4641K2585M3994j4082l8759
14757b101K1936L8529n046k3108k2000R256J2149M302m559k0710j2438K0101K787
14744A9098K1165J1036l805L2223J2268o4531N893l153L4209L972j4610L6929
14732I0694J4947l1036m9340k208L0378J3272n644l6833k8176K1443K4428j2915
$$ plain form
14720 29010 27078 56815 62698 47226 57896 51365 62651 64180 70482 42699 31552 58666 60060
14707 60060 46123 25632 38308 78934 87814 70228 51179 22756 3171 31188 39620 51776
14695 51776 12671 -1007 592 32792 39743 42526 56464 70484 58375 63838 72660 88484 67355
14682 67355 55092 70438 49503 3445 5352 33549 43591 55094 56814 46094 64138 73645
14670 73645 74831 83477 60736 78705 78217 73126 51577 29729 16254 55210 65736 68256 80910
14657 80910 93408 138716 131858 126699 125985 103971 80262 65733 45790 59492 78483 99106
14645 99106 100026 112601 90937 38481 37296 41630 39298 53547 52285 82006 87277 103389 116235
14632 116235 112944 111345 86261 60486 70473 86857 94880 63700 67855 65309 53948 29226 61298
$$ packed form
14720B9010j932K9737N883j5472J0670o531J1286J529O302k7783j1147K7114J394
14707F0060j3937k0491J2676M0626Q880j7586j9049k8423j9585K8017Q432J2156
14695E1776l9105j3678J599L2200O951K783J3938J4020j2109N463Q822J5824k1129
14682F7355j2263J5346k0935m6058J907K8197J0042J1503J720j0720J8044R507
14670G3645J186Q646k2741J7969m88n091k1549k1848j3475L8956J0526K520J2654
14657H0910J2498M5308o858n159p14k2014k3709j4529j9943J3702J8991K0623
14645I9106R20J2575k1664n2456j185M334k332J4249j262K9721N271J6112J2846
14632A16235l291j599k5084k5775R987J6384Q023l1180M155k546j1361k4722L2072
$$ plain form
14619 61298 83942 58681 103163 124067 119035 107469 108643 115955 89732 86535 104073 167765
14607 167765 224869 284203 304366 333510 345852 339420 294896 256281 234963 238193 229093 194793
14595 194793 198493 181977 145222 124944 134965 126649 151776 137729 147958 164100 167643 205373
14583 205373 214332 205895 217543 209692 204498 207916 198259 162012 161823 160602 170832 167463 156815
14570 156815 136443 134216 122807 133126 115398 130067 115785 102506 98516 83916 98736 87113
14558 87113 89240 107490 88610 86520 100092 70431 34066 31273 55842 91936 102592 129612
14546 129612 136970 114154 105080 123109 135447 102754 101958 130509 133247 132409 148581 172770 146276
14533 146276 104149 92717 72258 64597 36286 25871 -2058 -18362 19217 78567 100897 115177
$$ packed form
14619F1298K2644k5261M4482K0904n032j1566J174P312k6223l197J7538O3692
14607A67765N7104N9334K0163K9144J2342o432m4524l8615k1318L230r100l4300
14595A94793L700j6516l6755k0278J0021q316K5127j4047J0229J6142L543L7730
14583B05373Q959q437J1648p851n194L418r657l6247j89j221J0230l369j0648
14570A56815k0372k227j1409J0319j7728J4669j4282j3279l990j4600J4820j1623
14558H7113K127J8250j8880k090J3572k9661l6365k793K4569L6094J0656K7020
14546A29612P358k2816r074J8029J2338l2693p96K8551K738q38J6172K4189k6494
14533A46276m2127j1432k0459p661k8311j0415k7929j6304L7579N9350K2330J4280
$$ plain form
14521 115177 95014 70235 91583 141288 174176 170272 180933 176229 196292 183971 162857 145643
14509 145643 167092 225743 260936 294974 313388 342186 356122 396062 401601 368056 341621 317758
14497 317758 273790 218435 192018 199887 249329 252034 245654 236788 244796 238277 229534 265077 296372
14484 296372 288825 330429 415535 474712 545299 628027 684299 733442 806688 881551 1071037
14473 1071037 1347518 1678377 2045212 2302132 2424586 2439089 2296809 2058674 1740109 1382049
14463 1382049 1080900 844724 704243 548344 442995 395464 392166 397222 383786 387090 365611
14452 365611 365806 349956 343818 331276 289709 276064 300514 279177 297386 321007 304599 297858
14440 297858 327660 332027 362490 433903 414975 400365 378186 354742 385403 403975 456050 456463
$$ packed form
14521A15177k0163k4779K1348M9705L2888l904J0661m704K0063j2321k1114j7214
14509A45643K1449N8651L5193L4038J8414K8798J3936L9940N539l3545k6435k3863
14497C17758m3968n5355k6417P869M9442K705o380q866Q008o519q743L5543L1295
14484B96372p547M1604Q5106N9177P0587Q2728N6272M9143P3246P4863J89486
14473A071037K76481L30859L66835K56920J22454J4503j42280k38135l18565l58060
14463A382049l01149k36176j40481j55899j05349m7531l298N056j3436L304k1479
14452C65611J95j5850o138j2542m1567j3645K4450k1337J8209K3621j6408o741
14440B97858K9802M367L0463P1413j8928j4610k2179k3444L0661J8572N2075M13
$$ plain form
14428 456463 441746 440968 436676 428110 460203 458924 446592 449725 476393 503168 510429 474140 481945
14415 481945 507047 524312 546299 612620 623089 613955 650643 716671 765954 779346 784116 841397
14403 841397 911238 984281 1003256 1038861 1080221 1142602 1160115 1168728 1226518 1267775 1330073 1395515
14391 1395515 1463341 1561659 1678122 1765479 1788428 1832605 1932002 2023303 2111512 2256389 2443297
14380 2443297 2641318 2865010 3101281 3370866 3687033 4088367 4613749 5305884 6233483
14371 6233483 7349141 8625667 10028962 11419308 12752828 13898759 14951127 16098544
14363 16098544 17630263 19904730 23420283 28978740 37963685 52702688 76569762 111840177
14355 111840177 157348390 210763072 263938762 307086122 332796499 333541782 310545072
$$ packed form
14428D56463j4717p78m292q566L2093j279j2332L133K6668K6775P261l6289P805
14415D81945K5102J7265K1987O6321J0469r134L6688O6028M9283J3392M770N7281
14403H41397O9841P3043J8975L5605M1360O2381J7513Q613N7790M1257O2298O5442
14391A395515O7826R8318J16463Q7357K2949M4177R9397R1301Q8209J44877J86908
14380B443297J98021K23692K36271K69585L16167M01334N25382O92135R27599
14371F233483J115658J276526J403295J390346J333520J145931J052368J147417
14363A6098544J531719K274467L515553N558457Q984945J4739003K3867074L5270415
14355A11840177M5508213N3414682N3175690M3147360K5710377P45283k2996710
$$ plain form
14348 310545072 269404823 218342745 166704895 121245032 86598130 62572702 47003186
14341 47003186 37128896 30728555 26435951 23468409 21376625 19736047 18267410 16750173
14333 16750173 15098860 13338805 11545387 9846113 8359413 7203027 6300835 5585938
14325 5585938 5003201 4500911 4083806 3778337 3492667 3216890 2943231 2723668 2492520
14316 2492520 2274311 2093064 1903294 1780490 1670550 1591278 1504836 1426388 1371771 1311414
14306 1311414 1241623 1180968 1148529 1124883 1102273 1032221 968477 916794 882617 815693 742271
14295 742271 708830 694311 667604 645833 621557 577386 564378 595566 601975 565032 534677 539998
14283 539998 504944 501124 494682 464118 441104 442025 421905 408904 382265 361085 384176 394580
$$ packed form
14348C10545072m1140249n1062078n1637850m5459863l4646902k4025428j5569516
14341D7003186r874290o400341m292604k967542k091784j640578j468637j517237
14333A6750173j651313j760055j793418j699274j486700j156386r02192p14897
14325E585938n82737n02290m17105l05469k85670k75777k73659k19563k31148
14316B492520k18209j81247j89770j22804j09940p9272q6442p8448n4617o0357
14306A311414o9791o0655l2439k3646k2610p0052o3744n1683l4177o6924p3422
14295G42271l3441j4519k6707k1771k4276m4171j3008L1188O409l6943l0355N321
14283E39998l5054l820o442l0564k3014R21k0120j3001k6639k1180K3091J0404
$$ plain form
14271 394580 374603 351511 315532 289135 307919 307461 296877 283346 285913 267130 268838 275951
14259 275951 302078 288066 303019 302599 291908 273883 223715 208410 182582 141087 138892 181941
14247 181941 191446 183593 166017 199782 224431 221001 204354 213607 201553 174883 161729 186827
14235 186827 183899 193976 231974 267967 275192 266528 297042 337920 344284 307858 290203 274635
14223 274635 260860 242912 221456 153860 101266 93618 107213 97483 101814 77438 40441 46412
14211 46412 77867 76870 69909 111847 100382 50588 47322 41203 3033 -9576 -57254 -101250 -119603
14198 -119603 -136683 -152653 -122332 -68493 -56229 -18782 22268 57313 95145 64915 42364
14187 42364 22104 35753 52178 76305 67770 83275 97522 142329 161598 171312 161917 154722
$$ packed form
14271C94580j9977k3092l5979k6397J8784m58j0584j3531K567j8783J708P113
14259B75951K6127j4012J4953m20j0691j8025n0168j5305k5828m1495k195M3049
14247A81941R505p853j7576L3765K4649l430j6647R253j2054k6670j3154K5098
14235A86827k928J0077L7998L5993P225q664L0514M0878O364l6426j7655j5568
14223B74635j3775j7948k1456o7596n2594p648J3595r730M331k4376l6997N971
14211D6412L1455r97o961M1938j1465m9794l266o119l8170j2609m7678m3996j8353
14198a19603j7080j5970L0321N3839J2264L7447M1050L5045L7832l0230k2551
14187D2364k0260J3649J6425K4127q535J5505J4247M4807J9269R714r395p195
$$ plain form
14175 154722 152380 155765 136396 109002 110802 139016 153128 169012 145681 148500 177804 174709
14163 174709 188737 164195 153509 161110 166319 162139 137750 87774 56174 34637 41604 42122 34305
14150 34305 38598 21493 19628 17036 24440 43324 41226 40134 62306 80136 81371 52133 40047
14137 40047 48963 14824 -14742 -20165 -18508 -13195 -11461 -16380 -19328 -7406 26651 36658 16827
14124 16827 14259 20553 25058 57043 82860 76021 78803 58456 30051 51548 48188 16600 16455
14111 16455 41668 77294 70360 56425 59295 51387 55444 67492 114993 123545 98044 70033 46878
14098 46878 71609 100161 117856 83699 82588 95414 74572 39191 40399 39960 25089 26004 31647
14085 31647 56750 98117 77429 50560 20610 14581 40627 26452 18286 -4804 -647 376
$$ packed form
14175A54722k342L385j9369k7394J800K8214J4112J5884k3331K819K9304l095
14163A74709J4028k4542j0686P601N209m180k4389m9976l1600k1537O967N18p817
14150C4305M293j7105j865k592P404J8884k098j092K2172J7830J235k9238j2086
14137D0047Q916l4139k9566n423J657N313J734m919k948J1922L4057J0007j9831
14124A6827k568O294M505L1985K5817o839K782k0347k8405K1497l360l1588j45
14111A6455K5213L5626o934j3935K870p908M057J2048M7501Q552k5501k8011k3155
14098D6878K4731K8552J7695l4157j111J2826k0842l5381J208m39j4871R15N643
14085C1647K5103M1367k0688k6869k9950o029K6046j4175q166k3090M157J023
$$ plain form
14073 376 -14435 -14024 18982 28693 36376 42941 50050 29531 29114 23695 42679 26596 -7561 -10186
14059 -10186 48697 67820 57271 45673 9914 38593 40983 41050 47634 46540 32186 33473 26412
14046 26412 -1242 -22887 -16049 -5947 10736 25454 40301 15167 9843 57556 61361 24345
14034 24345 52995 68776 60952 53225 71842 68327 75499 106306 100027 78964 77596 80276 70880
14021 70880 50625 55114 29244 24549 27392 14050 6072 -10434 6485 5618 4280 23661 27643
14008 27643 14858 48871 50650 27834 9997 43623 77458 79177 83836 37613 -445 19502
13996 19502 3354 -4448 18230 27840 33114 56883 91310 119078 81573 81668 90521 128028 133156
13983 133156 84149 77735 79753 28387 -1826 13846 -11671 -37007 -7868 -8330 13926 13833 18142
$$ packed form
14073C76j4811M11L3006R711P683O565P109k0519m17n419J8984j6083l4157k625
14059a0186N8883J9123j0549j1598l5759K8679K390O7O584j094j4354J287p061
14046B6412k7654k1645O838J0102J6683J4718J4847k5134n324M7713L805l7016
14034B4345K8650J5781p824p727J8617l515P172L0807o279k1063j368K680r396
14021G0880k0255M489k5870m695K843j3342p978j6506J6919q67j338J9381L982
14008B7643j2785L4013J779k2816j7837L3626L3835J719M659m6223l8058J9947
13996A9502j6148p802K2678R610N274K3769L4427K7768l7505R5Q853L7507N128
13983A33156m9007o414K018n1366l0213J5672k5517k5336K9139m62K2256r3M309
$$ plain form
13970 18142 37380 56241 62772 57223 34133 23966 31657 1253 -14036 -28339 -31911 -12608
13958 -12608 -3342 5656 13128 46278 78979 75668 41338 3898 -20873 -10263 18613 5154
13946 5154 46760 82680 76912 34563 46 32716 70268 69822 37070 35823 27328 19466 8340
13933 8340 24741 72048 78445 70916 76683 84191 50332 12756 24924 26316 39228 19023 13672
13920 13672 44318 37162 21766 60562 82674 104528 142022 136385 97287 84791 107181 103977
13908 103977 91942 106817 123605 142249 163718 205372 281557 396813 632621 913889 1192815
13897 1192815 1421461 1616071 1751470 1727015 1603972 1416779 1227113 976318 716376 543465
13887 543465 455961 421047 424912 456852 447821 446938 427140 388372 331410 285222 253530 213440
$$ packed form
13970A8142J9238J8861O531n549k3090j0167P691l0404j5289j4303l572J9303
13958a2608R266Q998P472L3150L2701l311l4330l7440k4771J0610K8876j3459
13946E154M1606L5920n768m2349l4517L2670L7552m46l2752j247q495p862j1126
13933H340J6401M7307O397p529N767P508l3859l7576J2168J392J2912k0205n351
13920A3672L0646p156j5396L8796K2112K1854L7494n637l9098j2496K2390l204
13908A03977j2035J4875J6788J8644K1469M1654P6185J15256K35808K81268K78926
13897A192815K28646J94610J35399k4455j23043j87193j89666k50795k59942j72911
13887E43465q7504l4914L865L1940r031q83j9798l8768n6962m6188l1692m0090
$$ plain form
13875 213440 140295 87683 55555 44243 49551 69075 82272 75333 77704 75837 95877 97371
13863 97371 91428 103701 96638 61252 61414 86375 65157 50690 50505 16729 -4822 -22897 -14962
13850 -14962 34768 1052 -9222 -15007 -23668 13921 56200 100393 75533 41891 59556 84949
13838 84949 75089 26017 13605 -9553 19183 45567 91085 100244 77714 47318 59041 54053
13826 54053 19729 23461 5059 3865 -14099 -30975 -13255 14198 53648 59689 56724 46934 33222
13813 33222 4782 9457 9583 39784 30989 30411 -12205 2700 23481 -169 -26216 -58442 -44360
13800 -44360 -22328 -33046 -25611 -17471 -38451 -39451 -17046 -22271 -24547 -37864 -31280 -38238 -31469
13787 -31469 -23681 -18904 -16543 -20140 -30689 -15342 12681 18435 -18674 -10907 -6546 -14609 -17177
$$ packed form
13875B13440p3145n2612l2128j1312N308J9524J3197o939K371j867K0040J494
13863I7371n943J2273p063l5386J62K4961k1218j4467j85l3776k1551j8075P935
13850a4962M9730l3716j0274n785q661L7589M2279M4193k4860l3642J7665K5393
13838H4949r860m9072j2412k3158K8736K6384M5518R159k2530l0396J1723m988
13826E4053l4324L732j8402j194j7964j6876J7720K7453L9450O041k965r790j3712
13813C3222k8440M675J26L0201q795n78m2616J4905K0781k3650k6047l2226J4082
13800d4360K2032j0718P435Q140k0980j000K2405n225k276j3317O584o958O769
13787c1469P788M777K361l597j0549J5347K8023N754l7109P767M361q063k568
$$ plain form
13774 -17177 -2398 -14947 -32512 -7714 43 -19571 -17594 -24294 -65653 -69769 -31229 -31205 -35446
13761 -35446 -28600 3637 37355 52515 83743 80972 39811 2910 -27748 -40016 -36344 -23780
13749 -23780 -25717 -22694 -8416 -10881 -36049 -15540 18416 25827 -1053 -751 25710 26565 15945
13736 15945 7609 17236 -2274 -1833 -24302 -8365 28841 45366 44676 50234 66502 74371 50124
13723 50124 58291 64459 71602 48135 17078 -8230 -6380 6758 39331 33343 7105 4266 37946
13710 37946 35129 10209 -15743 -35121 -64363 -5523 55020 44541 13350 17498 50345 34973
13698 34973 44098 40010 -2402 4108 10312 2014 -1807 15245 18490 26316 39914 -2045 10955
13685 10955 61831 40645 27393 31655 -9379 -17780 -18906 -4031 18282 40815 36612 46907
$$ packed form
13774a7177J4779j2549j7565K4798P757j9614J977o700m1359m116L8540K4m241
13761c5446O846L2237L3718J5160L1228k771m1161l6901l0658j2268L672J2564
13749b3780j937L023J4278k465k5168K0509L3956P411k6880L02K6461Q55j0620
13736A5945q336R627j9510M41k2469J5937L7206J6525o90N558J6268P869k4247
13723E0124Q167O168P143k3467l1057k5308J850J3138L2573n988k6238k839L3680
13710C7946k817k4920k5952j9378k9242N8840O0543j0479l1191M148L2847j5372
13698C4973R125m088m2412O510O204q298l821J7052L245P826J3598m1959J3000
13685A0955N0876k1186j3252M262m1034q401j126J4875K2313K2533m203J0295
$$ plain form
13673 46907 39481 28916 22571 -501 -11592 -2983 16974 33082 20199 18453 48932 43125 -2892
13660 -2892 -51464 -37845 -22174 -15174 -8529 13894 13201 24238 24391 41654 59922 57382 45813
13647 45813 25977 21903 30846 33238 48188 64430 84186 79559 67585 57301 44653 39160 4164
13634 4164 -25358 -3430 -390 3180 4620 9272 12534 -33683 -78186 -86381 -64271 -33952 -23169
13621 -23169 -3928 42052 56983 59290 81486 78023 19709 -19316 -5708 933 -40986 -58146
13609 -58146 -54484 -25624 -6629 -3332 11688 7606 -30804 -32055 -11959 523 -33792 -43256 -42121
13596 -42121 -66923 -73993 -45978 20120 59010 89648 114098 97245 77487 33018 12272 -9829
13584 -9829 -41743 -23774 8699 27140 -12256 -14620 -7500 5545 8971 1376 -9561 789 -25219
$$ packed form
13673D6907p426j0565o345k3072j1091Q609J9957J6108j2883j746L0479n807m6017
13660b892m8572J3619J5671P000O645K2423o93J1037J53J7263J8268k540j1569
13647D5813j9836m074Q943K392J4950J6242J9756m627j1974j0284j2648n493l4996
13634D164k9522K1928L040L570J440M652L262m6217m4503q195K2110L0319J0783
13621b3169J9241M5980J4931K307K2196l463n8314l9025J3608O641m1919j7160
13609e8146L662K8860J8995L297J5020m082l8410j251K0096J2482l4315r464J135
13596d2121k4802p070K8015O6098L8890L0638K4450j6853j9758m4469k0746k2101
13584i829l1914J7969L2473J8441l9396k364P120J3045L426p595j0937J0350k6008
$$ plain form
13571 -25219 -48257 -22228 -1161 42028 62712 48795 -22656 -24908 38456 69638 68209 19440
13559 19440 19084 7779 -2423 -26160 -34461 -17593 14265 25869 36017 -5246 -10784 27445
13547 27445 26964 11444 50729 113624 183986 219063 232986 255035 271165 289104 299330 268436
13535 268436 265627 215329 191150 172972 172929 104740 66274 36096 -4601 27858 48936 61437
13523 61437 41765 49187 68950 87380 83867 77264 85375 54536 57023 56148 28743 24210 8703
13510 8703 -1750 13346 34977 36569 32355 29705 28801 39878 60542 39002 298 -16767 -31242
13497 -31242 -62489 -76425 -54085 -28588 -23411 -1657 14422 -7676 2944 35451 55606 33375
13485 33375 4378 -2346 13013 35169 39693 30632 26119 -9853 -12506 3403 -19699 -13885 10843
$$ packed form
13571b5219k3038K6029K1067M3189K0684j3917p1451k252O3364L1182j429m8769
13559A9440l56j1305j0202k3737q301J6868L1858J1604J0148m1263n538L8229
13547B7445m81j5520L9285O2895P0362L5077J3923K2049J6130J7939J0226l0894
13535B68436k809n0298k4179j8178m3o8189l8466l0178m0697L2459K1078J2501
13523F1437j9672P422J9763J8430l513o603Q111l0839K487q75k7405m533j5507
13510H703j0453J5096K1631J592m214k650r04J1077K0664k1540l8704j7065j4475
13497c1242l1247j3936K2340K5497N177K1754J6079k2098J0620L2507K0155k2231
13485C3375k8997o724J5359K2156M524r061m513l5972k653J5909k3102N814K4728
$$ plain form
13472 10843 391 -24752 -1839 38997 41038 -1868 -58147 -36349 -25409 -14726 -37820 -14899
13460 -14899 -1714 24040 46598 50943 19201 -11152 4968 25462 14035 56994 95924 44892
13448 44892 1039 -14987 -44487 -31800 -38163 -43520 -16165 -752 -8592 -11921 20295 54188
13436 54188 52894 50418 15297 17681 34197 43266 75670 77101 68577 28664 10986 -4201 52703
13423 52703 98817 170468 213428 265426 323155 346836 330533 323160 282422 212151 130138 78916
13411 78916 47573 20463 21568 22029 12735 25101 11330 -37546 -32414 -6018 18533 22122 27106
13398 27106 10857 7897 13033 18453 19926 33438 27800 24351 52967 48196 40302 52413 16510
13385 16510 -1968 3311 -12506 5796 2865 -29244 -17102 24702 49536 70367 78356 92513
$$ packed form
13472A0843j0452k5143K2913M0836K041m2906n6279K1798J0940J0683k3094K2921
13460a4899J3185K5754K2558M345l1742l0353J6120K0494j1427M2959L8930n1032
13448D4892m3853j6026k9500J2687o363n357K7355J5413p840l329L2216L3893
13436E4188j294k476l5121K384J6516R069L2404J431q524l9913j7678j5187N6904
13423E2703M6114P1651M2960N1998N7729K3681j6303p373m0738p0271q2013n1222
13411G8916l1343k7110J105M61r294J2366j3771m8876N132K6396K4551L589M984
13398B7106j6249k960N136N420J473J3512n638l449K8616m771p894J2111l5903
13385A6510j8478N279j5817J8302k931l2109J2142M1804K4834K0831P989J4157
$$ plain form
13373 92513 70381 66011 75437 82438 77521 76373 51510 43088 53495 31998 43014 45954 31575
13360 31575 22160 9557 11738 14114 18222 57946 64659 26105 16045 17606 26329 23512 25552
13347 25552 38408 38349 40314 16724 12576 36834 20671 16103 19237 9470 40788 46363 32136
13334 32136 17353 -5449 -14461 -13922 -9547 19422 -14006 -5452 36648 70905 32893 -10340 -8601
13321 -8601 10215 40436 56313 33091 2968 -1641 4943 13344 4188 -15378 -1179 35075 -2082
13308 -2082 -20076 -10180 -3718 -8748 3985 2546 -13406 198 9330 -4081 -2376 8539 11545
13295 11545 37190 38747 14435 16949 58267 55618 16224 -20675 -32924 -33288 12653 46747 65330
13282 65330 15519 10331 23099 29265 20435 32297 28450 34638 37259 28777 19209 3886 -31409
$$ packed form
13373I2513k2132m370R426P001m917j148k4863q422J0407k1497J1016K940j4379
13360C1575r415j2603K181K376M108L9724O713l8554j0060J561Q723k817K040
13347B5552J2856n9J965k3590m148K4258j6163m568L134r767L1318N575j4227
13334C2136j4783k2802r012N39M375K8969l3428Q554M2100L4257l8012m3233J739
13321h601J8816L0221J5877k3222l0123m609O584Q401r156j9566J4199L6254l7157
13308b082j7994R896O462n030J2733j439j5952J3604R132j3411J705J0915L006
13295A1545K5645J557k4312K514M1318k649l9394l6899j2249l64M5941L4094J8583
13282F5330m9811n188J2768O166q830J1862l847O188K621q482r568j5323l5295
$$ plain form
13269 -31409 -14205 20656 32670 32622 27412 1729 -2640 -948 5276 23423 3316 -3269 10673
13256 10673 -1900 -7985 113 14969 12810 6678 -32942 -33595 37007 68356 73268 86106 76368
13243 76368 19242 35886 75181 43495 -3990 -9522 -2896 9498 16436 5556 5745 -5132 466
13230 466 -2809 6048 23719 64902 35248 21847 30153 19362 1506 -2986 16097 7949 11409
13217 11409 -30157 -5903 14967 21413 27185 44571 54678 50369 55679 50910 25811 17320 32492
13204 32492 54711 63979 92053 127828 158894 191166 274828 348068 396983 366135 315641 285786
13192 285786 244180 205964 149418 120334 114490 81991 65888 78673 59063 20420 -352 1916
13180 1916 2478 19514 31062 22983 7400 -251 -4492 -2147 -30565 -54006 12619 26584 23702
$$ packed form
13269c1409J7204L4861J2014m8n210k5683m369J692O224J8147k0107o585J3942
13256A0673j2573o085Q098J4856k159o132l9620o53P0602L1349M912J2838r738
13243G6368n7126J6644L9295l1686m7485n532O626J2394O938j0880J89j0877N598
13230D66l275Q857J7671M1183k9654j3401Q306j0791j7856m492J9083q148L460
13217A1409m1566K4254K0870O446N772J7386J0107m309N310m769k5099q491J5172
13204C2492K2219R268K8074L5775L1066L2272Q3662P3240M8915l0848n0494k9855
13192B85786m1606l8216n6546k9084n844l2499j6103J2785j9610l8643k0772K268
13180A916N62J7036J1548q079j5583p651m241K345k8418k3441O6625J3965k882
$$ plain form
13167 23702 5170 20266 28721 24647 34658 44020 16199 -26382 -57711 -85189 -71519 -35543
13155 -35543 14180 48137 33026 27491 27672 5363 5039 7878 26457 22124 11985 -2736 -7008
13142 -7008 -142 12392 -579 -17956 -38538 -37930 -74738 -78644 -37751 -20367 -22728 -23305 -9231
13129 -9231 25634 31095 12970 -6581 -5892 -5682 18887 27955 29709 48811 35985 -11392 14313
13116 14313 29540 24893 44648 -3513 -28298 -13555 -13650 -45994 -35976 -8729 -16514 -14210 1918
13103 1918 15984 40402 46453 44349 24389 32175 31369 -14690 -24244 -51929 -61441 -37849 11415
13090 11415 -817 1886 11930 -6021 -42 -8435 -12573 -1064 27932 20970 -3574 7635 24770
13077 24770 27021 27661 65096 53086 43381 59329 68219 66747 36130 -34870 -28166 -3904 5976
$$ packed form
13167B3702j8532J5096Q455m074J0011R362k7821m2581l1329k7478J3670L5976
13155c5543M9723L3957j5111n535J81k2309l24K839J8579m333j0139j4721m272
13142g008O866J2534j2971j7377k0582O08l6808l906M0893J7384k361n77J4074
13129i231L4865N461j8125j9551O89K10K4569R068J754J9102j2826m7377K5705
13116A4313J5227m647J9755m8161k4785J4743r5l2344J0018K7247p785K304J6128
13103A918J4066K4418O051k104j9960P786q06m6059r554k7685r512K3592M9264
13090A1415j2232K703J0044j7951N979q393m138J1509K8996o962k4544J1209J7135
13077B4770K251O40L7435j2010r705J5948Q890j472l0617p1000O704K4262R880
$$ plain form
13064 5976 -5661 9697 27740 33269 21020 21187 3723 15542 2684 -9968 -2299 22238 -5536
13051 -5536 -13033 -4796 26505 36229 2152 25808 27979 17603 4294 20169 37472 67387 57806
13038 57806 49273 57424 46863 54353 83778 77763 58805 29801 -18771 -64364 -69283 -60071 -71694
13025 -71694 -67445 -56954 -23552 25119 46662 55201 61448 52749 26688 -17200 -7327 -23639 8810
13012 8810 -2554 1710 6256 -6703 -19119 23292 -3026 -25535 -16351 12606 22175 13056 5820
12999 5820 17026 26436 15150 7888 -24302 -4903 31183 48710 65356 17520 -3860 18216
12987 18216 19229 -4480 -6785 -25117 -31581 -55583 -32597 -29357 14012 40474 10707 9639 6856
12974 6856 22207 38100 24958 40296 52482 32134 31810 50001 58049 45067 26697 44287
$$ packed form
13064E976j1637J5358J8043N529j2249J67j7464J1819j2858j2652P669K4537k7774
13051e536p497Q237L1301R724l4077K3656K171j0376j3309J5875J7303K9915r581
13038E7806q533Q151j0561P490K9425o015j8958k9004m8572m5593m919R212j1623
13025g1694M249J0491L3402M8671K1543Q539O247q699k6061m3888R873j6312L2449
13012H810j1364M264M546j2959j2416M2411k6318k2509R184K8957R569r119p236
12999E820J1206R410j1286p262l2190J9399L6086J7527J6646m7836k1380K2076
12987A8216J013k3709k305j8332o464k4002K2986L240M3369K6462k9767j068k783
12974F856J5351J5893j3142J5338J2186k0348l24J8191Q048j2982j8370J7590
$$ plain form
12962 44287 36684 4686 -19831 -24169 -8890 19296 4158 22449 67312 55338 44501 22455
12950 22455 -1321 7212 -15700 -16680 -21839 -22511 793 52062 42100 22283 3447 206 -20171
12937 -20171 -4378 13955 15705 29846 53444 45100 40496 31313 15198 30235 64919 37445
12925 37445 -6594 -20834 -20119 -31307 -69281 -54132 -31241 -47541 -21937 24278 26266 33367
12913 33367 -15598 -25217 -7026 1959 -18951 -9149 18600 14710 31745 22079 42689 67684 38308
12900 38308 23116 23950 -1502 -24482 30895 64997 57344 56517 40694 -622 -8518 8732 27303
12887 27303 25149 -10913 -55282 -65302 -68422 -68775 -54147 -28521 -8365 -12977 -21232 -21028 -320
12874 -320 -1052 232 24393 55504 53781 67846 76634 44875 27954 40283 38567 52548 68379
$$ packed form
12962D4287p603l1998k4517m338J5279K8186j5138J8291M4863j1974j0837k2046
12950B2455k3776Q533k2912r80n159o72K3304N1269r962j9817j8836l241k0377
12937b0171J5793J8333J750J4141K3598q344m604r183j6115J5037L4684k7474
12925C7445m4039j4240P15j1188l7974J5149K2891j6300K5604M6215J988P101
12913C3367m8965r619J8191Q985k0910R802K7749l890J7035r666K0610K4995k9376
12900C8308j5192Q34k5452k2980N5377L4102p653q27j5823m1316p896J7250J8571
12887B7303k154l6062m4369j0020l120l53J4628K5626K0156m612q255K04K0708
12874c20p32J284K4161L1111j723J4065Q788l1759j6921J2329j716J3981J5831
$$ plain form
12861 68379 35827 8570 11873 35281 36752 27387 21497 -165 -1771 -27288 -42965 -54451 -76592
12848 -76592 -79132 -54104 -41722 -34756 -24313 -41751 -48534 -64586 -67199 -67837 -64497 -59553 -48885
12835 -48885 -50497 -45888 -18591 -56323 -47000 -41525 -30158 -44161 -56802 -46394 -27410 -18269 -29186
12822 -29186 -61507 -25965 -10351 -14061 -6510 -6043 -21136 -30487 -28607 1099 -9461 -7858 -10456
12809 -10456 -8419 19914 23328 23154 4450 -9237 2886 5612 1368 -11860 -13343 -15518 -5020
12796 -5020 21020 15523 2044 -32851 -22604 6046 -4819 -19663 -9766 16091 30065 37738
12784 37738 20521 739 -9328 31706 26428 14568 1142 -39441 -13896 -13300 -26281 9949
12772 9949 8520 -25989 -21614 12882 -6811 -1437 55350 110569 82669 37486 22511 38011
$$ packed form
12861F8379l2552k7257L303K3408J471r365n890k1662j606k5517j5677j1486k2141
12848g6592k540K5028J2382O966J0443j7438o783j6052k613o38L340M944J0668
12835d8885j612M609K7297l7732R323N475J1367j4003j2641J0408J8984R141j0917
12822b9186l2321L5542J5614l710P551M67j5093r351J880K9706j0560J603k598
12809a0456K037K8333L414j74j8704j3687J2123K726m244j3228j483k175J0498
12796e020K6040n497j3479l4895J0247K8650j0865j4844R897K5857J3974P673
12784C7738j7217j9782j0067M1034n278j1860j3426m0583K5545N96j2981L6230
12772I949j429l4509M375L4496j9693N374N6787N5219k7900m5183j4975J5500
$$ plain form
12760 38011 32561 21284 4664 8175 28401 34289 29539 -5167 -6620 -270 9654 3129 -27353
12747 -27353 -25583 7674 -5918 -30465 -31701 -16645 -33550 -60547 -52727 -35807 -53496 -51775
12735 -51775 -48420 -37868 -5016 7268 4298 32096 48713 91230 82833 45425 81806 144872
12723 144872 261279 469224 709771 710444 563123 395892 223222 99283 87276 96705 67488
12712 67488 26218 27513 25554 -1966 -51813 -33212 -9710 -11476 -37196 -10664 -15525 -24362 -49705
12699 -49705 -37857 -10760 19382 55039 54652 61781 57437 46026 39959 8536 -12243 1376 36348
12686 36348 38552 22095 48719 80270 78570 68537 43435 37417 40191 40944 73100 72480 40405
12673 40405 -4985 -7777 -10939 2058 19633 6401 9234 -25270 -31770 -3700 26646 350
$$ packed form
12760C8011n450j1277j6620L511K0226N888m750l4706j453O350R924o525l0482
12747b7353J770L3257j3592k4547j236J5056j6905k6997P820J6920j7689J721
12735e1775L355J0552L2852J2284k970K7798J6617M2517q397l7408L6381O3066
12723A44872J16407K07945K40547O73j47321j67231j72670j23939j2007R429k9217
12712F7488m1270J295j959k7520m9847J8601K3502j766k5720K6532m861q837k5343
12699d9705J1848K7097L0142L5657l87P129m344j1411o067l1423k0779J3619L4972
12686C6348K204j6457K6624L1551j700j0033k5102o018K774P53L2156o20l2075
12673D0405m5390k792l162J2997J7575j3232K833l4504o500K8070L0346k6296
$$ plain form
12661 350 -21671 -16577 -13406 -11667 19515 26490 16920 -2895 -9080 -675 -4131 -6009 -13388 -904
12647 -904 27685 -5752 -34074 -2207 -8601 -5599 14409 53722 31338 22109 35176 27068 8091
12634 8091 -13437 -23255 -384 9706 -857 -9331 -13619 -18765 -3416 -33055 -49176 -41801 10488
12621 10488 10173 13460 28913 16621 9293 11114 11162 -19286 -15750 18590 7813 24168 20996 22559
12607 22559 5611 840 -43675 -48769 -43619 -54086 -34292 -9626 -26641 -33349 -21367 -42685
12595 -42685 -39931 -14129 80 44650 41308 -1348 -36683 -12325 -6925 -36562 -41729 -9173
12583 -9173 -2872 -36000 -21172 -5293 30065 27549 -27312 -64252 -43940 -40999 -51056 -34782
12571 -34782 -30657 -18338 13959 5360 3043 3519 -17040 27419 70317 25625 5644 37158 18866
$$ packed form
12661C50k2021N094L171J739L1182O975r570j9815o185Q405l456j878p379J2484
12647i04K8589l3437k8322L1867o394L002K0008L9313k2384r229J3067q108j8977
12634H091k1528r818K2871J0090j0563q474m288n146J5349k9639j6121P375N2289
12621A0488l15L287J5453j2292p328J821M8l0448L536L4340j0777J6355l172J563
12607B2559j6948m771m4515n094N150j0467J9794K4666j7015o708J1982k1318
12595d2685K754K5802J4209M4570l342m2656l5335K4358N400k9637n167L2556
12583i173O301l3128J4828J5879L5358k516n4861l6940K0312K941j0057J6274
12571c4782M125J2319L2297q599k317M76k0559M4459M2898m4692j9981L1514j8292
$$ plain form
12558 18866 5214 2081 -11726 -45310 -67354 -56457 -52283 -64827 -74008 -27572 5915 19359
12546 19359 11101 16451 -3355 -18237 -36784 -53855 -58902 -26099 -22284 -33033 -25776 -38156 -47385
12533 -47385 -75432 -63170 -33284 -23496 -26 20635 15728 -2387 -1770 5058 31797 40712 11604
12520 11604 9633 -24929 -65309 -68989 -45711 7329 30808 20979 15305 38180 30719 24247 -15143
12507 -15143 -26307 -27401 -27089 -10388 13184 24442 23671 36753 30328 14166 -19462 15110 33091
12494 33091 22154 -27538 -41578 -17844 18102 34429 26491 28515 32804 13054 12850 7787 -27907
12481 -27907 -30398 -4308 40727 59162 38873 40573 51790 63300 49430 44369 21411 -2168
12469 -2168 3521 24856 40413 43503 19329 -11257 -31272 -12513 -5535 -201 -16211 -58695 -17776
$$ packed form
12558A8866j3652l133j3807l3584k2044J0897M174j2544r181M6436L3487J3444
12546A9359q258N350j9806j4882j8547j7071n047L2803L815j0749P257j2380r229
12533d7385k8047J2262K9886R788K3470K0661m907j8115O17O828K6739Q915k9108
12520A1604j971l4562m0380l680K3278N3040K3479r829n674K2875p461o472l9390
12507a5143j1164j094L12J6701K3572J1258p71J3082o425j6162l3628L4572J7981
12494C3091j0937m9692j4040K3734L5946J6327p938K024M289j9750k04n063l5694
12481b7907k491K6090M5035J8435k0289J700J1217J1510j3870n061k2958k3579
12469b168N689K1335J5557L090k4174l0586k0015J8759O978N334j6010m2484M0919
$$ plain form
12456 -17776 35589 4670 3877 36001 42422 30301 23776 26013 6971 -6218 -18824 -264 20563
12443 20563 33232 1721 -22501 -9804 20339 18600 8597 -11286 -74769 -53553 -22428 -16480
12431 -16480 -16246 4655 21936 18852 16390 3754 15001 24402 28366 13821 -3078 21832 27467
12418 27467 60171 28872 -4129 51624 70211 50373 25644 19502 23850 23126 14831 2239 -38708
12405 -38708 -7615 -2468 -6237 20346 51661 58100 39295 50669 58334 58602 51391 74270 72849
12392 72849 82841 55733 35856 49806 35653 42019 21330 15237 -14166 -57262 -76489 -45431
12380 -45431 -10672 -16988 -33511 -29459 -28975 -7016 2069 17259 11994 -2547 -16355 9327 -6347
12367 -6347 16753 15075 14919 16732 -24247 -50199 -15122 -3823 -10664 2263 7371 -18434 -3184
$$ packed form
12456a7776N3365l0919p93L2124O421j2121o525K237j9042j3189j2606J8560K0827
12443B0563J2669l1511k4222J2697L0143j739j0003j9883o3483K1216L1125N948
12431a6480K34K0901J7281l084k462j2636J1247R401L964j4545j6899K4910N635
12418B7467L2704l1299l3001N5753J8587j9838k4729o142M348p24q295j2592m0947
12405c8708L1093N147l769K6583L1315O439j8805J1374P665K68p211K2879j421
12392G2849R992k7108j9877J3950j4153O366k0689o093k9403m3096j9227L1058
12380d5431L4759o316j6523M052M84K1959R085J5190n265j4541j3808K5682j5674
12367f347K3100j678j56J813m0979k5952L5077J1299o841J2927N108k5805J5250
$$ plain form
12354 -3184 6099 -7459 -19325 -17550 6047 -6754 -13558 -25114 -14204 -7823 16876 13311 11812
12341 11812 13994 -12486 -6165 9976 28622 24716 -5113 -10502 32390 30965 6699 2023 -8538
12328 -8538 -16507 -10829 3987 -1946 40897 36852 761 -27423 -46880 -34388 -52388 -59483 -41238
12315 -41238 -15197 13011 40027 48695 34755 -12058 -52858 -40482 -49950 -57432 -12766 -10527
12303 -10527 8711 47883 77802 75016 70157 26477 -1651 13499 19478 21307 45260 56387
12291 56387 52628 35751 35950 61439 35487 -1590 3719 16875 1409 38685 16944 10481 -4933
12278 -4933 -13209 -803 13439 17650 -14316 -40899 -47289 -38874 -22958 -17941 18852 28973 31851
12265 31851 18965 41179 67146 52897 11650 -582 12630 27314 20771 28170 -6147 -28114
$$ packed form
12354c184R283j3558j1866J775K3597j2801o804j1556J0910O381K4699l565j499
12341A1812K182k6480O321J6141J8646l906k9829n389M2892j425k4266m676j0561
12328h538p969N678J4816n933M2843m045l6091k8184j9457J2492j8000p095J8245
12315d1238K6041K8208K7016Q668j3940m6813m0800J2376r468p482M4666K239
12303a0527J9238L9172K9919k786m859m3680k8128J5150N979J829K3953J1127
12291E6387l759j6877J99K5489k5952l7077N309J3156j5466L7276k1741o463j5414
12278d933q276J2406J4242M211l1966k6583o390Q415J5916N017L6793J0121K878
12265C1851j2886K2214K5967j4249m1247j2232J3212J4684o543P399l4317k1967
$$ plain form
12253 -28114 -3590 25739 23576 29469 34958 20657 -2037 14684 32833 -2676 -20898 -53276
12241 -53276 -74411 -49277 -34828 -49475 -44014 -11661 -24305 -45257 -23969 -14710 -7741 19207
12229 19207 24511 32598 23785 8307 3574 3237 6777 -14818 -12124 5602 -2214 -14889 -35530
12216 -35530 -14391 -17182 -8705 -14347 -30219 -51592 -44359 -46155 -65366 -58258 -55603 -65451 -45281
12203 -45281 -56816 -50963 -47058 -33770 -12544 -8039 -11813 -14325 -11308 5646 -2194 15882 47074
12190 47074 45952 19441 19670 56283 80010 80239 46416 22554 9745 3660 -16929 28809 70277
12177 70277 51369 18915 12685 33756 24781 29495 14267 38047 34991 -9376 -14781 -22191 -6845
12164 -6845 25755 6993 -5016 -23092 -29512 1945 22934 47915 22394 -935 -2755 -18860
$$ packed form
12253b8114K4524K9329k163N893N489j4301k2694J6721J8149l5509j8222l2378
12241e3276k1135K5134J4449j4647N461L2353j2644k0952K1288R259O969K6948
12229A9207N304Q087q813j5478m733l37L540k1595K694J7726p816j2675k0641
12216c5530K1139k791Q477n642j5872k1373P233j796j9211P108K655r848K0170
12203d5281j1535N853L905J3288K1226M505l774k512L017J6954p840J8076L1192
12190D7074j122k6511K29L6613K3727K29l3823k3862j2809o085k0589M5738M1468
12177G0277j8908l2454o230K1071q975M714j5228K3780l056m4367n405p410J5346
12164f845L2600j8762j2009j8076o420L1457K0989K4981k5521k3329j820j6105
$$ plain form
12152 -18860 -33666 -25864 -12433 -11534 -22766 -57324 -59553 -33319 -44927 -31938 -50912 -47930 -22234
12139 -22234 6214 11261 17369 23557 26744 53918 71114 35795 19519 22005 47170 13876 27743
12126 27743 29694 34570 35398 34374 26873 -14905 -34053 -5590 -23997 14387 16182 5332 2045
12113 2045 9457 3629 2676 886 -6010 35268 55003 31063 30972 20313 5900 -1638 -8523 4316
12099 4316 14265 28000 13296 8709 26560 7177 4052 6448 -11762 -44963 -28737 -6690 -34598
12086 -34598 -27209 12558 38338 20769 -663 -27527 -49981 -51493 -33553 -41273 -33045 -38516 -46589
12073 -46589 -25078 -6179 -13848 -18291 -25681 4552 -661 -9256 25812 -3739 -25863 -4614 -22032
12060 -22032 -15852 88 13918 14498 4608 29986 25943 5894 10044 32048 40836 64766 67803
$$ packed form
12152a8860j4806P802J3431Q99j1232l4558k229K6234j1608J2989j8974K982K5696
12139b2234K8448N047O108O188L187K7174J7196l5319j6276K486K5165l3294J3867
12126B7743J951M876Q28j024p501m1778j9148K8463j8407L8384J795j0850l287
12113B045P412n828r53j790o896M1278J9735k3940r1j0659j4413p538o885J2839
12099D316R949J3735j4704m587J7851j9383l125K396j8210l3201J6226K2047k7908
12086c4598P389L9767K5780j7569k1432k6864k2454j512J7940p720Q228n471q073
12073d6589K1511J8899p669m443p390L0233n213q595L5068k9551k2124K1249j7418
12060b2032O180J5940J3830N80r890K5378m043k0049M150K2004Q788K3930L037
$$ plain form
12047 67803 39447 25385 37679 39527 41161 47292 86439 77113 62240 45503 14796 -11880
12035 -11880 -1191 18070 19842 15735 14522 54570 70725 72342 71027 54867 34848 -653 -19697
12022 -19697 -9918 5826 23885 39923 27907 30508 30298 26158 12841 51307 63616 48801 13285
12009 13285 3806 -1759 13141 27781 7711 23406 8357 -98 7927 -8547 -21443 -40592
11997 -40592 -32433 -57471 -45174 -26627 -10229 12475 7404 1580 53 45216 59463 24424
11985 24424 -989 -19506 -19572 -23002 -22268 2097 29527 27663 13312 91 -20023 -19091 -7857
11972 -7857 23997 10951 -18675 -11723 3538 2660 -14893 -24049 -8750 -8413 9414 16357 6470
11959 6470 30157 -4030 -41261 -43885 -50223 -20045 -21518 -58814 -40680 7341 15508 1828 14239
$$ packed form
12047F7803k8356j4062J2294J848J634O131L9147r326j4873j6737l0707k6676
12035a1880J0689J9261J772m107j213M0048J6155J617j315j6160k0019l5501j9044
12022a9697R779J5744J8059J6038j2016K601k10m140j3317L8466J2309j4815l5516
12009A3285r479n565J4900J4640k0070J5695j5049q455Q025j6474j2896j9149
11997d0592Q159k5038J2297J8547J6398K2704n071n824j527M5163J4247l5039
11985B4424k5413j8517o6l430P34K4365K7430j864j4351j3221k0114R32J1234
11972g857L1854j3046k9626O952J5261q78j7553r156J5299L37J7827O943r887
11959F470K3687l4187l7231k624o338L0178j473l7296J8134M8021Q167j3680J2411
$$ plain form
11946 14239 -12613 -25783 -32749 -32535 -10839 1981 4154 21754 45387 33799 29297 17558 2858
11933 2858 3536 3140 15362 47570 27138 31513 57068 9634 -14017 -12209 -11131 -14912 -17042 1658
11919 1658 48807 89732 48432 12183 29290 -11474 -11592 14301 19122 41566 31046 7890
11907 7890 26217 35564 19375 -6096 9 -19056 -16389 24090 2604 -905 7213 11878 16033
11894 16033 28012 13344 9064 1252 -5061 13194 20251 -4822 31 10848 -801 -22989 -40714
11881 -40714 -58228 -30933 -20384 10401 11387 23283 24142 32899 43999 31847 -26045 -31127 -7353
11868 -7353 24696 31289 59167 45735 -483 -24226 -38081 -25097 -43705 -45506 -36070 -48266
11856 -48266 -50657 -41473 -44465 -46077 -23146 5809 12054 9397 33043 42882 37588 16234 38525
$$ packed form
11946A4239k6852j3170o966K14K1696J2820K173J7600K3633j1588m502j1739j4700
11933B858O78l96J2222L2208k0432M375K5555m7434k3651J808J078l781k130J8700
11919A658M7149M0925m1300l6249J7107m0764j18K5893M821K2444j0520k3156
11907G890J8327R347j6189k5471O105j9065K667M0479k1486l509Q118M665M155
11894A6033J1979j4668m280p812o313J8255P057k5073M853J0817j1649k2188j7725
11881d0714j7514K7295J0549L0785R86J1896Q59Q757J1100j2152n7892n082K3774
11868g353L2049O593K7878j3432m6218k3743j3855J2984j8608j801R436j2196
11856d8266k391R184k992j612K2931K8955O245k657K3646R839n294k1354K2291
$$ plain form
11843 38525 46592 41857 16850 -3157 3471 21055 6525 -11316 -3414 40234 52828 35258
11831 35258 42744 6263 -49184 -57996 -38460 -26441 -30404 -11813 -39333 -63311 -83201 -90761
11819 -90761 -90091 -76552 -80660 -57989 -18465 -6602 -33241 8166 27985 21595 13409 16905 -1942
11806 -1942 -1415 -5240 -32399 -35745 -19631 -18079 -13575 10608 19996 7685 -36743 -45159 -34951
11793 -34951 -186 19188 24792 55693 62735 35370 9508 -9626 -21963 -42507 -61696 -47782
11781 -47782 -12452 -9395 -50976 -65368 -62445 -43851 -59562 -46813 -17165 -34140 -28889 -11923
11769 -11923 -9659 -33606 -32183 -19991 -3685 -18666 4063 -10847 -10086 6374 19500 36085
11757 36085 45226 13551 6420 23193 28699 14511 21492 34592 30474 29344 31295 -2124 -23932
$$ packed form
11843C8525Q067m735k5007k0007O628J7584j4530j7841P902M3648J2594j7570
11831C5258P486l6481n5447q812J9536J2019l963J8591k7520k3978j9890p560
11819i0761O70J3539m108K2671L9524J1863k6639M1407J9819o390q186L496j8847
11806a942N27l825k7159l346J6114J552M504K4183R388j2311m4428q416J0208
11793c4951L4765J9374N604L0901P042k7365k5862j9134j2337k0544j9189J3914
11781d7782L5330L057m1581j4392K923J8594j5711J2749K9648j6975N251J6966
11769a1923K264k3947J423J2192J6306j4981K2729j4910P61J6460J3126J6585
11757C6085R141l1675p131J6773N506j4188O981J3100m118j130J951l3419k1808
$$ plain form
11744 -23932 1013 49828 74074 68116 19699 -35560 -24482 -7896 -13678 9263 18438 -6536
11732 -6536 -60645 -39886 24063 51117 54596 38256 -7559 -15456 -1666 25235 14602 25176
11720 25176 30785 -15641 -32040 -36452 -27248 -23703 -13160 -28694 -45038 -26040 -11508 268
11708 268 4262 -11656 -7682 -2763 11589 31508 51667 17421 -5499 -7217 25159 25131 3463
11695 3463 2806 -10212 -31534 -47914 -34515 6600 -19069 -24726 -28875 -38600 -72153 -52337 -10935
11682 -10935 -6620 -13814 -30381 -6405 9998 41141 32073 22751 46454 25617 34764 31321 9219
11669 9219 -1346 -35014 -45923 -4305 29619 39689 3095 1439 23968 24502 26040 26483 22053
11656 22053 27208 26630 1937 -14261 -25714 -37593 -43803 -51057 -38317 -19716 -25011 -23481 -72844
$$ packed form
11744b3932K4945M8815K4246n958m8417n5259J1078J6586n782K2941R175k4974
11732f536n4109K0759O3949K7054L479j6340m5815p897J3790K6901j0633J0574
11720B5176N609m6426j6399m412R204L545J0543j5534j6344J8998J4532J1776
11708B68L994j5918L974M919J4352J9919K0159l4246k2920j718L2376k8k1668
11695C463o57j3018k1322j6380J3399M1115k5669n657m149r725l3553J9816M1402
11682a0935M315p194j6567K3976J6403L1143r068r322K3703k0837R147l443k2102
11669I219j0565l3668j0909M1618L3924J0070l6594j656K2529N34J538M43m430
11656B2053N155n78k4693j6198j1453j1879o210p254J2740J8601n295J530m9363
$$ plain form
11643 -72844 -36694 -26434 -48054 -30346 -40100 -28013 42223 23287 -10456 -13105 -15050 -2962
11631 -2962 -3855 -22260 -45898 -69522 -25519 -20001 -34010 -24416 -41605 -34749 4198 -14132 -24969
11618 -24969 -55717 -51105 -30542 -48022 -72537 -38003 3573 22913 22899 22479 38555 35867 9936
11605 9936 -18225 -32066 -49922 -87917 -102479 -74567 -24592 -5060 20128 41165 26482 -20182
11593 -20182 -31297 -21419 2217 15126 541 -1290 -5703 17205 3839 -17754 -20143 -36530
11581 -36530 -43414 -45291 -42313 -39698 -11301 3781 15186 60371 35890 -659 10293 19995 5298
11568 5298 10521 21583 2495 -12658 -30795 -18850 6224 30582 25572 4275 22645 45623
11556 45623 9153 -30358 -42172 -36237 -2525 -15180 -36297 -47377 -68108 -60312 -79648 -70891
$$ packed form
11643g2844L6150J0260k1620J7708r754J2087P0236j8936l3743k649j945J2088
11631b962q93j8405k3638k3624M4003N518j4009R594j7189O856L8947j8330j0837
11618b4969l0748M612K0563j7480k4515L4534M1576J9340j4m20J6076k688k5931
11605I936k8161j3841j7856l7995j4562K7912M9975J9532K5188K1037j4683m6664
11593b0182j1115R878K3636J2909j4585j831m413K2908j3366k1593k389j6387
11581c6530o884j877K978K615K8397J5082J1405M5185k4481l6549J0952R702j4697
11568E298N223J1062j9088j5153j8137J1945K5074K4358n010k1297J8370K2978
11556D5623l6470l9511j1814N935L3712j2655k1117j1080k0731P796j9336Q757
$$ plain form
11544 -70891 -54165 -36164 -46859 -43750 -20815 4173 20665 1666 367 -2403 3472 4620 1664
11531 1664 17242 -22266 -70748 -61221 -48811 -8133 46249 69705 31208 22697 1592 -6892
11519 -6892 -15575 -28491 -20210 -46156 -68032 -80883 -49338 -37470 -2800 -9724 -8022 -1769 28308
11506 28308 24075 21090 20029 -11389 -60312 -88079 -62623 -32549 -5900 47926 38565 23799
11494 23799 14090 7591 -14629 -5396 854 -16647 -22479 -67 -1604 -15283 -3929 7902 53486
11481 53486 54461 45177 35832 -4481 -44379 -30182 -29425 -48011 -44086 -44088 -12294 -4665 -6464 -24969
11467 -24969 -35467 -535 22611 27479 29174 43476 57389 84735 61868 48096 36965 22237
11455 22237 53027 58144 36414 37998 7641 -34328 -30816 -15006 -12442 -22560 -39952 -37906 -23183
$$ packed form
11544g0891J6726J8001j0695L109K2935K4988J6492j8999j299k770N875J148k956
11531A664J5578l9508m8482R527J2410M0678N4382K3456l8497q511k1105q484
11519f892q683j2916Q281k5946k1876j2851L1545J1868L4670o924J702O253L0077
11506B8308m233k985j061l1418m8923k7767K5456L0074K6649N3826r361j4766
11494B3799r709o499k2220R233O250j7501n832K2412j537j3679J1354J1831M5584
11481E3486R75r284r345m0313l9898J4197P57j8586L925kL1794P629j799j8505
11467b4969j0498L4932K3146M868J695J4302J3913K7346k2867j3772j1131j4728
11455B2237L0790N117k1730J584l0357m1969L512J5810K564j0118j7392K046J4723
$$ plain form
11442 -23183 -19259 -24990 -53027 -30959 -3410 8822 28721 3701 8877 46419 68384 68888 68046
11429 68046 54848 71321 43877 -3166 23416 9568 -16195 -10595 35381 26217 -7535 24114
11417 24114 55515 61070 30990 26092 28559 -7887 -8123 6684 -2138 -37739 -77574 -87821 -50118
11404 -50118 -54279 -68134 -33600 16387 14805 450 -22843 -17880 -14010 118 46659 54068 41401
11391 41401 59641 31142 -10026 -35586 -45400 -23980 -15110 -16012 -12064 4165 -23998 -43508 -77250
11378 -77250 -52500 -4693 -15968 -32951 -10134 6167 22910 17480 -8350 -55590 -59942 -33064
11366 -33064 -955 12129 34837 37644 -7817 -21878 -14253 11359 12681 23575 20375 1614
11354 1614 16170 3246 35 -19449 -29809 -29497 -41052 -37949 -1358 -5687 -26563 -18258 -15144
$$ packed form
11442b3183L924n731k8037K2068K7549J2232J9899k5020N176L7542K1965N04q42
11429F8046j3198J6473k7444m7043K6582j3848k5763N600M5976r164l3752L1649
11417B4114L1401N555l0080m898K467l6446k36J4807q822l5601l9835j0247L7703
11404e0118m161j3855L4534M9987j582j4355k3293M963L870J4128M6541P409j2667
11391D1401J8240k8499m1168k5560r814K1420Q870r02L948J6229k8163j9510l3742
11378g7250K4750M7807j1275j6983K2817J6301J6743n430k5830m7240m352K6878
11366c3064L2109J3084K2708K807m5461j4061P625K5612J322J0894l200j8761
11354A614J4556j2924l211j9484j0360L12j1555L103L6591m329k0876Q305L114
$$ plain form
11341 -15144 -20396 -23856 -34609 -33862 -1859 20419 21620 19144 -22809 -20313 6257 -499 -7905
11328 -7905 18786 34558 28308 -13131 -19062 -34330 -61498 -25561 -3577 -11535 -30485 -17844
11316 -17844 1990 15896 37187 59237 51783 28879 25297 17856 33848 8902 -6253 11518
11304 11518 23505 23307 6444 -2703 -7498 -8540 -27535 -17863 -17208 -43922 -28357 -10573 -4031
11291 -4031 9850 21069 33357 20645 17544 23528 25947 15630 -23345 -91534 -79531 -28693
11279 -28693 3825 -38820 -65501 -63983 -56638 -29016 4666 13881 -18392 -37643 -4491 -9113
11267 -9113 -32454 -14028 2943 7896 32135 21734 -15929 -5204 47801 50661 43312 37334 -6459
11254 -6459 -25571 -25075 -62868 -40890 -22818 -29951 -16341 6438 5671 -6314 37650 47383 31677
$$ packed form
11341a5144n252l460j0753P47L2003K2278J201k476m1953K496K6570o756p406
11328g905K6691J5772o250m1439n931j5268k7168L5937K1984p958j8950J2641
11316a7844J9834J3906K1291K2050p454k2904l582p441J5992k4946j5155J7771
11304A1518J1987j98j6863r147m795j042j8995R672O55k6714J5565J7784O542
11291d031J3881J1219J2288j2712l101N984K419j0317l8975o8189J2003N0838
11279b8693L2518m2645k6681J518P345K7622L3682R215l2273j9251L3152m622
11267i113k3341J8426J6971M953K4239j0401l7663J0725N3005K860p349n978m3793
11254f459j9112M96l7793K1978J8072p133J3610K2779p67j1985M3964R733j5706
$$ plain form
11241 31677 39254 -5341 -17028 -9311 4173 13961 -22663 -18542 -27495 -207 25398 59338 48498
11228 48498 18949 -14332 -21976 -28891 -22730 10414 18978 21820 24869 -7121 -14406 -24878 -30054
11215 -30054 -36290 -29148 -25530 13478 10882 4795 15494 3876 -5934 -9835 -31077 -58331 -53559
11202 -53559 -27307 -6487 -26064 -27385 -5792 -28093 -41505 1159 40025 38425 32483 45250
11190 45250 34060 17898 20304 17729 5490 -22971 -44741 -56472 -49603 -24933 -57291 -48498
11178 -48498 -23150 1730 -21301 -21910 -31163 2214 -5469 12149 26390 10338 37 11865
11166 11865 3083 7934 1008 -11751 -26667 -29530 -16376 5033 -8815 959 -17678 -25271 7374
11153 7374 11914 17199 8722 -14728 -24094 -40868 -17308 1363 15246 35467 24151 13223 13083
$$ packed form
11241C1677P577m4595j1687P717J3484R788l6624M121q953K7288K5605L3940j0840
11228D8498k9549l3281p644o915O161L3144Q564K842L049l1990p285j0472n176
11215c0054o236P142L618L9008k596o087J0699j1618r810l901k1242k7254M772
11202e3559K6252K0820j9577j321K1593k2301j3412M2664L8866j600n942J2767
11190D5250j1190j6162K406k575j2239k8461k1770j1731O869K4670l2358Q793
11178d8498K5348K4880k3031o09r253L3377p683J7618J4241j6052j0301J1828
11166A1865q782M851o926j2759j4916k863J3154K1409j3848R774j8637p593L2645
11153G374M540N285q477k3450r366j6774K3560J8671J3883K0221j1316j0928j40
$$ plain form
11140 13083 -388 -6187 -21398 -33823 -29888 12445 20071 17289 13746 -17011 -22562 -11822 -15406
11127 -15406 -34335 -27308 -47724 -33352 -21945 -28859 -23314 -9684 -23355 -36540 -15178 13785
11115 13785 5840 13739 18761 8198 -5308 5118 24257 49229 60041 34646 28266 28648 21567
11102 21567 14138 21410 -4636 -13373 51 12109 -39496 -35871 -7049 17436 9845 -24045 -9577
11089 -9577 23755 62268 89873 74126 46701 41742 23665 18338 17729 18269 -3166 -38084 -37759
11076 -37759 -15512 -8278 -8795 -18262 13519 29835 35441 -2380 -21324 -22292 -33614 -22859 -16007
11063 -16007 16463 30599 31858 27429 -12728 -55647 -34438 -4484 -3129 -34789 -43766 -35413 -10109
11050 -10109 10903 9088 -5349 -8193 1128 23816 53237 42957 31515 21736 43971 59601
$$ packed form
11140A3083j3471n799j5211j2425L935M2333P626k782l543l0757n551J0740l584
11127a5406j8929P027k0416J4372J1407o914N545J3630j3671j3185K1362K8963
11115A3785p945P899N022j0563j3506J0426J9139K4972J0812k5395o380L82p081
11102B1567p429P272k6046q737J3424J2058n1605L625K8822K4485p591l3890J4468
11089i577L3332L8513K7605j5747k7425m959j8077n327o09N40k1435l4918L25
11076c7759K2247P234n17r467L1781J6316N606l7821j8944r68j1322J0755O852
11063a6007L2470J4136J259m429m0157m2919K1209K9954J355l1660q977Q353K5304
11050a0109K1012j815j4437k844R321K2688K9421j0280j1442r779K2235J5630
$$ plain form
11038 59601 31547 -14393 -48456 -48708 -26959 -46494 -61946 -13800 1552 -11947 -42990 -33900
11026 -33900 -15103 -12907 -9248 7791 17186 22611 7270 -5860 -10604 3464 10886 15450 -8452
11013 -8452 -5467 -24625 -33750 -68690 -6339 -1979 -40832 -28757 3946 3968 31520 21999 12706
11000 12706 -4510 1024 -27967 -33062 -24701 -32851 -69304 -67852 -24733 -15226 -16541 -21198 4645
10987 4645 2590 -9915 5855 -14804 3149 36018 39294 26555 13083 -24478 -37525 -34299
10975 -34299 -4407 12553 42448 60787 42592 168 -19276 -47760 -61960 -51111 -25178 -1159
10963 -1159 -16500 -55249 -59150 -42245 -47463 -47461 -32640 -33931 -33959 -18847 -4332 9979 8552 -13416
10949 -13416 -21258 -22739 -47834 -35888 -16157 -19142 -15017 -29790 -17052 -487 9600 6458 16205
$$ packed form
11038E9601k8054m5940l4063k52K1749j9535j5452M8146J5352j3499l1043R090
11026c3900J8797K196L659J7039R395N425j5341j3130m744J4068P422M564k3902
11013h452K985j9158r125l4940O2351M360l8853J2075L2703K2K7552r521r293
11000A2706j7216N534k8991n095Q361q150l6453J452M3119R507j315m657K5843
10987D645k055j2505J5770k0659J7953L2869L276j2739j3472l7561j3047L226
10975c4299K9892J6960K9895J8339j8195m2424j9444k8484j4200J0849K5933K4019
10963a159j5341l8749l901J6905n218KJ4821j291k8J5112J4515J4311j427k1968
10949a3416p842j481k5095J1946J9731k985M125j4773J2738J6565J0087l142R747
$$ plain form
10936 16205 43064 25071 25059 34123 47950 62394 57645 32731 16689 4691 9927 30227 3788
10923 3788 1223 6574 -8154 4395 23371 7346 14496 10353 5190 -21983 -47307 -56402 -35688
10910 -35688 -42398 -38822 -20300 -775 19839 -1471 9991 -3660 1497 5495 18569 3229
10898 3229 -31428 -11592 -3408 21432 53823 57466 -1529 -25348 -22168 1109 -24014 -1107
10886 -1107 8453 9075 19874 15687 -788 -19636 -7867 2520 -10920 -6388 -10613 -7461 -28345
10873 -28345 -18821 -4923 -8203 41636 58167 25073 733 6208 -14719 -4747 13431 -7900
10861 -7900 -3795 -5833 21410 57641 39871 9354 -5798 38767 44457 8167 -21856 -25630 -20467
10848 -20467 -17428 -33114 -28783 -14922 -9888 -41610 -62340 -65174 -30745 -21761 -57097 -98641 -75367
$$ packed form
10936A6205K6859j7993j2R064J3827J4444m749k4914j6042j1998N236K0300k6439
10923C788k565N351j4728J2549J8976j6025P150m143n163k7173k5324r095K0714
10910c5688o710L576J8522J9525K0614k1310J1462j3651N157L998J3074j5340
10898C229l4657J9836Q184K4840L2391L643n8995k3819L180K3277k5123K2907
10886a107R560O22J0799m187j6475j8848J1769J0387j3440M532m225L152k0884
10873b8345R524J3898l280M9839J6531l3094k4340N475k0927R972J8178k1331
10861g900M105k038K7243L6231j7770l0517j5152M4565N690l6290l0023l774N163
10848b0467L039j5686M331J3861N034l1722k0730k834L4429Q984l5336m1544K3274
$$ plain form
10835 -75367 -47400 -1965 17108 32296 29921 36223 16077 9437 -6491 -12527 3555 -18621
10823 -18621 -20936 -4799 1938 -7846 -14029 -9522 7725 17731 -13887 -35915 -44394 -39817 -34213
10810 -34213 -11200 2318 -10319 -170 -2755 6577 6294 -4845 4418 -10166 -49727 -65934 -77597
10797 -77597 -40998 -18296 -14538 467 17991 16365 -24187 -44512 -24857 -17400 -435 -10377
10785 -10377 -54832 -34595 24291 37471 -13077 -12721 -1091 -2695 15914 47535 77294 63240
10773 63240 44645 3686 14625 12462 -14859 -65702 -88105 -49717 -21894 -10693 19667 57819
10761 57819 87050 69155 46537 9575 -30311 -51778 -56059 -44630 -35916 -14371 -15065 -9259 -12732
10748 -12732 -19812 -16606 9718 11251 -17414 -30810 -53158 -56632 -34665 -13939 -4498 34104 31663
$$ packed form
10835g5367K7967M5435J9073J5188k375O302k0146o640j5928o036J6082k2176
10823a8621k315J6137O737r784o183M507J7247J0006l1618k2028q479M577N604
10810c4213K3013J3518j2637J0149k585R332k83j1139R263j4584l9561j6207j1663
10797g7597L6599K2702L758J5005J7524j626m0552k0325J9655P457J6965r942
10785a0377m4455K0237N8886J3180n0548L56J1630j604J8609L1621K9759j4054
10773F3240j8595m0959J0939k163k7321n0843k2403L8388K7823J1201L0360L8152
10761E7819K9231j7895k2618l6962l9886k1467m281J1429Q714K1545o94N806l473
10748a2732p080L206K6324J533k8665j3396k2348l474K1967K0726R441L8602k441
$$ plain form
10735 31663 -4327 -6597 -17044 -4916 22454 60184 35781 10498 2808 -32105 -53707 -45713
10723 -45713 1792 23871 29995 9193 -22301 -31656 -30031 -28143 -52676 -72246 -59210 -24501
10711 -24501 -9802 35587 49697 29792 187 7446 23528 25698 31605 -4222 10017 -2819
10699 -2819 -5145 -35743 -67831 -71157 -111777 -97408 -56905 -372 30916 25613 22026 24499 25308
10686 25308 10738 16397 -8730 -4703 -2598 -12166 -14580 -18761 -30212 -21731 -24545 -31801 -40259 -12623
10672 -12623 -25219 -55367 -45157 -57379 -76089 -66771 -56285 -54581 -42816 -46570 -61360 -57585
10660 -57585 -27862 -22697 -24477 -36069 -39534 -30631 -8808 -18644 8618 20716 12617 -2445 -31293
10647 -31293 -42109 -23678 -14665 -18664 -13622 -22467 -22334 -7368 635 4516 -890 6650 -32426 -42085
$$ packed form
10735C1663l5990k270j0447J2128K7370L7730k4403k5283p690l4913k1602P994
10723d5713M7505K2079O124k0802l1494r355J625J888k4533j9570J3036L4709
10711b4501J4699M5389J4110j9905k9605P259J6082K170N907l5827J4239j2836
10699b819k326l0598l2088l326m0620J4369M0503N6533L1288n303l587K473Q09
10686B5308j4570N659k5127M027K105r568k414m181j1451Q481k814p256q458K7636
10672a2623j2596l0148J0210j2222j8710R318J0486J704J1765l754j4790L775
10660e7585K9723N165j780j1592l465Q903K1823r836K7262J2098q099j5062k8848
10647c1293j0816J8431R013l999N042q845J33J4966Q003L881n406P540l9076r659
$$ plain form
10633 -42085 -22329 11201 -12137 -10913 5757 -15759 -41900 -43702 -29535 -33759 -51224 -53729
10621 -53729 -43692 -39370 -41995 -49013 -36187 -31058 -11056 5197 -9951 -22069 -41203 -40276 -37106
10608 -37106 -25769 3911 19330 -2226 -41696 -51530 -55463 -49507 -22248 -20748 -12478 -25729 -41116
10595 -41116 -14407 9311 -8008 2170 16371 22288 17504 25382 3589 -16490 -7245 8025
10583 8025 -19562 -59210 -36749 -14513 -17646 2379 -9221 -8505 -26211 -13275 -23356 -50655
10571 -50655 -57095 -27347 -9761 7769 -6829 -18870 6781 32437 9760 7727 19413 12782
10559 12782 -21111 -54678 -60231 -40675 -35176 -23686 25210 13479 -2444 6631 -3716 9490
10547 9490 24791 41463 37593 6233 28671 -3881 -22875 -22745 -8729 10954 32190 12290
$$ packed form
10633d2085J9756L3530k3338J224J6670k1516k6141j802J4167m224j7465k505
10621e3729J0037M322k625p018J2826N129K0002J6253j5148j2118j9134R27L170
10608c7106J1337K9680J5419k1556l9470r834l933N956K7259J500Q270j3251j5387
10595d1116K6709K3718j7319J0178J4201N917m784P878k1793k0079R245J5270
10583H025k7587l9648K2461K2236l133K0025j1600P16j7706J2936j0081k7299
10571e0655o440K9748J7586J7530j4598j2041K5651K5656k2677k033J1686o631
10559A2782l3893l3567n553J9556N499J1490M8896j1731j5923R075j0347J3206
10547I490J5301J6672l870l1360K2438l2552j8994J30J4016J9683K1236j9900
$$ plain form
10535 12290 -11186 -13341 -25671 -10699 6172 13400 9044 -11435 -26041 -41751 -35494 -29119 -5079
10522 -5079 7111 16776 21653 17673 17057 16023 1680 -13412 -6449 -23801 -52368 -44385 -33192
10509 -33192 -16041 -17266 -29463 -49524 -93940 -79640 -59369 -23430 -17693 -6604 -19041 -27460
10497 -27460 -18116 -15115 -5889 5239 -19322 -37726 -35172 -29041 -30702 -33550 -38116 -30647 -8958
10484 -8958 -32061 -48949 -27129 -20021 -4981 -8146 -30379 -19739 -5607 37064 46538 26256
10472 26256 -6068 -30830 -42235 -67499 -63162 -54999 -24296 -7982 3046 8739 16057 19985 31317
10459 31317 -1053 -58010 -57823 -62935 -76740 -92273 -80045 -83520 -67781 -50217 -4663 -8582 -20619
10446 -20619 -45014 -29912 -6969 -1571 12825 28396 27948 -3711 -29293 -44431 -67597 -75904
$$ packed form
10535A2290k3476k155j2330J4972J6871P228m356k0479j4606j5710O257O375K4040
10522e079J2190R665M877l980o16j034j4343j5092O963j7352k8567P983J1193
10509c3192J7151j225j2197k0061m4416J4300K0271L5939N737J1089j2437q419
10497b7460R344L001R226J1128k4561j8404K554O131j661k848m566P469K1689
10484h958k3103j6888K1820P108J5040l165k2233J0640J4132M2671R474k0282
10472B6256l2324k4762j1405k5264M337Q163L0703J6314J1028N693P318L928J1332
10459C1317l2370n6957J87n112j3805j5533J2228l475J5739J7564M5554l919j2037
10446b0619k4395J5102K2943N398J4396J5571m48l1659k5582j5138k3166q307
$$ plain form
10434 -75904 -67899 -33574 -5148 -13723 -20911 17500 23394 23914 6890 -9436 -7313 -19443 -32477
10421 -32477 -32263 -58555 -64124 -34246 -27115 -35466 -40791 -53832 -57087 -50053 -63721 -53597 -34078
10408 -34078 -15268 21230 35138 58313 79128 79970 66261 62795 102075 120195 90370 36325
10396 36325 41440 58286 62384 41830 29197 4276 -7030 -5749 -6794 23193 33811 40878 6507
10383 6507 -20141 -18412 23294 53219 55071 56941 65903 57136 29253 32524 48437 30681 14967
10370 14967 24220 -5190 -10130 -26401 -6621 -1855 -20890 -13995 -22519 -9404 4794 14419 12553
10357 12553 -26879 -24381 -13700 -14120 -47875 -60325 -60998 -47714 -476 34388 -9048 -39262 -35186
10344 -35186 15440 26976 12097 -21248 -76165 -86745 -55368 5401 35029 18961 -16753 -47670
$$ packed form
10434g5904Q005L4325K8426q575p188L8411N894N20j7024j6326K123j2130j3034
10421c2477K14k6292n569K9878P131q351n325j3041l255P034j3668J0124J9519
10408c4078J8810L6498J3908K3175K0815Q42j3709l466L9280J8120k9825n4045
10396C6325N115J6846M098k0554j2633k4921j1306J281j045K9987J0618P067l4371
10383F507k6648J729M1706K9925J852J870Q962q767k7883L271J5913j7756j5714
10370A4967R253k9410m940j6271J9780M766j9035O895q524J3115J4198R625j866
10357A2553l9432K498J0681m20l3755j2450o73J3284M7238L4864m3436l0214M076
10344c5186N0626J1536j4879l3345n4917j0580L1377O0769K9628j6068l5714l0917
$$ plain form
10332 -47670 -83675 -73055 -49507 -24905 -16519 11289 5820 -25022 -13074 14802 42583 60731
10320 60731 57975 46118 9891 1736 13000 -1546 2125 -9732 2193 6395 -22154 3254
10308 3254 14047 13191 7637 -4308 -13795 19431 7295 -4643 -1765 29477 43103 22088 35537
10295 35537 43360 34451 42575 16206 -27060 -28065 -3529 -7118 -13880 -1473 37729 58370 45207
10282 45207 63325 45031 57109 87044 59419 12552 -15326 35962 26357 3015 3565 7590
10270 7590 -4803 -16245 -64217 -32860 6333 -3428 20348 34000 -16461 -42183 -16709 -18693
10258 -18693 -48541 -64720 -66711 -39575 -50673 -35981 -24733 -15997 -7604 -1178 -5179 -6257 -10156
10245 -10156 -25947 -15497 3946 28023 1396 -23041 -14898 18661 24393 7798 37750 27295
$$ packed form
10332d7670l6005J0620K3548K4602Q386K7808n469l0842J1948K7876K7781J8148
10320F0731k756j1857l6227q155J1264j4546L671j1857J1925M202k8549K5408
10308C254J0793q56n554j1945r487L3226j2136j1938K878L1242J3626k1015J3449
10295C5537P823q909Q124k6369m3266j005K4536l589o762J2407L9202K0641j3163
10282D5207J8118j8294J2078K9935k7625m6867k7878N1288r605k3342N50M025
10270G590j2393j1442m7972L1357L9193r761K3776J3652n0461k5722K5474j984
10258a8693k9848j6179j991K7136j1098J4692J1248Q736Q393O426m001j078l899
10245a0156j5791J0450J9443K4077k6627k4437Q143L3559N732j6595K9952j0455
$$ plain form
10233 27295 -24505 -59585 -28924 -17814 -13765 8957 3719 13236 14363 -829 -16257 -27736
10221 -27736 -3051 -3058 -19 32111 21056 -9818 -5031 -18323 -10972 28322 13695 -1126 -19328
10208 -19328 -12840 -21059 18447 43507 8010 11228 11132 -7567 -11020 -19576 -34348 -27880 -25665 -12273
10194 -12273 15787 36654 40690 14142 3759 -1175 -450 20090 17534 3000 2093 -14293 6872
10181 6872 36488 951 -44840 -48347 -30823 -60701 -69583 -21623 -43940 -33250 -29436 -23332 -4363
10168 -4363 6033 18160 44930 64590 20797 -8730 -11515 -18445 14010 13897 -36364 -73216 -51959
10155 -51959 -42060 -6274 28334 38616 21412 -2673 -8872 -3319 -15682 -38394 -32160 2525
10143 2525 5676 -17739 -33424 -27797 3941 -10869 -24073 17423 16314 -12565 -40132 -31687 -29130
$$ packed form
10233B7295n1800l5080L0661J1110M049K2722n238R517J127j5192j5428j1479
10221b7736K4685pL039L2130j1055l0874M787j3292P351L9294j4627j4821j8202
10208a9328O488q219L9506K5060l5497L218r6j8699l453q556j4772O468K215J3392
10194a2273K8060K0867M036k6548j0383m934P25K0540k556j4534r07j6386K1165
10181F872K9616l5537m5791l507J7524k9878q882M7960k2317J0690L814O104J8969
10168d363J0396J2127K6770J9660m3793k9527k785o930L2455j13n0261l6852K1257
10155e1959R899L5786L4608J0282j7204k4085o199N553j2363k2712O234L4685
10143B525L151k3415j5685N627L1738j4810j3204M1496j109k8879k7567Q445K557
$$ plain form
10130 -29130 -43563 -46936 -25678 -10562 -5714 28722 22077 57387 74312 74741 28378 5286 -3086
10117 -3086 6235 -7963 -12440 5658 -8441 -5905 10751 345 -7832 10542 22399 -7985 -17177
10104 -17177 -20646 4872 2994 -2630 7676 38570 -868 -18034 -4795 -17096 13767 6705
10092 6705 3589 21184 22873 10289 29473 452 -15701 -1047 -4480 10548 -10834 -56674
10080 -56674 -37744 -3774 3764 -19674 -4004 15785 12574 -19175 -47664 -7624 33369 3967
10068 3967 -1459 32405 19510 17651 70380 33744 -1375 -2606 -30319 -13807 19324 42111
10056 42111 57371 32591 17104 1388 -11279 -11730 -2186 8 18375 24859 10503 776 34363
10043 34363 44023 47722 26816 21546 18818 48135 78566 58018 30480 31881 37706 -12654 -2622
$$ packed form
10130b9130j4433l373K1258J5116M848L4436o645L5310J6925M29m6363k3092q372
10117c086R321j4198m477J8098j4099K536J6656j0406q177J8374J1857l0384r192
10104a7177l469K5518j878n624J0306L0894l9438j7166J3239j2301L0863p062
10092F705l116J7595J689j2584J9184k9021j6153J4654l433J5028k1382m5840
10080e6674J8930L3970P538k3438J5670J9789l211l1749k8489M0040M0993k9402
10068C967n426L3864j2895j859N2729l6636l5119j231k7713J6512L3131K2787
10056D2111J5260k4780j5487j5716j2667m51R544K194J8367O484j4356r727L3587
10043C4363R660L699k0906n270k728K9317L0431k0548k7538J401N825n0360J0032
$$ plain form
10030 -2622 35912 18336 487 8012 4366 34985 42661 41391 38671 17383 21775 15514 16497 -20090
10016 -20090 -26935 -15947 -36719 -72489 -79629 -56405 -30680 -28204 -12586 -4179 8885 47197
10004 47197 38506 49044 10458 -14328 -12131 2199 -7277 -28764 -10481 6219 13623 16740 7231
9991 7231 1396 26195 38060 45789 90132 74457 70153 62263 40197 29600 36943 6109 -27357
9978 -27357 -29186 -18620 5331 -25670 -45303 -48750 -20854 10035 12827 18101 -6027 -2991 -21523
9965 -21523 -58488 -57151 -64517 -27838 5430 3377 -10324 -2150 -30963 -16079 19746 11536 6470
9952 6470 15472 -13551 -37882 -7842 -12697 -4009 19611 14929 25930 43049 47720 35235 41192
9939 41192 43543 74101 68927 49502 19804 -35335 -45824 -16212 -2498 356 10613 15476 17396
$$ packed form
10030b622L8534j7576j7849P525l646L0619P676j270k720k1288M392o261R83l6587
10016b0090o845J0988k0772l5770p140K3224K5725K476J5618Q407J3064L8312
10004D7197q691J0538l8586k4786K197J4330r476k1487J8283J6700P404L117r509
9991G231n835K4799J1865P729M4343j5675m304p890k2066j0597P343l0834l3466
9978b7357j829J0566K3951l1001j9633l447K7896L0889K792N274k4128L036j8532
9965b1523l6965J337p366L6679L3268k053j3701Q174k8813J4884L5825q210n066
9952F470R002k9023k4331L0040m855Q688K3620m682J1001J7119M671j2485N957
9939D1192K351L0558n174j9425k9698n5139j0489K9612J3714K854J0257M863J920
$$ plain form
9926 17396 26564 32577 11466 37583 65544 36756 52555 89247 82633 41123 -3150 -41106
9914 -41106 -55398 -48649 -39438 -37901 -33823 -27158 -7910 -11291 -50467 -73830 -74105 -66567 -43186 -25580
9900 -25580 -8544 11245 26789 24188 5035 7315 8735 8701 -4197 1219 8799 14844 -18899 -65288
9886 -65288 -51891 -53709 -57991 -18438 -15579 -58130 -57710 -22512 -6989 4032 -12687 658 13065
9873 13065 -19986 -13913 37458 60122 25232 21884 34094 69347 49929 52732 31903 4566
9861 4566 -31302 -22986 -11462 -23953 -6570 17839 4448 -8591 -7590 -42618 -26518 3487
9849 3487 -9895 -4250 -14088 -23180 -21748 -21967 -17436 -12828 -7785 -16192 -17278 -27368 -32821 -20094
9835 -20094 -18473 -37278 -45746 -41163 -9239 35000 28041 -25791 -85678 -120509 -83451 -98712 -80723
$$ packed form
9926A7396R168O013k1111K6117K7961k8788J5799L6692o614m1510m4273l7956
9914d1106j4292O749R211J537M078O665J9248l381l9176k3363k75P538K3381J7606
9900b5580J7036J9789J5544k601j9153K280J420l4j2898N416P580O045l3743m6389
9886f5288J3397j818m282L9553K859m2551M20L5198J5523J1021j6719J3345J2407
9873A3065l3051O073N1371K2664l4890l348J2210L5253j9418K803k0829k7337
9861D566l5868Q316J1524j2491J7383K4409j3391j3039J001l5028J6100L0005
9849C487j3382N645r838r092J432k19M531M608N043q407j086j0090n453J2727
9835b0094J621j8805q468M583L1924M4239o959n3832n9887l4831L7058j5261J7989
$$ plain form
9822 -80723 -68496 -50012 -52710 -46541 -27192 -34437 -413 11730 8241 -27262 -30067 -24197 -3169
9809 -3169 -7207 -13628 -18617 -24901 -15960 -9004 10243 27126 14122 -26044 -8401 10456 26625
9796 26625 23643 18303 27210 -870 -23819 -6198 -2293 138 -14781 -19719 -27194 -25765 -28329 -34959
9782 -34959 -28242 3612 8715 8 -14152 -15186 -40823 -70351 -63704 -34384 13667 28505 13080
9769 13080 -14270 -25335 -14095 36841 34329 51206 33254 -612 -11330 -15556 -18543 -8543
9757 -8543 -10192 849 42938 18484 10534 6143 -27642 -19787 -12617 35380 45449 44218 57951
9744 57951 35849 1922 2973 1941 31735 55631 39711 43959 64392 38756 31992 14856 10686
9731 10686 -29630 -38077 -28855 -10221 -32404 -28835 5080 23051 17522 -5174 -3264 -43134 -38873
$$ packed form
9822h0723J2227J8484k698O169J9349p245L4024J2143l489l5503k805N870K1028
9809c169m038o421m989o284Q941O956J9247J6883j3004m0166J7643J8857J6169
9796B6625k982n340Q907k8080k2949J7621L905K431j4919m938p475J429k564o630
9782c4959O717L1854N103q707j4160j034k5637k9528O647K9320M8051J4838j5425
9769A3080k7350j1065J1240N0936k512J6877j7952l3866j0718m226k987J0000
9757h543j649J1041M2089k4454p950m391l3785P855P170M7997J0069j231J3733
9744E7951k2102l3927J051j032K9794K3896j5920M248K0433k5636o764j7136m170
9731A0686m0316q447R222J8634k2183L569L3915J7971n529k2696J910l9870M261
$$ plain form
9718 -38873 -24908 4029 11630 9976 -17096 -39846 -34970 -7620 19318 5832 -19668 -19292 -20744
9705 -20744 6752 11515 -14621 -11383 -45396 -11530 -26326 -44842 -62577 -67900 -65678 -50472 -14000
9692 -14000 4084 5544 -22782 -23022 -12554 21458 40090 22397 -10300 3941 37002 17817
9680 17817 13449 -24784 -18003 2229 2379 4132 12407 3864 276 -38083 -68228 -58679 -87814 -109193
9666 -109193 -74586 -4733 40062 54328 64515 54708 71629 44271 20957 3478 -12296 -9637
9654 -9637 14691 6316 -31838 -25461 -7662 -11451 -25032 -15979 -17014 -3692 -7816 -27396 -53903
9641 -53903 -46375 -34424 -36203 -34960 -11421 -16679 -44673 -18805 23041 29046 7717 7179 24996
9628 24996 39458 22102 -16494 -12051 17197 29121 19426 11731 -5171 22129 26208 45356 47849
$$ packed form
9718c8873J3965K8937P601j654k7072k2750M876K7350K6938j3486k5500L76j452
9705b0744K7496M763k6136L238l4013L3866j4796j8516j7735n323K222J5206L6472
9692a4000J8084J460k8326k40J0468L4012J8632j7693l2697J4241L3061j9185
9680A7817m368l8233O781K0232J50J753Q275q543l588l8359l0145R549k9135k1379
9666a09193L4607O9853M4795J4266J0187r807J6921k7358k3314j7479j5774K659
9654i637K4328q375l8154O377J7799l789j3581R053j035J3322m124j9580k6507
9641e3903P528J1951j779J243K3539n258k7994K5868M1846O005k1329n38J7817
9628B4996J4462j7356l8596M443K9248J1924r695p695j6902K7300M079J9148K493
$$ plain form
9615 47849 44729 29548 -3099 6823 -14929 -42810 -43439 -19504 2909 24679 36288 23152 8599
9602 8599 -20800 -36736 -7067 -487 -7319 3124 -12738 -18720 9275 -37157 -59997 -44430 -33815
9589 -33815 -46954 -56345 -39571 -22184 -10044 5483 2546 -22091 -42987 -40367 -19607 12581
9577 12581 28146 22691 5764 22447 6206 5082 -10948 17449 38045 19569 23738 38244
9565 38244 27416 17297 16242 19196 49461 54833 63076 38292 21410 50698 66112 47800 34040
9552 34040 49769 78813 65917 63356 65599 62638 71211 50180 17180 15533 11251 -2516 -10742
9539 -10742 -19102 -22520 -21248 -13878 3442 -10925 -6699 -5778 -23927 -29946 -1555 -6893 7791 40241
9525 40241 12268 4843 21373 24618 -1636 -28066 10335 23140 35802 47684 19753 3391
$$ packed form
9615D7849l120j5181l2647R922k1752k7881o29K3935K2413K1770J1609j3136j4553
9602H599k9399j5936K9669O580o832J0443j5862n982K7995m6432k2840J5567J0615
9589c3815j3139r391J6774J7387J2140J5527k937k4637k0896K620K0760L2188
9577A2581J5565n455j6927J6683j6241j124j6030K8397K0596j8476M169J4506
9565C8244j0828j0119j055K954L0265N372Q243k4784j6882K9288J5414j8312j3760
9552C4040J5729K9044j2896k561K243k961Q573k1031l3000j647m282j3767q226
9539a0742q360l418J272P370J7320j4367M226R21j8149o019K8391n338J4684L2450
9525D0241k7973p425J6530L245k6254k6430L8401J2805J2662J1882k7931j6362
$$ plain form
9513 3391 -42271 -52614 -40278 -7137 -4097 -16999 -38834 -37398 -39968 -20951 -31367 -9711 21707
9500 21707 8289 -27674 -32706 -36335 -38185 -22603 -39170 -49953 -65753 -62923 -40915 -18523 -38182
9487 -38182 -28131 -5519 -11020 -17355 -4649 23764 13159 -8030 21062 11613 -27818 -10709
9475 -10709 22108 29517 6910 -8622 -28409 -28868 -22943 -19342 -30189 -32995 -8738 -2530 -32269
9462 -32269 -42684 -38431 -39898 -35916 -40292 -9759 20416 26915 21079 20051 25406 31652 29135 8367
9448 8367 -39127 -44054 -33368 -17861 6825 14291 -9723 5825 14210 9794 6726 7299 9124 38128
9434 38128 55174 40025 40481 7836 -5760 -6388 18668 43736 18663 1206 12613 46122 52628
9421 52628 26826 18449 -2629 -17515 -34078 -21171 -32074 -33893 -4602 -9387 -35267 -64186
$$ packed form
9513C391m5662j0343J2336L3141L040j2902k1835J436k570J9017j0416K1656L1418
9500B1707j3418l5963n032l629j850J5582j6567j0783j5800K830K2008K2392j9659
9487c8182J0051K2612n501o335J2706K8413j0605k1189K9092r449l9431J7109
9475a0709L2817P409k2607j5532j9787m59N925L601j0847k806K4257O208k9739
9462c2269j0415M253j467L982m376L0533L0175O499n836j028N355O246k517k0768
9448H367m7494m927J0686J5507K4686P466k4014J5548Q385m416l068N73J825K9004
9434C8128J7046j5149M56l2645j3596o28K5056K5068k5073j7457J1407L3509O506
9421E2628k5802q377k1078j4886j6563J2907j0903j819K9291m785k5880k8919
$$ plain form
9409 -64186 -55068 -54409 -44968 -7794 32835 39691 43711 25285 9782 -29052 -11706 13801 39484
9396 39484 44819 34788 31700 15409 24691 54932 69004 22985 -4423 -14220 -5005 2652 -26115
9383 -26115 -11516 -9535 -33017 -17081 17402 36925 33553 29937 31030 35243 22867 36431 38466
9370 38466 31047 -2944 -45705 -42423 -19924 32990 31524 20321 20049 23351 14144 38942 66346
9357 66346 73461 47350 24146 -2428 -11912 -16243 -35975 -19165 312 21224 14845 -1849 -16701
9344 -16701 4314 27494 73147 118831 83139 30118 20818 13380 6296 -3244 -48223 -72829 -30648
9331 -30648 2805 24145 27299 -14284 -31019 -16561 3048 39730 38675 40357 36676 35342 38869
9318 38869 28609 -7879 3020 17828 20658 33168 19715 20031 45403 38278 13545 3936 9613
$$ packed form
9409f4186R118O59R441L7174M0629O856M020j8426j5503l8834J7346K5507K5683
9396C9484N335j0031l088j6291R282L0241J4072m6019k7408r797R215P657k8767
9383b6115J4599J981k3482J5936L4483J9523l372l616J093M213j2376J3564K035
9370C8466p419l3991m2761L282K2499N2914j466j1203k72L302r207K4798K7404
9357F6346P115k6111k3204k6574r484m331j9732J6810J9477K0912o379j6694j4852
9344a6701K1015K3180M5653M5684l5692n3021r300p438p084r540m4979k4606M2181
9331c0648L3453K1340L154m1583j6735J4458J9609L6682j055J682l681j334L527
9318C8869j0260l6488J0899J4808K830J2510j3453L16K5372p125k4733r609N677
$$ plain form
9305 9613 -10125 -11558 -23870 -56827 -85169 -41907 26577 64901 43796 -6769 -37437 -71194
9293 -71194 -54546 -27171 -16842 -2272 -5206 -28217 -58273 -67294 -61280 -22772 -8582 -8787 -21523
9280 -21523 -11768 -10848 -11662 -14609 -29548 -22395 -597 -16144 -35848 -46975 -46731 -52530 -24102 8327
9266 8327 18583 5151 2032 1862 -3599 15175 27011 43205 62681 64330 31137 52370 73646
9253 73646 58751 42490 72084 44490 25760 35258 79835 81629 53118 28420 1552 17972
9241 17972 66411 90254 101552 72761 85929 62273 17451 38042 30451 27503 -22394 -9626
9229 -9626 29236 38186 23528 -6206 7551 24040 -6909 -33872 -35500 -22397 -752 -2488 -30651
9216 -30651 -54741 -73934 -63512 -33877 -17354 -40384 -28214 -26810 25423 69726 53527 21759
$$ packed form
9305I613j9738j433j2312l2957k8342M3262O8484L8324k1105n0565l0668l3757
9293g1194J6648K7375J0329J4570k934k3011l0056r021O014L8508J4190k05j2736
9280b1523R755R20q14k947j4939P153K1798j5547j9704j1127K44n799K8428L2429
9266H327J0256j3432l119j70n461J8774J1836J6194J9476J649l3193K1233K1276
9253G3646j4895j6261K9594k7594j8730R498M4577J794k8511k4698k6868J6420
9241A7972M8439K3843J1298k8791J3168k3656m4822K0591p591k948m9897J2768
9229i626L8862Q950j4658k9734J3757J6489l0949k6963j628J3103K1645j736k8163
9216c0651k4090j9193J0422K9635J6523k3030J2170J404N2233M4303j6199l1768
$$ plain form
9204 21759 11877 -23243 -19787 8224 54077 52674 45700 16738 10875 -2771 9746 37287 14782
9191 14782 -8273 -9226 23001 35699 30727 29636 60316 55670 21511 3419 -326 -1483 20486
9178 20486 49654 36330 41575 55960 5318 8341 26392 23202 40879 50962 42353 32396 43995
9165 43995 36152 21060 25381 48993 34855 27233 56019 54436 64267 74638 51181 44771 60378
9152 60378 48527 53453 71136 75465 65180 66617 18660 33297 61143 54278 48732 54720 77827
9139 77827 78388 95829 99406 96631 85657 61788 77030 82122 110213 146196 151186 127674 147916
9126 147916 193114 223385 229275 252611 289940 306335 379736 423310 422973 451606 506102 569291
9114 569291 585223 675060 829892 951282 1089928 1256121 1448142 1756120 2157943 2679396
$$ packed form
9204B1759r882l5120L456K8011M5853j403o974k8962n863j3646J2517K7541k2505
9191A4782k3055r53L2227J2698m972j091L0680m646l4159j8092l745j157K1969
9178B0486K9168j3324N245J4385n0642L023J8051l190J7677J0083q609r957J1599
9165D3995p843j5092M321K3612j4138p622K8786j583R831J0371k3457o410J5607
9152F0378j1851M926J7683M329j0285J437m7957J4637K7846o865n546N988K3107
9139G7827N61J7441L577k775j0974k3869J5242N092K8091L5983M990k3512K0242
9126A47916M5198L0271N890K3336L7329J6395P3401M3574l37K8633N4496O3189
9114E69291J5932Q9837J54832J21390J38646J66193J92021L07978M01823N21453
$$ plain form
9104 2679396 3427814 4460201 5940502 8075090 10927668 14274801 17018351 17790167 16344482
9095 16344482 13617063 10622950 8046928 6123782 4727553 3752322 3077677 2548607 2142460
9086 2142460 1821277 1538810 1327042 1173168 1049017 928859 835093 793237 670374 610475
9076 610475 553656 540638 508610 444409 414284 368027 344972 320619 292215 249384 244660 216942
9064 216942 200199 188837 153846 173481 179382 163781 148166 133712 123403 74998 68033 93255
9052 93255 133710 144750 156376 159142 132535 141343 143888 91571 66392 93389 96737 85082 74661
9039 74661 41518 52624 33972 39070 58095 68372 3749 -22406 3172 17641 42975 50539
9027 50539 70360 79788 83095 60015 41699 33962 41077 80424 102057 69969 27188 28400 42739
$$ packed form
9104B679396P48418J032387J480301K134588K852578L347133K743550P71816j445685
9095A6344482k727419k994113k576022j923146j396229r75231o74645n29070m06147
9086B142460l21183k82467k11768j53874j24151j20158r3766m1856j22863n9899
9076F10475n6819j3018l2028o4201l0125m6257k3055k4353k8404m2831m724k7718
9064B16942j6743j1362l4991J9635N901j5601j5615j4454j0309m8405o965K5222
9052I3255M0455J1040J1626K766k6607Q808K545n2317k5179K6997L348j1655j0421
9039G4661l3143J1106j8652N098J9025J0277o4623k6155K5578J4469K5334P564
9027E0539J9821R428L307k3080j8316p737P115L9347K1633l2088m2781J212J4339
$$ plain form
9014 42739 46419 42640 36389 48927 46392 42838 43541 82442 113418 95920 71014 36366 18665
9001 18665 54535 75169 31965 20769 13465 23862 49932 56152 35593 54823 48502 32912
8989 32912 50814 89357 113174 77126 43055 9439 -14415 -9675 25026 42043 53560 45391
8977 45391 15536 -34930 68 23919 36016 35347 -2001 9883 5617 35 4153 30446 64384
8964 64384 75080 45811 25333 3546 -6336 5258 21516 953 11956 42948 44743 34380
8952 34380 24127 -5134 -2431 -28405 -58502 -46835 -35792 -20300 -24821 -1043 35652 41215
8940 41215 59078 73260 26906 1819 -22030 -56583 -33006 -5067 8153 14235 1954 -44159
8928 -44159 -26920 8322 39099 42981 50545 42410 -1982 -44743 -67827 -37405 -6831 16426
$$ packed form
9014D2739L680l779o251J2538k535l554P03L8901L0976j7498k4906l4648j7701
9001A8665L5870K0634m3204j1196p304J0397K6070O220k0559J9230o321j5590
8989C2912J7902L8543K3817l6048l4071l3616k3854M740L4701J7017J1517q169
8977D5391k9855n0466L4998K3851J2097o69l7348J1884m266n582M118K6293L3938
8964F4384J0696k9269k0478k1787r882J1594J6258k0563J1003L0992J795j0363
8952C4380j0253k9261K703k5974l0097J1667J1043J5492m521K3778L6695N563
8940D1215J7863J4182m6354k5087k3849l4553K3577K7939J3220O082j2281m6113
8928d4159J7239L5242L0777L882P564q135m4392m2761k3084L0422L0574K3257
$$ plain form
8916 16426 16816 14405 20042 42545 44936 24084 27223 19601 -11773 -12333 -24035 -12013 -12422 -25962
8902 -25962 -707 44560 61976 34408 51258 57516 39441 41547 45104 18938 -1261 157 -16878
8889 -16878 -22687 -20061 -15362 2885 6488 44516 40229 29777 25451 22112 14601 21689 41145 13284
8875 13284 9299 10373 6693 -24654 -29912 -5086 40577 50296 32741 30041 7062 -12326 1776
8862 1776 -19214 -43105 -59221 -38565 -5822 -1390 9540 14689 27611 2843 -9522 12119
8850 12119 14259 26910 68552 62830 51547 42604 33535 40259 17398 18054 15182 38933 52672
8837 52672 45970 20633 -14585 -17684 14247 39164 24499 29222 6589 -5405 32550 29347 7115
8824 7115 -12807 -6799 15844 33926 43995 7359 -3720 7116 -5117 -12948 -20748 16542 59316
$$ packed form
8916A6426L90k411N637K2503K391k0852L139p622l1374n60j1702J2022m09j3540
8902b5962K5255M5267J7416k7568J6850O258j8075K106L557k6166k0199J418j7035
8889a6878n809K626M699J8247L603L8028m287j0452m326l339p511P088J9456k7861
8875A3284l985J074l680l1347n258K4826M5663R719j7555k700k2979j9388J4102
8862A776k0990k3891j6116K0656L2743M432J0930N149J2922k4768j2365K1641
8850A2119K140J2651M1642n722j1283q943r069O724k2861O56k872K3751J3739
8837E2672o702k5337l5218l099L1931K4917j4665M723k2633j1994L7955l203k2232
8824G115j9922O008K2643J8082J0069l6636j1079J0836j2233p831p800L7290M2774
$$ plain form
8811 59316 41174 9549 13256 12060 -44491 -72697 -58898 -37061 -19021 -21665 -3262 4689 -395
8798 -395 -7935 -14164 -13659 20718 33072 16852 11875 2812 -5971 8219 28111 20293 1255 -58274
8784 -58274 -53339 -42048 -16297 -1034 -6097 37035 -21075 -36814 -21939 13119 45044 25888
8772 25888 7250 144 19719 41184 29305 -2354 2905 15067 155 30014 34084 34073 35013
8759 35013 71012 64590 25964 -1189 -17416 -12367 -882 4231 -47077 -57518 -42504 -25417
8747 -25417 -15605 8154 1063 6034 10566 27387 58085 43733 12458 12249 22462 52231 47932
8734 47932 30421 54512 60163 49172 45835 54718 62141 65857 34932 8718 -5597 -17104 -18821
8721 -18821 8244 14222 18688 16015 28831 37252 48884 60074 44965 31593 -1885 -32845 -42142
$$ packed form
8811E9316j8142l1625L707j196n6551k8206J3799K1837J8040k644J8403P951n084
8798c95p540o229N05L4377J2354j6220m977r063q783J4190J9892p818j9038n9529
8784e8274M935J1291K5751J5263n063M3132n8110j5739J4875L5058L1925j9156
8772B5888j8638p106J9575K1465j1879l1659N259J2162j4912K9859M070j1R40
8759C5013L5999o422l8626k7153j6227N049J1485N113n1308j0441J5014J7087
8747b5417R812K3759p091M971M532J6821L0698j4352l1275k09J0213K9769m299
8734D7932j7511K4091N651j0991l337Q883P423L716l0925k6214j4315j1507j717
8721a8821K7065N978M466k673J2816Q421J1632J1190j5109j3372l3478l0960r297
$$ plain form
8708 -42142 -32562 -12844 14551 11229 12630 3663 -24171 -35084 -21238 15719 53553 69240 43272
8695 43272 13368 31054 55201 64141 51827 19219 4012 16155 5677 25594 35264 18116
8683 18116 34645 46915 21257 9434 41423 46165 14985 -5391 4864 8048 -7451 -24900
8671 -24900 -17982 14470 6750 -5320 -10400 -3229 -2649 3316 20756 13067 -20771 -18458 3698 3388
8657 3388 -8286 15636 21830 4461 34573 61210 44421 -4430 -14508 -11247 1962 16908
8645 16908 45122 62635 36542 43758 39118 35319 58523 51260 41976 65572 67548 54903 37774
8632 37774 28270 23501 24445 13985 42687 64926 67043 69626 59270 39210 21228 -3643 -1323
8619 -1323 33662 42710 48897 41881 40389 38816 28398 33319 -4594 -15947 -11043 12808 32280
$$ packed form
8708d2142R580J9718K7395l322J401q967k7834j0913J3846L6957L7834J5687k5968
8695D3272k9904J7686K4147Q940j2314l2608j5207J2143j0478J9917R670j7148
8683A8116J6529J2270k5658j1823L1989M742l1180k0376J0255L184j5499j7449
8671b4900O918L2452p720j2070n080P171N80N965J7440p689l3838K313K2156l10
8657C388j1674K3922O194j7369L0112K6637j6789m8851j0078L261J3209J4946
8645A6908K8214J7513k6093P216m640l799K3204p263r284K3596J976j2645j7129
8632C7774r504m769R44j0460K8702K2239K117K583j0356k0060j7982k4871K320
8619a323L4985R048O187p016j492j573j0418M921l7913j1353M904K3851J9472
$$ plain form
8606 32280 45247 56007 58440 46646 63781 70146 35467 84868 109568 91141 87179 85207 62733
8593 62733 64235 67149 57392 86012 110452 103476 63430 41372 54473 64832 58901 83502 77747
8580 77747 45453 7418 -12788 -32010 -24254 -13695 23488 31558 1843 -2582 31910 20469
8568 20469 -23943 -42418 -12638 -17949 -42469 -50871 -36814 -38461 -37204 -12994 5908 44638 31887
8555 31887 -16870 -8616 15381 20605 -6607 15024 3108 -9923 -40663 -49249 -18698 -17728 -22227
8542 -22227 -12734 -19150 -26471 -34696 -15537 -12274 14983 57433 69993 90832 68657 63191 -6191
8529 -6191 -23794 -13417 -29073 -29997 -1552 -16853 -17641 -11119 13151 11095 8081 -11669 -3257 29646
8515 29646 34721 50929 4616 35 12009 12950 36078 41776 41671 394 -18947 34984 67629
$$ packed form
8606C2280J2967J0760K433j1794J7135O365l4679M9401K4700j8427l962j972k2474
8593F2733J502K914r757K8620K4440o976m0046k2058J3101J0359n931K4601n755
8580G7747l2294l8035k0206j9222P756J0559L7183Q070k9715m425L4492j1441
8568B0469m4412j8475K9780n311k4520q402J4057j647J257K4210J8902L8730j2751
8555C1887m8757Q254K3997N224k7212K1631j1916j3031l0740q586L0551R70m499
8542b2227R493o416p321q225J9159L263K7257M2450J2560K0839k2175n466o9382
8529f191j7603J0377j5656r24K8445j5301p88O522K4270k056l014j9750Q412L2903
8515B9646N075J6208m6313m581J1974R41K3128N698j05m1277j9341N3931L2645
$$ plain form
8502 67629 96162 103688 72374 24845 -47321 -36499 -24797 -8989 3 -48059 -50447 -21563
8490 -21563 34228 38084 12549 -13420 -2133 5631 1265 -3485 -6958 -9436 -12496 11020 31522
8477 31522 30547 3411 -25326 -50828 -12029 28336 42594 28330 -923 6645 -10557 -40261
8465 -40261 -18301 -30897 11166 60659 26086 13622 48923 46324 32582 8417 -1035 -23825
8453 -23825 4347 12338 24741 39899 29566 -20746 -21805 -17327 -2351 12195 11960 -12710 -17874
8440 -17874 -16792 -283 8452 -2414 -31355 -11751 2375 -12362 -31182 -40460 -20772 -12580 -66562
8427 -66562 -80956 -48020 -52288 -83285 -112372 -140408 -112476 -57722 -29447 -18379 -6165 -19605
8415 -19605 -39634 -45420 -32447 -23642 -53893 -53818 -41851 -21961 -47421 -78544 -83129 -66313 -58100
$$ packed form
8502F7629K8533P526l1314m7529p2166J0822J1702J5808Q992m8062k388K8884
8490b1563N5791L856k5535k5969J1287P764m366m750l473k478l060K3516K0502
8477C1522r75k7136k8737k5502L8799M0365J4258j4264k9253P568j7202k9704
8465d0261K1960j2596M2063M9493l4573j2464L5301k599j3742k4165r452k2790
8453b3825K8172P991J2403J5158j0333n0312j059M478J4976J4546k35k4670n164
8440a7874J082J6509Q735j0866k8941J9604J4126j4737j8820r278J9688Q192n3982
8427f6562j4394L2936m268l0997k9087k8036K7932N4754K8275J1068J2214j3440
8415a9605k0029n786J2973Q805l0251P5J1967J9890k5460l1123m585J6816Q213
$$ plain form
8402 -58100 -30616 -30236 -41308 -24333 -44503 -38304 -31284 -46910 2980 18893 -6805 -4022 38609
8389 38609 37673 2099 2065 -1843 -28753 -17684 5826 19465 18606 5962 14104 24004 37396 32046
8375 32046 52543 31767 -5736 -20664 -33884 -13431 8971 -446 -8188 -6959 -15592 -13009 -27522
8362 -27522 -49996 -62827 -55983 -40003 -40473 -54771 -70382 -66550 -69438 -25333 -35667 -88821 -99314
8349 -99314 -106107 -66362 -31766 -40780 -24970 -43125 -46237 -38066 -12428 31620 43176 5079 -5814
8336 -5814 2863 56192 36873 2799 28460 29908 29819 7745 -25428 -17558 11607 16263 9438 30451
8322 30451 49794 38409 -2497 -54366 -76937 -55116 -63487 -36010 54427 56876 51338 43546 39119
8309 39119 35542 16296 -20219 -57579 -37477 -19531 -31443 -38216 -30461 -16020 3137 6065 9307
$$ packed form
8402e8100K7484L80j1072J6975k0170O199P020j5626M9890J5913k5698K783M2631
8389C8609r36l5574l4l908k6910J1069K3510J3639q59j2644Q142R900J3392n350
8375C2046K0497k0776l7503j4928j3220K0453K2402r417p742J229q633K583j4513
8362b7522k2474j2831O844J5980m70j4298j5611L832k888M4105j0334n3154j0493
8349i9314o793L9745L4596r014J5810j8155l112Q171K5638M4048J1556l8097j0893
8336e814Q677N3329j9319l4074K5661J448q9k2074l3173P870K9165M656o825K1013
8322C0451J9343j1385m0906n1869k2571K1821q371K7477R0437K449n538p792m427
8309C9119l577j9246l6515l7360K0102J7946j1912o773P755J4441J9157K928L242
$$ plain form
8296 9307 -609 -10211 11697 -2727 7565 1122 12498 -536 -2482 -10611 -27563 -47718 -24060
$$ packed form
8296I307r916r602K1908j4424J0292o443J1376j3034j946q129j6952k0155K3658
$$ [...]
##END NTUPLES=NMR SPECTRUM
##END=
