##TITLE=XTC-1693_1
##JCAMPDX= 6.0         $$ Bruker NMR JCAMP-DX V2.0
##DATA TYPE= nD NMR SPECTRUM
##DATA CLASS= NTUPLES
##NUM DIM= 2
##ORIGIN= BRUKER
##OWNER= patiny
$$ 1.79 TOPSPIN		Version 3.0
$$ 2012-05-20 11:26:57.769 +0200  patiny@icmbsg005
$$ Compression mode = diff/dup
##.OBSERVE FREQUENCY= 400.131593945353
##.OBSERVE NUCLEUS= ^1H
##.ACQUISITION MODE= SIMULTANEOUS (DQD)
##.ACQUISITION SCHEME= Echo-Antiecho
##.AVERAGES= 4
##.DIGITISER RES= 23
##SPECTROMETER/DATA SYSTEM= spect
##.PULSE SEQUENCE= hmbcetgpl3nd
##.SOLVENT NAME= D2O
##.SHIFT REFERENCE= INTERNAL, D2O, 1, 7.271974
##AUDIT TRAIL= $$ (NUMBER, WHEN, WHO, WHERE, PROCESS, VERSION, WHAT)
$$ ##TITLE= Audit trail, TOPSPIN		Version 3.0
$$ ##JCAMPDX= 5.01
$$ ##ORIGIN= Bruker BioSpin GmbH
$$ ##OWNER= patiny
$$ $$ /opt/data/patiny/nmr/XTC-1693_1/14/pdata/1/auditp.txt
$$ ##AUDIT TRAIL=  $$ (NUMBER, WHEN, WHO, WHERE, PROCESS, VERSION, WHAT)
(   1,<2012-05-20 11:26:55.860 +0200>,<patiny>,<icmbsg005>,<go>,<TOPSPIN 3.0>,
      <created by zg
	started at 2012-05-20 11:04:48.794 +0200,
	POWCHK enabled, PULCHK disabled,
       configuration hash MD5:
       77 C7 B7 C4 10 F4 BA 30 64 2E BB 52 82 F2 DA 41
       data hash MD5: 4K * 128
       BA 21 DC 42 F2 6B 14 19 22 72 A3 45 95 22 CC C1>)
(   2,<2012-05-20 11:26:55.922 +0200>,<patiny>,<icmbsg005>,<audit>,<TOPSPIN 3.0>,
      <user comment:
       ICON-NMR User ID: patiny
       data hash MD5: 4K * 128
       BA 21 DC 42 F2 6B 14 19 22 72 A3 45 95 22 CC C1>)
(   3,<2012-05-20 11:26:56.831 +0200>,<patiny>,<icmbsg005>,<proc2d>,<TOPSPIN 3.0>,
      <Start of raw data processing
       xfb same F2: SI = 2K WDW = 3 SSB = 4 FT_mod = 6 PKNL = 1 F1: SI = 1K ME_mod = 2 NCOEF = 32 WDW = 4 SSB = 2 FT_mod = 6 PHC0 = 0 PHC1 = 0
       data hash MD5: 2K * 1K
       F9 72 DD 76 94 80 FE E3 9E 9D 89 23 C6 81 2F EC>)
(   4,<2012-05-20 11:26:56.943 +0200>,<patiny>,<icmbsg005>,<proc2d>,<TOPSPIN 3.0>,
      <abs2 F2: ABSG = 5 ABSF1 = 7.271974 ABSF2 = 0.6951642
       data hash MD5: 2K * 1K
       25 5A 6D BF FD AE 6D 18 52 2C BB 40 7B 91 60 B9>)
(   5,<2012-05-20 11:26:57.126 +0200>,<patiny>,<icmbsg005>,<proc2d>,<TOPSPIN 3.0>,
      <abs1 F1: ABSG = 5 ABSF1 = 210.754 ABSF2 = -11.10083
       data hash MD5: 2K * 1K
       58 B6 3B B7 A9 69 27 2E B8 A5 68 EF FC 03 C4 EA>)
$$ ##END=
$$ 
$$ $$ hash MD5
$$ $$ 89 17 86 34 62 60 73 8C 22 51 36 96 E8 31 92 D0
##$RELAX= 
##$RELAX= 
##$RELAX= 
##$RELAX= 
##$RELAX= 
##$RELAX= 
##$RELAX= 
##$RELAX= 
##$RELAX= 
##$RELAX= 
##$RELAX= 
$$ Bruker specific parameters
$$ --------------------------
##$DATPATH= </opt/data/patiny/nmr>
##$EXPNO= 14
##$NAME= <XTC-1693_1>
##$PROCNO= 1
##$ACQT0= 1000000
##$AMP= (0..31)
100 100 100 100 100 100 100 100 100 100 100 100 100 100 100 100 100 100
100 100 100 100 100 100 100 100 100 100 100 100 100 100
##$ANAVPT= -1
##$AQSEQ= 0
##$AQ_mod= 3
##$AUNM= <au_getlinv>
##$AUTOPOS= <40 >
##$BF1= 400.13
##$BF2= 100.612769
##$BF3= 400.13
##$BF4= 400.13
##$BF5= 400.13
##$BF6= 400.13
##$BF7= 400.13
$$ [...]
##$SIGF1= 7.271974
##$SIGF2= 0.6951642
##$SINO= 0
##$SIOLD= 2048
##$SPECTYP= <>
##$SREGLST= <1H.DMSO>
##$SSB= 4
##$STSI= 2048
##$STSR= 0
##$SW_p= 2631.57894736842
##$SYMM= 0
##$S_DEV= 2464959
##$TDeff= 4096
##$TDoff= 0
##$TI= <>
##$TILT= no
##$TM1= 0
##$TM2= 0
##$TOPLEV= 100
##$USERP1= <>
##$USERP2= <>
##$USERP3= <>
##$USERP4= <>
##$USERP5= <>
##$WDW= 3
##$XDIM= 2048
##$YMAX_p= 266405671
##$YMIN_p= -267948545
##$CURPLOT= <Cups-PDF>
##$CURPRIN= <$Cups-PDF>
##$DFORMAT= <normdp>
##$LAYOUT= <+/2D_inv.xwp>
##$LFORMAT= <normlp>
##$PFORMAT= <normpl>
$$ Bruker specific parameters for F1
$$ ---------------------------------
##$ACQT0= 0
##$BF1= 100.612769
##$FnMODE= 6
##$NUC1= <13C>
##$O1= 10043.8343986724
##$SFO1= 100.622812834399
##$SW= 221.832681201688
##$SW_h= 22321.4283611104
##$TD= 128
##$ABSF1= 210.754
##$ABSF2= -11.10083
##$ABSG= 5
##$ABSL= 0
##$ALPHA= 0
##$AQORDER= 0
##$ASSFAC= 0
##$ASSFACI= 0
##$ASSFACX= 0
##$ASSWID= 0
##$AUNMP= <>
##$AXLEFT= 0
##$AXNAME= <F1>
##$AXNUC= <13C>
##$AXRIGHT= 0
##$AXTYPE= 0
##$AXUNIT= <>
##$AZFE= 0.1
##$AZFW= 0.5
##$BCFW= 0
##$BC_mod= 0
##$BYTORDP= 0
##$COROFFS= 0
##$CY= -3
##$DATMOD= 1
##$DC= 0
##$DFILT= <>
##$DTYPP= 0
##$ERETIC= no
##$F1P= 210.76350402832
##$F2P= -11.0913240743493
##$FCOR= 0.5
##$FTSIZE= 1024
##$FT_mod= 6
##$GAMMA= 0
##$GB= 0
##$INTBC= 1
##$INTSCL= 1
##$ISEN= 128
##$LB= 0
##$LEV0= 0
##$LPBIN= 256
##$MAXI= 10000
##$MC2= 5
##$MEAN= 0
##$ME_mod= 2
##$MI= 1
##$NCOEF= 32
##$NC_proc= -11
##$NLEV= 6
##$NOISF1= 0
##$NOISF2= 0
##$NSP= 0
##$NTH_PI= 0
##$NZP= 0
##$OFFSET= 210.754
##$PC= 4
##$PHC0= 0
##$PHC1= 0
##$PH_mod= 1
##$PKNL= no
##$PPARMOD= 1
##$PPDIAG= 0
##$PPIPTYP= 0
##$PPMPNUM= 2147483647
##$PPRESOL= 1
##$PSCAL= 1
##$PSIGN= 0
##$PYNMP= <>
##$REVERSE= no
##$SF= 100.612769
##$SI= 1024
##$SIGF1= 210.754
##$SIGF2= -11.10083
##$SINO= 0
##$SIOLD= 1024
##$SPECTYP= <>
##$SREGLST= <>
##$SSB= 2
##$STSI= 1024
##$STSR= 0
##$SW_p= 22321.42836111
##$SYMM= 0
##$S_DEV= 2464959
##$TDeff= 256
##$TDoff= 0
##$TI= <>
##$TILT= no
##$TM1= 0
##$TM2= 0
##$TOPLEV= 0
##$USERP1= <>
##$USERP2= <>
##$USERP3= <>
##$USERP4= <>
##$USERP5= <>
##$WDW= 4
##$XDIM= 128
##$YMAX_p= 266405671
##$YMIN_p= -267948545
$$ End of Bruker specific parameters
$$ ---------------------------------
##NTUPLES= nD NMR SPECTRUM
##VAR_NAME=  FREQUENCY1,    FREQUENCY2,      SPECTRUM
##SYMBOL=    F1,            F2,              Y
##.NUCLEUS=  13C,           1H
##VAR_TYPE=  INDEPENDENT,   INDEPENDENT,     DEPENDENT
##VAR_FORM=  AFFN,          AFFN,            ASDF
##VAR_DIM=   1024,          2048,            2048
##UNITS=     HZ,            HZ,              ARBITRARY UNITS
##FACTOR=    21.7982698838965, 1.28495065789474, 1
##FIRST=     21204.543296753, 2630.29399671053, -1678021
##LAST=      -1095.08679447308, 0,           535264
##MIN=       -1095.08679447308, 0,           -267948545
##MAX=       21204.543296753, 2630.29399671053, 266405671
##PAGE= F1=21204.54329675
##FIRST=     21204.543296753, 2630.29399671053, -1678021
##DATA TABLE= (F2++(Y..Y)), PROFILE
$$ [...]
##PAGE= F1=5684.175139418
##FIRST=     21204.543296753, 2630.29399671053, -51486
##DATA TABLE= (F2++(Y..Y)), PROFILE
792B871292J414731b434761m76961A914159K106350G10059J2734K562660e856199
782B64712L958859b123212D369052b26688C90333c492888B986846h75925A944650
772F537850A670570A12162J912978B74818J468951b829776a409398b11B494828
762e227783a091408k006569A669183a633921C791279f493446A773140a075152
753f1732l661563d94619l460646D727312a789162B009198D04974h01609o261387
744g062996B571704P39284a204450l496176C154982d272801D133852g37350a9806
734E632652B262175h43108L19809G27030a835540M58392B079613f89598B418179
724a21403B957765o4160c533234D568703a513387j035489A810675c866478A8728
$$ plain form
792 2871292 4286023 -2434761 -2911722 1914159 4020509 710059 722793 3285453 -5856199
782 264712 4223571 -2123212 4369052 -226688 390333 -3492888 2986846 -875925 1944650
772 6537850 1670570 112162 2025140 274818 1743769 -2829776 -1409398 -211 2494828
762 -5227783 -1091408 -3097977 1669183 -1633921 3791279 -6493446 1773140 -1075152
753 -61732 -3723295 -494619 -3955265 4727312 -1789162 2009198 404974 -801609 -7062996
744 -7062996 2571704 3310988 -1204450 -4700626 3154982 -4272801 4133852 -737350 -19806
734 5632652 2262175 -843108 -523299 727030 -1835540 -1377148 2079613 -689598 2418179
724 -121403 2957765 2893605 -3533234 4568703 -1513387 -2548876 1810675 -3866478 18728
714a728455A756019L362929H02675J37692c105671M19855A991512d253683B036281
704b946985a455830B02566i316252c228018d4236p1176B66574c992322k4948214
695b8940536e732400A640149c789435C2406809J187397F657603l076711P81334
687D362226a1815644m046k9654634b0316082j876358l969040F690524M8421626
679E5112150B6298893m715806J73852b990774j3778201e264252K487948K3985
671b752319B082931F50096J752588B45362a771400E69682J481247a668830A091655
661e739458B93797b753166C840979P4491M925773L591730N877341a0687145j0055198
652b0742343j3585763J3294624b330441k2156088B826644J6009243J0323885J6952755
$$ plain form
714 -1728455 1756019 5118948 802675 940367 -3105671 -2685816 1991512 -4253683 2036281
704 -2946985 -1455830 202566 -9316252 -3228018 -44236 -115412 266574 -3992322 -28940536
695 -28940536 -5732400 1640149 -3789435 32406809 33594206 6657603 3580892 4362226
687 4362226 -11815644 -11819690 -41474324 -20316082 -22192440 -26161480 6690524 55112150
679 55112150 26298893 21583087 21756939 -2990774 -16768975 -5264252 -2776304 -2752319
671 -2752319 2082931 650096 2402684 245362 -1771400 569682 2050929 -1668830 1091655
661 -5739458 293797 -2753166 3840979 3915470 8841243 12432973 18310314 -10687145 -20742343
652 -20742343 -34328106 -21033482 -2330441 -24486529 2826644 18835887 29159772 46112527
644D6112527A5581841a099766n434205j052241j1509059B656267a1683642q230401
636a9914043c834950B250586J9177719G328597C506266K32362d415950E18975
627A820316a669359A375802B01239b309135A387813b31568D628869o33811C02742
617B243755G62307k79119c775104f3940B415913a58538A272619J298822K55820
608B827261c992752I35098Q595187A06947K0245095j179678L2587906K3830686
600G5590956b67948545N0150427R6888544B66405671E2070072A2623728J523268
593A4146996n285821C234838F34338M139752f611399D711640A34436J542185K630361
584D306982d2480k295619R64938j057448D406516h24022B304772I08085K625140
$$ plain form
644 46112527 15581841 -1099766 -6533971 -7586212 -19095271 2656267 -11683642 -19914043
636 -19914043 -3834950 2250586 21428305 7328597 3506266 3738628 -4415950 518975
627 1820316 -1669359 1375802 201239 -2309135 1387813 -231568 4628869 3995058 302742
617 2243755 762307 483188 -3775104 -63940 2415913 -158538 1272619 2571441 2827261
608 2827261 -3992752 935098 9530285 106947 20352042 19172364 51760270 75590956
600 75590956 -267948545 -217798118 -120909574 266405671 52070072 12623728 14146996
593 14146996 8861175 3234838 634338 4774090 -6611399 4711640 134436 1676621 4306982
584 4306982 -42480 -2338099 -1373161 -2430609 4406516 -824022 2304772 908085 3533225
575C533225a474338N54155C648534A8855b06823h4704j404172C9549a98161h3895
564a935129Q81111A448221B96749b706294R67395e1238D565848c760535A494068
554d496096D868176a555259A095481j61141a815105B10524h62697k139296B298120
544g544764b959676A141456h195481a142160M14364L61259o27479A678689B23642
534h70122E52919K870610H68595F4642P22344J485388L16391c074823A862352
524f31835j161927j88113A45404J440167e13169B752061j330925i63664k951479
515c915143B109647R1977b032128k842218a072157k212897C500464M77288b893699
505E41264B07273P92862a11206j661849F297433B867626i85361j753300C86161
$$ plain form
575 3533225 -1474338 -920183 3648534 18855 -206823 -84704 -1488876 39549 -198161 -83895
564 -1935129 -1054018 1448221 296749 -2706294 -1738899 -51238 4565848 -3760535 1494068
554 -4496096 4868176 -1555259 1095481 934340 -1815105 210524 -862697 -3001993 2298120
544 -7544764 -2959676 1141456 -8195481 -1142160 -727796 -366537 -994016 1678689 223642
534 -870122 552919 3423529 868595 64642 786986 2272374 2588765 -3074823 1862352
524 -631835 -1793762 -1981875 145404 1585571 -513169 2752061 1421136 -963664 -3915143
515 -3915143 2109647 2201624 -2032128 -4874346 -1072157 -3285054 3500464 3977752 -2893699
505 541264 207273 1000135 -111206 -1773055 6297433 2867626 -985361 -2738661 386161
495d516431K0584G847290a260809C28276Q15261b747278A46500Q03082b505223
485D901058b438031e23984l51482G895319e34422E179372A779506K775714a587906
475i53244D56634J59160e18130l122720c66134C524199A720708a503755A21946
465a349034j627728l581783E17731J758705b325914F382338e054327G69148b772415
455F414274d095659A707149f839473D235256a472826j124322D114788b710842
446B64070K221336d512128a710000F84846J803633i34540p27182k403565a450661
436C606581K426429G69985j01622J749269m19361m70872c793879h85721D98717
426a647732K64981A540905O1646c98110J96490l191133e06936J02825j10361j740979
$$ plain form
495 -4516431 -4495847 7847290 -1260809 328276 1143537 -2747278 146500 949582 -2505223
485 4901058 -2438031 -523984 -875466 7895319 -534422 5179372 1779506 4555220 -1587906
475 -953244 456634 615794 -518130 -3640850 -366134 3524199 1720708 -1503755 121946
465 -1349034 -2976762 -6558545 517731 2276436 -2325914 6382338 -5054327 769148 -2772415
455 6414274 -4095659 1707149 -6839473 4235256 -1472826 -2597148 4114788 -2710842
446 264070 2485406 -4512128 -1710000 684846 2488479 -934540 -1661722 -4065287 -1450661
436 3606581 6033010 769985 668363 2417632 1998271 1527399 -3793879 -885721 498717
426 -1647732 -1382751 1540905 1602551 -398110 -201620 -3392753 -506936 -404111 -514472 -2255451
416b255451J75579C395538f88118o7347B240989j027482f088023B729023g481256
406c642839B856638f98187B222923K385959A727467b506480D70493O23463b627237
396G158973a192756j240571m86033C58254g07225k692641b02297j652182l233489
387e087968C279953K187761B476971b75490B70120b403274A995380b903800i23562
377f203121B267962d09142j188911C026929a029877C305229a438736A224877b658144
367F21658d560758a209984E734436k801268a845370B372656a802343j859026B138499
357I21519c117668A343372b264557q09194B723561b16037D310434j844755a902373
347a773618K5942l1969D674751i9093C147975j083758d240940a609365M76677
$$ plain form
416 -2255451 -2079872 3395538 -688118 -755465 2240989 1213507 -6088023 2729023 -7481256
406 -3642839 2856638 -698187 2222923 4608882 1727467 -2506480 470493 1093956 -2627237
396 7158973 -1192756 -2433327 -2919360 358254 -707225 -3399866 -202297 -1854479 -5087968
387 -5087968 3279953 5467714 2476971 -275490 270120 -2403274 1995380 -2903800 -923562
377 -6203121 2267962 -409142 -1598053 3026929 -1029877 3305229 -1438736 1224877 -2658144
367 621658 -4560758 -1209984 5734436 2933168 -1845370 2372656 -1802343 -3661369 2138499
357 921519 -3117668 1343372 -2264557 -3073751 2723561 -216037 4310434 2465679 -1902373
347 -1773618 -1747676 -1779645 4674751 -99093 3147975 2064217 -4240940 -1609365 -1132688
338a132688E252252f300760A645135D16274J903743C62226d349475D009671c291709
328e82824l39635C80495e48149k000457Q06840j547246a084215j738034C167746
318D10310b4636B596574j72751C38181J860427b567064j171068D93492f44110
308C077271j460945e80350j680333J115823n27287k255603a534272B084638g32694
298a417483G38865L48017J410108a419118A51704c239752f53406A809540f614609
288H15500N087162j251811k136241e300733E46744J04967a07691j337674A939333
278B304034a295761B46000a886312I664559A464966b050663C99351L001948c898767
268E291233E87507A3888M039340a244585A01355c33686B72652J163405l90968
$$ plain form
338 -1132688 5252252 -6300760 1645135 416274 2320017 362226 -4349475 4009671 -3291709
328 -582824 -922459 380495 -548149 -2548606 -1741766 -3289012 -1084215 -2822249 3167746
318 410310 -24636 2596574 2423823 338181 2198608 -2567064 -3738132 493492 -644110
308 3077271 1616326 -580350 -2260683 -1144860 -1672147 -3927750 -1534272 2084638 -732694
298 -1417483 738865 1086882 2496990 -1419118 151704 -3239752 -653406 1809540 -6614609
288 815500 5902662 4650851 2514610 -5300733 546744 651711 -107691 -1445365 1939333
278 2304034 -1295761 246000 -1886312 9664559 1464966 -2050663 399351 3401299 -3898767
268 5291233 587507 13888 4053228 -1244585 101355 -333686 272652 1436057 1045089
259A045089d07664A191573b806634q03601D553394b164539A950652a832068a76776
249B02490b69495k079057i72822n12859D561231a006599D348169f26901E420315
239e081261a513471A7771K637676q01587J073556d79355k94377A662985c526015
229H325722b537844A790729a688698k899185C972323c33470m912516F30943c17808
219C352310c079670o27571C78346a27500A109009D7594M84655c036787a25345
209H77426K777415a614502G817537e930338H357533a295006m601796C210184P91134
200D001318d954649B728283a651256B233406P15085e89245B350584b822861A589239
190a129158l193548C09517P293236A679711d49745C759378h55243j588038L42711
$$ plain form
259 1045089 -407664 1191573 -2806634 -3610235 4553394 -2164539 1950652 -1832068 -176776
249 202490 -269495 -2348552 -972822 -1485681 4561231 -1006599 4348169 -626901 5420315
239 -5081261 -1513471 17771 2655447 1853860 2927416 -479355 -773732 1662985 -3526015
229 8325722 -2537844 1790729 -1688698 -4587883 3972323 -333470 -5245986 630943 -317808
219 3352310 -3079670 -3707241 378346 -127500 1109009 47594 532249 -3036787 -125345
209 877426 3654841 -1614502 7817537 -5930338 8357533 -1295006 -5896802 3210184 4001318
200 4001318 -4954649 2728283 -1651256 2233406 2948491 -589245 2350584 -2822861 1589239
190 -1129158 -4322706 309517 7602753 1679711 -449745 3759378 -855243 -2443281 -2100570
181b100570g03201G032568d021855A477775K765992B048689K71033c149380A328590
171D372302b637106a124474F903267b447849a059564k175002B82958M74808a6397470
161e1569149j29939229C0320065J8989691J17206793k4664292p426587A1867236
153e9350041o9222565j4281582C5500207H11338J307907K212336j930643E88029
144g3080j45478j349655A024738O195192h17685A942569M887787i5076n15344
135f10420H33053A608d211851C01696c496016J352465C640907A322151b793637
125F60499K370771j436664c210805J433602m64042B993606d928430A18977J0421
116A29398L62440O531449B41775b218132H04218D0274Q05027a716055F35375b835058
$$ plain form
181 -2100570 -703201 7032568 -4021855 1477775 4243767 2048689 2319722 -3149380 1328590
171 4372302 -2637106 -1124474 6903267 -2447849 -1059564 -3234566 282958 757766 -16397470
161 -51569149 -181508378 30320065 49309756 166516549 141852257 134425670 11867236
153 -59350041 -128572606 -142854188 35500207 811338 2119245 4331581 2400938 588029
144 -73080 -218558 -1568213 1024738 7219930 -817685 1942569 6830356 -95076 -610420
135 -610420 833053 1608 -4211851 301696 -3496016 -2143551 3640907 1322151 -2793637
125 660499 3031270 1594606 -3210805 -1777203 -2241245 2993606 -4928430 118977 129398
116 129398 491838 7023287 241775 -2218132 804218 40274 845301 -1716055 635375 -2835058
105a620227a79763j417494I37795K010936a777812G95003f90518A497516i68494
95A110836b891090a442707L89478m371165E452591O09549b134723A289467c137256
85d50873A190998e961975C061161I20179J666712a975984A186816c309547C078523
75b37394n422543H50001K39578j49121a070554C1772K202013K433281A153119
65b26152j291384F916185i63583k10443A5486b392125E644365e362074A038661
55B182478b692612C120487d931308D873994E02231K090578d371072g25738c45440
45A620937G294L234490d289234C108544f063091f89795A457284i79103D15771
35B237832q74627d195484a18992B362272M37784G65096b403915j701409f49581
$$ plain form
105 -1620227 -179763 -1597257 937795 2948731 -1777812 795003 -690518 1497516 -968494
95 1110836 -2891090 -1442707 -1053229 -5424394 5452591 6062140 -2134723 1289467 -3137256
85 -450873 1190998 -5961975 3061161 920179 2586891 -1975984 1186816 -3309547 3078523
75 -237394 -5659937 850001 1089579 940458 -1070554 31772 2233785 4667066 1153119
65 -226152 -1517536 6916185 -963583 -1174026 15486 -2392125 5644365 -5362074 1038661
55 2182478 -2692612 3120487 -4931308 4873994 502231 2592809 -4371072 -725738 -345440
45 1620937 7294 3241784 -4289234 3108544 -6063091 -689795 1457284 -979103 415771
35 2237832 1363205 -4195484 -118992 2362272 2800056 765096 -2403915 -4105324 -649581
25a940823A134152K007898A031059A13178a568052j951824a707610C102818a348679
15D78502c165049a69328H45299J333083J293012E76597c86159B959382H99019
5b180632a24559G096b684371A989788I43075
$$ plain form
25 -1940823 1134152 3142050 1031059 113178 -1568052 -3519876 -1707610 3102818 -1348679
15 478502 -3165049 -169328 845299 2178382 3471394 576597 -386159 2959382 899019
5 -2180632 -124559 7096 -2684371 1989788 943075
##PAGE= F1=5662.376869535
##FIRST=     21204.543296753, 2630.29399671053, 378207
##DATA TABLE= (F2++(Y..Y)), PROFILE
2047C78207b198232O73237B586755j063985a654839F14270J354788i86154K26803
2038g59351A690927K44569f60526B446907H53268a193710k324082J230274a025061
2028B072220c059937e31727A127864O3239Q09638c359115A975084o23010i63812
2018E15889b344152d89601B080179K927596b679302G70398b446585j137265E81340
2008B414571F73007a129902j161208A857651a744646A193494l45961a637501E137898
1998d301914g72569F65213K722221b783067b24277E853917c086727A0004c32939
1988h47952k139207F972409d61135G984518a170693l987683A951908M99800Q62811
1979C314519e205932b007890I21382b087994E11014M340591b238939B460343A046484
$$ plain form
2047 378207 -2198232 -1524995 2586755 1522770 -1654839 614270 1969058 -986154 -759351
2038 -759351 1690927 1935496 -660526 2446907 853268 -1193710 -3517792 -2287518 -1025061
2028 2072220 -3059937 -531727 1127864 1191103 2000741 -3359115 1975084 1352074 -963812
2018 515889 -2344152 -489601 2080179 5007775 -2679302 770398 -2446585 -3583850 581340
2008 2414571 673007 -1129902 -2291110 1857651 -1744646 1193494 847533 -1637501 5137898
1998 -4301914 -772569 665213 3387434 -2783067 -224277 5853917 -3086727 10004 -332939
1988 -847952 -2987159 6972409 -461135 7984518 -1170693 -5158376 1951908 2451708 3314519
1979 3314519 -5205932 -2007890 921382 -2087994 511014 4851605 -2238939 2460343 1046484
1969A193750J43170K601013b774904C17885M309653D10958b78620B30311J162502
1960A392813O375435b966082j652627C093750a161246D3815g02010j295566C366118
1950G93771d712986A662348M726769b530866B093774J219691A556048a038467
1941D179141d918606A674149c215933r29712G837177a736914p46382g62755B077713
1931B468499g40309k943995B568736q79681o37580e051690C223820h14502j410206
1922b224708h68977B634201b547837D6817N86137a447215j829946C135795A080013
1912B057434H89929c45079D691855a774659F870810B887712e59488j767293b54565
1902a820096D236080A702474b386005r76194H55621g90210k635957H51648C51060
$$ plain form
1969 1193750 1336920 3937933 -2774904 317885 4627538 410958 -278620 230311 1392813
1960 1392813 7768248 -2966082 -4618709 3093750 -1161246 43815 -702010 -1997576 3366118
1950 793771 -4712986 1662348 6389117 -2530866 2093774 3313465 1556048 -1038467
1941 4179141 -4918606 1674149 -3215933 -4145645 7837177 -1736914 -2483296 -762755 2077713
1931 2468499 -740309 -3684304 2568736 1689055 1051475 -5051690 3223820 -814502 -2224708
1922 -2224708 -868977 2634201 -2547837 46817 632954 -1447215 -3277161 3135795 1080013
1912 2057434 889929 -345079 4691855 -1774659 6870810 2887712 -559488 -2326781 -254565
1902 -1820096 4236080 1702474 -2386005 -3362199 855621 -790210 -3426167 851648 351060
1892A691576i69157j9022C383668a359028F36825e382347D89032L643956b874745
1882C369327M51306b060294D87427L943397d386735A115827p4755a788052A332791
1872a121005C80241a040903D623462c094037A209498J512825B8009L986235i71470
1862b121473B141956f33966m431487A16843K071292j48542b093201I67212c055960
1852A425347J555155D349d48655q35606A647927G76084a991307Q98888D730185
1842B614149b840839B166284J852526A157667f54932r04719k396655C945901c748898
1832F97648b115728N59313A0513715a127914A010165a599881G49715a068963e05830
1822g6894C814845b772703b78458p23109B638886j211627I6675K230596b058990
$$ plain form
1892 1691576 -969157 -988179 3383668 -1359028 636825 -5382347 489032 4132988 -2874745
1882 3369327 3820633 -2060294 487427 4430824 -4386735 1115827 1041072 -1788052 1332791
1872 -1121005 380241 -1040903 4623462 -3094037 1209498 2722323 28009 4014244 -971470
1862 -2121473 2141956 -633966 -5065453 116843 2188135 2039593 -2093201 967212 -3055960
1852 1425347 2980502 4349 -448655 -1284261 1647927 776084 -1991307 -1092419 4730185
1842 2614149 -2840839 2166284 4018810 1157667 -654932 -1559651 -3956306 3945901 -3748898
1832 697648 -2115728 -1556415 10513715 -1127914 1010165 -1599881 749715 -1068963 -505830
1822 -76894 3814845 -2772703 -278458 -1001567 2638886 1427259 96675 2327271 -2058990
1812D962412d070532B016372a421109B999596E56826k22198L563673b965256B918295
1802b786952A039272d733850J722990C031862e775134a532590I85839c05585k384123
1793b689708C513179k8716r24434A089218d20953k390311B695146a551026p88418
1784b339444I51879M65255b28820G4152L695298b938544r59074C811836I20115
1774A698740c56222r43333D440681i64615f203B07778L64555d713399a645777
1764a241976C322117f446315A800050a917578A758942B31045M18056a264644j597159
1755b861803B336966c454215C970368d826351a614891G875194A604775c273654
1746c587066B147855F62919g272C449047J580434H34536C25182b340427F12194
$$ plain form
1812 4962412 -4070532 2016372 -1421109 2999596 556826 334628 3898301 -2965256 2918295
1802 -2786952 1039272 -4733850 -3010860 3031862 -5775134 -1532590 985839 -305585 -2689708
1793 -2689708 3513179 3484463 2560029 1089218 -420953 -2811264 2695146 -1551026 -2339444
1784 -2339444 951879 1417134 -228820 74152 3769450 -2938544 -3897618 3811836 920115
1774 1698740 -356222 -1299555 4440681 -964615 -6203 207778 572333 -4713399 -1645777
1764 -1241976 3322117 -6446315 1800050 -1917578 1758942 231045 649101 -1264644 -2861803
1755 -2861803 2336966 -3454215 3970368 -4826351 -1614891 7875194 1604775 -3273654
1746 -3587066 2147855 662919 -7272 3449047 5029481 834536 325182 -2340427 612194
1736C68206b235374H69611n26d58659B185127J027681a891966j810906J018396
1727b684476A790493h41985E037109C46832b96865j087719A122657b40251o49361
1718h89612H60513d79671A704626K278686j560145b235643B266756J320816a352886
1708b552258J033299K72734H13840b036961o55383a125191E43167K222972r39041
1699A827098b29582C864120c482511B762659j138225b395127B06591d189773J479546
1690b710227F801380b492821J044523J24854B410492n62311e250959D067916g74622
1680g57825j317566k239787F31552a646980G064427a956318C73773a118084D628612
1670D5578J057683b868150A520069J609527B65855c562005A111260K8150J544664
$$ plain form
1736 368206 -2235374 869611 869085 -458659 2185127 3212808 -1891966 -3702872 -2684476
1727 -2684476 1790493 -841985 5037109 346832 -296865 -1384584 1122657 -240251 -889612
1718 -889612 860513 -479671 1704626 3983312 2423167 -2235643 2266756 3587572 -1352886
1708 -2552258 -1518959 -1246225 813840 -2036961 -2692344 -1125191 543167 2766139 1827098
1699 1827098 -229582 3864120 -3482511 2762659 1624434 -2395127 206591 -4189773 -2710227
1690 -2710227 6801380 -2492821 -1448298 -1323444 2410492 1848181 -5250959 4067916 -774622
1680 -757825 -2075391 -4315178 631552 -1646980 7064427 -1956318 373773 -1118084 4628612
1670 45578 1103261 -2868150 1520069 3129596 265855 -3562005 1111260 1139410 2684074
1661B684074A174558L957866d486445c67458C947820b849119Q92514r03776E724472
1651e161939A98253a971921B988313A286978K406382a124752k7381B979092d93884
1641a147426C744149h13520a19279j83055l761948A459965J048470j250631G4877
1631b8157j047371l33563B562095m0317a093724B59739K081025a79098L3757p254627
1621g399968A832336c705728c78697B242390h35489m91696K18077D26650R33184
1612A359834b887736A787254p56249c167832D286089j531504a730512k953095
1604d683607F923514c498367A200447a940233k853106b287923H57953J447626
1596B305579m04108e56712A639748g09089B272318c906072i02779A5394K036252
$$ plain form
1661 2684074 1174558 5132424 -4486445 -367458 3947820 -2849119 -1956605 -2860381 5724472
1651 -5161939 198253 -1971921 2988313 1286978 3693360 -1124752 -1152133 2979092 -493884
1641 -1147426 3744149 -813520 -119279 -302334 -4064282 1459965 2508435 1257804 74877
1631 -28157 -1075528 -1409091 2562095 2521778 -1093724 259739 2340764 -179098 -145341 -7399968
1621 -7399968 1832336 -3705728 -378697 2242390 -835489 -1327185 -1109108 426650 1359834
1612 1359834 -2887736 1787254 1031005 -3167832 4286089 2754585 -1730512 -4683607
1604 -4683607 6923514 -3498367 1200447 -1940233 -4793339 -2287923 857953 2305579
1596 2305579 1901471 -556712 1639748 -709089 2272318 -3906072 -902779 15394 2051646
1587B051646d193331F640164A12089b228881B438992C36474b589568C076482B01990
1577A853112b996863J430509C390216c8356l779028Q50503l73414k35904D726502
1567B424391a879057F336569D58277a511160k394492A761086b702034A710033
1558D445052c073816D25772a423985m4338I87025l06084c419624I766M755961
1549D765727b622954l346416B162103D49090J753472q60214K484210a997076n7952
1540b055028C312902e49674H692704f007277A9899e849976K528847B416320L6964
1531B453284b742053D61770K36068l9129c496704J603611a28171C059397d22733
1521c02058C052099F17451c622328A128278c913394E405067e17957D219475c957096
$$ plain form
1587 2051646 -4193331 6640164 112089 -2228881 2438992 336474 -2589568 3076482 201990
1577 1853112 -2996863 -1566354 3390216 -38356 -3817384 -2966881 -3340295 -3576199 4726502
1567 2424391 -1879057 6336569 458277 -1511160 -3905652 1761086 -2702034 1710033
1558 4445052 -3073816 425772 -1423985 -1468323 987025 680941 -3419624 9766 4765727
1549 4765727 -2622954 -5969370 2162103 449090 2202562 1342348 3826558 -1997076 -2055028
1540 -2055028 3312902 -549674 8692704 -6007277 19899 -5849976 -3321129 2416320 2453284
1531 2453284 -2742053 461770 697838 658709 -3496704 -1893093 -128171 3059397 -422733
1521 -302058 3052099 617451 -3622328 1128278 -3913394 5405067 -517957 4219475 -3957096
1511e914921E19196M464254B474313h35488B117245e571195I258821a473636B683620
1501a180168j391746e37746E45192a316184B993482d695692C50384J659505M21615
1492B431504a425241B700624a537089A784751a008482A315761b627642a98386
1483H42830J924934m40261n96968b510986B260781r55466b665163D662464d648010
1473A414536K341039e383031F29911g942989F801287d775606B252902a217929
1464D347607e956033B025490b187447A960555a847308j332135C406430B89496
1455B162320l35770N94223r41522N808617c87259k215340C392632j513732c981429
1445C591190b361988k539060A788195d258757c51114m559023D418991k098045
$$ plain form
1511 -5914921 519196 4983450 2474313 -835488 2117245 -5571195 9258821 -1473636 2683620
1501 -1180168 -2571914 -537746 545192 -1316184 2993482 -4695692 350384 2009889 2431504
1492 2431504 -1425241 2700624 -1537089 1784751 -1008482 1315761 -2627642 -198386
1483 842830 2767764 2327503 1730535 -2510986 2260781 1305315 -2665163 4662464 -4648010
1473 1414536 3755575 -5383031 629911 -7942989 6801287 -4775606 2252902 -1217929
1464 4347607 -5956033 2025490 -2187447 1960555 -1847308 -3179443 3406430 289496
1455 2162320 1826550 2420773 1479251 7287868 -387259 -2602599 3392632 1878900 -3981429
1445 3591190 -2361988 -4901048 1788195 -4258757 -351114 -4910137 4418991 2320946
1437B320946c274940Q28352A931494c52650B434533a842421o28496B702131m47993
1428B254138g17963m425513C37718M804395k508341a093318B59046e700048B587567
1418A791856a149542B805701d656712G810278b559691o707B273834a669446C715391
1408A859434m06507c830109N21543A42393J924188o25586K39618P34609H65242
1398C742494C97657e024633C107489d096789G093081c983168C60978c433310A872718
1388B217885b809224D491294d772977k981573D706475b215187C271235j433081
1380A838154d258556A81889a230300n01495n67556A918275a78669k525881a057410
1370c625114A998933a165734o545228D632754A454739Q6006a390927N04421E728663
$$ plain form
1437 2320946 -3274940 -2446588 1931494 -352650 2434533 -1842421 -2470917 2702131 2254138
1428 2254138 -717963 -5143476 337718 5142113 2633772 -1093318 259046 -5700048 2587567
1418 1791856 -1149542 2805701 -4656712 7810278 -2559691 -2566398 2273834 -1669446 3715391
1408 1859434 1452927 -3830109 -3308566 142393 2066581 1440995 1680613 2415222 865242
1398 3742494 397657 -5024633 3107489 -4096789 7093081 -3983168 360978 -3433310 1872718
1388 2217885 -2809224 4491294 -4772977 -7754550 4706475 -2215187 3271235 1838154
1380 1838154 -4258556 181889 -1230300 -1731795 -2299351 1918275 -178669 -2704550 -1057410
1370 -3625114 1998933 -1165734 -7710962 4632754 1454739 1540745 -1390927 -886506 5728663
1360c192120F25571h43961A456662a217262D393890j786160j201548a923829A481831
1350A632871J145908E0182J422158h56890j796428G887200c722951h14445r79933
1341a794378P70055I39785e308434E56281M361931e94775E70697B74868a766520
1331A969198F67427b309193N91823A179873b87989j713241k502870K114890G578925
1321a116489j29667D80738L492218b462965A53249d53346F27466J515590r12872
1312A230184M09709J239395j104471c701969f45144p20766C267756B72148J498596
1303A770744c774705J334896A049802a859372E373439f137809A007717M006905
1295E014622B28909L728544C58688c134802i05500B505990I38217e305162G339129
$$ plain form
1360 -3192120 625571 -843961 1456662 -1217262 4393890 2607730 1406182 -1923829 1481831
1350 1632871 2778779 50182 1472340 -856890 -2653318 7887200 -3722951 -814445 -1794378
1341 -1794378 -1024323 939785 -5308434 556281 4918212 -594775 570697 274868 -1766520
1331 1969198 667427 -2309193 -1717370 1179873 -287989 -2001230 -4504100 -2389210 7578925
1321 -1116489 -1246156 480738 3972956 -2462965 153249 -453346 627466 2143056 1230184
1312 1230184 1639893 2879288 1774817 -3701969 -645144 -1365910 3267756 272148 1770744
1303 1770744 -3774705 -2439809 1049802 -1859372 5373439 -6137809 1007717 5014622
1295 5014622 228909 3957453 358688 -3134802 -905500 2505990 938217 -5305162 7339129
1285A30890L251823b346765H34731d912873a861992C5577b750425D189225d347763
1275D28783a514316m457705C953940c701669A046127b254159C25102b951007I95212
1265D045292A966132f53434j949321N46657B013205d022929C624787a293430k037391
1256c330821C756361I35250m56039J29579c156778D334799A571827g4472l647714
1247c722186C967690d799024B334823a761790i5190C017327j176307K333866B92493
1237c655157A816851a700440k01391b94509A922426K361552a912115A830352b46253
1227B767226A193582e626971I874431d838521e14813o6141B531459i95963A319886
1217E49776J280471a200346A071837d096482e81725B474765a46464j075660B791906
$$ plain form
1285 130890 3382713 -2346765 834731 -4912873 -1861992 35577 -2750425 4189225 -4347763
1275 428783 -1514316 -5972021 3953940 -3701669 1046127 -2254159 325102 -2951007 995212
1265 4045292 1966132 -653434 -2602755 -2056098 2013205 -4022929 3624787 -1293430 -3330821
1256 -3330821 3756361 935250 479211 608790 -3156778 4334799 1571827 -74472 -3722186
1247 -3722186 3967690 -4799024 2334823 -1761790 -95190 3017327 1841020 4174886 292493
1237 -3655157 1816851 -1700440 -1901831 -294509 1922426 4283978 -1912115 1830352 -246253
1227 2767226 1193582 -5626971 9874431 -4838521 -514813 -580954 2531459 -995963 1319886
1217 549776 1830247 -1200346 1071837 -4096482 -581725 2474765 -146464 -1222124 2791906
1207H03321M587816C91217b281922C287213H29524c277797A037173d728058C287546
1197a661115O55317D159444f504441b807340A546052D19813N334917h509266C331891
1187A134653g82203A830999h1393q899098A610895b820192j55523j331995e95405
1177d066611A637213E05383a597795o16947k78591p54073C44122f15965A193241
1167B312106n84568P70201a36306l592328G223297h573997D50756K607203e405209
1157C811255A297469D64084J034640e74146k881838d27481A576206B03412J267227
1148A470639a765144b65401m04793A475402a029618C208592b68462A779343d543255
1138A252511K765667c42411C045969b867186C536299B98376L278048a437922A948021
$$ plain form
1207 803321 5391137 391217 -2281922 3287213 829524 -3277797 1037173 -4728058 3287546
1197 -1661115 -1005798 4159444 -6504441 -2807340 1546052 419813 5754730 -8509266 3331891
1187 1134653 -782203 1830999 -81393 -8980491 1610895 -2820192 -2975715 -4307710 -595405
1177 -4066611 1637213 505383 -1597795 -2214742 -2493333 -3247406 344122 -615965 1193241
1167 2312106 1727538 2497739 -136306 -3728634 7223297 -8573997 450756 3057959 -5405209
1157 3811255 1297469 464084 1498724 -574146 -3455984 -427481 1576206 203412 1470639
1148 1470639 -1765144 -265401 -670194 1475402 -1029618 3208592 -268462 1779343 -4543255
1138 1252511 4018178 -342411 3045969 -2867186 3536299 298376 3576424 -1437922 1948021
1128b055381B811881G80878b977335N51450H6207a769448C512734k81710a03438
1118A23352a667419k324035B171854b537068j976894C506220a612569k675752
1110d288321B626005c335819E840778b65329A23594c11660A25969J619158e200874
1100C631239j48919i160A146492D50750K658200c185047L95162B390310A73543
1090c002651C776786m8933c014027O76629A642001a330237A19054R09224b043448
1080F152781a535150E11599J994435B33956g74558j061750o5532C489866b418464
1070B03349d919825B737444L49358e014892A609915N111806A384132C5968a242419
1060I19101a577655A522271Q79521J618905c595335A381846i18943B14050L549864
$$ plain form
1128 -2055381 2811881 780878 -2977335 -2425885 86207 -1769448 3512734 3231024 -103438
1118 123352 -1667419 -3991454 2171854 -2537068 -4513962 3506220 -1612569 -4288321
1110 -4288321 2626005 -3335819 5840778 -265329 123594 -311660 125969 1745127 -5200874
1100 3631239 3482320 -9160 1146492 450750 3108950 -3185047 -2789885 2390310 173543
1090 -3002651 3776786 3727853 -3014027 -2337398 1642001 -1330237 119054 1028278 -2043448
1080 6152781 -1535150 511599 2506034 233956 -774558 -1836308 -1901840 3489866 -2418464
1070 203349 -4919825 2737444 3086802 -5014892 1609915 6721721 1384132 35968 -1242419
1060 919101 -1577655 1522271 2401792 4020697 -3595335 1381846 -918943 214050 3763914
1051C763914l8007B98522e857711A811177D9758J449423b515110C773406b272966
1041b399889A209062K084902d881868G759845c091004p78359C481946c614851
1032C096521e432299A379958K922402b099221A064794b441444A438783J256265
1024B695048E40308F5591L717657e006165b123758F05899a27852k818787A268287
1014A553689a387374l762920B317213G69112P80007d78710E624685F84146L478349
1005D162495a298455G140740E07441K314579a872689C614407a548642C69248a337290
995A841213f994118A144653J886436D79609b137277h06854l76596l058500p7187
986d319137J773600I300077f265080A326337N19616g44623C50462L742009A476887
$$ plain form
1051 3763914 3725907 298522 -5857711 1811177 49758 1499181 -2515110 3773406 -2272966
1041 -2399889 1209062 3293964 -4881868 7759845 -3091004 -3869363 3481946 -3614851
1032 3096521 -5432299 1379958 4302360 -2099221 1064794 -2441444 1438783 2695048
1024 2695048 540308 65591 3783248 -5006165 -2123758 605899 -127852 -2946639 1268287
1014 1553689 -1387374 -5150294 2317213 769112 1549119 -478710 5624685 684146 4162495
1005 4162495 -1298455 7140740 507441 2822020 -1872689 3614407 -1548642 369248 -1337290
995 1841213 -6994118 1144653 3031089 479609 -2137277 -806854 -1183450 -4241950 -4319137
986 -4319137 -2545537 9300077 -6265080 1326337 1845953 -744623 350462 4092471 1476887
976D831610A595860J178396a826597g1439A888183a751253B30315J352114C42568
966C740092a427106B07674f00156D917652A862997e70034C07020L600460d97366
956A574927e949124F723938g78614B568665c864186C450799e9414k11359C599194
946C521566A684247B74310c611503B325779p21071M122336d858380A218521n25592
937F92929O94568K948687A380501a105319b56206k901010H75728b12107r80585
928a192692B299633K86522F87312J701878B24491c952189A5290G171c064686a45493
917c306841B013991d811775J608198C138J243244b44893k155926G1066O36116
908G07182R93438c313399J593489A50207a552887k397182C201196c12637r35994
$$ plain form
976 4831610 1595860 2774256 -1826597 -71439 1888183 -1751253 230315 1582429 342568
966 3740092 -1427106 207674 -600156 4917652 1862997 -570034 307020 3907480 -497366
956 1574927 -5949124 6723938 -778614 2568665 -3864186 3450799 -59414 -270773 3599194
946 3521566 1684247 274310 -3611503 2325779 1604708 5727044 -4858380 1218521 692929
937 692929 1387497 4336184 1380501 -1105319 -256206 -3157216 875728 -212107 -1192692
928 -1192692 2299633 2586155 687312 2389190 224491 -3952189 15290 7171 -3064686 -145493
917 -3306841 2013991 -4811775 -3203577 3138 1246382 -244893 -2400819 71066 707182
908 707182 1700620 -3313399 -1719910 150207 -1552887 -3950069 3201196 -312637 -1248631
899a248631l076545J50239R07033C762882n78342a702681B852014Q66878a482178
889A736950a545055A915636c507303A612530D35650c44476E77152b055161p61835
880b816996a74488B599016J638384d954202F283237d412536c38108A120821K07652
871A328473P06322B23779F5191d068771D433286a978019P96337j282173I82921
861B794723A230609b133683j78365A469486g76859c49286D895477e277726D92224
851i8022j356126B184353l321c305679k338393B686839N25528e819756D44743
841g43856E947522c874084J134220F62478b921679O06104A193147J655744h42932
831c135821a458606A327582J802202j9341b47014k296253I88262O57703p55114
$$ plain form
899 -1248631 -4325176 -4174937 -3267904 3762882 3184540 -1702681 2852014 3718892 -1482178
889 1736950 -1545055 1915636 -3507303 1612530 435650 -344476 577152 -2055161 -2816996
880 -2816996 -174488 2599016 4237400 -4954202 6283237 -4412536 -338108 1120821 1328473
871 1328473 2034795 223779 65191 -4068771 4433286 -1978019 -1181682 -2463855 982921
861 2794723 1230609 -2133683 -2312048 1469486 -776859 -349286 4895477 -5277726 492224
851 -98022 -1454148 2184353 2181032 -3305679 -5644072 2686839 3212367 -5819756 444743
841 -743856 5947522 -3874084 -2739864 662478 -2921679 -2315575 1193147 2848891 -842932
831 -3135821 -1458606 1327582 3129784 3110443 -247014 -2543267 988262 1645965 890851
822H90851a049687a60964p950063b61983A633L03464c52380B165772a509240n7884
812a567124A172761D26002b219493h21591E68342a912191A789138c283556c48915
802G06440a806437C533286e038402B458429b164255B595048j219805b180082D236370
792B023393J613791b257681m77119A752228K128109A152248n53537L371157d798841
782A613274J227145b192114B304690b81022A23853c153416C702909i18615B190710
772F684739B560816f11365B479746h9966B667309c402498a303514A104K593173
763B594277e041213a204434k301538A978288b258682D891728e490044A653604
754a300332G50405c234554f03951k879042E778730a281167A839803l49264c3509
$$ plain form
822 890851 -1049687 -160964 -8111027 -261983 1633 305097 -352380 2165772 -1509240 -1567124
812 -1567124 1172761 426002 -2219493 -821591 568342 -1912191 1789138 -3283556 -348915
802 706440 -1806437 3533286 -5038402 2458429 -2164255 2595048 1375243 -2180082 4236370
792 2023393 3637184 -2257681 -2734800 1752228 3880337 1152248 598711 3969868 -4798841
782 1613274 2840419 -2192114 2304690 -281022 123853 -3153416 3702909 -918615 2190710
772 6684739 2560816 -611365 2479746 -89966 2667309 -3402498 -1303514 1104 2594277
763 2594277 -5041213 -1204434 -3505972 1978288 -2258682 4891728 -5490044 1653604
754 -1300332 750405 -3234554 -603951 -3482993 5778730 -1281167 1839803 1490539 -33509
744f482413B059421O18968a658428k438975D005910d242196D053696f3131D85104
734E657784B461095a948268c84007G54938a331225L22107A773358h51387B061973
724h15312C578596j55748c768505D667351i02095k175276A754189d333182D39928
714a615928B521306J602231H80652L5170c379695k24614A834994d404937B298916
704a734359g28804B49785i440726c009541C48338b02085r3984l448153k3836864
695b7581086f775955B263793c751468C1282818L321434F384813k221619P52434
687D915628a2072525j071184k7926447K0248468j363737l065490F495255M9113514
679E5608769B5498327l433785K09039c819771j0848511e660581K438653Q03049
$$ plain form
744 -6482413 2059421 2678389 -1658428 -4097403 4005910 -4242196 4053696 -63131 485104
734 5657784 2461095 -1948268 -384007 754938 -1331225 -1009118 1773358 -851387 2061973
724 -815312 3578596 3422848 -3768505 4667351 -902095 -3077371 1754189 -4333182 439928
714 -1615928 2521306 4123537 880652 915822 -3379695 -3604309 1834994 -4404937 2298916
704 -1734359 -728804 249785 -9440726 -3009541 348338 -202085 -296069 -3744222 -27581086
695 -27581086 -6775955 2263793 -3751468 31282818 34604252 6384813 4163194 4915628
687 4915628 -12072525 -13143709 -41070156 -20821688 -22185425 -25250915 6495255 55608769
679 55608769 25498327 22064542 22273581 -3819771 -14668282 -5660581 -3221928 -2418879
671b418879A412377j19740J436333b14562j610981F63839J998182a946282A304783
661e778828E67095a901114D262970p90358N171840N448722M447745a2531624q448705
652b0980329j2610124J0463573b333322k1373965B515183J7180953P702197J9691531
644D7089864A4800742a302081n666467j095329j0540324C126623a0766381q673000
636a9439381b529536B563097J7599195G142836B685668P33687d724361B81822
627A591856a333485A314513a78705k100348A219095a63304D456448O5489A90559
617A555377M21552E93596d072075B53896K553081i09368I71745J761028L23643
608C056416c876580G10513Q691232C52608J8323315M52495L0128693K4830558
$$ plain form
671 -2418879 1412377 1292637 2728970 -214562 -1825543 663839 2662021 -1946282 1304783
661 -5778828 567095 -1901114 4262970 3472612 8644452 14093174 18540919 -12531624 -20980329
652 -20980329 -33590453 -23126880 -2333322 -23707287 2515183 19696136 27398333 47089864
644 47089864 14800742 -1302081 -6968548 -8063877 -18604201 3126623 -10766381 -19439381
636 -19439381 -2529536 2563097 20162292 7142836 2685668 3419355 -4724361 281822
627 1591856 -1333485 1314513 -178705 -2279053 1219095 -163304 4456448 4521937 190559
617 1555377 1976929 593596 -4072075 253896 2806977 -909368 971745 2732773 3056416
608 3056416 -3876580 710513 9401745 352608 18675923 19128418 49257111 74087669
600G4087669b62669193M9135835R2137699B62058952E0710621A4024877O09625
593A4634502o051871C047686A18587M009609e595033D487043A237247j61156L195637
584D271728a158490l30773J44211j842910D646128d14644B520466j250217K643435
575C913684a294225o74545C479515d2696C76999B7345a506209B06808f5631G7339
564b216677a021388A855839H0563b739302N80912E9275M586823c372242H58000
554d590188D997654a863331G97319Q678a303846C19195b6368l172350A466194
544f196596K175102A474955h209148a559815c34714j28937b8187A165263H4522
534g67837B008655M05245G12468d7673B439803j15804j99940c203841A644761
$$ plain form
600 74087669 -262669193 -213533358 -121395659 262058952 50710621 14024877 14634502
593 14634502 8582631 3047686 118587 4128196 -5595033 4487043 1237247 1076091 4271728
584 4271728 -1158490 -1489263 -1345052 -3187962 4646128 -414644 2520466 1270249 3913684
575 3913684 -1294225 -1968770 3479515 -42696 376999 27345 -1506209 206808 -65631 77339
564 -2216677 -1021388 1855839 80563 -2739302 -2158390 59275 4646098 -3372242 858000
554 -4590188 4997654 -1863331 797319 805997 -1303846 319195 -26368 -3198718 1466194
544 -6196596 -4021494 1474955 -8209148 -1559815 -334714 -463651 -28187 1165263 84522
534 -767837 2008655 2413900 712468 -47673 2439803 2323999 2124059 -3203841 1644761
524c15693m27324k006827D74882J011983h57873C024956G36247a159206k140229
515c299435B025947k99872b079435k733909a898226j087891B061491J889061a618059
505c2249D51365J781290c37549k144715G130442B841238g29861j111223B62307
495c762015k66168G007730g63958n1543A587676b730473f5725A086267b436385
485E569633b342030J131166e13267H703533f78644E513659A987556K337251b284802
475a059053A390450k17795a372362k323112G7956L145083A441591a726072B96698
465a54976l035756l173433C22830J748205b160324F169839d676719G14022c187452
455F786403c825083A455857f771192D258856a200744j415296D720434b712428
$$ plain form
524 -315693 -743017 -2749844 474882 1486865 -857873 3024956 736247 -1159206 -3299435
515 -3299435 2025947 1726075 -2079435 -4813344 -1898226 -2986117 2061491 3950552 -1618059
505 -32249 451365 2232655 -337549 -2482264 7130442 2841238 -729861 -1841084 262307
495 -3762015 -4028183 7007730 -763958 -815501 1587676 -2730473 -65725 1086267 -2436385
485 5569633 -2342030 -1210864 -513267 8703533 -678644 5513659 1987556 4324807 -2284802
475 -1059053 1390450 1172655 -1372362 -3695474 77956 3223039 1441591 -1726072 296698
465 -154976 -3190732 -6364165 322830 2071035 -2160324 6169839 -4676719 714022 -3187452
455 6786403 -3825083 1455857 -6771192 4258856 -1200744 -2616040 4720434 -2712428
446D28967K089671e378769a595291A55549J141818B52585a579495j636974J375901
437a840568C842202J008890F46773R53125P92513o27656M4062c645728e31603
427d18014j061074K26316A769477J02050a24101B67135c578112a22297m12305
418e34602B94259a248078r13697C745955a62393l75901A721355p77946f343901
408C235013f863065L319879B500725d45555B884812J779791A284537a563905A221047
398A484612c066577F874832f87205k516113q284A096670a138747l599372D27810
388a461557l111294C298590K156535A004184a02918r97620q57219B114550b514587
378a559312l743262B682422a452142J71726C335878a110615C051970b042079A262251
$$ plain form
446 428967 2518638 -5378769 -1595291 155549 1297367 252585 -1579495 -3216469 -1840568
437 -1840568 3842202 4851092 646773 1599898 2392411 1764755 1808817 -3645728 -531603
427 -418014 -1479088 -1252772 1769477 1871527 -124101 267135 -3578112 -122297 -534602
418 -534602 294259 -1248078 -2161775 3745955 -162393 -538294 1721355 943409 -6343901
408 3235013 -6863065 -3543186 2500725 -445555 2884812 4664603 1284537 -1563905 1221047
398 1484612 -3066577 6874832 -687205 -3203318 -3211602 1096670 -1138747 -4738119 427810
388 -1461557 -4572851 3298590 5455125 1004184 -102918 -1100538 -1957757 2114550 -2514587
378 -1559312 -5302574 2682422 -1452142 -1280416 3335878 -1110615 3051970 -2042079 1262251
368b917419A979096d151899c40390E565592k764454a977109B062141a850470j286495
359c136965A109485J64624c558482B547179a833963q22250B559946D08096K270214
350B678310O4180e04945j114984j070668h16781E311552a0365B147509r9051c243507
339a981721g79552E727935g161113A924255d62324B027784j012085d991450E268508
329b603923a175911k47046B76799a28991j388813m94888j735265d19858k194638
320b614496B790676B20252d43211C005771q63364b001247A789021b324458j338837
311c663295H86257a282678C671647A137049D03356b189206P02736K35691k570657
302c821436a626858A866175a587701p6666A300195K00167N86916a819462a11102
$$ plain form
368 -2917419 1979096 -4151899 -340390 5565592 2801138 -1977109 2062141 -1850470 -3136965
359 -3136965 1109485 1274109 -3558482 2547179 -1833963 -2656213 2559946 408096 2678310
350 2678310 2742490 -504945 -1619929 -2690597 -816781 5311552 -10365 2147509 2048458 -3243507
339 -1981721 -779552 5727935 -7161113 1924255 -462324 2027784 1015699 -4991450 5268508
329 -2603923 -1175911 -1422957 276799 -128991 -1517804 -2012692 -3747957 -419858 -2614496
320 -2614496 2790676 220252 -443211 3005771 2142407 -2001247 1789021 -2324458 -3663295
311 -3663295 886257 -1282678 3671647 1137049 403356 -2189206 -1486470 -1250779 -3821436
302 -3821436 -1626858 1866175 -1587701 -1664367 1300195 1500362 2087278 -1819462 -111102
292c232617b71373A919403f581040G60690N786201k121211j499469f183872G30167
282A115618A46265a628206B082387j36305a807714F47245a397182I255747A300994
272b184196f922B671407d000101E822846a27446E3725M030704a114875A10895
262a99532A29421J053653O84462a77082F32654c621759K30438C950203a856909
252B105311b062188d07650a74047D2866b085085c97192o39145C400923c33588
242D367418a037629E063826d969987a321554I04586J039176J46892P77367A009839
232a10550A312180c640149H427830b504623I02575a383511l008227C507354C93624
222d665586I36691a83319C592720b785903q80329b68261a20077A435737a16329
$$ plain form
292 -3232617 -271373 1919403 -6581040 760690 6546891 4425680 2926211 -6183872 730167
282 1115618 146265 -1628206 2082387 1946082 -1807714 647245 -1397182 9255747 1300994
272 -2184196 -6922 2671407 -4000101 5822846 -127446 53725 4084429 -1114875 110895
262 -199532 129421 1183074 1867536 -177082 632654 -3621759 -3391321 3950203 -1856909
252 2105311 -2062188 -407650 -174047 42866 -2085085 -397192 -1036337 3400923 -333588
242 4367418 -1037629 5063826 -4969987 -1321554 904586 1943762 2090654 2868021 1009839
232 -110550 1312180 -3640149 8427830 -2504623 902575 -1383511 -4391738 3507354 393624
222 -4665586 936691 -183319 3592720 -2785903 -3666232 -268261 -120077 1435737 -116329
212C99205c264100B10129N32297J774741a189603G530912e895244H460263a189807
202f452869C274976J093283e237448B415885a599396A850872n08107e05800A785628
192b589103A874986d73762k532313b29624G209801A101769A88355L562127h07192
182c749403J697221Q30705F157314d198780A638468K395614j395359K05411b598466
172A351719L586866b582110a073557E490151c052775c0336m130426A84662M13289
163E97951a7585184l3901845j28349770B7271336K2316640J19845749k8184857
156A41248868j0069445A1904708e8674896p0253184j1544472C3903267A864943
148A679641K310019j583446a3351A60203g37224n22903A252422N524468a072982
$$ plain form
212 399205 -3264100 210129 742426 2517167 -1189603 7530912 -5895244 8460263 -1189807
202 -6452869 3274976 4368259 -5237448 2415885 -1599396 1850872 1342765 -505800 1785628
192 -2589103 1874986 -473762 -3006075 -229624 7209801 1101769 188355 3750482 -807192
182 -3749403 -2052182 -1221477 6157314 -4198780 1638468 4034082 2638723 2844134 -2598466
172 1351719 4938585 -2582110 -1073557 5490151 -3052775 -30336 -4160762 184662 597951
163 597951 -17585184 -51487029 -179836799 27271336 49587976 169433725 141248868
156 141248868 131179423 11904708 -58674896 -128928080 -140472552 33903267 1864943
148 1679641 3989660 2406214 -13351 160203 -737224 -1260127 1252422 6776890 -1072982
138A731364N141010A11026a004623B71898c65518l130345E55430c422715a620108
128D308681F58752b852276A211085J719413j092891c041414a465062r55269B732988
118e473609A05960i01725F37511N987580f00628j430025I05805a1220G29311a871649
107G69801b677098M87712A15262a885833A129033K152490a295046A17007a101997
97A376377e6167I7953b256048L98947h56137m812751E717585N38760a112838H78179
86c599580b20073H21944f350365C399118A416392J215819b123102A630757c576503
76B733937A255991f855898D95554N12965J43489a541101b04135B583613J046137
67C629750I91541A57209a104073G181975f59026j333539a55844k403542F099354
$$ plain form
138 1731364 6872374 111026 -1004623 271898 -365518 -3495863 555430 -3422715 -1620108
128 4308681 658752 -2852276 1211085 2930498 1837607 -3041414 -1465062 -2420331 2732988
118 -5473609 105960 -901725 637511 6625091 -600628 -2030653 905805 -11220 729311 -1871649
107 769801 -2677098 -2189386 115262 -1885833 1129033 3281523 -1295046 117007 -1101997
97 1376377 -56167 97953 -2256048 -1857101 -856137 -5668888 5717585 6256345 -1112838 878179
86 -3599580 -220073 821944 -6350365 3399118 1416392 2632211 -2123102 1630757 -3576503
76 2733937 1255991 -6855898 495554 1008519 1152008 -1541101 -204135 2583613 3629750
67 3629750 991541 157209 -1104073 7181975 -659026 -1992565 -155844 -2559386 6099354
57d557227C12857K221677c344244C831422d185937E691519f00584C565368d338550
47f28236a74378B211279a490669C177451d655340B821246f512687h12414A020864
37a835390a25202B841692C85117d655381b26673B129534J005590A052627b290860
27c855688a426696j23456G80815K449386I26099k92901a818947j638784R45046
18b512685B849242a033636I37406c474363g46281D97762J921480N61507F99650
8f25982B864994F34105b304533d66168e2908k490192B145005E94084
$$ plain form
57 -4557227 312857 2534534 -3344244 3831422 -4185937 5691519 -600584 3565368 -4338550
47 -628236 -174378 2211279 -1490669 3177451 -4655340 2821246 -6512687 -812414 1020864
37 -1835390 -125202 2841692 385117 -4655381 -226673 2129534 3135124 1052627 -2290860
27 -3855688 -1426696 -1550152 780815 3230201 926099 633198 -1818947 -3457731 -2512685
18 -2512685 2849242 -1033636 937406 -3474363 -746281 497762 2419242 2980749 699650
8 -625982 2864994 634105 -2304533 -466168 -52908 -2543100 2145005 594084
##PAGE= F1=5640.578599651
##FIRST=     21204.543296753, 2630.29399671053, 734102
##DATA TABLE= (F2++(Y..Y)), PROFILE
2047G34102b213799P77855B181692A040708a682418F73931J044724a190157N51931
2038f38226A781419q20727c30687B288927I09876a192569k027490R91369K62758
2029a965932B108320c166791d32914A694570o16013J762999d145672A816572o50458
2020A166114a22538d7830j578924b72154A872236J899303b727402A066645b777369
2010c760848A277369K63585o43258g68234j068002A626803a949106A345849j88010
2001A157839a838681D507992c257853J268424H56123K299757b939992d41358E450520
1991b696919b08190I7438h98984j451708F107660b34234H808624i95214m123256
1982e118470A808936N86056J565231d395739a684443D41704b729613D71313M199652
$$ plain form
2047 734102 -2213799 -1435944 2181692 1040708 -1682418 673931 1718655 -1190157 -638226
2038 -638226 1781419 960692 -330687 2288927 909876 -1192569 -3220059 -2228690 -1965932
2029 -1965932 2108320 -3166791 -432914 1694570 1078557 2841556 -4145672 1816572 1166114
2020 1166114 -122538 -47830 -1626754 -272154 1872236 3771539 -2727402 1066645 -2777369
2010 -3760848 1277369 1540954 897696 -768234 -1836236 1626803 -1949106 1345849 1157839
2001 1157839 -1838681 4507992 -3257853 -1989429 856123 3155880 -2939992 -441358 5450520
1991 -2696919 -208190 97438 -898984 -2350692 6107660 -234234 8808624 -995214 -5118470
1982 -5118470 1808936 2394992 3960223 -4395739 -1684443 441704 -2729613 471313 4670965
1973D670965b179414B513697H22406K02803B34992L442873a841955I208M989146
1964D998354h45898b62038M0575A668147N134825a977933k489153D166617a260307
1954i48362p6879K03420B940045G54003d821119A886619M530624b340365B468672
1944C510725F50163e09558C693292e169254B409857c148287j459883H081567a885153
1934c064588a445078B034802J717422c19374l869265B422307p25509o00130e345695
1924C522567h71122q86298O77056B201880a762976G9873J100962b157729j085298
1915c243027C492067I18663J093902D75310e5603E327176b018005F263539B910734
1905h58956j446463D86057b828724D054287A915646b867494R1856A11914a205452
$$ plain form
1973 4670965 -2179414 2513697 822406 1025209 234992 3677865 -1841955 9208 4998354
1964 4998354 -845898 -262038 -221463 1668147 6802972 -1977933 -4467086 4166617 -1260307
1954 -948362 -1025241 -821821 2940045 754003 -4821119 1886619 6417243 -2340365 2468672
1944 3510725 650163 -509558 3693292 -5169254 2409857 -3148287 -4608170 8081567 -1885153
1934 -3064588 -1445078 2034802 3752224 -319374 -4188639 2422307 1696798 1096668 -5345695
1924 3522567 -871122 -1757420 -1080364 2201880 -1762976 79873 1180835 -2157729 -3243027
1915 -3243027 3492067 918663 2012565 475310 -55603 5327176 -2018005 6263539 2910734
1905 -858956 -2305419 486057 -2828724 4054287 1915646 -2867494 -2775638 111914 -1205452
1895c735453A241853b47438B221590a536205M35997C365167a075051E04644e317151
1885f94235D471516b606604B594824J496343b380587H98153K725582d159994A290141
1875A319292b277140A926132a854592F2599a602573D753859c146584A149168J796395
1866B945563A216819K474201a380580Q0352B202246a785971k821313f89298B190484
1856B515142b558967A266926b703429A667672R70850B16051C5860a654917A597826
1846F57724b706924a150033D651838k158912b926856A658629N58709o33322c49324
1836b312607j456599B440498c165177B27213b195812Q67533A0705657a653014
1827B980703b412898E70978a430459c13619Q6256D615276d226385c63270p90376
$$ plain form
1895 -3735453 1241853 -247438 2221590 -1536205 -1100208 3365167 -1075051 504644 -5317151
1885 -694235 4471516 -2606604 2594824 4091167 -2380587 898153 3623735 -4159994 1290141
1875 1319292 -2277140 1926132 -1854592 62599 -1602573 4753859 -3146584 1149168 2945563
1866 2945563 1216819 3691020 -1380580 -1300228 2202246 -1785971 -4607284 -689298 2190484
1856 2515142 -2558967 1266926 -2703429 1667672 2638522 216051 35860 -1654917 1597826
1846 657724 -2706924 -1150033 4651838 2492926 -2926856 1658629 2217338 1584016 -349324
1836 -2312607 -3769206 2440498 -3165177 227213 -2195812 -1328279 10705657 -1653014
1827 2980703 -2412898 570978 -1430459 -313619 -227363 4615276 -4226385 -363270 -1153646
1818a153646A897614I15389j25116M75644a265056D686632d134251A482546f97759
1808B488903A029873i397B994258c090477B927995c434841A620823c964648J26543
1799c838105C781228f775043a507196G75976j37966b592170B089995R67348L60554
1790C417897A106176d49387l385958C005680h15646j288898A143704J94728f24725
1780D70559L832093b620493j463246D101201G21526J098620a009379k60374D232303
1770h08543c16605A95836O91208d623389a030006J44779A660598e993354A229452
1760b012256A136261C18233O14285g49473k179590B179673c953435C789031d546448
1750a833143G303530A227674b396591p12682A718442B48337a61235C743400K416255
$$ plain form
1818 -1153646 1897614 915389 790273 1265917 -1265056 4686632 -4134251 1482546 -697759
1808 2488903 1029873 -9397 2994258 -3090477 2927995 -3434841 1620823 -3964648 -3838105
1799 -3838105 3781228 -6775043 -1507196 775976 638010 -2592170 2089995 3057343 3417897
1790 3417897 1106176 -449387 -3835345 3005680 -815646 -2104544 1143704 1338432 -624725
1780 470559 4302652 -2620493 -4083739 4101201 721526 1820146 -1009379 -1269753 4232303
1770 -808543 -316605 195836 887044 -4623389 -1030006 -885227 1660598 -5993354 1229452
1760 -2012256 1136261 318233 932518 -749473 -2929063 2179673 -3953435 3789031 -4546448
1750 -1833143 7303530 1227674 -2396591 -3109273 1718442 248337 -161235 3743400 6159655
1741F159655B98063P66793a916864C77244M37370b355288A191184D04294b46577
1731D008982j313477i56215k716423i16118B298876a180315E527117H20683g29230
1721a188649A154400E73666a143339A569350a46701I89730L284632j146722b127651
1711B495611R69407a429340j909776a301531D44470K69454b780452P31162R37260
1702a112030F58972K269469I82535e79197D400398b991413B458360p50556b372347
1692h46142j690530k84946G583586b877914a222161K95654B170189J051977e281734
1682B746858d52516k92780k290689l27550G43112a552238G281606b463491D68519
1672h40554D059622c90654A010551a694519A699646J361044f588l422718A641495
$$ plain form
1741 6159655 298063 1064856 -1916864 377244 814614 -2355288 1191184 404294 -246577
1731 4008982 2695505 -956215 -3672638 -916118 2298876 -1180315 5527117 820683 -729230
1721 -1188649 1154400 573666 -1143339 1569350 -146701 989730 4274362 3127640 -2127651
1711 2495611 3465018 -1429340 -3339116 -1301531 444470 713924 -2780452 -2049290 -1112030
1702 -1112030 658972 2928441 982535 -579197 4400398 -2991413 2458360 1707804 -2372347
1692 -846142 -2536672 -2821618 7583586 -2877914 -1222161 -926507 2170189 3222166 -5281734
1682 2746858 -452516 -745296 -3035985 -3363535 743112 -1552238 7281606 -2463491 468519
1672 -840554 4059622 -390654 1010551 -1694519 1699646 3060690 -6588 -3429306 1641495
1662A752107L42301E05881M593860b973964J254686D768284b936540M27079k81535
1653b790996E157726d567694B72690b004661C160128j031848O09488f29934j57775
1644g87709B642782h2452j102614C240173a170069a77726B87493c774519A060362
1634B366107I15121h74427B64130a156167o5537A788181J012651b235840D62401
1624A787659a354374F16662f897530B164529c952732h12374B522805d17673j52881
1615e70554j413447F6777J327096c018815B266019G84763c613703C679122j182641
1606B496481b383556j717012G055385b770701A450291b091085k439977J151190
1598c379872A881254P63845P5122c38577A549567a207416A792446b861862J007656
$$ plain form
1662 1752107 2094408 505881 5099741 -2973964 -1719278 4768284 -2936540 -2509461 -2790996
1653 -2790996 5157726 -4567694 272690 -2004661 3160128 2128280 2737768 -629934 -787709
1644 -787709 2642782 -82452 -1185066 3240173 -1170069 -177726 287493 -3774519 1060362
1634 2366107 915121 -874427 264130 -1156167 -1221704 1788181 2800832 -2235840 462401
1624 1787659 -1354374 616662 -6897530 2164529 -3952732 -812374 2522805 -417673 -570554
1615 -570554 -1984001 66777 1393873 -3018815 2266019 784763 -3613703 3679122 2496481
1606 2496481 -2383556 -4100568 7055385 -2770701 1450291 -2091085 -4531062 -3379872
1598 -3379872 1881254 2645099 2720221 -338577 1549567 -1207416 1792446 -2861862 -1854206
1589a854206a28210A996480d080914E871918C42439b439371B841809E94891b503372
1579C474606F80812j42566c101925i07768C300634b38389l365422P02376O90049
1570b211386j646787D643569k207303a969615E652722A65854b300302q97645A276220
1560a229278A498559L294445b656314B21815a519990n90480A033795j14319c313612
1550h23664E111045b196053l900838F71858j64652K342987B48336M057334b064523
1540b099083C151697a058235I501114f540331B37485e872559K241927B962517
1531C201636c549531H81099Q9509r1622c552752a127543c7831B810128f44553
1521d60896C337039A7189c397646H13919c585267E796166b46139C396808d372227
$$ plain form
1589 -1854206 -128210 1996480 -4080914 5871918 342439 -2439371 2841809 594891 -2503372
1579 3474606 680812 538246 -3101925 -907768 3300634 -238389 -3603811 -2901435 -2211386
1570 -2211386 -3858173 4643569 2436266 -1969615 5652722 165854 -2300302 -3197947 1276220
1560 -1229278 1498559 4793004 -2656314 221815 -1519990 -2110470 1033795 919476 -3313612
1550 -823664 5111045 -2196053 -6096891 671858 507206 2850193 248336 4305670 -2064523
1540 -2099083 3151697 -1058235 9501114 -6540331 237485 -5872559 -3630632 2962517
1531 3201636 -3549531 881099 970608 878986 -3552752 -1127543 -37831 2810128 -644553
1521 -460896 3337039 17189 -3397646 813919 -3585267 5796166 -246139 3396808 -4372227
1511f519724E25388N255669B034973i38883A917748e739087I844039a9149D48356
1501h94002j852891G42665I7980a909511C135590d441361D93768J770169M5654
1492B309591a269525B178701a626221A098580a540941B455024b393279B9628J040158
1483A069786J568741P32671j263222b549251B592539A248967b081739D341350
1474d248310A521416J687677e378641H45261f656856F446672d192531A909878
1465h25462C586895e791433A310975a830470B385096b357492J59507C654831g48195
1455A810076J738670A762577m0174L935956a12380j265492B670600r32670c958787
1445C699119b208934k424373F52414b642296i76874l815825D404074B125744b960932
$$ plain form
1511 -6519724 525388 5781057 2034973 -938883 1917748 -5739087 9844039 -19149 448356
1501 -894002 -2746893 742665 97980 -1909511 3135590 -4441361 493768 2263937 2309591
1492 2309591 -1269525 2178701 -1626221 1098580 -1540941 2455024 -2393279 29628 1069786
1483 1069786 2638527 3371198 2107976 -2549251 2592539 1248967 -2081739 4341350
1474 -4248310 1521416 3209093 -5378641 845261 -6656856 6446672 -4192531 1909878
1465 -825462 3586895 -5791433 1310975 -1830470 2385096 -2357492 -2197985 3654831 -748195
1455 1810076 3548746 1762577 1722403 5658359 -112380 -1377872 2670600 1737930 -3958787
1445 3699119 -2208934 -4633307 652414 -2642296 -976874 -4792699 4404074 2125744 -2960932
1435c142501A572875h70080B717240a701121q64757C310044j081949e71311n380735
1426e952046G16578M054889k194939f33561b17287n031986B673289p79084h51843
1416F55169d325711F566701b184354O5076A729978b027294D038375k009760H88254
1406c131785m07106G33609J162167o71502J003874O91852F58994K840886I81241
1396f092746B886553d670921F836934c970681E86202d242138B052954J33137b802083
1386D514663d557343k878881D442835b435529C093187o31566c732858a74665j241285
1377a415950p87153P33930A317134d14535j331949k02778p62905A283727e15545
1367f857388D262829A228722J174727b219808d23861E503516b893314A67033b143223
$$ plain form
1435 -3142501 1572875 -870080 2717240 -1701121 -2565878 3310044 2228095 -571311 -5952046
1426 -5952046 716578 4771467 2576528 -633561 -217287 -5249273 2673289 1894205 -851843
1416 655169 -4325711 6566701 -2184354 -2119278 1729978 -2027294 4038375 2028615 888254
1406 -3131785 -3538891 733609 1895776 1224274 2228148 2920000 658994 3499880 981241
1396 -6092746 2886553 -4670921 6836934 -3970681 586202 -4242138 2052954 2186091 -2802083
1386 4514663 -4557343 -7436224 4442835 -2435529 3093187 2461621 -3732858 -174665 -1415950
1377 -1415950 -2203103 -1469173 1317134 -414535 -1746484 -1949262 -2712167 1283727 -515545
1367 -6857388 4262829 1228722 2403449 -2219808 -423861 5503516 -2893314 167033 -2143223
1357B136584a687678D965889j941262A024198a987636A253357K69256Q2582G2101
1347G49226a57317k853754H756552d235703c81541j193011O25098A579708f643550
1337A034091M409438a620535A058291A34598a605120A950941G22266b415451P32473
1328a682978B949894d2094k445128k302326J818360G995369g40644n37598B0459
1318C887706b630820H29990b548789H32827J363057j049342J75968L178522A777264
1308c780886g81332a0546B545461I8350K168800d544787K169475I42571b760036
1298E394466f599191B437018J348551B60154L528530C64146c088910N5622C053066
1288h93203l950357F919686E00020L212917b662610C12004f307118a041928A994
$$ plain form
1357 2136584 -1687678 4965889 3024627 1024198 -1987636 1253357 1522613 1605195 72101
1347 749226 -157317 -3011071 8756552 -4235703 -381541 -1574552 -949454 1579708 -6643550
1337 1034091 5443529 -1620535 1058291 134598 -1605120 1950941 722266 -2415451 -1682978
1328 -1682978 2949894 -42094 -2487222 -4789548 -2971188 7995369 -740644 -1278242 20459
1318 3887706 -2630820 829990 -2548789 832827 2195884 1146542 1322510 4501032 1777264
1308 -3780886 -781332 -10546 2545461 98350 2267150 -4544787 -2375312 942571 -2760036
1298 5394466 -6599191 2437018 3785569 260154 3788684 364146 -3088910 -3033288 3053066
1288 -893203 -4843560 6919686 500020 3712937 -2662610 312004 -6307118 -1041928 1994
1278c094730C807845e238366C23234a560289m125420B573136d074266A010271
1269b771141c45823k808788A520006K573147A746503a302969j542750K2852B395280
1259d222847D115428a474274j149919C363799A028479B36132L87605c666141C755817
1249A453769a564969j749120D733699d528453B617835a632116H851L268692H92257
1239C498975C34921c042753A376107a498381J22535e55319A368178K739475a670225
1229A108269a364963B795665A100129d977462H380514d341999a87303r26020B518681
1219i83168A801300B13269J076834a782290A352657c005420b90729B888046b28746
1209a362289C148615A58683O121966B01850b178745B769219G02277c259016A403081
$$ plain form
1278 -3094730 3807845 -5238366 323234 -1560289 -5685709 2573136 -4074266 1010271
1269 -2771141 -345823 -3154611 1520006 4093153 1746503 -1302969 -2845719 -2822867 2395280
1259 -4222847 4115428 -1474274 -2624193 3363799 1028479 236132 623737 -3666141 3755817
1249 1453769 -1564969 -3314089 4733699 -4528453 2617835 -1632116 8851 3277543 892257
1239 3498975 334921 -3042753 1376107 -1498381 -1375846 -555319 1368178 4107653 -1670225
1229 1108269 -1364963 2795665 1100129 -4977462 8380514 -4341999 -187303 -1113323 2518681
1219 -983168 1801300 213269 1290103 -1782290 1352657 -3005420 -290729 2888046 -228746
1209 -1362289 3148615 158683 6280649 201850 -2178745 2769219 702277 -3259016 1403081
1199d632594A886902i33326j087870D090976f502280b982010B433742E5659N560588
1190E616247h508854B786262H23090h53910B212695c81983q437415A487457b873085
1180c621267k98118e33318l640347A125671l26827a351699q50024P6290j160143
1171c285576E34321d05241D29540K478415A074630K042972D27021d229845H008689
1161g758999C55748K810355d775345C792896A312674C98556J270563a118119k659357
1152c777476E21636P99513E13226J66551a476014b40q20375A172214f88229C393298
1141A51771J890933d007400G18815K202457e11976C020567b709386B723087G72962
1131B961170a457515H96947a435045A547990o60902b859749k35222A2317a215443
$$ plain form
1199 -4632594 1886902 -933326 -2021196 4090976 -6502280 -2982010 2433742 55659 5616247
1190 5616247 -8508854 2786262 823090 -853910 2212695 -381983 -8819398 1487457 -2873085
1180 -3621267 -3919385 -533318 -4173665 1125671 798844 -1351699 -2201723 -2125433 -3285576
1171 -3285576 534321 -405241 429540 2907955 1074630 3117602 427021 -4229845 8008689
1161 -7758999 355748 3166103 -4775345 3792896 1312674 398556 1669119 -1118119 -3777476
1152 -3777476 521636 1321149 513226 679777 -1476014 -240 -820615 1172214 -688229 3393298
1141 151771 2042704 -4007400 718815 2921272 -511976 3020567 -2709386 2723087 772962
1131 2961170 -1457515 896947 -1435045 1547990 887088 -2859749 -3094971 12317 -1215443
1121B832278M55806A303551a19398k600501j53233A188249a984680m253938C106080
1111b362058j815952B705544c247271E912842D00761b64598J29183A01393J575401
1102A676794e036139C777033M05999g8318A28643L91004L351500b873283j14125
1093b987408B082498D33383b562480C242388o09565c410858J317489A912346a086484
1083C4019P26992a864700F114813B4120L91183J876005E58045a890217j16224
1074b006441n33520C398082b655050G6403d474912B435425N03867c982564A151726
1064E857404B528488A58903a512982D08537a829808A376393O62046K232489b927231
1054A100603d22112J32907D203196j001297C45730e008980A600414B34801M95345
$$ plain form
1121 2832278 3288084 1303551 -119398 -2719899 -2873132 1188249 -1984680 -6238618 3106080
1111 -2362058 -4178010 2705544 -3247271 5912842 400761 -264598 -135415 101393 1676794
1102 1676794 -5036139 3777033 4183032 -78318 128643 519647 3871147 -2873283 -2987408
1093 -2987408 2082498 433383 -2562480 3242388 2632823 -3410858 -2093369 1912346 -1086484
1083 34019 761011 -1864700 6114813 24120 415303 2291308 558045 -1890217 -2006441
1074 -2006441 -2539961 3398082 -2655050 76403 -4474912 2435425 2939292 -3982564 1151726
1064 5857404 2528488 158903 -1512982 408537 -1829808 1376393 2038439 4270928 -2927231
1054 1100603 -422112 -289205 4203196 3201899 345730 -5008980 1600414 234801 730146
1045G30146b545935C277340c732856a687659A051639J866350d872457G842000
1036c711679J676355C680704c470522C533770e078660H73165M487635b378730
1027I66487a985974B564460J12517B41212a66687B942990d501161b206719D10597
1017f94715j923203A640111L04511b765474j343132B101441A44485J058440F0296
1007D250041C70746L661837a426396F685336B26303K642504a247964B755191b342260
997H3498a416477A357344f799917A461061R52200F49634b308332O63375O30260
988a014697k889524q28552a720979H141097e023277A485761N38028a197970D67172
978C910909A495020L022028A587699P46631a422526e70208A465708e24344G855
$$ plain form
1045 730146 -2545935 3277340 -3732856 -1687659 1051639 2917989 -4872457 7842000
1036 -3711679 -2035324 3680704 -3470522 3533770 -5078660 873165 5360800 -2378730
1027 966487 -1985974 2564460 2676977 241212 -166687 2942990 -4501161 -2206719 410597
1017 -694715 -2617918 1640111 1944622 -2765474 -4108606 2101441 144485 1202925 60296
1007 4250041 370746 4032583 -1426396 6685336 226303 2868807 -1247964 2755191 -2342260
997 83498 -1416477 1357344 -6799917 1461061 2413261 649634 -2308332 -1644957 -1014697
988 -1014697 -3904221 -4732773 -1720979 8141097 -5023277 1485761 2023789 -1197970 467172
978 3910909 1495020 4517048 1587699 2334330 -1422526 -570208 1465708 -524344 7855
968A506394o05558L197137a334109A56467a171822D657573k099251f95741A4870
958D889566a332033A520212d977902E525667a402233B414910c360942C161885
949e13001i2121C586185L25880A318092f51932k825290B214574q07855K692895
940D099614e009431I06820j04129L20251L669769B221560a132782C21080c548787
930A720609h49719l94497B039458K18276D43338J937623E89562d850588G10275
920a52562k495414a89945l253015B349030e098297K194513B53943J259949d96538
910a695847a02043D47263J474065c477692P29947D30289g59073l536143B897764
900c30506j42702l686164n05023J944881D093325n81517b026674B854845J258602
$$ plain form
968 1506394 900836 4097973 -1334109 156467 -1171822 4657573 2558322 -695741 14870
958 4889566 -1332033 1520212 -4977902 5525667 -1402233 2414910 -3360942 3161885
949 -513001 -92121 3586185 3912065 1318092 -651932 -3477222 2214574 1406719 4099614
940 4099614 -5009431 906820 802691 1122942 4792711 2221560 -1132782 321080 -3548787
930 1720609 -849719 -1244216 2039458 2257734 443338 2380961 589562 -4850588 710275
920 -152562 -2647976 -189945 -3442960 2349030 -5098297 -2903784 253943 1513892 -496538
910 -1695847 -102043 447263 1921328 -3477692 -2747745 430289 -759073 -4295216 2897764
900 -330506 -473208 -4159372 -4664395 -2719514 4093325 3511808 -2026674 2854845 4113447
891D113447b294906A864610b389337C408892d752413A951924n21927b84826B54185
881b832165h95916A90836K208760K117039d988328F745990e927515B366305A123853
871G99438J355926j044635d05518l547520D622290b218860e25118k342347E73824
861B177596O19061b752336j56815A903165a257715C70499M553183e585698C902
851b50201j252853A866678p62141b215662m144695C112857l51906d776347B98601
841b04816F293079c743504J399787d059k606273N28516G29732J361724g5393l739840
831c815233a193591A905692q7479J490420f79428j489754F39680J482456j41888
822A980248a017045K68078o519064i91107C17744N17169A34918L008054a293706
$$ plain form
891 4113447 -2294906 1864610 -2389337 3408892 -4752413 1951924 1429997 -284826 254185
881 -2832165 -895916 190836 2399596 4516635 -4988328 6745990 -5927515 2366305 1123853
871 799438 2155364 1110729 -405518 -3953038 4622290 -2218860 -525118 -2867465 573824
861 2177596 2796657 -2752336 -2909151 1903165 -1257715 370499 4923682 -5585698 3902
851 -250201 -1503054 1866678 1104537 -2215662 -6360357 3112857 2760951 -4776347 298601
841 -204816 6293079 -3743504 -2343717 -4059 -2610332 -2081816 729732 2091456 -75393 -3815233
831 -3815233 -1193591 1905692 1818213 3308633 -679428 -2169182 639680 2122136 1980248
822 1980248 -1017045 -748967 -7268031 -991107 317744 834913 134918 3142972 -1293706
812b594136H64830J16185b460958C07243b57654j826561B109475b561033h36158
802B129802b517244C369269d778639C536557b396692A280486J240510b531385
793D771403A006528J751229b117034l60105A547360K105887A574910C73890M255431
784D629321c762129B757068j167037b342747C21880b38607O0649k619466D149015
774i87799B216050M448815C114347a471066C015258d67811C059662c909887a062601
764b51688B394930d730102a289511k455002A942119c017157F022769d421979A380590
754a442770A304518b684852g74532j968269F177769g59467A738283N41412E46528
744e658553A540256L88637b053572j138455D691743d159159C713259G43406K72829
$$ plain form
812 -2594136 864830 981015 -2460958 307243 -257654 -2084215 2109475 -2561033 -836158
802 2129802 -2517244 3369269 -4778639 3536557 -2396692 1280486 2520996 -2531385
793 4771403 1006528 2757757 -2117034 -2477139 1547360 3653247 1574910 373890 4629321
784 4629321 -3762129 2757068 1590031 -2342747 321880 -238607 -177958 -2797424 4149015
774 -987799 2216050 6664865 3114347 -1471066 3015258 -467811 3059662 -3909887 -1062601
764 -251688 2394930 -4730102 -1289511 -3744513 1942119 -3017157 6022769 -4421979 1380590
754 -1442770 1304518 -2684852 -774532 -2742801 6177769 -759467 1738283 2279695 546528
744 -5658553 1540256 1928893 -2053572 -3192027 4691743 -4159159 3713259 743406 1016235
735A016235M457746B578261b694932b63791F82478g95238J43316A279414a010447
725A626219a622534D051462n69357c904239D638873b03083l276590A624741d727356
715H78185a453933C009912P4824G95504O1292c718342n19264A554735d311703
705B420611f77250g6257C02185i046482b794383F49803b54907n18622k677628
696c451157k0961634g563345B747918c439981B8134040N059462E686836j172213
688D514623P80545a1682423k380387k3623133J7773660j046848j891282F015545
679E2049834B2791810j600112j04935d437239p314521e852345K148414J561872
671b142059F43460J201707J019118f72456j142705F76706K502895b276716A423796
$$ plain form
735 1016235 5473981 2578261 -2694932 -263791 682478 -795238 -651922 1279414 -1010447
725 1626219 -1622534 4051462 3482105 -3904239 4638873 -203083 -3479673 1624741 -4727356
715 878185 -1453933 3009912 3084736 795504 856796 -3718342 -4237606 1554735 -4311703
705 2420611 -677250 -76257 302185 -9046482 -2794383 649803 -254907 -773529 -3451157
696 -3451157 -24412791 -7563345 2747918 -3439981 28134040 33193502 5686836 4514623
688 4514623 5295168 -11682423 -14062810 -37685943 -19912283 -20959131 -22850413 6015545
679 52049834 22791810 21191698 21086763 -4437239 -11751760 -5852345 -3703931 -2142059
671 -2142059 643460 1845167 2864285 -672456 -1815161 676706 3179601 -2276716 1423796
661e639476H08018a056547D638807j937095N255473O671500L308718a3303548
652b0039283j0385862O724916b163610j9266669B224282J6823812M420464K1098787
644D4567345A3051988a543195n566877j153144q535687C489826i580503q540665
636a8121168a291056B596896J5377730F028602B060195Q09826d648729a32129
627A189964i77426A275897f09027j506262H38123b5496D098630P19603A06255
617H69024K386351F80592d039486E11007K583961a737742G70886J898595N91018
608C260499c675302E16366Q032564E90658J5586249K114143K4893319K3777880
600F6962249b37482168M4384456Q0907273B37608302D5383328A4815063q49853
$$ plain form
661 -5639476 808018 -1056547 4638807 2701712 7957185 14628685 17937403 -13303548
652 -20039283 -30425145 -23700229 -2163610 -21430279 2224282 19048094 23468558 44567345
644 44567345 13051988 -1543195 -7110072 -8263216 -16798903 3489826 -9580503 -18121168
636 -18121168 -1291056 2596896 17974626 6028602 2060195 2870021 -4648729 -132129
627 1189964 -977426 1275897 -609027 -2115289 838123 -25496 4098630 4818233 106255
617 869024 3255375 680592 -4039486 511007 3094968 -1737742 770886 2669481 3260499
608 3260499 -3675302 516366 8548930 590658 16176907 18291050 43184369 66962249
600 66962249 -237482168 -193097712 -112190439 237608302 45383328 14815063 13965210
593A3965210o180383B764740d56076C187609d510637D050207k016231F15770L699749
584D315519b132807e56916q07820k689254D792271A1007K571252r16686K533991
575D199564i79988k092902C108293b89072I40025E0739a582862D71445B5086L41976
565C67062b434719a011624B255840h8780k649190N5892B06074M396044b976879
555C10954d530154D870954b027350D88294K08888g18343D94386L15885c613831
545H85907d889618L4447A727404g899019a813383c1808n83444A002199D41806
535b3695q34571C288162A391335E55848a09896C724350j345596q64440c214263
525A372857F9696J61259c329091F52046O44548a445340C230675a20087r80990
$$ plain form
593 13965210 7784827 2764740 -456076 3187609 -4510637 4050207 2033976 615770 4315519
584 4315519 -2132807 -556916 -1364736 -4053990 4792271 11007 2582259 1665573 4199564
575 4199564 -979988 -3072890 3108293 -289072 940025 50739 -1582862 471445 25086 367062
565 367062 -2434719 -1011624 2255840 -88780 -2737970 -2682078 206074 4602118 -2976879
555 310954 -4530154 4870954 -2027350 488294 697182 -718343 494386 810271 -3613831
545 885907 -4889618 -4855171 1727404 -7899019 -1813383 -31808 -615252 1002199 441806
535 -23695 -858266 3288162 1391335 555848 -109896 3724350 2378754 1514314 -3214263
525 1372857 69696 230955 -3329091 652046 1296594 -1445340 3230675 -120087 -1101077
516a101077j653871A615664l81368b127766k300843J798507P9351H10371K970344
507C780715d41717k12277I34952K391576f52301k470237G678543B726310b05232
497i84078H7371b911880l78881E740004b30569j842297B024414b591986a99978
487A207506b293369F028176b162541K58743a8938H852160h04097E676931B072451
477C921623b839824a089308B232870o65660b186787j497803E35164K192215A142062
467a922791C68893N64889c357906k463778a01243A587334a764882E693826d185559
457F43996c556023G162339c550918A155342f324385D143613i96352j483964E317489
447b590169E68776J927965f106169a425064c35479f2533A553272a517389o21690
$$ plain form
516 -1101077 -2754948 1615664 1234296 -2127766 -4428609 -2630102 -2550751 810371 3780715
507 3780715 -441717 -653994 934952 3326528 -652301 -3122538 7678543 2726310 -205232
497 -984078 87371 -2911880 -3290761 5740004 -230569 -2072866 2024414 -2591986 -199978
487 1207506 -2293369 6028176 -2162541 -1903798 -18938 8852160 -804097 5676931 2072451
477 3921623 -2839824 -1089308 2232870 1567210 -2186787 -3684590 535164 2727379 1142062
467 -1922791 368893 933782 -3357906 -5821684 -101243 1587334 -1764882 5693826 -4185559
457 643996 -3556023 7162339 -3550918 1155342 -6324385 4143613 -996352 -2480316 5317489
447 -2590169 568776 2496741 -6106169 -1425064 -335479 -62533 1553272 -1517389 -2139079
438b139079K7518C936721o41805E48801J791440j18121o33420O00182c479862
428a81849j165711M6481O47415A919931L0467A74598N63151c640250E1182g33577
417A038163b88386j703983C853702B61606b27767A256701E90615f407385C593829
407e766049K211352B335297d31764C390616J163160H33986f40628A931503p1393
398A860110c352252F316559c12566l421548K83605A771070a501273m239637H34722
388h65802k789922C239386J881033b40199I6713b293875P27568B110629a852777
378b197071j679981B994238b211342Q73877C360209a066748B610290b469982A323453
368c017129C238910c370608E29553M283404k195052a956907A625768a784197q42898
$$ plain form
438 -2139079 -2111561 3936721 3294916 548801 2340241 2222120 1588700 2188882 -3479862
428 -181849 -1347560 -1301079 -653664 1919931 1950398 174598 737749 -3640250 51182 -733577
417 1038163 -288386 -1992369 3853702 261606 -227767 1256701 590615 -6407385 3593829
407 -5766049 -3554697 2335297 -431764 3390616 4553776 833986 -640628 1931503 1860110
398 1860110 -3352252 6316559 -312566 -3734114 -3450509 1771070 -1501273 -5740910 834722
388 -865802 -3655724 3239386 5120419 -240199 96713 -2293875 -1566307 2110629 -1852777
378 -2197071 -3877052 2994238 -2211342 -1337465 3360209 -1066748 2610290 -2469982 1323453
368 -3017129 3238910 -3370608 529553 4812957 2617905 -1956907 1625768 -1784197 -2627095
359b627095E4298J518135c478983C627358a527832o95344B361665I87140m41143
350E45997K344441G24594a443120k050671C9321N945502A55352J000445Q21266
341A977063b277213O1076d32644F153135g702127B158992a282959A617904j37114
332A480790e453659F493050a846140R8203k00328A01847K01071g5731k285352
323b361083j753223B40745b251448B311639D3099h89820C337807j441636d420389
313A636901b021418j422474A219978a827255C912556F94518M80193b060253J85797
304a874456g33592k682529a706414A697429b554916O97345A743314J83500k91335
295A635479b152792d75360k595643B75004J564352f044597F18182O250146k739327
$$ plain form
359 -2627095 54298 1572433 -3478983 3627358 -1527832 -2223176 2361665 987140 545997
350 545997 2890438 724594 -1443120 -3493791 39321 5984823 155352 1155797 1977063
341 1977063 -2277213 -2216137 -432644 6153135 -7702127 2158992 -1282959 1617904 1480790
332 1480790 -5453659 6493050 -1846140 -1747937 -1948265 101847 302918 -75731 -2361083
323 -2361083 -4114306 240745 -2251448 2311639 43099 -889820 3337807 1896171 -4420389
313 1636901 -2021418 -3443892 1219978 -1827255 3912556 694518 1174711 -2060253 -1874456
304 -1874456 -733592 -3416121 -1706414 1697429 -2554916 -1857571 1743314 1926814 1635479
295 1635479 -2152792 -475360 -3071003 275004 1839356 -6044597 618182 6868328 4129001
286D129001j028897f997097A017597M94742B21783a700013B150558p88935a760574
276I80208g21697H242409A076631b245201c41244A791003d052657F231516h06063
266G5129L805019h52114H9785i2051I1319P84507J782037G2370c6655l959732
256c996387Q77260C084851a512427B161352b271066f54490J40563B99201a811127
246B44955d73742B098764C68926L837077a377211D396920d637953a071426A639347
236A068992J251959M44864m09783E38228L41967c611311H254872b339465A45902
226a209927k806100B927630A019575c816797A301176A62049L501757b476025j066815
217c542840h05231a06303A723375a40026B44319c179886D58149L09473L46451
$$ plain form
286 4129001 3100104 -6997097 1017597 1512339 221783 -1700013 2150558 1361623 -1760574
276 980208 -721697 8242409 1076631 -2245201 -341244 1791003 -4052657 6231516 -806063
266 75129 3880148 -852114 89785 -92051 91319 875826 2657863 72370 -36655 -3996387
256 -3996387 -3119127 3084851 -1512427 2161352 -2271066 -654490 -513927 299201 -1811127
246 244955 -473742 2098764 368926 4206003 -1377211 4396920 -4637953 -1071426 1639347
236 1068992 2320951 2765815 2356032 538228 880195 -3611311 8254872 -2339465 145902
226 -1209927 -4016027 2927630 1019575 -3816797 1301176 162049 3663806 -2476025 -3542840
217 -3542840 -805231 -106303 1723375 -140026 244319 -3179886 458149 767622 1114073
208A114073g91007F882176e610237H195483a230516n108763C161124J350500e510817
198B054783a408590A375805a40997l77002A154536b362687B015589C46685a965995
188h86107F702957C89079M12684K906854g30272m253652a989079J40816E103680
178d218045A699062K076549q77121L45975a679657A224830M094471b425044i91755
168C659639c625762I39332d863816B11224K07179a8141397k9388374j16095525
160a63625296B2229794K3905357J12044756k8311616j2067394A0816409e3688885
152a18273593r083733C0592601B677212A158655K532595j374250e78722B86317
143a237677K32952A507434M564641a355284A449274N201804C35131a571031c23630
$$ plain form
208 1114073 -791007 6882176 -5610237 8195483 -1230516 -6339279 3161124 4511624 -5510817
198 2054783 -1408590 1375805 -140997 -517999 1154536 -2362687 2015589 346685 -1965995
188 -886107 6702957 389079 801763 3708617 -730272 -4983924 -1989079 -1848263 5103680
178 -4218045 1699062 3775611 2898490 3244465 -1679657 1224830 5319301 -2425044 -991755
168 3659639 -3625762 939332 -4863816 211224 418403 -18141397 -47529771 -163625296
160 -163625296 22229794 46135151 158179907 129868291 117800897 10816409 -53688885
152 -118273593 -127357326 30592601 2677212 1158655 3691250 2317000 -578722 286317
143 -1237677 -1004725 1507434 6072075 -1355284 1449274 6651078 335131 -1571031 -323630
133e58334k474384G95242c104438a051626D673695d194k936558A569163J120376
124B689539o84591b856415a014932j511114B226380e735873E3617a787853F26560
114F007877a372472k43601A118298h4900G79050b009082I00199b615079j31881
105b746960D78774b186450A332112K124240i62912L21680q72110A274279n34723
96G39556i43371m84852q09280e33836n150756E459962O87237a28270E00283c832289
85c45458F84016f580823C787306j869463O24921b329465A914833c640154B142001
75B763544g737844H4755Q04809M79930a907917e41402B678406k61204I52873D51647
64f95334G199291d57898k337387d86893k170657F617300c624455e18209B846717
$$ plain form
133 -558334 -3032718 795242 -3104438 -1051626 4673695 -4194 -2940752 1569163 2689539
124 2689539 2004948 -2856415 -1014932 -2526046 2226380 -5735873 53617 -1787853 626560
114 6007877 -1372472 -1616073 1118298 -84900 779050 -2009082 900199 -2615079 -2746960
105 -2746960 478774 -2186450 1332112 3456352 -962912 -641232 -1513342 1274279 739556
96 739556 -943371 -1428223 -2237503 -533836 -5684592 5459962 6147199 -128270 500283 -3832289
85 -345458 684016 -6580823 3787306 1917843 2542764 -2329465 1914833 -3640154 2142001
75 2763544 -7737844 84755 889564 1369494 -1907917 -541402 2678406 2417202 952873 451647
64 -695334 7199291 -457898 -2795285 -486893 -2657550 6617300 -3624455 -518209 2846717
54c969215D358767c343314F494428a617207D229233d205337g10238b1446B589242
44b817641C204096e044886B312149f607088a097373F38074b627174e93349C256680
34e64390m322991e52216A880933J404484A255201b082920j628134J585290R96240
25a129524C48624K840564I58693K06068b135728j212211J16747B422724g98673
15A378845c721595a282632A26835K466341j88867H63796g79211B670555C83828
5b430031h57983b44311k016261B255636B01070
$$ plain form
54 -3969215 4358767 -3343314 6494428 -1617207 4229233 -4205337 -710238 -21446 2589242
44 -2817641 3204096 -5044886 2312149 -6607088 -1097373 638074 -2627174 -593349 3256680
34 -564390 -4887381 -552216 1880933 3285417 1255201 -2082920 -3711054 -2125764 -1129524
25 -1129524 348624 3189188 958693 1164761 -2135728 -3347939 -3231192 2422724 -798673
15 1378845 -3721595 -1282632 126835 2593176 2404309 863796 -779211 2670555 383828
5 -2430031 -857983 -244311 -2260572 2255636 201070
##PAGE= F1=5618.780329767
##FIRST=     21204.543296753, 2630.29399671053, 1074476
##DATA TABLE= (F2++(Y..Y)), PROFILE
2047A074476b237514Q97373A780097C00577a542731F90604O41052a296847e84294
2037A801925c7447p3273B114464I40817a121128j685247N81585o79438B053832
2027c021640c93637B109734I12483K811048d975338A651609G93529j39814e34776
2017i87778c0276A508769O33964b607329A240957c033231q62367A939629G91892
2007A179853c55412j164575A284742b135177A481449j36587a916855C726885b368318
1997b856191A042678J790669c049506f18507D935178b179351e54980D67662g94284
1987a651765E163953h7032H923406g92162m133954A640843M98082K409697c396735
1977a345593b6581l180036C97005L778072a975117B540291F18661J63617f76208
$$ plain form
2047 1074476 -2237514 -1340141 1780097 300577 -1542731 690604 1331656 -1296847 -584294
2037 1801925 -37447 -110720 2114464 940817 -1121128 -2806375 -2224790 -2904228 2053832
2027 -3021640 -393637 2109734 912483 3723531 -4975338 1651609 793529 653715 -534776
2017 -987778 -30276 1508769 2142733 -2607329 1240957 -3033231 -3895598 1939629 791892
2007 1179853 -355412 -1519987 1284742 -2135177 1481449 1344862 -1916855 3726885 -2368318
1997 -2856191 1042678 2833347 -3049506 -618507 4935178 -2179351 -554980 467662 -794284
1987 -1651765 5163953 -87032 8923406 -792162 -4926116 1640843 2138925 4548622 -3396735
1977 -1345593 -26581 -3206617 397005 4175077 -1975117 2540291 618661 782278 -676208
1967C162163h53266d24016E241521a971788c34316k67501A909196L727042g35921
1957d383388E255753a122628p06366M17350G30034J621522G38258d846966B006677
1947F109294b040732B745012Q64360b34232B17869K846020e326846C201692c110715
1937d910171H016815a916087j689149J332827A870879K999580B10842d912913
1928B238977m05792p20663e469698C550662h94550m36508J7633A698800h42133
1918c4082A754489b632964n31228C838135H21591J075625g7784A30987N879385
1909F010372b210780E569233k664615a239864r26141A247603c890793C898425
1900B090017c393886J354837f63276r68354k217092A354820d80042B643470b054250
$$ plain form
1967 3162163 -853266 -424016 5241521 -1971788 -334316 -601817 1909196 5636238 -735921
1957 -4383388 5255753 -1122628 -1828994 -1411644 730034 2351556 738258 -4846966 2006677
1947 6109294 -2040732 2745012 3609372 -234232 217869 3063889 -5326846 3201692 -3110715
1937 -4910171 8016815 -1916087 -3605236 -2272409 1870879 4870459 210842 -4912913
1928 2238977 1833185 1112522 -5469698 3550662 -894550 -1331058 -1313425 1698800 -842133
1918 -34082 1754489 -2632964 -3164192 3838135 821591 1897216 -77784 130987 6010372
1909 6010372 -2210780 5569233 2904618 -1239864 -2166005 1247603 -3890793 3898425
1900 2090017 -3393886 -2039049 -663276 -1631630 -3848722 1354820 -480042 2643470 -2054250
1890a090699C221457f99182D31827e383389a743633D652630b575333A617189K637300
1881D254489b830188A170816J637929c763798A368049K56950b834239B480430
1872b323939b55406j910656D679644c202007I62398K178554o76072O82337a640821
1862d26158B029146b639114j401894a603967A986044R62205b856029A432732b341413
1852A954822J81581D53206J01323a942595A546224B77807c290746a042775D347352
1842B288610b890028A148788C19365J580771h7873k742297o37389G11314b589119
1832b35049j949769a085446A0408960b226177D883105c153240B03062a731048
1823G183d55981E235707e497742c63891p94902A001961D78970R73293E8515e26074
$$ plain form
1890 -1090699 3221457 -699182 431827 -5383389 -1743633 4652630 -2575333 1617189 4254489
1881 4254489 -2830188 1170816 2808745 -3763798 1368049 1624999 -2834239 2480430
1872 -2323939 -255406 -2166062 4679644 -3202007 962398 3140952 2464880 3147217 -1640821
1862 -426158 2029146 -2639114 -4041008 -1603967 1986044 2948249 -2856029 1432732 -2341413
1852 1954822 2136403 453206 554529 -1942595 1546224 277807 -3290746 -1042775 4347352
1842 2288610 -2890028 1148788 319365 1900136 -87873 -2830170 -3467559 711314 -2589119
1832 -235049 -2184818 -1085446 10408960 -2226177 4883105 -3153240 203062 -1731048
1823 7183 -455981 5235707 -5497742 -363891 -1158793 1001961 478970 1452263 58515 -526074
1812D104448c762127G70996A25535J814048m81247b78043B027963c213768B927169
1802d067387B199428c256804j264825D525335g620053a449334D06765J159080
1794A565845b447699I64045J498125J730142A072254c00130m682579C269056A4826
1784a748497A371351k22553i94031G42394L939687b180457j694429D203822E25230
1774A891545a642983L77469C889173f70116K0734B19348R66839d464265c85237
1764c50936B4604e174452F38809b071653D76402k2329Q34542c39403k559588A879643
1753d689042C532893d085473b000538F541595G21161a550864j063148A486821
1744b49033q4885C807293L164700a29329A670486a459933A32191J078362b376118
$$ plain form
1812 4104448 -3762127 770996 125535 1939583 1458336 -278043 2027963 -3213768 2927169
1802 -4067387 2199428 -3256804 -4521629 4525335 -7620053 -1449334 406765 1565845
1794 1565845 -2447699 964045 2462170 4192312 1072254 -300130 -4982709 3269056 14826
1784 -1748497 1371351 1148798 -994031 742394 4682081 -2180457 -3874886 4203822 525230
1774 1891545 -1642983 -1265514 3889173 -670116 -649382 219348 1186187 -4464265 -385237
1764 -350936 24604 -5174452 638809 -2071653 476402 454073 1288615 -339403 -2898991 1879643
1753 -4689042 3532893 -4085473 -2000538 6541595 721161 -1550864 -2614012 1486821
1744 -249033 -333918 3807293 6971993 -129329 1670486 -1459933 132191 1210553 -2376118
1734A407427a87073a712E851785A914579i5818l304027A003903J472664a225596
1724E729893A273864a023310K0377A194911k4749a431173B058733A77314j3464
1715A63850M424958q62655b086077B730608O20627a530805k433809a162614A961556
1705F69005c128707a340860N31919H03426K185106A29405i11418D786808b383384
1695B101363m06035b220374L83675d38060k545068H283392c294986h32708K38920
1686e93788A842005K541892e046852A383493b01185n62951l172154J613718A142839
1676a585955G083786b766980E37209e30499C319228f55439I08913e24797A706693
1666B914896b63687k802723B076324L31805r86551b47732D867036a077008k122751
$$ plain form
1734 1407427 -187073 -1712 5851785 1914579 -95818 -3399845 1003903 2476567 -1225596
1724 5729893 1273864 -1023310 -1002933 1194911 1170162 -1431173 2058733 177314 163850
1715 163850 4588808 3726153 -2086077 2730608 3351235 -1530805 -3964614 -1162614 1961556
1705 669005 -3128707 -1340860 -808941 803426 2988532 129405 -911418 4786808 -2383384
1695 2101363 1695328 -2220374 -1836699 -438060 -2983128 8283392 -3294986 -832708 -593788
1686 -593788 1842005 4383897 -5046852 1383493 -201185 -764136 -3936290 -2322572 1142839
1676 -1585955 7083786 -2766980 537209 -530499 3319228 -655439 908913 -524797 1706693
1666 2914896 -263687 -3066410 2076324 2408129 1421578 -247732 4867036 -1077008 -3199759
1657c199759E706684b827299j70032L27286D456936c652441D50826a855500C222226
1647B850166r79812a00362j70796B200270D72969a103375B588954a516178a77110
1637G81749c114730F27750J493131E79030a781223E69104a308374N65428I66683
1627B821417c080268E71891P29918b453999A424305f177072B415944d205883a306916
1617B784241F7140P1351b965317c69749A457391b850974B576227F04970d018749
1607B985085o71598b887990n05144G020114b086889A678176b235438j683831l93746
1598d313015B714934K22682O08370d6722A417017a594198A271532a666999j151602
1589b818601a68061A835422c879617D949360E22599b563066C144576I96098b307140
$$ plain form
1657 -3199759 5706684 -2827299 -2997331 -2670045 4456936 -3652441 450826 -1855500 3222226
1647 2850166 1870354 -100362 -271158 2200270 472969 -1103375 2588954 -1516178 -177110
1637 781749 -3114730 627750 2120881 579030 -1781223 569104 -1308374 -742946 966683
1627 2821417 -3080268 571891 1301809 -2453999 1424305 -6177072 2415944 -4205883 -1306916
1617 2784241 67140 138491 -2965317 -369749 1457391 -2850974 2576227 604970 -4018749
1607 2985085 2313487 -2887990 -3393134 7020114 -2086889 1678176 -2235438 -3919269 -4313015
1598 -4313015 2714934 2937616 3545986 -46722 1417017 -1594198 1271532 -1666999 -2818601
1589 -2818601 -168061 1835422 -3879617 4949360 522599 -2563066 3144576 996098 -2307140
1579C376475A088824g00679k461758b19357C118282e20599k657955M77315i94640
1569d065199D759371B275236a955757D703555b05609k857987O85423F77992B30454
1559A226600L484195b005625b08906j123334j331325A197776k5267c277101J568969
1550a708132E382219a985403l854727h63319E23162K860774i33406D765705a949146
1540b027360B883420a549340I651171f858051E90606e720281J783431C321484
1531D105109d405325A321154j83386m6652c548576e28610F7912K441118g68094
1521f29996C518304e43257k534929E56014c087602F155435B1174K369911d254020
1511f883939E24044N762581A478636h88415A377440e482653I932789A440052a779350
$$ plain form
1579 3376475 1088824 -700679 -3162437 -219357 3118282 -520599 -3178554 -2701239 -994640
1569 -4065199 4759371 2275236 -1955757 4703555 -205609 -3063596 -2378173 677992 230454
1559 1226600 4710795 -2005625 -208906 -1332240 -2663565 1197776 1172509 -3277101 -1708132
1550 -1708132 5382219 -1985403 -5840130 -863319 523162 3383936 -933406 4765705 -1949146
1540 -2027360 2883420 -1549340 9651171 -6858051 590606 -5720281 -3936850 3321484
1531 4105109 -4405325 1321154 1137768 1091116 -3548576 -528610 67912 2509030 -768094
1521 -629996 3518304 -543257 -3078186 556014 -3087602 6155435 21174 2391085 -4254020
1511 -6883939 524044 6286625 1478636 -888415 1377440 -5482653 9932789 1440052 -1779350
1501d39905k536040A878224c57290k006721C212095c842097E87407J940719l20022
1492B208104a092533A613268a572015E03797b110093C389714b122084C50909Q08729
1483A159638J405876J562204j811749b807843B868587A091102a463045C907209
1474c740984A654960R85643e149815A232780e208445E887681c466836A575711
1465d09026B840553e331035H33350a579507B578081b753071a170495C886063a747994
1455A502033L779666H23149J077219J893694B72823H9934J816013l38037c848619
1445C652748b029953k109613e34288k85676p21213k962073D269649A924103b523056
1435c756761A671276a724696B639621a281899j250505C663337j401214c12209
$$ plain form
1501 -439905 -2975945 1878224 -357290 -2364011 3212095 -3842097 587407 2528126 2208104
1492 2208104 -1092533 1613268 -1572015 503797 -2110093 3389714 -2122084 350909 1159638
1483 1159638 2565514 4127718 2315969 -2807843 2868587 1091102 -1463045 3907209
1474 -3740984 1654960 2640603 -5149815 1232780 -5208445 5887681 -3466836 1575711
1465 -409026 2840553 -5331035 833350 -1579507 2578081 -2753071 -1170495 3886063 -1747994
1455 1502033 5281699 823149 1900368 3794062 272823 89934 1905947 1567910 -3848619
1445 3652748 -2029953 -4139566 -534288 -819964 -1541177 -4503250 4269649 1924103 -2523056
1435 -3756761 1671276 -1724696 2639621 -1281899 -2532404 3663337 2262123 -312209
1426f298386A028603L337936k046151a56950n10212l905984B758588r77826d72300
1416a380031k427189E008174a699723J36110A035160b182954D313302k146335
1408B166967B39913b241158j570617A391819M74182q89492J768194P94200B01530
1398C096578A438592g069526B509044d942617F329565c736901H14521d944006
1389B100616r8194b597560D399313d278956k431708D102926b638602B811888Q1201
1380B893089c216391c88617j137648j055399e63501G88766e41761l20808j819803
1371b682372Q93449F32458F7273f056841C867645G12482K651104b679805b07255
1361E032498b331428h2741l193922B776956a921270E409943k049509I14740a986005
$$ plain form
1426 -6298386 1028603 4366539 2320388 -156950 -667162 -4573146 2758588 1780762 -472300
1416 -1380031 -3807220 5008174 -1699723 -1563613 1035160 -2182954 4313302 2166967
1408 2166967 239913 -2241158 -3811775 1391819 1866001 976509 2744703 3538903 201530
1398 3096578 1438592 -7069526 2509044 -4942617 6329565 -3736901 814521 -4944006
1389 2100616 2002422 -2597560 4399313 -4278956 -6710664 4102926 -2638602 2811888 2893089
1380 2893089 -3216391 -388617 -1526265 -2581664 -563501 788766 -541761 -862569 -2682372
1371 -2682372 -1788923 632458 67273 -6056841 3867645 712482 3363586 -2679805 -207255
1361 5032498 -2331428 -82741 -3276663 2776956 -1921270 5409943 3360434 914740 -1986005
1351I86571L06547A37306j8209g6766E91710c254400I246661d482940B29118a416093
1340i20362B201418g849961A600023M079767b471499A731434B1354a257769A927002
1330G75925b356079Q92170D396362B73278b833254k172092J541826H153983d04952
1320a173247b82690C716626b577376A259265d471105H77039J275595A065458j98171
1311H67287M938398A711551c786617h90821A366634M56678b2466B827899e113212
1301b345799G63755c547578E377622f721966C640397j137709C35178L077052D54451
1291b900353k109077C624349b856906j407078F524750G37628L186425c061501
1282h2173p125856b45857a8030l217213C234501e749575A89904a612490l768442
$$ plain form
1351 986571 1293118 137306 119097 -76766 591710 -3254400 9246661 -4482940 229118 -1416093
1340 -920362 2201418 -7849961 1600023 5679790 -2471499 1731434 21354 -1257769 1927002
1330 775925 -2356079 -1463909 4396362 273278 -2833254 -5005346 -3463520 8153983 -404952
1320 -1173247 -282690 3716626 -2577376 1259265 -4471105 877039 2152634 1065458 867287
1311 867287 5805685 1711551 -3786617 -890821 1366634 1823312 -22466 2827899 -5113212
1301 -2345799 763755 -3547578 5377622 -6721966 3640397 2502688 335178 3412230 454451
1291 -2900353 -5009430 3624349 -2856906 -4263984 6524750 737628 3924053 -3061501
1282 -82173 -7208029 -245857 -18030 -3235243 3234501 -5749575 189904 -1612490 -5380932
1273e380932A174046d222377I05068c186396i96919k253865A958383K016905A636815
1263a879559j096593l83033B641360d108604D446349a562421l44565B949837I82890
1253C8440N04715d103674C142026A268320b957102J69706E352022d076886B881258
1243a444181C17627L076988b87350B678947E77226b451110H93397a289102N56922
1234g32180K0087I21314K816761a256850D32374b353530B641827I88531d143785
1224F483690c657228B29960a440789B488732i68352B240298b50624G15906b189387
1214A663745a777924B3406L186231a00425j553072C531423d46388F923896A4462
1204a942004B040156F14835c126414A591337d331770D17866c9241k794986C729750
$$ plain form
1273 -5380932 1174046 -4222377 905068 -3186396 -996919 -3250784 1958383 3975288 1636815
1263 -1879559 -2976152 -3359185 2641360 -4108604 4446349 -1562421 -1906986 2949837 982890
1253 38440 543155 -4103674 3142026 1268320 -2957102 -2787396 5352022 -4076886 2881258
1243 -1444181 317627 3394615 -287350 2678947 577226 -2451110 893397 -1289102 -732180
1234 -732180 -712093 921314 3738075 -1256850 432374 -2353530 2641827 988531 -4143785
1224 6483690 -3657228 229960 -1440789 2488732 -968352 2240298 -250624 715906 -2189387
1214 1663745 -1777924 23406 3209637 -100425 -1653497 3531423 -446388 6923896 14462
1204 -1942004 2040156 614835 -3126414 1591337 -4331770 417866 -39241 -2834227 3729750
1194f062037b963749C124962d55713E504485h344083B133539E22819a010428B565996
1184f36375p482121A229787b791745j733869J037983c31834l857877G13844K87672
1175A001516a052770q04733Q8279j367907G85650c995l03918C400403I80021K508884
1165C488905I14017d340516H677767f635625B55793K989800d055197C740843A307272
1155B10716J572740a527473k458977A312078k37386k77242b92138q42222A05069
1145i03964H38034c49241C448878D24920J909837c196527B10483J630248h74445
1135C018983b563257A615559k97276P09047a330006c50707m16385A14114Q56285
1126I70399b500784j238385b1348o89591A946173J232120m41231c38992l341660
$$ plain form
1194 -6062037 -2963749 3124962 -455713 5504485 -8344083 2133539 522819 -1010428 2565996
1184 -636375 -8118496 1229787 -2791745 -4525614 -3487631 -331834 -4189711 713844 1001516
1175 1001516 -1052770 -1857503 -1769224 -3137131 785650 -3995 -307913 3400403 980021 3488905
1165 3488905 914017 -4340516 8677767 -6635625 255793 3245593 -4055197 3740843 1307272
1155 210716 1783456 -1527473 -3986450 1312078 1074692 797450 -292138 -1134360 105069
1145 -903964 838034 -349241 3448878 424920 2334757 -3196527 210483 1840731 -874445
1135 3018983 -2563257 1615559 1318283 2027330 -1330006 -350707 -767092 114114 970399
1126 970399 -2500784 -3739169 -21348 -710939 1946173 3178293 2737062 -338992 -3680652
1117c680652a650951B50442a588300n851407B798154c121909r29172B778644b953458
1107E773584I50894f69782a01350E0318J590377d815405C758985J094025b22780
1097g09095F35580L836648b652047l57321A674842G94195a946751B447500p62302
1088A685198c740382a858724B190127h94954b03C50467a602304E856318A424084
1078D53306J470152H41874c260633J020143p80137C046738b778936i5210l885003
1069c980213A977356O55637b755918F03079M258002j255543A00221a788567h3234
1059a983983A131844N13764K631605b211255H52337a47858m84782D468519j743627
1050B724892A85022c889033A399562E06738f1208k491778B688751e154245i45213
$$ plain form
1117 -3680652 -1650951 250442 -1588300 -7439707 2798154 -3121909 -4051081 2778644 -2953458
1107 5773584 950894 -669782 -101350 50318 1640695 -4815405 3758985 4853010 -222780
1097 -709095 635580 4472228 -2652047 -3009368 1674842 794195 -1946751 2447500 1685198
1088 1685198 -3740382 -1858724 2190127 -894954 -203 350467 -1602304 5856318 1424084
1078 453306 1923458 841874 -3260633 -2240490 -3020627 3046738 -2778936 -95210 -3980213
1069 -3980213 1977356 2632993 -2755918 603079 4861081 3605538 100221 -1788567 -83234
1059 -1983983 1131844 1645608 4277213 -2211255 852337 -147858 -632640 4468519 2724892
1050 2724892 185022 -3889033 1399562 506738 -61208 -2552986 2688751 -5154245 -945213
1040H19561J681049d729670G619850d056150E3079L579204c363191C627330d312974
1030A74447N870908b570844G78307a130003C452090q46346I2055d33457A817677
1020d028693J889840A69571a204419j109616A916366M02245c846354P90389A802117
1010e30161G52222j29057K129604D0538L737618a552690F026928b8244B847551
1000g03870A830558c187021a28377j323516G31551f444790A676029Q1879D12608
990b419425L58538f97623k954420j217517a092578F960289c837152A577457M83206
981B060663a739154E02528K888308A488561K277688A473767L24536i67252j12669
972a079921A225623n24239d03386A371753J995K867668a314663A32008a742473
$$ plain form
1040 819561 2500610 -4729670 7619850 -4056150 53079 3632283 -3363191 3627330 -4312974
1030 174447 6045355 -2570844 778307 -1130003 3452090 2605744 92055 -433457 1817677
1020 -4028693 -2138853 169571 -1204419 -2314035 1916366 2318611 -3846354 -3055965 1802117
1010 -530161 752222 623165 2752769 40538 3778156 -1552690 6026928 -28244 2847551
1000 -703870 1830558 -3187021 -128377 -1451893 731551 -6444790 1676029 1757908 412608
990 -2419425 -2060887 -697623 -3652043 -4869560 -1092578 6960289 -3837152 1577457 2060663
981 2060663 -1739154 502528 3390836 1488561 3766249 1473767 1798303 -967252 -1079921
972 -1079921 1225623 701384 -403386 1371753 1373748 4241416 -1314663 132008 -1742473
962D112212q05015h64907c53662E643574b136741A322680d020966D514639b112341
952B342505b814678B712280a015672A1444L591584J94630H25240a458377j755371
943c213748A975916q00394J293332e093479E53790M44655k38681M351716k193675
934B917805a161784A007676c884465B374765a488310n0230A681702J47156A45543
924B438458I93332e266601A278753b18855k131986a86416l238244B502942e197466
914b503588E65271J111531f12694m18268c26448F8862J967730c603176J51538
905c451638E20331A16088d459941B493791c32147C27020c960603j161323b080357
895D221767m54671b445707B976555J205212c075996A882981c253719D828778e801440
$$ plain form
962 4112212 3307197 -864907 -353662 5643574 -2136741 1322680 -4020966 4514639 -2112341
952 2342505 -2814678 2712280 -1015672 11444 3603028 3797658 825240 -1458377 -3213748
943 -3213748 1975916 1175522 2468854 -5093479 553790 998445 759764 5111480 2917805
934 2917805 -1161784 1007676 -3884465 2374765 -1488310 -1538540 1681702 1828858 145543
924 2438458 993332 -5266601 1278753 -218855 -2350841 -186416 -3424660 2502942 -5197466
914 -2503588 565271 1676802 -612694 -1030962 -326448 68862 2036592 -3603176 -3451638
905 -3451638 520331 116088 -4459941 2493791 -332147 327020 -3960603 -5121926 -2080357
895 4221767 3767096 -2445707 2976555 4181767 -3075996 1882981 -3253719 4828778 -5801440
885B214974K26914b50320J13846l500436A026886D03373J816723K348251d823557
875F957484g000665E018816I80134B84364J747458m2314i44578k809846D636041
865b287214C09537c280849A63860J233433K428750c332163k50203B310310a724358
855I40375L823500e573077e78122J33521j254866A450985b65018r72708n545535
846f783261C363797j188671c568555A71046K75374N886077c581323J567165g10732
836b312293N66930G4497J196328o12624d419483h96447B240296B70261L043935
827C314196a190058l77839B84918K186273O77852a067854j92574m905817a605693
817D85512Q04193D90419L866354a154940k321243D64721R58494b630719A321293
$$ plain form
885 2214974 2441888 -250320 -136474 -3636910 1026886 403373 2220096 4568347 -4823557
875 6957484 -7000665 5018816 980134 284364 2031822 1989508 -944578 -3754424 4636041
865 -2287214 309537 -3280849 163860 1397293 3826043 -3332163 -3582366 2310310 -1724358
855 940375 4763875 -5573077 -578122 -444601 -1699467 1450985 -265018 -1237726 -6783261
846 -6783261 3363797 2175126 -3568555 171046 446420 6332497 -3581323 -2014158 -710732
836 -2312293 -1745363 74497 1270825 658201 -4419483 -896447 2240296 270261 3314196
827 3314196 -1190058 -1567897 284918 2471191 3149043 -1067854 -1260428 -6166245 -1605693
817 485512 1289705 490419 4356773 -1154940 -3476183 464721 1423215 -2630719 1321293
807a099901r29320B342849a816713M35975C282519c197404C048917d378455D358657
797b656143b84091C487136b771441E291127a31173A697584a977717j84787A295694
787C333398j398877E4546N138708b845273C591921F14114b617402J183284a05693
777d72619k019533D288568a080864B017034M475716C208892b399321C640633h20641
767B870878d332776f80199p1698A911462d323843a365024k430774A591786c893081
757G053902c381383I32049a517120A545863b104984a002369p86563E815093b80868
747A684658J051288H88086d720754A027804J08377b382628K85888E166515d050807
737C123369j502537r8034L577777k495782c054920a74455E12892b79903o6059
$$ plain form
807 -1099901 -2029221 2342849 -1816713 -1380738 3282519 -3197404 3048917 -4378455 4358657
797 -2656143 -284091 3487136 -2771441 5291127 -131173 1697584 -1977717 -2162504 1295694
787 3333398 1934521 54546 5193254 -2845273 3591921 614114 -2617402 -1434118 -105693
777 -472619 -2492152 4288568 -1080864 2017034 6492750 3208892 -2399321 3640633 -820641
767 2870878 -4332776 -680199 -751897 1911462 -4323843 -1365024 -3795798 1591786 -3893081
757 7053902 -3381383 932049 -1517120 1545863 -2104984 -1002369 -1788932 5815093 -280868
747 1684658 2735946 888086 -4720754 1027804 1136181 -2382628 -2096740 5166515 -4050807
737 3123369 1620832 1522798 5100575 2604793 -3054920 -174455 512892 -279903 -345962
728c45962F08657a189157A114393b501330D335424j261160c961702D457758D94571
718c724035A392857e046148A245572a291281C172461j099702E05548K24274d112064
708d500685A143854d027643B383476A16100L02012q4808h216540b627070H28799
698b87358q58050j968886j7108013h081008C056967b884116B3523354N917312
690B9440666D648114q2427P97700a0796989l687116j7323404J4097511j018783
682a8728781n79104E278020L9659016A8724183K69105o20436d842578l592660
674h435238K564184J673365b000102b14113B259782N89177a136405o44174E79906
664C514058b672308A401200e348271I88020c54422D906188A661479N127673P002409
$$ plain form
728 -345962 608657 -1189157 1114393 -2501330 4335424 3074264 -3961702 4457758 494571
718 -3724035 1392857 -5046148 1245572 -1291281 3172461 2072759 505548 729822 -4112064
708 -4500685 1143854 -4027643 2383476 116100 418112 333304 -8216540 -2627070 828799
698 -287358 -1145408 -3114294 -20222307 -8081008 3056967 -2884116 23523354 29440666
690 29440666 4648114 4565687 5363387 -10796989 -14484105 -31807509 -17709998 -18728781
682 -18728781 -19307885 5278020 44937036 18724183 18993288 18372852 -4842578 -8435238
674 -8435238 -5871054 -4197689 -2000102 -214113 2259782 2848959 -1136405 -1780579 579906
664 3514058 -2672308 1401200 -5348271 988020 -354422 4906188 1661479 6789152 13791561
655A3791561K771101a2873851n093475p410415K798889a879869j6231138A939456
646A6849981J177024K0904398A0569561a868273n108827j243851n740715C686527
637h274205p939751b53951B369915J2774619D257697A716468M00340d280368f98741
627E39688f52664A217302a094986p71737B06875n3768L388763J285961A0293J35640
617A45933M300655G30294c742325F70502K564293b628266F20125J725819J039261
608C385205c412065B96710O714894G58388J2417042L555154J8139170K0512759
600E5382513a97354558L6859315O5673718A97528769C7073517A4772329k557850
593A2214479n663584B375918a111556A971411c499880C401431j013572B62376
$$ plain form
655 13791561 16562662 -12873851 -17967326 -25377741 -22578852 -1879869 -18111007 1939456
646 16849981 18027005 38931403 10569561 -1868273 -6977100 -8220951 -13961666 3686527
637 -8274205 -16213956 -253951 2369915 15144534 4257697 1716468 2116808 -4280368 -698741
627 539688 -652664 1217302 -1094986 -1866723 206875 153107 3541870 4827831 10293 145933
617 145933 4446588 730294 -3742325 670502 3234795 -2628266 620125 2345944 3385205
608 3385205 -3412065 296710 7011604 758388 13175430 16730584 34869754 55382513
600 55382513 -197354558 -160495243 -94821525 197528769 37073517 14772329 12214479
593 12214479 6550895 2375918 -1111556 1971411 -3499880 3401431 2387859 262376
584D487064b914997C33856a476489l529617D784469C89993K076640m62256K314432
575D318809e97742l637360B528253g33714A411688f3611j682689G28226B5483
565G26651b622339a034586B557242b38778k495180o49070C62277M003791b640406
555b05084m136968D404739b081358A41824M46281a13358F92803Q53203d263813
545E52194c845602j595342A821575g350868a957553A00611h68306A956810d66929
535a55486j026143D231368C79595k5594a72975D536792k152148G82280c202432
525I79575D73600N14492c730910E85025M00193b279771C293718a141276L41771
516g99505j601721H44813r3233b220945j631225N90873J220083a56743C379394
$$ plain form
584 4487064 -2914997 333856 -1476489 -5006106 4784469 389993 2466633 2004377 4318809
575 4318809 -597742 -4235102 2528253 -733714 1411688 -63611 -1746300 728226 25483
565 726651 -2622339 -1034586 2557242 -238778 -2733958 -3383028 362277 4366068 -2640406
555 -205084 -4342052 4404739 -2081358 141824 588105 -113358 692803 1546006 -4263813
545 552194 -3845602 -5440944 1821575 -7350868 -1957553 100611 -868306 1956810 -466929
535 -155486 -1181629 4231368 379595 354001 -172975 4536792 2384644 782280 -3202432
525 979575 473600 988092 -3730910 585025 985218 -2279771 3293718 -1141276 -799505
516 -799505 -2401226 844813 751580 -2220945 -3852170 -3261297 -2041214 -156743 3379394
506D89717a284047A595685K558587a101988k590012G875200B490459E09834b44879
496a73471j910861l58127D203499B40288c414438B349037b357217b49859A244808
486b124977F204558a982886o08521E32222P761736i74365E603405A969759J358224
477C327983c278017a076041B864082j131664b952366p05118I62360J067295H00157
467b114835B59839J552607c490979j522283h03555H28200a226652D948823c660272
457D40996c885485G510987c318357G91195e583899C851509i14645j331615E807872
447b410489F19962J793535f708347a261055M58140p39909B864648a516634N74540
438i42094j364609C824205A432760D30825K412689r78893m43273J134416c343842
$$ plain form
506 489717 -1284047 1595685 4154272 -1101988 -3692000 7875200 2490459 509834 -244879
496 -173471 -2084332 -2442459 4203499 240288 -3414438 2349037 -2357217 -249859 1244808
486 -2124977 6204558 -1982886 -2591407 532222 8293958 -974365 5603405 1969759 3327983
477 3327983 -3278017 -1076041 2864082 1732418 -2952366 -3657484 962360 2029655 800157
467 -2114835 259839 1812446 -3490979 -5013262 -803555 828200 -1226652 4948823 -3660272
457 440996 -3885485 7510987 -3318357 791195 -5583899 3851509 -914645 -2246260 5807872
447 -2410489 619962 2413497 -6708347 -1261055 -802915 -1542824 2864648 -1516634 -942094
438 -942094 -2306703 3824205 1432760 430825 2843514 1864621 1421348 2555764 -3343842
428I4933b287153J108667C44881J593625j61441D39664P04801c608129a10629
418a009264A631025E40146a597062C663957E37866H0833P99533A50310f318946
408C745944d318300N95538B263095f31738C656601O08184C83275A56762K374751
399B531513l65318c488667E483055a12811l944307L96571B314520a855086m467368
390f322454I09422a36959k314694C047213J429054a200629B40027c204153a274867
380A933938a022594j822767P12287C138346b620298Q12950C065661i26260B006202
370b768634A372537b980921D226962b330097A302044K206216j159168a846612
361A075129a652146n36612i82278A714347b954438D408972a377962m44718B106858
$$ plain form
428 94933 -2287153 -1178486 344881 1938506 1777065 439664 1144465 -3608129 -110629
418 -1009264 1631025 540146 -1597062 3663957 537866 80833 880366 150310 -6318946
408 3745944 -4318300 -3722762 2263095 -631738 3656601 4264785 383275 156762 2531513
399 2531513 2166195 -3488667 5483055 -112811 -4057118 -3660547 2314520 -1855086 -6322454
390 -6322454 909422 -136959 -2451653 3047213 4476267 -1200629 240027 -3204153 -1274867
380 1933938 -1022594 -2845361 -2133074 3138346 -2620298 -1807348 3065661 -926260 2006202
370 -2768634 1372537 -2980921 4226962 -2330097 1302044 3508260 2349092 -1846612
361 1075129 -1652146 -2188758 -982278 1714347 -2954438 4408972 -1377962 -1822680 2106858
351A456273a859077B885379j224293a281049k865398F81698N952434C68921j55167
342B13754J627331a519275q17221a26948F470147g891920B333110b021179A117540
332A685971e737740G572345a062696j250282j96914a28463G06027R32475b794359
322d356117H30515a804377A746014a16741j235538C548437A671795f604361A709922
312a701330j391994A457173b272064C771034C40714J269122a898380l91020a69810
302b803807J039993A572512c575143J572204B001704L25173A150943b386698i08367
292b788008I27760O15122e034348C72598O484892l094575p39215g703039A394512
282A813146D6775a657276B102172F19838a266092A232857I8537O663217G92373
$$ plain form
351 1456273 -1859077 2885379 1661086 -1281049 -4146447 681698 6634132 368921 213754
342 213754 1841085 -1519275 -2336496 -126948 6470147 -7891920 2333110 -2021179 1117540
332 1685971 -5737740 7572345 -1062696 -2312978 -2509892 -128463 706027 1638502 -2794359
322 -4356117 830515 -1804377 1746014 -116741 -1352279 3548437 1671795 -6604361 1709922
312 -1701330 -3093324 1457173 -2272064 3771034 340714 1609836 -1898380 -2289400 -169810
302 -2803807 -1763814 1572512 -3575143 -2002939 2001704 2326877 1150943 -2386698 -908367
292 -2788008 927760 1542882 -5034348 372598 6857490 3762915 3023700 -7703039 1394512
282 1813146 46775 -1657276 2102172 619838 -1266092 1232857 98537 6761754 792373
272b228940e92023G88700d069954F511132a430139G7072L369619d82573D7196
262a0600A49990L57195K830768C13785g72346l050775J010771B067286a131402
252B111880b438965i12411J02695D91934a536751I27562A89863N84423K64187
243A038473K855331a625306C463912d114684g56329B146368E7268K496400J08192
234B661860Q01803A198494D26459c425940G806980b021434c63234q13338k285169
225c461741B325424q10987b762421A670441G03426K879773b132121j244740a156571
215c5028A991756e3817A13926b780744F32184M35662c77998m0342E916997e066387
204G620759a366245m216628B878955J607006e706187A733621a085132H76655a361789
$$ plain form
272 -2228940 -592023 788700 -4069954 6511132 -1430139 77072 3446691 -482573 47196
262 -10600 149990 507185 3337953 313785 -772346 -3823121 -2812350 2067286 -1131402
252 2111880 -2438965 -912411 -809716 491934 -1536751 927562 189863 774286 1038473
243 1038473 3893804 -1625306 3463912 -4114684 -756329 2146368 57268 2553668 2661860
234 2661860 3463663 1198494 426459 -3425940 7806980 -2021434 -363234 -1176572 -3461741
225 -3461741 2325424 1514437 -2762421 1670441 703426 3583199 -2132121 -3376861 -1156571
215 -35028 1991756 -53817 113926 -2780744 632184 1067846 -377998 -418340 5916997 -5066387
204 7620759 -1366245 -5582873 2878955 4485961 -5706187 1733621 -1085132 876655 -1361789
194e78345E35557b099169B033152o80147a278894l40930F159635c65277A399822
184C663229e56140n464108a876919o24104D005349d019920A730909J805591p16074
175B820426P27192d46625A019646M521921b159423h31525A675775d058377A827074
165e274123D39475j60017a7867679k2532339r5500092A6287872K3358978R5096364
157A34743214k4910298j2971623H581584d5138263n3344459p428848B6110608
149C271068F61907K859309j371396a017711C82131a614257g81765A859048L368606
140E227654a558894A190466N078097F30447b133454h22422L27346k276355A107189
130b462829d08456D731422e49021k398884A821637N52894k11533b528872d15666
$$ plain form
194 -578345 535557 -2099169 2033152 1353005 -1278894 -1619824 6159635 -365277 1399822
184 3663229 -556140 -6020248 -1876919 -2501023 4005349 -4019920 1730909 3536500 2820426
175 2820426 3547618 -446625 1019646 5541567 -2159423 -831525 1675775 -4058377 1827074
165 -5274123 439475 279458 -17867679 -40400018 -135900110 16287872 39646850 134743214
157 134743214 109832916 96861293 8581584 -45138263 -98482722 -105911570 26110608
149 3271068 661907 3521216 2149820 -1017711 382131 -1614257 -781765 1859048 5227654
140 5227654 -1558894 1190466 6268563 630447 -2133454 -822422 -495076 -2771431 1107189
130 -2462829 -408456 4731422 -549021 -2947905 1821637 2374531 2162998 -2528872 -415666
120b432454A597099e577883F5933b425523E84421M680733a961134i17160A504644
110i1933A100517b012607A128694b566035n40813A005558b383706A621346J965475
101C586821g18118o00542m73946A307203J88884a805890c19325k155568I298e353485
90D803493J046735I03583B98623c717659f73788H72526f518382D273599j748399
81B525200o2902b439403B173361c382866A463356K803325h053434b07844H69903
71A698982b027047g91181B666045A299516j07114m14212b06771G109699b48546
61c375010h06524j754080G339035b479779a224412C234410d367076D839605b335151
51G361015b302737D684993c853557g91116B56549K631580c715627C450130e258719
$$ plain form
120 -2432454 1597099 -5577883 65933 -2425523 584421 5265154 -1961134 -917160 1504644
110 -91933 1100517 -2012607 1128694 -2566035 -3106848 1005558 -2383706 1621346 3586821
101 3586821 -718118 -1318660 -1792606 1307203 1496087 -1805890 -319325 -2474893 9298 -5353485
90 4803493 5850228 903583 298623 -3717659 -673788 872526 -6518382 4273599 2525200
81 2525200 2462298 -2439403 2173361 -3382866 1463356 4266681 -8053434 -207844 869903
71 1698982 -2027047 -791181 2666045 1299516 1192402 778190 -206771 7109699 -248546
61 -3375010 -806524 -2560604 7339035 -2479779 -1224412 3234410 -4367076 4839605 -2335151
51 7361015 -2302737 4684993 -3853557 -791116 256549 2888129 -3715627 3450130 -5258719
41A807533f149684a373206E26877c121253h11521C666795a231343l410929i26708
31A804153J567613A559723a678885j808664J019448e14113D6739L174910A270537
21A886316b295667o85364o43809B041245e04162A974134c704335a538398d5943
11B896140r09693p11754f45726B588979C64004b345482a062004c23342j352379
2a675721B518347B1706
$$ plain form
41 1807533 -6149684 -1373206 526877 -3121253 -811521 3666795 -1231343 -4642272 -926708
31 1804153 3371766 1559723 -1678885 -3487549 -2468101 -514113 46739 3221649 1270537
21 1886316 -2295667 -2981031 -3624840 2041245 -504162 1974134 -3704335 -1538398 -45943
11 2896140 1986447 1274693 -645726 2588979 364004 -2345482 -1062004 -323342 -1675721
2 -1675721 2518347 21706
##PAGE= F1=5596.982059883
##FIRST=     21204.543296753, 2630.29399671053, 1511541
##DATA TABLE= (F2++(Y..Y)), PROFILE
2047A511541b123312J018829A578777d74808o17236H13283J45546a141817d59267
2037A872007h57685A25943J939714r89084h45854j336340J9891j452264B022023
2027b483652b11396B426368H04740L868405e686415A597704C98937J000953g93356
2017c64977C09289Q16584E05458b240051A401435c082721p93288B650268B91003
2007A608157B09834a289118A014382b204639A686657j68935a775142B970412a619313
1997c165934A301693J200987c011060f31729D421464a452058N40970H47647d43558
1987h72172D273856E6736Q473028d82391m006803A527414K44561L297119b247800
1977i23837c92980l043909C77993L103817a572283B613584E23883J92a246775
$$ plain form
2047 1511541 -2123312 -1104483 1578777 -474808 -1092044 813283 958829 -1141817 -459267
2037 1872007 -857685 125943 2065657 1076573 -845854 -2182194 -2162303 -3614567 2022023
2027 -2483652 -211396 2426368 804740 4673145 -5686415 1597704 398937 1399890 -793356
2017 -364977 309289 1125873 505458 -2240051 1401435 -3082721 -3876009 2650268 291003
2007 1608157 209834 -1289118 1014382 -2204639 1686657 1517722 -1775142 2970412 -1619313
1997 -3165934 1301693 2502680 -3011060 -631729 4421464 -1452058 -911088 847647 -443558
1987 -872172 4273856 56736 8529764 -482391 -4489194 1527414 1771975 5069094 -2247800
1977 -923837 -392980 -3436889 377993 3481810 -1572283 2613584 523883 524075 -1246775
1967B524038B02761h81232E410831b776932d62654l50094B186670K201858F94527
1957d287715F324575g28250j722419O56682B557340q33193G95349d734327B046336
1947E497622a588757B953882P16104i90748A107908J278799e348450D056783c099689
1937d973201G708996a780647k235952Q50178A644296M102247H70997e731885B068003
1927B066533r19747e353347C332668h63146m1002o19244A212691A12306b25620
1917B333945b799536k43395D182387H37699R12435g10038B35660O488286b307050
1907D920365k036739a652123k58715A993746d845879C825978j659629c874906
1898a182801k20304o14375j734769A214043c19797B934701b489135i57207C009561
$$ plain form
1967 2524038 202761 -881232 5410831 -2776932 -462654 -812748 2186670 4388528 694527
1957 -4287715 6324575 -728250 -2450669 -1793987 2557340 1724147 795349 -4734327 2046336
1947 5497622 -1588757 2953882 3669986 -990748 1107908 2386707 -5348450 4056783 -3099689
1937 -4973201 7708996 -1780647 -4016599 -3166421 1644296 5746543 870997 -5731885 2068003
1927 2066533 1146786 -5353347 3332668 -863146 -904148 -1523392 1212691 112306 -225620
1917 2333945 -2799536 -3042931 4182387 837699 1750134 -710038 235660 6723946 -2307050
1907 4920365 2883626 -1652123 -1910838 1993746 -4845879 3825978 2166349 -3874906
1898 -1182801 -1403105 -2017480 -3752249 1214043 -319797 2934701 -2489135 -957207 3009561
1888b35736D31885e617950b577132D683006b779755E12712L804013c303975A297361
1878B035291c239916A353154O07664c449121B960857b491580e56878k142857D410753
1868c248021F45150K649305M14222j287549a702844D05556J222621c132865k79138
1859c412003Q70318A544191J760775b935900A463993b014165B291909p81655G31841
1849A079390b137131A491183b58898l434890g87168C808860j801198b745064F40029
1839a542076B090339I4652c072747N413a044536r79738f84512j400340h63702
1829I631324b838250F544003c783736c48618j610500C93341g59513E613146f506729
1819b85514p13391C744J08006J914739a207245G7601L212551c079922g2426I73342
$$ plain form
1888 -235736 431885 -5617950 -2577132 4683006 -2779755 512712 4316725 -3303975 1297361
1878 2035291 -3239916 1353154 1960818 -3449121 2960857 -2491580 -556878 -2699735 4410753
1868 -3248021 645150 3294455 3708677 2421128 -1702844 405556 1628177 -3132865 -3412003
1859 -3412003 -2541685 1544191 3304966 -2935900 1463993 -2014165 2291909 1510254 731841
1849 1079390 -2137131 1491183 -258898 -3693788 -787168 3808860 2007662 -2745064 640029
1839 -1542076 2090339 94652 -3072747 -3067334 -1044536 -2024274 -684512 -2084852 -863702
1829 9631324 -2838250 6544003 -3783736 -348618 -1959118 393341 -759513 5613146 -6506729
1819 -285514 -998905 3744 111750 2026489 -1207245 77601 3290152 -3079922 -72426 973342
1808A376435M26729d89090A057162c267773B889169d659607B725432b655007k393359
1799e048366E190959h242051a342173a28343B396032b303802A93576J534933L046316
1790D774825I68897a936o129573C407945H62014a323005A596107p38550a351940
1780H47386L997926a702770j596676D085797C06460J578211b258387R39904C441823
1770e77743m36420B63210J159084d274333B30115N2948a410183k718328D4373
1760b118555b38172F30505J061154g3581k731381A462114e619543C183951c524837
1750b114464E638058I4473h21989j337048A495068h18095K61339C627187L728147
1741G355334d71742B041411a003199a58446A531644b339886A470903h74453B30488
$$ plain form
1808 1376435 1803164 -489090 1057162 -3267773 2889169 -4659607 2725432 -2655007 -5048366
1799 -5048366 5190959 -8242051 -1342173 -128343 2396032 -2303802 193576 1728509 4774825
1790 4774825 968897 -1936 -6131509 3407945 862014 -1323005 1596107 857557 -1351940
1780 847386 4845312 -1702770 -3299446 4085797 306460 1884671 -2258387 -1318483 3441823
1770 -577743 -1014163 263210 1422294 -4274333 230115 283063 -1410183 -4128511 44373
1760 -2118555 -238172 630505 1691659 -73581 -2804962 1462114 -5619543 3183951 -3524837
1750 -2114464 5638058 94473 -821989 -2159037 1495068 -818095 -556756 3627187 7355334
1741 7355334 -471742 2041411 -1003199 -158446 1531644 -2339886 1470903 -874453 230488
1731G517099H49284k24291b941826B862807o49517a073327E613327A638447a128671
1721h40254A212698K67860a769439B225153D64874g48351D869552p26118b169852
1711B926848L13696a682971k762784a116500C086753F83224c127434f26163K75533
1702c50630I28399J990281f92004n62307D981295a732103A669124j31164a969404
1692b743119A852194c216606H816378c799367c15055p8896A427697L767836d568478
1682F7730i4876p39604l909639a302373A755859a760893F411667b869094E14829
1672b13129B458758g70898G92641k89956R83854J193085e21767k018663B377310
1662C041857F73580a068926D412920A009650d710563F601989b573989q53217R00217
$$ plain form
1731 7517099 849284 624993 -2941826 2862807 2213290 -1073327 5613327 1638447 -1128671
1721 -840254 1212698 1480558 -1769439 2225153 464874 -748351 4869552 4143434 -2169852
1711 2926848 3240544 -1682971 -4445755 -1116500 3086753 683224 -3127434 -626163 -350630
1702 -350630 928399 2918680 -692004 -1254311 4981295 -1732103 1669124 1537960 -1969404
1692 -2743119 1852194 -3216606 8816378 -3799367 -315055 -393951 1427697 5195533 -4568478
1682 67730 -94876 -834480 -4744119 -1302373 1755859 -1760893 6411667 -2869094 514829
1672 -213129 2458758 -770898 792641 502685 1486539 2679624 -521767 -2540430 2377310
1662 3041857 673580 -1068926 4412920 1009650 -4710563 6601989 -2573989 -3427206 -2526989
1653b526989C662697b609074F95531a562689C157162K20260A136835D01217q5648
1644C15569J335057n51245i07958A810592a863647a38104A106967b153517A83059
1634A729527B40087b594742H24461a520614a3161I5249K486146c555704E65650
1624I02830c447734B215861e299716B583169d483144a837644B999843E32752K08416
1615G41168c953122h83415A420823b447237B672268D96609d377779B261805m9449
1606B212356c258819O38729F809922a537632A863409b347137o81507k061612C315027
1596C137914J133802B63550R83107a914781G33594d21050l296892a26697A555616
1586c592546C951012F29017b570859C299668A500310b029933B765355j380518
$$ plain form
1653 -2526989 3662697 -2609074 695531 -1562689 3157162 3377422 1136835 401217 315569
1644 315569 1650626 1099381 -907958 1810592 -1863647 -138104 1106967 -2153517 183059
1634 1729527 240087 -2594742 824461 -1520614 -13161 95249 2581395 -3555704 565650
1624 902830 -3447734 2215861 -5299716 2583169 -4483144 -1837644 2999843 532752 741168
1615 741168 -3953122 -883415 1420823 -2447237 2672268 496609 -4377779 2261805 2212356
1606 2212356 -3258819 -2620090 6809922 -1537632 1863409 -2347137 -3028644 -5090256 3315027
1596 3137914 4271716 263550 1246657 -1914781 733594 -421050 -3717942 -126697 1555616
1586 -3592546 3951012 629017 -2570859 3299668 1500310 -2029933 2765355 1384837
1578A384837a777565j417297D43563K398278h73424j758321K51412B38503d184113
1568E103006A932643a866806C570948f11689l158334a523903C71J530222o23218
1559I07375L215271a198836L13845j3436k207707A466554m8985c347894P49894
1550b598000E550967b033334l208279b340976D91318L267348b136555E154462
1541a669647j98175B529929b010122I160556f914622A031531e367423J111208
1533d256215C479008J564718e227091A720608n28723N5298c480228a26488A66053
1523B158126h02128R859C567273a050251j614613C78729b471103F469998B07101
1513A276475c639812l361568E25253N938455H17546f95765E43324d822275I468323
$$ plain form
1578 1384837 -1777565 -3194862 443563 2841841 -873424 -2631745 -2380333 238503 -4184113
1568 5103006 1932643 -1866806 3570948 -611689 -3770023 -1523903 371 1530593 907375
1559 907375 4122646 -1198836 -884991 -898427 -3106134 1466554 1417569 -3347894 -2598000
1550 -2598000 5550967 -2033334 -5241613 -2340976 491318 3758666 -2136555 5154462
1541 -1669647 -1867822 2529929 -2010122 9160556 -6914622 1031531 -5367423 -4256215
1533 -4256215 3479008 5043726 -5227091 1720608 1191885 1247183 -3480228 -126488 166053
1523 2158126 -802128 -792269 3567273 -1050251 -2664864 378729 -2471103 6469998 207101
1513 1276475 -3639812 -7001380 525253 6463708 817546 -695765 543324 -4822275 9468323
1503B793967c686883A45494c235789B792254g75763j887361C213088b919245F12407
1493B816155o83225i07198A052728a404015D6164b647021D039941a826487G41557
1483A096701J505266J907557k156315c253417C101371H13311h69702C417300c149252
1473A814711L01056d709987A735487c746643E157133b637510A270454G89K192798
1464B193587d613506E89065a407502B519055c010615a41316D101404b628360A265802
1454F879359b99397A985847n6356G70097R34363n24295K08313c620787C435814
1444a789938j704842a638566A058781a976474k064323D035143A741077a965024
1435d252083B223381b851272B207334f14207j752976C752976j317742D5549f154193
$$ plain form
1503 2793967 -3686883 145494 -3235789 2792254 -775763 -2663124 3213088 -2919245 612407
1493 2816155 2132930 -907198 1052728 -1404015 46164 -2647021 4039941 -1826487 741557
1483 1096701 2601967 4509524 2353209 -3253417 3101371 813311 -869702 3417300 -3149252
1473 1814711 2115767 -4709987 1735487 -3746643 5157133 -2637510 1270454 789 2193587
1464 2193587 -4613506 589065 -1407502 2519055 -3010615 -141316 4101404 -2628360 1265802
1454 6879359 -299397 1985847 1929491 770097 1704460 1180165 1388478 -3620787 3435814
1444 -1789938 -3494780 -1638566 1058781 -1976474 -4040797 4035143 1741077 -1965024
1435 -4252083 2223381 -2851272 2207334 -614207 -2367183 3752976 2435234 45549 -6154193
1425A239836K721227A865773C50598a025661k724965B894890j413876d0734l021665
1416c062399p5403C307987a132529K28029B68322b101511D533806k220554d31272
1406a212599k900331B093129j04358G34499K475711J004432d05033B570266p72642
1397A797624g748127A991053d848425E613898c259840A054296e414784B039415
1388A713812b163389D153044c920930j697739C757469b774675B469158O52363
1380C121521b699864d12341j091540j328211C77006K201d94319a73683l019496
1371c193179h98892A58145L87850e354009C479125e104D413520b725739b47206
1361D381027a513793d3182m098551C381663a848528E741284k091019A047455a874499
$$ plain form
1425 1239836 3961063 1865773 350598 -1025661 -3750626 2894890 1481014 -40734 -3062399
1416 -3062399 -3137802 3307987 -1132529 -904500 268322 -2101511 4533806 2313252 -431272
1406 -1212599 -4112930 2093129 1988771 734499 3210210 4214642 -405033 2570266 1797624
1397 1797624 -7748127 1991053 -4848425 5613898 -3259840 1054296 -5414784 2039415
1388 1713812 -2163389 4153044 -3920930 -5618669 3757469 -2774675 2469158 3121521
1380 3121521 -2699864 -412341 -1503881 -2832092 377006 379207 -494319 -173683 -3193179
1371 -3193179 -898892 158145 545995 -5354009 3479125 -5104 4413520 -2725739 -247206
1361 4381027 -1513793 -43182 -4141733 3381663 -1848528 5741284 3650265 1047455 -1874499
1351G13533L59457a482845B26316i18581A387833c313491I308790d410557A032536
1341a308958L99754B849721h693291B229100L488353c026933B596043a8032o71397
1332f89429A961819H91125b114643i86280E491726F60692b965974k079906J228331
1323c817549H020403i1910p95917c52363C563360b284280A467998f000780H45658
1313B087198A034597D17319O247990A584450c658171i03189B665025A201248c9628
1303C433021e460721b298453E71956d105986E388958f447388D571673A246883
1294E11257K415476F59711b503306m117631D234878d752296J197203F192205H67759
1284D038068c450413b86307p229093E38496D3167c130081B637915e773165H1649
$$ plain form
1351 713533 1072990 -1482845 226316 -918581 1387833 -3313491 9308790 -4410557 1032536
1341 -1308958 -909204 2849721 -8693291 2229100 5717453 -3026933 2596043 -18032 -689429
1332 -689429 1961819 891125 -2114643 -986280 5491726 660692 -2965974 -5045880 -3817549
1323 -3817549 8020403 -91910 -887827 -352363 3563360 -2284280 1467998 -6000780 845658
1313 2087198 1034597 417319 6665309 1584450 -3658171 -903189 2665025 1201248 -39628
1303 3433021 -5460721 -2298453 571956 -4105986 5388958 -6447388 4571673 1246883
1294 511257 2926733 659711 -2503306 -6620937 4234878 -4752296 -3555093 6192205 867759
1284 4038068 -3450413 -286307 -7515400 538496 43167 -3130081 2637915 -5773165 81649
1274a619607l353213b7755m087721H03863c402531a541236j642613B333723J416176
1265C749899A700685b268325o54564o55411B818809c639332D655479a498326L48161
1256a150165B559113H63947i928D45286d375820B600947A089614d092425J984206
1247b108219E837332c424677C160563a137263H77581K485428a553228A818934
1238A052958a808675D75748a029443D7911g11525G65330K499645f47319i1417
1228c084044B448214I09517c126099D422595b725237G69338a445855B514343h88986
1218B669792g40058B11328b317876B039812c83163D06653L108707C11167a962879
1208C963801h94744G371483f5173j466031A237794n94541b801650A657366c809324
$$ plain form
1274 -1619607 -4972820 -27755 -4115476 803863 -3402531 -1541236 -3183849 2333723 3749899
1265 3749899 1700685 -2268325 -2922889 -3578300 2818809 -3639332 4655479 -1498326 -1150165
1256 -1150165 2559113 863947 -9928 445286 -4375820 2600947 1089614 -4092425 -2108219
1247 -2108219 5837332 -3424677 3160563 -1137263 877581 3363009 -1553228 1818934
1238 1052958 -1808675 475748 -1029443 47911 -711525 765330 3264975 -647319 -91417
1228 -3084044 2448214 909517 -3126099 4422595 -2725237 769338 -1445855 2514343 -888986
1218 2669792 -740058 211328 -2317876 2039812 -383163 406653 3515360 311167 -1962879
1208 3963801 -894744 7371483 -65173 -1531204 1237794 643253 -2801650 1657366 -3809324
1198h87447A057532c313321C162677e162272K504830C649515i65150E470570g935804
1188A520131C41684a159368B940508g32103o162875H89311b480721l041915K552585
1179b970051G9667d024890E22270O74650f40326m55820k87390j352361A151178
1169F37995h97160C856876A485252K201503A354983c931245I270223e227799B42985
1159C393402c187257C745709A357866C75J902658a678622k337066A957766I51068
1149A113160a253950N77026A49756g87619E58882G1211L361363F07498K084816
1140B692314b070537a52081I30386a326023C131437b320658D10092J548951H77319
1130i71405o91549A3562a276383A077175a850458k381197I5459b02891A015846
$$ plain form
1198 -887447 1057532 -3313321 3162677 -5162272 -2657442 3649515 -965150 5470570 -7935804
1188 1520131 341684 -1159368 2940508 -732103 -6894978 889311 -2480721 -5522636 -2970051
1179 -2970051 79667 -4024890 522270 1196920 -640326 -1096146 -1383536 -2735897 1151178
1169 637995 -897160 3856876 1485252 3686755 1354983 -3931245 9270223 -5227799 242985
1159 3393402 -3187257 3745709 1357866 375 1903033 -1678622 -4015688 1957766 951068
1149 1113160 -1253950 -676924 149756 -787619 558882 71211 3432574 607498 2692314
1140 2692314 -2070537 -152081 930386 -1326023 3131437 -2320658 410092 1959043 877319
1130 -971405 -1662954 13562 -1276383 1077175 -1850458 -4231655 95459 -202891 1015846
1120C007206J167692d00384m016947b59928k32093p98234o667349B810126c733402
1110c831537B928612b386323E487785A452317i85323a11814I0206J633811d423774
1100C665722J857747c32258q57124H95191M038692b417548l37322A275733M7468
1091A323201a111037A533030m40609c883492a546427B562201f62125A18907g2748
1081a121756E482404B625522G40072P76276l36750d628627K196806p35488B573032
1071b679136b05058l173900A548510O78153a356946H2990L841632P31871e2057
1061a950721d33238j501517I10052M29243K808451a376195G47203A2233g07212
1051D662117k229097g2314k404228A321885l55289g18139j686798B149451f327684
$$ plain form
1120 3007206 4174898 -400384 -4417331 -259928 -492021 -1290255 -7957604 2810126 -3733402
1110 -3831537 2928612 -2386323 5487785 1452317 -985323 -111814 90206 1724017 -4423774
1100 3665722 5523469 -332258 -1189382 895191 4933883 -2417548 -2754870 1275733 1323201
1091 1323201 -1111037 1533030 1092421 -3883492 -1546427 2562201 -662125 118907 -72748
1081 -1121756 5482404 2625522 740072 1516348 1179598 -4628627 -2431821 -3167309 2573032
1071 -2679136 -205058 -3378958 1548510 2226663 -1356946 82990 3924622 4656493 -52057
1061 -1950721 -433238 -1934755 910052 1339295 4147746 -1376195 747203 12233 -707212
1051 4662117 2433020 -72314 -2476542 1321885 966596 -718139 -2404937 2149451 -6327684
1041a61198F54568J531031d358548G193187d015038B264020J195585c215324C471086
1031c216106e71264F333188b560630F36681A41094M016060j603533B07429f27534
1021F38858c521846J717057c453j497980m54404B215500N19224d423827a979609
1011A542161a073497C52674R44527O5168a83232C498386a570730E345832a14596
1001B847375a52097A006896c877758a44439j170829A47393e816379A826924o13037
992A213887h3823k272063L96388a72091l185047j258367e90806F024231b685620
982A725877L50085b253627E54600K152122j159296J206672A342513k3747c73257
972a448622A322293O36314h44511A263532N84290K424516a268362B54126b149382
$$ plain form
1041 -161198 654568 2185599 -4358548 7193187 -4015038 2264020 3459605 -3215324 3471086
1031 -3216106 -571264 6333188 -2560630 636681 141094 4157154 2553621 207429 -627534
1021 638858 -3521846 -1804789 -3453 -1501433 -1955837 2215500 2734724 -4423827 -1979609
1011 1542161 -1073497 352674 1297201 1362369 -183232 3498386 -1570730 5345832 -114596
1001 2847375 -152097 1006896 -3877758 -144439 -1315268 147393 -5816379 1826924 1213887
992 1213887 -83823 -2355886 -1959498 -172091 -3357138 -4615505 -590806 6024231 -2685620
982 1725877 2075962 -2253627 554600 2706722 1547426 2754098 1342513 1318766 -373257
972 -1448622 1322293 1958607 -844511 1263532 1847822 4272338 -1268362 254126 -2149382
962C426324P27245i97986L37377F301389b724677A074846c028250C930933b786423
952B478719b139203B247114a409332I0606L695145m88755C55116a986217p22363
943b708580A723767o79046K0361d996891C01205J040376D38367M915259j767478
934C586148a059193A867648d023063B888582a983751N3079A366563Q2859a02651
924B703484j158360e034860A792977h7683k021427b3948l081592B580090d987760
914a913684A023247Q42017d67136J19436j17243J60358B161600c527220j44944
905c672164E15865O40537d324156B132243b16336A166953c606794j809796a259446
895D264052k32692b805491C373097O83490c652195A926306c947825F138002f469998
$$ plain form
962 3426324 4153569 -997986 -660609 6301389 -2724677 1074846 -3028250 3930933 -2786423
952 2478719 -2139203 2247114 -1409332 90606 3785751 3296996 355116 -1986217 -2708580
943 -2708580 1723767 1044721 1065082 -4996891 301205 1341581 438367 5353626 3586148
934 3586148 -1059193 1867648 -4023063 2888582 -1983751 -1930672 1366563 1449422 -102651
924 2703484 1545124 -5034860 1792977 -87683 -2109110 -23948 -3105540 2580090 -4987760
914 -1913684 1023247 1865264 -467136 -347700 -464943 -304585 2161600 -3527220 -3672164
905 -3672164 515865 1156402 -4324156 2132243 -216336 1166953 -3606794 -5416590 -1259446
895 4264052 4031360 -2805491 3373097 4056587 -3652195 1926306 -3947825 6138002 -6469998
885B531669R65609a16691l51368l833807B934942E53695J632386K308418d381551
875G035999g419728G402238H32874e5088A792223J135632a397054j987736D581443
865b073089A402851c573938a05343F21283L791811c726661m52438B802606b057162
855A453793K990312e101003a110749e20880j372130A096394a660084c62687o412093
846f774780C529731A613632b183184B00672J038651M956497c295193J628868L97379
837a268946o76248P33452N72741E34464R13186d784542d67236B403009a201754
827C251855a583272f63696G4228K708254J629144a070643m88997l215814a964340
817F15409J142366H36977M967935a020249l008788A15235J721270b599283B257429
$$ plain form
885 2531669 3497278 -116691 -468059 -4301866 2934942 553695 2186081 4494499 -4381551
875 7035999 -7419728 7402238 832874 -55088 1792223 2927855 -1397054 -3384790 4581443
865 -2073089 1402851 -3573938 -105343 621283 4413094 -3726661 -4179099 2802606 -2057162
855 1453793 4444105 -5101003 -1110749 -520880 -1893010 1096394 -1660084 -362687 -6774780
846 -6774780 3529731 1613632 -2183184 200672 1239323 6195820 -3295193 -1666325 -1268946
837 -1268946 -1945194 -1211742 -639001 534464 1447650 -4784542 -467236 2403009 -1201754
827 3251855 -1583272 -663696 74228 2782482 4411626 -1070643 -1559640 -4775454 -1964340
817 615409 1757775 836977 5804912 -1020249 -4029037 115235 1836505 -2599283 2257429
807a866261K62329B599371i95690q31612D199918c680193B722238c755060D983794
797b791710R32759D307445b755284E851842a213429F47463a693474o311A110678
787C038652p26549b24593E710336b006230D180487I9274b924266J82630B25425
777e93647j583563D227542a067419A732202M583817B884317c200894D466117i86110
767B254132d531567c7189j306149A310428c744983a322670k214637A124495d729073
757G987581b322909D26047a421167A578894a401142K48989e71384D808407B26304
747A781452J212832A097817c674445F56778j56048b515855h19092E526373c818049
737B439017J80664n37563K617711k033398b929243iC87814r9313A367h7295j190944
$$ plain form
807 -1866261 -1603932 2599371 -995690 -1827302 4199918 -3680193 2722238 -3755060 4983794
797 -2791710 -1858951 4307445 -2755284 5851842 -1213429 647463 -1693474 -1699785 1110678
787 3038652 2312103 -224593 5710336 -2006230 4180487 99274 -2924266 -2741636 225425
777 -593647 -2177210 4227542 -1067419 1732202 6316019 2884317 -3200894 4466117 -986110
767 2254132 -4531567 -37189 -1343338 1310428 -3744983 -1322670 -3537307 1124495 -4729073
757 7987581 -2322909 426047 -1421167 1578894 -1401142 -1152153 -571384 4808407 226304
747 1781452 2994284 1097817 -3674445 656778 500730 -2515855 -819092 5526373 -3818049
737 2439017 2619681 2082118 4699829 2666431 -2929243 -9 387814 288501 1367 -87295 -1278239
726a278239F65593c274379D539922k164495c836736D236899A232020c663349A169545
716e166294A581180a050114C118190A293768A14632N20319d391126J59910G33355
706c492361B312267G00686J08153l61866f952180b416317I96287a80649j088086
697a268735j341653j3120014P521559C296707b005948A8320500N618899C516908
688D403494P40772i484164m762852r967260R801573j301079P12472D460559L1048486
679C5509045A4136077J705873j145318d931734q0746o38799J118660a922346R05551
670a016795B625715K47085a481904j45577D85125L235906c004102A329673d812341
660A216225B04592M932526E62491M764659O350207L015641a1181774l664475m314751
$$ plain form
726 -1278239 665593 -3274379 4539922 2375427 -3836736 4236899 1232020 -3663349 1169545
716 -5166294 1581180 -1050114 3118190 1293768 114632 634951 -4391126 -4231216 733355
706 -3492361 2312267 700686 808839 446973 -6952180 -2416317 996287 -180649 -1268735
697 -1268735 -2610388 -15730402 -8208843 3296707 -2005948 18320500 23939399 3516908
688 4403494 5144266 -9484164 -14247016 -24214276 -14412703 -15713782 -15001310 4460559 35509045
679 35509045 14136077 15841950 14696632 -4931734 -5012480 -5651279 -4532619 -1922346 -1016795
670 -1016795 2625715 2872800 -1481904 -1627481 485125 3721031 -3004102 1329673 -4812341
660 1216225 204592 5137118 562491 5327150 11677357 14692998 -11181774 -14846249 -19161000
651a9161000n96865a415989j2807916A776931J1682140j375432J9156405G773850
642b175782m301957j387559k532117C798455f847901p048422F14814J427599J0093403
633A2135816B264588m45482m85464c603916a249125b71160l942A228848a507248
623a460621e55447D72345K440559J734687d076n14584E517509H62029c134406
613H32061K490240c427107E80925J294860J633476b980819A28574M916885I28010
603A0144351M572960J1264669J5381854a49447096K7953717M9333804A49000377
595B7352735j3445337m158982m627622B006476a737997F56220b560282B680114
586B339902I3275M835727c353480A190480a587188m290584D702555G89712J500878
$$ plain form
651 -19161000 -19757865 -1415989 -14223905 1776931 13459071 12083639 31240044 7773850
642 -2175782 -6477739 -7865298 -10397415 3798455 -6847901 -13896323 614814 2042413 12135816
633 12135816 2264588 1819106 1333642 -3603916 -1249125 -271160 -275102 1228848 -1507248
623 -1460621 -555447 472345 2912904 4647591 -4076 -518660 5517509 862029 -3134406
613 832061 3322301 -3427107 580925 1875785 3509261 -2980819 128574 5045459 928010
603 10144351 14717311 25981980 41363834 -149447096 -121493379 -72159575 149000377
595 27352735 13907398 9748416 5120794 2006476 -1737997 656220 -2560282 2680114
586 2339902 93275 4929002 -3353480 1190480 -1587188 -5877772 4702555 789712 2290590
577B290590L3808K011926i2682n227785A875972a231227A850477b27519j657207
568a884726I97517B1424J196050b695072i76195B806615b74582k360717j548509
559d183808F24516L379694b294888f39844l298341C678410a947965a43484E79791
549E80769L94886J236695e017047E33900c135311k525988A816125f549776a934518
539A19464a138224B825825a380746b46708j375491D830043d90590A85739a69402
529D949718B410367G5099c152413E26928M33710N62879c864443C23842L24895
520F48737c226127C262115b173968a83459k040362a64831D03582b280456q53484
511c133940n47659a412968f75422B786582A184141a767513B456276K271277a605626
$$ plain form
577 2290590 2324398 4336324 -92682 -5320467 1875972 -1231227 1850477 -227519 -1884726
568 -1884726 997517 21424 1217474 -2695072 -976195 2806615 -274582 -2635299 -4183808
559 -4183808 624516 4004210 -2294888 -639844 -3938185 3678410 -1947965 -143484 579791
549 580769 975655 2212350 -5017047 533900 -3135311 -5661299 1816125 -6549776 -1934518
539 119464 -1138224 2825825 -1380746 -246708 -1622199 4830043 -490590 185739 -169402
529 4949718 2410367 75099 -3152413 526928 960638 1523517 -3864443 323842 648737
520 648737 -3226127 3262115 -2173968 -183459 -2223821 -164831 403582 -2280456 -3133940
511 -3133940 -3681599 -1412968 -675422 2786582 1184141 -1767513 2456276 4727553 -1605626
501d081047G793014B221002q03498D23962d39226q44146k68855B712311F65191
491d684979B569062a936256a19746A246256a879311F163774a775305j389837A165570
481G179786a145796E347641A737195R31438c534649i53022C292776j571817c566164
471c561491A419771j82101E00101b215800B75K504508c507972m36947a707803
461g7202m72358D050658c075949I2242d085854G880519c063351D48395d559416
451C450619i05348r78982F186818b152143F16726J744470g117886a070541r9552
442a170093j811436D166298a524334C35026b388825C541114e45918C31277K837513
433C168790A381993r0163J586642c192697C22113c150921a080309A690565J76738
$$ plain form
501 -4081047 7793014 2221002 1417504 423962 -439226 -1283372 -1552227 2712311 665191
491 -4684979 2569062 -1936256 -119746 1246256 -1879311 6163774 -1775305 -3165142 1165570
481 7179786 -1145796 5347641 1737195 2668633 -3534649 -953022 3292776 1720959 -3566164
471 -3561491 1419771 1237670 500101 -2215800 275 2504783 -3507972 -3944919 -1707803
461 -77202 -549560 4050658 -3075949 92242 -4085854 7880519 -3063351 448395 -4559416
451 3450619 -905348 -1884330 6186818 -2152143 616726 2361196 -7117886 -1070541 -1170093
442 -1170093 -2981529 4166298 -1524334 335026 -2388825 3541114 -545918 331277 3168790
433 3168790 1381993 1291830 2878472 -3192697 322113 -3150921 -1080309 1690565 1867303
424A867303m72236F94628Q15389c436647f01995o79287B080242q34451i49239
414C230360G10208l44798L20365b98156n760671C721854b617892j371879B237390
404i29214C692364J76710A3192P97044K211600o00262c425724D458567d1920m116643
394d158563L59046B734720b187523m189577F41855O1427a044711B739580Q96650
385C636230a803173C08394c703338a056341A613036h2139l372574b62452C118806
375b604558j9670B500870f66940A332426b946600A433151b790027D854004a130866
365A941328j39449K22600a663085D68095a457966l60585r5022A669146b066269
355D791410a350865r6079A820100j4054d194823B758125n05240a130674l482620
$$ plain form
424 1867303 1395067 694628 1510017 -3436647 -601995 -1281282 2080242 1245791 -949239
414 3230360 710208 365410 685775 -298156 -6058827 3721854 -2617892 -3989771 2237390
404 -929214 3692364 3869074 13192 810236 3021836 2421574 -3425724 4458567 -41920 -4158563
394 -4158563 -3799517 2734720 -2187523 -6377100 641855 703282 -1044711 2739580 3636230
385 3636230 -1803173 308394 -3703338 -1056341 1613036 -82139 -3454713 -262452 3118806
375 -2604558 -2624228 2500870 -666940 1332426 -2946600 1433151 -2790027 4854004 -1130866
365 1941328 1801879 2024479 -1663085 468095 -1457966 -1818551 -1913573 1669146 -2066269
355 4791410 -1350865 -1446944 1820100 1806046 -4194823 2758125 2252885 -1130674 -4613294
346d613294A076491O140021F34728f11524A670670a066415j274677A42636O517463
337F660099g713373B459892b625587E82972J037694e830238H419854b73213k569747
328b842960k39187c70597A073789K385589c285109j143583A313032a334070A137862
318b35915j558407C614975A472466h256123A971921a397396j225092A584748b605829
308C273371A22144J526203a711146r82781D00096b087729L01180A485395d569467
298b106313B020331O45479F45576b494959J132930j062425A616631n85871c631384
288A3480O519431l206470o27116h269462A826482J62019d45492j071114A894979
278b04633l00053A385431l90642L974440D44322b150657g75420c05475l772891
$$ plain form
346 -4613294 1076491 7216512 634728 -611524 1670670 -1066415 -2341092 142636 6660099
337 6660099 -7713373 2459892 -2625587 582972 1620666 -5830238 8419854 -273213 -2842960
328 -2842960 -3082147 -370597 1073789 3459378 -3285109 -4428692 1313032 -1334070 1137862
318 -235915 -1794322 3614975 1472466 -8256123 1971921 -1397396 -2622488 1584748 -2605829
308 3273371 122144 1648347 -1711146 -2693927 400096 -2087729 -1786549 1485395 -4569467
298 -2106313 2020331 2665810 645576 -2494959 -1362029 -2424454 1616631 1030760 -3631384
288 13480 6532911 3326441 2699325 -8269462 1826482 1988501 -445492 -1516606 1894979
278 -204633 -504686 1385431 994789 4969229 444322 -2150657 -775420 -305475 -4078366
269d078366F644576b009442D3394K745836f6269c0276B0433K38788D6443L768567
259C815010D90862a546715j534389N60033I93873g47229A920095b580581a206803
249a094279E80074a306379A580314o90106e09108A583471J847093a815688B285802
239c494254d20337B325509a101155B744230j97424J657703A842428d3614l095006
230c138620G051742a596648e97078p40197j467132A717360Q5132a649345A930751
220A332203J979058a794061j493067a332724G2836K117604D0457b2666k148109
211b170775F72914R98671a858770a46213D636972d361829F739719a619327k755212
202d374539B354165J917871e847083A444349g30876C31636b291828g26333h7314
$$ plain form
269 -4078366 6644576 -2009442 43394 2789230 -66269 -30276 20433 259221 46443 3815010
259 3815010 490862 -1546715 -3081104 -2521071 993873 -747229 1920095 -2580581 -1206803
249 -1094279 580074 -1306379 1580314 890208 -509108 1583471 3430564 -1815688 2285802
239 -3494254 -420337 2325509 -1101155 2744230 2546806 4204509 1842428 -43614 -3138620
230 -3138620 7051742 -1596648 -597078 -1337275 -2804407 1717360 1802492 -1649345 1930751
220 1332203 3311261 -1794061 -3287128 -1332724 72836 2190440 40457 -22666 -2170775
211 -2170775 672914 1671585 -1858770 -146213 4636972 -4361829 6739719 -1619327 -4374539
202 -4374539 2354165 4272036 -5847083 1444349 -730876 331636 -2291828 -726333 -87314
192a851099A862261N85728a053311j429586E553437a163801A886243J648972c30898
182f847496a793341j407596B894982c666061A687113J583902r54729J358715H76896
172F97745M829655a899826f75143c01991m071227B500806e483278G96907A12700
162a6797273j4640735p0352698A0410461K0753159P2058203j8603865j2592070
155G2025888E248166c4491200l8712137o825166B0988246C549337A44390L258267
147C402657j628979a402160C76769a928589g13662B206279K010207a743364H80585
137E675798H73867b679425a268038b88831k505754A401022a623717A61142M175931
128D337073a046054j896900A886318M15L06636b123321A40832b214383G96363
$$ plain form
192 -1851099 1862261 2447989 -1053311 -2482897 5553437 -1163801 1886243 3535215 -330898
182 -6847496 -1793341 -3200937 2894982 -3666061 1687113 3271015 2316286 3675001 876896
172 697745 5527400 -1899826 -675143 -301991 -4373218 2500806 -5483278 796907 112700
162 -16797273 -31438008 -101790706 10410461 31163620 103221823 84617958 72025888
155 72025888 5248166 -34491200 -73203337 -80028503 20988246 3549337 144390 3402657
147 3402657 1773678 -1402160 376769 -1928589 -713662 2206279 4216486 -1743364 880585
137 5675798 873867 -2679425 -1268038 -288831 -2794585 1401022 -1623717 161142 4337073
128 4337073 -1046054 -2942954 1886318 1886733 2193369 -2123321 140832 -2214383 796363
118e095370E2475b923056D42099L869924b461130a05930A912251a48252A574211
108a975803A340604b650552o37654A567760b573337A845289J731189f96410j280869
99a977279n7529A362589P17410b517406H97831b692134F23855d817574C705889
89E265248A833039A70557c405747a252147A209253f289874D656425j569796p98738
80B287891b548936B293901b964417F20533M882409g866520d72277H25285J152596
71A977881b029369J006043B441540B76390J287894n75024A88733O600903a86653
61c812547a214858j220163H095883a321490n47544C520139d636534E120743a400872
51H055045b743468D764334c478616i70276D95196K455861d264067C717262e407485
$$ plain form
118 -5095370 52475 -2923056 442099 4312023 -2461130 -105930 1912251 -148252 1574211
108 -1975803 1340604 -2650552 -3288206 1567760 -2573337 1845289 3576478 -696410 -1977279
99 -1977279 -2034808 1362589 2079999 -2517406 897831 -2692134 623855 -4817574 3705889
89 5265248 1833039 170557 -3405747 -1252147 1209253 -6289874 4656425 3086629 2287891
80 2287891 -2548936 2293901 -2964417 620533 5502942 -7866520 -472277 825285 1977881
71 1977881 -2029369 -1023326 2441540 276390 1564284 989260 188733 6789636 -186653
61 -3812547 -1214858 -2435021 8095883 -1321490 -1869034 3520139 -4636534 5120743 -1400872
51 8055045 -2743468 4764334 -3478616 -970276 495196 2951057 -4264067 3717262 -5407485
41A225497e313554a771066E68186c428198i35497C925427a716149k313521a492879
31A743528J453887j379541a318088k016558P81888A09074b61399C187104j548646
22A638458R82773b439321o8937j319468A573820c58620B530556c592868a657161
12a73372C151572j555445J61513d16025B458083D02339b228135J006488d28753
2a017883B733590h2110
$$ plain form
41 1225497 -5313554 -1771066 568186 -3428198 -935497 3925427 -1716149 -4029670 -1492879
31 1743528 3197415 1817874 -1318088 -3334646 -2552758 109074 -261399 3187104 1638458
22 1638458 2621231 -2439321 -2508258 -3827726 1573820 -358620 2530556 -3592868 -1657161
12 -173372 3151572 1596127 1757640 -416025 2458083 402339 -2228135 -1221647 -428753
2 -1017883 2733590 -82110
##PAGE= F1=5575.183789999
##FIRST=     21204.543296753, 2630.29399671053, 1820848
##DATA TABLE= (F2++(Y..Y)), PROFILE
2047A820848b065356i29758A439131a374950e37964H68433m30937h90259d37429
2037A803335a607485B06058J771594q31043e40143j013899o59062j961105A842372
2027a727310C8904K404149E90196M847949f388011A505540a10755A906583i51328
2017F3347M98832N0474a016226q00590A415415c042926p98285C248218a01933
2007B027218G86333a304133G75427b287895A821490k47254a550659B189355a173699
1997c002582A505040N35938b935119e76889C824908f42199p04456A115662C2568
1987a84980C375812H7143P613559a73251l735482A366403j44811M114906a150488
1977e22676k16669k778954C38897K232186a095576B650856D59186A56633a520354
$$ plain form
2047 1820848 -2065356 -929758 1439131 -1374950 -537964 868433 437496 -890259 -437429
2037 1803335 -1607485 206058 1977652 1146609 -540143 -1554042 -2213104 -4174209 1842372
2027 -1727310 38904 2443053 590196 5438145 -6388011 1505540 -110755 1906583 -951328
2017 63347 562179 612653 -1016226 -1816816 1415415 -3042926 -3841211 3248218 -101933
2007 2027218 786333 -1304133 775427 -2287895 1821490 1574236 -1550659 2189355 -1173699
1997 -3002582 1505040 2040978 -2935119 -576889 3824908 -642199 -1346655 1115662 32568
1987 -184980 3375812 87143 7700702 -173251 -3908733 1366403 1221592 5336498 -1150488
1977 -522676 -739345 -3518299 338897 2571083 -1095576 2650856 459186 156633 -1520354
1967A759454n72319a400132E413179c240237g56991j54524B431689O12912r45834
1958B098767d236323G196412b11093k602024N83961D372281A049296j93802d551909
1948A917219K614058a065058C015798O26083a631366B000111l42907e294912D874310
1938c196664j647471G141043a537032k781025J93985A326888M905788A580734
1929f560190A867292M21997j128329e018608B832474h43016L24721j225312G52519
1919H88910d92890B827479b688620k64172D454750I39119O06044a420208B27122
1909G384267b328125D361159j561011b094520M88113B634952e622826C831052
1900B032143d281463c00081j788406k76262j127637H22723A62946K880885b850867
$$ plain form
1967 1759454 1187135 -1400132 5413179 -3240237 -756991 -911515 2431689 3044601 2098767
1958 2098767 -4236323 7196412 -211093 -2813117 -2229156 4372281 1049296 855494 -4551909
1948 1917219 4531277 -1065058 3015798 3641881 -1631366 2000111 1657204 -5294912 4874310
1938 -3196664 -4844135 7141043 -1537032 -4318057 -4124072 1326888 6232676 1580734
1929 -6560190 1867292 2289289 1160960 -5018608 2832474 -843016 -518295 -1743607 752519
1919 888910 -492890 2827479 -2688620 -2952792 4454750 939119 1545163 -1420208 227122
1909 7384267 -2328125 4361159 2800148 -2094520 -1606407 2634952 -5622826 3831052
1900 2032143 -4281463 -300081 -2088487 -2364749 -3492386 822723 162946 3043831 -2850867
1890g46621B745134B63714K11650f048952K871225D547590c195892f61189D257217
1880c712954A252227O2114b672745A232055J066694d119579C310872b368113h46479
1870c192946C951974c289854A90771L186595J493489A551504a557137A096906
1861A011113c259659M75014o29688H46407K703104b777203A362469a764042B664113
1851H03406K51628N24979b238483A426638h51792l024063d11896C051045j389241
1842A661804b510690A36130c241358B155658A75424c024022M48523n7400J161111
1833a471788L63308p88145f85262H452593c459602G808317d259026a049528j046878
1824b096406G85973a115035E714692g185509a28057n23742l70450a90699B481039
$$ plain form
1890 -746621 2745134 263714 475364 -6048952 -3177727 4547590 -3195892 -661189 4257217
1880 -3712954 1252227 1314341 -2672745 1232055 2298749 -4119579 3310872 -2368113 -846479
1870 -3192946 3951974 -3289854 190771 3377366 4870855 1551504 -1557137 1096906
1861 1011113 -3259659 -2784645 -3414333 846407 3549511 -2777203 1362469 -1764042 2664113
1851 803406 1055034 1580013 -2238483 1426638 -851792 -3875855 -411896 3051045 1661804
1842 1661804 -2510690 136130 -3241358 2155658 175424 -3024022 -2575499 -2632899 -1471788
1833 -1471788 -1108480 -1896625 -685262 8452593 -3459602 7808317 -4259026 -1049528 -2096406
1824 -2096406 785973 -1115035 5714692 -7185509 -128057 -651799 -1022249 -190699 2481039
1814b411333E06009J842103b226755i79175A788069H40720J220667f44312A58065
1804c171625B817072e164028C176830b167748l230488E717341h561222a147524
1795g95019C082560b180048a88090I31305M167350H11475l86175g111640C383380
1785A673142h56083A808279E09422a680616G85705L984847a238799j157875C761360
1775G1077J734500b825050J395424B969179e20184q61063C39362J247991d057345
1765G96528J66554b483051m98516e01842j644122i98214H78078J261961F3539
1755b644538I90955f609763B766903b908530P67868D688920e96120b42182j515807
1746a757989A787684a402884N88487C244979M066276g17157B133730e46215O2341
$$ plain form
1814 -2411333 506009 2348112 -2226755 -979175 1788069 840720 2061387 -644312 158065
1804 -3171625 2817072 -5164028 3176830 -2167748 -5398236 5717341 -8561222 -1147524
1795 -795019 3082560 -2180048 -188090 931305 5098655 811475 425300 -7111640 3383380
1785 1673142 -856083 1808279 509422 -1680616 785705 4770552 -1238799 -2396674 3761360
1775 71077 1805577 -2825050 -1429626 2969179 -520184 -1381247 339362 1587353 -4057345
1765 796528 963082 -2483051 -2981567 -501842 -2145964 -998214 878078 2140039 63539
1755 -2644538 990955 -6609763 2766903 -2908530 -2140662 4688920 -596120 -242182 -1757989
1746 -1757989 1787684 -1402884 -814397 3244979 7311255 -717157 2133730 -546215 -483874
1737d83874A793403b252785A393859a586175D40830Q403509d53523A193529b335711
1727D474821A489943g92468E211979A891731i68339K92058A215447K85379b131512
1717B043962G26360a670387E089486p31200b381381C074293R3109a871094k903005
1708d774099a133154C673996G87598b816223F8915Q2180Q74155J709037a411975
1698a596972D986551a079143A178402M8518a622706j897353D079706c499378I135726
1688d389408C22565c48244I68432M631634c859734a083254a57363p80975m465252
1679e403590c70928B512266b041248E288900b761795C79982A24464J440364g57023
1669F91446O08514k65054J335190g70653j128011B546353J063260a03481j802620
$$ plain form
1737 -483874 1793403 -2252785 1393859 -1586175 440830 8844339 -453523 1193529 -2335711
1727 4474821 1489943 -792468 5211979 1891731 -968339 -676281 1215447 1500826 -2131512
1717 2043962 726360 -1670387 5089486 4358286 -2381381 3074293 3167402 -1871094 -4774099
1708 -4774099 -1133154 3673996 787598 -2816223 68915 151095 1025250 2734287 -1411975
1698 -1596972 4986551 -1079143 1178402 1226920 -1622706 -3520059 4079706 -3499378 9135726
1688 -4389408 322565 -348244 968432 5600066 -3859734 -1083254 -157363 -938338 -5403590
1679 -5403590 -370928 2512266 -2041248 5288900 -2761795 379982 124464 1564828 -757023
1669 691446 1299960 1034906 2370096 -770653 -1898664 2546353 3609613 -103481 -1906101
1660a906101C756879o76583f117798G323531b211672j570128J415693B841636
1651a621019I89861a148856B980566O90953E82742K55063P0383J17379P08054
1642A733621e95586I55445b195671f4929A228739i72100b27992A184243h9326
1632c256445I89509a754653I08025h07987B120552c631289D48102J69785d308073
1622B943837d323503B686933d779796b362652C156575I15259K87004d821182a450368
1612A189872a882875B534961D64520d674250A568384O23094c509194J675727F434404
1602a185509A998698b386814M30645l750751C660710m44700J558341E44050N04531
1593A048581b224994B00178N89289d475507c3713A157600c220648B955046F39710
$$ plain form
1660 -1906101 3756879 3080296 -6117798 7323531 -2211672 -3781800 -2366107 2841636
1651 -1621019 989861 -1148856 2980566 3671519 582742 837805 908188 1025567 1733621
1642 1733621 -595586 955445 -2195671 -64929 1228739 -972100 -227992 1184243 -89326
1632 -3256445 989509 -1754653 908025 -807987 2120552 -3631289 448102 617887 -4308073
1622 2943837 -4323503 2686933 -4779796 -2362652 3156575 915259 1202263 -4821182 -1450368
1612 1189872 -1882875 2534961 464520 -4674250 1568384 2191478 -3509194 -1833467 6434404
1602 -1185509 1998698 -2386814 -1956169 -5706920 3660710 3216010 4774351 544050 1048581
1593 1048581 -2224994 200178 789467 -4475507 -33713 1157600 -3220648 2955046 639710
1583b431174C266273j211283a706491A692232j56944b611636o00611A027589J445542
$$ plain form
1583 -2431174 3266273 2054990 -1706491 1692232 1535288 -2611636 -3212247 1027589 2473131
$$ [...]
##END NTUPLES=nD NMR SPECTRUM
##END=
