##TITLE=Analysis number 324793
Compound Code rf 03946
Project Code adrs
Chemist Name af chempharm
##JCAMPDX= 6.0         $$ Bruker NMR JCAMP-DX V2.0
##DATA TYPE= NMR SPECTRUM
##DATA CLASS= NTUPLES
##ORIGIN= Bruker BioSpin GmbH
##OWNER= nmr
$$ XWIN-NMR		Version 3.5
$$ Fri Dec  1 09:59:15 2006 GMT Standard Time (UT+0h)  MAYBRIDGE\nmr@NMR_250MHZ
##.OBSERVE FREQUENCY= 250.131544655141
##.OBSERVE NUCLEUS= ^1H
##.ACQUISITION MODE= SIMULTANEOUS (DQD)
##.ACQUISITION SCHEME= undefined
##.AVERAGES= 16
##.DIGITISER RES= 18
##SPECTROMETER/DATA SYSTEM= dpx250
##.PULSE SEQUENCE= zg30
##.SOLVENT NAME= CDCl3
##.SHIFT REFERENCE= (INTERNAL, CDCl3, 0, 16.4539)
##AUDIT TRAIL= $$ (NUMBER, WHEN, WHO, WHERE, WHAT)
$$ ##TITLE= Audit trail, XWIN-NMR		Version 3.5
$$ ##JCAMPDX= 5.01
$$ ##ORIGIN= Bruker BioSpin GmbH
$$ ##OWNER= nmr
$$ C:\u/data/dgb/nmr/ADRS/30/pdata/1/auditp.txt
$$ ##AUDIT TRAIL=  $$ (NUMBER, WHEN, WHO, WHERE, WHAT)
(   1,<2006-12-01 09:58:56.11 +000>,<MAYBRIDGE\nmr>,<NMR_250MHZ>,
      <created by zg, POWCHK disabled, PULCHK disabled
       configuration hash MD5:
       49 4B E0 1D 92 C2 6B 37 9F E6 65 BC 52 41 86 1D
       data hash MD5: 64K
       DD 6A 80 E5 C1 94 E1 B3 8D BA 58 36 E5 73 B2 9A>)
(   2,<2006-12-01 09:59:07.05 +000>,<MAYBRIDGE\nmr>,<NMR_250MHZ>,
      <Start of raw data processing
       ef LB = 0.3 FT_mod = 6 PKNL = 1 SI = 32K 
       data hash MD5: 32K
       CD EB A2 A5 D7 51 84 D9 B1 1D 5A C9 33 AF 45 D3>)
(   3,<2006-12-01 09:59:08.80 +000>,<MAYBRIDGE\nmr>,<NMR_250MHZ>,
      <apk 
       data hash MD5: 32K
       BC 82 43 A6 32 01 24 47 66 83 E6 EB 7C F4 4D C4>)
(   4,<2006-12-01 09:59:09.50 +000>,<MAYBRIDGE\nmr>,<NMR_250MHZ>,
      <abs ABSG = 5 
       data hash MD5: 32K
       78 1A CE 47 BC 00 C7 91 0E 06 A6 1D F7 D3 81 EE>)
$$ ##END=
$$ 
$$ hash MD5
$$ 07 EE 50 4B 98 D5 27 0A 0F EA 3C 72 80 7E 52 9A
##$RELAX= 
##$RELAX= 
##$RELAX= 
##$RELAX= 
##$RELAX= 
##$RELAX= 
##$RELAX= 
$$ Bruker specific parameters
$$ --------------------------
##$DU= <C:\u>
##$EXPNO= 30
##$NAME= <ADRS>
##$PROCNO= 1
##$TYPE= <nmr>
##$USER= <dgb>
##$AMP= (0..31)
100 100 100 100 100 100 100 100 100 100 100 100 100 100 100 100 100 100 
100 100 100 100 100 100 100 100 100 100 100 100 100 100 
##$AQSEQ= 0
##$AQ_mod= 3
##$AUNM= <au_zg>
##$AUTOPOS= <9 >
##$BF1= 250.13
##$BF2= 250.13
##$BF3= 250.13
##$BF4= 250.13
##$BF5= 500.13
##$BF6= 500.13
##$BF7= 500.13
##$BF8= 500.13
##$BYTORDA= 1
##$CFDGTYP= 0
##$CFRGTYP= 5
##$CHEMSTR= <none>
##$CNST= (0..31)
1 1 145 1 1 1 1 1 1 1 1 1 1 1 1 1 1 1 1 1 1 1 1 1 1 1 1 1 1 1 1 1 
##$CPDPRG= <>
##$CPDPRG1= <>
##$CPDPRG2= <>
##$CPDPRG3= <>
##$CPDPRG4= <mlev>
##$CPDPRG5= <mlev>
##$CPDPRG6= <mlev>
##$CPDPRG7= <mlev>
##$CPDPRG8= <mlev>
##$CPDPRGB= <>
##$CPDPRGT= <>
##$D= (0..31)
0 1 0 0 0 0 0 0 0 0.06 0 0 0 0 0 0 0.0002 0 0 0 0 0 0 0 0 0 0 0 0 0 0 
0 
##$DATE= 1164967135
##$DBL= (0..7)
120 120 120 120 120 120 120 120 
##$DBP= (0..7)
150 150 150 150 150 150 150 150 
##$DBP07= 0
##$DBPNAM0= <>
##$DBPNAM1= <>
##$DBPNAM2= <>
$$ [...]
##$SUBNAM7= <"">
##$SUBNAM8= <"">
##$SUBNAM9= <"">
##$SW= 20.6930455092707
##$SWIBOX= (0..15)
0 0 3 0 0 0 0 0 0 0 0 0 0 0 0 0 
##$SW_h= 5175.983436853
##$TD= 65536
##$TD0= 1
##$TE= 295.16
##$TE2= 300
##$TE3= 300
##$TEG= 300
##$TL= (0..7)
0 120 120 120 120 120 120 120 
##$TP= (0..7)
150 150 150 150 150 150 150 150 
##$TP07= 0
##$TPNAME0= <>
##$TPNAME1= <>
##$TPNAME2= <>
##$TPNAME3= <>
##$TPNAME4= <>
##$TPNAME5= <>
##$TPNAME6= <>
##$TPNAME7= <>
##$TPOAL= (0..7)
0.5 0.5 0.5 0.5 0.5 0.5 0.5 0.5 
##$TPOFFS= (0..7)
0 0 0 0 0 0 0 0 
##$TUNHIN= 0
##$TUNHOUT= 0
##$TUNXOUT= 0
##$USERA1= <user>
##$USERA2= <user>
##$USERA3= <user>
##$USERA4= <user>
##$USERA5= <user>
##$V9= 5
##$VALIST= <valist>
##$VCLIST= <CCCCCCCCCCCCCCC>
##$VD= 0
##$VDLIST= <DDDDDDDDDDDDDDD>
##$VPLIST= <PPPPPPPPPPPPPPP>
##$VTLIST= <TTTTTTTTTTTTTTT>
##$WBST= 1024
##$WBSW= 4
##$XGAIN= (0..3)
0 0 0 0 
##$XL= 0
##$YL= 0
##$YMAX_a= 222904
##$YMIN_a= -246723
##$ZGOPTNS= <>
##$ZL1= 120
##$ZL2= 120
##$ZL3= 120
##$ZL4= 120
##$ABSF1= 16.45389
##$ABSF2= -4.239283
##$ABSG= 5
##$ABSL= 3
##$ALPHA= 0
##$AQORDER= 0
##$ASSFAC= 0
##$ASSFACI= 0
##$ASSFACX= 0
##$ASSWID= 0
##$AUNMP= <proc_1d>
##$AZFE= 0.1
##$AZFW= 0.1
##$BCFW= 0
##$BC_mod= 0
##$BYTORDP= 0
##$COROFFS= 0
##$CY= 12.5
##$DATMOD= 1
##$DC= 0
##$DFILT= <>
##$DTYPP= 0
##$F1P= 14.0000005364418
##$F2P= -0.99999901652339
##$FCOR= 0.5
##$FTSIZE= 32768
##$FT_mod= 6
##$GAMMA= 0
##$GB= 0
##$INTBC= 1
##$INTSCL= 1
##$ISEN= 128
##$LB= 0.3
##$LEV0= 0
##$LPBIN= 0
##$MAXI= 10000
##$MC2= 0
##$MEAN= 0
##$ME_mod= 0
##$MI= 0
##$NCOEF= 0
##$NC_proc= -3
##$NLEV= 6
##$NOISF1= 0
##$NOISF2= 0
##$NSP= 0
##$NTH_PI= 0
##$NZP= 0
##$OFFSET= 16.45389
##$PC= 1
##$PHC0= 226.5053
##$PHC1= 6.721824
##$PH_mod= 1
##$PKNL= yes
##$PPARMOD= 0
##$PSCAL= 4
##$PSIGN= 0
##$REVERSE= no
##$SF= 250.130017036109
##$SI= 32768
##$SIGF1= 0
##$SIGF2= 0
##$SINO= 400
##$SIOLD= 32768
##$SREGLST= <1H.CDCl3>
##$SSB= 0
##$STSI= 32768
##$STSR= 0
##$SW_p= 5175.98343685301
##$SYMM= 0
##$S_DEV= 0
##$TDeff= 65536
##$TDoff= 0
##$TI= <Analysis number 999999
Compound Code 99
Book Reference 9
Project Code 9>
##$TILT= no
##$TM1= 0
##$TM2= 0
##$TOPLEV= 0
##$USERP1= <user>
##$USERP2= <user>
##$USERP3= <user>
##$USERP4= <user>
##$USERP5= <user>
##$WDW= 1
##$XDIM= 32768
##$YMAX_p= 516751379
##$YMIN_p= -187884
$$ End of Bruker specific parameters
$$ ---------------------------------
##NTUPLES= NMR SPECTRUM
##VAR_NAME=  FREQUENCY,     SPECTRUM/REAL,   SPECTRUM/IMAG
##SYMBOL=    X,             R,               I
##VAR_TYPE=  INDEPENDENT,   DEPENDENT,       DEPENDENT
##VAR_FORM=  AFFN,          ASDF,            ASDF
##VAR_DIM=   32768,         32768,           32768
##UNITS=     HZ,            ARBITRARY UNITS, ARBITRARY UNITS
##FACTOR=    0.157963299565203, 1,           1
##FIRST=     4115.61174769078, 0,            0
##LAST=      -1060.37168916223, 0,           0
##MIN=       -1060.37168916223, -187884,     0
##MAX=       4115.61174769078, 516751379,    0
$$ Real data points
##PAGE= N=1
##DATA TABLE= (X++(R..R)), XYDATA
$$ [...]
18746F6943K2315p9470J5110J6302m6020J4212l3705M8936M8040K4944k7703j3172
$$ 66943 89258 9788 24898 41200 -4820 9392 -24313 24623 72663 97607 69904 56732
18734E6732K4062m0187m8886j2374M3642Q788K395j3262j6906l9347N688k218
$$ 56732 80794 40607 -8279 -20653 22989 31777 34172 20910 4004 -35343 -29655 -31873
18722c1873n975J8721k8992l4115N662L8101M507m8330j1358QN718L7132J6184
$$ -31873 -37848 -19127 -48119 -82234 -76572 -38471 -33964 -82294 -93652 -93644 -87926 -50794 -34610
18709c4610J8571n814j6192J0095J6748j6779M089J399L308j0621k8102p841J2136
$$ -34610 -16039 -21853 -38045 -27950 -11202 -27981 -23892 -22493 -19185 -29806 -57908 -65749 -53613
18696e3613j1942N949N2751J2522M048L279P1561M1119r1513n9748k2075N5493
$$ -53613 -65555 -59606 -6855 5667 9715 12994 84555 125674 34161 -25587 -47662 7831
18684G831j6000N4855L112l6963q854L6151k8886n7476N1955O6769J2483l5179
$$ 7831 -8169 46686 49798 12835 3981 40132 11246 -46230 5725 72494 84977 49798
18672D9798r686M3402L3890M797o3784n4168K1753P1118j391j6683L36K1433l3280
$$ 49798 40112 83514 117404 122201 58417 4249 26002 97120 95729 79046 79382 100815 67535
18659F7535m4177L9755J1160o9712L122K4447K2542n433j5486n044j1076J808
$$ 67535 23358 63113 74273 4561 7683 32130 54672 49239 33753 28709 17633 19441
18647A9441J292j5727J9861o2613m6580r303J3949N8631N4406k1547j2006n271
$$ 19441 20733 5006 24867 -37746 -84326 -93629 -79680 -21049 33357 11810 -196 -5467
18635e467m7673M0185K333j9363l3852K5125M5789L3989J4236l1817m0019J207
$$ -5467 -53140 -12955 -10622 -29985 -63837 -38712 7077 41066 55302 23485 -16534 -15327
18623a5327M521M4778J455M217j5981l2884O1035N9552k6366n1850l884j2228
$$ -15327 -10806 33972 35427 39644 23663 -9221 51814 111366 85000 33150 29266 17038
18611A7038N757p279O273j9696J0313L0665J12272n234m6720l4635j6978o32j0739
$$ 17038 22795 15516 21789 2093 12406 43071 155343 150109 103389 68754 51776 51144 40405
18598D0405l0075k6885P272O454R826k3227K3708J5400l9457J7660O8205K6537
$$ 40405 10330 -16555 -9283 -2829 6997 -16230 7478 22878 -16579 1081 69286 95823
18586I5823k4721k3838M007J4220l3226J1683K2148j6075n031j9739L515l239
$$ 95823 71102 47264 51271 65491 32265 43948 66096 50021 44990 25251 28766 25527
18574B5527m6906n599k4161L8491j2850l5714j3954n333K9708O5671j9830r947
$$ 25527 -21379 -26978 -51139 -12648 -25498 -61212 -75166 -80499 -50791 14880 -4950 -14897
18562a4897J5036j6793J3514J2188J4960L6014p6818n5752L4832J4255j4663M1332
$$ -14897 139 -16654 -3140 9048 24008 60022 -16796 -72548 -37716 -23461 -38124 3208
18550C208N4831l7778j4158j8135l387L9009K0857n4468k4177J4810J4097J7590
$$ 3208 58039 20261 6103 -12032 -15419 23590 44447 -10021 -34198 -19388 -5291 12299
18538A2299M8428l420L539Q664J5233P658l1874k5369Q693M0295L3593k0927l1798
$$ 12299 60727 57307 60846 69510 84743 92401 60527 35158 43851 84146 117739 96812 65014
18525F5014l0791k9444P729L3300K232K8917O6567L3474J6689n5084q2362O805
$$ 65014 34223 4779 12508 45808 48040 76957 143524 176998 193687 138603 56241 63046
18513F3046K8316R1685K2314M6534J4089n0664j01574J9655M492j4375K9780L4759
$$ 63046 91362 183047 205361 251895 265984 215320 113746 133401 137893 123518 153298 188057
18501A88057j7002q362k7460K8286K379m4155m4094J8992M7450j1127m4562K244
$$ 188057 171055 162693 135233 163519 165898 121743 77649 96641 144091 132964 88402 90646
18489I0646N4505J2944l7064L1443N8482L6188M2888j8458M84M8724K3055n990
$$ 90646 145151 158095 121031 152474 210956 247144 290032 271574 272058 320782 343837 337847
18477C37847n8611p433K4285N6645L9844P2909Q4984k0622p3205o0550m5068m502
$$ 337847 279236 271803 296088 352733 392577 465486 550470 529848 456643 396093 351025 346523
18465C46523L14M8112J6273r318J0098L6141L0620P272L1367K6173L7393M8488
$$ 346523 346837 394949 411222 401904 412002 448143 478763 486035 517402 543575 580968 629456
18453F29456N2963k8569n031O2451J30266Q6958N9886R5235O4765J30866J73064
$$ 629456 682419 653850 648819 711270 841536 928494 988380 1083615 1148380 1279246 1452310
18442A452310J65051K10248J52468K64607L03830L43380L93780L05842L73741
$$ 1452310 1617361 1827609 1980077 2244684 2548514 2891894 3285674 3591516 3965257
18433C965257M23010N33143P49170R05363J223104J652651K208905K911673L956925
$$ 3965257 4388267 4921410 5670580 6575943 7799047 9451698 11660603 14572276 18529201
18424A8529201N510169P816906J1312234J5343177J7880526J6767603J1900388
$$ 18529201 24039370 31856276 43168510 58511687 76392213 93159816 105060204
18417A05060204N793262K22680m677972j0046146j5303210j8561732j7825491
$$ 105060204 110853466 111076146 106398174 96352028 81048818 62487086 44661595
18410D4661595j3778736r211905n797364l568569k330680j600777j098556p39760
$$ 44661595 30882859 21670954 15873590 12305021 9974341 8373564 7275008 6535248
18402F535248n71984m69083l84875l82555l56449l71877l50072l62985l66541
$$ 6535248 5963264 5494181 5109306 4726751 4370302 3998425 3648353 3285368 2918827
18393B918827l05463l35881k88967k45164k08060j91878j56647j37857j13558
$$ 2918827 2613364 2277483 1988516 1743352 1535292 1343414 1186767 1048910 935352
18384I35352p7240m1532n1972j0431k4422q5729l5082o7785p1820l7016L2776
$$ 935352 858112 816580 764608 754177 729755 644026 608944 541159 469339 432323 465099
18373D65099J0367n398k6027l5810q740j474K830L8181l3394j9169K2277j170
$$ 465099 475466 470068 444041 408231 399491 398017 400847 439028 405634 386465 408742 407572
18361D07572n3625m3483L9784l4316n5631l6477J7482L6297p650l8115k6987q436
$$ 407572 353947 310464 350248 315932 260301 223824 241306 277603 269953 231838 204851 196415
18349A96415j1007k736J5073m2746j5287K3477k3436j9315n2056K4991j8018k1195
$$ 196415 185408 182672 197745 154999 139712 163189 139753 120438 68382 93373 75355 54160
18337E4160J6376L1525r574J6330M057j1846j2641l3198P18J6329k5508l6445
$$ 54160 70536 102061 92487 108817 112874 101028 88387 55189 55907 72236 46728 10283
18325A0283k5453J955K45L6535M4420N928M8293K396j2265l0128j5590J4236l3344
$$ 10283 -15170 -13215 -12970 23565 67985 73913 122206 124602 112337 82209 66619 80855 47511
18312D7511m1958N4846P150k3066l34j5122K8579O1015J4436K4488o187j7067
$$ 47511 5553 60399 67549 44483 44149 29027 57606 118621 133057 157545 151358 134291
18300A34291k0644m6905Q950K7888m7225J3601J1673k4202k1219N744K2769O422
$$ 134291 113647 66742 75692 103580 56355 69956 81629 57427 36208 41952 64721 71143
18288G1143k4597o2960l6666K7201L7044l585N9821J7590n570q369n578r132R420
$$ 71143 46546 -16414 -53080 -25879 11165 7580 67401 84991 79421 71052 65474 56342 65762
18275F5762j5078l8778l312K7742L6926n936J7440R142N873l1880J4115L3416
$$ 65762 50684 11906 8594 36336 73262 67326 84766 93908 99781 67901 82016 115432
18263A15432k3209q7600l9158L3280Q7335J5305p8285m5827N5028P3244J5351
$$ 115432 92223 4623 -34535 -1255 86080 101385 23100 -22727 32301 105545 120896
18252A20896j9151m5050Q014P6336j7274O466K4027n5715k1204R027K8897j4007
$$ 120896 101745 56695 64709 141045 123771 130237 154264 98549 77345 86372 115269 101262
18240A01262l7713j4607L2642K8493n1865m9316K810N0580J8219L5K6716J2303
$$ 101262 63549 48942 81584 110077 58212 8896 11706 62286 80505 80540 107256 119559
18228A19559M672J46l8444m6397L550J7911l3078l046K6966M1150K1609J6487
$$ 119559 124231 124377 85933 39536 43086 60997 27919 24873 51839 92989 114598 131085
18216A31085j71p1081k9159J425k9933P139Q7647O7366m5671p6730K3383K4835
$$ 131085 130914 59833 30674 32099 2166 9305 96952 164318 118647 41917 65300 90135
18204I0135j0433L778k4743P099K8910k8399L6256M0411m246j5154k1251l7056
$$ 90135 79702 83480 58737 65836 94746 66347 102603 143014 138768 123614 102363 65307
18192F5307k9264K1412P9601Q429l2226L2916R236j3067J2894j2191o9315K4257
$$ 65307 36043 57455 137056 145485 113259 146175 155411 142344 155238 143047 73732 97989
18180I7989M6593M5036N767p13k42j9915k2507j0922j7734l4125r103q829k1253
$$ 97989 144582 189618 195385 194672 194430 174515 152008 141086 123352 89227 80124 71295 50042
18167E0042L2326L9916k4044l3929R690K6475k057K3865M3876r261N373M2348
$$ 50042 82368 122284 98240 64311 74001 100476 98419 122284 166160 156899 162272 204620
18155B04620l0456l8239k0417N583L1908J5280K3989K7855M2381K1121j3957L9144
$$ 204620 174164 135925 115508 121091 152999 168279 192268 220123 262504 283625 269668 308812
18143C08812j2495o967M9732K9716L3726N9237J7967o441L1125N4085m172L7757
$$ 308812 296317 289350 339082 368798 402524 461761 479728 473287 504412 558497 554325 592082
18131E92082P7287O1004J00145J99042J74891J54504J73774J96438L20610M92377
$$ 592082 669369 730373 830518 1029560 1204451 1358955 1532729 1729167 2049777 2542154
18121B542154O70199Q13658J067719J503161J975775K458078L050987L932485
$$ 2542154 3212353 4026011 5093730 6596891 8572666 11030744 14081731 18014216
18113A8014216N773195R659229J7003768K7774382L3510646O092706k9140457
$$ 18014216 23787411 33446640 50450408 78224790 111735436 117828142 88687685
18106H8687685l6947232k2194940j0752133n701489l398421k161556j472299j118093
$$ 88687685 51740453 29545513 18793380 13091891 9693470 7531914 6059615 4941522
18098D941522p81376o62081m57969l28440l48283l24961k73896j76893j20800
$$ 4941522 4160146 3498065 3040096 2711656 2363373 2038412 1764516 1587623 1466823
18089A466823j79584j27771j34010j13967l2309n8774p0472n5980k2126n1132
$$ 1466823 1287239 1159468 1025458 911491 879182 820408 749936 693956 671830 620698
18079F20698o7148n3650n6687l7564l8666m336k6256j2836k2600o1813j1401K3426
$$ 620698 553550 499900 443213 405649 366983 362647 336391 323555 300955 239142 227741 251167
18067B51167O1251J9402L39n0820m3811m548o0063j7337K3501L157k0462k7395
$$ 251167 312418 331820 332159 281339 237528 232980 172917 155580 179081 182238 161776 134381
18055A34381L4106r467l0809J0591J4653p465k6462J5799P094j5125J2556n0953
$$ 134381 168487 159020 128211 138802 153455 145990 119528 135327 142421 127296 139852 88899
18043H8899n5248m759M949L6724L1652J6398k8963m115j9882l1386M309L8746
$$ 88899 33651 28892 33841 70565 102217 118615 89652 85537 65655 34269 38578 77324
18031G7324L2171L610K8581q0855j7038M8833J6192k7098k5778k1286R403J9785
$$ 77324 109495 113105 141686 60831 43793 92626 108818 81720 55942 34656 44059 63844
18019F3844l4604l3409m4024M2658M5753r949O407k2306j2863k240Q893K4507
$$ 63844 29240 -4169 -48193 -5535 40218 30269 36676 14370 1507 -733 8160 32667
18007C2667k6138J0358K6537J5799k9800j1628q158O49k2223K8268J9242j6168
$$ 32667 6529 16887 43424 59223 29423 17795 9637 10286 -11937 16331 35573 19405
17995A9405L9894Q171l6858j4466k4664m3548M558O079M5218L5333O129P7356
$$ 19405 59299 67470 30612 16146 -8518 -52066 -47508 -41429 3789 39122 45251 122607
17983A22607O2955l5860n3229l9609M271Q69L0191Q098l5800l2607K1337N4564
$$ 122607 185562 149702 96473 56864 61135 62004 92195 100293 64493 31886 53223 107787
17971A07787q590n4094o4365J6763Q4189j006n6034l6447P359N2280K318l4996
$$ 107787 99197 45103 -19262 -2499 81690 80684 24650 -11797 -4438 47842 50160 15164
17959A5164k820m1179J673R429J0472n703l0650j9287R829J7092J3105J6249K5041
$$ 15164 12344 -28835 -27162 -17733 -7261 -12964 -43614 -62901 -53072 -35980 -22875 -6626 18415
17946A8415l8252j1797M8988Q432k0897j51q605P292K3039J4785l4318k8256j8754
$$ 18415 -19837 -31634 17354 25786 4889 4738 -3867 3425 26464 41249 6931 -21325 -40079
17933d0079k1155j3301l0386O161J9014j5998P756J3290O2139K3720J028n4352
$$ -40079 -61234 -74535 -104921 -98760 -79746 -95744 -87988 -74698 -12559 11161 12189 -42163
17921d2163k7735k729O2811J9947J1255l9597m94P3090q535J1356L817N1863j4655
$$ -42163 -69898 -72627 -9816 10131 21386 -18211 -18705 54385 45850 57206 61023 112886 98231
17908I8231k8606j7066p985p292n6413o674J6922N4451l1048j7330L9388J8443
$$ 98231 69625 52559 44574 37282 -19131 -25805 -8883 45568 14520 -2810 36578 55021
17896E5021M8034k1835K4739J427k1626n6175l3692J0542K8075k1253l7192M9826
$$ 55021 103055 81220 105959 107386 85760 29585 -4107 6435 34510 13257 -23935 25891
17884B5891N635M5407l7032k5650O594K6263M9291k3497l6602J9213n565l0561
$$ 25891 31526 76933 39901 14251 20845 47108 96399 72902 36300 55513 49948 19387
17872A9387L9449K8156n4973j00071k8300N5849o874N581K5366l8471M1837M4089
$$ 19387 58836 86992 32019 -68052 -96352 -40503 -47377 -41796 -16430 -54901 -13064 31025
17860C1025K4313J2475k3533j1106J1457k4107l2401K9416m7715m8518N8803N5478
$$ 31025 55338 67813 44280 33174 44631 20524 -11877 17539 -30176 -78694 -19891 35587
17848C5587k9254k4235J3601k2470p749m590K8774O0084M2156n498p771j1217
$$ 35587 6333 -17902 -4301 -26771 -34520 -39110 -10336 49748 91904 86406 78635 67418
17836F7418p5231l0749J9749J6654K6847k1425L9762o34J3343M432r156O994r694
$$ 67418 -7813 -38562 -18813 -2159 24688 3263 43025 42391 55734 60166 51010 58004 48310
17823D8310k9582k7056k8347K6994Q378J580J152n444m4956j6128M8097N2984
$$ 48310 18728 -8328 -36675 -9681 -1303 277 1429 -4015 -48971 -65099 -17002 35982
17811C5982O2750N4719j1914j1839N8186L3310P3373O2793Q8893N5188L0069L8932
$$ 35982 98732 153451 141537 129698 187884 221194 294567 357360 446253 501441 531510 570442
17799E70442P538q4309j01715r7790n9668m1491n7757j115n3934J9067j9386m3002
$$ 570442 577980 493671 391956 294166 234498 193007 135250 134135 80201 99268 79882 36880
17787C6880O080l978l7491j5198j3185K330j4594K1929j6221k0332Q284K8147
$$ 36880 42960 38982 1491 -13707 -26892 -24562 -39156 -17227 -33448 -53780 -45496 -17349
17775a7349K8963M5814j8211o485l1136l005k4663k4612L4512P0916M7346K5138
$$ -17349 11614 57428 39217 32732 1596 -1409 -26072 -50684 -16172 54744 102090 127228
17763A27228o9574o2039l3797k0658l0477l6567N0785M2459K8408K9872K8572
$$ 127228 57654 -4385 -38182 -58840 -89317 -125884 -75099 -32640 -4232 25640 54212
17752E4212l6512o2841N424K7291J7646l4438n6857l6272K7997O4851O3855m8408
$$ 54212 17700 -45141 -39717 -12426 5220 -29218 -86075 -122347 -94350 -29499 34356 -14052
17740a4052o9227K5809M9041K8530N2189O171K2607l8775m6711j3150m2777l2055
$$ -14052 -83279 -57470 -8429 20101 72290 78461 101068 62293 15582 2432 -40345 -72400
17728g2400O327J8669K6238j4413k3853J6790j3913j7509M1647K8916n0380n4376
$$ -72400 -66073 -47404 -21166 -35579 -59432 -42642 -56555 -74064 -32417 -3501 -53881 -108257
17716a08257R215K085L6517K9105J6700j6881k1536M4419J1161k034k379q349
$$ -108257 -99042 -96957 -60440 -31335 -14635 -31516 -53052 -8633 2528 494 -1885 -10234
17704a0234J0448m363j8939j1360l9643l9814O7036K7347J4239J2809J8518j9470
$$ -10234 214 -4149 -23088 -34448 -74091 -113905 -46869 -19522 -5283 7526 26044 6574
17692F574k472Q151k3757p990K8032M9283J5476j4615m03K1217j8160l0579m5269
$$ 6574 4102 12253 -11504 -19494 8538 57821 73297 58682 58279 79496 61336 30757 -14512
17679a4512L2210M9672k0399m3683K9034M418l014j4974k1293r825O304j9090
$$ -14512 17698 67370 46971 3288 32322 36740 33726 18752 -2541 -12366 -6062 -25152
17667b5152j5876K5817O8604J3151m7539l2742K9961M2979L1241p216J9623k5660
$$ -25152 -41028 -15211 53393 66544 19005 -13737 16224 59203 90444 83228 102851 77191
17655G7191J0014j8755l5396M590N3952j6895l6208Q019N486P662l258m0847n8680
$$ 77191 87205 68450 33054 37644 91596 74701 38493 46512 51998 59660 56402 15555 -43125
17642d3125l6385N5283O3147J33k8728m4095N9K0270K9533J0723m6310l6597k5635
$$ -43125 -79510 -24227 38920 39053 10325 -33770 -33711 -13441 16092 26815 -19495 -56092 -81727
17629h1727m676R837M2833l3561j3061K662K5028K9058k2040l2882L452L2636
$$ -81727 -86403 -76566 -33733 -67294 -80355 -77693 -52665 -23607 -45647 -78529 -75077 -42441
17617d2441k6106J694L3265J2866M8832L2044l3500o2401k9282N4832J6943j0364
$$ -42441 -68547 -66853 -33588 -20722 28110 60154 26654 -35747 -65029 -10197 6746 -3618
17605c618K6759j1669N1951J2990L4249j7335K7410l2078j0184J0665l4800m2879
$$ -3618 23141 11472 63423 76413 110662 93327 120737 88659 78475 89140 54340 11461
17593A1461K9921j5471p7177P825J9691N200j6765k2983L1197k2852n4289K7642
$$ 11461 41382 25911 -51266 -43441 -23750 -18550 -35315 -58298 -27101 -49953 -104242 -76600
17581g6600P2369j8753k5290J4833l0354k7852K9338K1926Q681M3574J6493l2953
$$ -76600 -4231 -22984 -48274 -33441 -63795 -91647 -62309 -40383 -31702 11872 28365 -4588
17569d588M79R192L3285l295k7901J495K9456K743l2041j5798k2450J5235P0822
$$ -4588 -4109 5083 38368 35073 7172 8667 38123 40866 8825 -6973 -29423 -14188 56634
17556E6634J6186J0309l3748r859n4929m8810m3779L1577L6838q256k7063M7302
$$ 56634 72820 83129 49381 39522 -15407 -64217 -107996 -76419 -39581 -47837 -74900 -27598
17544b7598J3517K0401l1718j13364L6049N0155K9982L7963J1728m5446M4109
$$ -27598 -14081 6320 -25398 -138762 -102713 -52558 -22576 15387 27115 -18331 25778
17533B5778L7143m1893K7939k7168J5448l5268m6997K4481L0573K2021Q180k4718
$$ 25778 62921 21028 48967 21799 37247 1979 -45018 -20537 10036 32057 40237 15519
17521A5519l1714m7697K0421J7716K3928K4698K5800l0072k2877Q941q588K2160
$$ 15519 -16195 -63892 -43471 -25755 -1827 22871 48671 18599 -4278 4663 -3925 18235
17509A8235l2999Q413M8780j3911Q54k9852j3113j2591L3376l0468j5303k8522
$$ 18235 -14764 -6351 42429 28518 29372 -480 -13593 -26184 7192 -23276 -38579 -67101
17497f7101J4411k4754L7335R7079m2798m4461j3741l2957k1564L1430j8955J7892
$$ -67101 -52690 -77444 -40109 56970 14172 -30289 -44030 -76987 -98551 -67121 -86076 -68184
17485f8184N390M9867q401R040Q401K3645o634m0646j4073L9220J4597Q319p755
$$ -68184 -62794 -12927 -21328 -12288 -3887 19758 13124 -27522 -41595 -2375 12222 20541 12786
17472A2786J6474M4596l2183m5843P332l3825q075K1965K7853j4832q61j243O549
$$ 12786 29260 73856 41673 -4170 3162 -30663 -38738 -16773 11080 -3752 -4613 -5856 693
17459F93P328m3366Q825K4748p70k8738r883K593K7793M4157M811k9978O2588
$$ 693 8021 -35345 -26520 -1772 -2542 -31280 -41163 -38570 -10777 33380 38191 8213 70801
17446G0801P3530R0234J32281J98942P3161j30104j89588p9018l5720n7488o7703
$$ 70801 144331 234565 366846 565788 638949 508845 319257 240239 204519 147031 79328
17435G9328j9395M628o841l7486Q09J9935J9276j0801K6591j2143k0869M169k092
$$ 79328 59933 64561 57720 20234 21043 40978 60254 49453 76044 63901 43032 47201 45109
17422D5109k5034m345Q408L935N0181j0641K915R990k2641o8189M9493L5389m1589
$$ 45109 20075 15730 24138 28073 78254 67613 70528 80518 57877 -10312 39181 74570 32981
17409C2981j8633m1370r9K8221j4095o1428l5794P6262N5175K0780K7757J8954
$$ 32981 14348 -27022 -27121 1100 -12995 -74423 -110217 -33955 21220 42000 69757 88711
17397H8711M3129K8347k2342j0061m8729k776p271m1213k2873k8714L1297P788
$$ 88711 131840 160187 137845 127784 79055 76279 69008 27795 4922 -23792 7505 15293
17385A5293l4093j2424M5866M5384j0526k3874k3574K9451j0100l7114M329L8092
$$ 15293 -18800 -31224 14642 60026 49500 25626 2052 31503 21403 -15711 -11382 26710
17373B6710J4208j9094J1606L6569r485q2608r635K466R423j8074L6727j5467
$$ 26710 40918 21824 33430 69999 60514 -22094 -31729 -29263 -19840 -37914 -1187 -16654
17361a6654l0150J7370N4354k5035N038J0317j2198k537L5541L2414k8744j2809
$$ -16654 -46804 -29434 24920 -115 4923 15240 3042 505 36046 68460 39716 26907
17349B6907m0420N527R366l7334l5478N9252M0036o890n1693O518L2941j3582
$$ 26907 -13513 -7986 1380 -35954 -71432 -12180 27856 20966 -30727 -24209 8732 -4850
17337d850j5187k386l3276j1755j979J2396k0676L6645M8993j3277J1647j4774
$$ -4850 -20037 -22423 -55699 -67454 -69433 -57037 -77713 -41068 7925 -5352 6295 -8479
17325h479K5661K6611j4371j3380q348K0808j8472J5462j9735k8458j3197m545
$$ -8479 17182 43793 29422 16042 7694 28502 10030 25492 5757 -22701 -35898 -40443
17313d0443j1826l2421n0408K3731L8253l203O3023J2740K5686k0239j0317R159
$$ -40443 -52269 -84690 -135098 -111367 -73114 -76317 -13294 -554 25132 4893 -5424 3735
17301C735J9235l9772m627J4013J382p767O916L7228J0204J3357L8440j3358Q333
$$ 3735 22970 -16802 -21429 -7416 -6034 -13801 -6885 30343 40547 53904 92344 78986 87319
17288H7319K9660o1318m916Q343j6643j5054O081K861j8538j8790o802J8781K2319
$$ 87319 116979 55661 50745 59088 42445 27391 33472 36333 17795 -995 -7797 10984 33303
17275C3303J685l6902l3891L950L8869K3282M6143l6500n3365l2348m0781j9136
$$ 33303 34988 -1914 -35805 -31855 7014 30296 76439 39939 -13426 -45774 -86555 -105691
17263a05691l3363P4233N8190J3805m2391l2468N6420O1050O3053P327l8115k7841
$$ -105691 -139054 -64821 -6631 7174 -35217 -67685 -11265 49785 112838 120165 82050 54209
17251E4209k5503n2475l8774P2230J9902n8727m854L4027J0593l137j8024N5776
$$ 54209 28706 -23769 -62543 9687 29589 -29138 -33992 35 10628 7491 -10533 45243
17239D5243p341l3288n210J7144m3809m9268L2314K7324m2454j1152j7024O980
$$ 45243 37902 4614 -596 16548 -27261 -76529 -44215 -16891 -59345 -70497 -87521 -80541
17227h0541j6514J4555P0610k6081K6636M9049L3674K6989n6729m9654j7195J3206
$$ -80541 -97055 -82500 -11890 -37971 -11335 37714 71388 98377 41648 -8006 -25201 -11995
17215a1995q475k9020k2196j4173K3551N0831M4499l0122J364l3381L7901N7018
$$ -11995 -20470 -49490 -71686 -85859 -62308 -11477 33022 2900 4264 -29117 8784 65802
17203F5802n3311n6578k8235L9614L0140n581q896L6632j264n0936j07O7358K79
$$ 65802 12491 -44087 -72322 -32708 -2568 -8149 -17045 19587 18323 -32613 -32720 34638 34917
17190C4917l1953n8646L606l2737M285M5911M6548k2116j4318j1141J7914j8105
$$ 34917 2964 -55682 -52076 -84813 -80528 -34617 11931 -10185 -24503 -35644 -17730 -35835
17178c5835L2119L3989o994l1110n961k8533K513K2572M1710L2024M512Q598J4773
$$ -35835 -3716 30273 23279 -7831 -13792 -42325 -39812 -17240 24470 56494 61006 69604 84377
17165H4377j6466m1213q19K6207m755l9642m6664n4700J3549J8588O852J4862
$$ 84377 67911 26698 25879 52086 47331 7689 -38975 -93675 -80126 -61538 -54686 -39824
17153c9824q987o239m5353L3690J0431k867J1279K084j7929j2425K8827K6838
$$ -39824 -48811 -55050 -100403 -66713 -56282 -59149 -47870 -45786 -63715 -76140 -47313 -20475
17141b0475L9238N775j0272n6991r359K0825J6228N738n6843J8244J666J2935
$$ -20475 18763 24538 14266 -42725 -52084 -31259 -15031 -9293 -66136 -47892 -46226 -33291
17129c3291L7833J542n1824n3332N1736J5503R308M0577N1748o2211q1968J1961
$$ -33291 4542 6084 -45740 -99072 -47336 -31833 -22525 18052 69800 7589 -74379 -62418
17117f2418M657j5731Q913Q3469r790m6223J9719N8450O848k3812N1724k8901
$$ -62418 -57761 -73492 -64579 18890 9100 -37123 -17404 41046 47894 24082 75806 46905
17105D6905r3451m6341J0896N7113N7427J7820n0156k1428o6K4235k7001l557
$$ 46905 -46546 -92887 -81991 -24878 32549 50369 213 -21215 -21281 2954 -24047 -27604
17093b7604J7278l307J4471L71J5484Nq41J7728m497R966L0549J3730k7418k4102
$$ -27604 -10326 -13633 838 1209 16693 16698 15857 33585 29088 39054 69603 83333 55915 31813
17079C1813p287n051N1883L0737m3037l5838l573O631R090j8492l5947L984L0110
$$ 31813 24526 19475 71358 102095 59058 23220 19647 26278 35368 16876 -19071 -15087 15023
17066A5023K346q39j1539K057J9888N657j078l5988l2062m83m113J8300N0798
$$ 15023 17369 16530 4991 7048 26936 32593 31515 -4473 -36535 -37018 -41131 -22831 27967
17053B7967L713p3050o1188l4119L5215K8320R7930O666k3156m5572j7149j3822
$$ 27967 31680 -41370 -102558 -136677 -101462 -73142 24788 31454 8298 -37274 -54423 -68245
17041f8245R358P017o714n2975J1921J2283M9149L412M233L9515P595J7054p774
$$ -68245 -58887 -51870 -58584 -111559 -99638 -87355 -38206 -34794 -30561 8954 16549 33603 25829
17028B5829m1220O425j446K382J3169J5213l0337P408M6226k1440m5203J7756
$$ 25829 -15391 -8966 -10412 -8030 5139 20352 -9985 -2577 43649 22209 -22994 -5238
17016e238J9876l6902J6604m4019j461K0198M4877o701j2892j7196l196N0775
$$ -5238 14638 -22264 -5660 -49679 -51140 -30942 13935 7234 -5658 -22854 -26050 24725
17004B4725j2565l3536k4393O381J9798k7261O989J2314K4780N1816M4419l1025
$$ 24725 12160 -21376 -45769 -39388 -19590 -46851 -39862 -27548 -2768 49048 93467 62442
16992F2442O161m7842p2692K4909R238l8416L944P7111J5329k5966K6680J0322
$$ 62442 68603 20761 -51931 -27022 -17784 -56200 -52256 24855 40184 14218 40898 51220
16980E1220m5424r5078K1067L4741j3299K9430n0065m8438j7382J0282R725K1264
$$ 51220 5796 -89282 -68215 -33474 -46773 -17343 -67408 -115846 -133228 -122946 -113221 -91957
16968i1957l774J7936j1890j4424J1505K4010K9368l3841L9919L4797k2870J8604
$$ -91957 -95731 -77795 -89685 -104109 -92604 -68594 -39226 -73067 -33148 1649 -21221 -2617
16956b617J0739P407j4589k1285j166L1562N83k0327K816k1147k0934l3101J7634
$$ -2617 8122 15529 940 -20345 -21511 10051 10634 -9693 -6877 -28024 -48958 -82059 -64425
16943f4425J8026n6580M321O7041K2109O0440l515n8582r474m0780k4364M9034
$$ -64425 -46399 -102979 -98658 -31617 -9508 50932 47417 -11165 -20639 -61419 -85783 -36749
16931c6749j3229Q868J9633l59j4085K2946r558j3572k6567o36J5329K3239K4831
$$ -36749 -49978 -41110 -21477 -21836 -35921 -12975 -22533 -36105 -62672 -63308 -47979 -24740 91
16918I1P859m3261k5498j0091j3756J6487L556n198K7204P3711K8529k0573m8424
$$ 91 7950 -35311 -60809 -70900 -84656 -68169 -64613 -69811 -42607 31104 59633 39060 -9364
16905i364k7008n672K7959L242j1689j4648M3548L2335M2706k726k5080k2015
$$ -9364 -36372 -42044 -14085 -10843 -22532 -37180 6368 38703 81409 78683 53603 31588
16893C1588l4793l063O5040J3264j2284K3142J8073k3061m2899m8689l6325K898
$$ 31588 -3205 -6268 58772 72036 59752 82894 100967 77906 35007 -13682 -50007 -47109
16881d7109o125j6946k7554j1668Q3058N8977k548J1190Q019m7152o6949j7758
$$ -47109 -53234 -70180 -97734 -109402 -26344 32633 30085 41275 49294 2142 -64807 -82565
16869h2565P514J0601K2652L5543k2873J546K8736l3593L8882L2301n0911j3522
$$ -82565 -75051 -64450 -41798 -6255 -29128 -27582 1154 -32439 6443 38744 -12167 -25689
16857b5689K5430J2949N347k6763K4546q672o1688L7756J6694j0690M773LK1183
$$ -25689 -259 12690 18037 -8726 15820 7148 -54540 -16784 -90 -10780 -6007 -6004 15179
16844A5179l0131j0124Q719p603J8067P17q234k0572K1126L3681M5852j8696l7844
$$ 15179 -14952 -25076 -16357 -23960 -5893 -5176 -13410 -33982 -12856 20825 66677 47981 10137
16831A0137J7098j4330j4663L2180R601k9915L502P1845K7307l9730l5485l0691
$$ 10137 27235 12905 -1758 30422 40023 10108 13610 85455 112762 73032 37547 6856
16819F856m2840L540O3009k3998j2036J1304M0042n2451k4681j4826k3559L3131
$$ 6856 -35984 -32444 30565 6567 -5469 5835 45877 -6574 -31255 -46081 -69640 -36509
16807c6509M1724M8018L7275m6766o8102n2384J9365J6348j0655L8125K2327l5169
$$ -36509 5215 53233 90508 43742 -24360 -76744 -57379 -41031 -51686 -13561 8766 -26403
16795b6403Q065J4371N170q755m6897k1586J3379K2345J3306K2015J4126L3147
$$ -26403 -18338 -3967 1203 -7552 -54449 -76035 -62656 -40311 -27005 -4990 9136 42283
16783D2283J1895m930Q842l2760k1916K0535K4797j8858l8622k0559L8190K6189
$$ 42283 54178 49248 58090 25330 3414 23949 48746 29888 -8734 -29293 8897 35086
16771C5086K482J487j1681p1668k1382j5498J8088J5196J8435K5929J7572K1190
$$ 35086 37568 39055 27374 -44294 -65676 -81174 -63086 -47890 -29455 -3526 14046 35236
16759C5236n375m1298m7846j7375j5317j3994L1490Q3009J8970O106p165l9177
$$ 35236 29861 -11437 -59283 -76658 -91975 -105969 -74479 8530 27500 33606 26441 -12736
16747a2736n5038j1276L4351j9553j6768L8391K3767M1145M7475j358j2920M5253
$$ -12736 -67774 -79050 -44699 -64252 -81020 -42629 -18862 22283 69758 68400 55480 100733
16735A00733k5585r28m4755R407J7403k0654j4283l7381L3869o360k0754J1758
$$ 100733 75148 74220 29465 38872 56275 35621 21338 -16043 17826 11466 -9288 2470
16723B470n951o163m5827j8360K338K4915N3338j5946m883J6039k4511k3257j6943
$$ 2470 -3481 -9644 -55471 -73831 -71493 -46578 6760 -9186 -14069 1970 -22541 -45798 -62741
16710f2741M5350P3115J4991J4330r805q1583k7872J2338O1025l466K7276K1289
$$ -62741 -17391 55724 70715 85045 75240 -6343 -34215 -21877 39148 35682 62958 84247
16698H4247p8959m9399l2160J0526j835J8056L7806k3159M55N323K0911q483K3783
$$ 84247 5288 -44111 -76271 -65745 -67580 -49524 -11718 -34877 -34422 -29099 -8188 -16671 7112
16685G112M283l8716K5454J6920k1375K7633j4291k691r030l4434L3653L4143
$$ 7112 11395 -27321 -1867 15053 -6322 21311 7020 4329 -4701 -39135 -5482 28661
16673B8661k4895J104k5837m9004n64J0395Q031M0255j3961n0490M538M0314j1879
$$ 28661 3766 4870 -20967 -69971 -70535 -60140 -52109 -11854 -25815 -76305 -71767 -31453 -43332
16660d3332m1720N735k62J1202j756k845M848K1447L5053L2918j2023K686o382
$$ -43332 -85052 -79317 -79579 -68377 -70133 -72978 -68130 -46683 -11630 21288 9265 11951 5569
16647E569j6469k256m3886p941L5866P35J2155O700n508r795J6857L907n2684
$$ 5569 -10900 -13156 -57042 -64983 -29117 -28382 -16227 -9527 -15035 -24830 -7973 -4066 -56750
16634e6750J9200Q8113M6931k0710l2906j5227l4659L859K6254K5983p4836j2420
$$ -56750 -37550 50563 97494 76784 43878 28651 -6008 -2149 24105 50088 -24748 -37168
16622c7168L7569j4510Q766K2965J7284p401j5880p0571k8983N6331K06j7783
$$ -37168 401 -14109 -5343 17622 34906 27505 11625 -58946 -87929 -31598 -31392 -49175
16610d9175K9632N391p609q009j4077K715L9772K9499k6373K7348M0195l2434
$$ -49175 -19543 -14152 -21761 -29770 -43847 -41132 -1360 28139 1766 29114 69309 36875
16598C6875j7147j3473n0008L6008J8283j837K6071o965l6023j0615l4466l3213
$$ 36875 19728 6255 -43753 -7745 10538 8701 34772 27807 -8216 -18831 -53297 -86510
16586h6510J3433J7729L9357m0269k298P115j8006k9873J9517O0695L5826j1220
$$ -86510 -73077 -55348 -15991 -56260 -58558 -51443 -69449 -99322 -79805 -19110 16716 5496
16574E496l2039M847N0606k1011k1092J8679l8335m8285N6149K6270J604m1174
$$ 5496 -26543 -21696 28910 7899 -13193 5486 -32849 -81134 -24985 1285 2889 -38285
16562c8285K939j3331O266M1064K5435K0600J1803k6354R329K6673k7999l4908
$$ -38285 -35346 -48677 -42411 -1347 24088 44688 56491 30137 39466 66139 38140 3232
16550C232l243J2086J0245M6200K3567n8293j2633q71n975o356J1039l9690k8214
$$ 3232 -11 12075 22320 68520 92087 33794 21161 20290 14315 7959 18998 -20692 -48906
16537d8906R327Q3011J7533J2439K7752k0369q721m970n7593J80p896k0221K2477
$$ -48906 -39579 43432 60965 73404 101156 80787 72066 67096 9503 9683 1787 -18434 4043
16524D043Q311L3017J3570l549j8842K311L186K9228N328m9910k4862J3599M2552
$$ 4043 12354 45371 58941 55392 36550 38861 42047 71275 76603 26693 1831 15430 57982
16511E7982j812K3802j2306o77l1952k8854J0036o737j0160l5007M417m0042n358
$$ 57982 56170 79972 67666 66989 35037 6183 16219 9482 -678 -35685 -31268 -71310 -76668
16498g6668K6649O0445K8450j149k7241k4060k7869N4186L0721K5738K5256m5718
$$ -76668 -50019 10426 38876 37727 10486 -13574 -41443 12743 43464 69202 94458 48740
16486D8740l1574K6669j112l1310k3238k6410l5517l9874L1654L8048N951n43
$$ 48740 17166 43835 42723 11413 -11825 -38235 -73752 -113626 -81972 -43924 -37973 -38516
16474c8516j7268K6952J0386k821l0230q947M397J8062n352J0318j4690K9711
$$ -38516 -55784 -28832 -18446 -21267 -51497 -60444 -56047 -37985 -43337 -33019 -47709 -17998
16462a7998K8495K0685j5309K1094k5463k108j1743M3908L3391m1703k8396m6331
$$ -17998 10497 31182 15873 36967 11504 9396 -2347 41561 74952 33249 4853 -41478
16450d1478j7725N0218L8373k969l9936L164N3229N9648k3078J0072P378K0809
$$ -41478 -59203 -8985 29388 26419 -13517 -10353 42876 102524 79446 89518 96896 117705
16438A17705l0418n5344r250k050L0648j0135J108L0457O074K2876m1643l0004
$$ 117705 87287 31943 22693 20643 51291 41156 42264 72721 78795 101671 60028 30024
16426C0024k9078l5668K1239o402k0817J157K3402K0450L6810Q020k8704m2071
$$ 30024 946 -34722 -13483 -19885 -40702 -39545 -16143 4307 41117 49137 20433 -21638
16414b1638j907J6778M3735k551J2254o3158n6471R814J1729M152L2260o814m6746
$$ -21638 -23545 -6767 36968 34417 46671 -16487 -72958 -63144 -51415 -47263 -15003 -21817 -68563
16401f8563j5407M7707N7786O2084j9583L7269j5783o2627q581Q042K932j2147
$$ -68563 -83970 -36263 21523 83607 64024 101293 85510 22883 14302 22344 25276 13129
16389A3129K2311n9096k1170O1104J8594P63n9146o3747o8919K270Q3335K5341
$$ 13129 35440 -23656 -44826 16278 34872 35635 -23511 -87258 -156177 -153907 -70572 -45231
16377d5231K5490k6713j8285J1097M895L0967N5121L309K8943N7380J6716m0846
$$ -45231 -19741 -46454 -64739 -53642 -48747 -17780 37341 40650 69593 126973 143689 102843
16365A02843m1899l0906Q06M0822j4013j7966n1547K360J5375j4304L707J3387
$$ 102843 60944 30038 30844 71666 57653 39687 -11860 -9500 5875 -8429 -4722 8665
16353H665L1461K9058p060j9059K5316K5500J2418j07847p7506J2126j1605K3251
$$ 8665 40126 69184 62124 43065 68381 93881 106299 -1548 -79054 -66928 -78533 -55282
16341e5282P9645J5696K4200K4950k4113m6301k3164j6899J2572p281l8061k456
$$ -55282 24363 40059 64259 89209 65096 18795 -4369 -21268 -8696 -15977 -54038 -56494
16329e6494L296N4180K9958j8713L185Q216J2828n6190k483K475j281l754L9203
$$ -56494 -53198 982 30940 12227 15412 23628 36456 -19734 -22217 -19742 -21023 -24777 14426
16316A4426j652O685O145n574l4982J1696K3262o171J89K1629l0487j5025o715
$$ 14426 12774 19459 25604 20030 -14952 -3256 20006 13835 14024 35653 5166 -9859 -16574
16303a6574N3051M0870J751m3385l435o814k2761l9146m305J7644J39M803j6868
$$ -16574 36477 77347 79098 35713 32278 25464 2703 -36443 -40748 -23104 -22965 -18162 -35030
16290c5030n640J9475R061N724N1161Q095l5973k2349Q510J858j7840J4786L1432
$$ -35030 -40670 -21195 -12134 -6410 44751 52846 16873 -5476 3034 4892 -12948 1838 33270
16277C3270o010N042k6850p297J9023M752q937J1699r046K6909j5196K9048m69
$$ 33270 27260 32302 5452 -1845 17178 21930 12993 24692 15646 42555 27359 56407 55938
16264E5938p439j3233L6761J5756k5814l7458k171j4819R322L0291J3505L3179
$$ 55938 48499 35266 72027 87783 61969 24511 22340 7521 16843 47134 60639 93818
16252I3818n2891l1765l6760k6238K6807L1901k9496m8664J9980L5311j2520r241
$$ 93818 40927 9162 -27598 -53836 -27029 4872 -24624 -73288 -53308 -17997 -30517 -39758
16240c9758K5703L8856O590N177K0182o3395m7654N018K7464m3359l8880o566
$$ -39758 -14055 24801 31391 36568 56750 -6645 -54299 -49281 -21817 -65176 -104056 -110622
16228a10622N0686O1074j9126j7682L2279l1784r731L6245o981k014k0755k1982
$$ -110622 -59936 1138 -17988 -35670 -3391 -35175 -44906 -8661 -15642 -17656 -38411 -60393
16216f0393K8068P059k2835k3300L6679r640j858O0389M7045k8818p0148Q163
$$ -60393 -32325 -25266 -48101 -71401 -34722 -44362 -46220 14169 61214 32396 -37752 -29589
16204b9589N0115m2628k5181K0857J5970K9358m860J5648O6885O350j9681L963
$$ -29589 20526 -22102 -47283 -26426 -10456 18902 14042 29690 96575 102925 83244 87207
16192H7207k3092m6875l8360K942J7396J7252r769j6039j1211P456K1699J2687
$$ 87207 64115 17240 -21120 -18178 -782 16470 6701 -9338 -20549 -13093 8606 21293
16180B1293k6459J4911j4405l359K2819M2057J0620J8878P753m0229l0498j365
$$ 21293 -5166 9745 -4660 -8019 14800 56857 67477 86355 94108 53879 23381 22016
16168B2016j2523J3123k052l568j3268j0898m8080m6894K1669K7306K8303O889
$$ 22016 9493 22616 20564 16996 3728 -7170 -55250 -102144 -80475 -53169 -24866 -17977
16156a7977J1265K0365k3306L6922j0360m1229J2229J145O798R876O989K0247
$$ -17977 -6712 13653 -9653 27269 16909 -24320 -12091 -10946 -4148 5728 12717 32964
16144C2964k2889l0326O8875P713q246J7406m0870j0379O786J0289K0095l1398
$$ 32964 10075 -20251 48624 56337 48091 65497 24627 14248 21034 31323 51418 20020
16132B0020k3274J4982O403j1888m4622l2917j5449n001q843M8951O1906j3055
$$ 20020 -3254 11728 18131 6243 -38379 -71296 -86745 -91746 -100589 -51638 10268 -2787
16120b787k9412k8605O1512N6929l1745l0129J3027Q393K687q0622l7931l9772
$$ -2787 -32199 -60804 708 57637 25892 -4237 8790 17183 19870 -60752 -98683 -138455
16108a38455J2090K5975N783N6955J8676p575m6817k9452k0702K9310j3615K8980
$$ -138455 -126365 -100390 -94607 -37652 -18976 -26551 -73368 -102820 -123522 -94212 -107827 -78847
16096g8847l3964j6150N4282J5887J1309J1354J3688J4786k0466J5887j1925k9211
$$ -78847 -112811 -128961 -74679 -58792 -47483 -36129 -22441 -7655 -28121 -12234 -24159 -53370
16084e3370N509J7240l2036j1626R598K6029P413o1030k0265K893N1731Q9l2728
$$ -53370 -47861 -30621 -62657 -74283 -64685 -38656 -31243 -92273 -112538 -109645 -57914 -57825 -90553
16071i0553L441L5634J4958L1738M1509P824o9247N960J3470j6175L1026L9710
$$ -90553 -87112 -51478 -36520 -4782 36727 44551 -24696 -18736 -5266 -21441 9585 49295
16059D9295L9194J966n7785l2214j5090K3891n942n3889j7152K28l4596Q241R375
$$ 49295 88489 90455 32670 456 -14634 9257 3315 -50574 -67726 -67498 -102094 -93853 -84478
16046h4478m120J0033J0994K923L1764N4332k809l7722j8749J718P6523j4827
$$ -84478 -88598 -78565 -67571 -64648 -32884 21448 18639 -19083 -37832 -36114 40409 25582
16034B5582n0507k2670L1101m990k3282l2870J0231L5350m932J5206J6463q112
$$ 25582 -24925 -47595 -16494 -21484 -44766 -77636 -67405 -32055 -36987 -21781 -5318 -13430
16022a3430o892k387r127K3269K6876M3024J1146n4964o4726R794M0713J8998
$$ -13430 -20322 -22709 -31836 -8567 18309 61333 72479 17515 -47211 -37417 3296 22294
16010B2294j4900j6081M5825P773o911l9192l5984k3141o447M5584P8277K3988
$$ 22294 7394 -8687 37138 44911 38000 -1192 -37176 -60317 -66764 -21180 57097 81085
15998H1085l0788m7015m6596Q064K4965J2996N5m38n4194M022M1695K0472L4431
$$ 81085 50297 3282 -43314 -35250 -10285 2711 2766 2328 -51866 -47844 -6149 14323 48754
15985D8754j0136k8145j8001K5772L1026k2518l9789K2620K4563J6013o0096o3569
$$ 48754 38618 10473 -7528 18244 49270 26752 -13037 9583 34146 50159 -9937 -73506
15973g3506K6745J8822J6056j6169J5021O4242L4976o849j0653n2087m1719M8122
$$ -73506 -46761 -27939 -11883 -28052 -13031 51211 86187 79338 68685 16598 -25121 23001
15961B3001J6508K8425K759o09j2738m6690k7314j373j84K3493n620k5954n5961
$$ 23001 39509 67934 70693 70084 57346 10656 -16658 -18031 -18215 5278 -342 -26296 -82257
15948h2257K3864J0314J3061O3762l8752r5335M6484L1906J3491K3042M933j5241
$$ -82257 -58393 -48079 -35018 28744 -10008 -105343 -58859 -26953 -13462 9580 14513 -728
15936g28l9778K8210L0768o892l5119P068L4328o137n9632O396P4481M3918K1423
$$ -728 -40506 -12296 18472 11580 -23539 -16471 17857 11720 -47912 -41516 32965 76883 98306
15923I8306n2345l9049q0370o6329J2257Q4008K1524l3814j6274P532L0750M2283
$$ 98306 45961 6912 -73458 -139787 -127530 -43522 -21998 -55812 -72086 -64554 -33804 8479
15911H479L7976K5467M7639M185o8704n3311j7827O247p216L8452N6375j4116
$$ 8479 46455 71922 119561 123746 55042 1731 -16096 -9849 -17065 21387 77762 63646
15899F3646k350k4113r911L474k588j4697P544n1645j1885J3671P1181J6537j7905
$$ 63646 61296 37183 27272 30746 28158 13461 21005 -30640 -42525 -28854 42327 58864 40959
15886D0959o7929k9324o339K9382N2420J4762n074M344k047l0170n303l220k4142
$$ 40959 -26970 -56294 -62633 -33251 19169 33931 28857 33201 31154 984 -4319 -7539 -31681
15873c1681k382m8065J3166K2893K8282M8695N2917l3703j0979p533k4602j6074
$$ -31681 -34063 -82128 -68962 -46069 -17787 30908 83825 50122 39143 31610 7008 -9066
15861i066O7716M8053k098o0343j1849K2353q4010k7121L7452L471j1220k692
$$ -9066 58650 106703 104605 44262 32413 54766 -29244 -56365 -18913 -15442 -26662 -29354
15849b9354L5640k6854l9641J6850K9293J4639j4469J3045N8941L1415R150l3278
$$ -29354 6286 -20568 -60209 -43359 -14066 573 -13896 -851 58090 89505 98655 65377
15837F5377k9778l84m5521j7159j8529k1548K3650M4465n295l7386K3232N3419
$$ 65377 35599 35215 -10306 -27465 -45994 -67542 -43892 573 -4722 -42108 -18876 34543
15825C4543m492o1943l2884L3801K4514k4171k8637J7154J6712Q530j7755J0652
$$ 34543 30051 -31892 -64776 -30975 -6461 -30632 -59269 -42115 -25403 -16873 -34628 -23976
15813b3976J3650j2939j0863K1241P256K0703j99o8366m7901j312K9028J4439
$$ -23976 -10326 -23265 -34128 -12887 -5631 15072 14873 -53493 -101394 -102706 -73678 -59239
15801e9239L2194o4280l5289K0301N9148R579J5146n254L9729j1278m217k8051
$$ -59239 -27045 -91325 -126614 -106313 -47165 -37586 -22440 -27694 12035 757 -3460 -31511
15789c1511j0017L966J5759K5725j0592j7083K8694N3387j6124k4208j4882j8899
$$ -31511 -41528 -37562 -21803 3922 -6670 -23753 4941 58328 42204 17996 3114 -15785
15777a5785J2631L0106l8317J2663J541L4339R273k7889n7975J6472m698k112
$$ -15785 -3154 26952 -11365 1298 2839 37178 46451 18562 -39413 -22941 -27639 -29751
15765b9751L546K2793R328k0919J1200L6733J448K5305l5941j8348N0772k3533
$$ -29751 -26205 -3412 5916 -15003 -3803 32930 34378 59683 23742 5394 56166 32633
15753C2633j3058j5507J0538L2771L4360j3889M2707K7282n553p8767r011P868
$$ 32633 19575 4068 14606 47377 81737 67848 110555 137837 132284 53517 44506 52374
15741E2374j9876j5888K6731k2013j2991K2509J7889o1792m2935Q88M1026N3899
$$ 52374 32498 16610 43341 21328 8337 30846 48735 -13057 -55992 -55104 -14078 39821
15729C9821N596l946m1268O9977K9209j9068r936k8715m792m0261L2950J653n6342
$$ 39821 45417 41471 203 70180 99389 80321 70385 41670 36878 -3383 29567 31220 -25122
15716b5122k7585J8366J2813K0825j94k6438j7369j9840P358K5553k7713K9111
$$ -25122 -52707 -34341 -21528 -703 -897 -27335 -44704 -64544 -57186 -31633 -59346 -30235
15704c0235j12L5150q925l1883n2295P506N9871N4904J1550j3675o562j8354j3325
$$ -30235 -30347 4803 -4122 -36005 -88300 -80794 -20923 33981 45531 31856 25294 6940 -6385
15691f385K0730L775k2854M873K4976p005q235k0449n1541J2572J5642k0819o2244
$$ -6385 14345 18120 -4734 139 25115 18110 9875 -10574 -62115 -49543 -33901 -54720 -116964
15678a16964J3617K4982J2291M2072k845k4691l7993Q8993P3857r068o5331k3371
$$ -116964 -103347 -78365 -66074 -24002 -26847 -51538 -89531 -538 73319 64251 -1080 -24451
15666b4451J3561J5456M32l5174l0269J0749K3907j7457L9586L1748L5532k3649
$$ -24451 -10890 4566 4998 -30176 -60445 -49696 -25789 -43246 -3660 28088 63620 39971
15654C9971n6820j9243r97j4315j3596Q2595L9381K0423j2654k7319l8987j5555
$$ 39971 -16849 -36092 -37089 -51404 -65000 17595 56976 77399 64745 37426 -1561 -17116
15642a7116k6080k681J381m75l1662J1329N6379j3962n4816M60K7109R954j5698
$$ -17116 -43196 -45877 -44496 -44971 -76633 -65304 -8925 -22887 -77703 -77243 -50134 -40180 -55878
15629e5878n117L8723K898M9204J2957j2295m6459l1452L8734r734o3023L1132
$$ -55878 -60995 -22272 -19374 29830 42787 30492 -15967 -47419 -8685 -18419 -81442 -50310
15617e0310k956k7489M673L1348L166j4489K7802L3779m1134P462J3727J0150
$$ -50310 -53266 -80755 -76082 -44734 -41568 -56057 -28255 5524 -35610 -28148 -14421 -4271
15605d271J3878P280j3497m9246L2043Q5370N5743L2089m0666n8975M5K6807l6703
$$ -4271 9607 16887 3390 -45856 -13813 71557 127300 159389 118723 59748 59793 86600 49897
15592D9897l2062K0564K4627k6142L0827J3128l3411l2915k3583j814J4106o2751
$$ 49897 17835 38399 63026 36884 67711 80839 47428 14513 -9070 -10884 3222 -59529
15580e9529j0968j9417K076N6898K3852j5602J2109k3477n3046j3447N1108M5003
$$ -59529 -70497 -89914 -87838 -30940 -7088 -22690 -10581 -34058 -87104 -100551 -49443 -4440
15568d440l11l1781m7072k4457L9368J7771R306J5336K6459M7826k1886K2010
$$ -4440 -4751 -36532 -83604 -108061 -68693 -50922 -41616 -26280 179 48005 26119 48129
15556D8129l8423l3140K1005M2151J6702N560J0357m9760k6417M021m2191J8090
$$ 48129 9706 -23434 -2429 39722 56424 61984 72341 22581 -3836 185 -42006 -23916
15544b3916O902K1214l170K911j3214K7276Q945k5660k9445j9114R921L5560J267
$$ -23916 -17014 4200 1030 3941 -9273 18003 26948 1288 -28157 -47271 -37350 -1790 -523
15531e23N0607k283n2943k3329K4896J9738j4985J6166l231n1564J2118M9952
$$ -523 50084 47801 -5142 -28471 -3575 16163 1178 17344 14113 -37451 -25333 24619
15519B4619o286k528J7725j6171j0366j6330j2587m8671J7477J5396M112L3283
$$ 24619 18333 15805 33530 17359 6993 -9337 -21924 -70595 -53118 -37722 -33610 -327
15507c27J4764K2066R623j9393k0138k4489m4476m5226j1626m696N0447M533N5526
$$ -327 14437 36503 46126 26733 6595 -17894 -62370 -107596 -119222 -123918 -73471 -68938 -13412
15494a3412L7590q013j8552n8288M6020J0880j4932n2808k8400M358L8026n0048
$$ -13412 24178 16165 -2387 -60675 -14655 -3775 -18707 -71515 -99915 -95557 -57531 -107579
15482a07579j2177L8490M4959J2562J3611K189K9670K9904j5702j8743j9579O066
$$ -107579 -119756 -81266 -36307 -23745 -10134 -7945 21725 51629 35927 17184 -2395 3671
15470C671M085J0639J1246P2842J9255k5451l5229J4001M1532n1650n8360m9670
$$ 3671 7756 18395 29641 102483 121738 96287 61058 75059 116591 64941 6581 -43089
15458d3089R49M070J5983j3255J1429j1316K0610N3249l5957j5386L0538n7781
$$ -43089 -42140 -38070 -22087 -35342 -23913 -35229 -14619 38630 2673 -12713 17825 -39956
15446c9956j6635j1612P910J6224n0918J6972P1667M3710k6021K213n110N3625
$$ -39956 -56591 -68203 -60293 -44069 -94987 -78015 -6348 37362 11341 13554 8444 62069
15434F2069j7474r359r478J5045j4802R683j369k9729m7190J1924l6043J0431
$$ 62069 44595 35236 25758 40803 26001 35684 34315 4586 -42604 -30680 -66723 -56292
15422e6292K1119k7335L0157N0677L3548m4281L646L2332k7424k4721m4563j3578
$$ -56292 -35173 -62508 -32351 18326 51874 7593 11239 43571 16147 -8574 -53137 -66715
15410f6715Q30j1522K3432J4116m0335m807M1254J4619N8456M7528r287J1252
$$ -66715 -65885 -77407 -53975 -39859 -80194 -85001 -43747 -29128 29328 76856 67569 78821
15398G8821K613p066k3371m4542k3814P6469j9483n8141l9896n2433K776Q0273
$$ 78821 81434 74368 50997 6455 -17359 59110 39627 -18514 -58410 -110843 -108067 -27794
15386b7794P5457l7661m4012J2683J6529O3225j9624N962j7253o5627n359K978
$$ -27794 47663 10002 -34010 -21327 -4798 58427 38803 44765 27512 -38115 -43474 -40496
15374d0496j3711L1888K8925K5544Q032O740p1219k9266L0836L8064L9967l5088
$$ -40496 -54207 -22319 6606 32150 40182 46922 -24297 -53563 -22727 15337 55304 20216
15362B0216q4129K2203N0141J7980r057K2531l5314J02l5195k5852O9685J5830
$$ 20216 -63913 -41710 8431 26411 17354 39885 4571 4673 -30522 -56374 13311 29141
15350B9141P1478L2354Q297J6211k9878n8498m8943p228K9296K3982K665m8409
$$ 29141 100619 132973 141270 157481 127603 69105 20162 12934 42230 66212 68877 20468
15338B0468k4755k6090j9118j8979r05O9705L4228n1693m9986J6900L8914L1934
$$ 20468 -4287 -30377 -49495 -68474 -69379 326 34554 -17139 -67125 -50225 -11311 20623
15326B0623j9264r88K681J4984N6545N6442k0997m0742J4811o1618J3163J2734
$$ 20623 1359 371 3052 18036 74581 131023 110026 69284 84095 22477 35640 48374
15314D8374J1202L55j5785p30m9225n598K4207n140l1542O706M1244K8028j0854
$$ 48374 59576 59931 44146 43416 -5809 -11407 12800 7660 -23882 -17176 24068 52096 41242
15301D1242j5439j4804j7023k1371j8976o890L9809M4411M1551k9473n3427k0574
$$ 41242 25803 10999 -6024 -27395 -46371 -53261 -13452 30959 72510 43037 -10390 -30964
15289c0964K4683L652J8120K9894J4996j5966m8269m4544J3723O3551K1085R539
$$ -30964 -6281 -2629 15491 45385 60381 44415 -3854 -48398 -34675 28876 49961 59500
15277E9500L14J7480K4090j5437n8949q568L445k8845N0851L242J4490k3412r0541
$$ 59500 59814 77294 101384 85947 26998 18430 21875 -6970 43881 47123 61613 38201 -52340
15264e2340K9732M0354R468p3781l49P891k5676k1148Q5421J7554j2075l7535
$$ -52340 -22608 17746 27214 -46567 -46916 -39025 -64701 -85849 -428 17126 5051 -32484
15252c2484k904k643N0925N8055m9591l5111n6459N2567O2642K9418m8643m7509
$$ -32484 -35388 -38031 12894 70949 21358 -13753 -70212 -17645 44997 74415 25772 -21737
15240b1737p051K5099N3135J1816k6202p84l8959k3802m041k5803M5153L6319
$$ -21737 -28788 -3689 49446 61262 35060 34276 -4683 -28485 -32526 -58329 -13176 23143
15228B3143k7960k1692J8955l2244j0836M7275M0491l2968L339L019J2082k4180
$$ 23143 -4817 -26509 -7554 -39798 -50634 -3359 37132 4164 7503 10522 22604 -1576
15216a576m2007L0221O235J1515R754j4655k5940l0413L7926N4396N1282k3849
$$ -1576 -43583 -13362 -7127 4388 14142 -513 -26453 -56866 -18940 35456 86738 62889
15204F2889L1370J3923k4242m3831l5272K4242L3804j0193j0107q549l2254m4017
$$ 62889 94259 108182 83940 40109 4837 29079 62883 52690 42583 34034 1780 -42237
15192d2237m0512l3832J3448J6307L1975P989J4416m38n60L102k9027L1319L79
$$ -42237 -82749 -116581 -103133 -86826 -54851 -46862 -32446 -32884 -33444 -30342 -59369 -28050 -27671
15179b7671K5731K0195k271Q928J3899K4931k7500j1486J2313L5832l4341n6571
$$ -27671 -1940 18255 15984 24912 38811 63742 36242 24756 37069 72901 38560 -18011
15167a8011J3448M9293p170P087l571o7112o920N414k9009N7880o903k9102J6452
$$ -18011 -4563 44730 37560 44647 41076 -26036 -32956 -27542 -56551 1329 -5574 -34676 -18224
15154a8224k754J0746L474J4183K3849p302L1580O84m5460l9366K0120K1639J0628
$$ -18224 -20978 -10232 -6758 7425 31274 23972 55552 56236 10776 -28590 -8470 13169 23797
15141B3797l3338k6037J4295K8610j0086p024L778l0862k4897j298L0918p368
$$ 23797 -9541 -35578 -21283 7327 -2759 -9783 -6005 -36867 -61764 -63062 -32144 -39512
15129c9512K7177M1184K9950M577k2171O853J9181k3416K4823J7289m4566m5120
$$ -39512 -12335 28849 58799 63376 41205 48058 67239 43823 68646 85935 41369 -3751
15117c751m731L00r810L6023L5464L9342o742l944Q667l2918m4737J1996M1208
$$ -3751 -8482 -8182 -17992 18031 53495 92837 86095 82151 90818 57900 13163 25159 66367
15104F6367L2083K4547j8829l5437r066k1885K9642J7905l5531k6369L243J5375
$$ 66367 98450 122997 104168 68731 59665 37780 67422 85327 49796 23427 26670 42045
15092D2045j4333q728o6178k7362J0448M8518L1950P126l277J3898l3267n795
$$ 42045 27712 18984 -47194 -74556 -64108 -15590 16360 23486 20209 34107 840 -4955
15080d955K0679j8542j3096K7495J6794L4089l7062q795l9333j6679O8103L157
$$ -4955 15724 -2818 -15914 11581 28375 62464 25402 16607 -22726 -39405 28698 31855
15068C1855j20K1800m5457J3204n004n0166l2031P7355K479o4758k490K7618k2403
$$ 31855 31735 53535 8078 21282 16278 -33888 -65919 11436 13915 -50843 -53333 -25715 -48118
15055d8118L3089P5585R565j465k3621m406L045q460J4104M153k5922R908k1771
$$ -48118 -15029 60556 70121 68656 45035 40629 43674 35214 49318 53471 27549 37457 15686
15042A5686J4509Q913K4412m9233n0410l5101J793J5433O6455M2641M5091K0214
$$ 15686 30195 39108 63520 14287 -36123 -71224 -69431 -53998 12457 55098 100189 120403
15030A20403n7214l1330J571M628m0242n447P4528k3690j0072K330j0709k096
$$ 120403 63189 31859 33430 38058 -2184 -7631 66897 43207 33135 35465 24756 22660
15018B2660L736K2876L1085J486P256K419n3049L574O5350l709N530k8383m2794
$$ 22660 26396 49272 80357 81843 89099 91518 38469 42043 107393 103684 109214 80831 38037
15005C8037J8434j8369k7015J2979n137K1491K2760L5605m9830m6280k5830l6956
$$ 38037 56471 38102 11087 24066 18929 40420 63180 98785 48955 2675 -23155 -60111
14993f0111J4698J5829j3613m5890m113J0693K6755J1814k526j9706m919k0919
$$ -60111 -45413 -29584 -43197 -89087 -93200 -82507 -55752 -43938 -46464 -66170 -71089 -92008
14981i2008J1324O0728L6494M308l717m9660P685M321j4523M0083N7443J2771
$$ -92008 -80684 -19956 16538 20846 17129 -32531 -24846 -20525 -35048 5035 62478 75249
14969G5249l3885r364J4857L3784J6634k4371p065n6609k0421L6901L818n5392
$$ 75249 41364 32000 46857 80641 97275 72904 65839 9230 -11191 25710 29528 -25864
14957b5864l9834j3991R212K9042N3485L6756j5729p9358j8066J5338N4419K5249
$$ -25864 -65698 -79689 -70477 -41435 12050 48806 33077 -46281 -64347 -49009 5410 30659
14945C0659J1468K2144k3325K9338l3320m8761J6881l4077j5204J5677N1675o543
$$ 30659 42127 64271 40946 70284 36964 -11797 5084 -28993 -44197 -28520 23155 16612
14933A6612L4317J5866O9028p745q9610o5564P237M0225K2521N04K4125L2598
$$ 16612 50929 66795 135823 128078 38468 -27096 -19859 20366 42887 43391 67516 100114
14921A00114j3479j3026l4773k0065J8888L865J4638L106l190j3266k4031n7617
$$ 100114 86635 73609 38836 18771 37659 41524 56162 59268 56078 42812 18781 -38836
14909c8836j0714K7446L5589k7838k2383K6084L2771J7053K7167L1310L6525m3576
$$ -38836 -49550 -22104 13485 -14353 -36736 -10652 22119 39172 66339 97649 134174 90598
14897I0598m4631N1404M8426K3596k8793o0831R899k1941J6020K2518j3443k1775
$$ 90598 45967 97371 145797 169393 140600 79769 89668 67727 83747 106265 92822 71047
14885G1047l8854j591k6332l328J9283J2460j7029J743O129J4669o7700k9749
$$ 71047 32193 30602 4270 942 20225 32685 15656 17399 23528 38197 -29503 -59252
14873e9252O8294r320M0439L8273n3520q2184j0507N6002J3800q533k8034o823
$$ -59252 9042 -278 40161 78434 24914 -57270 -67777 -11775 2025 -6508 -34542 -41365
14861d1365O7438L3242j0550k8065l0276o241l2323N1693M223m1050M1816K0071
$$ -41365 26073 59315 48765 20700 -9576 -15817 -48140 3553 7776 -33274 8542 28613
14849B8613Q267K0625k4155j2724J1331M4204m1426p199k6731l4898L2494l507
$$ 28613 36880 57505 33350 20626 31957 76161 34735 27536 805 -34093 -1599 -5106
14837e106r777k4336n1263j455O0706K2512J4861J5620n7554l0436K1148K4521
$$ -5106 -14883 -39219 -90482 -91937 -31231 -8719 6142 21762 -35792 -66228 -45080 -20559
14825b0559l1991K0008L6474K987j1129k9431j0753O2169L7328J2030k1682n3559
$$ -20559 -52550 -32542 3932 6919 -4210 -33641 -44394 17775 55103 67133 45451 -8108
14813h108j1680J283m7703m625M520K8037P6381R477l4016L186q048M7465K1311
$$ -8108 -19788 -18505 -66208 -70833 -66313 -38276 38105 47582 13566 16752 8704 56169 77480
14800G7480j7266r062j6150j0864l2518l3038p250j5838J1005L6521j491K4660
$$ 77480 60214 51152 35002 24138 -8380 -41418 -48668 -64506 -53501 -16980 -18471 6189
14788F189q863P390j2584q3025j7316N7337N1062j4928k8032O239n699n759L1005
$$ 6189 -2674 4716 -7868 -90893 -108209 -50872 190 -14738 -42770 -36531 -42230 -47989 -16984
14775a6984l365m5392L6157P6631K0626J2418L3083j6224l3928j5642j5174k4701
$$ -16984 -20349 -65741 -29584 47047 67673 80091 113174 96950 63022 47380 32206 7505
14763G505M3466K0508o6705n3661J5567P673l6287l1832L909M4782K7221R19M621
$$ 7505 50971 71479 4774 -48887 -33320 -25647 -61934 -93766 -89857 -45075 -17854 -16935 -12314
14750a2314K7278L3248J1761J1473J659k2800M1349k6065m7497k5784K4613J5701
$$ -12314 14964 48212 59973 71446 73105 50305 91654 65589 18092 -7692 16921 32622
14738C2622k4007m6554J8008L9544K5453k8961K5857J3764q4916N441L7065J3150
$$ 32622 8615 -37939 -19931 19613 45066 16105 41962 55726 -29190 -23749 13316 26466
14726B6466k6411n5060L7128P0778j0292j266k868n8215n0478q131K3792L8272
$$ 26466 55 -55005 -17877 52901 42609 41343 38475 -19740 -70218 -78349 -54557 -16285
14714a6285K2515L9446l0641K264M745k6559r854J8693r56j5543k0478k3344j49
$$ -16285 6230 45676 15035 17299 22044 -4515 -14369 4324 3368 -12175 -32653 -55997 -56146
14701e6146p885J28L7058j6078K9689O4138l9851j8702K2968m0319j7391j7200
$$ -56146 -64031 -63903 -26845 -42923 -13234 50904 11053 -7649 15319 -25000 -42391 -59591
14689e9591k4990M1093L5246Q5443l4495j3580j7948l4180p247K7847O208j0739
$$ -59591 -84581 -43488 -8242 77201 42706 29126 11178 -23002 -30249 -2402 3806 -6933
14677f933R901K2818J0911m7117k7842k4302J6470K6754J8115k160L2231j7627
$$ -6933 2968 25786 36697 -10420 -38262 -62564 -46094 -19340 -1225 -3385 28846 11219
14665A1219l7086j0519q468J0506j3110J7353L5075J5143r688n3828L6428O3531
$$ 11219 -25867 -36386 -44854 -34348 -47458 -30105 4970 20113 10425 -43403 -6975 56556
14653E6556o0227o176K6173j4820k578Q408N1m1364k4998P825J9009L9417k782
$$ 56556 -3671 -9847 16326 1506 -1072 7336 7387 -33977 -58975 -51150 -32141 7276 4494
14640D494J3573j2806M767J5361n746K2458k0521j8789K0846K0588N09J4181j5389
$$ 4494 18067 5261 10028 25389 19643 42101 21580 2791 23637 44225 44734 58915 43526
14627D3526n0650j9523k897J4734j1935k4277K5160L5534k8117j0116L8688L231
$$ 43526 -7124 -26647 -29544 -14810 -26745 -51022 -25862 9672 -18445 -28561 10127 13358
14615A3358k9413M020J4115j0195L8933P1999L7112m5674n9612j4599l0246J6316
$$ 13358 -16055 -12035 2080 -8115 30818 102817 139929 94255 34643 20044 -10202 6114
14603F114j8983M613K8055q204j6224N6284O8725l1766p9449j0763L7643j8378
$$ 6114 -12869 -8256 19799 11595 -4629 51655 120380 88614 9165 -1598 36045 17667
14591A7667l7480N129l1596P439J6897N1416r174l4921J2202N446l7418k8272
$$ 17667 -19813 -14684 -46280 -38841 -21944 29472 20298 -14623 -2421 3025 -34393 -62665
14579f2665k6969l8118R549J9068K7216L7982J6898o843k7752Q216k2521m686
$$ -62665 -89634 -127752 -118203 -99135 -71919 -33937 -17039 -23882 -51634 -43418 -65939 -70625
14567g0625L485K1350j0240J1051j3124j2949K8542k2263O8392M0610J1739m8344
$$ -70625 -67140 -45790 -56030 -44979 -58103 -71052 -42510 -64773 3619 44229 55968 7624
14555G624m4653N8215k408m502r042J343l5858l2960Q2753R046L0552M1550n4190
$$ 7624 -37029 21186 18778 14276 5234 6577 -29281 -62241 20512 29558 60110 101660 47470
14542D7470m3273J4773n8427k2910j3420K4760N8130R209N9244m39m5003k3834
$$ 47470 4197 18970 -39457 -62367 -75787 -51027 7103 16312 75556 75117 30114 6280
14530F280J8290q53J5214l860k5168k8933k4519J3808J1698o1725M1949N9859
$$ 6280 24570 23717 38931 35071 9903 -19030 -43549 -29741 -18043 -79768 -37819 22040
14518B2040n7423k2392M823J8185N3865J1985j796J6816j2625p3126l5132L5415
$$ 22040 -35383 -57775 -52952 -34767 19098 31083 29287 46103 33478 -39648 -74780 -39365
14506c9365L6208K2264o22l2899J701L2521m4159m4160m762N730O0698j372j1361
$$ -39365 -3157 19107 18485 -14414 -12713 19808 -24351 -68511 -73273 -67543 -6845 -8217 -19578
14493a9578L0240O711j8875L151J7771l5083P679M3944j990J9929l0260l4746
$$ -19578 10662 17373 -1502 1649 19420 -15663 -7984 35960 33970 53899 23639 -11107
14481a1107J447M4241j6245j7502m4651J8636N8388l0013l8245K1589Q534N268
$$ -11107 -9660 34581 18336 834 -43817 -25181 33207 3194 -35051 -13462 -4928 340
14469C40M8993k5368j8957l8028K5359K291l6564m0703L2489L084k9735k8107
$$ 340 49333 23965 5008 -33020 -7661 -5370 -41934 -82637 -50148 -47064 -76799 -104906
14457a04906L0264K1280N7451K1254n4596l6330P8680M3036k30k0132m0703l3279
$$ -104906 -74642 -53362 4089 25343 -29253 -65583 13097 56133 55903 35771 -4932 -38211
14445c8211J8721O497k0809R154K4754P699j3204M323k2978K8857K9977j6815
$$ -38211 -19490 -12993 -33802 -24648 106 7805 -5399 -1076 -24054 4803 34780 17965
14433A7965m1164O04m415j6667L5684K1520J0704m4113K309J8826K5457L2409
$$ 17965 -23199 -22595 -27010 -43677 -7993 13527 24231 -19882 -17573 1253 26710 59119
14421E9119k7086J7062O6897j358q150M420J6025J5296j8446j02147p2816j6246
$$ 59119 32033 49095 115992 114634 106484 110904 126929 142225 123779 21632 -51184 -67430
14409f7430L991N164K648j4502k4042M7403K8836K1466R653l766k7633P373k5385
$$ -67430 -63439 -58275 -55627 -70129 -94171 -46768 -17932 3534 13187 9421 -18212 -10839 -36224
14396c6224j4591M514O8293j1817K5819J3143k0580k9048o457J812K2740l7966
$$ -36224 -50815 -46301 21992 10175 35994 49137 28557 -491 -6948 -5136 17604 -20362
14384b0362j2693K1501j4027m6594M3979O5013m1121j9188L6970m3094k7895l285
$$ -20362 -33055 -11554 -25581 -72175 -28196 36817 -4304 -23492 13478 -29616 -57511 -60796
14372f0796N845J6899n898Q7840N2826k8816J4969K1248l7807m5306N36L29j6137
$$ -60796 -54951 -38052 -43950 43890 96716 67900 82869 104117 66310 21004 21540 21869 5732
14359E732o995Q04k9120r5661Q675k37M3601N6306O2213j1842n6121l4484P2807
$$ 5732 -1263 -459 -29579 -125240 -116565 -116802 -73201 -16895 45318 33476 -22645 -57129 15678
14346A5678L4023j3773l2323k1128Q331M5260R762Q742l358n6549p0132J3313
$$ 15678 49701 35928 3605 -17523 -9192 36068 45830 54572 51214 -5335 -75467 -62154
14334f2154L8234L761j446k1344L388k1099J4338N5786J5072M5138O2L22k9682
$$ -62154 -23920 -20159 -21605 -42949 -39561 -60660 -46322 9464 24536 69674 69736 70058 40376
14321D0376J952L391m9957j8672O6667N136k6641J4003k9837j0934P507M627o5727
$$ 40376 42328 45719 -4238 -22910 43757 48893 22252 36255 6418 -4516 2991 7618 -58109
14308e8109K9062K9463j594N645R436L9107N7856O773k9797l2295k3724J4566
$$ -58109 -29047 416 -1178 4467 13903 53010 110866 117639 87842 55547 31823 46389
14296D6389j268J696O503l3344N90O5471Q380m1110k9254J1754O228k5782m1122
$$ 46389 45121 46817 53320 19976 20566 86037 94417 53307 24053 35807 42035 16253 -24869
14283b4869j4916J5673M9175j0880k2286L369k3006J5455k1144M583J221o45j7844
$$ -24869 -39785 -24112 25063 14183 -8103 -4734 -27740 -12285 -33429 -28846 -27625 -28270 -46114
14270d6114O126J032j3217M1137j4365J3220L9645n4373l5148M2282M5259J0414
$$ -46114 -39988 -38956 -52173 -11036 -25401 -12181 27464 -26909 -62057 -19775 25484 35898
14258C5898M2172q873m7726j8990l2621J6384L1787M9432M5195l132l5862o1297
$$ 35898 78070 69197 21471 2481 -30140 -13756 18031 67463 112658 109526 73664 12367
14246A2367j4725n315K5843r480l6103l127Q2090N2813n1663j8109j3009J4148
$$ 12367 -2358 -7673 18170 8690 -27413 -30540 51550 104363 52700 34591 21582 35730
14234C5730n505Q2j2149j2845l586P045j7466K9749k5831J5306k2240K334L2652
$$ 35730 30225 30307 18158 5313 1727 8772 -8694 21055 -4776 10530 -11710 -9376 23276
14221B3276p148n245j2421R857J2044J1506m0571l4889K0292O7223n585j9589
$$ 23276 16128 10883 -1538 8319 20363 31869 -8702 -43591 -23299 43924 38339 18750
14209A8750N5348Q822n0487j4686N071n589J7129j8332M368J0215j090k054L7000
$$ 18750 74098 82920 32433 17747 22818 17229 34358 16026 20394 30609 29519 27465 64465
14196F4465n4267n5396J1827K750l9426r152K9375N5523k3583m3805K9081J5060
$$ 64465 10198 -45198 -33371 -30621 -70047 -79199 -49824 5699 -17884 -61689 -32608 -17548
14184a7548L8863K5279j0867n7735L567N5773K4973j1701n5115r936P1359N0964
$$ -17548 21315 46594 35727 -22008 -18441 37332 62305 50604 -4511 -14447 56912 107876
14172A07876l839n8473n2128l1790P421L3941L1417J0954l0745J7246l0784m729
$$ 107876 104037 45564 -6564 -38354 -30933 3008 34425 45379 14634 31880 1096 -3633
14160c633J8656j4882L6997N3132o6501j5137L4533r752l4262j10429k71P6544
$$ -3633 15023 141 37138 90270 23769 8632 43165 33413 -849 -111278 -111549 -35005
14148c5005P7026L6830j8778l5535l2080J4515N492M0717q950l7705k1072l7879
$$ -35005 42021 78851 60073 24538 -7542 6973 12465 53182 44232 6527 -14545 -52424
14136e2424O0898K817k3741j5843j6713k5455J3591p86M824O639m8149o916L2408
$$ -52424 8474 11291 -12450 -28293 -45006 -70461 -56870 -57656 -52832 -46193 -94342 -101258 -68850
14123f8850K0049K3766Q2901o65j1678m6871m5037K2038L0026j2294m294l684
$$ -68850 -48801 -25035 57866 57201 45523 -1348 -46385 -24347 5679 -6615 -10909 -14593
14111a4593M2091P791l0423l7152K4771j2299j2353K7681J8270J2599L2675n139
$$ -14593 27498 35289 4866 -32286 -7515 -19814 -32167 -4486 13784 26383 59058 53919
14099E3919m3303l6000k0118J2482M1955K0492l1698l1584N8887Q0555p954p2330
$$ 53919 10616 -25384 -45502 -33020 8935 29427 -2271 -33855 25032 105587 97633 25303
14087B5303J0874k3694L163j1761M6013K7139j7577n1760r654K9659J9200k0714
$$ 25303 36177 12483 15646 3885 49898 77037 59460 7700 -1954 27705 46905 26191
14075B6191J983J4334M8627l092l9409m8627K5945K874l1350J2270l7135j3507
$$ 26191 28174 42508 91135 88043 48634 7 25952 28826 -2524 9746 -27389 -40896
14063d0896K8469N621o697n663K7533L1144O397r570l4882o411k5222k5445M5949
$$ -40896 -12427 -6806 -13503 -19166 8367 39511 45908 36338 1456 -4955 -30177 -55622 -9673
14050i673O5141J5645m0963k5214J4665L4147J5590j2424l798M044o4787o3030
$$ -9673 55468 71113 30150 4936 19601 53748 69338 56914 53116 57160 -7627 -70657
14038g0657j7977J0212R3441N9852p515k0279l514J7771l8344j6078N968K4194
$$ -70657 -88634 -78422 15019 74871 67356 47077 43563 61334 22990 6912 12880 37074
14026C7074M4787L151p3819l0636J8942l746J1446P72K3508J552k5503M8151o299
$$ 37074 81861 85012 11193 -19443 -501 -4247 7199 7971 31479 33031 7528 55679 49380
14013D9380l2365L4686m0183K5199L723k300K1186J1929r284J2247L349o0099
$$ 49380 17015 51701 11518 36717 40440 38140 59326 71255 61971 74218 77567 17468
14001A7468k7969L6629L0572j6257n780o670j8956n9903l0587Q918J6114M2273
$$ 17468 -10501 26128 56700 40443 34663 27993 9037 -50866 -81453 -72535 -56421 -14148
13989a4148M0418J8077N663k5715J3387K3043J4448p8401n3133m0429M789M4532
$$ -14148 26270 44347 50010 24295 37682 60725 75173 -3228 -56361 -96790 -92001 -47469
13977d7469N4698J629j0451m3298J5847J2476L4410k4213o6689K5199m139L67
$$ -47469 7229 8858 -1593 -44891 -29044 -16568 17842 -6371 -73060 -47861 -52000 -51633
13965e1633L1868L3729j214l709l8996K8861K2587J5699J0199l7012l5784R545
$$ -51633 -19765 13964 12750 9041 -29955 -1094 21493 37192 47391 10379 -25405 -15860
13953a5860J3208q396j9628q925l920M7609N6771k6817j9944O035J8818L820J0361
$$ -15860 -2652 -11048 -30676 -39601 -43521 4088 60859 34042 14098 20133 38951 42771 53132
13940E3132Q524J0275m42o0318l1153J4208J4711j2046k3206j840Q1748P351n3452
$$ 53132 61656 71931 71489 11171 -19982 -5774 8937 -3109 -26315 -28155 53593 60944 7492
13927G492K0000L7284K4053k8979l143L8342k9127l6211m6163J0652j152m5573
$$ 7492 27492 64776 88829 59850 56707 95049 65922 29711 -16452 -5800 -6952 -52525
13915e2525j9449M6980k1644l332P0539j9622l8858j0725K8477M3090l1505n776
$$ -52525 -71974 -24994 -46638 -49970 20569 947 -37911 -48636 -20159 22931 -8574 -14350
13903a4350J8739j2866n337M0072J2869k0997j2565n9219N373K4055L6916J7487
$$ -14350 4389 -8477 -13814 26258 39127 18130 5565 -53654 -48281 -24226 12690 30177
13891C0177l1583K5288n137m3109N9808l040r003k0075N914j2118K6279J3376
$$ 30177 -1406 23882 18745 -24364 35444 32404 23401 3326 9240 -2878 23401 36777
13879C6777l3442k0605p730q384j5334J2811j3679K4826j532J136J6712k1472
$$ 36777 3335 -17270 -25000 -33384 -48718 -35907 -49586 -24760 -26292 -25156 -8444 -29916
13867b9916K9894k7528l6915J8562L6219l0093j0036L3293N1986K3970j7449l6069
$$ -29916 -22 -27550 -64465 -45903 -9684 -39777 -49813 -16520 35466 59436 41987 5918
13855E918M1422k3969m5376L7645j6634K9387k3383L788M5776O1131n539k3382
$$ 5918 47340 23371 -22005 15640 -994 28393 5010 8798 54574 115705 110166 86784
13843H6784J5984R400k2718r238k1163m9253L4033N9349J2001n489j4329m8517
$$ 86784 102768 112168 89450 80212 59049 9796 43829 103178 115179 109690 95361 46844
13831D6844J2650k729k4409k573l3688q1898O589N1657J0011j4861M9393M7251
$$ 46844 59494 56765 32356 29783 -3905 -85803 -79214 -27557 -17546 -32407 16986 64237
13819F4237K225j1263l5099r863P433l3698K8507p70n886J2246O90j3938J1269
$$ 64237 66462 55199 20100 10237 17670 -16028 12479 11709 5823 18069 18759 4821 16090
13806A6090l3955J280O23m1454L0361R2325l0489o4251j9086m223q542J4789J6914
$$ 16090 -17865 -16585 -15962 -57416 -27055 65270 34781 -29470 -48556 -52779 -61321 -46532 -29618
13793b9618j8379L1982j2545P777L942r976N992M7140K4893K1214j0441o2818
$$ -29618 -47997 -16015 -28560 -20783 -16841 -26817 -20825 26315 51208 72422 61981 -837
13781h37n4911N5271J4505l1435M687L052M4643Q3034N7497m9298p8316l5043
$$ -837 -55748 -477 14028 -17407 -12720 -9668 34975 118009 175506 126208 47892 12849
13769A2849m5419m6763K2366O4146j934K7453k6776j9068O3037J4078p2119j4919
$$ 12849 -32570 -79333 -56967 7179 5245 32698 5922 -13146 49891 63969 -8150 -23069
13757b3069K3337N3517k1558Q503M0367J2639o0086j2583j1233L145K6675l8865
$$ -23069 268 53785 32227 40730 81097 93736 33650 21067 9834 12979 39654 789
13745G89K5847j8227m0124j9846P1821J8533j1584k846J0596N2846k5463m2833
$$ 789 26636 8409 -31715 -51561 20260 38793 27209 24363 34959 87805 62342 19509
13733A9509p65J1100k2314n963K4756m6270l0511K2159L587K3553p69m3262k324
$$ 19509 18744 29844 7530 1567 26323 -19947 -50458 -28299 -24712 -1159 -1928 -45190 -47514
13720d7514K8633M1169m2589J5335O9911J1328k0765K5474O590m6924l3071j7974
$$ -47514 -18881 22288 -20301 -4966 64945 76273 55508 80982 87572 40648 7577 -10397
13708a0397n9077L3011J0593l4626K593N1600M4163k2674l4328j6313m886L3486
$$ -10397 -69474 -36463 -25870 -60496 -57903 -6303 37860 15186 -19142 -35455 -40341 -6855
13696f855K1759M1705Q564J7777J212o0454k9186M893l6249R400l3874M2235M1576
$$ -6855 14904 56609 65173 82950 84162 23708 -5478 -585 -36834 -27434 -61308 -19073 22503
13683B2503O82K0448J4407k2698J2493K2090m2243q4347k5092p185J966K9568
$$ 22503 23185 43633 58040 35342 47835 69925 27682 -56665 -81757 -88942 -86976 -57408
13671e7408K6872L1177J6475l7595j0423Q3513m929L234p048o2831j9632J1311
$$ -57408 -30536 641 17116 -20479 -30902 52611 47682 50916 43868 -18963 -38595 -27284
13659b7284o401L2652J3144j2094k2923q655k416N8200n243n475n447m7852N62
$$ -27284 -33685 -1033 12111 17 -22906 -31561 -33977 24223 18980 13505 8058 -39794 -39232
13646c9232K1598J1291M2446J3782l3179l2953L8413N2907l5457j4071l701n941
$$ -39232 -17634 -6343 36103 49885 16706 -16247 22166 75073 39616 25545 21844 15903
13634A5903j2908K0887j9274n0445n0920m199L2358M8258M6642k6589k3555J1006
$$ 15903 2995 23882 4608 -45837 -96757 -100956 -68598 -20340 26302 -287 -23842 -12836
13622a2836O5244K0613m67r682o7657k0672L2446K6042R951k0920n1J5640Q224
$$ -12836 52408 73021 72554 62872 -4785 -25457 6989 33031 42982 22062 22011 37651 45875
13609D5875l9514O82J6799j0442L5517l3639m134l0704K7270K3445j5777j5511
$$ 45875 6361 7043 23842 13400 48917 15278 11144 -19560 7710 31155 15378 -133
13597a33K3518L2405j8622p9239m9370k5484O18N4454N5361L8931N0576k7793
$$ -133 23385 55790 37168 -42071 -91441 -116925 -116307 -61853 -6492 32439 83015 55222
13585E5222m1348n7678Q160M8895J6640n9689n0824j5103K7494N665L0025m270
$$ 55222 13874 -43804 -35644 13251 29891 -29798 -80622 -95725 -68231 -62566 -32541 -36811
13573c6811j848O0543N613R789j6966l6789p771K2577J2935j1718k1856O0053
$$ -36811 -38659 21884 27497 37286 20320 -16469 -24240 -1663 11272 -446 -22302 37751
13561C7751M2775J996j2305k4082o6070r695R565J3545L4331j5714L7848L2309
$$ 37751 80526 82522 70217 46135 -19935 -29630 -20065 -6520 27811 12097 49945 82254
13549H2254m8643J8413Q388o3218M758K5498l217j219L2479K4578o1274j2473
$$ 82254 33611 52024 60412 -2806 1952 27450 24233 23014 55493 80071 18797 6324
13537F324P906j1793J2013L9272m220l3230k1029P6067n726l0572O281p7295j4081
$$ 6324 14230 2437 14450 53722 49502 16272 -4757 71310 65584 35012 41293 -36002 -50083
13524e0083j477j6286n152L2577N8196K2438j2405l3346k6171J2897N248j2518
$$ -50083 -51560 -67846 -72998 -40421 17775 40213 27808 -5538 -31709 -18812 -13564 -26082
13512b6082K7287M9r551J7958J2132k3469p943j5743K7415J0063n848K1026J7548
$$ -26082 1205 1254 -8297 9661 21793 -1676 -9619 -25362 2053 12116 6268 27294 44842
13499D4842O207q059J3556k385j8223l7805J9389K0500k2961k3527O8738J8234
$$ 44842 51049 42990 56546 54161 35938 -1867 17522 38022 15061 -8466 60272 78506
13487G8506J3808n989q440j7801l4438J0444j5368j1229J2474q280n7080N2251
$$ 78506 92314 86325 77885 60084 25646 36090 20722 9493 21967 13687 -43393 8858
13475H858L0092j4494J5455J5270k0781m929m8501L2623J3341o9872o6728l9232
$$ 8858 38950 24456 39911 55181 34400 29471 -19030 13593 26934 -42938 -109666 -148898
13463a48898L200j4006M9995O6339M2876L5339J4594K1682l1383m4898N9799N4063
$$ -148898 -145698 -159704 -109709 -43370 -494 34845 49439 71121 39738 -5160 54639 108702
13451A08702J2809l8017o8362j6644n573j1622p70K6355N1965M6311J6816n2509
$$ 108702 121511 83494 15132 -1512 -7085 -18707 -19477 6878 58843 105154 121970 69461
13439F9461l7927K274p260j1145K1064N4285j0786n6712l8304J24J148J2693Q668
$$ 69461 31534 33808 26548 15403 36467 90752 79966 23254 -15050 -14926 -13778 -1085 7583
13426G583J1008O5280r096l4316l377M4339P706K0143M287P511K8463q7542m4396
$$ 7583 18591 83871 74775 40459 37082 81421 89127 109270 113557 121068 149531 61989 17593
13413A7593K2395P5616n228l5505l7352M4058Q850J9j8717j396M1131o269j2523
$$ 17593 39988 115604 110376 74871 37519 81577 90427 90446 71729 70333 111464 105195 92672
13400I2672J4943n192k0585j6888o101Q431j3567l4766j3446j844l419j194L9676
$$ 92672 107615 102423 81838 64950 58849 67280 53713 18947 5501 3657 238 -956 38720
13387C8720J5653k1067L2690l362K2942J7422k3727l5531k7033L5528k2239o9188
$$ 38720 54373 33306 65996 62634 85576 102998 79271 43740 16707 52235 29996 -39192
13375c9192l5047L5635Q9507K4233Q2001P7207R0652R9082R0911J26463J83592
$$ -39192 -74239 -38604 50903 75136 157137 234344 324996 424078 514989 641452 825044
13364H25044L24351N38512O47624L84903p5490n52837o81380m97134l18574j94240
$$ 825044 1149395 1687907 2335531 2720434 2644944 2092107 1410727 913593 595019 400779
13354D00779r4794k8473j0068j0196j2400J5061O3109J52571K03020J98917j9676
$$ 400779 305985 277512 267444 257248 244848 259909 323018 475589 678609 877526 857850
13343H57850k09554k56426j65622p9604O17j5677l1033l7547K2395m1156j1542
$$ 857850 648296 391870 226248 146644 147261 131584 100551 63004 85399 44243 32701
13332C2701r017J7852j2460k6297j2138N9320N0318K6297m2277l3995J1324k5081
$$ 32701 23684 41536 29076 2779 -9359 49961 100279 126576 84299 50304 61628 36547
13320C6547o569k2212k3144M750N0324N4722M112k7007J0576K1778J8737o6634
$$ 36547 29978 7766 -15378 -10628 39696 94418 98530 71523 82099 103877 122614 55980
13308E5980k0389N449l637J0244J0258o293j2682J1269L7754L804p4825q926l49
$$ 55980 35591 41040 37403 47647 57905 51612 38930 50199 87953 91757 16932 8006 7657
13295G657M6804J3653k4812j4374K2827K1557J0234l0384n2586j9767j7680k0724
$$ 7657 54461 68114 43302 28928 51755 73312 83546 53162 576 -19191 -36871 -57595
13283e7595K2864J3330M7906O5481K3915o0764m4819k3550N5432K1380r09n275
$$ -57595 -34731 -21401 26505 91986 115901 55137 10318 -13232 42200 63580 62671 57396
13271E7396o109K4029L8103k5700m0999j57J3746m2468L661P461J7124J0182l029
$$ 57396 51287 75316 113419 87719 46720 46563 60309 17841 21502 28963 46087 56269 53240
13258E3240j9214j4714J0846l1018j0045K0076L0231J1456J754k0452k8318L9603
$$ 53240 34026 19312 30158 -860 -10905 9171 39402 50858 52612 32160 3842 43445
13246D3445P6564J0294m9258m1852J8904O645O4675K8139k0817k9514o8927m4001
$$ 43445 120009 130303 81045 39193 58097 64742 129417 157556 136739 107225 38298 -5703
13234e703K6841O5291N7733l4738j9540j8414k2566K4072N7620j0008n4748J2394
$$ -5703 21138 86429 144162 109424 89884 71470 48904 72976 130596 120588 65840 78234
13222G8234K2006l5472q9743l9618J3434J1285J7347K6289N2551L3337K0989j3715
$$ 78234 100240 64768 -24975 -64593 -51159 -39874 -22527 3762 56313 89650 110639 96924
13210I6924l5616k3457m0004m5780n4644O3962N7301L9411L005Q363J7863j4218
$$ 96924 61308 37851 -2153 -47933 -102577 -38615 18686 58097 61102 69465 87328 73110
13198G3110N93L1028M656l5549m9577j7215p64k3897L1508O0798M3110k9869n0664
$$ 73110 73703 104731 109387 73838 24261 7046 6282 -17615 13893 74691 117801 87932 37268
13185C7268l182N86K4038M3874q274j5009N2718K7104L0468K4211N2990N0838
$$ 37268 34086 34672 58710 102584 94310 79301 132019 159123 189591 213802 266792 317630
13173C17630N4421K4680n2897o0485m5338j2993N2514O2278m2953o6865m0147
$$ 317630 372051 396731 343834 283349 238011 225018 277532 339810 296857 229992 189845
13162A89845l329J312p5016l7249L556K8760M4535M2032O9718L7898j1211j03761
$$ 189845 186516 187828 112812 75563 79119 107879 152414 194446 264164 302062 290851 187090
13150A87090n7125n883r71q508J4486o5768l9995q87k0703J5206j7143l1876l1205
$$ 187090 129965 124082 123111 114603 129089 63321 23326 22439 1736 16942 -201 -32077 -63282
13137f3282O216J8337L217O373M0133M0496J4664L5431K4031j8822L0739K400
$$ -63282 -57066 -38729 -35512 -29139 10994 51490 66154 101585 125616 106794 137533 139933
13125A39933m6997p6671r637K0302m911L3618l46r454N3180M3563k0077k2830
$$ 139933 92936 16265 6628 26930 22019 55637 55291 45837 99017 142580 122503 99673
13113I9673Q602N9253N2531K0327M4298R3202k1414q2576j4464M1316k4943j07304
$$ 99673 108275 167528 220059 240386 284684 377886 356472 273896 259432 300748 275805 168501
13101A68501j30281n9237o4451k3989R0769O6563O6388k722j3347j9651l8996
$$ 168501 38220 -21017 -85468 -109457 -18688 47875 114263 111541 98194 78543 39547
13090C9547J1135k4598k5671k5331J7977L2202k9626p852m7916k0424k0008P749
$$ 39547 50682 26084 413 -24918 -6941 25261 -4365 -12217 -60133 -80557 -100565 -92816
13078i2816N7344J9218n082j4820N4217J7282l3395m6886n0700J030L147Q7891
$$ -92816 -35472 -16254 -21336 -36156 18061 35343 1948 -44938 -95638 -94608 -91461 -3570
13066c570K9275k5876R717J4685L712j1820n8959j05919J4516N8695j09o188M1219
$$ -3570 25705 -171 9546 24231 27943 16123 -42836 -148755 -134239 -75544 -75653 -81841 -40622
13053d0622L7578K0362k5708k0057L0360N7272r49n9113p4726k1516L7153R673
$$ -40622 -3044 17318 -8390 -28447 1913 59185 58236 -877 -75603 -97119 -59966 -50293
13041e0293M6741J43116J05089Q3729M2881l1558m3066n1596L4848k7661J1843
$$ -50293 -3552 139564 244653 328382 371263 339705 296639 245043 279891 252230 264073
13030B64073L6049r855j9968p032j1335k6193l5713q544j4779k460p600J7894
$$ 264073 300122 290267 270299 263267 251932 225739 190026 181482 166703 164243 156643 174537
13018A74537K1595N1261K6403n534j0844J2314R2551J01612J9574j0811l9387
$$ 174537 196132 247393 273796 268262 257418 269732 362283 463895 483469 472658 433271
13007D33271m1317L978m4647r4375l0741K9290j4853K6455J6605K8968M6776L355
$$ 433271 391954 395932 351285 256910 226169 255459 240606 267061 283666 312634 359410 362765
12995C62765K831K5708N2459N0265p8007l4447N5662M5348J2545K2670j6668J3008
$$ 362765 365596 391304 443763 494028 416021 381574 437236 482584 495129 517799 501131 514139
12983E14139Q7481K9862K0068j8056J7791M5916P4558M1939j6744r913k312K8536
$$ 514139 601620 631482 651550 633494 651285 697201 771759 813698 796954 787041 784729 813265
12971H13265P6810J09806M8952m7970p6647j5067m482L3702O4761O1047L6688
$$ 813265 890075 999881 1048833 1000863 924216 909149 904667 938369 1003130 1064177 1100865
12960A100865O1442R293P9163J33787O3785R3335J23074J32868J09063J22698
$$ 1100865 1162307 1171600 1250763 1384550 1448335 1541670 1664744 1797612 1906675 2029373
12950B029373J28168R7445J56780J27776R6412J31157J54226K22190K21922K88933
$$ 2029373 2157541 2254986 2411766 2539542 2635954 2767111 2921337 3143527 3365449 3654382
12940C654382L73293L67629M68644N51856P20818Q65029J017365J242187J594164
$$ 3654382 4027675 4395304 4863948 5415804 6136622 7001651 8019016 9261203 10855367
12931A0855367K164472K967939L877161N167595P000826R170698J1401848J3806174
$$ 10855367 13019839 15987778 19864939 25032534 32033360 41204058 52605906 66412080
12923F6412080J7201415K3354543L5434645N8048480R2534923J22453316R2856447
$$ 66412080 83613495 106968038 142402683 200451163 292986086 415439402 508295849
12916E08295849Q455530r1715848j32443481j10811377o5070605l5006571k0166857
$$ 508295849 516751379 425035531 292592050 181780673 116710068 81703497 61536640
12909F1536640j2690406r026672o946813n678044m593789l505038k594232j970833
$$ 61536640 48846234 39819562 32872749 27194705 22600916 19095878 16501646 14530813
12901A4530813j567972j304481j134306r19379p29846p32572p77818p99617p04287
$$ 14530813 12962841 11658360 10524054 9604675 8874829 8142257 7364439 6564822 5860535
12892E860535n74196m83010l95894l43222k36176k44640l22705l10263k51263
$$ 5860535 5286339 4803329 4407435 4064213 3828037 3583397 3260692 2950429 2699166
12883B699166j17564j19067j26617j41704j39885j35513j21833m9092m9397j05846
$$ 2699166 2581602 2462535 2335918 2194214 2054329 1918816 1796983 1747891 1698494 1592648
12873A592648j02317q6753p2444p7920o4811n3266p0149o6814p0126m3527k191
$$ 1592648 1490331 1403578 1331134 1253214 1188403 1135137 1064988 998174 928048 884521 882330
12862H82330J1052K2237k9080o1193n1762m2657k0173l8278p396l0608J1859k619
$$ 882330 893382 915619 886539 825346 773584 730927 710754 672476 665080 634472 646331 643712
12850F43712k2135m1327k1669J6694J0423q9116p8688j0305P2234N5747k5775
$$ 643712 621577 580250 558581 575275 585698 496582 417894 407589 479823 535570 509795
12839E09795q967l4387l0082N850Q722J3031k9007n6765n6881L709K6822m7525
$$ 509795 500828 466441 436359 442209 450931 463962 434955 378190 321309 325018 351840 304315
12827C04315m4044l6508m2994L9474l2910M646O2898k1556L1459M6288K8852K5668
$$ 304315 260271 223763 180769 220243 187333 191979 254877 233321 264780 311068 339920 365588
12815C65588o3433k1001l7672J7775N7983L2784p6411q5154o8789J0031L5610
$$ 365588 302155 281154 243482 261257 319240 352024 275613 190459 121670 131701 167311
12804A67311M20m4667R900K3103k3492K7580J1847k2996L6972K5036P4730J40245
$$ 167311 167731 123064 132964 156067 132575 160155 172002 149006 185978 211014 285744 425989
12792D25989O2988J1339L4027k7871k6183l3096q6049m8608J3728L3657N253k295
$$ 425989 488977 500316 534343 506472 480289 447193 361144 312536 326264 359921 365174 362879
12780C62879j120l3629k7279M3339J0689N127M022J781l2954l3896N409j651m4455
$$ 362879 361759 328130 300851 344190 354879 360006 364028 365809 332855 298959 304368 302717 258262
12767B58262j61K0492q747P738L3140l9120q2344K6531l793K2458J3122k5693
$$ 258262 258101 278593 269846 277584 310724 271604 189260 215791 211998 234456 247578 221885
12755B21885M97Q064J3473O329K5218q356K5637o395m0648o69n837o9924n3978
$$ 221885 222382 230446 243919 250248 275466 267110 292747 286352 245704 245035 239198 169274 115296
12742A15296m118J3746K5256r2465o5653M0670M3609M4375q393l4718q7320n6289
$$ 115296 111178 124924 150180 57715 -7938 32732 76341 120716 112323 77605 -9715 -66004
12730f6004J5564L6277K8418M9329Q891K5484k3905m6927J4599L0877m159k2995
$$ -66004 -50440 -14163 14255 63584 72475 97959 74054 27127 41726 72603 68444 45449
12718D5449j5072L0470M9738J1819M8687N5137j1192n8678k2550P384k8157L705
$$ 45449 30377 60847 110585 122404 171091 226228 215036 156358 133808 141192 113035 116740
12706A16740J0325L0567r659k6808K98j5427J2812K7039m652r564M509l171j0051
$$ 116740 127065 157632 147973 121165 121463 106036 118848 145887 141235 131671 136180 133009 122958
12693A22958K737k2468R74R745K6832j2913n3861J0821L9884K0728N172j6925
$$ 122958 125695 103227 104201 113946 140778 127865 74004 84825 124709 145437 150609 133684
12681A33684n3460L400K2771L6026K7286n3922m5945K383K7271k1466m7097J7838
$$ 133684 80224 83624 106395 142421 169707 115785 69840 72223 99494 78028 30931 48769
12669D8769p807r286M1215N1847L8830o197m120J895Q040l1756k0434o181j5595
$$ 48769 40962 31676 72891 124738 163568 157371 153251 155146 163186 131430 110996 104815 89220
12656H9220k204K7048K178l6808L2M6805n537l8881K009M221L837J0060M033J4459
$$ 89220 87016 114064 116242 79434 79466 126271 120734 81853 83862 88083 91920 101980 106013 120472
12642A20472P33l2038J8404m8334j4434j603N4167K2501m2683R299J5317m4006
$$ 120472 121205 89167 107571 59237 44803 43200 97367 119868 77185 86484 101801 57795
12630E7795m0074N7005O2133J0431J379m7423l3506o0434n0743M0641Q6564M5917
$$ 57795 17721 74726 136859 147290 148669 101246 67740 7306 -43437 -2796 83768 129685
12618A29685J9693l1947k2793j6831k6423L984R767l4313j805L3362n57r756k6169
$$ 129685 149378 117431 94638 77807 51384 55368 65135 30822 29017 62379 61822 52066 25897
12605B5897P959L976l092j9565K4117k449p3650k5894M1508m99J6883M4605k880
$$ 25897 33856 37832 34740 15175 39292 36843 -36807 -62701 -21193 -21692 -4809 39796 36916
12592C6916j542k6394N9003L7952o8817n9584J7764K2480k1455M0704M8534J2923
$$ 36916 35374 8980 67983 105935 37118 -22466 -4702 17778 -3677 37027 85561 98484
12580I8484K4194l5712k9444k162p233k2058l7897L844J3480k3098k1837N2199
$$ 98484 122678 86966 57522 55360 48127 26069 -11828 -7984 5496 -17602 -39439 12760
12568A2760K4421k8738M7090K9401J1458K9042J8709j0577J3533k3498j9802l2794
$$ 12760 37181 8443 55533 84934 96392 125434 144143 133566 147099 123601 103799 71005
12556G1005k8720p070N9401N2816R067k6810m5551k2183J4732k5984j9402M3766
$$ 71005 42285 35215 94616 147432 156499 129689 84138 61955 76687 50703 31301 75067
12544G5067J1941n0560L2775K1095j4434k9322K551J6966L2043k8323n0861k5832
$$ 75067 87008 36448 69223 90318 75884 46562 49113 66079 98122 69799 18938 -6894
12532f894Q426J7855L3584N2831L4535m918k0113n5541J8117Q5185K6163k9636
$$ -6894 1532 19387 52971 105802 140337 135419 115306 59765 77882 163067 189230 159594
12520A59594p9140k5242k663J176J0514q649q493l403k3781j4296L0776O8152
$$ 159594 80454 55212 52549 53725 64239 55590 47097 43694 19913 5617 36393 104545
12508A04545j7850q131n4056r657K470M1439l6530N342J3155J1481m4814m1552
$$ 104545 86695 78564 24508 14851 17321 58760 22230 27572 40727 52208 7394 -34158
12496c4158k645N9876J0524j4798L7583J5268l7277M4207m671k5130N156l5459
$$ -34158 -36803 23073 33597 18799 56382 71650 34373 78580 73909 48779 53935 18476
12484A8476r49k0794j1610K3900L0203M8205O1594N4560N9086K3499L7498M0145
$$ 18476 17527 -3267 -14877 9023 39226 87431 149025 203585 262671 286170 323668 363813
12472C63813R0452J27911J73948L26484M70665O28263N39695Q3513m58460p16232
$$ 363813 454265 582176 756124 1082608 1553273 2181536 2721231 2804744 2346284 1630052
12462A630052o24119l67152j87854j05104o7413j9768L2809l4991n7687l6356
$$ 1630052 1005933 638781 450927 345823 278410 258642 291451 256460 198773 162417
12452A62417l5760k0638m5670m5981k867r668k9182o714L8940M3626r317k855
$$ 162417 126657 106019 60349 14368 11501 1833 -27349 -34063 4877 48503 39186 36331
12440C6331J5684j1265J6326K1972K2807l0093j2042k2060J8353L166k6817j3009
$$ 36331 52015 40750 57076 79048 101855 71762 59720 37660 56013 59179 32362 19353
12428A9353M4562K0059j7356l2796K8674J0385k2078k8772K5285r079O132j711
$$ 19353 63915 83974 66618 33822 62496 72881 50803 22031 47316 38237 44369 42658
12416D2658j4673J255L2941m892j7971m2127l5356J53K0634N392L7756j7285M7085
$$ 42658 27985 29240 62181 57289 39318 -2809 -38165 -38012 -17378 -11986 25770 8485 55570
12403E5570m8990n9033O5918O5408k8278j4252P583p751m487k1139O502k7445
$$ 55570 6580 -52453 13465 78873 50595 36343 43926 36175 31688 10549 17051 -10394
12391a0394j9662M1644l088p532j161O557J8165j732J7800k1259j2032L5283n441
$$ -10394 -30056 11588 8500 968 -193 6364 24529 22797 40597 19338 7306 42589 37148
12378C7148p6025n4101P1511O9995K278J952L9197j4972l1613O3843L0211N133
$$ 37148 -38877 -92978 -21467 48528 50806 52758 91955 76983 45370 109213 139424 144557
12366A44557k8661l8178m5962k3611j1574K7238j947k1305q542J1380k6934N837
$$ 144557 115896 77718 31756 8145 -3429 23809 21862 557 -7985 3395 -23539 -17702
12354a7702L980J9469J1380l6747m08m201L4139L4730J5548n3049l6391j0980
$$ -17702 -13722 5747 17127 -19620 -20028 -24229 9910 44640 60188 7139 -29252 -40232
12342d0232O126M5595N9428l0905K7939M0897l1663K138J0550o7522r5751J806
$$ -40232 -34106 11489 70917 40012 67951 108848 77185 79323 89873 22351 -73400 -71594
12330g1594K5688L6416J2857O592k2936l7536L1611K0601k6094q1821J1513O4236
$$ -71594 -45906 -9490 3367 9959 -12977 -50513 -18902 1699 -24395 -106216 -94703 -30467
12318c0467p247j4766O3260P0612J2402K5977o9691q5200J7025L0668k016K5631
$$ -30467 -37714 -52480 10780 81392 93794 119771 50080 -35120 -18095 12573 10557 36188
12306C6188m291p651K8450l3277o1456L2102Q2597l1197o0776K1734k0932J358
$$ 36188 31897 24246 52696 19419 -42037 -9935 72662 41465 -19311 2423 -18509 -17151
12294a7151J2652l595J1475K4484p01j9911j7355O8184O4196k2210o9435j7501
$$ -17151 -4499 -8094 3381 27865 27164 7253 -10102 58082 122278 100068 30633 13132
12282A3132K6923m692K4842L9778J0827L3608p989m9662m5250n8679o0657l1245
$$ 13132 40055 35363 60205 99983 110810 144418 136429 86767 41517 -17162 -77819 -109064
12270a09064L3198K7952j6751o625J033O2145j0693o2960N2360M3560K7919r391
$$ -109064 -75866 -47914 -64665 -71290 -70257 -8112 -18805 -81765 -29405 14155 42074 32683
12258C2683k0995K7200K1445P090m1136K4053M3036k8338j6777j8963Q130j6546
$$ 32683 11688 38888 60333 67423 26287 50340 93376 65038 48261 29298 37428 20882
12246B0882J3610N8263p892l4964l1495j39J8108R022L115Q712j258N08p5100
$$ 20882 34492 92755 84863 49899 18404 18265 36373 45395 48510 57222 55964 56472 -18628
12233a8628n6441J1954O7053M5004n5024l9463K7918K3348J8774l2758k3262M7360
$$ -18628 -75069 -63115 3938 48942 -6082 -45545 -17627 5721 24495 -8263 -31525 15835
12221A5835K0840k4069j2179J8939N291L9161k5719l1027k910l3568J3160L5098
$$ 15835 36675 12606 427 19366 24657 63818 38099 7072 4162 -29406 -16246 18852
12209A8852P1722O3620m3712r2485n1943J8011O515M007M441l268J5674l2821
$$ 18852 90574 154194 110482 17997 -33946 -15935 -9420 -5413 -972 -4240 11434 -21387
12197b1387J0935O0260j4239Q70M556L4471M3733K002l7153m7924l4633l7037
$$ -21387 -10452 49808 35569 36439 40995 75466 119199 121201 84048 36124 1491 -35546
12185c5546J7452J6169p021N8076k1418K6118O9173k2330m7956J9390k277j0840
$$ -35546 -18094 -1925 -8946 49130 27712 53830 123003 100673 52717 72107 69830 58990
12173E8990M602M5346j5548q4256p9810K2038O6983N9101l0195m4771p940m358
$$ 58990 63592 108938 93390 9134 -70676 -48638 18345 77446 47251 2480 -5460 -9818
12161i818K1891K5613J4617k3243r253j1287k3217q012K7395L1705q584m5259
$$ -9818 12073 37686 52303 29060 19807 8520 -14697 -22709 4686 36391 27807 -17452
12149a7452K4548O2768k4734k3468j9157o6661K007L4201Q6887Q5589j6827m3889
$$ -17452 7096 69864 45130 21662 2505 -64156 -62149 -27948 58939 144528 127701 83812
12137H3812l7416J683R724l9260m9381o001K3986l2181K6704p275j4138L2518
$$ 83812 46396 48079 57803 18543 -30838 -36839 -12853 -45034 -18330 -25605 -39743 -7225
12125g225K7746J4720o788k4897J3200P4921j1823j9202p227j0419L2886k3952
$$ -7225 20521 35241 28453 3556 16756 91677 79854 60652 53425 43006 75892 51940
12113E1940l5862K897K1283k7151k4371L7340N797K4328q878l5291L9158N3968
$$ 51940 16078 18975 40258 13107 -11264 26076 31873 56201 47323 12032 51190 105158
12101A05158N524L5997k1746n6034L1525K3561l1251k5106N052m7055p1825M721
$$ 105158 110682 146679 124933 68899 100424 123985 92734 67628 72680 25625 -46200 -41479
12089d1479m375M4896O5243J1711m3567n606n3135k1542N6639N9734j6743J5241
$$ -41479 -45854 -958 64285 75996 32429 26823 -26312 -47854 8785 68519 51776 67017
12077F7017m722l6644k0380r454j0476J5393L1730j5318L556J7269k6016m4729
$$ 67017 62295 25651 5271 -4183 -14659 734 32464 17146 20702 37971 11955 -32774
12065c2774l825k3347j6528N6233M1765j4466n46L0095l765P2635k2663m2166
$$ -32774 -36599 -59946 -76474 -20241 21524 7058 6512 36607 32842 105477 82814 40648
12053D0648l9520l4964m0135M6521P4032K5550m9077m9398r117N9142L5206M9595
$$ 40648 1128 -33836 -73971 -27450 46582 72132 23055 -26343 -35460 23682 58888 108483
12041A08483p029o484p3486j9630J5562j7162K0536L0483l5088l3032l8896K4863
$$ 108483 101454 94970 21484 1854 17416 254 20790 51273 16185 -16847 -55743 -30880
12029c0880K0413j8273r846k031p237J6388L2992k2333K0944J5270M8476K0453
$$ -30880 -10467 -28740 -38586 -40617 -47854 -31466 1526 -20807 137 15407 63883 84336
12017H4336m3093j01010j7754O0183k3m4190L058l2451L250P1926P890l529P326
$$ 84336 41243 -59767 -77521 -17338 -17361 -61551 -58493 -90944 -87694 -15768 -7878 -11407 -4081
12004d081m3525j5745l33L1942O0942j849O373m7465N451M1960j1657L8550R106
$$ -4081 -47606 -63351 -63684 -31742 29200 27351 33724 -13741 -8290 33670 22013 60563 69669
11991F9669m0014j4674J088m4152K1523J5770M1116j7638k1041K8317j4378j7225
$$ 69669 29655 14981 16069 -28083 -6560 9210 50326 32688 11647 39964 25586 8361
11979H361M8290l8431m3240m0449m2419N681P700J8950K3352N10K4985J7523r737
$$ 8361 56651 18220 -25020 -65469 -107888 -102207 -94507 -75557 -52205 -51695 -26710 -9187 -18924
11966a8924K1728q448k753J1838M4769J3830M433l2509J1109K7867l6503o4338
$$ -18924 2804 -5644 -8397 3441 48210 62040 66473 33964 45073 72940 36437 -27901
11954b7901l9988m056M6861L7660K5110l9161K1200P841K2427K9851p84q632M062
$$ -27901 -67889 -71945 -25084 12576 37686 -1475 19725 27566 49993 79844 79060 70428 74490
11941G4490P792J694r436n3874k5979p2262j5439K5078J6494J3174K2367K1958
$$ 74490 82282 83976 74540 20666 -5313 -77575 -93014 -67936 -51442 -38268 -15901 6057
11929F057k9967j2732L0343L0142k1140q433n0788K4791K9845J4043O4650l5558
$$ 6057 -23910 -36642 -6299 23843 2703 -5730 -56518 -31727 -1882 12161 76811 41253
11917D1253n1099L2165l3464l1758N0769P9399j8328l8028m220P6587J3318m6537
$$ 41253 -9846 22319 -11145 -42903 7866 87265 68937 30909 26689 103276 116594 70057
11905G0057m2203j4679J887J8914l3539m5542l8566r002l78k277j2735L1738O1411
$$ 70057 27854 13175 15062 33976 437 -45105 -83671 -92673 -93051 -95328 -108063 -76325 -14914
11892a4914j9500j1m9656O064j258N824j5954M0246O2672J080j1933l3557K2936
$$ -14914 -34414 -34425 -84081 -78017 -79275 -73451 -89405 -49159 13513 14593 2660 -30897 -7961
11879g961l0762K2425L3952k9220l6538O4421P3137Q406m7089P334M196m3565
$$ -7961 -38723 -16298 17654 -11566 -48104 16317 89454 97860 50771 58105 62301 18736
11867A8736p3680K9330L7698P003M182L2194l7661l9933K1066M2368J2041J6257
$$ 18736 -54944 -25614 12084 19087 23269 55463 17802 -22131 -1065 41303 53344 69601
11855F9601k8136k0295L24L0163N079j5390J313O4458m7569j1667J7191M499L002
$$ 69601 41465 21170 21494 51657 56736 41346 42659 107117 59548 47881 65072 69571 72573
11842G2573k6336K1512Q576K2931j5122k3836n7872m3619N13J3030P845l859k060
$$ 72573 46237 67749 76325 99256 84134 60298 2426 -41193 -40680 -27650 -19805 -23664 -25724
11829b5724k1174k2846j2004M6099L6135J5379l930j8684K8040l6387J8507j4598
$$ -25724 -46898 -69744 -81748 -35649 486 15865 11935 -6749 21291 -15096 3411 -11187
11817a1187L480j5919k4825n084J1017l1920M2847K9130l8522P716J4099j3685
$$ -11187 -7707 -23626 -48451 -53535 -42518 -74438 -31591 -2461 -40983 -33267 -19168 -32853
11805c2853P993j0288K9854Q488q3M3321J1274m1339m7512Q402L6392K8873k4276
$$ -32853 -24860 -35148 -5294 3194 3111 46432 57706 16367 -31145 -22743 13649 42522 18246
11792A8246o5015J0192K8749O283k275l385J0620Q62k0336M514K3109L8186k6765
$$ 18246 -46769 -36577 -7828 -1545 -3820 -7205 3415 4277 -16059 -11545 11564 49750 22985
11779B2985P012k6719r711j1331k5110L6174k651J6895k865k4516K288O566p222
$$ 22985 29997 3278 -6433 -17764 -42874 -6700 -9351 7544 4679 -19837 -17549 -10983 -18205
11766a8205k2697J8170L6298J1951j6927J093l0121k241J0089J5287J6188m4126
$$ -18205 -40902 -22732 13566 25517 8590 9683 -20438 -22679 -12590 2697 18885 -25241
11754b5241J6336K0088j8498J3459O7K021n5279j3013M9088K0547j6393l0208
$$ -25241 -8905 11183 -7315 6144 6211 8232 -47047 -60060 -10972 9575 -6818 -37026
11742c7026O60L9606j9054K1076K6325J9345L3494l4899n2323n6554m9271L3370
$$ -37026 -36366 3240 -15814 5262 31587 50932 84426 49527 -2796 -59350 -108621 -75251
11730g5251L8642K8689J9180j9627J310k8378L267N9691j4562l0977r904k4801
$$ -75251 -36609 -7920 11260 -8367 -7057 -35435 -32168 27523 12961 -18016 -27920 -52721
11718e2721N0107N7716L589J9092l376n2027o5949l1656K3678J8466k7049L3287
$$ -52721 -2614 55102 58691 77783 74407 22380 -43569 -75225 -51547 -33081 -60130 -26843
11706b6843P9953M7756l5619k7794m0917k6991L1750M3656j7017l5962K3582r447
$$ -26843 53110 100866 65247 37453 -3464 -30455 1295 44951 27934 -8028 15554 6107
11694F107q707m9197p821O4661J3936q686l2095p319M351O554J4089L8767K2632
$$ 6107 -2600 -51797 -59618 5043 18979 10293 -21802 -29121 -24770 -18216 -4127 34640 57272
11681E7272j341J558J1825k3816l0811K8582n900R584m748n8800n9904K6313K2624
$$ 57272 55931 57489 69314 45498 14687 43269 37369 46953 42205 -16595 -76499 -50186 -27562
11668b7562K2091n645J737J618J2232k3483k1907L1111j4750p742k1184j342n859
$$ -27562 -5471 -11116 -9379 -7761 4471 -19012 -40919 -9808 -24558 -32300 -53484 -54826 -60685
11655f0685q563j5835l4426J4893j418N2187l873J5149K2378K3499n9613m241
$$ -60685 -69248 -85083 -119509 -104616 -106034 -53847 -57720 -42571 -20193 3306 -56307 -60548
11643f0548M6521O922J7466j313k3525N4842J0144k3900p9790n4407k8733N4839
$$ -60548 -14027 -7105 10361 9048 -14477 40365 50509 26609 -53181 -107588 -136321 -81482
11631h1482J7067J8351M3849K835l0626K5593K1044l9693k8740j7933M906J3914
$$ -81482 -64415 -46064 -2215 620 -30006 -4413 16631 -23062 -51802 -69735 -64829 -50915
11619e0915N7574n787k3344L6930O6400l5233j6969j1383k5955m7058j2248k9761
$$ -50915 6659 872 -22472 14458 80858 45625 28656 17273 -8682 -55740 -67988 -97749
11607i7749M2508L1879Q631J3031L1800m0341p5215M8504M9945L1147k6061j8353
$$ -97749 -55241 -23362 -14731 -1700 30100 -10241 -85456 -36952 12993 44140 18079 -274
11595b74r546l8699k7581M3717L3634J5076j6615m136K9903J4432J1319Q536j8781
$$ -274 -9820 -48519 -76100 -32383 1251 16327 -288 -4424 25479 39911 51230 59766 40985
11582D0985K1853L8442o415m8117J5650J2264l2302p2526o0121m744O0991L9798
$$ 40985 62838 101280 94865 46748 62398 74662 42360 -30166 -90287 -95031 -34040 5758
11570E758k96j4498J0238K5187Q780J697l5662m210k60J4757J0259k065J0410
$$ 5758 5462 -9036 1202 26389 35169 36866 1204 -3006 -3266 11491 21750 19685 30095
11557C0095K0183L5105K0522m9478r0588l359o69k6465N0421J8057k0295k3712
$$ 30095 50278 85383 105905 56427 -34161 -37520 -38189 -64654 -14233 3824 -16471 -40183
11545d0183k4926l9582j5522L1552J9963J9144J5948j0563j0156K2108M1539L8958
$$ -40183 -65109 -104691 -120213 -88661 -68698 -49554 -33606 -44169 -54325 -32217 9322 48280
11533D8280l7943j7378R280l3925O1027O2892J3768l0727m2797n8655m8293K3599
$$ 48280 10337 -7041 2239 -31686 29341 92233 106001 75274 32477 -26178 -74471 -50872
11521e0872j7526O920q52J4385N0063L7646J3715J8435n776k456K7999j6615l26
$$ -50872 -68398 -61478 -62330 -47945 2118 39764 53479 71914 66138 63682 91681 75066 74740
11508G4740J0932J0274P480N161O653M1104j1144l0387m1739l4452R826N262J4679
$$ 74740 85672 95946 103426 108587 115240 156344 145200 114813 73074 38622 48448 53710 68389
11495F8389j4405n380n8518k6630l4737k0369J9288j9341l9381K1931J5337K8798
$$ 68389 53984 48604 -9914 -36544 -71281 -91650 -72362 -91703 -131084 -109153 -93816 -65018
11483f5018O4375K0867k3356m4912p272L909J5136k5029L2034P5737Qm1794m6106
$$ -65018 -643 20224 -3132 -48044 -55316 -51407 -36271 -61300 -29266 46471 46479 4685 -41421
11470d1421L0377m6882k0588L1044j3484k9044L8309J015M8210K9833J4467K155
$$ -41421 -11044 -57926 -78514 -47470 -60954 -89998 -51689 -50674 -2464 27369 41836 43991
11458D3991J3664m700n0057k3777J9549K7798j8884k0893J4659j5692j846l5426
$$ 43991 57655 52955 2898 -20879 -1330 26468 7584 -13309 1350 -14342 -16188 -51614
11446e1614M4161J0053j245k8000l9121o806L0983R053n8262K2713Q392r896J2082
$$ -51614 -7453 2600 1355 -26645 -65766 -72572 -41589 -32536 -90798 -68085 -59693 -69589 -57507
11433e7507J857K3020O849k2594l27J6031l049O842r234k3545n3193N2200J9242
$$ -57507 -55650 -32630 -25781 -48375 -48702 -32671 -35720 -28878 -38112 -61657 -114850 -62650 -43408
11420d3408L2934M9021O317m4759L5031K8548j1247M657q014n3769Q822r336j312
$$ -43408 -10474 38547 44864 105 35136 63684 52437 57094 49080 -4689 4133 -5203 -6515
11407f515p2123K430J7590m477L7210L14j4598m909j3115L5795N0069J5651l5549
$$ -6515 -78638 -76208 -58618 -63095 -25885 -25571 -40169 -45078 -58193 -22398 27671 43322 7773
11394G773m1376p78L1211l6486K0647M363J8596J4578j1850J5336j2031l3478
$$ 7773 -33603 -34381 -3170 -39656 -19009 -14646 3950 18528 6678 22014 9983 -23495
11382b3495J7262J9040j9058n934K8489J8114r574n5285n104K019q342r331K3956
$$ -23495 -6233 12807 -6251 -12185 16304 34418 24844 -30441 -35545 -33526 -41868 -51199 -27243
11369b7243Q325J9553N5273j6934j095k8987l0089m3313M8149P1960o660j1306
$$ -27243 -18918 635 55908 38974 37879 8892 -21197 -64510 -16361 55599 48939 37633
11357C7633r336Q167l1782l3837l8148K5675L8725o178n5163k9906O835K6055
$$ 37633 28297 36464 4682 -29155 -67303 -41628 -2903 -9081 -64244 -94150 -87315 -61260
11345f1260J2451J2510N000j4846K1111o054J4180K3901n9132l4002l655K5035
$$ -61260 -48809 -36299 -31299 -46145 -25034 -31088 -16908 6993 -52139 -86141 -89796 -64761
11333f4761M2292N3305M8253k8327r977k5519K5264n320m6275j3447L0153j210
$$ -64761 -22469 30836 79089 50762 40785 15266 40530 35210 -11065 -24512 5641 4431
11321D431j4019j3012m0648l2382M3119M1950k196l2157j0786k191k8009N154
$$ 4431 -9588 -22600 -63248 -95630 -52511 -10561 -12757 -44914 -55700 -57891 -85900 -80746
11309h0746j4070M1798k3672k1604n587N1199N1919J8515J4604m9183j5317l0098
$$ -80746 -94816 -53018 -76690 -98294 -103881 -52682 -763 17752 32356 -16827 -32144 -62242
11297f2242j7115p907K5992j2841L203K5581R132k828l2518L026m391P7465N4937
$$ -62242 -79357 -87264 -61272 -74113 -70910 -45329 -36197 -39025 -71543 -68517 -72908 4557 59494
11284E9494n0447p945l4960M709p527p192r736j5979n4281Q8779N7004j9410L380
$$ 59494 9047 1102 -33858 -29149 -36676 -43868 -53604 -69583 -123864 -35085 21919 2509 5889
11271E889j812M8187J9886N90J1051L8041o2649m2119j8557j2052K0477j2751
$$ 5889 4077 52264 72150 72740 83791 121832 59183 17064 -1493 -13545 6932 -5819
11259e819m4458J1505N0495L0918j2149o1800K6090k7327l2567k075k5693L2914
$$ -5819 -50277 -38772 11723 42641 30492 -31308 -5218 -32545 -65112 -67187 -92880 -59966
11247e9966K8656o925L1634M5459k7805k4895K1121K5257k6533k6196n8309j54
$$ -59966 -31310 -38235 -6601 38858 11053 -13842 7279 32536 6003 -20193 -78502 -78656
11235g8656k1643K7696N4316p052j2322l8678j3044J5183J4714K6710m1421J9205
$$ -78656 -100299 -72603 -18287 -25339 -37661 -76339 -89383 -74200 -59486 -32776 -74197 -54992
11223e4992q223k473k3970j5819L6731M3469K5421N272J6931k4971l4212J7821
$$ -54992 -63215 -65688 -89658 -105477 -68746 -25277 144 5416 22347 -2624 -36836 -19015
11211a9015M4699K7629L137J9037j755m3225j2697K3172m319j6942m8651j745
$$ -19015 25684 53313 56450 75487 73732 30507 17810 40982 36663 19721 -28930 -30675
11199c0675M190o6918M215M3069M1816L274j3111l2388J4635L7342k0485p026
$$ -30675 -26485 -93403 -89188 -46119 -4303 -1029 -14140 -46528 -31893 5449 -15036 -22062
11187b2062m810j561N7823J5381j6951o8193k09J0233j1991m7074k3412R198n403
$$ -22062 -26872 -28433 29390 44771 27820 -40373 -40582 -30349 -42340 -89414 -112826 -103628 -109031
11174a09031L9558j5946N952j1985J8538J27951J3352m1500j7991j7695M2860
$$ -109031 -69473 -85419 -79467 -91452 -72914 55037 68389 26889 8898 -8797 34063
11163C4063J0317R60j1373m8219o5305M6906L5176N037J0213J9460L9393n5094
$$ 34063 44380 45340 33967 -14252 -79557 -32651 2525 7562 17775 37235 76628 21534
11151B1534n3168K0487O264K1150j9226l973m3752L3901O7764J6716k3442K0258
$$ 21534 -31634 -11147 -4883 16267 -2959 -6932 -50684 -16783 50981 67697 44255 64513
11139F4513J386J3885k3098p484R605l3721j0424Q060r382j7521j7709K1623k5269
$$ 64513 65899 79784 56686 49202 58807 25086 14662 22722 13340 -4181 -21890 -267 -25536
11126b5536J4597k003N4789K8101l4829j2919n8893N0K2211k091l135M711k6192
$$ -25536 -10939 -12942 41847 69948 35119 22200 -36693 -36643 -14432 -16523 -19658 -14947 -41139
11113d1139L6171J0201n3948l4228J1732J0642K3544l3361J0299K0873k3113L7177
$$ -41139 -4968 5233 -48715 -82943 -71211 -60569 -37025 -70386 -60087 -39214 -62327 -25150
11101b5150K2687j1378q0330Q747M6789J955m383L0121j1022j1726K0049J9551
$$ -25150 -2463 -13841 -94171 -85424 -38635 -36680 -41063 -10942 -21964 -33690 -13641 5910
11089E910k3111l4361l8842J2584L0431j1744N532J7051L2725k4955k247k323
$$ 5910 -17201 -51562 -90404 -77820 -47389 -59133 -53601 -36550 -3825 -28780 -31027 -33350
11077c3350P850L9606K8037J9583K0237l3844l1343k6563l5507k109n653M8365
$$ -33350 -25500 14106 42143 61726 81963 48119 16776 -9787 -45294 -47403 -53056 -4691
11065d691K4162L2569j6889l4983j7356J9231K6467k5997m4414j3249m0436L486
$$ -4691 19471 52040 35151 168 -17188 2043 28510 2513 -41901 -55150 -95586 -92100
11053i2100M1889L5852M3390n2218q5489n410L33L0970M7241P3307j174j9073
$$ -92100 -50211 -14359 29031 -23187 -108676 -114086 -113753 -82783 -35542 37765 36591 17518
11041A7518J5156q200k2360M8876j4795k0438m833J3432m9048j5211j1380K0449
$$ 17518 32674 24474 2114 50990 36195 15757 10924 24356 -24692 -39903 -51283 -30834
11029c0834K2996m1384k2925k377J0849O3746R0250j2400l5328j396J9038j9383
$$ -30834 -7838 -49222 -72147 -74524 -63675 71 90321 77921 42593 41197 60235 40852
11017D0852j8340J9488K3439L5401M3710N4803L2758L0555j55M9947J55078K29910
$$ 40852 22512 42000 65439 100840 144550 199353 232111 262666 262511 312458 467536 697446
11005F97446R4835j37011k43696j63586j07869q9558r0796L9379p154o895j1512
$$ 697446 792281 655270 411574 247988 140119 50561 -40235 -856 -8010 -14905 -26417
10994b6417K9471J3212m447j3231l7834j8193o761J5275R10J1045k0042m5894
$$ -26417 3054 16266 11819 -1412 -39246 -57439 -64200 -48925 -48015 -36970 -57012 -102906
10982a02906k1512o059J3941L0888J6788l2601K8690K5966J5914j5899M950N0723
$$ -102906 -124418 -130477 -116536 -85648 -68860 -101461 -72771 -46805 -30891 -46790 -41840 8883
10970H883p965j4364j2303n2760l6906L0084O852l766K805l4107p907J3614m1950
$$ 8883 918 -13446 -25749 -78509 -115415 -85331 -78479 -82245 -79440 -113547 -121454 -107840 -149790
10957a49790L502N0665K2701j077O5782l14m7827o073O8165L1669o2581j9337
$$ -149790 -146288 -95623 -72922 -73999 -8217 -8531 -56358 -62431 5734 37403 -25178 -44515
10945d4515K2322J1417N973R411o471n742l0656J4943K4673k8198k8234k1109
$$ -44515 -22193 -10776 -4803 4608 -1863 -7605 -38261 -23318 1355 -26843 -55077 -76186
10933g6186J6982m563L4047J1177J4070k1121J6449K9248m7251N717n498j984
$$ -76186 -59204 -63767 -29720 -18543 -4473 -25594 -9145 20103 -27148 -21431 -26929 -28913
10921b8913l1931q510Q5995J7143k4935J5735M277O66n705M6596K2163k2887K9483
$$ -28913 -60844 -69354 16641 33784 8849 24584 28861 29527 23822 70418 92581 69694 99177
10908I9177q713k2184J8766j6127l0925o6857n0276J8921O5740j3161j6046m962
$$ 99177 90464 68280 87046 70919 39994 -26863 -77139 -58218 7522 -5639 -21685 -26647
10896b6647k216j3658j6132L7136O1677K3927J1027K889j1531k5503j3855k2267
$$ -26647 -28863 -42521 -58653 -21517 40160 64087 75114 78003 66472 40969 27114 4847
10884D847l7499j1842M0050M6180j7640l819j416j2911L2284R359n5384j3792
$$ 4847 -32652 -44494 -4444 41736 24096 20277 18861 5950 38234 47593 -7791 -21583
10872b1583n287J7588k8390m6448L0624P5197N0128K2857M890k9100l0146k1072
$$ -21583 -26870 -9282 -37672 -84120 -53496 21701 71829 94686 99576 70476 40330 19258
10860A9258L906M1113K2055J1250l4764o148j785l1966l6666p79J5971k5801K1661
$$ 19258 23164 64277 86332 97582 62818 56670 54885 22919 -13747 -14526 1445 -24356 -2695
10847b695k4399k8736K4701L0243M010N281P716n8193j4426k5279N1577J2537
$$ -2695 -27094 -55830 -31129 -886 3124 8405 16121 -42072 -56498 -81777 -30200 -17663
10835a7663k8435Q887L1670L8597j724q034p526k4156p546Q8372o533m3336J1526
$$ -17663 -46098 -37211 -5541 33056 31332 23298 15772 -8384 -15930 72442 65909 22573 34099
10822C4099J3871m569m4634Q878P882k6060J5135J7826J1238L3299R778j897j3689
$$ 34099 47970 43401 -1233 7645 15527 -10533 4602 22428 33666 66965 76743 74846 61157
10809F1157j7685m0369l6896K9158L2700N6319o4581p5334l4688K2753r917j4304
$$ 61157 43472 3103 -33793 -4635 28065 84384 19803 -55531 -90219 -67466 -77383 -91687
10797i1687L5496O4644K6469K6848k5862j6686L3764k3437O21k6181l7890L3947
$$ -91687 -56191 8453 34922 61770 35908 19222 52986 29549 30170 3989 -33901 46
10785D6K7686k2604N7816K9624k9398K523m425l9955q198l3138q727J3543k6241
$$ 46 27732 5128 62944 92568 63170 65693 61268 21313 13115 -20023 -28750 -15207 -41448
10772d1448J256j008j9131O286J9691Q71l0657l3157N6722K1847M958M5779M6594
$$ -41448 -40192 -41200 -60331 -54045 -34354 -33483 -64140 -97297 -40575 -18728 -13770 32009 78603
10759G8603k446l0772l3693L9093k807K1607J0793j5547o0333k0473K8217J0400
$$ 78603 76157 45385 11692 50785 47978 69585 80378 64831 4498 -15975 12242 22642
10747B2642K7271J1418l2461q891K0898k8731j0362N0463j17o935m94K9971o4662
$$ 22642 49913 61331 28870 19979 40877 12146 1784 52247 52130 45195 44701 74672 10010
10734A0010m6368k6837L1377M1177l9276l5886R743L1575O4092L0966n991k6344
$$ 10010 -36358 -63195 -31818 9359 -29917 -65803 -56060 -24485 39607 70573 64582 38238
10722C8238K652Q670m664k4607k574q288l5518j2008k2393P769l968K9418R021
$$ 38238 40890 49560 44896 20289 17715 9427 -26091 -38099 -60492 -52723 -56691 -27273 -18252
10709a8252p654j0772j312j3712q075n0479l9914N3211N2950q659K0275K2766
$$ -18252 -25906 -36678 -37990 -51702 -59777 -110256 -150170 -96959 -44009 -52668 -32393 -9627
10697i627M0936j5565j4866L2763M5758k71L6642j5202N230k0743l19N057k8042
$$ -9627 31309 15744 878 33641 79399 79128 115770 100568 105798 85055 84736 89793 61751
10684F1751o682J4517l4230k7912p2729j1313P1184O2632J7962l1902o6288k9881
$$ 61751 55069 69586 35356 7444 -65285 -76598 -5414 57218 75180 43278 -23010 -52891
10672e2891J8122O923j4647O917M8320O952J3006m4774m59M0745M6295K865m6657
$$ -52891 -34769 -27846 -42493 -35576 12744 19696 32702 -12072 -12531 28214 74509 77374 30717
10659C0717n5503J1033L9930n231k0760J7185k8557n1630L318Q1245K2683N665
$$ 30717 -24786 -13753 26177 20946 186 17371 -11186 -62816 -59498 21747 44430 50095
10647E0095J4245k220j9291r796J5790j1297l9416o174l3922K005P758Q954j8544
$$ 50095 64340 62120 42829 33033 48823 37526 -1890 -8064 -41986 -39981 -32223 -23269 -41813
10634d1813k4477K8568N8626J4389j9252M9794p788l2435N542j8096L490L8047
$$ -41813 -66290 -37722 20904 35293 16041 65835 58047 25612 31154 13058 16548 54595
10622E4595p939J270n2574k4816N4156M953N362K3666J6434J1781n9302k6797
$$ 54595 46656 47926 -4648 -29464 24692 29645 35007 58673 75107 86888 27586 789
10610G89r807J6867l240O287J3383j1633n8090p372Q736o988j7821J099r51L3314
$$ 789 -9018 7849 4609 10896 24279 12646 -45444 -52816 -44080 -51068 -68889 -67790 -68741 -35427
10596c5427K0855J5489r703m6246k874L4486L3546l3411J1172K5835P076o782
$$ -35427 -14572 917 -8786 -55032 -57906 -23420 10126 -23285 -12113 13722 20798 14016
10584A4016l8791j5324l07M5684k4978m0988K2005N7600j8137k8222k0374L6887
$$ 14016 -24775 -40099 -40406 5278 -19700 -60688 -38683 18917 780 -27442 -47816 -10929
10572a0929J6987M601k6612L7769N3418N409j0768n2473L5275j4279J4041L5975
$$ -10929 6058 10659 -15953 21816 75234 80643 69875 17402 52677 38398 52439 88414
10560H8414k7954m0960k8727P053L4300L0199j6397k5925K024k5916m93K879k3343
$$ 88414 60460 19500 -9227 -2174 32126 62325 45928 20003 22027 -3889 -4382 -1503 -24846
10547b4846J6472k552Q470m188J402m966J6412K5597j3924N543p945l7647j4605
$$ -24846 -8374 -10926 -2456 -6644 -5242 -10208 6204 31801 17877 23420 15475 -22172 -36777
10534c6777k960J1798Q538J6190J2499l7250j2723k1704J0483M5986o202M8474
$$ -36777 -39737 -27939 -19401 -3211 9288 -27962 -40685 -62389 -51906 -5920 -12122 36352
10522C6352O101j3078J5130L8090J463m8857m7823J3010J8198O9562K3270J5811
$$ 36352 42453 29375 44505 82595 84058 35201 -12622 388 18586 88148 111418 127229
10510A27229k6783m4855R556j85n0639k3279l410k1105k4006R8579L4498k2500
$$ 127229 100446 55591 65147 64962 14323 -8956 -12366 -33471 -57477 41102 75600 53100
10498E3100n558O647l6270n0199m1475P7743L5628l5110j1176n248n983k8960
$$ 53100 47542 54189 17919 -32280 -73755 3988 39616 4506 -6670 -11918 -17901 -46861
10486d6861k801j5303j8520J6383J971o74Q367N893J2006l7315O395L8500j0773
$$ -46861 -49662 -64965 -83485 -67102 -65131 -65805 -57438 -51545 -39539 -76854 -70459 -31959 -42732
10473d2732r471l775K9535P417J8086j1031K4462j4746N0678J6861m598n593j7741
$$ -42732 -52203 -55978 -26443 -19026 -940 -11971 12491 -2255 48423 65284 60686 55093 37352
10460C7352n452q375q816j2472m9763M8575M3306k2091K7241K590N835k5863J5772
$$ 37352 31900 23525 14709 2237 -47526 1049 44355 22264 49505 52095 57930 32067 47839
10447D7839k1231k2165j3360p103n093R937N6360k4451l279K2758M134K373n282
$$ 47839 26608 4443 -8917 -16020 -21113 -11176 45184 20733 17454 40212 44346 46719 41437
10434D1437k0391k96m20j1636R111L4491m1067j6089n071Q314J7008P31j2144
$$ 41437 21046 20750 20330 8694 17805 52296 11229 -4860 -9931 -1617 15391 16122 3978
10421C978l1914K1577k44J0252k743n2739m6146J0884L9906m531N3634O8096k4814
$$ 3978 -27936 -6359 -6603 3649 906 -51833 -97979 -87095 -47189 -51720 1914 70010 45196
10408D5196l5031M4795N1892J8832k5786l6302J3400l4154p172J3841o98O911
$$ 45196 10165 54960 106852 125684 99898 63596 76996 42842 35670 49511 48813 55724
10396E5724j5117l3238j6833j8079L391J7611j0476n3395L551K7803J3283L673
$$ 55724 40607 7369 -9464 -27543 -24152 -6541 -17017 -70412 -66861 -39058 -25775 -22102
10384b2102R29l2474k2716J8885M9237L7789K2687J4099o3390k1129M8039K0722
$$ -22102 -21173 -53647 -76363 -57478 -8241 29548 52235 66334 2944 -18185 29854 50576
10372E0576j3306l2520l3035M575K3926O4670n2697n3006l0634k8353L8037O1413
$$ 50576 37270 4750 -28285 -23710 216 64886 12189 -40817 -71451 -99804 -61767 -354
10360c54k0348j1218M866R844J6136N667K6072l712r354j4109k0441n2193m6314
$$ -354 -20702 -31920 -27054 -17210 -1074 4593 30665 26953 17599 3490 -16951 -69144 -115458
10347a15458K3586J8387M9818M4974K9031o2402n2110L633J9644K6386J397N6719
$$ -115458 -91872 -73485 -23667 21307 50338 -12064 -64174 -60541 -40897 -14511 -13114 43605
10335D3605L0375o8494l1320k480J0525Q328K9222K1585j5531m0730j1431n476
$$ 43605 73980 5486 -25834 -28314 -17789 -9461 19761 41346 25815 -14915 -26346 -31822
10323c1822p833M8116r92N560K6536k6482l7129M0504L9041N752r749l0354L5050
$$ -31822 -39655 8461 7469 13029 39565 13083 -24046 16458 55499 61251 51502 21148 56198
10310E6198L2377j0482l8461k7465j7365l1701k5878p109n2143j2023Q8044N6950
$$ 56198 88575 78093 39632 12167 -5198 -36899 -62777 -69886 -122029 -134052 -46008 10942
10298A0942L6909J8756l1530j9694o2637j3662j3629o956K355R132L174N5854
$$ 10942 47851 66607 35077 15383 -47254 -60916 -74545 -81501 -79146 -70014 -66840 -10986
10286a0986K4569n9019j4277J802M0602L5881N118l5637P616p386l7413M9480
$$ -10986 13583 -45436 -59713 -57911 -17309 18572 23690 -11947 -4331 -11717 -49130 350
10274C50J8114K8061j2623k9270j2307k5941M8337J5407M8365l0825k1566o4049
$$ 350 18464 46525 33902 4632 -7675 -33616 14721 30128 78493 47668 26102 -37947
10262c7947k4712k834K3784K0031r878K8183L5856K0836K4286L0935K0930p5566
$$ -37947 -62659 -65493 -41709 -21678 -31556 -3373 32483 53319 77605 108540 129470 53904
10250E3904k1563k4212M50J0938m5144o796K8106j5044K4094K597k6789n8052
$$ 53904 32341 8129 8579 19517 -25627 -32423 -4317 -19361 4733 7330 -19459 -77511
10238g7511M2157O5594N786k9365o201K6766n1076m8314j2875M5604q890l513
$$ -77511 -35354 30240 36026 6661 460 27226 -23850 -72164 -85039 -39435 -48325 -51838
10226e1838J3439J1567M5735k1522l7109J9627L2123k0728j8092j4518k1221P20
$$ -51838 -38399 -26832 18903 -2619 -39728 -20101 12022 -8706 -26798 -41316 -62537 -61817
10214f1817j0388K5547K2215k2160J8129O0124j12K4076o6766j4632N9605N804
$$ -61817 -72205 -46658 -24443 -46603 -28474 31650 31538 55614 -11152 -25784 33821 39625
10202C9625k6131j1538m021K2976l0859j7201k9327L191k2150n281L4092R389
$$ 39625 13494 1956 -2065 20911 -9948 -27149 -56476 -53285 -75435 -80716 -46624 -37235
10190c7235N9934J4274m8697j2434J7664j93m8785J7359J0461J6971K4268N0364
$$ -37235 22699 36973 -11724 -24158 -6494 -6687 -55472 -38113 -27652 -10681 13587 63951
10178F3951K7691n7332j3421J4322J569j391J2768R745q327J583l8797n9403q330
$$ 63951 91642 34310 20889 35211 36780 35389 48157 57902 49575 51158 12361 -47042 -55372
10165e5372K7104m326j3282l039l1198J2054P4004j9976K0028K2266M6757k3721
$$ -55372 -28268 -32594 -45876 -48915 -80113 -68059 5945 -14031 5997 28263 75020 51299
10153E1299J0594K0062j6997j3550k6646m2102k019o361J3462l3889J2571K5368
$$ 51299 61893 81955 64958 51408 24762 -17340 -19359 -25720 -12258 -46147 -33576 -8208
10141h208L0381l5104o0676L558O877j0435M0545J4912k7455j604K3082j854L8152
$$ -8208 22173 -12931 -73607 -70049 -63172 -73607 -33062 -18150 -45605 -47209 -24127 -25981 12171
10128A2171L0194j0945K6578k5803l6226M6965J3563r902j9704l9341J0932j0191
$$ 12171 42365 31420 57998 32195 -4031 42934 56497 46595 26891 -12450 -1518 -11709
10116a1709k052M3851J1595o6749n6353J9905K0016J5341K2851n162j8155K6379
$$ -11709 -13761 30090 41685 -25064 -81417 -61512 -41496 -26155 -3304 -8466 -26621 -242
10104b42P637L3344K4088n9837l8727L6326M0268m1139n6695l6393j8729L2894
$$ -242 7395 40739 64827 4990 -33737 2589 42857 1718 -54977 -91370 -110099 -77205
10092g7205J9722K4585L1857r680k5908N565K7517m400L539L4643k863j5523J9549
$$ -77205 -57483 -32898 -1041 -10721 -36629 -31064 -3547 -7947 -4408 30235 27372 11849 31398
10079C1398j7863K2182J635l978j4208j9415m3331j3260L8912M86j2573K9943
$$ 31398 13535 35717 37352 33374 19166 -249 -43580 -56840 -17928 -17442 -30015 -72
10067g2K6041L1564q17L093n544j8212j1167m6345m6538n2044K0576L5779J4248
$$ -72 25969 57533 56716 59809 54265 36053 24886 -21459 -67997 -120041 -99465 -63686 -49438
10054d9438m2025M2970P5524M753k0472m5741q063j559J8084K2356N237K0003
$$ -49438 -91463 -48493 27031 31784 11312 -34429 -42492 -44051 -25967 -3611 1626 21629
10042B1629m2664M544K9136m842m2507K4766P578L1700j3044k7897q8695j2367
$$ 21629 -21035 -16491 12645 7803 -34704 -9938 -2360 29340 16296 -11601 -100296 -112663
10030a12663J0727j0702P7892J1040L6750j1060m772p882n137o6991m7637Q3419
$$ -112663 -101936 -112638 -34746 -23706 13044 1984 -2788 -10670 -15807 -82798 -130435 -47016
10018d7016M7051J1592o885j7483j6183K9231K8017J1770k9322J9706r051q2472
$$ -47016 35 11627 4742 -12741 -28924 307 28324 40094 10772 30478 21427 -61045
10006f1045p8386M5715M0045J483L849L6368K1506J503j5560J4963k3438n9025
$$ -61045 -139431 -93716 -53671 -52188 -48339 -11971 9535 11038 -4522 10441 -12997 -72022
9994g2022L2446K815M455q192q329j8644j9602o143L0352N6493o111J1635K5901
$$ -72022 -39576 -36761 -32306 -40498 -48827 -67471 -87073 -93216 -62864 -6371 -12482 -847 25054
9981B5054k8178j7650J9089K8515J4275J4444L658o3270n935J8700L3816K9201
$$ 25054 -3124 -20774 -1685 26830 41105 55549 59207 -4063 -9998 8702 42518 71719
9969G1719r491j0084k5410j0028Q101k8799J6475O016n0080K793L108m5390R188
$$ 71719 62228 52144 26734 16706 24807 -3992 12483 18499 -31581 -28788 -25680 -71070 -61882
9956f1882M4999j1995J027l6768l0184N1896N1954k6581n2165K5879P7138J4147
$$ -61882 -16883 -28878 -27851 -64619 -94803 -42907 9047 -17534 -69699 -43820 33318 47465
9944D7465l9964k9332J3608L793m5176l0585N2525N8285O195K0478j0223l4787
$$ 47465 7501 -21831 -8223 -4430 -49606 -80191 -27666 30619 36814 57292 47069 12282
9932A2282l6719K186M958j7465R470L4690J4611m597K9992m1239l8651m3726L0076
$$ 12282 -24437 -22251 -17293 -34758 -25288 9402 24013 19416 49408 8169 -30482 -74208 -44132
9919d4132L2727m4372j8759k4086L0119L1718P4382P609m0057l6905Q130L2121
$$ -44132 -11405 -55777 -74536 -98622 -68503 -36785 37597 45206 5149 -31756 -23626 8495
9907H495j6912l8550K250K6273K7106J1053l5299p9473K7088J1253m7965K6396
$$ 8495 -8417 -46967 -44717 -18444 8662 19715 -15584 -95057 -67969 -56716 -104681 -78285
9895g8285L7706j9604M1662M3937N3068Q216J5750m6572j1334j599J4002j5031
$$ -78285 -40579 -60183 -18521 25416 78484 86700 102450 55878 44544 42945 56947 41916
9883D1916K2997J6401l9220J267j4844j7056J4350j7038j1424J9452M0268K2473
$$ 41916 64913 81314 42094 43361 28517 11461 25811 8773 -2651 16801 57069 79542
9871G9542k6765k2653j6315O5092j6517o6970j0177O2076J0893m9234k0009J6359
$$ 79542 52777 30124 13809 78901 62384 -4586 -14763 47313 58206 8972 -11037 5322
9859E322P6665L2329p67J7202n102L631j7317m5O4713O2533J07061K74380K88326
$$ 5322 81987 114316 113549 130751 125649 129280 111963 111918 176631 239164 346225 620605 908931
9846I08931K31711K7239k07285l63943k43560j46885q0183l0473k6441l1788m1666
$$ 908931 1140642 1167881 960596 596653 353093 206208 126025 95552 69111 37323 -4343
9835d343j146M9024L2436l663j7324n0447J8648L0106r839j0366k4225m5113l4221
$$ -4343 -5489 43535 75971 72308 54984 4537 23185 53291 43452 33086 8861 -36252 -70473
9822g0473K088r432J5208K7339k5816J0074R7217J4312J00k0426n2081p158O224
$$ -70473 -68385 -77817 -62609 -35270 -61086 -51012 46205 60517 60617 40191 -11890 -19048 -12824
9809a2824K1905J3413k0597O618N7574k3580m4543m797M397l2186L7757R45j7666
$$ -12824 9081 22494 1897 8515 66089 42509 -2034 -6831 -2434 -34620 3137 4082 -13584
9796a3584n79j4611K7127L5271k2759l6317J2373O6803N1833J8504n7923k4519
$$ -13584 -14163 -28774 -1647 33624 10865 -25452 -13079 53724 105557 124061 66138 41619
9784D1619l0235l5809k8455l303J0011L4415J8640J9387Q44r44M2874J3912l0346
$$ 41619 11384 -24425 -52880 -56183 -46172 -11757 6883 26270 27114 26170 69044 82956 52610
9771E2610k2269k5817j9301p477P694J8312q363n5035n8323R8806M4176j0002
$$ 52610 30341 4524 -14777 -22254 -14560 3752 -4611 -59646 -117969 -19163 25013 15011
9759A5011N520m3768o6860K5220N1459k516k9918K1219L646R444K545J4006j3068
$$ 15011 20531 -23237 -90097 -64877 -13418 -15934 -45852 -24633 -20987 -11543 -8998 5008 -8060
9746h060m3373q52N5443M5333L72m7830L2675M6382l2068M571M230m0277l3528
$$ -8060 -51433 -52285 3158 48491 48863 1033 33708 80090 48022 52593 56823 16546 -16982
9733a6982L7739J1399K2819n5445m4271M0084o5708m1837J3805K1938L2932M9572
$$ -16982 20757 32156 54975 -470 -44741 -4657 -70365 -112202 -98397 -76459 -43527 6045
9721F045m9555j6187K3950J6320L8793j6286o803j8489k5247n988K9009o51o94
$$ 6045 -43510 -59697 -35747 -19427 19366 3080 -3723 -22212 -47459 -53447 -24438 -25089 -25783
9708b5783K0140K0731J8343P579K8874k1645l7947M9792l636R473n542k7424K4088
$$ -25783 -5643 15088 33431 41010 69884 48239 10292 60084 56448 65921 60379 32955 57043
9695E7043J4263l3615J9365J3409l4204l3842k2930Q719k3500k6354K400j6921
$$ 57043 71306 37691 57056 70465 36261 2419 -20511 -11792 -35292 -61646 -59246 -76167
9683g6167J2417l2099K7207M5175K3980K3615k7194k5865J2817r548K0494K9597
$$ -76167 -63750 -95849 -68642 -23467 513 24128 -3066 -28931 -16114 -25662 -5168 24429
9671B4429k7342k5950n415J2644P592M527o5376n1640J5498M4364M211K4854M8787
$$ 24429 -2913 -28863 -34278 -21634 -14042 -9515 -74891 -126531 -111033 -66669 -62458 -37604 11183
9658A1183J9923j8840k5432j6377P1048J8013l7328k3884j0801k1221J8206k5987
$$ 11183 31106 12266 -13166 -29543 41505 59518 22190 -1694 -12495 -33716 -15510 -41497
9646d1497J571P52j3984J5712k4906M5464K3119p461k1473R762l4147o4148m0256
$$ -41497 -39926 -39174 -53158 -37446 -62352 -16888 6231 -1230 -22703 -12941 -47088 -111236 -151492
9633a51492K2150N9674K315K9557N425P327m4827m2184K5332O5105O839j9772
$$ -151492 -129342 -69668 -67353 -37796 -32371 -25044 -69871 -112055 -86723 -21618 -14779 -34551
9621c4551M3868J5268M1929K6503l2120L2453n2605l8629K51J2685l4713j2721
$$ -34551 9317 24585 66514 93017 60897 93350 40745 2116 2367 15052 -19661 -32382
9609c2382L4769j1189l6736j8017J0803k2539K562M6191K1345j578l191P229l6021
$$ -32382 2387 -8802 -45538 -63555 -52752 -75291 -72729 -26538 -5193 -6771 -9962 -2733 -38754
9596c8754l9904K4044O4399L0592j8840k7651n169J511l7644j266j2417k1314
$$ -38754 -78658 -54614 9785 40377 21537 -6114 -11283 -9772 -47416 -48682 -61099 -82413
9584h2413L7586M3569K4779l197k0238k8577J1718K2649K2664p790J2695J5253
$$ -82413 -44827 -1258 23521 20324 86 -28491 -16773 5876 28540 20750 33445 48698
9572D8698o4143j8153k102l682K3721K4401N640K480m841K7267k9268l1260M087
$$ 48698 -15445 -33598 -35700 -39382 -15661 8740 14380 16860 12019 39286 10018 -21242 -17155
9559a7155K7085K118R293q739o1562l1845P4532L2808m3433n3334l1648L7055
$$ -17155 9930 12048 21341 12602 -48960 -80805 -6273 26535 -16898 -70232 -101880 -64825
9547f4825L1335L5519J2482Q265m6402n0417J2543m5125N3870L3015l645m9588
$$ -64825 -33490 2029 14511 22776 -23626 -74043 -61500 -106625 -52755 -19740 -23385 -72973
9535g2973J4249l951K3600O9906J6400n0746j6398K8697n6873k4245N3744K9257
$$ -72973 -58724 -62675 -39075 30831 47231 -3515 -19913 8784 -48089 -72334 -18590 10667
9523A0667j3202K7237j6471J4235J0715j6787J979k759j6846j0260j6472O93K4264
$$ 10667 -2535 24702 8231 22466 33181 16394 18373 15614 -1232 -11492 -27964 -27271 -3007
9510c007l8034j0543j4553j6569L8752J5551l3801J2855L7690N3687j0458l9181
$$ -3007 -41041 -51584 -66137 -82706 -43954 -28403 -62204 -49349 -11659 42028 31570 -7611
9498g611l1661j7348N353k301J02O25j5635J3443N0350K829j9170j5428k825K6064
$$ -7611 -39272 -56620 -51267 -53568 -53466 -52841 -68476 -55033 -4683 -1854 -21024 -36452 -39277 -13213
9484a3213o47l5592Q173K5232n0468j7177M7491N9934O595K0050l8367j4900N183
$$ -13213 -13860 -49452 -41279 -16047 -66515 -83692 -36201 23733 30328 50378 12011 -2889 2294
9471B294J7844N9818K4319l7017o7930l7754J7065l0501k5085J0341L3898P1351
$$ 2294 20138 79956 104275 67258 -672 -38426 -21361 -51862 -76947 -66606 -32708 38643
9459C8643K001p0081p1285N1101P3801j8799J348J0347r513k3985j4749K0776
$$ 38643 40644 -29437 -100722 -49621 24180 5381 6729 17076 7563 -16422 -31171 -10395
9447a0395j3669k1837j5843j5019L7438N5152J7772l1340l3578l1360K6046O4839
$$ -10395 -24064 -45901 -61744 -76763 -39325 15827 33599 2259 -31319 -62679 -36633 28206
9435B8206P673J9849j4652l1802j6286n5132l6804K5269O2170J8682m0751k8843
$$ 28206 35879 55728 41076 9274 -7012 -62144 -98948 -73679 -11509 7173 -33578 -62421
9423f2421J4951N7134J6968l9817l8197Q401L9045L7943j4230n2632n3210J9556
$$ -62421 -47470 9664 26632 -13185 -51382 -42981 -3936 34007 19777 -32855 -86065 -66509
9411f6509P9895L5965r294j3435j899n5650l2325N3438j7880L7593M08q933l9611
$$ -66509 13386 49351 40057 26622 24723 -30927 -63252 -9814 -27694 9899 10307 1374 -38237
9398c8237K6781j7637l1157L9393M762j5032p347K551J8217J066L5781P2851o2135
$$ -38237 -11456 -29093 -60250 -20857 -16095 -31127 -38474 -35923 -17706 -16640 19141 91992 29857
9385B9857m2764j4114K2467R7882P883l6668p0965m8455K4174q267k7649K4851
$$ 29857 -12907 -27021 -4554 93328 101211 64543 -6422 -54877 -30703 -38970 -66619 -41768
9373d1768J5630m2212l7386K4509K1578K3318O179N0867J4670Q385m429n4755
$$ -41768 -26138 -68350 -105736 -81227 -59649 -36331 -30152 20715 35385 43770 39341 -15414
9361a5414o461M4599J7414k3956n4824J2563M8750j2529m0842O334R111o05P265
$$ -15414 -21875 22724 40138 16182 -38642 -26079 22671 10142 -30700 -24366 -15255 -15860 -8595
9348h595j0626J4732j739J1335P049J2227J4L154m0567n872k3576J7599m549L7854
$$ -8595 -19221 -4489 -6228 5107 12156 24383 24397 27551 -13016 -18888 -42464 -24865 -29414 8440
9334H440N0565j6558m7201j7753j5194K2655j9832K9463K9121J7414J1359K887
$$ 8440 59005 42447 -4754 -22507 -37701 -15046 -34878 -5415 23706 41120 52479 55366
9322E5366p136k5653l9658j0251K1932R761n7206o5827J8861l868J0947M770M038
$$ 55366 48230 22577 -17081 -27332 -5400 4361 -52845 -118672 -99811 -103679 -92732 -87962 -83924
9309h3924M3325M7368q003j0061J0656n176L9723L0573j814l6166K429R033J1968
$$ -83924 -40599 6769 -1234 -11295 -639 -5815 33908 64481 62667 26501 28930 37963 49931
9296D9931j7896K4328m4892n5221J0405k5320L3657P2622k913k1106j4705j6187
$$ 49931 32035 56363 11471 -43750 -33345 -58665 -25008 47614 44701 23595 8890 -7297
9284g297L6927M5524J5752n310p1876o9899k1059L0579K6955k9725K3671R020
$$ -7297 29630 75154 90906 85596 13720 -56179 -77238 -46659 -19704 -49429 -25758 -16738
9272a6738k2522N8421J0313L5031M756J629l1357P722m061l8524o7154j1570N8366
$$ -16738 -39260 19161 29474 64505 69261 70890 39533 47255 43194 4670 -62484 -74054 -15688
9259a5688R809Q748M735N5775L0719j1497n093j0882n4965m6181K079P4523K4262
$$ -15688 -5879 2869 7604 63379 94098 82601 77508 66626 11661 -34520 -32441 42082 66344
9246F6344j5683N984L3698j0455j5700q5532l5503J9453j286q7719o1485N5756
$$ 66344 50661 56645 90343 79888 64188 -21344 -56847 -37394 -38680 -126399 -187884 -132128
9234a32128O0447L3307N1535M0078j9237j5929J0319p471o668q985L6996m684
$$ -132128 -71681 -38374 13161 53239 34002 18073 28392 20921 14253 5268 42264 37580
9222C7580l0862j442M1977K8158o268n518l5086k1581l578R368J5095j4814N6230
$$ 37580 6718 5276 47253 75411 69143 63625 28539 6958 3380 12748 27843 13029 69259
9209F9259k585m4589k001M713m576l3973l9704q027M1950L6426R176k8636L609
$$ 69259 66674 22085 20084 24797 20221 -13752 -53456 -61483 -19533 16893 26069 -2567 1042
9196A042r132K2960L0683K0698J1802k7427J5124q14M248k2988k3863M41j412
$$ 1042 -8090 14870 45553 66251 78053 50626 65750 64936 69184 46196 22333 22774 21362
9183B1362O2887J366l7222O580l060k8672K8765J5356k8926l6135M1502M5345
$$ 21362 84249 85615 48393 54973 51913 23241 52006 67362 38436 2301 43803 89148
9171H9148q856N989j3340k5113J0239K5247K1294p2906p6941k5993q189M5162
$$ 89148 80292 86281 72941 47828 58067 83314 104608 31702 -45239 -71232 -79421 -34259
9159c4259P8002J931l977m8101L4910M7638R096L9949M6917M705r2386m9273k3813
$$ -34259 43743 45674 41697 -6404 28506 76144 85240 125189 172106 176811 84425 35152 11339
9146A1339J1161M2046J0461M3652L5958N3750J0378M156M0717k7368j7462l747
$$ 11339 22500 64546 75007 118659 154617 208367 218745 222901 263618 236250 218788 215041
9134B15041l0301J7217P0194Q1751N9665M3571K4070P4499M0396Q5488J40799
$$ 215041 184740 201957 272151 353902 413567 457138 481208 555707 596103 681591 822390
9123H22390N5294J04334K23690L00109L71507M94884O41577P95705J004301J334852
$$ 822390 877684 982018 1205708 1505817 1877324 2372208 3013785 3809490 4813791 6148643
9113F148643J824050K866375M634352O959817Q245903M081321m721282r099749
$$ 6148643 7972693 10839068 15473420 22433237 30679140 34760461 30039179 20939430
9105B0939430p662960m587502k628497j588289r75579o31893m78874l67708l09576
$$ 20939430 13276470 8688968 6060471 4472182 3496603 2864710 2385836 2018128 1708552
9096A708552k74005k23307j63587j49124j08370r2130m0722r2360q0400j7742
$$ 1708552 1434547 1211240 1047653 898529 790159 698029 657307 564947 484547 466805
9086D66805l2340j01909k4701j493o2548j7922J5292k9043Q512N935l6452l3375
$$ 466805 434465 332556 307855 306362 243814 225892 241184 212141 220653 226588 190136 156761
9074A56761L9785J3995R487R61j7909l1068j1403K827m7973L455k0506J1091k142
$$ 156761 196546 210541 220028 220989 203080 172012 160609 163436 115463 118918 98412 109503 107361
9061A07361j9854L1193Q3236J3389Q310l9857p7054j3615k7380o1123j0278M6046
$$ 107361 87507 118700 201936 215325 223635 183778 106724 93109 65729 4606 -5672 40374
9049D0374M4180M001n8091j3843M406k5326O278r655m8934k06l663M4282J5909
$$ 40374 84554 88555 30464 16621 21027 -4299 1979 -7676 -56610 -56816 -60479 -16197 -288
9036b88L6325J0978l9951j3874j2882N1766P1015J0457o1958J058j9296j5922
$$ -288 36037 47015 7064 -6810 -19692 32074 103089 113546 51588 52646 33350 17428
9024A7428l5554R037K2803m0625L9829M2347M4812O7125J536l9375j2473J988
$$ 17428 -18126 -9089 13714 -26911 12918 55265 100077 167202 168738 129363 116890 118878
9012A18878J4931m7042m7363m9412l5894R109j4003p385J2001O3474J2342M1480
$$ 118878 133809 86767 39404 -10008 -45902 -36793 -50796 -58181 -46180 17294 29636 71116
9000G1116M0734l4884k4967j1274n2288R437J0092J789L7709L3076m8362j8808
$$ 71116 111850 76966 51999 40725 -11563 -2126 7966 9755 47464 80540 32178 13370
8988A3370L2260K1918K1471j4887N1158l0213K3729k5169k9392j6362K743k3993
$$ 13370 45630 67548 89019 74132 125290 95077 118806 93637 64245 47883 50626 26633
8976B6633k5166J725j9002N7042M909m7503k5800p637K731O095K8574K7136J555
$$ 26633 1467 3192 -15810 41232 46141 -1362 -27162 -34799 -32068 -25973 2601 29737 31292
8963C1292q067m4620k9864k8365k2760J2007M3161k1184k9556K6480P187K2100
$$ 31292 23225 -21395 -51259 -79624 -102384 -90377 -47216 -68400 -97956 -71476 -64289 -42189
8951d2189J1838P195Q71J8669j2648L576m7934j3013o742K6031L6250K0720K0365
$$ -42189 -30351 -23156 -22285 -3616 -16264 -12688 -60622 -73635 -80377 -54346 -18096 2624 22989
8938B2989m815k0529j5476K5741J7244M2589k4821m1642l5581J7275j4738r1552
$$ 22989 18174 -2355 -17831 7910 25154 67743 42922 1280 -34301 -17026 -31764 -123316
8926a23316j2365N8173K9230K6168L4854l2526m3322j0506N564K78k9888K4562
$$ -123316 -135681 -77508 -48278 -22110 12744 -19782 -63104 -73610 -68046 -67768 -97656 -73094
8914g3094N7992M4488K8613K2886j9501K5194q233o5019m0134L9448j0532o763
$$ -73094 -15102 29386 57999 80885 61384 86578 78345 13326 -26808 12640 2108 -4655
8902d655j9803P129n7507M4994N2441K5565l1062l3689Q103o199j2544N445m691
$$ -4655 -24458 -17329 -74836 -29842 22599 48164 17102 -16587 -8484 -14683 -27227 -21782 -26473
8889b6473M865l6666j1727j6502o496M1675M4202K2829K2804l9218j6564L8752
$$ -26473 -21608 -58274 -70001 -86503 -92999 -51324 -7122 15707 38511 -707 -17271 21481
8877B1481L5122n8940K507K0176J5195l9279n8811k4329j138l155J8209K7265
$$ 21481 56603 -2337 170 20346 35541 -3738 -62549 -86878 -88016 -91171 -72962 -45697
8865d5697J6396k9695M7377N1771m6989j4458L0860k6066q7728L10L8228L1598
$$ -45697 -29301 -58996 -11619 40152 -6837 -21295 9565 -16501 -104229 -103919 -65691 -34093
8853c4093k9950L1467j574L5894j720j5411k3165j900L1970k4989L1977L5649
$$ -34093 -64043 -32576 -34150 1744 24 -15387 -38552 -40452 -8482 -33471 -1494 34155
8841C4155k4497J8196K213j1l5507k7502P704j5192O810O016L8815p519o2381
$$ 34155 9658 27854 30067 30056 -5451 -32953 -25249 -40441 -33631 -27615 11200 3681 -58700
8828e8700n0492M0406K3597K2454K2148O269o077J1150j8080P755K9279p3417
$$ -58700 -109192 -68786 -45189 -22735 -587 5682 -395 10755 -7325 430 29709 -43708
8816d3708q369R6675O1308k4380k2001l6656o2894m88P8060J0679m9702l9729
$$ -43708 -52077 44598 105906 81526 59525 22869 -40025 -40513 37547 48226 -1476 -41205
8804d1205R073L8597M1237L8457k8003k6188k4918M9199l046j2351j7701j0371
$$ -41205 -32132 6465 47702 86159 58156 31968 7050 56249 53203 40852 23151 12780
8792A2780k4263K7321n373l0126k260m0586K3199M5535J3156k374L913j2113j10
$$ 12780 -11483 15838 10465 -19661 -21921 -62507 -39308 6227 19383 17009 20922 8809 8699
8779H699J4667J1728k8634j2983K0279o008j5421K4191L0400l5944j9207K0684
$$ 8699 23366 35094 6460 -6523 13756 7748 -7673 16518 46918 10974 -8233 12451
8767A2451R005L2093k2838r8858K6979M9224l0900L461N1139r120n6468L8755
$$ 12451 21456 53549 30711 -68147 -41168 8056 -22844 -19383 31756 22636 -33832 4923
8755D923j4079J7312O424P565K8451p329J5705k0712m2621l5969j9272L461K1215
$$ 4923 -9156 8156 14580 22145 50596 43267 58972 38260 -4361 -40330 -59602 -56141 -34926
8742c4926K1853K2691j7345k1079j5723l5830o803L1972J6854N645J4604N1732
$$ -34926 -13073 9618 -7727 -28806 -44529 -80359 -87162 -55190 -38336 -32691 -18087 33645
8730C3645M1257J3012j0803j8540j4608Q946m5678k3517k4084L0838R7174J3914
$$ 33645 74902 87914 77111 58571 43963 52909 7231 -16286 -40370 -9532 87642 101556
8718A01556n4190o738L9926k630K1845k6804m2803R818J9795J1867J2704J0009
$$ 101556 47366 40628 80554 77924 99769 72965 30162 39980 59775 71642 84346 94355
8706I4355K4169L994J527p8566n1109J401j4997J3485L5712J3458j3224k3947
$$ 94355 118524 122518 124045 45479 -5630 -4229 -19226 -5741 29971 43429 30205 6258
8694F258j0349M1985L6856J893L3247K525l4324k8827m5781k7204j1525N127j4947
$$ 6258 -4091 37894 74750 76643 109890 112415 78091 49264 3483 -23721 -35246 -30119 -45066
8681d5066l7268L4090M1223j9223M5541N907M728R787J9808k0662n4313l2409
$$ -45066 -82334 -48244 -7021 -26244 19297 25204 29932 39719 59527 38865 -15448 -47857
8669d7857m94J3408M8431L1713K7252r764l8799l6882l806L2107L6057l1289j1330
$$ -47857 -48351 -34943 13488 45201 72453 62689 23890 -12992 -16798 15309 51366 20077 8747
8656H747L1966q037J5576k3210K2151J2020M0427M0408K8350j8564N8375J41769
$$ 8747 40713 32676 48252 25042 47193 59213 99640 140048 168398 149834 208209 349978
8644C49978r009r7893o6143J5j9899l9556o598m5014J5978L8145k3121j2765k0588
$$ 349978 340969 243076 176933 176948 157049 117493 110895 65881 81859 120004 96883 84118 63530
8631F3530o611m528L0168j8549j692K967k137j9202j6761J7040J4020M9632M1578
$$ 63530 56919 52391 82559 64010 62318 65285 63148 43946 27185 44225 58245 107877 149455
8618A49455j2428l8830j4830k3795m2858K3700K7843J1162k349j2073m796K211
$$ 149455 137027 98197 83367 59572 16714 40414 68257 79419 77070 64997 60201 62412
8606F2412K7442N9238O7420O1727J38656Q5022J85800J29545r2153k07115k22290
$$ 62412 89854 149092 216512 278239 416895 501917 687717 817262 725109 517994 295704
8595B95704j31896n480L1236P855k3618n3087M9361L3664m1644n5169p665M2940
$$ 295704 163808 158328 189564 197419 173801 120714 170075 203739 162095 106926 99261 142201
8583A42201l1434k0184l676j2662J8555j0710J8461r802J132k2580j5456j8541
$$ 142201 110767 90583 86907 74245 92800 82090 100551 90749 91881 69301 53845 35304
8571C5304k3224N399M4360O758j2569l9209j7093N8908L3283J5557N910L8619
$$ 35304 12080 17479 61839 68597 56028 16819 -274 58634 91917 107474 113384 152003
8559A52003J7315K7872K3428M845M4440L7349R364p8190q2310l2391k5895k2303
$$ 152003 169318 197190 220618 225463 269903 307252 316616 238426 156116 123725 97830 75527
8547G5527R843K5799L834k6459q873J0118m0135P391L4j0788k6932j4658k0682
$$ 75527 85370 111169 115003 88544 79671 89789 49654 57045 57079 46291 19359 4701 -15981
8534a5981J4451J6367K3186P218n9310m2491J4750J2485l7183M8505O0839J0794
$$ -15981 -1530 14837 38023 45241 -14069 -56560 -41810 -29325 -66508 -18003 42836 53630
8522E3630j1322r577p349J0425m748k9374j0980J1417k323j5856J7691K2504q686
$$ 53630 42308 32731 25382 35807 31059 1685 -9295 2122 -201 -16057 1634 24138 15452
8509A5452L457K0116k7967l429j1211o1875j5675P8310O0106m4997j495P6014
$$ 15452 18909 39025 11058 7629 -3582 -65457 -81132 -2822 57284 12287 10792 86806
8497H6806o325r0604j7949J1348l5225O880K0010j929k7324p251j822L4076P090
$$ 86806 80481 -10123 -28072 -16724 -51949 -45069 -25059 -26988 -54312 -61563 -63385 -29309 -22219
8484b2219j1106o095K1453K7062R436l705J8009K309j489k0544J9534l0894j0046
$$ -22219 -33325 -39420 -17967 9095 18531 14826 32835 35144 33655 13111 32645 1751 -8295
8471h295L7892K9627J6467k655j2357m0628k2232J6915n166L6421J1226k5130
$$ -8295 29597 59224 75691 73036 60679 20051 -2181 14734 9568 45989 57215 32085
8459C2085j8676Q446m9360O415P606K3693j4022j5561K4331j6851K191P693n3363
$$ 32085 13409 21855 -27505 -21090 -13484 10209 -3813 -19374 4957 -11894 -9703 -2010 -55373
8446e5373j5891j3347j7628l1282P5381P4242m8939m5249J3927L6561P320m0119
$$ -55373 -71264 -84611 -102239 -133521 -58140 16102 -32837 -78086 -64159 -27598 -20278 -60397
8434f0397J2925M1311O031K1239P730r052m4322L3409M6927p673j0886J8089K5444
$$ -60397 -47472 -6161 -130 21109 28839 19787 -24535 8874 55801 48128 37242 55331 80775
8421H0775k080O825J1215k1700k2343K2558K8715m4074r0984J2299N1832k3534
$$ 80775 78695 85520 96735 75035 52692 75250 103965 59891 -31093 -18794 33038 9504
8409I504m9358J6819N5474r81L872n534j8200m0277k9469R312n662n911r634K7560
$$ 9504 -39854 -23035 32439 31458 35330 29796 11596 -28681 -58150 -48838 -54500 -60411 -70045 -42485
8395d2485m763K6367N9662m6352m3409o2155J1343R1105R003J547j6660j0621
$$ -42485 -47248 -20881 38781 -7571 -50980 -113135 -101792 -10687 -1684 -137 -16797 -27418
8383b7418j8505o564P7308M4706n0003o7833K8845L4293K9867j2592l0720M3329
$$ -27418 -45923 -52487 24821 69527 19524 -48309 -19464 14829 44696 32104 1384 44713
8371D4713j3529k4679L492j1873L259O673J1367k4769L88k0562k6940R113L4299
$$ 44713 31184 6505 9997 -1876 1383 8056 19423 -5346 -4958 -25520 -52460 -43347 -9048
8358i048k0234l5387K121L5069K675k9650r130K1087l253k0422M910L1605j9397
$$ -9048 -29282 -64669 -62548 -27479 -24804 -54454 -63584 -42497 -45750 -66172 -61262 -29657 -49054
8345d9054n327M8260K2435l7538j3674M286M9227K9223O003J3192j7829n7459
$$ -49054 -54381 -6121 16314 -21224 -34898 -30612 18615 47838 53841 67033 49204 -8255
8333h255m6753Q65N3579o602o98M8791q104J4824J7515o9433j1149J0629l8569
$$ -8255 -55008 -54143 -564 -7166 -7864 40927 32823 47647 65162 -4271 -15420 -4791 -43360
8320d3360j8699L0917j2032J4619j2553N8134O7017J3845l7703n8276j258J9825
$$ -43360 -62059 -31142 -43174 -28555 -41108 17026 84043 97888 60185 1909 651 20476
8308B0476j5140L126K1706r166M198k2763o4050J8971K5733M4160J2808N186O091
$$ 20476 5336 8462 30168 21002 25200 2437 -61613 -42642 -16909 27251 40059 45245 51336
8295E1336L2045j6916K799K3919k2633n873j080l4838L1772k8100l9987M576l1939
$$ 51336 83381 66465 69264 93183 70550 64677 63597 28759 60531 32431 -7556 -2980 -34919
8282c4919k4597j0794L3403j2444O197L2034J2210P307K1756m685k0996K9458
$$ -34919 -59516 -70310 -36907 -49351 -43154 -11120 1090 8397 30153 25468 4472 33930
8270C3930k1033j1579J6339l2883l0305m8025L2016N4677J265k2661k9098J4407
$$ 33930 12897 1318 17657 -15226 -45531 -93556 -61540 -6863 -5598 -28259 -57357 -42950
8258d2950O4970N7772k2741o7919k0886J554O2928O001l463q814M7335L8004m1531
$$ -42950 22020 79792 57051 -10868 -31754 -30200 32728 38729 35266 26452 73787 111791 70260
8245G0260o7799K15O1994J5342m7258j5216m2286j7286l531j7183L4068k0859
$$ 70260 2461 2676 64670 80012 32754 17538 -24748 -42034 -45565 -62748 -28680 -49539
8233d9539K34O9460K9691j2251n2418l4714j3156Q791P980K0797k3813J3058j3678
$$ -49539 -49305 20155 49846 37595 -14823 -49537 -62693 -53902 -45922 -25125 -48938 -35880 -49558
8220d9558j0833N8278M2333K3214m7644l7252j0534Q95P223k0102m6161K9348
$$ -49558 -60391 -2113 40220 63434 15790 -21462 -31996 -31101 -23878 -43980 -90141 -60793
8208f0793J7399P107k207N9458M6882m415n4311k9048k77j6236k4582K0653N4467
$$ -60793 -43394 -36287 -38494 20964 67846 63431 9120 -19928 -20205 -36441 -61023 -40370 14097
8195A4097j9669K8441j0076M3197k0911m5973j657M3924J3670k9098k860j0713
$$ 14097 -5572 22869 12793 55990 35079 -10894 -12551 31373 45043 15945 13085 2372
8183B372k9130j1359P576p700M0146k81M8756N0930o6875m0402l1937J8855M1725
$$ 2372 -26758 -38117 -30541 -38241 1905 1624 50380 101310 34435 -5967 -37904 -19049 22676
8170B2676M0664J6797j7516m4298r87K4797j1179j5317n3794j3170K7543m1642
$$ 22676 63340 80137 62621 18323 17336 42133 30954 15637 -38157 -51327 -23784 -65426
8158f5426K138k022L8426K8279m8457l3959Q637O8331J8774k1299l6722K8501
$$ -65426 -63288 -65310 -26884 1395 -47062 -81021 -72384 -4053 14721 -6578 -43300 -14799
8146a4799L7351O8369K4775k6830m3076l1045L762Q002L6222N4122k9872n4093
$$ -14799 22552 90921 115696 88866 45790 14745 18507 26509 62731 116853 86981 32888
8134C2888J5040M7598j9871o1765r8333p1025M449M3934M1258J8623M5909K6712
$$ 32888 47928 95526 75655 13890 -84443 -155468 -151019 -107085 -65827 -47204 -1295 25417
8122B5417n862M841R616J2491p964j2348O8449N315m1605o7612K0474M9804M541
$$ 25417 19555 24396 34012 46503 38539 26191 94640 99955 58350 -9262 11212 61016 65557
8109F5557o630n3669n7441J9181m533J5656O4396J5910m7139k9443j9430L9468
$$ 65557 58927 5258 -52183 -33002 -37535 -21879 42517 58427 11288 -18155 -37585 1883
8097A883k5799j1326M6634r595J0990j226O632j827m5472j0064J8630P7957l0663
$$ 1883 -23916 -35242 11392 1797 12787 11561 18193 16366 -29106 -39170 -20540 57417 26754
8084B6754l3014j5744K5465K2797n2458r8691M3944P3456j1536J628J8790m7315
$$ 26754 -6260 -22004 3461 26258 -26200 -124891 -80947 -7491 -19027 -17399 1391 -45924
8072d5924n432n287J5500J5795n8379L8235P4983J084N124M4787k0115n4813m6862
$$ -45924 -51356 -56643 -41143 -25348 -83727 -45492 29491 30575 35699 80486 60371 5558 -41304
8059d1304l9239K4352K2925K4711k2882j3835M5014J477J919j133J2284L0973
$$ -41304 -80543 -56191 -33266 -8555 -31437 -45272 -258 1219 3138 2005 14289 45262
8047D5262O270N5647M7676k7415l6802J0460O0865k985R579m0557j8322n726J145
$$ 45262 51532 107179 154855 127440 90638 101098 161963 158978 168557 128000 109678 103952 105097
8034A05097J1354K7421j2379p2050J4307L5557R151k1124o2063n3491k5414N0482
$$ 105097 116451 143872 131493 59443 73750 109307 118458 97334 35271 -18220 -43634 6848
8022F848M1726O4343J8869l9394j4340M0182N4256o66r994m1983K3942k6791n0512
$$ 6848 48574 112917 131786 92392 78052 118234 172490 171824 161830 119847 143789 116998 66486
8009F6486k9740L5889J1056n2881P351P6188J14648P8618l2224k7632O1843k4589
$$ 66486 36746 72635 83691 30810 38161 114349 228997 307615 275391 247759 309602 285013
7997B85013j4782o5062m4745k750l663K5481L1750J03684O2728J0661j03017o7060
$$ 285013 270231 205169 160424 157674 154011 179492 211242 314926 377654 388315 285298 218238
7985B18238k6168m6859o9748o5609J6536j625R409n820j9511k5126p697N079M75
$$ 218238 192070 145211 75463 9854 26390 24765 34174 28354 8843 -16283 -23980 -18901 -18426
7972a8426K057J0111L8136K4455j140K0088M5771J5527M5164q271l902M5021l702
$$ -18426 -16369 -6258 31878 56333 55193 75281 121052 136579 181743 173472 169570 214591 210889
7959B10889L5219N1498M4404Q7341J38032Q3321n472m9181j06595o9263J2789
$$ 210889 246108 297606 342010 429351 567383 650704 645232 596051 489456 420193 432982
7948D32982O7339L6441n9053j30055j67596n7956K1514m806k2056k7787J3726
$$ 432982 500321 536762 477709 347654 180058 122102 143616 138810 116754 88967 102693
7937A02693j6653m1037l909M5112M2740J688n5993l0250l5304L1121J4010k2541
$$ 102693 86040 45003 41094 86206 128946 130634 74641 44391 9087 40208 54218 31677
7925C1677l4339k4475K5095L9787J3440m0113J381K6812O7755M2682p444q194
$$ 31677 -2662 -27137 -2042 37745 51185 11072 12453 39265 107020 149702 142258 134064
7913A34064M673l5325J0191q059M357L4460K6423L0943J3704Q855j1828m9714
$$ 134064 138737 103412 113603 105544 109901 144361 170784 201727 215431 224286 212458 162744
7901A62744k0694k6628l5163j2966J6144O376L0618m0886k6404l360J1874J1116
$$ 162744 142050 115422 80259 67293 83437 89813 120431 79545 53141 49781 61655 72771
7889G2771j2082l0067J658n4020j7560p873p911k0581L0550L7126J7869J2992
$$ 72771 60689 30622 32280 -21740 -39300 -47173 -55084 -75665 -45115 -7989 9880 22872
7877B2872L0443L3117N6678k4455m2268q8402n2448J3722j343J7279M8690J5424
$$ 22872 53315 86432 143110 118655 76387 -12015 -64463 -50741 -52084 -34805 13885 29309
7865B9309r237o506J2153L4573k3517k8740L7982J1904o116k2561k0900k834n9308
$$ 29309 20072 13566 25719 60292 36775 8035 46017 57921 51805 29244 8344 5510 -53798
7852e3798m4318M1208P2580K4412j0282K3601j9232k2411m076J448L413k0094
$$ -53798 -98116 -56908 15672 40084 29802 53403 34171 11760 7684 9132 12545 -7549
7840g549K819n090J8378J956k0971l5672j5208Q753p825J0621k071j1132j3805
$$ -7549 -4730 -9820 8558 10514 -10457 -46129 -61337 -52584 -60409 -49788 -51859 -62991 -76796
7827g6796M6856K2411J5688O444J3408K588k0721l1407J7550K649j59P794l0594
$$ -76796 -29940 -7529 8159 14603 28011 30599 9878 -21529 -3979 -1330 -1489 6305 -24289
7814b4289k200J4529K4203j9743l7878m5588J3923K4097J3116K5261j6811J012
$$ -24289 -26489 -11960 12243 -7500 -45378 -90966 -77043 -52946 -39830 -14569 -31380 -30368
7802c0368L5882j5233j7890j0225N8490K1364L0854M4503m0109n9345k0841j7227
$$ -30368 5514 -9719 -27609 -37834 20656 42020 72874 117377 77268 17923 -2918 -20145
7790b0145L1074L3194k0223j9946q031k6142N94L5092L1801Q014j8364j9630L0114
$$ -20145 10929 44123 23900 3954 -4077 -30219 -29625 5467 37268 45282 26918 7288 37402
7777C7402k8789p2454l4546Q521J5269J6723N6554M3653k8294n0842k073L2866
$$ 37402 8613 -63841 -98387 -89866 -74597 -57874 -1320 42333 14039 -36803 -38876 -6010
7765f010L0325l6174l8181K4573K1047R38k4113J4121p398j8369L1793L8084j7610
$$ -6010 24315 -11859 -50040 -25467 -4420 -3482 -27595 -13474 -20872 -39241 -7448 30636 13026
7752A3026J0921K5201Q68m5336j6730M8551J3144k7313r178o5006K620K995j0717
$$ 13026 23947 49148 50016 4680 -12050 36501 49645 22332 13154 -51852 -49232 -46237 -56954
7739e6954L1651p110j9618N265J2465k5985m208j5366m1843j062L6217j4483N8782
$$ -56954 -25303 -32413 -52031 -46766 -34301 -60286 -64494 -79860 -121703 -122765 -86548 -101031 -42249
7726d2249N7488L0597k5012m7612l1866q328j2100K2022O4810m0630j4959M8391
$$ -42249 15239 45836 20824 -26788 -58654 -66982 -79082 -57060 7750 -32880 -47839 552
7714E52M5439M409K418p1520m8481J3656M2204L680L180j7866j8817m9876j9242
$$ 552 45991 50400 52818 -18702 -67183 -53527 -11323 -7643 -4463 -22329 -41146 -91022 -110264
7701a10264n241j1110L6560J22626N0651k9910n4435K2269l511l1147k5382j1249
$$ -110264 -115505 -126615 -90055 32571 83222 53312 -1123 21146 17635 -13512 -38894 -50143
7689e0143J5495j2536j3142J6739M9742J301l8366K2956J7848k784j3397L1546
$$ -50143 -34648 -47184 -60326 -43587 6155 7456 -30910 -7954 9894 7110 -6287 25259
7677B5259l1445l5866Q860j206j4716j3727M5688J9932L288j3954k1568l1107
$$ 25259 -6186 -42052 -33192 -34398 -49114 -62841 -17153 2779 6067 -7887 -29455 -60562
7665f0562K1532M1739R391K1462K518p797J2332N3316p765n1559n5176r570M1098
$$ -60562 -39030 2709 12100 33562 36080 28283 40615 93931 86166 34607 -20569 -30139 10959
7652A0959k1927J6772M867L1682j4237l0470K158J4899k4186M306k9976j9269
$$ 10959 -10968 5804 10671 42353 28116 -2354 -196 14703 -9483 -5177 -35153 -54422
7640e4422n058j6808l262L0998P7734N4479q9140r5669j1445J0569L1514J0233
$$ -54422 -59480 -76288 -79550 -48552 29182 83661 -5479 -101148 -112593 -102024 -70510 -60277
7628f0277P388M0876K00O366Q12M9837l3589n0209k0506M0634Q2511K4617j7481
$$ -60277 -52889 -12013 -11813 -5447 -4635 45202 11613 -38596 -59102 -18468 64043 88660 71179
7615G1179o899r301k0742J068j8447K2075j7430r486j2561j4453r553K7287J6106
$$ 71179 64280 54979 34237 35305 16858 38933 21503 12017 -544 -14997 -24550 2737 18843
7602A8843l1675j6338p807L2604Q858k1610J5162L14j428l975l3903k4247j2159
$$ 18843 -12832 -29170 -36977 -4373 4485 -17125 -1963 -1649 -3077 -7052 -40955 -65202 -77361
7589g7361K7781K2455p232k484M5722M4245j1146j3856o400m3102K0193M7445
$$ -77361 -49580 -27125 -34357 -36841 8881 53126 41980 28124 21724 -21378 -1185 46260
7577D6260l0411m6331L0072M9757M7652k4128M221J2092l5067k5606J605j7314
$$ 46260 15849 -30482 -410 49347 96999 72871 77092 89184 54117 28511 30116 12802
7565A2802o112j780N515m5210Q989q414j6617M5411M7458J3886l3635k9064l6419
$$ 12802 6690 4910 10425 -34785 -25796 -34210 -50827 -5416 42042 55928 22293 -6771 -43190
7552d3190n89j2923L3231L5212M0444N147j9039J6601K8699o6584o4942L6078
$$ -43190 -43779 -56702 -23471 11741 52185 57332 38293 54894 83593 17009 -47933 -11855
7540a1855L8536l4241j8900M014j4945p825q399k3566l8133m0819K7608R7980
$$ -11855 26681 -7560 -26460 -22446 -37391 -45216 -53615 -77181 -115314 -156133 -128525 -30545
7528c0545P7018P735k6391R818P929l1852j0413j3276j6878l924L4369P0315K3710
$$ -30545 46473 54208 27817 37635 45564 13712 3299 -9977 -26855 -30779 3590 73905 97615
7515I7615o4658p9338j8678J1409P2811M4589n8951m8529n381l3993k3829k706
$$ 97615 32957 -46381 -65059 -53650 19161 63750 4799 -43730 -49111 -83104 -106933 -109639
7503a09639L9939K5893l5462m301O9255P2434k3425n1729m1897J395K1369j8737
$$ -109639 -69700 -43807 -79269 -83570 -14315 58119 34694 -17035 -58932 -57537 -36168 -54905
7491e4905J9817J3443o087K2763M2910o1245j02901L828J9981p42p526K9913K6686
$$ -54905 -35088 -21645 -27732 -4969 37941 -23304 -126205 -122377 -102396 -103138 -110664 -80751 -54065
7478e4065J1046O0592M5427k1719O252J5640k3919m0377K1389L2469m9678n2010
$$ -54065 -43019 17573 63000 41281 47533 63173 39254 -1123 20266 52735 3057 -48953
7466d8953r076K4720M1001j9323j4915L9612J8218P683J4210l6310k5475l087
$$ -48953 -58029 -33309 7692 -11631 -26546 13066 31284 38967 53177 16867 -8608 -11695
7454a1695L1200K4131K0350o398p2262k4371k0611l077L8806L0877j6351J1173
$$ -11695 19505 43636 63986 57588 -14674 -39045 -59656 -62733 -23927 6950 -9401 1772
7442A772l08l7924P154k0815m7723l8798K4152M4060k3286K0937L2708K870L2164
$$ 1772 1464 -36460 -29306 -50121 -97844 -136642 -112490 -68430 -91716 -70779 -38071 -35201 -3037
7429c037L5338J3910q6060r185j2126P424j3772N6491L3714l2472l5105l9318
$$ -3037 32301 46211 -39849 -49034 -61160 -53736 -67508 -11017 22697 -9775 -44880 -84198
7417h4198L3671L7345M402l367J8421j3538J1421L0504k9052k6535j0148M013
$$ -84198 -50527 -13182 -8780 -12147 6274 -7264 4157 34661 5609 -20926 -31074 -27061
7405b7061L9K3931M0273K9363j0997p871j1759j2301n20k3429L1316K7300Q100
$$ -27061 -27022 -3091 37182 66545 55548 47677 35918 23617 23097 -332 30984 58284 66384
7392F6384o952l6283j7957L1626K6124j5339q3807k2544L5715R21O1997K7701
$$ 66384 59432 23149 5192 36818 62942 47603 -36204 -58748 -23033 -22112 39885 67586
7380F7586M339o0125k3802K7789l8370j2205O9767M0818n0814o9121K4500N014
$$ 67586 71925 11800 -12002 15787 -22583 -34788 34979 75797 24983 -44138 -19638 -14624
7368a4624k1350K8354N467n929j0803r154J9888N4302n5094j1862P7511n917o0885
$$ -14624 -35974 -7620 -2153 -8082 -18885 -28039 -8151 46151 -8943 -20805 56706 50789 -10096
7355a0096l9282J0482J5906J1195j604o770n9846K1818L8056O364J663O554K9929
$$ -10096 -49378 -38896 -22990 -11795 -13399 -20169 -80015 -58197 -20141 -13777 -12114 -5560 24369
7342B4369j464J5129J6957q517j0443k3075l7638j3518Q67k5933K5287O5819k8872
$$ 24369 22905 38034 54991 46474 36031 12956 -24682 -38200 -37333 -63266 -37979 27840 -1032
7329a032l3595m885l3830P0151L6107O237j106l14M0967j6727j5727P499J0931
$$ -1032 -34627 -39512 -73342 -3191 32916 39153 38047 37733 78700 61973 46246 53745 64676
7316F4676R538q152j7192r68r530k6207j2991m5145k4730j1950K809Q498k6385
$$ 64676 74214 66062 48870 47902 38372 12165 -826 -45971 -70701 -82651 -79842 -71344 -97729
7303i7729n690j5729N997j88k007K3990K9792O8P055J3784K0747K4219j3237k1738
$$ -97729 -103419 -119148 -113151 -113339 -115346 -91356 -61564 -61496 -54441 -40657 -19910 4309 -8928 -30666
7289c0666L5945J6412K2045L0203k4317q899J5339j9286P172N2413j1200n3486
$$ -30666 5279 21691 43736 73939 49622 40723 56062 36776 43948 96361 85161 31675
7277C1675k7924p4106n4745M046N9351P2189N4005l1802m9740k3415J7512k7110
$$ 31675 3751 -70355 -125100 -121054 -61703 10486 64491 32689 -17051 -40466 -22954 -50064
7265e0064m439K2565M5372K194j9800N259P026j513M967N1610k331k3156j8250
$$ -50064 -54503 -31938 13434 15628 -4172 1087 8113 6600 11567 63177 60846 37690 19440
7252A9440l3973j3686j8217l6705j0175j1126L2063K2778J514l5858L793O4530
$$ 19440 -14533 -28219 -46436 -83141 -93316 -104442 -72379 -49601 -48087 -83945 -80152 -15622
7240a5622N9921k9907P437L2456k0470m5741l4952J9098L3931M4614K3779k6498
$$ -15622 44299 14392 21829 54285 33815 -11926 -46878 -27780 6151 50765 74544 48046
7228D8046j5773M257l2162j8082L677L0402Q909n213n441k462j8048R646k6862
$$ 48046 32273 36530 4368 -13714 -10037 20365 29274 24061 18620 16158 -1890 7756 -19106
7215a9106j7186N39K128K4051L5870M387M898J557o6518k8546J6597N9128M3674
$$ -19106 -36292 -35753 -33625 -9574 26296 30683 35581 37138 -29380 -57926 -41329 17799 61473
7202F1473l8850m6181M0230k2212l3423j807J4543L6876M3694o3137j4940M919
$$ 61473 22623 -23558 16672 -5540 -38963 -40770 -26227 10649 54343 -8794 -23734 -18815
7190a8815L110j7742k7139L9655O9878l263j4787P648P876J9283J0943l117j3355
$$ -18815 -15705 -33447 -60586 -20931 48947 45684 30897 38545 46421 65704 76647 73530 60175
7177F0175o4070m7571q486J0060N4701k2420L3018J7606j4730J8839j6581R925
$$ 60175 -3895 -51466 -59952 -49892 4809 -17611 15407 33013 18283 37122 20541 30466
7165C0466K3817j7547n0957j2500k0751k1819K4118N117j6408J6089K0495l6442
$$ 30466 54283 36736 -14221 -26721 -47472 -69291 -45173 -40056 -56464 -40375 -19880 -56322
7153e6322q207n622J1105k1363j3696N848P7368K5450L055K8951M7136m5771o9268
$$ -56322 -64529 -70151 -59046 -80409 -94105 -88257 -10889 14561 17616 46567 93703 47932 -21336
7140b1336m2461k452l521J1384p788N45j0697O1672P529J5563Q165n406l3159
$$ -21336 -63797 -66249 -69770 -58386 -66174 -65629 -76326 -14654 -7125 8438 16603 11197 -21962
7127b1962k6872L9567L1869K5731m779m1752J2526N1197j8718R855J1711j5698
$$ -21962 -48834 -9267 22602 48333 43554 1802 14328 65525 46807 56662 68373 52675
7115E2675n0550l7760l1036K9450K6693M5870L4159m0158k7169j1787M804m6230
$$ 52675 2125 -35635 -66671 -37221 -10528 35342 69501 29343 2174 -9613 -4809 -51039
7103e1039l2856J6239L68M9225J9474k0161Q946L1911k842l911K9604j0507N787
$$ -51039 -83895 -67656 -67288 -18063 1411 -18750 -9804 22107 19265 15354 44958 34451 40238
7090D0238l0654m9888j3390L4272p550j2725K458j451L8114J0184L4254M697j0184
$$ 40238 9584 -40304 -53694 -19422 -26972 -39697 -37239 -38690 -576 9608 43862 48559 38375
7077C8375k3809L992M0730j9124m1617l0388M345j3021J2301K8178k6056K2049
$$ 38375 14566 18558 59288 40164 -1453 -31841 -27496 -40517 -28216 -38 -26094 -4045
7065d045P5884j7865k9727j4185l3242m8921k3181K8620K5082k2540O654K1757
$$ -4045 71839 53974 24247 10062 -23180 -72101 -95282 -66662 -41580 -64120 -57466 -35709
7053c5709L2197M4746j6088l3961k3060L4779L9437r362J4275j1135j8941m145
$$ -35709 -3512 41234 25146 -8815 -31875 2904 42341 32979 47254 36119 17178 13033
7041A3033R343l5490j8420l762K8307J4805K3571K954o4846k0110Q1625K386j5063
$$ 13033 22376 -13114 -31534 -35296 -6989 7816 31387 34341 -30505 -50615 31010 33396 18333
7028A8333N891J2961n9946r439J6589j4332m723J2840k799O412P374L0778M922
$$ 18333 24224 37185 -22761 -32200 -15611 -29943 -34666 -21826 -24625 -18213 -10839 19939 24861
7015B4861k5111l955p152N613P164L4318o69m0693n7945K4623O5000k2329j3355
$$ 24861 -250 -4205 -11357 -5744 1420 35738 35069 -5624 -63569 -38946 26054 3725 -9630
7002i630P589K7324k0496J9592K4922j1884l5995j3422P818R831j8264j6307k4813
$$ -9630 -2041 25283 4787 24379 49301 37417 1422 -12000 -4182 5649 -12615 -28922 -53735
6989e3735k7435N7839N3414N1391o56j6283q0489J1465J008R981n0866N883M265
$$ -53735 -81170 -23331 30083 81474 80818 64535 -15954 -4489 -3481 6500 -44366 -38483 -34218
$$ [...]
##END NTUPLES=NMR SPECTRUM
##END=
