##TITLE=Analysis number 324866
Compound Code rjc 03579
Project Code adrs
Chemist Name adomenas
##JCAMPDX= 6.0         $$ Bruker NMR JCAMP-DX V2.0
##DATA TYPE= NMR SPECTRUM
##DATA CLASS= NTUPLES
##ORIGIN= Bruker BioSpin GmbH
##OWNER= nmr
$$ XWIN-NMR		Version 3.5
$$ Mon Dec  4 10:53:20 2006 GMT Standard Time (UT+0h)  MAYBRIDGE\nmr@NMR_250MHZ
##.OBSERVE FREQUENCY= 250.131544655141
##.OBSERVE NUCLEUS= ^1H
##.ACQUISITION MODE= SIMULTANEOUS (DQD)
##.ACQUISITION SCHEME= undefined
##.AVERAGES= 16
##.DIGITISER RES= 18
##SPECTROMETER/DATA SYSTEM= dpx250
##.PULSE SEQUENCE= zg30
##.SOLVENT NAME= CDCl3
##.SHIFT REFERENCE= (INTERNAL, CDCl3, 0, 16.522)
##AUDIT TRAIL= $$ (NUMBER, WHEN, WHO, WHERE, WHAT)
$$ ##TITLE= Audit trail, XWIN-NMR		Version 3.5
$$ ##JCAMPDX= 5.01
$$ ##ORIGIN= Bruker BioSpin GmbH
$$ ##OWNER= nmr
$$ C:\u/data/dgb/nmr/ADRS/140/pdata/1/auditp.txt
$$ ##AUDIT TRAIL=  $$ (NUMBER, WHEN, WHO, WHERE, WHAT)
(   1,<2006-12-04 10:52:48.87 +000>,<MAYBRIDGE\nmr>,<NMR_250MHZ>,
      <created by zg, POWCHK disabled, PULCHK disabled
       configuration hash MD5:
       49 4B E0 1D 92 C2 6B 37 9F E6 65 BC 52 41 86 1D
       data hash MD5: 64K
       FC 1A 1A DD D6 A7 A5 D3 9B 62 89 4F E9 DE 21 7F>)
(   2,<2006-12-04 10:53:05.20 +000>,<MAYBRIDGE\nmr>,<NMR_250MHZ>,
      <Start of raw data processing
       ef LB = 0.3 FT_mod = 6 PKNL = 1 SI = 32K 
       data hash MD5: 32K
       12 16 58 76 33 42 B1 5E AB DF E0 EB 0C 86 3E D0>)
(   3,<2006-12-04 10:53:07.40 +000>,<MAYBRIDGE\nmr>,<NMR_250MHZ>,
      <apk 
       data hash MD5: 32K
       67 7D 94 1A FD 31 01 14 A1 0F FB 23 4D EE 92 F5>)
(   4,<2006-12-04 10:53:08.18 +000>,<MAYBRIDGE\nmr>,<NMR_250MHZ>,
      <abs ABSG = 5 
       data hash MD5: 32K
       81 90 B8 9B 0A AC 04 57 58 2E 28 EF EC 6C 91 8C>)
$$ ##END=
$$ 
$$ hash MD5
$$ 1D A1 29 BB 6F 10 6E FB BF 22 E6 21 5A 41 8F C1
##$RELAX= 
##$RELAX= 
##$RELAX= 
##$RELAX= 
##$RELAX= 
##$RELAX= 
##$RELAX= 
$$ Bruker specific parameters
$$ --------------------------
##$DU= <C:\u>
##$EXPNO= 140
##$NAME= <ADRS>
##$PROCNO= 1
##$TYPE= <nmr>
##$USER= <dgb>
##$AMP= (0..31)
100 100 100 100 100 100 100 100 100 100 100 100 100 100 100 100 100 100 
100 100 100 100 100 100 100 100 100 100 100 100 100 100 
##$AQSEQ= 0
##$AQ_mod= 3
##$AUNM= <au_zg>
##$AUTOPOS= <9 >
##$BF1= 250.13
##$BF2= 250.13
##$BF3= 250.13
##$BF4= 250.13
##$BF5= 500.13
##$BF6= 500.13
##$BF7= 500.13
##$BF8= 500.13
##$BYTORDA= 1
##$CFDGTYP= 0
##$CFRGTYP= 5
##$CHEMSTR= <none>
##$CNST= (0..31)
1 1 145 1 1 1 1 1 1 1 1 1 1 1 1 1 1 1 1 1 1 1 1 1 1 1 1 1 1 1 1 1 
##$CPDPRG= <>
##$CPDPRG1= <>
##$CPDPRG2= <>
##$CPDPRG3= <>
##$CPDPRG4= <mlev>
##$CPDPRG5= <mlev>
##$CPDPRG6= <mlev>
##$CPDPRG7= <mlev>
##$CPDPRG8= <mlev>
##$CPDPRGB= <>
##$CPDPRGT= <>
##$D= (0..31)
0 1 0 0 0 0 0 0 0 0.06 0 0 0 0 0 0 0.0002 0 0 0 0 0 0 0 0 0 0 0 0 0 0 
0 
##$DATE= 1165229567
##$DBL= (0..7)
120 120 120 120 120 120 120 120 
##$DBP= (0..7)
150 150 150 150 150 150 150 150 
##$DBP07= 0
##$DBPNAM0= <>
##$DBPNAM1= <>
##$DBPNAM2= <>
$$ [...]
##$SUBNAM7= <"">
##$SUBNAM8= <"">
##$SUBNAM9= <"">
##$SW= 20.6930455092707
##$SWIBOX= (0..15)
0 0 3 0 0 0 0 0 0 0 0 0 0 0 0 0 
##$SW_h= 5175.983436853
##$TD= 65536
##$TD0= 1
##$TE= 294.16
##$TE2= 300
##$TE3= 300
##$TEG= 300
##$TL= (0..7)
0 120 120 120 120 120 120 120 
##$TP= (0..7)
150 150 150 150 150 150 150 150 
##$TP07= 0
##$TPNAME0= <>
##$TPNAME1= <>
##$TPNAME2= <>
##$TPNAME3= <>
##$TPNAME4= <>
##$TPNAME5= <>
##$TPNAME6= <>
##$TPNAME7= <>
##$TPOAL= (0..7)
0.5 0.5 0.5 0.5 0.5 0.5 0.5 0.5 
##$TPOFFS= (0..7)
0 0 0 0 0 0 0 0 
##$TUNHIN= 0
##$TUNHOUT= 0
##$TUNXOUT= 0
##$USERA1= <user>
##$USERA2= <user>
##$USERA3= <user>
##$USERA4= <user>
##$USERA5= <user>
##$V9= 5
##$VALIST= <valist>
##$VCLIST= <CCCCCCCCCCCCCCC>
##$VD= 0
##$VDLIST= <DDDDDDDDDDDDDDD>
##$VPLIST= <PPPPPPPPPPPPPPP>
##$VTLIST= <TTTTTTTTTTTTTTT>
##$WBST= 1024
##$WBSW= 4
##$XGAIN= (0..3)
0 0 0 0 
##$XL= 0
##$YL= 0
##$YMAX_a= 638477
##$YMIN_a= -552168
##$ZGOPTNS= <>
##$ZL1= 120
##$ZL2= 120
##$ZL3= 120
##$ZL4= 120
##$ABSF1= 16.522
##$ABSF2= -4.171173
##$ABSG= 5
##$ABSL= 3
##$ALPHA= 0
##$AQORDER= 0
##$ASSFAC= 0
##$ASSFACI= 0
##$ASSFACX= 0
##$ASSWID= 0
##$AUNMP= <proc_1d>
##$AZFE= 0.1
##$AZFW= 0.1
##$BCFW= 0
##$BC_mod= 0
##$BYTORDP= 0
##$COROFFS= 0
##$CY= 12.5
##$DATMOD= 1
##$DC= 0
##$DFILT= <>
##$DTYPP= 0
##$F1P= 14.0000005364418
##$F2P= -0.99999901652339
##$FCOR= 0.5
##$FTSIZE= 32768
##$FT_mod= 6
##$GAMMA= 0
##$GB= 0
##$INTBC= 1
##$INTSCL= 1
##$ISEN= 128
##$LB= 0.3
##$LEV0= 0
##$LPBIN= 0
##$MAXI= 10000
##$MC2= 0
##$MEAN= 0
##$ME_mod= 0
##$MI= 0
##$NCOEF= 0
##$NC_proc= -3
##$NLEV= 6
##$NOISF1= 0
##$NOISF2= 0
##$NSP= 0
##$NTH_PI= 0
##$NZP= 0
##$OFFSET= 16.522
##$PC= 1
##$PHC0= 70.88241
##$PHC1= 7.221786
##$PH_mod= 1
##$PKNL= yes
##$PPARMOD= 0
##$PSCAL= 4
##$PSIGN= 0
##$REVERSE= no
##$SF= 250.13
##$SI= 32768
##$SIGF1= 0
##$SIGF2= 0
##$SINO= 400
##$SIOLD= 32768
##$SREGLST= <1H.CDCl3>
##$SSB= 0
##$STSI= 32768
##$STSR= 0
##$SW_p= 5175.98343685301
##$SYMM= 0
##$S_DEV= 0
##$TDeff= 65536
##$TDoff= 0
##$TI= <Analysis number 999999
Compound Code 99
Book Reference 9
Project Code 9>
##$TILT= no
##$TM1= 0
##$TM2= 0
##$TOPLEV= 0
##$USERP1= <user>
##$USERP2= <user>
##$USERP3= <user>
##$USERP4= <user>
##$USERP5= <user>
##$WDW= 1
##$XDIM= 32768
##$YMAX_p= 471549637
##$YMIN_p= -31580
$$ End of Bruker specific parameters
$$ ---------------------------------
##NTUPLES= NMR SPECTRUM
##VAR_NAME=  FREQUENCY,     SPECTRUM/REAL,   SPECTRUM/IMAG
##SYMBOL=    X,             R,               I
##VAR_TYPE=  INDEPENDENT,   DEPENDENT,       DEPENDENT
##VAR_FORM=  AFFN,          ASDF,            ASDF
##VAR_DIM=   32768,         32768,           32768
##UNITS=     HZ,            ARBITRARY UNITS, ARBITRARY UNITS
##FACTOR=    0.157963299565203, 1,           1
##FIRST=     4132.6476996994, 0,             0
##LAST=      -1043.33573715361, 0,           0
##MIN=       -1043.33573715361, -31580,      0
##MAX=       4132.6476996994, 471549637,     0
$$ Real data points
##PAGE= N=1
##DATA TABLE= (X++(R..R)), XYDATA
$$ [...]
17081e432M15n265l246M156M541m213n375N086R17o276o63O437K056l422j554
17066a1838N07l076L743M353l229j291M219J459Q64J660l21J070O15j18r83j282
17050c648J945J641o168r911j468J0587R97j592M930J409Q92k267K225l040j343
17035d811m079O21K465q88o275M081J304l689M082M5l725K113M259R06k479K698
17019c372k236j819N58p7J262k964q93K473O295M990m244p851o03J31l683J415
17003a0618O424J496J303l97m559K581K321K974J556n409l117M848l17o294j203
16988h411L07m19J26j636J161k071r91J038J351j463J56M342L189k406l244M290
16972d681L630j915q91J288K96j620j346J665K50n19p71o382p52N240L670J797
$$ plain form
17081 -5432 -5017 -10282 -13528 -9372 -4831 -9044 -14419 -9333 -8416 -14692 -15355 -8918 -6862 -10284 -11838
17066 -11838 -11331 -14407 -10664 -6311 -9540 -10831 -6612 -5153 -4289 -2629 -2950 -1880 -1265 -1383 -2366 -3648
17050 -3648 -1703 -62 -6230 -16141 -17609 -7022 -6025 -7617 -2687 -1278 -386 -2653 -428 -3468 -4811
17035 -4811 -8890 -8269 -5804 -6692 -12967 -8886 -7582 -11271 -7189 -7144 -10869 -8756 -4497 -3591 -6070 -3372
17019 -3372 -5608 -7427 -6869 -6946 -5684 -8648 -9541 -7068 -773 4217 -27 -7878 -8481 -8350 -12033 -10618
17003 -10618 -4194 -2698 -1395 -1792 -6351 -3770 -1449 1525 3081 -2328 -5445 -597 -914 -7208 -8411
16988 -8411 -8104 -8523 -8397 -10033 -8872 -10943 -11934 -10896 -9545 -11008 -10852 -6510 -3321 -5727 -8971 -4681
16972 -4681 -1051 -2966 -3857 -2569 -2273 -3893 -5239 -3574 -3324 -3843 -4614 -10996 -11748 -6508 -2838 -1041
16956a041L087q91n072n012M284P898j064p329k163Q44m457m169P663M287l46
16941c481l028l8j976o17Q24J00M024P180k558k781L439j050p943m387P71N830
16925e691l153L67j759J519J743M829l607n998p30N39N673K221l164J559K569
16910c083n363m411K367J710K246J377j796l058j731p85l325l291K777K532K82
16895a3552K497j858L05M64K5k059J753L066L293j023K22q00k270o110L450n64
16879a3161l335j726M818J41n66K193K733k00j106k492N626K558q18k870k926
16864a1131l891Q46N293J399l073k147K04k463K098K489M254J330J225k851k638
16849i056j638n72J256k84O4j650l638N406K203p591o434m150J958P590O896K996
$$ plain form
16956 -1041 2046 1155 -3917 -8929 -4645 3253 2189 -5140 -7303 -6459 -10916 -15085 -7422 -3135 -3481
16941 -3481 -6509 -6547 -8523 -9140 -8316 -8216 -4192 2988 430 -2351 1088 38 -7905 -12292 -11521 -5691
16925 -5691 -8844 -8477 -10236 -8717 -6974 -2145 -5752 -11750 -12480 -11941 -6268 -4047 -7211 -5652 -3083
16910 -3083 -8446 -12857 -10490 -8780 -6534 -5157 -6953 -10011 -11742 -12527 -15852 -19143 -16366 -13834 -13552
16895 -13552 -11055 -12913 -12608 -12144 -12119 -14178 -12425 -9359 -6066 -7089 -6867 -7667 -9937 -16047 -12597 -13161
16879 -13161 -16496 -18222 -13404 -13263 -13829 -11636 -8903 -9103 -10209 -12701 -7075 -4517 -5335 -8205 -11131
16864 -11131 -15022 -14176 -8883 -7484 -10557 -12704 -12500 -14963 -12865 -10376 -6122 -4792 -3567 -6418 -9056
16849 -9056 -10694 -11266 -10010 -10294 -10230 -11880 -15518 -10112 -7909 -15500 -21934 -26084 -24126 -16536 -9640 -6644
16833f644j139m484m851j929Q832L299l940k212K506K602N82m191k770J071K536
16818a0732j815j926N703m156q432N924J611Q71L343K95j853L83L356J636J069
16803d723j870o86K909o47k440l227q09j083K472k915K164P030j322l068l002
16788a1217L022K94j351p32O41J909K047L068j998N75k4l681L18j250m320j111
16772a3810P49J660l295M19K007O19K744n46J974k165J051k7M839m766l301L365
16756h483L292n117l161K591j781j2J346L76K294J510J281l488l006J890K695
16741g773N180K34j081n70L690J906l777m886O400j799m448n01k13j377j821R27
16725i909j176N81N28K337N401l37k433L263m0k481k530J490L937l412l133M88
$$ plain form
16833 -6644 -7783 -12267 -17118 -19047 -10215 -6916 -10856 -13068 -10562 -7960 -7378 -11569 -14339 -13268 -10732
16818 -10732 -12547 -14473 -8770 -12926 -21358 -15434 -13823 -12952 -9609 -9314 -11167 -10784 -7428 -5792 -4723
16803 -4723 -6593 -7279 -4370 -5017 -7457 -10684 -11493 -12576 -10104 -13019 -10855 -3825 -5147 -8215 -11217
16788 -11217 -8195 -7901 -9252 -9984 -9343 -7434 -5387 -2319 -4317 -3742 -3766 -7447 -7129 -8379 -12699 -13810
16772 -13810 -13061 -11401 -14696 -14277 -12270 -11651 -8907 -9453 -7479 -9644 -8593 -8620 -3781 -8547 -11848 -8483
16756 -8483 -5191 -10308 -13469 -10878 -12659 -12671 -11325 -10949 -8655 -7145 -5864 -9352 -12358 -10468 -7773
16741 -7773 -2593 -2359 -3440 -4010 -320 1586 -2191 -7077 -677 -2476 -6924 -7425 -7638 -9015 -10836 -9909
16725 -9909 -11085 -10504 -9976 -7639 -2238 -2575 -5008 -1745 -1785 -4266 -6796 -5306 -1369 -4781 -7914 -7426
16709g426J455L828k92k583J668l440j58M659J905J453q48o520o78K609L907j826
16693b287L498L134l898k494n221j246K992P01R78L664o774m718J018K462K335
16678e856J107k380K676J036k699L081k652l119L35L848M017L246Q67o426m419
16663g338K51L823J134N55j156K901m101l505J056k483J219k732k733N194N458
16648b457j489k367R82l730K004L633J697m714j009L132K248N633n47k605l575
16633c164M69j746j079K2k48K049O38K869K298J393j831J154m270n081l875j555
16617a1957L814L219l594K146L070K907k810j412k536j724j323l273j703r1K582
16602a2685N26J710K445M95M543L089l5o317k620j020j247K61K571K749Q6n538
$$ plain form
16709 -7426 -5971 -2143 -2435 -5018 -3350 -6790 -6948 -2289 -384 1069 221 -6299 -6977 -4368 -461 -2287
16693 -2287 1211 4345 447 -2047 -7268 -8514 -5522 -4821 -3843 -179 -6953 -11671 -10653 -8191 -5856
16678 -5856 -4749 -7129 -4453 -3417 -6116 -3035 -5687 -8806 -8471 -4623 -606 2640 3507 -2919 -7338
16663 -7338 -7087 -3264 -2130 -1575 -2731 170 -3931 -7436 -6380 -8863 -7644 -10376 -13109 -7915 -2457
16648 -2457 -3946 -6313 -5331 -9061 -7057 -3424 -1727 -6441 -7450 -4318 -2070 3563 3016 411 -3164
16633 -3164 -2695 -4441 -5520 -5498 -5746 -3697 -3059 -190 2108 3501 1670 2824 -1446 -6527 -10402 -11957
16617 -11957 -8143 -4924 -8518 -6372 -3302 -395 -3205 -4617 -7153 -8877 -10200 -13473 -15176 -15267 -12685
16602 -12685 -12159 -10449 -8004 -7509 -2966 123 88 -6229 -8849 -9869 -11116 -10855 -8284 -5535 -5449 -10987
16586a0987j518R56L286O256P41n323m282J811k335J781K109J532J088r47m057
16571i889L477M646j289M48J026J244j358j699J224J897m300m06k400m163J245
16556a0297o32L426N601j196j057j168K407K510l156j199M118k729K76N036k294
16541c54l974l435j004M244J217M15o167j256L391J310L79O68k226l414j586l87
16525a2179K87O569J348n856J862O37r03k146j522N58P373J247m712n238L006
16510i669O10M19L034J783m120n703j095P475M284L278k324N0O02j541L900o78
16494C05p479m169J805M437J550k985k847J39L423O593j91K437l526o903j81L322
16478d270J713N280N947L037o221m600J770L604K585m965n7M198j192j1K98J336
$$ plain form
16586 -10987 -12505 -11549 -8263 -2007 -1266 -6589 -10871 -9060 -11395 -9614 -7505 -5973 -4885 -5832 -9889
16571 -9889 -6412 -1766 -3055 -2607 -1581 -337 -1695 -3394 -2170 -273 -4573 -4979 -7379 -11542 -10297
16556 -10297 -10929 -7503 -1902 -3098 -4155 -5323 -2916 -406 -3562 -4761 -643 -3372 -3096 1940 -354
16541 -354 -4328 -7763 -8767 -4523 -3306 -2891 -9058 -10314 -6923 -5613 -5234 -4566 -6792 -10206 -11792 -12179
16525 -12179 -11892 -5323 -3975 -9831 -7969 -7332 -8235 -10381 -11903 -11345 -3972 -2725 -7437 -12675 -9669
16510 -9669 -9059 -8640 -5606 -3823 -7943 -13646 -14741 -7266 -2982 296 -2028 -1978 -1376 -2917 983 305
16494 305 -7174 -11343 -9538 -5101 -3551 -6536 -9383 -9244 -5821 772 581 3018 -508 -7411 -7592 -4270
16478 -4270 -2557 2723 8670 11707 5486 886 2656 6260 8845 3880 3823 8021 6829 6818 7116 8452
16462H452p22L36j487m484k171L278o01l101j712n03L461K637q085j305J746m062
16446h323Q93L885R88L275J464J409l163O23K84l758j0070k446O210P196N788
16431D255k497J19n092j905K776J073K55J207O44l333J883l503M295L262q33j896
16415G10o48J92j23Q51J801N510j717p712M520l85q84L357k674n32R24n645k827
16398e282P252N703L883l710r31l59J202r64J362N157K667k126l101P16K467j822
16382A2114l659j758O185o31o44p64M648J401l535k838m30J33p128n126N780K527
16366F275p494k696L957L761Q56k59K451j805J170j341m941L39P949M443K485
16351A5150l837o43m500K648Q826K398k198l458j434J426J564J133k855J394N40
$$ plain form
16462 8452 7730 8066 6579 2095 -76 3202 2601 -500 -2212 -2715 746 3383 -4702 -6007 -4261 -8323
16446 -8323 -7430 -3545 -2557 718 2182 3591 428 1051 1335 -2423 -12493 -14939 -8729 -1533 4255
16431 4255 1758 1877 -3215 -5120 -2344 -1271 -1016 191 835 -2498 -615 -4118 177 3439 2606 710
16415 710 62 254 131 982 2783 8293 6576 -1136 3384 2999 2115 5472 2798 2266 3190 -2455 -5282
16398 -5282 1970 7673 11556 7846 6915 6556 7758 6794 8156 13313 15980 13854 10753 11469 13936 12114
16382 12114 8455 6697 12882 12251 11607 10843 15491 16892 13357 10519 10089 10222 3094 -2032 3748 6275
16366 6275 -1219 -3915 42 3803 4659 4400 6851 5046 6216 4875 -66 273 8222 12665 15150
16351 15150 11313 10670 6170 8818 17644 20042 17844 14386 12952 14378 15942 17075 14220 15614 16154
16336A6154P49j906m373r27N031M351j312n866k038k26M072j126k01K109L048
16321A7539j524K055n78m70j007j439j694o73j092R62R39k015k447J672l61K528
16305A2395L712J024k538O91K450J690L53J905k325r107k210k230M128N665L569
16290A9172J568j029J256R81j678N08J386K876J633l056k973J179j87l106L65
16275A8895P91N9k309j650M372m418l314N366K061j687J269K545J766L379J833
16260B8958J270l489j628k464m571P176M196M7M513m060j9n75M9k199l616o492
16244A7096n56P786N749J27m378o214J295L711m4n95l167J634M4m300p139k10
16228A0839N016L365M599p99j539M670j086r41J274N099m70l874j822K424J352
$$ plain form
16336 16154 16903 14997 10624 9697 14728 19079 17767 11901 9863 9637 13709 12583 12382 14491 17539
16321 17539 16015 18070 17492 17022 16015 14576 12882 12209 11117 12079 13018 11003 8556 10228 9867 12395
16305 12395 16107 17131 14593 15284 17734 19424 19777 21682 19357 10250 8040 5810 9938 15603 19172
16290 19172 20740 19711 20967 21948 20270 20778 22164 25040 26673 23617 20644 21823 21636 18530 18895
16275 18895 19686 19745 17436 15786 20158 15740 12426 17792 19853 18166 19435 21980 23746 27125 28958
16260 28958 30228 26739 25111 22647 18076 25252 29448 29495 34008 29948 29929 29354 29403 27204 23588 17096
16244 17096 16540 24326 30075 30202 25824 19610 20905 24616 24572 23977 20810 22444 22488 18188 11049 10839
16228 10839 15855 19220 23819 23020 21481 26151 25065 24124 25398 30497 30027 26153 24331 26755 28107
16213B8107l186L594L429n377q248j722K006M047k06J53n480k065O319J167P69
16198B3307k504j580m83k348r76K859K463R76k433j939l67p48k445O437N143K78
16182B5640m60p524l131J513L296n4J915K077j549J841l077k702J591n039j953
16167A2384K405K742J77j026K314O18J753j021J281M91L493L437p38k991L029
16152B8348m93o432L008L255j774p465k671K458L021J574j880R75l59J212q55
16137B1922r08j837J228j126J152j681j725k064K79j458M667j623j228K770Q94
16122A9262j04J642j484j601N71p50j863k679n308L734K248n033J106p81k161
16107F799q50M945N985P22k162q43J807K486P09o32M9O30P28J320J839k559J985
$$ plain form
16213 28107 24921 28515 31944 26567 18319 16597 18603 22650 22444 22597 17117 15052 21371 22538 23307
16198 23307 20803 19223 18740 16392 15416 18275 20738 21714 19281 17342 16975 16227 13782 20219 25362 25640
16182 25640 25180 17656 14525 16038 19334 19280 21195 23272 21723 23564 20487 17785 19376 14337 12384
16167 12384 14789 17531 17708 16682 18996 19614 21367 20346 21627 22118 25611 29048 28310 25319 28348
16152 28348 27855 21423 24431 27686 25912 18447 15776 18234 21255 22829 20949 21924 21565 22777 21922
16137 21922 21014 19177 20405 19279 20431 18750 17025 14961 15240 13782 18449 16826 15598 18368 19262
16122 19262 19158 20800 19316 17715 18286 17536 15673 12994 7686 11420 13668 8635 9741 8960 6799
16107 6799 5949 10894 16879 17601 15439 14596 16403 18889 19598 18966 19015 19645 20373 21693 23532 20973 22958
16090B2958K001l458j571q99j921l956K821M221j463l057k742o2L646k727P7J734
16074A5602J376J925k497j440l102J560K277p314J651J684P546M618l129m881
16060A5876n8L189l361j447l9K048k80k014j815J907K553q5J194O963K638M05
16044B7674L086R951K000k787n085r336r710j047L068o28J890K562J198N74n005
16029A8405n958r6J979k314J933j009P90L298J496l28o190l613K734r44J477J729
16013A3389K498K950o36k224m488J694J937O91k442J632R19R74O968j311j625
15998B0926k123N394l38o154l127K435K755Q21M306m401k885K560N09R50J059
15983B2687Q4N20J132j491m49J129R92Q13K898j487l277M163l596n326j747j82
$$ plain form
16090 22958 24959 21501 19930 19031 17110 13154 15975 20196 18733 15676 12934 12872 16518 13791 13868 15602
16074 15602 16978 18903 16406 14966 11864 13424 15701 8387 10038 11722 19268 23886 20757 15876
16060 15876 15818 19007 15646 14199 14160 16208 15928 13914 12099 14006 16559 16474 17668 24631 27269 27674
16044 27674 30760 40711 42711 39924 34839 25503 15793 14746 17814 17186 19076 21638 22836 23410 18405
16029 18405 12447 12351 14330 12016 13949 12940 13730 17028 18524 18196 12006 8393 11127 10183 11660 13389
16013 13389 15887 18837 18201 15977 11489 13183 15120 15811 13369 15001 15920 16894 23862 22551 20926
15998 20926 18803 24197 23859 17705 14578 17013 19768 20589 24895 20494 17609 20169 20678 21628 22687
15983 22687 22771 23291 24423 22932 22483 23612 24604 25417 28315 26828 23551 27714 24118 18792 17045 16863
15967A6863N398J103J723p79j183p75r50j068J936m44k335L264J790L373k764
15952B5152m93J171r80L023o54l560J202K178j070k397l616j903p70L266L650
15937B4199R23K415N035l693j979R91j988k939K755K297L421k633l065k861j466
15922B1412M040l130l722K373j569j31M922K75O83r52j560k772o82K099M494K185
15906B7965J091k852o858j110O057J890K552M032m868p91r14L154k65m690m054
15891B0339k37n96K822L948k231o585p18L696L719L111l503r88J710O05Q18l322
15875B2588p12j469K854O402p63k439K448K338l076m393k43k463m55M042r08L523
15859B7274J023k044j476R81L921r00K454K314J444j256o323m058j923K905j384
$$ plain form
15967 16863 22261 23364 25087 24308 23125 22350 21400 20332 22268 21824 19489 22753 24543 27916 25152
15952 25152 24659 25830 24850 27873 27219 23659 24861 27039 25969 23572 19956 18053 17283 20549 24199
15937 24199 25122 27537 32572 28879 26900 27891 25903 22964 25719 28016 31437 28804 25739 22878 21412
15922 21412 25452 22322 18600 20973 19404 19273 24195 24470 25153 24201 22641 19869 19187 21286 25780 27965
15906 27965 29056 26204 19346 18236 24293 26183 28735 32767 27899 27108 26194 29348 29083 24393 20339
15891 20339 20102 19506 22328 26276 24045 17460 16742 20438 24157 27268 23765 22777 24487 25092 25910 22588
15875 22588 21876 20407 23261 29663 28900 26461 28909 31247 28171 23778 23535 21072 20617 24659 23751 27274
15859 27274 28297 26253 24777 25758 29679 28779 31233 33547 34991 33735 27412 23354 21431 24336 22952
15844B2952l119l860M994L228N347K280k633m469k931j682j935M606m54m176k96
15829A7852K973P814l536k493k47K386K439n028m596L337Q639j088p65j664L52
15814B6375J831j757k801j447N37J94k711l54m070j319J280P223K651l204k844
15799A9584J222j153p65P55k85k188N86k292K018L609K813k608l60J049K40M518
15783B6743K017j322j899m252J162J137j520k785l982n49l141k212q46K360O623
15768A7534J848k917J644K176m040K550K084p392l915M448Q087K019l326k232
15754A8568k085r41K20M182K006j572k776K768L897L59k592k861o390l464L73
15739I692j777j338K548L95M031L664L09q43O53m55M27J890J92J12k608k841n30
$$ plain form
15844 22952 19833 15973 20967 24195 29542 31822 29189 24720 21789 20107 18172 22778 22324 18148 17852
15829 17852 20825 28639 25103 22610 22363 24749 27188 22160 17564 20901 29540 28452 27687 26023 26375
15814 26375 28206 26449 23648 22201 22738 22932 20221 19867 15797 14478 15758 22981 25632 22428 19584
15799 19584 20806 19653 18888 19643 19358 17170 17756 15464 17482 21091 23904 21296 20936 21985 22225 26743
15783 26743 28760 27438 25539 21287 22449 23586 22066 19281 15299 14750 11609 9397 8551 10911 17534
15768 17534 19382 16465 18109 20285 16245 18795 20879 13487 9572 14020 22107 24126 20800 18568
15754 18568 16483 15542 15762 19944 21950 20378 17602 20370 24267 24626 22034 19173 12783 9319 9692
15739 9692 7915 6577 9125 9520 13551 17215 17524 16681 17334 16879 17306 19196 19388 19500 16892 14051 13521
15722A3521R18k371j850L704N354l98J57L804K308j036K74l055k332n523L34Q9
15706A3898k330L530M173o23p47N44q56k349j907L557K437O62k623q169J970L913
15690A5080k42J562p56k681j418J59K520J753p7J886m207r15J021j613r68r64
15674A0140K312K81K127J584j536m487L480J357j178N573L600k668n171P80J478
15659A7672j661o686QM64j902K977J227j998l421J203O629M550K109Q22m228n225
15643A2540l544O18M677L71l488M290J083k075m870l594L624L375P572N369k701
15628B3247k534m464n716L307O415m324J97p05m351l429J703K26J722J193m445
15613H042k611q88N319K858j356k01j889k61N083Q128r01k646k090J223J05m126
$$ plain form
15722 13521 14439 12068 10218 13922 19276 18878 19035 22839 25147 24111 24385 21330 18998 13475 13809 13898
15706 13898 11568 15098 19271 18648 17901 18445 17589 15240 13333 16890 19327 19989 17366 9197 11167 15080
15690 15080 14838 16400 15644 12963 11545 11704 14224 15977 15900 17786 13579 12664 13685 12072 11104 10140
15674 10140 12452 12733 14860 16444 14908 10421 13901 15258 14080 19653 23253 20585 15414 16194 17672
15659 17672 16011 9325 9333 9797 7895 10872 12099 10101 6680 7883 14512 19062 21171 21993 17765 12540
15643 12540 8996 9614 14291 14662 11174 15464 16547 14472 9602 6008 9632 13007 20579 25948 23247
15628 23247 20713 16249 10533 13840 20255 15931 16128 15423 11072 7643 9346 9572 11294 12487 8042
15613 8042 5431 4543 9862 12720 11364 11163 9274 9013 14096 22224 21323 18677 16587 17810 17915 13789
15597A3789k350l039l809M213P40n726j257K484O176M062m00N050J504J022j63
15582B2296m862l414j25j04k390J086J979l009j848J804K083J037j57K495l064
15567A3807K444Q02M969L317q20k592k8j416m332M59m162l039J675N489m4K406
15551A8935K346r93k908j395k792j187O1L618N89M362J441l307n512J117K173
15536A6548l666K780k417l220Q83J304P18k189k94M162L539K316N42o904q64K969
15520A6207n87j365j657k66r52K856j055N83R09M794n30m324k434J517J947K418
15504A8061j444n438J134o650m778k250L314L85L807J188J688K517J288L931K937
15489A9690n249k778l61K196m373n986M861L368R20l321J793J973M340K290K270
$$ plain form
15597 13789 11439 8400 4591 8804 9544 3818 2561 5045 11221 15283 14883 19933 21437 22459 22296
15582 22296 17434 14020 13895 13791 11401 12487 14466 11457 9609 11413 13496 14533 14376 16871 13807
15567 13807 16251 17053 22022 25339 24519 21927 21899 20483 16151 16610 12448 9409 11084 16573 16529 18935
15551 18935 21281 20288 17380 15985 13193 12006 12067 15685 16274 20636 22077 18770 13258 14375 16548
15536 16548 12882 15662 13245 10025 10908 12212 12930 10741 10447 14609 18148 20464 21006 14102 13238 16207
15520 16207 15620 14255 12598 12332 11380 14236 13181 13764 14673 19467 18937 14613 12179 13696 15643 18061
15504 18061 16617 11179 12313 5663 885 -1365 1949 2334 6141 7329 9017 11534 12822 16753 19690
15489 19690 14441 11663 11302 13498 9125 3139 8000 11368 12288 8967 10760 12733 17073 19363 21633
15474B1633r81j879m12o482n756q23K85K091P905J783K124k233L604m016p16n6
15458A6071K971O40K276o338k006l096k624J214M145J677N011N648L98L44l970
15443B2361J217p69J781J218J11k754L24k93m256o73N899M678J686o049Q64J971
15427B7316l556m089l147O149J388j049o7J096J23j321M155K69o46K209l123m096
15411B1611K84L823L279k436K32q3j408j456j550M257K625J154m274M587J080
15396C1725l142O12p40m281L309p34n822m47L611Q34k733j327J853l133o75M064
15380B2974M012J822n396o54N365n15m272K239N03l230J811k939l29k370J726
15365B0747K102m09k152J384o38K653L873L56m6J89K135o09K36J729k485J388
$$ plain form
15474 21633 20652 18773 18361 11879 6123 5300 5585 7676 15581 17364 19488 17255 20859 16843 16127 16071
15458 16071 19042 19682 21958 15620 13614 10518 7894 9108 13253 14930 19941 25589 25987 26331 22361
15443 22361 23578 22809 24590 25808 25919 23165 23489 23196 18940 18267 24166 28844 30530 24481 25345 27316
15427 27316 23760 19671 16524 22673 24061 23012 22945 24041 24164 22843 26998 27267 26621 28830 25707 21611
15411 21611 21895 25718 28997 26561 26793 26710 25302 23846 22296 26553 29178 30332 26058 30645 31725
15396 31725 28583 29195 28455 24174 27483 26749 20927 20480 24091 24925 22192 20865 22718 19585 18910 22974
15380 22974 26986 28808 23412 22758 28123 27608 23336 25575 26078 22848 24659 21720 21391 19021 20747
15365 20747 22849 22440 20288 21672 21034 23687 27560 27916 27870 28059 30194 29585 29821 31550 29065 30453
15349C0453K246l103k582J469K012j446l609L616m785m358j916M20M465M675K406
15334B9963K567M853o45J937r84n406n902j971K146N232K757J597N38p47j112
15319C4823k859R03N033L110l018k455K825J40k614k772K583Q883j670n002J76
15304C8086O202N313j319m487k117k891k54N300j2j0p30j943j777k421K028p90
15288C8178j373N46k743o260k978r49J96L35J440K245k058o092O52j597K333L272
15272B5147J259K755J047K566j953j41N9l962J385K534L468M142J473l870m139
15257C1770K113m014k111M509m96j342j363k915n49J893K930K251J710pJ113N317
15241D0809K072p769k661K900M489l452o667K341K201K003k202N506L411K585
$$ plain form
15349 30453 32699 29596 27014 28483 30495 29049 25440 29056 24271 19913 17997 18417 22882 27557 29963
15334 29963 32530 37383 36738 38675 37691 32285 26383 24412 26558 31790 34547 36144 36682 35935 34823
15319 34823 31964 32867 37900 41010 37992 35537 38362 38502 35888 33116 35699 44582 42912 37910 38086
15304 38086 44288 49601 48282 43795 41678 38787 38533 43833 43821 43811 43081 41138 39361 36940 38968 38178
15288 38178 36805 37351 34608 28348 25370 24421 24617 24952 26392 28637 26579 20487 21139 19542 21875 25147
15272 25147 26406 29161 30208 32774 30821 30680 30739 26777 28162 30696 34164 38306 39779 35909 31770
15257 31770 33883 29869 27758 32267 31771 30429 29066 26151 25602 27495 30425 32676 34386 34379 35492 40809
15241 40809 42881 35112 32451 35351 39840 36388 29721 32062 34263 36266 34064 39570 42981 45566
15227D5566q7P55O2k409k818J249L065j657k356M957M776j898J059j256k866j42
15211D6000N325K308L014J497P42l112k692J77M129L584J814K652m8J279L151
15196F9820O785K827M512M742L454P087p55N26m592j0139m324N27o623q230j561
15181F4056o95M965M169J088o223l923j129M497R55n12J865K878l076l762l425
15166F1728O520N178P63L064j458j844p882j375m08R85L854L446r12J302k704
15151G0257Q26K115k239N356N505j360p61N83L314R57j45L242L560K842J163L674
15135I8889m36m888j656L769L965K34J533j684M358O193M388Q39j366l734J032
15120A11436K314M37j253n010k73L951k127j378J112J768J37P49k675Q55J780
$$ plain form
15227 45566 45479 46234 46296 43887 41069 42318 45383 43726 41370 46327 51103 49205 50264 49008 46142 46000
15211 46000 51325 53633 56647 58144 58886 55774 53082 53259 57388 60972 62786 65438 65390 66669 69820
15196 69820 76605 79432 83944 88686 92140 99227 98472 98998 94406 84267 79943 80470 73847 65617 64056
15181 64056 63361 68326 72495 73583 67360 63437 62308 66805 67760 67248 69113 71991 68915 65153 61728
15166 61728 68248 73426 74189 77253 75795 73951 66069 64694 64286 65271 69125 72571 71659 72961 70257
15151 70257 71083 73198 70959 76315 81820 80460 79699 80282 83596 84553 84408 87650 91210 94052 95215 98889
15135 98889 98453 93565 91909 95678 99643 99877 101410 99726 104084 110277 114665 115504 114138 110404 111436
15120 111436 113750 114187 112934 107924 107651 111602 109475 108097 109209 110977 111114 111863 109188 110043 111823
15105A11823K943J585K779J523k507m514L541K394K019Q02K260J0096j279n496
15091A27969L411N599J29N328K243k150m054k485L089N893N935O172K411K977
15077A62467N564O295N791P497L672k128k985J381k789m247k219m12J053J036
15063A79976k749r82L319j060m91Q14J845k79n568m314L721K069j737k901Q97
15048A72560j774Q34J404l35J514k204N56j209q74K183l005J541K14K723O169
15033A80297J490l778K118L692O602N282L700K520K197L875K432k780p217k393
15019A98037o01j942j091N294L687j713J093P188J350n191J067Q17L012J785R524
15004B22316N332M378N972K162M963L857N43L150N247K948o27j61O526N029l37
$$ plain form
15105 111823 114766 116351 119130 120653 118146 113632 117173 119567 121586 122388 124648 134744 133465 127969
15091 127969 131380 136979 137108 142436 144679 142529 138475 135990 139079 144972 150907 157079 159490 162467
15077 162467 168031 174326 180117 187614 191286 189158 186173 187554 184765 180518 178299 177887 178940 179976
15063 179976 177227 176245 179564 178504 178013 178827 180672 180393 174825 170511 174232 176301 174564 171663 172560
15048 172560 170786 171620 173024 172689 174203 171999 172555 171346 170472 172655 169650 171191 171405 174128 180297
15033 180297 181787 178009 180127 183819 190421 195703 199403 201923 204120 207995 210427 207647 200430 198037
15019 198037 197436 195494 194403 199697 203384 201671 202764 209952 211302 206111 207178 207995 211007 212792 222316
15004 222316 227648 232026 237998 240160 245123 248980 249523 252673 257920 260868 260241 260080 266606 271635 271298
14989B71298l742K485M423P447N929j619M279L135k26J848K349O583N466Q185
14975C17840M444K991l309j937M165L106P53J755K483P588L845n81P306Q114K74
14960C58837O032O053Q517Q639J0832J1630Q874R377J1813K2107K0238J4620J1146
14947E08715J0375J5658J3591J6085J0953J4021O640O887L842M180J822K58L33
14934F13360M89L193O201N633Q567P259L079M506R050N418O082J0907J5303J0893
14920G09940R562J6464J7193J4345J4509J5946J8367J8701J9806J6698J7732K2136
14908I11399J9380K1800K3355K3318K7560K6227J8295K2868K6310K9214L3783
14897A183509L3450K7823L7731K9754K7994L0591L5788M2245M4553M5704M4359
$$ plain form
14989 271298 267556 270041 274464 281911 287840 286221 290500 293635 293409 295257 297606 304189 309655 317840
14975 317840 322284 325275 321966 320029 324194 327300 328053 329808 332291 339879 343724 343143 350449 358563 358837
14960 358837 364869 370922 379439 388078 398910 410540 419414 428791 440604 462711 482949 497569 508715
14947 508715 519090 534748 548339 564424 575377 589398 596038 602925 606767 610947 612769 613027 613360
14934 613360 613849 617042 623243 628876 637443 644702 647781 652287 661337 666755 672837 683744 699047 709940
14920 709940 719502 735966 753159 767504 782013 797959 816326 835027 854833 871531 889263 911399
14908 911399 930779 952579 975934 999252 1026812 1053039 1071334 1094202 1120512 1149726 1183509
14897 1183509 1216959 1244782 1282513 1312267 1340261 1370852 1406640 1448885 1493438 1539142 1583501
14886A583501M6589N3264N2853N3575N1948N8307O0359O7373P8104Q3196Q2764
14875B271833Q4927R0038Q7970R0964R8858J01879J10773J13072J22165J27417
14865C299896J32923J39300J41521J53266J69702J84475J97166K13202K24826
14856D856277K40847K56963K76090L02489L30672L46207L73559M13189M52275
14847G848568M92548N33895N86446O50800P14905P85315Q74078R72508J083850
14838A4542913J219674J365550J536543J721239J943888K194340K472099K788815
14830B9785061L140357L514663L917645M302713M658547M931346N074721N008964
14822F4334017M687468M082830L209690K099093Q48310m14588j588542k594666
$$ plain form
14886 1583501 1630090 1683354 1736207 1789782 1841730 1900037 1960396 2027769 2105873 2189069 2271833
14875 2271833 2356760 2446798 2534768 2625732 2724590 2826469 2937242 3050314 3172479 3299896
14865 3299896 3432819 3572119 3713640 3866906 4036608 4221083 4418249 4631451 4856277
14856 4856277 5097124 5354087 5630177 5932666 6263338 6609545 6983104 7396293 7848568
14847 7848568 8341116 8875011 9461457 10112257 10827162 11612477 12486555 13459063 14542913
14838 14542913 15762587 17128137 18664680 20385919 22329807 24524147 26996246 29785061
14830 29785061 32925418 36440081 40357726 44660439 49318986 54250332 59325053 64334017
14822 64334017 69021485 73104315 76314005 78413098 79261408 78846820 77258278 74663612
14814G4663612l404248l996078m382094m575233m608137m505877m299941m031386
14806D0860618l716581l384258l057702k746327k458764k192438j954806j752184
14798A9597558j563644j391508j259633j138625j016769r13461q34962p59215
14790A0719741o90734o32108n71031n21815m75959m42761m04591l72705l43418
14781F264619l19284k99990k73841k55648k41354k24209k05953j87587j77823
14772D078930j69316j61789j51566j41843j33054j20427j13263j08159r9740q7722
14762B792051q6690q6787q0980p5784p2478p1525o6191n8729n6850n7451n1670
14751B026916m8456m1565l9001l7818l8011l0995k1139j7022p540L401J4021K1032
$$ plain form
14814 74663612 71259364 67263286 62881192 58305959 53697822 49191945 44892004 40860618
14806 40860618 37144037 33759779 30702077 27955750 25496986 23304548 21349742 19597558
14798 19597558 18033914 16642406 15382773 14244148 13227379 12313918 11478956 10719741
14790 10719741 10029007 9396899 8825868 8304053 7828094 7385333 6980742 6608037 6264619
14781 6264619 5945335 5645345 5371504 5115856 4874502 4650293 4444340 4256753 4078930
14772 4078930 3909614 3747825 3596259 3454416 3321362 3200935 3087672 2979513 2879773 2792051
14762 2792051 2705361 2618574 2537594 2461810 2389332 2317807 2251616 2192887 2136037 2078586 2026916
14751 2026916 1978460 1936895 1897894 1860076 1822065 1791070 1769931 1752909 1745369 1748770 1762791 1783823
14739A783823K9410M3588O9209J00761J43834K19673L37591M96195O91177Q67732
14729D782993R78277R84438Q57835N91288K03205k27454o15474q84359j007477
14720E663272j004868r02103p26268n39009l78603k56914j83649j36692j16758
14711A418408r9381q1653o4960n7285m9377n4775n3019m1609l9778l2197l0280
14700H14094l0343k8483k5890k4466k2919k1317j9149j0677r716q793j3943j2219
14688E86179r892p817m486r428j589k548r643j3578r480p372o045l313n715p531
14674D87742j0410p432p680r044m696q462o778q203p993m183K277l325j1114q523
14660C92176n738n252r817j0104p414m887j632K74q084j2644m097m259r117m825
$$ plain form
14739 1783823 1813233 1856821 1926030 2026791 2170625 2390298 2727889 3224084 3915261 4782993
14729 4782993 5761270 6745708 7603543 8194831 8398036 8170582 7555108 6670749 5663272
14720 5663272 4658404 3756301 3030033 2491024 2112421 1855507 1671858 1535166 1418408
14711 1418408 1319027 1237374 1172414 1115129 1065752 1010977 957958 916349 876571 844374 814094
14700 814094 783751 755268 729378 704912 681993 660676 641527 630850 621134 612341 598398 586179
14688 586179 576287 568470 563984 554556 552967 550419 540776 527198 517718 510346 504301 500988 495273 487742
14674 487742 477332 469900 462220 453176 448480 440018 433240 425037 417044 412861 415138 411813 400699 392176
14660 392176 386438 381186 371369 361265 353851 348964 347332 347606 339522 326878 322781 318522 309405 304580
14646C04580j919M84J90k634n684m725J037k537r49j25J154n94j842n904R18K518
14630B83968m565n19l356q737p146j744K246j489K959n306m366O60J115m127l467
14615B46126o376m577o490n383K1o502K292o32m762n544j507p51j333n84l250
14600B00748o192k013k790R6j725n990l87o94k289O32J247M804k210o565m066
14585A72606k340o33q11J573K90l697q278l298K369K322J467m67r4M181q51j785
14569A62554l329l137P86K11L304n76m127j75K833p74k862Q46M91n429J575J105
14553A53296n797l936m281k156l115r41k572o98k841l434k750M771J557k150o965
14538A17988r36J581K59k431m385j720m61N30N195K134J47j487m18J421K827n0
$$ plain form
14646 304580 302661 303145 303335 300701 295017 290292 291329 288792 287843 287718 288872 288278 286436 280532 281450 283968
14630 283968 279403 278884 275528 266791 259645 257901 260147 258658 261617 256311 251945 252605 253720 249593 246126
14615 246126 239750 235173 228683 223300 223321 216819 219111 218479 213717 208173 206666 205915 204582 203998 200748
14600 200748 194556 192543 189753 189849 188124 182134 181747 181053 178764 179396 180643 185447 183237 176672 172606
14585 172606 170266 169633 168822 170395 170685 166988 158710 155412 157781 160103 161570 161103 161009 165190 164339 162554
14569 162554 159225 156088 156874 157085 160389 159813 155686 155511 158344 157570 154708 155554 156045 150616 152191 153296
14553 153296 147499 143563 139282 137126 134011 133070 130498 129800 126959 123525 120775 125546 127103 124953 117988
14538 117988 117052 118633 118892 116461 112076 110356 109895 110425 115620 117754 117901 116414 115996 117417 120244 120194
14522A20194m698P26K193K67l115n315k562L569j249k775J229J723n85k417l717
14507A03468o488K160K898l299k124L710L83J170M135J087P898Q113L046M780
14493A30937J274o35k804K482J520m450J250k76n500P91m862j724l823k694L640
14478A15126M966M806Q617N157J146P073J2154J3275J7701J6507L0852N0308P1664
14465C59352Q9058J29318J73167J98654J97904J83192J69253J40828P8518k392
14455A716852q8632j43582j67736j78923j92797j88064j59542j22637q5643n9755
14445C29541m2053l2702k8395k4580k1852j5934j4937o479m554q342q265j1822
14433A09626q994l816q302j0472k805j905K512M257M727r098o345R96J162q92
$$ plain form
14522 120194 115496 116222 118415 118682 115567 110252 107690 111259 110010 107235 108464 110187 109602 107185 103468
14507 103468 96980 99140 102038 98739 96615 100325 100708 101878 106013 107100 114998 123111 126157 130937
14493 130937 132211 131576 128772 131254 132774 128324 129574 129298 123798 124589 119727 118003 114180 111486 115126
14478 115126 120092 124898 133515 138672 139818 146891 159045 172320 190021 206528 237380 287688 359352
14465 359352 448410 577728 750895 949549 1147453 1330645 1499898 1640726 1719244 1716852
14455 1716852 1628220 1484638 1316902 1137979 945182 757118 597576 474939 389296 329541
14445 329541 287488 254786 226391 201811 179959 164025 149088 142609 138055 129713 121448 109626
14433 109626 100632 96816 88514 78042 75237 73332 75844 80101 84828 75730 69385 70381 71543 70651
14419G0651J003O74J115j285j624L326K571K501j205M922J2384P993Q802J0216
14405A22044J8676J6059J8146J9400K6222K5356K5807J4294P289j285r483j8617
14393B63908k3014k4224k3649k0559k2708j6544j2024q430n013m180n641m995
14381I2927j90j552m192k574K259K536M105P01j665j384J166M28q169k749J745
14366H3392K245J374j760p251K69K433j341o16J062p99l283m929K780N074J135
14351G9785k320j022l684j642n72k712K920L263J111o991q266j5k10J139K039
14336F2823M634j285o504q839l160M845N168M465L479J103J793N396N418N132
14322H4468P141M532J0109R257R933Q796O469N954Q78p23k87m016r014r348j3495
$$ plain form
14419 70651 71654 72328 73443 72158 70534 73860 76431 78932 77727 82649 95033 103026 111828 122044
14405 122044 140720 156779 174925 194325 220547 245903 271710 286004 293293 292008 282525 263908
14393 263908 240894 216670 193021 172462 149754 133210 121186 112756 107743 103563 97922 92927
14381 92927 92737 91185 86993 84419 86678 89214 93319 94020 92355 90971 92137 92565 84396 81647 83392
14366 83392 85637 87011 85251 78000 78269 80702 79361 78745 79807 79008 75725 70796 73576 78650 79785
14351 79785 77465 76443 72759 71117 70545 67833 70753 74016 75127 68136 59870 59855 59645 60784 62823
14336 62823 67457 66172 59668 50829 47669 52514 57682 62147 65626 66729 68522 73918 79336 84468
14322 84468 91609 96141 106250 115507 125440 134236 140705 146659 147537 146814 146527 142511 133497 124149 110654
14307A10654j7127o547R35Q251M503J0677J9939K6761K6138L2225L5927K5807
14295B78143J3150q863k7403l1656l3841k9451k0669j0587o114o160o76r43M761
14282A19691M070l567k869l34m292j599L142R117R216J2326J1390R266J0849J3520
14268A89926J9657J7468J4588J6205J0535R074Q368m345k197o037q256j5118j5761
14255B34107j2455p085q436j0515r744p383n450r570m548p675j0083p223l693
14242A30247M77k548l118k884o155p3r76p18Q23J626N26l236p313l098l608p852
14226I2120n408k273j875k367m218l75j154J204K703L062M115N805J0886O109
14212A08334M331O379K756K237L74j0071o246p327j3181j0521n283l630o854k10
$$ plain form
14307 110654 93527 86980 87915 96166 100669 111346 131285 158046 184184 216409 252336 278143
14295 278143 291293 282430 255027 223371 189530 160079 139410 128823 122709 116549 115873 114930 119691
14282 119691 123761 120194 117325 116991 112699 111100 114242 123359 132575 144901 156291 165557 176406 189926
14268 189926 209583 227051 241639 257844 268379 277453 285821 281476 279279 273242 264986 249868 234107
14255 234107 221652 214567 206131 195616 185872 178489 173039 163469 158921 151246 141163 133940 130247
14242 130247 130724 128176 125058 122174 116019 115946 114970 114252 115075 116701 117227 113991 106678 103580 99972 92120
14226 92120 86712 84439 82564 80197 75979 75604 74450 75654 78357 81419 85534 91339 102225 108334
14212 108334 112665 119044 121800 124037 124411 114340 108094 100767 87586 77065 71782 68152 61298 61088
14198F1088M738O973N152P875Q102Q118K688L052Q845J5202R909L094M126L555
14184A52517L468j342k302k212m094q828j0890p931k261l775p938n733n033N92
14170I4238L355P996J0652Q410M291L908j777m602o088m577q453n847o437o276
14156H8793o412j142q52O71Q43K32Q062J2736Q970J0542N975J0067K0454J5490
14142A74429K2579L1266M3458N2197N7497N1814M3697L7722L0260J0171j2359
14131E42731l2062m4317m2534m2726l9180m2519l3727j9221j2321n365N82P730
14119B37071K250k980p87k256n971o476n607M599P109R361P208O730L974N751
14105B59976O021L730R317J1926O877Q608O605J2645J6762J7753K1858J6763J5185
$$ plain form
14198 61088 65826 72799 77951 85826 93928 102046 104734 107786 116631 131833 141742 144836 148962 152517
14184 152517 155985 154643 152341 150129 146035 137207 126317 118386 116125 112350 104412 98679 93646 94238
14170 94238 97593 105589 116241 124651 128942 132850 131073 126471 120383 115806 107353 101506 95069 88793
14156 88793 82381 81239 80387 81058 81901 82133 90195 102931 111901 122443 128418 138485 158939 174429
14142 174429 197008 228274 271732 323929 381426 433240 476937 514659 544919 555090 542731
14131 542731 510669 466352 423818 381092 341912 299393 265666 246445 234124 228759 229341 237071
14119 237071 239321 236341 235554 233298 227327 220851 215244 219843 226952 236313 243521 250251 254225 259976
14105 259976 265997 269727 279044 290970 297847 306455 313060 325705 342467 360220 382078 398841 414026
14092D14026J5300K1307K7232L0530K8252K3080K0324K5261K2221J5778J3300
14081F56611J1303J0163M830J935j49j409j033N171J1828J4546J6865K2478L0408
14068G83547L4615M6966N2614M9981N2024N5536N9854O3548O3402O3548O7419
14057A393054O8461O0405N7933N8373O5889O8207P3697Q0787R7975J07181J15367
14046B247329J26894J44617J55785J66055J78300J92247K04131K21594K42507
14037C879459K61629K80800L09740L45245L95746M56685N36503O39365P73323
14028G878495R47473J148835J369439J614572J925970K325477K850983L529201
14020B3590445M427388N725240P690569J0679627J5198889K1656395K9184528
$$ plain form
14092 414026 429326 450633 477865 508395 536647 559727 580051 605312 627533 643311 656611
14081 656611 667914 678077 682907 684842 684693 683284 682251 687422 699250 713796 730661 753139 783547
14068 783547 818162 865128 917742 967723 1019747 1075283 1135137 1198685 1262087 1325635 1393054
14057 1393054 1461515 1521920 1579853 1638226 1704115 1772322 1846019 1926806 2024781 2131962 2247329
14046 2247329 2374223 2518840 2674625 2840680 3018980 3211227 3415358 3636952 3879459
14037 3879459 4141088 4421888 4731628 5076873 5472619 5929304 6465807 7105172 7878495
14028 7878495 8825968 9974803 11344242 12958814 14884784 17210261 20061244 23590445
14020 23590445 28017833 33743073 41433642 52113269 67312158 88968553 118153081
14013A18153081L4818528L6018061L3349571L0052355K6250504J8881927N792847
14006C03316874r252324k0819671k6894826l0266767l3365786l5023237l2913801
13999A14780462k7101296k0065509j4055968r830967p101900n360816m214281
13992B7049725l425503k840162k391151k041589j772537j542150j346414j170311
13984A0519908j009178q77184p64796o81171o09396n46890m81217m21066l70925
13975D758085l30842k91421k62916k31224k03321j91031j70622j61110j50585
13966B765013j43027j33922j25972j20904j16489j07850r8732r2131q6084p2854
13956A667048o6899n6899m4188l7141l0943l3789k6944k6609k9040k7702l0521
$$ plain form
14013 118153081 152971609 188989670 222339241 252391596 278642100 297524027 303316874
14006 303316874 294064550 273244879 246350053 216083286 182717500 147694263 114780462
13999 114780462 87679166 67613657 53557689 43726722 36624822 31264006 27049725
13992 27049725 23624222 20784060 18392909 16351320 14578783 13036633 11690219 10519908
13984 10519908 9510730 8633546 7868750 7187579 6578183 6031293 5550076 5129010 4758085
13975 4758085 4427243 4135822 3872906 3641682 3438361 3247330 3076708 2915598 2765013
13966 2765013 2621986 2488064 2362092 2241188 2124699 2016849 1918117 1825986 1739902 1667048
13956 1667048 1600149 1543250 1499062 1461921 1430978 1397189 1370245 1343636 1314596 1286894 1256373
13945A256373l1272l2317l5079l6179l2505l6151l5399l8759l1760k1714k5587
13934H99651j8688j7195j8241k0597j7492j6284j7256k0496j9881k2127k1918
13923F89476j7657j1987o829n701m568o887p703r643q882q475r952j6968j6415
13910E57809l011m507r363m617m180q669n525o298o874p221j2011j2939j1893
13897D60701j0997j0908r951m088j674o451j945K523O14j6057k3021k4695k5024
13884C29027k4516l1516k9509j8498l121J1002J1007J4422J6705K2956K4052J5720
13872C37731M209K549n204m509p987m936p22r29J11N792K69n312p756n733o321
13857C01252j0281j2655j4772r490j891j2344j3108p687J963P187J134n39R81
$$ plain form
13945 1256373 1225101 1192784 1157705 1121526 1089021 1052870 1017471 978712 946952 925238 899651
13934 899651 880963 863768 845527 824930 807438 791154 773898 753402 733521 711394 689476
13923 689476 671819 659832 653003 647302 642734 635847 628144 618501 609619 601144 591192 574224 557809
13910 557809 554798 550291 540928 536311 532131 523462 517937 511639 504765 497544 485533 472594 460701
13897 460701 449704 438796 428845 424757 423083 416632 414687 417210 417824 401767 378746 354051 329027
13884 329027 304511 272995 243486 224988 221867 232869 243876 258298 275003 297959 322011 337731
13872 337731 341940 344489 339285 334776 326789 321853 321131 320202 320313 326105 326374 321062 313306 307573 301252
13857 301252 290971 278316 263544 254054 252163 239819 226711 219024 220987 228174 229308 228769 229750
13844B29750j236k861K200q520j2792j6308r582r865r319q799q880p558q079o235
13830A21916j462N48J073K189K627P114L598O116K228M69L274N821P979P174M401
13815A75065J719k531L211m224q505o444q835r499n100m009o579J949Q139k615
13801A31742m99P044N592K703m62K82P8l183o201m950o28k434n592r684p884n615
13785A00309o759q413k019O48n125j209o88l69j504m972n552K279N263l368m36
13770F8085j774j52J979J260R549L124q041l382P042Q775Q914J0043N915O621
13756A17958J768k958J498J47L70q82r032r625o474n354o715J992M838o23o638
13741H0270l491k573m958j445j453o944q066j930j602O185P563J93l661l374j123
$$ plain form
13844 229750 228514 225653 227853 219333 206541 190233 180651 170786 161467 152668 143788 136230 128151 121916
13830 121916 120454 121002 122075 124264 126891 134005 137603 143719 145947 146416 149690 155511 163490 170664 175065
13815 175065 176784 174253 177464 173240 164735 158291 149456 139957 134857 130848 124269 126218 134357 131742
13801 131742 131243 138287 143879 146582 146120 146402 146480 143297 137096 132146 131518 129084 123492 113808 105924 100309
13785 100309 93550 85137 83118 83766 78641 77432 76744 76375 74871 69899 64347 66626 71889 68521 68085
13770 68085 66311 66159 68138 69398 78947 82071 74030 70648 77690 86465 95379 105422 111337 117958
13756 117958 119726 116768 118266 118413 118783 117901 108869 99244 92770 87416 80701 82693 87531 86908 80270
13741 80270 76779 74206 69248 67803 66350 59406 51340 49410 47808 53993 61556 61749 58088 54714 53591
13726E3591m806k448L488M844l718o921l087M532K663J661J781J864l418J476
13712E1502R42O20l283r601q363m637q734j3690j2019l811j13j491l082Q34O764
13697h162Q471n97M146J1640O821J369M266L005K727M019J21k174l792L328P419
13682D2607L339J735O5j549m022k072n26r28M475j501m54j01m901M279K101m774
13666C7773k593P800K834k183k422L663Q16n06m195j164q3O79n083p385K237K003
13650C2191o43m704l667k962p536m20M351N941m56j031k916L191j418k843J655
13635A8733o38J585j327m838L104L665l470J233K644K720L67K878M231L226j794
13620C2319q64J188j659k445j021j099j253l81j86L836O681j38j024K200j333
$$ plain form
13726 53591 48785 46337 49825 54669 50951 44030 40943 45475 48138 49799 51580 53444 50026 51502
13712 51502 52444 53064 49781 40180 31817 27180 18446 4756 -7263 -11074 -11187 -12678 -15760 -14926 -8162
13697 -8162 309 -288 3858 15498 22319 23688 27954 30959 33686 37705 37826 35652 31860 35188 42607
13682 42607 45946 47681 47746 46197 42175 40103 39577 38649 43124 41623 41169 41068 36167 40446 42547 37773
13666 37773 35180 42980 45814 43631 41209 44872 45688 45182 40987 39823 39740 40419 35336 27951 30188 32191
13650 32191 31548 26844 23177 20215 12679 12259 16610 22551 22095 21064 18148 21339 19921 17078 18733
13635 18733 18095 19680 18353 13515 16619 20284 16814 18047 20691 23411 23778 26656 30887 34113 32319
13620 32319 31455 32643 30984 28539 27518 26419 25166 24785 24599 28435 35116 34978 33954 36154 34821
13605C4821p29L218M468L563J202K549L46J9J816k192L041o44p99L482O25J476
13589E6262M124l3k204j925J598j438k646L379K689L504k134l641k534K834M840
13574F2675K67L547N279M661O143N776J0795J6278J4684J7694K7464L7704M0620
13561B53587N1467Q3296J15148J53456J88198K01296J96915J80617J58777J16069
13551A698826L6699n6893j23806j56019j75945j94887j99345j74322j43438j13667
13541C97203p9624n6503l3837k6503k6089k4328j9075j2181j1877j1359j1794
13530H4033j3634j5797j6460q957l859m140j056m815L77L43Q97L747J13m663K720
13515A8849R02o081l728P412J255q57k84Q04k966j364j969j270J247l347J604
$$ plain form
13605 34821 34092 37310 41778 45341 46543 49092 49438 49457 51273 49081 52122 51478 50679 54161 54786 56262
13589 56262 60386 60353 58149 56224 57822 56384 53738 57117 59806 63310 61176 57535 55001 57835 62675
13574 62675 62942 66489 71768 76429 82572 88348 99143 115421 130105 147799 175263 212967 253587
13561 253587 305054 388350 503498 656954 845152 1046448 1243363 1423980 1582757 1698826
13551 1698826 1735525 1678632 1554826 1398807 1222862 1027975 828630 654308 510870 397203
13541 397203 317579 261076 227239 200736 174647 150319 131244 119063 107186 95827 84033
13530 84033 70399 54602 38142 29185 25326 21186 20130 15315 15692 16035 16932 20679 20792 16129 18849
13515 18849 19751 13670 9942 17354 18609 17752 17468 18272 15306 13942 11973 10703 11950 8603 10207
13500A0207j031K854N661j054k177l354J606Q95O92K728J362n63l153l275N76
13485A1974J603K503k323M187j238J40n15m623k139M57l71l571K808J388L715
13470A3995J2K086o977k931o26K512J097k108q90j143j137N611P5l969j426l63
13454C818r33j652M817K016m972j418j768l039J271M366K387j106P02N60l609
13439A440j386j169O22L021J549l196n193N08O5J557M294k237k422N762K650J579
13423G444N282o697n307j318K243J507k778m32m16J309L87m386J543L904O197
13408H482k735j276K968n593o508K764J59O04K314m025o318m443L133j175M47
13393a1202K5J696j067O76Q363J602j932p45m22p294m995M093P064j8P007P008
$$ plain form
13500 10207 9176 12030 17691 16637 14460 11106 12712 13607 14299 17027 18389 17826 14673 11398 11974
13485 11974 13577 16080 13757 17944 16706 16846 16331 11708 9569 10026 9655 6084 8892 10280 13995
13470 13995 14007 16093 9116 6185 5559 8071 9168 7060 6170 5027 3890 9501 9576 5607 4181 3818
13454 3818 2885 1233 6050 8066 3094 1676 -92 -3131 -1860 2506 4893 3787 4489 5049 1440
13439 1440 54 -1115 -493 2528 4077 881 -4312 -3804 -3739 -2182 2112 -125 -2547 3215 5865 7444
13423 7444 12726 6029 722 -596 1647 3154 376 -56 -472 837 1224 -3162 -1619 2285 8482
13408 8482 5747 4471 7439 1846 -4662 -1898 -1739 -1135 1179 -2846 -9164 -13607 -10474 -11649 -11202
13393 -11202 -11177 -9481 -10548 -9872 -1509 93 -1839 -2584 -3006 -10300 -15295 -11202 -4138 -4156 2851 9859
13377I859M01l383j607l295j294Q67M972K567l022k705M983K146j471k256P4j357
13361E479O13j884J567K091l686L26M655j356j738K529q470p263J827N54J750
13346c006K545J112P75l15K074L848O23l059k500J021M928m03k003k98j695j50
13330C497l48k403K89L111Q50N32L254K646k115m900q20K242j725l475O26l900
13314b639j201K236O575M438K200R68K008k475o131p042m475l188P37L639L210
13299a140l07l823k700l348l627L433K688J285J959J578M100P98m025N633L772
13284F276j576n597l554L90O405k051L72K128j724J580q11O96N11n41O97P82l595
13267C88l115j254P062N134K35l727p805J34j659M590L988k781j447K726q19N18
$$ plain form
13377 9859 10260 6877 5270 1975 681 1548 6520 9087 6065 3360 8343 10489 9018 6762 6836 5479
13361 5479 6092 4208 5775 7866 4180 4506 9161 7805 6067 8596 126 -7137 -5310 -4756 -3006
13346 -3006 -461 651 1426 1111 3185 7033 7656 4597 2097 3118 8046 7643 5640 5342 3647 3497
13330 3497 3149 746 1035 4146 4996 5528 8782 11428 9313 4413 3593 5835 4110 635 1261 -2639
13314 -2639 -3840 -1604 4971 9409 11609 12577 14585 12110 5979 -1063 -5538 -8726 -7989 -4350 -1140
13299 -1140 -1447 -5270 -7970 -11318 -14945 -11512 -8824 -7539 -5580 -4002 98 896 -3129 2504 6276
13284 6276 4700 -897 -4451 -4061 2344 293 665 2793 1069 2649 1838 2534 3045 2504 3201 3983 388
13267 388 -2727 -3981 3081 8215 8450 4723 -3082 -2948 -4607 -17 3971 1190 -257 2469 1650 2168
13251B168q74k057l156l701l97K288M103j436m64l457L77K728Q53q13K011K503
13235F76L72M020J678l688j329j793l188j756k841k135O47L580N085J339J059
13220A726j815k516K179J536n652m696P78M0L000Q33j81J193k185k086l058J671
13204i233j129J213L282N674m250l850J669l427k719Q77M776j199m967N92L164
13189i527N838j14R40J785K227J544j702j486j595q317n58Q539J020m87O84l890
13173e099m515L321P767L063j081m562p812j610N566L098J953L683J310k86K38
13158E034l61K098l355n62K305R54n532o348O89j605n01k60j118M833L279J914
13142A464k07j097J866k547l15l677M067j330j242L00l923P54j644M103L043l061
$$ plain form
13251 2168 1294 -763 -3919 -7620 -8017 -5729 -1626 -3062 -3526 -6983 -6606 -3878 -3025 -3838 -1827 676
13235 676 1048 5068 6746 3058 1729 -64 -3252 -5008 -7849 -9984 -9337 -5757 -672 667 1726
13220 1726 -89 -2605 -426 1110 -4542 -9238 -8460 -8420 -5420 -4587 -4768 -3575 -5760 -7846 -10904 -9233
13204 -9233 -10362 -9149 -5867 -193 -4443 -8293 -6624 -10051 -12770 -11893 -7117 -8316 -13283 -12691 -9527
13189 -9527 -3689 -3803 -2863 -1078 1149 2693 991 -495 -2090 -10407 -10965 -2426 -1406 -1893 -1209 -5099
13173 -5099 -9614 -6293 1474 4537 3456 -1106 -8918 -10528 -4962 -1864 89 3772 5082 4796 5034
13158 5034 4673 6771 3416 2854 5159 6113 581 -5767 -5078 -6683 -7184 -7444 -8562 -3729 -450 1464
13142 1464 1257 160 2026 -521 -836 -4513 -446 -1776 -3018 -2718 -6641 -5887 -7531 -3428 -385 -3446
13126c446k699j958m568j255l81L81M226K199L355M85J333O79J440n50K385L49
13110A975O86k509j035K03r32J732J441J624k360m42j875k713J823j893l650K391
13094e534L703r79Q13j601L785K004k439l772j25K687K769J092O32k635J031L100
13078D531N062K444j962m133j975P218P375J1276J3606J1887P755m73m508l72
13064E7731j0487j0972j1456k147M59L65j920l402M20l528m021J866K085P66n871
13049I888l940k114p533j464k305M274L755Q68M720p38M26J367l63P084O108N836
13033B5869Q212J1889J7530K8601K5499J4413o333j4545j4712r921j1406j5829
13021E9267j9851r762n092p543q51L226k736o550j514p17m321k521L177j377l72
$$ plain form
13126 -3446 -6145 -8103 -12671 -13926 -14307 -13926 -9700 -7501 -4146 -3661 -2328 -1649 -209 -759 1626 1975
13110 1975 2661 152 -883 -680 -1612 120 1561 3185 825 383 -1492 -4205 -2382 -4275 -7925 -5534
13094 -5534 -1831 -2810 -1997 -3598 187 2191 -248 -4020 -4145 -1458 1311 2403 3035 400 1431 4531
13078 4531 9593 12037 10075 5942 3967 11185 18560 29836 43442 55329 63084 62611 58103 57731
13064 57731 47244 36272 24816 22669 23128 23493 21573 18171 18591 15063 11042 12908 14993 15759 9888
13049 9888 5948 3834 -3699 -5163 -7468 -3194 561 1429 6149 5411 5837 7204 6841 13925 20033 25869
13033 25869 34081 45970 63500 92101 117600 132013 125680 111135 96423 86502 75096 59267
13021 59267 39416 29654 24562 17019 16168 19394 16658 10108 8594 7877 3556 1035 4212 2835 2463
13006B463l042J409L200n620j400K930N29k335M905M749P49K452J646P600N903
12991B6138L496P382J7374J5532M204k413j0165j3225j2069o901m426j241m367
12978A9319p102K897Q954J1836J1791R260l428q318j2123j1125r165q517j136
12965C143J239k194J654L030L560k184q054N33R22P6j86j795k222j097j879J981
12949c473J639K781K761j14j855J084J420k045K952N044M503K288R264R233Q462
12934D3944J3674J6523J3322M536l249r791j6241j5880j3502r125k266k350r945
12921I650j893O597j47l155k491j839l023j54N236j038k095k241n892m440J927
12906d998j425K535K716r22l639J758K977L587K279K678J230R53K710N770N449
$$ plain form
13006 2463 -579 830 4030 -1590 -2990 -60 469 -1866 3039 7788 8537 10989 12635 20235 26138
12991 26138 29634 37016 54390 69922 74126 71713 61548 48323 36254 29353 24927 23686 19319
12978 19319 12217 15114 24068 35904 47695 56955 53527 45209 33086 21961 12796 4279 3143
12965 3143 4382 2188 3842 6872 10432 8248 194 727 1649 1725 1539 -256 -2478 -3575 -5454 -3473
12949 -3473 -1834 947 3708 3594 1739 2823 4243 2198 5150 10194 14697 16985 26249 35482 43944
12934 43944 57618 74141 87463 91999 88750 78959 62718 46838 33336 24211 21945 19595 9650
12921 9650 7757 14354 14207 11052 8561 6722 3699 3545 8781 7743 5648 3407 -2485 -6925 -4998
12906 -4998 -6423 -3888 -1172 -2094 -5733 -3975 -998 2589 4868 7546 8776 9729 12439 18209 23658
12891B3658J2088J5381N820p306j5173j5045q419k862m449L82n164q331J437J482
12877f501j329o49j645K443k887k854J151J012K091k316K296M310K349J539j283
12862b273J155O33M70j319k884J944O529L136n827J008N448j51L224N299l737
12847A2655M856J1592P812q623j2073o893l382n877k523K091P73o344r19j710
12833h565l070o72N973N627j435K192J394j521j676m266j370J156K830k160J247
12818d316n540O51k909O30M476q29j975K94k754l61L785K895m310j070q12O859
12802e286J846L04O75k062P00r6N274j445n382K285P07l201q48j608k466N99L442
12785f562L771j709k739L557O87k973j833l172J381L887k082k67J897N81K543
$$ plain form
12891 23658 35746 51127 56947 49641 34468 19423 11004 8142 3693 4075 -1089 -9420 -7983 -6501
12877 -6501 -7830 -8479 -10124 -7681 -10568 -13422 -12271 -11259 -9168 -11484 -9188 -4878 -2529 -990 -2273
12862 -2273 -1118 -485 -15 -1334 -4218 -2274 4255 7391 1564 2572 8020 7869 11093 16392 12655
12847 12655 17511 29103 36915 28292 16219 9326 5944 67 -2456 -365 408 -5936 -6855 -8565
12833 -8565 -11635 -12307 -6334 -707 -2142 50 1444 -77 -1753 -6019 -7389 -6233 -3403 -5563 -4316
12818 -4316 -9856 -9205 -12114 -11484 -7008 -7837 -9812 -9518 -12272 -12633 -8848 -5953 -10263 -11333 -12145 -5286
12802 -5286 -3440 -3136 -2461 -4523 -3823 -3919 1355 -90 -5472 -3187 -2480 -5681 -6529 -8137 -10603 -10004 -6562
12785 -6562 -2791 -4500 -7239 -3682 -2995 -5968 -7801 -10973 -9592 -5705 -7787 -8054 -6157 -5576 -3033
12770c033k187l259M497J504L218l133l504p87J487J486m028k575k639j080J353
12755a2680L061K245k030j986K159L335r56J96J010J819K860J71o991o805j968
12740a6560K551M262P425j403l756l855o18j30K574N52K09K20K677N878L102o238
12724c110j969K586J217n065k2j009J005K49k071o436K760L648K156L85l694j470
12708a0840R00N722l940n405J301O919j761j10j311k913m813j389K883j203K539
12693a3421J0887Q2k031K461k143n422j735L425J112k584j063m95m167k36J551
12678a3779K319j375q97o29n89J03l144M859K344P30P82j27K923K745K271j522
12662b986p088k849j077J024K840O097J56Q07J774J580k46j626l13P47m378m765
$$ plain form
12770 -3033 -5220 -8479 -3982 -2478 740 -2393 -5897 -6684 -5197 -3711 -7739 -10314 -12953 -14033 -12680
12755 -12680 -9619 -7374 -9404 -11390 -9231 -5896 -6852 -6656 -5646 -3827 -967 -796 -7787 -14592 -16560
12740 -16560 -14009 -9747 -2322 -3725 -7481 -11336 -11954 -12084 -9510 -8958 -8749 -8529 -5852 26 3128 -3110
12724 -3110 -5079 -2493 -1276 -6341 -6363 -7372 -6367 -6118 -8189 -14625 -11865 -8217 -6061 -5676 -9370 -10840
12708 -10840 -9940 -4218 -8158 -13563 -12262 -5343 -7104 -7214 -8525 -11438 -16251 -17640 -14757 -15960 -13421
12693 -13421 -2534 -2452 -4483 -2022 -4165 -9587 -11322 -7897 -6785 -9369 -10432 -10927 -15094 -15330 -13779
12678 -13779 -11460 -12835 -13732 -14361 -14950 -14847 -17991 -13132 -10788 -10058 -9276 -9403 -6480 -3735 -1464 -2986
12662 -2986 -10074 -12923 -14000 -12976 -10136 -4039 -3883 -3076 -1302 278 32 -1594 -1907 -1160 -5538 -10303
12646a0303m141K41K537K071K145J330o02k092l199l692M793J628J292J799M864
12631a329J727N45L108k096m031j034j473l065k07j677J546L218J716q61l766
12616g679J6k574J250K246M758K663m361j15l386K156J09l990l59j649L478L610
12600c827k574L19K319K19K325K888L024N94k523k45p91m28k954L28M656M650
12584G980J742J339K039N792R631J4720K0439P194o184j5830j7034j1714o119
12571A3995k952n144n925j317M842r29k245J086J283J047q8n21M417M480J0844
12556B2873J4538J0850k278m872r338r309r09L856J3685J4597Q564K963m870p408
12542E2942p720r100m952k105J8j877p71O776K712R72l292q454m069o819r309
$$ plain form
12646 -10303 -14444 -14203 -11666 -9595 -7450 -6120 -6722 -8814 -12013 -15705 -10912 -9284 -7992 -6193 -1329
12631 -1329 398 943 4051 1955 -2076 -3110 -4583 -7648 -7855 -9532 -7986 -4768 -3052 -3913 -7679
12616 -7679 -7663 -10237 -8987 -6741 -1983 680 -3681 -3796 -7182 -5026 -4917 -8907 -9266 -10915 -7437 -3827
12600 -3827 -6401 -6082 -3763 -3544 -1219 1669 4693 5287 2764 2519 1728 1300 -1654 -1326 3330 7980
12584 7980 9722 11061 13100 18892 28523 43243 63682 70876 64692 48862 31828 20114 13995
12571 13995 11043 5899 -26 -1343 3499 2570 325 1411 2694 3741 3653 3132 7549 12029 22873
12556 22873 37411 48261 45983 41111 31773 22464 21555 25411 39096 53693 62257 65220 60350 52942
12542 52942 45222 36122 31170 29065 29083 27206 26435 33211 35923 36895 33603 25149 21080 14261 4952
12527D952k995o03K26m69k350L457Q070k263L160L366J954Q497R115K1152J7826
12512G3095j472p815j7688j4302j8362o689n95j7j348k561j222o364o249n318
12498a6907R19M181o63K246L925K365k191r57M45M14N577M67k487J573l075l988
12482h156m344K093K567j422k6O778K936o499O61L181P059L61j087j104K091J411
12466F500l229J19j027L9J330P0m100l666j270M739p06J362K121J348n982m281
12450f633k233K973M926K552M040L49L04p536l701m180n01J020K979Q497L406
12435F262j016K608r98n300l336J308j748l986q8M113K822O55K008j462k594n86
12419a338k911k685k54N970K532m792l732J405L66L514K902J447p00k60J662k201
$$ plain form
12527 4952 1957 1354 1580 1111 -1239 2218 10288 8025 11185 14551 16505 25002 34117 55269 73095
12512 73095 71623 63808 46120 31818 13456 6767 6172 6155 4807 2246 1024 -5340 -11589 -16907
12498 -16907 -15988 -11807 -12470 -10224 -6299 -3934 -6125 -7082 -6637 -6223 -646 -179 -2666 -1093 -4168 -8156
12482 -8156 -12500 -10407 -7840 -9262 -9288 -2510 426 -6073 -5412 -2231 4828 5189 4102 2998 5089 6500
12466 6500 3271 3390 2363 2402 3732 3802 -298 -3964 -5234 -495 -1201 161 2282 3630 -2352 -6633
12450 -6633 -8866 -5893 -967 1585 5625 5974 6278 -1258 -4959 -9139 -9640 -8620 -5641 2856 6262
12435 6262 5246 7854 6856 1556 -1780 -472 -2220 -6206 -6294 -2181 641 1296 3304 1842 -752 -1338
12419 -1338 -4249 -6934 -7188 -1218 1314 -3478 -7210 -5805 -5439 -1925 977 2424 1724 1464 3126 925
12403I25j211J584O700M555K170J0933J1989L587j0543j4665r547n191j344M210
12389D152q52k193p77m539n485K217K867k944P53K633k400r57Q780M869p80m891
12373D53k229m998r37L87L274j470k147j108K497m662p54K658K247k453k689p5
12357a2006J746M207K552r49k285K599m495m985k660K131M010K283J833J012k725
12342g732j946k171P42N687K600m106j714l77J982n25K516n695m521j51r37O860
12326i488O580n765K435J588j855p97l143J720k693r44L187k834k419J903l731
12311a6256K847M805J27j740j06K660K132m283o806L171K80J313K982j993J061
12296i806n93M965J643j219j004l110o178j614M479M481j93L492N463l025k021
$$ plain form
12403 925 -286 1298 7998 12553 14723 25656 37645 41232 30689 16024 6477 1286 -58 4152
12389 4152 3300 1107 330 -4209 -9694 -7477 -4610 -7554 -6801 -4168 -6568 -7525 1255 6124 5344 453
12373 453 -1776 -6774 -7711 -7324 -4050 -5520 -7667 -8775 -6278 -10940 -11694 -9036 -6789 -9242 -11931 -12006
12357 -12006 -10260 -6053 -3501 -4450 -6735 -4136 -8631 -13616 -16276 -14145 -10135 -7852 -6019 -5007 -7732
12342 -7732 -9678 -11849 -11107 -5420 -2820 -6926 -8640 -9017 -7035 -7560 -5044 -10739 -15260 -15411 -16348 -9488
12326 -9488 -2908 -8673 -6238 -4650 -6505 -7302 -10445 -8725 -11418 -12362 -9175 -12009 -14428 -12525 -16256
12311 -16256 -13409 -8604 -8477 -10217 -10323 -7663 -5531 -9814 -16620 -13449 -13169 -11856 -8874 -10867 -9806
12296 -9806 -10399 -5434 -3791 -5010 -6014 -9124 -15302 -16916 -12437 -7956 -8149 -4657 806 -2219 -4240
12281d240M26O87r87j440K714O710L60J270k592o826l51K927j826k663r24m46
12265g201l38l776j956j394K337P211M738j22n584m475k886k70k849J125l831
12250a9271o7K678J149J233M578M75N60J146k4k03N137o53n736m627N734L427
12234d464J797k008m243q6L66J512K816j205M59J314l442L191J907j605O494Q776
12218A1579Q246K08k641j324k841Q581Q424L047L204L411l161j712m903j2122
12204A7996r544o500l125l779n61k948j67J657m02n83K67L074J992n61l52K887
12188f49R22l681K241k058l365K517J149j74O418Q929j17k464O015J2319J2709
12173D0711R238M996M55L032M243L173N24J175N02n099P7Q089N867O809N219r86
$$ plain form
12281 -4240 -3814 -3127 -4114 -5554 -2840 3870 4230 5500 2908 -3918 -4269 -1342 -3168 -5831 -6755 -7201
12265 -7201 -7539 -11315 -13271 -14665 -12328 -5117 -379 -501 -6085 -10560 -13446 -13716 -16565 -15440 -19271
12250 -19271 -19338 -16660 -15511 -14278 -9700 -9225 -8665 -7519 -7543 -7746 -2609 -3262 -8998 -13625 -7891 -4464
12234 -4464 -2667 -4675 -8918 -9004 -8638 -7126 -4310 -5515 -5056 -3742 -7184 -3993 -2086 -3691 2803 11579
12218 11579 19825 20033 17392 16068 13227 21808 30232 33279 36483 39894 36733 35021 30118 17996
12204 17996 8452 1952 -1173 -4952 -5513 -8461 -8628 -6971 -7373 -7956 -7689 -4615 -2623 -3184 -3536 -649
12188 -649 273 -3408 -1167 -3225 -6590 -4073 -2924 -3098 3320 12249 12132 9668 15683 28002 40711
12173 40711 49949 54945 55400 58432 62675 65848 66372 67547 68049 62950 63027 71116 76983 83792 89011 88025
12157H8025j1367j1585j2485j8517j0197m217n004n889n949q89M125M378J795
12144A2224L80l357K885k461k626m928K45L716J993M581n84K468K118M723Q636
12129C0013P906L720P474N329N965O484J0881R629O234M659O668O554r44p363
12115A03209j4332j4364k2122j1757j0032j0304l50N700m276q215l126p821j979
12102B31p34m614J123L202K25k717l339N38N086R89p91J007j692p48K836L206
12086C808N531O089L239M554P226J2590R910O123m187p241j257o751l122o295
12072C0217r453p308k754k405j236J077m840p497J48N21J475M510N274Q02k207
12057F324o601n237J330J414l765J555K825N724k575m643m574L724J451K366L35
$$ plain form
12157 88025 76658 65073 52588 34071 23874 19657 14653 8764 2815 1926 6051 10429 12224
12144 12224 12604 9247 12132 9671 7045 2117 2362 6078 8071 12652 12068 14536 16654 21377 30013
12129 30013 37919 41639 49113 54442 60407 66891 77772 87401 93635 98294 104962 111516 110572 103209
12115 103209 88877 74513 52391 40634 30602 20298 19948 25648 21372 13157 10031 2210 231
12102 231 -503 -5117 -3994 -792 -567 -3284 -6623 -6085 -999 -10 -801 206 -1486 -2234 602 3808
12086 3808 9339 15428 18667 23221 30447 43037 52947 59070 54883 47642 46385 39634 36512 30217
12072 30217 20764 13456 10702 8297 7061 8138 3298 -4199 -4051 -3530 -2055 2455 7729 8531 6324
12057 6324 -277 -5514 -4184 -2770 -6535 -4980 -2155 3569 994 -3649 -8223 -4499 -3048 -682 -347
12042c47j567j363J298j764m645k774j894j536N072M181l149l166J579L085J718
12027e272l71k063o73o150Q44K902K378M172Q97J00l041p027k231L182J948n34
12011a0939O20m09J261K684M836J462j656j746k351k095o292l430O229K646L215
11996e965J327K204p60l850n893n893j590L722K093N153J037K758j548P00j622
11981h127J927M781j977j935m447r16l392j679l183K390M011k704L03L625p04
11966a2027Q12m62L787R11j931j270j132p16M558O79m4l495J962P33j835Q77J155
11949g438M81L49R9N64k135k345j870K351L671M120m542m566L104K003L69K201
11933c584r3p59o219m480J419Q38N49K633R71j280J451j73M44M03L709J771n016
$$ plain form
12042 -347 -1914 -3277 -1979 -3743 -8388 -11162 -13056 -14592 -9520 -5339 -8488 -11654 -10075 -6990 -5272
12027 -5272 -5643 -7706 -8379 -14529 -13685 -10783 -8405 -4233 -3336 -3236 -6277 -13304 -15535 -12353 -10405 -10939
12011 -10939 -10319 -10728 -9467 -6783 -1947 -485 -2141 -3887 -6238 -8333 -14625 -18055 -11826 -9180 -5965
11996 -5965 -4638 -2434 -3194 -7044 -12937 -18830 -20420 -16698 -14605 -9452 -8415 -5657 -7205 -6505 -8127
11981 -8127 -6200 -1419 -3396 -5331 -9778 -10694 -14086 -15765 -18948 -16558 -12547 -15251 -14948 -11323 -12027
11966 -12027 -11215 -11677 -7890 -6979 -8910 -10180 -11312 -12028 -7470 -6791 -6835 -10330 -8368 -7635 -9470 -8593 -7438
11949 -7438 -6957 -6608 -6509 -5945 -8080 -10425 -12295 -9944 -6273 -2153 -6695 -11261 -8157 -6154 -5785 -3584
11933 -3584 -3677 -4436 -10655 -15135 -13716 -12878 -12329 -9696 -8725 -10005 -8554 -8727 -8283 -7880 -4171 -2400 -7416
11916g416o889L763L208R02o33l108L24K230O883N551k332L654P323J1211J894
11901B6565m013r010j3225n406j742j495J214M938J848J07j45o63k173q03L343
11886f60J496k017l856R01R9j060k167n65l11k656n401j410J117j033j6J090K462
11869a3987L529M100o28k916j188L332L578J04o66r57j359m53l09l007j590m125
11853a6542J742N997L648M575k458l107l02m078m053Q373K133l100J472o53K3
11838f330k186J663j040K575l076K512k63j361r21K727l34n75m740N35K687j709
11822i836l90J877K361N516N368o648o974M121J147k766j256K799L353M46n501
11807f383j179J643j677m150k102p95O95J153M718k28r54K392m169m991J30J548
$$ plain form
11916 -7416 -14305 -10542 -7334 -6432 -7065 -10173 -9849 -7619 -736 4815 2483 6137 13460 24671 26565
11901 26565 22552 13542 317 -5089 -6831 -8326 -7112 -2174 -326 -219 -364 -1027 -3200 -4003 -660
11886 -660 836 -1181 -5037 -4136 -4037 -5097 -7264 -7829 -8140 -10796 -16197 -17607 -16490 -17523 -17539 -16449 -13987
11869 -13987 -10458 -6358 -6986 -9902 -11090 -7758 -4180 -4076 -4742 -5699 -7058 -7511 -7820 -10827 -12417 -16542
11853 -16542 -14800 -8803 -5155 -580 -3038 -6145 -6447 -10525 -14578 -6205 -4072 -7172 -5700 -6353 -6330
11838 -6330 -8516 -6853 -7893 -5318 -8394 -5882 -6145 -7506 -8427 -5700 -6034 -6609 -11349 -10814 -8127 -9836
11822 -9836 -10226 -8349 -5988 -472 4896 -1752 -8726 -4605 -3458 -6224 -7480 -4681 -1328 -882 -6383
11807 -6383 -7562 -5919 -7596 -11746 -13848 -14643 -13948 -12795 -8077 -8305 -9259 -6867 -11036 -16027 -15897 -14349
11791a4349K643M12q09J300k082K338k205l727K138L986l46l35M886N41q30N294
11775a145j783n747K144M194M619N549m73m772k68j345R63k257m074n336l185
11760a2916J472O546r70K357O7p83J70m784N6L917L235k440n34k268P46J257j301
11743f173j645l55L442m76O93N742M168k213j814p731n787K711P834L617j681
11728C32l32p91m197m738l358K31M413J614K176L028m35J447J65J031J099l220
11712a535n939n395l34K649M235J503r8J070Q48q52P15j080k765k058l82j658
11696a1076Q36k244J616J34Q5m146p09K57k78M323K114K034k20j274n56j010K116
11679g998K793j263k564K068j018J846N289L302m890o827l229k359J0395N674
$$ plain form
11791 -14349 -11706 -11294 -12103 -10803 -12885 -10547 -12752 -16479 -14341 -10355 -10701 -11036 -6150 -5609 -6439 -1145
11775 -1145 -2928 -8675 -6531 -2337 2282 7831 7358 2586 2318 973 1936 -321 -4395 -9731 -12916
11760 -12916 -11444 -4898 -5868 -3511 -3444 -4227 -4057 -8841 -8785 -4868 -1633 -4073 -4607 -6875 -6129 -4872 -6173
11743 -6173 -7818 -8173 -4731 -5207 -4514 1228 5396 3183 1369 -6362 -12149 -9438 -1604 2013 332
11728 332 0 -791 -4988 -9726 -13084 -12853 -8440 -6826 -4650 -1622 -2057 -610 -445 586 1685 -1535
11712 -1535 -7474 -12869 -13203 -10554 -6319 -4816 -4914 -3844 -2996 -3848 -3133 -4213 -6978 -9036 -9418 -11076
11696 -11076 -10240 -12484 -10868 -10734 -10649 -14795 -15504 -15247 -15525 -11202 -9088 -7054 -7274 -8548 -9104 -10114 -7998
11679 -7998 -5205 -6468 -9032 -6964 -7982 -6136 -847 2455 -2435 -9262 -12491 -14850 -4455 1219
11665A219m112m34j016m906L751J416j465m649k262K720O86J980K440J119j993
11650e506n956p73R49M545j70K41n15k523l509o53N022R22q69j416M924M076k576
11633c787N755K244l515l519Q33j1499k161J590L586M853R30K657j313J574j727
11618c499L33J838j142m005L057K64J192J03m906n002k126J189K059K780M234
11603c631O438N33k005l530J579q81p078j156k775L007L182M46l155l970K286
11588a0710M523k99L353J148k331J557M534L733j659K027l585k267K557l5m261
11573a715j136k398j108L731j854l843K590n474j125L725n32j494K476m105j104
11558a3366L641J026k294r78L416m02M336L527k23l698m773o8O74k789O96l057
$$ plain form
11665 1219 -2893 -3327 -4343 -9249 -5498 -4082 -5547 -10196 -12458 -9738 -9052 -7072 -4632 -3513 -5506
11650 -5506 -11462 -12235 -11286 -6741 -6911 -6670 -7185 -9708 -13217 -13870 -8848 -7926 -8795 -10211 -5287 -1211 -3787
11633 -3787 1968 4212 697 -2822 -1989 -13488 -15649 -14059 -10473 -5620 -4690 -2033 -3346 -1772 -3499
11618 -3499 -3166 -1328 -2470 -6475 -3418 -3154 -1962 -1859 -6765 -11767 -13893 -12704 -10645 -7865 -3631
11603 -3631 2807 3340 1335 -2195 -616 -1497 -8575 -9731 -12506 -9499 -6317 -5871 -9026 -12996 -10710
11588 -10710 -6187 -6486 -3133 -1985 -4316 -2759 1775 5508 3849 5876 2291 24 2581 2546 -1715
11573 -1715 -2851 -5249 -6357 -2626 -4480 -8323 -5733 -11207 -12332 -8607 -9139 -10633 -8157 -12262 -13366
11558 -13366 -9725 -8699 -10993 -11971 -8555 -8957 -4621 -1094 -1317 -5015 -9788 -9856 -9182 -11971 -11275 -14332
11542a4332J803m03K228K146q5M74J500M039k507k735j774J649M216j863M08j548
11526f784P027N221q25o601O3K008l197J175l938o25J239k107j189l09J494J115
11510f233L542k3m331m404J650J860K361K529r15j461k617j707N19L651M081l979
11494e477k667l753J731m22J552K063k119j931j647J829M386M69n025p002k88
11479a8301j970r66n20l581J636L514O635M865K204k54M057K657L815N35j692
11464B634Q93k614l306Q10j260M212j415j022l479L020O802j845n737K013k133
11449b427k041j241m22Q45J887K103k497j584l084r36r5j797J644Q237L306L191
11433E089J589k289J992k176j146K202j005l921K82O387k13k815K627K628r83
$$ plain form
11542 -14332 -12529 -12932 -10704 -8558 -8643 -8169 -6669 -2630 -5137 -7872 -9646 -7997 -3781 -5644 -5236 -6784
11526 -6784 243 5464 4639 -1962 -1899 109 -3088 -1913 -5851 -6476 -5237 -7344 -8533 -8842 -7348 -6233
11510 -6233 -2691 -2714 -7045 -11449 -9799 -7939 -5578 -3049 -3964 -5425 -8042 -9749 -9230 -5579 -1498 -5477
11494 -5477 -8144 -11897 -10166 -10588 -9036 -6973 -9092 -11023 -12670 -10841 -6455 -5986 -11011 -18013 -18301
11479 -18301 -20271 -21237 -21757 -25338 -23702 -20188 -13553 -8688 -6484 -6738 -2681 -24 3791 4326 2634
11464 2634 3527 913 -2393 -1583 -2843 1369 -46 -1068 -4547 -1527 5275 3430 -2307 -294 -2427
11449 -2427 -4468 -5709 -6131 -5286 -3399 -1296 -3793 -5377 -8461 -9397 -9492 -11289 -9645 -1408 1898 5089
11433 5089 6678 4389 6381 4205 3059 5261 4256 335 617 7004 6791 3976 6603 9231 8248
11418H248l708n383m481K15M596P66k327J75k854J314L623p56n410J476O66k470
11402f310k238J357J420j869j813k03P62J544o82k717k63P795M592J415p11k659
11386e80j370q14m631j476m62L177L998R53j633j664m469j59L288J799K758Q06
11370d79o981n700L280L163l581j991M991L458p70l339j880K867J653J823L266
11355b20J317o42K958R79P02l59L57j306K897l725j929M243J780J876N943k251
11339A2620k395K016r09n209L192K962m927j446l549K445r70p59K467q02k17M131
11323H650j58p177k573J145J959N2K41j461m197K399K890N376J289m200l720j149
11307f34M051L250P247M467M67m497n138m923p77L923j769r51K308J741M857L51
$$ plain form
11418 8248 4540 -843 -5324 -5109 -513 253 -2074 -1899 -4753 -3439 184 -572 -5982 -4506 -3840 -6310
11402 -6310 -8548 -7191 -5771 -7640 -9453 -9656 -8894 -7350 -8032 -10749 -11012 -3217 1375 2790 2079 -580
11386 -580 -1950 -2764 -7395 -8871 -9333 -6156 -2158 -1205 -2838 -4502 -8971 -9130 -5842 -4043 -1285 -479
11370 -479 -7460 -13160 -9880 -6717 -10298 -12289 -7298 -3840 -4610 -7949 -9829 -6962 -5309 -3486 -220
11355 -220 1097 455 3413 4392 5094 4735 5092 3786 6683 2958 1029 5272 7052 8928 14871 12620
11339 12620 10225 12241 11332 6123 9315 12277 7350 5904 2355 4800 3830 3071 5538 4736 4519 8650
11323 8650 8492 1315 -1258 -113 1846 1898 2139 678 -3519 -1120 1770 7146 8435 4235 515 -634
11307 -634 3417 6667 13914 18381 18848 14351 9213 4290 3513 7436 5667 4716 7024 8765 13622 13973
11291A3973p519m406l018M95L101N079M869L790P73P80M122N03m238n850l178
11276I276n591K13q50N8J992P64q263J817K385J590l22p73L436k084K4m114m20
11259h62J865l063j593Q03K83M370q08j635k764l21J301n76l59L105M400k295
11243A851l655R28j457K952L745k53j150l253R29L786o70m871l445l726O746J487
11227e6j465L738J136m01K780j544k70r0m701k917k44K890l073j25n02k604M770
11210b678m4k623l69N29k043m65M58K193N758N494K575j138L073n90o57q19q06
11193G848r081m689P206P173M349k454L804K542j702n764m623M434L104K82k883
11178I546j047J585L607J02k107k675p414k577k410m67N332M974J795P01P88J028
$$ plain form
11291 13973 6454 2048 -970 -475 2626 7705 12574 16364 17137 17917 22039 22542 18304 12454 9276
11276 9276 3685 3898 3048 3106 5098 5862 -2401 -584 1801 3391 3069 2296 5732 3648 3672 -442 -862
11259 -862 1003 -2060 -3653 -2850 -2567 1803 995 -640 -3404 -3725 -2424 -3000 -3359 -254 4146 1851
11243 1851 -1804 -876 -2333 619 4364 4111 2961 -292 637 4423 3753 -1118 -4563 -8289 -1543 -56
11227 -56 -1521 2217 3353 2952 5732 4188 3918 3828 -873 -3790 -4034 -1144 -4217 -4342 -4844 -7448 -2678
11210 -2678 -2722 -5345 -5714 -5185 -7228 -7693 -7235 -5042 716 6210 8785 7647 10720 10130 9473 8654 7848
11193 7848 -1233 -5922 1284 8457 12806 10352 14156 16698 14996 9232 4609 9043 12147 12429 9546
11178 9546 8499 10084 13691 13793 11686 9011 1597 -980 -3390 -3857 1475 6449 8244 8945 9733 10761
11162A0761M431N978J14k933k707j18M629M005K931o41l9j399l610j802M446q72
11146B3174k168n84J353n69N84P527j125o340j973j822j816p46K723K293o077
11131A4434n863J158l728K749P156J216P52R15k919M275j344n954j865m94m183
11116F305j120M226K514L375j752m122j060j908k320N120Q135L424j977J301L649
11101B3790k427k678k607p205J220K171M441K737n953o200Q90K88M851n96m816
11086G906k368j043M056J706m88K96M137L251N571M798l177j772m910l643l713
11071A0607k476J848K648n76L066K497Q30j022O293J386j81p7L591R808J7591
11056E5833J3433J4042J0547l659n299o204j3440j1293j5009m580K453J834k956
$$ plain form
11162 10761 15192 21170 21284 18351 15644 15526 20155 24160 27091 26450 26411 25012 21402 19600 24046 23174
11146 23174 21006 20422 21775 21206 21790 29317 28192 21852 19879 18057 16241 15495 18218 20511 14434
11131 14434 8571 9729 6001 8750 15906 17122 17874 18789 15870 20145 18801 12847 10982 10488 6305
11116 6305 5185 9411 11925 15300 13548 9426 8366 6458 4138 9258 17393 20817 18840 20141 23790
11101 23790 21363 18685 16078 8873 10093 12264 16705 19442 13489 7289 8179 8467 13318 12722 7906
11086 7906 5538 4495 8551 10257 9769 10065 14202 17453 23024 27822 24645 22873 17963 14320 10607
11071 10607 8131 9979 12627 12051 15117 17614 18444 17422 23715 25101 24920 24843 28434 38242 55833
11056 55833 69266 83308 93855 90196 84897 78693 65253 53960 38951 34371 36824 38658 35702
11043C5702L79K144l05J936k189M353M049N143N112J2261J2786M012k324k624
11029H0435Q18j516m938k044M391Q366J3544L846o438m165j864o445o650l783
11015G3557m138j655J0290J3978J1526O958l690j2005j3828m349o529n887r192
11002E5036j0099j1082j0018o641m682m763M308N647N672Q212J0072L297j783
10989D3176l156j3579j6206j6406j1981l000M10M602J1897J3357J1490J0602J3958
10976D5164J2838O844N795N429j27k542p272r429p654j2014o173l2K491M960O309
10961D4587p63r569j990q97k486N309K413J525j203j87o96O54K102L111L437P392
10945E2739J3435J3288P743O265Q239K5672K5124K7783M3196M9356O3935R5567
$$ plain form
11043 35702 36081 38225 37920 39856 37667 42020 46069 51212 56324 68585 81371 85383 83059 80435
11029 80435 81253 79737 74799 72755 77146 85512 99056 102902 96464 92299 90435 83990 77340 73557
11015 73557 69419 67764 78054 92032 103558 110516 106826 94821 80993 76644 70115 64228 55036
11002 55036 44937 33855 23837 17196 12514 7751 12059 17706 23378 31590 41662 44959 43176
10989 43176 40020 26441 10235 -6171 -18152 -21152 -20742 -16140 -4243 9114 20604 31206 45164
10976 45164 58002 64846 70641 76070 75943 73401 66129 56700 49046 37032 30859 30827 33318 38278 44587
10961 44587 43824 34255 32265 31368 28882 34191 36604 38129 36926 36739 36043 36697 38799 41910 45347 52739
10945 52739 66174 79462 87205 93470 101709 127381 152505 180288 223484 272840 336775 432342
10933D32342J40716K06927K87115L47030L72508L66281L25975K43937R7952q2295
10923B738488k30151l20373l58729l73283l45444k83708j99916j32997q9696n9290
10913C44901m5616l5601l0717k5937j2977o597k964K522L648N393J1251P040l900
10900B10446m088r010j5603j4528j7879k2649j5895p616p872m187r464k394P72
10887H0033m971m799k060j188j987n030P60N743K209O26K175j410N481J1878Q401
10872I5861J2562P475k940L275m959j1705o523q253q695r985j1972n037J780l739
10858D7145o057J215j69r32j050k430O789N812N71O77N003J025L116M6N14J970
10842F3245M462O051P902J0613P054R625J4818J2496J4695R392j717o71n917o297
$$ plain form
10933 432342 573058 779985 1067100 1414130 1786638 2152919 2478894 2722831 2820783 2738488
10923 2738488 2508337 2187964 1829235 1455952 1110508 826800 626884 493887 404191 344901
10913 344901 299285 263684 232967 207030 194053 187456 184492 187014 190662 196055 207306 214346 210446
10900 210446 206358 197348 181745 167217 149338 126689 110794 103178 95306 91119 81655 79261 80033
10887 80033 75062 70263 68203 67015 65028 59998 60758 66501 68710 69336 71511 70101 75582 87460 95861
10872 95861 108423 115898 112958 116233 111274 99569 93046 84793 76098 66113 54141 49104 50884 47145
10858 47145 41088 42303 42134 41202 40152 37722 44511 50323 50894 51571 56574 57599 60715 60761 61275 63245
10842 63245 67707 73758 81660 92273 99327 108952 123770 136266 150961 160353 158636 157965 152048 145751
10828A45751r377j4133j3863j1398k1219k2341o343j036K501N780O685Q762Q915
10815G8684k61L014L487Q72k124M020N963j748r568n619K252N360N120K032k58
10800I1226J273j286M079M807O338J81J764L715O471J5968J3320K1233K4550L0392
10786B24031L0830L3313L6974K9217J5975R783p40j3857j9831k3990k4443k5700
10774B71562k2257k2046j9370j7425q591r054k140j1408j3279n970L351Q108N939
10761A57420j815n919n098l42j947O86m138j650J41K462L906J358N161J0925R020
10746A70170J0068P459J3508K272j8435k5576k4968j4985j8561q619l644j864
10734H6825L85J463J270Q693Q997L644J452O97l869p694j3299j0033o843r644
$$ plain form
10828 145751 136374 122241 108378 96980 75761 53420 47077 46041 48542 54322 61007 69769 78684
10815 78684 78423 81437 84924 85796 83672 87692 93655 91907 82339 76720 78972 84332 89452 91484 91226
10800 91226 92499 91213 95292 100099 106437 106618 108382 112097 118568 134536 147856 169089 193639 224031
10786 224031 254861 288174 325148 354365 370340 380123 379383 365526 345695 321705 297262 271562
10774 271562 249305 227259 207889 190464 181873 172819 170679 159271 145992 140022 143373 151481 157420
10761 157420 155605 149686 144588 144246 142299 142985 138847 137197 137338 139800 143706 145064 150225 161150 170170
10746 170170 180238 187697 201205 203477 185042 159466 134498 119513 100952 92333 88689 86825
10734 86825 87210 88673 89943 98636 107633 111277 112729 113426 109557 101863 88564 78531 71688 62044
10720F2044p572l280k5K618N565J2694J6092J1861R756J2404J3803J2412J1824
10707A60196O118P409Q141J5822J0947J859M700J2903R550J213j3013k0797k2746
10694A82302k2416k3194k1539j2345l305O886O918K274J0310R116Q595N641m670
10681A44573p792p211r612o487q864n641m168l761m092M665Q350N964J0144J2118
10667A28186J1318J6454J5622J4288J6921K5658L1982L8382N3569O9693Q9622
10656E11695R8042R1056P7270N7024K2778j1566m9962p3155q2693q5412p7862
10645D77215o4898m8070k6754q709K34M371P2m524k002l064l279p31j853K415
10631C20423L408N552O305Q799J4513J4338R093J1826J3112J0811L470K053J2514
$$ plain form
10720 62044 54472 51192 51167 53785 59350 72044 88136 99997 109753 122157 135960 148372 160196
10707 160196 166314 173723 181864 197686 208633 210492 215192 228095 237645 238858 225845 205048 182302
10694 182302 159886 136692 115153 102808 99503 106389 113307 115581 125891 135007 143602 149243 144573
10681 144573 136781 129570 119958 113471 104607 98966 94798 91037 86945 91610 99960 105924 116068 128186
10667 128186 139504 155958 171580 185868 202789 228447 260429 298811 352380 422073 511695
10656 511695 609737 700793 778063 835087 857865 846299 796337 723182 640489 555077 477215
10645 477215 412317 364247 337493 328784 329018 333389 333461 328937 326935 323871 320592 319861 318008 320423
10631 320423 323831 329383 335688 344487 359000 373338 382431 394257 407369 418180 421650 423703 436217
10618D36217J3655J9982K1880K7623K8981K4503K2937K8095K9212K0733J8024
10607F91842J7994J5185J6128J9632L3433M2213M6000N7584O0459O6211O1859
10596A128540N4123N1649N8797O2249P2310Q9943J06858J34577J72602K22827
10586B154475K99767M06490N36281N71697N06810N97014Q79456J268065J540469
10577H760524J604066J515993J230749O85511l7520p54722j220719j418201j496416
10568H869265j408892j104059p18552l91371j66263k4751O2856J31497J75936
10559E425666K23541K70061L17464L68463M25079M97772N92969P19751Q84844
10550I725610J049019J186793J324586J468293J614870J758543J938800K236728
$$ plain form
10618 436217 449872 469854 491734 519357 548338 572841 595778 623873 653085 673818 691842
10607 691842 709836 725021 741149 760781 794214 836427 882427 940011 1000470 1066681 1128540
10596 1128540 1182663 1234312 1293109 1355358 1427668 1517611 1624469 1759046 1931648 2154475
10586 2154475 2454242 2860732 3397013 3968710 4475520 5072534 5951990 7220055 8760524
10577 8760524 10364590 11880583 13111332 13796843 13759323 13004601 11783882 10365681 8869265
10568 8869265 7460373 6356314 5637762 5246391 5080128 5055377 5118233 5249730 5425666
10559 5425666 5649207 5919268 6236732 6605195 7030274 7528046 8121015 8840766 9725610
10550 9725610 10774629 11961422 13286008 14754301 16369171 18127714 20066514 22303242
10542B2303242K670640L273460M066501N140283O640307Q750527J1753107J6158833
10534H0756900K2867653L3075975M6321911N8028033O2060920N8782166N1005149
10527D12898707L8732513J9918417l184051k5897372m2469140n2288962n8172778
10520B89537334n9667308n3979326m2319822k9839172k0292633j4198015j0533589
10513E8707469q238270o610797n318364m300305l528618k952637k498566k140654
10505B3119258j905613j787519j713243j642805j547319j443976j309239j157471
10497A0612073r90599q28194p01808n99263n17500m50891l99069l67013l26450
10488E431286k93702k71127k52457k37118k32356k20753k02080j91751j78550
$$ plain form
10542 22303242 24973882 28247342 32313843 37454126 44094433 52844960 64598067 80756900
10534 80756900 103624553 136700528 183022439 241050472 303111392 361893558 412898707
10527 412898707 451631220 471549637 468365586 442468214 399999074 347710112 289537334
10520 289537334 229870026 175890700 133570878 103731706 83439073 69241058 58707469
10513 58707469 50469199 43858402 38540038 34239733 30711115 27758478 25259912 23119258
10505 23119258 21213645 19426126 17712883 16070078 14522759 13078783 11769544 10612073
10497 10612073 9621474 8793280 8091472 7492209 6974709 6523818 6124749 5757736 5431286
10488 5431286 5137584 4866457 4614000 4376882 4144526 3923773 3721693 3529942 3351392
10479C351392j66240j56411j39374j27316j16879j01142q0451p0587o1407n1485
10469B280100m8264m1234l7184m1421m0096m4469n3440o3521p1324p0784o0393
10458A707970n8776n7030m8853l6551k2724k4791k6161j7797j0961j9370k6508
10447A358448k5797l6190l8204l2140l7089l6487l1266j7589j2258j1399k614
10436A077415l326j6063j3736j6059k4442k4246j8116r862p970r948k884o864
10424I23899j5908j5020j4597j7268j8409k0413j8035j3593j4894j7272r809p082
10412G41599l516R773J3132J9667J4753M307k7206n1368o1700o9518p1603p2646
10400D45674o3204k8106K061K2015K8862L8155M6572M2355K1460M22l967q442
$$ plain form
10479 3351392 3185152 3028741 2889367 2762051 2645172 2544030 2463579 2392992 2331585 2280100
10469 2280100 2231836 2190602 2153418 2111997 2071901 2027432 1973992 1910471 1839147 1768363 1707970
10458 1707970 1649194 1592164 1543311 1506760 1484036 1459245 1433084 1415287 1404326 1384956 1358448
10447 1358448 1332651 1296461 1258257 1226117 1189028 1152541 1121275 1103686 1091428 1080029 1077415
10436 1077415 1074089 1058026 1044290 1028231 1003789 979543 961427 951565 943595 933647 930763 923899
10424 923899 907991 892971 878374 861106 842697 822284 804249 790656 775762 758490 748681 741599
10412 741599 738083 747856 760988 780655 795408 799715 772509 721141 659441 589923 518320 445674
10400 445674 382470 354364 356425 378440 407302 445457 492029 534384 555844 556266 552299 543857
10388E43857j1793o234M81rM26J013J026m894n022m046n074o639j5072j4481j3405
10373D60134j7586j8214j2255j2880j6337o427n64P547J44J079N834K550j460
10360C91565n856j8162j6857j0791j9310k2049j7206j4564p372l831k403m852
10348B48312k380k75O138J5858Q666J0638J0949J1477J7217J8717K6558K8730
10336D00605J0124p090j7553k1127k2030k3617j8745j3548j2158j2438j6580j2073
10324B33770r10K558J137k570k23M191M233N782O084O189K615k235p011n841q038
10309B39731j1106r526p951j2422j0479p087n210l934o175q776k604n83p419o179
10295A40280j445k535j582J926j324L695K593l1k300n179K373J176L922O622J1684
$$ plain form
10388 543857 532064 525830 526311 526302 526728 527741 528767 523873 518851 514805 509731 503092 488020 473539 460134
10373 460134 442548 424334 412079 399199 382862 376435 375871 383418 383562 384641 390475 393025 391565
10360 391565 385709 367547 350690 339899 320589 298540 281334 266770 259398 255567 253164 248312
10348 248312 245932 245657 251795 267653 276319 286957 297906 309383 326600 345317 371875 400605
10336 400605 410729 403639 386086 364959 342929 319312 300567 287019 274861 262423 245843 233770
10324 233770 232860 235418 236555 233985 233762 237953 242186 247968 254052 260241 262856 260621 253610 247769 239731
10309 239731 228625 219099 211148 198726 188247 181160 175950 172016 165841 157065 154461 153878 146459 140280
10295 140280 138835 136300 134718 136644 135320 139015 141608 141577 139277 134098 136471 137647 141569 148191 159875
10280A59875J3495J2730J0497R168P797O289M098K039J522j716o812q009j0126
10267B00847k947K370o32l956k041k268N852J2543J3824K2198L4408L6508L9376
10254C56082M9568N2643M4082K3259N817n184j9953l0909m1915m7871m7908m1888
10242B95823l7190l4763k4209j3827J561M517J3627L1703M4772M9421J8489k5096
10230C24828m4189m1343m0794l3006k6416k3309k1437k0891j6575j4273q753p215
10218B6627l975O039J3864J2451O376J988P562L645N925N621L301M281N89l821
10204I0473l211N261j172k939L212O374J157K724N436J171j821m740K181K344
10190A06450L243J951j685k467K895M861R551N186q51j34n918j630n079p471K409
$$ plain form
10280 159875 173370 186100 196597 205765 213562 219851 223949 225988 227510 225794 218982 210973 200847
10267 200847 197900 200270 199638 195682 193641 191373 197225 209768 223592 245790 280198 316706 356082
10254 356082 405650 458293 502375 525634 531451 526267 506314 475405 433490 385619 337711 295823
10242 295823 258633 223870 199661 185834 187395 191912 205539 237242 282014 331435 349924 324828
10230 324828 280639 239296 198502 165496 139080 115771 94334 73443 56868 42595 33842 26627
10218 26627 22652 28691 42555 55006 61382 63370 70932 74577 80502 86123 89424 93705 94294 90473
10204 90473 87262 92523 91351 88412 91624 97998 99155 101879 107315 108486 106665 101925 104106 106450
10190 106450 109693 111644 109959 107492 110387 115248 124799 129985 129134 129000 123082 121452 116373 108902 111311
10175A11311J574M857J2786J0454P407J1002M572R81n442n389l955m195j3449
10162A32514j2699o17n024p964p454k412j567j8K031o70q54J266J243J114m60
10147I8429M001J2337P436O950O297J2855O867K476J1927J0242J2047K0466K1470
10134B33800K3545L2631M7660O1046Q6400J22641J81342K57423L34220L73352
10124A754060L68545L36468K62941J30877l2582j93560k93862l44373l68730l53221
10114A266563k97567k14306j48054j08285p2230m7325l3214k6736k2475j5571
10104B80800j3787j8202j0894j1399j3185j2894j4278j0052j5316j9066j6842
10093A24885n448R25j204p834j0389n451M8M030P090M602j064k327k897J911l638
$$ plain form
10175 111311 112885 117742 130528 140982 148389 159391 163963 164944 159502 154113 150158 145963 132514
10162 132514 119815 119198 114174 106210 98756 96344 94777 94759 96790 96120 95266 96532 97775 98889 98429
10147 98429 102430 114767 122203 129153 135450 148305 155172 157648 169575 179817 191864 212330 233800
10134 233800 257345 289976 337636 398682 485082 607723 789065 1046488 1380708 1754060
10124 1754060 2122605 2459073 2722014 2852891 2820309 2626749 2332887 1988514 1619784 1266563
10114 1266563 968996 754690 606636 498351 426121 378796 345582 318846 296371 280800
10104 280800 267013 248811 237917 226518 213333 200439 186161 176109 160793 141727 124885
10093 124885 119437 120362 119158 111324 100935 95484 95532 99562 106652 111254 110190 107863 104966 106877 103239
10078A03239j0384n268j822M689M762L116R680J3431Q448L390K895N745J138k452
10064A40607n003q006q759q547p505p688l094K296Q233P214j60m964j7329j3549
10050G3746p280j1372j1363q374n077m741p834p019P057P993K112J672O914K243
10036C8677J345k951k185R22L748j066l85O803j872J394r010o130j524k636j325
10021B3805J657O80q47P905M093M683O271P558K312k582n915l096j577k64J898
10006D6581K48L70J517M415R09J634K146p63k890n391n363o745J065l1N516O520
9990D9738K581J25K114R64j416Q168L311O461N196k228m094m186l437j781LN814
9974F7333O788L468J56J767j205O918P183R655J0339J3156J1364K0624K6925L8965
$$ plain form
10078 103239 92855 87587 85765 90454 95216 98332 108012 121443 129891 133281 136176 141921 143059 140607
10064 140607 135604 127598 118839 110292 102787 95099 92005 94301 102534 109748 109588 104624 87295 73746
10050 73746 66466 55094 43731 35357 30280 25539 17705 10686 17743 25736 27848 29520 36434 38677
10036 38677 40022 37071 34886 35808 39556 38490 38105 44908 43036 44430 35420 29290 27766 25130 23805
10021 23805 25462 26142 25295 33200 37293 41976 48247 55805 58117 55535 49620 46524 44947 44683 46581
10006 46581 46829 47199 48716 53131 54040 55674 57820 57057 54167 48776 43413 36668 37733 37702 43218 49738
9990 49738 52319 52444 54558 55522 54106 62274 65585 72046 77242 75014 70920 66734 63297 61516 61519 67333
9974 67333 74121 77589 77745 79512 78307 85225 92408 102063 112402 125558 136922 157546 184471 223436
9960B23436P5473R9323J6781n1145n0929j9605p6j512j701J3559K0234J9157O029
9947C49024k009O912J7551L5918N0699N9906P2626R5791J32832J76182K33312
9936A228744L24514M69665O82263J030003J637041K802627M350056M434204J234282
9927A8193399k741440m442052l799112k424152j397320q47354n66377m00017k85258
9918A290317k03745j44403j10572r2835q1248p1150o4570m8920l7981k4383j2290
9907C98220o562k431k0171m1352m0832l1249k0537j6105j3421j1971n672p250
9895A80667q425n776L029K153l267n474l405j324m678p349l58M523P997N031L86
9880A63730j247n283n005k41N282N731R962O972M391j449j239M908P008J1804
$$ plain form
9960 223436 298909 398232 415013 363868 312939 293334 293258 291746 290045 303604 323838 342995 349024
9947 349024 347015 353927 371478 407396 458095 518001 590627 686418 819250 995432 1228744
9936 1228744 1553258 2022923 2705186 3735189 5372230 8174857 12524913 16959117 18193399
9927 18193399 15451959 11009907 7210795 4786643 3389323 2541969 1975592 1575575 1290317
9918 1290317 1086572 942169 831597 738762 657514 586364 521794 472874 434893 410510 398220
9907 398220 391658 389227 369056 327704 286872 255623 235086 218981 205560 193589 187917 180667
9895 180667 172242 166466 169495 171648 168381 162907 159502 158178 153500 146151 145793 150316 158313 163344 163730
9880 163730 162483 157200 152195 151954 157236 162967 172929 179901 184292 182843 181604 186512 193520 205324
9866B05324J6928J3970Q852P873R623O488Q000J0513J4844K8153K7853K2670K7229
9853D08320L0663L2231M0150O2138Q9561R9491P3469L9385M1406O4576R4957J25542
9841A201889J50731K00330K66575L61306M88240O46913Q78840J219511J700509
9832G114844K431346L671794N893476Q927868Q198588J07990p100143q702153
9824B0543610o418535l924412k428880j639742j207040r12880o89945n22657l97510
9815B402009l12999k53791k12567j69145j34592j11698q8188n3954k3095k6687
9805A015293p5767j07199j03002q1999o8520n9967m4960l1730k8952l1348k5264
9794C56585j9427k2295j5057j0542j1862j1697j0133j0877m359k506j4263j6893
$$ plain form
9866 205324 222252 236222 245074 252947 262570 269058 277058 287571 302415 330568 358421 381091 408320
9853 408320 438983 471214 511364 573502 663063 762554 836023 875408 916814 981390 1076347 1201889
9841 1201889 1352620 1552950 1819525 2180831 2669071 3315984 4194824 5414335 7114844
9832 7114844 9546190 13217984 19111460 28039328 36237916 36345906 29245763 20543610
9824 20543610 14125075 10200663 7771783 6132041 4925001 4012121 3322176 2799519 2402009
9815 2402009 2089010 1835219 1622652 1453507 1318915 1207217 1119029 1065075 1041980 1015293
9805 1015293 939526 832327 729325 647326 578806 518839 473879 442149 413197 381849 356585
9794 356585 337158 314863 299806 289264 277402 265705 255572 244695 240336 237830 223567 206674
9782B06674j3778j5571m051j570J179m763o995j2119p754j0998n845J641J876
9769A27926O136N757m102p144j404l652k289o120l352n39m915m579m763l458q426
9754H5076J378M107R41L396J451J717J874l553j948J101K963N764K386O731J1389
9739A24773J5127K3023L5573M4318L6188L2265L2388J1030j7910l5368m3601l8157
9727B19649m2706k8575k4066j8170j0880n242J000j123J81k415n34j39k249J553
9713H6284K473l110p14k640p663k506L356N03j668q416j9470j7104r669J1147
9699C0803J5871O760K498J323O295J028k136K231j564l091O000N281J854J105
9685G4258Q446K561K238R124N404O249P437J0843N753O685J1866J4395J9034K6537
$$ plain form
9782 206674 192896 177325 173274 171704 172883 168120 161125 149006 141252 130254 124409 126050 127926
9769 127926 134062 139819 135717 128573 127169 123517 121228 115108 111756 111217 106302 101723 96960 93502 85076
9754 85076 86454 90561 91502 94898 96349 98066 99940 96387 94439 95540 98503 104267 106653 113384 124773
9739 124773 139900 162923 198496 242814 279002 311267 343655 354685 336775 301407 257806 219649
9727 219649 176943 148368 124302 106132 95252 90010 91010 89887 90068 87653 87119 86980 84731 86284
9713 86284 88757 85647 84933 82293 74630 72124 75480 75983 74315 65899 46429 29325 19656 30803
9699 30803 46674 53434 55932 57255 63550 64578 62442 64673 63109 60018 66018 71299 73153 74258
9685 74258 82704 85265 87503 96627 102031 108280 115717 126560 132313 138998 150864 165259 184293 210830
9671B10830M1322N2009P3799J08290J43161K14811L34669N04896N42876L47901
9661B574564J30841o238j72594m21852n39141m68753l12672j97940j29186q3225
9651C73804o0694m4924l5762k6642k3205j9576j5296r389r227o845m352j00k688
9638A15104m909o187p020j2151n878k946n385j802m107n746n933n504J298j573
9624D7261m363j773J539L339M185L536p83n58L180P43J239M802R856N476J576
9609G9255j232j361l252J597K409O817J7443K1153K3804K3770J9621J5075O873
9596B11972m088j8916k6449k6864k5529k9251k6414r356n907m505J450l616j246
9583C1281N722K962J040J199k598l252J544m34k19j833L604M437J082R63p030
$$ plain form
9671 210830 252152 304161 377960 486250 629411 844222 1178891 1683787 2226663 2574564
9661 2574564 2705405 2699167 2526573 2104721 1565580 1096827 784155 586215 457029 373804
9651 373804 313110 268186 232424 205782 182577 163001 147705 138316 129089 122244 117892 117792 115104
9638 115104 110195 104008 96988 84837 78959 76013 70628 68826 64719 58973 53040 47536 48834 47261
9624 47261 42898 41125 42664 46003 50188 53724 52941 52383 55563 56306 57545 62347 72203 77679 79255
9609 79255 78023 76662 73410 75007 77416 84233 101676 122829 146633 170403 190024 205099 211972
9596 211972 207884 188968 162519 135655 110126 80875 54461 45105 39198 34693 36143 32527 31281
9583 31281 37003 39965 41005 42204 39606 36354 37898 37464 37245 35412 39016 43453 44535 45498 38468
9568C8468q925j675n1n265n76J972j86N535j468l805k532n917J892N129J101r85
9552B2712l403K79O792K848k234l419K748J366k406n376j958J943k23l01k020
9537A7348o67K851J285K174j128O751k803O24O82Q8J162mK11n139m929l063L286
9520A8729J2785J0112J1778J9250K2689J2773n283k3937j9270j4843q885q264
9508B7634m096m58m01j126j147l21p980j426P365K203K615K243k787m934p929
9493I455N80K228M086n484n35k00R5K198O758K686l119j302l41L26j827k522J924
9476A5006J269k452Q2p93K902M050J6m293l113j524M580l353J73J472j362o16
9460A2044mm17L058K91q93k993K148L582j36J254m418l255P02n740j337K857k422
$$ plain form
9568 38468 29543 27868 27817 22552 21976 23948 23762 29297 27829 24024 21492 15575 17467 22596 23697 22712
9552 22712 19309 19588 26380 29228 26994 23575 26323 27689 25283 19907 17949 19892 19669 19368 17348
9537 17348 16681 19532 20817 22991 21863 28614 25811 26435 27117 27205 28367 28363 28574 23435 18506 15443 18729
9520 18729 31514 41626 53404 72654 95343 108116 102833 78896 59626 44783 35898 27634
9508 27634 23538 23080 22679 21553 20406 20085 12105 10679 18044 20247 22862 25105 22318 17384 9455
9493 9455 10035 12263 16349 10865 10330 10130 10225 12423 19181 21867 18748 17446 17105 17431 15604 13082 15006
9476 15006 16275 13823 13905 13112 16014 20064 20080 15787 12674 11150 15730 12377 12550 14022 12660 12044
9460 12044 12040 11623 14681 14972 14079 11086 13234 16816 16680 17934 13516 10261 10963 5223 3886 6743 4321
9443D321L526K151m362j409N989O257L171P52K441K832q115j1570J39J813L938
9428A1874J0890N971L025M438M360L457P384K2286L7532M7952M0728k506l5235
9415A62156l6948l4100k3307j4734p852k379j197n860p927j318L590k822k221
9402B5081k376j92J659n3J052n53l393j989k753J302j701k628k768L443J017K839
9386A7987k851J070J945n01k152l840N584L676K020l211j481K487O26l126J383
9371A9616L061K236j985k879Q24k90l65j848J591N312J811p567p157o69P45j82
9355A2254J315k333J8M04k737m071j567L617Q17n730n7K466j367L080k49M4O44
9338F548J547L002m447m977k978J371R54l82r2k01P74J901M751l749n099O749
$$ plain form
9443 4321 7847 9998 5636 4227 10216 16473 19644 20396 22837 25669 17554 5984 6123 7936 11874
9428 11874 22764 28735 31760 36198 40558 44015 51399 73685 111217 159169 199897 197391 162156
9415 162156 125208 91108 67801 53067 45215 42836 41639 35779 27852 26534 30124 27302 25081
9402 25081 22705 22513 24172 24119 25171 24618 21225 19236 16483 17785 16084 13456 10688 14131 15148 17987
9386 17987 15136 16206 18151 17650 15498 11658 17242 20918 22938 19727 18246 20733 21359 18233 19616
9371 19616 22677 24913 22928 20049 20873 20583 20218 18370 19961 25273 27084 19517 12360 11691 12436 12254
9355 12254 13569 11236 11254 11658 8921 4850 3283 6900 7717 1987 1930 4396 3029 6109 5860 5904 6548
9338 6548 8095 11097 6650 1673 -1305 66 1020 638 546 345 1119 3020 7771 4022 -1077 5672
9322E672J925l351j151K97L247M866J099l246l863L082L602p71k95K000j701j756
9306I656m014k873p78J202j799k484M669P819K88n248l564q80M72P037L591J872
9290A4966P2l063m177n026j823M503M908Q01M32K106P56o979n546K070J830O47
9274F477P05Q42q76m435j023O438O257J679k700j85j716m177j497Q84p9o11J877
9257G860K318L565J377k085o17O468J832l176l929k078q66J63n114k052R80N836
9241A0482L351k794n498l683L931K307J010l464k688L249K61l001K900J76J3n594
9225I58J742K823k802l443l022K532K624l054k656n68J857K955j94k0J172O054
9209F958J03n982L46K841j86j228o078k381J424N748K278R17K743J02l526K39
$$ plain form
9322 5672 7597 4246 3095 3392 6639 11505 12604 9358 5495 8577 12179 11408 11113 13113 11412 9656
9306 9656 5642 2769 1991 3193 1394 -1090 3579 11398 11686 6438 2874 1994 2466 9503 13094 14966
9290 14966 15038 11975 7798 2772 949 5452 10360 11161 11593 13699 14455 7476 1930 4000 5830 6477
9274 6477 7182 8024 7148 2713 1690 8128 14385 16064 13364 13179 11463 7286 5789 6673 6594 5983 7860
9257 7860 10178 13743 15120 13035 12418 18886 20718 17542 13613 11535 10669 10832 5718 3666 4646 10482
9241 10482 13833 11039 5541 1858 5789 8096 9106 5642 2954 6203 6464 3463 6363 6539 6552 958
9225 958 2700 5523 2721 -722 -3744 -1212 1412 -1642 -4298 -4866 -3009 -54 -248 -268 904 6958
9209 6958 7061 1079 1425 4266 4080 2852 -3226 -5607 -4183 1565 3843 4760 7503 7605 4079 4318
9193D318J918L473j103j571J527K414J209k211O93l396j972k134k770m326J35
9178c796Q11m32k354J898J588P334K872q53P72m854m037j805K792K594j754k21
9162E55M18L265K180j49l247K034N462K413r99J069M55r69m911n709P03j819J179
9145A930Q26J343k011K942j298L162k861m934L65N476P130P90n36L095m976M25
9129A0868l541n018r28L416R19L217l754o496k063m77M526J158L514L856k564
9114F633j703L70M733J242m662o943j668L838O696j285k047p70n77K835N516n67
9098A1641o044k032J557O72l455N881M21K762J938m717p090l318N37K400L079
9083D232l006J568N475k410n422M51L861j308K191P36J442j688n111o485J669
$$ plain form
9193 4318 6236 9709 8606 7035 8562 10976 12185 9974 10667 7271 5299 3165 395 -3931 -3796
9178 -3796 -2985 -3417 -5771 -3873 -2285 5049 7921 7068 7840 2986 -1051 -2856 -64 2530 776 555
9162 555 973 4238 6418 6269 3022 5056 10518 12931 11932 13001 13456 12487 7576 1867 2570 751 1930
9145 1930 2756 4099 2088 5030 3732 6894 4033 -901 -536 4940 12070 12860 12324 15419 10443 10868
9129 10868 7327 2309 1381 4797 5716 8933 5179 -1317 -3380 -3857 669 1827 5341 9197 6633
9114 6633 4930 5300 10033 11275 6613 -330 -1998 1840 8536 7251 5204 4434 3857 6692 12208 11641
9098 11641 5597 3565 5122 5794 2339 8220 8641 11403 13341 8624 1534 -1784 -1247 1153 4232
9083 4232 1226 2794 8269 5859 437 888 4749 3441 5632 6368 7810 6122 1011 -5474 -3805
9068c805O25K185j864k558L102Q749K059m264K39K206k01K039K83K860J822j480
9052A1997m668l823L162l274m344K656J319O46M426N45P75o4j839o119j749M711
9036D357K412K431j438L617K721k436p193M000j044l108M394l311n267l067K217
9021g15K901J730J434J116m713n082M95m01j318j440j756K334k039j606M599O821
9005B360Q45Q22R15m728j539m246j355J981M678K239j028m867j614K527K74J307
8989a429O923L90m257R99P195k167r758N8J188k666N50M587L761j924j027R71
8973C394j226j31L94n110j102J399k391R24k418L577M639k014n418K469N448L252
8957E686j906l975J26J062M735J528m587j976J37J187L460j429J277P86r95M796
$$ plain form
9068 -3805 -3180 -995 -2859 -5417 -2315 6434 8493 4229 4468 6674 6473 8512 8795 11655 13477 11997
9052 11997 7329 3506 6668 3394 -950 1706 3025 3671 8097 8642 9417 9353 7514 1395 -354 4357
9036 4357 6769 9200 7762 11379 14100 11664 4471 8471 7427 4319 8713 5402 135 -2932 -715
9021 -715 2186 3916 5350 6466 1753 -3329 -2834 -3235 -4553 -5993 -7749 -5415 -7454 -9060 -4461 2360
9005 2360 3205 4027 4942 214 -1325 -5571 -6926 -4945 -267 1972 944 -3923 -5537 -3010 -2736 -1429
8989 -1429 5494 5884 1627 2626 9821 7654 -2104 -2046 -858 -3524 -2974 1613 5374 3450 2423 3394
8973 3394 2168 2037 2431 -2679 -3781 -2382 -4773 -3849 -6267 -2690 1949 -65 -5483 -3014 2434 5686
8957 5686 3780 -195 -69 993 5728 7256 2669 693 830 2017 5477 4048 5325 6111 5116 9912
8941I912L828K887K010L746O917j272k702j881o032n472m92m00k413p099N04J044
8925C085K185j27Q83K592m89j869n162j706P347M054n9n20m761M130P3o935N73
8908C294N352K606k453j062L387j544j591j883M291j184M011J2618N431m209q868
8893A8196m813j589l522N15L01L622k484j638J913q456j810K555j634K622N866
8878I644m66m090j861m10J911J411J782K374j622L10L002L14l061l217k627P004
8862A0398M97m521k500O58J882o95k044K170L530J370l369m153J028K707j830
8847E128p97M73k113K736K588j737n019K270L038p32N04K684K46j959j719k178
8831C413L991M216l260m657j672K317P72l007l552R15k498j962L650J827o43j640
$$ plain form
8941 9912 13740 16627 18637 22383 29300 28028 25326 23445 17413 11941 11449 11049 8636 1537 2041 3085
8925 3085 5270 5143 6026 8618 8129 6260 1098 -608 6739 10793 10734 10214 5453 9583 9656 2721 3294
8908 3294 8646 11252 8799 7737 11124 9580 7989 6106 10397 9213 13224 25842 31273 27064 18196
8893 18196 13383 11794 8272 8787 9088 12710 10226 8588 10501 2045 235 2790 1156 3778 9644
8878 9644 9178 5088 3227 2817 4728 6139 7921 10295 8673 8983 11985 12299 9238 6021 3394 10398
8862 10398 10895 6374 3874 4532 6414 5719 3675 5845 9375 10745 7376 3223 4251 6958 5128
8847 5128 4331 4804 2691 5427 8015 6278 1259 3529 6567 5835 6339 9023 9269 7310 5591 3413
8831 3413 7404 11620 8360 3703 2031 4348 5120 2113 -1439 -524 -3022 -4984 -1334 493 -150 -1790
8815a790N594j314L80j602n987j906O951K660m585l10O142M873j549o040o98L340
8799D159K639m013m008K923L245j670j387J084k962N830N84q27L276k909l669
8784B295R97L23j360r95J428k388J443L605j865m280k77K105j181K36M089O715
8768A0890l733p490k646P3J734O14l138j685L660l92l240O58J576K762l142J122
8752b377J763K45J806L468O9j932L655L955k246P16J520k920k918k581J433m74
8736C182J463k062j997k346p81K363K192Q90k405J046J909j025K010M498O45m979
8720D603L151l39q74o72J975k07j005J081p33L583J246l953k767p94l695j132
8704e32M04r35K259M776K072P9o629m204K074K684K94j196M86M71O12j564k876
$$ plain form
8815 -1790 3804 2490 2870 1268 -4719 -6625 326 2986 -1599 -1909 4233 9106 7557 1517 819 4159
8799 4159 6798 2785 -1223 1700 4945 3275 1888 2972 10 5840 6424 5597 8873 5964 2295
8784 2295 3292 3615 2255 1260 2688 300 1743 5348 3483 -797 -1074 1031 -150 86 4175 10890
8768 10890 7157 -333 -2979 -2906 -1172 -558 -3696 -5381 -1721 -2113 -5353 -4695 -3119 -357 -3499 -2377
8752 -2377 -614 -369 1437 4905 4974 3042 6697 10652 8406 9122 10642 7722 4804 2223 3656 3182
8736 3182 4645 2583 586 -1760 -2541 -178 2014 2904 499 1545 3454 2429 4439 8937 9582 4603
8720 4603 7754 7415 6541 5869 7844 7637 6632 7713 6980 10563 11809 7856 5089 4295 600 -532
8704 -532 -128 -1063 1196 5972 8044 8123 1494 -2710 -636 2048 2342 1146 1632 2103 2715 1151 -1725
8687a725j778k055l741o45N466J012m12P551N667j847m414p74m246p05O105l199
8671B60J799J039j394N083K182j667J965j579j281L478K700K292l106m784k920
8656D067q38N985K683q73l731k883k090J943K21k534M50n7J565R41j415j733O17
8639B318L399M23l81n363l493J773J20l279O453N12o12L896L744l703J508k059
8623E256k387L66O41J440O424K140l431j721j582j578n01n42k272K896j33j971
8607C045k591L103K159M066r2n522p791j952J574K039L97J887J378q49M849K124
8591G824k465j192j701k178L274J845J402M169J016m458r568j594q7k191L78L669
8575a857L065J154k495j5k100N94L032K584n236j599K434M65M867M59j496J679
$$ plain form
8687 -1725 -3503 -5558 -9299 -9944 -4478 -3466 -3878 3673 9340 7493 3079 2305 -1941 -2646 3459 260
8671 260 2059 3098 1704 6787 8969 7302 9267 7688 6407 9885 12585 14877 11771 6987 4067
8656 4067 3229 9214 11897 11024 7293 4410 2320 4263 4484 1950 2400 2343 3908 4849 3434 1701 2318
8639 2318 5717 6140 5759 396 -3097 -1324 -1204 -4483 1970 2482 1870 5766 9510 5807 7315 5256
8623 5256 2869 3235 3876 5316 11740 13880 10449 8728 7146 5568 5067 4525 2253 5149 5016 3045
8607 3045 454 3557 5716 9782 9690 4168 -3623 -5575 -4001 -1962 -1565 322 1700 851 5700 7824
8591 7824 5359 4167 2466 288 3562 5407 6809 10978 11994 7536 -2032 -3626 -3713 -5904 -5526 -1857
8575 -1857 1208 2362 -133 -148 -2248 -1654 1378 3962 -1274 -2873 -439 26 4893 5352 3856 5535
8559E535J445M03j030P55j68l18K911J307N27k694n619j274N288J945K725O03
8543A2341J107k354m547J340k971J98M655N227L655k637J695K376j8k663j486
8528A5918k62n291k310j200J182Q37l32P52k461P020m64q234l219n45J534k359
8512E66J289L524OK119N59k016q68M83K298K057m455M87L162K03o798k991K554
8495B179L194k296N8J579k613L159J816L20k944k74K780q99M452k747K44J058
8479I066n542L57J779m253o704L562L170l755k724N522N714j600l266k309j98
8464a181k220J03k155O37L37L16K773P46L911j458l457M06k087J373K812K433
8448C289L645K009r57m555l163J539L538N570N151p68l955m086k56O87j026m339
$$ plain form
8559 5535 6980 7383 6353 7108 6940 6622 9533 10840 11367 8673 3054 1780 7068 9013 11738 12341
8543 12341 13448 11094 6547 7887 4916 5114 9769 14996 18651 16014 17709 20085 20067 17404 15918
8528 15918 15656 10365 8055 6855 8037 8874 8542 9294 6833 13853 13389 5155 1936 1391 2925 566
8512 566 1855 5379 5385 7504 8063 6047 5179 5662 7960 10017 5562 6049 9211 9414 2616 -375 2179
8495 2179 5373 3077 3135 4714 2101 5260 7076 7396 4452 4178 6958 6059 10511 7764 8008 9066
8479 9066 3524 3881 5660 1407 -5297 -1735 1435 -2320 -5044 478 6192 4592 1326 -983 -1181
8464 -1181 -3401 -3298 -5453 -4816 -4479 -4163 -1390 -644 3267 1809 -1648 -1242 -3329 -1956 856 3289
8448 3289 6934 8943 7986 3431 268 1807 5345 10915 16066 15298 11343 7257 7001 7688 6662 2323
8432B323l51K671J126j287L519N136L203M61k087k162n222k584l52j182K454O089
8416A1755L148j077k878l532l007J283m61n145K237L640k217l499M597L565O719
8401A5128L056o529k518J711j592m982m347j42l040K069L475k978M25k302j638
8386d204K15K213l115L575J33J455j153J854p23L096k465j954L741J969R30n08
8370E059O167Q231K248n432l403j577j827j868k586k786r88L750P29j188K715
8355G244J475K041K159r75q942J43J927K206K393j755l800k809K329l32L216k5
8339F495m754L373n97j77O30J346J580l502J027M681m148o517n203L009M137K233
8323C613l274m709M840K743j297j687p72l541J658K455J225j745q816O69M780
$$ plain form
8432 2323 1972 4643 5769 4482 8001 13137 16340 16801 14714 12552 7330 4746 4394 3212 5666 11755
8416 11755 14903 13826 10948 7416 4409 5692 5231 86 2323 5963 3746 247 4844 8409 15128
8401 15128 18184 11655 9137 10848 9256 4274 -73 -215 -3255 -1186 2289 -689 -264 -2566 -4204
8386 -4204 -3989 -1776 -4891 -1316 -1183 272 -881 973 250 3346 881 -1073 2668 4637 5567 5059
8370 5059 11226 19457 21705 16273 12870 11293 9466 7598 5012 2226 1238 4988 5717 4529 7244
8355 7244 8719 10760 12919 11944 3002 3145 5072 7278 9671 7916 4116 1307 3636 3304 6520 6495
8339 6495 1741 5114 4517 4340 4970 6316 7896 4394 5421 10102 5954 -563 -5766 -2757 1380 3613
8323 3613 339 -4370 470 3213 1916 229 -543 -4084 -2426 29 1254 -491 -9307 -8638 -3858
8308c858L293R56j374L92J989j452q58j515L825K304k439J842p09J887L457j633
8292F107n368m883l22L444k554M141N999j434k798l78L502M15k692j431j617k873
8276b742k928l20O310k43m119k785J051L716K396K799K87K588J36l667n644O713
8260C548P156k330q835p183K46M418N627O24o177q25k269j951Q81J862J030R65
8244c213k125l442R00j357J43L845N57L576k030n598R81L843M011R72n42k984
8228b463Q51L457J609K545k602k505j271n60k905J577J891M229L233l165k697
8213A224l476J972K931J997k948J452M009n876n388K621J707j547j370L641L329
8198D278R4Q80j034k812k436J862j670l765J791j561n53j933J188J583L281M395
$$ plain form
8308 -3858 -565 391 -983 -591 1398 -54 -912 -2427 1398 3702 1263 3105 2396 4283 7740 6107
8292 6107 739 -4144 -4466 -1022 -3576 565 6564 5130 2332 1954 5456 5871 3179 1748 131 -2742
8276 -2742 -5670 -5990 320 77 -4042 -6827 -5776 -2060 336 3135 3422 6010 6146 2479 -3165 3548
8260 3548 10704 8374 -461 -7644 -7398 -2980 2647 3271 -2906 -3731 -6000 -7951 -7070 -5208 -4178 -3213
8244 -3213 -5338 -8780 -7880 -9237 -9094 -5249 -4692 -1116 -3146 -8744 -7763 -3920 91 1063 521 -2463
8228 -2463 -1612 1845 3454 5999 3397 892 -379 -939 -3844 -2267 -376 3853 7086 3921 1224
8213 1224 -2252 -280 2651 4648 1700 3152 7161 1285 -4103 -1482 225 -1322 -2692 949 4278
8198 4278 4372 5252 4218 1406 -1030 832 -838 -4603 -2812 -4373 -4926 -6859 -5671 -4088 -807 3588
8182C588J849l079j713k209k238m094j913k27J366Q098K440n209n71k03K167K025
8166G7j740J734M318J233J69k981J308K825l62j467L480k618j3102k651K773o91
8150g695L459K329k633J897J392J039l328K08J55K693k363J278M185J845j133
8135C328m86m994L9L728j065L20o64n087p87M981J110o230m22L288M078q16K129
8118B450J030k167m833k077M913M253P39j016M010J931j870k670q377k887J226
8103e345L586L425q25k882P2J915J201L612J927k940j737J118l92n767K093J541
8087F02r2k26j033N030K161L125j016M65j390m411J4j684M053k297r15L57r490
8070f747m213Q052N361l791k57L486M835L33l103k03j384l98n297j726J537O44
$$ plain form
8182 3588 5437 2358 645 -1564 -3802 -7896 -9809 -10036 -8670 -572 1868 -3341 -3912 -4115 -1948 77
8166 77 -1663 71 4389 5622 5791 2810 4118 6943 6581 5114 8594 5976 -7126 -9777 -7004 -7695
8150 -7695 -4236 -1907 -4540 -2643 -1251 -212 -3540 -3332 -3177 -484 -2847 -1569 2616 4461 3328
8135 3328 2842 -2152 -2113 1615 550 870 206 -4881 -5668 -687 423 -5807 -6229 -2941 1137 321 2450
8118 2450 3480 1313 -3520 -5597 -684 3569 4308 3292 7302 9233 7363 4693 -3684 -6571 -5345
8103 -5345 -1759 1666 841 -2041 -1969 -54 1147 4759 6686 3746 2009 3127 2735 -3032 -939 602
8087 602 510 284 -749 4281 6442 9567 8551 9016 7626 3215 3229 1545 5598 3301 2386 2743 -6747
8070 -6747 -10960 -2908 2453 -1338 -1595 1891 6726 7059 3956 3753 2369 1971 -3326 -5052 -3515 -2871
8054b871m621n781q4L874Q56L190L932L74M76P598N8j807j764J567r34j643M566
8037F986j919m248L387L150K86l161K72K710K36J203M05L629R90k897l005q03
8021G221k279K180k165n549l8K996K882K209j836q40L798J70l162l412J781J860
8005E816J048M19k839o068K28N690J192N456P026K008K48m111k887j605k383n492
7989C746j331m02J162k459L8q61O63J962o32K33q47k377J84K885Q32l054l031
7972c289j600K153R51R83O420O744l067K223M992J0313L509l515o864j964l766
7957A4223m253N88j231p89K726K813R63K317K221l540r00K582m080l044j020k885
7941F691K107j564R19j247m671k09M813k785k96M884l40k760n97l189j946O698
$$ plain form
8054 -2871 -7492 -13273 -13357 -9483 -8627 -5437 -1505 -1131 -655 6943 7001 5194 3430 4997 4063 2420 6986
8037 6986 5067 819 4206 7356 7642 4481 4753 7463 7699 8902 9307 12936 13926 11029 8024 7221
8021 7221 4942 7122 4957 -592 -630 2366 5248 7457 5621 4781 8579 8749 5587 2175 3956 5816
8005 5816 6864 7283 4444 -1624 -1396 4294 5486 10942 17968 19976 20224 16113 13226 11621 9238 3746
7989 3746 2415 2013 3175 716 754 -107 556 2518 1886 2119 1272 -1105 -921 1964 2796 -258 -3289
7972 -3289 -4889 -2736 -1785 -802 5618 12362 9295 11518 16510 26823 30332 26817 19953 17989 14223
7957 14223 9970 10558 9327 8538 11264 14077 15040 17357 19578 16038 15138 17720 13640 10596 9576 6691
7941 6691 8798 7234 8153 6906 2235 2026 6839 4054 3758 8642 8302 5542 4945 1756 -190 6508
7925F508N940j206J852Q20k642l120j891L978r862l904k29m0K05j611L211R01
7909a090K162N812N681l581j240J33n73L369J746k647n146L92L934j812n693l877
7893b430N553M854j518K086K641l922j943L1p10n102m18K753k020k326k421K265
7877b627J640M580J623k20R99L954m128j368k900j145J905K392r67k607m921l223
7861g013L805O989n2j873n486k419j701J388k96l010P020M130j294n739p521l678
7845a6750L988J974K426M702j592J885K786L409n028j740N815J948j371K81J831
7830D564J024L141J404l967p355k922J638J001L793L733k111l429k749k79K580
7815F6o03j336L22l806K215j167l23Q729M979j202q596l519k497K777Q54R18L520
$$ plain form
7925 6508 12448 11242 13094 13914 11272 8152 6261 10239 377 -3527 -3756 -3796 -3591 -5202 -1991 -1090
7909 -1090 1072 6884 12565 8984 7744 7877 7304 10673 12419 9772 4626 5018 8952 7140 1447 -2430
7893 -2430 3123 7977 6459 8545 11186 7264 5321 5352 4642 -460 -878 1875 -145 -2471 -4892 -2627
7877 -2627 -987 3593 5216 4996 5995 9949 5821 4453 1553 408 2313 4705 3738 1131 -3790 -7013
7861 -7013 -3208 3781 3729 1856 -3630 -6049 -7750 -6362 -6658 -9668 -2648 1482 188 -5551 -13072 -16750
7845 -16750 -12762 -10788 -8362 -3660 -5252 -3367 -581 2828 -2200 -3940 1875 3823 2452 2733 4564
7830 4564 5588 8729 10133 6166 -1189 -4111 -2473 -1472 2321 6054 3943 514 -2235 -2514 66
7815 66 -537 -1873 -1551 -5357 -3142 -4309 -4632 4097 9076 7874 -722 -4241 -6738 -3961 -3107 -2189 1331
7798A331L738L506r53k153l569n537J146L655j224j612L04j903L509O20N79k353
7782i16m534k528J771N118L474J651n08k371m066k349j828j676K367K238m546
7767h703k726L789P472J428J349l759M144M836j36n60l585l208j378J232m344
7752d149K057K221J341M082j589k281j291n56j817K057Q33j258m407J319j85L62
7736c261M73L751o0k213l615j939J408M261j959K56O924L569j911l575L0j009
7720A130k686K959p27k906j356P04L495K630M67N49l471j462N97m793n848q96
7704a1614J086P07K043J078K662K932J699J754K370k944j845k475k326m396J319
7689g950K56M224K242j443k812q94J193K384J806Q71k734j011K110r46M483K472
$$ plain form
7798 1331 5069 8575 7622 5469 1900 -3637 -2491 1164 -60 -1672 -1368 -3271 238 858 1437 -916
7782 -916 -5450 -7978 -6207 -1089 2385 4036 3528 1157 -2909 -5258 -7086 -8762 -6395 -4157 -8703
7767 -8703 -11429 -7640 -168 1260 2609 -1150 2994 7830 7694 7134 3549 341 -1037 195 -4149
7752 -4149 -2092 129 1470 5552 3963 1682 391 -165 -1982 75 908 -350 -4757 -3438 -3623 -3261
7736 -3261 -2788 963 903 -1310 -4925 -6864 -5456 -1195 -3154 -2898 4026 7595 5684 2109 2139 1130
7720 1130 -1556 1403 676 -2230 -3586 -2882 613 3243 3710 4259 788 -674 -77 -4870 -10718 -11614
7704 -11614 -10528 -9821 -7778 -6700 -4038 -1106 593 2347 4717 1773 -72 -2547 -4873 -9269 -7950
7689 -7950 -7694 -3470 -1228 -2671 -5483 -6377 -5184 -2800 -994 -123 -2857 -3868 -1758 -2704 1779 4251
7673D251k763m000j748M318K508K353K98J705j792J598P44k106q011k967J16L895
7657a601J346j276K834j459m478L160K496O10j321K085K81k079l673k009L9j85
7641e230k480M500K850j920j290j526M23M729k677K242P52k595k112j489k092
7626g915j915J769J445k835k619L170N03j565L222M35m355L797L702J715q5j573
7610c104n33l000j649N90j187J023K628O30J697q37j611M402j500l401m840m777
7594a5469M713P358k078K62k171J399k244K762m917p01J672M804L432L019m88
7579A353j547P1N346k723m940l238l801J615p28P00J640P865L450m898M88l357
7563b704K523l99L469L704R21l897m543K280O38k189J309k468k333J187M119n777
$$ plain form
7673 4251 1488 -2512 -4260 58 2566 4919 5217 6922 5130 6728 7472 5366 -2645 -5612 -5496 -1601
7657 -1601 -255 -1531 1303 -156 -4634 -1474 1022 1632 311 2396 2677 598 -3075 -5084 -5045 -5230
7641 -5230 -7710 -3210 -360 -2280 -3570 -5096 -4673 56 -2621 -379 373 -2222 -4334 -5823 -7915
7626 -7915 -9830 -8061 -6616 -9451 -12070 -8900 -8397 -9962 -6740 -6305 -10660 -6863 -3161 -1446 -1531 -3104
7610 -3104 -3637 -6637 -8286 -7696 -8883 -7860 -5232 -4602 -2905 -3742 -5353 -951 -2451 -5852 -10692 -15469
7594 -15469 -10756 -3398 -5476 -5214 -7385 -5986 -8230 -5468 -10385 -11086 -9414 -4610 -1178 1841 1353
7579 1353 -194 -123 5223 2500 -2440 -5678 -9479 -7864 -8592 -7892 -6252 1613 5063 165 653 -2704
7563 -2704 -181 -580 2889 6593 7514 3617 -926 1354 1992 -197 1112 -1356 -3689 -2502 1617 -4160
7547d160k979L973L302R43N932J894K37l142r953l010L986j082q94P91K517J229
7531d16M165P6n237j514Q23K85L137m29J881M535m217l572L212L35o394k363K650
7514c043k123K874Q360M500m245n225j070L921j820j824k01l726J675k470J554
7499b863P122J766m457k088r32R44m54o8k557O166J458n186j700K445j491k152
7483d047l845M67O490p25Q55K610n576j077O645J600j951o689j769M097K141m532
7467e306r1L402n069l685P863O754n538j679l442K52M235j52R35L301j833m840
7451d893j210J183L305O57J0r12J985j66k23L808M266K734j464k236m191k87k116
7434B50l753m855N11L480j792l407J21N382K821l104k561j435O10M200p4K235
$$ plain form
7547 -4160 -7139 -3166 136 1079 7011 8905 9142 6000 -3953 -6963 -2977 -4059 -4953 -4162 -1645 -416
7531 -416 3749 3825 -1412 -2926 -2103 -1818 1319 890 2771 7306 3089 -483 2729 3064 -3330 -5693 -3043
7514 -3043 -5166 -2292 6068 10568 6323 1098 28 3949 2129 305 104 -3622 -1947 -4417 -2863
7499 -2863 4259 6025 1568 -520 -1452 -508 -962 -1030 -3587 2579 4037 -1149 -2849 -404 -1895 -4047
7483 -4047 -7892 -7425 -935 -1660 -805 1805 -3771 -4848 1797 3397 1446 -5243 -7012 -2915 -774 -5306
7467 -5306 -5397 -1995 -7064 -10749 -2886 3868 -1670 -3349 -6791 -6539 -2304 -2456 -1521 1780 -53 -4893
7451 -4893 -6103 -4920 -1615 -958 -948 -1860 125 -41 -264 3544 7810 10544 9080 6844 2653 2366 250
7434 250 -3503 -8358 -7847 -4367 -6159 -9566 -9445 -4063 -1242 -4346 -6907 -8342 -7732 -3532 -3606 -1371
7418a371n62J358j103L037M65L67k032k607J938J897n692k980J1L379k040N278
7402f57M175k181p16j824K907J000N62m427J676k597k4k473l897M08j194L756
7386e506j573J671K095L074k57n9J817L63k832q375o72J122L686J947k88lk270
7369f060J448k711q351N092L686K413K871j065o86J192M438j041p503m696J791
7354i182K219O003N820k374k171j82o868k56K476n195l849M012M779J196j258
7339d830k681N184J457k300L956j859n685K665K614J224M71j250n715l839r6K75
7323a0409J027M223N885m086j040j313m493J918Q77l719K675N496N356j119n980
7308d702M34L529j851k615j304J444J300m119n113M127L847l83J134l080j726
$$ plain form
7418 -1371 -1933 -575 -1678 1359 1824 2191 159 -2448 -510 1387 -4305 -7285 -7274 -3895 -5935 -657
7402 -657 3518 1337 621 -1203 1704 2704 3266 -1161 515 -2082 -2106 -4579 -8476 -8068 -9262 -5506
7386 -5506 -7079 -5408 -3313 -239 -496 -555 1262 1625 -1207 -9582 -10254 -9132 -5446 -3499 -3787 -3790 -6060
7369 -6060 -4612 -7323 -15674 -10582 -6896 -4483 -1612 -2677 -3363 -2171 2267 1226 -6277 -10973 -9182
7354 -9182 -6963 -960 4860 2486 315 133 -6735 -6991 -4515 -9710 -13559 -9547 -4768 -3572 -4830
7339 -4830 -7511 -2327 -870 -3170 786 -1073 -6758 -4093 -1479 -255 216 -1034 -6749 -10588 -10684 -10409
7323 -10409 -9382 -5159 726 -3360 -4400 -5713 -10206 -8288 -7411 -11130 -8455 -2959 2397 1278 -4702
7308 -4702 -4268 -739 -2590 -5205 -6509 -5065 -3765 -7884 -12997 -8870 -5023 -5406 -4272 -7352 -9078
7293i078k86K010N451K283L59J151p43m872J687L647K62P08o45N68j11l278J429
7276E42n110r574L066O988K402k861L266p13k319m672o64O385M454L7k350l66
7260a489R0l230P74N184N592j027j039J992l164n78M031k350k475J579j369m33
7244B088K28J372K84n418K834R41l100k731L342N784J449k406p369n194P92O86
7228f418L581J301J327Q53k27k329J83N669M003m762r83k741l673N86L802k826
7212b654k710M517O350M71m281n97M2k860M143K904m735j312L701r32j540m075
7196c568q92l99l876O533M448j160J91j962k401p74l229j559j38k550K79J132
7180i925K821m232q2J116Q45M047J010J357k69J928l00m322N444P356n105p96
$$ plain form
7293 -9078 -9364 -7354 -1903 380 739 1890 1147 -3725 -2038 1609 1871 2579 1934 2502 2391 -887 542
7276 542 -4568 -14142 -11076 -4088 -1686 -4547 -1281 -1994 -4313 -8985 -9649 -3264 1190 1227 -1123 -1489
7260 -1489 -1399 -4629 -3855 1329 6921 5894 4855 6847 3683 3105 7136 4786 2311 3890 2521 2088
7244 2088 2316 3688 3972 -1446 1388 2329 -771 -3502 -160 5624 7073 4667 -2702 -7896 -7104 -6418
7228 -6418 -2837 -1536 -209 644 417 -1912 -1729 3940 7943 3181 2198 -543 -4216 -3630 172 -2654
7212 -2654 -5364 -847 5503 5974 1693 1096 1138 -1722 2421 5325 590 -722 2979 2047 507 -3568
7196 -3568 -4460 -4859 -8735 -2202 2246 1086 1277 -685 -3086 -3860 -7089 -8648 -8786 -11336 -11057 -9925
7180 -9925 -7104 -11336 -11418 -10302 -9457 -5410 -4400 -3043 -3312 -1384 -1684 -6006 -562 6794 1689 893
7164H93l601m355J671P462K223Q99n301j076M570j031m341k463rK311L373l303
7148b078O0o33j26L290K504l670k077l394n617K198L879Q817M926m915M421K174
7132I759q545n989o012M062N885k17o33o373k422K750O413j254k603K498M370
7117A689m611q65J396K694K708j355k512J741N35l578N92L596M795j672m925j533
7101a305J056n06K668k002l379J423K982k91o455n078o36L810M448J011k529N74
7085d209P82j287L3o15L170M668k874m553J476J915J030K437K05j805l149j222
7069c998k658K037j267j916J000q20k99K772k366M147J454o389o118p235o523
7054b8179l401P084J5095Q466N893J4547J5547J4222N680L88l088l567q711j1596
$$ plain form
7164 893 -2708 -7063 -5392 2070 4293 5192 -109 -1185 3385 2354 -1987 -4450 -4459 -2148 1225 -2078
7148 -2078 -2018 -2651 -2777 513 3017 -653 -2730 -6124 -11741 -9543 -5664 3153 8079 3164 7585 9759
7132 9759 1214 -4775 -10787 -6725 -840 -1057 -1690 -8063 -10485 -7735 -1322 -2576 -5179 -2681 1689
7117 1689 -2922 -3787 -2391 303 3011 1656 -856 885 1420 -2158 -1566 2030 6825 5153 228 -1305
7101 -1305 -249 -755 1913 -89 -3468 -2045 937 646 -5809 -10887 -11523 -7713 -3265 -2254 -4783 -4209
7085 -4209 -3427 -4714 -4681 -5296 -2126 2542 -332 -4885 -3409 -1494 -464 1973 2178 373 -2776 -3998
7069 -3998 -6656 -4619 -5886 -7802 -6802 -7622 -7921 -5149 -7515 -3368 -1914 -8303 -14421 -21656 -28179
7054 -28179 -31580 -24496 -9401 -935 4958 19505 35052 49274 54954 55342 52254 48687 39976 28380
7040B8380j6495j0804j0117q975m421k898o02Q834J0888K073K767K268K97K464
7026C659m120k908N057l756p527j648M554n24R09J824j132j810m550m442K715
7011a3699L325K347O271K176r04Q35K024k537K185k549k100R10J412m691m037
6996i032n745Q95L876L039J063n501J345R932N822l871l41j323j567n898O15Q91
6980e800M468K863Q48n048n69O00Q77J039m858L08K548O55M098q51j61L064R20
6963E001m884K52L12j213J098J852r40j754Q41M79j634q23q2l119k143q50N01
6946g106L682O16K223K042J052J791R39K48J489p444n773P347O858R73k705k029
6930D203j235j140j84O69r67l690j02L746q33l669j851K03J549k58M143L922o90
$$ plain form
7040 28380 11885 1081 -9036 -18011 -22432 -25330 -25932 -17098 -6210 -4137 -1370 898 1195 3659
7026 3659 -461 -3369 1688 -2068 -9595 -11243 -6689 -7213 -6304 -4480 -5612 -7422 -11972 -16414 -13699
7011 -13699 -10374 -8027 -1756 420 -484 351 2375 -162 2023 -526 -2626 -1716 -304 -4995 -9032
6996 -9032 -14777 -13882 -10006 -6967 -5904 -11405 -10060 -128 5694 1823 1482 159 -1408 -7306 -6691 -5800
6980 -5800 -1332 1531 2379 -2669 -3238 -2638 -1761 -722 -5580 -5272 -2724 -2069 2029 1178 1017 4081 5001
6963 5001 117 369 681 -532 566 2418 1478 -276 565 1044 -590 -1413 -1495 -4614 -6757 -7607 -7106
6946 -7106 -3424 -2808 -585 1457 2509 4300 5239 5487 6976 -468 -6241 1106 7964 8937 6232 4203
6930 4203 2968 1828 1644 2313 1346 -2344 -2446 1300 467 -3202 -5053 -4850 -3301 -3559 584 4506 3816
6913C816J240L755o221j114K012p334l211j132j567M97O37O210O0J383K947l643
6897a665k093p098J911M493K624J648k932j12M547Q647J540l327l845j065L341
6882F614k407n367n338p22K701j82r41J284K111j38n70M401O148o68k098k652
6866B176j178j217J683k598j159j450M874J157K319K504O65P90o413k537M634
6851D250M187P09m61J504j911l42o98l54k464j029K68k258K192n420r05j185L400
6834e17L980O04j744J21m160m107J428N345N54J659l90R45L225k333k03l906n399
6817d898j619J198J389J36j601K4M304K442L97l022j447k520n97K890q01P12N510
6800B497M27q735q041k509L678M219K497K465P49K133m379J850M730K603m083
$$ plain form
6913 3816 5056 8811 2590 1476 3488 -3846 -7057 -8189 -9756 -9259 -8622 -2412 -2352 -969 1978 -1665
6897 -1665 -3758 -10856 -8945 -4452 -1828 -180 -3112 -3224 1323 9970 11510 8183 4338 3273 6614
6882 6614 4207 -1160 -6498 -7220 -4519 -4701 -5642 -4358 -2247 -2385 -2955 1446 7594 6926 4828 2176
6866 2176 998 -219 1464 -1134 -2293 -3743 1131 2288 4607 7111 7776 8566 2153 -384 4250
6851 4250 8437 9146 8685 10189 8278 7936 7238 6884 4420 3391 3659 1401 3593 -1827 -2732 -3917 -517
6834 -517 3463 4067 2323 2444 -1716 -5823 -4395 950 1504 3163 2773 3718 6943 4610 4407 501 -4898
6817 -4898 -6517 -5319 -3930 -3794 -5395 -5371 -1067 1375 1772 -1250 -2697 -5217 -5814 -2924 -3725 -3013 2497
6800 2497 2924 -5811 -13852 -16361 -12683 -8464 -5967 -3502 -2753 -620 -4999 -3149 1581 4184 101
6785A01J64n64P55K033J971k958m249l898k166J795J97L583K313j087k016J778
6769b248M985K767k981r54L534k808k497J817j804m632L21M031K046k10n101O241
6753B507O182r27k154l832l367k79k468l433J529J054J123K603J935k126M29j661
6737b885q75N07P109L040O6o03k266l015j579L05M01j904J586L932J9n497k112
6720c771J470l478k148L915Q46m02k17L958M841j804p62o58l540j236J635J096
6704b55J411k52j771L742r34n231m861n82L32j910L175m93R62K176q24l220J158
6687g377N975L42k515j499J473M696q18K369N914l656m463j827m374p96q95j760
6671i211O429J236n45l982l327k942j00K536m476J950P96L54m32l630M132N427
$$ plain form
6785 101 265 -299 456 2489 4460 1502 -2747 -6645 -8811 -7016 -6819 -3236 -923 -2010 -4026 -2248
6769 -2248 2737 5504 2523 1569 5103 2295 -202 1615 -189 -4821 -4500 -469 1577 1367 -3734 2507
6753 2507 8689 7762 5608 1776 -1591 -1870 -4338 -7771 -6242 -5188 -4065 -1462 473 -1653 -1224 -2885
6737 -2885 -3760 -3253 3856 6896 6962 6359 4093 1078 -501 -196 205 -1699 -113 3819 3838 -1659 -3771
6720 -3771 -2301 -5779 -7927 -4012 -3166 -3568 -3785 173 5014 3210 2448 1790 -1750 -2986 -1351 -255
6704 -255 1156 904 -867 2875 1941 -3290 -8151 -8733 -8401 -10311 -7136 -7629 -6667 -4491 -5315 -8535 -7377
6687 -7377 -1402 -1060 -3575 -5074 -3601 1095 277 2646 8560 4904 441 -1386 -5760 -6556 -7451 -9211
6671 -9211 -2782 -1546 -2091 -6073 -9400 -12342 -12442 -9906 -14382 -12432 -11636 -11282 -11714 -15344 -11212 -5785
6655e785K505l146l130J561K998Q5p70N63O17j122K034L050K861k286M987p232
6639b210k406K743J757Q93p358l02J114j780J022L847k67o507m44J850L453J124
6623c471J214k877r35K486l342k719L237J822M479k161p537j354M447k862k352
6608a1925R90O192N390q54q37Q69K173l475n56l61K857J159m299k348L010l50
6592b365l69n600N127O331l950k19L77L786j29n834l54M88K686Oj042k697n289
6575i047o79O29N064M870k155l463q41M522L511j766J642J034j791n121l281j820
6559h692j127K374K991k876p57K932M722Q898P87o943j758L985j514m891q07K018
6543f58J846j937P06N2n24m0J184M58o442J518Q36M77N338K005K832J354j982
$$ plain form
6655 -5785 -3280 -6426 -9556 -7995 -4997 -4912 -5682 -5119 -4502 -5624 -3590 -540 2321 35 5022 -2210
6639 -2210 -4616 -1873 -116 777 -6581 -6883 -5769 -7549 -6527 -2680 -2947 -9454 -9898 -8048 -4595 -3471
6623 -3471 -2257 -5134 -6069 -3583 -6925 -9644 -6407 -4585 -106 -2267 -9804 -11158 -6711 -9573 -11925
6608 -11925 -10935 -4743 647 -207 -1044 -175 1998 -1477 -2033 -2394 463 1622 -2677 -5025 -2015 -2365
6592 -2365 -2734 -8334 -3207 3124 -826 -1045 -668 3118 2989 -2845 -3199 -2711 -25 -19 -1061 -3758 -9047
6575 -9047 -9726 -9097 -4033 837 -1318 -4781 -5622 -1100 2411 645 2287 3321 1530 -3591 -6872 -8692
6559 -8692 -9819 -7445 -4454 -7330 -8087 -5155 -433 8465 9252 2309 551 4536 3022 -1869 -2676 -658
6543 -658 1188 -749 -43 9 -515 -555 629 1087 -5355 -3837 -3001 -2524 2814 4819 7651 9005 7023
6526G023P37j17j783n105j6J598k552k896m508o49o94j869K380Q30L475P336J457
6509D647p493k551l81L40O325L131K46j553O96m492N50Q40q59k776L87j852j460
6492f255L526q46m67r23Q33J039K044L751m132j229m27O2k010m30M37L003P13
6475a311l043l657m466L360M051m6L170k165m442J831J539j334l598k112R93M64
6459a0766J017N009R10J081j401k575p14q24L583L1j39J346L780J830J412m985
6443a405l746j394J537k842j705O444K441j664N460j848l195l078n511Q95p64
6428a0375J161K179J103r03M616K014k185o50K49j799p90j584K283K509N07J968
6412C03J699j744L027l554m324P278L240l94k29k921n75j483p158J390K69K293
$$ plain form
6526 7023 7760 7643 5860 755 739 2337 -215 -3111 -7619 -8268 -8962 -10831 -8451 -7621 -4146 3190 4647
6509 4647 -2846 -5397 -5778 -5438 887 4018 4264 2711 3407 -1085 -535 305 -554 -3330 -2943 -4795 -6255
6492 -6255 -2729 -3575 -4042 -4965 -4132 -3093 -1049 2702 -1430 -2659 -3086 -3024 -5034 -5464 -5027 -2024 -1311
6475 -1311 -4354 -8011 -12477 -9117 -5066 -5112 -1942 -4107 -8549 -6718 -5179 -6513 -10111 -12223 -11230 -10766
6459 -10766 -9749 -4740 -3830 -2749 -4150 -6725 -7439 -8263 -4680 -4649 -4788 -3442 338 2168 3580 -1405
6443 -1405 -5151 -6545 -5008 -7850 -9555 -3111 -670 -2334 3126 1278 -1917 -4995 -10506 -9611 -10375
6428 -10375 -9214 -7035 -5932 -6835 -2219 -205 -2390 -3040 -2791 -4590 -5380 -6964 -4681 -2172 -1665 303
6412 303 2002 258 3285 -269 -4593 2685 5925 5531 5302 2381 1806 323 -6835 -5445 -5176 -2883
6396b883K392m107J774K304J748n36m809l693o26M229O159M867M144J187l461
6381H689l864n085o030K277P770l67o259l583L910K929O02R83L46l988J399J977
6365A706l767m717k06J834j608J786PL448J708R49J122m746m878o803K350J0388
6349a427J923M969K634m11p07m532o965n646L269J544m83j756L998M161Q48J455
6333B874K65l222k79j994m030o61N493K049j001J082J048l421k170n0l311m362
6317a1690N0M383N239p47K607L459j514j23p07l061k023k632k717M330O32k809
6301g323L022M007R9j849l613M530K697N7J394P44m081k840K011M281k3n677m283
6284f847L539J229k621J811J493k93J870k316J105O53L988L51q48K115n773J295
$$ plain form
6396 -2883 -491 -4598 -2824 -520 1228 692 -4117 -7810 -8436 -4207 1952 6819 10963 12150 8689
6381 8689 4825 -260 -6290 -4013 3757 3390 -2869 -6452 -2542 387 989 1972 2318 -1670 -271 1706
6365 1706 -2061 -6778 -6984 -5150 -6758 -4972 -4965 -1517 191 1140 2262 -2484 -7362 -14165 -11815 -1427
6349 -1427 496 5465 8099 7688 6981 2449 -4516 -10162 -6893 -5349 -5832 -7588 -3590 571 1419 2874
6333 2874 3139 -83 -362 -2356 -6386 -7047 -1554 495 -506 576 1624 -1797 -3967 -4017 -7328 -11690
6317 -11690 -11640 -7257 -2018 -2765 -158 3301 1787 1664 957 -2104 -4127 -6759 -9476 -5146 -4514 -7323
6301 -7323 -4301 -294 -195 -2044 -5657 -1127 1570 1627 3021 3765 -316 -3156 -1145 3136 3113 -2564 -6847
6284 -6847 -3308 -2079 -4700 -2889 -1396 -1689 181 -2135 -1030 -377 3611 3962 3114 5229 -544 751
6268G51j850k230j935l608n97L421L204M92r37L782k619J70K94j676l487n21Q39
6251f507Q13MK879L521J294j216k146l748m155J829K105Q22l204M94k483L65J486
6234g847J691J731k121k41K620M341m20k567n187J049j25M091N546j358n042K904
6218i35K757K398R21m959M644M538l341o326K533L231l292l968j875O663L196
6203F185k17n362m510J49l344N057J149j814N036j543L163J861l465n015j182
6188c852J36n048k31K847K580p89L199M28j580k962m253L840j387J367k91j33
6172f129N380M632N05n555Q62k41N38m141K532J756l514k932K769j38K446q24
6156b054l023j823L993L253J433j89k533m6J789L86k44O84j409o834k583J257
$$ plain form
6268 751 -1099 -3329 -5264 -8872 -9469 -6048 -2844 -2352 -3289 493 -2126 -1956 -1662 -3338 -6825 -7346 -6507
6251 -6507 -5694 -5690 -2811 710 2004 788 -1358 -5106 -9261 -7432 -5327 -4505 -7709 -7215 -9698 -9333 -7847
6234 -7847 -6156 -4425 -6546 -6787 -4167 174 -246 -2813 -8000 -6951 -7076 -2985 2561 1203 -3839 -935
6218 -935 1822 4220 5141 182 4826 9364 6023 -303 2230 5461 2169 -1799 -3674 2989 6185
6203 6185 5968 606 -3904 -3755 -7099 -2042 -893 -2707 2329 786 3949 5810 2345 -2670 -3852
6188 -3852 -3716 -8764 -8995 -6148 -3568 -4357 -1158 -730 -2310 -5272 -9525 -5685 -7072 -5705 -5996 -6129
6172 -6129 -749 3883 4388 -1167 -305 -546 -8 -4149 -1617 139 -3375 -6307 -3538 -3676 -1230 -2054
6156 -2054 -5077 -6900 -2907 346 1779 1590 -943 -989 800 1186 942 1626 217 -6617 -9200 -7943
6140g943M569K279K12k422p87L382l341K521Q80j958j140j070J958J984N855M768
6124I747L85k477j0240M73L995j083nK276k742k346O83k985n98J492K430k300
6108c295J703K819l161L282o12j157l13j583J530J770k041J989M622K793m809
6093C537l949J692P73l539n029j12m665n137o17K047M819J027N629L221K45K021
6077A963J518K888k218j715k337j869n694j199J592M194j992J663K041J018N40
6062C93K040m623j968M111j53k093j330l80k59N248K834K58L50j367k963r9j293
6045a294j554K082M46M78P01r54k500Q06O0j119R74k890l302l196L667J2674J1678
6028A6757M531k159p645o451k430k753J756l378J328N694L91l43L483j526o235
$$ plain form
6140 -7943 -3374 -1095 -883 -3305 -4092 -710 -4051 -1530 -650 -2608 -3748 -4818 -2860 -876 4979 9747
6124 9747 10132 7655 -2585 -2112 1883 800 795 3071 329 -2017 -1334 -4319 -4917 -3425 -995 -3295
6108 -3295 -1592 1227 -1934 1348 736 -421 -734 -2317 -787 983 -1058 931 5553 8346 3537
6093 3537 -412 1280 2053 -1486 -6515 -6627 -11292 -16429 -17046 -14999 -10180 -9153 -3524 -303 -58 1963
6077 1963 3481 6369 4151 2436 99 -1770 -7464 -8663 -7071 -2877 -4869 -3206 -1165 -147 393
6062 393 2433 -2190 -4158 -47 -200 -2293 -3623 -4003 -4262 986 3820 4078 4428 3061 98 -1 -1294
6045 -1294 -2848 -766 -320 158 859 -95 -2595 -1789 -1729 -2848 -1874 -4764 -8066 -11262 -7595 5079 16757
6028 16757 21288 19129 11484 5033 2603 -150 1606 -1772 -444 5250 5641 5298 8781 7255 1020
6013A020l671o223m140L564K534J824K12L834j39k940Q01J984N169J709l420l927
5997a809J838L240N77j378j438l265n71j944L11o664l928K397O110O424L479j990
5981A389l035N117O448k382p622m097K144P540l601k28j591k553M995k091j307
5966h74k461o57j860m129L838M030j55p09n761P57J759l221M588L88K306J385
5950g76m243L669O00j098R93j425j391J502j097l632l359K66K351K273n26l7j087
5933g017k64n792L086N957K997j73k773p39L792j461r75N134j521j016l514r24
5917e203k481J689K8K13Q37Q1j406M959M096L058l543m956K406N05j223M328N0
5900C438r30m013j117M642j283J026K044j086j582l259k078O36K33J406n04k66
$$ plain form
6013 1020 -2651 -8874 -13014 -9450 -6916 -5092 -4880 -1046 -1185 -4125 -3324 -1340 3829 5538 2118 -1809
5997 -1809 29 3269 3846 2468 1030 -2235 -2806 -4750 -4439 -11103 -15031 -12634 -6524 -100 3379 1389
5981 1389 -1646 3471 9919 7537 -85 -4182 -2038 5502 1901 1673 82 -2471 2524 433 -874
5966 -874 -3335 -3992 -5852 -9981 -6143 -2113 -2268 -2977 -8738 -7981 -6222 -9443 -4855 -4467 -2161 -776
5950 -776 -5019 -1350 -750 -1848 -855 -2280 -3671 -2169 -3266 -6898 -10257 -9991 -7640 -5367 -5893 -5930 -7017
5933 -7017 -7281 -13073 -9987 -4030 -1033 -1206 -3979 -4718 -926 -2387 -3362 1772 251 -765 -4279 -5203
5917 -5203 -7684 -5995 -5967 -5754 -4917 -4836 -6242 -1283 2813 5871 2328 -2628 -222 283 -940 3388 3438
5900 3438 2508 -1505 -2622 2020 737 1763 3807 2721 1139 -2120 -4198 -3562 -3329 -1923 -2427 -2693
5884b693L385L542L667j595o652L313J686J823k300l148K93J057J179j273K611
5869D895M488j50o944n111k757j976K203L61K08o473p83M57M50O411k91q69l285
5852i166J887J866N249j820r04J254J005k403n396k958O911K924Q105n853r11
5837b10J504L87R28m278j090n15l701q85q5p40K360M982n363p90M004P56j977
5820d713K261j671J24j274j781M18k050J664J252J245M472K37J239k277K031k997
5804a820k117j394k265M779P742o320l914L796K477J35J045l613j962o01j838
5789e870j007k481K173K65k871L044M651L609K235l95l010m093M82k1K421L325
5773B457L022j466j008J869j6O8o376M68q71l017k968P45L576Lk292J289J886
$$ plain form
5884 -2693 692 4234 7901 6306 -346 2967 4653 6476 4176 1028 1321 2378 3557 2284 4895
5869 4895 9383 9233 2289 -2822 -5579 -7555 -5352 -4991 -4783 -11256 -12039 -11582 -11132 -4721 -5012 -5881 -9166
5852 -9166 -7279 -5413 -164 -1984 -2888 -1634 -629 -3032 -8428 -11386 -4475 -1551 6554 701 -210
5837 -210 1294 1681 2609 -1669 -2759 -3274 -6975 -7860 -7945 -8685 -6325 -1343 -6706 -7496 -3492 -2736 -4713
5820 -4713 -2452 -4123 -3999 -5273 -7054 -6636 -8686 -7022 -5770 -4525 -53 184 1423 -854 1177 -1820
5804 -1820 -3937 -5331 -7596 -2817 4925 -1395 -5309 -1513 964 1099 2144 -1469 -3431 -4032 -5870
5789 -5870 -6877 -9358 -7185 -6920 -9791 -6747 -2096 1513 3748 3353 343 -3750 -3268 -3289 -868 2457
5773 2457 5479 4013 3005 4874 4858 4926 -1450 -982 -1853 -4870 -7838 -7093 -3517 -3514 -5806 -4517 -2631
5756b631k818O35J023l313o16J623J384J760j385l757n598N309N879l559O663
5741E99K709n73r78j698n194J347K7p46K51o36L458L232m22r18J118K283M3n626
5723a724l352P271J601j595j935k143l562j090k592K40L853J454k285j59M489
5708a529N144j038n105j915M498M244k354m286L102k183l148L282j281j797K257
5693b109m18L40m030l323L504j57k67O194K901k600k858M20l889k335L420M600
5677f07j62q35J511N494l841j404J831l00P50J908k624n862q902L176M888q81
5661e860l285R90M530J097J418R91n96L663j600n071j385K068L103j896j267P71
5645b329j286L452j289J735J534L960l831l450j572M40M361o102R63L753O36M70
$$ plain form
5756 -2631 -5449 -4814 -3791 -7104 -7720 -6097 -4713 -2953 -4338 -8095 -13693 -8384 -2505 -6064 599
5741 599 3308 2735 1757 59 -5135 -3788 -3761 -4507 -4256 -4892 -1434 1798 1376 458 1576 3859 3902 -1724
5723 -1724 -5076 2195 3796 2201 266 -1877 -5439 -6529 -9121 -8881 -5028 -3574 -5859 -6018 -1529
5708 -1529 3615 2577 -2528 -4443 55 4299 1945 -2341 761 -1422 -4570 -1288 -2569 -4366 -2109
5693 -2109 -2527 -2187 -6217 -9540 -6036 -6193 -6460 -266 2635 35 -2823 -2403 -6292 -8627 -5207 -607
5677 -607 -769 -1604 -93 5401 1560 156 1987 1687 2437 4345 1721 -4141 -13043 -9867 -4979 -5860
5661 -5860 -9145 -8155 -3625 -2528 -1110 -119 -715 2948 1348 -3723 -5108 -3040 63 -1833 -3100 -2329
5645 -2329 -3615 -163 -1452 283 1817 5777 1946 -1504 -3076 -2636 1725 -4377 -3414 339 975 1445
5629A445O45j739J462P85k459k681l94K040L48j080L704J22K757l056k383J26
5613c58J179K974k47P97k559j197K664J355k99m986o748l685M734R591L682k932
5597C965l491j724K362q2m658K973J788j14r98l259L173M05O385o62r36k366o651
5580c890k563K284L496J392K178P58J956k663k519p62l338K362k085k120j087
5565f601K780j432l498J571L908l50o002l624j68L996j96P62L549L078K456L394
5549C623R06j319n001p2J491o232l497M124p50M893k158l875N843J136n856l465
5533a0209l060k28N762L576P081K154k273j910k268m493l712p22Q95M756m01n36
5517e588r60L280O414J124k629l922k271j465m911K039L471J520M922M86n985
$$ plain form
5629 1445 2090 351 1813 2598 139 -2542 -2936 -896 -548 -1628 2076 2198 4955 1899 -484 -358
5613 -358 821 3795 3548 4345 1786 589 3253 4608 4309 -677 -7425 -11110 -6376 3215 6897 3965
5597 3965 474 -1250 1112 1030 -3628 -655 1133 1019 21 -3238 -65 340 6725 6063 5127 2761 -3890
5580 -3890 -6453 -4169 -673 719 2897 3655 5611 2948 429 -333 -3671 -1309 -3394 -5514 -6601
5565 -6601 -3821 -5253 -8751 -7180 -3272 -3622 -9624 -13248 -13416 -9420 -9616 -8854 -5305 -2227 229 3623
5549 3623 4529 3210 -1791 -1863 -372 -6604 -10101 -5977 -6727 -1834 -3992 -7867 -2024 -888 -6744 -10209
5533 -10209 -13269 -13497 -7735 -4159 2922 5076 2803 893 -1375 -5868 -9580 -10302 -9407 -4651 -5052 -5588
5517 -5588 -6548 -3268 3146 4270 1641 -2281 -4552 -6017 -10928 -8889 -5418 -3898 1024 1510 -4475
5502d475K521L412j090l82k814l048o8J312m15k315l147J687L829L251j751K191
5486a302L644J945j884k341k542o41j737l600J955J363j24J00Q26P67j0K863m848
5469e566j18L048l557O54M554L329K243j420j190k021j703J608n016m807L375
5454f587K450KM868l477k594o67m15K786k859K309L678O59m123l276J1J24k174
5437i285J345M682J577j205L815J7j278m700j045JL516L271k587q03P26L370J985
5420C402N43n003j499j139K5L279J94N2J530O309P83l43l681k338l841k397p30
5403d854P046J363l336K690n40j398j173k759L022m69k605J517K260N90R8J987
5387C439L23j542l861m547k458j097Q48J739K331O867J751n745n629N892K778
$$ plain form
5502 -4475 -1954 1458 368 -14 -2828 -5876 -5944 -4632 -5047 -7362 -10509 -8822 -4993 -1742 -3493 -1302
5486 -1302 2342 4287 2403 62 -2480 -3121 -4858 -8458 -6503 -5140 -5264 -5164 -4338 -3571 -3581 -718 -5566
5469 -5566 -5684 -2636 -6193 -5539 -985 2344 4587 3167 1977 -44 -1747 -139 -5155 -9962 -6587
5454 -6587 -4137 -4135 733 -2744 -5338 -6005 -6420 -3634 -6493 -4184 -506 153 -3970 -7246 -7235 -7111 -9285
5437 -9285 -7940 -3258 -1681 -2886 929 946 -332 -5032 -6077 -6076 -2560 711 -1876 -2679 -1953 1417 3402
5420 3402 3945 -1058 -2557 -3696 -3671 -392 -198 -146 1384 7693 8476 8133 4452 2114 -1727 -4124 -4854
5403 -4854 2192 3555 219 2909 2369 971 -202 -2961 61 -408 -3013 -1496 764 1354 1452 3439
5387 3439 3762 2220 -1641 -6188 -8646 -9743 -8895 -7156 -4825 2042 3793 -1952 -7581 -1689 1089
5372A089K438l450L529J779m790m87K19k781K237L073k081m049m320J209J683
5357d702K901K311J312l168j891R48r86K107l369k836L418N253Q88l789m223Q94
5341d932J111J966K013l079p80N484l950k217j975j082O554L514K559L216m979
5326C423p612k494j69O252L482J578j152l655l125J051K047P4J08n047m724j123
5310a1086K516O447P16P230J793m09l944m90n941o464J528K501N994r92j193K533
5294G39l390k52j413L627O949Q28m492m140J143P05o096n828L433P400N537J469
5278F219J461m693o219k389L527R349N995m459m680m981M715N6J125K276m140
5263C162l609j16M567l156k527O433k155P31L171o864o015k449K845L610K046
$$ plain form
5372 1089 3527 77 3606 5385 595 108 327 -2454 -217 2856 775 -3274 -7594 -6385 -4702
5357 -4702 -1801 510 1822 -1346 -3237 -2289 -3275 -1168 -4537 -7373 -3955 1298 2186 -1603 -5826 -4932
5341 -4932 -3821 -1855 158 -2921 -3701 1783 -2167 -4384 -6359 -7441 -887 2627 5186 8402 3423
5326 3423 -4189 -6683 -6852 -600 2882 4460 3308 -347 -3472 -2421 -374 -300 -192 -5239 -9963 -11086
5310 -11086 -8570 -2123 -1407 5823 7616 7207 3263 2773 -3168 -9632 -8104 -5603 391 -601 -1794 739
5294 739 -2651 -2903 -4316 -689 6260 7088 2596 -1544 -401 304 -5792 -11620 -8187 -787 4750 6219
5278 6219 7680 2987 -3232 -5621 -2094 7255 13250 8791 4111 -870 3845 3901 5026 7302 3162
5263 3162 -447 -563 4004 848 -1679 4754 2599 3330 6501 -363 -6378 -8827 -5982 -2372 -326
5248c26k046N210M081k160m123O45N56j250L805k585l122M243J697k572J863K243
5232F159l637o798J312M134l816q58N79L643K479J593l030O168m582p465J890
5217b229K008j809K589j671r25K259r01k758M101P252L55j888R45J063m043j541
5201B807k113k57k76M741j774o378N38N852K603J262k711p450k452M584J739L568
5185D283L320k400m141m898l299k314O988M117J811k765j14m29o512N47J489M864
5169E47O67k953L62K831J034N24j399n186J608J8p486j230J163K537M121J697
5153a145k19L554m37J988m290l478L973j193J97K456J55j07n409m094K937k577
5137g689J469Q786J962l698j344n634K148k281l06J204l689J232O46O648J593
$$ plain form
5248 -326 -2372 2838 6919 4759 636 1281 1837 587 4392 1807 -1315 2928 4625 2053 3916 6159
5232 6159 2522 -4276 -2964 1170 -2646 -3504 -2925 718 3197 4790 1760 7928 3346 -4119 -2229
5217 -2229 -221 -2030 559 -1112 -2037 222 -679 -3437 664 7916 8271 6383 7328 8391 4348 2807
5201 2807 694 437 161 4902 3128 -3250 -2712 3140 5743 7005 4294 -3156 -5608 -1024 715 4283
5185 4283 7603 5203 1062 -3836 -7135 -9449 -2461 1656 3467 702 588 159 -6353 -5806 -4317 547
5169 547 1214 -1739 -1377 1454 2488 3012 1613 -3573 -1965 -1947 -9433 -10663 -9500 -6963 -2842 -1145
5153 -1145 -1364 2190 1753 3741 -549 -4027 -54 -1247 -1050 1406 1561 1454 -3955 -8049 -5112 -7689
5137 -7689 -6220 2566 4528 830 -514 -6148 -4000 -6281 -6587 -5383 -9072 -7840 -7194 -546 1047
5122A047L31N349K847j878k464j170j433j60L219J958O34J48l686j852l370k031
5106b511r97M24j193M61j580o06J988K697m7l074j029J908k399K075K438j581
5090c026k646p07O079L730k197j226k90l015J377L754k975K161j240J059n63k296
5074b021M04j869M9K625l712j335j845l859l86L661J693M809M843K743m452l328
5058a980M950J367l953l45j556K987M134j832j236j059L325l830k31M98l649l361
5042e771O84O58j865J915K148K278J0p3q29p60M501L433J171p65N712r706p913
5025e172k682L482M115j192l205J39o909L00N118M901L336K604K147n46k49k232
5009C955J210J369p393j193m827k146M429K790J676K714j949l328K693M115J112
$$ plain form
5122 1047 1378 6727 9574 7696 5232 4062 2629 2469 5688 7646 8280 8428 4742 2890 -480 -2511
5106 -2511 -3508 -3084 -4277 -3816 -5396 -6002 -4014 -1317 -1364 -4438 -5467 -3559 -5958 -3883 -1445 -3026
5090 -3026 -5672 -6379 -300 3430 1233 7 -283 -3298 -1921 1833 -1142 1019 -221 838 275 -2021
5074 -2021 -1617 -3486 -3437 -812 -4524 -5859 -7704 -11563 -11949 -8288 -6595 -1786 3057 5800 1348 -1980
5058 -1980 2970 4337 384 39 -1517 1470 5604 3772 2536 1477 4802 972 741 1239 -2410 -5771
5042 -5771 -5087 -4429 -6294 -4379 -2231 47 57 -16 -845 -1605 2896 6329 7500 6735 12447 2741 -5172
5025 -5172 -7854 -4372 -257 -1449 -4654 -4515 -11424 -11124 -6006 -1105 2231 4835 6982 6436 6187 3955
5009 3955 5165 6534 -859 -2052 -6879 -9025 -4596 -1806 -130 2584 635 -2693 0 4115 5227
4994E227k354k661J458M410l071m069O401L195l349j094p11j152j603L846K024
4979F497l207k539l043p66k712q9R75k588O15J210J770P59N206j30J24q087l581
4962i586J448K008k501n73M144N114K000j970j626N27K000l30Q12k769N267M747
4946H712J751L82m583q041K50j230n46J132K155J503j445q96O76J609L332p81
4930C980n206k619J690L97K028L279j567m562j680k617OK593J10K1Q56j505l1
4913d827P69j066o55K498j140L104K969J771o38k42k70j444J512L301M12q869
4897b815j611O958J49j537O53O38M28j854k314M782m782m6L242K828l827j083
4881a91l960k095N735O579n653o060N254M449J138o53l404m710k65J81J254J516
$$ plain form
4994 5227 2873 212 1670 6080 3009 -1060 5341 8536 5187 4093 3382 2230 627 4473 6497
4979 6497 3290 751 -2292 -3058 -5770 -5859 -4884 -7472 -6857 -5647 -3877 -3118 2088 1958 2082 -6005 -9586
4962 -9586 -8138 -6130 -8631 -9204 -5060 54 2054 84 -1542 -1015 985 655 1467 -1302 3965 8712
4946 8712 10463 10845 6262 -1779 -1529 -2759 -3305 -2173 -18 1485 40 -856 -180 1429 4761 3980
4930 3980 -1226 -3845 -2155 -1758 270 3549 1982 -2580 -4260 -6877 -6871 -4278 -4168 -4147 -3291 -4796 -4827
4913 -4827 -4058 -5124 -5779 -3281 -4421 -1317 1652 3423 2785 2543 2273 829 2341 5642 6054 -2815
4897 -2815 -4426 2532 2681 1144 1797 2435 2863 1009 -1305 3477 -1305 -1351 1891 4719 892 -191
4881 -191 -4151 -6246 -511 6068 415 -5645 -391 4058 5196 4543 1139 -3571 -3836 -3655 -2401 -885
4865h85M51j321L79J048l392j642K214O2n0J39k044q15J742L174P740J766n152
4848C414j830k410l117m616J656k367K382P477j082j400m115j531k389J914P145
4833h69J628l727J208L252j496j454k416j18M435J725J649k280j115l589n155
4818h322R73M434M812M17n316m280K055J124M36J200J019j343p142n256N766P132
4802b291L97m92O414J092m583k714k26k969K88N186k037P35M937r91n540o878
4786i672l444N545K606l974o088j048J2761Q445L99M42K810L36k27l700n182j962
4770a953M7l263P86N492J279l74k121k007p91K566N50l225r88L344L035k908j352
4753a883L403l356L424K014m12m463j959M887K867o949l233N411J567n791P76
$$ plain form
4865 -885 -434 -1755 -1376 -328 -3720 -5362 -3148 -3086 -3136 -2997 -5041 -5856 -4114 -940 6800 8566 3414
4848 3414 1584 -826 -3943 -8559 -6903 -9270 -6888 589 -493 -1893 -6008 -7539 -9928 -8014 -869
4833 -869 759 -2968 -1760 1492 -4 -1458 -3874 -3992 443 2168 3817 1537 422 -3167 -8322
4818 -8322 -7349 -2915 1897 2314 -3002 -7282 -5227 -4103 -3667 -2467 -1448 -2791 -9933 -15189 -9423 -2291
4802 -2291 -1894 -2386 4028 5120 537 -2177 -2403 -5372 -5084 102 -1935 -1200 3737 2746 -2794 -9672
4786 -9672 -13116 -7571 -4965 -8939 -15027 -16075 -3314 5131 5530 5972 8782 9118 8891 5191 9 -1953
4770 -1953 -1906 -5169 -4383 1109 2388 2014 -107 -2114 -2905 -339 211 -3014 -4002 -658 2377 -531 -1883
4753 -1883 1520 -1836 1588 3602 3190 -1273 -3232 1655 4522 -2427 -5660 -249 1318 -4473 -3697
4738c697q19N003k400k088j662j302L585O262N870N63p19L03j872k705k153l2
4722B137n35k147k21o381K55Q21J618P99l35L888O37K87j2K410P32j09R25o163
4704a394k952K196K610Q59L58p99l405N90K85P49R75k144K396J518L835n096j757
4687a176k428k07m443P0M364N086k31N98j459j564l768N4l40K149K052k399L319
4670c23J568L371L541J812l756j132l603o417q546L078N373p02m9J182K172K402
4654b9K862M312j153r43L845j782m168q993l487o40M405J417l65P16J115K286
4638f02K42J720K603o544q133P58L790J153J507J562o41k692J55M245Q45Q4J139
4621A191k27l218K42j067m480k626N073L374J057J993k683j641R2K984J08j486
$$ plain form
4738 -3697 -4516 487 -1913 -4001 -5663 -6965 -3380 2882 8752 9315 8596 8899 7027 4322 2169 2137
4722 2137 1602 -545 -766 -7147 -6892 -6071 -4453 -3654 -3989 -101 536 823 811 3221 3953 3844 4769 -1394
4704 -1394 -4346 -2150 460 1319 1677 878 -2527 -1937 -1652 -903 72 -2072 324 1842 5677 581 -1176
4687 -1176 -3604 -3811 -8254 -8184 -3820 1266 1035 1633 174 -1390 -5158 -5104 -5444 -3295 -1243 -3642 -323
4670 -323 1245 4616 8157 9969 6213 5081 1478 -4939 -13485 -10407 -5034 -5736 -5785 -4603 -2431 -29
4654 -29 2833 7145 5992 5049 8894 7112 2944 -6049 -9536 -10176 -5771 -4354 -4719 -4003 -2888 -602
4638 -602 -360 1360 3963 -2581 -10714 -9956 -6166 -5013 -3506 -1944 -2585 -5277 -5122 -877 -32 52 1191
4621 1191 964 -2254 -2012 -3079 -7559 -10185 -5112 -1738 -681 1312 -1371 -3012 -2920 64 172 -1314
4605a314J369l760k81L249O02n986j404N464O286j7O56k1m345k746K362l344K56
4588b974M257K574J203l371m118K616j874r13P10L78J638K84l424j528j3M168
4572c87N442j490k391k321n192l716L595L97P094Q8m019J639K058m033O51M299
4556A714k556j547J686j653m117J83J138K985j873j302k174K974P036K936O59
4541F089q88M002j148k261J48r82k216k696J787J304k010R72J880n99j144j442
4525G96q18P631r62m439R24l159m87j309k095J229J439L692j411j496P38J005
4509A278m935m115o7M234K57l570j406J695L405j139L422L080l601k418k492k047
4493h419k696R38K644k94J741Q554O941R95k775j494k963K028l842N224M073m201
$$ plain form
4605 -1314 55 -3705 -3986 -737 -135 -6121 -7525 -2061 4225 4208 4864 4843 498 -2248 114 -3230 -2974
4588 -2974 1283 3857 5060 1689 -2429 187 -1687 -2600 -1890 -1512 126 410 -3014 -4542 -4555 -387
4572 -387 5055 3565 1174 -1147 -6339 -10055 -6460 -6063 1031 1119 -2900 -1261 797 -3236 -2585 1714
4556 1714 -842 -2389 -703 -2356 -6473 -6290 -5152 -2167 -4040 -5342 -7516 -4542 2494 5430 6089
4541 6089 5201 9203 8055 5794 5942 4960 2744 48 1835 3139 1129 2101 3981 3382 2238 796
4525 796 -22 7609 6647 2208 3132 -27 -514 -1823 -3918 -2689 -1250 2442 1031 -465 273 1278
4509 1278 -3657 -7772 -7839 -3605 -3348 -6918 -8324 -6629 -3224 -4363 -941 2139 -1462 -3880 -6372 -8419
4493 -8419 -11115 -10177 -7533 -7827 -6086 2468 9409 10404 7629 6135 3172 5200 1358 6582 10655 6454
4477F454o189J23K1j407m86N33J057J543m511l501q05J836N613J795r44L397L915
4460H444m97k149N27m359k464o92p39J248k716k492J717J083k00L049L333k188
4444I05L413M31o915n157m41M129L541k752K331l293J057J673J633j954l828R72
4428d255K464P36l81L25k359p73j09j204K699L620m224r88l58J797Q22k461l529
4411h178P014J01n79l339l75L522M587J439o318k134j210r23J187K034N282J26
4395B236M741j105l877M54j200M268J481l434l74N010N879o47j69Q23n386l661
4379E039q46K246L011J152l40J005n397l651L910M27r81k842m479J626O576j050
4363E406l685j398M24k037j124K206k686o49Q46j124p23J361P381j257k853L509
$$ plain form
4477 6454 265 388 409 -998 -1484 -951 106 1649 -2862 -6363 -7168 -5332 281 2076 1132 4529 8444
4460 8444 7947 5798 6325 1966 -498 -1190 -1929 -681 -3397 -5889 -4172 -3089 -3289 -240 3093 905
4444 905 4318 4749 -2166 -7323 -7764 -3635 -94 -2846 -515 -3808 -2751 -1078 555 -1399 -5227 -4255
4428 -4255 -1791 -1055 -1436 -1111 -3470 -4243 -4352 -5556 -2857 763 -3461 -4449 -4807 -3010 -2188 -4649 -8178
4411 -8178 -1164 -1063 -1642 -4981 -5356 -1834 2753 4192 -2126 -4260 -5470 -6393 -5206 -3172 2110 2236
4395 2236 6977 5872 1995 2449 1249 5517 6998 3564 3190 8200 14079 13432 13263 14086 8700 5039
4379 5039 4193 6439 9450 10602 10262 11267 5870 2219 6129 6556 5575 2733 -1746 -120 6456 5406
4363 5406 1721 323 747 -1290 -2414 -208 -2894 -3543 -2697 -3821 -4544 -3183 4198 2941 88 3597
4347C597J476K611n500o384J288K307M003m882k407qN750J128n780K517M319M015
4331H050j152M293L392n79K97k888o207m105k908K298j056o34L14K709J56m290
4315b310K66K749l96J208j76n16J833n614l485O77m14o49K222L676K430L057j410
4298C148j39K675k04n154p48P36l462m473m411J277M979j946K506O605l411l100
4282e122p60J368k10n970o88J045p62l12M049n42K350j026J208q30K59R36j40
4265e147N15M857L286k265j157O15M18L468m556j449j858k013J190j009k519J307
4249f317L492N335N6J620K198j291n50J689M13n526l954j428K701L141p38o89
4233A52n76j564n083K427L680l899l161K771M546k635M357L977k244j683J912
$$ plain form
4347 3597 5073 7684 2184 -4200 -2912 -605 3398 -1484 -3891 -3899 1851 2979 -2801 -284 4035 8050
4331 8050 6898 11191 14583 14004 14301 11413 5206 1101 -1807 491 -565 -1199 -885 1824 1980 -2310
4315 -2310 -2044 705 309 1517 1341 825 2658 -2956 -6441 -5764 -6178 -6827 -4605 -929 1501 4558 3148
4298 3148 3009 5684 5480 326 -422 314 -3148 -7621 -12032 -10755 -5776 -7722 -5216 1389 -2022 -5122
4282 -5122 -5882 -4514 -4724 -10694 -11382 -10337 -11099 -11411 -7362 -7904 -5554 -6580 -5372 -6202 -5943 -5007 -5147
4265 -5147 -4632 225 3511 1246 89 704 1122 4590 34 -1415 -3273 -5286 -4096 -5105 -7624 -6317
4249 -6317 -2825 2510 2566 4186 6384 5093 4543 6232 6645 1119 -2835 -4263 -1562 1579 841 152
4233 152 -424 -1988 -7071 -4644 -964 -4863 -8024 -5253 -707 -3342 1015 4992 2748 1065 2977
4218B977J70K582l210o957l901J228J0110J87m600l020L520k803K0K131K434K249
4202C117L038L476k307o537k322j147o330N16L586M462p01k862K206k750L74l009
4186g190m205j036M055M139j547k978n043L871M779m106q42l71L141M550k318
4171e101L570L868M423j953n381M023L83m109J013K978J400o577j137p63j586
4156d949M335M570N211l027l328q04L216j228m067M213P72k351o598n220K331
4141f924k634n47K814L150P425M047o184l269k39M75M24K758M247J494k713J044
4125E368j1L35l062m173m020J729M192l91O66j393J578J000l060p33J210J065
4109C00K287l134m457J057P464L488k349L213K942o37q05o903q728K124M485J968
$$ plain form
4218 2977 3147 5729 2519 -4438 -8339 -7111 2999 3186 -1414 -4434 -914 -3717 -3697 -1566 868 3117
4202 3117 6155 9631 7324 787 -1535 -2682 -9012 -8496 -4910 -448 -1149 -4011 -1805 -4555 -4181 -7190
4186 -7190 -11395 -12431 -8376 -4237 -5784 -8762 -13805 -9934 -5155 -9261 -10103 -10474 -7333 -2783 -5101
4171 -5101 -1531 2337 6760 4807 -574 3449 3832 -277 736 3714 5114 -1463 -2600 -3363 -4949
4156 -4949 -614 3956 9167 6140 2812 2008 5224 3996 -71 4142 4914 2563 -4035 -9255 -6924
4141 -6924 -9558 -10105 -7291 -4141 3284 7331 1147 -2122 -2361 -1886 -1462 1296 5543 7037 4324 5368
4125 5368 5357 5692 2630 -1543 -5563 -3834 358 -33 633 -760 818 1818 -1242 -1975 -765 300
4109 300 2587 -547 -5004 -3947 3517 7005 4656 7869 10811 10174 9369 2466 -6262 -4138 347 2315
4093B315O20n979K364K170j897p88j328m38j571K403M255k346J513o06o62Q57
4077H82r14k498m21K975j698J604l006Q53l23K084k74J639k196k331m62J931R41
4060a214j068m01N702M334l426j120M269J485j907k812j575j726j26N07j494R02
4044C30j427K509M553Q15m499l058K01k310P09N92L356j780k91l53q80K899P529
4027H895m185n046l312J766L626j420m445J337K083m579Q81j989j048R21M305
4012b210M91Q75M646n65q74L854n401m763K451K628k190j040L083L500l500p6
3996I09N569N32m556j587K395J191O99O83K386n863j760K929K427O062j042k775
3980H199m037m77l424Q12L344r01m208J87K328j292k102M009K142k796J228J271
$$ plain form
4093 2315 2935 -3044 -680 1490 -407 -1195 -2523 -2961 -4532 -2129 2126 -220 1293 687 25 882
4077 882 -32 -2530 -2951 24 -1674 -70 -3076 -2223 -2546 -462 -736 903 -1293 -3624 -4086 -2155 -1214
4060 -1214 -2282 -2683 3019 7353 3927 2807 7076 8561 6654 3842 2267 541 415 922 -572 330
4044 330 -1097 1412 5965 6780 2281 -777 -576 -2886 -2177 -1585 1771 -9 -300 -653 -1533 1366 8895
4027 8895 4710 -336 -3648 -1882 1744 324 -4121 -2784 -701 -5280 -4399 -6388 -7436 -6515 -2210
4012 -2210 -1719 -844 3802 3237 2363 6217 816 -3947 -1496 1132 -1058 -2098 985 4485 985 909
3996 909 6478 7010 2454 867 3262 4453 5152 5835 8221 2358 598 3527 5954 12016 10974 8199
3980 8199 4162 3685 261 1073 4417 3516 -692 -505 1823 531 -1571 2438 4580 1784 3012 4283
3964D283L67L753K09j334n078j599J736K138K04N41n59k00K462l51n163m528N30
3947b589M942L118j867o829m611J763L042k306j653m28M241J226K159L870M71
3932D549M03k780j168k165j309K57o81J79N1k37k00M431m795j499K885L136P13
3915A770j96K310L037J611m155j959j479r69K002P13p8K64l71j057r84J300L092
3898D851k249j044M997n214l843K31M474k645k054m617M189N569K669m456j973
3883a115L355l303K584L274j398M28Ll68Q6K438k729j777k1J37k087L322K396
3866E225R96K163M776j738k323r997l558P756m16p53K594l57m748l321j581K100
3850c182L493M684J668j094J51k884n19K628m44K553n628j122k270K97K185J912
$$ plain form
3964 4283 4650 8403 8612 7278 2200 601 2337 4475 4679 5220 4661 4461 6923 6572 1409 -3119 -2589
3947 -2589 2353 5471 3604 -3225 -7836 -6073 -3031 -5337 -6990 -7418 -3177 -1951 208 4078 4549
3932 4549 4952 2172 1004 -1161 -2470 -2213 -2894 -2715 -2664 -2901 -3101 1330 -3465 -4964 -2079 1057 1770
3915 1770 1574 3884 6921 8532 4377 2418 939 -30 1972 2685 2607 2871 2500 1443 459 1759 4851
3898 4851 2602 1558 6555 1341 -2502 -2271 2203 -442 -2496 -7113 -2924 2645 5314 858 -1115
3883 -1115 2240 -1063 1521 4795 3397 3825 3828 3460 3546 5984 3255 1478 1457 1594 -493 2829 5225
3866 5225 6221 8384 13160 11422 9099 -898 -4456 3300 2884 2131 4725 4368 -380 -3701 -5282 -3182
3850 -3182 311 4995 6663 5569 5720 2836 2317 4945 4501 7054 1426 304 -1966 -1669 516 2428
3834B428o79k909q10N462j936M56J650p15J405n238n046K358K358O86k271j018
3818c819J237j245K258K958J298o74K584M187p23Q2j195l000j300K70k315k099
3802a496K796J773j710K806k179k783j163j040k576L803k275l043l69k319L095
3787f680K301k023K75N56o58o48O821K469m706l387L895M848k719n67J17j910
3771b016j098K737J766o656m877J081K181L359K664J792r4l729J895k121k044
3756e160M937J912l836M11J04p31M81L339L293J215J043m686p382j04N454K038
3740B328n044P3J130j123j476J89M96L243K714J807j366l547k599J739Q728r58
3724F334o077j360K00p38M458M731r67l081q94k652L050N853N827Q2m632K498
$$ plain form
3834 2428 1749 -1160 -1970 3492 1556 2012 3662 2947 4352 -886 -5932 -3574 -1216 -530 -2801 -3819
3818 -3819 -2582 -3827 -1569 1389 2687 2013 4597 8784 8061 8143 6948 3948 2648 2918 603 -1496
3802 -1496 1300 3073 1363 4169 1990 -793 -1956 -2996 -5572 -1769 -4044 -7087 -7456 -9775 -6680
3787 -6680 -4379 -6402 -6127 -5571 -6229 -6877 -56 2413 -2293 -5680 -1785 3063 344 -223 -106 -2016
3771 -2016 -3114 -377 1389 -5267 -10144 -9063 -6882 -3523 -859 933 839 -2890 -995 -3116 -5160
3756 -5160 -223 1689 -2147 -1736 -1632 -2363 -1882 1457 4750 5965 7008 2322 -5060 -5164 290 2328
3740 2328 -2716 -2643 -1513 -2636 -4112 -3923 -3427 -184 2530 4337 2971 -576 -3175 -1436 7292 6334
3724 6334 257 -1103 -903 -1641 2817 7548 6581 3500 2606 -46 3004 8857 14684 14766 10134 12632
3708A2632j507m333j862Q37L554k475k664l944k219J544M733J342M16q75j550
3693C629m040L010N125l48n709J293j789L77m2j196K98J329k022l827N33O927
3677C548K082l786J646k06j749j742K194j577m48L070J906p257j450L161j314
3662a922j828P096r087l936P253k883j789J171j419M908N562K571n455j044m40
3647a242k529J739M742k674n373K958L684o70k299K014L084j599j615l856j874
3632e510L922O384M240J05j362n55n514l589m632J12R72l9L086N144J576k116
3616B224k90N47k733Q255P109J437j484k682k477l034R26l14m004m229j107o78
3600b534M054L270L106K361J676p720n242J403p483k610k607N536R212r92L31
$$ plain form
3708 12632 11125 6792 4930 5767 9321 6846 4182 238 -1981 -437 4296 5638 6054 5179 3629
3693 3629 -411 2599 7724 7376 1667 2960 1171 1548 1506 310 608 1937 -85 -3912 -3379 3548
3677 3548 5630 1844 3490 3284 1535 -207 1987 410 -38 3032 4938 -2319 -3769 -608 -1922
3662 -1922 -3750 3346 -5741 -9677 -2424 -5307 -7096 -5925 -7344 -2436 3126 5697 242 -802 -1242
3647 -1242 -3771 -2032 2710 36 -5337 -2379 1305 635 -1664 350 3434 1835 220 -3636 -5510
3632 -5510 -1588 4796 9036 9141 7779 7224 1710 -1879 -6511 -6399 -5427 -5466 -2380 2764 4340 2224
3616 2224 1934 2481 -252 8003 15112 16549 15065 12383 9906 6872 7798 7484 3480 -749 -1856 -2534
3600 -2534 1520 4790 7896 10257 11933 4213 -1029 374 -7109 -9719 -12326 -6790 2422 1430 1761
3585A761J907K566k622m767l057l24K450j10K949K866J885K931j503q2P48j257
3569F341q715o560j379J440o697m008J926j729n168L049N376L366K515N93J525
3554h125L441K869K863j223K069J47O09o84n02j206L919N765P54J224M5m315k377
3537E273Q03l62j179l323m590p6M48L864l973J982j551l458L434J294p60L189
3521A015K961k900K825N197K14j660l279M008M378k513p135k652j105j263o7j086
$$ plain form
3585 1761 3668 6234 3612 -1155 -4212 -4536 -2086 -2196 753 3619 5504 8435 6932 6850 7598 6341
3569 6341 -2374 -8934 -10313 -8873 -15570 -19578 -17652 -19381 -24549 -21500 -16124 -12758 -10243 -9650 -8125
3554 -8125 -4684 -1815 1048 -175 1894 2041 2650 1966 1464 258 4177 9942 10696 11920 11965 7650 5273
3537 5273 6076 5714 4535 1212 -3378 -3454 -3006 858 -3115 -1133 -2684 -6142 -2708 -1414 -2174 1015
3521 1015 3976 1076 3901 9098 9312 7652 4373 8381 12759 10246 3111 459 -646 -1909 -1976 -3062
$$ [...]
##END NTUPLES=NMR SPECTRUM
##END=
