##TITLE=Analysis number 328450
Compound Code sb 01703
Project Code adrs
Chemist Name stores
##JCAMPDX= 6.0         $$ Bruker NMR JCAMP-DX V2.0
##DATA TYPE= NMR SPECTRUM
##DATA CLASS= NTUPLES
##ORIGIN= Bruker BioSpin GmbH
##OWNER= nmr
$$ XWIN-NMR		Version 3.5
$$ Wed Jun  6 11:53:48 2007 GMT Daylight Time (UT+1h)  MAYBRIDGE\nmr@NMR_250MHZ
##.OBSERVE FREQUENCY= 250.131544655141
##.OBSERVE NUCLEUS= ^1H
##.ACQUISITION MODE= SIMULTANEOUS (DQD)
##.ACQUISITION SCHEME= undefined
##.AVERAGES= 16
##.DIGITISER RES= 18
##SPECTROMETER/DATA SYSTEM= dpx250
##.PULSE SEQUENCE= zg30
##.SOLVENT NAME= CDCl3
##.SHIFT REFERENCE= (INTERNAL, CDCl3, 0, 16.522)
##AUDIT TRAIL= $$ (NUMBER, WHEN, WHO, WHERE, WHAT)
$$ ##TITLE= Audit trail, XWIN-NMR		Version 3.5
$$ ##JCAMPDX= 5.01
$$ ##ORIGIN= Bruker BioSpin GmbH
$$ ##OWNER= nmr
$$ C:\u/data/dgb/nmr/ADRS/350/pdata/1/auditp.txt
$$ ##AUDIT TRAIL=  $$ (NUMBER, WHEN, WHO, WHERE, WHAT)
(   1,<2007-06-06 11:53:28.07 +100>,<MAYBRIDGE\nmr>,<NMR_250MHZ>,
      <created by zg, POWCHK disabled, PULCHK disabled
       configuration hash MD5:
       76 6E 9A 78 1E 09 19 81 EC 84 63 8F B0 6A 59 2D
       data hash MD5: 64K
       00 64 88 8F 4E 82 8A FB DB 10 BA FB 5E E3 44 6D>)
(   2,<2007-06-06 11:53:39.32 +100>,<MAYBRIDGE\nmr>,<NMR_250MHZ>,
      <Start of raw data processing
       ef LB = 0.3 FT_mod = 6 PKNL = 1 SI = 32K 
       data hash MD5: 32K
       6E 39 80 A4 6A 3B 03 B6 65 DF 1D 03 44 67 A0 1F>)
(   3,<2007-06-06 11:53:41.65 +100>,<MAYBRIDGE\nmr>,<NMR_250MHZ>,
      <apk 
       data hash MD5: 32K
       43 F2 5A 23 82 9E C0 EE 81 42 35 C5 E0 23 1C 52>)
(   4,<2007-06-06 11:53:42.48 +100>,<MAYBRIDGE\nmr>,<NMR_250MHZ>,
      <abs ABSG = 5 
       data hash MD5: 32K
       6D 31 47 C1 DC EE DA 67 69 34 82 23 05 8A 18 B4>)
$$ ##END=
$$ 
$$ hash MD5
$$ 67 AD 62 0C A4 E7 59 4B D3 55 18 9B 4E 33 B5 B6
##$RELAX= 
##$RELAX= 
##$RELAX= 
##$RELAX= 
##$RELAX= 
##$RELAX= 
##$RELAX= 
$$ Bruker specific parameters
$$ --------------------------
##$DU= <C:\u>
##$EXPNO= 350
##$NAME= <ADRS>
##$PROCNO= 1
##$TYPE= <nmr>
##$USER= <dgb>
##$AMP= (0..31)
100 100 100 100 100 100 100 100 100 100 100 100 100 100 100 100 100 100 
100 100 100 100 100 100 100 100 100 100 100 100 100 100 
##$AQSEQ= 0
##$AQ_mod= 3
##$AUNM= <au_zg>
##$AUTOPOS= <19 >
##$BF1= 250.13
##$BF2= 250.13
##$BF3= 250.13
##$BF4= 250.13
##$BF5= 500.13
##$BF6= 500.13
##$BF7= 500.13
##$BF8= 500.13
##$BYTORDA= 1
##$CFDGTYP= 0
##$CFRGTYP= 5
##$CHEMSTR= <none>
##$CNST= (0..31)
1 1 145 1 1 1 1 1 1 1 1 1 1 1 1 1 1 1 1 1 1 1 1 1 1 1 1 1 1 1 1 1 
##$CPDPRG= <>
##$CPDPRG1= <>
##$CPDPRG2= <>
##$CPDPRG3= <>
##$CPDPRG4= <mlev>
##$CPDPRG5= <mlev>
##$CPDPRG6= <mlev>
##$CPDPRG7= <mlev>
##$CPDPRG8= <mlev>
##$CPDPRGB= <>
##$CPDPRGT= <>
##$D= (0..31)
0 1 0 0 0 0 0 0 0 0.06 0 0 0 0 0 0 0.0002 0 0 0 0 0 0 0 0 0 0 0 0 0 0 
0 
##$DATE= 1181127207
##$DBL= (0..7)
120 120 120 120 120 120 120 120 
##$DBP= (0..7)
150 150 150 150 150 150 150 150 
##$DBP07= 0
##$DBPNAM0= <>
##$DBPNAM1= <>
##$DBPNAM2= <>
##$DBPNAM3= <>
$$ [...]
##$SUBNAM7= <"">
##$SUBNAM8= <"">
##$SUBNAM9= <"">
##$SW= 20.6930455092707
##$SWIBOX= (0..15)
0 0 3 0 0 0 0 0 0 0 0 0 0 0 0 0 
##$SW_h= 5175.983436853
##$TD= 65536
##$TD0= 1
##$TE= 296.16
##$TE2= 300
##$TE3= 300
##$TEG= 300
##$TL= (0..7)
0 120 120 120 120 120 120 120 
##$TP= (0..7)
150 150 150 150 150 150 150 150 
##$TP07= 0
##$TPNAME0= <>
##$TPNAME1= <>
##$TPNAME2= <>
##$TPNAME3= <>
##$TPNAME4= <>
##$TPNAME5= <>
##$TPNAME6= <>
##$TPNAME7= <>
##$TPOAL= (0..7)
0.5 0.5 0.5 0.5 0.5 0.5 0.5 0.5 
##$TPOFFS= (0..7)
0 0 0 0 0 0 0 0 
##$TUNHIN= 0
##$TUNHOUT= 0
##$TUNXOUT= 0
##$USERA1= <user>
##$USERA2= <user>
##$USERA3= <user>
##$USERA4= <user>
##$USERA5= <user>
##$V9= 5
##$VALIST= <valist>
##$VCLIST= <CCCCCCCCCCCCCCC>
##$VD= 0
##$VDLIST= <DDDDDDDDDDDDDDD>
##$VPLIST= <PPPPPPPPPPPPPPP>
##$VTLIST= <TTTTTTTTTTTTTTT>
##$WBST= 1024
##$WBSW= 4
##$XGAIN= (0..3)
0 0 0 0 
##$XL= 0
##$YL= 0
##$YMAX_a= 644085
##$YMIN_a= -619008
##$ZGOPTNS= <>
##$ZL1= 120
##$ZL2= 120
##$ZL3= 120
##$ZL4= 120
##$ABSF1= 16.522
##$ABSF2= -4.171173
##$ABSG= 5
##$ABSL= 3
##$ALPHA= 0
##$AQORDER= 0
##$ASSFAC= 0
##$ASSFACI= 0
##$ASSFACX= 0
##$ASSWID= 0
##$AUNMP= <proc_1d>
##$AZFE= 0.1
##$AZFW= 0.1
##$BCFW= 0
##$BC_mod= 0
##$BYTORDP= 0
##$COROFFS= 0
##$CY= 12.5
##$DATMOD= 1
##$DC= 0
##$DFILT= <>
##$DTYPP= 0
##$F1P= 14.0000005364418
##$F2P= -0.99999901652339
##$FCOR= 0.5
##$FTSIZE= 32768
##$FT_mod= 6
##$GAMMA= 0
##$GB= 0
##$INTBC= 1
##$INTSCL= 1
##$ISEN= 128
##$LB= 0.3
##$LEV0= 0
##$LPBIN= 0
##$MAXI= 10000
##$MC2= 0
##$MEAN= 0
##$ME_mod= 0
##$MI= 0
##$NCOEF= 0
##$NC_proc= -2
##$NLEV= 6
##$NOISF1= 0
##$NOISF2= 0
##$NSP= 0
##$NTH_PI= 0
##$NZP= 0
##$OFFSET= 16.522
##$PC= 1
##$PHC0= 152.596
##$PHC1= 7.451607
##$PH_mod= 1
##$PKNL= yes
##$PPARMOD= 0
##$PSCAL= 4
##$PSIGN= 0
##$REVERSE= no
##$SF= 250.13
##$SI= 32768
##$SIGF1= 0
##$SIGF2= 0
##$SINO= 400
##$SIOLD= 32768
##$SREGLST= <1H.CDCl3>
##$SSB= 0
##$STSI= 32768
##$STSR= 0
##$SW_p= 5175.98343685301
##$SYMM= 0
##$S_DEV= 0
##$TDeff= 65536
##$TDoff= 0
##$TI= <Analysis number 999999
Compound Code 99
Book Reference 9
Project Code 9>
##$TILT= no
##$TM1= 0
##$TM2= 0
##$TOPLEV= 0
##$USERP1= <user>
##$USERP2= <user>
##$USERP3= <user>
##$USERP4= <user>
##$USERP5= <user>
##$WDW= 1
##$XDIM= 32768
##$YMAX_p= 519720020
##$YMIN_p= -298081
$$ End of Bruker specific parameters
$$ ---------------------------------
##NTUPLES= NMR SPECTRUM
##VAR_NAME=  FREQUENCY,     SPECTRUM/REAL,   SPECTRUM/IMAG
##SYMBOL=    X,             R,               I
##VAR_TYPE=  INDEPENDENT,   DEPENDENT,       DEPENDENT
##VAR_FORM=  AFFN,          ASDF,            ASDF
##VAR_DIM=   32768,         32768,           32768
##UNITS=     HZ,            ARBITRARY UNITS, ARBITRARY UNITS
##FACTOR=    0.157963299565203, 1,           1
##FIRST=     4132.6476996994, 0,             0
##LAST=      -1043.33573715361, 0,           0
##MIN=       -1043.33573715361, -298081,     0
##MAX=       4132.6476996994, 519720020,     0
$$ Real data points
##PAGE= N=1
##DATA TABLE= (X++(R..R)), XYDATA
$$ [...]
19545 4893 5010 5706 7709 11264 9752 6823 -722 -4420 -2931 -730 4222 4724 4298 890 -1887 -840
19529 -840 -1716 -709 3069 6610 9058 7427 1806 -846 4745 5246 4235 1552 456 1390 797 167
19513 167 3728 4420 1598 -1743 -5363 -2135 -856 -5007 -6090 -3905 -7732 -8212 -7045 -8768 -6203
19498 -6203 -6345 -9335 -8965 -3079 -2240 -1434 1019 3199 765 42 -1557 2246 3769 3722 2799 270 2164
19481 2164 3701 7058 1921 -1325 1805 2925 709 -2291 -4520 -2322 978 3877 3246 -1800 -5224
19466 -5224 -3615 -1177 4038 2107 -698 -3848 -3957 -3660 -3056 -5260 -5249 1952 1455 -2407 -1765 -4399
19450 -4399 -658 1700 -781 -1194 3961 8259 7333 4860 3104 -491 -1047 55 -4062 -6305 -1909
19435 -1909 2649 3854 472 3305 1971 4292 5324 10731 14873 14760 6652 1292 1833 4610 4732
19420 4732 6233 5361 3374 9275 7205 2969 4039 -500 -964 -3543 -4742 119 -571 -4872 -8399
19405 -8399 -4492 -1127 -940 -1544 -3371 -2213 -1326 707 -451 2304 200 52 2800 2232 3145 2071
19389 2071 -919 -4679 -3761 -5764 -6789 -10530 -7303 -6214 -9541 -8101 -6508 -2270 -553 -2207 -4720
19374 -4720 -4159 -1634 -3328 -7006 -5781 -4002 -1828 1879 1344 -3879 -8821 -2696 43 127 -3204 -6964
19358 -6964 -772 2628 1718 -4609 -5215 -1657 4163 2656 -780 875 906 -3906 -1778 2928 2458 1697
19342 1697 3095 4287 2323 118 4314 6295 5750 7316 2738 -1285 -1440 1765 5244 5850 3668
19327 3668 2176 2404 3105 2751 4633 2679 64 813 4000 7345 7662 2823 671 2823 4251 -3731
19311 -3731 -6609 -5104 -2644 -5085 -4557 -2555 1942 2431 910 -1134 -1978 369 4039 5407 0
19296 0 382 3763 1424 -681 2611 1002 -4484 -6483 -4020 -2067 -866 1089 853 1347 -679 195
19280 195 1725 6348 11370 14181 11741 8461 9588 8613 11086 11624 6263 8747 10918 6812 5359
19265 5359 6769 4823 2143 2050 3740 7058 9560 8666 4795 1357 -4471 -5672 -2178 -2701 -3659 -1401
19249 -1401 757 3094 4242 4004 1126 4048 3720 2500 785 -56 -2338 -2313 -1157 -2304 1093 2899
19233 2899 2602 256 -6469 -10394 -5107 -378 -739 -938 283 -1431 -1058 -689 -2244 -1393 -2366 -4600
19217 -4600 -8013 -7458 -1439 -1460 -4932 -2446 2591 1589 3487 4361 3027 1856 4243 3386 7548 4779
19201 4779 1951 1947 4017 1230 -4401 -4802 -3168 -3086 -780 -176 2036 -2336 1102 2126 840 -1204
19185 -1204 -3860 -4977 -3481 697 -3202 -8848 -8927 -3390 -318 -3771 -7855 -5731 -1941 -2993 -4263
19170 -4263 -4491 -1268 920 183 -296 1316 4750 4834 3656 4129 5323 2792 -1636 -4294 -1634 2919
19154 2919 4134 6172 6803 5686 6104 1293 -4659 -4462 -6001 -3882 -279 323 -1677 -1250 1565 -2095
19138 -2095 -2672 -2914 -5799 -5045 -5110 -1610 -311 1419 -84 -2546 1334 6082 420 -2348 -1951 -1985 -6996
19121 -6996 -8260 -4398 -2548 -9446 -7480 -5668 -6393 -6653 -5768 -4622 -1860 -62 -930 -1086 583 -8
19105 -8 3524 3239 -385 -1353 -1513 143 -1858 -3081 -3681 -47 1306 4104 4559 2638 948 1746 5189
19088 5189 3723 -1254 -3463 -3900 -1468 267 2209 6269 593 -6329 -5802 -4582 -3888 -1890 -3250
19073 -3250 -8172 -7287 -4630 967 2445 -2088 -3977 -4473 -2362 -3545 -4540 -3329 -3188 -563 3247 2118
19057 2118 1400 -1156 -4340 -3873 -5119 -2660 483 -1470 -1716 3637 4682 3937 1586 -494 -34 2408
19041 2408 -889 -517 449 1442 1301 707 1010 613 2545 1348 734 1637 722 -199 -1519 -2077 -241 768
19023 768 -1075 -4560 -9391 -9178 -6019 220 -400 -2214 -1277 -2092 -5170 -1786 -718 -353 -452 2774 7400
19006 7400 7009 -512 -8453 -7701 -2701 1429 -955 -785 -1028 571 2219 3147 2100 -8 -1352 -2136
18990 -2136 -1208 69 504 -3044 -6077 -3201 388 272 1705 -2403 -7066 -4064 -1319 501 3543
18975 3543 2038 1912 -396 -1649 -335 1273 1628 3646 714 -4356 -3208 -3059 -7063 -7841 -1051 3879
18959 3879 5176 3102 767 1271 -2503 -10503 -12463 -6912 -1854 1470 2180 1192 2755 -1705 -4073
18944 -4073 -4521 -4960 -2798 -127 1786 4991 4480 6675 6222 6287 2512 29 568 -2372 -7218 -9243
18928 -9243 -7357 -2710 -1686 -2154 172 384 -1658 -3853 -5959 -7403 -7590 -4208 -936 1840 -4180
18913 -4180 -6330 -5671 -7547 -8256 -4907 -4652 -1317 -1192 -635 831 -583 320 -3203 -2607 125 1047 -551
18896 -551 -1433 253 1179 -1177 -1214 3348 4824 3374 3924 5616 490 -4921 -5122 -7835 -5993 -1035
18880 -1035 -197 -2124 1342 4126 3875 323 -2338 -2064 -1807 -1009 262 -1909 811 3479 3346 3197
18864 3197 373 -1582 -359 -1057 -3375 -187 3876 4656 2855 3246 -631 -2903 660 -896 -2250
18849 -2250 -640 2052 4611 4524 1593 -706 -1016 -2274 -2403 -2102 -686 -1528 -3591 -49 1610 -170
18833 -170 1408 -1000 -1507 -1627 -2355 292 -957 -6437 -4745 54 1434 1102 -379 639 3617 1323
18817 1323 2000 1306 -2731 -1774 -818 85 -3342 -3398 -683 2154 6194 11007 6666 1496 1233 2534 5892
18800 5892 7440 2420 -2025 450 972 142 -6385 -5351 -4000 -1610 70 2130 2517 -2353 40
18785 40 1777 2725 4718 2766 1891 2549 2640 3264 5619 5676 5395 6366 6996 428 3015 8504 17742 34190
18767 34190 53177 55056 38838 23899 16518 12797 9420 6120 2396 3349 3781 5037 262 -3088
18753 -3088 -3602 -378 3501 2653 1440 4113 2596 937 450 4002 8248 3603 3772 4871 4522 3577
18737 3577 2893 -618 -5554 -4193 -2251 -3409 -1619 3924 5640 5087 1421 -1022 -194 2468 6485
18722 6485 3991 -308 -4166 -6296 -7025 -5034 -4310 -7759 -6945 -5667 -1857 -1603 1052 2140 2335 2787
18706 2787 -269 -6485 -6587 893 5619 5056 5749 3598 317 4552 5734 1670 1027 3312 4219 3871
18690 3871 2966 1469 284 -1911 -993 -2647 -6889 -8168 -5696 -2344 1385 5375 2335 -215 1461
18675 1461 446 3390 8530 4247 459 3286 482 204 2259 3393 523 -486 -220 778 -1848
18660 -1848 -2020 1228 1072 1633 2016 2473 1903 3381 5071 7587 5644 274 2993 7182 5830 4528
18644 4528 6818 5951 5934 3747 1090 1472 2408 7652 8879 7843 6982 4619 3432 4723 3884 1250
18628 1250 5024 10041 8821 2482 -2280 147 609 306 2811 5504 3885 5929 7704 4364 -411
18613 -411 -1262 -1299 -1402 -99 2763 1617 -1712 155 1339 491 1279 -724 -1271 -1069 -1631 -1137 33
18596 33 3667 -200 -4340 -1420 2400 -29 483 1979 3265 2895 3505 524 -1603 1388 2674 3279
18580 3279 1760 2350 1538 193 -986 -332 -2607 -5979 -9305 -9655 -5480 1029 -510 -4295 -5466 -5231
18564 -5231 -5541 -1555 -592 -2050 -2080 -2404 22 -1388 -3364 -2204 949 161 -1624 -1299 -878 199 -2579
18547 -2579 -1809 -1289 -5056 -7424 -6162 -2705 1937 -429 -1017 -2222 -3523 -3218 5120 9016 7266 2339
18531 2339 1933 4800 1510 -24 -553 896 4205 4758 6129 4025 1858 1304 1363 299 -451 -4264
18515 -4264 -6660 455 4540 -26 -2725 -710 2033 1046 3746 592 -2977 -975 -2341 -2389 -1241
18500 -1241 823 4613 3970 1867 -3115 19 184 1903 -239 -4660 -2040 -375 43 -1203 441
18485 441 -555 -3093 -314 -1104 -4126 -5920 -6197 -6534 -2060 2701 3815 2872 3657 924 -4631 -8318
18469 -8318 -6654 -7383 -3429 1134 1625 2764 -600 189 5979 6092 6383 6912 6120 7007 10264 10129 8750
18452 8750 10431 5760 2147 2428 3029 1758 -1303 -3861 140 1790 -2645 -2353 -942 3432 3753 3181
18436 3181 1602 4674 1976 -1853 -170 2701 1533 2104 2413 1126 -1462 -5764 -5269 -6974 -3916
18421 -3916 -391 618 -1361 866 4210 1431 -575 1732 1187 566 4910 8151 6769 4077 899
18406 899 -1674 -1852 -5085 -3507 -4359 -195 2996 3328 1189 1020 4038 5739 3260 1688 -2396 -318
18390 -318 1112 560 -2328 -1187 2531 7857 4715 3758 4734 5643 6552 8159 4489 -1866 -1764 -233
18374 -233 835 -663 -1217 -1101 496 596 1457 194 907 1190 4694 7965 9968 9631 9268 4695 -2714
18357 -2714 -2918 -1754 2402 2617 910 -2487 -1090 2373 2014 -510 873 4393 4851 3039 3947 7732
18341 7732 10324 6741 7221 2919 -824 -2106 -3385 -219 3276 222 -1311 -2248 -3659 -5068 -9995
18326 -9995 -7934 -2375 186 -652 -36 942 -632 1572 3193 2708 116 -2331 -1036 1907 1361 1361 3615
18309 3615 547 -3513 -3012 -3364 -3812 -3942 -3755 -1153 -283 -3125 -819 1630 -2359 -7098 -7186 -1820 -170
18292 -170 -2058 -4839 -7484 -6489 -5676 -5945 -7106 -3300 1305 2539 1543 1296 777 102 1024 4734 5105
18275 5105 1239 -2586 8 2861 1245 -2654 -4805 -6018 -5273 -2219 -2624 -3188 -4442 -3762 3136 10850
18259 10850 11678 8949 4664 3422 3291 2949 1589 935 1281 -1316 -1031 2032 4110 4680 4249 4670 6119
18242 6119 2937 1703 3930 6578 12859 17571 16732 15496 12307 8407 5459 6165 8750 7214 6544
18227 6544 7278 7331 7124 7039 5627 4365 2736 4845 2826 -2835 -4085 -3025 -30 2220 5862 4024
18211 4024 1003 2606 2444 4306 8247 9608 9867 8155 2133 3899 1756 69 -733 -223 1348 -1454
18195 -1454 -3314 -4130 -3101 -2633 -1204 2036 4024 6475 5572 2354 3178 7617 12343 9257 6532 8683
18179 8683 7228 7451 4637 4951 3696 4914 7820 5118 6716 9636 9408 9484 8968 8866 6748 3843
18163 3843 10740 17531 20536 19495 15235 12199 10495 10076 14127 18216 18559 22731 24323 23247 21334
18148 21334 20091 21693 20796 20502 25594 25990 25054 32009 33099 27858 32780 36744 34854 38213 40817
18133 40817 42470 46104 53380 59756 62578 69967 75697 79876 87995 105406 122545 138635 158136
18120 158136 184113 221696 272268 336262 416965 537945 718729 1012968 1544340 2567687
18110 2567687 4582317 8006114 10230397 8232624 4732915 2626570 1620100 1098246
18102 1098246 785030 581930 444955 353818 289949 242913 207263 175203 148080 135188 123521
18091 123521 108315 92101 81714 75686 68671 58388 46843 42900 43789 38098 34031 32132 29645
18078 29645 28915 26519 24614 25491 25452 22833 18077 19153 18300 11140 6550 4340 4412 4078 2558 6238
18062 6238 8862 10399 16472 17296 17319 13232 12047 6516 1007 959 2102 2222 3515 3358 3170 4198 2774
18045 2774 8480 10968 11088 14351 10630 6775 7851 10092 12376 13766 14774 16974 16204 15723 14111
18030 14111 10405 7023 4103 1993 812 2722 7719 11657 3892 -3012 -702 353 2592 3782
18016 3782 1110 2023 365 -371 422 1872 -402 -2818 -2889 1178 -164 2888 4244 3657 3145 8136
18000 8136 12562 16492 19919 23441 18000 14885 14404 14045 10388 10929 17675 23007 27750 31930 32973
17985 32973 33992 30046 28585 23082 15673 10648 9275 5994 2290 3465 3299 -2775 -915 2044 4414
17970 4414 4818 5404 3040 2427 254 2739 4864 4944 2023 4893 7315 6386 1658 1976 7260 5520
17954 5520 7006 9714 8218 8768 12598 16274 17127 16358 15815 12684 11669 6806 5609 11436 15717 16218
17938 16218 11483 10351 7206 5303 4187 4533 4338 5972 6106 2654 2619 5983 6784 7045 6287 8866
17922 8866 11459 10559 3560 1704 3964 6360 12274 18383 16211 13101 11546 11509 12415 16734 14563 10091
17906 10091 7797 7401 10311 7358 10381 11058 11399 8313 6598 40 1301 1451 3250 2466 1312 -248
17890 -248 194 2300 7026 4755 1479 -64 -2520 -826 2284 4543 1003 -824 749 6005 7846
17875 7846 3190 4075 7151 7508 7220 8220 8226 10194 11637 11538 14037 17825 21805 27895 36312 56454
17859 56454 94652 146144 191245 202224 166267 109640 66697 41502 29215 22760 14310 10203
17847 10203 9122 8636 6788 7500 9083 4226 2606 1738 1302 287 -2298 -2744 444 3812 3325 368
17831 368 1336 4687 5351 3179 2835 593 -2687 -5570 -4856 2157 108 1168 370 -1996 -4343 495
17815 495 3376 4834 4899 4045 6149 9939 8451 2836 -1473 -582 3074 5966 2413 4730 2592 1221
17799 1221 5246 -1823 -6093 -5471 -7345 -9184 -7538 -4784 -4067 -3310 -1053 1934 6391 8804 4029
17784 4029 900 1847 2617 2481 3562 6117 8157 6709 5950 4303 1234 -637 1167 3349 953 -2221
17768 -2221 4 722 846 697 -1187 -448 103 111 504 2620 2997 733 -743 1212 -2622 -9727 -7951
17751 -7951 -5215 -2146 2223 2963 3851 4240 1503 -512 10 4852 7277 4062 7797 11148 17109 23236
17735 23236 26816 27046 30123 33763 39913 45167 55363 63412 69314 78912 90521 101736 106771 107029
17721 107029 100739 99189 92484 82383 69816 64699 58891 50547 41884 34212 29670 26644 23685 17985
17707 17985 15658 11159 8108 9381 12536 11524 12377 12868 9274 9583 9867 5401 2309 -13 934 -1471
17691 -1471 -1004 3289 4484 5042 -631 1846 10667 14536 16503 17636 15975 20590 30810 35706 33763
17676 33763 33049 33151 33166 32070 32236 32949 34089 35174 32562 25134 21299 20391 19281 22236 25996 23130
17660 23130 20534 16673 16685 15434 8885 6805 11126 9519 9022 8821 6972 891 -1791 1670 -112
17645 -112 -2271 213 3675 2720 3470 1432 673 -1724 -1907 -3906 -4558 -1649 3213 1695 1341 -478
17629 -478 1087 287 -4029 -11869 -13227 -7480 -383 -1434 -3954 -4159 -2596 -4754 -10014 -9858 -1321 1410
17613 1410 213 -1205 1510 3665 4347 5728 3684 2688 4789 1459 -2650 -3103 -505 6653 2091
17598 2091 -10 -11 1586 3109 3432 -1294 -892 -3634 -1931 -1927 -3312 -1995 967 2102 4575 4538 4614 3511
17580 3511 -1344 -2437 -1794 -930 -1018 -3311 -3176 -3771 -2618 -4434 -6659 -5503 26 1929 5430 3358
17564 3358 -1415 -2394 343 1399 1001 3447 2505 -2365 -305 5665 1672 -2440 -1154 -4430 -6571
17549 -6571 -5266 -3426 -1488 1335 984 743 -1686 1855 -561 855 -2812 -2926 -3319 -3763 -4554 -6196
17533 -6196 -3226 -613 1792 4568 1694 1041 1599 -558 176 1669 3244 4932 5245 1993 2607 3520
17517 3520 4286 3894 1939 -1413 -4369 -6077 -192 1127 -2780 -2246 -1828 -2647 -4182 -4124 -3147 862 901
17500 901 2563 -656 -1129 -2593 -1855 -4086 -2842 -4219 -10127 -11547 -7090 -690 -4193 -8871 -4634
17485 -4634 239 -525 -1254 3398 4670 3823 2301 -15 -16 5309 4282 2979 1516 -772 542 1209
17469 1209 2976 3752 3138 688 1130 257 -5530 -3240 -524 -1914 -3011 -318 -915 -686 1783 4169
17453 4169 4883 1802 1502 5962 810 776 -2534 95 6412 11491 26666 49470 55481 39764 18834
17438 18834 12547 8754 2699 856 -1683 -3255 -304 -164 3078 2680 5644 5837 1392 2855 5472
17423 5472 3274 910 -1140 -3054 -468 70 -5552 -10114 -10408 -11470 -9789 -7242 -10503 -9581 -7630
17408 -7630 -1065 -541 1058 3299 2083 -2489 -10216 -12760 -5846 469 576 2319 2001 -112 88 -3862
17392 -3862 -4882 -1223 -1481 -3250 -4634 -1219 315 -2221 -1219 -1744 2502 -247 -1761 2204 3742
17377 3742 4753 6198 3870 -388 -6629 -8761 -7383 -6808 -8075 -7085 -7382 -8826 -5128 -2140 -3693
17362 -3693 -778 353 -6628 -10878 -4543 -3037 -1506 1094 -573 -5287 -8978 -5902 -4162 -3585 -4594
17347 -4594 -4459 -3680 1360 801 -1739 -1030 2369 4275 6305 6139 5620 2293 2855 3716 1461 2880 3399
17330 3399 2463 -1253 -4341 -4693 -6860 -3595 -225 -3146 -1700 408 1379 535 266 4335 4493 3776
17314 3776 2126 3869 4621 1789 1345 1068 -4279 -6970 -2410 1900 2284 3871 4761 3041 4497 396
17298 396 -2671 782 4395 5794 3585 -947 -3682 -2396 -1387 -2231 2748 5108 2513 -2700 -1895
17283 -1895 -1487 -604 -5736 -9263 -5444 -2493 -2352 -2405 891 1002 -4190 -1505 422 -3302 105 4211
17267 4211 3171 2177 3877 7677 9379 8662 7052 2004 -5191 -3670 -2453 -1740 -4843 -1471 -1690 -2656
17251 -2656 -6334 -8311 -7501 -7626 -6559 -8520 -9588 -9867 -6470 -3510 -4940 -7594 -9926 -7526 -2901
17236 -2901 -4294 761 4927 4921 -552 -726 1280 4412 5719 7016 4570 -4146 -6038 -2282 -390 1599
17220 1599 3910 202 584 411 -1367 -3314 -2366 -5828 -5646 -1701 -2433 -1672 -1219 -2922 -4458 -5123 -6572
17203 -6572 -2329 -2182 -2798 -5089 -5421 -5100 -2192 1257 2493 -324 -3045 -1629 -3838 -8746 -8189 -4230
17187 -4230 -4953 -6496 -6508 -7107 -4137 -2119 977 826 -3267 -3058 -8009 -6736 -3925 -5080 -4505 -4350 -5038
17170 -5038 -4635 -4579 -4380 -3388 -1749 -4410 -3568 -1177 -2390 -6516 -5748 -6824 -12662 -7248 -5006 -8190
17154 -8190 -9072 -6100 -1598 -1420 -708 -2491 -2071 -2987 -5482 -3757 222 -2455 -2429 151 -214 2774 4148
17137 4148 945 886 1503 496 -2958 -6179 -8293 -8381 -3146 991 1563 -1178 -889 -809 -935 -705 -3699
17120 -3699 -6312 -1612 -383 -594 -2263 -2118 -698 -327 1457 2029 -1250 -3395 -1462 -568 -333 -9245
17104 -9245 -11389 -7135 -4970 -3066 -3139 -3299 -1801 -1817 -1441 -3204 -6362 -4339 -2509 -2239 -1688 -830 -2770
17087 -2770 -3882 -3411 -4900 -5106 -3567 -2037 -2248 -1451 -2728 -4455 -76 -1565 -701 2102 4 -1688
17071 -1688 -5686 -2564 -3951 -5723 -5744 -6914 -5790 -4004 -6519 -8287 -6580 -595 -365 -3804 -3949 -786
17055 -786 -1816 -3964 -7093 -6205 -616 -194 -2793 -3261 -3463 -289 1775 -1175 -2908 -1611 -3548 -2774
17039 -2774 -6015 -4827 -3852 -3432 -5555 -3000 -2414 -2740 -2424 -781 -2694 -5312 -7052 -8492 -3548 -2192
17023 -2192 1379 4200 2212 5154 2810 234 -1014 -1533 -3428 -1467 -385 -527 1215 289 -2549
17008 -2549 -1220 -807 487 -1039 -2477 1863 1951 2768 5687 -1137 -2483 994 267 -1601 -2230 -834
16992 -834 -2855 -2356 -2138 -346 -1165 -4415 -7712 -5785 -3767 -4384 -6557 -3104 -4647 -5316 -5514 -7038
16976 -7038 -3047 -1488 -1217 -1164 -5980 -11969 -10789 -6656 -6456 -6846 -3462 -237 -3351 -6338 -7072 -223
16960 -223 6697 6692 6208 4758 -1878 -7270 -1941 -404 1689 2948 -1521 -2105 1030 4852 5001 1733
16944 1733 -4519 -7025 -2702 284 3188 1745 -1495 -208 2207 2338 2228 813 1007 2768 5295
16929 5295 1290 -6318 -7927 -6013 -411 4507 6021 3596 2875 3450 2439 -76 -2473 828 -476
16914 -476 -1856 926 -158 -96 445 -2467 -3841 -2507 -645 -3437 -6195 -3771 1200 918 -3133 -5986
16898 -5986 -5806 -3207 -2750 -4755 -7189 -6396 -3939 140 3332 2785 -333 -2008 -2368 -2241 -926 1639
16882 1639 1635 65 3118 5300 566 1323 4677 6178 3292 3181 6802 4420 390 -294 -3146 -1944
16866 -1944 -1586 -187 1718 1644 1533 -1726 -5546 -7075 -8258 -7183 -6866 -7495 -4336 -2207 -2561 -1337
16850 -1337 -6921 -8212 -5864 -5651 -6494 -5484 -2030 666 -1277 2271 14 -3163 -2861 -472 -1069 2263
16834 2263 4529 1597 -1496 1412 3518 3171 2021 -3275 -7581 -11313 -9225 -7542 -5668 -5658 -8475
16819 -8475 -4137 3086 2679 -3059 -5591 -2149 1118 2807 2711 -1171 -6674 -5366 -2026 -257 -2790
16804 -2790 -2593 -2908 2120 3747 4689 6597 1905 612 -1225 -3925 -6557 -5631 -4400 -2866 1527 861
16788 861 -5631 -4418 190 -622 -1938 -3665 -1874 -1071 -5371 -1792 -739 -331 -450 -1825 -284 -443
16772 -443 34 -1772 -995 -138 -1349 673 1197 1146 -21 -2956 -2637 -4193 -4101 -87 1346 2741 3258
16755 3258 2157 752 -433 855 3442 2365 2426 5990 6928 111 -5404 -3302 -4315 349 4114
16740 4114 4644 2892 3893 279 -1577 -5929 -4052 -1705 -530 -967 674 -1941 -3886 -5069 -3190
16725 -3190 -1290 -2094 -2470 247 1043 -517 2709 1943 -3621 -6137 -5308 -2532 612 2929 622 -1703
16709 -1703 -2846 -4961 -1215 6129 4342 2798 -911 -4783 -1069 -151 -716 -4532 -7454 -5257 660
16694 660 430 -2433 -490 -886 -551 -1211 -1353 -686 -2105 -6679 -10467 -8431 -8009 -5432 135 -133 -6068
16677 -6068 -3041 -533 -2769 -3454 -865 1200 -385 -415 -2162 -4713 -4771 -62 2600 429 -606 -3252
16661 -3252 -2450 2265 1223 2370 1885 1725 2329 3949 2946 -3193 -2615 -1686 -1456 -2789 205 2202
16645 2202 1793 2907 2619 205 -678 -1379 -5353 -4354 811 2870 -2666 -834 -1024 -1907 -2869 1693 992
16628 992 -3261 -2638 -4107 -5655 -4405 -4670 -10188 -4494 -1149 -77 183 -1327 -4005 -5031 -3997 -2251
16612 -2251 -4033 -5998 -6079 -5057 -2156 -1294 -3387 -4797 -7457 -4192 445 1882 -1139 -1668 -2272 -2511
16596 -2511 -4234 -3135 -68 1567 -681 -508 -2601 476 4284 -2047 -8370 -9628 -7441 -3751 -4572
16581 -4572 -1718 -1830 -4966 -4540 -226 1332 2470 -384 -304 188 -2307 -4884 -3018 675 608 550 -1132
16564 -1132 -2609 -2841 2006 1587 -1801 -4417 257 507 1860 1753 622 -3126 -5069 459 1794 -310
16548 -310 1945 3356 803 1171 2849 3494 3207 3815 6479 4272 4990 5586 3373 2582 2441 -3255 -6107
16531 -6107 -9542 -10695 -6031 189 -1238 -3532 -8274 -7230 -6087 -7982 -4153 -3361 -7928 -3867 -5150
16516 -5150 -9425 -7325 -10663 -8721 -3301 -5663 -6196 -11317 -16365 -15080 -4068 3707 4011 5862 5505
16501 5505 3982 3024 2303 881 -692 -3761 -2722 -7188 -4857 -1471 1137 207 -1290 -3428 -4928
16486 -4928 -6906 -4339 -4400 -5010 471 -139 -1140 -4091 -4010 -3339 -1839 860 3430 3658 -984 1471 588
16469 588 -1446 -3752 -5448 -1815 -439 -2231 -3369 -2264 -3283 -1293 444 2060 1415 1632 3046
16454 3046 249 445 155 -949 -1418 744 6389 5830 2168 4173 1396 -766 1463 1423 476 1447 842
16437 842 -6185 -2149 -850 -577 356 -1482 -2931 -2708 790 617 -91 -2567 -6821 -6237 -6044 -6245 -4697
16420 -4697 -5571 -5303 -4885 -3441 -2021 2156 649 -2106 -7347 -6718 -5472 -4237 -2460 -309 3398 2783
16404 2783 3622 6822 6729 633 -3487 -4974 -7491 -6215 -3256 -2303 178 772 1122 -726 -2719 -3368
16388 -3368 248 -1492 -4644 -3879 -855 3242 1492 -1064 160 1374 710 -131 3121 346 -4110
16373 -4110 -7458 -6073 -4396 -3627 -2511 -1398 3463 5051 1638 -2556 -2709 -1316 2194 4242 1467
16358 1467 -578 660 2795 131 -185 5724 6610 2799 -372 -3563 -5585 -7798 -8547 -10274 -8789
16343 -8789 -6410 -9626 -10090 -8137 -8958 -6469 -4148 -3494 -3880 681 1528 231 2524 3110 453 -870
16327 -870 -2950 -6138 -4830 1178 -2265 -5129 -3993 -6001 -5438 -5920 -5781 -5997 925 4955 2962 305
16311 305 -882 -5908 -9431 -12577 -12868 -10356 -5583 -2759 -4726 -6413 -6557 -7491 -5300 412 -67 -1931
16295 -1931 -2582 -1873 -1301 -3362 -4587 -4505 -7971 -12940 -8651 -2564 1892 632 -4216 -5953 -4277 -5474
16279 -5474 -614 -2923 -3725 -6513 -8011 -6795 -4979 -2104 -4616 -6752 -6891 -9633 -3586 -349 1945
16264 1945 4058 2993 -528 -2411 -1130 3694 4290 3662 -326 -2706 -4253 548 -828 -4356 -8772
16249 -8772 -4736 1193 3648 1974 1439 -2782 -4350 -4505 -2457 -6033 -7190 -6755 -148 -1545 -2960
16234 -2960 -1561 -556 3104 -619 -703 -678 -71 -2558 -176 -729 -5617 -5242 -3412 -797 73 -1212 -3997
16217 -3997 -3763 -4310 -2798 -7626 -8766 -6307 -5434 -3996 -5049 -8906 -9248 -4123 -5113 -6531 -5507 -1371
16201 -1371 138 -1554 -1783 -1827 -155 -1264 -1712 -2869 -5193 -4316 -806 -2563 -4916 -4920 -2732 -6344 -6929
16184 -6929 -5251 -4139 -3025 -4184 -3866 -3205 -5462 -1158 144 -3296 -3844 -354 2168 1548 -1964 -4508
16168 -4508 -8375 -10414 -5780 -4981 -6743 -4357 -4395 -2329 -4145 -2646 -82 266 -2209 397 -87 -3362
16152 -3362 -2574 -4113 -4975 -6628 -5238 -3368 -2267 -2739 -1663 -2256 -2530 -1812 -3964 -5290 -9029 -9283
16136 -9283 714 1897 -5449 -4566 -5449 -9591 -11492 -13820 -9045 -7511 -6923 -3680 -2544 -209 4440
16121 4440 3495 -3044 -5386 -5276 -3045 2483 4665 4543 3522 3950 5053 5164 3085 -880 -2136 -2617
16105 -2617 -1676 -1250 -2404 -4180 -7959 -12304 -12582 -7069 -1088 -2261 -5187 -5686 -6485 -6588 -6407 -8363
16089 -8363 -7664 -5188 -2956 -3240 -3340 500 203 -3393 -6752 -5782 -5562 -4048 -4919 -1816 1185 2757
16073 2757 1358 1144 1219 -50 -1864 -2932 -1292 -442 -2508 -5036 -6692 -4864 -3638 -4985 -8030 -7860
16057 -7860 -6370 1169 3682 619 -2754 -4791 -4582 -3451 -447 -575 -1058 -1854 1268 -105 -1869 -5456
16041 -5456 -7997 -7906 -9165 -7693 -4134 -1763 -3233 -7475 -5897 -85 813 1302 1135 674 -3250 -4036
16025 -4036 -3984 -5217 -4519 -1264 -3346 -4001 -2976 -2411 -4950 -2648 -3217 -6794 -6861 -7063 -2610 1603 326
16008 326 -2470 -4149 -4533 -2578 -116 -380 -372 -928 -3471 -8202 -2726 294 -1796 -1247 -2285 -3305 -3378
15991 -3378 -4431 -1755 -1643 -572 -41 -2779 -3887 -4526 -2934 -3850 -770 1491 2040 1504 4118 3441
15975 3441 2675 515 1470 2362 1769 2918 1712 799 200 -692 -2668 -6785 -9544 -8000 -4366 -502
15959 -502 2988 2931 -531 -3538 -5572 -5085 -7340 -6436 -4453 -1757 1138 -4948 -8692 -5868 -2596 -1522
15943 -1522 1643 4477 8521 10782 6220 3083 1759 -299 -84 2301 2292 -2200 -3184 -5294 -6693 -5232
15927 -5232 -3370 -5241 -2774 -872 5441 5680 1616 648 2616 6068 3380 978 4822 4276 4669 4182
15911 4182 7194 5435 584 4524 5945 2301 6234 3335 -319 -4587 -5744 -5549 -9427 -8309 -3856
15896 -3856 -2641 -970 3257 1659 164 -598 -2923 -4646 -964 916 -1400 -11280 -16790 -13139 -9384
15881 -9384 -3247 -3760 -3827 -3586 -4856 -6466 -3293 -2333 -4826 -3901 -3697 -3026 -2497 -5171 -4706 -4226 -5755
15864 -5755 -6563 -4394 -3259 -4922 -3076 -4400 -7695 -6435 -8220 -7443 -8376 -4303 2203 5185 1713
15849 1713 -2149 -5148 -6589 -3916 -3672 -3097 -380 4150 3326 3265 3472 6855 8101 1514 -457 -715
15833 -715 -1942 -3875 -2808 -372 -181 -3263 -4065 637 1504 -3639 -6360 -6790 -5893 -2220 -349 -745
15817 -745 -2740 -2860 -1365 -635 2978 2810 -1957 -4523 -4757 -7145 -4759 2068 1565 -1864 -2519 -5625
15801 -5625 -5517 -710 605 3014 2569 3423 1949 -44 -1449 -1783 -6467 -4539 -5308 -3775 -42 -4218
15785 -4218 -4510 -3496 -1211 1995 -1195 -2349 -5857 -8797 -6986 -5762 -3135 2606 7027 4436 -4609
15770 -4609 -4487 -2357 -2120 -3056 -3317 -1770 -1768 -4515 -6075 -5624 -1723 2586 -897 -4114 -6954 -8508 -5399
15753 -5399 -1787 -704 -1807 -932 -4965 -1739 -1609 797 299 915 3792 4393 2181 -1105 -1641 -2793
15737 -2793 -6036 -4469 -5049 -2722 -6138 -9676 -13234 -13075 -10318 -5255 -3222 -8750 -10412 -6984 -2661
15722 -2661 447 -327 -6885 -8265 -6061 -4343 -3102 -3250 -1498 -217 -2321 -4267 -4844 -7899 -2134
15707 -2134 -2033 -2387 -3642 -5348 -2401 2373 5254 2385 -1467 -4474 -3110 -4738 -7929 -5833 -5849 -5181
15691 -5181 -5876 -5866 -622 3985 3725 499 -2089 -2519 -1566 -730 -610 506 -523 -5095 -8911 -6634 -4463
15674 -4463 -4333 -6006 -7914 -5314 -7233 -6051 -6103 -5895 -4299 -1617 1750 5605 6503 3971 -160 -2353
15658 -2353 -5564 -6940 -9002 -8885 -5532 -1519 -1557 -2785 -1808 1227 -87 -1615 -72 -179 3826 7489
15642 7489 5245 812 3634 3998 -959 -4019 -3142 -3583 -5545 -6229 -8917 -6220 -3650 -2310 -1783 -1717
15626 -1717 -3937 -4345 -1490 -783 -1880 -4616 -143 2468 2912 1572 -3557 -2254 -1408 -4523 -11236 -13410
15610 -13410 -13978 -11874 -8177 -4371 -5167 402 8630 8250 5172 5110 6202 4266 -1054 -1941 1675 1193
15594 1193 -2290 -579 -3288 -5389 -1627 -3255 -5198 -7688 -9008 -9683 -8413 -5150 -3454 -3223 -5331
15579 -5331 -6266 -4573 -3172 -4381 -5369 -6059 -3820 1041 5658 7332 8660 10257 3935 1907 3563
15564 3563 140 3382 5954 5062 768 -616 -6187 -2578 799 -2763 -6716 -6351 -7112 -7588 -10439 -15131
15548 -15131 -10102 -5794 -4749 -1917 -5999 -10396 -4982 -1570 -2962 -8137 -13007 -14014 -11120 -5913
15534 -5913 -5474 -6266 -8829 -11936 -10464 -7095 -7815 -9473 -7455 -3182 -4406 -6024 -4919 -3377 -8122
15519 -8122 -11952 -14800 -5975 -509 3633 6110 6092 6631 3221 -1733 -301 2595 -422 -2038 -2355 1883
15503 1883 2238 2434 3369 -1199 -5967 -3534 -1865 -574 -1422 -370 1247 2299 -979 -3969 -6084 -8256
15487 -8256 -5920 -6639 -5126 -833 -1015 -1917 -2463 -4709 -3353 898 5788 8899 13228 8557 2879 3206
15471 3206 1417 -716 525 4355 8088 7782 7381 8269 6297 4411 -2018 -1179 1398 434 -2623 -213
15455 -213 -232 191 938 423 1131 1779 2615 1820 313 1285 3280 916 1115 3322 1493 1627 -537 2732
15437 2732 2952 -2024 -4999 -8069 -7514 -4807 -3676 -2795 -2656 -4939 -3130 -4562 -5771 -1580 -237 844
15421 844 -184 4118 7072 5567 3825 5698 4221 2698 -773 -1210 -377 3687 5586 6259 4580 1786
15405 1786 1885 6518 5771 -130 -4415 -2295 1810 1802 1834 190 716 1735 7188 7999 5196 3312 1601
15388 1601 1359 1463 3923 3163 -3402 -7109 -5605 -5378 -3387 94 1488 -3577 -2854 -1137 -3284 409
15372 409 285 -2512 -3741 -3079 -1611 -191 -230 1888 2509 390 -2338 -6917 -8722 -5423 -2718 -1999
15356 -1999 1629 103 -6539 -9320 -5845 -2980 -2227 -7734 -8119 -9627 -6902 -4399 -4002 -3779 -6276 -4280
15340 -4280 -882 1674 -1017 -4495 -7033 -3319 -810 -3801 -3935 1057 3578 3318 5167 1940 1288
15325 1288 811 2902 4400 3682 1273 -1005 196 1925 1759 192 -52 2003 576 2037 485 -380
15309 -380 -2150 1587 2305 2940 8315 10082 4595 2575 6156 9626 8036 6945 1645 -6514 -5713 -1653
15293 -1653 1185 792 1501 1077 3561 714 2318 -336 -3636 -2354 -3506 -1402 -1223 -1605 -418 -1285
15277 -1285 -1006 2137 3228 -869 -1218 55 -201 1408 -691 -3371 -2282 -1010 -429 -2117 -1754 -7784
15261 -7784 -11380 -7367 -7862 -9416 -7412 -4126 -4031 -4470 -87 787 -1882 -2265 -3285 -8681 -8593 -8838 -6915
15244 -6915 -1307 1667 1874 -2064 -1810 771 3004 1588 4357 3895 -2093 -5132 -5281 -5012 -3696 -2897
15228 -2897 1118 -1166 -4104 -2616 -469 3178 1568 -333 -966 -2351 -2267 -3117 -4933 -5358 -5760 -313
15212 -313 2185 887 -1000 -3029 -3777 -1154 3753 3941 5415 -145 -4291 -1936 2858 1952 1454 -510
15196 -510 -1078 -1826 164 -3029 -5821 -7030 -4170 -1213 -2324 4235 4724 3717 1316 -5989 -7264 -3549
15180 -3549 -3523 -6214 -7108 -7965 -4775 -1236 -4515 -8874 -9835 -5668 -1596 1226 -842 -1677 630 -1908
15164 -1908 -2013 -167 3001 2672 -680 626 3023 3069 2739 4078 3149 5113 4306 -772 -2988 -1892
15148 -1892 -1174 -2875 -9041 -10826 -9001 -5791 -4059 -2246 -454 -690 -676 -2182 143 4602 3959 4835
15132 4835 3874 2785 1263 -1992 -6169 -7210 -4082 -372 3141 1837 404 2528 1386 -558 -2534
15117 -2534 1049 6581 4116 -78 -911 913 1326 -1569 -1323 1319 -437 750 -198 -358 157 1697
15101 1697 3109 3778 2713 1041 5682 4698 4729 -2277 -10750 -13105 -7181 -3455 -3556 -4129 -4801 -6655
15085 -6655 -2920 -1822 -224 1422 1878 -865 -237 -3720 -9009 -12072 -11634 -10426 -7929 -7739 -9511 -5917
15069 -5917 -3313 610 -3095 -7209 -3598 -3812 -4931 -8077 -10243 -9846 -10824 -14315 -11611 -5932 -4586
15054 -4586 -4959 -7278 -5105 -1460 -78 -1837 -854 59 -2546 -3388 -4854 -4080 -5663 -5982 -4093 -5794
15038 -5794 -3062 -1430 -821 -1040 -1046 -280 -1515 -4131 -5298 -2471 312 2799 5 -4055 -5825 -3247
15022 -3247 -4371 -7094 -4718 2120 2332 -3325 -4461 -3140 -999 3366 4836 3531 2535 1415 -1793
15007 -1793 -5713 -8423 -6216 -3829 -6258 -6154 -4692 -3249 -639 3425 7076 8883 6416 375 -3479
14992 -3479 1751 4985 7237 10013 10843 8422 3211 -4163 -5517 -1509 38 3780 2363 532 -4103
14977 -4103 -4848 -1041 97 -4610 -7653 -5755 -7515 -9412 -6361 -2929 -1236 1206 -22 -3152 -7633
14962 -7633 -9319 -10551 -4576 144 2079 2687 -1013 -7718 -9475 -9337 -9503 -8136 -4418 -3660 -5837 -6063
14946 -6063 -3831 -3275 -7440 -9342 -7002 -4996 -4286 -4674 -6373 -5491 -1490 3255 4096 -150 -4920 -5469
14930 -5469 -3827 -1556 2226 3440 2929 -383 -3761 129 2189 1287 2423 -3012 -4571 -5957 -6256
14915 -6256 -5014 2638 7164 5112 877 -129 2523 -2134 -6029 -6786 -5646 -3434 -2659 -3484 -5524
14900 -5524 -5611 -6775 -10839 -9284 -2049 -1149 -5100 -1883 1330 -1273 75 -568 -2817 -3835 -2401 -4108
14884 -4108 -4732 -3688 178 -1546 -801 -1339 -172 303 -2196 -4838 -6060 -3898 -6278 -9702 -10784 -7946
14868 -7946 -7150 -5570 -2497 1052 1665 -1773 -5590 -3849 -4713 -4556 -4591 -2720 -1231 -203 116 791 -2430
14851 -2430 -771 2062 2654 -48 -1179 -942 260 254 -2532 -624 494 1842 2194 2155 1386 -636 -4134
14834 -4134 -1502 1650 124 -3480 172 5103 4348 2269 1838 4920 6455 6161 882 -3016 -3734 -1930
14818 -1930 -916 1371 -1023 -3266 -4577 -1285 239 -2575 -2980 -3523 -3835 -3570 -5910 -3780 1573 -1720
14802 -1720 -6596 -7265 -5269 -2284 -4730 -2091 1263 4861 3361 -901 -641 -361 -1743 -223 2121
14787 2121 3049 2278 1339 2592 600 -930 3512 3906 1242 -1571 -2521 -6328 -7632 -6036 -5030 -2104
14771 -2104 -2592 -2356 -3227 -1099 -2813 -1551 578 1335 -984 -2186 708 -509 -7028 -8128 -4775 -1444
14755 -1444 2872 4084 4384 1443 -6073 -5556 -5612 -6688 -3482 -492 -926 -1567 -205 645 114 335 3855
14738 3855 4531 4285 730 -4766 -9628 -8764 -5842 -5603 -1626 -957 -3287 -2891 -1573 171 346 1725
14722 1725 -2622 -7139 -8386 -9735 -9853 -9234 -6055 -1577 184 -906 -465 -1967 -3156 -2427 838 -1643
14706 -1643 -6143 -6228 -7307 -8085 -5998 252 370 -3234 -3557 -3937 -1644 -700 780 4302 5381 2966
14690 2966 2400 -2321 -2536 309 524 -893 -4783 -5528 -1695 4302 609 -2267 -2320 -2453 606 1119 -1883
14673 -1883 -883 1140 -1154 -377 -1283 -2746 -2386 -2154 -2193 -1089 2214 -1192 -2270 -2375 -2796 -511 3739
14656 3739 5250 182 -4113 -8390 -5136 -2411 -3467 -1774 69 2435 977 -4520 -4831 -3488 -6164
14641 -6164 -5306 -5815 -4813 -2882 -1290 -493 -24 1851 2900 2722 -1446 -2138 -59 2975 1870 -2100
14625 -2100 -886 3509 3343 -634 80 260 -1253 -1875 522 -1701 -2554 790 3497 -675 -1602 -1617 1050
14608 1050 -63 -2177 2625 3136 2617 1152 -1336 -1106 1431 457 -2979 -1927 -2102 -1731 3051 7713
14592 7713 6982 5490 2563 1310 -223 386 1821 -3532 -6399 -4272 -2796 936 2789 -4081 -5944
14577 -5944 -1704 4583 6025 3713 784 232 1291 -2097 -5873 -3112 686 -1121 157 1152 -3418
14562 -3418 -4362 -2258 -1144 -876 -1687 -4524 -2880 -2925 -4184 -1604 377 255 -1280 1758 -1459 921
14546 921 5940 5303 3805 591 -4516 -9172 -10717 -10007 -6626 43 593 -3421 -3563 -4569 -5824 -2916
14530 -2916 3384 90 -4785 -4357 -3543 -446 -1487 -2224 -4898 -8587 -6848 -2690 245 -190 -4856 -3215
14514 -3215 -836 -166 -3145 -745 -1507 -2337 796 3944 3561 3552 3645 2829 1086 -3113 -8602 -9594 -6178
14497 -6178 -2615 -1056 -1808 -4294 -4174 -4762 -7357 -12420 -14769 -13758 -10781 -5703 -2993 -4436 -6533
14482 -6533 -3842 -4628 -3487 613 -2341 -5686 -6453 -8752 -12402 -12430 -12775 -10739 -11590 -8424 -7357 -4594
14466 -4594 372 -1407 -4042 -3087 1496 166 -6315 -6219 -3393 -4475 -6557 -5544 -3244 -1831 -721
14451 -721 -1173 -2461 -660 -1176 2876 4105 -501 -2510 -120 2474 3851 4461 2585 252 907 -672
14435 -672 -593 1354 -901 -1938 -3390 -5304 -7256 -5328 -5021 273 5360 254 -6791 -11255 -9007 -8002
14419 -8002 -5737 -3935 -4865 -6304 -7578 -7534 -2856 5 280 217 -1281 331 1367 552 -2753 -1455
14403 -1455 469 -4829 -8403 -6398 -6961 -8362 -10671 -9759 -10312 -6921 -10379 -8850 -5964 -1379 -2059 -5127
14387 -5127 -6276 -2621 2739 2613 2261 -3434 -3924 -2430 -2587 699 -236 -2235 535 750 -2848 -3470
14371 -3470 -6471 -9066 -5430 -5270 -4031 -6416 -9759 -12406 -10127 -3738 -3858 -5160 -4165 -914 4472
14356 4472 3628 409 -3929 -3568 -6400 -5098 -4616 -4154 -3756 -6260 -3939 -3917 -2915 -5870 -8798 -7109
14340 -7109 -3336 -4923 -9477 -6144 -73 1245 -543 100 -241 2793 3676 734 3212 -1118 -5789
14325 -5789 -4779 -2119 -5854 -7387 -6495 -5629 -4143 -1570 110 -2172 1448 -304 326 -3486 -5478
14310 -5478 -4536 -2322 -3682 -4930 -1512 -1794 -2293 16 4228 3398 4239 3437 -1598 -6001 -4137 -589
14294 -589 3324 1244 -4898 -8108 -8472 -9036 -3375 2185 6737 5209 2243 2223 1667 -1039 938 892 -373
14277 -373 -1994 -6219 -8163 -5755 -5703 -3185 -4471 -1349 4141 7868 8082 2262 -3382 -4715 -4223 -3835
14261 -3835 -1856 -3926 -3745 -262 -1027 -4225 -7287 -9785 -2953 1178 -3862 -6534 -4958 -2172 -3008
14246 -3008 -4067 -4670 -3052 -2195 1195 -337 -3881 -5606 -1259 1023 -851 -5501 -4446 -219 -111
14231 -111 -2939 -3433 -6966 -5126 -738 -724 -5322 -5044 123 -843 2120 4359 -724 -1576 -266 -1835
14215 -1835 -2594 2454 907 872 2171 2836 6831 2854 624 -157 -2967 -2272 2870 -1027 -3973 -2473
14199 -2473 -1957 -3711 -4798 -4971 -3900 -366 -1864 -656 -2837 -1543 669 1656 3142 -322 -7083
14184 -7083 -8158 -5052 -3190 -2139 -1153 -3269 -214 -1618 -2917 -1155 -2011 -137 -1168 3293 5564
14169 5564 3926 -813 -3846 -2810 -4906 -6051 -3413 1540 3506 5034 4551 5441 3314 2540 3942
14154 3942 3799 4491 5061 3951 625 -1438 -3702 -1263 407 1841 4200 8940 8785 3844 2945 964
14138 964 4630 4524 2807 4385 -1453 -2848 -1444 -406 3357 5755 2574 3550 5075 -2650 -4302
14123 -4302 -3039 -4949 -4460 -3038 -1498 -1815 -3585 2262 2664 3198 2952 218 -1400 -1156 -1848 -760
14107 -760 2041 2398 5343 8710 6602 1211 -3368 -1777 -651 717 4199 6381 7239 9159 6603
14092 6603 7345 10034 11694 10531 11127 9918 10317 7887 5973 4439 6885 3453 2661 4650 5342 7716
14076 7716 10029 7326 6567 5901 4377 2269 -1820 80 4712 6192 6014 7194 6766 8530 8299 5809
14060 5809 5261 7733 8895 9094 7947 5549 3438 4625 6792 9190 10422 12424 10705 12933 8872
14045 8872 5101 5848 9947 14199 13999 15110 12132 10126 10997 10628 9116 5597 4827 7767 8653 9622
14029 9622 7205 8856 7616 8313 11698 11812 8215 5569 5669 7859 8307 8258 8694 4469 1290 2502
14013 2502 2603 1318 -4008 -2670 -2971 1142 6566 6950 6196 4397 4566 8527 7112 6137 3431 -1072
13997 -1072 -4659 -7521 -3870 1962 3602 7207 7108 5735 6785 8406 7993 2256 -1182 -2206 -784
13982 -784 -3562 219 175 -2033 -648 -1461 -2939 -3867 -2234 -293 3613 1659 -2850 -372 -634 -3348
13966 -3348 -1431 2635 3830 1008 -1101 -433 2159 3186 1166 2209 1307 1864 -620 817 2801
13951 2801 898 -947 454 3576 4388 5880 8648 7647 2928 2456 5234 2710 -1842 803 3864
13936 3864 5337 7685 4256 6074 7136 4943 -2307 -3466 -57 1480 -1266 3016 3203 5677 8236
13921 8236 10143 7699 3555 4126 -543 -3141 -3963 -2894 676 3991 4846 3674 -330 -4748 -3977 -1243
13905 -1243 -673 -1133 -2359 -1592 -845 391 1473 5028 676 -1171 -2680 -5708 -5338 -5412 -2447 1621
13889 1621 -642 -2483 -937 -4862 -7191 -8314 -6900 -4538 -4650 -5488 -7355 -9225 -12758 -9690 -2742
13874 -2742 447 -856 -15 4306 3482 622 488 -1575 -2479 -4799 -710 639 -659 -1391 -2182 -1770
13858 -1770 -5823 -5967 -5172 -5363 -7813 -8485 1917 8166 5840 80 -3493 -3291 1866 4239 1962 -1425
13842 -1425 -925 -355 -3379 -2037 1514 -377 1070 925 2715 2179 861 372 923 -3811 -7050 -5974
13826 -5974 -7463 -5881 -2073 -666 -2483 -1398 1842 2632 3275 2831 -1499 -3862 -1130 -904 -227 184
13810 184 586 -2978 -5739 -1807 362 2114 3491 -168 -1723 -3025 -4277 -3591 -2983 533 2132 3096
13794 3096 407 1199 1172 -255 -1246 -1726 -1570 -937 -2655 -5887 -5569 -2530 -1670 -812 -2184 -1431 -2794
13777 -2794 -4165 974 -12 -909 -3349 -4729 -5739 -2643 -1831 1624 737 -2032 1164 928 -1949 -4155
13761 -4155 -1924 -2114 542 -2941 -5543 -4252 2343 -1553 -2445 2710 3109 4125 3180 -95 -1268 -4219
13745 -4219 -7732 -5449 -5193 -4100 -3361 -8438 -11294 -6298 -6896 -6163 -1289 -193 117 1678 2991 2356
13729 2356 -1201 -4025 -6842 -7149 -3394 801 1316 -359 -1487 1779 3914 2617 319 -2629 -572
13714 -572 1184 3590 5480 3568 -812 -5517 -891 -349 -2825 -4540 -5065 -6212 -7246 -5068 -4853 -8311
13698 -8311 -8083 -7339 -8437 -8505 -3180 937 776 1427 3768 3710 -2101 -2215 -2407 -1544 -550 -447 -1631 -351
13680 -351 -2789 -5939 -6282 -4944 -5362 -3744 -1411 224 -2170 -5823 -1044 1277 808 1870 -122 -2310
13664 -2310 -6533 -9932 -10713 -7465 -8342 -8760 -5219 -3133 -1532 -2271 -697 10 -152 -1540 -2763 140
13648 140 3751 4001 1467 1305 1339 -6814 -6794 -3326 -5269 -4534 -3870 -6635 -9848 -5727 -1439 -5 -2970
13631 -2970 -2919 -3357 -3296 -2442 -1899 -718 -1104 -3533 -4375 -2876 -1176 1245 2465 -501 -3658 -3459 -5950
13614 -5950 -6042 -2203 1117 6600 5457 2825 2749 -1464 -6941 -6012 -3517 -3509 -2828 -3505 -6218 -5592 -3289
13597 -3289 -905 1925 3542 825 -3477 -1391 3466 2680 3990 2982 2482 1466 4385 2357 2984
13582 2984 3327 3077 6879 1572 -145 1639 -1144 -1060 1886 -497 -3505 -3390 109 1736 6045 5881
13566 5881 6378 2844 -339 2312 2700 1471 -2835 -4482 35 4192 -1837 -3469 -5414 -7562 -11684
13551 -11684 -8653 -7056 -6883 -4398 -2695 -864 -3825 -6131 -8048 -6617 -4308 -6672 -6677 -9314 -4614
13536 -4614 -2179 -1541 601 796 -2206 -656 -3369 -2816 1404 312 2254 6160 7205 4264 2295
13521 2295 -964 -2746 -2172 3937 2710 -328 -869 -1864 -1781 -1091 -1495 -4108 -3993 -5809 -8910 -7970 -6425
13504 -6425 -4667 -4283 -7473 -6693 -2697 -4344 -7412 -10236 -8790 -6132 -5214 -9337 -7367 -6244 -6745 -5236
13488 -5236 -4744 -4220 306 -1740 -110 751 124 -1705 -1344 932 -1088 -7205 -9785 -7429 -4084 -1787
13472 -1787 -4135 -1811 -62 3599 2700 701 1311 4941 2693 5316 -612 -6425 -9797 -6777 -5516
13457 -5516 -2066 -1184 -1425 82 2647 -414 -4091 -3619 -1390 -3632 -8360 -7017 -2531 -2349 -1480 -109
13441 -109 -3053 -1849 260 1551 3756 2224 -226 -2167 -2995 -2772 -205 1189 2214 5055 5514 6998
13425 6998 7822 581 -2171 -3095 -384 7461 6921 1996 1199 2219 3218 6851 7741 7346 1838 -2004
13409 -2004 -2559 1790 559 1130 2919 1939 1790 -597 -876 2488 4311 2350 -98 -10 -824 -3330 -3574
13392 -3574 -2041 50 2802 1486 -4228 -3094 339 -632 -835 -4705 -4883 -423 1973 2553 5453 1089
13376 1089 -939 -3975 -2976 343 2453 3164 363 1061 -1202 -8177 -12287 -8677 -6361 -5962 -4358 -1571
13360 -1571 -1328 734 1738 -163 -4067 -1505 624 -895 -5162 -3449 -2968 -6465 -7658 -8004 -5470
13345 -5470 -2737 -1253 -1482 1640 2516 -3505 -10324 -11910 -9775 -6231 -5890 -3686 -431 -1960 -4479
13330 -4479 -6134 -8994 -11410 -14292 -12723 -10224 -5967 -1283 259 -2187 1703 2549 490 -298 669
13315 669 2583 -968 -3179 -5235 -5515 -1414 -2667 -887 4327 3607 2620 2292 371 -2714 -3973 -4826
13299 -4826 -5837 -6345 -5220 -4181 -1923 539 993 -11 -3740 -6927 -4394 671 -1170 -523 1795
13284 1795 1004 -954 -1858 1264 -465 -3408 -3781 -2669 -2825 -5893 -4039 -4361 -5515 -6271 -7547 -5736
13268 -5736 -8431 -9127 -6651 -4533 -2132 -1538 423 716 -489 -2411 -1357 -2568 -2610 -7404 -6465 -5211
13252 -5211 -968 2250 1729 -1233 -3073 -3057 -318 -1049 -3774 -5968 -8358 -9754 -11602 -10817 -8003 -6165
13236 -6165 -1987 431 1776 1435 -5035 -6465 -6862 -7042 -5355 -4259 -1869 1805 2026 2611 5969 12035
13220 12035 26502 48650 71855 79162 59346 34574 21109 13567 5915 2572 3877 4986 1251
13207 1251 1739 3153 3018 -1099 -1948 2031 468 -1550 4071 2646 546 1026 1542 4053 1999 708
13191 708 1502 7089 11559 10685 9704 7261 1255 -1384 -2435 -4781 -838 1013 -1232 -1135 -408 -2661
13175 -2661 -2070 -26 -854 1232 4762 3495 1453 133 -4841 -7270 -4842 -3899 -5538 -6219 -2698 -3724
13159 -3724 -7217 -852 4422 3154 -1143 -4900 -8862 -9977 -8474 -6734 -6281 -2359 1024 4415 6116
13144 6116 2686 2487 4501 25 -4773 -3010 -3185 -1996 1497 5207 2734 1992 -279 -2080 -482
13129 -482 -1951 -4800 -5270 -2474 -1849 -3237 -4316 -3816 -1949 248 4058 7242 5959 2542 -1331 -4029
13113 -4029 -7993 -7731 -6986 -4568 -6138 -6240 -6822 -6526 -5233 -4192 2291 7051 5254 2125 391 -1498
13097 -1498 -4073 429 4074 5931 4057 3688 -1196 -4253 -1454 -2014 -8108 -10969 -10832 -7421 -5354
13082 -5354 -5009 322 5147 5490 3564 1448 1024 4835 9613 15813 28275 29376 24742 18407 15239
13067 15239 16793 14293 12342 13908 16126 18491 16575 17092 15937 11065 11885 10777 6449 6177 7268
13052 7268 3281 696 -1165 -2507 -5512 -10308 -10526 -5977 -94 2190 3383 7477 5457 5016 2886
13037 2886 520 -1176 -2219 -1529 -1983 -7591 -4750 -3697 -562 2207 -1475 -1981 1005 573 4243 3967
13021 3967 2181 -2100 -2308 856 3381 5631 8215 11278 10947 12308 9513 4875 5277 6207 6103 6338
13005 6338 6560 2675 4693 2937 -1214 -3093 -2656 -3613 -3248 -1286 -253 -1037 -3386 -3507 -5846 -7653
12989 -7653 -3150 1040 4856 7419 9144 11881 13188 10032 8097 5040 1867 -1455 -2351 -1817 -290
12974 -290 683 4302 3545 4023 6728 5928 6726 7194 2764 3498 4300 -135 -1904 2135 8898 5885 4286
12957 4286 2845 3553 9531 6280 1695 1233 2859 1213 802 1319 3599 5591 6670 4954 3483 3285
12941 3285 1308 -1872 -5786 -2832 1379 1592 -2712 -5384 -2263 83 -2686 -3443 -9081 -11014 -6988
12926 -6988 -3449 -5137 498 -1412 -3381 -5884 -11983 -8125 -4852 -2255 -748 -3257 -6545 -1709 4952
12911 4952 5460 4801 4017 2446 2165 3233 5744 4622 -33 505 2413 5541 5049 2623 527 -1387
12895 -1387 -1940 -1977 -257 1764 -1806 -6786 -6803 -3339 -1109 -3669 -5135 -5164 -4710 -4042 1066 6008 5851
12878 5851 2697 1872 -649 3325 5150 4581 2550 1293 2102 1741 939 1500 909 -1004 2578 2432 -1683
12861 -1683 -5855 -7200 -4118 -4217 -376 5826 9436 11163 11729 12538 11073 6896 3682 5726 5657 3612
12845 3612 3130 4620 4315 5376 5871 3787 138 -3347 -6007 -4224 -2186 -17 -1463 1156 4051
12830 4051 3727 6300 4268 1054 2027 1712 -2690 543 3042 2443 -2281 -3862 -4513 -5332 -2161 2591
12814 2591 5951 6674 2388 -2255 -2194 626 4607 3205 862 -259 302 -565 -3630 -2079 1081 3281
12798 3281 8486 8257 3689 1179 4121 5699 5772 6499 6179 4167 9338 9230 8573 6070 2640 3
12782 3 -1679 -392 4872 9134 9161 4905 648 -874 104 -1986 -2353 -1140 -1594 -2109 -2285 -934 -857 2649
12764 2649 4825 3189 4060 6868 6941 4855 3684 1131 -948 1388 4169 3850 10569 18062 28049 40120
12748 40120 37283 28512 19097 15999 8980 60 -3044 -1322 -557 1892 2579 1913 1299 692 -1035 -3973
12732 -3973 -2970 -3366 -5292 -8874 -4185 585 372 -1731 -38 198 -805 1828 3699 3055 3789 5323
12716 5323 4287 1820 5369 10539 8715 5903 3581 1542 217 784 4405 8279 7982 3400 -147
12701 -147 -1640 -2373 -1878 -959 -142 1881 -696 76 457 -1156 1332 3202 821 756 3236 1014 -1951
12684 -1951 -2771 -4662 -3359 -131 3552 4791 147 -4191 -2488 1129 6745 6379 2254 -435 -1294
12669 -1294 3422 8771 4863 4625 3286 3956 7952 9012 7390 3483 924 4436 8504 14384 18801
12654 18801 25042 29791 25240 12974 4532 1635 3342 943 -3211 -3331 -952 -3040 -5825 -3869
12640 -3869 -2491 227 2126 2202 5475 4573 5926 4832 5962 5979 5803 4199 -402 -874 -4168 -7547
12624 -7547 -9095 -8469 -4008 1277 5250 2947 -1076 -3138 608 2559 -750 -2818 -3961 -6335 -7036
12609 -7036 -6366 -3182 3579 6728 2482 2910 5986 4237 58 5928 7422 3686 4035 1101 -2181
12594 -2181 -1036 166 2915 5720 6586 8194 10541 12235 10812 11371 12906 19311 21970 20120 16748
12579 16748 15942 17261 15531 10605 3734 3062 3687 6229 5414 3012 4317 883 384 4710 7098 4271
12563 4271 2527 4251 5297 6779 7964 7145 6735 5677 5194 4504 5545 5801 7585 5918 4133 3714
12547 3714 3628 3115 5191 7474 3139 -1543 1279 10879 13815 11335 6929 9705 8871 8058 10270 12570
12531 12570 11444 9906 10076 10464 6442 7057 7951 6181 7774 6503 7502 11523 9087 9005 9714 10202 8643
12514 8643 9574 4547 1345 2831 5554 6266 8164 5629 2187 -1699 29 2211 5031 5477 5615 170
12498 170 -369 2498 3194 4206 7810 9911 8922 7715 12485 12915 11885 10656 11250 10725 9194 7791
12482 7791 8267 11118 14358 15432 14533 11121 12522 14661 12891 6700 8831 10716 13584 12908 12124 11395
12466 11395 8706 8570 10141 10787 11667 10448 10091 12598 8534 7224 9566 11504 13477 14783 11285
12451 11285 12115 16004 18675 21062 21634 24839 22994 22557 19006 19833 23949 23053 25889 24359 24863 25130
12435 25130 22642 20432 20997 21327 18577 20125 23919 24825 22617 19119 17637 19126 25050 27723 27511
12420 27511 31126 33849 30284 30019 31437 35545 35560 36590 42136 45119 44869 44251 46103 52239 55121 54101
12404 54101 51394 52112 59843 67303 75359 79634 85462 89873 96656 101894 111294 122311 130374 139116
12390 139116 156773 176055 197716 218125 234606 259181 282934 301226 317825 322543 314232 299548
12378 299548 277120 250742 227026 204446 184071 165549 152164 140573 131986 124118 118060 111614
12366 111614 113071 115582 111890 108032 105399 104513 112025 137555 187207 273663 418380 644805 887408
12353 887408 935085 736471 489655 319818 218573 157665 125692 105439 95450 89969 83089
12342 83089 74600 72109 69231 67216 61692 62646 61251 54517 50616 49711 49709 53698 54180 55056 59668 67043
12326 67043 69488 66150 63309 66645 69106 76645 96004 137312 208906 335869 542765 809060
12314 809060 959774 830364 565728 357949 236551 164346 125009 97610 81745 76639 74365
12303 74365 72869 66909 54858 46359 40975 35152 36819 37766 36889 30817 23823 21603 18554 15956 12596
12288 12596 14528 15136 15485 15533 16031 12663 12815 12676 6819 2471 3103 7268 12261 15137 15596 11341 6486
12271 6486 -1103 -2882 -815 100 763 5961 12937 14453 16246 19938 20018 22392 28893 33217 29141 21907
12255 21907 18685 19444 13821 9107 6405 9029 11777 12599 13173 14558 10610 7536 7047 8939 12006
12240 12006 13247 11658 7589 6693 11181 12106 11400 7655 5672 6660 7447 9422 4340 3954 2957 -1716
12224 -1716 -5065 -3837 -2951 1192 7482 11406 6984 9333 13556 16300 21384 23699 25217 18926 11534
12209 11534 10741 21361 41746 84989 143479 170396 143915 108222 86685 75306 64730 58638
12197 58638 57834 55346 50798 47432 51288 53099 48788 42923 40036 39962 39466 37687 34918 28683 27590
12182 27590 27284 22990 22588 23745 26006 29167 33399 38535 40986 41483 36305 40518 44875 46108 61121
12167 61121 98286 160938 208509 209033 179416 147976 134701 134649 138930 153431 166283 177894 181481
12154 181481 170868 160289 153194 146478 124580 99924 82219 76978 71764 69954 70158 65439 54273
12141 54273 44912 40984 42418 46751 50256 50714 58218 63500 70195 72640 72448 70119 67549 65342 64136
12126 64136 65348 75926 82717 87571 93452 102341 112461 130861 149257 168727 184276 180641 168356
12113 168356 156661 150654 152552 152771 144078 128239 113393 97144 81308 70559 60974 53864 57127
12100 57127 60095 60934 61460 54353 47892 43840 53020 65011 74264 75303 69118 58363 52326 51020
12086 51020 52367 50138 48809 49189 52395 53314 50040 52979 57056 60504 65750 69942 67839 63966 62192
12071 62192 72165 84699 100029 107790 98980 86783 73033 61906 58632 60987 62543 59979 54416
12058 54416 50674 56600 62405 68168 74763 83015 85326 81059 72834 64902 66969 68685 68936 66207 63907
12043 63907 65664 62480 54927 48526 50103 53465 54049 59307 69723 77443 91950 126940 179540 214231
12029 214231 201366 189764 193122 188835 169898 147230 127270 112455 97948 83400 75112 81431
12017 81431 100990 115631 123674 125397 121439 125732 127461 128363 128520 123050 123264 127547 127242 127948 132933
12002 132933 133935 135454 136394 131292 124987 125859 133634 147980 164639 190864 238826 292824 304242
11989 304242 269194 253912 252945 249679 245837 238504 226542 222851 219999 218650 226678 237138 242023
11976 242023 246421 251226 250584 250372 255791 260272 266933 271441 279157 283973 294343 310338 326257 337755
11962 337755 353236 358301 348255 343759 350639 360784 373578 395961 414662 429165 445161 453906
11950 453906 466709 480079 492464 524099 576589 620564 641864 646755 658967 677718 694601 720293
11938 720293 769952 818234 865020 920588 984523 1054393 1118767 1183133 1247764 1316451 1406043
11927 1406043 1518696 1664422 1836101 2015267 2219409 2462138 2746020 3073207 3498397
11918 3498397 4119638 5048899 6370852 7941783 9209026 9943559 10587154 11735352 13786810
11909 13786810 17002934 22058823 30405738 44649662 69202145 108733505 154622002
11902 154622002 169405478 137358859 90877821 58038782 39100491 28036917 21137698
11895 21137698 16677823 13833500 12133925 11227663 10850496 10421357 9317614 7822463
11887 7822463 6606879 5819316 5307409 4984917 4828882 4806750 4890532 5089483 5468970 6139838
11877 6139838 7192826 8611286 9965927 10766285 11268858 12107519 13761677 16507142 20810597
11868 20810597 27796147 39610999 60051206 94450508 142276221 175299475 159568746
11861 159568746 112522607 71709600 47044146 32816082 24142090 18562297 14909900
11854 14909900 12620661 11297669 10656483 10251576 9321758 7741657 6184441 5041920
11846 5041920 4236538 3630320 3160259 2802906 2526454 2298953 2105707 1950822 1810974
11837 1810974 1663196 1515603 1383840 1267719 1175263 1101912 1039193 988492 945942 908884
11827 908884 870696 830924 795563 740119 684695 649950 631442 601112 551499 511863 494988
11816 494988 484584 469766 447221 426484 410243 395787 387244 383619 377773 365888 348927 322138
11804 322138 299265 283804 278009 276696 275892 278545 282062 276967 264491 251833 244905 239351 236984
11791 236984 227715 214818 204290 195928 195828 200439 201652 193870 179433 179591 183425 182172 180858 199726
11777 199726 237957 260891 247714 225665 213372 204684 198112 193187 187240 182419 174824 163810 153534
11764 153534 144430 136998 132312 129078 122844 121596 120019 115572 111216 104743 103291 105056 108579 110811
11750 110811 113946 117955 126418 137103 139554 135153 124442 109152 103080 100779 100201 111258 149018
11737 149018 178926 176212 151798 134307 123529 109485 103456 106265 107680 105919 101684 101741 99530
11724 99530 94072 87004 81325 79077 78498 76619 76264 75342 70377 63111 52778 48363 55651 70102 72899
11709 72899 71886 75239 78945 78276 71701 70816 67732 63982 58610 53059 46445 44797 46902 49966 50864
11694 50864 47739 41905 36723 36726 41681 47982 48992 49271 47524 44446 39643 38052 40137 44968 45654 40995
11678 40995 39918 36398 26252 13783 7402 9742 15867 26915 33702 34103 31327 32183 31298 24406
11664 24406 24796 30245 30041 27549 27789 27175 28624 37230 40395 39210 39567 36229 30928 31250 42986 52782
11648 52782 48353 31921 15030 11457 9693 9367 12868 17088 18461 13905 8837 5815 -1282 -4027
11634 -4027 -4611 -2003 2716 7939 12257 11703 17334 23482 22909 17863 12856 10366 5293 548 -973
11619 -973 -1136 632 2636 -1124 -6730 -9355 -10059 -6353 60 8562 14558 7604 -6489 -19815 -27697
11604 -27697 -32626 -43952 -70540 -99322 -99825 -58152 -10509 11148 18634 18874 15944 20527 21301 14670
11590 14670 10115 9504 6746 7900 10614 11179 10080 8603 9619 6161 6100 5193 -691 -10162 -8504 -3964
11574 -3964 -5700 -8646 -10049 -8407 -5869 -8249 -15232 -19379 -23470 -28378 -33485 -50492 -78939 -94232
11560 -94232 -65056 -6975 31061 42606 46262 46840 44487 37988 30582 25005 19202 18820 19663 24434
11546 24434 23448 26627 26660 27132 26625 23032 19742 17143 14588 12519 15501 18629 23083 23605 21653 15294
11530 15294 10392 9960 9139 11923 16539 22177 24053 23890 21539 26967 33208 35119 35043 32845 29726 28873
11514 28873 27136 23704 22427 19071 15048 13033 12530 15524 12438 7293 9093 10534 12406 11022 11359
11499 11359 12367 19066 25314 24515 22214 19672 15858 14189 9910 9899 17963 24376 25363 20787 24155
11484 24155 28795 32470 28565 23631 21859 22412 20221 14170 14569 15381 13789 11728 5452 1755 516
11469 516 -2951 514 5486 11027 13847 16102 15796 11955 12433 12726 17742 25495 38734 48716 55941
11454 55941 63068 66286 75463 90785 109993 140743 189865 268254 406768 619276 864188 942584
11442 942584 765259 509614 325583 221691 159784 118295 95487 78850 64256 51416 39359
11431 39359 32977 27520 21983 21943 27207 30339 28287 29033 32071 33837 34067 33459 36814 44093 53710 61388
11415 61388 63140 63306 70184 81533 98836 129082 171205 235080 348786 535679 793098 980223
11403 980223 897356 637494 410699 269321 189502 142680 111064 90909 80164 76599 75034
11392 75034 72757 63934 53900 48626 42762 39533 39626 44137 45235 46467 52885 62273 62573 59913 57273
11377 57273 52683 46629 47570 42780 33322 32356 30824 26621 22856 18355 19192 22510 20565 17678 19742
11362 19742 19347 18253 17620 19956 22855 20809 20141 20191 25433 31417 30621 29386 33899 37715 40734 45717
11346 45717 46312 52296 62908 69596 78457 86514 87861 89298 91123 91344 92481 89776 83424 78169 72739
11331 72739 66270 65360 62916 58278 55994 52883 46432 43926 39142 34552 27947 25451 28485 30016 29196
11316 29196 31107 30781 28369 27098 24546 24300 22454 26249 24671 21589 26641 34268 36792 34285 38185
11301 38185 42517 46753 48601 55398 57439 57217 56428 57242 54030 47563 44320 38039 35470 31441 25771
11286 25771 20321 19256 24103 21655 17425 14683 13227 9826 3819 7677 10682 13335 15744 17907
11272 17907 20235 22188 19814 15380 13305 13167 9941 9715 9516 9691 1256 2408 2346 -307 1670 5550
11256 5550 4413 644 698 3177 2648 2442 1945 -2286 -3122 -1512 -757 -3989 -3766 -1860 671 3103 2285
11239 2285 61 -2132 697 1586 -176 1198 -2858 -3319 -3619 -2365 750 757 1377 -1313 99 3170
11223 3170 2317 3150 -1298 -4459 -5200 -4015 -4826 -3322 -4377 412 -249 348 2470 647 -4861 -11642
11207 -11642 -12349 -8859 -7158 -6819 -5940 -5123 -7342 -6694 -6718 -7612 -2742 -1496 -5166 -8699 -7002 -8588
11191 -8588 -9667 -11299 -12707 -18534 -21103 -23547 -20075 -17835 -16651 -11932 -7443 -5508 -7577 -9498 -10925
11176 -10925 -10217 -8207 -5255 -3154 -8926 -12275 -11385 -10122 -4548 -2705 -3391 -591 0 -4414 -5218 -8533
11160 -8533 -8526 -8843 -7871 -1721 4161 8456 8948 14277 13464 12053 6536 4443 6895 5845 2598 -21
11144 -21 -4397 -3760 -3865 -7819 -8825 -7951 -6625 -4349 -4245 -4911 -5244 -7119 -9845 -10678 -11738 -12679 -7157
11127 -7157 -7425 -3991 -2245 916 95 1097 3483 -1908 -3769 -3739 -8285 -11701 -15620 -13375 -5005 1195
11111 1195 -1019 -4493 -1304 -252 -1346 -1406 -2455 -5576 -10400 -12712 -12958 -10767 -9412 -5174 -8534
11096 -8534 -6584 -3682 -3715 -4741 -9359 -8211 -3627 -4450 -3751 -4742 -6415 -8212 -8877 -7989 -8679 -11258 -9320
11079 -9320 -7248 -2921 -6593 -5129 -8155 -10650 -7665 -5535 -5908 -3299 -4386 -4894 -251 2224 3997
11064 3997 3037 479 -3983 -6208 -5744 -2937 -1984 -4733 -6235 -9592 -4410 -2055 -7268 -5625 -1342
11049 -1342 -139 -1102 -5225 -7361 -6118 -2382 -3300 -5529 -3927 193 205 -943 -7869 -11210 -7150 -1093
11033 -1093 -4395 -5736 -2856 -3428 -5576 -7531 -6007 -7249 -9994 -5726 -4945 -2195 -1024 -2495 -3625
11018 -3625 1164 -1501 -7706 -10667 -10629 -12859 -10983 -9982 -9509 -9282 -4181 1001 3104 1315 -935 -2961
11002 -2961 -406 -2803 -5848 -6560 -7645 -10279 -8277 -4038 -1406 -390 -3257 -5931 -6962 -8540 -5177
10987 -5177 -795 -354 -4780 -6180 -6740 -1999 -2683 -4706 -6679 -7315 -7736 -8773 -6739 -6595 -5099 -3933
10971 -3933 -952 -88 2845 926 -1979 -6254 -5874 -1893 -161 -2152 -5783 -4254 -3069 79 900
10956 900 -4856 -9407 -13509 -12998 -12769 -10009 -8445 -8597 -8119 -5891 -6671 -8125 -6903 -4974 -3388 -4358
10940 -4358 -4188 -5417 -3895 -1597 -1727 -4690 -4795 -3391 -2506 -3882 -2615 -3035 1452 2386 -2910 -5249
10924 -5249 -8047 -7495 -8292 -8511 -4397 -3437 -5498 -4893 -4845 -5471 -5626 -7957 -9803 -9171 -4589 -1842 -3215
10907 -3215 -4022 -3961 -5076 -5075 -4919 -4680 -5695 -7211 -9753 -12443 -14041 -12598 -11389 -10834 -9032 -7997 -8639
10890 -8639 -9603 -9394 -5991 -1510 1273 -2177 -9130 -11222 -8792 -1564 -722 -8613 -9340 -8179 -7341 -9221
10874 -9221 -8680 -9141 -5227 -1407 -3077 -8633 -7460 -3705 -5349 -8671 -5351 -1085 760 -3413 -1912
10859 -1912 -686 -969 -2151 -5263 -5537 -3006 -616 2732 -1257 -7081 -9950 -10653 -10989 -9970 -9347 -5816
10843 -5816 -3254 -3377 -5990 -6476 -7666 -9131 -7391 -5671 -5665 -3758 -3252 -7662 -4898 -2515 -5649 -6804
10827 -6804 -2882 -3035 2660 6983 10717 16234 23322 28595 32607 35923 40583 41631 33557 22853 14582
10812 14582 9380 3908 915 -4012 -3959 -2075 -1085 2755 2953 6733 9282 10871 9878 8953 5006 -847
10796 -847 -483 -436 -3102 -6377 -8066 -9176 -7374 -4443 -2969 -2187 -3 2704 2168 10294 15825 12754
10780 12754 7691 12342 21364 30472 35358 48929 62941 75993 92610 99538 102821 102576 99067 89814
10766 89814 70515 55773 44099 33714 27868 21125 19448 19542 18286 21527 28769 39776 52473
10753 52473 64339 70900 61221 42920 28493 17096 11596 8347 4396 3279 1975 -2044 1497
10740 1497 1488 721 24 321 -1523 1024 386 1075 6686 14161 17016 22551 31033 41312 54763 71754
10724 71754 83237 90536 93537 97571 94644 83835 69579 52952 39024 31561 26418 18515 13100
10711 13100 13642 11943 14671 21558 32195 40807 50112 57664 55991 42487 31702 20208 15928 9983
10697 9983 2687 2667 3976 1342 2209 3358 -125 3277 6583 4478 2651 4035 1509 -4512 -4297 -1766
10681 -1766 -142 2138 9732 16482 24882 26638 27896 32480 32848 30802 29053 23216 21268 19824 13435
10666 13435 8468 11400 14739 29034 50624 78102 91895 80522 56286 40151 34421 27664 22210
10653 22210 16790 9392 3977 -650 -1164 2172 3983 500 1688 1169 2326 1946 3420 7160 5089
10638 5089 -1285 -6893 -5413 -7237 -15757 -16892 -10502 -3676 -572 4193 7474 6138 4822 2403 -563
10623 -563 -2768 -3840 -6436 -3257 -143 2463 4836 1380 -1923 -1826 -254 -709 -3206 -750 -3039 -5647
10607 -5647 -5094 -7666 -7493 -5493 -3193 -2643 -5371 -8765 -9619 -8675 -4838 -4441 -6457 -9690 -10677 -11264 -10064
10590 -10064 -8371 -9090 -8805 -3499 -1811 -5656 -10225 -8084 -7933 -8884 -7195 -5908 -3553 -2958 -5883 -4877
10574 -4877 -2638 -4185 -9056 -8821 -7983 -5739 -9195 -11730 -10035 -7093 -6322 -8941 -7803 -8596 -7389 -5084
10558 -5084 -6732 -7811 -5662 -551 171 1911 127 -1913 -6222 -10018 -12146 -11710 -10202 -9113 -8975
10543 -8975 -8032 -7776 -6343 -6088 -3124 -2860 -2304 714 2909 4502 2464 -1387 -2237 -1653 -3330 -4097 -1863
10526 -1863 -167 -3886 -7238 -8948 -7476 -7775 -5879 -6548 -10685 -10757 -8032 -6138 -7219 -3590 -5698 -3031
10510 -3031 -4170 -3361 -1514 -4192 -1180 -4594 -6515 -4764 -4605 -4914 -4133 -4445 -6399 -7841 -3215 -1169
10494 -1169 -780 -400 -1446 -4257 -2627 1009 -983 -4415 -3577 -4941 -8238 -8405 -6961 -7776 -4048 -2767
10478 -2767 -626 -2474 -5063 -9795 -9191 -5694 -2142 -2700 -5445 -5155 -2086 -3117 -4861 -6593 -8378
10463 -8378 -8580 -12037 -11190 -8408 -7239 -7826 -2964 -4223 -3609 -1791 -993 -1732 -4879 -9827 -13816 -12729
10447 -12729 -13347 -11190 -9713 -7801 -4908 -7352 -10535 -12573 -9210 -5267 -3609 -4682 -4560 -10830 -10940
10432 -10940 -13831 -13162 -10550 -7444 -3909 -2101 -3953 -4291 -5544 -2453 -1 -798 -6268 -6104 -9409
10417 -9409 -10048 -10135 -6923 -10237 -13230 -11062 -8712 -11040 -9577 -8358 -10568 -12084 -8738 -3631 -4569 -4789
10401 -4789 -3751 -5557 -5193 -3748 -5516 -5687 -5456 -4099 -3832 -3958 -384 800 -1904 -1383 23 -773
10385 -773 -2401 306 2890 -411 -1336 -1380 3102 1775 -2708 -1835 -263 -2811 -2001 -840 -4305 -4900
10369 -4900 -2971 -526 2510 4289 -1407 -5934 -5778 -8383 -8112 -8687 -10223 -10016 -7327 -6837 -4591 -2318
10353 -2318 -4356 -2828 -1440 -5488 -5106 -5816 -5415 -8715 -10837 -10448 -7397 -4150 -3821 -5438 -5945 -4978
10337 -4978 -4197 -7797 -6777 -4610 -5857 -2703 -6013 -8536 -11939 -10805 -4563 -476 -3116 -7781 -8507
10322 -8507 -4363 -1622 804 -1399 -2943 -5592 -7787 -10036 -5708 -1803 -833 1966 765 2422 5120
10307 5120 5378 6099 131 -2425 -57 -621 -2879 -7710 -9135 -9054 -5321 -3945 2751 5919 4605 9961
10291 9961 14727 15793 16007 19877 16714 8602 1819 -847 519 291 -882 954 -1149 -3939 3600
10276 3600 9915 12556 14566 11572 5522 3407 2708 7263 5328 630 -43 5014 9357 7862 7856 7358
10260 7358 6872 5578 8210 18368 24034 25047 19447 18419 22053 28796 35464 45435 51166 55554 56522
10245 56522 55074 49971 43889 33160 23929 18323 14487 12471 10643 9451 9437 13859 18593 18823 19775
10230 19775 14440 12223 8879 7097 8187 6029 2932 3857 3726 3967 5145 5850 5382 7450 10302 16117
10214 16117 20427 28257 30517 35871 47818 60312 74578 91103 104244 111102 108824 102572 91300
10201 91300 75441 64949 50066 33792 23203 16821 14900 17230 19585 21113 22756 20308 12336
10188 12336 8730 9767 12666 13689 14046 14058 11581 10401 10664 9506 6652 6085 9120 9407 12667 17036
10172 17036 21410 26770 37235 52253 70669 86728 103153 124186 135838 139651 131940 118199
10160 118199 102075 81934 59657 42656 34630 27560 24054 18648 13846 10486 8263 6344 14319
10147 14319 18539 16180 16880 18471 17091 17575 15876 15533 16557 16966 17843 19624 19813 22914 24609 28189
10131 28189 28143 28054 31742 42349 48854 59866 75485 94058 112723 123466 123752 117938 103132 82013
10117 82013 61498 53168 41764 34567 30987 27059 18973 16224 19014 17520 15995 12102 16480 22287
10103 22287 22793 22538 23872 26497 28483 29863 25625 24770 23018 22736 25278 26727 25105 22772 23609 21906
10087 21906 19420 21407 29048 37348 47409 60692 68327 71841 65387 58345 47429 32762 27867
10074 27867 24645 20534 20329 14569 11158 11653 10260 12773 15625 12155 11910 17931 22821 27319 33819
10059 33819 35596 37751 40455 42632 45879 40576 38828 36724 34368 37702 36147 33889 32264 26817
10045 26817 21712 18511 21073 30415 39496 38642 40325 40680 40097 43016 45517 40395 41302 48737 53098
10030 53098 63141 82010 107789 160602 270173 481077 807644 913811 649201 362550
10020 362550 220860 159070 123935 98137 84986 77854 75621 74648 69394 61684 53872 51925 51841
10007 51841 47605 44760 44310 40039 36024 29434 26562 26001 26014 23139 21299 23566 22200 22115 19298 19709
9991 19709 25098 25444 23608 21559 22520 22504 22391 28258 31479 29706 25991 27354 28875 27087 31574 30789
9975 30789 33514 33848 36500 38706 43940 45911 53223 55198 54137 49556 45852 37751 39591 41085 40559
9960 40559 37011 31177 33378 35459 34251 33977 37820 38604 38386 39321 35153 32991 33126 35025 40325 42005
9944 42005 38006 41233 45687 46026 46627 53188 59728 62443 65303 73592 82112 86681 96855 115926 136764
9929 136764 169220 215475 274418 357565 454253 517686 497925 412339 317459 249137 202806 173005
9917 173005 148297 133618 123771 117597 111432 110142 110519 109903 113405 117961 118090 116780 120734 129095 135926
9902 135926 141376 153204 161500 179023 197275 214767 240337 274481 315796 365830 424826 493878
9890 493878 589485 729795 943548 1249028 1656880 2105759 2504018 2845776 3162269 3267424
9880 3267424 2938178 2321062 1732399 1303776 1012863 820410 698321 611203 553705 515587
9870 515587 484518 464182 448310 434911 422648 413683 409859 417030 427509 446640 469824 498501
9858 498501 541680 603736 674750 758037 863911 996308 1154289 1341770 1583631 1906884
9848 1906884 2356382 2981794 3807922 4838708 6096672 7598485 9071907 9985131 10213856
9839 10213856 10023100 9319766 7851655 6022835 4477594 3400842 2690360 2215151 1889180
9830 1889180 1666535 1505702 1386637 1290094 1210720 1147002 1089736 1039785 1010152 1001537 1013176
9819 1013176 1040068 1084039 1147753 1238286 1360732 1517006 1710709 1948351 2234356 2592693
9809 2592693 3040128 3614717 4383582 5413607 6777724 8580254 10870228 13473816 16101366
9800 16101366 18554718 20308296 20504370 19244266 17256848 14660832 11599833 8750547
9792 8750547 6608264 5157152 4190515 3532203 3075062 2747479 2497865 2290213 2110693
9783 2110693 1952461 1822795 1712907 1634812 1588542 1576271 1595180 1645375 1726287 1843101 2003450
9772 2003450 2210999 2478071 2808797 3215496 3716961 4340736 5149131 6221381 7662797
9763 7662797 9592946 12088898 15132890 18543579 21773399 24350342 26025585 26040698 23958357
9754 23958357 20669692 17115891 13536105 10300803 7829945 6131614 4987354 4204323
9746 4204323 3648876 3237225 2911834 2643011 2405195 2195625 2017414 1870778 1756967 1682593
9736 1682593 1641825 1633754 1657959 1714208 1804053 1931704 2105550 2334387 2613065 2959123 3391320
9725 3391320 3941675 4653230 5597659 6885091 8624911 10839070 13491577 16468937 19262988
9716 19262988 21106019 21782797 21265883 19222620 16071572 12783862 9857088 7493898
9708 7493898 5764495 4573277 3761481 3198741 2795143 2481625 2225368 2003545 1804759
9699 1804759 1626788 1475662 1351917 1254942 1187921 1146304 1127484 1129308 1145952 1179723 1237833
9688 1237833 1325896 1434442 1570211 1742352 1964695 2258529 2652782 3168786 3858747 4818431
9678 4818431 6105394 7670591 9334596 10837341 11742237 11791625 11041709 9532894 7594431
9669 7594431 5781727 4360149 3329864 2613425 2120257 1783172 1541142 1358184 1212918
9660 1212918 1091960 978317 874470 779867 697090 633151 583065 547376 522267 502270 490341
9649 490341 488945 492859 501368 523284 556066 598121 648397 711312 791518 904790 1067030 1293935
9637 1293935 1595925 1984224 2486136 3123983 3756952 4023500 3776394 3217020 2562320 1952138
9627 1952138 1469024 1120019 881415 721064 612673 534021 472367 424788 381549 342001
9617 342001 313449 282286 252910 225141 205421 193503 180272 167911 161235 154706 152463 149299
9605 149299 146232 148232 151016 157971 162244 169059 175462 188487 204966 227284 269278 334561 432063
9592 432063 553091 648374 648081 548540 424336 319334 244336 194062 158954 139229 124318
9581 124318 111025 104770 98300 94816 92094 86352 78651 71519 63909 61101 57278 56003 51734 50127
9567 50127 48500 51675 51022 50004 48752 47229 47834 50529 50274 43699 45663 42679 40018 41502 40855 39204
9551 39204 40362 38476 31450 27432 28579 29619 26946 30413 32693 32434 23414 17118 20402 28008 24583
9536 24583 26385 26653 27786 28551 29537 33522 33711 33116 34204 33415 38000 46980 52294 42590 31238 28780
9520 28780 27705 27046 24718 22963 19495 20570 19556 23012 22848 17321 15424 15689 15712 13811 15751 19163
9504 19163 20026 18606 13139 10039 4215 -4334 -5987 -1377 1777 7512 13452 14396 17369 16917 22745
9489 22745 26892 26972 32740 36534 39726 44388 55425 67157 64709 52206 39989 35726 25283 20164
9475 20164 21051 24185 25224 28372 27773 20912 20251 26907 33772 33086 27137 25209 19008 12141 9077 7471
9459 7471 3331 792 1213 -1858 -4208 -5956 -264 8754 11268 13674 20516 24732 28647 31001 32722
9444 32722 30183 30427 35288 38543 40045 40349 37640 34986 33988 34948 37035 37738 41289 51032 58333 65221
9428 65221 70665 67991 59382 55843 55044 49417 39978 28342 23118 17093 12941 14235 11500 9795 6277
9413 6277 3195 7967 15869 23614 29424 28354 30339 35898 38033 44479 47884 51221 58203 64085 66368
9398 66368 68663 68948 64305 60867 64064 68022 64601 68759 83243 95764 112610 126282 139327 146646
9384 146646 143327 132255 121296 108144 88914 68303 50088 39991 34135 27785 25828 20456 22876
9371 22876 26819 27854 34799 39119 37730 42986 47688 54813 62457 63521 69246 79104 87821 94890 99917
9356 99917 102969 102912 102178 101238 97458 94814 95259 101785 111219 124706 141216 155123 160409 164092 158333
9341 158333 145245 130722 111013 89254 72923 60359 52435 45730 40488 37873 37113 33722 26692
9328 26692 24327 31400 33844 33527 34098 37940 43952 49562 54058 58225 61015 68313 74359 78718 83887
9313 83887 86228 91140 93966 98860 105158 108990 112540 119037 125669 138016 147275 151306 149155 140604
9299 140604 121109 102092 83806 62639 49043 45452 43980 41009 38545 35734 35537 34672 34952 33999
9285 33999 34544 35328 34061 32887 35143 37790 37654 41114 42416 38716 35705 38212 37792 41386 46978 50499
9269 50499 54137 63547 68782 71734 75229 82462 88196 93226 97823 100096 97738 90553 81318 65614
9255 65614 51212 44561 40473 35833 35999 42189 44885 44659 46859 49484 50509 47388 43232 37501 32703
9240 32703 29110 26049 26891 29838 31119 25686 23437 20379 18623 24079 25630 27431 25533 22839 24866
9225 24866 28839 32576 32775 36047 39462 39938 43823 46670 44666 35997 30489 25625 26431 25685 25468 24903
9209 24903 22013 16642 14557 12695 10945 10846 11922 16118 17295 16736 17177 16464 21542 24207 24820 21724
9193 21724 18891 19471 18486 17500 17356 19922 21850 19368 15055 11808 6990 6865 9315 9811 8975 8279 10013
9176 10013 15176 17946 18652 14327 13710 18973 20856 20811 16727 16718 14468 12620 9259 10831 12977 12360 11896
9159 11896 11812 10768 13818 16636 19466 17906 16457 15577 13850 17285 17594 15643 14182 14125 14388 17460
9143 17460 15926 16196 20359 21041 21288 20546 19683 16679 16189 14280 12723 11228 10279 10432 14952 15501 13940
9126 13940 9074 10921 11652 14189 14092 14877 15819 20395 21267 19995 21978 25473 21771 22480 23664 25179
9110 25179 26432 27075 30133 28725 22956 19827 21360 23036 25066 25513 29845 37058 40299 41496 42109
9095 42109 40960 43935 51220 57366 55492 55172 66469 72361 76752 84694 92911 100244 111251 126803
9081 126803 149403 174666 201906 240040 294721 364951 457701 582304 765024 1045302 1473141
9070 1473141 2113175 2944247 3678795 3791909 3191428 2350723 1663698 1194727 884725 672108
9060 672108 526011 424714 352157 291309 245601 210448 177621 154008 137418 127643 114213
9049 114213 99019 88346 81218 74569 69184 63215 62466 61019 54258 45768 39314 38534 38821 36055 35436
9034 35436 33389 28022 27277 25770 27084 30389 30367 27829 27333 32487 31579 32221 31978 28273 21359 23055
9018 23055 22805 18167 21553 28507 25047 19637 16928 17999 16402 15205 18065 13666 13093 9662 11493
9003 11493 11108 9181 9392 10480 12412 10903 10455 9442 9859 12708 16181 17266 17450 14612 12093 11247
8987 11247 10166 13028 15519 13740 11993 11378 7130 6883 10933 13708 17378 20159 20128 21415 22150 19604
8971 19604 15079 16688 17687 14880 13319 12578 12964 11914 11832 13549 13761 11821 10147 13984 13248 8651
8955 8651 6101 2399 2068 2984 709 6150 6049 7553 7544 10103 8345 11575 14268 13300 13213 13390 11669
8938 11669 10430 15793 15706 14702 10239 8679 11462 15541 11349 7919 7740 9213 11823 8290 9148 15527
8922 15527 18420 18212 14965 15839 18914 14638 15634 20189 19458 19553 21018 19888 15616 16655 15342 15217
8906 15217 15876 17859 17917 15948 19284 20466 18860 16109 16680 16591 14676 13636 10260 13828 14195 17108
8890 17108 15724 14170 11901 15185 20128 22362 22301 24363 19641 17666 20846 23800 18758 17500 16242
8875 16242 16391 20181 22197 20784 24017 26464 26482 22776 20654 19331 19288 23041 28384 27905 27908 29924 28434
8858 28434 25723 27008 29210 27063 27931 26369 27152 33367 33075 26830 30518 44378 62005 81593 107170
8843 107170 150221 222871 311430 358625 316147 228192 155431 106861 79331 62115 53143 45580
8831 45580 39183 36728 35206 33818 32513 33451 33001 29134 28288 28042 26150 23890 21503 21903 16329 15498
8815 15498 16725 19533 19559 18965 23666 26800 22192 18840 19459 25652 27284 24691 20213 13852 7276 11544
8799 11544 13694 9736 4397 5826 11094 11559 13735 13703 16602 19268 19507 22662 28047 34304 32474 32384
8783 32384 34467 34219 33798 39215 51466 68411 90442 115292 131087 123632 100650 77608 59552
8770 59552 43439 36227 29534 27398 26677 29181 32590 39025 43547 53239 59814 59450 54225 46085 39238
8755 39238 34676 27464 21115 25509 29461 30235 29734 31196 34455 31023 29896 32004 35570 40095 44505
8740 44505 53417 57128 63310 77655 93336 117867 134102 127726 105509 80604 64715 51952 38338
8727 38338 33571 33447 34464 35050 36698 36119 38684 45153 43793 41639 42118 46113 49343 52459 60942 60657
8711 60657 55247 48393 41870 37853 35677 34961 36530 42945 44052 44688 47409 50271 52951 53588 49713
8696 49713 47008 44327 39926 33309 35531 36188 33346 33226 30161 27511 26052 24302 26094 27924 31302
8681 31302 38447 40833 39922 38873 42361 47578 51164 58092 64879 76208 79037 73788 67511 61435 55095
8666 55095 51021 36028 14516 -10304 -30452 -30654 -14243 -3038 4096 8164 11660 23016 34799
8653 34799 37621 42441 42577 45388 50512 53591 53738 48982 49208 49249 49559 58688 70371 90786 118360
8638 118360 142733 151013 140433 131182 121144 101528 88857 89737 86136 80645 76383 70830 67186
8625 67186 58671 49127 41248 32646 12143 -8416 -6372 22130 52341 66079 78115 89806 107452
8612 107452 127536 146006 161914 189214 231318 291986 384343 529666 774343 1173608 1755999
8601 1755999 2398386 2791849 2698595 2197209 1583199 1102093 801222 614624 492771 408085
8591 408085 350995 319361 312339 329524 362706 385379 369405 318199 263636 219075 188935 173268
8579 173268 160066 152542 156266 164539 167538 171123 181602 195308 215212 243928 264196 270077 268129
8566 268129 275795 306782 363897 453016 616179 907816 1372625 1957032 2432777 2528518 2179848
8555 2179848 1601385 1066137 698152 480686 353225 276285 225108 194250 178135 166302
8545 166302 157991 152999 162989 186508 220779 288678 399705 483315 452890 344311 243870 178869
8533 178869 140979 119098 102945 82871 65313 52068 46296 52464 65029 88486 131109 189644
8521 189644 221676 218729 229190 275949 290408 223256 139282 86673 52994 33694 28573 48463
8509 48463 115804 254169 405925 472426 426961 342307 279404 238593 213251 192245 181744
8498 181744 177232 177044 177271 178104 181699 193729 222994 266261 301435 300798 257751 203094 164887 140666
8484 140666 125042 118677 123566 146324 200928 272333 283579 232136 186284 174967 185521 196686
8472 196686 183281 155018 130970 110810 111575 150576 252302 403127 519779 544463 507377
8461 507377 491814 510382 540972 573187 552786 470888 385781 314905 265157 227004 196104 181376
8449 181376 179594 184828 188837 180390 168395 159574 150591 138838 126234 117032 115564 123030 133141
8436 133141 146576 159319 170196 176508 175591 169450 162664 160251 156853 156800 160161 170990 174624 178004
8422 178004 186815 202070 228979 278268 340243 404829 463366 481579 429568 347429 274742 219751
8410 219751 176088 141987 122117 117230 117427 123870 134577 141015 142882 137833 127064 119023 103321
8397 103321 97985 105278 125833 155371 176574 179950 166197 153980 148199 137354 125076 117265 115411
8384 115411 117406 119273 122337 126555 126781 126907 130445 142736 159202 167888 163852 149612 135366 134106
8370 134106 142136 150970 148049 133386 117790 105924 90740 79729 69105 66185 88712 126518
8358 126518 160804 180748 182347 175120 173083 188260 210032 224700 214539 196226 186768 191752 193563
8345 193563 182585 168924 157732 162252 169535 164131 158947 166391 180825 208337 273375 398643
8333 398643 561493 656008 621648 576880 574020 550427 501426 439422 383113 340049 301938 260499
8321 260499 233205 217530 206845 211836 245449 282429 309490 330090 346843 359113 367108 365800
8309 365800 361073 357906 353983 356760 371564 384588 386718 375417 354414 344423 352838 363256 376021
8296 376021 390841 404723 425410 475621 563958 703337 825730 837258 791250 793606 811367
8285 811367 800217 765250 721856 690293 689302 696032 693563 688304 686536 691797 703755 725596 752237
8272 752237 772131 788338 804908 840145 888780 946518 1001531 1047475 1092531 1123882 1138513 1142753
8260 1142753 1145061 1153533 1177512 1213193 1265243 1321057 1359415 1383065 1433331 1508984 1594662 1689439
8248 1689439 1784628 1853228 1895082 1934001 1990278 2050462 2117928 2207500 2339427 2511583 2714149
8237 2714149 2933494 3153929 3362684 3559489 3746410 3956737 4211900 4529933 4938556 5485825
8227 5485825 6221680 7244384 8702770 10599230 12375204 13457809 14162855 15014791 16190691
8218 16190691 17860058 20065082 22481743 25090517 28608883 33874010 41734828 53570583
8210 53570583 71970661 102018201 153198646 239820559 368021959 492146748 519720020
8203 519720020 427675387 289771875 184432771 122198274 85986942 63484350 48641061
8196 48641061 38540379 31637615 26932587 23785437 21906300 21025412 20329797 19215416
8188 19215416 17984611 17031923 16457793 15981455 15156177 14394980 14429791 15120999 15649540
8179 15649540 15795128 15974699 16434731 17287172 18627970 20303338 22204019 24758402 28635016
8170 28635016 34509065 43394802 57150372 79384745 117194277 182875344 289616256
8163 289616256 420204044 495039663 454234866 334269274 217815988 142212459 98160479
8156 98160479 71447093 54095353 42289059 34124305 28458961 24518658 21903531 20434259
8148 20434259 19563234 18397495 16888843 15485955 14377895 13436648 12142767 10408401
8140 10408401 8776505 7567195 6706571 6060437 5527995 5063129 4656141 4299439 3988529
8131 3988529 3718209 3492774 3320404 3189635 3070976 2948932 2808757 2656641 2501948 2371016
8121 2371016 2267975 2175449 2059209 1937345 1850735 1801749 1760749 1705822 1637896 1573490 1527185
8110 1527185 1489205 1458260 1414279 1361536 1307819 1252689 1185834 1122594 1080236 1050073 1032830
8099 1032830 1035198 1049753 1059812 1058160 1042104 1021312 1008083 1005340 1011841 1023140 1033787 1044304
8087 1044304 1034423 987801 938298 900581 847924 804678 814748 903016 1016880 1040003 958011
8076 958011 867963 825937 802861 782355 766481 750744 730030 713187 705180 698363 677734 649014
8064 649014 618756 595962 581449 578387 571917 557756 545656 541270 536559 537944 541394 549892 556266
8051 556266 575383 616744 665080 709849 755791 808164 845934 855054 874269 959001 1127268 1358841
8039 1358841 1543406 1556115 1426951 1238116 1030343 847054 745660 692992 658946 631291
8029 631291 606329 582805 553619 529220 511777 501721 491971 466666 436852 416035 408666 399354
8017 399354 378703 348524 343674 362348 381347 392973 393098 384419 379347 395325 427726 457257 475387
8004 475387 488276 504745 532331 583779 669998 820526 1029706 1224522 1245666 1063211 812499
7993 812499 614598 485286 415156 377985 362460 356707 347828 337967 337461 341382 346960 355835 368839
7980 368839 376669 361533 328070 293535 256812 225238 198273 188393 211806 248516 279348 295282
7968 295282 288702 263855 239479 220364 204609 198154 205979 212968 224034 240141 247214 235696 213683
7955 213683 201655 210795 238934 263627 269634 246881 212128 181979 163849 155338 152917 148404 143327
7942 143327 143126 147815 154518 158756 162642 165460 160415 150763 133661 123815 117973 120326 130788 145702
7928 145702 160640 171946 174833 158052 135472 117419 98372 80674 66393 61252 61617 62455 60323
7915 60323 53787 39695 28935 32911 51416 77365 92098 74420 26823 -40771 -125909 -222672
7903 -222672 -298081 -278389 -164172 -16946 82614 122757 128814 127201 123791 113409 107389 113026
7891 113026 123789 124956 121608 112428 113327 120541 124760 119335 109183 96308 85874 73529 59965
7878 59965 51092 50512 46642 40208 41771 39145 32766 25456 20619 15825 12760 6489 -4146 -21559
7864 -21559 -52594 -96930 -168730 -247864 -273227 -201201 -63437 61465 124509 145649 147431 142694
7852 142694 132976 127864 130251 131257 129878 132951 131919 130671 135054 135664 133532 134473 134106 132568 129474
7837 129474 125156 123342 113989 107715 106078 102624 103396 104591 100658 101979 100592 105319 121120 133690
7823 133690 142637 151570 153925 156600 159402 162307 169144 179467 196839 212291 233753 255268 286691
7810 286691 339493 426637 578094 836724 1272707 1890672 2517158 2808282 2562150 1954979
7800 1954979 1332011 886010 621365 466431 370551 307497 269306 244293 227296 212919 206581
7789 206581 203218 202071 200756 195238 186148 177546 172736 171357 169111 166400 164449 159121 150342 142930
7775 142930 136960 136318 128742 127756 141651 170143 213016 274094 354821 472305 665664 1005943
7763 1005943 1538656 2174600 2615590 2579819 2103665 1490131 997800 685375 500630 390085
7753 390085 325364 286732 259867 244192 244070 255117 256869 238138 210553 179384 152464 134749
7741 134749 120919 107429 91541 73786 64925 56753 52054 48497 44811 37286 27624 17556 14375
7728 14375 20043 31155 43969 57068 64537 64950 64288 64539 59873 56926 52756 51018 52420 50203 47700
7713 47700 47607 54259 60874 68746 71305 71068 76177 94247 106235 99613 79430 54707 41998 35620
7699 35620 31129 31743 29186 21463 12438 10162 12878 14106 16764 22289 23427 26659 30299 30882 35423
7684 35423 37829 38721 42006 42477 42133 39569 36650 32660 32381 33082 34852 28782 28590 31285 31792 30468
7668 30468 29342 28850 30641 32093 35451 32063 30997 30981 31883 30630 31226 32948 32225 32045 32801 30739 28021
7651 28021 27108 28075 33532 32116 30175 32460 31318 32387 38990 44516 42837 45031 42283 37512 31876
7636 31876 26544 23973 26076 27349 27150 28690 29550 29950 29626 29796 30805 27226 29651 28433 28474 30763
7620 30763 31195 33257 31884 32451 33670 31102 29817 33706 33637 35738 31594 25974 26414 25318 26264 27505
7604 27505 30028 31155 33060 31602 26949 27606 28831 26628 25859 28055 26089 27818 30658 28483 23417
7589 23417 24010 26985 27945 28407 26722 23669 22444 19980 20005 16707 15017 16201 21992 25161 24304 26774
7573 26774 30068 30436 29496 29243 25284 29159 30625 25971 28268 32983 32343 29902 28318 28989 23524 21250
7557 21250 23128 19473 14045 17432 16650 15687 18184 20684 21829 18084 15753 14100 13874 15181 12083
7542 12083 11341 8732 12404 15574 18546 22464 20937 19025 21574 23054 20332 19427 18080 15164 10146
7527 10146 9143 8596 11631 14238 16022 16075 17983 20203 21827 19865 15325 14551 17697 19490 17600 12590
7511 12590 12074 13727 13257 13594 16122 16085 11735 11492 10642 11889 12073 10771 12914 13296 13378 16744 21190
7494 21190 21051 23046 21920 17654 16756 19568 20309 21884 20445 15275 16966 17955 18946 20575 20921 19793
7478 19793 22071 20889 14165 12883 14063 15729 11808 9543 11358 13357 13876 13878 15510 15600 17025 15868
7462 15868 9684 9586 11600 9134 12728 14050 13479 15891 14879 15679 14592 13471 16739 17692 15494 17027
7446 17027 19396 15012 12219 14244 16567 15682 13438 17298 21723 22577 23494 18644 20707 22372 18666
7431 18666 18180 14187 12421 12149 10967 10965 12944 15941 15954 17689 17450 12164 11130 11403 11267 16813 20255
7414 20255 20512 19452 20766 21581 23520 21762 18050 19457 18095 18273 16682 16053 14605 16594 17894 16260
7398 16260 13925 13668 16303 15593 16913 18313 13272 12033 13670 14690 9892 8310 8783 6783 8551
7383 8551 13210 15067 19998 23189 22768 21154 14595 11783 10158 10812 9373 14194 19296 17286 14034
7368 14034 10968 11345 14780 18530 20728 17626 17654 15956 13327 15680 16063 17072 17593 19291 21309 21328
7352 21328 16623 16580 20790 20691 18851 16710 18010 16661 13347 14264 17397 19588 19337 16663 13181 13132 14811
7335 14811 14237 17439 21156 23315 20239 19461 19216 16100 11208 12576 12654 17358 21111 24104 23081 26361
7319 26361 22744 19042 14144 10284 11667 10069 13198 18587 17333 11868 11064 12466 16158 18251 20205
7304 20205 25712 21609 13499 9798 6785 2691 1910 -37 2255 6905 9634 10531 10343 9959 9667 10381
7288 10381 8742 9784 14963 15786 15046 14394 8802 8670 13029 11651 10927 10522 6809 11099 14560 15158
7272 15158 11747 12149 12565 11845 15088 14863 16368 17627 14534 8728 9744 11275 12970 11236 8935 7813
7256 7813 7501 7131 8340 7159 9203 9628 7215 6934 7791 8613 4950 4768 11425 20067 23502 21629 16271
7239 16271 12001 12418 10601 11301 14680 20153 20110 17973 13373 10927 8904 9831 8808 4641 3540 10133
7223 10133 14108 16371 16394 11844 13153 13928 16041 18396 18831 12436 7026 5481 4462 5685 6264 5219
7207 5219 7982 13741 16993 15184 14288 14504 7762 6062 9840 9407 8171 6724 2175 3034 2759 6712
7191 6712 7165 2731 1253 4881 7596 7701 6784 7221 9398 8779 7399 9991 10737 6043 2665 2019 5250
7174 5250 13137 18825 19182 16962 12266 10988 8650 13735 17094 10710 9898 8885 9908 8465 12354
7159 12354 12876 8691 9337 12110 13555 12783 7500 6308 8856 8312 10256 3974 -73 66 2716 5866
7143 5866 9221 9200 7814 3939 3670 5579 9338 11077 8476 11020 10506 9654 6356 6935 8664 6681
7127 6681 2258 2524 3150 3743 3858 4370 2668 3927 8697 8998 7044 9676 11249 7527 4620 4856 1112
7110 1112 3737 6587 6399 5243 7341 8389 8288 8030 7135 7827 6858 5261 9897 12533 10430 10359 9052
7093 9052 8170 8082 10167 11592 8588 4953 3247 4656 4500 5500 8985 13373 13187 8674 9333 7341
7077 7341 6971 7972 9514 11788 14186 14783 12870 14676 13991 12938 11535 11333 10024 8756 7361 6057
7061 6057 7953 8621 3377 923 -1331 -5659 -1440 1475 1599 2229 2637 -2483 -4746 -1668 2128 2120 -424
7044 -424 772 3843 5311 6307 2882 2344 3697 5121 8954 8002 9659 13882 13339 10765 9458 6891
7028 6891 1850 500 3406 4740 3240 5417 6518 9108 13924 13513 8412 5119 4753 6349 8059
7013 8059 8764 8704 4141 -91 425 2441 1354 3728 3947 2585 3582 5840 2585 3834 5506 4456
6997 4456 4475 6483 6427 5288 6617 7045 9998 13601 8529 10076 10094 5774 5892 5011 6175 5855 6072 7840
6979 7840 6778 4078 4791 2383 917 3515 2621 -487 -840 -3297 -2848 1488 1567 3215 6539 6482 8348
6962 8348 6647 3451 3090 388 618 -1753 -549 3461 10168 16106 11311 7933 13097 13204 12671 11154
6946 11154 12550 12597 10197 4946 -2496 494 5226 4393 635 -847 2584 3326 2742 -392 -408 5517
6930 5517 9029 3026 5048 3681 1948 1963 4583 5139 4419 3710 1890 -1881 1106 5783 5365 7209
6914 7209 10079 9976 9881 5719 -532 4143 3803 3887 7528 8637 6681 5848 6202 7031 4092 4864 1152
6897 1152 -822 3529 1680 -3117 -1395 1328 1518 4894 7769 10140 6792 1591 -1219 -1026 2439
6882 2439 3603 4447 6550 4616 1106 4897 9333 12379 8456 3380 2182 1168 4474 4327 -1742
6867 -1742 -1616 1178 4430 5103 624 30 693 2712 6300 6561 6017 4012 1417 -479 1886 1885 3692
6850 3692 5308 3696 1208 -697 -240 3724 1305 -708 1181 -1876 -4152 -5735 -4680 -2427 1812
6835 1812 5086 3620 3234 734 -2543 -1384 905 941 3562 3472 3381 2788 2266 10094 12206 8438 5205
6818 5205 1637 4235 7514 6739 6896 8332 9130 6674 3274 1690 59 -712 229 784 -846 -376 -773
6801 -773 3299 8415 10581 10700 11026 10926 7568 3741 384 -1363 -1250 191 245 -2104 -257 -540 -1063
6784 -1063 2195 84 -5354 -7698 -4946 -3026 -1971 1102 2758 1111 2061 4675 7844 6619 1374
6769 1374 61 3812 6953 5583 5948 4710 7197 5447 4797 195 -520 4787 7741 7729 7320 4466
6753 4466 1688 704 2000 5066 9455 9209 5280 70 -1119 3887 8147 8964 3337 -2932 -964 1432
6737 1432 3207 -458 1369 4396 3293 3164 4869 965 -616 -1857 -3718 -942 360 672 3506
6722 3506 -733 -3919 -5706 -842 4723 4097 3971 3608 2517 4600 4848 4866 4242 4276 2836 4155 4985
6705 4985 1706 2862 2543 6958 9104 7832 9458 12258 8531 6874 4269 5620 5218 5728 8195 10132
6689 10132 8369 6077 3337 -516 -1362 670 5094 7796 4205 2023 3252 1649 3799 4420 2123
6674 2123 2164 -1363 1863 5150 1587 -2582 -864 -60 -3024 -4936 -4016 -3335 -72 -354 -1484 -888 2727
6657 2727 7446 7229 4612 1347 3670 2151 3124 -689 -1259 1312 6061 3416 -1341 583 4948 7775
6641 7775 2930 1704 4291 3690 2905 771 915 3290 3327 -2492 -5328 -5002 -3991 -4179 -5182 -765 2141
6624 2141 3213 4653 9057 13028 14668 14405 12749 8477 6861 6401 4612 3804 3230 5790 6671 5547
6608 5547 8440 6745 3317 1065 3252 5458 6348 1490 774 1329 2205 4341 2696 2209 1197 3484
6592 3484 3561 3121 3324 5351 4329 5250 8085 4744 527 -2777 -2056 -1038 952 1412 5094 5418 7857
6575 7857 6901 6630 7197 3288 3706 7171 8892 8913 7356 6764 7692 8126 5095 6180 6329 3293 1873
6558 1873 1391 -1216 -2736 50 2564 1057 229 4734 6519 305 -4385 2822 3419 2282 3736 3090
6542 3090 5661 7265 6729 6030 5457 4237 7557 8975 6152 4881 4503 8208 9356 9796 8078 10280
6526 10280 8117 6747 5309 4298 2698 6649 10547 7224 3381 4686 9881 7779 2127 3684 8091
6511 8091 6749 6245 4613 5479 4360 1617 246 4538 4419 5216 4690 6780 1843 -2959 -4608 -1732
6495 -1732 2717 3760 5115 4096 5062 2746 2156 3288 5357 1224 -630 515 -122 1062 3372 1318
6479 1318 5499 5285 5802 10374 5351 154 -1686 -2113 133 127 2489 4739 10227 9886 8257 6558 2861
6462 2861 -188 1709 3682 6352 10952 11401 7041 1769 -977 -1030 -1000 -2536 -5407 -4929 -2602 4455
6446 4455 9344 11400 12187 8950 8931 6595 3264 7641 5928 2163 2342 7193 4586 4759 6327 4633
6430 4633 4886 8927 9953 8048 2470 534 190 340 2372 4252 3413 3660 2328 1932 -548 -358 3729
6413 3729 5005 -667 -1854 -2113 -3166 -2240 -630 -920 1538 4332 896 -1072 -3837 -10809 -13724 -9464
6397 -9464 -5842 -2573 -4864 -5201 -4029 -2506 -2627 -4434 -2638 -701 -2645 -2647 -3977 -6236 -1498 3268
6381 3268 546 -3701 -1714 5615 7977 10913 10964 4931 -760 -8 2282 6426 5473 5194 3776 4175
6365 4175 1035 -1211 3225 6418 3557 634 -1418 1128 516 -1461 -3309 -2019 716 998 -1572
6350 -1572 1037 4023 2714 1584 -80 -2184 -1540 542 1707 5127 7618 4863 4263 5008 2664 1277
6334 1277 1406 66 1440 -1251 -1376 -1738 -656 6553 11697 12996 13412 12234 4986 560 2677 4114
6318 4114 3682 -112 -3239 -1436 -1079 -4891 -563 -1591 -5750 -6045 -2424 502 -434 2595 2949 1214
6302 1214 -708 -876 -2613 -3190 -2345 -2280 -2934 3179 234 -4477 -7113 -6227 -1317 4432 5114 2102 -406
6285 -406 -3767 -3232 3479 7499 8218 6248 6107 3313 4307 1012 516 -898 -1841 1269 1721 1679 2547 1481
6267 1481 -2389 -4498 -6914 -9088 -7360 -1507 -407 -3246 -6260 -4782 -3801 2242 5415 -616 -627 510
6251 510 3734 841 -64 -2064 -2883 -895 -5415 -8879 -5281 -4795 -5543 -3132 -3712 -4578 -6149 -4933 -6064
6234 -6064 -7859 -4790 -1202 348 -71 -4026 62 3288 1989 3620 7308 5807 1784 -268 1635
6219 1635 4291 4722 695 -805 422 2682 737 -2388 -4133 -1885 -1663 2616 1234 -2946 -53
6204 -53 5227 4247 1658 800 1936 3169 1353 843 2368 2812 3056 2389 4014 1653 5735 4389 4539
6187 4539 -1388 -8798 -6631 -2853 -2487 -3768 -1569 -422 3663 5175 4846 4166 2013 -1672 -2236 333
6171 333 2140 -70 -1005 -5187 -4827 -1915 1129 3968 1836 -3047 -3570 -8394 -9929 -4072 -2592 -4727
6155 -4727 -4360 -2672 3621 8743 7039 2747 192 -1319 -532 1950 6766 8347 3831 6753 6489 2525
6139 2525 2580 305 -1394 -4113 -779 1320 -1079 -3780 -5806 -5952 -7511 -8519 -4610 -4494 -4903 -2185
6123 -2185 82 3142 1935 609 308 -3083 -2238 2610 7860 7920 6766 7812 7112 4441 5567 7041
6107 7041 4131 5532 7486 7860 120 -2376 -1964 -4227 -4406 -3014 -3895 -6225 -7900 -2111 3569 1381
6091 1381 -1627 -979 3152 3620 -1567 -2671 298 3343 5089 1401 -1330 -1603 -1785 -3410 -528 2095
6075 2095 5366 6396 -756 -3815 -4267 -926 -513 442 7115 9587 7995 4657 1446 690 1232 2123
6059 2123 4668 6834 7883 5297 5042 5338 2951 4933 3950 5263 6492 1512 -1207 -3154 -4707 1548
6043 1548 2442 -3091 -6416 -669 5621 5707 2787 244 950 3600 5408 3473 3206 5810 9413 8035
6027 8035 4641 2757 -3067 -2314 -667 -1229 1335 3444 1495 156 809 2170 3902 4879 1712 122
6011 122 -336 -1705 -1754 -3156 -2247 -2223 50 672 -201 2662 3725 -272 -3224 952 4324 3874 1975
5994 1975 -766 -53 994 -3706 -5206 -3131 -389 866 -601 -3526 -399 3566 3088 -1269 -2828
5979 -2828 -1063 4841 9355 7723 3390 4357 5883 1281 -127 6811 11816 10911 5397 2336 -116
5964 -116 92 2934 6651 7070 6373 1577 1434 1867 1886 7493 7875 8126 9627 9837 4094 2236 4300 7468
5946 7468 3993 830 -5014 -3869 -1197 -27 850 2423 6031 2669 106 1008 -2800 -2987 -4077 -5321
5930 -5321 -4743 -2766 -3580 -88 269 4080 6829 7425 4132 363 765 -240 -209 -61 -941 -1700 -1980 -2455
5912 -2455 -3660 -8373 -5757 -3227 3031 5750 4884 3866 1100 -2658 -4540 -1387 2256 117 -521
5897 -521 -1896 958 4005 1470 72 -2789 -6206 -4725 -3279 -912 1926 2414 3102 5981 4768 1725
5881 1725 749 1375 -2352 -5920 502 2737 1756 3480 3251 471 -66 1085 -1047 -4222 -8050 -9762
5865 -9762 -7356 -8537 1008 2864 5128 1866 402 1889 3533 3865 2696 4195 2594 3796 1488
5850 1488 1573 723 -2726 -5140 -3436 549 581 -2355 -3100 -5118 -2094 4774 9824 11137 7969 4788
5834 4788 2491 1637 2532 -1692 -1168 1837 -708 -3464 -7869 -9438 -5741 -5057 -3699 -2938 -2694 -6803
5818 -6803 -5837 -3063 -4967 -11516 -10917 -4145 2303 2176 -1256 -1729 -3615 -6266 -6333 -5977 -2855 -3092 -1737
5801 -1737 2235 1652 2258 -253 -2749 -921 2462 3998 8382 5505 1231 -295 1409 4580 4478 -822
5785 -822 -1303 -2392 -1325 -5172 -3091 -2056 427 251 -331 1143 1893 1893 3258 3915 5221 4077 -162
5768 -162 -2055 -1695 -2554 -2378 -2020 -1927 -2321 -2897 107 6114 4911 2461 631 1411 2127 1902 -274 3632
5750 3632 -773 -5774 -1104 1952 3144 1701 -4018 -5558 -7955 -6210 -2623 1193 6849 7413 8735
5735 8735 5116 -117 -2357 -5606 -5138 -861 1766 274 1500 427 -4462 -8196 -10549 -7879 -5265
5720 -5265 -5150 -4397 -969 1339 4281 5590 4784 5045 2556 2307 -1417 -6020 -4189 2095 -748 -6020
5704 -6020 -6623 -3307 -3463 -3414 -6806 -6245 -1817 -532 -3671 -4929 -5057 -4656 -4623 -2900 -2351 -2760 -3526 -6545
5686 -6545 -5487 -6546 -9316 -7705 144 3962 1857 -6015 -9578 -4764 -1728 -1722 -3129 -1109 2057 1442
5670 1442 -629 -502 -2283 -1303 -2151 -1473 -2278 -169 3887 5503 5957 4354 999 1319 2531 6046 4813
5653 4813 1930 -1383 3481 7276 8665 5885 1818 -520 -2994 -1131 -3080 -3059 709 1906 3193
5638 3193 2064 -2196 -1731 -907 -1182 265 -2132 -3007 -1963 -3626 -5169 -1862 2118 3883 4496 7609
5622 7609 7118 7020 4520 1892 412 510 1766 3313 3340 2046 -377 2161 4823 2239 -428 -1203 -556
5605 -556 736 2509 3025 -1490 -997 1373 3723 2686 -703 -3737 -3368 -2598 -5473 -7433 -5596 -354
5589 -354 -1706 -6355 -5298 -383 272 -5264 -5651 -4402 -2304 -2752 -1672 -3234 194 -1430 -5190 -3959
5573 -3959 -410 -4660 -8127 -8636 -5796 -1757 -3222 -4463 -1468 -3701 -5022 -3264 -3379 -4196 -5676 -4543
5557 -4543 -515 1791 328 -3186 -4372 26 -976 -1939 2458 699 -3738 -299 4895 2960 2879 3986
5541 3986 1076 -3931 -6857 -4328 -1462 9 1306 -1070 -4874 -2149 -4033 -3546 -2947 -2380 721 1047
5525 1047 -1447 -2608 -3862 -388 -749 -2058 -5734 -7014 -7499 -9178 -8672 -1800 3024 3849 -2666 -4360
5509 -4360 -1774 -4232 -1890 -1046 -1699 -2673 -1545 -301 -1765 -1103 461 -2631 -3518 -3913 -5082 -2483
5493 -2483 -3757 -132 3258 5666 2230 807 -1974 -3322 -1373 1437 2706 1059 -2333 -1386 1865
5478 1865 2655 6207 4424 5330 5174 6391 2406 -889 -3829 -3808 -2410 -1228 4649 8091 4609 -771
5462 -771 -4166 -3781 113 3725 4493 1140 -3278 -6222 -4410 -1094 -809 -2087 -5029 -6398 -5311 -3583
5446 -3583 -4767 -7056 -10308 -10882 -7945 -5474 -3840 -190 -813 1847 1994 1789 4767 4347 2524 -518
5430 -518 -1452 -4714 -6426 -5436 -7143 -7652 -10741 -14077 -10531 -7817 -2567 88 2300 1673 2209 1688 -546
5413 -546 -2548 466 1490 366 4804 6319 1401 -2324 -2657 -628 626 -4067 -3722 -2458 -2730 -4709
5397 -4709 -1233 -561 1788 1132 615 3904 4620 -1390 -3618 -4101 -991 -175 -3309 -4010 -5652 -1465 498
5380 498 -1076 -284 2812 4726 5587 7441 7435 2978 94 -2019 470 1578 -739 -117 -628 -5822 -4538
5363 -4538 -199 2013 933 -636 -2289 -8143 -11036 -5090 -2344 -108 3974 5073 1855 -2809 -2209
5348 -2209 -263 3801 1405 2488 318 -856 -1559 -1286 -2661 -1290 -1518 -2799 -783 -914 -3112 -2472
5332 -2472 -3424 -4871 -3599 -6846 -6821 -3008 -281 -5048 -7350 -806 -446 3074 6335 4313 155 -908
5316 -908 151 -1184 -2088 -1815 -122 5608 8270 7484 4962 4603 7308 5001 2804 2829 4489 2036 -550
5299 -550 1792 723 2160 5784 3640 4141 4431 3325 2984 -579 2133 4696 3006 -1268 -3540 -3834
5283 -3834 -6314 -7918 -4158 -3316 -7738 -7870 -3271 -1849 -5119 -9057 -7346 -3155 -3815 -4799 -4585 -2554
5267 -2554 -2502 -5784 -6470 -5793 -6204 -3124 -438 -1233 -4732 -5050 -4677 -1034 159 1356 1877 -4025 -2707
5250 -2707 -2955 -2735 -3124 -2942 -5040 -5027 -2454 -761 3023 -2168 -2903 -3592 -2996 449 4405 7770 7547
5233 7547 7320 5193 6636 7412 5500 3314 1985 3862 3819 -1053 -1009 -2435 -2832 -2455 -4046 -1451 701
5216 701 778 -594 -3548 -10051 -11320 -9633 -8429 -4828 -936 -383 2023 5707 1621 -1075 -1072 -880 1153
5199 1153 1224 292 2549 4785 4151 2396 1506 5242 5366 6339 6477 5516 -910 -2438 -382 2254 2784
5182 2784 1171 1904 1349 1701 1752 938 377 1179 2938 2811 -2052 -4847 -3786 -415 -926 -3054 -3692 -2263
5164 -2263 -2485 -1125 -2813 -4946 -4954 -4792 -4385 -6525 -8083 -7864 -6813 -1403 5825 9529 7526 3424 6033
5147 6033 8158 7168 -34 -2689 -2454 -2729 -2184 -2436 -1840 -1867 -2920 -555 -1693 -5253 -8277 -4836 -2040
5130 -2040 -2852 -1939 -1029 50 -2232 -5933 -5938 -3083 -4375 -4374 -3410 -7253 -6624 -3409 -628 461 -991 -3126
5112 -3126 -3625 -4162 -2351 152 -342 -1838 -3156 -2677 -1195 -150 -2889 -672 1107 1598 2046 1480 -2165
5095 -2165 -7697 -5381 -4332 -7770 -9639 -5447 -2304 -6720 -6179 -834 4080 6005 7583 6637 6418 3010
5079 3010 6619 7330 828 -1889 -2316 -6215 -4738 -2828 -4523 -2702 -1648 342 9 -5322 -8441 -2533
5063 -2533 1641 1447 4237 4885 -116 36 1220 3624 739 -239 -2232 1900 9371 6268 5399 436
5047 436 100 4029 5005 4074 -1237 -3427 2122 1982 -1074 -1590 -657 -957 -539 648 -429 -2332 -5434
5030 -5434 -6667 -5393 -7640 -8590 -5070 -1947 596 1633 -1570 -6726 -4835 -3283 -2457 -3369 -6684 -6505
5014 -6505 -3459 1178 2450 2789 3076 -1415 -4010 -2523 -908 -2818 -4231 -4664 -4076 -4340 -6008 -4540
4998 -4540 -3318 -6044 -2135 2240 5809 6284 -754 -599 1010 -568 -3541 -4520 -5988 -6773 -3642 954
4982 954 3998 1528 -2950 -3124 -577 -3825 -54 759 362 2709 506 -5011 -1015 3473 2913 -2450
4966 -2450 -5941 -9414 -13287 -11620 -5655 -3723 -1834 590 -976 -1288 -1375 -929 -1228 -5662 -7259 -5649
4950 -5649 -2895 -3086 525 3218 1753 1422 -333 198 -894 -7507 -6603 -1482 -4448 -6531 -6674 -3319
4934 -3319 -229 32 -2950 -4726 -3929 -4025 -3742 -3879 -3561 -1393 -4129 -4169 -6736 -7994 -6979 -6105 -10181
4917 -10181 -8231 -6875 -3353 950 -3082 -3345 -2969 758 4596 993 -4970 -7601 -9174 -11426 -7675
4902 -7675 -4145 -2054 846 115 -613 1555 838 2540 2279 -949 -2163 889 4947 7407 5169 1300
4886 1300 -866 -2557 -3364 -2269 -1387 -4065 -3294 -856 -1299 -6049 -11711 -8158 509 1802 -1981 -3441
4870 -3441 -2197 859 1436 1561 -3210 -939 -1395 -1371 -2643 -1271 -709 -591 2565 5673 2737 1307 899
4853 899 -3120 -3473 1131 3934 35 -1300 -1811 632 1346 -671 306 799 1926 -834 -4769 -5832
4837 -5832 -4025 -3881 -6770 -6202 -8556 -6761 -1840 326 997 -2240 -3104 -3317 -2091 -215 2887 3611
4821 3611 3900 1287 2615 1274 3576 3962 3907 477 -3084 -3164 -5009 -6421 -6559 -4721 1063 1973 -2282
4804 -2282 -1375 -57 1097 -896 -4298 -5523 -2520 -2375 -1661 -2351 -3278 -5379 -2574 3217 4400 -3231
4788 -3231 -8280 -5652 -356 24 -483 1744 2041 1198 -1280 -4048 -2775 -1384 -3707 -1900 780 -2797
4772 -2797 -5357 -3675 355 -4244 -6695 326 2829 3460 4491 3324 3868 3153 -136 -556 -3959 -5975
4756 -5975 -8791 -9330 -9368 -10238 -5848 -4671 -5973 -4668 -2657 -2786 -2680 -3027 -1307 -3611 -4938 -5277 -9178
4739 -9178 -7265 -3715 22 2053 1358 -2998 -5685 -5825 -5227 -5641 -8125 -5675 -4320 -2011 -2538 -1498
4723 -1498 -6873 -11775 -9183 -3592 2369 1398 -2436 -941 325 -1768 -2007 -2472 -2734 -5195 -7205 -5147
4707 -5147 -3447 -209 225 4671 1256 -3872 -6558 -3048 -2528 -698 1218 -1021 -1973 2149 4802 5029
4691 5029 1423 810 2762 2284 23 -3824 -1857 -1734 -608 -1301 -4957 -6367 -1946 6327 6683 4437
4675 4437 3921 3488 4850 -4360 -6820 -6880 -7040 -4289 -5182 -5953 -2799 -634 3228 4833 2823 -1550 -2510
4658 -2510 85 1946 1367 -71 -6191 -6022 -1592 -3735 1155 1699 547 -359 -2183 -1634 670 3296
4642 3296 459 -3563 -2047 525 604 -435 -1992 -3449 -2003 3895 9279 8755 8247 6419 2934 683
4626 683 814 -1609 -3093 2240 4385 448 -255 -1191 -5586 -5526 -5223 -5237 -2704 -3376 -5787 -4437 -1322
4609 -1322 3823 5419 3441 -244 -4197 -3428 -1974 -5168 -6725 -5346 -5552 -4670 -5411 -4833 -3097 -5605
4593 -5605 -5915 1816 5136 3234 -5267 -6925 -1964 5416 3874 1759 -1576 -2835 -944 1192 -900
4578 -900 -3575 -2881 -5722 -4275 -898 -2072 3254 8567 5091 -549 -3931 -6398 -7222 -3362 1101 1234
4562 1234 822 -4152 -10274 -7099 -7019 -6607 -1193 4147 2727 -1429 -4588 895 -2529 -7469 -10632 -2349
4546 -2349 6269 4245 -4740 -8822 -7101 -5746 -3927 -2312 2941 3429 -118 -4270 -6312 -4937 -6485
4531 -6485 -7458 -6602 -3838 430 -203 -5976 -6379 -2158 -640 -2353 -6559 -3719 -4586 -1770 2029 1377
4515 1377 2777 -1954 -8817 -7396 409 1407 864 816 -3400 -5867 1672 17472 20271 6312 -8414
4500 -8414 -3458 5334 1296 -1533 2962 473 -624 2568 2771 2439 -2134 -3087 -2369 -4983 -5109 -4210
4484 -4210 -2592 -3739 -3625 -4695 -4375 -6783 -7885 -5846 -2805 2750 3325 2606 2174 544 3631 4650
4468 4650 -4956 -8697 -632 16692 20269 7492 -6978 -7999 129 -1264 -2301 -6532 -8480 -4415
4454 -4415 -4152 -3960 -5224 -6331 -2806 -4873 -6741 -11255 -11402 -9681 -3638 1057 2019 307 -3175 -7087
4438 -7087 -2041 -170 -4541 -5787 -5071 -2240 4760 6019 5551 7043 561 -3128 -4609 -4909 -3144 -2760
4422 -2760 -3136 -4065 -3115 -2097 -5386 -3960 -354 1773 2926 5069 530 -5562 -5944 -2064 -1678 212
4406 212 2415 -2559 -6152 -4796 -2772 178 -346 -2416 2356 4690 4009 1747 -284 -2042 -3479 -1263
4390 -1263 128 759 2986 5233 3098 -2047 -2170 -735 874 -3750 -9250 -12492 -6970 -1087 -156 -3597
4374 -3597 -663 2971 3012 434 -1366 -2893 -3753 -2616 -4115 -3876 -394 2818 11 -515 -1959 -1921 -3064
4357 -3064 -7253 -9895 -7800 -4997 -4862 -3993 -3222 495 -32 -2579 -2159 -1859 395 -2057 -3579 -7568
4341 -7568 -7255 -8952 -6681 1808 514 -3126 -8190 -10509 -7879 -9341 -6237 -6062 -5873 -7256 -1553 1
4325 1 770 -441 -136 -2468 -2290 -3476 -2772 -2471 -4268 -8299 -6267 -3211 4 2334 5476 5269 6069
4308 6069 6916 3201 1853 2350 2301 2354 2755 3223 2863 -578 -2479 -3889 -3487 -1807 -2188 -5143 -2278 423
4290 423 -2041 -1438 518 -1621 -3462 -1438 433 -3384 -9742 -10642 -6017 -6159 -3717 -371 -1523 -4175
4274 -4175 -6603 -5047 351 -413 1499 -5435 -6024 -3567 -1848 380 3533 1263 -3181 -6644 -9156
4259 -9156 -7778 -5466 -118 1360 -1244 389 2209 3436 1905 2261 3600 2899 -2648 -6241 -4432
4244 -4432 -179 1089 -2298 -5612 -5032 -4655 -3382 -2085 -5284 -6399 -2501 -2692 -4186 -7729 -7644 -5520
4228 -5520 -8145 -8005 -2009 -17 1366 1706 -1443 -1674 -2930 -2073 -5027 -8188 -5382 -6367 -4672 -721
4212 -721 -1938 -725 -3767 -2933 1309 967 1164 1296 2776 3803 1708 -3193 -8279 -6369 -947 -306
4196 -306 -82 570 2814 2553 -645 622 907 648 -2325 -1645 0 -913 3374 3653 5896 7291 3716
4179 3716 -1001 -2555 -4413 -5429 -5456 -6090 -2698 1494 2182 2327 -3502 -6634 -11266 -12072 -9319 -5957
4163 -5957 -5798 -3521 -5714 -4914 -3757 -4154 -4324 -3832 -1767 -4021 -1593 -165 -1081 -2854 -3180 -3799 -1844
4146 -1844 -2386 -4039 -3793 -4020 -3604 -2373 -2395 429 3835 3289 3767 2011 -284 -2085 -2589 -3710 -2649
4129 -2649 -2575 -1762 -633 -1786 -2612 2424 -1557 -3266 -2959 42 1457 7376 8259 4434 3664 -2536 -7267
4112 -7267 -7845 -4061 -2111 -3164 -2991 -2687 -2608 -4996 -8792 -8716 -5747 -2150 587 -505 -4424 -7363 -3642
4095 -3642 -1344 -3207 -2694 -1295 -751 -5314 -4234 -3428 -5831 -4037 -488 1508 -783 -3815 -2003 3491
4079 3491 4272 -2118 -3588 -2769 -6034 -3983 -816 801 174 27 1929 3199 3626 4085 1000 -3141
4063 -3141 -1042 -396 -7459 -9859 -7846 -5796 -5835 -4363 -1592 3131 4638 689 -1780 1327 3198 1236
4047 1236 -257 -4942 -7387 -9809 -8891 -8679 -7454 -7233 -4194 -56 -638 -3738 -1639 2414 4110 1919
4031 1919 -963 -2719 -1837 -3633 -1585 894 3482 1983 -138 -4092 -6765 -5675 -4199 -9281 -9595
4016 -9595 -5042 -3795 -3363 -2669 -3024 -2794 -167 -631 -5888 -7008 -3879 696 901 -764 -3483 -3529 -1264
3999 -1264 -2197 864 464 7 -2769 -4809 -4434 -5951 -5005 -2860 2374 3639 3284 3339 5684 6426 2128
3982 2128 -1815 -7088 -6607 -6204 -6488 -2677 -2556 -1704 2012 385 -946 -2923 -8018 -7725 -5262 -1613
3966 -1613 3140 2530 4954 2288 -474 -4486 -6992 -4312 -608 -6213 -7217 -6935 -4859 -1411 -2192 -1144
3950 -1144 -3107 -7012 -6870 -2911 -732 424 -1642 -2737 -478 694 1020 537 2021 2735 1297 -57
3934 -57 -1500 -1070 -3137 -493 889 274 -2412 -354 3233 39 3343 -15 -6595 -9710 -11384 -12150
3918 -12150 -10369 -9117 -13045 -14994 -9154 -6226 -3778 -6768 -5713 -4564 -3542 -1973 -1061 473 -1689
3903 -1689 1406 517 -5432 -8886 -7443 -1899 -2016 -5978 -10235 -9262 -9412 -11204 -8347 -4383 -1958 -3372
3887 -3372 -3577 -2527 -225 -5163 -5183 -1382 -6622 -10417 -5590 -3847 -8500 -10039 -6794 -4618 -3874 -2994
3871 -2994 -4523 -5477 -4243 -1376 -211 -3336 -895 1051 998 -624 -4560 -3214 -407 -2855 -2630 -1303
3855 -1303 233 -3989 -1651 1419 -4311 -8673 -6426 -3097 -3245 -4258 -4297 -7318 -3631 731 3752 1910
3839 1910 -5339 -7617 -6920 -4066 -5469 -6670 -6562 -2613 3339 3605 1414 -1567 -4806 -5872 -2034 -2599
3823 -2599 -2479 -30 2266 465 -4758 -6355 -7276 -5799 -4878 -4873 -2361 1814 582 1239 4163 4400 843
3806 843 902 -2154 -3266 -2428 -1434 309 -105 805 2205 232 -1264 2381 142 -1529 1447 3445 4394
3789 4394 4047 4581 2722 2827 2100 2203 925 -1009 -2085 -4055 -6319 -1666 2134 1424 5454 8346
3773 8346 1565 -735 -171 1150 -407 806 3584 5955 6017 6271 7760 5386 250 1481 574 -1004
3757 -1004 1532 2042 3192 957 -4278 -5532 -11335 -11263 -3372 -3338 -6609 -5201 -2585 -2643 -1704 -2802 -975
3740 -975 165 1326 2603 6199 7392 7732 4267 -128 -347 -2807 -5122 -997 3485 3577 4755 5852
3724 5852 2483 -962 -306 724 1799 1505 2176 2567 7167 8553 6561 3049 4381 2361 264 -783
3708 -783 -958 -1362 36 -1727 -4479 -992 -123 210 188 -3726 -1987 3159 3909 1893 -495 -1872 -2389
3691 -2389 218 5119 4533 4439 -184 -4895 -6156 -7250 -11580 -6979 -5073 -4603 -2080 922 -2614 -3850
3675 -3850 -5249 -6377 -6291 -7142 -4593 -4651 -4325 -3584 435 2873 591 -2554 -2901 -792 344 642 1595
3658 1595 484 -333 -1217 -3976 -3938 -4744 -5150 -4108 -3050 -563 -4103 -5938 -3298 -1393 -1524 1395 3021
3641 3021 3682 5458 5718 5062 997 -5512 -7641 -10506 -7909 -4812 -4169 -3863 -4697 -3850 -3532 -2032 -2309
3624 -2309 -2038 -4042 -709 2616 2154 -3407 -4389 -6360 -8133 -5471 -3015 -4607 -6076 -3753 -5418 -7149
3608 -7149 -4285 -6447 -6706 -4132 -6746 -4894 -4529 -6435 -4860 -1433 -1609 -620 -2503 -4776 -5470 -4597
3592 -4597 -4163 -1703 -2897 -2175 -1557 517 413 -3803 -4685 -4376 -3660 -2799 -5287 -3225 355 1154 189
3575 189 1818 -254 -822 -2421 2192 7195 8455 8197 2762 -1365 -2071 772 57 -2263 -2787 -4380
3559 -4380 -7720 -7916 -4468 -3568 -3140 -2371 -2101 506 -1528 -5738 -4550 -690 -1834 -986 44 1845
3543 1845 1416 -1778 -3945 -2421 -1732 1423 1388 -973 -2375 -3241 -6108 -8948 -9529 -9449 -2945 -67 -2683
3526 -2683 -917 2123 3239 917 -2278 -4663 -7526 -5395 -558 -201 -3757 -1646 -3107 -2883 598
3511 598 3591 1271 -1238 -2032 1139 93 -2028 -2898 -1844 -2504 -2412 -1124 1189 969 -1894 -5509 -8447
3494 -8447 -4988 -4118 -552 888 1371 6202 6858 1829 -4147 -6994 -4887 -1051 1912 3038 -530 -3686
3478 -3686 -1842 469 1069 -1711 -5891 -6527 -6943 -13681 -16249 -15050 -7313 -3337 -1459 -881 892 -1950
3462 -1950 -2098 3569 1882 -1294 -1773 -571 572 -1318 -4177 -8403 -5859 -3828 -2318 -879 -3588
3447 -3588 -3492 -3156 -3514 -2446 -5624 -5886 -2398 -839 -4338 -4094 -4618 1022 1919 3554 3920 -1193 -1402
3430 -1402 -1935 3240 6780 5703 1554 -1685 -6145 -3738 -4037 -1698 -784 2919 2715 2337 574 -1620
3414 -1620 -4032 -4248 3620 6223 991 -5496 -7091 -6938 -5296 -4309 -4047 -4092 -7679 -4983 -4645 -6878 -3169
3397 -3169 -1892 -1629 540 6915 6881 6864 4076 5425 5534 6421 8262 5974 140 -2122 2009 7155 8783
3380 8783 6029 5414 4454 6191 6896 3062 103 -2416 -4604 -4906 -3471 -5204 -4294 -3517 -6346 -9683
3364 -9683 -9556 -6139 -2179 2646 3260 3475 2802 3498 3184 6024 9369 3157 -2542 -2850 294 281 -1484
3347 -1484 499 2295 230 99 1332 -1261 -5580 -8073 -8796 -6294 -2453 1620 3728 1832 2012 2520
3331 2520 3056 -166 -2411 -2314 -3879 -6240 -5125 -1471 25 -4621 -9536 -11832 -9824 -4300 -1450 -7249
3315 -7249 -9598 -10964 -5101 -3413 -4467 -5184 -6085 -4561 -4463 -2817 -3104 -5722 1234 5177 1168 -1124
3299 -1124 812 3083 -258 -4894 -2021 -1986 -2674 -4216 -689 -1281 -2033 -1184 -7048 -9475 -4561 -4346 -3897
3282 -3897 -2646 -582 -2027 -1834 1516 -915 -660 1188 516 1531 1457 2023 3011 1692 1085 2878 3803
3265 3803 2740 -1114 -723 -340 -521 -2442 -312 1858 2989 301 -2610 -45 1704 3179 622 1650
3249 1650 847 -2438 -1210 -4282 -5917 -8270 -10349 -8793 -7601 -7060 -5035 -4307 -5485 -6757 -6197 -5976
3233 -5976 -4321 -5288 -5019 -5528 -2235 -878 -2990 -6283 -5039 -4076 -6852 -8565 -4021 -2944 -1082 -1920
3217 -1920 -3668 -4117 -3030 -1911 -3146 -8 4113 1622 681 1835 1972 4321 3069 -3345 -9977 -9204
3201 -9204 -4260 -4730 -3865 -4124 -5251 -4654 -4554 -1793 -2727 -1776 -209 -2408 -4156 -1048 568 -3398 -6023
3184 -6023 -5402 -7799 -5624 -6709 -6132 892 -338 -5203 -3530 -3623 -3873 -1551 1831 3937 6650 5653
3168 5653 1410 1829 -622 -6455 -9685 -6867 -4638 -6786 -7131 -8213 -6399 -3846 -4066 -6749 -6976 -6724
3152 -6724 269 1744 1127 1714 1322 3695 2005 1174 3827 3495 -1206 -2966 -5736 -3252 196 3167
3136 3167 9028 10038 6113 8038 4543 -655 -5531 -4502 -1090 339 1829 2722 382 1139 1269 411
3120 411 1875 -268 -6097 -8778 -6590 -4885 -3026 5543 6019 522 -3802 -4255 -6069 -5966 -4248 -803
3104 -803 2494 2018 -297 -1336 -6865 -6762 -6131 -3939 -3468 -5008 -3971 308 5612 5422 6389 7060 2771
3087 2771 3220 536 806 2373 3706 -87 -1941 -4627 -4969 -6319 -7204 -3656 -3249 -2270 -1195 -2328
3071 -2328 -2152 -3548 -3024 -2877 665 2058 862 1028 2277 703 -1807 -1793 341 -42 -1146 -626 -3027
3054 -3027 -5089 -3900 -3375 -661 3416 5023 3594 -255 -2211 -3919 -5222 -7444 -4665 -323 -4011
3039 -4011 -1486 -3929 -9142 -6537 -2359 788 741 3348 6880 2766 592 -2068 -884 26 -2259 -2303
3023 -2303 -1142 -7566 -12211 -11849 -5660 -1985 2358 5094 885 -1620 -4564 -3474 -5602 -3640 -6567
3008 -6567 -7969 -3977 -1585 -3394 -3276 -1462 -89 -5137 -4755 -4507 -8155 -7311 -549 674 559 -2475
2992 -2475 -1006 658 2688 6235 6889 1253 -1501 -2294 -3462 -4824 -5866 -5138 -5147 -875 -878 -3901 -2801
2975 -2801 -3435 -8965 -8684 -6012 -5834 -3494 -5198 -5947 -5153 -3678 -3727 -5317 -7231 -7742 -5263 -1553 1495
2958 1495 2841 2560 -2195 -5665 -7515 -3909 -5733 -5824 -2025 -2568 -4700 -5188 -1247 -1692 -4450 -4351 -5389
2941 -5389 -4082 -3777 -3828 -4474 -3943 -4764 -3854 -2320 -2458 710 1227 1919 6022 4846 4644 1394 -2814 -5337
2923 -5337 -6769 -4150 -976 -3483 -3014 -525 -1899 -1569 -3767 -459 1381 -1932 101 -1405 -4232
2908 -4232 -5703 -1509 5174 2447 -724 3216 5382 2947 2845 1850 1051 -1352 -2129 -365 4180 7246
2892 7246 6949 6486 2192 -707 -2858 -3114 -5367 -2447 -1176 -1563 -502 -2246 -5651 -3793 -4273 -8511
2876 -8511 -9034 -5699 -5640 -6415 -6084 -4521 -2509 -3998 -8073 -2688 -858 -1411 -3165 -3091 -4574 -6481 -2361
2859 -2361 -610 753 2595 2068 3747 1948 -373 1087 -1785 -2718 -5730 -6635 -4021 231 3539 874
2843 874 -3554 -5681 -4328 -5262 -4956 -1165 439 1502 5897 1295 -1409 -1454 -3770 -4990 164 -3404
2827 -3404 -4080 -357 2509 2933 6307 4629 1741 4652 8371 7731 4728 2624 170 874 -1672 507
2811 507 939 3124 6804 2784 376 -1923 -2325 -2127 -5310 -3857 -5520 -6322 -750 528 -1199 -632
2795 -632 916 5203 3991 -353 -1981 -1444 -965 4990 4430 2230 -1290 -7409 -5717 4758 8149 6368
2779 6368 1419 708 2969 339 32 648 3510 6542 1697 334 536 2259 -2461 -5169 -8015 -7475
2763 -7475 -3362 2566 3554 3645 516 -1879 -2975 -1354 -1552 -2768 -4065 -6939 -7016 -3580 -4737 -7021
2747 -7021 -4523 -1062 -2042 275 950 894 -124 3348 8276 6771 5402 1410 4451 3436 3296 1515
2731 1515 1928 -40 -4373 -4772 -209 -5394 -6906 -9896 -5578 1232 2065 2025 5962 3599 -2724 -3768
2715 -3768 -3844 -3257 -4647 -5169 -8187 -5027 -2880 -4306 -1317 614 -1274 -2157 -1534 58 -244 -333 -38
2698 -38 1431 -1155 -3702 -1380 -1702 668 1463 1166 -2723 -3043 -4388 -7124 -7221 -7379 -8293 -9600 -7456
2681 -7456 -6127 -4633 -2320 -2681 -8375 -8506 -8606 -9231 -7299 -9410 -8358 -7809 -5581 -7214 -5093 -3878
2665 -3878 -4811 -6679 -5502 -3771 -4091 -3903 -1271 -1131 -1115 -3609 -6365 -5893 -3466 -2241 -61 -1566 -4495
2648 -4495 -3189 -5206 -7303 -7443 -6298 -3246 -1124 -3678 -501 -2839 -3058 -1186 1234 910 5087 8023
2632 8023 7189 7212 5795 2581 -528 -3726 -7215 -4516 -6814 -6505 -6105 -8475 -6128 -1746 1910 1443
2616 1443 -2064 -3925 -2613 -2295 -4688 -3709 -5285 -6247 -3024 3639 5690 170 -5855 585 3050 896
2600 896 -3195 -2311 -3937 -5485 -8063 -13348 -11895 -6270 -2986 -1765 395 -833 -1730 -1826 -4794 -6211
2584 -6211 -7537 -9297 -4441 2562 6464 5281 4094 1658 1946 -645 -6745 -6602 -4425 -624 2944
2569 2944 6530 6163 8581 7136 3438 1609 -112 -207 -2824 -2082 -392 1243 -1175 -3882 -6897 -11362
2553 -11362 -12660 -8737 -5942 -5461 -4529 -2818 -4597 -4406 -5635 -6578 -7284 -5249 -1592 -272 -53 3715
2537 3715 2101 -925 -1805 -1042 -1704 -153 -675 -2420 -1421 -472 -4431 -4375 -2551 -2767 -3752 1799 6739
2520 6739 4799 776 711 7599 8199 1825 720 4121 4943 2304 -1724 1227 766 3835 2966 2542 14
2503 14 -3013 -2120 -3761 -4433 -3516 -1623 1318 2261 3481 4708 4401 3619 2528 -1894 -3829 -4046 -4886
2486 -4886 -1596 374 638 320 2672 6355 7674 4494 2524 -1926 -5661 -3181 302 632 157 -1815
2470 -1815 -202 175 2043 4663 3877 -145 -1775 -707 2061 1575 -146 661 1008 -2483 -3463 -2744 1115
2453 1115 1164 -4817 -6556 -3372 -5092 -5422 -2899 -402 -647 1282 1457 -2172 -3302 -4171 -4119 -4165 -5646
2436 -5646 -4979 -3336 -5994 -7938 -6962 -4297 -4141 -3458 -3926 -7495 -8778 -4794 -379 2746 2810 1008 -527
2419 -527 -1846 -5558 -6165 -1819 4104 2093 -326 2753 2204 688 -2484 -4592 1586 6229 7569 8053
2403 8053 4611 -183 -2126 -1337 -2239 -1724 -2316 5262 3662 -920 -2890 -4272 -3752 -3788 -3383 -969 1415
2386 1415 44 -2101 -2254 728 1796 2713 1653 1535 -2734 -6482 -3788 816 -2735 -6109 -5146 -3323
2370 -3323 -703 -36 195 1181 2094 542 -2824 -4341 -2631 402 2536 2820 2950 5030 6982 4318
2354 4318 128 -1643 -2188 -6405 -6052 417 2891 1044 -946 -5348 -5631 -7839 -5579 -1113 1474 -2114
2338 -2114 -4070 -2863 -1947 -3492 -3248 -5666 -2579 -2868 -3068 -5087 -7022 -5979 -4870 -1973 2872 1717
2322 1717 -1850 -3522 -2691 -3487 -3811 243 2566 3822 3493 1417 -2307 -834 2892 4477 4327 5024
2306 5024 1839 227 -844 1573 3848 -155 -975 -3747 -4915 -667 1705 3642 1797 -2981 -956
2291 -956 2921 4220 1488 -3550 -3634 -1906 2287 5814 1261 714 -174 -4386 -4079 725 2335 1913 -1323
2274 -1323 -2358 -4961 1283 5195 3904 2518 4839 3096 1664 -3012 -3751 -5287 -6275 -917 -258 2591
2258 2591 2319 -1144 -2257 3413 3448 -4477 -3931 -1497 -1938 -714 3018 2324 2547 2999 -1485 -719 2509
2241 2509 4251 5524 7487 4485 4577 4592 6811 4937 1452 211 918 -1834 -3496 -1955 1254 -1145
2225 -1145 -6280 -5312 -3468 -1526 -1120 2463 2914 -3888 -2696 -3422 -2772 -927 -2728 -2320 -1124 826
2209 826 -2544 -4078 -6869 -3618 160 4191 5409 806 -175 476 918 -1758 -2055 -766 -734 -927 2486
2192 2486 3052 1739 1498 3715 4146 4875 1314 -2756 -3131 -1414 -2226 3240 5455 657 1261 5605 4523
2175 4523 -510 -1406 -619 -142 145 -5205 -5739 -6019 -2015 833 1988 853 913 7045 2248 -4548 -6082
2158 -6082 -2881 -5452 -5500 -6053 -3419 2396 4543 7529 9909 7550 3413 1284 1542 1063 550 13 -22
2141 -22 -2931 -1654 -311 -3741 -1773 -1652 1057 5077 9644 8583 4421 5350 3834 -931 -1613 -547
2125 -547 -373 2377 2402 -432 -748 -968 5933 8843 5698 7097 8143 4519 3188 3436 153 323 -815
2108 -815 1200 157 3751 7519 6531 1460 758 232 -1715 -2573 -4591 -8120 -4907 -1404 2143 2010
2092 2010 -494 -591 -39 -2573 100 -1591 -4195 -8329 -10709 -5942 -5659 -5902 -2357 2649 2908 1105
2076 1105 -536 -2336 -1351 577 1068 3117 2573 4272 4054 5991 5924 4807 569 1866 4885 4556 -12
2059 -12 -1046 -1911 -1450 -48 -947 -1257 -2280 -884 1289 5619 6073 2748 1476 -260 -2493 -810 -1443
2042 -1443 -2691 -444 -661 1404 4291 3710 571 4821 3077 146 -1301 -4053 -5080 -599 4946
2027 4946 326 -1421 -5514 -7784 -5867 -3280 243 929 5346 8420 2671 -2245 -139 -4718 -9084
2012 -9084 -8786 -5345 278 1699 -3831 -4530 -3694 -79 460 -3028 -899 -1373 -1950 1531 3613 6333
1996 6333 2113 1542 3941 4018 9367 8708 4159 3492 6607 5285 1113 2901 2175 -4748 -7433 -8407 -5388
1979 -5388 -6654 -7661 -7866 -7528 -2236 3650 2633 -608 -3204 -4740 -5909 -2823 -631 -1683 -4867
1964 -4867 -1614 687 -127 641 35 342 4612 5440 5020 3862 -2547 -606 -2564 -860 2341 522
1948 522 -76 -3202 -2889 -1963 2078 1575 -1785 -1914 3098 1566 -1507 -1472 1014 1495 -474 -926 -367 3499
1930 3499 4422 -1051 -2301 1235 383 -2315 -1472 -1243 -740 -409 -1235 -2413 -3677 -1410 3564 3736 -1998
1913 -1998 -1712 630 714 653 568 2714 1173 -371 3183 6857 5544 1891 3972 3622 1728 -129 -81
1896 -81 1835 280 -640 -1267 2352 -794 1454 1478 4119 4976 3629 2705 5306 4763 6557 1418 -2131
1879 -2131 -3119 -4387 463 3429 3021 2157 4567 2289 -338 -1238 386 -779 172 2084 7680 6482
1863 6482 509 -1501 148 2274 1972 1884 5099 6644 7318 5038 1902 3041 5120 5212 1047 -3278
1847 -3278 -3363 -1358 722 3322 2328 502 1092 165 -2266 881 508 1591 4183 3697 -1397 -4644 -6405
1830 -6405 -4478 -1496 -5345 -8606 -5881 -3975 -1157 1739 4865 7417 8169 6107 -577 -1341 3983
1815 3983 2925 2151 3389 2661 6289 2592 -274 -2366 789 2578 2134 2979 3006 956 1333 3133 1606
1798 1606 1761 885 598 5355 4918 274 -3921 -3018 -4312 344 1470 709 -9 -496 -659 -661 -3980 -3502
1780 -3502 -1012 -5520 -3379 -614 -2196 -3285 -1629 -2670 -5670 -5696 -7014 -6356 -6334 -8512 -7410 -2638
1764 -2638 1006 534 -581 -3758 -3424 1982 1804 -1629 -2000 -818 -4792 -6201 -2939 1798 2395 1314
1748 1314 -2225 -3680 -2377 -3283 -3711 -6265 -2499 -1544 -2566 802 5520 7101 2835 1901 2590 -29
1732 -29 -4255 -7520 -8397 -9789 -5106 -7136 -10450 -9353 -6144 -2442 -643 2196 4801 5772 6542 4250
1716 4250 3314 -86 -1898 -1939 -3825 -5021 -4291 -1775 726 -354 -1799 -3179 -3583 -758 859 3813
1700 3813 4985 4871 3166 -2453 -4689 -4072 1107 3628 5531 5810 3462 -323 -1257 2723 3416 3687
1684 3687 595 -2154 -924 337 1657 5085 5863 4375 1601 1737 261 -2070 4416 7146 1271
1669 1271 215 815 112 368 -1597 1061 3199 3314 1881 783 -147 -2691 -2131 -2712 -1827 -448 -1485
1652 -1485 -91 -1959 191 3609 2789 -752 -4699 -4096 -1475 468 -996 944 5632 5886 3039 2616
1636 2616 3113 1448 2166 734 4929 7665 5925 5538 4737 4627 3608 6019 2557 96 5051 6615
1620 6615 4334 3041 -4276 -3590 -666 1598 1476 3040 5082 4824 4269 2732 3857 640 137 -2841
1604 -2841 -1101 561 3344 4512 3529 2738 3273 3816 2999 3529 4729 4595 8358 9659 3750 479 -599
1587 -599 -2101 -4501 -3006 -3156 -16 2479 4057 3919 8071 10293 9678 5847 -438 -1574 -5074 -6810
1571 -6810 -5093 2106 7686 4531 3428 -633 -3645 -2315 -182 -1603 -3069 -1882 674 1596 2752
1556 2752 2837 2151 3029 1831 1807 2493 4099 4445 2354 -2033 -6013 -5826 -3484 -1186 -438 -1727 -1003 3088
1538 3088 8493 8150 7865 5931 8761 4477 -26 -1795 279 1682 4678 3760 3022 1301 2631 1923
1522 1923 1847 135 2676 6593 7907 9133 7671 3435 -1257 -2854 -6942 -4182 -615 -4181 -6362
1507 -6362 -7409 -10862 -9599 -4041 3134 3140 579 475 3427 2983 2572 8163 9465 5701 4270 2619
1491 2619 3067 2634 -730 -2821 -14 233 2816 4328 4955 2869 4369 -238 -1857 2467 1458 -3408
1475 -3408 -4614 -3565 1479 1922 1975 347 -363 2659 3734 3874 -675 -2537 61 2254 3064 2305 3779
1458 3779 5886 4073 819 3620 1761 289 3676 2524 4425 4396 5802 6001 4998 6067 11057 11563
1442 11563 7931 4631 1899 1566 291 388 -1451 1177 3729 2926 2124 370 -2152 -942 434 -2870
1426 -2870 -842 801 3434 5807 7186 2393 1257 734 3707 6136 2365 2837 5095 2236 1254 3954
1410 3954 -542 -3239 -3575 -2844 -5714 -6138 -5156 -1793 557 -1715 -381 -3325 -4738 -3663 -2929 -2831 -145
1393 -145 3527 3102 2650 1494 426 1491 178 810 4470 2916 -670 -839 492 -1878 -4853 -758
1377 -758 3766 3425 5608 6525 4171 3300 -212 133 1394 1725 1351 375 701 6231 9348 10209 6696
1360 6696 5319 12185 13068 9800 5208 1568 1093 2411 -635 2162 875 182 -1721 -3511 -2706 -675
1344 -675 2785 3827 1723 2645 868 511 3662 2964 -2151 -148 3826 4142 4117 3783 3354 -380 -1573
1327 -1573 -2921 -4361 -4133 -1712 1509 -1617 -3679 -2292 557 -934 1339 5392 4027 2333 1500
1312 1500 2763 5778 8184 8678 6998 2072 1026 1222 3635 4030 4373 6346 3564 6072 6642 6693 9574
1295 9574 6969 527 -1191 3310 7666 8393 3404 815 1791 -2974 -2755 932 2146 838 -154 1981
1279 1981 2787 -1900 -2280 -228 -2196 -1237 2064 1063 -1069 -788 -389 2406 2752 5548 6720 2661
1263 2661 2168 3674 4399 2757 1577 2500 1061 2778 2814 1917 5483 7015 4021 -287 -3170 -3605 -2808
1246 -2808 -1368 4848 6808 6358 3443 1374 1214 1699 3941 2248 -693 -777 3688 7933 4576 -205
1230 -205 -674 24 -3113 -943 2869 3696 -2521 -4962 -3375 -3019 -2447 -3304 -430 3383 3231 3201 1961
1213 1961 3537 3155 2250 3720 3723 4354 5460 6224 4316 3475 4403 2676 1870 3872 4555 4475 3773 5577
1195 5577 8972 8223 6959 4352 -199 -1316 625 1935 1378 1579 9308 12655 10952 12496 11797 8971
1179 8971 9222 6970 6201 8836 6783 -75 -3852 2219 4387 4775 5349 3231 -2595 -4021 -3737 -448
1163 -448 4318 3490 6372 8297 7227 4329 448 -2793 1338 5984 8470 8410 3235 4708 6253 7429
1147 7429 4481 4123 5696 8591 8473 8239 7323 5999 3935 -279 -1912 -4533 -4434 -3709 -3980 -5187 -3182
1130 -3182 -363 4378 6100 4926 4600 4609 9978 9382 6333 3115 2053 3246 7258 8538 6725 5803
1114 5803 4636 7 365 8348 11413 5103 2465 5605 7646 7538 4634 1609 2453 482 -796 672
1098 672 1082 3939 3548 4352 3468 1701 -2689 -3369 2463 3459 2736 641 -206 1883 581 -694 1341
1081 1341 4035 2063 863 1175 -1141 -3460 1840 2110 1076 -2039 -304 1502 -102 1328 -569
1066 -569 -1721 3166 3231 3673 2381 -2688 549 3397 1177 3387 4120 5749 4773 1450 4945 5578 613
1049 613 -1328 -2360 762 1561 -22 2470 4456 5081 2500 2753 2129 1608 3215 3589 4083 5699 6331
1032 6331 4831 1691 50 -1519 288 2990 2119 -921 348 4748 1351 -1608 -1276 -609 412 -2276
1016 -2276 1367 4381 7056 3742 907 -1535 -891 290 -181 3124 4451 3593 4908 1940 -630 909
1000 909 -337 -844 1303 -1150 -4625 -5042 -1228 1894 885 3145 4482 1221 -1903 -3029 2269 6246
984 6246 3055 -1102 -3234 -4663 -5226 -4927 -3411 -4960 -7820 -7889 -6386 -5305 -5212 -575 4626 8851 10005
967 10005 9896 6127 4241 1201 1444 1692 10684 11482 10628 7386 6026 2623 1356 -1029 2332 8178
951 8178 2649 -1759 -477 4468 8721 9490 8586 5395 -419 -1903 1614 3612 6737 7711 5275 3634
935 3634 -3220 -1904 1463 2162 5119 5000 2454 -2016 -3127 885 3424 5975 1994 270 432 2140
919 2140 4122 3399 3031 918 6476 9380 4088 3570 3334 4536 5163 4995 1196 2736 7961 9865 10026
902 10026 7680 6677 3719 2003 2757 -496 2108 2392 -942 -4211 -2360 -1089 -865 -5710 -6692 11
886 11 3687 3991 -3415 -4554 -5105 -6434 1455 2765 2053 2028 3050 735 -6779 -7426 -3358 1956 2300
869 2300 -474 -1181 1723 2167 1578 2070 554 -3598 -3369 2253 2891 2517 1076 -2777 -1868 -474 1311
852 1311 4480 7765 8945 11957 14768 15513 11175 9931 10229 11976 11345 6768 3730 2110 119 -168
836 -168 2403 1980 1686 4579 5827 6364 8471 7284 4461 3488 -428 -411 5108 6909 3236 -1705 480
819 480 4553 8522 7243 -342 -4066 -2827 870 866 -3209 -4581 -5045 -5975 -10574 -12635 -11018 -5713 -370
802 -370 3567 4343 4336 3670 -2284 -332 -1503 -4267 -4684 -1708 -3063 -3450 -5755 -1317 532 -815 -473
785 -473 -550 -2124 -1950 -2889 -482 3972 4607 1820 1577 2257 207 -231 1456 676 1088 4279 7139 8246
767 8246 6261 6445 5410 3137 -3767 -4291 1522 4128 827 -1206 1996 -405 -1878 -149 996 846
751 846 -2094 -5216 -5598 -4596 -6158 -3818 -2326 -1828 95 994 -1382 -2223 -2431 1193 751 229 2818
734 2818 1080 1356 -218 -899 -1679 468 2536 -863 -3047 -3930 -5886 -4048 926 1758 5557 3727
718 3727 1564 -2025 477 570 2440 4003 4 -2061 -3023 87 1052 -1913 -6711 -5184 688 4364
702 4364 3566 711 1434 -867 -1267 -999 1836 3187 6409 5014 110 -3049 -5451 -4174 -2657 134
686 134 -1447 -3363 -3829 1543 4085 6056 2772 -2009 -3213 -3996 -9333 -10898 -10399 -7423 -5848 -3504
670 -3504 -4269 -4193 -4871 -3147 -325 2366 2226 -4211 -6382 -3093 -867 -3246 -243 -1622 -1150 2686 4409
653 4409 2507 -3464 -9222 -7579 -5390 -1445 1550 1584 1809 -1318 -2246 -4803 -2719 -2843 -5824 -5686 2173
636 2173 10137 4420 861 -2552 -7381 -4786 -4545 -5250 -2916 1686 2162 -1091 -34 944 707 -2560
620 -2560 -219 -2916 -3464 963 4747 6542 6135 37 -4607 -2912 -640 479 318 -2679 -1089 -491
604 -491 -349 -1327 -459 -95 942 3045 6255 6886 3488 2053 3723 1773 276 2153 1544 -485 -176
587 -176 -5378 -6172 -3033 1634 7739 11204 8944 6116 -1824 -1264 -249 -119 3397 7295 3020 1641
571 1641 -1573 -210 172 -1571 -6645 -6029 1222 4939 3401 2980 3286 3871 -1384 -6610 -6721 -6838 -2983
554 -2983 1968 2125 1396 272 4618 6909 2818 1059 -2478 -2430 -5293 -8825 -5676 -1769 -1559 551
538 551 1263 -1514 -1738 -3068 -807 -3303 -4177 -1748 6539 2790 -1119 106 1466 3506 3500 1179 -2763
521 -2763 -4933 -5640 -5874 -5713 -434 4132 2639 -3896 -2029 -2813 -3919 -4755 -4856 -2860 -2648 -1678 -2229
504 -2229 298 -631 -4047 -1400 4911 4939 2632 2361 3857 1398 -2726 -3896 -10145 -12202 -5841 -2771
488 -2771 1466 1298 926 3036 4117 4989 1461 -2171 -4248 -2737 -3473 -5882 -4968 -2857 -3663 -2124 -2091
471 -2091 -575 -4444 -6050 -5058 -5386 -6746 -4995 1502 5792 6310 9243 7858 821 -943 169 3625
455 3625 5327 3234 1306 4503 5208 4426 7418 7469 5586 550 -4404 -5599 -7376 -8804 -10349 -11030
439 -11030 -12277 -11108 -6956 -5033 -3007 278 3346 1638 -1325 -626 1963 2799 1853 -303 -4071 -3116
423 -3116 2285 3454 1362 -343 1708 -874 -3786 -4642 -1699 2736 1912 924 3026 3350 2441 3008 8284
406 8284 7206 3974 6902 4216 -1788 -3354 -2644 -1602 -1804 1425 4572 1323 -26 2488 1465 -2734
390 -2734 -1076 205 28 1659 -190 -641 -163 45 -82 3233 4264 2660 1643 -2571 -2158 -1483 -753
373 -753 -1433 -3136 -1942 1784 3785 3500 907 -2699 -2821 -1788 785 -1453 -4865 -7218 -6275 -933
357 -933 -1756 -2201 -3387 -3684 -479 -3650 -3701 253 3167 1634 -608 -2056 -1804 -3989 -266 27 -3395
340 -3395 -3737 -1571 426 986 -539 999 1942 129 -945 -4047 -6743 -4840 -5595 -5217 -2457 131
324 131 -1785 -3079 -2470 -737 2610 2843 -2250 -4310 -5419 -5131 -3535 698 1252 85 -459 3064 3626
307 3626 2715 1443 -2373 -6399 -5994 -4950 -5013 -4295 -2903 -3617 -3081 -2398 1221 4914 3753 4944 8348
290 8348 7092 3240 4691 2810 585 1249 4549 5798 979 -2920 -4859 -4930 -4105 -4120 -5362 -7119 -6003
273 -6003 -5267 -4282 -1115 1719 891 -2830 -2675 -3430 -5310 -5538 -1561 -1082 -410 -1024 -6500 -7558 -5526
256 -5526 -4097 -359 -928 -1172 1728 3729 4121 3326 2752 2753 -893 -686 -600 -3775 -349 -251 882 2440
238 2440 454 113 4683 7461 6173 4265 3839 728 -2472 -4029 -2163 -1959 -982 2475 3609 -203
222 -203 -1037 -490 -2339 -4347 -4027 -4470 -3392 -1419 -2408 19 270 646 1795 -1048 -2588 -3192 -1055
205 -1055 1459 1539 43 -1059 -1889 -2969 -2870 290 2066 3376 3015 -123 -3740 -4701 -1141 -644 1812
188 1812 1619 -335 93 -196 955 1925 2281 1413 1975 -1593 -2927 556 -2009 -5769 520 5498 1888
171 1888 -658 -448 173 -2549 -2021 -756 -690 157 1266 3149 2155 2676 2973 2406 1078 -250 -1466 -991
153 -991 -2121 -1990 3261 5339 6793 7956 6113 5130 1335 661 -2622 -4519 -4939 -4679 -6655 -6357 -7143
136 -7143 -7389 -5170 -2247 -3535 -3251 -1967 -805 -728 -1138 3019 4019 1380 1142 1720 2139 -330 -189
119 -189 -95 911 1502 226 224 -1326 -1273 -2790 -5855 -4808 -5308 -3783 -1979 449 -1157 -1086 -1209 -1735 -2324
100 -2324 -3663 -6864 -8065 -6701 -4073 -1330 -375 367 3226 4261 4584 3771 4278 5088 3655 2545 1080
83 1080 -2997 -4616 -2950 259 1385 -140 1626 -800 514 -4862 -5651 -2820 -1595 -2957 -1479 1151
67 1151 -722 -567 -311 327 2061 767 615 -714 -3720 -2590 -1065 827 922 -2643 -3941 -4480 -4955
50 -4955 -1963 -606 -6 469 -2583 -5016 -858 2383 3293 2336 1443 1482 2619 4547 6292 4192 1800
33 1800 1705 -240 2438 2872 527 -976 -3179 -4452 -3064 -4272 -4274 -5352 -6163 -2601 -2555 -377 -648 -907
15 -907 -887 -1128 -569 -858 -1750 -2644 -2111 -2289 -2281 440 2334 3515 2893 827 -740
0g40
$$ Imaginary data points
##PAGE= N=2
##DATA TABLE= (X++(I..I)), XYDATA
32767 6688 7141 7000 7203 8019 8165 9301 10480 9315 9107 9341 9885 11208 11705 10862 10497 13110 14538
32750 14538 17135 16974 19045 17377 19361 22808 23741 21350 21025 22111 24029 24764 23504 22830 23794 24468
32734 24468 24962 25870 25819 27426 27551 29944 32306 28224 25449 24517 26561 27043 27415 28591 31352 32986
32718 32986 36093 35043 33469 36225 36067 34347 36422 41250 40317 40734 42125 39887 37306 39039 39249
32703 39249 41669 41337 40075 42534 42749 44835 46383 45567 44710 43942 42870 40522 42589 40532 40015 44146
32687 44146 46864 50858 52935 52083 53985 54242 53916 56928 53894 52184 51476 51070 55445 59262 59848 61977
32671 61977 60020 59919 57755 55837 59044 60744 58439 56006 55621 58468 63457 65163 66480 69189 70079
32656 70079 69053 67289 67319 67818 70209 70213 70772 68621 68168 68225 69008 69183 67754 65325 66380 68568 68070 67441
32638 67441 66136 67792 69927 71876 71426 71603 70303 68946 69752 70885 73931 77491 76294 79647 80987
32623 80987 82010 83310 86609 90011 87393 86771 87440 85705 84296 86941 86343 81528 78828 84026 85785
32608 85785 86640 87922 89025 88240 87447 87105 89141 90987 90353 92321 92723 91869 93485 91548 93454 97813
32592 97813 98185 101708 102242 97312 93492 96336 98590 98977 99528 101116 98528 97197 95915 96721 97799 97266
32576 97266 98150 97392 97067 98256 100878 100883 101353 101766 103874 105502 104940 105696 104108 103519 105420 105480 102999 100838
32558 100838 101759 102258 102523 105800 105900 107105 108591 104448 102897 107523 111276 112906 111339 109256 111217
32543 111217 113313 113825 113034 115916 118816 119570 117385 115420 117162 119388 121808 126298 124217 122631 123060
32528 123060 121246 117162 114632 117266 120755 122481 118986 115477 114934 117117 117366 116499 120999 126831 127199
32513 127199 125572 124149 122334 124569 128634 126059 125298 125145 126255 128833 125966 123480 123387 123746 124960
32498 124960 127168 130123 131499 134067 132907 131656 134281 137160 133761 133600 132748 131925 131338 129148 126395
32483 126395 125739 127898 130155 131969 132178 131885 133459 135708 136261 136699 136792 136471 136024 134364 134451 135613 138501
32466 138501 138237 135878 135725 137605 139357 139981 140570 140886 144065 144134 143589 140054 140593 140969 140705 140761 143029
32449 143029 143961 144548 143578 139428 133667 131845 136527 139923 142188 141658 142441 146043 147428 142182 141969 142629
32433 142629 145008 147187 145982 144295 146951 146183 144416 147104 144549 144124 143064 144440 148781 147461 146007
32418 146007 143960 143487 146521 151389 153289 151654 150361 148720 146525 144747 146357 153099 153720 149335 150537
32403 150537 153681 151419 149929 148628 150091 150457 150953 151574 151755 152093 153840 152860 152989 155035 152876 149318
32387 149318 150494 151301 149040 152763 156727 158830 157865 157347 156747 154838 157447 155625 151501 158179 163865
32372 163865 166170 162732 158850 158829 154806 153422 157031 159118 159934 161352 158516 157289 156524 160129 159199
32357 159199 158970 157913 158668 162336 167914 170091 169318 167863 167858 166678 160130 162107 161669 161612 160366 159263
32341 159263 161050 160477 157575 159059 163694 160136 157283 155429 152769 156796 156462 159030 160579 156282 154562
32326 154562 155650 156086 159126 160404 162430 167269 167422 166381 165478 165605 166646 162207 159549 161533 160039
32311 160039 157021 158155 161784 164820 164788 162984 162583 160046 160822 165187 164969 165175 171018 173315 169893 165659
32295 165659 164935 170237 170127 168416 166348 165057 167260 167319 166477 168532 170699 168736 169798 166597 164955
32280 164955 169304 171430 171758 172423 169086 169045 171601 173574 172164 167964 166403 171532 174557 173263 170061
32265 170061 170697 172472 172215 170600 176057 177978 174932 175499 173850 170211 170020 167524 166748 168670 171933
32250 171933 172338 171486 168405 165348 167196 169110 172347 173222 168637 166647 164071 165219 169429 171416 171187
32235 171187 168724 165702 166943 165278 167522 169511 168285 168504 169320 169637 171212 175815 177457 172635 171706
32220 171706 171225 170396 171628 170856 168726 168020 173357 175404 175251 171352 171388 170926 170096 171256 171145 169743 167962
32203 167962 170658 175729 178192 178056 177228 176754 175759 178150 175811 172982 178340 176077 175657 172552 173601
32188 173601 176153 172639 170022 169655 168020 171744 175261 176305 177651 178554 179149 177185 175988 172938 171042
32173 171042 169245 173332 181398 181244 181328 182483 177969 177890 179592 176663 170434 173742 176112 181439 185037
32158 185037 181386 176817 172846 171474 177089 182821 183477 185461 186664 183051 180133 178755 179623 181305 184109
32143 184109 182774 180486 176138 169660 168255 168945 169500 170167 169902 172989 173264 174809 178791 178962 174555 173072
32127 173072 172031 174522 178486 179785 178038 180971 176626 174289 170130 168979 170499 171939 177801 179905
32113 179905 176901 172670 171436 173916 178418 181760 181294 180001 185375 183310 181470 179824 181317 179212
32099 179212 176209 172827 174232 176013 179559 176419 170964 173393 172137 174619 175385 175234 173686 173145 172322
32084 172322 170497 173160 173469 175066 174035 175467 173560 173335 173187 176349 175680 172190 175322 176842 176730
32069 176730 177925 173991 172891 171871 174154 174996 173641 171441 173668 175375 178721 174659 176868 180277
32055 180277 183184 179875 179324 177890 179173 178693 174354 176214 180549 181799 179289 176997 173408 171126 174050
32040 174050 178350 176625 173309 170475 171088 176262 173877 170770 170218 176586 181669 181020 178786 181521 182936
32025 182936 181156 179424 171553 173999 178119 182222 179432 178634 179807 182873 182465 181603 181815 180665 175437
32010 175437 176587 179454 180447 182391 183499 184071 182026 179391 177278 177569 176108 176609 179075 179631 176004
31995 176004 177636 178405 177749 184612 186404 183014 180790 181956 180804 178214 179565 179634 180541 181390 182458 179577
31979 179577 171452 173431 177217 177997 181028 182391 177668 178794 180456 182157 181678 185801 185777 182709 180047
31964 180047 179479 178587 179886 182806 177806 174132 169337 167085 169540 174759 175501 174603 170898 167946 171808
31949 171808 174558 171124 172487 172488 169051 169132 171842 173415 174531 174931 178154 180450 177118 175992 173023 170635
31933 170635 168503 175519 178336 185182 183514 182592 182710 180146 174796 172974 172528 178883 183295 183845 183253
31918 183253 182228 183238 183895 182781 180678 178728 176479 175661 174617 176751 177063 174995 175327 176764 180373
31903 180373 178218 177884 178437 181295 180078 175809 176542 177030 176616 175754 175811 179773 182817 179808 178201 172449
31887 172449 169061 176646 181747 178550 170072 170054 172785 174591 173722 175432 175758 176897 174534 176959 176051
31872 176051 174872 172975 175069 175907 178674 181554 181318 178068 176452 174428 170735 168441 171017 176931 180266
31857 180266 178244 174207 173671 176392 173922 172514 171778 173120 173256 174282 176685 179983 180776 181082 175739
31842 175739 174163 178040 182788 182921 184789 184875 181910 179433 181623 181763 179969 180011 179099 174435 170289 170123
31826 170123 172140 179678 183252 181570 182162 179094 177604 175194 175396 178096 177356 176544 177585 177745 176013
31811 176013 176451 179118 181497 182606 181333 178971 181463 184749 182805 177607 176801 176348 177329 177450 180239
31796 180239 182658 179925 182388 186437 183921 181300 180273 181245 179855 181825 180127 179953 178694 182246 182356
31781 182356 182366 185620 184474 182724 182699 182852 182380 182211 181771 184278 181973 174687 175592 177367 177423 179683 184503
31764 184503 184544 181488 179698 180584 183793 183477 183039 184865 186668 185610 179301 178070 181584 180940 186243 189647
31748 189647 186902 187062 184215 181595 179421 178780 183253 183027 185083 187040 185715 183396 179334 178603 182054
31733 182054 182948 178374 176428 181694 188898 185318 182514 178808 179346 179610 182785 185182 184811 183839 184176 180713
31717 180713 175569 177217 180687 178639 178829 182904 183010 182256 180110 177460 175098 175617 179957 183916 183221
31702 183221 186740 190072 188711 186019 183266 179650 178646 181557 182968 181556 179908 179007 180457 179573 179227
31687 179227 181029 180738 183961 181210 177487 177831 176530 173022 174569 174424 172643 176389 180483 182274 183138
31672 183138 182791 184476 186150 180738 179119 176535 174849 175805 176292 176708 176161 179355 181738 180780 180050 180159
31656 180159 182462 184659 184870 181287 178657 180074 180266 177784 180145 180650 177790 176490 174784 179473 182825
31641 182825 181477 182328 179270 177267 175135 176062 182595 186134 187282 184139 182230 179730 184487 188743 184264
31626 184264 176445 173674 173389 174372 180847 184541 186524 185656 181367 179811 177411 173271 169540 170701 175855
31611 175855 184161 180732 175035 175481 178138 178298 181814 182618 180138 180877 180469 178842 179153 179769 177210 177980
31595 177980 180670 184594 180250 179523 178055 177514 176256 175662 176069 175624 177582 179297 181294 180116 181665
31580 181665 178146 175539 174261 174792 177904 180873 183613 181921 183780 185951 181509 178116 179606 179416 176804
31565 176804 176400 180174 182166 185105 184868 184686 181551 177255 175214 173822 176512 177971 177924 174569 172434
31550 172434 173212 177319 179544 175324 175534 177841 181205 180251 180287 180997 177211 175379 178200 182731 187411 185715
31534 185715 182806 184650 189129 191009 192166 193627 187675 182445 183904 184449 183470 184563 182714 184310 182592
31519 182592 181158 178587 178127 181702 184153 185592 190444 188819 184831 187244 189469 185419 179565 180635
31505 180635 179565 179889 177795 173739 172504 172704 176133 179251 182232 179334 179622 181610 182387 181653 181179 180616
31489 180616 182156 181365 179421 180263 177909 177662 177852 173873 175088 175463 175956 175862 174666 176859 179840 182135
31473 182135 181904 178868 179379 177660 176664 177844 176481 174991 175024 179630 184214 181528 177866 176707 176680 175402
31457 175402 176491 181566 183564 184418 181679 180863 178706 179767 181038 180936 181731 178294 175962 180375 183225
31442 183225 178738 179622 182157 183656 182788 180781 180886 179904 181243 181974 178938 176385 173994 176973 179033
31427 179033 179788 180133 184013 187448 185538 178080 175388 180018 182432 182780 178836 174915 175919 181684 185860
31412 185860 185462 186123 185766 184463 184756 185039 184545 182566 179797 177383 177433 176065 178038 181212 178277 176609
31396 176609 179420 184645 186301 182781 176272 175929 176457 177286 181163 183661 184126 183756 182172 183820 185167
31381 185167 182911 184595 184490 182448 183587 181596 183433 186614 183403 180310 177835 176862 176179 178935 180340
31366 180340 179807 179928 183484 181860 177690 178325 177395 178263 181694 185885 189609 188435 186397 185355 184056
31351 184056 182370 181567 181222 182343 182156 183722 185580 182552 179536 182088 183932 185935 186217 188156 187892
31336 187892 182863 182455 183931 188315 193275 192134 188089 186463 184190 184518 184628 182017 182318 180293 180064
31321 180064 180681 180336 179314 178243 180516 180307 181596 181687 183299 182274 183575 182582 183949 187530 188389 183760
31305 183760 181366 182171 181108 180084 180522 181665 182316 181463 178500 177545 180196 183720 183536 182839 182757 184833
31289 184833 182754 184043 184342 186082 187613 188196 187072 185168 187404 188569 181773 179192 182229 183132 184171
31274 184171 187582 185735 183356 183619 186836 185171 184583 186490 182812 187554 194081 193297 187157 181952 184234
31259 184234 183583 182718 182543 184186 182243 183108 186941 187208 185511 184019 178627 178171 177247 177513 179379 182334
31243 182334 180717 180817 181701 182529 178944 182276 185758 183393 180307 179996 179779 179933 184871 188191 185291 180520
31227 180520 179579 178142 176146 176219 177796 180182 181363 182898 183010 184732 179608 182577 183246 183234 183584 184677
31211 184677 182505 182878 182175 176908 175668 179665 180002 180693 177844 176409 176993 179121 175599 174032 174987 179945
31195 179945 181861 177106 178141 177990 175883 174486 172422 172273 175795 177483 177550 181812 180922 179558 182244
31180 182244 182719 178909 174000 176195 178436 177941 177623 180079 176726 176717 177404 176822 175492 178744 181008 184183
31164 184183 186843 187328 185064 184859 184941 179682 179001 176832 173650 177784 184757 187941 189323 189122 189997 190278
31148 190278 186956 185782 183090 182744 182685 181671 184711 185022 185056 183034 175023 175167 176587 179341 183236 189901
31132 189901 191126 189675 184661 177563 179581 186554 187555 182064 180811 183445 182124 181397 181455 181599 182811
31117 182811 179449 176422 181695 183331 183924 183887 183846 178478 177939 178053 180352 184938 180777 180836 185007 186649
31101 186649 187351 190918 196745 192732 191866 192222 188200 184688 183530 183018 185452 188269 189241 184465 182368
31086 182368 184074 185694 186418 189007 189817 189784 187331 183722 185258 187785 185609 179915 179970 181733 183159 186150
31070 186150 185198 180657 183920 187619 185009 183389 183955 180986 177967 175428 175524 181592 184030 184837 184031 183795
31054 183795 182501 182162 183344 183770 184053 182432 185277 186083 183358 183254 183937 187146 185648 183893 186620 189616
31038 189616 189764 188853 189289 187761 184808 183769 180450 181729 183035 182774 184845 186849 186888 182800 182911 183523
31022 183523 181061 180156 182806 186360 185807 183956 182600 186930 186019 186756 192145 192750 196155 195189 192485 194027
31006 194027 191796 185042 182585 181139 179568 181184 185416 190085 187534 185396 183282 180728 179217 180496
30992 180496 183717 186140 185727 186719 186645 184998 184242 187273 188938 187060 183036 182909 186919 184341 180178 176360
30976 176360 180810 184083 188396 190948 188652 186361 185348 187673 190512 188464 185332 182684 180550 183936
30962 183936 188971 194024 193022 190814 192369 190426 185134 185664 189071 183163 180899 181995 182866 182372 183563
30947 183563 181246 178349 179374 179561 179780 181168 183687 184937 188611 189356 184861 183649 182358 184438 184536
30932 184536 184647 187011 186920 184339 186347 187823 187241 182878 182571 183384 184547 189249 193775 196477 195017 191322
30916 191322 185443 182405 184984 185457 186807 185525 188478 186650 183814 183133 181842 183750 186516 184631 182383
30901 182383 185219 186270 185888 183891 185585 185596 189186 190320 189553 186118 184643 186129 187149 187730 187917 186985
30885 186985 186625 184727 183528 187299 190270 189088 191132 191699 192543 193441 193868 193251 190428 192080 191627 193714
30869 193714 195577 196930 194008 190764 187462 186329 188114 186773 187843 192536 194313 191299 188117 185258
30855 185258 187805 189059 186335 183499 182676 181764 179999 179476 180623 182086 184044 181727 177035 179177 183744
30840 183744 190212 188262 185234 185693 188017 186208 187966 191682 192663 186551 185690 186307 185658 186357 183545 182242
30824 182242 184985 184993 182991 183400 182746 186964 189434 189497 183933 181101 183937 186774 184587 184956 188066 188911
30808 188911 192989 195848 193695 187324 187172 188993 190149 192145 191655 186194 183260 184392 185395 186562 186403
30793 186403 185188 179934 181457 185524 184901 187162 189446 189693 189395 188316 184283 184642 187793 186554 188380
30778 188380 187563 187792 191734 194904 195376 188629 185904 187998 187050 187283 184776 184469 186615 188293 187361 183272
30762 183272 185032 182951 184959 188270 186400 187894 187126 183996 184139 185036 184013 187683 186675 183986 182637
30747 182637 181646 176776 179580 185282 185945 186854 185803 186148 183137 182407 180478 183279 183071 181498 180806 182920
30731 182920 185143 184380 183503 186605 189941 186821 185916 185632 186049 185676 185001 185104 186833 187328 183532 184508 186714
30714 186714 187934 188175 187005 189696 188191 185386 187054 186709 184245 185862 187658 186096 187296 190005 191013
30699 191013 187554 188944 190751 191437 188923 185995 190219 190654 189010 188634 188798 191590 193030 191136 193988
30684 193988 193204 194747 191376 186688 180812 180140 182051 182313 181114 185054 186774 187234 190185 192887 193198
30669 193198 194809 193155 190635 188592 189086 188196 189164 191329 187887 184035 184783 186675 186073 189266 188493 181617
30653 181617 181830 184942 186354 184321 186217 184898 188089 186535 185013 184146 184897 185318 185310 189809 191786 193976
30637 193976 190373 187167 183900 183117 185706 186702 190193 194385 193123 189163 188388 189036 185813 188514 193281
30622 193281 195468 193914 191829 189345 189665 190539 188581 184280 187004 187580 187877 188968 186006 182626 188139
30607 188139 187417 183441 181997 182721 182662 186191 188320 190320 191840 190608 190522 193435 191562 188648 186574 186097
30591 186097 183676 186126 187988 186264 188206 190726 192904 190428 188656 193930 194251 194431 194241 194610 194808
30576 194808 194389 195123 189932 192018 189609 189046 189833 188371 189262 187733 189549 195775 193645 194359 198210 199156
30560 199156 193974 190446 189547 185609 182153 186487 187753 192625 193925 193051 192704 194263 194544 191515 188363
30545 188363 188454 185157 187916 189190 189655 191607 185684 184841 188318 189101 191381 193584 193473 189782 189444 195209
30529 195209 196522 191922 186450 187096 187085 192009 193411 190262 188503 187850 188888 191290 194211 195302 193580
30514 193580 187719 184377 184280 188794 186626 187201 191704 191662 190945 193485 195798 195859 196208 189541 181526 181774 184467
30497 184467 186851 187287 186749 180737 185455 189990 189781 189126 187237 185977 188952 191294 185858 183846 183584
30482 183584 187412 189693 190371 192674 187292 183494 187271 188174 188241 193042 194241 190403 191018 186894 187086 190168
30466 190168 193628 191534 188806 187244 186707 187165 184844 186329 189185 191860 188640 189093 190294 189066 189995
30451 189995 189185 191527 191797 193331 189587 188922 192544 194467 189692 185649 184919 185352 184187 188586 191816
30436 191816 189641 186738 188271 188558 185086 183291 183439 187979 188331 192649 191115 187865 184074 182415 184865
30421 184865 183188 186962 186432 185812 188644 189671 189588 190085 184332 184804 186889 186923 184655 184435 189352 191588
30405 191588 191642 191184 191975 196329 199139 198966 197424 197372 196670 193802 191149 189889 190706 188908 187623 188938
30389 188938 190542 188901 189825 192764 192552 194785 196406 192041 190448 193328 194088 196213 194623 191657 186029
30374 186029 187493 190515 193207 189616 188020 188193 188335 189661 183013 181470 184661 185888 186018 186556 186473 186949
30358 186949 184362 184305 184091 188835 189524 185839 185071 183780 183777 187053 193232 195660 192080 194553 196123 199134
30342 199134 200580 202209 202843 193523 188561 188068 187271 192761 195011 196033 195715 196751 194443 191961 187055
30327 187055 183612 182008 183365 190562 192490 193968 194198 192451 188636 186609 189139 194398 193577 193041 192141
30312 192141 187949 185740 185682 186905 190179 188998 184260 181025 184766 187447 191932 196609 191696 188777 185331
30297 185331 184570 186524 189059 192603 197319 198006 194262 194339 194972 195253 192076 189929 188932 192646 194073 192903
30281 192903 192166 191978 191013 188296 188916 189689 190790 191843 191945 191203 194088 194864 194390 193134 189819 188199
30265 188199 187942 191350 188526 182390 181743 186029 191241 195028 194878 193544 190503 187936 185341 190572 197071
30250 197071 196859 196878 194491 191775 194834 194407 191723 192621 193381 195126 194072 191196 191052 192229 192758 192888
30234 192888 193474 190683 187820 186720 192456 192927 193493 192376 192881 195380 192951 188516 187907 188075 184416 184937
30218 184937 188810 189848 191253 195083 197453 198097 197503 197241 195659 193405 197269 199668 197415 200614 196751
30203 196751 194583 197306 194807 193386 190473 193751 199142 198925 194090 192436 191769 191967 191361 191261 192350
30188 192350 195684 197363 196980 195089 197096 197183 194786 193475 193922 195975 196150 201454 202743 203891 198461
30173 198461 193795 193782 195072 192697 192948 194592 194918 194166 193553 193634 194871 198595 196092 193892 192394 196341
30157 196341 197586 196073 192409 187887 190981 190039 194722 196610 196051 195479 192863 193768 193364 195629 196267 188358
30141 188358 183566 184263 183748 187288 191427 191348 193882 194761 191340 193198 192012 192980 194471 194259 193733 192583
30125 192583 194452 193216 190900 191852 193771 198510 198533 200735 200178 194486 194566 196794 197445 195382 194453 191078
30109 191078 192916 191733 193264 194413 193538 192400 194451 196121 196206 191566 186288 185381 184725 181912 184981
30094 184981 190845 191913 187567 185920 189217 192608 189587 189216 191801 192275 195246 200101 196615 194012 193689
30079 193689 190810 191819 194935 194381 195537 197326 200342 203197 203047 201693 200293 196395 196311 193591 193337
30064 193337 191082 189697 191096 190950 190337 192102 192842 191463 191116 196192 195833 193563 193083 192020 194107 197382
30048 197382 195927 190721 188427 187699 188290 190726 190856 188826 189873 190017 187579 189892 193058 190894 190790
30033 190790 189960 184995 189997 190261 190532 194134 194997 193643 191892 190327 189653 187303 187586 186525 190405 193537
30017 193537 195861 195510 189210 184246 183998 189616 190945 195043 193189 190706 192270 192070 192657 195075 193897
30002 193897 195436 195519 197215 198147 196210 195671 195325 194939 194923 192770 193648 192867 194034 193377 195068 199098 201095
29985 201095 199164 198075 195185 194619 194954 195312 192520 198567 199428 199444 197021 195771 192682 188313 186930 191282
29969 191282 193860 190773 189782 190693 190885 191899 191980 195010 195429 195206 199781 199927 195182 191685 192958 195838
29953 195838 196218 195456 197468 197998 197564 194867 192135 194504 193430 195138 195476 194822 194852 193102 191610 188580
29937 188580 189788 191851 195179 194772 190772 192451 193428 197873 199831 196891 193105 194303 197265 199852 192720
29922 192720 193221 191005 191367 193526 193469 191029 189327 190716 191399 193504 191585 186259 188927 193552 195694
29907 195694 196245 193888 191828 195159 193590 194311 194400 193285 196198 196797 194306 192188 188934 187382 189796
29892 189796 193194 196366 197330 197714 195337 194915 194988 198831 197732 195384 198811 201167 202320 199082 200358
29877 200358 198206 195707 192094 192866 189125 187786 189259 188373 186635 188274 188168 187311 190941 196485 194378
29862 194378 190610 190470 189920 191522 190262 191040 194542 199155 199695 198347 195454 193459 191142 187203 184276
29847 184276 185446 188243 189025 190724 195030 198188 197756 199638 198296 197373 196133 198710 198642 198724 197710 195262
29831 195262 198016 197237 194984 196010 196024 195996 194186 191975 192323 195066 199861 201646 200200 201375 202977 199112
29815 199112 194696 192371 194424 195712 193155 193415 193600 190957 191264 195746 201080 202043 200087 197309 197168
29800 197168 198342 200926 200596 194357 192864 192591 193554 194308 195500 195406 199482 201036 200658 200927 200029 196624
29784 196624 193459 194555 196476 195575 197440 197759 193337 191615 187640 185581 188242 192305 193223 193990 191560
29769 191560 192478 193199 192864 189978 191725 194810 195009 190067 187003 188512 188968 187064 189995 194034 193665 196110
29753 196110 194242 188954 191902 201711 203361 203077 200342 198181 196989 197733 200002 201956 198597 197619 196136
29738 196136 195107 194595 193598 191114 190085 193517 197706 196453 191089 196179 199248 196228 195929 197148 199088
29723 199088 200688 197670 194512 195421 197596 200003 199987 199404 200091 197884 198236 198738 198782 194366 190468 190529 190482
29706 190482 191524 191981 194028 192519 196107 199543 199870 197812 194106 191191 194833 198935 204666 206878 205184
29691 205184 200279 199119 199189 200028 198578 201131 199669 200208 201458 202620 203896 202769 202491 204865 203752
29676 203752 203241 199160 199025 200206 196809 195007 194353 193428 190845 189944 195729 200608 195630 193623 198327
29661 198327 199798 197435 195614 194183 195057 195641 192885 193469 195540 201759 201587 201240 202523 200989 196862
29646 196862 195979 196132 196032 194219 192244 192111 196496 197666 197794 196953 194701 194103 196564 197691 197497 198469
29630 198469 197859 198248 196501 192634 191476 192592 196526 200409 202143 201750 205187 201175 196207 197201 195757
29615 195757 193196 196544 197522 196223 193756 196183 199856 204060 200045 195144 192082 191687 193952 195533 197305
29600 197305 198348 197745 193360 191524 194387 196028 199337 202910 201015 201102 200899 200268 201620 201726 201687 199900
29584 199900 196098 195517 198850 202559 200123 195799 193433 196226 198944 202790 205293 204789 204322 201987 199257
29569 199257 200002 201650 200970 201331 204304 203030 203108 203732 203530 204029 201362 196981 191304 194421 199658 201289
29553 201289 199544 196176 198014 199961 200082 202067 197646 198359 196423 194887 195707 197728 198242 198991 199733 197014
29537 197014 193088 193088 196142 199865 200786 198052 194757 191483 193115 193722 192391 194825 192110 193847 196551
29522 196551 201282 200793 196874 200260 202385 199921 196517 196252 196901 200783 200136 199445 199454 200139 195745 194849 193767
29505 193767 195919 199818 196606 197674 200256 198628 197815 197312 193694 199250 200953 196066 196769 200427 198377
29490 198377 199293 201154 200332 193529 193683 195911 193168 195429 197311 194106 190959 190680 192203 195175 195412
29475 195412 197228 198843 202368 202528 199452 197433 199387 197586 197525 197388 191056 192009 191645 192086 194938 195112
29459 195112 196445 200996 198498 199389 197341 198115 197929 198593 200011 201509 201664 202334 202797 199120 196934 198826
29443 198826 201237 205422 205942 205107 200132 199740 204896 201637 197437 196369 195158 195534 196270 199683 202545
29428 202545 198560 199202 197421 196666 200069 199659 198348 198170 197310 199459 200475 195839 192561 190030 191195
29413 191195 187787 185561 187274 191046 195646 197434 199132 198901 196208 196936 193694 195549 200648 203572 206312
29398 206312 206544 202427 202199 202147 201934 199291 196092 200817 204307 207844 206188 201502 200108 198604 203384
29383 203384 204644 200136 198200 196792 195690 198674 199394 200523 202939 201763 197844 198823 199477 198526 197884
29368 197884 196306 193417 194639 197413 198222 196055 196609 199477 199289 199573 200902 201485 202779 200057 199954 198561
29352 198561 198413 201825 203353 200477 198899 195189 194078 199776 200161 196384 192161 195330 197767 199444 199678
29337 199678 195432 193077 194128 190966 194630 198027 202519 201817 199604 201604 201558 196214 193489 191919 195318
29322 195318 197735 199608 198972 200908 200740 198675 200419 204227 204742 204653 207112 204642 203586 205364 205185 205616
29306 205616 209907 205378 200244 200831 196436 197637 197670 198302 198393 201153 203689 207312 209829 203855 198350 199024
29290 199024 197104 192679 194100 196710 197559 201049 203660 199902 202295 206751 208993 205825 202828 199222
29276 199222 198695 204153 209107 209298 203711 199211 202700 204058 202889 203640 200343 200422 201567 204235 206497
29261 206497 209276 207455 205210 203825 203171 200775 204919 207367 208995 204078 208425 213216 209689 205533
29247 205533 203996 204793 204619 202433 201493 200035 196713 193848 195463 193253 191822 195493 199152 200551 198716
29232 198716 202450 209154 212855 208848 207427 207364 202224 201381 203421 204856 204014 203416 203206 202528 202749 205387
29216 205387 205625 207217 208845 204160 200571 204066 207183 206413 204815 203706 200729 199399 201662 200990 199447
29201 199447 203381 203580 201845 204724 202563 203032 203406 201428 204712 207389 204569 203066 202034 200479 203605
29186 203605 204482 202898 200446 198243 198919 202162 202367 201528 205695 210375 210092 208800 203365 201610 203770
29171 203770 201977 202652 202360 202602 204472 201046 199533 199801 194073 194909 197086 201270 205549 204098 200236
29156 200236 199604 195763 193665 192556 194720 195091 198717 203604 204268 200219 200438 199269 201928 207401 203635
29141 203635 202552 202573 204172 205692 204213 208309 210806 208770 206992 211660 207545 203796 203529 202463 204256
29126 204256 204711 204658 201625 197969 197202 198141 199858 202441 203877 203925 202553 200665 197915 198207 202704 200721
29110 200721 197662 200902 201969 202135 198122 195821 198065 201067 197309 199417 204622 204963 204121 205432 206241
29095 206241 204792 201174 197871 198071 200789 202353 200948 202726 205817 206138 207313 205206 201585 200511 200796
29080 200796 200705 200722 204360 207660 205671 205428 207208 207765 206141 205135 207353 207503 209981 206895 202579 197732
29064 197732 199649 203218 202771 200875 201693 199869 198623 197042 195795 194768 197418 198643 199286 197675 196650
29049 196650 204471 208161 205535 207280 206640 199734 197005 194719 195503 198374 201320 202485 205069 205347 202115
$$ [...]
##END NTUPLES=NMR SPECTRUM
##END=
