##TITLE=Analysis number 328667
Compound Code sb 01813
Project Code adrs
Chemist Name stores
##JCAMPDX= 6.0         $$ Bruker NMR JCAMP-DX V2.0
##DATA TYPE= NMR SPECTRUM
##DATA CLASS= NTUPLES
##ORIGIN= Bruker BioSpin GmbH
##OWNER= nmr
$$ XWIN-NMR		Version 3.5
$$ Tue Jun 26 09:04:01 2007 GMT Daylight Time (UT+1h)  MAYBRIDGE\nmr@NMR_250MHZ
##.OBSERVE FREQUENCY= 250.131544655141
##.OBSERVE NUCLEUS= ^1H
##.ACQUISITION MODE= SIMULTANEOUS (DQD)
##.ACQUISITION SCHEME= undefined
##.AVERAGES= 16
##.DIGITISER RES= 18
##SPECTROMETER/DATA SYSTEM= dpx250
##.PULSE SEQUENCE= zg30
##.SOLVENT NAME= CDCl3
##.SHIFT REFERENCE= (INTERNAL, CDCl3, 0, 16.522)
##AUDIT TRAIL= $$ (NUMBER, WHEN, WHO, WHERE, WHAT)
$$ ##TITLE= Audit trail, XWIN-NMR		Version 3.5
$$ ##JCAMPDX= 5.01
$$ ##ORIGIN= Bruker BioSpin GmbH
$$ ##OWNER= nmr
$$ C:\u/data/dgb/nmr/ADRS/1840/pdata/1/auditp.txt
$$ ##AUDIT TRAIL=  $$ (NUMBER, WHEN, WHO, WHERE, WHAT)
(   1,<2007-06-26 09:03:34.65 +100>,<MAYBRIDGE\nmr>,<NMR_250MHZ>,
      <created by zg, POWCHK disabled, PULCHK disabled
       configuration hash MD5:
       76 6E 9A 78 1E 09 19 81 EC 84 63 8F B0 6A 59 2D
       data hash MD5: 64K
       6D E5 1E A0 76 3B DE 8A BE 32 50 AA 88 0B 8E 5F>)
(   2,<2007-06-26 09:03:49.54 +100>,<MAYBRIDGE\nmr>,<NMR_250MHZ>,
      <Start of raw data processing
       ef LB = 0.3 FT_mod = 6 PKNL = 1 SI = 32K 
       data hash MD5: 32K
       51 01 80 38 51 4B 82 C5 4C 91 5B C7 3E F3 18 FC>)
(   3,<2007-06-26 09:03:51.31 +100>,<MAYBRIDGE\nmr>,<NMR_250MHZ>,
      <apk 
       data hash MD5: 32K
       2A B7 14 A2 2A 2B 2A C4 C3 12 93 1B 20 3F 2B 82>)
(   4,<2007-06-26 09:03:52.18 +100>,<MAYBRIDGE\nmr>,<NMR_250MHZ>,
      <abs ABSG = 5 
       data hash MD5: 32K
       C4 4C A4 48 FA AD 6D D8 82 24 F2 CB AF 48 6F 2E>)
$$ ##END=
$$ 
$$ hash MD5
$$ EB 9B 85 3F 49 EE DA 95 78 3E 59 CF CE 04 E9 0D
##$RELAX= 
##$RELAX= 
##$RELAX= 
##$RELAX= 
##$RELAX= 
##$RELAX= 
##$RELAX= 
$$ Bruker specific parameters
$$ --------------------------
##$DU= <C:\u>
##$EXPNO= 1840
##$NAME= <ADRS>
##$PROCNO= 1
##$TYPE= <nmr>
##$USER= <dgb>
##$AMP= (0..31)
100 100 100 100 100 100 100 100 100 100 100 100 100 100 100 100 100 100 
100 100 100 100 100 100 100 100 100 100 100 100 100 100 
##$AQSEQ= 0
##$AQ_mod= 3
##$AUNM= <au_zg>
##$AUTOPOS= <3 >
##$BF1= 250.13
##$BF2= 250.13
##$BF3= 250.13
##$BF4= 250.13
##$BF5= 500.13
##$BF6= 500.13
##$BF7= 500.13
##$BF8= 500.13
##$BYTORDA= 1
##$CFDGTYP= 0
##$CFRGTYP= 5
##$CHEMSTR= <none>
##$CNST= (0..31)
1 1 145 1 1 1 1 1 1 1 1 1 1 1 1 1 1 1 1 1 1 1 1 1 1 1 1 1 1 1 1 1 
##$CPDPRG= <>
##$CPDPRG1= <>
##$CPDPRG2= <>
##$CPDPRG3= <>
##$CPDPRG4= <mlev>
##$CPDPRG5= <mlev>
##$CPDPRG6= <mlev>
##$CPDPRG7= <mlev>
##$CPDPRG8= <mlev>
##$CPDPRGB= <>
##$CPDPRGT= <>
##$D= (0..31)
0 1 0 0 0 0 0 0 0 0.06 0 0 0 0 0 0 0.0002 0 0 0 0 0 0 0 0 0 0 0 0 0 0 
0 
##$DATE= 1182845013
##$DBL= (0..7)
120 120 120 120 120 120 120 120 
##$DBP= (0..7)
150 150 150 150 150 150 150 150 
##$DBP07= 0
##$DBPNAM0= <>
##$DBPNAM1= <>
##$DBPNAM2= <>
$$ [...]
##$SUBNAM7= <"">
##$SUBNAM8= <"">
##$SUBNAM9= <"">
##$SW= 20.6930455092707
##$SWIBOX= (0..15)
0 0 3 0 0 0 0 0 0 0 0 0 0 0 0 0 
##$SW_h= 5175.983436853
##$TD= 65536
##$TD0= 1
##$TE= 295.16
##$TE2= 300
##$TE3= 300
##$TEG= 300
##$TL= (0..7)
0 120 120 120 120 120 120 120 
##$TP= (0..7)
150 150 150 150 150 150 150 150 
##$TP07= 0
##$TPNAME0= <>
##$TPNAME1= <>
##$TPNAME2= <>
##$TPNAME3= <>
##$TPNAME4= <>
##$TPNAME5= <>
##$TPNAME6= <>
##$TPNAME7= <>
##$TPOAL= (0..7)
0.5 0.5 0.5 0.5 0.5 0.5 0.5 0.5 
##$TPOFFS= (0..7)
0 0 0 0 0 0 0 0 
##$TUNHIN= 0
##$TUNHOUT= 0
##$TUNXOUT= 0
##$USERA1= <user>
##$USERA2= <user>
##$USERA3= <user>
##$USERA4= <user>
##$USERA5= <user>
##$V9= 5
##$VALIST= <valist>
##$VCLIST= <CCCCCCCCCCCCCCC>
##$VD= 0
##$VDLIST= <DDDDDDDDDDDDDDD>
##$VPLIST= <PPPPPPPPPPPPPPP>
##$VTLIST= <TTTTTTTTTTTTTTT>
##$WBST= 1024
##$WBSW= 4
##$XGAIN= (0..3)
0 0 0 0 
##$XL= 0
##$YL= 0
##$YMAX_a= 324206
##$YMIN_a= -419567
##$ZGOPTNS= <>
##$ZL1= 120
##$ZL2= 120
##$ZL3= 120
##$ZL4= 120
##$ABSF1= 16.522
##$ABSF2= -4.171173
##$ABSG= 5
##$ABSL= 3
##$ALPHA= 0
##$AQORDER= 0
##$ASSFAC= 0
##$ASSFACI= 0
##$ASSFACX= 0
##$ASSWID= 0
##$AUNMP= <proc_1d>
##$AZFE= 0.1
##$AZFW= 0.1
##$BCFW= 0
##$BC_mod= 0
##$BYTORDP= 0
##$COROFFS= 0
##$CY= 12.5
##$DATMOD= 1
##$DC= 0
##$DFILT= <>
##$DTYPP= 0
##$F1P= 14.0000005364418
##$F2P= -0.99999901652339
##$FCOR= 0.5
##$FTSIZE= 32768
##$FT_mod= 6
##$GAMMA= 0
##$GB= 0
##$INTBC= 1
##$INTSCL= 1
##$ISEN= 128
##$LB= 0.3
##$LEV0= 0
##$LPBIN= 0
##$MAXI= 10000
##$MC2= 0
##$MEAN= 0
##$ME_mod= 0
##$MI= 0
##$NCOEF= 0
##$NC_proc= -4
##$NLEV= 6
##$NOISF1= 0
##$NOISF2= 0
##$NSP= 0
##$NTH_PI= 0
##$NZP= 0
##$OFFSET= 16.522
##$PC= 1
##$PHC0= 159.2753
##$PHC1= 4.231719
##$PH_mod= 1
##$PKNL= yes
##$PPARMOD= 0
##$PSCAL= 4
##$PSIGN= 0
##$REVERSE= no
##$SF= 250.13
##$SI= 32768
##$SIGF1= 0
##$SIGF2= 0
##$SINO= 400
##$SIOLD= 32768
##$SREGLST= <1H.CDCl3>
##$SSB= 0
##$STSI= 32768
##$STSR= 0
##$SW_p= 5175.98343685301
##$SYMM= 0
##$S_DEV= 0
##$TDeff= 65536
##$TDoff= 0
##$TI= <Analysis number 999999
Compound Code 99
Book Reference 9
Project Code 9>
##$TILT= no
##$TM1= 0
##$TM2= 0
##$TOPLEV= 0
##$USERP1= <user>
##$USERP2= <user>
##$USERP3= <user>
##$USERP4= <user>
##$USERP5= <user>
##$WDW= 1
##$XDIM= 32768
##$YMAX_p= 448364276
##$YMIN_p= -73509
$$ End of Bruker specific parameters
$$ ---------------------------------
##NTUPLES= NMR SPECTRUM
##VAR_NAME=  FREQUENCY,     SPECTRUM/REAL,   SPECTRUM/IMAG
##SYMBOL=    X,             R,               I
##VAR_TYPE=  INDEPENDENT,   DEPENDENT,       DEPENDENT
##VAR_FORM=  AFFN,          ASDF,            ASDF
##VAR_DIM=   32768,         32768,           32768
##UNITS=     HZ,            ARBITRARY UNITS, ARBITRARY UNITS
##FACTOR=    0.157963299565203, 1,           1
##FIRST=     4132.6476996994, 0,             0
##LAST=      -1043.33573715361, 0,           0
##MIN=       -1043.33573715361, -73509,      0
##MAX=       4132.6476996994, 448364276,     0
$$ Real data points
##PAGE= N=1
##DATA TABLE= (X++(R..R)), XYDATA
$$ [...]
20722 79925 79918 75700 73727 72610 65816 61679 64477 69876 67438 47771 38472 43011 48261 57603 69038
20707 69038 69741 68324 76681 79150 75029 69611 70070 67219 63806 55561 60931 74314 76602 69117 70165
20692 70165 62764 65974 77931 74408 75370 75839 74394 80064 77264 65437 51481 54714 55784 51279
20678 51279 48078 51710 63064 64436 63196 68651 58123 53091 70461 71072 68012 66019 66622 73244
20664 73244 72346 70274 69789 72285 61461 69361 75724 84431 74205 64869 53058 58092 70404 70470
20650 70470 74295 60454 65925 68203 71921 66319 55032 65623 87135 102667 109291 101427 87658
20637 87658 87560 93571 92432 85141 80158 78179 72572 78018 79945 74124 79441 94205 88181 86947 76945
20622 76945 60826 74337 82505 74103 85631 95232 89403 81274 76488 71347 73815 89693 103971
20609 103971 94896 84997 79824 81563 89261 82168 84890 83287 86359 79535 75632 62782 65633 69088
20595 69088 80390 87656 84622 83917 82368 89726 90119 81359 80767 80547 64300 60040 65721 72820 69175
20580 69175 66479 78143 84972 83060 80649 75675 73938 68463 60404 60289 62750 58051 63017 59311
20566 59311 64135 64412 70213 72617 79803 83989 91754 71645 69719 84585 92669 95707 89682 83369
20552 83369 92122 90192 81526 73022 76471 79437 79119 83025 100344 96597 85415 86123 93130 87600
20538 87600 91311 82590 78684 64763 70977 75048 78321 85037 84212 91251 92442 93251 102753 96768 81381
20523 81381 74614 86921 97976 93857 79393 75523 67033 55783 62421 68105 62749 55085 57033
20510 57033 71311 77249 84755 85124 79471 69603 66873 77090 84968 89847 84797 84182 88674 85594
20496 85594 89067 80283 69001 88687 97993 86250 70333 76621 81301 73828 73690 80069 84387 94253
20482 94253 92260 87007 82764 79557 73370 72695 78902 86079 91590 86954 74857 72802 81954 79674
20468 79674 75132 72085 74194 68752 68258 70153 67117 63568 73329 65061 66279 74725 75901 73992 69919
20453 69919 57957 59744 60973 54376 51080 50692 67882 91966 103301 94250 101988 94409 86912 89951
20439 89951 83952 73686 70985 73113 68354 71779 79742 77958 73074 71054 76438 72348 70919 76722
20425 76722 79999 66709 58882 50444 56246 56037 50140 50944 61544 62078 70244 84533 89886 86828
20411 86828 82902 74579 67029 64882 72637 75304 77517 73920 61324 64905 65265 63861 49197 46306
20397 46306 45334 40408 36236 40831 46176 56794 48823 41931 50599 70094 68040 70727 64693 68697
20383 68697 60877 59800 60181 50138 50114 52776 46946 46115 48082 60539 61225 54122 54984 45205 49491
20368 49491 54975 52322 45415 47912 47159 41815 58273 64779 74160 76814 70333 64168 54730 55848
20354 55848 57518 46557 55904 59314 59210 55376 43002 44410 37512 33123 41274 49452 47404 51239
20340 51239 48912 48303 38353 45115 48265 37387 26604 29518 29669 36563 46502 44432 44886 39187 44640
20325 44640 52533 35350 28438 38579 46569 43260 40390 34985 36255 45165 54093 62569 60473 45445
20311 45445 48410 54387 36132 22289 22626 25362 25601 26319 32106 27467 8914 13423 18026 22639
20297 22639 23178 29365 33930 39478 39309 34754 43271 49757 51594 45211 50898 58810 50094 36319 39672
20282 39672 56641 43919 33470 37995 33705 29761 33980 31054 27042 16163 17951 26550 34187
20269 34187 39467 49660 52494 48425 32694 39149 42890 35295 33217 35889 34199 39976 42130 36154
20255 36154 38475 26742 24005 29002 36566 38732 23515 23383 35045 27426 23561 37230 44064 39063
20241 39063 52840 61597 58721 46882 48872 55410 47569 27363 21223 28394 30559 31379 26097 26733
20227 26733 26265 26797 25896 40374 52309 58935 48633 34051 16983 24359 34721 40100 38038 34825
20213 34825 28505 28909 30331 33230 30260 29377 24634 18697 19780 15834 7811 16467 17914 15162 16813
20198 16813 17339 17527 17256 19061 6493 8468 15484 29183 38483 40791 40571 48322 46003 25086 7716
20183 7716 5143 9880 18120 32628 37669 28320 21810 22140 21313 22835 31074 24908 22298 35283 41223
20168 41223 40843 31427 26792 23045 26245 40151 42525 53320 66301 66760 66286 81349 109802 131902
20154 131902 141117 139007 138215 137363 133630 118114 99697 82011 71629 56644 48956 43911 44835 50436
20140 50436 41095 42724 39651 26810 25556 27698 21952 23333 21156 11252 17242 15578 20563 31959
20126 31959 41223 55252 53270 45011 35938 34449 27479 4987 8356 26111 32643 35799 37037 39306
20112 39306 45420 57624 57241 55186 60505 65715 64677 63878 79414 87398 117284 132854 135415 129082
20098 129082 122912 129046 134190 132073 117663 101318 87340 61604 44283 32339 34309 30190 27481
20085 27481 27774 30472 33782 39286 39046 28447 21932 23145 29307 36170 37583 33252 39058 40476 25677
20070 25677 17280 7283 3274 -3820 -4780 -4281 12293 21620 27059 26761 15783 23989 21930 20157 20811
20055 20811 26166 24096 21306 15347 7223 13009 10102 14921 7049 8932 15981 12164 9945 17633
20041 17633 27533 34205 22919 15863 17732 19744 18569 15776 16868 21686 21839 18707 17643 26541
20027 26541 38639 36606 23653 17964 21066 17777 1489 7674 15907 16757 22083 21291 5907 12942
20013 12942 26200 23276 22144 29199 12879 8289 15578 15711 13864 11643 12682 17826 11963 9436
19999 9436 -12081 -12640 -612 2428 6712 3674 3063 5284 13696 21266 9905 -5488 2383 12703
19985 12703 14236 26598 30310 29024 40688 52975 45728 44391 40589 38129 25552 -14 6269
19972 6269 13913 14221 17590 12036 -602 57 13090 6336 2712 8036 7986 -2392 630 5013 5107
19957 5107 564 -6705 -12983 -19150 5845 25717 30609 12134 -1759 623 7879 8519 20849 29633
19943 29633 26442 19165 10475 -3618 -482 17394 27981 27356 17624 9891 -4644 -12398 -575
19930 -575 5910 6013 17672 15964 24192 27727 20086 8968 2959 1966 15808 23787 24170 18243 8411
19915 8411 1143 6398 -2970 -4273 9992 8658 5936 6830 9849 298 -2530 -506 2540 17457
19901 17457 24476 15471 16693 17952 18261 14382 7278 8520 15336 25395 20042 15355 23389 28284
19887 28284 24761 11583 7287 18619 30790 16100 15047 8620 10454 48041 70012 56323 25990
19874 25990 16215 13632 6348 6767 7344 13255 7514 6054 648 -6321 15736 14353 5351 13879 23631
19859 23631 21753 28864 37117 29954 20261 8735 10725 16827 14870 13776 9889 3688 7910 5702
19845 5702 10979 15927 22118 26756 32070 21218 1079 -6320 -4435 4147 14970 16777 43875 68179
19831 68179 75331 74535 70922 60471 40198 33498 16181 -12302 -15853 -13489 -11394 -2342 7184 7678
19817 7678 14925 19589 22307 18539 -7108 -9953 -7640 -9827 -12748 -4768 14089 18590 1901 2929
19803 2929 12332 12128 3422 -4757 -8452 -1535 1062 8862 2571 6288 7691 9566 14893 4875 2288
19788 2288 21560 34326 36341 35527 30177 35781 34555 39952 30415 17537 20214 26699 39784 32507
19774 32507 32510 32260 33609 38098 44137 41637 48072 48898 56003 65355 67955 78662 105359 125190 142306
19759 142306 141403 132471 127163 115703 92710 64555 54595 37874 31990 38341 33208 34079 24364 28299
19745 28299 33037 37096 23025 22572 26010 13258 214 -5617 -12748 -3141 8968 5534 9373 18942
19731 18942 24298 22585 22176 19008 33521 45866 48687 44695 27155 15894 21741 31172 40379 39891
19717 39891 45633 45955 31957 18184 14950 21326 33285 49117 50881 47742 51347 77014 106179
19704 106179 128862 136005 152389 160914 153664 150550 135514 108139 84669 67198 42211 32514
19692 32514 20782 23835 25377 31501 28740 18684 6631 7341 4154 9272 16312 12527 -1411 5539
19678 5539 4275 1374 7575 14609 20005 42849 52108 30197 12862 5994 2115 1384 -1748 4180
19664 4180 18469 5177 -12496 -16201 -21922 -14192 -1357 3176 13961 16279 5327 5577 520
19651 520 2501 17397 24182 24089 27891 20013 12238 19093 28263 31333 37670 32373 16553 9870 1488
19636 1488 632 -68 -1690 6390 5802 1288 2294 -5068 -4781 2742 -3406 267 11865 5619 7191
19621 7191 12727 10796 13670 17342 15908 16382 6252 -812 2255 7597 5303 5458 16696 20511 22762
19606 22762 27493 24841 15904 12035 -18 -13309 4260 23390 18550 11986 11716 14664 18154 16267
19592 16267 13300 5295 982 5041 12844 14651 20869 33746 34757 26930 21242 11969 17448 23165
19578 23165 23356 32337 16669 8568 11810 5927 16924 37664 45383 36963 27598 19460 13871 17804
19564 17804 26118 36146 27360 25922 21989 3273 -6093 -15270 -13939 2436 -2888 -9481 -8088 -4774
19550 -4774 -3236 4774 12269 14139 10921 19715 13040 7682 5170 2923 4921 13106 18740 17083 13530
19535 13530 4173 -4040 -3957 -2572 -8521 -3537 3238 9774 3987 13956 28301 11986 2779 8224
19521 8224 21397 34622 40233 36366 34938 27296 16050 12749 17994 16083 19448 18668 18470 12144
19507 12144 3310 4677 9626 5814 4269 3865 3955 -1015 -3606 -5795 -12926 -2377 8224 6489 -1409
19492 -1409 -16828 -27131 -28307 -22105 -17871 -12122 -4323 -7 2399 -9018 -9695 -7089 -6623 -2111
19478 -2111 501 10453 9124 9168 13535 18372 6923 10057 15838 -819 -22043 -24468 -25404 -15203
19464 -15203 -8163 -1422 -3625 -15473 -22550 -10260 3542 13569 9368 2247 11516 27135 15943
19451 15943 3861 3746 6379 8829 5088 19226 17745 15374 21745 13727 5845 22151 33975 28364
19437 28364 10937 -5404 -2519 5045 11221 13307 4542 7204 19331 31148 44548 36087 21035
19424 21035 23441 25023 24018 27996 30821 44431 53336 46332 34373 31330 25424 15991 12054 23674
19410 23674 23143 21560 19940 15692 22998 29721 40651 42038 51625 53720 44475 48719 41896 35718
19396 35718 36020 37284 30793 34010 38706 47835 46168 44606 35462 33123 29101 27055 26463 29383 36454
19381 36454 31442 43887 61832 64815 50020 66549 66649 58253 58589 48408 41524 44812 50670 58075
19367 58075 74025 71062 56610 48762 61405 69605 70773 67255 67555 63514 53606 66214 80573
19354 80573 82672 93552 96729 88076 90476 104330 115966 123124 121622 141225 154384 145019 141605
19341 141605 126230 137510 158698 177700 191161 200324 206032 210837 215246 210065 212629 206917 213041
19328 213041 205122 187968 165423 154435 144999 135834 116641 106435 96510 85223 70941 71542 77491
19315 77491 77069 76228 76774 85805 83272 79129 88737 104564 112177 123650 138554 131248 130649 133889 129589
19300 129589 125376 129182 122868 117096 112539 113355 116222 113539 116729 116776 115066 106066 94015 85511 76904
19285 76904 73252 71711 81149 79879 76295 80086 79371 74704 84203 90115 102844 118366 130398 138156
19271 138156 145774 149235 152912 156584 147470 136714 125605 117104 118360 134998 141910 147960 145703
19258 145703 153816 172471 192275 203903 211140 220094 207076 200731 187959 184698 176462 169140 158553
19245 158553 154478 155528 160373 165444 176005 173349 172245 175746 166426 156465 155268 144643 130942
19232 130942 126989 128498 139569 132901 131457 159326 181711 173987 170078 158412 139264 125175 116273
19219 116273 130425 149920 148259 147800 162911 167910 161266 156383 144843 132907 117398 104608 98067
19206 98067 96630 102803 103540 110728 121367 108130 89887 86784 93387 93476 86681 80772 76604 91071
19192 91071 99969 92429 91963 106544 106097 96500 86940 73762 67097 73278 67154 70090 70135 78118 82968
19177 82968 76176 79780 84262 94942 104768 111589 119059 115693 114347 114582 105456 109068 116674 108087
19163 108087 101468 108657 112424 119498 127949 124612 112957 110486 105457 114833 116800 113414 117584 115450
19149 115450 96509 88840 92686 104891 101851 101033 95878 96804 96826 93107 95617 99639 88005 75524
19135 75524 67193 52465 40682 60038 74691 64325 62602 68585 69942 64166 50292 45495 60094
19122 60094 75776 68941 66507 73149 66420 59514 53745 54985 44482 41986 43919 56234 74642
19109 74642 86905 78236 73174 76153 88849 101094 108559 104468 103935 94773 92617 94826 104497 103800
19095 103800 98325 102375 106732 100612 95327 97703 99726 93953 92162 83030 70271 81437 91542
19082 91542 96764 100327 94740 90409 87570 93166 81678 72141 64780 58831 43793 39231 49559 64566
19068 64566 66922 62295 66687 72051 80971 82620 73207 65351 77465 92103 94064 94396 83092 89421
19054 89421 105382 107224 96435 89566 89471 80914 83185 68778 64119 68758 75563 89982 104212 112763
19040 112763 126380 138834 143585 152305 162445 171641 182287 186828 192557 217441 262166 324397
19028 324397 368710 424873 494792 581106 674905 756956 817376 860309 911243 949019 968453
19017 968453 979312 994725 1000221 1006554 1029400 1082634 1171906 1250240 1275547 1303848 1336936 1370015
19005 1370015 1356267 1288096 1229300 1154496 1049212 910895 794140 700667 619387 559997 500097
18994 500097 439354 403803 391819 387025 390859 375694 367376 373808 377471 362871 350477 338821
18982 338821 334793 330079 331249 327750 318234 314695 315170 324473 329455 336720 350706 365326 365630 380152
18968 380152 393796 410861 428111 449574 450276 446816 452116 458248 472809 507539 556188 628300
18956 628300 715122 816075 898835 936864 936386 971286 989316 964496 905914 865719 883104 928456
18944 928456 989899 1086808 1221554 1378455 1559579 1743407 1944273 2155405 2337827 2472742
18934 2472742 2558460 2613755 2590770 2488674 2334961 2137728 1921789 1697747 1496337 1315863
18924 1315863 1143098 999096 883645 793632 714474 661419 622729 595755 569174 537065 506598
18913 506598 493032 491576 500116 495131 513438 540289 581329 649843 709975 778383 884235 971640
18901 971640 1005347 1015443 1047784 1060006 1031458 994524 987694 1016679 1090931 1197949 1331379
18890 1331379 1503750 1709096 1928611 2139058 2363580 2589163 2777781 2902830 2971108 2961894
18880 2961894 2874535 2711051 2486723 2239629 1988350 1745064 1523875 1331888 1162646 1027984
18870 1027984 909837 802347 733174 682101 617203 566236 514738 484236 450311 415457 394422
18859 394422 384785 374819 352771 336100 321921 320360 288837 266297 261511 262498 247860 224472 217724
18846 217724 220018 210664 204706 219190 227882 238965 250123 261663 271425 268922 266520 267571 254440
18833 254440 245927 259788 257629 259428 277301 299388 306012 336354 361837 369174 384848 400574
18821 400574 406762 391655 376762 367496 362796 349546 325922 304664 300589 281863 262420 250768
18809 250768 229628 217045 216604 218817 208499 210263 199480 182216 175055 180087 177115 165128 160083
18796 160083 162668 172402 172005 168536 168797 169976 170558 167971 183045 196504 201260 206570 210664 208260
18782 208260 202709 219360 234341 239481 250358 273540 301166 322816 338894 357652 372140 383207
18770 383207 382977 398946 424862 447105 467667 454834 384907 322434 281067 252213 235341 229182
18758 229182 229816 220561 224204 213454 195159 192780 196175 188131 179272 183027 167043 158318 158428 155550
18744 155550 149177 149177 155135 165092 157714 140451 144876 158937 173215 196175 209999 229702 242135
18731 242135 247564 260033 257351 246277 230434 227709 212516 214356 209934 206393 192393 186891 189976
18718 189976 203452 217012 223256 211479 208850 210650 211753 197523 188066 184937 195904 207013 208319
18705 208319 216294 225653 233341 238103 233701 227311 217475 210044 210136 197808 200639 198843 194421 197574
18691 197574 197354 193565 197889 195540 200585 199536 198556 215551 249779 267648 276782 277819 278689 273662
18677 273662 257865 254157 256179 245722 236524 231345 223788 210948 200260 196631 197842 200896 203407
18664 203407 200037 183961 172310 180036 168080 163823 172507 173421 172760 170445 170658 166115 166971 169879
18650 169879 162443 163938 153386 154526 150389 151274 151512 152538 142717 138322 146969 145647 141502 131491
18636 131491 121777 124986 119159 115616 124395 114750 91933 85883 91007 92387 83105 80640 81480 70567
18622 70567 71243 75616 64482 43129 43962 50223 60066 62201 62314 65474 53838 55050 74515 78166
18608 78166 71335 63474 54788 51659 65834 69316 56823 41551 49007 71833 76425 82197 77385
18595 77385 76904 77070 69578 68369 77631 84518 95196 106428 107897 99441 97229 88470 87308 89680
18581 89680 96622 109052 121558 137910 159078 177976 194185 213792 231249 239806 234829 216975
18569 216975 186406 162496 139545 112211 97790 90341 80483 77967 76799 74238 72440 77918 79075
18556 79075 71842 63449 70617 84194 95326 95689 85921 88976 82638 77425 82199 87296 86427 89857
18542 89857 91089 77197 64582 62065 65040 64810 70109 61794 60172 70068 77429 69621 56646 67600
18528 67600 91458 114529 138596 158133 172973 197412 215088 228013 208794 201714 171132 145280
18516 145280 129901 98851 87309 80798 77243 72731 78415 76435 69369 66010 55955 60640 62528
18503 62528 60368 57430 57801 57048 61116 56695 47355 63707 76458 63264 43501 44792 46996 58056
18489 58056 58453 55901 58868 69347 73447 82114 91488 108384 119631 131349 154711 183570 225235
18476 225235 247063 239450 246169 257704 250425 237799 229692 232243 219653 215920 210445 199043 183828
18463 183828 171186 160973 138911 128424 113311 92341 83962 75839 64083 61855 63488 73213
18451 73213 59935 43538 55624 71807 80723 70662 68764 62914 65377 71896 79078 84989 97229
18438 97229 101670 111590 139113 153901 162758 166102 174740 188475 217058 236259 256942 264921 267864
18425 267864 295031 310434 325609 348918 351276 346072 335082 338913 312158 285362 274769 244588
18413 244588 218448 203245 173251 155087 132552 120687 108658 94857 87468 81562 90552 95337
18401 95337 90649 91718 95297 98540 99603 90092 77569 78936 81171 85636 92346 99130 103646 89216
18387 89216 88591 98519 105848 113156 120430 123743 118139 99352 97980 93360 98864 100599 102725 92086
18373 92086 91688 111307 129957 140389 153306 156272 146577 140860 135600 144495 142034 135391 119005
18360 119005 104056 96579 105265 105084 101642 91097 84379 75903 64845 65195 81790 92412 94648
18347 94648 101169 115341 105792 112686 115103 121453 127491 135465 126078 107550 103278 94703 93864 111374
18333 111374 112684 122618 124359 115107 110330 111609 117101 121192 119157 115015 109411 103621 99126 98799
18319 98799 110551 113312 109656 113214 116755 118720 118866 125638 140737 158383 179267 202990 229856
18306 229856 252047 252533 232737 221763 203679 187568 165306 141710 128781 131308 135378 140193
18294 140193 155922 166381 180044 206530 230095 245038 255746 266376 266124 265638 264613 251762
18282 251762 233961 215485 197660 195190 196951 189628 195287 225558 235818 224515 225941 220930 211264
18269 211264 202518 183035 155113 148196 148686 137867 128578 121246 107568 109306 122128 135820 142117
18256 142117 141189 130426 109907 114120 117836 125175 129597 142662 146291 144685 155043 156509 142554
18243 142554 118474 107038 115453 122532 126853 141414 148228 144097 149777 165452 188264 194299 170693
18230 170693 159605 165946 161120 165954 177773 198016 213019 237948 259771 285639 311838 338085
18218 338085 369610 398765 432613 463043 504905 543261 571688 614887 658530 714716 786002
18207 786002 867919 976603 1102277 1257453 1429700 1589673 1719519 1781017 1806412 1794972
18197 1794972 1732198 1625130 1484879 1352985 1234519 1108311 987821 882667 793101 709460
18187 709460 623223 541053 487545 458616 438030 420731 409409 423029 445915 451829 454402 465728
18175 465728 487280 507537 544938 554204 580142 622921 672382 711824 739244 761846 768923 787769
18163 787769 809042 827535 866338 933058 1009563 1130319 1296678 1517631 1790823 2081475
18153 2081475 2348036 2574317 2724795 2779822 2733419 2597795 2392848 2147368 1903591 1677257
18143 1677257 1508686 1375168 1252250 1145102 1034376 924084 824437 764710 736389 717668
18133 717668 712131 711280 723125 738973 750008 773519 809238 833497 882037 926394 967948 1020888
18121 1020888 1064423 1118612 1200573 1320993 1480832 1703551 2026529 2486239 3221146 4472740
18111 4472740 6788772 10990458 17775388 26717408 32188525 25566872 14796791 8526875
18103 8526875 5531942 3895028 2906725 2296542 1903758 1643942 1462152 1326775 1224557
18094 1224557 1153439 1086966 1027253 990672 975076 994445 1041240 1117262 1183953 1268573 1391399
18083 1391399 1514438 1629334 1737233 1867720 2004473 2116473 2192670 2243833 2303329 2403087
18073 2403087 2509621 2593810 2670233 2726462 2771156 2800053 2823457 2843909 2859640 2827676 2767943
18062 2767943 2714751 2678378 2648927 2624830 2608176 2602847 2595674 2566111 2507735 2404850 2279766
18051 2279766 2115511 1954647 1811508 1684584 1568736 1463362 1397378 1357762 1333902 1301273
18041 1301273 1263850 1221358 1162274 1099660 1007330 915034 851880 805536 770700 749847 746808
18030 746808 745029 748467 744864 736592 732028 718448 701076 699139 711697 720012 716044 718214 715864
18017 715864 725526 731224 761141 789129 816378 854112 879959 917725 976326 1030433 1080809 1110857
18005 1110857 1123627 1120554 1096871 1047099 1012548 977744 950074 929647 922872 924000 936357 955257
17993 955257 951464 925136 903586 870493 821223 758042 700348 637854 585166 549244 525097 505078
17981 505078 491746 459823 422428 416544 405540 393626 384879 383734 384042 384436 370091 364809 380678
17968 380678 399533 402688 398301 401327 406664 404872 413199 412356 410484 402149 409389 420005 419248 436972
17954 436972 485069 540947 624770 747398 908147 1082444 1295857 1477511 1595941 1676251
17944 1676251 1648958 1539857 1377571 1187990 1000093 853185 740826 671680 619245 584513
17934 584513 569442 567432 564642 578840 594130 605845 609050 587818 562250 551878 547887 550778
17922 550778 559961 574631 578642 577689 595841 617568 634708 655784 683997 723595 756818 786481
17910 786481 805582 836280 842929 811081 749752 721896 719965 722769 732386 753548 787063 861822
17898 861822 990127 1142786 1301525 1432712 1529740 1564573 1490290 1355004 1199878 1033491
17888 1033491 890301 786947 723073 664270 615212 582526 568230 562311 545568 551305 561457
17877 561457 591939 633764 670499 695272 709081 693527 655612 635620 645929 676325 739663
17866 739663 854998 1008326 1193256 1346169 1406249 1310935 1114687 900956 739861 661174
17856 661174 614055 598512 599185 603097 621273 640754 664068 704061 754080 800463 852218 913643
17844 913643 986051 1079916 1168165 1243880 1290603 1293457 1286938 1266082 1237832 1215558 1207670 1240910
17832 1240910 1336960 1517353 1744058 2037866 2462426 3090806 3925354 4772426 5084589 4709977
17822 4709977 4236519 4085843 4210108 4324856 4224812 3876763 3349649 2766376 2248588
17813 2248588 1872892 1640569 1521126 1476916 1476111 1521375 1602271 1681480 1771145 1877353 2022518
17802 2022518 2154920 2257626 2367618 2527413 2710510 2826663 2839015 2852365 2904708 2874375
17792 2874375 2715271 2498220 2301276 2138480 1989888 1835422 1711512 1660558 1651302 1715080
17782 1715080 1862622 2035736 2192954 2361311 2621742 3013735 3513800 4075211 4735392
17773 4735392 5604010 6722526 8075731 9466517 10497907 10826294 10353768 9323901 8107985
17764 8107985 7009731 6162812 5587930 5230328 4999598 4858032 4807675 4824888 4880622 4948522
17754 4948522 4979383 4948006 4900640 4833475 4730946 4621016 4497500 4353978 4241458 4177551
17744 4177551 4168327 4204793 4310043 4477263 4717986 5060409 5507892 6085340 6868922 7936914
17734 7936914 9278164 10900690 12949075 15607682 18752024 21903736 25151510 29282740
17726 29282740 34366706 39214093 43379869 47979937 53505494 58867880 63106690 66303256
17718 66303256 68692623 70990195 73600586 75249763 74725544 73359584 72672409 72546005
17710 72546005 71961256 70133057 66866526 63282918 60739510 58704061 55520598 51384401
17702 51384401 48520766 47768526 46851758 42499476 34604711 26636573 20824897 16848087
17694 16848087 13989836 11921511 10452492 9436420 8766779 8343404 8058312 7880387 7818501
17685 7818501 7883732 8092892 8463697 9036925 9849256 10799105 11623413 12082220 12282698 12511526
17675 12511526 12940297 13463381 13855137 14088010 14389320 14983842 15883609 17040933 18400870
17666 18400870 20012822 22106495 24860974 28342591 32787809 39109129 49341205 66711223
17658 66711223 94717024 135799237 186613417 225306487 230847432 218078871 207136434
17651 207136434 202467205 200720148 194008415 172082326 139514214 112742578 98893661
17644 98893661 94186006 92606649 89534646 83391800 74055704 62320239 50322983 39456828
17636 39456828 30641100 24138471 19579861 16428659 14145953 12239417 10625038 9321284
17628 9321284 8298939 7501825 6871148 6315943 5851217 5454498 5105044 4801019 4569215
17619 4569215 4362620 4203182 4045039 3913672 3795210 3694778 3590692 3477551 3376690
17610 3376690 3277916 3204296 3158428 3198185 3367629 3705922 4230040 4899184 5554773 5949719
17600 5949719 5917651 5517589 4946022 4430023 4153583 4195920 4546153 5078814 5598311 5922705
17590 5922705 5918087 5550268 4954858 4240356 3516986 2904356 2428492 2093522 1852947 1696508
17580 1696508 1589594 1509220 1444562 1388436 1330740 1263731 1222714 1206387 1178881 1137907 1109963
17569 1109963 1099626 1083125 1069937 1053306 1028328 1001774 964488 928584 902720 875149 851991
17558 851991 835884 820077 808351 795210 788302 796750 797537 793184 792238 786786 788553 774579 778176
17545 778176 783216 787736 794765 798367 801459 817541 812259 813569 810843 796317 797664 800221 779442
17532 779442 753645 734496 738754 774643 811068 821988 820350 813779 798682 781700 766275 744028
17520 744028 716715 686658 653499 622889 611318 612019 606631 588257 569770 555372 538457 526293
17508 526293 513704 493339 467955 452173 445840 445660 452763 453624 450987 445347 450871 457783 448087 435447
17494 435447 417121 409754 408143 414528 425543 439512 438751 437249 461585 485408 479861 474899 481350
17481 481350 490262 485894 472677 455884 450919 445984 434235 441403 454280 457333 446652 456442 467200
17468 467200 460055 455900 437886 420656 411759 392364 384208 388438 375342 367800 360570 349586 348857
17455 348857 361856 376716 386418 391577 382544 384577 390987 388783 377840 375949 392892 426253 454116
17442 454116 483722 508931 479518 430750 394807 384079 370218 354959 354140 352659 346696 333196
17430 333196 331788 335007 337405 334185 332909 325732 324495 324445 323675 324114 315053 302080 301494 297339 301299
17415 301299 309197 315904 316828 299372 290241 291771 284706 276885 274981 278885 284092 283323 288903 287761
17401 287761 285159 285004 287580 284156 268749 243731 239860 258093 250214 233136 219758 209089 208874
17388 208874 213192 212084 208871 209688 213625 222665 224040 228477 228675 224334 218589 220162 219407 219747 214264
17373 214264 190504 197610 207493 207625 204483 205875 210914 215422 216050 217793 219253 223946 216884 217959
17359 217959 212362 211667 212317 221567 234701 219633 215513 210884 195471 186185 187781 194916 193965 189691
17345 189691 167424 149649 153498 159778 146859 135573 134862 142954 145503 148855 169013 183974 171632
17332 171632 158759 153625 144782 135112 138043 141138 136750 145753 148451 147521 149081 158761 165632 164653
17318 164653 168719 171394 168189 160300 158672 154003 152296 160899 153454 149512 154759 150072 138577 145804
17304 145804 146296 142826 139347 145624 150607 155120 167793 165372 162270 159397 157927 159115 159650 143978
17290 143978 146869 141976 131908 134778 138079 138146 135139 138835 142816 141978 149820 149813 141590 141809 150531 168237
17274 168237 175996 165537 163823 164367 164165 171762 164830 150755 153156 156003 149215 143232 144046 148107
17260 148107 132959 136236 150489 145032 137079 134549 133739 127862 134943 137760 133296 138667 147974 157842
17246 157842 165873 167296 174008 179582 166567 167596 170585 163917 157922 174306 197255 219009 225246
17233 225246 241099 259810 278840 310795 340498 384415 405549 423163 452600 479795 493810
17222 493810 493735 498587 485124 483664 487143 471228 474607 491396 479873 461319 454407 426460 402017
17209 402017 384340 365439 340005 310450 286902 273468 254893 231385 211897 192484 183557 180017
17197 180017 180789 165077 145949 143582 150623 160407 158256 152028 157510 146884 141206 154396 181410
17184 181410 194748 194503 200691 239697 304262 358749 426520 502339 562584 609486 631580 626594
17172 626594 602554 567010 526100 483889 444414 409967 385318 373532 352271 340601 321096
17161 321096 312402 306227 306850 289256 281789 285535 295883 308553 322253 335950 332321 316912 297002
17148 297002 270767 260832 236755 219139 206951 198789 186762 170480 166962 170025 174673 172255 168170
17135 168170 160940 160124 168142 175833 185658 213146 248743 300886 366771 438994 477693 494769 509465
17122 509465 508037 484687 443292 402705 377530 350006 326216 312577 299381 296343 275614 252008
17110 252008 251600 246817 241378 232081 221494 234461 237573 248257 248601 253198 256827 245273 219305
17097 219305 196655 190335 181228 154206 149482 137257 115284 114058 108008 108782 102684 92469 81107
17084 81107 69419 71327 88677 97915 88323 76459 77459 80549 82626 77943 82019 79843 65356
17071 65356 58879 60347 59284 60774 72405 83292 85929 85082 86262 82816 82799 81899 67583 60969 54617
17056 54617 52196 53066 60529 59731 57393 62787 68995 66296 65691 54389 54192 48710 41650 40365 41312
17041 41312 42942 49661 54444 59726 64413 57643 62927 68901 75900 73619 71096 66803 72669 82677
17027 82677 73381 67834 67497 76186 71918 62860 53924 55886 65611 60761 60893 52174 40301 22040
17013 22040 28111 32406 23955 40646 53895 64040 72153 62801 44902 35710 36835 51114 56950
17000 56950 55519 59671 51953 53634 52148 50314 41900 51712 43219 43974 49391 57056 45311 43841
16986 43841 42948 48165 46704 31542 29231 28666 18181 25250 27008 30159 34224 41389 43832 52728
16972 52728 54433 58634 63610 48091 33711 31122 40031 39842 44290 48650 35042 22724 27846 42759
16958 42759 57898 51411 43038 39755 33315 45073 48220 55980 60639 60495 69645 64563 48861 43217
16944 43217 24678 21369 43128 58719 59597 60292 51114 52361 50800 55287 66348 68313 56138 59295
16930 59295 63521 71636 71915 68624 67491 50735 33082 39777 56662 62330 65290 52426 38508
16917 38508 34460 34272 46006 54528 49311 60814 70660 61462 67558 76027 70451 53550 46092 42572
16903 42572 31638 25666 28172 41218 54225 56771 62587 65945 71836 68935 60171 52089 48624 42860
16889 42860 46821 62695 62161 55912 51042 50798 56417 51369 50190 57202 58458 60264 68539 76885 65146
16874 65146 57454 49899 52004 70522 71176 54652 52969 59275 67852 74125 66414 54009 37632 32552
16860 32552 31854 31402 38144 48476 53328 57028 53632 57722 52677 56331 59293 68031 76406 66127
16846 66127 57019 50409 52442 63038 74339 78948 78682 72853 55102 41400 49510 63581 67857
16833 67857 70629 62187 59692 53023 47175 65665 74322 67382 49640 32897 30465 39786 40600 36759
16819 36759 29753 30085 24467 32680 34855 34883 29286 48766 59487 66087 54094 58152 65029 61619
16805 61619 61290 62950 60440 60373 50307 53877 46917 41011 45691 55646 47817 37203 33684 34513 27147
16790 27147 25935 30091 39295 37944 40112 48075 55658 65832 62958 58354 51317 46560 58620 65727
16776 65727 63390 54086 48154 47995 48253 47599 48844 53651 55743 50111 48240 38980 38930 39138 48508 50093
16760 50093 55405 69550 75698 70208 62259 49314 47688 39080 31675 46513 56949 62431 59556
16747 59556 43803 45148 40150 34935 49757 43909 34472 29109 26423 43961 48210 45136 57946
16734 57946 65260 62375 60378 51147 48843 50244 52707 57724 63259 70558 77296 82536 76319 66838
16720 66838 67179 57881 53703 58461 66473 68282 67379 70666 67812 67016 88016 83866 80272 77831 58533
16705 58533 57164 72781 90140 86156 80530 80732 73926 79974 85576 75145 79372 84218 93046 104132
16691 104132 109051 108860 106949 101171 98927 110666 118671 107729 106889 104314 109754 109688 117659 122970 123628
16676 123628 126113 119938 112355 122046 142807 155876 146355 148099 153288 149411 139664 143289 153912
16663 153912 148924 139171 145802 145054 153346 156960 151782 161060 162941 158218 152224 157940 153476 140336
16649 140336 143454 131684 129363 125862 108728 104600 98113 95080 108299 116820 116969 103073 98199
16636 98199 94723 87561 91278 93739 92176 91145 84728 88533 89520 82178 78831 79846 83776 88981 82206
16621 82206 83154 75811 73605 93161 103614 102879 90676 79468 79984 83745 78419 70036 80801 71705
16607 71705 47092 47325 48639 62732 69731 56402 61714 65658 61066 55246 57697 56464 50043 60723
16593 60723 72364 66704 61542 55329 57810 51853 47498 47322 42759 55521 60739 59009 44931 45377
16579 45377 60468 63230 49916 50952 53784 50836 53437 58754 53982 43515 45497 48299 49355 55089
16565 55089 46698 40873 45282 50883 57185 54644 60265 56819 54898 60620 52777 37036 24433 36302
16551 36302 48365 35736 28618 32090 38270 35693 42018 48307 47553 40552 35273 23717 14746 20952
16537 20952 24726 23225 14667 16428 14175 14307 19904 18106 8690 14098 32662 37663 36418 28628
16523 28628 24366 22579 20424 20890 11828 1505 9928 16552 27740 36572 36438 36747 30974 24576 31622
16508 31622 30568 34909 34746 33520 25535 14910 20213 23290 19212 31384 32712 18118 10948 11146
16494 11146 25037 25152 21951 30813 33998 27445 12547 8843 6458 13106 23190 21189 16325 9248
16480 9248 7335 6325 2781 6290 3084 -679 -2698 -7843 -1105 7354 24871 31308 18770 11310
16466 11310 14098 17175 10398 14641 4631 7199 18389 18391 22481 22398 26499 20276 19890 20815 24772 19088
16450 19088 14706 26519 35096 30576 12230 14221 14626 6485 15326 22001 16037 22555 17328 20629
16436 20629 30638 32845 29440 22535 5740 470 10355 17251 20588 23570 25515 17295 16673 25957
16422 25957 20504 16253 15716 16336 19096 28836 28953 33178 27439 18580 25327 32315 31999 34058 33117 30438
16406 30438 22843 25862 27355 34211 45675 37378 35567 38093 39304 38070 43324 36077 38546 50395
16392 50395 55281 52696 45471 39056 29998 26033 27006 17979 11690 13748 4650 8241 12913 10256 13583
16377 13583 9545 11900 16039 26965 33078 31228 32380 28279 30106 14835 16771 18614 5505 3519
16363 3519 13654 8715 13506 20929 21710 32287 33416 33012 31750 22490 10786 9435 14557 13509
16349 13509 20979 30887 27635 23493 31981 33846 28099 10061 8329 18609 19243 19245 18013 18715 27762
16334 27762 15669 -2075 2178 6219 3547 20606 31938 20403 5228 -1320 5861 16845 24800
16321 24800 17923 -436 -2576 9794 22613 23847 23351 28801 28017 23783 20786 29899 23247 26091
16307 26091 33579 23427 23086 15014 9098 7966 8662 7618 1094 -1124 3127 14481 20851 30303
16293 30303 24245 22501 17451 14512 1634 8578 11082 5821 2283 -9072 -14057 -3448 6148 26433
16279 26433 25145 20725 11694 4909 1017 17298 30707 31370 30776 26746 19227 18960 6707 -4629
16265 -4629 -2318 -6659 -12060 -5475 1601 -186 -1996 12030 21487 21504 15080 7219 -426 5088 13366
16250 13366 19977 16019 3291 -1921 964 8090 8589 15150 17693 28447 36472 41415 38282 27197
16236 27197 25701 40536 30686 29685 32748 34462 46381 45799 38468 37112 26550 27097 22000 16022
16222 16022 34715 44454 46962 45300 44847 48402 61226 68588 75585 85023 87237 78647 81538 82881
16208 82881 96882 113396 133890 151147 168037 187363 201690 219898 231294 239654 254945 276298
16196 276298 289503 296247 299750 305591 309477 308955 297587 275863 260660 251222 252642 237261 213747
16183 213747 198678 175036 152417 136761 129154 126010 102762 91074 83825 87523 79673 74328 64483
16170 64483 59765 47871 34208 22646 28319 38472 37813 37956 29818 36984 33115 26252 27970 34433
16156 34433 33310 45064 44649 39525 23088 26957 21004 19502 30322 30119 17665 18564 17642 11546
16142 11546 5001 13902 28220 21840 14996 11637 29827 26303 24193 25607 24250 11690 10956 8495
16128 8495 8132 17713 22136 6839 15986 20037 14200 7582 -2508 -8055 1643 4830 30131 16566
16114 16566 586 4033 275 -10085 -321 7834 10729 10838 9737 16391 25939 33992 24965 29998
16100 29998 27739 11022 6133 13160 25503 26983 26574 6999 4932 5462 2890 11883 11388 1869
16086 1869 -4460 6899 9781 31206 40207 31263 22704 20213 11515 14446 -106 -3612 -1895 4827
16072 4827 22354 28492 9724 14606 20058 20841 28414 25483 20105 9108 3470 7089 9839 5804
16058 5804 -2263 -7640 5223 19882 20722 19837 24104 14072 18271 11486 3073 -4964 -1770 -6461
16044 -6461 -6759 -5810 -1764 14468 17659 5743 5197 10149 17325 25798 27209 12169 13977 16758 18897
16029 18897 15329 12403 20296 17852 9672 9935 19461 24590 22647 20845 8377 -4334 817 2333
16015 2333 -5299 -7053 -20975 -6480 5935 9684 17958 32474 29846 24976 14735 9908 5340
16002 5340 -1994 1648 6690 -642 1012 -5275 -16159 -6072 2599 662 12249 18318 35772 38491
15988 38491 32940 27099 18824 9992 5492 4629 7513 5521 12560 18702 18274 27104 19066 19199 24204
15973 24204 16417 16912 16087 18293 19955 15120 14493 2336 1375 12662 20580 28619 22904 12586 10606
15958 10606 25861 22897 14340 11863 19137 35284 37930 34025 31416 30320 21651 10390 18725 21667
15944 21667 8781 3400 -7942 -4515 -4030 -2937 -4774 -9942 -2654 9844 13894 19136 24273 12614
15930 12614 5438 14934 6576 4353 7051 10632 18204 18195 5977 -3864 2197 1031 -3689 -17155 -18921
15915 -18921 -12571 -7120 -9748 -9148 -11991 -4857 11293 12943 2279 5825 4407 6961 7209 12194
15901 12194 4417 9604 8872 10684 9057 1777 -1280 9801 18663 17715 29672 32030 28538 19432
15887 19432 16851 4472 2363 -1491 2979 -985 -706 2957 2125 9254 3265 2944 -869 -1682 7491
15872 7491 4739 -4127 -5715 -7624 -15308 -10760 -3056 -7058 -14798 -8960 -10390 -21645 -34621 -32924
15858 -32924 -16469 -7560 -7142 -11818 2870 13540 13200 16203 23558 25003 38467 36585 21171 20409
15844 20409 17158 18574 25874 18707 21707 12169 7885 10999 14154 11554 3582 -10055 485 4850
15830 4850 19861 23649 14180 3466 -2494 1950 2681 1298 1009 424 -2011 -4385 764 12517 17801
15815 17801 10880 -5071 -5342 8893 22009 16459 13268 5859 9594 12334 10144 8613 18917 30424
15801 30424 23444 4772 -4736 6483 12340 25069 28356 22403 21068 6561 -2580 -10118 -3853
15788 -3853 584 1924 16454 8807 2826 7723 22768 24476 29607 29180 17369 14361 17455 10281
15774 10281 11478 19438 10534 3512 14148 33338 38304 26042 19491 23344 28389 33008 36095 35950
15760 35950 32362 33969 30411 15948 10583 2745 -2869 6336 19567 15842 5977 15366 26940 27272
15746 27272 19027 6787 22732 33959 32869 28291 30891 33459 30602 30381 24144 24564 30500 25387
15732 25387 15969 14497 19361 17253 19647 13894 15523 21945 19905 20338 21963 18997 16874 16488 20012
15717 20012 38623 53133 36232 26586 20156 10890 -2069 -1102 11184 34633 36573 25923 18143
15704 18143 7862 1823 6648 10376 3696 6372 17057 15004 16282 15978 13881 9095 8739 2959
15690 2959 -3792 12170 26465 38067 25617 27173 17490 15343 10026 10528 19338 29286 17697 23157
15676 23157 29987 39279 32279 28711 35780 22716 8924 2051 17365 24189 21679 25530 36770
15663 36770 42873 41781 40653 31108 40252 45452 50233 56252 63901 78241 86765 96767 113735 117122
15649 117122 132399 149774 149847 158205 166713 159280 156412 144871 112406 91098 88547 88205 79777 70438
15635 70438 62162 60427 63749 60108 51199 42824 32946 30551 36270 27291 39802 42292 41148 42737
15621 42737 62850 67733 77194 87774 85699 85501 76839 76462 85419 100902 132401 160740 182638
15608 182638 195696 213803 233672 236487 230374 236264 232931 222807 214232 211096 220011 214462 192720
15595 192720 190044 177448 150737 132359 123973 108706 95588 80378 73373 75725 73975 72954 55073
15582 55073 52694 50954 55362 55260 36245 35283 46893 66450 69955 61635 54017 50469 55929 59648
15568 59648 61172 64635 79299 90487 89707 101035 114989 121449 124268 141573 148865 160414 163169
15555 163169 138173 116361 116439 102924 72858 63066 59948 46935 29687 29590 24819 29843 33413 44158
15541 44158 29279 16105 27870 34927 27578 18407 11327 3573 8825 3637 1953 10018 30311
15528 30311 24613 15259 14901 32197 31754 23134 15002 17002 10821 3378 -7468 -1697 9625 -1609
15514 -1609 -17681 -3006 5305 8978 2796 -3656 -2335 971 -12232 -9231 -11415 -10028 -4586 3743
15500 3743 -1985 -4140 -7991 -3041 6403 9813 12178 13175 14905 17971 15535 9895 -1227 -12171
15486 -12171 -12350 -3594 -13925 -14109 1451 13567 28913 40459 38963 38647 38850 25203 13737 -1545
15472 -1545 -17096 -29346 -17394 2123 4347 4491 -4140 -1755 5075 18404 9930 -5299 -16765
15459 -16765 -38067 -38114 -29029 -8259 5127 12107 5261 3224 4325 13716 16328 13732 7002 7699
15445 7699 27 -9279 1239 2170 -6744 -14054 -2612 12713 13932 9511 24310 26377 22954 30641
15431 30641 20696 11212 23269 29924 24921 2201 -9254 -8467 -2548 380 5835 7429 4609 6091
15417 6091 -4760 -9114 8000 5820 -1837 -80 5808 9030 14317 21099 25761 37667 49367 42652
15403 42652 49932 45844 45746 45265 32937 18412 14186 13296 2772 -1301 -11659 -16189 -9985 -7242
15389 -7242 -9027 -15958 -23247 -34242 -23116 -20455 -25595 -22450 -12528 -16034 -17149 -3895 1731 -2364
15375 -2364 -6938 -8573 -9493 -13254 -20354 -15639 -5414 830 816 -4939 -1959 -9446 -11281 -4713 2019
15360 2019 7845 -12592 -8310 379 -2716 818 -2129 5356 4136 6284 9952 1044 -3126 -8108
15346 -8108 -4281 1308 8833 5983 4114 -4344 -15952 -21877 -18469 -19247 -27716 -16706 -15386 -10584
15332 -10584 -6813 -5410 -6212 -17710 -26717 -34484 -31390 -19871 -6376 -5744 156 15235 13553 -692
15318 -692 -13405 -5707 1986 11981 15289 14224 13466 15675 5013 -9693 -7073 -10333 -13012 -4276
15304 -4276 300 -4743 -554 -1225 -9298 -8427 1607 5199 -5644 -6909 -1681 -5224 -646 -3468 12456
15289 12456 17379 16568 14414 -7459 -20197 -4783 -3005 -3517 -1140 4334 9006 8291 -517 4584
15275 4584 14459 13793 5649 3983 7900 6095 4200 9107 8021 -2156 829 -219 -5753 3749 3267
15260 3267 -5046 -22991 -31023 -22030 -13020 -9539 -7717 -5830 -7329 -15735 -10063 -10878 661 6886
15246 6886 4557 1460 -2362 -3198 -17535 -9809 5718 -338 -7477 -7476 -3855 -6482 -8605 -98 -695
15231 -695 -7721 -12721 -6838 -590 -3956 -2608 519 -980 -2454 -1056 -6199 -481 1175 286 -16205
15216 -16205 -24698 -18552 -16281 -11169 -1835 -6978 -13552 -14393 -7258 -850 -5493 -20816 -22092 -29590
15202 -29590 -23982 -18071 -12746 -9141 -8680 -6201 -5250 -7894 -7738 -6705 13152 19980 9672 -4674
15188 -4674 -16897 -5492 2908 4953 12583 14716 1579 9992 16719 12424 21975 23454 10697 -5481
15174 -5481 -17462 -6321 -3306 -13026 -21516 -18359 -18530 -13988 -24786 -26242 -32719 -32733 -35002 -29258 -16596
15159 -16596 -13359 -18944 -16303 -12674 -24783 -11852 -3771 -2898 9660 19842 19188 19775 22952 23211
15145 23211 8888 -1326 -7313 -3875 303 2365 4737 5097 4149 -1995 2137 -638 -2276 -6952
15131 -6952 -1262 512 -1230 -7070 -3711 -2815 -5118 -15559 -14542 -3288 -22451 -36422 -35478 -27731
15117 -27731 -27741 -19956 -10253 -163 6492 11639 16694 5288 -1118 -15201 -17942 -17801 -14384 -4083
15103 -4083 1201 -3231 -386 -1631 -3247 -7998 -5288 -5637 -15065 -6829 -6563 -3979 -4771 -758 -8811
15088 -8811 -4496 1896 -841 -1336 4055 -452 806 1723 4483 4301 -612 -10310 -25033 -27418 -13098
15073 -13098 362 -7917 -21331 -18544 -7844 -9928 -19620 -22849 -26033 -25250 -24377 -30219 -25923 -27166
15059 -27166 -27062 -28694 -28646 -17988 -10535 -21264 -31954 -31058 -25989 -14420 -9982 -3043 3462 2751 -2618
15044 -2618 -4115 -10390 -20862 -28271 -22159 -4853 -5633 -5665 -5809 -3556 -8229 -15433 -5852 -10779 -9052
15029 -9052 -5179 -6592 2917 4371 -5 3716 17021 19311 5050 -20035 -17257 -24036 -20338 -14819
15015 -14819 -16561 -22612 -27197 -18548 -14779 -8495 -2064 -2360 -215 4567 7524 -2501 -13261 -3171
15001 -3171 -7917 -7957 -10849 -18093 -12014 -5828 -7501 1608 10825 8424 -1121 -6339 3670 13466 14065
14986 14065 10903 5119 4706 6757 10307 7787 9028 15050 26552 29603 25511 23151 27036 22845
14972 22845 13174 -11012 -25992 -15835 -7439 -7997 -3263 -5221 -3094 -4976 -2344 -4859 6975 4498
14958 4498 -7548 182 8075 837 -8751 -3519 -3484 -6175 -2507 4047 2093 4228 546 5294 21426
14943 21426 10133 12808 10642 2029 -1076 -11158 -18083 -17764 -16036 -18128 -28823 -29270 -23256 -24276
14929 -24276 -14151 -8812 -6947 -18704 -24357 -28923 -23546 -32995 -32509 -23186 -22146 -18982 -7726 3636
14915 3636 6363 3519 2655 3381 -9880 -5023 9697 12358 4979 673 3573 -5208 2502 5094 7861
14900 7861 13980 7308 -2567 -5766 -13451 -13595 -5579 -4411 -2319 -2132 2575 13567 11070 9659 9929
14885 9929 3845 10467 10975 8315 4832 3389 20438 21203 24839 35744 36099 24316 27467 39009
14871 39009 52704 56477 52932 62168 54282 56986 51341 41236 28789 22631 19144 11899 22747
14858 22747 30687 39962 43354 34900 22722 15507 13828 17427 9265 7247 10130 9091 8846 12792
14844 12792 8973 -1475 52 -13421 -11708 -6727 -16284 -14477 2233 24167 31615 15152 18630
14831 18630 26939 18070 485 556 390 -1556 -3629 5467 5613 2270 3881 17552 9431 6777 164
14816 164 7226 -2766 -11976 -10404 -20327 -14782 -5401 -2806 -11357 -13499 -12577 -7276 -12744 -18203 -7884
14801 -7884 12599 7274 514 -8986 -3001 -4803 -7316 -2251 -7741 -2245 2828 -7663 -3800 659
14787 659 -15259 -24014 -28449 -30276 -23644 -19291 -10471 -17152 -18496 -14667 -11739 -864 -9700 -12388
14773 -12388 -8511 843 -1702 -10053 -6326 3854 5840 -4557 -8250 -11047 -9972 -4300 -24118 -30181
14759 -30181 -22808 -16755 -11720 -9626 -14351 -19275 -23261 -22600 -17731 -23036 -24654 -14861 -2575 1643
14745 1643 -175 145 -5992 588 9267 6705 -9221 -18360 -9057 -6388 -10108 -7723 -9161 -12926 -10606
14730 -10606 344 6440 2922 -7190 -1218 21741 30603 9802 -2767 -3872 -12501 -12734 -13436 -15979
14716 -15979 -24740 -23555 -7940 -1059 -950 16016 13292 2598 -7778 -12416 -16914 -14424 3641
14703 3641 7978 11253 14320 9331 -6015 -1456 2843 3870 10642 8290 10105 4579 -5146 -1527
14689 -1527 -6050 -11629 -17576 -19412 -5180 -1068 -1625 -2624 -14136 -15667 -12160 -11630 -4865 3802 -4941
14674 -4941 -7060 4136 9627 -3137 -6427 117 -4600 -11750 3261 4057 4177 7983 1278 3924
14660 3924 494 -10352 -8367 -2364 1452 -3106 6717 6695 -4829 -8949 -7157 -21491 -18357 -16979
14646 -16979 -21265 -16978 -11879 -17291 -18705 -14332 -11534 1427 12745 14545 11178 4572 6472 11536
14632 11536 15718 -3886 -24389 -25074 -31547 -43184 -33099 -27120 -22006 -6697 8173 19572 21201
14619 21201 11475 18590 15148 24981 18247 21807 9966 455 5866 5800 810 -3172 -4044 -9692 -9867
14604 -9867 -1729 -8856 -11082 -16302 -16423 -7818 898 5646 11800 -1728 -2952 1857 4570 -10600
14590 -10600 -14854 -3241 -5864 -14428 2800 8767 770 -8330 -15663 -19673 -31335 -26558 -27300 -11009
14576 -11009 8199 22876 18847 10696 2011 -9050 -5365 5693 12603 4203 -4516 2054 -1584
14563 -1584 3507 2670 -6793 -14769 -16553 -17238 -15473 -23749 -13327 6623 14358 11283 3153 1354 8487
14548 8487 10666 11314 11178 265 -2259 -15460 -16565 -8175 -6199 -7726 -4576 -10673 -11386 -14313 -3736
14533 -3736 10657 12918 4410 -7871 -5715 -4896 -6964 -17807 -10072 -2114 -670 -1875 1906 -3026
14519 -3026 5094 -2534 -22369 -22717 -21317 -15922 -7714 -5217 -10951 -18165 -25525 -22026 -17067 -14319 -9838
14504 -9838 -17219 -16730 -14004 -6268 -4824 -5915 4995 8469 9607 18272 11196 13857 16082 2488
14490 2488 -14384 -7919 -6930 -18836 -27119 -16121 -4679 -2029 -8732 -14098 -10771 -16014 -13893 -15590
14476 -15590 -13826 -11588 5349 5541 5624 16519 22108 14876 5663 4254 6655 6603 -5946 -268 2344
14461 2344 10349 10875 8747 7523 18778 23346 16022 19710 25757 12139 5971 8752 6650 2010
14447 2010 -4182 -16553 -8815 2855 -3120 -3151 -3988 -13792 -4674 2052 9246 15918 25266 19565 853
14432 853 -5009 -12401 -23107 -26045 -29083 -21028 -13952 -11293 -8118 9655 8433 9930 8243 8792 11253
14417 11253 5716 5715 -8265 -8600 245 677 2450 3952 -11690 -11782 -1861 10627 10032 9680 4617 -528
14401 -528 5658 -11 -6689 -1771 4615 13484 19796 18257 13622 7413 1322 -4514 -5349 1947 976
14386 976 -10543 -4891 6619 7987 9835 -1707 -1164 16538 21599 9369 -5377 -5652 -6697 -1811
14372 -1811 6644 -2966 -13347 -46 766 1310 -5246 -10003 2549 8015 1183 -6968 -2377 1424
14358 1424 516 -7735 -9999 -15486 -14733 -20804 -21148 -20333 -25166 -21466 -14924 -14539 -10835 -11606 -10139 -14322
14342 -14322 -7652 -4627 -6481 -4573 -12513 -19388 -24103 -18172 -840 -2847 -999 8153 -6052 -14807
14328 -14807 -13285 -6088 5167 7344 -4913 -2289 -576 -1508 -1607 -16764 -28041 -27784 -15769 -12950
14314 -12950 -8848 -5883 -9551 -13848 -20215 -19511 -373 6341 -8690 -15989 -24600 -20025 -8154 719
14300 719 -8043 -15252 -13701 -19797 -29705 -30528 -39367 -25301 -9805 456 12376 21957 22897 23901
14286 23901 12446 8432 -2572 -5593 -1266 1721 -6053 -6515 -13895 -22144 -34374 -36672 -23981 -22572
14272 -22572 -26821 -20081 -10925 -17561 -20813 -15967 -11923 -18032 -27755 -26056 -19200 -13290 -8349 -3097
14258 -3097 5504 10326 12434 2478 -5176 -2140 -17629 -20352 -14809 -2727 1891 -4820 -15229 -14131
14244 -14131 -17824 -19188 -19366 -10505 4239 3400 5154 -7472 -8239 -12405 -10209 -3806 388 -404 -12451
14229 -12451 -12296 -5062 13030 9299 14270 20162 12702 9208 536 193 -1965 -4062 4869 13451 -972
14214 -972 -15146 -23269 -23733 -7126 -4729 -8728 -8732 -11971 2249 8190 8354 -2443 -13279 -4604 -8647
14199 -8647 -20436 -13787 -16834 -27603 -18593 -10793 -11957 -16741 -23120 -15496 9006 19846 11837 13513
14185 13513 18736 24300 15556 8496 -5854 -9150 -4514 -20067 -22894 -22761 -19757 -13235 -19321 -23640
14171 -23640 -25424 -23636 -13205 -10631 -984 -214 6289 14158 10117 8988 2493 -3143 8932 7895
14157 7895 5118 12770 21784 18594 2675 -8873 -14751 -8880 4031 15805 10667 7920 7927 8190 7920
14142 7920 13558 26402 28578 26455 31345 27912 8337 4151 266 -4475 -2432 -12474 -30622 -31542
14128 -31542 -26327 -23271 -19717 -10669 -6111 -7613 -6935 -15573 -20114 -20611 -15007 -11633 -15477 -17137 -23723
14113 -23723 -29944 -41798 -35732 -30903 -24372 -8825 -7809 -18848 -18726 -11778 -3825 3614 2933 13197
14099 13197 10752 2798 -6560 -2810 3348 490 2268 16948 18200 5214 7407 6784 -333 -3991
14085 -3991 -17585 -27937 -21981 -5290 -3855 -20597 -26453 -23982 -20720 -15833 -13714 412 -9211
14072 -9211 -11606 5152 1425 -922 -1154 2735 2199 -3388 -6728 3432 4690 2898 -1723 -4664 -7352
14057 -7352 -13253 -18125 -22924 -23136 -27760 -26969 -30185 -30889 -17880 2714 1650 4906 1781 -966 -7644
14042 -7644 -8788 -16733 -3051 9484 14498 -2666 -5671 -6263 -12453 -11405 -16179 -6701 -4657 -22398
14028 -22398 -24881 -21917 -9078 -5408 -11486 -12376 -20820 -16229 -14502 -16807 -17346 -18477 -15809 -13997 -8322
14013 -8322 -11442 -27721 -34307 -30018 -27376 -21625 -20762 -25152 -23287 -15757 -2920 6834 -314 -2104
13999 -2104 1605 -5425 -15557 -22015 -10421 3640 6278 8273 -10045 -13461 -10742 -14361 -26515
13986 -26515 -23373 -8222 318 -6116 -12524 -2245 -1943 -14005 -24719 -15293 -21302 -23596 -26823 -27597
13972 -27597 -17403 -12663 -13328 -12579 -9927 -8607 5986 14540 14578 66 -4219 -20096 -25415 -21453
13958 -21453 -16989 -3919 -9392 -15828 -14979 -10011 -4552 -17208 -23118 -20677 -15757 -13793 -16830 -17365
13944 -17365 -4877 -6052 -18128 -19916 -10050 -4442 3236 1362 1181 9931 -3383 1234 2541 -2936
13930 -2936 -4100 -9327 -2478 4952 21956 29776 20855 -4212 -17181 -16508 -35149 -32884 -29542 -27934
13916 -27934 -21065 -19861 -23398 -16248 -19561 -16477 -15091 -27733 -22694 -14031 -19383 -16792 -1646 10291
13902 10291 -3267 1517 4566 -4233 -9707 -5888 2154 -5885 -6084 -12720 -11966 -19524 -27993 -27308 -28141
13887 -28141 -14399 -15149 -19672 -27300 -34502 -42712 -40536 -35427 -28550 -19801 -25849 -29346 -22043 -18909
13873 -18909 -19894 -22342 -18793 -12781 -3291 163 4987 4073 -10109 -14950 -13357 -12700 -15409 -18414 -27693
13858 -27693 -36233 -32587 -32897 -33990 -28077 -19691 -30554 -27475 -31366 -19750 -14959 -31193 -35689 -33375
13844 -33375 -33201 -30204 -29396 -17065 -3475 2512 1553 -12661 -19859 -13204 -5214 -488 -2500 -13419
13830 -13419 -20666 -16475 -27174 -31506 -20752 -31393 -37838 -27011 -4262 4977 -2005 -10685 -17475
13817 -17475 -2805 -3506 -6150 -9611 -8271 -12488 -7135 -7530 -2435 4617 2908 -4869 -2615 -4540 -4297
13802 -4297 -14722 -24566 -23808 -20685 -18420 -18644 -11273 -8753 -10143 -5873 3489 -4029 -13741 -13290 -16866
13787 -16866 -19131 -17102 -26373 -16513 -19167 -27185 -27991 -25124 -12214 -12559 -10065 -5400 -5219 -3318 -2087
13772 -2087 1885 3604 1561 -10840 -10191 -2259 -1043 -13829 -14830 -13620 -4178 -13344 -20807 -11211
13758 -11211 -7905 -6405 -7505 -3849 -13573 -18438 -25173 -15296 -9138 -10526 -7767 -10909 -9057 -2569
13744 -2569 14428 10278 -596 -5362 3508 19276 15396 7738 -194 1916 -899 -24871 -33909 -25746
13730 -25746 -14454 3994 13928 22222 10957 -708 -7517 -6397 -1848 -10936 -18387 -19424 -16680
13717 -16680 -11264 -6677 -9914 -17213 -14877 -22983 -19745 -20075 -20397 -23601 -17070 -5098 -7508 -12746 -14055
13702 -14055 -4804 -14978 -16533 -15477 -17936 -6914 -14580 -30708 -25744 -17197 -13557 -18643 -15988 -5149
13688 -5149 -6004 -15772 -20898 -13144 -8318 2281 -709 1041 -6511 -12024 -5948 -10326 -15887 -14526 -14796
13673 -14796 -17151 -1573 6621 12147 12811 7392 -9398 -19551 -11660 -5888 -11742 -18945 -20408 -25383
13659 -25383 -17048 -20763 -18709 -14038 -5851 2001 4620 -2939 -8560 -3269 -4645 -6893 -9048 -4382
13645 -4382 -2211 -16530 -22745 -21471 -9845 1321 451 -10302 -29170 -33242 -17600 -14453 -28282
13632 -28282 -28982 -21090 -25674 -27046 -34163 -35243 -26927 -22257 -18264 -23108 -32423 -31233 -23883 -15381 -18931
13617 -18931 -20605 -14246 -20987 -25781 -17296 -15989 -23512 -16749 4868 -3284 -13057 -13215 -18545 -16649
13603 -16649 -3749 1711 -7472 -28399 -34393 -35286 -41009 -37940 -27098 -23659 -22242 -16192 -11822 -5755
13589 -5755 -8481 -9904 -24966 -23851 -32397 -34600 -25208 -28313 -29815 -29827 -33341 -26338 -21758 -34167 -41792
13574 -41792 -33035 -21652 -19132 -21885 -3916 -3262 -5556 -8321 -11250 -15048 -20678 -20200 -19642 -20345 -24347
13559 -24347 -28510 -17541 -14349 -19391 -27235 -23136 -15236 -21759 -19931 -18785 -24448 -17583 -22374 -23346
13545 -23346 -26978 -18134 -14921 -25018 -26974 -29959 -20701 -8060 25 -14078 -17250 -22526 -24669 -11730
13531 -11730 -5515 -6335 -4249 -8057 -7723 8426 4761 -3512 -16659 -36973 -45694 -43215 -37511 -28685
13517 -28685 -21579 -30077 -26216 -15731 -11676 -13306 -16840 -15880 -18323 -23712 -18095 -17648 -13952 739
13503 739 2238 -15326 -9836 -1160 -3538 -25499 -32831 -31948 -34701 -33158 -6856 15062 2038 -15810
13489 -15810 -14981 -6161 -9361 -12727 -8429 -15736 -33303 -39179 -43704 -32313 -10770 -5540 -3430 -8517
13475 -8517 -11563 -9583 -710 5628 916 -12407 -23888 -25519 -29584 -32564 -36711 -31336 -28996 -21150
13461 -21150 -26629 -24203 -8179 -3720 -14445 -26253 -27157 -19044 -949 2185 6309 11547 -1883
13448 -1883 -15928 -17756 -15903 -11228 4779 217 -6560 -12943 -16036 -15104 -20022 -12335 6376 7288
13434 7288 -16784 -21101 -16669 -15304 -5628 -1221 -7294 123 -3970 11022 17621 6334 -10556 -20037
13420 -20037 -17818 -7006 -21754 -19566 -4047 -662 -7744 -22378 -31549 -18460 -10998 -4754 -8967
13407 -8967 -5443 -2952 -12601 -10013 -13940 -11886 -17608 -22916 -27709 -17983 -13300 -17248 -4657 2342
13393 2342 -15759 -25561 -10125 1398 16410 12381 12916 18131 22339 11152 1301 -12806 -7648
13380 -7648 1747 -478 -1831 -1188 -3952 -7264 -11113 -6316 -1163 582 8781 10437 -494 -5217 -7935
13365 -7935 -5755 -18406 -28842 -25567 -19713 -13354 1031 1812 1482 12317 14920 2804 2506 -10910
13351 -10910 -24162 -30067 -34284 -35642 -35997 -24467 -20175 -13226 -18238 -23611 -24665 -23690 -17364 -9122
13337 -9122 -8846 -14042 -6649 -11279 -12181 -17195 -17929 -27117 -20750 -21904 -20503 -10153 -2715 1343 8418
13322 8418 -7932 -18640 -23408 -25440 -11221 -21724 -32940 -29104 -34179 -32925 -27563 -16473 -7150
13309 -7150 119 -7364 -17413 -19314 -36266 -29246 -7960 -13839 -24509 -22426 -22294 -14707 -14516 -9752
13295 -9752 6340 22449 17817 3221 -2007 -8866 -17497 -12437 -3009 6999 1363 -19966 -20835 -15240
13281 -15240 -2674 -71 10241 10313 5840 10121 11743 4770 -1274 -2957 7876 12583 -2851 -6175
13267 -6175 -4057 971 -4868 -10120 -7904 -8638 4072 -124 -9931 -13349 -22604 -28804 -20419 -10634 -4965
13252 -4965 -4739 -797 -9157 -18256 -12209 -10711 -15794 -15801 3359 6417 3334 -5148 -12618 -8346 -10940
13237 -10940 -10669 -666 7702 448 6822 8636 -2826 -6746 -1060 -7418 -9822 -5433 -5997 -1042
13223 -1042 -3525 -7320 -8483 -7416 -1283 3089 5168 4912 9265 12835 9417 12346 26097 51915
13209 51915 57669 45988 46925 32681 14021 21585 25842 20051 10029 10544 15771 15041 9716 867
13195 867 -1347 -5623 -9580 -985 9749 3245 -3570 1960 14723 6228 1783 9217 13408 18544
13181 18544 23657 22577 26431 22916 9868 -3160 5825 9518 5092 5666 30868 56398 73975
13168 73975 98849 132923 142923 114917 85077 53912 41311 34209 31147 30330 38079 35610 12971
13155 12971 -5444 -12489 -8340 -9061 -11529 -17364 -18493 -10917 -5939 9559 17221 11981 5706 10651
13141 10651 15978 15769 14743 3646 5923 6371 476 -4676 43 6418 2587 8070 17910 25610 39490
13126 39490 44502 44490 59537 63133 64161 43748 18771 9692 9630 4913 2668 2874 7087 16402 13783
13111 13783 10272 6164 2002 5682 773 7754 14424 17613 13805 11961 -3763 -4110 10289 16563
13097 16563 20075 14304 11793 13090 15415 5327 -25541 -28902 -28161 -15608 -13269 -16305 -16181 -14976
13083 -14976 -21343 -28984 -25466 -11038 -5487 -17597 -26819 -8793 -5040 -11388 -19269 -28697 -28254 -9235
13069 -9235 -16588 -18379 -12222 -9620 269 -5920 -19935 -23762 -7258 1588 -5538 -5463 -4012 7453
13055 7453 10349 10197 -1027 -4554 -13130 -20732 -3680 14603 18336 18735 -3617 -10714 -13103 -9789
13041 -9789 -12028 -7052 -5047 -8455 -10131 1725 11800 13911 7069 -5095 -13875 -10175 -3378 -15572
13027 -15572 -19050 -13358 -10520 -9484 -10241 -19319 -35787 -28300 -4408 2848 666 -13660 -45037 -40743
13013 -40743 -24862 -23380 -30326 -25302 -27960 -21218 -18372 -27009 -25514 -22498 -31893 -22757 -14729 -12331
12999 -12331 -20667 -26877 -23685 -21990 -24559 -32973 -19860 -3187 5457 4711 -5390 -9928 -6929 -4479
12985 -4479 4384 -4214 -14968 -29285 -26982 -22126 -14425 -5671 -8048 -2275 -6628 -13176 -7806 -9506
12971 -9506 -8089 -13067 -8971 -4286 -10370 -22256 -14092 -15710 -7174 -9587 -12715 -6044 -7068 -34178
12957 -34178 -49462 -45731 -35086 -26951 -19951 -11600 -9541 -10287 -16192 -29263 -26306 -25680 -29218 -24761
12943 -24761 -16247 -18965 -33299 -30487 -24206 -12703 -7738 -22015 -35139 -33067 -26058 -22726 -25773
12930 -25773 -18796 -12529 -10012 83 -4664 -8819 -18024 -13126 -1248 3694 6634 319 -6420 -5912
12916 -5912 -3130 2137 5653 -5616 -5005 -4213 -4484 11929 1850 -18211 -20031 -10324 -7674 -2988
12902 -2988 -3415 -7896 -981 -6338 -8370 -3696 -6235 -11049 -3918 -5939 -12969 -7157 9721 17687 2528
12887 2528 -1176 3412 2178 -3549 -2861 -6050 -12264 -20356 -20332 -19092 -9866 2014 4264 -13391 -13875
12872 -13875 -12857 -16776 -18523 -15932 -5203 -3315 -19155 -25789 -29951 -27279 -31998 -38238 -37396 -23084
12858 -23084 -12491 -9722 -11991 -1885 -3081 -1128 -10403 -19016 -9075 338 1606 19930 32486
12845 32486 21017 10603 8100 5752 2853 2396 9649 30 -4255 -1397 -1812 -19921 -33835 -38718
12831 -38718 -35520 -23934 -15720 -13881 -9228 -19037 -29295 -23240 -6954 -1546 -3831 -15213 -29598
12818 -29598 -30732 -16626 -17131 -30464 -27165 -31508 -27411 -15384 -15291 -10899 2870 11250 11345 11854 7583
12803 7583 -13865 -22783 -20813 -14685 -10757 -15214 -22886 -26428 -18739 -11943 -17391 -7129 -198 713
12789 713 -10102 -18184 -18717 -18288 -24136 -17858 -22430 -32486 -19004 -13444 -21586 -17844 -16964 -11442 -9946
12774 -9946 -18351 -25076 -14104 -6003 -5700 -6498 -15298 -6340 3525 15322 17304 13993 -1155 -17681
12760 -17681 -14357 -9169 -4671 -6429 -16217 -19166 -14931 -4150 -7956 -13046 -19096 -27328 -18176 -11724
12746 -11724 -12427 -19491 -28240 236 -7039 -9604 -18629 -23686 -26656 -25177 -14116 -10836 -2444 1650
12732 1650 -9621 -12013 -20938 -28489 -19199 -23273 -35232 -22283 -13564 4080 12662 5375 4196 4937
12718 4937 -2170 -12558 -15229 -9177 -6931 -9291 -1740 15278 26584 25595 20384 11544 -2883 -5494
12704 -5494 -6586 506 6265 -243 -7934 -13175 -14470 -15334 -7568 -11431 -9922 -7599 -1965 -4895 -11118
12689 -11118 -10421 -8282 -14280 -11331 -18505 -25871 -22512 -5496 7008 4232 -2977 -15989 -17412 -14614
12675 -14614 -6169 -1556 -10387 -18565 -21850 -26112 -20236 -12171 -2755 -2412 -4838 3831 -2253 -10690 -8155
12660 -8155 -11297 -6478 -6663 -7916 -4115 -7730 -4668 -8281 -6646 -12150 -9787 -10073 -3293 5031 -871
12645 -871 -5408 -7128 -11532 -8186 -16611 -30693 -31189 -21596 -14503 -10343 -9977 -10477 -4434 -2214 -9734
12630 -9734 -31196 -31520 -11543 10748 17965 19496 8065 -3408 -9267 -3666 -2752 -12175 -24091 -21849
12616 -21849 -6772 7667 -5211 -26701 -41778 -31823 -23954 -31765 -23729 -15814 -24285 -27971 -26397
12603 -26397 -15817 -15345 -9664 -4885 -6397 -11441 -13896 -14122 -27593 -32354 -25896 -30681 -31288 -22074 -8447
12588 -8447 -10485 -20870 -15035 -24742 -24911 -24721 -34537 -30577 -14353 -30631 -32958 -20295 -4799 3357
12574 3357 -3486 -13695 -13872 -10029 -20038 -38208 -50579 -57260 -42045 -14075 -3108 4538 -5239
12561 -5239 -16826 -15339 -9527 -18209 -20651 -15399 -258 2522 -10989 -20575 -24720 -16474 -18161 -29400
12547 -29400 -18796 -14301 -11137 4579 12070 -69 -4181 -8222 -13973 -15816 -8174 -2223 -6651 -16773
12533 -16773 -19922 -13708 -8842 -4862 -11255 -15696 -21661 -29353 -28360 -32164 -29582 -27286 -30463 -31777 -30980
12518 -30980 -30570 -41641 -34907 -25669 -17077 -13387 -22165 -30429 -34235 -36866 -37388 -29490 -34746 -23299
12504 -23299 -19736 -31530 -30102 -27452 -19602 -15997 -10823 -3109 -4671 -16267 -10485 -6914 -14048 -21377
12490 -21377 -10849 -13140 -15706 -7901 88 5402 5626 -4351 -9739 -15595 -11781 -6054 7832 1615
12476 1615 8084 9255 4151 -16684 -28541 -19301 -2081 560 -1968 -8984 -20993 -37011 -26768
12463 -26768 -10491 -10040 -21996 -37748 -39368 -40798 -36290 -18215 937 21516 37077 43741 50328
12450 50328 49849 37848 23425 14445 1680 -24791 -42048 -49675 -49678 -47974 -52374 -35449 -19624 -22080
12436 -22080 -21342 -23048 -18619 -10353 -14070 -13307 -11797 -13184 -20352 -26838 -32918 -37032 -31606 -24025 -10107
12421 -10107 -12035 -11831 -16267 -20007 -22215 -18942 -28720 -31421 -16682 -9241 -15991 -8220 -11267 -17535
12407 -17535 -19236 -21750 -17412 -14260 -10269 -8765 -8645 -13607 -33164 -46511 -42237 -38247 -31169 -23605
12393 -23605 -28891 -28102 -23213 -18069 -28657 -30505 -23805 -17402 -3038 15541 15282 18153 17831 23068
12379 23068 8871 -14718 -15024 -7694 -4030 -1335 6467 7525 -1118 -18238 -19518 -27829 -30652 -25020
12365 -25020 -22071 -32170 -41192 -39113 -32171 -29569 -17940 -18124 -22636 -11540 -15470 -16259 -13461 -708
12351 -708 -6475 -13580 -8661 -16963 -25955 -14345 -2730 -14289 -19968 -25992 -29235 -22225 -28104 -32944
12337 -32944 -25532 -33231 -36903 -34466 -31005 -22246 -31312 -31047 -27203 -18525 -23716 -23160 -22355 -21236 -20163
12322 -20163 -25904 -29950 -23373 -15545 -14571 -22896 -36046 -26596 -15271 -8891 -15523 -25517 -23782 -19124
12308 -19124 -19060 -19411 -17350 -20331 -31797 -36598 -40082 -22320 -15822 -16993 -15484 -6427 -5873 -514 -2396
12293 -2396 -10723 -18761 -17882 -4022 7724 16363 6210 -5633 5136 4031 -6203 -19256 -10897
12280 -10897 -8935 -8423 -13207 -12776 -14185 -25307 -35561 -32016 -19634 -18165 -20738 -15995 2133 -6082
12266 -6082 -13750 -17867 -21581 -5972 7280 1279 -3295 -12819 -14868 -22128 -14158 -10451 -17170 -24530
12252 -24530 -14251 -25510 -30584 -15668 -18777 -10701 -19628 -34785 -29859 -19694 -6529 -2102 -12585
12239 -12585 -25349 -27094 -27080 -25177 -34853 -34437 -26720 -28813 -31257 -21687 -8373 137 -8667 -2170 -5228
12224 -5228 -13257 -22807 -14988 -11868 -1287 -612 -8547 -6836 -841 1107 1654 -6706 -18826 -24000 -23614
12209 -23614 -23599 -30418 -20672 -13498 -19548 -25866 -16755 -10064 1141 -3478 -12779 -16547 -12995 -8628 -13579
12194 -13579 -20495 -21317 -17032 -32839 -40743 -30912 -21042 -31041 -34311 -38030 -42667 -41051 -33069 -12692
12180 -12692 -4901 -5603 -12349 -16511 -20366 -20149 -20544 -16297 -20383 -20217 -34438 -29320 -22417 -28254 -21219
12165 -21219 -7955 -12692 -17177 -13362 -6923 -8035 -16727 -15173 -19563 -26757 -27408 -27127 -23564 -20190 -15015
12150 -15015 -13611 -5070 -5375 -6031 -6240 -13984 -19533 -20785 -27998 -9842 2775 -4892 -18820 -22840
12136 -22840 -19161 -3441 -704 -2519 -11744 -18777 -29102 -38847 -26719 -16964 -9726 -1920 -3802 -1809
12122 -1809 -1602 -3799 -6353 -9683 -5165 -2785 -7956 -19994 -21665 -27814 -30388 -18512 -12326 -22586
12108 -22586 -30322 -30031 -19103 -21734 -34370 -33152 -20922 -18224 -25790 -31861 -23791 -15926 -16673 -19883
12094 -19883 -16153 -11564 -17826 -29604 -43109 -49335 -38317 -33636 -27730 -27366 -32681 -34172 -31023 -20288
12080 -20288 -21988 -34158 -39705 -27807 -23918 -27253 -25137 -27505 -24402 -24624 -10539 -4589 -2431 -4787
12066 -4787 -11368 -26788 -24706 -20596 -31340 -34374 -38423 -45890 -42291 -29162 -29937 -34939 -22692 -21378
12052 -21378 -19939 -4467 80 -1995 -23078 -25677 -21012 -31582 -22231 -10501 -10723 -22790 -16737
12039 -16737 -7699 -7268 -17959 -32167 -39978 -11207 8421 6657 -6336 -14170 -18560 -18795 -19610 -7931
12025 -7931 -9897 -6979 3685 -8097 -28766 -39207 -43731 -39539 -33820 -26057 -23461 -17229 -15073 -18112
12011 -18112 -26100 -19424 -10231 -926 -6940 -10 3253 -1758 -2969 5488 -81 -9142 -15470 -10442
11997 -10442 -13053 -24119 -18677 -15455 -11838 -16878 -12550 -6992 -9040 -6572 -5873 -18450 -20008 -13955
11983 -13955 -8645 -2156 3107 5959 16888 9047 -6493 -10833 -14515 -22935 -31278 -39408 -36031 -22659
11969 -22659 -24595 -28724 -22010 -12506 -14661 -28453 -24430 -16334 -12822 -20082 -16396 -12459 -20997 -20581
11955 -20581 -14906 -10440 -17428 -23592 -29347 -19120 -26186 -31332 -30879 -19507 -10019 -16277 -28877 -36933
11941 -36933 -36437 -27114 -26529 -36361 -32013 -22880 -13301 -8956 -10339 -9253 -7650 8809 8218 394 -8451
11926 -8451 -16236 -11133 -8302 768 9042 4540 -12218 -17349 -9054 -20311 -24015 -10508 -12366 -5065
11912 -5065 858 -19042 -28032 -20112 -16994 -20502 -19363 -18546 -9272 -4279 -10618 4778 6204 3978
11898 3978 -352 4718 13780 16954 24640 10210 -3601 -8740 11826 11612 -3326 -12089 -11293 -5911
11884 -5911 -13140 -19988 -26425 -22118 -5727 -1373 -4217 -1014 -2775 -7916 -7874 -12411 -21542 -16069 -13376
11869 -13376 -21031 -12845 -7284 -2957 1983 -3075 3451 -1502 -5201 -1601 10073 8954 3584 -14049
11855 -14049 -22519 -25112 -28642 -14013 5109 8078 2282 1603 2617 -2889 -11955 -26065 -29957 -18022
11841 -18022 -11432 -18055 -24261 -21200 -12092 -15189 -27634 -20114 -12843 -20510 -22563 -22742 -24121 -29911
11827 -29911 -33737 -40533 -38300 -33221 -23339 -11294 -10913 -19038 -11946 -11651 -16220 -22211 -23086 -23187 -30632
11812 -30632 -27664 -27873 -29666 -20356 -23627 -23780 -21532 -15005 -10572 -15405 -16591 -10240 -2309 -3062 -17223
11797 -17223 -13045 -17843 -20874 -13333 -16766 -19027 -20839 -16149 -29115 -34842 -30946 -28963 -34469 -23902
11783 -23902 -17259 -13220 -5322 4620 11277 258 -8023 4108 7086 -4733 -10555 -12505 714
11770 714 1987 4966 -1921 -7659 -6178 -8491 -15857 -16110 -8824 -3253 7195 14268 8746 582 -6030
11755 -6030 -11787 -12890 -3404 1912 3086 -1016 -7766 -10320 -11339 -10178 -8884 -15584 -31877 -32077 -31787
11740 -31787 -15752 -11440 -8669 -18553 -21036 -15476 -17808 -20875 -21024 -21867 -16709 -16455 -21590 -14488 -5309
11725 -5309 -11449 -22921 -30604 -18986 -10478 -15115 -18240 -5063 -8489 -15134 -20694 -17705 -15081 -10503
11711 -10503 -7542 -2814 -8266 -17715 -25792 -21459 -19513 -21017 -20317 -18702 -9194 -4876 -7016 -14042 -15416
11696 -15416 -6616 -18516 -27060 -20879 -6167 -11793 -7107 4582 13524 7879 -6013 -18123 -21693
11683 -21693 -13887 -16365 -36161 -32088 -26718 -27560 -20916 -23027 -28981 -27558 -29393 -35126 -28443 -18659
11669 -18659 -6898 7778 4632 -4961 -17810 -23913 -14970 -11007 -11495 -15263 -27539 -19766 -14802 -7074
11655 -7074 599 4023 10658 16527 1052 -9327 -1196 -2319 -6076 -18197 -25986 -13544 -12190 -19255
11641 -19255 -14928 -7042 -2099 -4675 -15382 -7570 -11252 -5432 4602 -8149 -9752 -7458 -9012 4676
11627 4676 10096 1681 -10136 -27444 -19865 -7863 -9554 3893 -501 -5052 4046 3397 1214 -5003
11613 -5003 -5469 -18730 -20204 -18037 -16346 -3329 -7289 -5199 -3024 391 -7438 7261 16885 6954
11599 6954 -447 -3478 7 8016 6895 8469 2347 -20771 -35111 -39461 -20959 3382 -3648 5068
11585 5068 9452 -825 -5608 -13186 365 9017 7969 616 -594 -3331 -3964 -5595 -10740 -12041
11571 -12041 -1614 -493 -3140 14551 15005 5589 -11089 -17527 -23417 -17095 -14895 -27365 -24687 -21919
11557 -21919 -14057 -19456 -17833 -10262 -10320 -11693 -14697 -13954 -15839 -16114 -12587 -12231 -8379 -8452 -16864 -6959
11541 -6959 -3421 -26037 -18707 -745 3669 6906 -958 -4610 -8751 -8739 -7273 -11130 -14411 -8859 65
11526 65 7719 10879 14080 11217 5740 -5189 -9068 -121 13418 17733 36934 56471 71670 70963
11512 70963 77660 89815 84326 71095 61920 47999 31702 22857 24186 25223 22902 9382 12886
11499 12886 7579 5273 11100 21031 28984 25780 25852 25339 20921 24741 34799 20419 19315 33783
11485 33783 32560 33814 41250 43764 47405 47206 42896 70763 88764 94389 120134 150433 192788
11472 192788 246107 316981 380403 432010 479582 478903 432860 370167 321256 268103 213953 157007
11460 157007 113002 97356 93204 73734 59935 52109 43649 32712 24465 27944 46164 52940 38871
11447 38871 25866 28415 44978 43816 41778 61428 67672 69176 79319 97590 104577 109683 106889
11434 106889 111570 127651 159331 200777 261061 351259 470114 612413 765636 907237 1007891
11423 1007891 1038192 993774 872168 717024 561767 428677 313256 217481 162310 140600
11413 140600 126592 119445 126285 123982 120418 115427 115003 114070 118063 105048 100090 113901 117535 116770
11399 116770 132808 143131 163847 174600 181949 220309 254100 273239 282898 287978 289185 294147
11387 294147 317430 365216 435755 534356 668763 831472 984830 1092415 1136849 1095473 993340
11376 993340 851487 698564 547293 420886 330317 256759 220781 185937 170443 175709 189696
11365 189696 192703 189371 173409 161774 146905 134234 134859 124064 111399 112213 122188 131198 159129
11352 159129 185357 217406 264285 322747 357139 392172 409268 399194 369776 346747 334012
11341 334012 339978 375312 425092 490437 564124 619626 652501 637137 573025 506104 421873 339479
11329 339479 262456 212229 190814 163779 147890 135505 127783 118878 116139 116326 113054 106343 105951
11316 105951 107618 104546 106288 121149 115777 107511 126065 135834 134806 150581 157523 170951 189284
11303 189284 211656 237043 276143 298717 296612 289662 279040 273074 270884 270739 280638 310026 357535
11290 357535 390727 416650 484261 587165 750721 999304 1298064 1542447 1605071 1448558
11280 1448558 1161719 895557 720492 596990 495211 418692 357104 300243 255159 261584
11270 261584 259562 234079 216588 194031 183849 174676 165513 165801 182481 197316 214293 232292
11258 232292 256784 283046 296714 298800 283980 266056 255255 252875 263263 251679 257267 285089
11246 285089 314665 355794 430194 551718 730651 1021556 1426828 1935786 2432429 2702492
11236 2702492 2668082 2423378 2140960 1856351 1543531 1243318 998267 815372 679875 582682
11226 582682 517481 458833 412913 362802 317143 289144 278518 284365 288783 306823 329055 339204
11214 339204 339720 340035 329265 329676 321517 302160 292839 266355 239608 216345 200183 195586 188733
11201 188733 188863 196567 221780 263192 317812 393683 510850 686931 945263 1280846 1602649
11190 1602649 1750972 1637188 1359861 1047590 807764 655722 550308 455050 382685 334807
11180 334807 287451 259445 229001 199471 195053 179264 158621 154192 151911 152513 146061 152767 155319
11167 155319 158001 160757 158285 166971 144690 116770 91803 79035 68715 62664 63130 74686 78566
11154 78566 70612 65848 72159 66448 69281 74583 71274 71795 51857 33597 26540 19977 22614 21748
11140 21748 24353 25194 36448 26489 26131 37020 48181 53206 59350 60365 65132 63981 63767 62177
11126 62177 57735 59283 71479 92231 87032 81774 94236 102276 93292 79921 97740 118455 129011
11113 129011 152209 179899 205103 253613 301468 351488 391469 406176 387578 372177 330244
11102 330244 274274 224095 191735 154317 115365 108200 103731 107632 105130 103392 101339 99879 100601
11089 100601 98959 98880 99742 102454 107673 115324 114460 121087 113433 125049 135058 137221 141397 138543 153342
11074 153342 163866 152567 162331 173242 179223 181364 198079 237175 272850 310725 360392 401128
11062 401128 451911 517525 560312 569070 564479 558552 530744 480055 422275 368979 321537 291885
11050 291885 275140 263503 253043 221567 198809 198346 194987 190757 182930 171973 154508 144158
11038 144158 138571 133832 125885 110762 107229 106489 112395 115735 121728 117349 105621 99107 105856 106611
11024 106611 116112 126502 122987 116129 120886 125118 131189 157463 183673 219236 268969 315453 376783
11011 376783 425462 429929 428871 425325 397613 347013 302091 273544 226264 184929 170675 156063
10999 156063 156249 144125 140540 150619 145534 130478 125685 117898 107892 102788 99681 98413 102500
10986 102500 117043 118804 113291 106303 96233 86617 90417 98735 112896 133888 145780 143361 148305
10973 148305 166255 170848 164722 171794 173424 181902 182889 172903 171061 169998 159116 145724 133963
10960 133963 141513 141395 133483 121939 126291 115887 109014 103542 107659 102386 113913 126483 129324
10947 129324 119542 117165 122825 127232 133336 142040 149810 144505 144385 143227 156264 155613 163258 176611
10933 176611 180539 183213 190888 207784 223272 245121 266216 270486 285519 299295 320620 346921
10921 346921 349251 355227 351179 343924 338219 344529 334322 316962 298964 285119 275256 266726 261242
10908 261242 269595 275379 272275 280110 295789 301782 306315 324837 339377 347609 358606 364267 361391
10895 361391 350855 363272 376682 368304 367557 380589 402287 417419 440380 456434 478308 498210
10883 498210 527597 550075 588452 635949 705317 803501 932656 1087849 1278325 1520747 1806727
10872 1806727 2102255 2381278 2612231 2742506 2738473 2621702 2435467 2200169 1952131 1723474
10862 1723474 1529855 1360662 1215022 1097848 1012170 967387 934314 894113 863527 846048
10852 846048 843562 839630 833911 858927 889931 912135 928533 963420 999632 1037423 1076544 1117009
10840 1117009 1166278 1220248 1279098 1363686 1454863 1537891 1630720 1742480 1868147 2004268 2176409
10829 2176409 2371107 2575550 2794520 3036394 3282036 3528800 3719451 3837021 3869086 3818761
10819 3818761 3693560 3517662 3335330 3146407 2966247 2795042 2629461 2473971 2353979
10810 2353979 2264766 2180876 2086255 2004735 1935072 1859002 1779246 1678111 1574977 1503252 1441252
10799 1441252 1384538 1328201 1275349 1247355 1223776 1198324 1191843 1192007 1200693 1208989 1198122 1191186
10787 1191186 1205420 1215763 1209221 1216728 1249942 1298455 1376291 1479268 1624600 1829830 2076945
10776 2076945 2388168 2743433 3085275 3360385 3516976 3544787 3437039 3214832 2950907 2686512
10766 2686512 2432327 2216761 2049696 1904150 1791863 1705178 1625883 1540639 1493102 1465218
10756 1465218 1448978 1430373 1426892 1437541 1476409 1515219 1549045 1590236 1611438 1630302 1657389
10745 1657389 1678260 1691636 1715414 1746251 1787727 1856903 1950908 2046131 2160401 2283394 2416467
10734 2416467 2567768 2756215 2986949 3249600 3542104 3849793 4177620 4499483 4847237
10725 4847237 5245743 5710357 6340378 7236158 8522845 10396531 13144503 17159292 22812945
10716 22812945 30303999 39365466 49174853 58470732 65906647 70416900 71260445 68120491
10708 68120491 61253750 51773640 41398315 31810189 24121358 18575783 14881627 12563612
10700 12563612 11164839 10353384 9939420 9773011 9742849 9763802 9810714 9848563 9867257 9822132
10690 9822132 9718213 9583343 9466343 9438360 9564461 9912658 10551920 11516869 12771277
10681 12771277 14239047 15923475 17898397 20215780 22799759 25512248 28453601 31891321
10673 31891321 36028512 40871577 46333983 52481875 59472598 67331332 75757231 83953206
10665 83953206 90866887 95625696 97700065 96804769 92761747 85749105 76709618 67169500
10657 67169500 58459375 51261559 45678977 41600958 38872186 37263868 36329282 35495603
10649 35495603 34295478 32477393 30025521 27146518 24166565 21386828 18956838 16918753
10641 16918753 15236282 13857558 12751037 11885003 11239013 10774517 10443079 10237683 10138334
10632 10138334 10122455 10140799 10184635 10233324 10305382 10432712 10685115 11200928 12153277 13776321
10622 13776321 16436002 20579630 26671321 34884212 44881811 55644883 65736749 73754770
10614 73754770 78571053 79430271 76000630 68566775 58268992 46887891 36177869 27328651
10606 27328651 20737933 16219068 13285222 11471206 10368892 9711031 9330158 9106162
10598 9106162 8920936 8712708 8456089 8122256 7693974 7163458 6586402 5993008 5429473
10589 5429473 4923917 4484174 4110643 3830612 3603922 3392013 3209063 3006698 2795807
10580 2795807 2587378 2376368 2142994 1932737 1757671 1616504 1508856 1417747 1334729 1265625
10570 1265625 1192065 1145205 1103603 1071878 1041565 1019569 1007233 996944 994741 984349 976601 970436
10558 970436 961885 958083 951542 931628 896318 854157 842056 816263 786989 756820 735300 721509
10546 721509 704771 678156 666899 692832 711435 729977 734922 755794 770019 775544 773847 781263
10534 781263 807612 824429 844233 865413 918932 970223 1003057 1020174 1027639 1033426 1033108 1000196
10522 1000196 921228 844428 804729 791366 808726 832445 870052 931757 998879 1055417 1112289
10511 1112289 1135002 1135130 1110578 1076686 1013367 946273 874883 816600 750511 693772 656362 633849
10499 633849 608735 584387 562333 541151 534974 527744 517286 517390 516035 526912 563881 582632
10487 582632 591097 604962 611223 615803 607276 580686 555748 540095 520893 504735 485402 466878
10475 466878 456146 462056 472105 493059 505758 509762 523505 529113 527934 524046 538191 527359
10463 527359 515564 491314 463920 459720 478618 475388 458158 476264 517034 555840 594584 643824
10451 643824 726390 783739 828521 902896 943250 956711 957827 923637 876754 816979 754805 719558
10439 719558 689528 645405 613838 597415 587125 587938 598878 601080 603234 621651 647699 682755
10427 682755 718510 769141 824225 855714 885356 917247 956066 1000738 1045450 1131032 1283323
10416 1283323 1527877 1900032 2459815 3210247 3996251 4709096 5432583 6107018 6541109
10407 6541109 6672584 6592377 6338587 5882452 5282827 4708794 4116115 3466997 2923030 2633597
10397 2633597 2488262 2346713 2181935 2028574 1932673 1867972 1811790 1744519 1670895 1605965
10387 1605965 1533098 1452117 1389066 1319266 1269884 1248421 1263236 1275215 1295620 1342876 1393073
10376 1393073 1437188 1468143 1516114 1583179 1683062 1847605 2092899 2474437 3072969 4016942
10366 4016942 5474771 7533024 9864351 11706038 12772748 12830463 11664461 10050361
10358 10050361 8798347 7763463 6503402 5086780 3932374 3215916 2825383 2620748
10350 2620748 2526298 2502318 2524238 2586866 2711665 2940874 3301033 3857054 4690978 5858709
10340 5858709 7245429 8551484 9576492 10362186 10844591 10893436 10381701 9347083 8094994
10331 8094994 7056126 6476532 6338380 6562894 7103296 7912526 8959883 10155257 11356876
10322 11356876 12405257 13218064 13733063 13862474 13547805 12831561 11837265 10717630 9602325
10313 9602325 8571165 7705040 7049771 6593136 6307084 6138480 6046622 6048056 6147964 6326529
10303 6326529 6587967 6987008 7573276 8446237 9742715 11620243 14113827 16962195 19777453
10294 19777453 22450319 24983042 27253377 28931777 29710575 29646656 29192932 29231373 30488863
10285 30488863 33306344 38191561 46358133 59894261 81922210 116726939 168992271
10278 168992271 240199984 319987664 385172698 421248225 434545966 441545539 448364276
10271 448364276 435164170 381899129 296961549 209307505 141560009 97688116 71032872
10264 71032872 54635266 44242151 37478033 32884612 29595394 27138169 25175957 23395843
10256 23395843 21611187 19779935 17991991 16265846 14554059 12909870 11387241 10048976
10248 10048976 8927307 8012992 7280034 6676147 6170577 5748520 5394517 5079505 4816046
10239 4816046 4586082 4367498 4181882 4030749 3920528 3850139 3806428 3768294 3740670 3708469
10229 3708469 3656077 3572579 3452043 3300256 3128495 2965500 2834322 2739616 2694268 2688762
10219 2688762 2701214 2731908 2763439 2792751 2853948 2916557 2925335 2873469 2796557 2700701 2572673
10208 2572673 2417583 2239372 2064963 1903905 1773574 1672501 1587107 1516837 1454751 1407198
10198 1407198 1384701 1359921 1335881 1331072 1327576 1328533 1325564 1325018 1332559 1339701 1335812 1323692 1318134
10185 1318134 1294317 1264319 1233394 1212254 1193764 1168188 1162835 1177706 1202346 1233215 1281956
10174 1281956 1327910 1355316 1382437 1390538 1405009 1395931 1363288 1324800 1270902 1207830 1141505 1081767
10162 1081767 1030295 1001222 978890 951897 945345 950236 956783 972246 995178 1053833 1139026 1247427
10150 1247427 1405357 1586907 1797760 2030616 2261883 2493987 2691429 2819717 2857150 2805887
10140 2805887 2680202 2491423 2265325 2030071 1804145 1589620 1411898 1284548 1186588 1120637
10130 1120637 1062616 1024722 995039 976749 964116 937725 909082 883603 865335 857491 854610 856389
10118 856389 855524 847903 837668 840550 847037 846729 852579 852472 851270 853400 864166 865141 871783 868086 868351
10103 868351 868060 869058 877790 874847 874929 881191 894837 903563 930265 950704 967703 969481 965378 966092
10089 966092 944419 911287 879659 854853 847441 828452 812864 827748 828593 842423 883091 966318
10077 966318 1076689 1229653 1438917 1556774 1517158 1495726 1586322 1756495 1960593 2174623
10067 2174623 2378993 2566503 2688715 2745969 2732012 2626083 2462532 2270324 2054789 1828529
10057 1828529 1632128 1477882 1353162 1255872 1185914 1148625 1114760 1074558 1055877 1063399 1071045
10046 1071045 1078716 1088710 1109273 1153202 1196903 1244262 1299032 1345960 1407743 1481750 1548895 1612573
10034 1612573 1683791 1776935 1867411 1994839 2111237 2238757 2370909 2503217 2634310 2754382
10024 2754382 2863431 2972710 3079078 3181011 3275644 3360338 3474211 3629816 3807471 4029138
10014 4029138 4344124 4705024 5152985 5717918 6384301 7153827 8020040 8945849 9908158
10005 9908158 10830696 11647095 12285872 12710019 12855267 12699784 12281623 11632050 10792590
9996 10792590 9823959 8817102 7828119 6914748 6087080 5372359 4771090 4274266 3862926
9987 3862926 3526934 3241797 3000865 2800875 2635972 2486196 2363502 2245981 2133257 2035352
9977 2035352 1932605 1830326 1746110 1659728 1578495 1496791 1404309 1321051 1242335 1186060 1140511
9966 1140511 1077924 1027213 983371 968532 946846 924937 923239 919747 904853 906910 898086 890278
9954 890278 854979 831510 818879 785687 757540 733773 720732 695283 670962 655115 641133 645843
9942 645843 642299 637758 639359 651046 669234 673714 672647 679733 681015 680665 676330 659376 640958 615785
9928 615785 597433 578281 561553 552514 547428 528694 515241 522601 519938 516160 529197 534197 541837
9915 541837 547326 539453 519533 492806 472574 464510 471002 463007 450806 438002 440310 454561 457085
9902 457085 451402 434565 432131 438935 444913 453803 463336 472426 478782 494208 531110 562919 585193
9889 585193 598560 622824 664081 695760 709541 710482 701241 694104 674263 654198 651373 654555 685518
9876 685518 745579 859987 1033146 1300388 1677532 2092830 2431967 2636481 2778794 2901765
9866 2901765 2939252 2718659 2249729 1712095 1262367 961633 787881 689981 623436 579162
9856 579162 542500 508620 484633 474058 471695 465362 451685 442262 439669 429516 431707 428295 413389
9843 413389 386574 371792 366721 365468 340264 341273 358020 365618 364649 360709 358308 367270 385539
9830 385539 397311 413327 430282 469935 495509 514688 536100 567887 593007 623757 653477 691522
9818 691522 736350 786683 836639 864050 876181 886057 886969 882097 849574 810770 764944 718431
9806 718431 670664 633329 591772 555432 523948 505172 497322 489178 469149 465645 462978 456162 439556
9793 439556 420700 410030 395408 404455 403409 401632 398827 401262 395436 392009 382254 375752 379909 376821
9779 376821 368188 362676 366443 365897 361648 353584 353696 370174 378782 402153 418394 421667 415102 411398
9765 411398 416686 421455 418390 403257 375987 357496 338917 320883 307775 298298 296864 303753 317016
9752 317016 315702 316413 316811 319939 334027 329255 332174 321536 307340 302963 308868 317822 308243 310020
9738 310020 297076 289551 290386 299059 295270 290737 289498 289637 291167 294544 286887 269530 259460 263984
9724 263984 250851 263410 257432 248101 242222 235322 228721 234229 246319 261977 257395 240748 240552
9711 240552 250871 263188 274016 283620 283044 282191 278903 270762 270122 277236 279758 269835 261206 247149
9697 247149 246954 256557 256817 264576 269615 265163 257519 253904 251470 242431 234504 239952 248380 241059 232058
9682 232058 237498 243986 249065 255201 259698 262902 250526 241977 252907 245925 250683 256681 254938 260142
9668 260142 263809 266375 259370 256078 247867 238911 246830 240714 228742 222842 226969 223956 217975 224645
9654 224645 238593 238082 230097 230137 229782 229853 246446 266152 257988 248923 242940 237359 250728 255067 230761
9639 230761 228236 228359 217328 213005 223498 235198 244564 241175 233425 230099 224696 223778 226954 221222
9625 221222 224650 211391 199669 205127 216510 218917 218571 219105 214812 212735 214997 205633 206881 209346
9611 209346 209490 217204 213795 230022 252984 259324 260254 274139 284801 329242 360892 382960 395029
9598 395029 381291 352799 326097 307340 294158 282861 257262 237608 233469 231997 227786 224321
9586 224321 225508 223518 230517 237548 237454 219783 217839 220607 215549 211579 198230 194103 186866 190527
9572 190527 201147 201248 206143 216572 233339 257975 262326 281554 303041 320609 343764 365080
9560 365080 384566 394294 390854 392567 414589 425960 440389 460493 484534 502055 476950 442392
9548 442392 422839 415262 407293 412685 434305 459091 484485 503597 507208 483801 442798 398905
9536 398905 364464 357046 342716 334980 323918 318747 312601 292611 286980 279568 288775 293786 288579
9523 288579 295219 305116 317648 333408 353213 376469 401417 422999 433542 427269 431569 441912
9511 441912 470132 506498 551837 590429 631269 690719 753833 783369 790261 796805 814465 834015
9499 834015 873289 928263 1001003 1065572 1102613 1111281 1059288 941990 810690 724531 666844
9488 666844 641054 615246 587440 565824 540074 504209 481505 466120 443518 423320 416197 409729
9476 409729 409473 401878 398083 412628 419520 429748 437679 459737 486089 507450 539485 587731 647135
9463 647135 697392 718654 734338 739903 754903 760334 781559 814726 879292 959664 1087774 1241301
9451 1241301 1411186 1581723 1726706 1823637 1844236 1759276 1561558 1315270 1104539 963323
9441 963323 897682 847973 805674 777489 726392 689535 658310 620372 587939 556956 532378 519526
9429 519526 518742 528986 529538 526252 532900 530090 531388 541707 564339 584010 587232 580097 584441 587397
9415 587397 579936 592108 594942 603750 620028 652840 712881 811968 942502 1116063 1321009 1526517
9403 1526517 1693562 1791485 1825882 1795062 1670915 1458681 1220500 1025504 888169 790130
9393 790130 735374 713230 686698 656063 637160 611313 579982 544691 508225 480229 462005 456162
9381 456162 450782 450402 447646 441034 453418 442737 437435 419231 405540 405343 403163 409273 436363 469238
9367 469238 492641 500360 509414 516251 530653 579860 637512 717382 815582 911994 985661 1050655
9355 1050655 1131809 1167209 1107945 985166 859227 754099 673699 614050 570252 549051 543225
9344 543225 554061 549390 518998 503183 479522 467383 445422 431009 437725 438828 452415 473543
9332 473543 482446 480756 480462 485457 497216 514039 507468 502246 521504 554841 571483 586269 598817
9319 598817 599305 584422 579656 590571 586074 590630 609385 647776 671770 686971 712443 739173 735967
9306 735967 722619 719028 736338 753907 782076 818854 842430 834756 821932 795580 757672 735694
9294 735694 717040 707846 691730 688021 684112 684575 696053 712484 739239 793488 866750 923641 912962
9281 912962 873653 849633 846700 855744 887917 934473 962130 983778 982400 979384 968263 964222 975673
9268 975673 998511 1035669 1093014 1158618 1237782 1313785 1405378 1493157 1567544 1631408 1674297 1684127
9256 1684127 1668703 1634284 1591153 1543078 1483207 1434789 1415120 1425399 1451778 1482057 1503736
9245 1503736 1534974 1581809 1641147 1709879 1821418 1957420 2115829 2263615 2359579 2390662 2398826
9234 2398826 2369961 2272410 2123961 1996281 1916286 1877077 1868900 1895715 1929263 1954543 1991286
9223 1991286 2070182 2188161 2352755 2549936 2799011 3096047 3421386 3774412 4193158 4691873
9213 4691873 5288276 6058391 7131908 8603929 10631961 13222567 15886700 17603339 17951792
9204 17951792 17630832 17255599 16636155 15267646 13188439 10902671 8963399 7605508 6752015
9195 6752015 6239307 5959962 5825502 5822828 5908931 6016134 6093866 6042835 5816187 5453334
9185 5453334 5041563 4701909 4491101 4414235 4460814 4598336 4784551 5040841 5368915 5796632
9175 5796632 6381620 7182825 8277295 9794649 11927875 14862756 18600715 22744888 26620199
9166 26620199 29752482 31880334 33322213 34715969 36643265 38927906 40610764 40721778
9158 40721778 38469838 34112319 29270397 25581751 23719269 23501728 24349234 25518062
9150 25518062 26456801 26940186 27036907 27181597 27927375 29243023 29992456 28642002 25293640
9141 25293640 21364659 17904234 15276624 13393523 12073307 11200017 10725349 10599597 10786498
9132 10786498 11200840 11749633 12304371 12722595 13070206 13654893 14912534 17091683 20177803
9123 20177803 23890260 27939703 31487502 33319116 33636035 33899473 35740533 39911967
9115 39911967 46236160 53476854 59429295 62229158 61876619 60203798 59034207 58716936
9107 58716936 57945899 55413356 51391649 46992697 42742615 38547149 34304204 30201735
9099 30201735 26654141 24135231 22939091 23167867 24710596 27132457 30026452 32660468
9091 32660468 33170701 30848283 27123868 23751356 21449352 20009083 18850183 17511408
9083 17511408 15971710 14520962 13510579 13078821 13260433 14029231 15346882 17171545 19239414
9074 19239414 21182565 23319235 26369420 30333353 33932132 36339672 37841450 38265315
9066 38265315 37678847 37229159 38231945 40882255 43952742 46182137 47152331 46250213 42932757
9057 42932757 38177073 33944532 31459624 30313632 28856642 26367539 23897896 22501555
9049 22501555 22068885 22010244 22137203 22160396 21192819 18933857 16067044 13356833 11161590
9040 11161590 9470620 8144913 7119689 6362761 5819663 5445918 5165981 4966271 4805033
9031 4805033 4661904 4517647 4386274 4306834 4302780 4375058 4502110 4709950 5032597 5516906
9021 5516906 6287120 7485998 9374024 12188169 16057843 20744254 25009850 27223058
9013 27223058 27361019 26238621 23796978 19811482 15195398 11239411 8459901 6688859
9005 6688859 5620628 4988895 4609240 4381471 4213173 4029330 3803281 3536359 3250544
8996 3250544 2961273 2699382 2487955 2338892 2251818 2229303 2209350 2135038 1994265 1824189
8986 1824189 1668366 1525839 1403490 1316325 1246949 1186901 1140178 1117445 1095112 1075925 1050360
8975 1050360 1025354 989021 950938 923877 898481 871572 871320 863359 857371 867907 890425 913952
8963 913952 945131 961410 940461 916287 905680 901172 895096 893324 898469 895161 903843 910669 926180
8950 926180 963513 1004202 1039274 1075468 1116687 1174554 1235173 1274039 1304893 1311034 1284846 1248967
8938 1248967 1209814 1144990 1079461 1060009 1052874 1058822 1066294 1054855 1035907 1041062 1056637 1080486
8926 1080486 1130373 1205441 1255488 1295520 1327064 1355136 1376607 1402810 1404924 1397781 1405965 1390558
8914 1390558 1329099 1234760 1147434 1085518 1057937 1045801 1036856 1051856 1086861 1114555 1159221 1196628
8902 1196628 1243264 1293134 1360071 1431038 1527353 1661802 1808991 1962761 2106131 2235451
8892 2235451 2273805 2206889 2080117 1985397 1921657 1901538 1939433 2013568 2136499 2309297 2508468
8881 2508468 2736794 3021742 3332584 3678217 4086503 4607956 5331101 6383594 7947075
8872 7947075 10138706 12894097 15579991 16738273 15427568 12513345 9507787 7260227
8864 7260227 5788200 4865533 4314946 3982235 3786860 3689214 3643758 3615099 3549918 3432424
8854 3432424 3312130 3234165 3212755 3233942 3292424 3375674 3517133 3720726 4002238 4364510
8844 4364510 4826915 5392066 6045402 6699630 7212585 7589768 7946853 8411630 9005724 9721702
8834 9721702 10575134 11741380 13453728 15843769 19003859 22884025 27288175 31952295
8826 31952295 36493415 40164815 41996067 41717686 39999344 37138074 32820704 27641245
8818 27641245 22948958 19615169 17623511 16557053 15967695 15382488 14457957 13184338 11813443
8809 11813443 10551674 9507361 8687284 8104016 7733159 7591512 7636366 7845632 8208555
8800 8208555 8745380 9484329 10320201 11169150 12108358 13320650 14873678 16471808 17674183
8791 17674183 18412681 19056104 20110439 21849477 24288283 27263222 30735537 34797699
8783 34797699 39403290 44239538 48758212 52158393 53817816 53882751 53172725 52522595 52421315
8774 52421315 52360253 51075862 48236286 45042492 42712436 40769866 37835049 33684047
8766 33684047 29240357 25393898 22149812 19174068 16575259 14558869 13135553 12157504
8758 12157504 11523917 11135926 10959443 10960152 11140820 11510440 12008990 12610945 13341645 14331503
8748 14331503 15677144 17259220 18709551 19678033 20207263 20862759 22121344 24015474 26329775
8739 26329775 28783647 31384933 34252804 37167162 39617379 41352161 42667007 44051029
8731 44051029 45938751 48443910 51046453 53039383 53956547 53815675 52605634 49968935
8723 49968935 45313133 39128886 33010994 28162442 24622879 21753353 18963726 16300900
8715 16300900 14067527 12395330 11201463 10316564 9604559 8956164 8370015 7881514 7531623
8706 7531623 7375743 7418199 7646306 8056422 8618901 9174541 9504047 9620469 9756723 10078899
8696 10078899 10560934 11131463 11837383 12808889 14128644 15708047 17375035 19125590 21195770
8687 21195770 23736874 26746301 30042134 32913994 34553259 34812709 34027057 32356674
8679 32356674 29485914 25475899 21213834 17693502 15195501 13357622 11744268 10247741
8671 10247741 8950192 7875833 7012630 6285352 5638595 5058692 4546289 4093456 3701461
8662 3701461 3370765 3080287 2836784 2616202 2426145 2293497 2188130 2114675 2072077 2055385
8652 2055385 2073313 2108256 2166147 2258552 2385880 2567732 2817425 3193973 3740956 4539083
8642 4539083 5687178 7246066 9142498 11109622 12567395 12793702 11606126 9482672
8634 9482672 7244156 5420453 4149824 3329471 2815923 2510226 2338459 2248683 2186149
8625 2186149 2114632 1994753 1843210 1669062 1507283 1387030 1282782 1197524 1126230 1073300
8615 1073300 1018819 962744 925891 901998 885779 871191 849662 838430 834671 842554 849694 850040
8603 850040 873395 901679 916109 922044 932495 957323 975278 981203 986798 1005212 1034285 1051899
8591 1051899 1062619 1098871 1160805 1264451 1441350 1748991 2255687 3046787 4224953 5813465
8581 5813465 7604343 8644840 8041674 6293261 4498296 3251699 2527210 2108195 1867434
8572 1867434 1733375 1699173 1754014 1905462 2177899 2609953 3265939 4233502 5531001 7116377
8562 7116377 8648184 9158877 8116925 6224749 4458824 3237603 2472001 1997569 1722272
8553 1722272 1565777 1506561 1509551 1526652 1574930 1613051 1641389 1683833 1778352 1927111 2134876
8542 2134876 2442119 2952839 3804425 5081916 6795680 8560847 9258814 8270420 6409910
8533 6409910 4737695 3663293 3035236 2641590 2383955 2207585 2122970 2146680 2257284 2456883
8523 2456883 2803683 3387231 4261330 5458025 6939385 8356798 8771584 7694140 5844870
8514 5844870 4135142 2952558 2224585 1771153 1487201 1307324 1194208 1126222 1087690 1078115
8504 1078115 1090082 1109679 1126753 1150349 1151231 1128171 1086503 1045513 1023424 1044994 1147972 1315693
8492 1315693 1481748 1612381 1680164 1663550 1588533 1486032 1379307 1272082 1158821 1061680
8482 1061680 963247 884160 810958 755612 714814 673270 639598 611708 596658 571127 555470
8471 555470 549386 539389 534166 514385 490733 471220 464104 453343 442625 442679 432384 421289 420572
8458 420572 416834 396901 381849 390133 395542 417847 443652 467434 484388 502824 511277 507595 509839
8445 509839 517973 553996 602263 626655 643365 627866 578469 527215 489732 464517 464757 483421
8433 483421 502758 519277 542640 561869 565846 550304 532079 497504 454403 417491 379642 354720
8421 354720 345108 339219 344669 348419 355585 339824 324378 316725 313077 308019 295934 314317 337131
8408 337131 337488 330928 334458 338998 369348 395677 408655 407810 401529 406803 430353 448385 467927
8395 467927 478606 471538 467969 467305 450256 433152 421777 415140 407568 414384 430281 461466 484988
8382 484988 487908 488140 488642 479515 459068 439507 423936 410485 392014 392456 396134 385353 369368
8369 369368 352535 355643 338498 333647 324087 315994 313546 302883 307431 321292 339435 348885 355977
8356 355977 379320 410151 430968 457465 488432 537089 572329 580516 555333 533636 508558 487477
8344 487477 470896 451574 444195 431719 427269 449989 475549 485861 506275 517144 508056 513470
8332 513470 511261 482473 466538 452024 444633 431678 422152 415281 410378 407742 399297 377053 364580
8319 364580 369225 371935 387269 413536 416560 417057 435993 445254 465130 492191 538831 607945 666849
8306 666849 714095 756295 768277 724651 670324 615490 561621 530950 515517 513285 530213 545937
8294 545937 551315 548410 562827 589417 605939 634448 668369 696130 692677 674162 654690 651048
8282 651048 660263 700636 772609 856875 1012370 1259395 1617161 2044853 2500526 2826563 2873796
8271 2873796 2617515 2209302 1819855 1523990 1312634 1192477 1122026 1085019 1109557 1201698
8261 1201698 1334405 1490917 1646811 1718460 1662316 1510547 1340725 1199834 1087977 999919
8251 999919 930229 879097 841351 820068 802203 792115 800107 798987 800881 805715 797349 812559 818042
8238 818042 835312 876182 946726 1018685 1118965 1256295 1435415 1731082 2190875 2898096
8228 2898096 3890500 4938161 5525223 5373583 4663162 3790531 3039773 2485694 2094862
8219 2094862 1847618 1718261 1694069 1750774 1865899 2038519 2214369 2293145 2239162 2120103
8209 2120103 1982014 1854207 1738197 1626776 1535875 1480963 1443104 1432920 1473744 1560654 1675076
8198 1675076 1824161 2047237 2346519 2710184 3117520 3535411 3938459 4257088 4403881 4372707
8188 4372707 4220442 4023250 3836104 3730320 3763694 3970427 4367954 4941813 5595229 6190155
8178 6190155 6621469 6881138 7027303 7135925 7210596 7139141 6876610 6464606 6005922 5581669
8168 5581669 5273464 5109758 5075676 5159554 5311379 5542577 5853273 6257713 6741968 7262848
8158 7262848 7820489 8457663 9303955 10512392 12268548 14825656 18479407 23792894 31617055
8149 31617055 42918105 58565171 78305886 99775738 120021642 137652911 149436972
8142 149436972 149688436 138302328 119765675 97223112 74010167 54103644 39746099
8135 39746099 30566766 24992337 21713628 20003196 19426258 19636878 20240787 20711055 20671227
8126 20671227 20168267 19555936 19169243 19064795 19142627 19243893 19130872 18620104 17824901 16968045
8116 16968045 16204743 15662558 15387985 15349317 15530735 15935972 16642783 17786599 19586071
8107 19586071 22357779 26519558 32737348 42180003 56746540 79113332 112470876 157619025
8099 157619025 208913454 258277091 290214223 289770382 258729427 208555882 154891944
8092 154891944 109629533 77234432 56242567 43069184 34757171 29457846 26046238
8085 26046238 23856134 22452155 21506411 20884346 20559754 20581396 21115308 22305876 24043611
8076 24043611 25918114 27237238 27177681 25531847 22814123 19785167 17066554 14953614
8068 14953614 13475162 12503696 11933700 11711382 11814892 12294652 13253462 14865894 17433594
8059 17433594 21405131 27378361 36023250 47752912 61999890 76630164 89757670 101201958
8051 101201958 108565808 106758127 96611021 84321952 72472225 59213563 45018022
8044 45018022 32685190 23938911 18354766 14813859 12494306 10954490 9924398 9223890
8036 9223890 8779812 8581200 8613739 8833821 9193639 9582309 9897979 10068270 9951532 9449080
8026 9449080 8702904 7902626 7069749 6191086 5334102 4601535 4035885 3629822 3341935 3140167
8016 3140167 2978724 2873773 2803875 2770792 2769012 2831791 2994550 3295890 3839696 4706784
8006 4706784 5922911 7274051 8288945 8480999 7702515 6334606 4910250 3779609 3014332
7997 3014332 2522872 2198567 1970306 1813555 1695694 1611953 1539476 1475137 1429270 1397934
7987 1397934 1373206 1337421 1296594 1269921 1254902 1265530 1296128 1337918 1394728 1472099 1574442
7976 1574442 1656303 1705878 1730529 1752833 1820049 1910400 2051616 2218113 2440070 2792557 3290699
7965 3290699 3899520 4564352 5114400 5391657 5356277 5173554 5009311 4919624 4824913 4595935
7955 4595935 4141818 3514213 2876556 2341769 1930205 1620606 1402215 1259738 1169602 1101474
7945 1101474 1039714 998537 969646 959922 958665 945191 931884 922450 905917 902462 922867 948366
7933 948366 987008 1051355 1109368 1176403 1242700 1310200 1404603 1541720 1698342 1867075 2042816
7922 2042816 2304495 2753555 3495860 4610326 6022844 7296405 7938072 7590422 6471126
7913 6471126 5059833 3803169 2889245 2311221 1964845 1717013 1519979 1362087 1209488
7904 1209488 1091874 990862 912311 848204 804847 757365 715556 689917 662543 646128 633586
7893 633586 611491 602431 592145 582461 580721 572283 558368 567117 579869 595439 611147 645666 694158
7880 694158 763226 832190 910260 1002596 1116945 1290098 1549336 1916825 2387115 2904772
7870 2904772 3334158 3497156 3337188 2906817 2361428 1845323 1446950 1190135 1025318 919062
7860 919062 830127 758445 689454 631879 585110 545782 520782 491133 458326 428889 412775 401918
7848 401918 397163 399214 398615 400046 396726 398093 388528 362474 347396 329505 327593 311062 307533 304946
7834 304946 285706 265212 261727 268781 295162 315579 323974 321512 313873 318623 304997 291512 303562
7821 303562 311616 304667 304418 322922 322816 311936 305741 294107 287140 291106 295657 291782 290374 296588
7807 296588 298551 303109 305482 306332 310746 298518 301197 326395 324609 319308 326581 335139 339830 351668
7793 351668 355451 328355 311425 305616 273682 263200 271594 258553 249364 239323 232390 238186 243827
7780 243827 252084 257329 260097 261893 247767 230926 222917 223753 234151 241970 242772 243338 232383 214478
7766 214478 212385 214959 209931 218803 242186 248438 250111 267051 289721 308466 321421 322340 327369
7753 327369 352323 408436 479311 586147 724350 877555 1032179 1121747 1111348 1021408 877173
7742 877173 711510 562685 447346 372831 325019 297359 276452 268803 272140 270058 257838 267872
7730 267872 281103 292560 298007 288329 286204 278431 276562 278086 298182 301520 286659 280245 270394
7717 270394 250371 241769 237046 235035 242421 246397 256050 282748 311441 352376 396609 441465 525129
7704 525129 684895 905397 1187674 1517642 1782740 1869985 1691100 1346584 998093 725955
7694 725955 570555 464087 388823 339354 294365 283207 275450 248082 227300 217252 228532
7683 228532 246132 254658 243148 250512 265027 279112 272011 257002 241436 230201 202677 193934
7671 193934 186020 177987 175733 170142 156933 152782 155774 161645 166635 181944 217484 245364 298738
7658 298738 375656 482382 599812 705588 780166 791838 720749 606285 492174 388391
7648 388391 310448 255269 201297 171820 157392 148653 147427 146238 151457 149202 151001 153683 150762
7635 150762 140637 145121 151419 147918 145032 113452 113904 118081 108688 95963 98000 102570 103584 101788
7621 101788 96263 80852 81185 76042 72343 57463 49808 60838 77052 71000 86299 84731 65424
7608 65424 69640 81852 97104 108247 108887 102598 98719 78966 69595 79286 87059 86048 73815 65729
7594 65729 58185 58855 49304 31678 23224 27651 29263 26742 33769 43201 37302 38438 27748 23681
7580 23681 28513 51946 62048 50434 47241 45478 53792 57438 51384 51409 68914 81277 77571 75585
7566 75585 84194 82097 73577 69444 68834 70280 78988 77573 69805 75308 72024 74795 72915 61002 50725
7551 50725 43175 47765 53472 56940 58734 61952 69186 52430 43205 49777 61485 62105 54817 53690
7537 53690 53572 41052 33893 36696 35857 44997 43481 50467 56163 52776 46784 41386 34551 32660 36939
7522 36939 53816 66071 76972 86969 86279 97038 84270 77696 74263 77668 63676 59268 60101 62684
7508 62684 67071 64475 49314 39929 45022 40486 42225 41743 46869 48446 39129 36266 33268 29911 47009
7493 47009 47570 51150 50422 47433 45284 41169 37728 41019 45110 32200 23136 34607 45251 51121
7479 51121 50525 47239 48588 47418 39785 49826 56911 50528 56982 67098 62060 50772 43337 42385
7465 42385 39057 35893 26698 26231 24812 20918 29066 25810 33878 32572 40628 36533 41587 43747 44850
7450 44850 41111 30036 39624 52013 45665 36821 33825 37239 47100 47935 41519 39296 56472 58371
7436 58371 41751 38974 47076 32802 21866 18239 16055 15648 29456 25605 29306 34431 26970 32747
7422 32747 49637 47561 36835 45611 38951 41228 46727 49178 50993 41552 35094 34289 20750 12236
7408 12236 22846 28928 33831 40247 31332 22779 11732 35298 54374 50632 45004 45018 39543 36665
7394 36665 24170 21242 21029 25576 30772 22297 19008 21035 23152 22497 27041 33032 40601 34467 20462
7379 20462 20720 16022 8496 9134 9086 8347 20927 22964 22121 18550 12996 5021 14597 22003 18387 16768
7363 16768 24573 26961 15818 18962 21094 30358 34119 35334 53100 59220 49357 41115 41170 36949 42056
7348 42056 46501 44621 41923 49666 53979 45727 41006 40920 42643 43805 36262 26509 22288 17285 18127
7333 18127 17119 25013 29322 22882 8237 7898 24049 38293 36642 39243 34306 31023 17310 7761
7319 7761 12685 26260 16625 13756 13712 16158 21177 17972 19881 11323 1637 8238 9952 14667 25658
7304 25658 30244 27091 10759 7141 14892 15174 14675 9832 15905 19837 19140 21432 28631 28699 27493 15328
7288 15328 21247 17040 3758 7181 18772 27065 32436 31058 31240 11645 3391 5797 10690 16986
7274 16986 18990 21599 18924 16930 4731 6185 13262 8946 7666 18797 25165 20104 17266 5432
7260 5432 -9480 -3017 -4422 -4400 4982 3050 15453 22958 17873 21891 33358 38116 40799 43710 33562
7245 33562 22414 37014 43265 25359 -1078 -8391 2170 -2899 -15932 -4273 8241 20392
7233 20392 15810 25351 17545 22913 26874 25953 16968 6294 7871 19667 5753 5810 17005 20435
7219 20435 21380 34986 34284 27168 25592 14797 18552 15906 11976 7060 3740 855 -2944 -1286 23420
7204 23420 23493 23438 16259 19121 16004 11628 12718 4544 8243 5251 -9578 -13413 -6881 -6082 -7772 2467
7188 2467 10969 14404 20097 19940 17613 17029 16525 16581 22871 25186 25725 28470 24992 10346 8295 13146
7172 13146 22655 37997 40295 20796 10219 1755 3643 13731 13164 11864 15292 22043 11097 14737
7158 14737 23260 24980 30034 39251 37473 18745 4373 3702 10118 11256 7435 14530 14936 14399 19095
7143 19095 263 -12428 6793 21772 30717 33735 46678 58064 54442 35704 21983 23748 14039
7130 14039 2301 -921 -3172 -7060 -380 16858 7113 -11 5859 14272 19895 18516 17301 15476
7116 15476 18696 20561 24670 18004 24188 27429 22899 14441 10389 9447 7534 7996 13126 15223 6440
7101 6440 6166 7112 1930 -1281 3610 15028 23488 24287 12410 12546 3722 1093 -5116 -3159 5748
7086 5748 7352 14920 16547 15303 19950 20587 20525 12761 6669 3933 8008 9406 8210 7717 3043 18073
7070 18073 26518 21775 15684 9793 1123 -341 -2584 3395 4529 10604 4062 3649 15299 25355
7056 25355 27319 22296 25032 20572 4966 -8851 -16688 -8631 -5716 -2081 5340 12108 11080 7895
7042 7895 17456 16255 19356 13154 9542 20311 15080 1238 -10853 529 17465 29204 23668
7029 23668 12729 15012 13738 6355 -785 -6179 9844 10369 15912 22981 21931 11631 7378 16073
7015 16073 6793 -600 -933 12645 20357 13646 8913 -7873 -14392 -14685 -10413 -12784 -9565 -5342 4657
7000 4657 13656 10791 8162 16932 17679 15725 13556 4417 2107 1678 6048 405 -17788 -8938 11048
6985 11048 15235 11228 15232 22467 16538 16923 20915 14441 -783 -4734 -18024 -19770 -9676 1662
6971 1662 14916 20371 22934 28852 27828 18097 16526 22563 17820 23339 28602 17626 16507 22033
6957 22033 20896 13451 6872 -13412 -15094 -8693 1707 9918 16375 16456 13591 4606 -4485 11208
6943 11208 24248 12851 10143 7855 17618 10141 2429 -5134 -547 12079 15736 13149 -1049 727
6929 727 7972 9038 15619 28043 23693 14956 12867 12179 13641 11214 -241 8962 17873 18747 20360
6914 20360 30200 18730 8790 5161 -1453 5965 18625 11835 13841 5791 -2238 -8393 -6772 -3208
6900 -3208 -5368 -4812 -1027 7350 3444 3030 3557 -573 -9275 -12429 1024 6958 643 -9068 -2603
6885 -2603 8034 12564 14598 9652 15601 17820 10137 11708 6900 -14961 -29317 -33117 -17179 -3759
6871 -3759 -10484 -5314 10486 11860 -733 -4694 7155 -501 -11166 -28425 -26340 -11206 -6069
6858 -6069 6577 23750 16061 956 -2804 7305 12342 5739 -6336 -3196 12044 14380 -1888
6845 -1888 5367 22151 25806 13816 11000 14781 12409 17302 21883 24661 11071 1845 10666 25197
6831 25197 18625 -1468 -12608 -15937 -18223 -21907 -23886 -3879 7071 1245 -328 -7630 1849 16923
6817 16923 17278 17291 24160 24022 18192 2041 -3313 -10656 -366 7271 11181 19539 23433 22845 22238 13668
6801 13668 20218 31715 35851 36934 30567 28730 18472 19267 18660 16045 30581 32452 16345 11123
6787 11123 16145 11369 15227 28424 37214 23349 13272 13580 21168 19779 16125 16183 24598 38883
6773 38883 34529 25356 28141 32397 27934 20970 14393 5571 10291 8378 12076 11836 9923 12359 13979
6758 13979 7448 3875 12210 16355 16362 16456 14795 3522 -9757 4944 17970 21824 6206 -3802
6744 -3802 -362 -271 -4955 -6716 15716 32455 37996 27018 19259 15797 18992 7018 2961 7787
6730 7787 512 -13201 -7472 -18943 -16787 -6326 2770 13517 1487 -5052 1231 -4249 60 6257
6716 6257 3776 -2375 -6041 -2051 -1515 -9272 -16195 -27165 -17026 -14062 -8389 -5169 5707 7336
6702 7336 9161 7914 4239 -4447 7256 22846 7061 4949 5099 -3433 -2431 13869 18328 17139
6688 17139 19406 12786 4548 -941 -2233 -2702 -6134 11726 26715 22783 23082 20874 16537 16024 25781
6673 25781 26361 15464 8702 12492 21109 26115 20287 3549 11006 5857 -2855 -9580 -1609 -3527
6659 -3527 15874 24867 18941 21436 15201 2337 5502 25591 37353 33398 12318 -3523 3745
6646 3745 5769 -3111 -11729 -12093 -2082 8672 7719 15281 24598 15352 18151 14743 13006 9387 9260
6631 9260 8801 14847 20587 21593 18621 17320 27626 38143 31429 14129 7572 12241 17228 12348
6617 12348 3472 -1957 10206 20866 20195 12340 16146 19531 12302 11541 10212 4062 11789 9347 13143
6602 13143 8236 17673 28095 5651 -8809 777 6142 18759 15835 11507 17155 17792 10210 5421
6588 5421 9734 24094 6503 1615 6597 5411 3270 10290 18466 20963 22314 24282 26405 24149
6574 24149 17160 11391 9336 11801 13771 12762 14955 12492 8604 2975 7579 8291 7061 4131 13896
6559 13896 19665 16936 13125 21220 26467 40487 36348 36709 37634 27375 22254 16805 10696 13918 13207
6544 13207 10001 13621 8489 -1770 -3889 -10075 -9810 -3582 10279 7958 -4947 -13381 2002 1626
6530 1626 6729 16816 16730 17404 -2495 527 4149 898 1772 -1186 -2269 4143 1879 1695 2839 6684
6514 6684 3164 -4531 4018 6036 1975 6589 8739 10485 7316 7961 9312 18494 13139 -2849 -3908
6499 -3908 -3132 -10328 -14389 -6312 -3675 -2946 6169 4840 9898 -3351 -11167 -13940 -5468 -3824 -5817
6484 -5817 -2506 3447 -144 -2979 3800 6798 9612 -735 -18150 -14413 4460 26991 30984 15742
6470 15742 -2568 1369 1456 9165 11279 2544 -5138 -3612 -3411 -3051 -375 -6411 -5769 1337 -14398
6455 -14398 -15244 -12096 -8051 -7236 -72 7550 6292 13097 15748 18544 21886 26991 16260 9714 13165
6440 13165 11342 4398 2418 -3830 -17398 -4299 8840 21021 21542 15610 18398 22672 18542 11122
6426 11122 -1816 -4936 9030 10567 11075 16852 9061 4067 -646 -2520 -5335 -1401 -791 -8501 -7488
6411 -7488 5292 16315 18071 9286 -621 -1119 -3550 8911 7442 9613 9928 1620 -4420 -29 165
6396 165 754 1309 -6327 -21424 -16739 -7783 -12492 -6824 -5452 -4172 2377 3017 -7463 -14038 -19274
6381 -19274 -7634 4718 9078 11103 -1981 -8357 -4187 -3779 -5197 -3706 6091 7869 -4900 5533
6367 5533 13380 7102 5045 9175 -6094 -9661 40 5314 12703 14576 4199 9068 11553 17033
6353 17033 25001 34423 41019 19027 10173 -3830 -18503 -15382 -4127 5257 944 -6364 -5797 -7194
6339 -7194 -11983 -8912 -9317 -11228 -7715 5488 9549 -2520 599 -4712 -11035 -6627 -5514 -11419 -6372
6324 -6372 459 -833 3234 -1405 -16443 -17956 -14243 -7911 -4787 -10105 -14374 -14932 -22593 -21100 -19396
6309 -19396 -19078 -14479 -18588 -15022 -13636 2006 19560 22303 19435 17270 19765 21729 20988 18827 15705
6294 15705 -2710 -9042 -4995 1501 -3052 -10820 -14655 -15163 -9817 -3168 -1476 6676 7691 1792 5771
6279 5771 10825 26566 29812 32241 32682 15083 1875 2318 -4075 -11291 -5442 -8336 -13777 -13102 -13101 -11467
6263 -11467 5353 2276 -12254 -16125 -12647 -4637 -846 7294 9365 10451 22694 19609 20834 14930
6249 14930 23752 33123 24230 14437 4691 2928 9804 17427 16573 12072 14172 18757 15245 11411 4310
6234 4310 1743 16183 29600 13377 -10011 -13175 -4093 5064 -6604 -11861 -3302 5300 4383 9575
6220 9575 14710 13674 6276 2763 -902 6268 8747 10146 10366 -2422 3009 15784 7330 10550 12235
6205 12235 649 -65 -8893 -10943 -4760 -2449 3633 9072 10674 12839 14053 20478 14405 9596 9654
6190 9654 9775 12985 20186 14534 -337 -1780 2149 17126 17225 12735 187 4516 11753 11497 16966
6175 16966 17438 11022 7068 8839 6365 466 656 -14827 -16719 -20460 -17083 -10662 -9320 779 6817
6160 6817 17374 12839 22796 22311 12581 17145 6678 -4087 1804 5909 1351 9602 16419 14884
6146 14884 4222 -1926 -4362 -614 -3707 3004 3047 3025 12371 5382 -13182 -21953 -27869 -10123 5438
6131 5438 -4460 -6061 -9637 -4307 -899 2343 -8123 -10821 -11880 2269 1295 13004 18019 26102
6117 26102 34829 35742 39791 33783 26018 17459 34038 32146 28085 20434 10515 5875 -472 3062 6477
6102 6477 1049 5372 11254 18611 16317 8754 16019 27441 26309 23160 7908 5190 13319 7880
6088 7880 11687 7104 287 -643 4006 4901 9405 3341 3427 4513 10896 12514 -1057 -6277 -10137 -9984
6072 -9984 -9522 2321 7550 9696 13518 9641 2451 1362 -5913 -10159 -7809 -5279 -13961 -746 20756
6057 20756 23360 15844 8990 -2374 7883 20011 24625 27356 17348 13042 14317 5168 6141 8995
6043 8995 4387 10730 20088 14628 18823 20342 19134 16517 7728 -8369 -20249 -20705 -6904 -10290
6029 -10290 -14935 -9659 -22888 -30307 -22824 -2562 1564 -13437 -20806 -9742 -14069 -20543 -21880 -4298
6015 -4298 37 -3223 -4252 -198 -5812 -19625 -16866 -7607 -7848 -21579 -27397 -16110 -8802 -8559 -13401
6000 -13401 -13074 -757 2916 9133 10383 11242 4815 -2466 4971 11688 12301 10227 4197 5906 7984
5985 7984 8871 4939 -9877 -9605 1948 3827 -9148 -10837 3081 5790 -4461 -5386 -1857 -14817
5971 -14817 -24211 -12559 28203 51249 49769 46047 40747 23293 15236 2061 -13510 -9165 2892
5958 2892 -2666 5172 3398 -1233 -7676 -9972 -16613 -12990 -8389 -2751 7905 7511 1742 -4055 7100
5943 7100 14101 15553 14610 -2694 -13597 -5002 9174 13768 24923 23110 19295 9761 -945 -12481
5929 -12481 -22391 -21420 -17309 2279 14859 34088 50058 62901 54233 30271 18699 14255 11751
5916 11751 -3528 -6045 -14296 -9261 -16184 -24960 -17696 -3033 19537 22746 1741 -14442 -5675
5903 -5675 6341 12178 15058 15123 9867 2450 4166 962 -9414 -14286 -16718 -17972 -21730 -16660 -4042
5888 -4042 6242 7149 6388 3730 2979 -3075 -1575 -7136 -3915 1409 -5392 -5412 7395 22617 27051
5873 27051 35325 26413 15548 5126 -6205 -16892 -13523 -3093 876 5403 -203 -6372 1418
5860 1418 -2369 3606 12342 14439 18987 -8260 -20336 -15561 454 4909 8563 8872 1477 -5220
5846 -5220 -5148 -9451 -11573 -3849 5407 -7 5996 10582 10650 2637 786 -6600 -9648 -13417 -27803 -36028
5830 -36028 -26917 -8096 4408 10467 -2536 -14060 -15618 -5434 -2026 7960 7520 7065 4006 8369
5816 8369 10110 9606 2627 -2298 -1672 -12385 -17709 -12664 -8803 -13358 -2242 -5106 -8646 -1165 -6122
5801 -6122 -14116 248 13603 17304 23281 12481 -9655 -17135 -11045 3466 5582 4854 2756 -1338
5787 -1338 -13591 -7761 -281 -733 1624 10251 15135 9051 -4973 -19428 -22418 -15721 -9613 -18843
5773 -18843 -13109 12032 19451 25787 19213 6835 -2689 -6622 -3182 -5146 -6818 -7516 -8957 -10976
5759 -10976 -7307 8211 6347 -1884 -15114 -22412 -28464 -37858 -20382 -1594 1468 -3905 -6677 -4269
5745 -4269 -4398 -1605 -2425 4095 17136 11414 10894 24187 21320 25269 27793 22028 4460 -11016 -13259
5730 -13259 -13037 -2264 -2856 4093 11480 8509 3679 1540 1433 6337 -4646 -11297 -14577 -8858 -5616
5715 -5616 3053 7082 17198 23443 14843 18295 11681 7183 11453 22215 25904 23386 19935 21887
5701 21887 24087 28529 19760 11190 25827 31721 33940 20588 4690 -9518 -11187 519 -657
5688 -657 -12474 -10192 -15634 -5394 4753 716 -9718 -10469 -7632 9973 19411 22247 10097 16212
5674 16212 15278 2752 5243 11551 3212 1510 -1920 -1200 -2336 6771 -5887 -21820 -20404 -13756
5660 -13756 -13345 -12411 -1935 -906 3126 9821 12441 9950 1403 -3360 1233 7987 13358 7988 3165
5645 3165 3696 15297 14497 7925 11808 17499 18207 11419 4778 -7937 -8857 1252 3743 1044 -4439
5630 -4439 3130 3443 274 9442 5704 5093 7569 -418 -3067 -558 -2358 -2259 8377 13827 10866 9268
5614 9268 10718 10337 -2171 -3842 -896 -7589 -16635 -6013 2899 8583 -11276 -5497 7686 1696
5600 1696 -4517 -18527 -27044 -18503 -3834 2304 5900 15774 11989 2797 5359 9233 3501 -1693
5586 -1693 -1733 4409 16584 11293 -4311 -2520 -887 1526 6044 7605 2957 1251 2358 -2314 22
5571 22 9835 6544 9950 13374 4492 3162 15813 10978 -944 -9790 -13932 1512 14282 6346
5557 6346 -333 1176 -1580 -6927 -9499 -4136 -5788 11746 3035 -14344 -12859 -14004 -17906 -17376 -15571
5542 -15571 -571 71 -1986 -6792 1296 3498 -2094 -2260 -764 -3139 2709 -4417 -5516 -5412 -6251
5527 -6251 -9389 -14920 -12610 3910 5756 5926 3820 -3822 31 -9501 -15054 -3499 233 8627 7426
5512 7426 3529 6664 8255 -742 -5040 -9936 -1998 7557 13448 13129 16616 9372 -308 3801 7343
5497 7343 6468 -5345 -10009 -10181 -6267 -2333 -1459 7255 -1245 -3964 6823 18988 14180 8547 11034
5482 11034 9915 -3691 -15051 -343 3717 5163 7888 14559 16047 5283 -667 -2983 1563 7455
5468 7455 1563 -1250 11163 10542 -4599 -22413 -24691 -10762 -6415 -5377 -2497 -8768 -16070 -15995 -20470
5453 -20470 -27036 -24068 -16407 -6983 -3650 13604 13861 4880 1899 -10628 -9381 439 5197 9072
5439 9072 15693 16361 7776 62 1037 4436 -5965 -14388 -13930 -8207 -47 -430 -4792 7845 233
5424 233 -11269 -7785 -18972 -11649 -1178 -17576 -27512 -7886 2593 -3370 -2249 -11581 -14176 -15891
5410 -15891 -16184 -15936 -11533 -2687 7820 -4960 -2527 3180 -826 -5135 -9299 -9081 -5683 -12915 -18835
5395 -18835 -29306 -15468 -6643 4304 1805 1019 -8490 -4835 1659 -3314 -4190 -9703 2683 8776
5381 8776 -316 -185 -11889 1736 4844 4410 6305 1574 -1860 -1244 2308 7908 3640 8642 6402
5366 6402 5848 12291 4892 -819 -10568 -5614 -5238 -15035 -23599 -19125 -356 6088 7669 21900 20324
5351 20324 11184 3984 2838 9345 16079 4403 4819 5689 2181 -1370 10019 9196 -11594 -16309 -11854
5336 -11854 -12901 -14767 -2083 -6885 -21123 -11167 -15541 -13602 -5330 1860 -575 -1692 6610 14504
5322 14504 10739 1038 13668 23661 21559 3364 -3898 -4790 -1263 4170 -1094 6394 5202 13947
5308 13947 11844 -567 -6703 -9312 -5787 -10565 -10009 -13296 -16671 -18680 -28390 -38161 -33603 -16621
5294 -16621 -2309 -19156 -25100 -17040 -10445 -5670 -6338 -16014 -15435 -7712 -11449 -15701 -2622 7264
5280 7264 14998 -528 -3201 3224 2111 1993 13648 17202 13819 13984 5091 -391 -7005 -8355 -9695
5265 -9695 -893 -1117 -8244 -10839 -11189 5619 14246 12847 8627 9857 20141 16835 8114 72 1531
5250 1531 483 442 -14262 -15571 -18706 -14274 -8696 -7085 -3827 2000 -9282 -8962 5789 4633 9272
5235 9272 8985 11423 8624 2202 8151 18859 16447 9120 5697 4566 -10478 -14761 -11743 -12723 -9533
5220 -9533 -11504 -685 7444 9661 2008 -1510 -6774 -20925 -17573 1575 5122 5553 -1530 -1871 12711
5205 12711 5751 -9422 -10440 -10649 -10882 -8412 2657 2659 -2094 -9370 -10931 -6867 -6695 -3078 -1769 -3187
5189 -3187 2778 -8299 -1367 -2377 -4880 -1444 7385 11043 19079 21647 7250 9549 7744 -809
5175 -809 6249 11446 7560 3237 -4686 -25984 -22680 -9836 -7728 -14212 -4045 11933 18179 25842
5161 25842 19940 5221 -8941 -8374 546 6658 6627 5680 8247 -4481 -6831 -7460 -2830 -13300 -15429
5146 -15429 -8493 -11646 -18971 -17766 -14874 -10721 -1038 790 -617 1975 1365 5445 12147 7168 -831
5131 -831 2656 5726 14672 18460 18836 21219 13990 10423 12406 -1562 403 -172 2937 6741 4347
5116 4347 5647 10060 12415 7622 2159 4282 3324 5246 -2502 6922 11480 1632 -4853 198 9986
5101 9986 21564 22073 21056 18010 17020 13548 2106 -6270 -1206 7575 8046 13796 15854 12559 10054
5086 10054 -1500 2173 -2579 -1237 7968 6953 6077 7782 13871 5417 -15742 -25944 -12597 -4306
5072 -4306 3395 -4777 -18586 -30148 -20860 -2012 10709 7506 -4024 -6121 5389 20256 27841
5059 27841 31714 16269 -4543 -8840 -10532 -24188 -19786 -20816 -22854 -13589 -8903 -5914 3015 259
5045 259 -6185 -20617 -21163 -23585 -23516 -16707 -7935 -4137 893 8559 1912 -5359 -8169 -15045 -14214 -24118
5029 -24118 -23975 -20984 -12989 9274 7969 2442 -4155 -3136 3298 -271 3466 1459 -868 -8379 -15298
5014 -15298 -11326 -12806 957 4643 -1620 5288 -5797 -9609 -7123 -4799 -21106 -17543 -12495 -15956
5000 -15956 -15514 -11433 6075 -1225 -7985 -6510 -3898 -11375 -9834 3768 18531 9794 8223 -79
4986 -79 -16759 -25030 -4667 -673 -5799 -6539 2326 3610 925 -720 15033 14768 3147 -378 2456
4971 2456 -1637 -13544 -19872 -10729 2384 13873 17288 13612 -1724 -6986 -18587 -20197 -25194 -25238
4957 -25238 -20300 2837 15826 3703 1794 2550 -6368 -4248 1065 -9043 -7725 -8544 -13143 5479
4943 5479 10956 6498 -6089 -8233 -1132 410 4849 11541 16014 11058 7805 17491 11616 8950 11915
4928 11915 9041 11577 11876 7943 6148 7354 5181 -405 8258 21406 21018 13096 14793 10599 13141
4913 13141 20160 27110 13001 -2942 -4249 -5166 994 4862 -537 -10702 -13978 -8098 -12175 -20920
4899 -20920 -13114 -4837 1592 17431 11470 6777 200 -15001 -17529 -14248 -27634 -24043 -17553 -23650
4885 -23650 -33124 -19669 -15440 -6580 -3930 -2565 12007 22368 11429 4249 6970 15200 17176 9352
4871 9352 -3270 -4339 -1039 5220 9696 10668 11910 21790 19292 17987 18161 3399 -4872 -9785 -26394
4856 -26394 -24978 -18313 -22596 -21467 -16412 -12688 -19792 -3682 7277 3823 5368 5141 12299 15122
4842 15122 1952 -5569 -20411 -27107 -18244 -10666 -3307 -1737 -8243 -6741 -5797 -1123 189 -6796
4828 -6796 -7288 2646 -779 -7115 -420 249 -2296 -1942 2250 6780 2628 -5321 -4818 2580 4390 -1518
4812 -1518 -2034 6278 16236 17146 7469 4462 8409 7647 -10693 -9324 -3233 -8580 3875 10440 3598
4797 3598 -268 5498 520 3891 12386 13629 14059 3806 -9193 -4279 -5878 -6566 -449 11752 9159
4782 9159 17505 22866 9925 5762 1884 7784 5531 -2855 -7047 -4080 9188 6752 7339 645 -9030
4767 -9030 -6857 7521 4881 -10291 -1639 -10962 -11229 -2903 -25675 -33513 -27309 -22933 -25690 -17208
4753 -17208 -22734 -23532 -24424 -27205 -22721 -11639 -4884 -11652 -12158 -13422 -25800 -23043 -16836 1004 -3208
4738 -3208 1516 10919 21109 16203 -3444 -10113 -8554 -9873 -16836 -18413 -12189 -6593 -11670 -5444
4724 -5444 1106 -3407 2056 8873 10387 12723 2529 -4211 -6143 1054 1476 -3818 -1701 -517 -3081
4709 -3081 -10448 -11443 -10164 2088 8522 -2009 -7748 -8582 1698 -12690 -5754 -12214 -21624 -18775
4695 -18775 -3286 -1365 -5378 -18020 -10896 270 -3004 -20966 -26615 -17699 -13672 -12657 -9506 -12879
4681 -12879 -1410 1491 6233 14249 11021 7856 5532 10418 4414 -757 -7747 -1148 9344 14809
4667 14809 18728 7717 5666 9625 2492 -2050 7336 14133 -3190 -11951 -7318 -12212 -8544 -5352
4653 -5352 6071 -2614 -4325 -2633 -14902 -13604 -12761 -9109 -9214 -10681 -13784 -12541 -6816 7227 5416
4638 5416 -2571 438 13137 7116 -3878 -1888 4625 8108 11154 -5340 -11685 -9552 -7519 -3274
4624 -3274 2379 -3360 -5368 -5359 -2919 4302 1371 3674 6015 2934 -7717 -13634 3504 9893 14831
4609 14831 15457 5220 -1524 8532 11989 1335 -6594 2413 4164 10591 10462 11075 6624 4791 -5764
4594 -5764 -9136 -1233 8219 907 -10661 -14540 -361 -1509 -15109 -8652 -12089 -22241 -24632 -18167
4580 -18167 -6692 3806 356 -5930 2497 12827 12649 11532 -4413 -1208 5116 10511 6682 5826
4566 5826 462 12172 12528 6125 -1291 4090 2879 -4399 -7839 -12565 13084 16558 20118 19116 9765
4551 9765 4606 18355 17596 19230 17133 13733 15871 8315 4138 7853 17409 6395 5848 5204 3775
4536 3775 12223 9258 3429 -6150 265 593 -13301 -2481 1099 9128 5515 -1197 -1485 -7912 -16908
4521 -16908 -19566 -9989 -9677 -10280 -81 15217 15397 2800 -11331 -9066 1537 12868 14793 11525
4507 11525 -2297 -2229 -293 -7490 -20369 -18200 -3600 -2347 -6038 -1355 -7770 -10622 -18043 -14331
4493 -14331 -16095 -13713 4420 5258 -5150 -6978 38 -196 -3559 -6031 -4204 -3866 -3259 -3205 483 9942
4477 9942 8402 -3180 -10311 -6680 -10997 -14568 -10063 -3705 -3914 -7320 -3720 -11553 -5073 -8757 -6997
4462 -6997 -7612 -5234 -3380 -45 -1419 -2284 5628 6132 5981 7398 8598 109 -1410 -6239 -16162 -23966
4446 -23966 -21909 -8583 6474 769 -10240 -4625 -5774 4766 16843 20975 15294 3752 -2793
4433 -2793 -7093 -4475 -7274 -3675 -3819 -682 -4325 -11458 -8061 -5078 -751 -2654 -1323 -16827 -33060
4418 -33060 -29639 -23041 -19596 -19587 -21734 -21644 -7352 7809 21041 11972 -2312 3130 -1794 -10016 -19596
4403 -19596 -16259 -7653 2931 4888 -4595 -9563 -2217 -1485 -2916 2801 2900 3948 5986 13162 9587
4388 9587 12686 6455 -3567 6267 614 -2646 2358 1320 1177 5202 -2843 -10418 -5788 -382 -7383
4373 -7383 -3970 -2883 -210 7036 4374 599 483 -1108 -11317 -4913 -2728 -8243 -15908 -16381 -16134
4358 -16134 -14742 -8878 -6723 -7957 -16654 -10473 -8796 -10542 -11347 -4649 -21215 -35260 -23841 -6560
4344 -6560 6064 4145 10243 23495 16518 9758 8634 8943 5111 7247 2544 -5979 -15684 -19205 -8119
4329 -8119 -11789 -23449 -17707 -16659 -26877 -26501 -10859 -3136 -733 10295 5701 229 -6279 -9199
4315 -9199 -9385 2205 20 -14823 -14499 -20137 -16378 -21543 -25112 -17226 -10466 -7135 -11613 -4632 6802
4300 6802 7349 3125 5701 7913 6749 -4561 -2828 2383 -5226 2023 6454 8848 44 -12157 -10559
4285 -10559 -10509 -12478 3978 12679 13758 4714 2538 9555 18423 17657 17172 11753 9815 12165 18308
4270 18308 18832 13057 7258 3545 4989 -8200 10817 13899 4147 5427 10241 6456 -1372 -179
4256 -179 -2818 -3355 -1224 283 454 12011 4799 6001 7429 -1692 -13574 -8884 -201 4614 8250
4241 8250 -376 -17421 -13953 -14664 -15274 -12401 -6983 -2298 -9132 -9405 -7310 -2673 -7550 -20880 -11084
4226 -11084 8602 15746 7374 7714 14584 -2162 -15171 -14259 -10324 -1694 12056 2874 -3584 -9354
4212 -9354 -3633 -15051 -20459 -24512 -25751 -13100 3056 5880 4989 6728 2562 1661 6657 16917
4198 16917 16580 -783 -6096 -966 6240 2282 -4244 -25036 -33993 -31094 -26300 -10873 -8175 -5446
4184 -5446 -9712 -8431 -7234 -51 -15960 -15691 -5035 -1897 -10431 -12533 -15051 -15717 -18120 -25709 -12020
4169 -12020 -4793 -13964 -16483 -28121 -26097 -19263 -1787 616 4321 2414 926 3123 8790 4472
4155 4472 6752 13799 16319 9485 10165 -876 -10760 -17217 -20784 -21114 -20279 -20129 -18947 -12195 -13637 -22026
4139 -22026 -17716 -1146 13205 19300 27029 29022 26156 22376 15134 12356 11797 11823 8921 -1390 -8903
4124 -8903 -6016 -3828 559 -10174 -20578 -20496 -18500 -11557 -5391 -1580 2707 -1112 -15425 -18629 -6737
4109 -6737 6046 7526 2519 -4827 -4743 -6635 -764 5355 -7175 -15878 -15537 -18175 -18301 -13774 -6918
4094 -6918 -8408 -3043 11753 12948 8924 12239 6899 4530 10241 16369 15796 25341 20971 4548 8707
4079 8707 9015 10684 13285 6378 8009 1906 9766 18006 14184 6639 5795 4903 4478 13752 20311 32138
4063 32138 34491 22848 15249 2030 -993 -5020 -3009 1196 -2059 -5756 -18932 -10997 3329 11384
4049 11384 14501 13084 15627 -6462 -16707 -7405 1279 6704 8607 16891 14811 6892 -9438 -8429
4035 -8429 2449 1498 -5703 -15348 -5176 -5458 -2059 16960 21788 9225 7225 13950 14914 11469 22510
4020 22510 32061 32560 30960 27635 27481 24465 21467 10512 -4634 -3564 1022 4583 4459 -5921 -5653
4005 -5653 640 5026 8079 2348 9044 16188 18985 20075 17081 25594 18772 12688 -6923 -9650 -6715
3990 -6715 -6649 6888 10584 5416 16176 31838 17716 5183 15944 22477 15840 6131 -5242 -8157
3976 -8157 -180 6222 1828 -5624 -10754 -19153 -31022 -16357 -15774 -21342 -23474 -15222 -13139 -4369 -1167
3961 -1167 -9945 -8484 -6278 1960 7373 12446 13339 16554 25946 11748 333 -759 -16407 -20919
3947 -20919 -12269 -1674 7954 -2592 -1049 5939 14429 2455 -19535 -31076 -24824 -23265 -6784
3934 -6784 3890 5781 -7654 -5329 -10027 -6829 -3982 -3099 -1582 -1521 -6920 -12067 -17449 -11302 -4901
3919 -4901 -12909 -11803 -4453 -5075 -17698 -28872 -31052 -23189 -9132 -10216 -13350 -13810 -20395 -22445 -20667
3904 -20667 -14645 -15947 -14082 -7524 -2253 2068 5340 1095 592 1763 1041 -3924 3467 -8350 -19976
3889 -19976 -11544 6854 11594 -7958 -17196 -16249 -22918 -19469 -14082 -15543 -11967 -4315 -6938 -7024 -6693
3874 -6693 -13095 -10678 -16968 -22283 -22883 -18382 -17535 -4283 10567 16303 14152 14339 21380 13923 876
3859 876 578 -5096 -6688 -9771 -902 -3178 -14938 -24134 -16644 10536 15052 17654 10161 12445 12970
3844 12970 14834 4373 -15787 -7741 3275 -5692 -4817 -11427 -18374 -7836 -12320 -13742 -7659 -8760
3830 -8760 -10587 1055 12024 12706 7841 6862 -1425 3291 14690 14469 10102 14060 15434 14551 14588 11307
3814 11307 15977 17788 -2147 -13072 -20000 -21788 -27748 -30451 -17880 -8567 -15163 -12199 -6238 -2691
3800 -2691 -10332 -2836 4569 12331 21857 9962 -8277 -22266 -17434 -11815 -13391 -20576 -31904 -26824
3786 -26824 -14326 -11729 -20775 -9705 -11132 -15396 -18098 -15260 -9929 -18021 -1020 -209 -4417 -13215
3772 -13215 -22529 -23881 -15271 -11388 -14595 -10124 -5842 -8473 -14439 -8562 7595 2650 7250 14866
3758 14866 14711 11300 -3677 -17587 -16317 -7882 -3263 1667 -4865 -10905 -8498 -4898 -19448 -19845
3744 -19845 -16062 -32088 -38801 -21353 -8673 -3250 -3234 3213 9426 11878 12789 8002 22106 22054 -943
3729 -943 -11548 -12850 -18490 -20652 -19735 -26969 -23676 -15832 -23445 -9462 2618 2113 3028 -8954 1151
3714 1151 7226 -4013 -18888 -16773 -14190 -20802 -20980 -18702 -22922 -23797 -17774 -10415 -14319 -18797 -10978
3699 -10978 -13357 -26365 -40401 -29195 -10669 -7965 -19189 -17268 -15314 -30649 -30281 -15907 -10335
3686 -10335 -2485 -7445 -10877 4113 12005 4140 -1778 -5871 -17963 -4140 857 -6858 -15040 -15944
3672 -15944 -10719 -19269 -19378 -14518 -16712 -17365 -7651 -4430 -6077 4332 1196 -853 -3678 915 -7638
3657 -7638 -18365 -20835 -7608 -5956 -13536 -9679 -4016 -3930 -3266 4376 645 -4402 -6670 -7121 -4106
3642 -4106 -5231 -9800 -14898 -26478 -9996 7830 16177 16215 5482 8817 14360 5515 -4847 3850
3628 3850 -80 -8525 -7355 -19046 -20770 -15365 -4896 -7037 8526 12383 2971 -1126 -374 -1402
3614 -1402 -6193 2901 2511 4298 5648 -7905 -3593 6640 5277 13179 -1624 -19475 -13754 -3911
3600 -3911 -14189 -10005 -7488 -4744 -4031 -15530 -7495 5407 3752 -908 -6897 -10876 -13352 -28028
3586 -28028 -20765 -7437 3997 1024 994 -7003 -7107 -19509 -39059 -26373 -6685 -12205 -15498 -15271
3572 -15271 -16854 -17177 -14054 -10917 -8852 -4456 14650 8465 -1956 -964 4787 -9238 -14125 -8719
3558 -8719 -909 193 -5487 -3654 5020 7348 6713 -3586 -13421 -14619 -12494 -6499 11452 2475 -6482
3543 -6482 -12277 -2448 -4295 -502 1646 -8744 -12960 -2991 2384 -3143 2204 -896 6877 14227 8338
3528 8338 6861 -3750 -16824 -19547 -16870 -18000 -13736 -15900 -18428 -11698 -3875 -6063 -2585 -2438 6873
3513 6873 12502 11556 5708 -11587 -16168 -16993 -18935 -9429 -353 -4065 -7599 6262 11195 20937 11914
3498 11914 6840 4701 14368 21195 12780 17937 3910 -1836 -6721 -5333 452 16204 18937 4970
3484 4970 9685 4185 -1486 -6949 -15726 -15080 -7353 -639 13 -1280 4116 4863 10479 11099 14092 5682
3468 5682 3701 -362 -11130 -18984 -19232 -10369 -4089 -1791 4171 -2139 -8552 -17573 -13092 -10807 -3358
3453 -3358 -5930 -9410 -11886 -14759 -21217 -22193 -14107 -7590 4187 29301 15649 2544 -1712 -10875
3439 -10875 -16766 -5016 -3809 2467 25903 29392 32466 26552 6958 -8887 -3578 2700 13601
3426 13601 12348 1095 3526 -6958 -12674 -10586 -4214 -1060 6107 15183 13323 12987 16720 17950
3412 17950 11537 6283 -2782 -12301 -10891 -8921 -1720 -5191 -6510 -5651 7805 4692 -11970 -12356 -432
3397 -432 3158 -1720 2436 3518 6093 5516 3990 -12381 -20412 -18362 -7650 910 1805 -705 -13099
3382 -13099 -3653 -6779 -5935 -10359 -4346 -600 -4019 -5236 -17581 -25943 -25035 -24089 -21820 -16976 -10388
3367 -10388 -7532 -1577 3772 5222 -1138 -9295 -11679 -4874 -4115 13028 20968 11919 2892 4130 8265
3352 8265 17924 20956 25188 30990 16835 2796 567 7831 15979 7371 1162 -7524 6871 10983
3338 10983 352 -11819 -2806 -1397 2956 8374 3682 -2545 -8331 -14804 -23347 -10775 481 839
3324 839 5159 3263 -2201 -14490 -15126 -11119 6374 -3298 -3376 6549 7252 6015 5125 962 -5947 -632
3308 -632 -1985 -4954 1698 -1650 1073 -5188 -10291 -7123 9272 7042 6267 7575 1824 -822 -4561
3293 -4561 3028 8261 3787 352 -10001 -9148 1222 5120 -5416 -7707 9093 5138 3491 3644
3279 3644 -2243 -11743 -10520 -10117 226 -36 1380 7548 2322 -2863 -11337 -15631 -12847 7115 4589
3264 4589 -7140 -12084 -10782 -1088 -4773 149 -8081 -7888 -10763 -16427 -14972 -21801 -27616 -23034 -20834
3249 -20834 -20815 -9651 -6354 -12166 -10318 -12176 -22520 -32071 -19982 1575 6039 -4529 -1344 -147
3235 -147 -2917 -2580 9450 3866 -15059 -12098 -4184 -5121 14271 27955 27557 21304 14226 3878 -1600
3220 -1600 6956 16251 10914 4501 -1672 -13046 -11128 -7990 -16755 -13833 -8256 -8951 -8259 -17564 -27502
3205 -27502 -29876 -22751 -11362 -2406 -14000 -22112 -16790 -21683 -22380 -13454 -4828 6541 1749 -2204
3191 -2204 -9652 -16336 -21541 -25401 -19851 -9732 4697 15313 10423 6181 12487 8726 2962 5763
3177 5763 12066 15757 13476 8128 5804 -9597 -15482 -2147 1555 3384 4482 -1098 10753 6029
3163 6029 -15045 -11207 -3769 2671 -1585 -41 10408 18166 11347 -639 -4011 -6024 1607 1530 -3616
3148 -3616 -3360 -10295 -10510 -10578 -19188 -13202 -4693 7984 7009 -2801 -3726 5142 4730 -6303 -21842 -20033
3132 -20033 -4878 -932 -610 6244 15621 14740 1619 -3332 485 18198 13602 8220 4276 1671
3118 1671 -1618 -8660 -26770 -34133 -21374 -14647 -9533 -7700 -6822 -9716 -186 -6798 -13674 -2130
3104 -2130 19137 33216 29523 11604 15750 23113 10879 6257 5467 3746 -17396 -21779 -21495 -20565
3090 -20565 -8257 302 6455 -1431 -7343 1279 1524 1515 -737 -8617 -9667 -10515 -19925 -24365 -20899 -12620
3074 -12620 -12102 1708 5130 -4007 5979 18533 13018 10092 12777 8417 14866 19254 20183 16048 6200
3059 6200 -2906 -6733 -9956 -9360 -895 -16514 -30881 -32785 -26618 -20964 -8848 -8089 -9329 -10832 -5354
3044 -5354 -19306 -17651 -17429 -19598 -24173 -14861 -7064 -5604 -6616 -1649 -7047 -9801 -8877 -22150 -16828
3029 -16828 4414 10896 1415 -13611 -19801 -19324 -15823 -15046 -10635 754 9318 11383 6581 -3109
3015 -3109 2982 2471 -163 9820 -4963 -5535 -2077 -4589 -8830 -2163 11059 5928 -6212 -15652 -2085
3000 -2085 3762 10427 4936 5417 -1987 248 1785 -3512 -15892 -9273 2471 6565 11175 8227 11464
2985 11464 2664 -2301 -8925 -11458 -13464 -12498 -11242 -8626 -4648 -7579 -5492 -2083 2779 4439 1344
2970 1344 2788 -2319 3510 -4368 -6547 -121 -3520 -15790 -15570 -9235 1425 -4203 -5346 -4408 -2029
2955 -2029 9686 3748 -4461 2779 1055 -4559 143 -5211 -14506 -9251 -8104 -25226 -42690 -54131
2941 -54131 -40934 -42095 -43512 -39630 -36238 -29149 -20980 -13029 -4144 3724 3175 5760 7109 7980 3336
2926 3336 6636 -5018 -2173 3227 -591 -5069 -4733 1266 3091 947 4286 5073 241 -13942 -21559
2911 -21559 1892 13668 1106 8470 7863 6363 5354 -4915 2517 17072 24062 17734 5466
2898 5466 -3520 2782 29055 54222 62329 45060 34413 42748 50691 37311 7753 -14972 -25863
2885 -25863 -15918 21 -4428 -16391 -27737 -19187 -1569 -13605 -14864 -18804 -20490 -12691 -12666 -17459
2871 -17459 -20805 -23367 -24399 -21301 -24289 -15381 -7760 -8374 -6811 -6335 -9072 -12403 -19545 -18384 -13372
2856 -13372 -25491 -28532 -31699 -31785 -26990 -29893 -30950 -39439 -44629 -39939 -36806 -30964 -16227 -21177 -14324
2841 -14324 5235 22364 31898 25564 25181 26015 22094 14715 -2169 -14257 -7025 2288 8691 23230
2827 23230 28482 33089 30704 29317 22676 11025 12467 11533 4368 -11378 -11096 -16389 -8761 550 -3706
2812 -3706 131 -101 -546 -2133 835 3412 372 1427 4989 15369 3886 -9600 -7633 -8758 -6972
2797 -6972 -10956 -9809 -15929 -20975 -15277 -3649 -5039 -8561 -16128 -12281 12036 13194 1924 -6257
2783 -6257 1585 3778 4726 -1173 -5841 -1923 -4215 -4322 -2957 -5439 -5603 -4648 -231 4591 10074 19990
2767 19990 19641 11716 14635 14636 5902 8896 17066 14649 6480 8989 13311 19157 18507 12529 13861 25524
2751 25524 31201 19070 10413 15014 11901 3929 8137 6700 2090 12417 -11066 -26267 -17741 -19851
2737 -19851 -8089 -4930 -9084 -12217 -13996 -12475 -1433 7940 20063 17266 -3230 -5635 -7166 -15987
2723 -15987 -1742 1304 8084 1949 -4715 4464 17114 24582 26441 31321 6039 -6873 -6841 4348
2709 4348 14135 14099 -289 -7359 -1759 -11747 -14221 -14998 -8129 -5707 -11681 -3454 9568 23685 15832
2694 15832 5647 7469 11916 6083 -3650 -6798 2 -7669 -8567 -11660 867 2692 -2027 -11450
2680 -11450 -12563 4961 22449 37914 27415 11535 3006 1320 1049 -4976 -18137 -24157 -31351
2667 -31351 -26340 -1060 14358 4814 9457 13032 21263 16538 5170 5502 218 -6822 -10447 -10039
2653 -10039 -4831 1528 8401 16054 18732 11549 277 -19547 -24890 -32791 -24134 -6687 -9944 -5783
2639 -5783 1214 6975 16705 15732 3495 9199 4839 6751 6045 -5564 -4784 -3408 -5312 -10135 -16336
2624 -16336 -13693 -11840 -1577 -4495 -7491 -22880 -8802 -5474 1310 -287 -4288 -12805 -14620 -9419
2610 -9419 5147 7089 3100 -3166 -8497 -22176 -21589 471 7112 14189 17319 1652 -4058 -5840
2596 -5840 -9053 -9634 -15311 -12573 -11213 -17951 -24084 -22701 -24694 -21131 -21646 -19304 -15945 -545 3150
2581 3150 -1138 770 2122 2585 4410 -1510 4122 3334 1673 -486 6659 14602 10425 -1431 -6661
2566 -6661 -3962 -2709 6615 -5834 -4356 8428 17291 20329 20702 14793 -4717 -239 -13063 -17946
2552 -17946 -26827 -12737 1583 6852 2065 2684 -7339 -19063 -18706 -11818 -7152 -8852 -9461 -9416 -2042
2537 -2042 1253 -3586 1210 6326 1256 772 -3753 -7680 -3539 -2732 9953 17611 22648 11950 -17499
2522 -17499 -15245 1722 4100 -4189 -7371 -844 1680 -286 -2384 -7587 7393 38519 21900 12763
2508 12763 18916 12525 3368 481 1519 -3783 -4892 -1825 111 -13541 -24257 -26263 -16425 -31305
2494 -31305 -32931 -18096 -11682 -14135 -13969 -9058 -18743 -18194 -19297 -13770 -7895 -9936 -17820 -12364 -1257
2479 -1257 3101 -367 3586 10108 7925 -1703 -13554 -23446 -20234 -11884 -9039 -1700 16125 4951
2465 4951 -5440 5939 -314 4282 19957 9374 5797 10315 16698 -2806 -19722 -2566 2606
2452 2606 6720 3676 -1805 -17367 -12584 -5987 -6201 -4827 -1877 11650 11949 6948 2996 -4499 -4117
2437 -4117 -5520 -14821 -22423 -30083 -25051 -14576 -16995 -18735 -6963 3473 -5011 -7455 1543 7603
2423 7603 -7377 -26445 -27967 -27687 -16572 -14052 -9678 1750 8541 -135 10346 22565 3435
2410 3435 -2426 812 13409 10059 17312 14570 8866 592 -4368 5928 10172 -6259 -5111 -6239
2396 -6239 -9788 -2386 -7577 -3018 -6927 -1911 11564 5474 -17214 -10243 5496 6297 -14092 -12841
2382 -12841 -8137 -16826 -9780 -10768 -13426 -21095 -17706 8009 13712 -6316 -6875 53 636 2937 -6422
2367 -6422 -7139 -11454 -22389 -29314 -36193 -37155 -24338 -19272 -10578 -15828 -16258 -17291 -7732 3455 7414
2352 7414 920 -3833 -1585 -3752 761 -4781 -4716 6844 4977 12002 12395 18207 20460 15247 14838 5324
2336 5324 6876 -62 2447 5426 20214 16854 14086 14831 14269 21710 4156 -2618 2128 5848 14981
2321 14981 6612 6900 8392 5001 -8657 -8345 -741 8064 -2 -12827 -12797 -10154 -17089 -7665 -3319
2306 -3319 -1749 10827 3168 -5730 5604 8581 6913 -7683 -17883 -15902 -8580 -16228 -21862 -20422
2292 -20422 -8628 -2959 -11207 -4060 782 -5298 -7031 -1202 -10599 -6545 -5466 -4864 -3096 -5015 -3129
2277 -3129 -859 9528 14821 10080 -1029 4820 -2097 -627 -3788 -4486 8115 16438 12695 4719
2263 4719 -431 9369 3387 -2414 -1984 -10956 -26760 -38872 -24560 -19100 -18065 -15712 -19433 -28121
2249 -28121 -23372 -6027 -2827 -4223 -3051 254 -49 5272 7741 11937 -5667 -17154 -18949 -27028
2235 -27028 -34600 -30211 -14723 -16750 -11567 -3631 -8313 -14079 -22224 -15222 -24202 -21646 6873 11758
2221 11758 -587 1877 813 -3181 2675 16396 21142 17046 12027 14827 23716 25904 19008 13062
2207 13062 -2921 -8200 -6469 -3593 -1323 7751 5717 2966 8425 10919 8733 3331 7184 5711
2193 5711 9210 19975 33269 20864 4069 1822 -5165 9282 9256 -936 -12044 -9497 -5288 428
2179 428 2330 1309 3017 15184 25481 23532 8917 9515 10032 -2076 845 295 7237 2790 -3192
2164 -3192 3245 8243 18207 19069 20242 21901 25252 13806 7228 7689 10887 21317 28681 12957 -2578
2149 -2578 -10469 -11201 -631 240 -8123 -589 2298 379 -2363 3141 4989 -5908 866 -7367 -22414
2134 -22414 -27347 -12734 1742 1498 12422 9667 13689 21925 25060 15376 18687 13435 17979 25157
2120 25157 10764 2627 1247 2340 9200 2805 8109 7190 13004 21067 22530 16426 9738 -1999
2106 -1999 -12351 -5791 -11447 -13207 -8638 -5797 -6285 -6809 1177 -3177 2936 20663 14986 6166 11060
2091 11060 9660 22347 26154 19331 5258 8653 9392 10825 15606 17190 23175 23446 24066 18298 6360
2076 6360 -289 9793 16907 12641 10408 8837 5619 -689 -3168 2165 2397 8989 18052 22046 24991
2061 24991 21535 19216 13868 13335 17007 12221 11130 -9371 -12942 -13974 -6737 2785 3360 -4083 -10857
2046 -10857 -5051 2105 -3316 -1935 -10955 2008 210 3360 8569 10185 10002 6825 -4179 -2980
2032 -2980 6537 20064 25230 21063 19055 2358 -1189 -6284 396 -921 4363 -490 -6650 -1966
2018 -1966 10700 7821 4226 -12795 -15690 -7836 2059 -105 -6134 -21809 -28616 -19509 -12856 -6600
2004 -6600 1075 9495 6113 -3954 1755 13242 22459 7238 5060 -83 -15041 -19643 -9554 -871
1990 -871 483 8544 13758 5606 -5074 -8973 -24230 -15312 3259 -29 -13222 -25020 -25642 -16465
1976 -16465 -12660 -6922 -1752 -3757 10106 10325 14823 17309 10340 5745 -3358 -9482 -4925 -6082 -2068
1961 -2068 -13658 -28871 -23959 -22446 -30313 -32921 -29188 -21898 -11211 -12799 -4209 -2100 935 6797
1947 6797 8224 969 -1369 -421 -11481 -17686 -5565 -2127 -1120 -8836 -10267 -5086 -7274 -19482
1933 -19482 -22795 -9279 -2032 -8321 -12462 -4756 -7775 -9354 2730 723 4490 19865 25976 22448
1919 22448 10230 -1458 -9728 -4505 -3583 -3518 -9473 -14270 2105 7440 -958 -9442 -3594 -6781 -12514
1904 -12514 -9574 -12404 -8888 -4963 6145 11582 15945 12259 2611 -3632 1019 7281 8082 3373 -93
1889 -93 7708 16692 11828 10113 21658 23284 6825 3515 110 -10325 -9751 -11995 -6093 1122 7762
1874 7762 -212 -4582 -13741 -19252 -27981 -21814 -18375 -5858 5946 9503 1828 -9226 -9336 -16608
1860 -16608 -17325 -10785 -18951 -14811 -8192 -11586 -17329 -20969 -21576 -18057 -26810 -22292 -12569 -9476 57
1845 57 1472 -8191 -10185 -11577 -4800 -4292 -4879 5048 5051 9052 -1086 -14623 -24321 -24756 -25359 -22514 -24988
1828 -24988 -14544 -6845 -8411 -6980 -2559 -12697 -16289 -2874 2201 -85 -9250 -11230 7188 23126
1814 23126 13032 6564 9723 11602 9349 3878 -14274 -26468 -27788 -12383 -3699 -13837 -19410
1801 -19410 -17919 -1598 -510 -4757 -2068 7016 14720 5898 -2199 -11080 -3821 10328 22390 15175
1787 15175 65 4911 11022 2152 1622 -2969 -5969 8501 13719 5248 9961 5846 -40 -4179
1773 -4179 -364 7331 4715 713 5990 9620 1056 -12146 -2082 7873 4181 5883 13712 8204
1759 8204 -82 3042 12136 13881 3132 -2425 10329 7439 -7606 -18210 -20859 -22321 -12885 3302
1745 3302 16271 31215 37749 39375 19098 -1754 2016 -1214 -1965 1726 1724 2644 5937 17372 20716
1730 20716 8732 3274 -1497 12603 18958 20966 17678 11092 2568 -4697 2564 -7527 -10081 10728
1716 10728 14707 21289 13884 2280 -3257 -4325 -10424 -21581 -21054 -17142 -12452 -5545 8578 15114
1702 15114 8542 7167 4519 -390 -2390 17080 3941 -330 2471 15163 13401 5999 6486 6663
1688 6663 -176 -5818 -10706 -4979 -16485 -14450 -17805 -19309 -8620 -13005 -11829 5187 5381 -4673
1674 -4673 -7899 -7169 -3757 -1234 -1182 -1125 -3768 7091 5433 -5071 -4857 13148 15484 9466 1343 766
1658 766 9379 20843 17233 21250 15064 3455 -2380 2693 -5990 -564 -8085 -10207 -8073 -10194 -7020
1643 -7020 -2862 -7801 -16949 -12589 -2247 2421 -4549 -7825 -12848 -9096 -2154 -3714 -6655 -4952 -12325
1628 -12325 -12669 -14459 -11643 -2313 -6084 -11224 -13159 -22258 -24062 -31622 -21522 -1889 6461 4159
1614 4159 18456 28161 41562 41804 28859 20400 7664 -12360 -8763 5930 17739 14812 8615
1601 8615 5528 7398 1750 -2411 -4427 -603 -1095 19574 17500 4550 -3703 -713 -737 -252 -4002
1586 -4002 -17961 -22636 -233 7747 2683 -12007 -11839 -10287 -22415 -16806 -14770 -16232 -13604 -7779
1572 -7779 1216 -267 -3668 -3183 2858 14254 4688 1473 2725 3202 6418 -10422 -8995 -2852 10570
1557 10570 1805 5985 17874 29556 34861 42537 36361 29536 26168 29292 21824 10463 81 -2964
1543 -2964 -8098 -6947 7152 417 -5126 3268 -1554 -9736 1910 -6819 -3507 2227 6284 5637 11428
1528 11428 21911 11911 4254 1122 6830 9448 9464 6050 -6138 -2742 -7330 -17817 -27756 -18943
1514 -18943 -22326 -20494 -23540 -20371 -2269 6307 -11 -5916 10330 13944 7989 974 1836 7847
1500 7847 12792 9202 7451 -99 2326 6709 5552 12866 13649 345 -6290 -10735 -144 4819 1476
1485 1476 5736 3007 11948 8697 -2469 -2298 863 -387 -599 -107 1794 10064 12952 5700 2770
1470 2770 3920 3992 -6677 -4923 -12041 -22199 -30081 -18350 4445 18689 15424 -624 -5808 12179
1456 12179 17228 11393 8391 -11394 -11037 217 6390 3196 5693 3600 -548 4306 15049 21365
1442 21365 13844 4360 -1035 -9574 -1900 -4686 -18239 -20844 -10855 1286 -8352 -11932 -13572 -14566
1428 -14566 -11587 -7396 -8500 -12408 -6605 623 4518 -3298 -6856 -4724 1869 9849 5035 3312 -12309
1413 -12309 -13691 -1723 -6686 -14499 2756 16095 18737 6882 9230 5284 703 -6084 -9819 -19737
1399 -19737 -21025 -7475 7967 14090 9270 6919 9655 12094 3190 5409 6317 9938 10538 5611 3501
1384 3501 5808 12682 5876 1038 3948 -1736 -5880 -2736 -887 3830 1444 -1366 -16532 -20256 -13452
1369 -13452 2582 -160 -1721 8314 21962 14750 2052 6302 22035 18409 13536 19794 14350
1356 14350 19036 24454 22161 18322 14552 8156 9958 7028 5173 3919 2734 3717 5495 -2335 -5074
1341 -5074 -5856 8218 4650 8839 5788 -2785 -4550 2081 2729 15644 17736 11530 2078 3541 -5766
1326 -5766 -7397 -5236 2291 13554 17221 8319 -8464 -20451 -16020 -9886 -10993 -13130 -13787 -6475
1312 -6475 -2819 -3405 6091 5402 -1972 -23 7741 5993 9147 4120 -5996 -14516 -27395 -16768 -10396
1297 -10396 -19171 -18391 -16653 -13151 -6468 -11549 -13574 -9879 -6005 -10418 -4034 -2728 -3499 -8162 -5871
1282 -5871 -4896 -969 1344 8652 8696 8417 6952 6086 -4344 -727 -5917 -7429 -16537 -25617 -18788 -15371
1266 -15371 -18098 -8254 9105 9359 2693 -1740 -1755 3250 9113 132 4476 12947 11381 -1636 -22265
1251 -22265 -17962 -11631 -2241 2071 -11979 -7311 8248 9407 5167 13749 11691 9017 12546 8203
1237 8203 21436 7237 -192 6790 12069 8978 2907 -8051 -6633 3087 296 -5978 2156 17779
1223 17779 22139 24140 28117 32457 26684 7025 -2055 3429 17994 14183 16179 27761 26728 17399
1209 17399 12485 18989 6370 -9045 -7164 13819 21027 9617 1635 266 3707 5120 -2012 -11501
1195 -11501 -7960 -10872 -6196 -1140 -5597 -1628 -9115 -1167 5962 1089 -9993 2919 20729 18141
1181 18141 4368 4707 12073 9351 4382 1637 3892 -2521 -10421 -5021 -5146 -6698 2551 5581 8858
1166 8858 -1002 -14912 -26026 -28264 -29021 -27079 -37320 -27120 -11171 2057 3596 8736 17706 26768
1152 26768 20065 10408 1797 3680 3050 -3544 6250 5863 6726 633 7687 10981 760 2314 6677
1137 6677 -1671 9138 17962 14434 2907 -638 19895 23584 23567 15614 11735 1963 -4590 -1115 -7855
1122 -7855 -6747 -1253 -8187 2340 -2306 3841 -893 -2618 -7326 -8020 -2130 1791 -2515 4639 8507
1107 8507 20926 10300 -99 -6022 577 11308 3726 -7273 -12265 -2359 2503 3711 9163 5960
1093 5960 1050 6169 6672 -5172 -11850 4681 9870 11860 9521 -2528 -4006 -1113 8643 3857
1079 3857 1099 9680 12740 -13133 -25629 -18239 -10626 -9230 -8632 -7456 610 4489 -5347 -946 -1339
1064 -1339 -501 -11368 -15044 -16066 -13547 -8400 -8230 -7739 7463 12997 -4596 -7385 6092 5012 4541
1049 4541 -5652 -5763 -3420 -9900 -13552 -211 8058 -3107 -14657 -8026 -12853 -16546 -15026 10590
1035 10590 11116 9605 7019 -6692 -14716 -21903 -20510 -14535 925 -1484 -9092 -7969 -12224 -18182
1021 -18182 -1452 6703 -2362 -4680 4637 2778 -2065 -15838 -17109 53 717 4012 4991 6813
1007 6813 13212 7693 1441 1118 6448 5847 12018 23578 21465 8195 4 -6050 -6624 -8495 -8638
992 -8638 -997 -3573 -3010 3674 8883 15554 13209 -1020 -23 6170 9357 11023 11296 16812 28813
977 28813 35861 30652 5721 4526 8545 8522 4960 2385 2976 -3813 -75 2217 3068 9267 10725 4989
961 4989 -4296 -8110 -9157 -7217 -8442 -5845 -12600 -18218 -22506 -26150 -20915 -9683 -7170 -8510 -7870
946 -7870 4715 17611 24117 19300 22325 21409 19136 304 -2481 -2571 2646 6650 18948 27423 22801
931 22801 19192 24377 20772 2118 6542 18853 17334 7805 2018 -3061 7269 18337 16212 11654
917 11654 20030 32213 20891 9681 4380 1061 -6216 6074 7822 -8721 -5972 3103 -2030 -3619
903 -3619 1147 758 9184 14184 12043 16504 13390 -1434 4870 10012 4660 12617 11359 3159 2702
888 2702 12469 3164 -761 -3374 -3812 11941 10139 6224 8530 12150 11244 8298 6422 19909 9247
873 9247 2186 4067 9127 -1878 7155 5816 -5882 -8493 -9897 2027 1481 4954 9497 13088 17077
858 17077 8704 4132 375 9279 3962 -3644 -15719 -13898 -8560 -5913 -12089 -12098 -5103 2885 -3284
843 -3284 -11578 -3345 5423 2228 3330 6463 8218 12162 12215 14426 16132 17908 12067 899 5009
828 5009 5910 9200 15783 27985 22227 18027 13184 -4577 -7970 -196 -86 -4591 -16984 -19883 -16611
813 -16611 -8552 -5131 -8227 -10321 -8197 -11966 -11989 -4668 1683 4295 3151 2981 69 -9099 -5877 -7559
797 -7559 -3614 -5743 -1581 15822 25444 14868 6650 13615 -1472 -5249 -1511 -5426 -8815 -1297
783 -1297 6156 4391 -242 -1852 4546 253 -4069 -6467 9154 8897 12748 19258 27483 26524 27196 25443
767 25443 25110 19016 10851 3810 -8684 -9925 236 5660 2157 -2055 -3609 -19084 -35694 -36322
753 -36322 -36917 -25424 -11730 -13600 -13135 -15444 -16048 -16243 -17204 -829 15849 10833 2974 -176 -9557
738 -9557 -24374 -24417 -684 1537 5516 5500 13743 17550 21508 18759 12905 440 2771 -11702 -23883
723 -23883 -20197 -7455 9732 16615 28243 55294 69938 58932 55365 46010 27987 -651 -11840
710 -11840 -23348 -42558 -40212 -23093 -7736 -8686 -11732 2512 4040 2629 6830 10096 11958 21672
696 21672 16393 13216 8250 13948 21912 4894 -10013 -8624 -6201 1037 -4529 -15544 -9783 6934
682 6934 4124 7810 14609 20343 1594 -5980 -2614 9164 8093 -3541 -5273 2688 2583 -1718 -255
667 -255 2407 -2021 9977 2763 -11357 -18326 -17019 -17494 -9687 -2882 6653 19922 22371 4949 -6067
652 -6067 -5778 4936 10352 16581 12639 13588 1244 -2139 3519 3479 -5392 -15681 -18045 -20260 -12014
637 -12014 -7005 -9176 -8143 7774 11463 2801 -8409 -12112 -7416 -12717 -16614 -10664 -11876 334
623 334 -3820 -14206 -19891 7165 8303 -1062 4015 7287 -1496 4428 -133 -4315 -6325 -4146 -5553
608 -5553 -8862 -10885 -9465 -5973 -12438 -19465 -4220 4214 2275 -1400 -4049 562 602 886 6566 10432
592 10432 3577 9456 16833 16851 20449 16096 7564 3629 -591 -5724 -3382 286 10830 13964 -363
577 -363 -4318 -137 1735 6522 -7108 2624 18680 -1479 -16970 -21262 -24720 -22127 -13888 -6976
563 -6976 -6836 -11675 -9573 -5824 -4058 1976 7519 21824 13072 11731 3436 2842 11553 10182 25330
548 25330 19879 16649 197 -3487 -3458 -2650 -1250 -2638 3101 84 -3192 -230 6249 7758 13589
533 13589 20582 22470 28864 12221 2063 -7744 -10249 -9264 -3097 -140 -1382 4707 13239 7359 7104
518 7104 5873 -7697 1474 1275 4531 6891 12756 10354 -4286 -7982 -12774 -14713 -4704 5657
504 5657 5062 16398 16537 5239 10145 8059 -4558 -3035 6218 3900 4810 -2351 -14774 -12039 362
489 362 9222 4018 -1365 155 1746 6542 18256 24387 6301 -17375 -20221 -11488 -6721 -1217 -2377
474 -2377 -2793 19091 27322 6864 -2592 -10027 -11754 -8844 -384 -8125 -19904 -14316 -6038 -6973 -10850
459 -10850 -14405 -20503 -16867 -15302 -10804 -12785 -9209 4839 18801 12810 3213 -3090 -6207 -4324
445 -4324 -8963 -5033 3345 8863 4553 715 -4758 -11583 4478 1602 -6777 -9187 -155 886 2620
430 2620 -11366 -17194 -17742 -21667 -12178 -2594 17128 20438 21871 17369 958 -1525 -3229 -18253
416 -18253 -18745 -4660 4373 11088 15620 10956 6371 1041 -3480 -8480 -6502 5004 3486 1061 5847
401 5847 2568 -1279 6256 10422 3997 2591 20653 21592 9140 1535 14216 11984 10845 17692 16825
386 16825 18692 17066 11039 -1185 -3199 -8836 -14774 -4896 2565 -1393 7288 3474 1539 1342 934
371 934 10233 11374 12696 12770 6144 -3073 593 -4685 -2980 8790 15782 5483 -5604 -18997 -22921
356 -22921 -18610 -19381 -16172 -13207 -3130 2719 9537 14896 10192 19584 18125 15050 13854 2823 9319
341 9319 3022 -5607 -1842 -827 -4133 -22206 -19332 -2015 4735 5306 1073 -992 1210 -7003 -5179
326 -5179 -6339 -21913 -14963 2372 4556 -12623 -5516 3931 13122 15000 7303 7825 4453 3536 2010
311 2010 8585 18820 16919 10968 11483 23700 29023 32265 41239 36693 26579 22534 4999 5140 900
296 900 3035 6865 10973 14814 8303 3527 10885 19137 12647 5973 -6083 -9233 -7534 9171 10681
281 10681 3946 2697 6837 8430 -5219 -17208 -17200 -14564 -2145 4415 8821 13443 8094 5382 7806
266 7806 10064 16278 14208 8400 1261 -1048 -1880 -3231 -4429 -4631 -14284 -13726 -9944 -16049 -19217 -10372
250 -10372 -3270 2801 6125 10339 19038 15161 12330 15846 21808 22936 20929 12580 15335 3687 -506
235 -506 143 -106 9824 3162 -2815 4448 15264 16948 21492 6946 942 9633 24029 19583 7308
220 7308 4327 14770 6509 -5949 -14523 -16526 -12618 -2782 -791 -6821 -2291 -2361 -4837 -12054 -11862
205 -11862 -13526 -3771 8838 5901 8824 4926 6194 15086 22277 22504 22716 16002 8026 3055 6616
190 6616 -4914 -9464 -8146 -9146 -13336 -9054 1219 -6899 -11398 -8145 -1694 4597 8126 3780 -1544
175 -1544 -3222 -3258 -847 2026 3657 7434 12168 6416 14074 12401 13722 -152 -8015 -11213 -10169
160 -10169 -3544 -4795 -8434 -4530 8388 8664 930 -3780 -5338 -4421 6418 5969 -2171 -12483 -5807
145 -5807 -638 -4118 -1607 7759 850 4607 7071 2657 1835 3520 -1327 -8189 -6211 -1915 -4170
130 -4170 -4112 -3080 -14665 -20237 -9923 -1591 4253 8699 8753 910 -6110 -2373 270 -5612 -1845 -8763
114 -8763 1405 12591 15220 18422 13694 5848 9570 10033 3596 6042 1423 872 5103 13017 22265
99 22265 21933 16131 8405 5450 1378 1617 1659 3038 5139 7823 12237 14045 10186 6551 11965 13634
83 13634 12112 3870 3990 6193 1723 -5046 -7601 6906 4145 -5353 -6834 -5834 -10228 -8930 -17191
68 -17191 -6430 9094 10146 11133 4975 -2440 765 7720 12879 6564 4460 2297 26 -1083 -4488
53 -4488 -1013 10649 16604 17727 13678 8644 11808 8187 5559 6652 11112 15115 12845 8482 1499
38 1499 1631 11875 17718 7788 -5595 -2764 -10953 -8546 -10193 -9171 -6567 -1967 8564 11695 7659
23 7659 -5181 -4115 12409 21400 15332 19269 14383 13206 14385 5868 7161 6239 10739 7177 7532
8 7532 2020 -6954 2204 6489 -2042 -4890 -6846 -2680
0 -2680
$$ Imaginary data points
##PAGE= N=2
##DATA TABLE= (X++(I..I)), XYDATA
32767 78040 69481 65255 53996 51152 57925 67387 66543 62581 65213 61316 56371 61673 68043 75620
32753 75620 86942 92844 87650 86424 91535 99860 109651 114450 118293 116543 114331 113799 109619 95659
32739 95659 92190 101239 108705 110003 116982 118442 120872 126756 138265 138282 147518 151316 140116 136705
32725 136705 145785 147622 138545 142167 148003 147111 144669 140537 135074 134921 148684 153823 155266 162681
32711 162681 164619 164236 164585 163314 171722 171754 176248 181489 175865 169877 169089 180152 186456 192464 196769
32696 196769 190867 193205 192459 193086 188591 191279 196230 200149 204040 198871 200307 209299 213426 206967 210062
32681 210062 214175 206906 204677 208385 215268 222769 225713 230284 227942 218297 219084 225222 228912 233517
32667 233517 234721 242811 245282 246287 242426 246896 252073 258286 257833 253667 252722 252245 257261 267228 264594
32652 264594 256565 251694 257584 272566 262701 251238 247057 249290 256117 263376 266009 267638 269309 274672
32638 274672 277214 275632 271633 269213 269139 277329 282485 281819 278406 271209 276390 283784 286000 295206 290450
32623 290450 289457 300333 297399 293409 295712 297614 294250 292403 300089 309656 315275 318080 312647 296498
32609 296498 290399 290348 301553 317661 324278 323614 320184 327929 323265 307935 302532 308832 310724 308576
32595 308576 323105 324989 330895 328521 335928 342571 349434 346040 346846 349705 344602 337183 328328 339117
32581 339117 355028 357540 351883 358568 358805 355845 362949 376607 378346 370553 364357 353584 347094 353572
32567 353572 359526 366215 377180 372595 369502 368205 367663 368225 357419 353233 355355 366292 361938 371355
32553 371355 370351 374787 380690 371007 373907 387225 391830 397490 390327 376404 375766 387970 399084
32540 399084 408935 408889 412155 420179 416216 415116 414561 412578 410397 409794 400100 404224 412210 414001 412874
32525 412874 415988 416233 410742 415017 414909 415800 419341 421698 417432 415982 408850 412374 425283 423218 424559
32510 424559 431163 423657 429188 436776 432415 429439 438981 443267 440951 447651 449741 443237 451811 458422
32496 458422 452358 454152 449812 437084 439796 439432 435467 437756 443388 445656 446400 434809 453021 460351
$$ [...]
##END NTUPLES=NMR SPECTRUM
##END=
