##TITLE=XTC-814d_1
##JCAMPDX= 6.0         $$ Bruker NMR JCAMP-DX V2.0
##DATA TYPE= nD NMR SPECTRUM
##DATA CLASS= NTUPLES
##NUM DIM= 2
##ORIGIN= BRUKER
##OWNER= patiny
$$ 1.79 TOPSPIN		Version 3.0
$$ 2012-05-19 08:22:14.664 +0200  patiny@icmbsg005
$$ Compression mode = diff/dup
##.OBSERVE FREQUENCY= 400.13188181139
##.OBSERVE NUCLEUS= ^1H
##.ACQUISITION MODE= SIMULTANEOUS (DQD)
##.ACQUISITION SCHEME= Echo-Antiecho
##.AVERAGES= 2
##.DIGITISER RES= 23
##SPECTROMETER/DATA SYSTEM= spect
##.PULSE SEQUENCE= hsqcetgpsisp2.2
##.SOLVENT NAME= D2O
##.SHIFT REFERENCE= INTERNAL, D2O, 1, 11.697
##AUDIT TRAIL= $$ (NUMBER, WHEN, WHO, WHERE, PROCESS, VERSION, WHAT)
$$ ##TITLE= Audit trail, TOPSPIN		Version 3.0
$$ ##JCAMPDX= 5.01
$$ ##ORIGIN= Bruker BioSpin GmbH
$$ ##OWNER= patiny
$$ $$ /opt/data/patiny/nmr/XTC-814d_1/13/pdata/1/auditp.txt
$$ ##AUDIT TRAIL=  $$ (NUMBER, WHEN, WHO, WHERE, PROCESS, VERSION, WHAT)
(   1,<2012-05-19 08:22:13.486 +0200>,<patiny>,<icmbsg005>,<go>,<TOPSPIN 3.0>,
      <created by zg
	started at 2012-05-19 08:03:32.290 +0200,
	POWCHK enabled, PULCHK disabled,
       configuration hash MD5:
       77 C7 B7 C4 10 F4 BA 30 64 2E BB 52 82 F2 DA 41
       data hash MD5: 1K * 256
       62 7D 75 F6 46 35 DA 4B 92 4B 65 C6 DC 1F 24 47>)
(   2,<2012-05-19 08:22:13.584 +0200>,<patiny>,<icmbsg005>,<audit>,<TOPSPIN 3.0>,
      <user comment:
       ICON-NMR User ID: patiny
       data hash MD5: 1K * 256
       62 7D 75 F6 46 35 DA 4B 92 4B 65 C6 DC 1F 24 47>)
(   3,<2012-05-19 08:22:14.474 +0200>,<patiny>,<icmbsg005>,<proc2d>,<TOPSPIN 3.0>,
      <Start of raw data processing
       xfb same F2: SI = 1K WDW = 4 SSB = 2 FT_mod = 6 PKNL = 1 PHC0 = 0 PHC1 = 0 F1: SI = 1K ME_mod = 2 NCOEF = 32 WDW = 4 SSB = 2 FT_mod = 6
       data hash MD5: 1K * 1K
       87 75 29 F6 8C 0C C8 41 9C 5B 0A E0 5F 80 B6 24>)
(   4,<2012-05-19 08:22:14.568 +0200>,<patiny>,<icmbsg005>,<proc2d>,<TOPSPIN 3.0>,
      <abs2 F2: ABSG = 5 ABSF1 = 11.697 ABSF2 = -2.290992
       data hash MD5: 1K * 1K
       7B 56 E3 59 76 22 35 50 09 06 9E 67 32 EA 33 8A>)
(   5,<2012-05-19 08:22:14.655 +0200>,<patiny>,<icmbsg005>,<proc2d>,<TOPSPIN 3.0>,
      <abs1 F1: ABSG = 5 ABSF1 = 179.9984 ABSF2 = -40.017
       data hash MD5: 1K * 1K
       8A F3 76 BC 1D FD 1D 20 3F 85 73 F2 B8 B1 DC DA>)
$$ ##END=
$$ 
$$ $$ hash MD5
$$ $$ CF 34 C2 8A 18 B3 56 B0 7D DD 3E 7C 71 FF 60 1C
##$RELAX= 
##$RELAX= 
##$RELAX= 
##$RELAX= 
##$RELAX= 
##$RELAX= 
##$RELAX= 
##$RELAX= 
##$RELAX= 
##$RELAX= 
##$RELAX= 
$$ Bruker specific parameters
$$ --------------------------
##$DATPATH= </opt/data/patiny/nmr>
##$EXPNO= 13
##$NAME= <XTC-814d_1>
##$PROCNO= 1
##$ACQT0= 0
##$AMP= (0..31)
100 100 100 100 100 100 100 100 100 100 100 100 100 100 100 100 100 100
100 100 100 100 100 100 100 100 100 100 100 100 100 100
##$ANAVPT= -1
##$AQSEQ= 0
##$AQ_mod= 3
##$AUNM= <au_zg>
##$AUTOPOS= <16 >
##$BF1= 400.13
##$BF2= 100.612769
##$BF3= 400.13
##$BF4= 400.13
##$BF5= 400.13
##$BF6= 400.13
##$BF7= 400.13
##$BF8= 400.13
$$ [...]
##$REVERSE= no
##$SF= 400.13
##$SI= 1024
##$SIGF1= 11.697
##$SIGF2= -2.290992
##$SINO= 0
##$SIOLD= 1024
##$SPECTYP= <>
##$SREGLST= <13C.H2O+D2O>
##$SSB= 2
##$STSI= 1024
##$STSR= 0
##$SW_p= 5597.01492537312
##$SYMM= 0
##$S_DEV= 1667739
##$TDeff= 1024
##$TDoff= 0
##$TI= <>
##$TILT= no
##$TM1= 0
##$TM2= 0
##$TOPLEV= 100
##$USERP1= <>
##$USERP2= <>
##$USERP3= <>
##$USERP4= <>
##$USERP5= <>
##$WDW= 4
##$XDIM= 1024
##$YMAX_p= 83363669
##$YMIN_p= -398613120
##$CURPLOT= <Cups-PDF>
##$CURPRIN= <$Cups-PDF>
##$DFORMAT= <normdp>
##$LAYOUT= <+/2D_inv.xwp>
##$LFORMAT= <normlp>
##$PFORMAT= <normpl>
$$ Bruker specific parameters for F1
$$ ---------------------------------
##$ACQT0= 0
##$BF1= 100.612769
##$FnMODE= 6
##$NUC1= <13C>
##$O1= 7041.95747781
##$SFO1= 100.619810957478
##$SW= 220
##$SW_h= 22136.3584106452
##$TD= 256
##$ABSF1= 179.9984
##$ABSF2= -40.017
##$ABSG= 5
##$ABSL= 0
##$ALPHA= 0
##$AQORDER= 0
##$ASSFAC= 0
##$ASSFACI= 0
##$ASSFACX= 0
##$ASSWID= 0
##$AUNMP= <>
##$AXLEFT= 0
##$AXNAME= <F1>
##$AXNUC= <13C>
##$AXRIGHT= 0
##$AXTYPE= 0
##$AXUNIT= <>
##$AZFE= 0.1
##$AZFW= 0.5
##$BCFW= 0
##$BC_mod= 0
##$BYTORDP= 0
##$COROFFS= 0
##$CY= -3
##$DATMOD= 1
##$DC= 0
##$DFILT= <>
##$DTYPP= 0
##$ERETIC= no
##$F1P= 0
##$F2P= 0
##$FCOR= 0.5
##$FTSIZE= 1024
##$FT_mod= 6
##$GAMMA= 0
##$GB= 0
##$INTBC= 1
##$INTSCL= 1
##$ISEN= 128
##$LB= 0
##$LEV0= 0
##$LPBIN= 512
##$MAXI= 10000
##$MC2= 5
##$MEAN= 0
##$ME_mod= 2
##$MI= 1
##$NCOEF= 32
##$NC_proc= -11
##$NLEV= 6
##$NOISF1= 0
##$NOISF2= 0
##$NSP= 0
##$NTH_PI= 0
##$NZP= 0
##$OFFSET= 179.9984
##$PC= 4
##$PHC0= 0
##$PHC1= 0
##$PH_mod= 0
##$PKNL= no
##$PPARMOD= 1
##$PPDIAG= 0
##$PPIPTYP= 0
##$PPMPNUM= 100
##$PPRESOL= 1
##$PSCAL= 1
##$PSIGN= 0
##$PYNMP= <>
##$REVERSE= no
##$SF= 100.612769
##$SI= 1024
##$SIGF1= 179.9984
##$SIGF2= -40.017
##$SINO= 0
##$SIOLD= 1024
##$SPECTYP= <>
##$SREGLST= <>
##$SSB= 2
##$STSI= 1024
##$STSR= 0
##$SW_p= 22136.3584106452
##$SYMM= 0
##$S_DEV= 1667739
##$TDeff= 512
##$TDoff= 0
##$TI= <>
##$TILT= no
##$TM1= 0
##$TM2= 0
##$TOPLEV= 0
##$USERP1= <>
##$USERP2= <>
##$USERP3= <>
##$USERP4= <>
##$USERP5= <>
##$WDW= 4
##$XDIM= 128
##$YMAX_p= 83363669
##$YMIN_p= -398613120
$$ End of Bruker specific parameters
$$ ---------------------------------
##NTUPLES= nD NMR SPECTRUM
##VAR_NAME=  FREQUENCY1,    FREQUENCY2,      SPECTRUM
##SYMBOL=    F1,            F2,              Y
##.NUCLEUS=  13C,           1H
##VAR_TYPE=  INDEPENDENT,   INDEPENDENT,     DEPENDENT
##VAR_FORM=  AFFN,          AFFN,            ASDF
##VAR_DIM=   1024,          1024,            1024
##UNITS=     HZ,            HZ,              ARBITRARY UNITS
##FACTOR=    21.6175375103957, 5.46583488805969, 1
##FIRST=     18110.137220953, 5591.54909048506, 718220
##LAST=      -4004.60365218182, 0,           495452
##MIN=       -4004.60365218182, 0,           -398613120
##MAX=       18110.137220953, 5591.54909048506, 83363669
##PAGE= F1=18110.13722095
##FIRST=     18110.137220953, 5591.54909048506, 718220
##DATA TABLE= (F2++(Y..Y)), PROFILE
$$ [...]
##PAGE= F1=1572.7210255
##FIRST=     18110.137220953, 5591.54909048506, -1510668
##DATA TABLE= (F2++(Y..Y)), PROFILE
932B79579J758628G13032a675464l77946i76862A05441M56017j27772P8350Q48037
922A360073P23427K47259m71842F59560h09935m38196Q2641p21377L13570E22381
911A303345k61817G3287a81664H4160e55101j70950a56885D91762J344702Q60673
901B697137o50432r45803L69180n96277a322121n28923c49264A136282J473579
892B609861j29166j194697B97667c9218j104983j192783R29688A282540K138358
883C420898l65675A430771f84193j651752K28520M90013K28333j56038m82970
874b028087M84744A99009L02460i48840k811898o22842a610069A632154K637062
865D269216N62191j910215B38876a259570J18170A184613P55087C4198a825754
$$ y = [279579, 2038207, 713032, -1675464, -2053410, -976862, 105441, 561458, 433686, 512036, 1360073, 2083500, 2330759, 1858917, 659560, -809935, -1248131, -1165490, -1886867, -1573297, 522381, 1303345, 1041528, 73287, -181664, 84160, -555101, -726051, -156885, 491762, 1836464, 2697137, 2046705, 1100902, 1470082, 873805, -1322121, -1851044, -349264, 1136282, 2609861, 2480695, 1285998, 297667, -39218, -1144201, -2336984, -1407296, 1282540, 3420898, 3055223, 1430771, -684193, -2335945, -2107425, -1617412, -1389079, -1545117, -2028087, -1543343, 199009, 501469, -948840, -3760738, -4383580, -1610069, 1632154, 4269216, 4831407, 2921192, 238876, -1259570, -1141400, 1184613, 1939700, 34198, -1825754]
855b954994n46474J212727b56706B96917c03322E74526J664010o41316F99833
845A315163L69716N20484L25607I31745b023525j146646M58070R55946f17750
835g01257j244625K45598B93345Q64584C695a951837k082261N68718a069553a87383
824a641877k431167K55331i95165A753626J91567C81931G6952a023934j157718
815b181652a085672A386502Q76184r08973P9318m48882a491719q82023D19905
805A959506r01211j58561l33389A34424F6539a35676p46658C85822J656134L0001
795B071957r91323n27028a34990o00885r26507l03450f90429A499533K066172
786C565705n47386A215738B14906K65706J177840l31464h65677p87805f86736
$$ y = [-2954994, -3501468, -2288741, -256706, 296917, -303322, 574526, 2238536, 1597220, 699833, 1315163, 1684879, 2205363, 2530970, 931745, -2023525, -3170171, -2712101, -1756155, -617750, -701257, -1945882, -1700284, 293345, 1157929, 3695, -1951837, -4034098, -3465380, -1069553, -187383, -1641877, -4073044, -3817713, -995165, 1753626, 1945193, 381931, 76952, -1023934, -2181652, -1085672, 1386502, 2262686, 1353713, 1433031, 984149, -1491719, -2373742, 419905, 1959506, 1058295, 899734, 566345, 134424, 66539, -135676, -882334, 385822, 2041956, 2071957, 1080634, 553606, -134990, -735875, -1662382, -1965832, -690429, 1499533, 3565705, 3018319, 1215738, 214906, 480612, 1658452, 1326988, -865677, -1653482, -686736]
776H4779g93174j210905Q4472B14890Q69974a140960L09394B648845N24823B43686
765a096112b77752f0297l88245I04195J599713j169309a432869p37312a70200
755A892923r543H67782g29304j681987o05313J129142P66551a01128A958315l73291
745A585024G7524e92717b89038B77492K39344g13974j351629o61531k70515J137884
735a859765g35848E80085K102036q70650d84851j64280R1694o6450C02025J929834
725B231859k51290c1655n76739A196630Q73992q09557G5156J50869J399182E95818
714b233502k043918Q19817J711347e20638K46179H87482J021539r48517c13130
704e77182k94850n83389b86695C46414J18328J206622N62922E45544a199815n25061
$$ y = [84779, -793174, -2004079, -1919607, 214890, 1084864, -1140960, -831566, 2648845, 3173668, 243686, -1096112, -277752, -60297, -448542, 904195, 2503908, 1334599, -1432869, -2170181, -170200, 1892923, 1883380, 867782, -729304, -2411291, -3016604, -1887462, -1120911, -101128, 1958315, 1585024, 77524, -592717, -289038, 277492, 516836, -713974, -2065603, -2727134, -2997649, -1859765, -735848, 580085, 2682121, 1811471, -484851, -649131, -557437, -623887, 302025, 2231859, 1980569, -31655, -608394, 1196630, 2070622, 1261065, 75156, 226025, 1625207, 595818, -2233502, -4277420, -3457603, -1746256, -520638, -274459, 887482, 1909021, 960504, -313130, -577182, -872032, -1455421, -286695, 346414, 464742, 1671364, 2234286, 545544, -1199815, -1724876]
694a724876I8703K022150I89849b307287j903094N73939J694171j05988j60831
685b209090a011667J91772J17906A14814J423568K064778J958278j469769A470105
675H4157a961117k038910Q63769a109879A4557Q42666L5018d00626j525510L33450
665a592686i8283D6886f26550B69794M71754B33425a93993m82362j889181j395191
655c960727a944910A266819M88689E58924Q11432P20727p37019n02606O44038
646A495496k33127I0963f28326i8897A251285c20731l556000j112811a375458
636A923847E99685a033286C82541Q36841J329498J939736j198059G22202a404461
626b556083J076082b69976l55493C1978J5974a217084q77811a038875C66547q6761
$$ y = [-1724876, 98703, 2120853, 989849, -2307287, -4210381, -3636442, -1942271, -2048259, -2209090, -1011667, -819895, -701989, 114814, 1538382, 3603160, 5561438, 4091669, 1470105, 84157, -1961117, -4000027, -3136258, -1109879, 14557, 857223, 892241, -400626, -1926136, -1592686, -98283, 46886, -626550, 269794, 741548, 233425, -193993, -676355, -2565536, -3960727, -1944910, 1266819, 1755508, 558924, 1370356, 2091083, 1354064, 851458, 1495496, 1262369, 90963, -628326, -98897, 1251285, -320731, -3876731, -4989542, -1375458, 1923847, 599685, -1033286, 382541, 1219382, 2548880, 4488616, 3290557, 722202, -1404461, -2556083, -1480001, -269976, -625469, 31978, 47952, -1217084, -2094895, -1038875, 366547, 279786]
616B79786d58836R7849k43027l89878A390107K339371o10392l89658L4270j5321
606B748377r45873A44650J86918J014007c29924l573688j046647J027778J372439
597b550042i77891G00203B41944a531671K29327A42424J679562J649578R4525
588C566089A691052n42236N97138k06662F17913f5092j941771j391015O25123
579b772755J072883n2473j47578h28855K70652q55175J82043k43208m79139P35278
569a218404C39221M23924g64166a87599B320984j081738b081394m29026g35564
559A02724Q12186K134016N04708A370223a83137n4611i58k51412C82017Q52655
549A234672Q186K4911k11598g20520k973097M44916A92743R89208M332Q9860C7014
$$ y = [279786, -458836, -360987, -604014, -993892, 1390107, 3729478, 3119086, 2729428, 2763698, 2748377, 1802504, 144650, 331568, 1345575, -329924, -3903612, -4950259, -3922481, -2550042, -977891, 700203, 241944, -1531671, -1302344, 142424, 1821986, 3471564, 3566089, 1691052, 1148816, 1745954, 1539292, 617913, -65092, -2006863, -3397878, -2772755, -1699872, -1752345, -1899923, -828855, -558203, -1413378, -1231335, -1474543, -1953682, -1218404, 339221, 763145, -764166, -187599, 2320984, 1239246, -2081394, -2510420, -735564, 102724, 914910, 3048926, 3553634, 1370223, -183137, -237748, -958, -252370, 382017, 1234672, 1242858, 1267769, 1056171, -720520, -3693617, -3248701, 192743, 1181951, 1186283, 1276143, 37014]
537i32051c32320l43188k665797j988364J081290a736214A99900J360320K65214
528A825434q17494J020830O09189H98804h26839l22509B51417J948009M01356
519B600782k65699D91810a734409f26577A309693k62596f56876j562399l21349
510b540624Q83990e23885A603J72423O37831L06215B65649g64867c26241C92895
499H50408J25933j83851L49109P33642J9831D41849c215169m59179d10780G19383
488a158139j022281Q70902d24824D37370j11032E6275M17196Q91047L44338k1087
478A687769L23372M8724I20608f00116r47034j10466d55422A93846a311270n04317
468a815587L35428H8577J006636C39499h78009J5219L84686a89113A054883J266349
$$ y = [-932051, -332320, -675508, -3341305, -5329669, -4248379, -1736214, 199900, 1560220, 1825434, 1007940, 2028770, 2637959, 898804, -826839, -1149348, 251417, 2199426, 2600782, 2335083, 491810, -1734409, -626577, 1309693, 1047097, -656876, -2219275, -2540624, -1656634, -523885, 1603, 174026, 811857, 1118072, 265649, -764867, -326241, 392895, 850408, 976341, 792490, 1141599, 1875241, 1895072, 441849, -3215169, -3674348, -410780, 719383, -1158139, -2180420, -1309518, -424824, 437370, 326338, 56275, 473471, 1364518, 1708856, 1687769, 2011141, 2059865, 920608, -600116, -1547150, -1657616, -455422, 193846, -1311270, -1815587, -1480159, 88577, 1095213, 339499, -878009, -862790, -478104, -189113, 1054883, 2321232]
458B321232m96650h9523p20057D49686J144895D46137a611234m29073M37619g58464
447c34567p7607l06804j390855m34915e35642G95487E5612R8138Q50723m96942
437E07531L25749R89227J51025B15876a936826n96697M20384O60456e45302k12160
427g57462j573245K86978A246714K198216A586594g42656Q0336H26613J224452
418B051065J682007k14575A719610E5180a429837O80404I76657J138983P15425
409B831065o39257D45585a097834j034310K97842b99258D80298L87126J461900
400B329324J46943A190417F4407e35673D95650J148892k41915j91558O8913N41720
390A821702J522683m69595c24743j914726r3058N69246l21497l36681a199785
$$ y = [2321232, 1824582, -89523, -809580, 449686, 1594581, 446137, -1611234, -2040307, -1602688, -758464, -334567, -412174, -718978, -2109833, -2544748, -535642, 795487, 55612, 153750, 1004473, 507531, 833280, 1822507, 1973532, 215876, -1936826, -2533523, -2113139, -1452683, -545302, -757462, -2330707, -2043729, 1246714, 3444930, 1586594, -742656, -662320, 826613, 2051065, 3733072, 3518497, 1719610, 55180, -1429837, -749433, 976657, 2115640, 2831065, 2191808, 445585, -1097834, -2132144, -1834302, -299258, 480298, 867424, 2329324, 2476267, 1190417, 64407, -535673, 495650, 1644542, 1402627, 1211069, 1279982, 1821702, 3344385, 2874790, -324743, -2239469, -2332527, -1763281, -2084778, -2421459, -1199785]
380i3813q87576j509524o0973a183078c85023l288q40458j168699k25656P78907
370a844217l96290q93299h54875E71937f30332q78957g04246D26368J166194p7394
360A515168a63246L7666A184993l94331i3692n28360o52747j88189j027797k95536
350b786321J324360A244755K136557k19366A576220p84054C74670j24348J408644
341A658966N33361A061319k00646J268831o7252e88860k295687P27388O69145
332a488014o26592j99876l03281j231720m89727J662472E08628K312283M08727
323C229638p61800p91886D05884a86902n3692C25824Q32526l82735f24649m21331
313a045980A177304K014099m75406D04180g66641q76071k99308o97526j216688
$$ y = [-93813, -981389, -2490913, -2551886, -1183078, -385023, -388311, -1228769, -2397468, -2623124, -1844217, -2240507, -3133806, -854875, 571937, -630332, -1509289, -704246, 426368, 1592562, 1515168, -163246, -125580, 1184993, 790662, -93692, -622052, -1274799, -1462988, -2490785, -2786321, -1461961, 1244755, 3381312, 3161946, 1576220, 792166, 374670, 250322, 1658966, 2192327, 1061319, 860673, 2129504, 2062252, -588860, -2884547, -2157159, -1488014, -2114606, -2314482, -2617763, -3849483, -4339210, -2676738, 508628, 2820911, 3229638, 2467838, 1675952, 405884, -186902, -240594, 325824, 1158350, 775615, -624649, -1045980, 1177304, 3191403, 2715997, 404180, -766641, -1642712, -1942020, -2639546, -3856234]
304c856234N94601a095387M87137j008225g55431E73894B18012e1626B35728e27766
293b306988l04640J090469C38745J525909j26485n59919a64346j038371n50281
284a752998k95213g77531B37326a210547j345547l23196M08670N78159a74073
274A282503l41341J56242O52918N07363l656k54334l29706p76347k04934M39670
264A128378a051205n82842G479J072789J608040J764177L721160O974513J518686
255A6666844H225050D27753b361762n37750k84927M20379r93202L14601a001731
245a694379q92276J133402B85091J355103j61052K57634J807564P386A375478
235E16083O51917J598504M82926j398058b98855o88145L79626H14494N76930n86695
$$ y = [-3856234, -3261633, -1095387, -608250, -1616475, -755431, 573894, 218012, -51626, 235728, -527766, -2306988, -2611628, -1521159, 338745, 1864654, 1738169, 1178250, -164346, -1202717, -1752998, -2048211, -777531, 237326, -1210547, -2556094, -2879290, -2470620, -1892461, -174073, 1282503, 941162, 1097404, 1750322, 2257685, 2254029, 1999695, 1669989, 893642, 688708, 1128378, -1051205, -1634047, 7479, 1080268, 2688308, 4452485, 8173645, 15148158, 16666844, 8225050, 427753, -2361762, -2899512, -3184439, -2764060, -3757262, -3442661, -1001731, -1694379, -2586655, -1453253, 285091, 1640194, 1479142, 1736776, 3544340, 3551726, 1375478, 516083, 1168000, 2766504, 3249430, 1851372, -298855, -987000, -607374, 814494, 1391424, 804729]
225H04729O42082J229656R17143p83818C90656a589234P15242A68227d62840j968422
215b431262k190376J5028K100796J248757k32859k6444L08294L26238b35460I58012
204B414473I52811e65022L3320C82130L08688L74842j6613F132M03301J246686
194A656119o7k82693m61895E8242N97290J234700K99835m41257F18685a128472
183g48998B41056J40031a94589k29231j000993L16195F03849J111021B60561b422583
172b893123J063855c40532A757509J702726k17385F48267a446409d35829A627023
162E02541b218762o7502e68062k13167j708516O75557C08806K20199m1124L97014
152H84895e14864j19089B198005K150455r30839j235719K15959k64815E80088
$$ y = [804729, 1446811, 2676467, 3593610, 2809792, 390656, -1589234, -873992, 168227, -462840, -2431262, -4621638, -4606610, -2505814, -1257057, -1489916, -1516360, -1208066, -881828, -235460, 958012, 2414473, 952811, -565022, -531702, 382130, 690818, 1065660, 1049047, 6132, 409433, 1656119, 1656052, 1373359, 911464, 58242, 655532, 1890232, 2190067, 1748810, 618685, -1128472, -748998, 241056, 381087, -194589, -423820, -1424813, -1108618, 603849, 1714870, 260561, -2422583, -2893123, -1829268, -340532, 1757509, 3460235, 3242850, 648267, -1446409, -435829, 1627023, 502541, -2218762, -2286264, -568062, -781229, -2489745, -1814188, 308806, 529005, 487881, 884895, -514864, -633953, 2198005, 4348460, 3417621, 2181902, 2397861, 2133046, 580088]
142a058041r77932Q83137D81816a69917j554290K33436P9866N48779A915030P18413
132B633443e98064j873697L42284K38600g05851b71962n34580q33453n37740K33737
122a943998J50611B39029K831127q9345A452313K35989R74342O5407A358121a555500
111c997253N62231a267773L9717j079953p99956j143242n3981J578544g48820
101e07128j503209O57346D45369J166899l46085e29602j807363l98918P1741a212336
90D09881J032623L08315p29541A32573J863455k07611F63966O31030J833499M59228
80C587723L37922q68584j105698q91872c20848j748746l29769a014763H40372
70A124321d45183o04929K08738q25059f52279A991838O96253j62952l39662H69123
$$ y = [-1058041, -2035973, -1152836, 481816, -169917, -1724207, -1490771, -1410905, -862126, 1915030, 2633443, -598064, -2471761, -2129477, -1890877, -705851, -271962, -806542, -1639995, -2177735, -1943998, -1793387, 239029, 3070156, 2980811, 1452313, 1688302, 2662644, 2728051, 1358121, -1555500, -3997253, -3435022, -1267773, -1228056, -2308009, -3107965, -4251207, -4305188, -2726644, -748820, -507128, -2010337, -1352991, 445369, 1612268, 1266183, -529602, -2336965, -2735883, -2664142, -1212336, 409881, 1442504, 1750819, 1021278, 132573, 1996028, 1788417, 663966, 1294996, 3128495, 3587723, 3925645, 3057061, 1951363, 1059491, -320848, -2069594, -2399363, -1014763, 840372, 1124321, -445183, -1050112, -841374, -1666433, -652279, 1991838, 2688091, 2525139, 2185477, 869123]
59a172511j613099P06931b72336p51452j155852D9068J515099j72202j07236n42213
49G42516d19033j32663p0338c05575F15843J487747K19131A84928g00373H65590
38A801643H97533A37923f74933d9704B15907a653828k14105f61556j199068j861499
28c722123m16245k04972q41897Q55625J355857J348974b86247A320038J265168
19B585206H05009b017907j01206R32085n43613m66943N06258d37615A083789J31806
9A215595l07463J409701M66946A025928D32194J60946A62359d52914j227628
0a680542
$$ y = [-1172511, -2785610, -2078679, -272336, -1023788, -2179640, 49068, 1564167, 1391965, 1284729, 742516, -419033, -551696, -622034, -305575, 615843, 2103590, 2322721, 184928, -700373, 865590, 1801643, 897533, 137923, -674933, -49704, 215907, -1653828, -1867933, -661556, -1860624, -3722123, -4138368, -4343340, -5185237, -4329612, -2973755, -1624781, -286247, 1320038, 2585206, 805009, -2017907, -2119113, -1187028, -1730641, -2197584, -1691326, -437615, 1083789, 1215595, 908132, 2317833, 2784779, 1025928, 432194, 593140, 162359, -452914, -1680542]
##PAGE= F1=1551.10348799
##FIRST=     18110.137220953, 5591.54909048506, -1706802
##DATA TABLE= (F2++(Y..Y)), PROFILE
1023a706802K79093m400m12730Q59777A76593k0198F8301J236690L75658a548060
1012d592339J732265e19478a59457C68543K472914K066535N7589j412502B69452
1002b403406j100782M09783N49565a112758F83452K465424O02248j372011M59440
993B838553R20331j773427F74107e02669r39537O33128A495775J523188A380179
983b552563j354726J342195O44965d74272B153417K44326j013167j41756c22349
973a133462c82371A10299f26387R3106l4959l64495J28275A85599M49775i6350
962i30843q99798L22693I43536J430262n46345a167841l705059j423669J482485
953d814084J522748J520681C75366J795113j79426b73655k134776k25243d68091
$$ y = [-1706802, -1427709, -1432109, -1844839, -985062, 176593, 156395, 68301, 1304991, 1680649, -1548060, -4592339, -2860074, -519478, -159457, 368543, 2841457, 4907992, 4965581, 3553079, 269452, -2403406, -3504188, -3094405, -2544840, -1112758, 683452, 3148876, 3751124, 2379113, 2838553, 3758884, 1985457, 674107, -502669, -1442206, -809078, 1495775, 3018963, 1380179, -2552563, -3907289, -2565094, -1920129, -474272, 2153417, 2397743, 1384576, 1242820, -322349, -1133462, -382371, 110299, -626387, -533281, -568240, -932735, -804460, 185599, 635374, -96350, -930843, -1830641, -1507948, 943536, 2373798, 1827453, -1167841, -4872900, -6296569, -4814084, -3291336, -1770655, 375366, 2170479, 1991053, -273655, -2408431, -2633674, -468091]
943A418970M53734p47906A43302O24505K845488K129364r64775j856147H58642
933h15174G28799J950619I73798a638753o94461R13453b57831F141b59933E10796
922A213348m6330L50941J26205A55661a850676J49512e80841k60285j46168E78711
911A201310l00976B4727F749J17890i95217o67358h02483G57981J485424N00113
901B743518j181454B61002M09970R3522h03031k02543D03821R35225P82342l49048
891A772340D85119g07283L6888m84513j262324J25398A91101K879996K6558A174316
880h15430j036414O30393K41089k63170k08046o85022k20520i38845a77558j136336
870a313894l112120p06913a859127A995685K799319N66035j571870A043322a722942
$$ y = [1418970, 1872704, 1124798, 143302, 767807, 3613295, 5742659, 4777884, 2921737, 858642, -815174, 728799, 2679418, 973798, -1638753, -2333214, -1419761, -257831, 6141, -259933, 510796, 1213348, 1167018, 1517959, 1644164, 155661, -1850676, -1701164, -580841, -841126, -987294, 578711, 1201310, 900334, 24727, 6749, 124639, -995217, -1662575, -802483, 757981, 2243405, 2743518, 1562064, 261002, 670972, 764494, -803031, -1005574, 403821, 1339046, 2121388, 1772340, 485119, -707283, -670395, -1154908, -2417232, -2291834, 191101, 3071097, 3097655, 1174316, -815430, -1851844, -1221451, -980362, -1243532, -1451578, -2136600, -2357120, -938845, -177558, -1313894, -4426014, -5132927, -1859127, 1995685, 4795004, 5361039, 3789169, 1043322, -1722942]
860b230927H27740J347969B24761a753639j157778n10182O75288a126198c19791
850a05821A285086J197204A235428E98766J149054M79742k1261K00645j193224
841A213722a554538j218146L21117P02164M87517m07457q58503Q22064a67590
831b33713r58624p09829j310392l43533J722728c27300q02406j887148q4989a006722
820A630276N7067a15828A28698M6564d65993A4411J195692L10606D57090M4909
810E01999K70637f94977n76153F78267J236113o70920m5285C89819h72553m33231
800a305784J36125N8526I32061J669919o30788H07770C32783d52349m91988n35821
790a480158K03636C916J423021J467644j19094A261231C29822K91823R47813k44593
$$ y = [-2230927, 827740, 2175709, 224761, -1753639, -2911417, -3421599, -2746311, -1126198, -319791, -105821, 1285086, 2482290, 1235428, 598766, 1747820, 2227562, 2206301, 2406946, 1213722, -1554538, -2772684, -2451567, -1749403, -1261886, -1669343, -2527846, -1705782, -167590, -233713, -1192337, -1902166, -3212558, -3556091, -1833363, -327300, -1129706, -3016854, -3101843, -1006722, 1630276, 1687343, -115828, 128698, 175262, -465993, 14411, 1210103, 1520709, 457090, 501999, 772636, -694977, -1271130, 678267, 1914380, 1243460, 1198175, 389819, -872553, -1305784, -1169659, -1111133, 932061, 2601980, 1971192, 807770, 332783, -452349, -944337, -1480158, -1276522, 3916, 1426937, 2894581, 2775487, 1261231, 329822, 621645, 1569458, 1324865]
780A324865c30423l79577I19473R70741h3846k149564M55623E88971O90549d37022
769B44270K783079k54999d91736j674203P31602d40791B5094J153011J116474
760B294579j064621i71442p80378d17189A223657J3884E46923h45772j550108
751b395880l22231P70768M29257a87682A903191m89707D1977e44443a65169B23992
740h23135j886409j92164P08970O07651d52540g9946F40105J931135j254072a250547
729a361906R0700j92660A7995K185260j78213B0110a362250B0067K173786Q10609
719C004462j388247C56181M36615C37779a436421j954158L55197J417337f17170
709f14898F81524J456707n93498C49385p7824n8490g10898b89301C87559M56084
$$ y = [1324865, -330423, -710000, 919473, 1890214, -83846, -2233410, -1777787, 588971, 1279520, -437022, 244270, 3027349, 2772350, -491736, -2165939, -1434337, -440791, 25094, 1178105, 2294579, 1229958, -971442, -1751820, -417189, 1223657, 1237541, 546923, -845772, -2395880, -2718111, -1947343, -1518086, -187682, 1903191, 1413484, 41977, -544443, -165169, 223992, -823135, -2709544, -2901708, -2192738, -1585087, -452540, -79946, 640105, 2571240, 1317168, -1250547, -1361906, -1271206, -1463866, 17995, 2203255, 2025042, 20110, -1362250, 20067, 2193853, 3004462, 1616215, 356181, 792796, 337779, -1436421, -3390579, -3035382, -1618045, -617170, -614898, 681524, 2138231, 1544733, 349385, 271561, 213071, -710898, -289301, 387559, 843643]
699H43643J047309P74108j138080e55387j037133c42261A183686B30107b950939
689e163238Q47189a901173j06972q21922N22040J47255L11180d83025A334809
679C430911J704976j428115A063613b41114j320647j570160L00613J208445P54004
670h68859E79458R67548C87172a246743O01708G78394J50871j88895M49688C98563
659a243128N8747a07526r60094j689129i00294B007060j38042B53996P20328Q23252
649A797576k97933n4438M32623m33665D28789G637P03652J288656D48191b922866
638d588267a628795A666528n76675a13632A087055N84584J312565K008384r46185
629D046403A461417h48765j300365P37306e76221j40691C90765O38264A38623
$$ y = [843643, 1890952, 2665060, 1526980, -555387, -1592520, -342261, 1183686, 230107, -2950939, -5163238, -4316049, -1901173, -2008145, -2830067, -2308027, -2160772, -1849592, -483025, 1334809, 3430911, 5135887, 3707772, 1063613, -241114, -1561761, -3131921, -2831308, -1622863, -868859, 579458, 1547006, 387172, -1246743, -645035, 778394, 929265, 740370, 1190058, 398563, -1243128, -1184381, -107526, -1067620, -2756749, -900294, 2007060, 1869018, 253996, 974324, 1797576, 1499643, 1445205, 1877828, 1444163, 428789, 7637, 711289, 1999945, 448191, -2922866, -4588267, -1628795, 1666528, 1089853, -113632, 1087055, 1671639, 2984204, 4992588, 4046403, 1461417, -848765, -2149130, -1411824, -576221, -716912, 390765, 1029029, 138623]
619a243702R1144a30427E92380O74255N54319o09121D1861J617689K004788l30335
609C334003l55425r8981j53070j198263c02655C24209J993917j028563b108269
599d132213M49744J422904i40573D71147A09182a854674j24544e41978A545840
589C396046j78777A423276r7969R27703k58596p57361m27245a194935j605774
580b800709N92358R90562l25944n99415g89567B44088h76321j247665o93808N30813
570b286981c94069A396864m09581a527778g30985B317486I36810b953377j0228
561b963605b22436A068025R5978J448942N42527A524924a14403l07385D5664f71040
550g57154B74641K22147J95934K48746c10737k765580J14634B49057J138131k2583
$$ y = [-1243702, -1152558, -130427, 592380, 1266635, 1820954, 1211833, 41861, 1659550, 3664338, 3334003, 2978578, 2879597, 2726527, 1528264, -302655, 324209, 2318126, 1289563, -2108269, -4132213, -3682469, -2259565, -940573, 471147, 109182, -1854674, -1979218, -541978, 1545840, 3396046, 3217269, 1423276, 1325307, 2253010, 1994414, 1237053, 809808, -1194935, -2800709, -2208351, -1217789, -1543733, -2143148, -789567, 244088, -876321, -2123986, -2817794, -2286981, -394069, 1396864, 987283, -1527778, -730985, 2317486, 936810, -2953377, -2963605, -222436, 1068025, 1164003, 2612945, 3155472, 1524924, -114403, -421788, 45664, -671040, -757154, 274641, 496788, 692722, 941468, -310737, -3076317, -2961683, 249057, 1387188, 1364605]
540A364605O053A32637i72543M15897m52774k391853j157084J741597f44823F92606
529A535306N791p33514J888733J716022j715164E90150P0806J703788O01121r64410
519B001455n36208C91380g99443H00317J528640o76007a90192j630319l38466
510b158977h79697F84918J02394a76213O9225C83140H6812f58621J62852J31111
500c64658j9662a21427C51522N45712q5023C77337a287735l261869r17558b211761
489c89723l04126k71384J12509c91535I31685o0270b32439n4069A008428J029812
479B038240L74128J89248k05682A068075b05566q60702k34205b91088G13606g96729
468a615672g33405A340267P61670I00870d10818a65866C04459m8180J150560J825805
$$ y = [1364605, 1370658, 132637, -972543, -556646, -1009420, -3401273, -4558357, -2816760, -644823, 692606, 1535306, 1541097, 807583, 2696316, 4412338, 2697174, 590150, 660956, 2364744, 2965865, 2001455, 1465247, 391380, -799443, 800317, 2328957, 1652950, -190192, -1820511, -2158977, -879697, 684918, 787312, -176213, -106988, 383140, 86812, -658621, -495769, -364658, -384320, -121427, 351522, 897234, 812211, 377337, -1287735, -4549604, -5467162, -2211761, -389723, -693849, -965233, -852724, -391535, 931685, 871415, -232439, -286508, 1008428, 2038240, 2412368, 2601616, 2395934, 1068075, -205566, -1066268, -1300473, -291088, 713606, -796729, -1615672, -733405, 1340267, 2101937, 900870, -410818, -165866, 304459, 256279, 1406839, 3232644]
458C232644m44923A21734a048637B56713Q45027b43802j679643K6282L05505g92978
447i86136K72123b06537j197914j237006J182807B05035K26592K69827P56390
438A457844K13171K11737P08240m80608e42708k280311K82455Q11257P15062C53297
427f7210k136311N15831A851738J397183G32864g31652H94141M52950m03672K132157
417C075576N68639j610766A35282a287491J4560b08235I25230Q25956k50732C28707
406f63181l55367d89946a82076j49640G69775K177830m41751E68577d2451B4368
395G91683J660693O68514p81676j140677L73876J317808p63246i71349j588632
386b559981j02803N89632K86719m22001P00015a2964o75322k592156q11665a899395
$$ y = [3232644, 2787721, 121734, -1048637, 256713, 1101740, -243802, -1923445, -1897163, -1591658, -792978, -986136, -714013, -206537, -1404451, -2641457, -1458650, 205035, 431627, 701454, 1457844, 1671015, 1882752, 2590992, 2110384, -542708, -2823019, -2540564, -1729307, -1014245, 353297, -67210, -2203521, -1687690, 1851738, 3248921, 732864, -731652, 894141, 1347091, 943419, 3075576, 3644215, 2033449, 135282, -1287491, -1272931, -208235, 925230, 1751186, 1500454, 328707, -663181, -1018548, -489946, -182076, -331716, 769775, 2947605, 2505854, 568577, -42451, 24368, 791683, 2452376, 3120890, 2339214, 1198537, 1572413, 2890221, 2126975, -971349, -2559981, -2662784, -2073152, -1786433, -2208434, -1508419, -12964, -688286, -3280442, -4092107, -1899395]
375g43672p1753l31600r80682n55750O32454o99466j599977a983550I41110j64956
365G76154e96136a60811A170998N51118l73168e02295m37749D28883O03384J96733
355A229000C41638a471246l63808r07617j040880Q43101a42513B540545M71990
346C012535r43342r03281I1921f88596C59026Q23133l70569J69704O93101n25220
336A149175a593363k164461J214408a227264m75592n88201n83835j163963K22515
327c816340a856401D68976J229873j12110n54783I2687a129933m34910n6846M31394
317a190295N08787j69115k83579L84395A243448J773063l15397I78882b81251
307b196292o10437L19905m99256L61091M13408q53466j055341R3478J954402g60978
$$ y = [-743672, -815425, -1147025, -2127707, -2683457, -2051003, -2750469, -4350446, -1983550, 941110, 776154, -596136, -160811, 1170998, 1722116, 1348948, -502295, -940044, 428883, 1032267, 1229000, 341638, -1471246, -1835054, -2742671, -3783551, -2940450, -142513, 2540545, 3012535, 2069193, 1165912, 91921, -688596, 359026, 1182159, 811590, 981294, 1674395, 1149175, -1593363, -3757824, -2543416, -1227264, -1702856, -2291057, -2874892, -4038855, -3816340, -1856401, 468976, 1698849, 1586739, 1031956, 92687, -1129933, -1564843, -1621689, -1190295, -681508, -850623, -1134202, -749807, 1243448, 3016511, 2701114, 978882, -281251, -2196292, -2806729, -2486824, -2986080, -2624989, -2211581, -3065047, -4120388, -4026910, -2072508, -760978]
296I9093K04386g94686k252824q98262N27057a356734F97085j80616d27978j189256
286a617234m16444o00642o65325J080322P18652j596046p33286k9333O30180P5220
276c153936J282925B63171M78936a88605o16810E8818R50367B00762h25613O1726
266g63887a30502o96705l067457j026172Q46926Q45821N73761j012007m387755
257h054090q784540p558826O360772c812616D733877B163309r18704J435131A192374
247H25437J289970H25338d42666C88359J993498J565663m83392j39791J488704
238D813041j87399j591039j201968K38501K010841K73861j916430A176865m52279
229G24586C32467J671792J616140r47999l09809J014510J173182k59139A958267
$$ y = [99093, 303479, -794686, -3047510, -3945772, -3418715, -1356734, 697085, 516469, -427978, -1617234, -2033678, -2634320, -3299645, -2219323, -1500671, -3096717, -3830003, -3859336, -3229156, -3153936, -1871011, 263171, 742107, -188605, -805415, 58818, 1009185, 200762, -825613, -763887, -130502, -827207, -3894664, -4920836, -4073910, -3228089, -2654328, -3666335, -8054090, -16838630, -24397456, -18036684, -3812616, 4733877, 2163309, 1244605, 2679736, 1192374, 825437, 2115407, 825338, -442666, 388359, 2381857, 3947520, 3464128, 3324337, 4813041, 4625642, 3034603, 1832635, 2071136, 4081977, 4355838, 2439408, 1176865, 724586, 332467, 2004259, 3620399, 2672400, 2362591, 3377101, 4550283, 4291144, 1958267]
219g54094L8868F57361J92359e32758j921744j735c32347G27371k51331B36800
208D26606J26878M38374J612111J880462j318297A287607m94068K9723r5010J84512
198I12764C71929e66041G16783J689038l38321n17288o25468b53460D05522J387625
188A793147k07427m5231J90689E60315j26399K33960k86211A2348a84832j476734
178a661566J17987A099987K099518j248148a405904j005814J027287E81908J836550
169B418458M75400r67982b15981j435802a02138B332350H90411b143115K96768
160a846347H5052b95382j998594K00229a03250C42528N6906Q97900F22675A05795
149A682727J911547j4990k97077P99438L44391B094654a210104k573848L51316
$$ y = [-754094, -715226, 657361, 849720, -532758, -2454502, -2456237, -332347, 727371, 476040, 236800, 426606, 553484, 991858, 2603969, 4484431, 3166134, 1287607, 793539, 823262, 728252, 912764, 371929, -566041, 716783, 2405821, 2067500, 1550212, 924744, -253460, 405522, 1793147, 1585720, 1540489, 1731178, 560315, 433916, 667876, 381665, 12348, -184832, -1661566, -1543579, 1099987, 3199505, 1951357, -1405904, -2411718, -1384431, 581908, 2418458, 2893858, 1925876, -215981, -1651783, -102138, 2332350, 890411, -2143115, -1846347, 85052, -295382, -2293976, -2093747, -103250, 342528, 399434, 1297334, 622675, 105795, 1682727, 3594274, 3579284, 3282207, 4081645, 4426036, 2094654, -1210104, -3783952, -3432636]
140c432636h58215P2824j302322L4236k2743M56594H81319J402837a07711k187778
130b295489j74513N94816e50692J91242l38019o70616n83093Q23468e31738A097322
119C242730j96370j411281j78575Q60137L21976F93361c377044l014782J067826
110e324000b622039K45762j309192j258583m75770J201250K037657c27775k17020
101e44795k316526P87692H32793J709526q50636g46818k332808p58282J45023
92c692885a637036I81804J276650m80559E35339b22426A248910n76845a35108
82A625523K295727K98197j12898m69842r66404p96566q26148d04331j025141f76265
71A555459N96889A31358c73196F25021a46790c9854A842501K92253n04348m07895
$$ y = [-3432636, -858215, -785391, -2087713, -2053477, -2076220, -1619626, 881319, 2284156, -107711, -2295489, -2470002, -1875186, -550692, -359450, -697469, -1368085, -1951178, -1127710, -531738, 1097322, 3242730, 3046360, 1635079, 1456504, 2316641, 2638617, 693361, -3377044, -6391826, -5324000, -2622039, -2376277, -3685469, -4944052, -5419822, -4218572, -2180915, -327775, -544795, -2861321, -2073629, 832793, 2542319, 1691683, -746818, -3079626, -3837908, -3692885, -1637036, 981804, 2258454, 1777895, 535339, -222426, 1248910, 672065, -135108, 1625523, 3921250, 4219447, 4106549, 3636707, 2670303, 1873737, 1047589, -404331, -1429472, -676265, 1555459, 2152348, 131358, -373196, 625021, -146790, -39854, 1842501, 2134754, 1630406, 1222511]
61A222511D3351a961591j671022J194031b7401p46355j592893D49052K435703
52B884755q26674p85735j26086B02134i540m95476k15954a67627A548371L88420
42A936791c93049p88747A164596J333880j023233E42683g46555r6424J72485j397152
32b067646Q22534B52812g31739j910786r77569q33342r29431O18274J295569J212241
22b256783h94550H40799J354306F19300a769092j84263N88720m51156l9805N38188
12a317408L21730b97135a33040A48968K379559J146093A837040m10921q9116B48038
1f80329j181741
0a862070
$$ y = [1222511, 43351, -1961591, -3632613, -2438582, -27401, -773756, -2366649, 449052, 2884755, 2058081, 1272346, 1146260, 202134, -9540, -505016, -720970, -167627, 1548371, 1936791, -393049, -1181796, 1164596, 2498476, 1475243, 542683, -746555, -842979, -670494, -2067646, -1245112, 252812, -731739, -2642525, -3620094, -4453436, -5382867, -4764593, -3469024, -2256783, -894550, 840799, 2195105, 619300, -1769092, -1953355, -1364635, -1815791, -1855596, -1317408, -995678, -297135, -133040, 148968, 2528527, 3674620, 1837040, 1426119, 1337003, 248038, -680329, -1862070]
##PAGE= F1=1529.485950479
##FIRST=     18110.137220953, 5591.54909048506, -1535447
##DATA TABLE= (F2++(Y..Y)), PROFILE
1023a535447l8519p41148m65153a261262D61873L16534j92020P62198K8405a456024
1012d223773J188633g41623a47239B92484K321607J664464n31552j334254F169
1002a735038j300655l00791J067764a39401A572615K299844N08344j541240r7466
993B742097P20175j427509H15560c37048q41976b7279B851633J459192k101634
984B209191b025154j268260J622892g77288f5259A862788P04365k03437l3465
975B330251F76401b73773B52585A14903a596513o27656Q62228f68089k6183C53734
964A168532D15201a29438m96597l42654A03025J106292K72930g93037l084851
955c877888q02205J449713J248635R88607I54547J613425l71483B36059a753265
$$ y = [-1535447, -1573966, -2315114, -2780267, -1261262, 461873, 778407, 586387, 1348585, 1376990, -1456024, -4223773, -3035140, -741623, -147239, 292484, 2614091, 4278555, 3747003, 2412749, 6169, -1735038, -3035693, -3336484, -2268720, -139401, 1572615, 3872459, 4380803, 2839563, 2742097, 3462272, 2034763, 815560, -337048, -1179024, -27279, 2851633, 4310825, 2209191, -2025154, -3293414, -1670522, -777288, -65259, 1862788, 2567153, 2363716, 2330251, 676401, -273773, 252585, 114903, -1596513, -2224169, -1361941, -668089, -694272, 353734, 1168532, 415201, -129438, -626035, -968689, 103025, 1209317, 1482247, -793037, -3877888, -4680093, -3230380, -1981745, -993138, 954547, 2567972, 2196489, 236059, -1753265]
945a743383G68466J630707m90261G32464A74720Q53838K498637J369134j305915
936C590414A286331h94649p63356G79186K372865j530296i98912j130704O02805
927a526811d64170k14872j93904F34002N95290E27830M27960N50547a53532k418459
917b571991N38813D2486L53108a12974G76468L64794m72143a75837C3688L3802
907F7490a253604j091235P77973E52583J686007K23968H76169d53340a71232C72190
896c66382e4502A282811K97733J07105l43226A11790a452553n9313P2363r11337
886b350840k88296e55387B498709J44863E97321i42414k35866c15511j23317n99049
876a037877r9325m16903r05385M46428Q46780l57865k844716r95311b164376A837022
$$ y = [-1743383, 768466, 2399173, 1908912, 732464, 174720, 1028558, 3527195, 4896329, 3590414, 1286331, -894649, -1658005, 779186, 3152051, 1621755, -998912, -2129616, -1526811, -464170, -679042, -872946, 634002, 1229292, 527830, 955790, 1506337, -153532, -2571991, -2033178, 42486, 395594, -112974, 776468, 1141262, 669119, -175837, 33688, 67490, -1253604, -2344839, -1566866, 552583, 2238590, 2462558, 876169, -453340, -171232, 372190, -366382, -54502, 1282811, 1580544, 1687649, 1344423, 111790, -1452553, -1511866, -1439503, -2350840, -2639136, -555387, 2498709, 2643572, 597321, -942414, -1178280, -315511, -438828, -1037877, -1137202, -1554105, -2459490, -2013062, -1166282, -1524147, -4368863, -5364174, -2164376, 1837022]
865D345516O03196p67977A662248b076406r99208D16811J869002F20568a071907
855b161664q90941M1223J326115f89105a89A705409O14181G44275B79759J389613
845A669372O34560k28069J24590p88606i90491j390252K75494N13573l77380p50004
835b719060k09500J335985P76754q92718n36043L58829p52260q52880J177181
826b313712e59993m39231j052393J85086f58298A178824l69140g87967A19328
816A224447k08618r0244J01163k52301c70248o2496E00897I1531b90781E83272
805A591171j01609M9055A11823a798505n77871M05208Q40034A448362J339365
796B787727j344000G4556c75223o57208l4384O8436d51770F36729N17474O00690
$$ y = [4345516, 4948712, 4180735, 1662248, -2076406, -3075614, 416811, 2285813, 620568, -1071907, -2161664, -3052605, -3011382, -1685267, -689105, -189, 1705409, 2319590, 744275, 279759, 1669372, 2303932, 2075863, 2200453, 1411847, -990491, -2380743, -2105249, -1591676, -1969056, -2719060, -2928560, -1592575, -815821, -1708539, -2244582, -1885753, -2638013, -3490893, -2313712, -559993, -999224, -2051617, -1866531, -658298, 1178824, 809684, -787967, 119328, 1224447, 1015829, 925585, 1026748, 774447, -370248, -432744, 500897, 91531, -290781, 583272, 1591171, 1489562, 1538617, 111823, -1798505, -2376376, -1971168, -1131134, 1448362, 2787727, 1443727, 74556, -375223, -1032431, -1066815, -998379, -451770, 636729, 1154203, 1754893]
786A754893K36588H69616A07526M36394P15137m8400C99995J79815J963998P62983
776C306791D13103b238217Q37292F35293L20606A86459J079442J684393j114313
767A835981a203853j493831P44745e58508C47588P53683M89057o68576b25008
757h03209b28590E08303k45434I575h40934j088560k89008q6163J33631d63288
746A342809o18778b32495k39066K27014G3670a405689j946239L27877J503376
737a520675a89807H94460m1008J07637J233429G68998a685920l13587L7641j26629
727b088495b23744A884942k90599a71292k001259O48127A833001K359282j574408
718B617875B32202b93107f0478n51837j731644k54168J002381e45178p1278D67461
$$ y = [1754893, 1991481, 869616, 107526, 543920, 1259057, 1210657, 399995, 579810, 2543808, 3306791, 413103, -2238217, -1400925, 635293, 955899, 186459, 1265901, 2950294, 1835981, -1203853, -2697684, -1952939, -558508, 347588, 1101271, 1590328, 921752, -225008, -803209, -228590, 508303, 262869, 9575, -840934, -1929494, -2218502, -2304665, -2171034, -463288, 1342809, 724031, -232495, -471561, -244547, 73670, -1405689, -3351928, -3024051, -1520675, -189807, 894460, 853452, 961089, 2194518, 768998, -1685920, -1999507, -1961866, -2088495, -223744, 1884942, 1594343, -171292, -2172551, -1524424, 1833001, 4192283, 2617875, 232202, -293107, -60478, -612315, -2343959, -2598127, -1595746, -545178, -616456, 467461]
707B081287R9666q63377j04871J49653D44504A32475N67074N12796M93284P62478
697B468107l62056A36719a307348M16120a97586m59924k336144k235456R43725
688d285385a483449k51088j645805p4206L5437M24634a086910A007763J744616
679B752379R92287j292282B37057i54063p53879r62479j66574M70070N80484I2647
668A699070E20319a247269a69900A807164M64671j71641o25534c55536k207068
659b562604O36494D19390J16497a348106a4167B336917o01380a24245D07224O95056
649A102280j7535M02911M66030l98133o56982k12455M26431J048500I49661a818857
638c570251a572338A282598M02389p99586N24773L08826J390151J869711n21894
$$ y = [2081287, 2180953, 1317576, 1212705, 1362358, 444504, 132475, 699549, 1212345, 1705629, 2468107, 2106051, 136719, -1307348, -891228, -197586, -657510, -2993654, -5229110, -4285385, -1483449, -1734537, -3380342, -3454548, -3419111, -2994477, -1086910, 1007763, 2752379, 3744666, 2452384, 237057, -954063, -1707942, -2670421, -2836995, -2366925, -1786441, 92647, 1699070, 520319, -1247269, -169900, 1807164, 2271835, 2100194, 1474660, -355536, -2562604, -1926110, 419390, 535887, -1348106, -14167, 2336917, 1735537, -124245, 407224, 1102280, 1084745, 1487656, 1953686, 1555553, 898571, 686116, 1112547, 2161047, 949661, -1818857, -3570251, -1572338, 1282598, 1684987, 885401, 1410174, 1719000, 3109151, 4978862, 4456968]
629D456968k208293f7798j374337K87757K36528L9866F15214J357145l49485B1462
618a066186J51230D76975K255136J180202j081131I44009O83822J459126p9451
609C007506k65571K5174j01652A246631f48847A56326K603094k73316C9231b414431
598b868482J058783f12674E55011d7583k101948m12075a182008A221504J786770
589C008274o95927G22466L43543J460090j09372p41511l34213c59588j615761
580a975349L64546f21222m72413j278404a034957G59948c70775k619597j161310
571d151682J450012B05159K131657q00574a665216O01932A925170E98010c083877
561b921786A09948J565410n73828N41445Q35199m86462B31850f91479a1836p27061
$$ y = [4456968, 2248675, -67798, -1442135, -1154378, -917850, -877984, 615214, 1972359, 1622874, 21462, -1066186, -914956, 476975, 2732111, 3912313, 2831182, 944009, 1627831, 3086957, 3007506, 2741935, 2767109, 2665457, 1246631, -648847, 156326, 2759420, 2486104, 39231, -2414431, -2868482, -1809699, -612674, 555011, -47583, -2149531, -2561606, -1182008, 1221504, 3008274, 2312347, 722466, 1066009, 2526099, 2416727, 1675216, 1341003, -359588, -1975349, -1610803, -621222, -1093635, -2372039, -1034957, 759948, -370775, -2990372, -4151682, -2701670, 205159, 2336816, 1536242, -1665216, -1063284, 1925170, 598010, -3083877, -2921786, 109948, 1675358, 1101530, 1642975, 2478174, 1991712, 231850, -691479, -11836, -738897]
551g38897j082549O24435N63929g9643H00715C30382a972576q8520F50039Q38093
541A488132j95850P5295C43404h49909K62956k49498j575314o18435a406339C39858
530I79942Q5351l98246C07229K729384K872183j414263A947470M02561K032609
521D382640o78729A534314p59859l62724P184J809022Q91846j064761C49472a051561
510a342834b0253A691748m4307a54927r56524L920k3067J11023L02658n57695
500a274612n24797Q09346C32577M34313d47861j347371j703826j630380j90623
491e320061K594378a144305a18403F09947B15128m5595J289862m4197a90279n19883
481g10162G27135J730637P69066l11592q79360H69087A57909e12778m05294d4808
$$ y = [-738897, -1821446, -1197011, -633082, -79643, 800715, 330382, -1972576, -2061096, 650039, 1488132, 1292282, 1367577, 343404, -849909, -586953, -836451, -2411765, -3030200, -1406339, 339858, 979942, 1065293, 667047, 307229, 3036613, 5908796, 4494533, 1947470, 2350031, 4382640, 3703911, 1534314, 774455, 411731, 418915, 2227937, 3119783, 2055022, 349472, -1051561, -1342834, -20253, 1691748, 1647441, -154927, -1111451, -1107531, -1130598, -1019575, -716917, -1274612, -1799409, -990063, 332577, 766890, -447861, -1795232, -3499058, -5129438, -5320061, -2725683, -1144305, -118403, 609947, 215128, 169533, 1459395, 1415198, -190279, -710162, 727135, 2457772, 3226838, 2915246, 2035886, 869087, 157909, -512778, -918072, -44808]
470H96919f22138j152315a78420B245678L37296A151820E6844P21111P64293l87837
460A154411O75077J913821l22368E44713i16168B76836N68023d70674j292845
451a763519K73390L13970b47727o59935K69533E04255b92532j749110K74810f3049
440H01375L7758N13755J081932J72450K46257j046551a473398k126727J226216
431b373909a058492a98550A357767E51723a752589P57327B309889M03953a61106
421f82103B063154m28222e31253A194795J282654n17292C51968h86428p26571
412a612999M12909g1232F01015k53800b75930j11055B5715N53649b64150r06103
402a170253D74202K703629p46454B9546b34843C89773P28481K182443J475325
$$ y = [896919, -622138, -1774453, -178420, 2245678, 2582974, 1151820, 56844, 777955, 1542248, 1154411, 1829488, 3743309, 3420941, 544713, -916168, 276836, 844859, -470674, -1763519, -1490129, -1176159, -247727, -907662, -638129, 504255, -292532, -2041642, -1766832, -63049, 801375, 839133, 1352888, 2434820, 2607270, 2853527, 1806976, -1473398, -3600125, -2373909, -1058492, -198550, 1357767, 551723, -1752589, -995262, 2309889, 2713842, -161106, -682103, 2063154, 1634932, -531253, 1194795, 2477449, 1960157, 351968, -886428, -1612999, -1200090, -71232, 601015, 347215, -275930, -386985, 25715, 579364, -264150, -1170253, 474202, 3177831, 2431377, 29546, -234843, 389773, 1118254, 3300697, 4776022]
393D776022j357232A085088q6009R94805o90029a320246j303307j40569K98330
384b465792O33036l00545N30541E25700H995c632474j412601b366994J125656
375a241338j69383K73608n88365q68850N30782n70697j998902J846943A189834
365B128037B83166I3499J619412J88976H99551a064320m13521C1814J253664R03023
355B188501A018566a359086l49017n51071j338620K87972a159358A094394Q87900
346A982294J514p31324d24982j324680N03590b92539A28476Q78409N04740D10609
335b427162j877837J849067c11590J6580j096404r96765r95502M92365a424550
325a15041C82881A11262b81230q60660j022316o35547j68056N32350q6452j77250
$$ y = [4776022, 3418790, 1085088, 999079, 1993884, 1303855, -1320246, -2623553, -2764122, -2465792, -1832756, -2133301, -1602760, 525700, 8995, -3632474, -5045075, -2366994, -1241338, -1410721, -1137113, -1725478, -2594328, -2063546, -2634243, -4633145, -2786202, 1189834, 2128037, 283166, 93499, 1712911, 1901887, 899551, -1064320, -1477841, 31814, 1285478, 2188501, 1018566, -1359086, -1708103, -2259174, -3597794, -3309822, -1159358, 1094394, 1982294, 1983808, 1252484, -424982, -1749662, -1246072, -292539, 128476, 1006885, 1511625, 410609, -2427162, -4304999, -2455932, -311590, -295010, -1391414, -2388179, -3383681, -2891316, -1424550, -115041, 382881, 111262, -281230, -1141890, -2164206, -2799753, -2967809, -2435459, -2521911, -2699161]
315b699161Q75199d84444A066085R80195q1389o99141E0376b376372r64959P71848
305b569483K50104M57004j273377k034210o09702k22715J651502b104992d60089
295a06992j137902k431501j232267J27545J938007h23614k68765j266373p96467
286c155219L59591m36894q95595O86224J66512j525439k05431K23044M77183o37282
276d943306P49328a663303e80231j964072k013040R67289R45411j186893j220542
267e052078P14554N65162k470222l512238k111897n99472J75795k280751o650065
258b1221212k5662104n3959879l1256089M7532855a0230211B2771442o289968
251A6481474m309791Q49044j838957j901231j033888j314509j905035k65148J706980
$$ y = [-2699161, -1823962, -484444, 1066085, 2046280, 1964891, 1265750, 50376, -2376372, -3341331, -2569483, -2319379, -1862375, -3135752, -5169962, -5779664, -6002379, -4350877, -2104992, -460089, -106992, -1244894, -3676395, -4908662, -4781117, -2843110, -823614, -1092379, -2358752, -3155219, -2795628, -3232522, -4128117, -3441893, -3275381, -4800820, -5006251, -4783207, -4306024, -4943306, -4193978, -1663303, -580231, -2544303, -4557343, -3590054, -2644643, -3831536, -5052078, -4337524, -3772362, -6242584, -9754822, -11866719, -12466191, -12290396, -14571147, -21221212, -46883316, -100843195, -132099284, -84566429, -10230211, 22771442, 16481474, 12171683, 13020727, 11181770, 9280539, 8246651, 6932142, 5027107, 4761959, 6468939]
242F468939R71708q31769n23909L84736k96699p69000j664131m97718J949454
233E191611M77722k015033n82072n78441j161956J840735K739690p76627j319978
224C815651O27090J050763R1905k037834C01619b57735A353591J047878p39102
215A662367a23193l34303A429787R16896j53059k15577J59035M9458K53037J739125
205D178702K202534p65893k304736j334137n79484k55759j32775A11530g55461
195I28614J854390n68482n14247m54115I1772O87712J324503o98337L39204J364338
185C109192n95415r12051o66931C31538J89746B21082a789815K6751A511139K843246
175D354385j219162c38510j352779h33182A478984J447040p54959F31585h03754
$$ y = [6468939, 7440647, 6608878, 6084969, 6469705, 6173006, 5404006, 3739875, 3242157, 5191611, 5669333, 3654300, 3072228, 2493787, 1331831, 3172566, 5912256, 5135629, 3815651, 4442741, 5493504, 5585409, 3547575, 301619, -257735, 1353591, 2401469, 1662367, -123193, -457496, 1429787, 2346683, 2193624, 1978047, 2137082, 2186540, 2439577, 4178702, 6381236, 5615343, 3310607, 1976470, 1396986, 1141227, 1008452, 111530, -755461, 928614, 2783004, 2214522, 1700275, 1246160, 91772, 779484, 2103987, 1405650, 1744854, 3109192, 2513777, 1601726, 934795, 331538, 521284, 221082, -1789815, -1763064, 1511139, 4354385, 3135223, -338510, -1691289, -833182, 1478984, 2926024, 2171065, 631585, -803754]
165a559936B54615K427578j298240a314020M64573H58643l89497a336219P8201
156a258018B04939L21300J7923J159304J9983p90386K91496J420831O97509N18041
146C860940J278278P48230B886461a489496l461646K25304a722718M68441j096470
137b350747j13554P101M70707b72617A344090B55879a723232p63320R66572h6955
126b32541j99395k81193m36040E537Q63966J018933J068669j10822r91918p02004
116A152361P61538P86500C76455d370403l280661J405866K508421K2273j343712
107e058216j082260L98291K178893a430771A78914a33051k650441K31310G20779
97B926417p90607b83422k388587j197749k73728b010438A107797J512454r92887
$$ y = [-1559936, 254615, 2682193, 1383953, -1314020, -849447, 858643, 469146, -1336219, -1258018, 204939, 526239, 544162, 1703466, 1723449, 933063, 1224559, 2645390, 3342899, 3860940, 5139218, 5887448, 2886461, -1489496, -4951142, -4725838, -1722718, -1254277, -2350747, -2464301, -2457200, -1986493, -272617, 1344090, 255879, -1723232, -2486552, -1519980, -86955, -232541, -431936, -713129, -1149169, 5537, 869503, 1888436, 2957105, 2846283, 1854365, 1152361, 1913899, 2700399, 376455, -4370403, -7651064, -6245198, -3736777, -3714504, -5058216, -6140476, -5742185, -3563292, -1430771, 178914, -133051, -2783492, -2552182, 720779, 2926417, 2135810, -283422, -2672009, -3869758, -4143486, -2010438, 1107797, 2620251, 1627364]
88A627364A48361f25061I1965b01461l2432A836095J938420O4742k2378M36893
78D253772q67447q95769k61927r14114c94418j43587A580434R15993D98531A69060
67A806069n44843C86898P45273j99297B21505E6524g56329j711154j422878J526150
57b364211A84920d82709j724561G73445L019261j146203j044045k666C65679b04226
46h42727m53356J83922E52734M70618i12129l97161A167395J151252r06481G04279
35f75241p60009O4294o34526e62077E98889c94963j691163q15562q77938n93072
25d372698J42676P55122R35316a026156H39151J203024G75851a071503l88534
16a460037R7016l01038N39984M75901q38138n9828K36850N48261B027275J590673
$$ y = [1627364, 148361, -625061, 91965, -201461, -233893, 1836095, 3774515, 3839257, 3816879, 4253772, 3386325, 2490556, 2228629, 1314515, -394418, -538005, 1580434, 2496427, 498531, 169060, 1806069, 1261226, 386898, 1132171, 932874, 221505, 56524, -756329, -2467483, -3890361, -2364211, 184920, -482709, -2207270, 773445, 3792706, 2646503, 1602458, 1599792, 365679, -204226, -842727, -1296083, -1112161, 552734, 1023352, -912129, -1309290, 1167395, 2318647, 1412166, 704279, -675241, -1435250, -1370956, -2005482, -562077, 598889, -394963, -2086126, -2901688, -3779626, -4372698, -4230022, -3474900, -2539584, -1026156, 839151, 2042175, 775851, -1071503, -1460037, -1363021, -1664059, -1124075, -648174, -1486312, -1546140, -1309290, -761029, 2027275, 3617948]
6C617948j646715j11940p8710B55941a199193j118651
0b317844
$$ y = [3617948, 1971233, 1859293, 1780583, 255941, -1199193, -2317844]
##PAGE= F1=1507.868412969
##FIRST=     18110.137220953, 5591.54909048506, -1358568
##DATA TABLE= (F2++(Y..Y)), PROFILE
1023a358568k31714j408071n83945a668659D19628P48932j72655J93857k43133
1014I46629a124221k168573P08480f04859a30858A9631J907838J277834n00898
1005B704405A273404g02783o56019n75389q19761J114249E94349J247669J883328
996C725346N51261j438017n18516N02154j009442G44827b67218n44094F69308
986C540625J096204k067901a112248j153231f39616B36542D5533J104715J155770
977B306018M79007P3739j237910F29663Q0962E3283b321555j417456J505730e39359
966c28361E98331R40661n28403l67325B93885e38009j11685G9903P93612e04506
955b635637j09043J086172P36990M46792A213416J271981p41740a10421j622273
$$ y = [-1358568, -1590282, -2998353, -3582298, -1668659, 419628, 1168560, 995905, 1189762, 946629, -1124221, -3292794, -2584314, -604859, -130858, 19631, 1927469, 3205303, 2704405, 1273404, -702783, -1358802, -1934191, -2753952, -1639703, 594349, 1842018, 3725346, 4276607, 2838590, 2320074, 2822228, 1812786, 744827, -267218, -811312, 669308, 3540625, 4636829, 2568928, -1112248, -2265479, -639616, 236542, 45533, 1150248, 2306018, 2785025, 2858764, 1620854, 629663, 710625, 53283, -2321555, -3739011, -2233281, -539359, -328361, 598331, 1538992, 1010589, 643264, 293885, -538009, -649694, 79903, 873515, -504506, -2635637, -2744680, -1658508, -921518, -474726, 1213416, 2485397, 1743657, -110421, -1732694]
946a732694P85509A862103J315312j346975D82648j0293R05278J711867M97104
937C586604j580919c60784k036881j70315C33318K847424q89886a31089j551207
928a682296K38383e57424o56817K5724F74481N41396B28681M37920O61173c08189
917b859417O04899D27000Q95146F37193L11724J7629A43597f81095a66433Q2793
907h3640j313647j367447M38967a09049A705092J8633C3494a061097L3128c15894
896b30066F21999J307291k98575m47683j50685C2674a919843m98920M93067k83896
886b209592k51096i11671A608749n4757c37645q54537N32645A98309c03328o71542
876i74870R8425J66098j313671q30375M92134N62450k093438j315896b555352
$$ y = [-1732694, -947185, 1862103, 3177415, 1830440, 482648, 472355, 1377633, 3089500, 3586604, 2005685, -360784, -2397665, -2567980, 333318, 3180742, 2290856, -131089, -1682296, -1443913, -557424, -1214241, -1188517, 674481, 1215877, 228681, 666601, 1327774, -308189, -2859417, -2254518, 427000, 1322146, 637193, 948917, 966546, 143597, -681095, -166433, -83640, -1397287, -2764734, -2325767, -109049, 1705092, 1723725, 33494, -1061097, -1027969, -315894, -230066, 621999, 1929290, 1630715, 1183032, 1032347, 32674, -1919843, -2418763, -1925696, -2209592, -2460688, -911671, 1608749, 1553992, -337645, -1192182, -659537, 198309, -303328, -974870, -876445, -710347, -2024018, -2854393, -2362259, -1799809, -3893247, -5209143, -2555352]
866A086107J782918N68719L60628A844091b239998j211804D312K061442H61595
856a87257p29125j481248n84536J201111g05460i5825A477711J45806A53546b17384
845A058685P70988l5275R3234m71123d84408j553660L48223M38201j198722j078644
835c529010M52450a435650N1711j349782q6708R22150o15912q63912R44241h52335
824a247390j61788c88768E3911M95697d52786j064490D6894J819520k9715n00506
814A336193m67209A40914a012450r7149B47245M13189B71836A12738P96443O35477
804A544658K07666b30876k164641l80562N83699h82446A743359O46151E17254
794i29848m27350l29023O76368c38385B54845P84711k28873k31397L85386B47809
$$ y = [1086107, 2869025, 3437744, 3798372, 1844091, -2239998, -3451802, 4312, 2065754, 861595, -187257, -916382, -2397630, -2982166, -1781055, -705460, -95825, 1477711, 1623517, 153546, -217384, 1058685, 1829673, 1794398, 1887632, 1416509, -484408, -2038068, -1689845, -1251644, -2450366, -3529010, -3076560, -1435650, -1383939, -2733721, -2820429, -1898279, -2514191, -3378103, -2433862, -852335, -1247390, -1409178, -388768, 53911, 549608, -452786, -1517276, 46894, 1866414, 1836699, 1336193, 868984, 140914, -1012450, -1109599, 247245, 660434, 271836, 112738, 909181, 1544658, 1752324, -230876, -2395517, -2776079, -2192380, -882446, 1743359, 2389510, 517254, -929848, -1357198, -1686221, -1009853, -338385, 254845, 1039556, 810683, 579286, 964672, 247809]
783c14983B71724N84081L40288J93925O45818J768274K23270F07120a988047i32294
772B87884o8442M38114J503538M33128F76082a645222q67897Q30676b98837E07374
761G11241j01214l5406Q4448j79076o6780d3331p41853J72035j27137l09613l87910
750a437809j193284j95873h22412F07783a62711n08335K29426K3286c6855r61787
740i98642j410345J03085h27032G46722R91631P1390k69523K11245D54410a438565
729b080948k01140J4890b98716A505879m80586b97920k220418j69653A235060
719D522936j596452D5979a115100c37883A00309a333567q17338O31836a67597
709a90683C65298J489073R85789k84176l31858K04149o37747q27710L08205K18650
$$ y = [-314983, 271724, 855805, 1196093, 1390018, 2035836, 3804110, 4027380, 607120, -1988047, -932294, 287884, 219442, 657556, 2161094, 2594222, 676082, -1645222, -2513119, -1682443, -298837, 507374, 711241, 610027, 574621, 659069, 479993, 413213, -43331, -785184, -613149, -740286, -1049899, -1437809, -2631093, -2826966, -822412, 607783, -162711, -671046, -441620, -418334, -36855, -998642, -2408987, -2305902, -827032, 746722, 1738353, 1809743, 1540220, 1751465, 454410, -1438565, -2080948, -2282088, -2267198, -298716, 1505879, 1025293, -297920, -2518338, -2687991, 1235060, 4522936, 2926484, 45979, -1115100, -337883, 100309, -1333567, -2150905, -1519069, -167597, -190683, 365298, 1854371, 2840160, 2555984, 2224126, 2428275, 1790528, 962818, 1271023, 1489673]
699A489673l05946O02992M41593H07398g64606m39944k92462J72254r07886j842051
689d074695P40619g28105m98535k272275l57179j14307K98907a615823E84444
679A836338J37026H53556e78152r61505o16083o41829l70489J04958O88093c21994
668A383328G9101a771255b82362B650963J119717n56262A293606a135456k047214
659c182670J122526I75899J035432F6232N64551J712697q12297b95379F8584L93487
649D62071K5320O68819O73513j67922k03590j16784j42479P78499o67575g43916
638b165719a070211A120024J274589o11374n00586O3901J599690J723274J104
629D670622j653416H18455d83334k26646m30346K26132I09037J922086R4901A362450
$$ y = [1489673, 1183727, 1786719, 2228312, 807398, -764606, -1204550, -1497012, -1324758, -2232644, -4074695, -3334076, -728105, -1226640, -3498915, -3856094, -3970401, -3671494, -1615823, 584444, 1836338, 1973364, 853556, -578152, -1539657, -2155740, -2797569, -3168058, -3063100, -2375007, -321994, 1383328, 79101, -1771255, -282362, 2650963, 3770680, 3214418, 1293606, -1135456, -3182670, -2060144, 975899, 2011331, 66232, 630783, 2343480, 1531183, -295379, 68584, 462071, 487391, 1156210, 1829723, 1661801, 1458211, 1341427, 1198948, 1977447, 1309872, -743916, -2165719, -1070211, 1120024, 2394613, 1783239, 1282653, 1346554, 2946244, 4669518, 4670622, 3017206, 818455, -483334, -709980, -1140326, -914194, 909037, 2831123, 2926024, 1362450]
618g53241q87111A75579L569249J674360j667941A448235j1086Q64308L7455j27788
608B211124K64962Q8226A089378f36883A69210K583471K49673j169059c51921
598a663371M94017A34540J043628H3320b141698o27972J264014A040712J474797
589B515509A184509a79286F03751K062131J48823r01451l77615D46124i77626
579a043641e2057n11160k055565J018000H84021G8996c448780j594352J959981
570c083151D14527K479007o50320a128749N0091A373383D99090b337460m2339
561b379799B00022J598365H14454l24936J262446Q05802G14811i14912A6416a28018
550b088295m74747O19579i60765F62983L58089g54798j08440A359814L58197m99221
$$ y = [-753241, -1640352, 175579, 3744828, 5419188, 3751247, 1448235, 1437149, 2301457, 2338912, 2211124, 2476086, 2564312, 1089378, -636883, 169210, 2752681, 3002354, 1833295, -351921, -1663371, -1169354, 134540, 1178168, 83320, -2141698, -2769670, -1505656, 1040712, 2515509, 1184509, -179286, 603751, 2665882, 2814705, 1913254, 1535639, 446124, -977626, -1043641, -52057, -563217, -2618782, -1600782, 884021, 78996, -3448780, -5043132, -3083151, 414527, 2893534, 2243214, -1128749, -1078658, 1373383, 499090, -2337460, -2379799, 200022, 1798387, 814454, 489518, 1751964, 2557766, 714811, -914912, 16416, -128018, -2088295, -2563042, -1943463, -960765, 662983, 1021072, -754798, -863238, 1359814, 1718011, 1218790]
540A218790R1820E93837e61999J84531J42776n81758n07961d72228H94918J45852
530A040770D34381c75802J62220C059107L625224r64972k828067O90645K311692
521E893629j525102A365487D33420R7465R48188J720846L01356j257377I07390
511d3748k10079F23668J484684K51599C32921a867379j030772j09888J276833
502a731206h44647j213929r98851a423651G93333N8116a579519k431543j276589
493e287651M20648J211575J511269Q22267E90075J543074o31778m79388Q26571
484A848554j87413a19074q47623D14725K274251J075341j015740I59820B74829
474B36391b60283n82370g861F26045g13955j280438E1268K458896j44442I39383
$$ y = [1218790, 1310610, 593837, -561999, -377468, -234692, -816450, -1324411, -472228, 894918, 1040770, 434381, -375802, -213582, 3059107, 6684331, 5719359, 2891292, 3581937, 5893629, 4368527, 1365487, 433420, 530885, 1479073, 3199919, 3501275, 2243898, 907390, -43748, -253827, 623668, 2108352, 2359951, 332921, -1867379, -2898151, -3008039, -1731206, -844647, -2058576, -3057427, -1423651, 793333, 851449, -1579519, -4011062, -5287651, -4867003, -3655428, -2144159, -1321892, 590075, 2133149, 1501371, 1021983, 1848554, 1661141, -119074, -966697, 414725, 2688976, 3764317, 2748577, 959820, 274829, 236391, -260283, -842653, -7861, 626045, -713955, -1994393, 51268, 2510164, 2365722, 939383]
463C43454J333150J103606p46939r0807J561879m3725A001347e29189C89445L94736
453G84181b92417r26123L87328c14504F53054b64224n7884A123078k88051a030866
442a567520a04857I45647D16661J46186J697169L32122j36641A147230b252480
432c941670J926908c45417F14457J343012F96213a296134b83658B323644n05845
423A817799i63834K57310B383354r23338b274259M51055A68527J177623E46480
413d51026j362311j54006h79247M26576n30275k08214d03507D97429J70503i03803
402b003938b3964B935445o40224b88386k71516B98308R41015K544832J861740
393E645895j814531F87245g094F53145B89132a564636q77646j94984l37718N91873
$$ y = [343454, 1676604, 2780210, 2033271, 1942464, 3504343, 3460618, 1001347, -529189, 389445, 784181, -292417, -1218540, -831212, -314504, 653054, -264224, -322108, 1123078, 835027, -1030866, -1567520, -104857, 945647, 416661, 562847, 2260016, 2592138, 2455497, 1147230, -2252480, -3941670, -2014762, -345417, 614457, 1957469, 696213, -1296134, -283658, 2323644, 1817799, -963834, -706524, 2383354, 1460016, -2274259, -1823204, 168527, 1346150, 546480, -451026, -1813337, -1967343, -879247, -452671, -982946, -1191160, -403507, 497429, 667932, -903803, -2003938, -23964, 2935445, 2295221, -288386, -559902, 298308, 1239323, 3784155, 5645895, 3831364, 687245, -7094, 653145, 289132, -1564636, -2442282, -2637266, -2974984, -2383111]
383b383111K1949P63806A202430n26263c788232j668351K705127P40248l21998
374b333206P66451j6806r57320M92500m9093j980124P60373H36247J909424F62392
363b93695A491894K22313A0802a848111J84606a26089A073706J027330I31495
353a237821k93061j64971r63461j88892R07498i43798H7637J140853k62746a128820
342b773665n8282Q65624i45958G63990Q28307B7207b961981j616156b235779F06886
331A396516H2949a241745p24472K13506K38357K95986K27126q513m04376o93028
321b097159p41236r40592k52970P83828p05851l74823J734968e44926B85698F3536
310B69638L98925d46313k329261j081089P28343R63184P28757k545203k807196
$$ y = [-2383111, -2361162, -1597356, 1202430, 676167, -3788232, -5456583, -2751456, -2011208, -2333206, -1566755, -1583561, -2540881, -2048381, -2097474, -4077598, -3317225, 836247, 2745671, 662392, -293695, 1491894, 1714207, 10802, -1848111, -1663505, -126089, 1073706, 2101036, 931495, -1237821, -1530882, -1695853, -2659314, -2848206, -1940708, -943798, 87637, 1228490, 965744, -1128820, -2773665, -2831947, -1966323, -945958, 763990, 1592297, 27207, -2961981, -4578137, -2235779, 606886, 1396516, 82949, -1241745, -1966217, -1752711, -1514354, -1218368, -991242, -999755, -1404131, -2097159, -2838395, -3778987, -4031957, -3248129, -3953980, -4328803, -2593835, -544926, 285698, 63536, 269638, 668563, -446313, -2775574, -3856663, -3128320, -2165136, -1436379, -3981582, -6788778]
301f788778R4118J93142O41105K119412a847426P59140q82027k274821j205047
292e450181j9382J379374J328893m17894j328851j21379J185102j06378j080891
283d631587P7001n18327j307187J40697M65321L4396j234143L54930K488432J064442
273c066025k720622k802293J079439J17054j500234j324827N44584l79205l738613
264a3790742l569975l382739j992178j457719n588988j1971482n3561819j15860034
256b11175676o3519430J01116225a7176866D7385165j0042865j0188741k051294
249B5102265k803990m116190l665934p99930j655515j375288M26185n69664j146789
240I395150n55075p19067k53811j96632k252940j544861J451886J096108j511061
$$ y = [-6788778, -6694660, -6501518, -5860413, -3741001, -1847426, -1088286, -1970313, -4245134, -5450181, -5469563, -4090189, -2761296, -3179190, -4508041, -4629420, -3444318, -3550696, -4631587, -4554586, -5072913, -6380100, -6239403, -5774082, -5739686, -6973829, -6618899, -4130467, -3066025, -5786647, -8588940, -7509501, -7392447, -8892681, -10217508, -9672924, -10052129, -13790742, -17360717, -20743456, -22735634, -24193353, -29782341, -41753823, -95315642, -211175676, -274695106, -173578881, -17176866, 47385165, 37342300, 27153559, 25102265, 22298275, 18182085, 14516151, 13716221, 12060706, 10685418, 11111603, 10541939, 9395150, 8840075, 8121008, 7867197, 7670565, 5417625, 3872764, 5324650, 6420758, 4909697]
231D909697m45320j017497j653269J822607L488158j29288k016074J0594O94644
222E664252L34208j634132H97686C5504J810312J713835k92858A532449p21215
213H11234J356898P74844q0712k6344K55561P9945P352J405512K400810P4265
203G059365k473221k232216q68293j54124m12974a00152q50743F27380J778673
194B406053n05128k64356q0839p74269P32296R32175j116428O06882K122207k75185
184C783408j881671C96009b77098E74100B25053b083485J50778A502470K948540
175D451010j385973B09531a157678e60292A855867J057687A244373f19368p40392
166a359760j36241C35152K078504o74812a5052B89662J092510k61579b00756a8453
$$ y = [4909697, 4464377, 3446880, 1793611, 3616218, 7104376, 6975088, 4959014, 4969608, 5664252, 5998460, 4364328, 897686, 35504, 1845816, 3559651, 3266793, 1532449, 811234, 2168132, 2942976, 2862264, 2835920, 3091481, 3171426, 3178778, 4584290, 6985100, 7059365, 4586144, 2353928, 1485635, 1331511, 918537, -100152, -950895, 627380, 2406053, 1900925, 1636569, 1555730, 781461, 1513757, 2445932, 1329504, 1936386, 4058593, 3783408, 1901737, 396009, -277098, 574100, 225053, -2083485, -1932707, 1502470, 4451010, 3065037, 209531, -1157678, -560292, 1855867, 2913554, 1244373, -619368, -1359760, -1496001, 335152, 2413656, 1738844, -15052, 289662, 1382172, 1120593, -200756, -18453]
155F93950o7838o6447J182008N19456q32756o07425Q90762R94854Q95630J460039
145E062233P65902B533499b091576l519989M26801b357246N81018r00981o0143
136b737352J79214L43817N21962c33744E0059a174938j140834J117344A49108
126c28049j12443a93765j229A032861P27428K35112K1042K63155l76811G71586
115A454006J162017A61954d515692l021637J365255J656314n15425j157144l99283
106f587612J144383K676252g78962F06605l2679a949096q71264c4313B567719
96B399727E73991a382329j505166j075750J650059G24131J615463A124995d13394
86a448759J27164e99854D14282J465130Q16293l32226N83280J583736p40159j181141
$$ y = [693950, 626112, 559665, 1741673, 2261129, 1428373, 820948, 1711710, 2706564, 3602194, 5062233, 5828135, 2533499, -2091576, -5611565, -5184764, -2357246, -1776228, -2677209, -2737352, -2558138, -2214321, -1692359, -333744, 50059, -1174938, -2315772, -1198428, 149108, -328049, -440492, -193765, -194994, 1032861, 1760289, 1995401, 2016443, 2279598, 1902787, 771586, 1454006, 2616023, 161954, -4515692, -7537329, -6172074, -4515760, -5031185, -6188329, -6587612, -5443229, -2766977, -778962, 606605, 573926, -1949096, -2820360, -34313, 2567719, 2399727, 573991, -1382329, -2887495, -3963245, -2313186, 724131, 2339594, 1124995, -413394, -1448759, -1321595, -599854, 414282, 1879412, 2695705, 2363479, 2946759, 4530495, 3790336, 2609195]
76B609195Q9373k86014C77162f64165G53397J066421C80162m701K010998k24434
66B162025D93770c7980p04648p11835K62810l08465j272548q96775J747637C68171
55b46823j660179G51787L199943q95494r30989l45130a20275j080479m57977l32622
45a991353p8797f47749e2427j090871N1333H12330N38521o25501j43165d57185
34a606160O0332K49518A48210L39365g57505j269386j38740l57525J14085k73937
24b683008j33569N61168e00060A514495Q67975r39769C6708h34676n81937p2446
14a489059c39807g4299j795536m00729M00241M08549I93606J677866j124276K05528
4A752724J20949B55636a738675j044568
$$ y = [2609195, 2698568, 2412554, 377162, -664165, 753397, 1819818, 380162, 375461, 2386459, 2162025, 493770, -37980, -742628, -1454463, -1191653, -1500118, -2772666, -3669441, -1921804, 368171, -246823, -1907002, 751787, 3951730, 3056236, 2125247, 1780117, -120275, -1200754, -1658731, -1991353, -2070150, -647749, -52427, -1143298, -1091965, 812330, 1350851, 725350, 582185, -457185, -1606160, -1545828, -1296310, 148210, 487575, -757505, -2026891, -2165631, -2523156, -2409071, -2683008, -2816577, -2255409, -500060, 1514495, 2382470, 1442701, 36708, -834676, -1416613, -1489059, -339807, -74299, -1869835, -2270564, -1870323, -1461774, 993606, 2671472, 1547196, 1752724, 1873673, 255636, -1738675, -2783243]
0b783243
$$ y = [-2783243]
##PAGE= F1=1486.250875459
##FIRST=     18110.137220953, 5591.54909048506, -1301645
##DATA TABLE= (F2++(Y..Y)), PROFILE
1023a301645k07778j802904p43480J813947a88060I99102J3779l60069l02079
1014C50733f15268j442142J59467e16086b30372j41089A026685J117394K8987
1005B173066D81978a646421J59838O69855r01940P84419H85854N54394J336200
996B776448P50897j149131p55678L08319o72641D64530a80457n0123A277586K238749
986C516335L97116j742406c40968r34616A99055O84580a08129B12974J485442
977A698416J005236K74739o06985j038345m98042i421k360098j849179J580406
968b638292d26055B52048O01395Q07704r5692k68552l99464a32063q30836L79738
958e83161C92888a06185j134220M44131a51670N6147j56559I68079Q29853F68869
$$ y = [-1301645, -1509423, -3312327, -4055807, -2241860, -188060, 999102, 1012881, 652812, 350733, -615268, -2057410, -1897943, -516086, -230372, -371461, 1026685, 2144079, 2173066, 481978, -1646421, -1486583, -816728, -1718668, -934249, 885854, 1440248, 2776448, 3527345, 2378214, 1622536, 1930855, 1258214, 464530, -180457, -230580, 1277586, 3516335, 3913451, 2171045, -340968, -1275584, 199055, 883635, -108129, 212974, 1698416, 2703652, 2978391, 2371406, 1333061, 835019, -9421, -2369519, -4218698, -2638292, -426055, 252048, 853443, 1661147, 1565455, 1296903, 897439, -132063, -962899, -583161, 392888, -106185, -1240405, -796274, -151670, -95523, -252082, 968079, 1797932, 668869]
947a287938r36253c07881B606640Q70321A537869C72858N53625P49425P33791
938B409699j43365F79491a238078j687998r3547a80236B996402l4429I02448h97372
927i96513b77541p40911K36970H03836N09311D96459K96712L78075a97754k238303
917b436057M13628G46164J170001o60421J0996l83722d35135p75084b87671a0774
906a233856j463578Q5349f51283A086439k08995e81692p27414k63401O55002a83575
895A067104J304579p12505q24505Q9056C05048a857736r91351P17122L37355J19450
885a675160f71137G25391A84749a272240o8673b82292C37043d34120m86208K46983
875f73345H9987a149125j905313k29867J220855j085502j456422J821716F8391
$$ y = [-1287938, -2224191, -307881, 2606640, 3476961, 1537869, 372858, 926483, 1675908, 2409699, 2266334, 679491, -1238078, -2926076, -3019623, -180236, 2996402, 2961973, 902448, -897372, -996513, -277541, -1018452, -781482, 803836, 1313147, 496459, 793171, 1171246, -197754, -2436057, -2022429, 746164, 1916165, 1255744, 1266740, 883018, -435135, -1210219, -287671, -10774, -1233856, -2697434, -2612085, -651283, 1086439, 877444, -581692, -1309106, -1572507, -917505, -183575, 1067104, 2371683, 1659178, 834673, 923729, 305048, -1857736, -2849087, -2131965, -1794610, -1675160, -671137, 725391, 184749, -1272240, -1340913, -282292, 337043, -434120, -920328, -673345, 89987, -1149125, -3054438, -3284305, -2063450, -3148952, -4605374, -2783658, 68391]
865I37270L96476J525425j081943a934293j151431a53782A642816p83988k67487
856E91341k9903a339832j084785J207769a88837k2483F79491j04030c71956k62460
846f34416B59573Q23929M51675P7785k85576B7640a497399M64076M25335j713247
836b321235j306275Q62515a145306l52187j298426J92556Q22131r10868m96533
827c188633J048387a023497n65735N21909A031919K0898E3471a599208m53163
818b052371F802K080110j04417o75860m35856b18568j163506K3403I9796Q44081
808I43877C82186e55194A2819J297264M52299e35474k000273J32440P57994c17472
797A756706k81381e98840j320536l85770J14845g44533B87125L13657N06077E35601
$$ y = [937270, 1333746, 2859171, 1777228, -1934293, -3085724, -153782, 1642816, 858828, 591341, 561438, -1339832, -2424617, -1216848, -188837, -211320, 679491, 575461, -371956, -634416, 259573, 1083502, 1535177, 1612962, 1327386, 27640, -1497399, -1033323, -607988, -2321235, -3627510, -2764995, -1145306, -1497493, -2795919, -2603363, -1781232, -2692100, -3188633, -2140246, -1023497, -1589232, -1067323, 1031919, 1052817, 53471, -1599208, -2052371, 6802, 2086912, 1982495, 1306635, 870779, -218568, -1382074, -1358671, 99796, 943877, 382186, -555194, 12819, 1310083, 1762382, -535474, -2535747, -2403307, -1645313, -317472, 1756706, 1475325, -598840, -1919376, -2305146, -2190301, -744533, 287125, 600782, 1106859, 535601]
786b15996G1529c08113m12922a06914D95251R03065J103012Q00004J093881m54542
776C940671D71572a575758f02776J43000k72645I07468J868309p38600d69673
766a740269L789h43608B20379K74151A01259c81960B97853J147184L13050m58762
756A299325c37332j347736M60763N69534b9503m59403k194922o38415a257061
746e3799r04956k64316N57028o7533a15559A41089c76231o34034c41520H10995
735A645764O75550j98621p36613D39549e71051q94231o69531N1296c18664A108540
724E10430b42826j947669p74975F32452L302137j386378a43736j292605d53378
714D85970f39634j164996M18490C67918M1213j70930J132377J822923M56444o34639
$$ y = [-215996, 71529, -308113, -721035, -106914, 495251, 1398316, 2501328, 3301332, 4395213, 3940671, 471572, -1575758, -602776, -459776, -732421, 907468, 2775777, 2037177, -469673, -1740269, -1736480, -843608, 220379, 494530, 101259, -381960, 297853, 1445037, 1758087, 1299325, -337332, -1685068, -1224305, -654771, -29503, -488906, -2683828, -3322243, -1257061, -53799, -958755, -1223071, -666043, -733576, -115559, 141089, -376231, -1010265, -341520, 810995, 1645764, 2321314, 2122693, 1386080, 439549, -571051, -1465282, -2134813, -2083517, -318664, 1108540, 510430, -242826, -2190495, -2965470, 632452, 3934589, 2548211, -143736, -1436341, -453378, 485970, -639634, -1804630, -1386140, 367918, 409131, 238201, 1370578, 3193501, 3649945, 3015306]
704C015306P4092k63492j017754n1593l45559B79542L80621J069668o01220b16296
693a291728j167146P76898P75700j078803J83876a3784p42884k431978l21157
684c509803k43922o0149J610404a04143G83568B39667g62968m93930n04246q92014
674b653158q03943l34605K00866J057710e63794F34968h20347j845973a131467
664B656825K008131r62930H23574a744659j315894J338883A311891J545335A006262
654G73687J126819p66853c51784b0912C1147a18658E02220R00554J46692K21467
644A770933j28562p62476O55241q9406h6732q55870c82453A131962J758188p12416
634B177734E33612j44087J883021J740889N41211j158654A342036B50886d14399
$$ y = [3015306, 3089398, 2825906, 1808152, 1756559, 1411000, 279542, 660163, 1729831, 1128611, -216296, -1291728, -2458874, -1681976, -906276, -1985079, -1801203, -13784, -756668, -3188646, -3509803, -3753725, -3813874, -2203470, -104143, 783568, 239667, -762968, -1256898, -1761144, -2653158, -3457101, -3791706, -3590840, -2533130, -563794, 634968, -820347, -2666320, -1131467, 2656825, 4664956, 3702026, 823574, -1744659, -3060553, -1721670, 1311891, 2857226, 1006262, 773687, 1900506, 1133653, -351784, -20912, 31147, -118658, 502220, 1402774, 1549466, 1770933, 1642371, 879895, 1535136, 1445730, -86732, -942602, -382453, 1131962, 2890150, 2177734, 533612, 389525, 2272546, 4013435, 4554646, 3395992, 1342036, 250886, -414399]
624a337640M27699A158332K086166K32832j347185e16557j714328b93249C968149
614E778039k244693A229801k05906L74818m1202k652M34287L32480H45645d12966
603C44355J907741L70510o2657A182856e66328J7481A010713R98929C54313a956186
592b698322J102217H73946R99287e454j163342B7343K512979L86952j167295m74927
582A285052l48272a54147o05899A37226c43483k706259M77047D34951j76608c479537
571e448444J888293c8856B656448o0816c65247o36037G26981j17021a118115n94620
561a712735a35696A288609B98942e71300A018892J729451I60643a154253G1105
551I75986a345190j997288P9125J300911C69400J016540B6747K5453J960031N759
$$ y = [-1337640, -909941, 1158332, 3244498, 3477330, 2130145, -516557, -2230885, -293249, 3968149, 5778039, 3533346, 1229801, 1023895, 1398713, 1357511, 1354859, 1789146, 2121626, 845645, -412966, 344355, 2252096, 2622606, 2559949, 1182856, -566328, -548847, 1010713, 2009642, 354313, -1956186, -2698322, -1596105, 873946, 1873233, -5454, -1168796, 27343, 2540322, 2927274, 1759979, 1285052, 936780, -154147, -760046, 137226, -343483, -3049742, -2572695, 434951, 258343, -3479537, -5448444, -3560151, -38856, 2656448, 2595632, -365247, -1001284, 726981, 609960, -1118115, -1712735, -135696, 1288609, 298942, -571300, 1018892, 2748343, 960643, -1154253, 71105, 975986, -1345190, -3342478, -3263353, -1962442, 369400, 1385940, 26747, 52200, 2012231, 2017990]
541B017990q40184j04404m67803c56152a56570C68785J72346a40279j04842G85419
530G62172a76473j022737e95945B679249L615750n05881k702451R39424K459628
521F485719j753095A351996B67760K44388J357211J430610j4095j122751q50141
512A312982m16899j08840k0338Q99194R89734A136151b081420k188496m58212
503d728128K248093h24803j691970j380727a478829A456276l72339b314521l285829
494e600350m34303J975961a652289M87580J78213A331836J823861o54957p16478
485A784262J32183n49258c53314r01037G726K471495J211908j618993d79562p4138
475e53700i3448m34178o53787c57533A274h83449j056264a0607B084719n42058
$$ y = [2017990, 1177806, 1073402, 605599, -356152, -156570, 368785, 541131, -140279, -245121, 785419, 762172, -176473, -1199210, -595945, 2679249, 6294999, 5789118, 3086667, 4026091, 6485719, 4732624, 1351996, 267760, 512148, 1869359, 3299969, 3285874, 2163123, 1312982, 896083, 787243, 766905, 1666099, 2655833, 1136151, -2081420, -4269916, -4728128, -2480035, -824803, -2516773, -3897500, -1478829, 1456276, 1083937, -2314521, -5600350, -6034653, -4058692, -1652289, -1164709, -986496, 1331836, 3155697, 2500740, 1784262, 1916445, 1367187, -353314, -1254351, 7726, 2479221, 3691129, 2072136, -479562, -553700, -93448, -527626, -1181413, -357533, 1274, -883449, -1939713, -10607, 2084719, 1542661]
465A542661C12749M9966J904901J336425j116349r96585R33284M37085A349663
455a7100D83398L22803A26752d48611B2022Q41595P75547F43128I7272J350100
445A447372K03911E5607a063426c4020H12759c74015k51892A167048O28671k42727
435A552992D17119b508092j043668a363318B93182Q55084P37489B94163i30437
425C34297J579654H12685a401576O71174A892006I45185c817832j267316b467969
415C87236L04035e8664j724073n75646R83291L07778q17708J4688d73403C83106
404b94792j682683n29412c73908B543111j64378d9833o31562f395A238975K566562
394C805537J665789k028247A57547a041622L88753l3921j016131j93774k04988
$$ y = [1542661, 312749, 362715, 2267616, 3604041, 2487692, 1491107, 2424391, 2861476, 1349663, -17100, 483398, 806201, 126752, -448611, 22022, 863617, 1639164, 643128, 97272, 1447372, 1651283, 55607, -1063426, -34020, 812759, -374015, -625907, 1167048, 1795719, 1552992, 417119, -2508092, -3551760, -1363318, 293182, 1148266, 1885755, 294163, -930437, 334297, 1913951, 812685, -1401576, -730402, 1892006, 945185, -3817832, -5085148, -2467969, 387236, 691271, -58664, -1782737, -2358383, -1375092, -1067314, -1885022, -1870334, -473403, 383106, -294792, -1977475, -2506887, -373908, 2543111, 2378733, -49833, -681395, -6395, 1238975, 3805537, 5471326, 3443079, 157547, -1041622, -652869, -686790, -1702921, -1896695, -2101683]
385b101683j133631J89542M21379J287097A937140p08205c667458j538211K344849
376b860820J61077n23824R81674O14036p38525M99595O86093j619436n92791a1376
365B575994F49641i88111G04642N59223i10385j443234a163933A25437L43118
356D68555O10658C32739i92934l38489N5068r517m81034n52965n93686J002446
346a911111C98470M30060a417715j781803n17345N70085J292627E76563J581582
337B158145D85950b654623j472387a696103A383803J609373j008437E60960A55232
327b24761j280086o19917L03488N41632n63218n75822m89180j071136k24243J044893
317c158350j043321o57314K060393e67475q9802j512412M49624e43091r52587
$$ y = [-2101683, -3235314, -3045772, -2624393, -1337296, 1937140, 1228935, -3667458, -5205669, -2860820, -2699743, -3223567, -2241893, -1627857, -2366382, -1866787, -1180694, -2800130, -3392921, -11376, 2575994, 649641, -988111, 704642, 1263865, -910385, -2353619, -1163933, 125437, 468555, 1079213, 332739, -992934, -1331423, -1276355, -1285872, -1766906, -2319871, -2913557, -1911111, 398470, 828530, -1417715, -3199518, -3716863, -3146778, -1854151, 576563, 2158145, 485950, -2654623, -4127010, -1696103, 1383803, 2993176, 1984739, 560960, 155232, -224761, -1504847, -2124764, -1821276, -1279644, -1842862, -2418684, -2907864, -3979000, -4203243, -3158350, -4201671, -4858985, -2798592, -567475, -657277, -2169689, -1720065, -543091, -1495678]
308a495678j722842p89185M84374J506844R23361l203772l041755P79286J143612
299e415755m78174J027173J663128J333287m28729j849856q79930k0956M34890
290d614922K07540n51937r69553P01044J900466K88650j284505o56180j180666
281f160063j050504M40194O55230n55850j488761K43040K038917L52864l098999
272h623932k597254J372660p81681j668272j618960o59183j558078l469685l324214
263b2928599l970187k486675l593842p192334j3446360p2357906j59675373q6836110
255c72487386J36048353b1428751F6269008j1585846j5450805n743945m506450
248B8981962n780640n134712k25945K9219j534988j635133k446266j318140k19331
$$ y = [-1495678, -3218520, -4007705, -3523331, -2016487, -1093126, -4296898, -7338653, -6559367, -5415755, -5893929, -4866756, -3203628, -1870341, -2299070, -4148926, -5028856, -5049812, -4614922, -4407382, -4959319, -5928872, -5227828, -3327362, -3038712, -4323217, -4979397, -6160063, -7210567, -6770373, -6115143, -6670993, -8159754, -7916714, -5877797, -5524933, -8623932, -11221186, -9848526, -10630207, -12298479, -13917439, -14576622, -16134700, -19604385, -22928599, -26898786, -29385461, -32979303, -40171637, -53617997, -125975903, -285651276, -372487386, -236439033, -21428751, 66269008, 54683162, 39232357, 33488412, 28981962, 23201322, 18066610, 17840665, 17869884, 16334896, 14699763, 12253497, 10935357, 10716026]
239A0716026j162061j47523l9109k727287k632428Q04077J935392n48446r09262
230E289379j587962j710587J569090L565880P66715k060534p85309K92910N03560
221E843142j275876A217703D24439J989638K035717j46387j631807q81959O21093
212B410734N39267j90474J05321M45709K46325l13209O10096K498304J012489
203G364562k257047B202052q71974J49769n35575h099q58834B39314J527882p2927
193A694269J70025L14219j48727P93950K31248j443051O85012K348732l42876
184D302801A475045f09728m28242B53860f70k148024N37643A542758K292511j579001
174B256268F04159d58354a48209B096864P40977G60890a180730l10238L90336
$$ y = [10716026, 9553965, 9406442, 9367333, 6640046, 4007618, 4811695, 6747087, 6198641, 5289379, 3701417, 1990830, 3559920, 7125800, 7892515, 5831981, 5046672, 5339582, 5843142, 4567266, 1217703, 424439, 2414077, 4449794, 4303407, 2671600, 1789641, 2410734, 2950001, 2759527, 2864848, 3310557, 3556882, 3243673, 3853769, 6352073, 7364562, 5107515, 2202052, 1330078, 1479847, 944272, -8099, -866933, 239314, 1767196, 1694269, 1864294, 2178513, 2029786, 2823736, 3054984, 1611933, 2296945, 4645677, 4302801, 1475045, -609728, -1037970, 253860, -670, -2148694, -1611051, 1542758, 3835269, 2256268, 604159, -458354, -148209, 2096864, 2837841, 760890, -1180730, -1490968, -1100632]
165a100632F18825J540153K21387n15267j67532K97372n2346q24461K86776J2158
155A417065n32452j43944J023807P55033n91467q66117N11478Q00722O77317J268991
145D320433M59824A707761b404658k964477O46108K211258N76442o47910K64557
136b318680M59525j13972q64921Q28092b95251q6154j141609f95107B78320c66176
125c99162C16595O50402J123924Q2314o24959n26841R26976K54761H74971N39153
115A414124J168540B63318c564862k241738Q69208M43830j110823p89691M88100
106e905976J549903a711427A6024J219806M41658d55827k116917h86047A986632
96B775515r61426E91722i07023j949364P85097D15299J473764F54599h80654j510085
$$ y = [-1100632, 618825, 2158978, 2380365, 1865098, 1697566, 1994938, 1942592, 1118131, 1404907, 1417065, 884613, 740669, 1764476, 2519509, 1928042, 1061925, 1573403, 2374125, 3051442, 4320433, 4780257, 1707761, -2404658, -5369135, -4723027, -2511769, -1935327, -2583237, -2318680, -1859155, -1973127, -2838048, -2009956, -295251, -381405, -1523014, -695107, 278320, -366176, -399162, 316595, 966997, 2090921, 2173235, 1548276, 1021435, 1948411, 2203172, 874971, 1414124, 2582664, 263318, -3564862, -5806600, -4937392, -4493562, -5604385, -6394076, -5905976, -4356073, -1711427, 16024, 1235830, 1677488, -455827, -2572744, -886047, 1986632, 2775515, 1814089, 591722, -907023, -2856387, -2071290, 415299, 1889063, 654599, -880654, -2390739]
86b390739J06334a00536A918332K42852p57796D59396J388570K610887m77998
77C980855j517005P8858K18798I87788f65514K27772D81449A1204M74604K082482
67B568290Q9511E73095a103262j135514m92312O81023J61867q42368k34012a029224
56H08698A39070a446083D72064K994909q0039o13205j085944i48222j523763o3701
46b535686L6009k21375J087238g73553o6366K91969B76284A36904a45805C98325
35D6a156760J94562C2384R23578B72874a378408p85812O59333M52339a63020m09477
24e72497j030457J84235E50721K088302M67124o35641j182487c51397j371422
15a722819J56724B5291a5398k190373j95913O38546m6940c01304A139733l77171
$$ y = [-2390739, -2284405, -100536, 1918332, 2161184, 1403388, 459396, 1847966, 4458853, 3980855, 2463850, 2542708, 2761506, 987788, -665514, -437742, 481449, 11204, 485808, 2568290, 2657801, 573095, -1103262, -2238776, -2731088, -2050065, -1888198, -2730566, -2964578, -1029224, 808698, 139070, -1446083, 472064, 3466973, 3386934, 2773729, 1687785, -948222, -2471985, -2535686, -2499677, -2721052, -1633814, -773553, -839919, -547950, 276284, 136904, -145805, 398325, 46, -1156760, -962198, 32384, 955962, 272874, -1378408, -2164220, -1504887, -1052548, -163020, -572497, -1602954, -1418719, 550721, 2639023, 3106147, 2470506, 1288019, -351397, -1722819, -1566095, 25291, -15398, -2205771, -2401684, -1763138, -1810078, -301304, 1139733, 762562]
5G62562M44658L37413A34513b216849r55476
0c172325
$$ y = [762562, 1207220, 1544633, 134513, -2216849, -3172325]
##PAGE= F1=1464.633337948
##FIRST=     18110.137220953, 5591.54909048506, -1084622
##DATA TABLE= (F2++(Y..Y)), PROFILE
1023a084622K2246j840170q99179J179447a051165D85749L03933c6229r1445B25334
1012e90232o18571N50432L14221k50920C74527J263856O84111C36418b317211
1002a861063h9846n22940b88495H36353j75854Q06859J043542p85366q17296J44004
992A052242E25604A57949j0286N23634J173699J143023n25065A078132e2763m92441
982e45204F97494M09421c57215k79181I70864J391262N91195j09255j140035F46359
971A5240a559662j703558R66492b62167H80137J83838N07461L64848j98239n16632
961A221413B61746g67180J18118C06175J76380G7852O83899L70410E40744b88643
950A82821L69145h40117k119073J2293E3351K721645K47796H24737A55527J037107
$$ y = [-1084622, -1062376, -2902546, -3801725, -2622278, -1051165, 485749, 789682, -36229, -127674, 225334, -590232, -1208803, -658371, -344150, -595070, 374527, 1638383, 2322494, 336418, -2317211, -1861063, -89846, -612786, -288495, 836353, 660499, 1467358, 2510900, 1725534, 908238, 1052242, 525604, 157949, 147663, 671297, 1844996, 2988019, 2462954, 1078132, -52763, -545204, 697494, 1106915, -357215, -636396, 970864, 2362126, 2953321, 2844066, 1704031, 646359, 15240, -1559662, -3263220, -2296728, -262167, 880137, 1063975, 1571436, 1936284, 1738045, 1221413, 261746, -767180, -649062, 306175, 482555, 77852, 761751, 1132161, 540744, -288643, 182821, 551966, -840117, -2959190, -2946897, 53351, 2774996, 3022792, 824737, 155527, 1192634]
940A192634M52452r7777l24853D783a029713j244357n06319d51270B761645O92753
930C454398j600397A01047b62267C19772b9357B67399P30155M43315l07968o7020
920A065881k92401a01089j391872J80642A009646J087952m71591M6586p76828
911H95765i48995o89206b74559B80724h71184j392518l1459f73785G14495A45022
900h65230l52389n37337M80813a62301A221073J286784q26873F66004K01420j71141
890F96283a325492j215887P10186O53514e87735B2549L1453a164110q62617O72575
880a354152a34042I2429g32343j43105K15040D25210b09126k325460j123578J311924
870b346240j03530j263522R06892a002720R5121J27845A630814j8611a179903
$$ y = [1192634, 1645086, 1547309, 1222456, 4783, -1029713, -2274070, -2780389, -451270, 2761645, 3454398, 1854001, 101047, -262267, 319772, -29357, 267399, 997554, 1440869, 1132901, 1065881, 773480, -101089, -1492961, -1312319, 1009646, 2097598, 1626007, 1672593, 895765, -948995, -1638201, -274559, 280724, -871184, -2263702, -2295161, -673785, 714495, 145022, -865230, -1217619, -1754956, -1274143, -162301, 1221073, 2507857, 1680984, 666004, 867424, 696283, -1325492, -2541379, -1831193, -1177679, -587735, 22549, 54002, -1164110, -2026727, -1354152, -134042, 92429, -732343, -875448, -660408, 425210, -209126, -2534586, -3658164, -2346240, -2449770, -3713292, -2806400, -1002720, -907599, -779754, 1630814, 1612203, -1179903]
860b120637d9821A079215D93137L69928Q66835g2234j355738a76802G06100b63300
849d57743j81688k00372n4181M20547B94076J021912M4638k43442D83410f63672
838a69754B00100a540409j312724Q48770g58829l18766p87182J89691J45243j442280
828b972123j5299J333002O00627p65769Q01663A943873L9239a70794k105048j7298
818b293140d5111A894160k64595n86907m480c12219j261236K81106I27Q97876
808H98803A13332a279396L46016G81960P38860g70749j570576Q06170d75209D89982
797A511327B90269a658459j017624l02390N66378c76492F07854j88956L87781
788H06679C89031d28864L5549j48131l63600M47747B82894J501799J643346N63599
$$ y = [-2120637, -49821, 1079215, 493137, 863065, 1729900, -72234, -1427972, -176802, 706100, -263300, -457743, -639431, -839803, -893984, -473437, 294076, 1315988, 1360626, 1117184, 483410, -663672, -169754, 200100, -1540409, -2853133, -2004363, -758829, -1077595, -1864777, -1675086, -1529843, -2972123, -2987422, -1654420, -1053793, -1819562, -1017899, 1943873, 1983112, -170794, -2275842, -2293140, -45111, 1894160, 1629565, 1042658, 1038178, -312219, -1573455, -1292349, 927, 898803, 113332, -1279396, -933380, 781960, 1520820, -770749, -2341325, -1535155, -475209, 489982, 1511327, 290269, -1658459, -2676083, -2978473, -2412095, -376492, 607854, 418898, 806679, 389031, -428864, -393315, -541446, -905046, -457299, 282894, 1784693, 3428039, 3991638]
778C991638K04519j048987G6619a139760N44085r02028j43482I25079K032459
769B957538A312875a421515j06772f52307A96642O23494C97832e27624n61084
760a088708B07724J795274P64527n62490b71781j901890N12701f18167H61097
750E10890b268828j213670a663235c97162r44994l39306N20685K1695a08995A555796
739A938326E06016a02636C0404N68468J518478L84252j197552n56724m5489a81191
728a466562j65872c07527H09942B73696A11567a125671r12302D67501K455225
719B922726j045245a86140r52214c01453F29465b40800j207787L90048I97221
709A018844A03593O32282K349537J194981q24766j58530o384r09781m16900r63549
$$ y = [3991638, 4196157, 3147170, 76619, -1139760, -595675, -1497703, -1641185, 925079, 2957538, 1312875, -1421515, -1528287, -652307, 196642, 820136, 397832, -527624, -1088708, 207724, 2002998, 2767525, 2205035, -271781, -2173671, -1660970, -618167, 861097, 510890, -2268828, -3482498, -1663235, -397162, -1342156, -1681462, -1160777, -1139082, -108995, 1555796, 1938326, 506016, -102636, 30404, 598872, 2117350, 2501602, 1304050, 747326, 701837, -181191, -1466562, -1632434, -307527, 809942, 273696, 111567, -1125671, -2037973, 467501, 2922726, 1877481, -186140, -1138354, -301453, 629465, -240800, -1448587, -1058539, 997221, 1018844, 103593, 735875, 3085412, 4280393, 3455627, 3297097, 3290713, 2380932, 1964032, 1000483]
699A000483g59281J49309G69461K51538B04639a114256j665739J248761G54812
689E70395h0662D83843c67211k070776j45341k98435m86353O79275h99338i6266
678i79141j019345M08328K50775j316835j335512k26415O31956J598943c03346
668g6759j563976j772433J044663A649270K882148r18969E30057a839640l86280
659b225920a001884A433912J554138A389521E74084O44902n42523b25064B67127
649H8527c53046g9377I01178M12479N24706k13696D20468P97308L69953B15478
638g1462D19223R65609J762414j025184e14585l54962A245653J980896J022961
629D249510q92173A373842E49449b75371j022808O20361A487558J725415p75j050321
$$ y = [1000483, -759281, -609972, 769461, 1020999, 204639, -1114256, -2779995, -1531234, 754812, 570395, -80662, 483843, -367211, -2437987, -2583328, -2881763, -3368116, -2688841, -899338, -96266, -979141, -1998486, -1590158, -1339383, -2656218, -3991730, -4218145, -3586189, -1987246, -303346, -76759, -1640735, -3413168, -2368505, 1649270, 4531418, 3612449, 530057, -1839640, -2225920, -1001884, 1433912, 2988050, 1389521, 574084, 1218986, 676463, -225064, 267127, 88527, -353046, -79377, 901178, 1313657, 1838363, 1624667, 420468, 1217776, 1587729, 215478, -71462, 419223, 1384832, 3147246, 2122062, -514585, -869547, 1245653, 3226549, 4249510, 3357337, 1373842, 549449, -275371, -1298179, -677818, 1487558, 3212973, 3212198, 2161877]
619B161877c55034k042089f17490C566411J527186B490482E65312J08873Q8559
610G62744l16453K879M13625N69637F16754G3683P25430P89642J48458N50475
600B287688m03714C20365j41092J758540Q99074G62664a512723p21745R06071
591a328397H47340M82883h21017r75900b84385B326326N10649j400377n39180
582H97418K94607D76697f16345A8811c99926k977072j19836b47763C52091b922911
571e193353J272899i14396A748987P09724C60337g99742C56229P50285C16252
561a007520L86591E40230c7211r37170E88987J925127A000476a166061C21588
551B408961D47314b945835j053457J323901A06237J333598B99490K21820J968748
$$ y = [2161877, -355034, -2397123, -617490, 3566411, 5093597, 2490482, 565312, 674185, 762744, 446291, 449170, 862795, 1432432, 616754, 73683, 799113, 1588755, 1737213, 2287688, 1883974, 320365, 179273, 1937813, 2836887, 762664, -1512723, -2234468, -1328397, 847340, 1330223, -821017, -1796917, -284385, 2326326, 2836975, 1436598, 897418, 1192025, 476697, -616345, 18811, -399926, -3376998, -3496834, -247763, 352091, -2922911, -5193353, -3920454, -914396, 1748987, 2458711, 360337, -799742, 356229, 1106514, 316252, -1007520, -620929, 540230, -37211, -974381, 588987, 2514114, 1000476, -1166061, 321588, 2408961, 447314, -2945835, -3999292, -2675391, 106237, 1439835, 299490, 521310, 2490058]
542B490058j5975j076995n50729m01031a79210A23702O96126M05541C90914c09081
531C54295L6855c62115q50064d69494B131050K751836j32102k028988J128698
522C850494K418450j428101A495668B46077J37085J203127J070694M3551o29840
513B070694l98761M5321K0044E89384Q3288J972029m38520a354209k937626q75708
503e167543K535748d25577j880460j633229a139278B129190n93620b265078l611177
494e876255L86702K522775b58107m9921J23315B141194J441406n69460p09095
485B304045n39812F92714h57243o14137b64162A931706J117301A231121a527780
475a118642N33554n17323m71042P62935K80863k40674n11267f5516A313212E64899
$$ y = [2490058, 2474083, 1397088, 846359, 445328, -179210, 123702, 819828, 1225369, 390914, -309081, 354295, 391150, -362115, -1212179, -469494, 2131050, 4882886, 4750784, 2721796, 3850494, 6268944, 4840843, 1495668, 246077, 383162, 1586289, 2656983, 2700534, 2070694, 1671933, 1717254, 1737298, 589384, 672672, 2644701, 2206181, -1354209, -4291835, -5167543, -2631795, -425577, -2306037, -3939266, -1139278, 2129190, 1535570, -2265078, -5876255, -5489553, -2966778, -258107, -308028, -184713, 2141194, 3582600, 3013140, 2304045, 1764233, 692714, -857243, -1471380, -264162, 1931706, 3049007, 1231121, -1527780, -1118642, -585088, -1102411, -1573453, -810518, -529655, -770329, -1281596, -65516, 1313212, 564899]
464c62736B74995K251429J389298j434504F15718K35768J050578k91316F01434
454E95835K95640j88909k70472N52649J140615M08461j000886E40271R08229N82798
444B031298I75395d46287I4701M56244a091346n69726c08015E50748j7480c1005
433b029025l54567c88933H38828M51525r9843d26540j45278H93354M18154A5944
422a286764O34721I43671C76899d599271k722441K866201e79836G76567B62741
412a479619q26503Q13449M62963q55880L5432c06025c2414j829849j233138O84206
402b411195b83724B305885N14509H83945b97409J28288A212041K129254R32622
393D273917j904210c01710j359836J93163M8081m26743O71309n1375j744059m24354
$$ y = [-362736, 274995, 2526424, 3915722, 2481218, 615718, 851486, 1902064, 1610748, 601434, 595835, 891475, 702566, 432094, 984743, 2125358, 2533819, 1532933, 540271, 1448500, 2031298, 975395, -446287, 94701, 550945, -1091346, -1661072, -308015, 550748, 533268, -31005, -2029025, -2383592, -388933, 838828, 1290353, 1190510, -426540, -571818, 893354, 1311508, 15944, -1286764, -652043, 943671, 376899, -4599271, -7321712, -4455511, -579836, 776567, 262741, -1479619, -2306122, -1492673, -1029710, -1885590, -1850158, -306025, -32414, -1862263, -3095401, -2411195, -283724, 2305885, 2820394, 883945, -297409, -169121, 1212041, 3341295, 4273917, 2369707, -301710, -1661546, -1468383, -1420302, -1847045, -1175736, -1227111, -2971170, -3395524]
383c395524P01327h31216B542236r50140c221913j146024J787254m07538p27122
374c715343Q67713J121672l07536M93322a72127j145003j799955a133104A753574
364D00311a610843b86474F57607a543206p51497e2108F63629d47179r0056Q3962
354d53273k25835n51976J3693h4196n44825j784844j907508R43183f3577A145113
343i92708j901447q73544J50314J261480E21948K482141j322157a481978j417982
334b899960h95807A759745K180031k37562j274287j60992q59822a046168j388678
325b434846M53183h82242p16105n87496l59354q97107r2170J220237r14320r18273
315d146830J826510d45830j017976k567019M97657J390796o82256q14923j03652
$$ y = [-3395524, -2694197, -831216, 2542236, 1592096, -3221913, -4367937, -2580683, -2988221, -3715343, -2847630, -1725958, -2033494, -1540172, -172127, -1317130, -3117085, -1133104, 1753574, 400311, -1610843, -286474, 657607, -1543206, -2294703, -52108, 663629, -447179, -537235, -453273, -679108, -1231084, -1217391, -84196, -629021, -2413865, -4321373, -3378190, -63577, 1145113, -992708, -2894155, -3767699, -3617385, -2355905, 521948, 3004089, 1681932, -1481978, -2899960, -895807, 1759745, 3939776, 3702214, 2427927, 2266935, 1407113, -1046168, -2434846, -1981663, -882242, -1598347, -2185843, -2545197, -3442304, -3534474, -2314237, -3228557, -4146830, -2320320, -445830, -1463806, -4030825, -3533168, -2142372, -2824628, -3639551, -3743203]
306c743203L73276a656000Q27526l240578k753805J260042K093337j152592n28365
297e150435J237676J913423M0917j353601m90820r1064o48717q88339n21891j83575
287f136426J394927K334552O12293j505900j348406j665275q23937Q54710O80675
278e602787j125575j353327L95166J370036p22177l099116j600333J786304j039016
269a0990825j537746j945161k330128k164756j769766k832766l361391j874970
261b8807509m764773o104022j0602650o9888050j56314307q5822075J29918363
254b32385023b1019273F7235750j0039754j6408701p552241n987913n679314m630879
246A6936948j01094K343867m29396l482863l689854j230728K21382r16913j07529
$$ y = [-3743203, -3369927, -1656000, -828474, -4069052, -6822857, -5562815, -3469478, -4622070, -5150435, -3912759, -1999336, -1958419, -3312020, -3802840, -3893904, -4542621, -5430960, -5952851, -6136426, -4741499, -2406947, -1794654, -3300554, -4648960, -6314235, -7138172, -6283462, -5602787, -6728362, -8081689, -7686523, -6316487, -7038664, -10137780, -11738113, -9951809, -10990825, -12528571, -14473732, -16803860, -18968616, -20738382, -23571148, -26932539, -28807509, -33572282, -39676304, -50278954, -120167004, -276481311, -362303386, -232385023, -21019273, 67235750, 57195996, 40787295, 33235054, 27247141, 21567827, 16936948, 16835854, 19179721, 18750325, 15267462, 11577608, 10346880, 10568262, 9651349, 9543820]
237I543820q7036k725469l297197L64498K700550M36925j748472k066980j350214
228A770425J131107K991725J646693j339581j525031o2653N09826j124943A029620
218E88347K108071J969059k22845j338874o80652j14891J42034n60276o6588O38653
208B462038N86821o55089m57842K549814J889268j766589A420526o91569N36799
199A265756m75075b5315q39071c51713H35323O26219O69385N92583N24107Q12747
189D060364o09435j678956N68463K123434p22581B21323b072229P7199g22821
179h27617j478938a151999A468975J109498A013628k91984A34544P3334J862870
170B070748M99424E76852a269315k63545f91719I41772J006324J044028N50664
$$ y = [9543820, 9456784, 6731315, 3434118, 3798616, 6499166, 6936091, 5187619, 3120639, 1770425, 2901532, 5893257, 7539950, 6200369, 4675338, 4612685, 5122511, 3997568, 1029620, 588347, 2696418, 4665477, 4442632, 3103758, 2423106, 2308215, 2450249, 1889973, 1823385, 2462038, 3048859, 2393770, 1935928, 4485742, 6375010, 4608421, 1420526, 728957, 1265756, 790681, -25315, -864386, -351713, 835323, 1461542, 2130927, 2723510, 3247617, 4060364, 3450929, 1771973, 2340436, 4463870, 3741289, 221323, -2072229, -1995030, -722821, -827617, -2306555, -1151999, 1468975, 2578473, 1013628, 721644, 134544, 207878, 2070748, 2570172, 576852, -1269315, -1532860, -691719, 941772, 1948096, 2992124, 3542788]
161C542788p99436l92545J81028n37358K14646m08415q93662k11156P99718P70830
151B266438j09936m86403L67818K17221m6325P81076R1815F88876b459138k237537
141d696675N47668J497807O52516k93274Q02791g25197r14113k157999L42249
132c455060g77046C51245d71532L3368h3123m96736Q6860D18991J323287R50310
122B692588r84222C21264E2802J744251P08109A246612K47220O97162B53849b143640
111c342121M8673p13756j497855l58878J269082J612450h11131E82204J069323
102A651527Q66716H00411b236091M47557A199486J721708j81100m73271j100914
93A165909a335059j29224B62747J063324A29008a416230j988592P19544H86170
$$ y = [3542788, 2743352, 2350807, 2531835, 1994477, 2209123, 1800708, 907046, 695890, 1495608, 2266438, 2156502, 1670099, 2037917, 2255138, 2208813, 2989889, 3081704, 688876, -2459138, -4696675, -4149007, -2651200, -1998684, -2291958, -1489167, -725197, -1639310, -3797309, -3455060, -777046, 351245, -471532, -438164, -83123, -579859, -492999, 418991, 1742278, 2692588, 1708366, 321264, 52802, 1797053, 2505162, 1246612, 1493832, 2190994, 253849, -2143640, -3342121, -3293448, -4007204, -5505059, -5863937, -4594855, -2982405, -811131, 582204, 1651527, 2518243, 800411, -2236091, -1788534, 1199486, 2921194, 2740094, 2266823, 1165909, -1335059, -1464283, 262747, 1326071, 129008, -1416230, -3404822, -2685278, 886170]
83C555394j055137A95183a506239D54596L218171l0184j701114k81135M48391
74B108725r18835e94501j172425M65929O46858C75815J889360L25444E29487a928186
63c333664j09282R15644M25009n14934L83540i0479A355807E29140a116278a78526
52B312367J026115k80966A130958a941256j656949L55916M50119k95000P37629
43b349541a072514b20309e5567l90148m70245O8042B38052K98352b85135A27459
32A515564K09473A30069a937484l93751a086678H5928J339511k39846c49948m9498
22c99446A635238J939983J62712l22383j170226b70561k069513K64896c85388
12f72642j864181M39287Q83995n89727L39955d24123f2903D95682M17558a27331
$$ y = [3555394, 2500257, 195183, -1506239, 454596, 3672767, 3642583, 1941469, 1660334, 2108725, 1189890, -594501, -1766926, -1300997, -654139, 375815, 2265175, 2590619, 529487, -1928186, -3333664, -3442946, -2527302, -2102293, -2617227, -2233687, -90479, 1355807, 529140, -1116278, -178526, 2312367, 3338482, 3057516, 1130958, -1941256, -3598205, -3242289, -2792170, -3087170, -2349541, -1072514, -220309, -55567, -445715, -915960, -847918, 238052, 536404, -285135, 127459, 1515564, 1725037, 130069, -1937484, -2331235, -1086678, 85928, 1425439, 1185593, -349948, -399446, 1635238, 3575221, 3737933, 3415550, 2245324, -270561, -2340074, -2075178, -385388, -672642, -2536823, -2097536, -1213541, -1803268, -1463313, -424123, -62903, 495682, 913240, -127331]
1b517838q15365
0c333203
$$ y = [-2517838, -3333203]
##PAGE= F1=1443.015800438
##FIRST=     18110.137220953, 5591.54909048506, -674192
##DATA TABLE= (F2++(Y..Y)), PROFILE
1023f74192c35417j571064r95917K02281P89843a79473C78757g73390L54795A237954
1012G74568h82489l54297e49173q7467I0736J612982J082368F52736b470715K37228
1002b233487h8250A5033K4953M47921b82878A40608J320714m31632B85850k36
992B85614b81587i6182G26061R86236M87067j17353F70034d76361Q3421a95230
981G35650J13668f44966n98025B52635J650377R35529K5943j257445A77350E4763
970a89924j064061j75131a86353A218692j44704J81868O54462r5391n49754E19074
959c23376p987E97180N25255j37426N83266L86698I68226e40154m61399k0685
949a022238j465633k114094R81510b0610B204345n12636d90840l3794H47927J53638
$$ y = [-674192, -335417, -1906481, -2902398, -2700117, -1910274, -179473, 378757, -773390, -418595, 1237954, 774568, -882489, -1236786, -549173, -636640, 90736, 1703718, 2786086, 652736, -2470715, -2233487, -88250, 15033, 39986, 487907, -282878, 140608, 1461322, 1029690, 285850, 285614, -281587, -96182, 726061, 1712297, 2199364, 2082011, 670034, -476361, -392940, -195230, 735650, 849318, -644966, -1242991, 252635, 1903012, 2838541, 2864484, 1607039, 177350, 54763, -189924, -1253985, -1429116, -186353, 1218692, 1073988, 1255856, 1910318, 1814927, 1265173, 519074, -323376, -331363, 597180, 1122435, 985009, 1568275, 1954973, 968226, -540154, -1001553, -1022238, -2487871, -4601965, -3620455, -20610, 2204345, 1691709, -490840, -524634, 847927, 1001565]
939A001565m86911j0082b9974a3276p97918j150117c69135B542399R75707j123923
929B394183A027364D86785M28949L46343J80880l52163K99512K70312o42602b13797
918d55972q1585J44905A089579O99310j67185L58339H93581a357699n96026b64681
907E37913e92019j202429K21747h3966G26605c81320n51745m0495p40979K96226
897a418313b03383I98300J207919n87612E73636N3706K33228e84829r66333M81914
887a069248M72606C11994N00829c09156j949169l15852J246039c00558j97332
878d97890o16454K18178n5756D7469L35757a519035j922555P74390O09467p28673
868b786406P2163P04985l21562r8725C97018J040769b39676p36121A58278K66630
$$ y = [1001565, 514654, 504572, -29974, -13276, -811194, -1961311, -369135, 2542399, 3518106, 2394183, 1027364, 486785, 915734, 1262077, 1442957, 1090794, 1390306, 1660618, 1018016, -213797, -455972, -537557, -392652, 1089579, 1788889, 1621704, 1980043, 893581, -1357699, -1953725, -264681, 537913, -592019, -1794448, -1572701, -83966, 726605, -381320, -933065, -973560, -1714539, -1418313, -203383, 998300, 2206219, 1618607, 573636, 627342, 860570, -584829, -1551162, -1069248, -596642, 311994, 812823, -309156, -2258325, -2574177, -1328138, -300558, -497890, -1114344, -896166, -951922, 47469, 383226, -1519035, -3441590, -2667200, -2057733, -2786406, -2714243, -2009258, -2330820, -2429545, 397018, 1437787, -239676, -975797, 158278, 424908]
858D24908b59513C88130J695268A014537c27864H96025P04667b45237j320652
849a565889k17094M76111K47626K8038d06278A053213k7650l37842M3800C31232
838F63281J82101d09029j010011M11290c94229O1118m9201q9593q05854j908480
828c186239K96161a364608K76149q12761O17623A927417M30474b11413k204896
819b416309R6766b79903A276984k68232k67191M64742c40067j477073N74762b17450
808E06034d41953j609756J90248A5030R87138a015282j123709g20937H47898M66301
798A314199k57822i06384j618504o45641j58403R25416a72707C34700c77693A24062
787B46638b32341j78017o666m19240J12001A79064J912938J626005L9781n60967
$$ y = [424908, -259513, 388130, 2083398, 1014537, -327864, 896025, 1600692, -245237, -1565889, -1782983, -1306872, -1059246, -1031208, -406278, 1053213, 1025563, 687721, 731521, 331232, 663281, 845382, -409029, -1419040, -1007750, -394229, -333111, -382312, -471905, -1277759, -3186239, -2890078, -1364608, -1088459, -1901220, -1283597, 1927417, 2357891, -211413, -2416309, -2319543, -279903, 1276984, 1008752, 741561, 1206303, -340067, -1817140, -1242378, -217450, 506034, -441953, -2051709, -1861461, 15030, 1002168, -1015282, -2138991, -720937, 847898, 1314199, 1056377, -906384, -2524888, -3170529, -3328932, -2403516, -172707, 334700, -377693, 124062, 246638, -232341, -410358, -417024, -836264, -724263, 179064, 2092002, 3718007, 3757788, 3196821]
777C196821j396067e39637l67880j64632j660840L35325F23779J862035C24543
767b202205R38623B79628O94059K52925B25498a100403l61967B23072J951814
758B174886J040586m08508G4472b201627K66780g73742A272759K6897a509573
748c358442J324319d44461q27174o82734P6692K34026a17729B559071R89912A702483
737a62044j179576J36964A018038J332721r58710l00303P77830n25880e32611
727a207825d16823E30715B30662L33106k74867a89166I46796J100196q24761a92221
716e56092b7468E70619a55099r71197M91658A458741j27161a48404e3925B319918
705D046343p34238l46767k5156o55225o69098B53530a771891r0800e43477C72489
$$ y = [3196821, 1800754, -539637, -907517, -1072149, -2732989, -2397664, 623779, 2485814, 324543, -2202205, -1263582, 279628, 973687, 1226612, 225498, -1100403, -1462370, 223072, 2174886, 3215472, 2806964, 74472, -2201627, -1934847, -773742, 1272759, 1299656, -1509573, -3358442, -2034123, -444461, -1271635, -1954369, -1877677, -1643651, -117729, 2559071, 3548983, 1702483, -162044, -1341620, -1204656, 1018038, 2350759, 1392049, 1091746, 1869576, 1343696, -532611, -1207825, -416823, 530715, 230662, 563768, 288901, -189166, 946796, 2046992, 1222231, -192221, -556092, -27468, 570619, -155099, -1126296, -634638, 1458741, 1331580, -148404, -53925, 2319918, 4046343, 3312105, 2965338, 2940182, 2284957, 1615859, 253530, -1771891, -1862691, -543477, 372489]
694B23855h99406j624795i77846B248184N06311A180620E05249b22703j368779
685a591482o3920k65158p46629l60852J313427g67050r16540j192113J162613
676a713090d55238j536014j916343k32016J145584h10723D65917d50885j606628
667b057513j687162O8784c18460C122647j91908D38424a545400L53299c09999
657A196654J160946A148933A26247K43798A00212a28669F93796j98747b19453
647d48715C63225N21603O66103l20588a04910A092226O28192A84577Q0390P32557
637I97524N79665J418489j356382a623869o26677h3540B273702J376620q93371
628B756951G14385A13083d25483o49674c17440A731003R12801m99777p61593d49938
$$ y = [223855, -899406, -2524201, -977846, 2248184, 2754495, 1180620, 505249, -222703, -1591482, -1655402, -1920560, -2667189, -3028041, -1714614, -767050, -1683590, -2875703, -1713090, -455238, -1991252, -3907595, -4139611, -2994027, -810723, 465917, -450885, -2057513, -3744675, -3675891, -318460, 3122647, 2930739, 438424, -1545400, -1192101, -309999, 1196654, 2357600, 1148933, 126247, 370045, 100212, -128669, 693796, 495049, -219453, -448715, 363225, 884828, 1550931, 1230343, -104910, 1092226, 1720418, 184577, 264967, 997524, 1577189, 2995678, 1639296, -1623869, -2250546, -83540, 2273702, 3650322, 2756951, 714385, 113083, -425483, -1075157, -317440, 1731003, 2643804, 2144027, 1382434, -449938]
617b232744g79690B665097R41726A033779b93676D15204K7234b84383k13344K12422
607b85305D98911j78970K47349O49848m07816j71839O44717L33187G99453Q4684
597H84137J688658O10414I86654a034406n64649O73059G86931M4010a235109p66035
587b001144c75131A909051N14691I69694D44572O45207l94985f68880K01625l50730
577h17985k689674n51955i43826C42671b055455k468640L42287b051238B87618
567A635595E58148g24124B64198J518611l16373e25519o04697a72928d8207n85307
557f33514C96144J354533G48134a009723E82389L007857r75691a477557k409130
548c886687R61880a66722A060934c4412C41294K115170L09635j070733E52191
$$ y = [-2232744, -779690, 2665097, 3606823, 1033779, -293676, 415204, 442438, -284383, -497727, -285305, 498911, 319941, 567290, 1217138, 809322, 637483, 1282200, 1615387, 799453, 884137, 2572795, 3183209, 986654, -1034406, -1599055, -925996, 786931, 830941, -1235109, -2001144, -375131, 1909051, 2423742, 969694, 444572, 1089779, 694794, -668880, -467255, -817985, -3507659, -4059614, -943826, 342671, -2055455, -4524095, -4181808, -2051238, 287618, 1635595, 558148, -724124, 264198, 1782809, 1466436, -525519, -1130216, -172928, -48207, -633514, 396144, 1750677, 748134, -1009723, 582389, 3590246, 2614555, -1477557, -3886687, -2924807, -166722, 1060934, -34412, 341294, 2456464, 2766099, 1695366, 552191]
538e513j84099B80988N33772R1799B09565c86588a61154f5810r4673k22692I4195
526A380467J275063J31550q78484J231969K175383q15089A478527D9833d5678
516F36216P46177M27142J34062j21520L09102K01304A75394e80186B282157Q25301
506C107458H7627b804340j182481J934570A81555a554232j753016g60768B355774
496A919120a563005l375297O51138b129644g1508J872F46091K061466N27097m81523
486B753131m90390r70102b93564j357694l1914d09396A048527P67546C58291a813420
475a224586P8252p05098P5808O92278L24515L61311J47054a03593C83708c39454
464i49179B4695K250418J290084j592643e50643l60289F98902Q70930n31872m96588
$$ y = [-5513, -189612, 280988, 814760, 906559, 209565, -386588, -161154, -65810, -160483, -383175, 94195, 1380467, 2655530, 2787080, 1908596, 3140565, 5315948, 4500859, 1478527, 49833, -45678, 636216, 1382393, 1809535, 1943597, 1822077, 2131179, 2332483, 175394, -580186, 2282157, 3107458, 87627, -2804340, -3986821, -2052251, 181555, -1554232, -3307248, -760768, 2355774, 1919120, -1563005, -4938302, -4287164, -2129644, -71508, -69636, 646091, 2707557, 3234654, 2753131, 2262741, 1292639, -293564, -1651258, -1683172, -409396, 1048527, 1816073, 358291, -1813420, -1224586, -1146334, -1851432, -1775624, -1083346, -758831, -397520, -250466, -103593, 383708, -339454, -949179, 24695, 2275113, 3565197, 1972554, -550643, -910932, 698902, 1569832, 1037960, 541372]
454E41372K62336L28537j02338N58548J292225P2613j042713F44957K85483Q20622
444A751062m27147a51218e183A28513a558565p22354N88259Q14647M38743b11143
433a150008J77323E29291N38183k05377d6086j261650b89665A258442E86194e78753
422h67377K05034b49251N8843m255418l296544K409267a428482F23749k83083
413C40666a143906r17234O14581e58970n27813j11838F8563e07756k929104n07105
403c943965a826519A27638K031127J199252j165629E12866i0255A055392J253224
394B308616j03773G74021f83963j061984M3230k31918l47423h42312M11162j815327
384b246477j048428O88637c79883B670590j061063b536171o95532J220971q01757
$$ y = [541372, 803708, 1132245, 1029907, 1588455, 2880680, 2953293, 1910580, 644957, 930440, 1751062, 1323915, -151218, -5183, 128513, -1558565, -2280919, -1692660, -878013, -439270, -211143, -1150008, -972685, 529291, 1067474, 862097, -46086, -1307736, -289665, 1258442, 586194, -578753, -867377, -662343, -249251, -190408, -4445826, -7742370, -5333103, -1428482, 623749, 340666, -1143906, -2061140, -1446559, -558970, -1086783, -1198621, 68563, -507756, -3436860, -3943965, -1826519, 127638, 2158765, 3358017, 2192388, 512866, -90255, 1055392, 2308616, 2204843, 774021, -683963, -1745947, -1702717, -1934635, -2282058, -842312, -431150, -2246477, -3294905, -2606268, -379883, 2670590, 1609527, -2536171, -3231703, -2010732, -2812489]
375b812489q55842N17361J351095J19874L96960D56735c42055k520678N35567
366b327166D94860a2809j960555P85308f9406j740483N9672A191096q2990a605827
355b324779J134396d93941q91622k36854C62292c4347k468268k491935R84220
346d010330a5968A895588D6810b131393j230723k51574J100923D87927L167259
337C655186o31280I2336a247715g8473A530967K290786P12811r38109q8227q59948
327B648280a39242j959758L93821c21079o77484o94576l84221n23601N6164a220086
316a585774j100017J232059a99713j725717l209746K40714J074299k93247J51925
307c961485Q15246N93849a065445L88087k798898k077132J500745a516088j238553
$$ y = [-2812489, -3668331, -3150970, -1799875, -1680001, -1283041, 456735, -342055, -2862733, -2327166, 494860, -12809, -1973364, -1188056, -69406, -1809889, -1750217, 1191096, 1108106, -1605827, -2324779, -1190383, -493941, -1385563, -1622417, 362292, -34347, -2502615, -4994550, -4010330, -15968, 1895588, 46810, -2131393, -3362116, -3613690, -2512767, 487927, 3655186, 3023906, 92336, -1247715, -78473, 1530967, 3821753, 4534564, 3596455, 3508228, 2648280, -139242, -2099000, -1705179, -321079, -998563, -1693139, -2077360, -2600961, -2544797, -1220086, -1585774, -2685791, -1453732, -199713, -1925430, -5135176, -4894462, -3820163, -4113410, -3961485, -3146239, -2552390, -1065445, -677358, -3476256, -5553388, -4052643, -1516088, -2754641]
298b754641j854597R97335a256714L28809j054011l37553l82038j493727j475430
289e670664j93090Q16573J694108i71556b28899j690838j811841j827023o08789
280f167390J343665M38294j490891r24241O58559P27933j613342k782588m35479
271a0245480K096365n47700j083225j902937l400552j843168R5362k170931j915935
262b0918201p69525l809071l433752o349775m8640477j09051766o1282784Q9145804
254a65109547a6122712D9536640o728176j2255737o150156n953565l808998k751330
246A1888678n45886L659566J219099l991269l680478q49517N18098m89780k34637
237G493874l4649j998709B353975L54608L118151R62449k586556A916621p30794
$$ y = [-2754641, -4609238, -3611903, -1256714, -927905, -1981916, -2319469, -2701507, -4195234, -5670664, -5863754, -5047181, -3353073, -971556, -228899, -1919737, -3731578, -5558601, -6167390, -4823725, -4385431, -5876322, -6800563, -6142004, -5414071, -7027413, -9810001, -10245480, -8149115, -8696815, -9780040, -11682977, -15083529, -16926697, -16831335, -19002266, -20918201, -21687726, -25496797, -28930549, -35280324, -83920801, -192972567, -254255351, -165109547, -16122712, 49536640, 42808464, 30552727, 24402571, 18449006, 14640008, 11888678, 11342792, 15002358, 16221457, 12230188, 8549710, 7700193, 8218291, 7728511, 7493874, 7459225, 5460516, 2353975, 2708583, 5826734, 6789183, 4202627, 1916621, 1185827]
228A185827O59279K090943K334731o2564j850081l95423J73282j281286C95434
218C90460K077559J589701l29167p99964j89746o04076l86282F13690b9617G10285
207A802702H72795f11847A997886K608574j227507B88619a68410F99985k99480
198D00505c20135p45251M9780a72568A158496J103324P18350J023709P10447j322467
188C391859A581292L22524J680980j149095a368127k149523O68033P43793j07814
179b213638m48095g66261A326601r0000A6488P13279j39852l9344J405879K87431
169B243881F18587a079533n17202c25587A364081O24094J464745J033192j379153
160C106959p52800M02802n21792n4171m79847F21679k88212O57281O89467M67228
$$ y = [1185827, 1845106, 3936049, 6270780, 6208216, 4358135, 3962712, 4135994, 2854708, 395434, 390460, 2468019, 4057720, 3728553, 2928589, 2738843, 2134767, 1748485, 613690, -29617, 710285, 1802702, 872795, -611847, 1997886, 4606460, 3378953, 288619, -168410, 699985, 400505, -320135, -1065386, -1015606, -172568, 1158496, 2261820, 2980170, 4003879, 4714326, 3391859, 1581292, 1903816, 3584796, 2435701, -1368127, -3517650, -2849617, -2105824, -2213638, -2661733, -766261, 1326601, 1236601, 16488, 729767, 589915, 550571, 1956450, 2243881, 618587, -1079533, -1596735, -325587, 1364081, 1988175, 3452920, 4486112, 3106959, 2354159, 2756961, 2235169, 2180998, 1701151, 621679, 333467, 990748, 1680215, 2147443]
150B147443K83024M13244n03678r57751J88404l5346E8479b089846j788624j8788
140c897258J024793R41192J47126d03419E70263a294173l050873J91889i69740
130A087980m41826d62917l31256J7945K61296B01603J806849P94140E86723a260615
119d94684A967178Q36491r91453j87710j22303A40577e93170k71253q20506j454498
109c139427j535113l0018J759268a446490b3194I16326Q59373J052746A397859
99a912245m47375E45188K288201K71294M4778l86463C21926d15205F46350M79595
89A125945a16106j593845k183509J658547B128457K778035j895616c31407k415445
80b746852g81706B475647N31960A435793F19740L88362K91500a16063k426664
$$ y = [2147443, 2430467, 2843711, 2340033, 1382282, 1570686, 1535340, 58479, -2089846, -3878470, -3897258, -2872465, -1931273, -1784147, -403419, 570263, -1294173, -4345046, -4153157, -969740, 1087980, 646154, -462917, -794173, -776228, -514932, 201603, 2008452, 2802592, 586723, -1260615, -494684, 1967178, 2803669, 1812216, 1624506, 1502203, 140577, -593170, -864423, -1684929, -3139427, -4674540, -4704558, -2945290, -1446490, -23194, 916326, 1775699, 2828445, 1397859, -1912245, -2359620, 545188, 2833389, 3104683, 3149461, 2762998, 321926, -415205, 646350, 1125945, -116106, -1709951, -3893460, -2234913, 2128457, 4906492, 3010876, -331407, -2746852, -781706, 2475647, 3007607, 1435793, 619740, 1008102, 1299602, -116063, -2542727]
71b542727j70872a112244C97890J500753M54873F83648b074237j466492L11995
62c228734Q61790L91436k77282Q05375I00503J305827r86560f55650o6547A077420
51C041063p6641D86296b447329j324326O25908P14490l78478M01179f62792H02734
40D88354h57625k06808M39574F54012P78488l13920O10175J366105l53521E61046
29a799915k01848e13368I80986J174387M3955G89637r743J891661J472648Q0768
19D224971M5557j279694b31133k444018J55071a154126l07585r29296a183617
9a54827r70629n83414O45435b34248C18281L05233e0440k087713n87588
0b725741
$$ y = [-2542727, -2713599, -1112244, 397890, 1898643, 2353516, 683648, -2074237, -3540729, -3228734, -2366944, -1975508, -2252790, -1447415, 900503, 2206330, 1219770, -655650, -722197, 1077420, 3041063, 2964422, 486296, -2447329, -3771655, -3145747, -2431257, -2809735, -2408556, -662792, 802734, 488354, -857625, -1064433, -624859, 654012, 1432500, 1118580, 1728755, 3094860, 2741339, 561046, -1799915, -2001763, -513368, 980986, 2155373, 2199328, 789637, 779894, 2671555, 4144203, 4224971, 4270528, 2990834, -231133, -2675151, -2520080, -1154126, -1461711, -2391007, -1183617, -154827, -1125456, -1708870, -1063435, -234248, 318281, 623514, -50440, -2138153, -2725741]
##PAGE= F1=1421.398262927
##FIRST=     18110.137220953, 5591.54909048506, -67199
##DATA TABLE= (F2++(Y..Y)), PROFILE
1023f7199D87195f67438r92621p62404l58f83666e3181j303737d34873B225645
1012A758390a025156j081669g93660L00063A55033J914057J053935A122031b018803
1002b301666g36899a02188a0437B0647a103878K54291F33259j34110i2470j32181
992b24651o84371a23621A545045J146916m67880I96400i52577r88059R17862e6513
981D50441j76126h38481o06449b55755A500745J144608k08075A152560c50566
971I5231J172605k47615d30813J56766A101136k40299n6419O71418J02338l81752
961A196422n37310A46716K6509J017701N18686l27489K87643O57006j033970g91125
950b114849k76884j367816j776049J633438d54394A079456a88261k033274N04933
$$ y = [-67199, 487195, -667438, -1660059, -2422463, -2422821, -683666, -53181, -1356918, -434873, 2225645, 1758390, -1025156, -2106825, -793660, -493597, 155033, 2069090, 3123025, 1122031, -2018803, -2301666, -736899, -102188, -10437, 20647, -1103878, -849587, 633259, 499149, -92470, -224651, -909022, -123621, 1545045, 2691961, 2224081, 996400, -952577, -1940636, -1022774, -56513, 450441, 274315, -838481, -1444930, -255755, 1500745, 2645353, 2437278, 1152560, -350566, 95231, 1267836, 1020221, -430813, -274047, 1101136, 860837, 804418, 1475836, 1578174, 1196422, 659112, 146716, 173225, 1190926, 1709612, 1382123, 1669766, 2326772, 1292802, -791125, -2114849, -2391733, -3759549, -5535598, -3902160, -454394, 1079456, -188261, -2221535, -1716602]
941a716602a95267l200l07559A42389K38748Q87419l80569g57880A47948K337967
931B485915O55582p12999p04962o38627J78887R65959J0397A058807P4397O16630
921A749834D39354a765107L92660F8978M18390M91906J71035K18424Q06028I22424
910a482787n42937b94292E99536e18037r58135f89791A027648J71999e46639k84648
900h31287J91082q53357J70178b12959E29879J046700k7300E98839B11875M90333
890G02208B18117b2370G4508a38535G62643P17402a98206k576033k6545a224199
879f09709n31727j88474M85577n19744N83408E60418b45860k362310j65012R21990
869a851192r702n84855k55797l81450j38529d16107A452971G05921G0622L92050
$$ y = [-1716602, -195267, -198467, -506026, 142389, 381137, 1268556, 887987, -757880, 147948, 2485915, 3141497, 2428498, 1723536, 1084909, 1263796, 2229755, 2240152, 1058807, 1133204, 1749834, 439354, -1765107, -1372447, 68978, 487368, 979274, 1150309, 1368733, 2174761, 922424, -1482787, -2025724, -294292, 599536, -518037, -1476172, -689791, 1027648, 1199647, -546639, -831287, -640205, -1493562, -1323384, -212959, 529879, 1576579, 1549279, 598839, 211875, 702208, 218117, -22370, 74508, -138535, 762643, 1480045, -198206, -2774239, -2800784, -1224199, -609709, -1141436, -1329910, -844333, -1364077, -780669, 560418, -245860, -2608170, -2773182, -1851192, -1860894, -2445749, -2701546, -3082996, -3221525, -416107, 1452971, 705921, 70622, 462672]
859D62672e7623j017082N06416A624280R8064F59965J051900N65739E082b068652
848b389062Q15829N33550j93798M52655H57786j34504A77876O52604N47819l8913
838A339386j49481l94571C90837A32571F0216N45930N80346n38082i78800k042536
828c021336K61772J371197K81833n99972P4753A064405R82923f6327j904432r3452
818b064211f34612D81141P3262J82735O20270c52362j744189P90073d47389G7703
807i35510j753546J53337f31180E05580a117971q78808b33012B009658J33316
798B142974G38239a656984j259018l26733O1371J123627a48788k67828j030659
789a447275f20456A58008N7123F8044J08884c56270k78178C45462J917219J026930
$$ y = [462672, -57623, -1074705, -568289, 1624280, 1722344, 659965, 1711865, 2277604, 5082, -2068652, -2389062, -1573233, -1039683, -1233481, -780826, 857786, 723282, 177876, 830480, 1378299, 1339386, 1189905, 795334, 390837, 132571, 60216, 606146, 1186492, 648410, -978800, -3021336, -2759564, -1388367, -1106534, -1706506, -1631753, 1064405, 2047328, -66327, -1970759, -2064211, -634612, 481141, 554403, 737138, 1357408, -352362, -2096551, -1306478, -447389, 77703, -935510, -2689056, -2535719, -631180, 505580, -1117971, -1996779, -233012, 2009658, 2142974, 738239, -1656984, -2916002, -3242735, -3181364, -2057737, -148788, -416616, -1447275, -620456, 158008, 215131, 68044, 176928, -356270, -634448, 345462, 2262681, 3289611]
779C289611n33680r37080C93208a046794K76318r93011k002142J033441B07898
769A515487g20489j921855i65499I36838N13057Q1691B37701a359027k9032D31435
758B141287J050966o0365H10999a607274k81223Q99590A257713O53007d40865
748b828193P43553i0393n51719j112581n88494M43591A0287K856912J175865j631993
738B411071b08879k357941m81561f07483A716621j23937k31245J349891J28594
729B839924E81332g92119L22421D35714p359O34370O82227M32194J24706k61499
719B040353r85755h7193G6254L51951K14608h4176n79779c7268A782544l73923
709A408621c01398l72178A179052J879545k96467l59050l56081m57848p05789
$$ y = [3289611, 2755931, 1818851, 393208, -1046794, -770476, -1763487, -3765629, -2732188, 207898, 1515487, -720489, -2642344, -965499, 936838, 1449895, 1531586, 237701, -1359027, -1388059, 431435, 2141287, 3192253, 3131888, 810999, -1607274, -1888497, -988907, 1257713, 1910720, -440865, -2828193, -2084640, -90393, -642112, -1754693, -2343187, -1899596, 10287, 2867199, 4043064, 2411071, -208879, -2566820, -3048381, -607483, 1716621, 1592684, 1361439, 2711330, 2839924, 581332, -792119, -469698, 435714, 428355, 1062725, 1744952, 2177146, 2301852, 2040353, 1054598, -87193, 76254, 428205, 642813, -84176, -663955, -37268, 1782544, 1408621, -301398, -673576, 1179052, 3058597, 2762130, 2403080, 2046999, 1589151, 883362]
700H83362d33335j859468l76622R31704d73054a1964n69502j050628C4013L370138
690C404151P28996A780974B33317a34999o37219k18583j84209o62531j039012
681b876553P61641a013811q21264j458032a567719G61096e27098k208869m39120
672c175087J498442I98351Q36387d8429j596132j648398j138649J948128I87077
662A974973E15279i79395b70111B68589N69740O00566G11864a28494j13155q0965
652c22614A0121J214434J593C77117c03191A07283M29424O60141l92921c56646
641A354680O97734B43179J38622R68953L15935R98035A182564b239566r90974
632c230540a259131A422671J541433j065215b97794m67411K06928P7561C13236
$$ y = [883362, -433335, -2292803, -2669425, -1737721, -473054, -11964, -581466, -1632094, 34013, 3404151, 4133147, 1780974, 233317, -134999, -772218, -990801, -1175010, -1837541, -2876553, -2114912, -1013811, -1835075, -3293107, -1567719, 761096, -527098, -2735967, -3175087, -1676645, 998351, 1834738, -48429, -1644561, -3292959, -4431608, -2483480, 987077, 1974973, 515279, -979395, -270111, 268589, 838329, 1438895, 711864, -128494, -241649, -322614, 10121, 1224555, 1226148, 377117, -303191, 107283, 536707, 1196848, 803927, -356646, 1354680, 2052414, 243179, 381801, 1350754, 1666689, 2664724, 1182564, -2239566, -3230540, -1259131, 1422671, 2964104, 1898889, -297794, -765205, -558277, -480716, 313236]
622B003982r1784H77825C38406e90048j070528e25338A835016K72600b9319p27424
612g56743E05404J50475e03167o75974m5528b29567B61902Q71992L64329A71701
601a11772C47773N92939J94510N74241J255264R2872A078721d21130l21161c54232
590H16067k36708a101850n28220a91892A456846M92723G09676B61830O15984j92077
580F85737f37509l27152k88562j832300o11070a103872E34463i40570k505967
571c446537n78895J153249a099007E01699k50121f80193F12670K049072l29652
562B332090e8639j136381b72451F20418q1678L2366L15852l13319d73152I45419
551D313729K88913H05842b603648K94907a38714E92003e30895a18004B040790
$$ y = [2003982, 1912198, 877825, 338406, -590048, -1660576, -525338, 1835016, 2107616, -29319, -756743, 505404, 655879, -503167, -1179141, -1224669, -229567, 261902, 1133894, 1498223, 171701, -111772, 347773, 940712, 1135222, 1709463, 2964727, 3057599, 1078721, -421130, -742291, -354232, 816067, 579359, -1101850, -1630070, -191892, 1456846, 1949569, 709676, 261830, 877814, 685737, -637509, -964661, -1253223, -3085523, -3696593, -1103872, 534463, -940570, -3446537, -4025432, -2872183, -1099007, 501699, 251578, -680193, 612670, 2661742, 2332090, -58639, -1195020, -272451, 620418, 538740, 571106, 886958, 573639, -473152, 945419, 4313729, 4602642, 805842, -2603648, -2308741, -138714, 592003, -530895, -118004, 2040790]
541B861908p45408D31188d46654a42376E23932N7325C6199a53951A7789b19937
530b85327E21117P60994j16849m41336l42419L16458M61478J247280J766484k42301
520C930906A369104b16069l22171J02996G2350R84509R88726r6830L15457M59580
510B723792B0227a378408A932093J792440j769276c4562j283623O37630A027265
500b71963j765088c51565B186777O7130b89301k823999J21159J412817e74692
490a80890A415053J635899n97459m59437j52966G95552a094160j163883O94021
481a564022a45395B79114J89049a54920q53121M69612q04920r08020R66888e06249
470b62799C94522O28778A20424b06690n05390l42040i5530A792896J128245A437204
$$ y = [2861908, 2116500, 431188, -446654, -142376, 523932, 581257, 36199, -153951, 17789, -219937, -285327, 521117, 1282111, 1165262, 723926, 381507, 697965, 1159443, 2406723, 4173207, 3930906, 1369104, -216069, -538240, -435244, 72350, 1056859, 2045585, 1948755, 2264212, 2723792, 20227, -1378408, 1932093, 3724533, 1955257, -34562, -1318185, -680555, 1027265, -271963, -2037051, -351565, 2186777, 2253907, -289301, -3113300, -2992141, -1579324, -574692, -180890, 1415053, 3050952, 2453493, 1994056, 1841090, 795552, -1094160, -2258043, -1564022, -145395, 279114, 468163, -154920, -1008041, -538429, -1343349, -2251369, -1284481, -506249, -262799, 394522, 1023300, 120424, -206690, -712080, -1054120, -95530, 1792896, 2921141, 1437204]
459a391440p69645b81869A391435k2893E27162K19636P96189j94219L58167J269984
449B976919j1769j168347D36453A45998R53614J03489a63947l8258P9559j286883
439a409529o74836j90644M08566R14269C9686g1112C24913R55485j31444B19822
428a210738n98015B06726J458609A37533g55354b08169m55036n59894d63054k716240
418c179294k829158J181682a757239E06239o1365f89755q88785M43925B75922
408C36656b7374G55473e06985l572638J24173g39584H34107J331259J742509k40884
398C666991A744093D60057N25247J20225i424p14746l359l86095r4114p84677
388a992415q51161a082087A74371a003288j518068L15943a9773B390578q57309
$$ y = [-1391440, -2161085, -281869, 1391435, 1368542, 527162, 746798, 1542987, 1348768, 1706935, 2976919, 2965150, 1796803, 436453, 145998, 1099612, 1203101, -163947, -202205, -122646, -1409529, -2084365, -2275009, -1866443, -952174, 39686, -71112, 324913, 1280398, 1148954, 219822, -1210738, -1808753, 206726, 1665335, 137533, -755354, -208169, -663205, -1223099, -463054, -3179294, -6008452, -4826770, -1757239, 506239, 444874, -689755, -1578540, -1134615, 275922, 336656, -27374, 755473, -506985, -4079623, -3955450, -739584, 834107, 2165366, 3907875, 3666991, 1744093, 460057, 985304, 1105529, -9424, -724170, -727529, -1113624, -1207738, -1992415, -2843576, -1082087, 174371, -1003288, -2521356, -2205413, -19773, 2390578, 1533269]
379A533269a387096l62036P33702r54325q49571J21984J258398L26516J45036
370i67392F78262a8806k622734m24378e76861b32713j534128K44390e60058r32345
360a492403g13509B289045r11732b567095r80601a444247c05234j240682n31939
351b077855A60633D1227b507154k256659J190486F96895K395295j502249a079125
341b785037m89167J026727E85891L350978J16590A653544E15503K00731K18048
332I34282J902196J486412m83996j57889l12330A157963a110062j9223A23874
322b16049p59231n44764k52209J14344b01775A37376a081069d89797B81879a773647
311e235629k95082N15562J35670R33494J743276a073826a86841k63055k102013
$$ y = [1533269, -1387096, -1749132, -1015430, -1969755, -2819326, -2697342, -1438944, -1112428, -967392, 678262, -18806, -2641540, -3065918, -576861, -232713, -1766841, -1522451, -560058, -1492403, -713509, 2289045, 1377313, -2567095, -3547696, -1444247, -305234, -1545916, -2077855, 160633, 41227, -2507154, -4763813, -3573327, 696895, 3092190, 1589941, -1079125, -2785037, -3274204, -2247477, 585891, 3936869, 4053459, 1653544, 515503, 716234, 934282, 2836478, 4322890, 3838894, 3681005, 3368675, 1157963, -1110062, -1129285, 123874, -216049, -975280, -1520044, -1772253, -1657909, -201775, 137376, -1081069, -489797, 281879, -1773647, -5235629, -5530711, -5015149, -4879479, -3945985, -2202709, -1073826, -186841, -449896, -2551909]
302b551909j213480J574243A02718i45922k415205J217364D55557K95883d26826
292a054061q66243j766509j277776M40031J648885a376030F79159O15822d91083
282b399102j560697l35879J604452r3636j483993l54908Q32407K98108j879579
273e372827k255675K93285K104957J88710m86333j320887l108545r62431P92198
264a0127548j448412n40699K1216j185877j214046l834933k3132704n0096943
256i1559946k9500477M1842946h951627B4848012l910453o005689k835737m022695
248H073438j324455q96689j273702K918841K180162k832616k574920k97360O36743
239D609442l61857o12153K05527n94519A310690P30699L031724P78044B756082
$$ y = [-2551909, -3765389, -2191146, 102718, -945922, -3361127, -2143763, 455557, 751440, -426826, -1054061, -1920304, -3686813, -4964589, -4524558, -2875673, -1376030, 679159, 1294981, -491083, -2399102, -3959799, -4295678, -2691226, -2784862, -4268855, -4623763, -3791356, -3493248, -5372827, -7628502, -7335217, -5230260, -5041550, -5527883, -6848770, -9957315, -10919746, -10127548, -11575960, -12116659, -12095443, -13281320, -14495366, -18330299, -41463003, -91559946, -121060423, -79217477, -8951627, 24848012, 20937559, 14931870, 12096133, 8073438, 6748983, 5852294, 4578592, 7497433, 9677595, 6844979, 4270059, 3972699, 4609442, 4247585, 3635432, 3840959, 3246440, 1310690, 2041389, 5073113, 5851157, 2756082]
229E55100q0061L39687J311355K768861J299723j501951p43115o22428A593031
219c85046h7016A716858J053080k82925r3530L70147o82657r15126e88448j488014
209b076462P01436B80600g88049k165489b62577B841790q25276g40902k88802
200a029704a0035j34346p09954n59110j23517N46125G29287J380236P52331J172361
190D034215M47273j646655A036198M2743J294808A068713b597084j792638J101923
181c287799j52011m44347O49851f32208A133506C78698b63908G39043J21299J6980
171H77322J017203M3301F56583i68967q23676e7770A848338M28694J319670P66936
161D363638j749672p29121N96850o62808l79664l22893d1635l88599B89321O35637
$$ y = [555100, 475039, 814726, 2126081, 4894942, 6194665, 4692714, 3949599, 3327171, 1593031, -385046, -87016, 1716858, 2769938, 2487013, 2393483, 2763630, 2080973, 1165847, -588448, -2076462, -1375026, 280600, -788049, -2953538, -262577, 2841790, 2016514, -740902, -1029704, -10035, -144381, -854335, -1413445, -1536962, -990837, 729287, 2109523, 2861854, 4034215, 4481488, 2834833, 1036198, 1078941, 2373749, 1068713, -2597084, -4389722, -3287799, -3439810, -3884157, -3234306, -632208, 1133506, 378698, -263908, 739043, 860342, 877322, 1894525, 1937826, 656583, -968967, -1792643, -57770, 1848338, 2277032, 3596702, 4363638, 2613966, 1884845, 2481695, 1818887, 1439223, 1116330, -41635, -430234, 289321, 924958]
151I24958R27735J048240N10688j059405F98808k94266K35991D0414a418516j859214
141c277730r30818R40193J438669N95451E38028R66617a150950l310863N02053
132c959760f93966A716992l16905h64845q59956P87569M51884J74746A671431
122B373547i13619j870244f11165B185923N87447o67852o38291D93798a91417
112E99103K45970f28488j619864j268133N0597a529764a14441D72829K92934N28674
102A294437R26320I20212a973122p11129i4001B200421L47253K34200M26397A467752
91F62374P13477r3450a66170j680720j924531a343306B931256K349818j984472
82C296602b53590k858071J317399I52136J029162H82238c88103J56541A241461
$$ y = [924958, 1852693, 2900933, 3411621, 2352216, 698808, 404542, 640533, 40414, -1418516, -3277730, -4208548, -3268355, -1829686, -1234235, 538028, 1504645, -1150950, -4461813, -3959760, -693966, 1716992, 1400087, -864845, -1724801, -937232, -485348, -310602, 1671431, 2373547, -913619, -2783863, -611165, 2185923, 2773370, 2105518, 1467227, 493798, -191417, 599103, 845073, -628488, -2248352, -3516485, -3465888, -1529764, -114441, 472829, 765763, 1294437, 2220757, 920212, -1973122, -2684251, -94001, 2200421, 2547674, 2781874, 3208271, 1467752, 662374, 1375851, 1282401, -166170, -1846890, -3771421, -1343306, 2931256, 5281074, 3296602, -253590, -3111661, -1794262, 952136, 1981298, 882238, -388103, -231562, 1241461]
72E28295b709483p90791a349545C87372R69665M81348G67898a833210j336804
63c170014O11679M97909J04887k7859R60849A415815J465304j001037c10252r18259
53a228511b10436B062150o2178d52366k156994n43456O64064P21369n39318N6000
43b250701a60492A557600E97965a194574e96257B77636J071016Q46819J33372
34B328843P03589J031009o10149A071044a378823k30809a40970A168987L57453
25A526440J52111p18572L38580J578826P39330K30036M52517j408297f20984k357330
15b978314j78999O88713l0923K79378d57373E02468e34501r27882L52466b52634
4B14316O1784a49443j536303k74666
$$ y = [528295, -2709483, -3500274, -1349545, 387372, 1357037, 1838385, 767898, -1833210, -3170014, -2558335, -2060426, -1955539, -1983398, -1022549, 1415815, 2881119, 1880082, -310252, -1228511, -210436, 2062150, 1999972, -452366, -2609360, -3152816, -2488752, -1767383, -2306701, -2250701, -160492, 1557600, 597965, -1194574, -596257, 277636, 1348652, 2195471, 2328843, 3032432, 4063441, 3453292, 1071044, -1378823, -1609632, -140970, 1168987, 1526440, 1678551, 959979, 1298559, 2877385, 3616715, 3846751, 4299268, 2890971, -620984, -2978314, -3157313, -2468600, -2499523, -2220145, -457373, 502468, -534501, -1462383, -1109917, -252634, 214316, 276100, -149443, -1685746, -1960412]
0a960412
$$ y = [-1960412]
##PAGE= F1=1399.780725417
##FIRST=     18110.137220953, 5591.54909048506, 497037
##DATA TABLE= (F2++(Y..Y)), PROFILE
1023D97037N03009B20131f58859j338307m86856i08508M51952j260074b59986
1013B864334q01949a606721j376149a035470b94237C01072J902365P21352A342124
1003a218627p98142K51371P87561d24414k2121j207381L01218A38689R1546a88886
992d34004p31039A52460K287821R05536j537853a53784j896966p25414J353451
983a422713H1982k7967d00720m73109l49606d50422A199698J072791o05190E64567
972g12436I0478K172119L85347B55461e65524E23931p7596j71650M58999M42988
962A176672L1967m32826k64663K07871J193195K27780p75835L9445J033878q21424
952A616060h44849j825169l90748j155423j103270J706603a034742a99804j817633
$$ y = [497037, 1000046, 220131, -658859, -1997166, -2484022, -908508, -456556, -1716630, -259986, 2864334, 2062385, -1606721, -2982870, -1035470, -294237, 301072, 2203437, 2924789, 1342124, -1218627, -2016769, -1765398, -977837, -424414, -446535, -1653916, -1352698, 138689, 230235, -188886, -434004, -1165043, 152460, 2440281, 3345817, 1807964, -153784, -2050750, -2776164, -1422713, 81982, 54015, -400720, -873829, -1223435, -450422, 1199698, 2272489, 1667299, 564567, -712436, 90478, 2262597, 2647944, 255461, -565524, 523931, 446335, 274685, 733684, 1176672, 1208639, 775813, 511150, 719021, 1912216, 2139996, 1364161, 1403606, 2437484, 1616060, -844849, -2670018, -3060766, -4216189, -5319459, -3612856, -1034742, -199804, -2017437]
943b017437j888853P50506J468704N2009L32614G5878Q05172J297138K9650E43060
932A041338J630877j88020m42439O9279o73549k26014J133781k3258I48193j86850
922G61343N27171e93083k897904R09784B17681Q96465l89091k81507O62007J224685
912B330240A073483a170447n65279c49134C96142f59916p21347E0827K234184
903B285011k85546b90503l16258b64457q76432J28367a11518A158Q21272P36108
893A558538p60303b40425B96202O73964P58543l36414A67789N27713J180050D10485
882b544682j16600a015058J75919p04725L33935e91624j046988O4567D44010N03154
872I47164a317866j084314Q36901O27415j026071r56146k63139M9497e72509A699263
$$ y = [-2017437, -3906290, -3155784, -1687080, -1635071, -1302457, 75878, 881050, 2178188, 2207838, 543060, 1041338, 2672215, 2484195, 2041756, 2111035, 1437486, 1211472, 2345253, 2321995, 948193, 761343, 1288514, -593083, -3490987, -2581203, 217681, 1114146, 725055, 443548, 1105555, 2330240, 1073483, -1170447, -1735726, -349134, 396142, -659916, -1381263, 50827, 2285011, 1999465, -290503, -606761, -264457, -1140889, -1012522, -111518, 1158, 822430, 1558538, 798235, -240425, 296202, 970166, 1728709, 1392295, 167789, 695502, 1875552, 410485, -2544682, -2661282, -1015058, -839139, -1543864, -1209929, -591624, -1638612, -1574045, 444010, 947164, -1317866, -2402180, -1565279, -937864, -1963935, -2920081, -3183220, -3133723, -572509, 1699263]
861A441994o29874J8341a81253j416024N4565F73249J268521o09859P17607N10784
851B560302E30896a649631n19579P00395O49356k63035L07902G90668k46592b78990
840H09817J386731n40979n44446N86727L81160q43714n68520Q58582P93471j005226
830A313603f62571j734951j23450P66423N94197j37149n97791c11022A101967
820A12170a155004m30834N09779c35975D53387O15919K69640e20503j919194Q72949
810a566748f08392a36827j042553j970667K37080i56132B31812a040486r29726
801a970212b42785B667012J79016G37363a796170j022236j37616L64775J129239
792a462008c80228j110987r86550a221301E087N17007K36063K80268D12447a55598
$$ y = [1441994, 812120, 830461, -181253, -1597277, -1542712, 673249, 1941770, 1331911, 2049518, 2560302, 530896, -1649631, -2169210, -1468815, -819459, -1082494, -774592, 790668, 544076, -278990, 809817, 2196548, 1655569, 1111123, 1697850, 2079010, 1235296, 666776, 1525358, 2318829, 1313603, -662571, -2397522, -2520972, -1754549, -1160352, -1297501, -1895292, -311022, 1101967, 112170, -1155004, -1585838, -1076059, -335975, 453387, 1069306, 1338946, -520503, -2439697, -1566748, -608392, -136827, -1179380, -3150047, -2912967, -956132, 231812, -1040486, -1970212, -242785, 2667012, 2846028, 737363, -1796170, -2818406, -2956022, -2591247, -1462008, -380228, -1491215, -2477765, -1221301, 5087, 522094, 758157, 1038425, 412447, -155598]
781G40851J400630J091r09604D01503g54685n40179O06922j741933j951771J724822
771b656824b57161A89088a716817j075506g83964A179820M25502J42260D46714
761a348986K35426F50535J267983P91358M02433j355673f04463j069167L46833
752a326797H22843J394240E96759b050715K64048D51991k06926a168188j139143
743b307331N46211A76602K078654R98528q24077a55124l027543j236150J995166
734b423651E50046R28165k58946J700485R29930A526020e26757L1447D19231J74174
724E93405O85765J382585J556653o1802j177364A358422h7199B89424N25506l473
714H11457e7504k03080D44666J321642o31628d11392o73532a65736A429438M03847
$$ y = [740851, 2141481, 2142572, 1232968, 401503, -754685, -1294864, -687942, -2429875, -4381646, -2656824, -257161, 189088, -1716817, -2792323, -783964, 1179820, 1605322, 1747582, 446714, -1348986, -1113560, 650535, 1918518, 2709876, 3112309, 1756636, -604463, -1673630, -1326797, 822843, 2217083, 596759, -2050715, -1786667, 451991, 245065, -1168188, -2307331, -1761120, 176602, 2255256, 3253784, 2429707, -155124, -3182667, -4418817, -2423651, 550046, 1478211, 1219265, 2919750, 3849680, 1526020, -526757, -495310, 419231, 593405, 1279170, 2661755, 4218408, 4156606, 2979242, 1358422, -87199, 289424, 814930, 811457, -57504, -260584, 444666, 1766308, 1134680, -411392, -1084924, -165736, 1429438, 1833285]
704A833285j56723G82920C06109a82999p45901j307057p42493L30599J292568
695a355283d89821J70862j33441A152271K743826M25101A516227c25927J24802
686b01125j56627n78108j27285k04391j019782K47144R93618p85930j680034a452734
675A721450n27904h33621q03376g1827B883459M51892I44105f08025j682656k236716
665d527397K56106a334877F61365A54032g56644I100M15611j16903J20134A99795
654a98023m12882n9514f8854A445663L42658p80590A04704I918J63733N54168
644G27819C41004d66774A646015O62718C91732r3380Q96195J04860P58294H06122
633b330814j421186J552917E55456J479788H12300a504640l83801f81090A97622
$$ y = [1833285, 1676562, 782920, 306109, -182999, -928900, -2235957, -2978450, -2647851, -1355283, -489821, -318959, -452400, 1152271, 3896097, 4321198, 1516227, -325927, -201125, -357752, -935860, -1063145, -1267536, -2287318, -2040174, -1046556, -1832486, -3512520, -1452734, 1721450, 1193546, -833621, -1636997, -71827, 2883459, 3335351, 944105, -608025, -2290681, -4527397, -4271291, -1334877, 661365, 154032, -756644, 9100, 424711, 307808, 427942, 199795, -198023, -610905, -670419, -68854, 1445663, 1788321, 1007731, 104704, 9918, 173651, 727819, 341004, -466774, 1646015, 2308733, 391732, 298352, 1194547, 1299407, 2057701, 806122, -2330814, -3752000, -2199083, 555456, 2035244, 812300, -1504640, -1888441, -681090, 197622]
623I00109J131108r44014b69105m09945k20655j89113g6585A250583k70577d87778
612h12706F77624L86434d10539j286604k03444f80022C69554J118757l00726e78769
601e49311b06837A82351J062984J083595N43473n61804H07332C8272e2277a4441
590F41280C08133h58402l19108b62180G05071N92034E24784A55100K50992j17271
580B88821g01541q19743k35372n88676j91655g55894G36252h3460k315049j198139
570c596648L21111J095983h20214J04118k47791I63954K316240n88501B76016
560h90748A80675J488788K22229G11570A3185M37322A57475R15382L070048J395800
550E538705k638542f60513m27377D3430j8117a089140L10370A099465J268971
$$ y = [900109, 2031217, 1087203, -269105, -679050, -899705, -1088818, -76585, 1250583, 980006, -487778, -812706, 677624, 1064058, -410539, -1697143, -1900587, -680022, 369554, 1488311, 1187585, -578769, -549311, -206837, 182351, 1245335, 2328930, 2872403, 2310599, 807332, 38272, -52277, -14441, 641280, 308133, -858402, -1177510, -262180, 705071, 1297105, 524784, 155100, 406092, 288821, -701541, -1521284, -1756656, -2345332, -2536987, -755894, 736252, -83460, -2398509, -3596648, -3275537, -2179554, -820214, -716096, -963887, 963954, 3280194, 2691693, 276016, -890748, 180675, 1669463, 1891692, 711570, 13185, 450507, 157475, 1072857, 4142905, 5538705, 2900163, -660513, -1087890, 43430, 25313, -1089140, -778770, 1099465, 2368436]
541B368436j29267B59873i67998b00517F50275H2223a072008e32867G02325H1861
530d37189A190310J858427q05640B2124a609941M65139D63907J219360J267383
521B950650N2929I16330g57922m60489k50589L65989D23069J721069l15443Q6966
511A915661P98367A25805a569896A522210K084481l06170n14441j176764G47700
501A631497o89293g60065b44961A490976O84970H50806a466705r43028Q72635
492a537098K93874e00093A722916J119845A282426n13955J89599A72354a669270
482b598217a240553B81738c47888n34008L82281C41353K36368a261039j037683
473b298722b91414H83470j44737M86309P00579C22245e13806j95490j51164b23171
$$ y = [2368436, 2239169, 259873, -967998, -200517, 650275, 82223, -1072008, -532867, 702325, 81861, -437189, 1190310, 3048737, 2243097, 22124, -1609941, -1144802, 463907, 1683267, 2950650, 3003579, 916330, -757922, -1218411, -1469000, -1103011, 423069, 2144138, 1828695, 1915661, 2714028, 125805, -1569896, 1522210, 3606691, 3300521, 2786080, 1609316, 747700, 1631497, 942204, -760065, -244961, 1490976, 2175946, 850806, -1466705, -2409733, -1537098, -1243224, -500093, 1722916, 2842761, 1282426, 768471, 958070, 172354, -1669270, -2598217, -1240553, 281738, -347888, -881896, -499615, 341353, 577721, -1261039, -2298722, -291414, 883470, 738733, 1225042, 1925621, 322245, -513806, -709296, -860460, -223171]
462A043624R82779I58624a738689r83584a037148H91540M31195D01172K15217
453F16389J118779o25222j30383J143003K51290A044221c26999o11363A05660
443E02372f95840M3920b85158n80676m41821p20433k80933a138581C64439K47091
433F11530K64704N76807n14854e25057j517223J80682G85171J184403h3961o66867
423g50828B23423i28255j128537f45331p18522j699263m43765a641792D41629
413E56165c55425p92726L54451I69219O15854o41257L70708i5987l505608M05513
403c196082C46459R60209O10944K085643O58258j832624A124873k67123a09468
393a909577L5919f19251b02311k11346j352918j756160J425586B81073L4292a442301
$$ y = [1043624, 2026403, 958624, -1738689, -2722273, -1037148, 891540, 1322735, 401172, 616389, 1735168, 1109946, 979563, 2122566, 2373856, 1044221, -326999, -938362, 105660, 502372, -695840, -651920, -285158, -865834, -1307655, -2028088, -2309021, -1138581, 364439, 611530, 876234, 1453041, 938187, -525057, -2042280, -1861598, 785171, 1969574, -83961, -750828, 223423, -928255, -2056792, -645331, -1363853, -3063116, -3506881, -1641792, 441629, 556165, -355425, -1148151, -793700, 969219, 1585073, 943816, 1314524, -95987, -3601595, -3196082, 346459, 1306668, 1917612, 4003255, 4661513, 2828889, 1124873, 857750, -109468, -1909577, -1873658, -619251, -202311, -413657, -1766575, -3522735, -2097149, 281073, 315365, -1442301]
382a783828h7915A581529k51710D735b15512I9526g94166o99194j22381f69940
371d50731k78427C63314d09430k193156o49457a234321c15882r15607j38391N48109
361h21771k0015D02300K371765A188131c218097p54051a271325b32921j474369
352a707290o82558d53389J48857k233307j496276J534156A676482K573552j212723
343C037311b03400k307518m78986J158243F13345K948639O24774j645169q04923
334A736666n87656C7336J147778J836085P1464j86590M95494j111286C2983f78579
323I7876K73384b29601q07214m16845K5176B84444Q64738a90701a8122G01443
312a278588l462767r12765J03954M61911J320579a295644E00815J49764b21817
$$ y = [-1783828, -87915, 1581529, 1329819, 4735, -215512, 99526, -794166, -1493360, -1615741, -669940, -450731, -729158, 363314, -409430, -2602586, -3252043, -1234321, -315882, -1231489, -1369880, -821771, -841786, 402300, 2774065, 1188131, -3218097, -3972148, -1271325, -232921, -1707290, -2389848, -453389, -304532, -2537839, -4034115, -2499959, 1676482, 4250034, 3037311, -203400, -2510918, -2989904, -1831661, 613345, 3561984, 4186758, 2541589, 1736666, 1149010, 37336, 1185114, 3021199, 3092663, 2906073, 3401567, 2290281, 32983, -678579, 97876, 371260, -229601, -1036815, -1453660, -1428484, 284444, 1149182, -190701, -18122, 701443, -1278588, -4741355, -5654120, -5550166, -5088255, -3767676, -1295644, 500815, 650579, -221817]
302a589811l72494c80319A187640A33834a970435e6406B630584o9429G77812e54916
291a889441j355912l61929J203401d65756D83897J502463K63573D67821a134520
281a980794L6002f80362q21219j006626K29871P80277J44360j429512j648411
272d431622L86067J800977N49094j3482m53977j627969k88269P0331p33137J44435
262d597552K18616J299020m48857l503839o662807j1133077p482844J2011819
254b0299521b618979F751384k720967j726096j93625I72901O45697K4649b61063
244C02755J766652p96791A50467J71247P04632D73942g89414c15683H33114j06533
234G26581J224011K464067J3928A296188e95484a94085A12776R80822K949655
$$ y = [-1589811, -1962305, -380319, 1187640, 133834, -1970435, -56406, 2630584, 2561155, 777812, -554916, -1889441, -3245353, -3607282, -2403881, -465756, 483897, 1986360, 2249933, 467821, -1134520, -1980794, -1944792, -680362, -1501581, -2508207, -2278336, -1498059, -1353699, -2783211, -4431622, -4045555, -2244578, -1695484, -1708966, -2162943, -3790912, -4079181, -4008850, -4741987, -4597552, -4378936, -3079916, -3528773, -7032612, -13695419, -24828496, -32311340, -20299521, -2618979, 6751384, 4030417, 2304321, 2110696, 972901, 1618598, 1643247, -261063, 302755, 2069407, 1272616, 150467, 321714, 1026346, 473942, -789414, -315683, 833114, 726581, 1950592, 4414659, 4428587, 1296188, -595484, -194085, 112776, 1093598, 4043253]
225D043253K235987n40982j027988j748978F18697a019685L30835E61207N35265
216A096472j4158N98768P85539l54354H33138a401782k257698N57052a014001
206b062502k320045a622683A691696o13110a270760k52324f07158r5878p33237
197a436273k83603Q614K86349A45635J494551Q04402Q97468O7527j425242C97581
186B10729J155873C77376b840251j418356J177630j157718j114581J497056g44008
176I53449C91659j01107N35823J50862K47799P91909k67943E23417a179700q85983
166b065683A90575K197986L49085O92153q1245A469443m52400P65457p28121E13409
155C49315i25389m90388c82628B89112J072384J441750N33826j208357C07521
$$ y = [4043253, 6279240, 5738258, 4710270, 2961292, 618697, -1019685, -688850, 561207, 1096472, 1082314, 1681082, 2466621, 2112267, 833138, -1401782, -3659480, -3102428, -1014001, -2062502, -4382547, -1622683, 1691696, 1078586, -1270760, -1523084, -607158, -703036, -1436273, -1719876, -1711262, -1424913, 145635, 1640186, 2444588, 3342056, 3409583, 1984341, 397581, 210729, 1366602, 377376, -2840251, -4258607, -3080977, -4238695, -5353276, -3856220, -744008, 953449, 391659, 290552, 826375, 977237, 1225036, 2016945, 1749002, 523417, -1179700, -2065683, 190575, 2388561, 2737646, 3429799, 3348554, 1469443, 1017043, 1782500, 1054379, 513409, 349315, -925389, -1415777, -382628, 289112, 1361496, 2803246, 3337072, 2128715, 307521]
145b09546F20999M0552e47204k365289j854371J144252a614636f56207A148656
135A818790a179094k852031J183489A93576K082006o28932a397611j054364h92392
125b97818m97611A085927O96465b131515j473021b73565B299953L2901m33012
116A899842q94122d76993j3731A414039L01673f7000j295638q72070j57304d99993
105I88326j59407B84251O4685N38985c65500j992505l38613f18099A154119J84419
95A338538J82388J065057o54402l03206P61437m50899A48129a652409j307053
86b959462c03667C090574J578818j355871D42079b424346K18726c63958I13943
76E18074h97306n8443A319372N9081b084651j189638a049742E38910L29936M34322
$$ y = [-209546, 620999, 661551, -547204, -2912493, -4766864, -3622612, -1614636, -656207, 1148656, 1818790, -1179094, -4031125, -2847636, 193576, 2275582, 1646650, -1397611, -2451975, -892392, -297818, -795429, 1085927, 1782392, -2131515, -3604536, -273565, 2299953, 2332854, 1899842, 1005720, -476993, -490724, 1414039, 1715712, -67000, -1362638, -2234708, -2392012, -499993, 988326, 828919, 284251, 348936, 887921, -365500, -2358005, -2696618, -618099, 1154119, 1338538, 1520926, 2585983, 1931581, 1628375, 2389812, 1938913, 148129, -1652409, -2959462, -303667, 3090574, 4669392, 3313521, 442079, -2424346, -2205620, -363958, 913943, 518074, -897306, -955749, 1319372, 1378453, -2084651, -3274289, -1049742, 538910, 868846, 1303168]
66A303168m22462a235592j086716O70311j05102k62299L66189g69761A504525
56C335889p36448A75640a332957K29735F15724k15636a394948r08572M96728N23332
46a283460M90020p92742l21517B47004J704848D70219a227309C92804J390064
37A782868N98330M76959L40009P00909N93563o48603A571793g18694l95206B53956
26A011961A59654E0054K03769R07018J234877j9994M95068Q00926j484018a093219
15b926518o13518j19594M73930J363218E2112O21473a06453o13453J63804i7117
4B70061A09496a95622q89409P4924
0a010107
$$ y = [1303168, 880706, -1235592, -2322308, -1651997, -1757099, -2019398, -1653209, -769761, 1504525, 3335889, 2599441, 175640, -1332957, -1103222, 615724, 400088, -1394948, -2303520, -1806792, -1283460, -793440, -1586182, -1907699, 247004, 1951852, 470219, -1227309, 392804, 1782868, 2381198, 2858157, 3198166, 3899075, 4492638, 3844035, 1571793, -718694, -1113900, 253956, 1011961, 159654, 50054, 253823, 1160841, 2395718, 2375724, 2870792, 3671718, 2187700, -1093219, -2926518, -3540036, -3659630, -3185700, -1822482, 52112, 673585, -106453, -719906, -556102, -97117, 270061, 109496, -195622, -1085031, -1010107]
##PAGE= F1=1378.163187907
##FIRST=     18110.137220953, 5591.54909048506, 995285
##DATA TABLE= (F2++(Y..Y)), PROFILE
1023I95285J18574E21223a74033j299250m72789f63150O6401j036563A74284K946495
1013C120779j351025b224888j109635i98011A3484L78735J442554L88700j014421
1004A209052c64195j050803j255545M76773i58139K26938j055951N12052A06662
994C41873E4824b69563o18901G65551K468640L07099A014749a225532j217034
985b442566j85896a146188D02138b05092p21194K06207O3043c16003I60577O82283
975A642860G77013A29089g42773A980K402991O20209C70470a009699c36112a06873
964c14477a51102G82301O44785m49372k18618M66002J297321k04456A130330L7936
954A168266J349782n66974f72054j817162m07706q65484k65322J170399J316958
$$ y = [995285, 1113859, 521223, -174033, -1473283, -1946072, -663150, -596749, -1633312, 174284, 3120779, 1769754, -2224888, -3334523, -998011, 13484, 392219, 1834773, 2223473, 1209052, -364195, -1414998, -2670543, -2193770, -958139, -731201, -1787152, -1275100, 106662, 341873, 54824, -269563, -888464, 765551, 3234191, 3541290, 1014749, -1225532, -2442566, -2628462, -1146188, 402138, -205092, -926286, -720079, -657036, -316003, 960577, 1642860, 777013, 129089, -742773, 1980, 2404971, 3025180, 370470, -1009699, -336112, -106873, -314477, -151102, 782301, 1427086, 977714, 759096, 1225098, 2522419, 2317963, 1130330, 1168266, 2518048, 1951074, -672054, -2489216, -2896922, -3762406, -4027728, -2857329, -1540371]
945a540371L16583j998790j814215O29274J223005K69794J124929A04494R30424
936A034918J152981M64692j076514M70740R44366j254202l63601P36753o62745
927A447388F75835O92625K13369G62691C56808j5800a841736l018703J267800
918c592639A3972J289526C39774a37350I88270J473342j134925d68330o55914
909a124244d43425i2301r28318n33552C14052K766260l40839B36440c85350F489
898h19608J73986D2007e05853G8908J530505m91918f13392b34685A518697J708584
888C227281o95126B72172j09834J712335n81482a701277n62251g72793j12239
879h85032p12627P87813a55697j475350l21331A77021J491990E8798a497796M70403
$$ y = [-1540371, -1223788, -3222578, -5036793, -4407519, -3184514, -2914720, -1789791, 104494, 1034918, 2187899, 2652591, 1576077, 2046817, 2991183, 1736981, 1373380, 2110133, 1447388, 675835, 1368460, 1581829, 762691, 356808, 341008, -1841736, -4860439, -3592639, 13972, 1303498, 339774, -137350, 988270, 2461612, 1326687, -468330, -1124244, -443425, -92301, -1020619, -1554171, 314052, 3080312, 2739473, 236440, -385350, 6489, -819608, -645622, 42007, -505853, 78908, 1609413, 1117495, -613392, -234685, 1518697, 3227281, 2532155, 272172, 162338, 1874673, 1293191, -1701277, -2263528, -772793, -885032, -1597659, -809846, -155697, -1631047, -1952378, 177021, 1669011, 58798, -1497796, -1027393]
869a027393i4920j244107j352849j81679L68159a67335A986345k50642o20621
860A115082L1379C0516a645594m91610c39025A661386j26125K60285N34849j139090
850A191305d27435p61161K06704d90444k63484K28318H32164l18413e90642F59976
839B453361j046323E41020J429158J155464j033426o88184Q12911M41976A300044
829d06143j073578p07461j70352J052039M60524j136220K88893b11438A33543
819b98342o97766n41737M58912F44540Q94559n46462a000544j851591Q67976f03210
808C7238a109665k310364L81542i25515B83485g66384j209976f55108B680990
798C304008A090940a380131r81346p5708P52506g37097r7283j778938n53619a518407
$$ y = [-1027393, -94920, -1339027, -2691876, -2873555, -2505396, -167335, 1986345, 1735703, 1115082, 1146461, 30516, -1645594, -2137204, -339025, 1661386, 1535261, 1795546, 2330395, 1191305, -427435, -1188596, -981892, -490444, -753928, -525610, 832164, 513751, -590642, 659976, 2453361, 1407038, 541020, 1970178, 3125642, 2092216, 1404032, 2216943, 2658919, 1300044, -406143, -1479721, -2187182, -2357534, -1305495, -844971, -1981191, -1692298, -211438, 133543, -298342, -996108, -1537845, -1078933, 644540, 1539099, 992637, -1000544, -2852135, -1984159, -603210, 37238, -1109665, -3420029, -3038487, -925515, 283485, -766384, -1976360, -655108, 2680990, 3304008, 1090940, -1380131, -2361477, -2437185, -1684679, -737097, -834380, -2613318, -3166937, -1518407]
787b86685C95426R08021N68319o10391o26470O59216M28609E53329d06882l33680
777g40562o58167K19032e30357k237059j658468K190014f40041n28416j305219
768b473676k15214g35462A087637N06010L75570H23305a161469K63106G28692
758A573910L65366Q88649j13462E28323a436060l20632A69419K044197q52723
749A360893a137719R346A014142O0695c64237j256426N31587C44150N64056O38591
739A546797L24054A15721b892891j992333R49343i44316G91108k14046J950030
730B527092J699516k077599c33691n3583D95810J26932M92581J659030K570606
721E344959O45666j399374B041374b00663f864A034009Q516d9737K2169F57018
$$ y = [-286685, 395426, 1303447, 1871766, 1261375, 634905, 1294121, 1722730, 553329, -406882, -740562, -1398729, -1179697, -530357, -2767416, -4425884, -2235870, -640041, -1168457, -2473676, -2688890, -735462, 1087637, 1593647, 1969217, 823305, -1161469, -898363, 728692, 1573910, 1939276, 2827925, 2714463, 528323, -1436060, -1756692, 169419, 2213616, 1360893, -1137719, -1128373, 1014142, 1074837, -364237, -1620663, -1089076, 344150, 908206, 1546797, 1870851, 115721, -2892891, -4885224, -3935881, -944316, 791108, 577062, 2527092, 4226608, 2149009, -333691, -387274, 495810, 622742, 1115323, 2774353, 5344959, 5990625, 4591251, 2041374, -200663, -6864, 1034009, 1042525, -49737, -27568, 657018]
710A434959F35147d11001p47290j48582c30525H16738J81347d26640p40078p2102
700a238820K45097n14160j173922l29857J099495h82827B0541Q09666J345136
691B175343J611422k24576G03233h94857c18103l6709r54297j48974M93690k65881
681a230274j35758M53857q95344j696793a410281B102385N67208A267739G5789
671A453449K953594K01904B292448H22816i46061k944249j177403J977963h98963
661i01440k22285c32154B68503a75170j41931a27893a4795n68780k06058c06774
650A277550O95599n11183F36633A20293f8070C36403E4584d04981A784693O24851
640B409544G44856B64914L98716j07086Q01339o58208a818154j826557J009681
$$ y = [1434959, 635147, -411001, -1158291, -1306873, -330525, 816738, 998085, -426640, -1166718, -1238820, -993723, -1507883, -2681805, -3011662, -1912167, -882827, 20541, 830207, 2175343, 3786765, 3562189, 703233, -894857, -318103, -354812, -1309109, -1458083, -964393, -1230274, -1366032, -912175, -1807519, -3504312, -1410281, 2102385, 2669593, 1267739, 75789, 1453449, 4407043, 4608947, 2292448, 822816, -946061, -3890310, -5067713, -3089750, -898963, -901440, -1123725, -332154, 268503, -175170, -317101, -127893, -14795, -583575, -789633, -306774, 1277550, 1973149, 1461966, 636633, 120293, -68070, 336403, 54584, -404981, 1784693, 2409544, 744856, 264914, 663630, 556544, 1357883, 699675, -1818154, -3644711, -2635030]
$$ [...]
##END NTUPLES=nD NMR SPECTRUM
##END=
