##TITLE=XTC-z140a_1
##JCAMPDX= 6.0         $$ Bruker NMR JCAMP-DX V2.0
##DATA TYPE= nD NMR SPECTRUM
##DATA CLASS= NTUPLES
##NUM DIM= 2
##ORIGIN= BRUKER
##OWNER= patiny
$$ 1.79 TOPSPIN		Version 3.0
$$ 2012-05-21 02:56:02.138 +0200  patiny@icmbsg005
$$ Compression mode = diff/dup
##.OBSERVE FREQUENCY= 400.131975957863
##.OBSERVE NUCLEUS= ^1H
##.ACQUISITION MODE= SIMULTANEOUS (DQD)
##.ACQUISITION SCHEME= NOT PHASE SENSITIVE
##.AVERAGES= 2
##.DIGITISER RES= 23
##SPECTROMETER/DATA SYSTEM= spect
##.PULSE SEQUENCE= cosygpppqf
##.SOLVENT NAME= D2O
##.SHIFT REFERENCE= INTERNAL, D2O, 1, 8.468216
##AUDIT TRAIL= $$ (NUMBER, WHEN, WHO, WHERE, PROCESS, VERSION, WHAT)
$$ ##TITLE= Audit trail, TOPSPIN		Version 3.0
$$ ##JCAMPDX= 5.01
$$ ##ORIGIN= Bruker BioSpin GmbH
$$ ##OWNER= patiny
$$ $$ /opt/data/patiny/nmr/XTC-z140a_1/12/pdata/1/auditp.txt
$$ ##AUDIT TRAIL=  $$ (NUMBER, WHEN, WHO, WHERE, PROCESS, VERSION, WHAT)
(   1,<2012-05-21 02:56:01.134 +0200>,<patiny>,<icmbsg005>,<go>,<TOPSPIN 3.0>,
      <created by zg
	started at 2012-05-21 02:36:15.010 +0200,
	POWCHK enabled, PULCHK disabled,
       configuration hash MD5:
       77 C7 B7 C4 10 F4 BA 30 64 2E BB 52 82 F2 DA 41
       data hash MD5: 2K * 256
       AF E0 F8 94 44 6C 10 3D 40 D1 C3 F7 CA 70 C1 BD>)
(   2,<2012-05-21 02:56:01.195 +0200>,<patiny>,<icmbsg005>,<audit>,<TOPSPIN 3.0>,
      <user comment:
       ICON-NMR User ID: patiny
       data hash MD5: 2K * 256
       AF E0 F8 94 44 6C 10 3D 40 D1 C3 F7 CA 70 C1 BD>)
(   3,<2012-05-21 02:56:01.888 +0200>,<patiny>,<icmbsg005>,<proc2d>,<TOPSPIN 3.0>,
      <Start of raw data processing
       xfb same F2: SI = 1K WDW = 4 SSB = 0 FT_mod = 6 PKNL = 1 F1: SI = 1K ME_mod = 2 NCOEF = 32 WDW = 4 SSB = 0 FT_mod = 6 PH_mod = 2
       data hash MD5: 1K * 1K
       99 F8 B1 1E FA 27 5C 7E 30 2B E5 B7 87 ED 72 57>)
(   4,<2012-05-21 02:56:01.996 +0200>,<patiny>,<icmbsg005>,<proc2d>,<TOPSPIN 3.0>,
      <abs2 F2: ABSG = 5 ABSF1 = 8.468216 ABSF2 = 1.408363
       data hash MD5: 1K * 1K
       BB FF 11 BD BD 71 6D 73 DA DE 72 DE F8 87 54 EE>)
(   5,<2012-05-21 02:56:02.089 +0200>,<patiny>,<icmbsg005>,<proc2d>,<TOPSPIN 3.0>,
      <abs1 F1: ABSG = 5 ABSF1 = 8.468216 ABSF2 = 1.408363
       data hash MD5: 1K * 1K
       EF 23 06 C1 80 EE F7 B1 49 B3 6F 50 BD 3C C4 D0>)
(   6,<2012-05-21 02:56:02.127 +0200>,<patiny>,<icmbsg005>,<proc2d>,<TOPSPIN 3.0>,
      <sym
       data hash MD5: 1K * 1K
       C8 5B 0F 35 A7 81 F1 F7 EC 3B AF 54 20 77 72 F1>)
$$ ##END=
$$ 
$$ $$ hash MD5
$$ $$ EE D4 53 2C 9C 12 95 8F C2 8F 00 68 B4 8A 14 69
##$RELAX= 
##$RELAX= 
##$RELAX= 
##$RELAX= 
##$RELAX= 
##$RELAX= 
##$RELAX= 
##$RELAX= 
##$RELAX= 
$$ Bruker specific parameters
$$ --------------------------
##$DATPATH= </opt/data/patiny/nmr>
##$EXPNO= 12
##$NAME= <XTC-z140a_1>
##$PROCNO= 1
##$ACQT0= 1000000
##$AMP= (0..31)
100 100 100 100 100 100 100 100 100 100 100 100 100 100 100 100 100 100
100 100 100 100 100 100 100 100 100 100 100 100 100 100
##$ANAVPT= -1
##$AQSEQ= 0
##$AQ_mod= 3
$$ [...]
##$PYNMP= <proc.py>
##$REVERSE= no
##$SF= 400.13
##$SI= 1024
##$SIGF1= 8.468216
##$SIGF2= 1.408363
##$SINO= 0
##$SIOLD= 1024
##$SPECTYP= <>
##$SREGLST= <1H.MeOD>
##$SSB= 0
##$STSI= 1024
##$STSR= 0
##$SW_p= 2824.85875706215
##$SYMM= 1
##$S_DEV= 5078
##$TDeff= 2048
##$TDoff= 0
##$TI= <>
##$TILT= no
##$TM1= 0
##$TM2= 0
##$TOPLEV= 100
##$USERP1= <>
##$USERP2= <>
##$USERP3= <>
##$USERP4= <>
##$USERP5= <>
##$WDW= 4
##$XDIM= 1024
##$YMAX_p= 302961373
##$YMIN_p= 0
##$CURPLOT= <Cups-PDF>
##$CURPRIN= <$Cups-PDF>
##$DFORMAT= <normdp>
##$LAYOUT= <+/2D_hom.xwp>
##$LFORMAT= <normlp>
##$PFORMAT= <normpl>
$$ Bruker specific parameters for F1
$$ ---------------------------------
##$ACQT0= 0
##$BF1= 400.13
##$FnMODE= 1
##$NUC1= <1H>
##$O1= 1975.95786324509
##$SFO1= 400.131975957863
##$SW= 7.05981757718765
##$SW_h= 2824.85875706215
##$TD= 256
##$ABSF1= 8.468216
##$ABSF2= 1.408363
##$ABSG= 5
##$ABSL= 0
##$ALPHA= 0
##$AQORDER= 0
##$ASSFAC= 0
##$ASSFACI= 0
##$ASSFACX= 0
##$ASSWID= 0
##$AUNMP= <>
##$AXLEFT= 0
##$AXNAME= <F1>
##$AXNUC= <1H>
##$AXRIGHT= 0
##$AXTYPE= 0
##$AXUNIT= <>
##$AZFE= 0.1
##$AZFW= 0.5
##$BCFW= 0
##$BC_mod= 0
##$BYTORDP= 0
##$COROFFS= 0
##$CY= 15
##$DATMOD= 1
##$DC= 0
##$DFILT= <>
##$DTYPP= 0
##$ERETIC= no
##$F1P= 0
##$F2P= 0
##$FCOR= 0.5
##$FTSIZE= 1024
##$FT_mod= 6
##$GAMMA= 0
##$GB= 0
##$INTBC= 1
##$INTSCL= 1
##$ISEN= 128
##$LB= 0
##$LEV0= 0
##$LPBIN= 512
##$MAXI= 10000
##$MC2= 0
##$MEAN= 0
##$ME_mod= 2
##$MI= 0
##$NCOEF= 32
##$NC_proc= -4
##$NLEV= 6
##$NOISF1= 0
##$NOISF2= 0
##$NSP= 0
##$NTH_PI= 0
##$NZP= 0
##$OFFSET= 8.468216
##$PC= 4
##$PHC0= 0
##$PHC1= 0
##$PH_mod= 2
##$PKNL= no
##$PPARMOD= 1
##$PPDIAG= 0
##$PPIPTYP= 0
##$PPMPNUM= 2147483647
##$PPRESOL= 1
##$PSCAL= 1
##$PSIGN= 0
##$PYNMP= <proc.py>
##$REVERSE= no
##$SF= 400.13
##$SI= 1024
##$SIGF1= 8.468216
##$SIGF2= 1.408363
##$SINO= 0
##$SIOLD= 1024
##$SPECTYP= <>
##$SREGLST= <>
##$SSB= 0
##$STSI= 1024
##$STSR= 0
##$SW_p= 2824.85875706215
##$SYMM= 1
##$S_DEV= 5078
##$TDeff= 512
##$TDoff= 0
##$TI= <>
##$TILT= no
##$TM1= 0
##$TM2= 0
##$TOPLEV= 0
##$USERP1= <>
##$USERP2= <>
##$USERP3= <>
##$USERP4= <>
##$USERP5= <>
##$WDW= 4
##$XDIM= 128
##$YMAX_p= 302961373
##$YMIN_p= 0
$$ End of Bruker specific parameters
$$ ---------------------------------
##NTUPLES= nD NMR SPECTRUM
##VAR_NAME=  FREQUENCY1,    FREQUENCY2,      SPECTRUM
##SYMBOL=    F1,            F2,              Y
##.NUCLEUS=  1H,            1H
##VAR_TYPE=  INDEPENDENT,   INDEPENDENT,     DEPENDENT
##VAR_FORM=  AFFN,          AFFN,            ASDF
##VAR_DIM=   1024,          1024,            1024
##UNITS=     HZ,            HZ,              ARBITRARY UNITS
##FACTOR=    2.75865112994351, 2.75865112994351, 1
##FIRST=     3388.38724502563, 2822.10010593221, -3630
##LAST=      566.287139093428, 0,            -1431
##MIN=       566.287139093428, 0,            0
##MAX=       3388.38724502563, 2822.10010593221, 302961373
##PAGE= F1=3388.387245026
##FIRST=     3388.38724502563, 2822.10010593221, -3630
##DATA TABLE= (F2++(Y..Y)), PROFILE
$$ [...]
##PAGE= F1=1901.474285986
##FIRST=     3388.38724502563, 2822.10010593221, -1177
##DATA TABLE= (F2++(Y..Y)), PROFILE
682C663j631E74c348B323d355K24L13r38j217K324A214M770j431c292A643O846
$$ 3663 2032 574 -3348 2323 -4355 -4131 -3818 -4756 -5973 -3649 1214 5984 4553 -3292 1643 8489
666H489D244F3a76C849a493B805O662m200a139o548K857J493n220c791a807C65
$$ 8489 4244 63 -176 3849 -1493 2805 9467 5267 -1139 -7687 -4830 -3337 -8557 -3791 -1807 365
649G19L126c682m209a163C667h56k526L9J150i83n384A022L434c068C83K547b193
$$ 719 3845 -3682 -7891 -1163 3667 -856 -3382 -3343 -2193 -983 -6367 1022 4456 -3068 383 2930 -2193
631c473l549j345k72P38K179K1K064J618B235n23a80l857k275b989A536o58b802
$$ -3473 -7022 -8367 -8639 -7901 -5722 -5701 -3637 -2019 2235 1712 -180 -4037 -6312 -2989 1536 878 -2802
613B949a22m157l186N23K666k033b489J22l431b448h08A152c149o635A38c016
$$ 2949 -122 -4279 -7465 -6942 -4276 -6309 -2489 -2367 -5798 -2448 -808 1152 -3149 -9784 138 -3016
596e988o49P12j792J677a220j481A463K335P84Q07B197E22J559a939l527q76k095
$$ -5988 -6637 -5925 -7717 -6040 -1220 -2701 1463 3798 4582 5389 2197 522 2081 -1939 -5466 -6342 -8437
579h437J164K568J831R34j96j473k287k450o37K842b900b72l962k352K430g72
$$ -8437 -7273 -4705 -2874 -1940 -2136 -3609 -5896 -8346 -8983 -6141 -2900 -272 -4234 -6586 -4156 -772
562f778J349B7a153C649j48f068a026I708k0K243G50a819A587J397j282f112J525
$$ -6778 -5429 27 -1153 3649 3501 -6068 -1026 9708 9688 11931 750 -1819 1587 2984 1702 -6112 -4587
545d587B071a326p89j850k735K43j732M086J589g45B510e851J231m156K235L029
$$ -4587 2071 -1326 -2115 -3965 -6700 -6457 -8189 -4103 -2514 -745 2510 -5851 -4620 -8776 -6541 -3512
529c512a737P58d81k610h83j524l786J722l78J429a648a52m872q52J364C37J039
$$ -3512 -1737 -979 -481 -3091 -883 -2407 -6193 -4471 -4849 -3420 -1648 -152 -5024 -5876 -4512 337 1376
512A376J572a585l235J323m995p29a642j588n11o98m443b550l891K129A91a75
$$ 1376 2948 -1585 -4820 -3497 -8492 -9221 -1642 -3230 -3741 -4439 -8882 -2550 -6441 -4312 191 -175
495a579k292l265k783K376K852l660M167j927Q94J401B987K651M820A611J0238
$$ -1579 -3871 -7136 -9919 -7543 -4691 -8351 -4184 -6111 -5217 -3816 2987 5638 10458 1611 11849
480A1849Q8331M0785J7180j6901n4835A1856b182G512j746P46h376D468J348f521
$$ 11849 100180 140965 158145 141244 86409 11856 -2182 7512 5766 6512 -8376 4468 5816 -6521
465i20n209L003j94i14A92J065a0358b297m742j727b857j434M0A723J670d724
$$ -920 -6129 -3126 -3320 -914 192 1257 -10358 -2297 -7039 -8766 -2857 -4291 -4251 1723 3393 -4724
448B135A81a109j356j323r13o53m68m92k15N27L39K203Q21k773b014g27Np212
$$ 2135 181 -1109 -2465 -3788 -4701 -5354 -5822 -6314 -6529 -6002 -5663 -3460 -2639 -5412 -2014 -727 -722 -7934
430g934e35j994l103F77d353l254k229b548K49m167K765L74J173d15A492e742
$$ -7934 -535 -2529 -5632 677 -4353 -7607 -9836 -2548 -2299 -6466 -3701 -3327 -2154 -415 1492 -5742
413d218A487J107c073o1j564K42J995d9A901d41B158g91j12j475k39O91Q49j804
$$ -4218 1487 2594 -3073 -3134 -4698 -4456 -2461 -49 1901 -441 2158 -791 -903 -2378 -2617 -1926 -1077 -2881
395b881n910K907k187L02K574a212n92k771l148K977q24L04N38O60P73P47L56
$$ -2881 -8791 -5884 -8071 -7769 -5195 -1212 -1804 -4575 -7723 -4746 -5570 -5266 -4728 -4068 -3295 -2548 -2192
378b192j043N28j319j814j487j550r09K052K496J654O82k415N74k413j484lJ722
$$ -2192 -3235 -2707 -4026 -5840 -7327 -8877 -9786 -7734 -5238 -3584 -2902 -5317 -4743 -7156 -8640 -8643 -6921
361f921J065k228L690a401m408J543j576N93K003a349F28J831P50R00I91c845
$$ -6921 -5856 -8084 -4394 -1401 -5809 -4266 -5842 -5249 -3246 -1349 628 2459 3209 4109 991 -3845
344c795G15a3E44b900O49B459e369j900r04L637k523R12J086o29k552N89L538
$$ -3795 715 -13 544 -2900 -2251 2459 -5369 -7269 -8173 -4536 -7059 -6147 -5061 -5690 -8242 -7653 -4115
327d115l42J670E476a937a94j024B48g98H82J830a310o640c903m344L910A00K333
$$ -4115 -4457 -2787 5476 -1937 -194 -1218 248 -798 882 2712 -1310 -7950 -3903 -8247 -4337 100 2433
310B433j42G67J65M160k195e083C292a142k797C715j142c211a078D397R79A587
$$ 2433 2291 767 932 5092 2897 -5083 3292 -1142 -3939 3715 2573 -3211 -1078 4397 5376 1587
293h583a421F265J085e187l080a409G43e789k011O41J183m36j796L42K581K421
$$ -8583 -1421 6265 7350 -5187 -8267 -1409 743 -5789 -7800 -7159 -5976 -6412 -8208 -7866 -5285 -2864
277b864e71B095K604e422F702O92C072K76A082e166l825J252b644J296l891J761
$$ -2864 -571 2095 4699 -5422 6702 7394 3072 3348 1082 -5166 -8991 -7739 -2644 -1348 -5239 -3478
261c478F191a810A746e33k245I71J289k74i547c213m203k606M439J622i07B762
$$ -3478 6191 -1810 1746 -533 -2778 971 2260 1986 -9547 -3213 -7416 -10022 -5583 -3961 -907 2762
244D850c097B463d6o394j351L130g46C025l88A259h53j585o18l12n009L884J859
$$ 4850 -3097 2463 -46 -6440 -7791 -4661 -746 3025 2637 1259 -853 -2438 -3056 -3368 -8377 -4493 -2634
227b634j412k946J931n455M982C68a13C930L744j449j702h44m054D968A065g036
$$ -2634 -4046 -6992 -5061 -10516 -5534 368 -113 3930 7674 6225 4523 -844 -4898 4968 1065 -7036
210i80B834b424k526k509k255L085b795I38L306K672B824l46a13D291j101b757
$$ -980 2834 -2424 -4950 -7459 -9714 -6629 -2795 938 4244 6916 2824 2478 -113 4291 3190 -2757
193b09j863l027J50j138j214j399p92K995b642A601M451K092k657A503L18K798
$$ -209 -2072 -5099 -4949 -6087 -7301 -8700 -9492 -6497 -2642 1601 6052 8144 5487 1503 1821 4619
177D619R80g52l987A443b6m554F686O809b297A302K283b683J200o32r7m678K92
$$ 4619 5599 -752 -4739 1443 -26 -4580 6686 13495 -2297 1302 3585 -2683 -1483 -2115 -2212 -6890 -6598
160f598Q37j107k564L017a585P24A100N878l195D6a921A485a408n84B191e843
$$ -6598 -5761 -6868 -9432 -6415 -1585 -861 1100 6978 3783 46 -1921 1485 -1408 -1992 2191 -5843
143B857L2q03o17h65j225i05p47k29j410k947b851j414j909j822j155L21N47K86
$$ 2857 2889 2086 1469 -865 -2090 -905 -1652 -1881 -3291 -6238 -2851 -4265 -6174 -7996 -9151 -8830 -8283 -7997
125g997LM32L97J730b554k60j74l37m459D346D69d401l92J439k30a085l060j089
$$ -7997 -7994 -7562 -7165 -5435 -2554 -2814 -2988 -3325 -7784 4346 469 -4401 -4793 -3354 -3584 -1085 -4145 -5234
107e234q42j63o79L428k432k619J4d74d5r05m461J060J761k895H78L146A641a683
$$ -5234 -6076 -6239 -6918 -3490 -5922 -8541 -8527 -474 -45 -950 -5411 -4351 -2590 -5485 878 4024 1641 -1683
88C747J015k135g69l392n919K079K471J800j235K61J280A840k72D78i74p051A864
$$ 3747 4762 2627 -769 -4161 -10080 -8001 -5530 -3730 -4965 -4704 -3424 1840 1568 478 -974 -8025 1864
70C945b460k951k480K253C023J278c95m272P90L76J645H33d192j115a691l023
$$ 3945 -2460 -5411 -7891 -5638 3023 4301 -395 -4667 -3877 -3501 -1856 833 -4192 -5307 -1691 -4714
54d714K004N83j34k9j119j593k082J137J099j628P87b750m851L000C042J610a97
$$ -4714 -2710 -2127 -2261 -2290 -3409 -5002 -7084 -5947 -4848 -6476 -5689 -2750 -7601 -4601 3042 4652 -197
36A229l40e061k160J213b35A507J656G96g202c511J590c93F325a44p678b155j943
$$ 1229 889 -5061 -7221 -6008 -235 1507 3163 796 -7202 -3511 -1921 -393 6325 -144 -7822 -2155 -4098
19d098k371i18G148k471j174g181b419R45j62k072k371j962n67K243K591J637
$$ -4098 -6469 -918 7148 4677 3503 -7181 -2419 -1474 -1636 -3708 -6079 -8041 -8608 -6365 -3774 -2137
3b137P51m47k28
$$ -2137 -1386 -1833 -2061
0b061
$$ -2061
##PAGE= F1=1898.715634856
##FIRST=     3388.38724502563, 2822.10010593221, 2493
##DATA TABLE= (F2++(Y..Y)), PROFILE
1023B493A082d708d96k369j869l452K069K017r98A099J327J570c059E217k54g537
$$ 2493 1082 -4708 -496 -2865 -4734 -8186 -6117 -4100 -5098 1099 2426 3996 -3059 5217 4963 -7537
1006b25D849A706a132q71j45p335L370a729j26J6j7l14j863J040J131o108f20
$$ -225 4849 1706 -1132 -2003 -2148 -9483 -6113 -1729 -1855 -1839 -1856 -2170 -4033 -2993 -1862 -7970 -620
988D491N87j162p49A20c023J353D41b642K28e11k169a053j385n94M82h22A098
$$ 4491 5078 3916 3167 120 -3023 -1670 441 -2642 -2414 -511 -2680 -1053 -2438 -3032 -2550 -822 1098
970a69k306K33a47C44Q50a531l153l109r00J120k83j221J943K371j008a862L04
$$ -169 -2475 -2242 -147 344 1194 -1531 -4684 -7793 -8693 -7573 -7856 -9077 -7134 -4763 -5771 -1862 -1558
953a558r26j430p06J918B36K173R85A194k25a866l116p33J209J320j491m012c847
$$ -1558 -2484 -3914 -4620 -2702 236 2409 3394 1194 969 -1866 -4982 -5715 -4506 -3186 -4677 -8689 -3847
935f041m17K327f40k644A445c096C043j345g669b682l959L015k625c024a501k145
$$ -6041 -6458 -4131 -640 -3284 1445 -3096 3043 1698 -7669 -2682 -6641 -3626 -6251 -3024 -1501 -3646
919c646a533l29m508J893D289J361n8k029d300j599r38J408a255l96k835j492
$$ -3646 -1533 -1862 -6370 -4477 4289 5650 5592 3563 -4300 -5899 -6837 -5429 -1255 -1651 -4486 -5978
903e978l70k231A072L592j448D94c086l502j453K073j753c472E54J040g186A8
$$ -5978 -6348 -8579 1072 4664 3216 494 -3086 -6588 -8041 -5968 -7721 -3472 554 1594 -7186 18
886b769l276r09j246P40a947A754e887K573j295j319K078f01B382c438A542E0
$$ -2769 -6045 -6954 -8200 -7460 -1947 1754 -5887 -3314 -4609 -5928 -3850 -601 2382 -3438 1542 50
869D795a695e28o021b024r23d56l820l839q79J682R84p9K91J314j371K220B039
$$ 4795 -1695 -528 -6549 -2024 -2947 -456 -4276 -8115 -8994 -7312 -6328 -6407 -6116 -4802 -6173 -3953 2039
851A563h267K400J348B213i57o347b916c63m889E847J791b27a4A460K008q84r55
$$ 1563 -8267 -5867 -4519 2213 -957 -7304 -2916 -363 -5252 5847 7638 -227 -14 1460 3468 2584 1629
834A629d173A955B59a030M76A005B72G8K719g39l113m571K880f46C318R03A818
$$ 1629 -4173 1955 259 -1030 -554 1005 272 78 2797 -739 -3852 -8423 -5543 -646 3318 4221 1818
816f159N47K05J06l655k42K410J830J046l42j045j247j721j423M01K188K313J631
$$ -6159 -5612 -5407 -5301 -8956 -9198 -6788 -4958 -3912 -4254 -5299 -6546 -8267 -9690 -9289 -7101 -4788 -3157
799c157M68l637J083J508A93M349i21j500D540a236D428k024D71O66d344k119
$$ -3157 -2689 -6326 -5243 -3735 193 4542 -921 -2421 4540 -1236 4428 2404 471 1137 -4344 -6463
783f463D784A537b436k444K418A252b859i7B986G67a357j98A88d735D804J716
$$ -6463 4784 1537 -2436 -4880 -2462 1252 -2859 -97 2986 767 -1357 -1555 188 -4735 4804 6520
767F520d193E65c822K61A331a049k826j953l029r74P46K451J596J12j565k544
$$ 6520 -4193 565 -3822 -3561 1331 -1049 -3875 -5828 -8857 -9831 -9085 -6634 -5038 -4926 -6491 -9035
751i035J033c866j526A375o8a920k126k949J12J858J811Q66l336J844l906L431
$$ -9035 -8002 -3866 -5392 1375 1307 -1920 -4046 -6995 -6883 -5025 -3214 -2348 -5684 -3840 -7746 -4315
735d315C687j142e47m358l07j809j090J585b913k362B255K193A766c708k24k718
$$ -4315 3687 2545 -547 -4905 -5212 -7021 -8111 -6526 -2913 -5275 2255 4448 1766 -3708 -3932 -6650
719f650m057J707L221K741K42k240k891D702L51c380G26c342l822O46m088M354
$$ -6650 -10707 -9000 -5779 -3038 -2796 -5036 -7927 4702 5053 -3380 726 -3342 -7164 -6518 -10606 -6252
703f252b757l758F19c283A549a497l772B217R057R5C886E67d20r19m071j761c253
$$ -6252 -2757 -6515 619 -3283 1549 -1497 -5269 2217 11274 11369 3886 567 -420 -1339 -5410 -7171 -3253
685d094C996P35l33j158A343c779B53e608R78p68n90J359A27N295K505M72B46
$$ -4094 3996 4731 4398 3240 1343 -3779 253 -5608 -4630 -5398 -5988 -4629 127 5422 7927 8399 246
667C501L959l114d12m035b002j706B762L829C155a157N34E045d701m025b965b08
$$ 3501 7460 4346 -412 -4447 -2002 -3708 2762 6591 3155 -1157 -623 5045 -4701 -8726 -2965 -208
650g82j329A885d664l694a639B870b433k978Q9J153J221m362H75K119e023C981
$$ -782 -2111 1885 -4664 -8358 -1639 2870 -2433 -5411 -5322 -4169 -2948 -7310 875 2994 -5023 3981
633E896e025a905p68q05c74k639j726J64k520j983n7J257J658N55J02j56L97P57
$$ 5896 -5025 -1905 -2673 -3478 -374 -3013 -4739 -4575 -7095 -9078 -9135 -7878 -6220 -5665 -5563 -5719 -5322 -4565
615d565O71M2k91j370j385q23O35J323J008R50a631j720i16B188d963j375E989
$$ -4565 -3894 -3852 -4143 -5513 -6898 -7721 -7086 -5763 -4755 -3805 -1631 -3351 -916 2188 -4963 -6338 5989
597A690c734m676K231n23b957D89d56j837j34O68f73a95l053J225p20j466l945
$$ 1690 -3734 -8410 -6179 -6702 -2957 489 -456 -2293 -2427 -1759 -673 -195 -3248 -2023 -2743 -4209 -8154
580h154C90J493e97A11K034o09F31d222Q63k333P42K439f25m094n47J41c99o024
$$ -8154 390 1883 -597 111 2145 1536 631 -4222 -3359 -5692 -4950 -2511 -625 -4719 -5266 -5125 -399 -6423
562f423n84d34B064M564A774f714K821A432J622J035F69e794a08B267n07c069
$$ -6423 -7007 -434 2064 6628 1774 -6714 -3893 1432 3054 4089 669 -5794 -108 2267 1760 -3069
545e680B316a612m8j543j34j542h79B659c178A367K113f938a907l427k976j370
$$ -5680 2316 -1612 -1660 -3203 -3337 -4879 -879 2659 -3178 1367 3480 -6938 -1907 -5334 -8310 -9680
529i680j2j02L89P14O56M75J703b784j171C702J790k162c441k404NP84J178a830
$$ -9680 -9692 -9794 -9405 -8691 -8035 -7560 -5857 -2784 -3955 3702 5492 3330 -3441 -5845 -5840 -5056 -3878 -1830
510c133l434J305l308K692b858l044J011l80m186M123P37l05h84A45N5M7R05a214
$$ -3133 -6567 -5262 -8570 -5878 -2858 -5902 -4891 -5271 -9457 -5334 -4597 -4902 -884 145 200 247 1152 -1214
491h23l993k078B464f886C124f555E638J117k422A032C04Q7261K74490O3603n5076
$$ -823 -4816 -6894 2464 -6886 3124 -6555 5638 6755 4333 1032 304 87565 362055 425658 370582
476C70582I8983B825b171F044j259j377g250B720J175i360h31n663b688k96d59
$$ 370582 98983 2825 -2171 6044 4785 3408 -7250 2720 3895 -9360 -831 -6494 -2688 -2984 -459
460d21l2o732K742l359O64K903p95k67R34k324j219K091K120J655P08N92D30J206
$$ -421 -453 -7185 -4443 -7802 -7138 -4235 -5030 -5297 -4363 -6687 -7906 -5815 -3695 -2040 -1332 -740 430 1636
442A636P03k59e088i31k666J233g20l511J110f08k320k304R49j474j889n17j483
$$ 1636 2339 2080 -5088 -931 -3597 -2364 -720 -4231 -3121 -608 -2928 -5232 -4283 -5757 -7646 -8163 -9646
425i646R71J761c241l03m29A848M75j73o75E63f101b764a170j551k520l461b759
$$ -9646 -8675 -6914 -3241 -3544 -3973 1848 2323 2150 1475 563 -6101 -2764 -1170 -2721 -5241 -8702 -2759
407D123d39I187l853b782B417b552C885Q89j716a743A933a916n259l25R61L184
$$ 4123 -439 9187 5334 -2782 2417 -2552 3885 4774 3058 -1743 1933 -1916 -7175 -7500 -6539 -3355
391c355m626A45c88l082o98f20k996A988N04d906A668a116l765l713K056K637
$$ -3355 -7981 145 -388 -3470 -4168 -620 -3616 1988 2492 -4906 1668 -1116 -4881 -8594 -6538 -3901
375c901K64R54j235j393j08J226R27Q20j5g73l615a456m761b491m410J181h19
$$ -3901 -3637 -2683 -3918 -5311 -5419 -4193 -3266 -2446 -2461 -773 -4388 -1456 -6217 -2491 -6901 -5720 -819
357a35k614D15a116o136a679L23d31p75a18B500E39b792m011a414A73R49g447
$$ -135 -2749 415 -1116 -7252 -1679 -1356 -431 -1206 -118 2500 539 -2792 -6803 -1414 173 1122 -7447
339i88A788g302K141k880A282d103k253K542q11k855n32d88I88e970C245a215
$$ -988 1788 -7302 -5161 -8041 1282 -4103 -6356 -3814 -4625 -7480 -8012 -488 988 -5970 3245 -1215
322d850a649j16n559L105D40K17h885J525b936l548n83K042P79j90N04a291H94
$$ -4850 -1649 -1765 -7324 -4219 440 657 -8885 -7360 -2936 -6484 -7067 -5025 -4246 -4436 -3932 -1291 894
304h301A517b098j154D467j183a888o59K43l59Q15n537b602J243B075c951k822
$$ -8301 1517 -2098 -3252 4467 3284 -1888 -2547 -2304 -2663 -1848 -7385 -2602 -1359 2075 -3951 -6773
288f773a829C288d934b258B18i70l853q63K642j454J119f57B595L187d312E523
$$ -6773 -1829 3288 -4934 -2258 218 -970 -4823 -5686 -3044 -4498 -3379 -657 2595 5782 -4312 5523
271A3212C361R4j197g944J840K518J005m919L9L685a529n8j87j985j700M34J816
$$ 13212 3361 3455 2258 -7944 -6104 -3586 -2581 -7500 -7461 -3776 -1529 -1587 -1774 -3759 -5459 -5025 -3209
254c209J400l979a484k57k775J576l402K237n82l49p07J029J9k80l687K146M07
$$ -3209 -1809 -5788 -1484 -1741 -4516 -2940 -6342 -4105 -4687 -5036 -5743 -4714 -4695 -4975 -8662 -6516 -6109
237f109P06J289J420a237c99B84b464m556L380a351j978l248j643L50c481H13
$$ -6109 -5403 -4114 -2694 -1237 -399 284 -2464 -7020 -3640 -1351 -3329 -6577 -8220 -7870 -3481 813
220h11C756N551J387j511F79a067C258i25n455m78f71k676p69R05e34b34j666
$$ -811 3756 9307 10694 9183 679 -1067 3258 -925 -6380 -6858 -671 -3347 -4116 -3211 -534 -234 -1900
203a900G17M789k9A109l81b501B724r95d050c39k275m712j211J292c601C19b56
$$ -1900 717 5506 5477 1109 728 -2501 2724 1729 -4050 -339 -2614 -7326 -8537 -7245 -3601 319 -256
185B938l44l93J808K126j879A898K759L256j721A29i18B367j154c779D58J083
$$ 2938 2594 2201 4009 6135 4256 1898 4657 7913 6192 129 -918 2367 1213 -3779 458 1541
169A541a911e19C533A023M41n99a939l195k684j538N87R47J119J549J575J780
$$ 1541 -1911 -519 3533 1023 1464 865 -1939 -5134 -7818 -9356 -8769 -7822 -6703 -5154 -3579 -1799
153a799d55F32Q83a070j475j295J696B083c128E282M64p84k430b311a016k766
$$ -1799 -455 632 1515 -1070 -2545 -3840 -2144 2083 -3128 5282 5746 4962 2532 -2311 -1016 -3782
137c782l115k610j900M92P20J171J419J233N06J54l71n28k81J054J794l86a735
$$ -3782 -6897 -9507 -11407 -10915 -10195 -9024 -7605 -6372 -5866 -5712 -6083 -6611 -6892 -5838 -4044 -4430 -1735
119d347K107l457j317G362j189e496A66e96j762P17k785J118o49O96l867r16N02
$$ -4347 -2240 -5697 -7014 7362 6173 -5496 166 -596 -2358 -1641 -4426 -3308 -3957 -3261 -7128 -8044 -7542
102g542p41K185J380j648k669J943L170Q27k766a394B33K032b803C565q13o44
$$ -7542 -8283 -6098 -4718 -6366 -9035 -7092 -3922 -3095 -5861 -1394 233 2265 -2803 3565 2752 2108
86B108j47Q90h062j474i90d47l295j577j44B502I61a278m282p43K702a516l260
$$ 2108 1961 2851 -8062 -9536 -990 -447 -3742 -5319 -5463 2502 961 -1278 -5560 -6303 -3601 -1516 -4776
69d776m172R3L900A263K138I33d518l292j309L871a508I09f357a46l374j357f32
$$ -4776 -8948 -8855 -4955 1263 3401 933 -4518 -7810 -9119 -5248 -1508 909 -6357 -146 -3520 -4877 -632
51b346L37p45M23O93J7l920j700c397D041a595k679B95J741a427N97A533c299
$$ -2346 -2009 -2754 -2331 -1638 -1621 -5541 -7241 -3397 4041 -1595 -4274 295 2036 -1427 -830 1533 -3299
33F68d121Q2f74A662m1e122c70j145r0E997a509n480c188m58P57A243M422k383
$$ 668 -4121 -4039 -674 1662 1621 -5122 -370 -1515 -1605 5997 -1509 -6989 -3188 -3646 -2889 1243 5665 3282
15C282j636g499L194C9R51i22k990k339j317p86O75J358J871J452J213
$$ 3282 1646 -7499 -4305 39 990 -922 -3912 -6251 -7568 -8354 -7679 -6321 -4450 -2998 -1785
0a785
$$ -1785
##PAGE= F1=1895.956983726
##FIRST=     3388.38724502563, 2822.10010593221, 2483
##DATA TABLE= (F2++(Y..Y)), PROFILE
1023B483a180l783a011l072K029C400j164b084l977B476E91e23m504a190j966
$$ 2483 -1180 -4963 -1011 -4083 -2054 3400 2236 -2084 -6061 2476 591 -523 -5027 -1190 -3156
1008c156l726m46K261J479k88j393j94l039L324B700Q5A015b247m050j822L727
$$ -3156 -6882 -7328 -5067 -3588 -3876 -5269 -5463 -8502 -5178 2700 2785 1015 -2247 -6297 -8119 -4392
992d392g59o489C2M834j56j620J48a37l394a002A270b985a481I24b961B931I16
$$ -4392 -759 -7248 32 4866 4710 3090 3238 -137 -3531 -1002 1270 -2985 -1481 924 -2961 2931 916
974a407k639j446Q22K150j017m124c147b95C575j780d915I31b185k743j907k34
$$ -1407 -4046 -5492 -4670 -2520 -3537 -7661 -3147 -295 3575 1795 -4915 931 -2185 -4928 -6835 -7069
958g069J201R74k797L537l85j503k081j001K467L159a129C90M81m19h02k091j534
$$ -7069 -5868 -4894 -7691 -4154 -4539 -6042 -8123 -9124 -6657 -3498 -1129 390 871 452 -802 -2893 -4427
941d427j482j430m96M77J286J415J975e01B001e604a200m606B49I9d920A108e314
$$ -4427 -5909 -7339 -7835 -7358 -6072 -4657 -2682 -501 2001 -5604 -1200 -5806 249 99 -4920 1108 -5314
923d349O6a298d90j684A77a981n937L939C908k09m58j124d256j572j289j800J213
$$ -4349 -4283 -1298 -490 -2174 177 -1981 -7918 -3979 3908 3699 3241 2117 -4256 -5828 -7117 -8917 -7704
906g704J896N65J27N91j619a305I7J46h30k206j789M54k02l521b090G190l23f976
$$ -7704 -5808 -5243 -5116 -4525 -6144 -1305 97 243 -830 -3036 -4825 -4371 -4573 -8094 -2090 7190 6867 -6976
887A105a478j603k225J395o23a439D733d549a891B018B38c178b4F59d846b266
$$ 1105 -1478 -3081 -5306 -3911 -4534 -1439 4733 -4549 -1891 2018 238 -3178 -24 659 -4846 -2266
870I94R185D200j466f613c225a284k461m60J800e33m278F34B0h75k545l342K80
$$ 994 10179 4200 2734 -6613 -3225 -1284 -3745 -4205 -2405 -533 -4811 634 20 -875 -3420 -6762 -6482
853f482a491j349p88J385l41k09D159d031a74p942K266A162M633b760O22A475
$$ -6482 -1491 -2840 -3628 -2243 -2584 -2793 4159 -4031 -174 -8116 -5850 1162 5795 -2760 -2138 1475
836H840M20B400I20Q673C408c44G03a716k22j902J773k157m217j080c904A321
$$ 8840 9260 2400 920 9593 3408 -344 703 -1716 -1938 -3840 -2067 -4224 -8441 -9521 -3904 1321
819E150e08k553k442j021L72a686i6l776l525k898j603N20J155J941J529J200
$$ 5150 -508 -3061 -5503 -6524 -6152 -1686 -96 -3872 -7397 -10295 -11898 -11378 -10223 -8282 -6753 -5553
803e553Q00L40l0J31R25a541E40J963j088L092g00k163A133a27d2n38q76j004
$$ -5553 -4753 -4413 -4443 -4312 -3387 -1541 540 2503 1415 4507 -700 -2863 1133 -127 -42 -580 -1456 -2460
785b460k381m61m98J08J988h69B044c115j435B687j008c27k286k210j784p06Q96
$$ -2460 -4841 -5302 -5800 -5692 -3704 -869 2044 -3115 -4550 2687 1679 -327 -2613 -4823 -6607 -7313 -6417
768f417J896R41J132m687J789A138a013k529j137j62j049l66J448K018a206e21
$$ -6417 -4521 -3580 -2448 -7135 -5346 1138 -1013 -3542 -4679 -4841 -5890 -6256 -4808 -2790 -1206 -521
751g05l397o9n64J817p00m52J829A925J067a133C191d54m650l9k006K357F966
$$ -705 -4102 -4171 -4735 -2918 -3618 -4070 -2241 1925 2992 -1133 3191 -454 -5104 -5143 -7149 -4792 6966
733A0416h8n892D75L541c958l509J236J105B363J724K06b444h36j245n271Q86
$$ 10416 -88 -5980 475 4016 -3958 -7467 -6231 -5126 2363 4087 4293 -2444 -836 -2081 -7352 -6466
717f466N27K860k25k722K665C577J20a249K14l294l096k037o3J359J298J728J806
$$ -6466 -5939 -3079 -3304 -6026 -3361 3577 3697 -1249 -1035 -4329 -7425 -9462 -9525 -8166 -6868 -5140 -3334
700c334a649a23A074d936B484K352J337j288I82f88L19k491m421J677J175b88
$$ -3334 -1649 -123 1074 -4936 2484 4836 6173 4885 982 -688 -369 -2860 -7281 -5604 -4429 -288
683C06N1d02k262l498l865M080J104j327p10K967P95o3R00J045N17P7o74j592
$$ 306 357 -402 -2664 -6162 -10027 -5947 -4843 -6170 -6880 -3913 -3118 -3181 -2281 -1236 -719 -642 -1316 -2908
665b908k439k934k190J875J662J476K045f14B228K404e871k408b674B36c666m074
$$ -2908 -5347 -8281 -10471 -8596 -6934 -5458 -3413 -614 2228 4632 -5871 -8279 -2674 236 -3666 -7740
649g740k681L736j336b119O92l837k36J334o28K93o48Aa67m723B882p88d253C314
$$ -7740 -10421 -6685 -8021 -2119 -1427 -5264 -5500 -4166 -4794 -4501 -5149 1 -167 -4890 2882 2094 -4253 3314
630E416a283B675d640J435Q97C34b1G627j363B516l46K44b672B809b208N7i29
$$ 5416 -1283 2675 -4640 -3205 -2308 334 -21 7627 6264 2516 2170 2414 -2672 2809 -2208 -2151 -929
612C3i96A896J143E31b630n04c43B760d453m06G06c923l747K112f01C124e934
$$ 33 -996 1896 3039 531 -2630 -3134 -343 2760 -4453 -4859 706 -3923 -7670 -5558 -601 3124 -5934
594d227k249c95C873j3c340A641O226J672l716f090D378a607j187l399b297D048
$$ -4227 -6476 -395 3873 3860 -3340 1641 7867 9539 5823 -6090 4378 -1607 -2794 -6193 -2297 4048
577b728P24I24b084A990c204I135k40j11h54q38l216b409j968J939m056j113a511
$$ -2728 -2004 924 -2084 1990 -3204 9135 8895 8784 -854 -1692 -4908 -2409 -4377 -2438 -6494 -7607 -1511
559b501o08j12R8m698b812q26j536k017j138K721b544D56h24k002D128a72k367
$$ -2501 -3109 -3221 -3123 -7821 -2812 -3638 -5174 -7191 -8329 -5608 -2544 456 -824 -2826 4128 -172 -2539
542b539j285J324j425n06l1K60J386i39n196B299b412k833i53k003j855j518j376
$$ -2539 -3824 -2500 -3925 -4431 -4462 -4202 -2816 -939 -6135 2299 -2412 -5245 -953 -2956 -4811 -6329 -7705
525g705j304L06K479K512j266f10B69J168b110l035j906H36g73j711k742k234
$$ -7705 -9009 -8703 -6224 -3712 -4978 -610 269 1437 -2110 -5145 -7051 836 -773 -2484 -5226 -7460
509g460J613l81K178k34j925o84p10j95c151Q00k868b599k238k793J903a544r
$$ -7460 -5847 -6228 -4050 -4284 -6209 -6893 -7603 -7798 -3151 -2351 -5219 -2599 -4837 -7630 -5727 -1544 -1553
492a553j112n820c390B0739g372C848A55J0303D333J1747o422M2448J79992K14379
$$ -1553 -2665 -8485 -3390 20739 -7372 3848 155 10458 4333 16080 9658 52106 232098 446477
478D46477J28667l9549D4442J9586k7785H303l267N295b868P95r33m081a429n174
$$ 446477 575144 535595 44442 64028 36243 8303 5036 10331 -2868 -2073 -3006 -7087 -1429 -6603
464f603a604r28m64n75p13l77M57r81J716l18p62m02J090Q12k423a900R3k92j391
$$ -6603 -1604 -2532 -2996 -3571 -4284 -4661 -4204 -5185 -3469 -3787 -4549 -4951 -3861 -3049 -5472 -1900 -1807 -2099 -3490
445c490j887j063L49Q11J92m13n06K94K265f67j735k766J702n21m02J006J250
$$ -3490 -5377 -6440 -6091 -5280 -5088 -5501 -6007 -5713 -3448 -667 -2402 -5168 -3466 -3987 -4389 -3383 -2133
428b133o411G47d166l320j056L828r5b105q99j372j419l00J411N27d91b34j560
$$ -2133 -8544 747 -4166 -7486 -8542 -4714 -4809 -2105 -3004 -4376 -5795 -6095 -4684 -4157 -491 -234 -1794
411a794k494r08b277B281o31R221E338f790f9m089D151J550A759b991A266d46
$$ -1794 -4288 -5196 -2277 2281 1650 10871 5338 -6790 -69 -4158 4151 5701 1759 -2991 1266 -446
394d742r93a961l835l018d271a676n34i04B124c494C396D96d039O60l439j794
$$ -4742 -5735 -1961 -5796 -8814 -4271 -1676 -2210 -904 2124 -3494 3396 496 -4039 -3379 -6818 -8612
378h612J949K169K67L23a470p0o67r22J41J337r88A112A21a091F05e235c62o187
$$ -8612 -6663 -4494 -4227 -3904 -1470 -1540 -2207 -3129 -2988 -1651 -2639 1112 121 -1091 605 -5235 -362 -6549
360f549L176B005o61E97L410j407g769e71j433p47k26J07k12p47l69j902iC401
$$ -6549 -3373 2005 1344 597 4007 2600 -7769 -571 -2004 -2751 -2977 -2870 -3082 -3829 -4198 -6100 -9 3401
341C04e099A865C75f314b489m133b428J08j496e93k349m326P16a283B386f673
$$ 304 -5099 1865 375 -6314 -2489 -6622 -2428 -2320 -3816 -593 -2942 -7268 -6552 -1283 2386 -6673
324A085f30n225J544k561l54J606K180J564o211j19c033q15L0Q46R47N33m76j285
$$ 1085 -630 -5855 -4311 -6872 -7226 -5620 -3440 -1876 -8087 -8206 -3033 -3848 -3818 -2972 -2025 -1492 -1968 -3253
306c253j817k994J105Q15R55O42K28j23o26m30j85R67j247K640L17K19M18j368
$$ -3253 -5070 -8064 -6959 -6144 -5189 -4547 -4319 -4442 -5068 -5498 -5683 -4716 -5963 -3323 -3006 -2787 -2369 -3737
288c737N84D6e179J440A2b023rj048j6a070D4c89e8B017c540C426P880D401A737
$$ -3737 -3153 46 -5179 -3739 12 -2023 -2032 -3080 -3096 -1070 44 -389 -58 2017 -3540 3426 11306 4401 1737
268A981f976K387b36B203p88a289F031K374a072A842N135b359C399K359J639a685
$$ 1981 -6976 -4589 -236 2203 1415 -1289 6031 8405 -1072 1842 6977 -2359 3399 5758 7397 -1685
251e451a874D21K435f012f98m80A975e690B891r88d071k608j451a116C507k7J417
$$ -5451 -1874 421 2856 -6012 -698 -1178 1975 -5690 2891 1903 -4071 -6679 -8130 -1116 3507 3480 4897
234D897b016F932K646a285l917b002A641g60m839l067k555L262K253P89O78J802
$$ 4897 -2016 6932 9578 -1285 -5202 -2002 1641 -760 -5599 -8666 -11221 -7959 -5706 -4917 -4239 -2437
218b437B08K958K43M0A602b955a471l585M80M32N07j894K495k115j626a377A09
$$ -2437 208 3166 3409 3449 1602 -2955 -1471 -5056 -4576 -4144 -3637 -5531 -3036 -5151 -6777 -1377 109
200A154E29a373k572C88a269m936A061a732m681l270b949C386J186h79B505A155
$$ 1154 529 -1373 -3945 388 -1269 -6205 1061 -1732 -6413 -9683 -2949 3386 4572 -879 2505 1155
183B436N45N67j375Kb05r91A104M68N08L009A751b178J03j120Q7q46J256q38p65
$$ 2436 2981 3548 2173 2175 -205 -1196 1104 1572 2080 5089 1751 -2178 -2075 -3195 -3108 -3954 -2698 -3536 -4301
164d301j98N93L89P1q13j400k000k098p47J463J860J123J102J107R35m290K263
$$ -4301 -4499 -3906 -3517 -3446 -4259 -5659 -7659 -9757 -10504 -9041 -7181 -6058 -4956 -3849 -2914 -7204 -4941
147d941a86G46h57E70r4K41Q19b967D59L318o24r95b308j838n8J812M84a76A683
$$ -4941 -186 746 -857 570 476 717 1536 -2967 459 3777 3153 2158 -2308 -4146 -4204 -2392 -1908 -176 1683
127C072p8A481d72AK811c821l169J415h41o800K568F458l45e681C69J040a726
$$ 3072 2994 1481 -472 1 2812 -3821 -6990 -5575 -841 -7641 -5073 6458 6113 -5681 369 1409 -1726
109c194n891J334L762a250k667J98l751l061K912K341M90n98k010q45j472J962
$$ -3194 -9085 -7751 -3989 -1250 -3917 -3719 -7470 -10531 -7619 -5278 -4788 -5386 -7396 -8241 -9713 -7751
93g751L429i57A062b885G94l72J258K311N13e978m769e84A126d35k179n597a641
$$ -7751 -4322 -957 1062 -2885 794 422 1680 3991 4504 -5978 -10747 -584 1126 -435 -2614 -8211 -1641
75e046l456p47K606K619J682m098l37q39J712j773j370j021N05J679J679J447
$$ -5046 -8502 -9249 -6643 -4024 -2342 -6440 -6777 -7616 -5904 -7677 -9047 -10068 -9563 -7884 -6205 -4758
59d758J473J272k855i7G1f020A59d924A60J46d356J238O44k361n5d98F039K013
$$ -4758 -3285 -2013 -4868 -97 71 -6020 159 -4924 160 306 -4356 -3118 -2474 -4835 -4890 -498 6039 8052
41H052C126E68P71b504k904J480a144@a494l557m045Q02L353K333j280J727j208
$$ 8052 3126 568 1339 -2504 -5408 -3928 -1144 0 -1494 -5051 -9096 -8294 -4941 -2608 -3888 -2161 -3369
24c369D228c058j202l40a735A712K179j31A707k9g286K214A953b059C687N58j657
$$ -3369 4228 -3058 -4260 -4600 -1735 1712 3891 3760 1707 1678 -7286 -5072 1953 -2059 3687 4245 2588
7B588e62l153J260k18R08f80C64
$$ 2588 -562 -3715 -2455 -2673 -1765 -680 364
##PAGE= F1=1893.198332596
##FIRST=     3388.38724502563, 2822.10010593221, 1724
##DATA TABLE= (F2++(Y..Y)), PROFILE
1023A724c668K33J246l949G01N865k377g53l185B21K285a682n759a922B88g621
$$ 1724 -3668 -3435 -2189 -6138 701 6566 4189 -753 -3938 221 2506 -1682 -7441 -1922 288 -7621
1006a17I199L69l080c52A764e765J351B507a152d94j200l516k378j36m00n49K461
$$ -117 9199 9568 6488 -352 1764 -5765 -4414 2507 -1152 -494 -1694 -5210 -7588 -7724 -8124 -8673 -6212
989f212L042a300l80k728m022N80K308M40j035J03K790j471A176J641a124C886
$$ -6212 -3170 -1300 -1680 -4408 -8430 -7850 -5542 -5102 -6137 -6034 -3244 -4715 1176 2817 -1124 3886
972B882l50O44a867n599K816i89C722j710c356b41j424j200j845j655J47K348
$$ 2882 2532 3176 -1867 -7466 -4650 -989 3722 2012 -3356 -241 -1665 -2865 -4710 -6365 -6218 -3870
956c870l507c022B037Q96a485n68m979k718M122a552A422J949J018O8L94p68j431
$$ -3870 -7377 -3022 2037 2933 -1485 -2053 -7032 -9750 -5628 -1552 1422 3371 4389 4457 4851 4083 2652
939B652i00m772b037l94g08A868K426f564J594j441e59l824e49B555d042p93K343
$$ 2652 -900 -5672 -2037 -2431 -708 1868 4294 -6564 -4970 -6411 -559 -4383 -549 2555 -4042 -4835 -2492
922b492g80B04h58A310b710m263c386k261k232j637m07N29J762K337j739M83K665
$$ -2492 -780 204 -858 1310 -2710 -6973 -3386 -5647 -7879 -9516 -9923 -9394 -7632 -5295 -7034 -6551 -3886
905c886F08J03a727k686p26J934i56D05j95c355j917o2k849c736k16l83j715J219
$$ -3886 608 711 -1727 -4413 -5139 -3205 -956 405 210 -3355 -5272 -5334 -8183 -3736 -3952 -4335 -6050 -4831
887d831L61O13k835b586L13P27d39l610a298b07j838j843q70J232L44l823C49
$$ -4831 -4470 -3857 -6692 -2586 -2273 -1546 -439 -4049 -1298 -207 -2045 -3888 -4758 -3526 -3182 -7005 349
869A911J580O96d742o07a172E106o97j849d67m143m233K278b921J233o581L59
$$ 1911 3491 4187 -4742 -5349 -1172 5106 4409 2560 -467 -4610 -8843 -6565 -2921 -1688 -8269 -7910
853g910j656d692B450j186E63b118J93m209A600K57d068A942M98f201J615A433
$$ -7910 -9566 -4692 2450 1264 563 -2118 -1925 -6134 1600 1857 -4068 1942 2440 -6201 -4586 1433
836A0561j222B338L335O309B209a186B2Q018B31d965r52J383b236B340K548K062
$$ 10561 9339 2338 5673 11982 2209 -1186 22 8040 231 -4965 -5917 -4534 -2236 2340 4888 6950
820F950J003b311m714L384l582p0b188D413A707a461l287k242l95R33J759q29
$$ 6950 7953 -2311 -7025 -3641 -7223 -7293 -2188 4413 1707 -1461 -4748 -6990 -7385 -6452 -4693 -5522
804e522j885L269j611j267J631a662B205K703J217a790E529a103k244d5j148m46
$$ -5522 -7407 -4138 -5749 -7016 -5385 -1662 2205 4908 6125 -1790 5529 -1103 -3347 -45 -1193 -1639
788a639K33O17C4d707l20D501K405C209n28j307h063b637l132l288J297J202m66
$$ -1639 -1406 -789 34 -4707 -5027 4501 6906 3209 2681 1374 -8063 -2637 -5769 -9057 -7760 -6558 -7024
771g024j73N42a367A965h29n712j547j74a696r95k913l285o70K695J160k93j370
$$ -7024 -7197 -6655 -1367 1965 -829 -6541 -8088 -8262 -1696 -2691 -5604 -8889 -9559 -6864 -5704 -5997 -7367
754g367q92J059J556Q04j066k972n36d476K08C851L905k590c79E71i50m413k91
$$ -7367 -8259 -7200 -5644 -4840 -5906 -8878 -9414 -4476 -4268 3851 7756 5166 -379 571 -950 -5363 -5654
737e654L97o00B992L622B405c960a197r13k425J681j27k191J567J417I10b438
$$ -5654 -5257 -5857 2992 6614 2405 -3960 -1197 -2110 -4535 -2854 -2981 -5172 -3605 -2188 910 -2438
720A43N64f207e8o130a772k301j865E85N009A778b702k755N05j287p02b126j592
$$ 143 707 -6207 -58 -6188 -1772 -4073 -5938 585 5594 1778 -2702 -5457 -4952 -6239 -6941 -2126 -3718
703c718l441l268M725A60N073B339c422B977P956k425D249A38b223Q57a59o252
$$ -3718 -7159 -10427 -5702 160 5233 2339 -3422 2977 10933 8508 4249 138 -2223 -1366 -159 -6411
687f411L00J443A62a634o53P34d00k818a433n301K254j489j405K378P28c61A309
$$ -6411 -6111 -4668 162 -1634 -2287 -1553 -400 -3218 -1433 -6734 -4480 -5969 -7374 -4996 -4268 -361 1309
669B409L27j33o59H74d36j387l363p6R92O7M54O10K86r2l963m2o04j434J839J104
$$ 2409 2736 2603 1944 874 -436 -1823 -5186 -5262 -4270 -4203 -3749 -3139 -2853 -2945 -6908 -6950 -7554 -8988 -7149 -6045
649f045a556l991j065a869N49p212L721a049C954G18c936a078j718J48R92O76
$$ -6045 -1556 -5547 -6612 -1869 -1320 -8532 -4811 -1049 3954 718 -3936 -1078 -2796 -2648 -1656 -980
633i80j011C38J003m63l18f447b497g16A230h4F026j135A513N440B459e648f90
$$ -980 -1991 338 1341 878 560 -6447 -2497 -716 1230 -84 6026 4891 1513 6953 2459 -5648 -690
615e481b233A737K408b436A860M000A731d178l503a219E919d78o754a207p51E07
$$ -5481 -2233 1737 4145 -2436 1860 5860 1731 -4178 -7681 -1219 5919 -478 -7232 -1207 -1958 507
598H784L954H47e895M43j664A062Q042l064G32Q411o55Q73k454g822D312a478
$$ 8784 12738 847 -5895 -5452 -7116 1062 9104 6040 732 9143 8488 9361 6907 -7822 4312 -1478
581a602l648J116A890d937K268e42m037A064a325G126R495l709A576c614n17e7
$$ -1602 -5250 -4134 1890 -4937 -2669 -542 -4579 1064 -1325 7126 16621 12912 1576 -3614 -4131 -57
564a905m386m51J02L055C642L758a900F11i742A594a366n749j243K438M20K0n35
$$ -1905 -6291 -6742 -6640 -3585 3642 7400 -1900 611 -9742 1594 -1366 -7115 -8358 -5920 -5500 -5480 -6015
547f015L99J462J351J018k625j831b231n27j003j399l36b423A947d010B940c717
$$ -6015 -5616 -4154 -2803 -1785 -4410 -6241 -2231 -2758 -3761 -5160 -5496 -2423 1947 -4010 2940 -3717
530e293h3j175n428l520L007L346J753q83n17l982k397c039C948a554k112l047
$$ -5293 -83 -1258 -6686 -10206 -7199 -3853 -2100 -2983 -3500 -7482 -9879 -3039 3948 -1554 -3666 -6713
514f713G48J478a02o418K003m10m41J949J537m074b717l875J737d99q3n410K578
$$ -6713 748 2226 -102 -6520 -4517 -4927 -5368 -3419 -1882 -5956 -2717 -6592 -4855 -499 -582 -5992 -3414
497c414O01d09B401J775b045k518j798b849E045a947D933k4A611n79Q626J5319
$$ -3414 -2813 -409 2401 4176 -2045 -4563 -6361 -2849 5045 -1947 4933 4909 1611 1032 9658 24977
481B4977J5049J38375O03573J58689j25420A65851o7743A9557P780I4M091j916
$$ 24977 40026 178401 781974 940663 815243 165851 98108 19557 27337 94 4185 2269
469B269b998o94k011k088J304R54J349J75m36O34Q35J134j621C77A3i26k759O83
$$ 2269 -2998 -3692 -5703 -7791 -6487 -5533 -4184 -4009 -4445 -3811 -2976 -1842 -3463 377 13 -926 -3685 -3002
451c002m61l216b898Q46p55n570b952a442k26l23n77k263J48k118j894r73J390
$$ -3002 -3463 -6679 -2898 -2052 -2807 -8377 -2952 -1442 -1668 -1991 -2568 -4831 -4683 -6801 -8695 -9668 -8278
434h278J181J26o89o9J549K526k934c1n168b26j772j565k274b101c18A125N18
$$ -8278 -7097 -6971 -7660 -7729 -6180 -3654 -6588 -31 -5199 -226 -1998 -3563 -5837 -2101 -318 1125 1643
417A643l34E55a666C8JK03a611A805J271J184p67M23j781h724c525k340C64L138
$$ 1643 1309 555 -1666 38 39 242 -1611 1805 3076 4260 3493 3916 2135 -8724 -3525 -5865 364 3502
399C502L49b283f14F32b348R16B210l43d590A347a222k515k162j529M5J541J743
$$ 3502 3851 -2283 -614 632 -2348 -1432 2210 1867 -4590 1347 -1222 -3737 -5899 -7428 -7383 -5842 -4099
382d099J027J144Q8k83L09f27m511J322e87A155g88j998k2a141m634B027j66C6
$$ -4099 -3072 -1928 -1840 -2123 -1814 -627 -5138 -3816 -587 1155 -788 -2786 -2808 -1141 -5775 2027 1861 36
363b899l225k098k46M39k69j042j043R81J966Q37b371@B096J252c885R17f21A15
$$ -2899 -6124 -8222 -8468 -8029 -8298 -9340 -10383 -9402 -7436 -6599 -2371 0 2096 3348 -3885 -2968 -621 115
344c957G79K393a896f02A946a932j108e94n657b907O9k950B935B97c766m601j332
$$ -3957 779 3172 -1896 -602 1946 -1932 -3040 -594 -6251 -2907 -2838 -5788 2935 297 -3766 -8367 -9699
327i699K359P29o79j127j443L08K531L443i11H74P06e418P48A125E06c613j63
$$ -9699 -7340 -6611 -7290 -8417 -9860 -9552 -7021 -3578 -911 874 1580 -5418 -4670 1125 506 -3613 -3776
310c776l465k057M506B45a207m983a691j182J383B597A181g18l396a642c77H78
$$ -3776 -7241 -9298 -4792 245 -1207 -6190 -1691 -2873 -1490 2597 1181 -718 -4114 -1642 -377 878
293e061g3A0488q90C71c81n271a3p921J446b537k574i34c09j152d42j054M59e04
$$ -5061 -73 10488 9598 371 -381 -5652 -13 -7934 -6488 -2537 -5111 -934 -309 -1461 -442 -1496 -1037 -504
274B218c429d8A1910D523a409C428d502q60a713C75J733K77R985K123i38a90D033
$$ 2218 -3429 -48 11910 4523 -1409 3428 -4502 -5362 -1713 375 2108 2385 12370 14493 -938 -190 4033
256b837A272K223K307C83f381i71D389J375b488l72l80L61j212E421j041d713
$$ -2837 1272 3495 5802 383 -6381 -971 4389 5764 -2488 -2860 -3240 -2879 -4091 5421 4380 -4713
239e140m418b254F854p00j989d931b11j520o59n13M19N95M03l742J487j451k93
$$ -5140 -9558 -2254 6854 6154 4165 -4931 -211 -1731 -2390 -2903 -2484 -1889 -1486 -5228 -3741 -5192 -5485
222e485J995m66a476j602l000j53b612A640d67m384B353a926m920k483L571k669
$$ -5485 -3490 -3956 -1476 -3078 -6078 -6231 -2612 1640 -467 -4851 2353 -1926 -6846 -9329 -5758 -8427
206h427L915M84k664m5L60c105a08l925R75J012l797k940A07Nb145k026j052K084
$$ -8427 -4512 -4028 -6692 -6737 -6377 -3105 -108 -4033 -3058 -2046 -5843 -8783 107 112 -2145 -4171 -5223 -3139
188c139c63r47F00a366B623l0E73a060C038l3I04b037j562J069i06l24k328k778
$$ -3139 -363 -1310 600 -1366 2623 2593 573 -1060 3038 3005 904 -2037 -3599 -2530 -906 -1230 -3558 -6336
170f336L83K644n452c49k223l615l889K672L463a144F49J44J260m56e14k55k567
$$ -6336 -5953 -3309 -8761 -349 -2572 -6187 -10076 -7404 -3941 -1144 649 793 2053 1597 -514 -769 -3336
153c336k55o92O4L63m119c925J250p61j469j439R01b524H35c052A784N135n95
$$ -3336 -3591 -4283 -4219 -3856 -7975 -3925 -2675 -3436 -4905 -6344 -5443 -2524 835 -3052 1784 6919 6324
136F324j466c842O12j395k86m056R20c300I28K354r2H01a529Qb37o072K168F18
$$ 6324 4858 -3842 -3230 -4625 -4911 -8967 -8047 -3300 928 3282 3190 801 -1529 -1521 -237 -6309 -4141 618
117f315L065D035od501g5B454a631l375j164K059q7a23n01A19D4h751c932j95
$$ -6315 -3250 4035 4029 -4501 -75 2454 -1631 -5006 -6170 -4111 -4198 -123 -624 119 44 -8751 -3932 -4127
99d127L3p0k958K712J211k656a103f1H17a540B824J376J528J046j839d609n691
$$ -4127 -4094 -4164 -7122 -4410 -3199 -5855 -1103 -61 817 -1540 2824 4200 5728 6774 4935 -4609 -10300
82a0300e84A192J344j210h279C436J63B38a860l763R07J21k032K045j888K108
$$ -10300 -584 1192 2536 1326 -8279 3436 3599 238 -1860 -5623 -4716 -4595 -6627 -4582 -6470 -4362
66d362m91J775A903c201J411C330f30B738j110c238a586j600j673K74k872J917
$$ -4362 -4853 -3078 1903 -3201 -1790 3330 -630 2738 1628 -3238 -1586 -3186 -4859 -4585 -7457 -5540
50e540j526m24O56P93L03J972E71N384J928C629a045C962A897e997A578O19c826
$$ -5540 -7066 -7490 -6834 -6041 -5738 -3766 571 5955 7883 3629 -1045 3962 1897 -5997 1578 2197 -3826
32e771K427J553L05m76p79m530K664j329m7J745a078m774A916K709j417I41a664
$$ -5771 -3344 -1791 -1486 -1962 -2741 -7271 -4607 -5936 -5983 -4238 -1078 -5852 1916 4625 3208 941 -1664
14c841j876j489j03K373K210J347d4r4n423Q77a882O02B195N89
$$ -3841 -5717 -7206 -7309 -4936 -2726 -1379 -44 -138 -5561 -4684 -1882 -1280 2195 2784
0B784
$$ 2784
##PAGE= F1=1890.439681466
##FIRST=     3388.38724502563, 2822.10010593221, -1039
##DATA TABLE= (F2++(Y..Y)), PROFILE
1023a039l827m44a560j041C295N571l917A66b253p12a049l492k559b036M20o013
$$ -1039 -4866 -5310 -1560 -2601 3295 8866 4949 166 -2253 -2965 -1049 -4541 -7100 -2036 -1616 -7629
1007g629d11H695K204m729CL484c006m9a384m746j704L45J316O13j287l461o48
$$ -7629 -411 8695 10899 6170 3 3487 -3006 -3055 -1384 -6130 -7834 -7489 -6173 -5560 -6847 -10308 -10956
990a0956e429g71B046o58J01k57f068D226Q02b253J29k276k361K793J502L32i34
$$ -10956 -5429 -771 2046 1388 1489 1232 -6068 4226 5028 -2253 -2124 -4400 -6761 -3968 -2466 -2134 -934
972E75K091K111G59c473r32a718B941a48l390j327Q92J108l537Q39l213k611L492
$$ 575 2666 4777 759 -3473 -4405 -1718 2941 -148 -3538 -4865 -3973 -2865 -6402 -5563 -8776 -11387 -7895
955g895L108b334h50J73A99a470k103j662N06K224D1J936Q73R90E73j9f83l955
$$ -7895 -4787 -2334 -850 -677 199 -1470 -3573 -5235 -4729 -2505 41 1977 2850 3840 573 554 -683 -4638
937d638J596j570A01d29A99e308l974b501G4c238k276k896j550J24J875L485F6
$$ -4638 -3042 -4612 101 -429 199 -5308 -9282 -2501 74 -3238 -5514 -8410 -9960 -9836 -7961 -4476 66
919A91K239b324j855J19p540e291D99K889f805B24l0e715k869J992a712k817Q17
$$ 191 2430 -2324 -4179 -4060 -11600 -5291 499 3388 -6805 224 194 -5715 -8584 -6592 -1712 -4529 -3712
902c712a826K38k590m872J270b485a21r23l896k970a132B91b556k397j099R13
$$ -3712 -1826 -1588 -4178 -9050 -7780 -2485 -121 -1044 -4940 -7910 -1132 291 -2556 -4953 -6052 -5139
886e139J847m617a32L3j707J20k385J180q13j278j655j489O31J473j333a291B510
$$ -5139 -3292 -7909 -132 -99 -1806 -1686 -4071 -2891 -3704 -4982 -6637 -8126 -7495 -6022 -7355 -1291 2510
868F815l123c583m406b317E859P272E399j085c239n10K92a223d50q273K834j983
$$ 6815 3692 -3583 -7989 -2317 5859 13131 5399 4314 -3239 -3749 -3457 -1223 -450 -8723 -5889 -7872
852g872c092G066l274l54K79d953j968B990k09d972a362k080n390K064A029Q226
$$ -7872 -3092 7066 3792 3438 3717 -4953 -6921 2990 2781 -4972 -1362 -3442 -8832 -6768 1029 9255
836I255j828A200Q605M277A083n23a051H558A03a431o804K105b933A429K103N983
$$ 9255 7427 1200 9805 14082 1083 560 -1051 8558 103 -1431 -8235 -6130 -2933 1429 3532 9515
820I515p64a550n950b448n463m99c802m034j974K384K492J651k544b716M13l649
$$ 9515 8751 -1550 -7500 -2448 -7911 -8410 -3802 -7836 -9810 -7426 -4934 -3283 -5827 -2716 -2303 -5952
804e952O61b005j072k473l281l47M319b21D164c345B833a290k671D651B09b02
$$ -5952 -5291 -2005 -3077 -5550 -8831 -9178 -4859 -221 4164 -3345 2833 -1290 -3961 4651 209 -202
787A222K73o70c376k416A414P29B15Q21b307l192m916q10M176K383J84q11J134
$$ 1222 1495 825 -3376 -5792 1414 2143 215 1036 -2307 -5499 -10415 -11225 -7049 -4666 -4482 -5293 -4159
770d159n98D324L920A880f205J575N6j141i87j678o91a135l03j674k455k211l87
$$ -4159 -4757 4324 8244 1880 -6205 -4630 -4574 -5715 -987 -2665 -3356 -1135 -1438 -3112 -5567 -7778 -8165
753h165J015O07n55k074j52d481A262e768B461N421r64C67c502l441J975K130
$$ -8165 -7150 -6543 -7098 -9172 -9324 -4481 1262 -5768 2461 7882 6918 367 -3502 -6943 -4968 -2838
737b838j07k291l488j346M091a232j881C285c720e39m253l629K216A81O486c876
$$ -2838 -2945 -5236 -8724 -10070 -5979 -1232 -3113 3285 -3720 -539 -4792 -8421 -6205 181 6667 -3876
720a032E34e654D02e183K189k397L85C829N700j946B006L89F2e938n08A513M245
$$ -1032 534 -5654 402 -5183 -2994 -5391 -5006 3829 9529 7583 2006 2395 62 -5938 -6446 1513 5758
703E758A043d850n898J774b976B395a900C742N10E93c783m096k35c614J729l512
$$ 5758 1043 -4850 -10748 -8974 -2976 2395 -1900 3742 4252 593 -3783 -7879 -8114 -3614 -1885 -5397
687e397K316r24A953a722k425L11a693o29j555l563b512k420k026K725k073a246
$$ -5397 -3081 -4005 1953 -1722 -4147 -3836 -1693 -2322 -3877 -7440 -2512 -4932 -6958 -4233 -6306 -1246
670e03A569Q98M60k52a84d8l283k840b750k200j625j326r32p4N23k67j158L49
$$ -503 1569 2467 2927 2675 -184 -48 -3331 -6171 -2750 -4950 -6575 -7901 -8833 -8907 -8384 -8651 -9809 -9460
652i460L139a536j427a415l655N74g20j740n309m281J023M034K576Q83n9o52P48
$$ -9460 -6321 -1536 -2963 -1415 -5070 -4496 -720 -2460 -7769 -12050 -11027 -6993 -4417 -3534 -3593 -4245 -3497
635c497a611ij193o17l273l925l599k894L782N226d75I8K322p01B36N240B53h016
$$ -3497 -1611 -9 -1202 -1819 -5092 -9017 -12616 -15510 -11728 -6502 -475 98 2420 1719 236 5476 253 -8016
616d844k68K348j591M5k75k49k42J90J424d25C874L944C728d961J817e12C023
$$ -4844 -5112 -2764 -4355 -4310 -4585 -4834 -5076 -4886 -3462 -425 3874 7818 3728 -4961 -3144 -512 3023
598G505k223a579l833J988m144A309P199j661j038J444j217j66n67f950C767a164
$$ 7505 5282 -1579 -5412 -3424 -7568 1309 8508 6847 5809 7253 6036 5870 5303 -6950 3767 -1164
581g53m249j157n973L04N741a541j620B949A093K385N421q19l927e959b274A093
$$ -753 -5002 -6159 -12132 -11828 -6087 -1541 -3161 2949 1093 3478 8899 8080 4153 -5959 -2274 1093
564I13e436p36K211j865A128M523d648D105d125a662l17j380N56p5m921c116B566
$$ 913 -5436 -6172 -3961 -5826 1128 5651 -4648 4105 -4125 -1662 -1979 -3359 -2803 -2878 -7799 -3116 2566
546b10B262K114A893e064k371m11k741j438J175K835L670g85j128D28d575j84
$$ -210 2262 4376 1893 -5064 -7435 -7846 -10587 -12025 -10850 -8015 -4345 -785 -1913 428 -4575 -4759
530d759j82N78r21m61J732J922Q65k509J018l677K888J165E60a036m94k645b18
$$ -4759 -4941 -4363 -5284 -5745 -4013 -2091 -1226 -3735 -2717 -6394 -3506 -2341 560 -1036 -1530 -4175 -218
512D842a017k517e78k682k468K145R44l286P13k352f18p84F88g012K740ln23r08
$$ 4842 -1017 -3534 -578 -3260 -5728 -3583 -2639 -5925 -5212 -7564 -618 -1402 688 -7012 -4272 -4275 -4798 -5706
494e706k271n77l389e895N19o39E8K893b783A1849C04N1802j2080N45995R95300
$$ -5706 -7977 -8554 -11943 -5895 -5376 -6015 58 2951 -2783 11849 304 52106 40026 586021 1581321
479A581321R93998L73810n04039A168606C00551G472J7780o682L919I556Q38h106
$$ 1581321 2575319 2949129 2445090 1168606 300551 7472 25252 18570 22489 9556 10394 -8106
466h662j71K756K884l0Q21Q75k155k882j410j771K604L563a571j038Q15m256n785
$$ -8662 -8833 -6077 -3193 -3223 -2402 -1527 -3682 -6564 -7974 -9745 -7141 -3578 -1571 -2609 -1794 -6050 -11835
449a1835J454b936k842J835J717D585j234D79h79m638K690l657n244K44d562A251
$$ -11835 -10381 -2936 -5778 -3943 -2226 4585 3351 479 -879 -5517 -2827 -6484 -11728 -11484 -4562 1251
432d552j568j574J588I50d395A383g032F8a713j046k944e19A413J096n58E2b356
$$ -4552 -6120 -7694 -6106 950 -4395 1383 -7032 68 -1713 -2759 -5703 -519 1413 2509 1951 52 -2356
414c935n10O22J386f15G20M65D52a718k936j327K929l708j29B414K910a16o308
$$ -3935 -4445 -3823 -2437 -615 720 1185 452 -1718 -4654 -5981 -3052 -6760 -6889 2414 5324 -116 -6424
397f424j905K376J031L03d51B463d036A836g8j525H14M069b673C383e113K086
$$ -6424 -8329 -5953 -4922 -4619 -451 2463 -4036 1836 -78 -1603 814 4883 -2673 3383 -5113 -3027
381c027J239l765l164k231j569k17J516J580O01n60o96K624c150m876E376p61
$$ -3027 -1788 -5553 -8717 -10948 -12517 -12734 -11218 -9638 -9037 -9597 -10293 -7669 -3150 -8026 5376 4615
365D615j884b546j599K038n210J258j4K58j46j742k875l210L638L178K360R73
$$ 4615 2731 -2546 -4145 -2107 -7317 -6059 -6073 -5815 -5961 -7703 -10578 -13788 -10150 -6972 -4612 -3639
349c639l48k449j144j490l90R39K173J544I1L456d121f6C84g026J103a347p16
$$ -3639 -3987 -6436 -7580 -9070 -9460 -8521 -6348 -4804 91 3547 -4121 -66 384 -7026 -5923 -1347 -2063
332b063m29j666J706d53E22A14b607j253k525k975l268J123L988L471g34B268
$$ -2063 -2492 -4158 -2452 -453 522 114 -2607 -3860 -6385 -9360 -12628 -11505 -7517 -4046 -734 2268
315b582K85F066j287g538b533m172l583J785c090a047m556J950l71a774J62D485
$$ -2582 -2297 6066 4779 -7538 -2533 -6705 -10288 -8503 -3090 -1047 -5603 -3653 -4024 -1774 -1612 4485
298E524b712B873K248a066l289E19J1614l783A831J127e407G0h317J656b837m953
$$ 5524 -2712 2873 5121 -1066 -4355 519 12133 8350 1831 2958 -5407 70 -8317 -6661 -2837 -7790
282g790K332l048k357J683N33j007J409c475J68p32H594C385a687A112c944l801
$$ -7790 -5458 -8506 -10863 -9180 -8647 -9654 -8245 -3475 -3307 -4039 8594 3385 -1687 1112 -3944 -7745
266g745M45K677b022c00F53B88a805l757l283c714a063p75A140A98d793A156N884
$$ -7745 -7300 -4623 -2022 -300 653 288 -1805 -5562 -8845 -3714 -1063 -1838 1140 198 -4793 1156 7040
249G040r34A192e903R84j764b466A271Q982f007J242l904L786C169K089B309d413
$$ 7040 6106 1192 -5903 -4919 -6683 -2466 1271 10253 -6007 -4765 -8669 -4883 3169 5258 2309 -4413
232H941j147C771A12c65l329k198j302j041o65K68J801R11b38j27k472l846l780
$$ 8941 7794 3771 112 -365 -3694 -5892 -7194 -8235 -8900 -8632 -6831 -5920 -238 -365 -2837 -6683 -10463
215a0463J715K950J503N57q29q37m20n8k223J600p06k97K75P14Q37J80r85j707
$$ -10463 -8748 -5798 -4295 -3738 -4567 -5404 -5824 -5882 -8105 -6505 -7211 -7508 -7233 -6519 -5682 -5502 -6487 -8194
197h194j225L96J345L061p87k213l309K596L248b388R56k51j470E068k130b399
$$ -8194 -9419 -9023 -7678 -4617 -5404 -7617 -10926 -8330 -5082 -2388 -1432 -1683 -3153 5068 2938 -2399
180d431I20J933L213j691j710p30M963G39b70k588k551J442o958A101L580A340
$$ -4431 920 2853 6066 4375 2665 1935 6898 739 -270 -2858 -5409 -3967 -10925 1101 4681 1340
163b584m96A23J367P38E58N470A632b032H29c405n222B443J872A520c915J771
$$ -2584 -3080 123 1490 2228 558 6028 1632 -2032 829 -3405 -8627 2443 4315 1520 -3915 -2144
147b144C161K5j352H56d345k989c434J013C114Q057P48p74e896b373L52j533i36
$$ -2144 3161 3186 1834 856 -4345 -7334 -3434 -2421 3114 11171 11919 11145 -5896 -2373 -2021 -3554 -936
129d078j127j169J300j347L8b668A499K082a70j041A495d258a669F31a309j554
$$ -4078 -5205 -6374 -5074 -6421 -6383 -2668 1499 3581 -170 -1211 1495 -4258 -1669 631 -1309 -2863
113b863j108p61o80j361j206N3R36J393J274R27R34p814a813N77o10j819k263
$$ -2863 -3971 -4732 -5412 -6773 -7979 -7926 -6990 -5597 -4323 -3396 -2462 -10276 -1813 -1236 -1846 -3665 -5928
96e928j128q35j19P03J834K116J624bF60m3b19m13l386l930b682k069o67J898
$$ -5928 -7056 -7891 -8010 -7307 -5473 -3357 -1733 -2 660 617 -219 -632 -4018 -7948 -2682 -4751 -5418 -3520
78c520r41A690N7b659m20n74a242o521K960J608k695Q79l682Q02D67b957J347
$$ -3520 -4461 1690 1747 -2659 -3079 -3653 -1242 -7763 -4803 -3195 -5890 -5011 -8693 -7891 467 -2957 -1610
61a610G565b435C776A344c725l887p22J768J672k571L178j42m83l83J95J808P72
$$ -1610 7565 -2435 3776 1344 -3725 -7612 -8334 -6566 -4894 -7465 -4287 -4429 -4912 -5295 -5100 -3292 -2520
44b520A783j18J596k57a798F906k423g541A375L866j446k82O18c159C244R02j202
$$ -2520 1783 1665 3261 3004 -1798 6906 4483 -7541 1375 5241 3795 3513 4131 -3159 3244 4146 2944
27B944f560L026j351j785j759p92j454k853k527M571N161a931B41c394j401C557
$$ 2944 -6560 -3534 -4885 -6670 -8429 -9221 -10675 -13528 -16055 -11484 -6323 -1931 241 -3394 -4795 3557
10c151D4a024o289o409L197c968R02F63K624A143
$$ -3151 44 -1024 -7313 -13722 -10525 -3968 -3066 663 3287 1143
##PAGE= F1=1887.681030336
##FIRST=     3388.38724502563, 2822.10010593221, -5613
##DATA TABLE= (F2++(Y..Y)), PROFILE
1023e613p313L598N26l319L139a265D019H02a055n284J104p915O336b267a023
$$ -5613 -12926 -9328 -8802 -12121 -8982 -1265 4019 802 -1055 -6339 -5235 -13150 -6814 -2267 -1023
1007e880P65k104p74l93j14K504e69j162e5p270C004j44a134j857k744C4f052
$$ -5880 -5115 -7219 -7993 -8386 -8500 -5996 -569 -1731 -55 -7325 3004 2860 -1134 -2991 -5735 34 -6052
989d602m468g84a42F363j149h596D602J626a031k904B103f056c15A901b952I04
$$ -4602 -9070 -784 -142 6363 5214 -8596 4602 6228 -1031 -3935 2103 -6056 -315 1901 -2952 904
972e256l605p63K010c734j008J601A198h26A042J069h95k750l951k7k459l784
$$ -5256 -8861 -9624 -7614 -3734 -4742 -3141 1198 -826 1042 2111 -895 -3645 -7596 -7623 -10082 -13866
956a3866j327K125J494j35j362j716J810L411L733a727B100K266j065K276i6l200
$$ -13866 -15193 -13068 -11574 -11709 -13071 -14787 -12977 -9566 -5833 -1727 2100 4366 3301 5577 -96 -3296
940c296J405J71k876l65j506k5K17Q13J117k781A534K258G58M863J708b212m853
$$ -3296 -1891 -1720 -4596 -4961 -6467 -6492 -6275 -5462 -4345 -7126 1534 3792 758 5621 7329 -2212 -7065
923g065L049a923I60k08K013b31j272B433a546l555j109j431j532K382b970k05
$$ -7065 -4016 -1923 960 752 2765 -231 -1503 2433 -1546 -5101 -6210 -7641 -9173 -6791 -2970 -3175
907c175p012j61n79a499A401M169K893J70B668a412e31C027J364d343l023i92
$$ -3175 -10187 -10348 -10927 -1499 1401 5570 8463 8633 2668 -1412 -531 3027 4391 -4343 -7366 -992
890B425a200m513n656k786O291r67E258B414a972B391d149a154E579f09o246n865
$$ 2425 -1200 -5713 -11369 -14155 -7864 -8831 5258 2414 -1972 2391 -4149 -1154 5579 -609 -6855 -12720
874a2720j569N509c347A846J2258m058A264d539n026c521E353P849D162m98d911
$$ -12720 -14289 -8780 -3347 1846 14104 10046 1264 -4539 -9565 -3521 5353 13202 4162 3664 -4911
858C295A20a321q678m556c636j862a068I570m591K70A017f791p093J039M736J827
$$ 3295 120 -1321 -9999 -14555 -3636 -5498 -1068 9570 4979 5249 1017 -6791 -13884 -12845 -8109 -6282
842f282J864r53k136k690k764j251O88J534K011K590K791a702k59A633H08G4d579
$$ -6282 -4418 -5371 -7507 -10197 -12961 -14212 -13524 -11990 -9979 -7389 -4598 -1702 -1961 1633 808 74 -4579
824h132J055b682P86I467m42e5o483b826n266J675a600B764D55c124P18a176o838
$$ -8132 -7077 -2682 -1896 9467 9025 -55 -6538 -2826 -8092 -6417 -1600 2764 455 -3124 -2406 -1176 -8014
807h014B128A42f279P97k943L850b014j311D737J521A129b792l78J459f96m152
$$ -8014 2128 142 -6279 -5482 -8425 -4575 -2014 -3325 4737 6258 1129 -2792 -3170 -1711 -696 -4848
791d848D329e9l237M97A437J163a897n766c236o174n376J737M220K615M04j496
$$ -4848 4329 -59 -3296 -2799 1437 2600 -1897 -7663 -3236 -9410 -14786 -13049 -8829 -6214 -5810 -7306
775g306k368j485K485M047m85a259r06k229l266m232l426L389L961b228J33o37
$$ -7306 -9674 -11159 -8674 -4627 -5112 -1259 -2165 -4394 -7660 -11892 -15318 -11929 -7968 -2228 -2095 -2732
759b732a179l477m806n044j823L792K994J305o30l020l216L891N190Q45a443j336
$$ -2732 -1179 -4656 -9462 -14506 -16329 -12537 -9543 -8238 -8868 -11888 -15104 -11213 -6023 -5178 -1443 -2779
743b779l550m676j547K304J388j452l958j090O847a718C777K434e271E164b423
$$ -2779 -6329 -11005 -12552 -10248 -8860 -10312 -14270 -15360 -8513 -1718 3777 6211 -5271 5164 -2423
727e63o105p448j073f555A223f462K657a003m534D21d430M22l498c695N43l160
$$ -563 -6668 -14116 -15189 -6555 1223 -6462 -3805 -1003 -5537 421 -4430 -4008 -7506 -3695 -3152 -6312
711f312r23J746a934M9m411o89d5j932k115k775l661q0e213H20a049C831D68d455
$$ -6312 -7235 -5489 -1934 -1885 -6296 -6985 -45 -1977 -4092 -6867 -10528 -10608 -5213 820 -1049 3831 468 -4455
692g832L85M74K877L73j05A469b231E957g23p861l538N725b332l847J159d57o305
$$ -7832 -7447 -6973 -4096 -3723 -3828 1469 -2231 5957 -723 -8584 -12122 -6397 -2332 -6179 -5020 -457 -6762
675f762o303J807L672b623d7E59c07n34r03K71F85c714ja1j264b1H151N18C122
$$ -6762 -13065 -11258 -7586 -2623 -47 559 -307 -841 -1744 -1473 685 -3714 -3715 -11 -1275 -21 8151 8669 3122
655A627g115b817m988b374E380A06c22l754J781I60b355k763M86n148l762q73
$$ 1627 -7115 -2817 -7805 -2374 5380 106 -322 -4076 -2295 960 -2355 -5118 -4632 -9780 -13542 -14415
639a4415J400J729O56Q44K240c755J240D468L022B665a893P5F465G26M51oM96
$$ -14415 -13015 -11286 -10630 -9786 -7546 -3755 -2515 4468 7490 2665 -1893 -1818 6465 726 1177 1171 1667
622A667A46a046B522c745l483P81a653l64F73J973e353A146K279O75O29p64F12
$$ 1667 146 -1046 2522 -3745 -7228 -6447 -1653 -2017 673 2646 -5353 1146 3425 4100 4729 3965 612
604e40j480j655j075o35k229k447j685O0R51N02K77O07R27Q59p8r60j796j29K749
$$ -540 -2020 -3675 -4750 -5385 -7614 -10061 -11746 -11686 -10735 -10233 -9956 -9349 -8422 -7563 -7641 -8601 -10397 -10526 -7777
585g777J813H87g64c70m059J556O60n32k190p628k649O048d089a141C337K202
$$ -7777 -5964 887 -764 -370 -4429 -2873 -2213 -2745 -4935 -12563 -15212 -9164 -4089 -1141 3337 5539
569E539N91g066c38G18K366i25m989e76k154l699k790k447j800L091c472J8h52
$$ 5539 6130 -7066 -338 718 3084 -925 -5914 -576 -2730 -6429 -9219 -11666 -13466 -10375 -3472 -3454 -852
551f022a173l903j376A896a438C313J3488F619c364j0337b353A253J541a518c95
$$ -6022 -1173 -5076 -6452 1896 -1438 3313 16801 6619 -3364 -13701 -2353 1253 2794 -1518 -395
535b36q40l497Q24k91j22n360L247K866k74P34k426m1l47b637J111p12l139l277
$$ -236 -1076 -4573 -3749 -4040 -4162 -9522 -6275 -3409 -3683 -2949 -5375 -5416 -5763 -2637 -1526 -2238 -5377 -8654
517h654m420L4e909A976L883a517d02C109a701n207L228C036h218m570d658a936
$$ -8654 -13074 -13040 -5909 1976 5859 -1517 -402 3109 -1701 -6908 -3680 3036 -8218 -12788 -4658 -1936
500c265M81m521p409j626e270E519f45l350j333b41o540C6212A7612l7J0793P1812
$$ -3265 -2784 -7305 -14714 -16340 -5270 5519 -645 -3995 -5328 -241 -6781 36212 17612 17575 28368 100180
484A00180j2615J44533n3697J402920P136513O100417K822391k406550C784515
$$ 100180 87565 232098 178401 1581321 8717834 14818251 17640642 15234092 3784515
474A462060A90174J46531a5668A39651A6349O428c177F758a2473g75j5472b752
$$ 1462060 190174 336705 -15668 139651 16349 22777 -3177 6758 -12473 -775 -16247 -2752
461h779l291e850r2J09J227l920n147r3q10O01K758M315a694B418b740A182B26
$$ -8779 -12070 -5850 -5942 -5833 -4606 -8526 -13673 -13766 -14576 -13975 -11217 -6902 -1694 2418 -2740 1182 226
443b094k546k527k23J673J998J149a78j168G16P171a070o673c342J113A723b346
$$ -2094 -4640 -7167 -7390 -5717 -3719 -2570 -178 -1346 716 7887 -1070 -7743 -3342 -2229 1723 -2346
426A952f391g48kl574r48A102N328M286K264K62D318F98M953A937b08k972r57
$$ 1952 -6391 -748 -750 -4324 -5272 1102 6430 10716 12980 13242 4318 698 5651 1937 -208 -3180 -4137
409d137J703A788K716P067j733B154f435j79A802Q511j987A23c039E54K646J385
$$ -4137 -2434 1788 4504 11571 9838 2154 -6435 -6614 1802 10313 8326 123 -3039 554 3200 4585
393D585F92b742l869l249K425a646c42C612c566B714f069o26o501k451O37J75
$$ 4585 692 -2742 -6611 -9860 -7435 -1646 -342 3612 -3566 2714 -6069 -6695 -13196 -15647 -15010 -14835
377a4835K402L979L550m266b163j961l656p45b784l664E669R27B750e024J533
$$ -14835 -12433 -8454 -4904 -9170 -2163 -4124 -7780 -8525 -2784 -6448 5669 6596 2750 -5024 -3491
362c491j379l807b668B055a331l285l358k231n67O76J216J104J75p38p58R84K474
$$ -3491 -4870 -8677 -2668 2055 -1331 -4616 -7974 -10205 -10772 -10096 -8880 -7776 -7601 -8339 -9097 -8113 -5639
345e639J830j12j823j332b650C167e242B097D72h549M64A592K77b288C48L829
$$ -5639 -3809 -3921 -5744 -7076 -2650 3167 -5242 2097 472 -8549 -8085 1592 1869 -2288 348 4177
329D177J004Q679j606a892j302L18a333p304k615N588g4C893K160a18j277E411
$$ 4177 5181 13860 12254 -1892 -3194 -2876 -1333 -8637 -11252 -5664 -74 3893 6053 -118 -1395 5411
312C339g575c542l839l430k251J364L573K762k41K85K505k948C695R27i92B947
$$ 3339 -7575 -3542 -7381 -10811 -13062 -11698 -8125 -5363 -5604 -5319 -2814 -5762 3695 4622 -992 2947
295B667c348j7R27j704r91j09R10J080M78j60j000j623j370o04o5l82j035k60
$$ 2667 -3348 -3365 -2438 -4142 -5133 -5242 -4332 -3252 -2774 -2934 -3934 -5557 -6927 -7531 -7596 -7978 -9013 -9273
277i273J322K082Q27j404l351l207K391M828a676l83o800L236m511k128J145K111
$$ -9273 -7951 -5869 -5042 -6446 -9797 -13004 -10613 -5785 -1676 -2059 -8859 -5623 -10134 -12262 -11117 -9006
261i006K190L324R14a010l780K285m008K227a939j863n504o297J562K933L672
$$ -9006 -6816 -3492 -2578 -1010 -4790 -2505 -6513 -4286 -1939 -3802 -9306 -15603 -14041 -11108 -7436
246g436K859p17h94k986E547g385J733r73r10a007A414a516D98J4545J897F564
$$ -7436 -4577 -5294 -894 -3880 5547 -7385 -5652 -6625 -7535 -1007 1414 -1516 498 15043 16940 6564
229C182o43J985B074e578a416L0o762K524k75q70J803J646M53j048j622k316k119
$$ 3182 2539 4524 2074 -5578 -1416 -1386 -8148 -5624 -5899 -6769 -4966 -3320 -2867 -3915 -5537 -7853 -9972
212i972k241j591n42N35J496J821K529K026J620j558K304n68j160k822j52l82
$$ -9972 -12213 -13804 -14346 -13811 -12315 -10494 -7965 -5939 -4319 -5877 -3573 -4141 -5301 -8123 -8275 -8657
196h657N67R26M8j226M2M127G13J630I96a280k165m7E447B112e603mG735d631
$$ -8657 -8090 -7164 -7116 -8342 -8300 -4173 713 2343 996 -1280 -3445 -3492 5447 2112 -5603 -5607 7735 -4631
177a4905N617c718J304j312k198J35a699L67j861m083C537M072p70L530D444j783
$$ -14905 -9288 -3718 -2414 -3726 -5924 -5789 -1699 -1332 -3193 -7276 3537 7609 6839 10369 4444 2661
161B661c37j038O56D915D59c124j814m227J501c527h35D58f60l11C515L43p45
$$ 2661 -337 -1375 -719 4915 459 -3124 -4938 -9165 -7664 -3527 -835 458 -660 -971 3515 3858 3113
144C113a657j074a059b76r11D350Q77K37L703f920a582H42d720E149p29a5154
$$ 3113 -1657 -2731 -1059 -276 -1187 4350 5227 5464 9167 -6920 -1582 842 -4720 5149 4420 -15154
127c7806P534a787m978n26a804F008j169I72J44c110d95J75l787n528m603k790
$$ -37806 -30272 -1787 -6765 -7291 -1804 6008 4839 972 1116 -3110 -495 -320 -4107 -9635 -14238 -17028
111a7028L565M910K397J320o31j189m076k854K541L234c499M31I45D3f834p835
$$ -17028 -13463 -8553 -6156 -4836 -5467 -6656 -10732 -13586 -11045 -7811 -3499 -3068 945 43 -6834 -14669
95a4669q40O262M278J980j84j732j649k392k709k145J740M052L281a410N14E11
$$ -14669 -15509 -9247 -4969 -2989 -3173 -4905 -6554 -8946 -11655 -13800 -12060 -8008 -4727 -1410 -896 511
78H56a151B177m51e030J088m303m222k825Q22L630M597m62J79J825h27k521J565
$$ 856 -1151 2177 1726 -5030 -3942 -8245 -12467 -15292 -14470 -10840 -6243 -6705 -6526 -4701 -827 -3348 -1783
61a783G188b296D205O584a442E024K354b849c25m952f97k626n699J173K544n79
$$ -1783 7188 -2296 4205 10789 -1442 5024 7378 -2849 -325 -5277 -697 -3323 -9022 -7849 -5305 -5884
45e884l646m966m045j405J727M799O450d26n431F32Q836J395k903k401e416D611
$$ -5884 -9530 -14496 -18541 -19946 -18219 -13420 -6970 -426 -5857 632 9468 10863 7960 5559 -5416 4611
28A0635D257d573J957j248f78n687J71M96e90k607l868J680a832G7a257l557A578
$$ 10635 4257 -4573 -2616 -3864 -678 -6365 -6194 -5698 -590 -3197 -7065 -5385 -1832 77 -1257 -4814 1578
10a869o49m771q171m948P989c584Q93A995b361p616
$$ -1869 -2518 -7289 -15460 -20408 -12419 -3584 -2691 1995 -2361 -9977
0i977
$$ -9977
##PAGE= F1=1884.922379206
##FIRST=     3388.38724502563, 2822.10010593221, -61563
##DATA TABLE= (F2++(Y..Y)), PROFILE
1023f1563P309O146J1221a8400C758M502B029j69B5e839l0200k1783J9664J6380
$$ -61563 -54254 -48108 -36887 -18400 3758 8260 2029 1860 25 -5839 -36039 -57822 -38158 -21778
1009b1778P061o80m782n462l254P47O735g344A246h45j077k837C544E96c302B35
$$ -21778 -14717 -15397 -20179 -25641 -28895 -28148 -21413 -7344 1246 -845 -1922 -4759 3544 596 -3302 235
992g802b67q969l1421k580i657b459C989N89a0282D404K247H19f501A824d079
$$ -7802 -267 -9236 -40657 -43237 -9657 -2459 3989 4578 -10282 4404 6651 819 -6501 1824 -4079
976A067L535b834J321n836l698n163j0184j8248j2889b6227a414k115E48K047
$$ 1067 4602 -2834 -1513 -7349 -11047 -16210 -26394 -44642 -57531 -26227 -1414 -3529 548 2595
962B595o0A089a5614k7555j7948J4961O558r82m669n167j557M187J1049J5788
$$ 2595 2535 1089 -15614 -43169 -61117 -46156 -39598 -40580 -45249 -50416 -51973 -47786 -36737 -20949
948b0949f156K139B26K482e926j1111o890p195j3136p558K3755f667o88d07H006
$$ -20949 -6156 -4017 226 2708 -5926 -17037 -23927 -31122 -44258 -51816 -28061 -6667 -7355 -407 8006
932C053d469O80D665J160j501K054Q35a644p852j7334R946I15k62K080j49E08
$$ 3053 -4469 -3789 4665 5825 4324 6378 7213 -1644 -9496 -26830 -16884 915 653 2733 2584 508
915D897j895J911j477d364j544G248N009a14j6790j7062d683D008q43M053l44
$$ 4897 3002 4913 3436 -4364 -5908 7248 12257 -114 -16904 -33966 -4683 4008 3165 7218 6874
900F874M267Q814e29q372J648K641q10m813n640k041L949O371c196a037A322e999
$$ 6874 11141 19955 -529 -8901 -7253 -4612 -5422 -10235 -15875 -17916 -13967 -7596 -3196 -1037 1322 -5999
883G420C251a091D79c875i79A0394k62a115k268j533p378j7450l479f236E930
$$ 7420 3251 -1091 479 -3875 -979 10394 10132 -1115 -3383 -4916 -12294 -29744 -33223 -6236 5930
867b810n153P15c404D067P696C132J292g435F192i25k144a24l5577N076b230B48
$$ -2810 -7963 -7248 -3404 4067 11763 3132 4424 -7435 6192 -925 -3069 -124 -35701 -30625 -2230 248
850I878D926P68e906j8005N98i932A215g243B687a853k828l81e00C636A226d798
$$ 9878 4926 5694 -5906 -23911 -23313 -9932 1215 -7243 2687 -1853 -4681 -5062 -500 3636 1226 -4798
833A4819D092a0771j5528j4446r848P156P946K953l284m688J0106a1896C866K893
$$ 14819 4092 -10771 -26299 -40745 -50593 -43437 -35491 -32538 -35822 -40510 -30404 -11896 3866 6759
819F759A769f604j6654K695b736J229g24k272p52J067k88m475F182B346f575h
$$ 6759 1769 -6604 -23258 -20563 -2736 -1507 -724 -2996 -3748 -2681 -2969 -7444 6182 2346 -6575 -8
802C81c09D64c960o235q593j5508j8819K3350f377C38e829D077a77o075j466a716
$$ 381 -309 464 -3960 -10195 -18788 -34296 -53115 -29765 -6377 338 -5829 4077 -177 -6252 -7718 -1716
785A518a146o930f47B95a8277j8497j1732l849L279J1050J6062e272K031r72l897
$$ 1518 -1146 -8076 -647 295 -18277 -36774 -48506 -52355 -49076 -38026 -21964 -5272 -3241 -4213 -8110
770h110B504P367j183l949A939M18K690d080h12k28p81n558j4580j6181j3931
$$ -8110 2504 9871 8688 4739 1939 2357 5047 -4080 -812 -1040 -1821 -7379 -21959 -38140 -52071
755e2071J5073J5767h721b128r50q882j4208j1858N016J3617h008a878j613j0406
$$ -52071 -36998 -21231 -8721 -2128 -3078 -11960 -26168 -38026 -33010 -19393 -8008 -1878 -3491 -13897
741a3897j7153k0238J8579J5438O947k458j0423j4434j869J4475a1460b011P16
$$ -13897 -31050 -51288 -32709 -17271 -10324 -12782 -23205 -37639 -39508 -25033 -11460 -2011 -1295
728a295j41r21o362p184o319l823j467j219k989m957m433j24L424K176k069n945
$$ -1295 -1436 -2357 -8719 -15903 -22222 -26045 -27512 -28731 -31720 -36677 -41110 -41234 -37810 -35634 -37703 -43648
712d3648n412J0460J2988J0553N542L9k985k860j041j201k406k805m36K151J515
$$ -43648 -49060 -38600 -25612 -15059 -9517 -9478 -12463 -15323 -16364 -17565 -19971 -22776 -23212 -21061 -19546
697a9546k489n012j577O165R610e759L37L72Q63a089F232d25C798d951j2948j3929
$$ -19546 -22035 -27047 -28624 -22459 -12849 -5759 -5422 -5050 -4187 -1089 6232 -425 3798 -4951 -17899 -31828
681c1828q951K510L709j788l918P613a5623f453j121L536a039l888Q97j329M19
$$ -31828 -40779 -38269 -34560 -36348 -40266 -32653 -15623 -6453 -7574 -4038 -1039 -4927 -4030 -5359 -4940
666d940K203A507b371M42A952p06P05M786n80C60i87l839F06a8369j8061K767
$$ -4940 -2737 1507 -2371 -1929 1952 1246 1951 6737 6157 360 -987 -4826 606 -18369 -36430 -33663
650c3663J5479g011J901p913j6432j1793J5388f243b980A437m77a154j934k374
$$ -33663 -18184 -7011 -5110 -13023 -29455 -41248 -25860 -6243 -2980 1437 960 -1154 -3088 -5462
636e462n337l772K708d928A296M643B613d041H54P215C96g575k5680k3099J6106
$$ -5462 -10799 -14571 -11863 -4928 1296 5939 2613 -4041 854 8069 396 -7575 -33255 -56354 -40248
621d0248J3641P792M271K155q0l816q088j2347j2299O138J2844R708M296n42l828
$$ -40248 -26607 -18815 -14544 -12389 -12469 -16285 -24373 -36720 -49019 -42881 -30037 -20329 -16033 -16575 -20403
606b0403m889j988L18Q82Q27J21j41j68j444k515l504m831k881L887R570J0933
$$ -20403 -25292 -27280 -26962 -26080 -25253 -25132 -25273 -25441 -26885 -29400 -32904 -37735 -40616 -36729 -27159 -16226
590a6226f644a02A534a154j763m233n199n063k809L428P986b251L8p252j1857
$$ -16226 -6644 -102 1534 -1154 -2917 -7150 -12349 -17412 -20221 -16793 -8807 -2251 -2213 -9465 -21322
575b1322j5509j8888J5141a7813D740J4644F824e148G63a224p502k2724k2002
$$ -21322 -36831 -55719 -40578 -17813 4740 19384 6824 -5148 763 -1224 -8726 -31450 -53452
562e3452K0426i754c955h5n117I250D592a110n797K544k153c81j915p546A297
$$ -53452 -33026 -9754 -3955 -85 -5202 9250 4592 -1110 -6907 -4363 -6516 -381 -2296 -9842 1297
546b976C014J4794G018a782O83d74A980K226A38i22j804A485B0f516b846j595
$$ -2976 3014 17808 7018 -1782 -1099 -474 1980 4206 138 -922 -2726 1485 20 -6516 -2846 -4441
530d441l762K484C168c502K30A0168D109h482E33K518q64O990j276A611m0C62
$$ -4441 -8203 -5719 3168 -3502 -3272 10168 4109 -8482 533 3051 2187 9177 7901 1611 1571 362
513F269K528a447A649M246g84p926c713l2847B405R06A5Q220E59b2896k6600a5655
$$ 6269 8797 -1447 1649 5895 -784 -8710 -3713 -36560 2405 3311 15 8235 559 -22896 -49496 -15655
496C862a0255A3103c1112e272J534C71a2313C6182q823K4764j7795J06637K21090
$$ 3862 -10255 13103 -31112 -5272 -3738 371 -12313 36182 27359 52123 34328 140965 362055
483C62055Q4422L35497J793345J2242932J19483760L2144573l5269850G168763
$$ 362055 446477 781974 2575319 14818251 134302011 166446584 131176734 7168763
474C065424A329963F19264k31406j60717H2645k2210j3985I834A657J294a5025
$$ 3065424 1329963 619264 387858 227141 82645 60435 46450 9834 1657 2951 -15025
462a626E633B032J3315g802f53G800h823j6559c731M43j28n08k079k5449a3069
$$ -1626 5633 2032 15347 -7802 -653 7800 -8823 -25382 -3731 -3288 -3416 -3924 -6003 -31452 -13069
446a65D794k162H47L755M855j467c938j1636k8612J7489a2443A71R217A558h048
$$ -165 4794 2632 847 4602 9457 7990 -3938 -15574 -44186 -26697 -12443 171 9388 1558 -8048
430D67Q84j29a123B423d427J672B425l10e504G756k025L005Q148j461D871d00
$$ 467 1351 1222 -1123 2423 -4427 -2755 2425 2115 -5504 7756 5731 8736 16884 15423 4871 -400
413B732a577c79A4197J1761j1037D434j959N666R58l532c226k022A541Q379j479
$$ 2732 -1577 -379 14197 25958 14921 4434 2475 8141 9099 5567 -3226 -5248 1541 9920 8441
398H441D49b636B48N804O031i034k0474o482J7811b123P0j36F71d486B807b5032
$$ 8441 449 -2636 248 6052 12083 -9034 -29508 -35990 -18179 -2123 -2053 -2189 671 -4486 2807 -25032
381d8373O2J2580J3263h248D650b767k084Q42D31J3525n549a706j935r53D467
$$ -48373 -48311 -35731 -22468 -8248 4650 -2767 -4851 -4009 431 13956 8407 -1706 -3641 -4594 4467
365F803A053g656j3018o608j356K15M15P13J272J106J66o91r24j305j247j99J422
$$ 6803 1053 -7656 -20674 -27282 -28638 -28423 -28008 -27295 -26023 -24917 -24751 -25442 -26366 -27671 -28918 -29117 -27695
348b7695K924K132k134p904j3663j0163J8062J5427J0519N462K658a563o075k30
$$ -27695 -24771 -22639 -24773 -32677 -46340 -56503 -38441 -23014 -12495 -7033 -4375 -1563 -7638 -7868
334g868J688j1040r661N755a677G074N165l842b496m30o05a420j4172r598K826
$$ -7868 -6180 -17220 -26881 -21126 -1677 7074 12239 8397 -2496 -2926 -3531 -1420 -15592 -25190 -22364
319b2364N473K321k09R23M051L804o5n829j0802j2755j0152j978K977Q78m13L572
$$ -22364 -16891 -14570 -14779 -13856 -9805 -6001 -6066 -11895 -22697 -35452 -45604 -47582 -44605 -43727 -44140 -40568
303d0568R597J2917f528C011L831e74B680K05f393a713j350A0457l566B819M344
$$ -40568 -30971 -18054 -6528 3011 6842 -574 2680 2885 -6393 -1713 -3063 10457 6891 2819 7163
288G163C341L631B144D57K089c750i50j7804j7709j2477J85J378j650K494P974
$$ 7163 3341 6972 2144 457 2546 -3750 -950 -18754 -36463 -48940 -48755 -47377 -49027 -46533 -38559
273c8559P773M130Q2k696k900j139K763N823P062N891J829k865o569p125l258
$$ -38559 -30786 -26656 -26574 -29270 -32170 -33309 -30546 -24723 -17661 -11770 -9941 -12806 -19375 -26500 -29758
258b9758J204J692j285m576p040m981N210J1772J1969g112K702m238j1131j5200
$$ -29758 -28554 -26862 -28147 -32723 -39763 -44744 -39534 -27762 -15793 -7112 -4410 -8648 -19779 -34979
244c4979q577J1390J5133P724J574L067q318p588M975C27N454J0981N1G656k560
$$ -34979 -43556 -32166 -17033 -9309 -7735 -4668 -12986 -20574 -15599 327 5781 16762 16813 7656 5096
229E096k264k01I67i636k0654p971J2863i665d245J468C218g279j5906j7936q285
$$ 5096 2832 2631 967 -9636 -30290 -38261 -25398 -9665 -4245 -2777 3218 -7279 -23185 -41121 -49406
214d9406J0875R068L424r72l534l948n46N512R587Q180M082j554o811j0073j1244
$$ -49406 -38531 -29463 -26039 -27011 -30545 -34493 -35039 -29527 -19940 -11760 -7678 -9232 -16043 -26116 -37360
199c7360j0276k811P386P652O311N186O255g398a736h39K86C03a143l334P15C907
$$ -37360 -47636 -50447 -43061 -35409 -29098 -23912 -17657 -7398 -1736 -839 -553 303 -1143 -4477 -3762 3907
182F7g991c103D024a5381j7293j1521l105N553J3508i697h07k880a830J47m001
$$ 67 -7991 -3103 4024 -15381 -32674 -44195 -47300 -41747 -28239 -9697 -807 -3687 -1830 -1683 -5684
167e684E202J931k446L566C399A690c956j4917j0909O779g747c094G330m36B633
$$ -5684 5202 7133 4687 8253 3399 1690 -3956 -18873 -29782 -23003 -7747 -3094 7330 6894 2633
151C521c71C910A698i78B738J444Rb172e98D989B25k5b1628k2677J2432a4190
$$ 3521 -371 3910 1698 -978 2738 4182 4191 -2172 -598 4989 225 200 -21628 -44305 -31873 -14190
134f577k992j1007j2298l745N025L839m0705J1908K0718M423J2918a967F996Q04
$$ -6577 -9569 -20576 -32874 -36619 -31594 -27755 -68460 -56552 -35834 -31411 -18493 -1967 6996 7800
120G800A237i06k373A6b305k775j826J362l948j3077k2138p661b6075f782b763
$$ 7800 1237 -906 -3279 16 -2305 -5080 -6906 -5544 -9492 -22569 -44707 -52368 -26075 -6782 -2763
104B733i333k3236j9539b1660f662b180A128f760K575J745j5949p185h841A698
$$ 2733 -9333 -32569 -52108 -21660 -6662 -2180 1128 -6760 -4185 -2440 -18389 -25574 -8841 1698
89E715A586l06h680j3875L695f482a801F722b057B731M954H39J0811J0245f358
$$ 5715 1586 1280 -8680 -22555 -18860 -6482 -1801 6722 -2057 2731 7685 839 11650 21895 -6358
73A2566k825a32k262a160k315m253n55p14m199P77M389c976J592L91A202P949
$$ 12566 9741 -132 -2394 -1160 -3475 -7728 -8283 -8997 -13196 -12419 -8030 -3976 -2384 -1993 1202 9151
57I151a798C381L183a882q29j539N69k1371j7406a0588b873l559q18B65J299a019
$$ 9151 -1798 3381 6564 -1882 -2711 -4250 -3681 -25052 -42458 -10588 -2873 -6432 -7250 265 1564 -1019
40b659J146H625k663d094a068k635j1726j6446o661a5273E026Q486C925d917a434
$$ -2659 -1513 8625 5962 -4094 -1068 -3703 -15429 -31875 -38536 -15273 5026 13512 3925 -4917 -1434
24c565C37a969C864e136A3713D710b5020k2265P920J6359O975j108j093N057N585
$$ -3565 337 -1969 3864 -5136 13713 4710 -25020 -47285 -39365 -23006 -16031 -17139 -18232 -13175 -7590
9g590k161j2710k1421k5380j2774J2140K911n742r801
$$ -7590 -9751 -22461 -43882 -69262 -82036 -69896 -66985 -72727 -82528
0h2528
$$ -82528
##PAGE= F1=1882.163728076
##FIRST=     3388.38724502563, 2822.10010593221, -95778
##DATA TABLE= (F2++(Y..Y)), PROFILE
1023i5778j312O03K3893c5034E485L51H60L047A495i359n0993l6813L2421K9005
$$ -95778 -97090 -96487 -72594 -35034 5485 5836 860 3907 1495 -9359 -60352 -97165 -64744 -35739
1009c5739J4766L256k314k353J623P660A777M117B251b35l283R21B100a856l160
$$ -35739 -20973 -17717 -20031 -22384 -20761 -13101 1777 5894 2251 -235 -3518 -2597 2100 -1856 -5016
994e016E07f870F6c8069n5886L9664A436d688A232J409h589D032K803C161i109
$$ -5016 507 -6870 66 -38069 -93955 -54291 1436 -4688 1232 2641 -8589 4032 6835 3161 -9109
978A570b319A940J225a5314q416p93J856j723j1291k5821l9733M0638f102k93
$$ 1570 -2319 1940 3165 -15314 -23730 -24523 -22667 -24390 -35681 -61502 -101235 -60597 -6102 -6395
964f395a425B397L042j882c1426m5401j0914K0275O978o402j3016j2450k431J0068
$$ -6395 -1425 2397 5439 3557 -31426 -76827 -87741 -67466 -60488 -66890 -79906 -92356 -94787 -84719
950h4719K1105K8474a0542K567b552D716h308r008j404o322j9998k5070J5708
$$ -84719 -63614 -35140 -10542 -7975 -2552 4716 -8308 -17316 -18720 -25042 -45040 -70110 -54402
937e4402a4477f663a240G298A223e510a403F654R50l54j344K06a333k5900l1733
$$ -54402 -14477 -6663 -1240 7298 1223 -5510 -1403 6654 7604 7250 5906 6112 -1333 -27233 -58966
922e8966K0807h752h3B819K216A637N329j491j379a082n686K782I329N772B623
$$ -58966 -38159 -8752 -83 2819 5035 1637 6966 5475 4096 -1082 -6768 -3986 9329 15101 2623
906b3750j6590e613C499R29K259l303O537J2234j864c527B128J114e225n846j3091
$$ -23750 -40340 -5613 3499 4428 6687 3384 9921 22155 20291 -3527 2128 3242 -5225 -11071 -24162
891b4162o059P926f455A620b275j91J171I372C073E56c07k606f31A3094m29B890
$$ -24162 -30221 -22295 -6455 1620 -2275 -2466 -1295 9372 3073 556 -307 -2913 -631 13094 12665 2890
874A199e775A377b2028l7207M523a0189K648j262d004J450B460P265B441n9b928
$$ 1199 -5775 1377 -22028 -59235 -54712 -10189 -7541 -8803 -4004 -2554 2460 9725 2441 2382 -2928
858A0721F54d249f46l4010k7591L0716I21P548D071Q64a6863l4054j3652K3858
$$ 10721 654 -4249 -646 -34656 -62247 -31531 921 8469 4071 4935 -16863 -50917 -64569 -40711
844d0711a7632f731j058o520l2b761j65D94J592h545A5521R95c528j3176k7246
$$ -40711 -17632 -6731 -7789 -14309 -14341 -2761 -2926 494 2086 -8545 15521 16516 -3528 -16704 -43950
829d3950k6061k0109J4332Q380k702j0286J1868K4603J9730O635j0358k5102j3792
$$ -43950 -70011 -90120 -75788 -67408 -70110 -80396 -68528 -43925 -24195 -17560 -27918 -53020 -66812
816f6812L3400A700a717k482r08J651a682j981j090A0272E062f370I34L48K31
$$ -66812 -33412 1700 -1717 -4199 -5107 -3456 -1682 -3663 -4753 10272 5062 -6370 934 1282 1513
801A513N08I56a6534k7388j9715J3882a9378f309I63f052C627A25h066j98L031
$$ 1513 2021 956 -16534 -43922 -63637 -49755 -19378 -6309 963 -6052 3627 125 -8066 -8264 -5233
786e233a489k0l285a317l631k0188k0191j1646k027Q805J7535a1408A388d556
$$ -5233 -1489 -1509 -4794 -1317 -4948 -25136 -45327 -56973 -59000 -50195 -32660 -11408 1388 -4556
771e145r97E362R566l484E685k516L85L812a702D17j42a0359j7393k0226k1846
$$ -5145 -6142 5362 14928 11444 5685 3169 3554 7366 -1702 417 275 -10359 -27752 -47978 -69824
756f9824k1045K5271K5830a7640c921a755j0078j8885j9903p097J3475J8716a1856
$$ -69824 -90869 -65598 -39768 -17640 -3921 -1755 -11833 -30718 -50621 -57718 -44243 -25527 -11856
742i511j2345k5861l6227K4399b6153d396A917e721k0490k7445k4628J1755K4180
$$ -9511 -21856 -47717 -83944 -59545 -26153 -4396 1917 -5721 -26211 -53656 -78284 -66529 -42349
729d2349K0565e812C793A73N310O776B16f236j2216k6396k8864k896K3635J7024
$$ -42349 -21784 -5812 3793 173 5483 12259 216 -6236 -18452 -44848 -73712 -76608 -52973 -35949
715c5949N980o535j6851k1513Q142K6891a7357e636k649j689r740q550o910o196
$$ -35949 -29969 -36504 -53355 -74868 -66726 -39835 -17357 -5636 -8285 -9974 -19714 -28264 -35174 -41370
701d1370o089m386k019j352j300M325J2667J5614a1481N526j153n086m949j702
$$ -41370 -47459 -51845 -53864 -55216 -56516 -52191 -39524 -23910 -11481 -5955 -7108 -12194 -17143 -18845
687a8845P26Q92j978o472j0820j3133j2001n358o63k592j608J3214K4733f981
$$ -18845 -18119 -17227 -19205 -25677 -36497 -49630 -61631 -66989 -67652 -70244 -71852 -58638 -33905 -6981
672f493j044K248j223J528R11J935j392A742a251k05B815K820l40j201A679c760
$$ -6493 -7537 -5289 -6512 -4984 -4073 -2138 -3530 1742 -1251 -1456 2815 5635 5295 4094 1679 -3760
655d133J875j0239k2798k1073p523O414N328m764j7157j4458L5637a6104d577
$$ -4133 -2258 -12497 -35295 -56368 -63891 -57477 -52149 -56913 -74070 -88528 -52891 -16104 -4577
641d447a5B740A129d881j0802j0070m485Q832d663j69G31J905e589B439N874d63
$$ -4447 -15 2740 1129 -4881 -15683 -25753 -30238 -21406 -4663 -4832 731 2636 -5589 2439 8313 -463
624b8586k7972O014K2895i471d231m68j164n139o939j0814j7003k0767j4904R551
$$ -28586 -56558 -50544 -27649 -9471 -4231 -4699 -5863 -11002 -17941 -28755 -45758 -66525 -81429 -71878
610g1878J5512R130K649k031m014j407j18j19rn43j53M28j044k154l549o633o595
$$ -71878 -56366 -47236 -44587 -46618 -50632 -52039 -52157 -52276 -52285 -52828 -52981 -52553 -53597 -55751 -59300 -65933 -72528
593g2528J809J5070K1851a0666I645l263a863j651j769b22j11k130p133O18K198
$$ -72528 -70719 -55649 -33798 -10666 9645 6382 -1863 -3514 -5283 -222 -333 -2463 -9596 -8978 -6780
578f780m578j2181j6286j9857k4488L093L7445c459A7662E957b621G03d347l0940
$$ -6780 -11358 -23539 -39825 -59682 -84170 -81077 -43632 -3459 17662 5957 -2621 703 -4347 -35287
564c5287l5278N906b4768G385A095f219e69A0343l415B79g037K744J941e0j86
$$ -35287 -70565 -64659 -24768 7385 1095 -6219 -569 10343 6928 279 -7037 -4293 -2352 -50 -236
549b36o770A272c808A523J4411E697a153c96A595R26J769D04b413k605b34m44
$$ -236 -7006 1272 -3808 1523 15934 5697 -1153 -396 1595 2521 4290 404 -2413 -5018 -234 -678
533f78n643b086l686r11J139G152A194e611I315C608f840B746L668C68M595L093
$$ -678 -6321 -2086 -5772 -6683 -5544 7152 1194 -5611 9315 3608 -6840 2746 6414 368 4963 8056
517H056C162A359o79R232J948a551B474N002g05q647c818j5282G380N18B636Q359
$$ 8056 3162 1359 680 9912 11860 -1551 2474 7476 -705 -9352 -3818 -19100 7380 7898 2636 10995
501A0995B407J320a4510B791J516E61R213c4146f062a891Q89r525C2808R71K8444
$$ 10995 2407 3727 -14510 2791 4307 561 9774 -34146 -6062 -1891 -1002 -10527 32808 33779 62223
486F2223M5606N0316K67513J49486L65519K008466J4691513J48805942J29332202
$$ 62223 107829 158145 425658 575144 940663 2949129 17640642 166446584 295778786
477B95778786j29569633I468029D239479A817094G89020l25040j81251A07764
$$ 295778786 166209153 9468029 4239479 1817094 789020 463980 282729 107764
468F6010j7323A0596i31F069b3785c336D311b10A7214f416b637H669c298m6387
$$ 66010 48687 10596 -931 6069 -23785 -3336 4311 -210 17214 -6416 -2637 8669 -3298 -49685
454d9685a854k376j021b496j879l5829a4669A097N540k644b822D485O887m98g17
$$ -49685 -1854 -4230 -5251 -2496 -4375 -40204 -14669 1097 6637 3993 -2822 4485 11372 10874 -717
438a538k6815j2205J1355f963G822B902f397B884O53e93k74B554c167j820A929
$$ -1538 -28353 -40558 -29203 -6963 7822 2902 -6397 2884 3537 -593 -867 2554 -3167 -4987 1929
422B809f296H248C847K483R621L08E027c047P85k708F29J6666J1552j2654B889
$$ 2809 -6296 8248 3847 6330 15951 16259 5027 -3047 -2262 -4970 629 17295 28847 16193 2889
406a510B014L707J323C99b963A556O038j041A165a035A765O471M485a3491l5720
$$ -1510 2014 5721 7044 399 -2963 1556 7594 6553 1165 -1035 1765 8236 12721 -13491 -49211
391d9211j5461K5377b909J8m91J516q45D467b4271l9890j9976K5238b9289d388
$$ -49211 -64672 -39295 -2909 -2891 -3382 -1866 -2711 4467 -24271 -64161 -84137 -58899 -29289 -4388
376D665e85n668B08o4J2778n929e632J39K284B047L002a8275k5066j9397o173
$$ 4665 -585 -6253 208 144 12922 6993 -5632 -5493 -3209 2047 5049 -18275 -43341 -62738 -68911
361f8911J509N20J067M772P523P281M341J338o71l232n213m856k002K977M063
$$ -68911 -67402 -66882 -65815 -61043 -53520 -46239 -41898 -40560 -41231 -44463 -49676 -54532 -56534 -53557 -49494
346d9494j671r930j7571j866K4448K2748J6659f974a944j58k031m233j7979k5447
$$ -49494 -51165 -61095 -78666 -80532 -56084 -33336 -16677 -6974 -1944 -2102 -4133 -8366 -26345 -51792
332e1792j1340K9299E129K436KB041c784J103j087J421k8034j5655J829O897M374
$$ -51792 -63132 -33833 5129 7565 7567 2041 -3784 -2681 -3768 -2347 -30381 -46036 -44207 -37310 -32936
317c2936K994N175P136L860l121j1257j7317j7129p068M334L741k290l045R814
$$ -32936 -29942 -24767 -17631 -13771 -16892 -28149 -45466 -62595 -69663 -65329 -61588 -63878 -66923 -57109
303e7109K2722g684c795B402K543b026A684q03i449H74e790F726j181B562M747
$$ -57109 -34387 -7684 -3795 2402 4945 -2026 1684 881 -9449 874 -5790 6726 5545 2562 7309
288G309l79K930l988k702J61c048a336A434b4165j9079m641k44p048j4324n93
$$ 7309 6930 9860 5872 3170 3331 -3048 -1336 1434 -24165 -43244 -47885 -48129 -55177 -69501 -70094
273g0094K2459K2096a0397c399J189j752j257j149K771d10p395j4703j7992j5891
$$ -70094 -47635 -25539 -10397 -3399 -2210 -3962 -5219 -6368 -3597 -410 -7805 -22508 -40500 -56391
259e6391o091L372M487K743K411K146J378J320N178J0455J1382O096k851j3220
$$ -56391 -62482 -59110 -54623 -51880 -49469 -47323 -45945 -44625 -39447 -28992 -17610 -11514 -14365 -27585
245b7585k1674k5468j228K0778J2919L475o150j3996j5006J1399K2517a8885b279
$$ -27585 -49259 -74727 -75955 -55177 -42258 -38783 -44933 -58929 -73935 -62536 -40019 -18885 -2279
231I661k903j412B043a58m13j6679k3569k4078K488K4837a5631e112a393j1400
$$ 9661 6758 5346 2043 -158 -571 -17250 -40819 -64897 -62409 -37572 -15631 -5112 -1393 -12793
217a2793k0733k1917l448J4371J2102L556l457p264p320j408Q637J4740J1980
$$ -12793 -33526 -55443 -58891 -44520 -32418 -28862 -32319 -39583 -46903 -48311 -39674 -24934 -12954
204a2954M105o210j5495k0776k0484PJ7191J5742J1977P719M502N531a072p7j096
$$ -12954 -8849 -15059 -30554 -51330 -71814 -71807 -54616 -38874 -26897 -19178 -14676 -9145 -1072 -1149 -2245
189b245q48c66m96l729R6I23b226k342E17a2595k4056j8487q606M050J6015a7763
$$ -2245 -3093 -366 -862 -4591 -4495 923 -2226 -4568 517 -12595 -36651 -55138 -63744 -59694 -43679 -17763
172F68b195n082a96p0n763E489P18A888L204A448A26h049k8441k4505N471K4415
$$ 668 -2195 -7277 -196 -266 -6029 5489 6207 1888 5092 1448 126 -8049 -36490 -60995 -55524 -31109
156c1109c153H572J673m294A140h41G545l708a475A506K766Q68a139H55R387A438
$$ -31109 -3153 8572 10245 5951 1140 -841 7545 3837 -1475 1506 4272 5140 -1139 855 10242 1438
139a8439m0673m988L0025a5886N69j4517k2915j8630J503M953m070k5471K0912
$$ -18439 -59112 -64100 -34075 -15886 -15317 -29834 -52749 -71379 -69876 -64923 -68993 -94464 -73552
126g3552K1245K3444e201r66F032L021Ec560m03D65c186a282B528c405E875a693
$$ -73552 -52307 -28863 -5201 -6167 6032 9053 5 -3560 -3963 465 -3186 -1282 2528 -3405 5875 -1693
109c3907l3382J9135h519L192A746M337a3248m1350M885g869J944b0p883c890
$$ -33907 -67289 -48154 -8519 -5327 1746 6083 -13248 -54598 -49713 -7869 -5925 -20 -7903 -3890
94b495q48M11N25B819M651E00M10b621l4794p942a6332A098P122a425O22F311
$$ -2495 -3343 -2932 -2407 2819 7470 500 910 -2621 -37415 -45357 -16332 1098 8220 -1425 -803 6311
77B422O823R482e425I544j548h5p21L21n981q322j0811j3779j1068k04Q640P331
$$ 2422 9245 18727 -5425 9544 7996 -85 -806 -485 -6466 -14788 -25599 -39378 -50446 -50650 -42010 -34679
61c4679K94n291j027J6541a628I96M281A06d156R01j138n8311j0073a7110E25
$$ -34679 -34385 -39676 -40703 -24162 -1628 996 5277 106 -4156 -3255 -4393 -62704 -72777 -17110 525
45f220J070g90C3d422j453d81o921j7523r463n959r715j8373k1301J5318b1677
$$ -6220 -5150 -790 33 -4422 -5875 -481 -7402 -24925 -34388 -40347 -50062 -68435 -89736 -74418 -21677
29D879R535D514f164B67c374B320E8L200d083A5267a5713m6984l6774R512K2987
$$ 4879 14414 4514 -6164 267 -3374 2320 58 3258 -4083 15267 -15713 -62697 -99471 -89959 -66972
14f6972J0742L682R455J8091a0298J83j7146l0735l6787l2838k2454o357L686
$$ -66972 -56230 -52548 -43093 -25002 -10298 -10115 -27261 -57996 -94783 -127621 -150075 -156432 -152746
1a52746O349
$$ -152746 -146397
0a46397
$$ -146397
##PAGE= F1=1879.405076946
##FIRST=     3388.38724502563, 2822.10010593221, -60048
##DATA TABLE= (F2++(Y..Y)), PROFILE
1023f0048p900O799K2206a2691D359B060m30M225B617d665l1039j2048J8115a3581
$$ -60048 -67948 -61149 -38943 -12691 4359 2060 1630 5855 2617 -4665 -35704 -47752 -29637 -13581
1008f089J257l9K031A986A37K969J940A435d31m057a551M21k135n429b762k638
$$ -6089 -4832 -4871 -2840 1986 137 3106 5046 1435 -431 -4488 -1551 -1130 -3265 -8694 -2762 -5400
992e400k123k5062k9816L0166b112l361e33k01o951C051K931j331f165I35a510
$$ -5400 -7523 -32585 -62401 -32235 -2112 -5473 -533 -734 -7685 3051 5982 4651 -6165 935 -1510
976g010j8307j0103k583K842M892L493j343r933j9706M434b0836g618K899A119
$$ -7010 -25317 -35420 -38003 -35161 -30269 -26776 -28119 -38052 -57758 -53324 -20836 -7618 -4719 1119
961H061j589a9216k9239q458J3817N017m775r792q502K483N637Q861J4175a4586
$$ 8061 6472 -19216 -48455 -56913 -43096 -38079 -42854 -52646 -61148 -58665 -53028 -44167 -29992 -14586
946h504c798K30m448J056O20j200o667j9445m985a5887e697b638F219A348g411
$$ -8504 -3798 -3568 -8016 -6960 -6340 -7540 -14207 -33652 -38637 -15887 -5697 -2638 6219 1348 -7411
930f98G102J671N32m615p61a944j6823j6604J4438b494P05B877K949A202O325
$$ -698 7102 8773 9305 4690 3929 -1944 -18767 -35371 -20933 -2494 -1789 2877 5826 1202 7527
915G527O07B868c502M19J10I735O181D342f120q436d422B368J636J46a626F984
$$ 7527 8134 2868 -3502 -3083 -2973 9735 15916 4342 -6120 -14556 -4422 2368 4004 4150 -1626 6984
898A7108j953c854A1871p97g465c344p985m378M596a027d03n660j827C364P014
$$ 17108 15155 -3854 11871 11074 -7465 -3344 -11329 -15707 -11111 -1027 -403 -6063 -7890 3364 10378
883A0378A403J3d89j010g41A4833o99C662H16f830a375q41k6227r379a3830e487
$$ 10378 1403 1416 -489 -1499 -741 14833 14134 3662 816 -6830 -1375 -2216 -28443 -37822 -13830 -5487
866b635O79j308A29O83a0184a197B607J2700C507d741a800k2855k4188J2151a4378
$$ -2635 -1956 -3264 129 812 -10184 -1197 2607 15307 3507 -4741 -1800 -24655 -48843 -36692 -14378
850A658P58O77h554k1153k0521Q871J7282R572J079k948K375a005n510B346L745
$$ 1658 2416 3093 -8554 -29707 -50228 -41357 -24075 -14503 -13424 -16372 -13997 -1005 -6515 2346 6091
835F091d251A5176m59f013o525j9590j9144q090J1827M532l876j1240Q494J5129
$$ 6091 -4251 15176 14717 -6013 -12538 -32128 -51272 -59362 -47535 -43003 -46879 -58119 -49625 -34496
821c4496R274r05j1957j2273K1611a24E914b451l511M95J951f94k813P51A3541
$$ -34496 -25222 -26127 -38084 -50357 -28746 -124 5914 -2451 -5962 -5467 -3516 -694 -3507 -2756 13541
805H311e528I31N45L48n14k3L554a1849j2206L133e673J394B55e230B275E32h828
$$ 8311 -5528 931 1476 1824 1310 1287 4841 -11849 -24055 -20922 -5673 -4279 255 -5230 2275 532 -8828
787d420l89j250K619J220o59j1389r180p012m110J685R564i344a283B183f981
$$ -4420 -4809 -6059 -3440 -2220 -2879 -14268 -23448 -30460 -34570 -32885 -23321 -9344 -1283 2183 -6981
771b241j607A729L863P551o525B115K59b289j0105o341m161m663o797q788j0893
$$ -2241 -3848 1729 5592 13143 6618 2115 2374 -2289 -12394 -18735 -22896 -27559 -34356 -43144 -54037
756e4037r02J5295J6171i693a255H3f223j1862j2748p163M646J0169Q736K884
$$ -54037 -54939 -39644 -23473 -9693 -1255 83 -6223 -18085 -30833 -37996 -33350 -23181 -14445 -11561
742a1561n463j3088j7390O424K0390d635B720a06m921j3551j4137o523R244a3903
$$ -11561 -17024 -30112 -47502 -41078 -20688 -4635 2720 -106 -5027 -18578 -32715 -39238 -29994 -13903
727f700B747F64P639Q657A805d333k77l102j2331q93h574e06j475e61j2744j5829
$$ -6700 2747 664 8303 16960 1805 -4333 -4610 -7712 -20043 -20936 -8574 -506 -1981 -561 -13305 -29134
711b9134m618J2902f061K632n754b864n811j0582q638l894L69J802N05j565k156
$$ -29134 -33752 -20850 -6061 -3429 -9183 -2864 -8675 -19257 -27895 -31789 -31420 -29618 -29113 -30678 -32834
696c2834K835Q910R873K866M062k776n552m660k166p63l28j301l137n630p717
$$ -32834 -29999 -21089 -11216 -8350 -4288 -7064 -12616 -17276 -19442 -20205 -20533 -21834 -24971 -30601 -38318
681c8318o846J454N776J795m480m447J1617a3562e203k335K923M31J904A031J319
$$ -38318 -45164 -43710 -37934 -36139 -40619 -45066 -33449 -13562 -5203 -7538 -4615 -4184 -2280 1031 2350
666B350c415A124a235j140B446b441l768j28R82l631o03o968r224q730m687Q16
$$ 2350 -3415 1124 -1235 -2375 2446 -2441 -6209 -6337 -5355 -8986 -9589 -16557 -25781 -34511 -39198 -38382
650c8382J281k238p632r560J5755a9041e126M66q34a853C202n17f648o103k062
$$ -38382 -37101 -39339 -46971 -56531 -40776 -19041 -5126 -4660 -5494 -1853 3202 2685 -6648 -12751 -14813
635a4813K177f105a872l678b753B551f540B572M515a780m953n742N316J774J795
$$ -14813 -12636 -6105 -1872 -5550 -2753 2551 -6540 2572 7087 -1780 -6733 -12475 -7159 -5385 -3590
620c590m129a363o548q071p807q663r980l212Q687J0267O404K07n169q385q432
$$ -3590 -7719 -1363 -7911 -15982 -23789 -32452 -42432 -45644 -36957 -26690 -20286 -20079 -25248 -33633 -42065
605d2065k691J368J203K86K23J472K604K097J678P63j926l835k390N909J3927
$$ -42065 -44756 -43388 -42185 -41899 -41676 -40204 -37600 -35503 -33825 -33062 -34988 -38823 -41213 -35304 -21377
590b1377d811A0822m476b36r83m201b538e10p27k234F58a720j605j600j0616j1159
$$ -21377 -4811 10822 6346 -236 -1219 -5420 -2538 -510 -1237 -3471 658 -1720 -3325 -4925 -15541 -26700
574b6700j3611j0465J9408d984A4170C719d27r4p165j0861j6068O834e715A0086
$$ -26700 -40311 -50776 -31368 -4984 14170 3719 -427 -521 -7686 -18547 -34615 -27781 -5715 10086
559F152b694C236P154k321A229d428e19B419G11N77c297A613c801g63A1609B776
$$ 6152 -2694 3236 10390 8069 1229 -4428 -519 2419 711 1288 -3297 1613 -3801 -763 11609 2776
542a119o19B698J31J345F65d059j413K620N17j997J968n638J626j31H490l486
$$ -1119 -1738 2698 2829 4174 665 -4059 -5472 -2852 -2335 -4332 -2364 -8002 -6376 -6507 8490 5004
526E004g329F439B284c522D207L839C40g42F900k406E3g78A1006K331a654B365
$$ 5004 -7329 6439 2284 -3522 4207 8046 340 -742 6900 4494 53 -778 11006 13337 -1654 2365
509G666a524o247L775A0670K87o61C463Q392D265Q09d462B735J098A42N635M36
$$ 7666 -1524 -7771 -3996 10670 10957 10296 3463 11855 4265 5074 -4462 2735 3833 142 5777 6213
493F213e882a80l892I607J6902Q544K7577M3551L5063K29338J65013K79648J629847
$$ 6213 -5882 -180 -4072 9607 26509 35053 62630 106181 141244 370582 535595 815243 2445090
480B445090J2789002J15942642L5032419j3745494I200606D213036A772428G26667
$$ 2445090 15234092 131176734 166209153 152463659 9200606 4213036 1772428 726667
471D05174j36598A16915n7871j4061H678k310J685e1905e200A883c243A6375c721
$$ 405174 268576 116915 59044 44983 8678 6368 8053 -51905 -5200 1883 -3243 16375 -3721
457d702G811a8468m925f741K695k439a36j863k1158R237A365N235k543g305C800
$$ -4702 7811 -18468 -23393 -6741 -4046 -6485 -136 -1999 -23157 -13920 1365 6600 4057 -7305 3800
441A2609Q47B766e226m999j5439O716d315C615o01e225C727P04c224a170B091
$$ 12609 13456 2766 -5226 -10225 -25664 -18948 -4315 3615 3014 -5225 3727 4431 -3224 -1170 2091
425b971l907A255K390f898H375B863Q18J0190J460D285f607j550L023B004J6251
$$ -2971 -6878 1255 3645 -6898 8375 2863 3681 13871 15331 4285 -6607 -8157 -5134 2004 18255
410A8255J1546j3190A089f584P87C35O285k919b20A561J985Q80j326A209L367
$$ 18255 29801 16611 1089 -6584 -5797 335 6620 3701 -220 1561 3546 4426 3100 1209 4576
395D576M498Q73a1728k7121M34a6347b780j160R82i53I06N759a938k1732k4500
$$ 4576 9074 9947 -11728 -38849 -38415 -16347 -2780 -3940 -2958 -953 906 6665 -1938 -23670 -48170
380d8170J7660f691a666C309A199h092F12c189A055O040c545O79M97i78o185j1741
$$ -48170 -30510 -6691 -1666 3309 1199 -8092 612 -3189 1055 7095 -3545 -2866 -2369 -978 -7163 -18904
364a8904j3224j0459j848L355L376M290M974M637L308J936Q23m61k942n869p288
$$ -18904 -32128 -42587 -44435 -41080 -37704 -33414 -28440 -23803 -20495 -18559 -17736 -18197 -21139 -27008 -34296
349c4296m151M803Q073M644r49o958r669o01J0394J0306O508K576n8l287p594
$$ -34296 -38447 -33644 -25571 -20927 -21876 -28834 -38503 -39104 -28710 -18404 -11896 -9320 -9378 -12665 -20259
334b0259j2265j7063J3719a2917F029R40I04e861J456J727j209k329j8679r438
$$ -20259 -32524 -49587 -35868 -12917 6029 6969 904 -5861 -4405 -2678 -3887 -6216 -24895 -34333
320c4333N169O878L837J432N95J18k477n822q035m507N396Q420N207l15o602j1132
$$ -34333 -29164 -22286 -18449 -17017 -16422 -16304 -18781 -24603 -32638 -37145 -31749 -23329 -18122 -18437 -25039 -36171
304c6171m178J5911d465a836A480q4e475c23j176n424C481e796A247J644p56M413
$$ -36171 -40349 -24438 -4465 -1836 1480 1396 -5475 -323 -1499 -6923 3481 -5796 1247 2891 2135 6548
288F548K280J786l193k831A901c847p76b292A159b005k046k91n934j0342q600
$$ 6548 8828 10614 7421 4590 1901 -3847 -4623 -2292 1159 -2005 -4051 -4342 -10276 -20618 -29218
273b9218N371a0337a650F958p08e617J036b119k474b168k615j2926j0445PP121
$$ -29218 -23847 -10337 -1650 6958 6250 -5617 -4581 -2119 -4593 -2168 -4783 -17709 -28154 -28147 -21026
258b1026N731K648R85J025m1k664n667m761J396N645L488j816p679j1467j1455
$$ -21026 -15295 -12647 -11662 -10637 -10678 -13342 -19009 -23770 -22374 -16729 -13241 -15057 -22736 -34203 -45658
243d5658j09O869M005K158J276N77j164l552o163n331P089R683R449Q215e254
$$ -45658 -45767 -38898 -34893 -32735 -31459 -30882 -32046 -35598 -41761 -47092 -40003 -30320 -20871 -12656 -5254
227c673J235o36L63j1316j4506r361R456J2849P136j243q559j2277p006M934O535
$$ -3673 -2438 -3074 -2711 -14027 -28533 -37894 -28438 -15589 -8453 -9696 -18255 -30532 -37538 -32604 -26069
212b6069J652k720n256n350r5P525J0277P523K574l444q473j0706q991P96P746
$$ -26069 -24417 -27137 -32393 -37743 -37838 -30313 -20036 -12513 -9939 -13383 -21856 -32562 -41553 -40757 -33011
197c3011P561N235K204p46j246K529O105N643L84N65l00L07j026K529q91i13n40
$$ -33011 -25450 -20215 -18011 -18757 -20003 -17474 -11369 -5726 -5342 -4777 -5077 -4770 -5796 -3267 -4158 -913 -1453
180a453j5009j5006j0619l501L334J0142a5070i26l644k257A860b96p112D387
$$ -1453 -16462 -31468 -42087 -45588 -42254 -32112 -15070 -926 -4570 -6827 1860 -296 -7408 4387
165D322a408A051a632m65j0161k0565j7707O790P451J0069g807A0162l924a778
$$ 4322 -1408 1051 -1632 -2097 -12258 -32823 -50530 -43740 -36289 -26220 -7807 10162 6238 -1778
150C215P503E194b545e62C267J629a184A473J2076B043f423j4941P255I34Q220
$$ 3215 10718 5194 -2545 -562 3267 4896 -1184 1473 13549 2043 -6423 -21364 -14109 934 9154
135I154a596n133j7765j4097o38L118k006m3104K6086K2024J1900g771r66B802
$$ 9154 -1596 -6729 -24494 -38591 -39229 -36111 -38117 -81221 -55135 -33111 -21211 -7771 -8737 2802
120H026c089k908M08a9m083D397l76d514F927q57a2399k2151P139f169k281g0
$$ 8026 -3089 -5997 -5589 -19 -4102 4397 4021 -4514 6927 6070 -12399 -34550 -27411 -6169 -8450 -70
103F913m31a3883k7962a2187M127a11o305K381R25R94G655b232B776N279D32J218
$$ 6913 6482 -13883 -41845 -12187 -8060 -111 -6416 -4035 -3110 -2116 7655 -2232 2776 8055 432 1650
87A650k17d063k0824K060e329E698h9m185C743n72K852P880c973D700L41a62j1469
$$ 1650 1433 -4063 -24887 -22827 -5329 5698 -89 -4274 3743 3171 6023 13903 -3973 4700 5041 -162 -11631
70a1631j3282o549k222l269m410K488J1675J2818f444L40p018q968K244a072j345
$$ -11631 -24913 -31462 -33684 -36953 -41363 -38875 -27200 -14382 -6444 -6104 -13122 -22090 -19846 -1072 -2417
55b417C334j606d823K055p648l9239J9248D152j554d651b083B92A45e529j376
$$ -2417 3334 1728 -4823 -2768 -10416 -49655 -30407 4152 2598 -4651 -2083 292 145 -5529 -6905
40f905D08a3035j4642p886k277j754l127L664a7854e826C202J1773E732h167A123
$$ -6905 408 -13035 -27677 -35563 -37840 -39594 -42721 -39057 -17854 -5826 3202 14975 5732 -8167 1123
24c956C025A506l08c367I845a4714k9888r770K0311J6773P811c802j760i41l341
$$ -3956 3025 1506 1198 -3367 9845 -14714 -44602 -54372 -34061 -17288 -9477 -3802 -5562 -941 -4282
9d282A506N531a684k4725k1678j4776o635j744j64
$$ -4282 1506 7037 -1684 -26409 -48087 -62863 -69498 -71242 -71406
0g1406
$$ -71406
##PAGE= F1=1876.646425817
##FIRST=     3388.38724502563, 2822.10010593221, -4873
##DATA TABLE= (F2++(Y..Y)), PROFILE
1023d873J477a360A496K800j853a985D069K932C167H54d009l120J222K630k971
$$ -4873 -3396 -1360 1496 4296 2443 -1985 4069 7001 3167 854 -4009 -7129 -5907 -3277 -6248
1008f248k951J07K701K990a171C12N88a018j143l487m708l981J792M448L616p
$$ -6248 -9199 -9092 -6391 -3401 -1171 312 900 -1018 -2161 -5648 -10356 -14337 -12545 -8097 -4481 -4488
992d488J581k178k706j710R83K708b524j675k764A625l6b983n312j341d605a265
$$ -4488 -2907 -5085 -7791 -9501 -8518 -5810 -2524 -4199 -6963 1625 1589 -2983 -8295 -9636 -4605 -1265
975E099b954D47M176a650m095B463a306j830n289R70k688J980b483H37C63d224
$$ 5099 -2954 447 4623 -1650 -5745 2463 -1306 -3136 -8425 -7455 -10143 -8163 -2483 837 363 -4224
958a1380n639N869L406P71K88J364K060J411j000g63j129l563P49A679Q86O07
$$ -11380 -17019 -11150 -7744 -6973 -6685 -5321 -3261 -1850 -2850 -763 -1892 -5455 -4706 1679 2565 3172
942C172d338j026l218K800K024j2j226N80D757j244g936a525F456K706J401D181
$$ 3172 -4338 -5364 -8582 -5782 -3758 -3770 -4996 -4416 4757 3513 -7936 -1525 6456 9162 10563 4181
925A554c517r34a396c64j475j924C040J682g36F184J754A248a171A353c028H958
$$ 1554 -3517 -4451 -1396 -364 -1839 -3763 3040 4722 -736 6184 7938 1248 -1171 1353 -3028 8958
908A4084E672b906D964b834hA929q31f534B728L790P67c145A0762k437i381a157
$$ 14084 5672 -2906 4964 -2834 -8 1929 1098 -6534 2728 6518 7285 -3145 10762 8325 -9381 -1157
891d048A024a384j324q30m384K755r12R19a265G01a104C75a306I229j587C168
$$ -4048 1024 -1384 -2708 -3538 -7922 -5167 -6079 -5160 -1265 701 -1104 375 -1306 9229 7642 3168
874b80p606K509a462p127n028O670b92B388a636m775c099L67m207l293j882j04
$$ -280 -7886 -5377 -1462 -8589 -13617 -6947 -292 2388 -1636 -6411 -3099 -2732 -6939 -10232 -12114 -12218
858a2218L78l94j360k36N245a53C33J665B11P84Q611a99B129l70b822j768r82
$$ -12218 -11840 -12234 -13594 -13830 -8585 -153 333 1998 211 995 9606 -199 2129 1759 -2822 -4590 -5572
841e572k212k814J004J193I48M130H91N575k222g605c666l101j83K664J638j186
$$ -5572 -7784 -10598 -9594 -8401 948 5078 891 6466 4244 -7605 -3666 -6767 -6950 -4286 -2648 -3834
825c834l984n340L09K943K41j220M184B444N635J390j82c227j189o93J494c54
$$ -3834 -7818 -13158 -12849 -9906 -9665 -10885 -6701 2444 8079 9469 9287 -3227 -4416 -5109 -3615 -354
808c435a543j025n367j220J669K188K514J150A14J576i72n503m305M422b020M75
$$ -3435 -1543 -2568 -7935 -9155 -7486 -5298 -2784 -1634 114 1690 -972 -6475 -10780 -6358 -2020 -1545
792a545k397A22R35i631a985l950m022q52K234L642J255N20j114m682k217d635
$$ -1545 -3942 122 1057 -9631 -1985 -5935 -9957 -10809 -8575 -4933 -3678 -3158 -4272 -8954 -11171 -4635
775d371J414G27e909A993a412k198k987j728k248l780j312N032L841K019m43k453
$$ -4371 -2957 727 -5909 1993 -1412 -3610 -6597 -8325 -10573 -14353 -15665 -10633 -6792 -4773 -5216 -7669
759g669l644J3N459H68O142B208N77C49M000h97j60n002k440Q63K095k265a577
$$ -7669 -11313 -11300 -5841 868 7010 2208 2785 349 4349 -897 -1057 -6059 -8499 -7636 -5541 -7806 -1577
741f430K458j611c00A952o04a27k575m026k474K772a266l133i08p213F75C16Q637
$$ -6430 -3972 -5583 -300 1952 1348 -127 -2702 -6728 -9202 -6430 -1266 -4399 -908 -8121 675 316 8953
724H953J1594E138c101m44l796b337l967l106B057r20e23F794r16B478a614m022
$$ 8953 20547 5138 -3101 -3545 -7341 -2337 -6304 -9410 2057 1137 -523 6794 5878 2478 -1614 -5636
708e636g83q615L000n248l525N476c821IK398r42a663n162n490j910K603J898
$$ -5636 -783 -9398 -6398 -11646 -15171 -9695 -3821 9 2407 1465 -1663 -6825 -12315 -14225 -11622 -9724
692i724M76N1Q57J658J734J092Q02j69j039j643j761j006J476L069a582g74j497
$$ -9724 -9248 -9197 -8340 -6682 -4948 -3856 -3054 -3223 -4262 -5905 -7666 -8672 -7196 -4127 -1582 -774 -2271
675b271l760m164J23L708c078M6a36F89J050b084B87b629m512l81b224C563b359
$$ -2271 -6031 -10195 -10072 -6364 -3078 -3032 -136 689 1739 -2084 287 -2629 -7141 -7522 -2224 3563 -2359
657a0347M575K109A60d288m735l201K974M410a630p58g23j504j756j497J40m81
$$ -10347 -5772 -3663 160 -4288 -9023 -12224 -9250 -4840 -1630 -2388 -723 -2227 -3983 -5480 -5340 -5821
641e821n07n73J865F29K975b693m298J7G37J30b709B332f886A613L402b860c79
$$ -5821 -6328 -6901 -5036 629 3604 -2693 -6991 -6974 737 867 -2709 2332 -6886 1613 5015 -2860 -379
623B104b381o757J825k742K863c518J634D78b560O44B660f106Q88p07j35a405
$$ 2104 -2381 -9138 -7313 -10055 -7192 -3518 -1884 478 -2560 -1916 2660 -6106 -5218 -5925 -6060 -1405
606b781n907K030Q79j20j603k861l949M86M206L884J764i44M65l59p79n06k11
$$ -2781 -8688 -6658 -5779 -5899 -7502 -10363 -14312 -13826 -9620 -5736 -3972 -944 -479 -838 -1617 -2123 -2334
589b334K87n7O4L90l792P19a315j175k339J657J062l391K647f50j395k508l164
$$ -2334 -2047 -2104 -2040 -1650 -5442 -4723 -1315 -2490 -4829 -3172 -2110 -5501 -2854 -650 -2045 -4553 -7717
572g717k978k20L248L104J720k85l619Q59j818k641j973M065a921B837K930J397
$$ -7717 -10695 -10915 -7667 -4563 -2843 -3128 -6747 -5888 -7706 -10347 -12320 -8255 -1921 2837 5767 7164
556G164o34B127a246D269L329B961N8B47J838c465O18F288h65b19l556B473J119
$$ 7164 6530 2127 -1246 4269 7598 2961 3019 247 2085 -3465 -2847 6288 -865 -219 -3775 2473 3592
539C592K263B889d019J39j568J424j769l659l222j154K064L728b627k117B336
$$ 3592 5855 2889 -4019 -3880 -5448 -4024 -5793 -9452 -12674 -13828 -11764 -8036 -2627 -4744 2336
523A156G8N257L016B249f779D767J235h73k472A903L629f41B338M511b700l241
$$ 1156 78 5335 8351 2249 -6779 4767 6002 -873 -3345 1903 5532 -641 2338 6849 -2700 -5941
507e941k979K8a149C721r52O486k977N66b926A335K194C74J745E78d744A539g600
$$ -5941 -8920 -8892 -1149 3721 2769 9255 6278 6844 -2926 1335 3529 374 2119 578 -4744 1539 -7600
489F135a94o18q253H373P8036J2574D4442J21409J002755K615909L384248K299266
$$ 6135 -194 -812 -9065 8373 86409 98983 44442 165851 1168606 3784515 7168763 9468029
477I468029k67423k628277C010002I50575H7382L2099K4171E4831f637k233D769
$$ 9468029 9200606 6572329 3010002 950575 87382 119481 143652 54831 -6637 -8870 4769
465G462J576B97f492a144n116A2045g53n067f84j52E543g298b662l652n549f30
$$ 7462 9038 297 -6492 -1144 -6260 12045 -753 -5820 -684 -836 5543 -7298 -2662 -6314 -11863 -630
448c296D189A145J820b944m721C069R970K224E957h414B919J172D13c380j631
$$ -3296 4189 1145 2965 -2944 -7665 3069 13039 15263 5957 -8414 2919 4091 413 -3380 -5011
433e011J537j631C245P89d867g21A308c336m222H25A07e913M34n14J309J237J085
$$ -5011 -3474 -5105 3245 4034 -4867 -721 1308 -3336 -7558 825 107 -5913 -5479 -5993 -4684 -3447 -2362
416b362i57n774L124a785C088K832B319b529m832l722j634n74j255J857M483c037
$$ -2362 -957 -6731 -3607 -1785 3088 5920 2319 -2529 -7361 -11083 -12717 -13291 -14546 -12689 -8206 -3037
399a130C803K440k767L504J446m125A464d732m243j135n59L94K887c501e24B48
$$ -1130 3803 6243 3476 6980 8426 4301 1464 -4732 -8975 -10110 -10669 -10275 -7388 -3501 -524 248
382a953q913J113M191a258k997A905N71i472D557K313k377E67c318l785k776j540
$$ -1953 -10866 -9753 -5562 -1258 -4255 1905 2476 -9472 4557 6870 4493 567 -3318 -7103 -9879 -11419
366a1419n15k72l9J83N35N31M33k44j197j631J58K530K331Q77r49k482l715O57
$$ -11419 -11934 -12206 -12245 -12062 -11527 -10996 -10563 -10807 -12004 -13635 -13477 -10947 -8616 -7739 -8688 -11170 -14885 -14228
348a4228N102d452p86j223P48o41K786m134l073J083L285b799B85a891DN603j985
$$ -14228 -9126 -4452 -5238 -6461 -5713 -6354 -3568 -7702 -10775 -9692 -6407 -2799 285 -1891 4 5607 3622
331C622p03J756B138f266p82k596j348L162L534a546K35j427l225l575k340J122
$$ 3622 2919 4675 2138 -6266 -7048 -9644 -10992 -7830 -4296 -1546 -1311 -2738 -5963 -9538 -11878 -10756
315a0756L610c280C59c691k465K460C799m68A608L467k307f144m66L21a394G09
$$ -10756 -7146 -3280 359 -3691 -6156 -3696 3799 3331 1608 5075 2768 -6144 -6610 -6289 -1394 709
298b463p273b653l77p37D490b923j745g47A692R82P03M45O43L18i08m119j791
$$ -2463 -9736 -2653 -3030 -3767 4490 -2923 -4668 -747 1692 2674 3377 3822 4465 4783 -908 -5027 -6818
281f818J733a992k102J043Q18E310n71g346L086A654c192l406o26O17K73j369
$$ -6818 -5085 -1992 -4094 -3051 -2233 5310 4739 -7346 -4260 1654 -3192 -6598 -7224 -6607 -6334 -7703
265g703k518j885K742c419B835L737h604b384Q7m916g92E83b647k360j672J308
$$ -7703 -10221 -12106 -9364 -3419 2835 6572 -8604 -2384 -2297 -7213 -792 583 -2647 -5007 -6679 -5371
249e371K435J205l007J793m58J57p73k038k439j33K204K018N14k83k25M29L53
$$ -5371 -2936 -1731 -4738 -2945 -3403 -3246 -4019 -6057 -8496 -8629 -6425 -4407 -3893 -4176 -4401 -3972 -3619
232c619M48M78n7l23l332K628J648N24D217P7G51d052l333b624J085l3k391k555
$$ -3619 -3171 -2693 -2750 -3073 -6405 -3777 -2129 -1605 4217 4294 751 -4052 -7385 -2624 -1539 -1572 -3963 -6518
214f518j520N11L99j89l99k03L52J080J337M08k18D036j009b305k79l952J110
$$ -6518 -8038 -7527 -7128 -7317 -7716 -7919 -7567 -6487 -5150 -4742 -4960 4036 3027 -2305 -2584 -6536 -5426
197e426O60N14j339J985O99j290J262k915p91b521Q12l258j069j012K597O71j586
$$ -5426 -4766 -4252 -5591 -3606 -2907 -4197 -2935 -5850 -6641 -2521 -1709 -4967 -6036 -7048 -4451 -3780 -5366
180e366j194o47O0n71j827l155j220L152L890L063A55a409m148D212k008c797
$$ -5366 -6560 -7207 -7147 -7718 -9545 -12700 -13920 -10768 -6878 -3815 155 -1409 -5557 4212 2204 -3797
163b448k294R16J285j725p055m78M338L237J982e33A52h83r9I74N301c046N28
$$ -2448 -4742 -3826 -2541 -4266 -11321 -11799 -7461 -4224 -2242 -533 152 -883 -982 974 6275 -3046 -2518
146b518A901J995b373B749J2980B338J544P77j244J0650k341b80F41b572q963
$$ -2518 1901 3896 -2373 2749 15729 2338 3882 4659 3415 14065 11724 -280 641 -2572 -11535
131a1535q91c390k5561m2080K3475i695C863L958e660a381C149f411K065k441
$$ -11535 -12426 -3390 -28951 -71031 -47556 -9695 3863 7821 -5660 -1381 3149 -6411 -4346 -6787
117f787a064l952D380J347c898B034c171m720N13c308j213m786a410G443K79C842
$$ -6787 -1064 -5016 4380 5727 -3898 2034 -3171 -7891 -7378 -3308 -4521 -9307 -1410 7443 7722 3842
100a738N58l859A468d691R25N53f32A0070c5A684O588A871J792j09a840m955b887
$$ -1738 -1180 -5039 1468 -4691 -3766 -3213 -632 10070 -35 1684 8272 1871 3663 3554 -1840 -6795 -2887
82C743A288b47k578Q84q01j142j155j410m85K11Q47P83K92o54k881k199l884K24
$$ 3743 1288 -247 -2825 -1941 -2742 -3884 -5039 -6449 -6934 -6723 -5876 -5093 -4801 -5455 -8336 -10535 -14419 -14195
64a4195N004L952J156a790j205j664r28M66M20j87j978l178k341K789M185k062
$$ -14195 -9191 -5239 -4083 -1790 -2995 -4659 -5587 -5121 -4701 -4888 -6866 -10044 -12385 -9596 -5411 -7473
48g473G56Q2c125m51o15J902j412o04A539M966k864a158k671E329A585f290J741
$$ -7473 756 838 -3125 -3576 -4191 -2289 -3701 -4305 1539 6505 3641 -1158 -3829 5329 1585 -6290 -4549
31d549l135A153J3942G319g249A305d006B325a230m985m476J029a251N22q027
$$ -4549 -7684 1153 15095 7319 -7249 1305 -4006 2325 -1230 -6215 -10691 -9662 -1251 -729 -8756
16h756O02b794E602j017c246F45c306g33D294E24f770a411l99l08l063j538
$$ -8756 -8154 -2794 5602 4585 -3246 645 -3306 -733 4294 524 -6770 -1411 -1810 -2118 -5181 -6719
0f719
$$ -6719
##PAGE= F1=1873.887774687
##FIRST=     3388.38724502563, 2822.10010593221, -6883
##DATA TABLE= (F2++(Y..Y)), PROFILE
1023f883g45m831m476J92L614J998J985n63k016k211k426l062P03N126a866k82
$$ -6883 -745 -5576 -10052 -9860 -6246 -4248 -2263 -2826 -4842 -7053 -9479 -12541 -11838 -6712 -1866 -2148
1007b148k602a966k243C787n02D78c796J361n73J019m191m164k349O280K013B534
$$ -2148 -4750 -1966 -4209 3787 3285 478 -3796 -2435 -3008 -1989 -6180 -10344 -12693 -6413 -4400 2534
990C824b788o7j656a122A601e299l22J889k130J388a813G4f36k812C576e033C602
$$ 3824 -2788 -2855 -4511 -1122 1601 -5299 -5621 -3732 -5862 -4474 -1813 74 -636 -3448 3576 -5033 3602
972H393B654i179A639c931K24l873b972h8l895J032l660j690O75J745K063J429
$$ 8393 2654 -9179 1639 -3931 -3707 -7580 -2972 -88 -3983 -2951 -6611 -8301 -7626 -5881 -3818 -2389
956b389i16j311k368D033J593Q40a439E01B7b826l278A612a096j626K38r2m274
$$ -2389 -916 -2227 -4595 4033 5626 6466 -1439 501 27 -2826 -6104 1612 -1096 -2722 -2484 -2576 -6850
939f850c354J03k662n85O65q6n75J55b842E787L163K302E498F65e384I8J342b95
$$ -6850 -3354 -3251 -5913 -6498 -5833 -5919 -6494 -6339 -2842 5787 8950 11252 5498 665 -5384 98 1440 -295
920c327o87A933b024l373J735B01K6K211N05c446a402j814o95R9P76M95o74a090
$$ -3327 -4014 1933 -2024 -5397 -3662 201 227 2438 2943 -3446 -1402 -3216 -3911 -3812 -3036 -2541 -3215 -1090
901a161p239a486j243j284j155l88O87j210b418k855K340j373j321l17J288a465
$$ -1161 -8400 -1486 -2729 -4013 -5168 -5556 -4869 -6079 -2418 -5273 -2933 -4306 -5627 -5944 -4656 -1465
884A486K712b567J267j044B854a603D247N55A792a701o116m89b359n752H8J999
$$ 1486 4198 -2567 -1300 -2344 2854 -1603 4247 4802 1792 -1701 -7817 -8306 -2359 -8111 88 2087
868B087J375M72b627p950L821c195m952O21b548I84L13d563l268M54B32K92E7
$$ 2087 3462 3934 -2627 -10577 -6756 -3195 -8147 -7526 -2548 984 1297 -4563 -7831 -7377 232 524 57
850a220q92e32E088d265J196k281k13J407J867m267a256c40m816a626J04K37n5
$$ -1220 -2112 -532 5088 -4265 -3069 -5350 -5563 -4156 -2289 -6556 -1256 -340 -5156 -1626 -1522 -1285 -1340
833a340n50m263J502j423j646q02O14K25P39l69g30Q6C31K050K412o97K185j562
$$ -1340 -1890 -6153 -4651 -6074 -7720 -8522 -7908 -7683 -6944 -7313 -730 -644 331 2381 4793 4096 6281 4719
815D719A538c524o33j014J211j620k200K754A21N011b474b1l07j839l993b587
$$ 4719 1538 -3524 -4157 -5171 -3960 -5580 -7780 -5026 121 5132 -2474 -21 -328 -2167 -6160 -2587
798d951l37P73J154n61j708j259K530K066A460h879h82B160e190j227a349C931
$$ -4951 -5288 -4515 -3361 -3922 -5630 -6889 -4359 -2293 1460 -8879 -882 2160 -5190 -6417 -1349 3931
781A783h33j443l359m791L810M71J522M20l278k383K739J338M78j16m42r99j377
$$ 1783 -833 -2276 -5635 -10426 -6616 -6145 -4623 -4203 -7481 -9864 -7125 -5787 -5309 -5425 -5867 -6866 -8243
764h243p99J443J956O23j169l243L223a550D487J82A800Q17a504D563A281b292
$$ -8243 -9042 -7599 -5643 -5020 -6189 -9432 -6209 -1550 4487 4669 1800 2617 -1504 4563 1281 -2292
747E632k580c866A524f618G25e952J390k176c042B171L91J052j247B82a484m83
$$ 5632 3052 -3866 1524 -6618 725 -5952 -4562 -6738 -3042 2171 2562 3614 2367 282 -1484 -1967
731a967l030k971l362J059L008K093J142N26R36Q6r75l104b381n996P71D137j292
$$ -1967 -4997 -7968 -11330 -10271 -7263 -5170 -4028 -3502 -2566 -2480 -3455 -6559 -2381 -8377 -7606 4137 2845
714B845a304A04a488k4k614J241A075i921D635j426d851K096g52r75k481j220
$$ 2845 -1304 104 -1488 -1512 -4126 -2885 1075 -9921 4635 3209 -4851 -2755 -752 -1727 -4208 -5428
698e428J582a718f27p89m525q64k462r59L30M53P06P89J096O76O00R61J396a239
$$ -5428 -3846 -1718 -627 -1416 -5941 -6805 -9267 -10226 -9896 -9443 -8737 -7948 -6852 -6176 -5576 -4615 -3219 -1239
679A080c464E866J191K71o03c478R04j128J413j487J083O39N99P4o1j635k928
$$ 1080 -3464 5866 7057 7328 6725 -3478 -2574 -3702 -2289 -3776 -2693 -2054 -1455 -1381 -1442 -3077 -6005
662f005F16P912L867c484l325a721L17B135a285p082j023c983D67a523j637Q99
$$ -6005 616 8528 12395 -3484 -6809 -1721 -1404 2135 -1285 -8367 -9390 -3983 467 -1523 -3160 -2261
646b261r12j024q4J665j648Q51A026J373J617L177F2c491k263A612J133d509p737
$$ -2261 -3173 -4197 -4281 -2616 -4264 -3413 1026 2399 4016 7193 62 -3491 -5754 1612 2745 -4509 -12246
629a2246M676i15A849d001a757e3o698k529c987p66C208b943k91f97k529a395
$$ -12246 -7570 -915 1849 -4001 -1757 -53 -6751 -9280 -3987 -4753 3208 -2943 -3234 -697 -3226 -1395
612f55o404J553q44q83K343j215l197J535m93R44J932L81J280j444l062l999J325
$$ -655 -7059 -5506 -6350 -7233 -4890 -6105 -9302 -7767 -8260 -7316 -5384 -5003 -3723 -5167 -8229 -12228 -10903
595a0903M232b953a30A555Q73J55P8o47H88e77n445j110K937n81j993K093l22
$$ -10903 -6671 -2953 -130 1555 2428 2583 2661 2014 888 -577 -6022 -7132 -4195 -4776 -6769 -4676 -4998
578d998j889l082M15M275a498I95R17G84a571k533j729j294r07p2K616h55C567
$$ -4998 -6887 -9969 -9554 -5279 -1498 995 1912 784 -1571 -4104 -5833 -7127 -8034 -8106 -5490 -855 3567
560F502O70j732B229A95Q17R58F37M676k092B99g07A130K69d190q42C51e355A492
$$ 6502 7172 5440 2229 195 1012 1970 637 5313 3221 299 -707 1130 1399 -4190 -5032 351 -5355 1492
541c862A2R87D8a140j922j309l472q12k145J018J251L725k48a968M98k54j388
$$ -3862 12 999 48 -1140 -3062 -4371 -7843 -8655 -10800 -9782 -8531 -4806 -5054 -1968 -1470 -1724 -3112
524c112b01B465A102a692j920l041A256N707e31n440D317M616G49J506K236d508
$$ -3112 -201 2465 1102 -1692 -3612 -6653 1256 6963 -531 -5971 4317 8933 749 2255 4491 -4508
507d818P49J664B81J241D8L286K09J188a812k24C618A18b764n123m017M541j756
$$ -4818 -4069 -2405 281 1522 48 3334 3543 4731 -1812 -2036 3618 118 -2764 -7887 -11904 -7363 -9119
490i119b099I204K261A477O625L754B825O1203L4080K02443J161509J603364J174055
$$ -9119 -2099 9204 11465 1477 8102 11856 2825 64028 98108 300551 1462060 3065424 4239479
477D239479k6443j203034A422566B99158H4990k3426G795a0397I841a991j744
$$ 4239479 4213036 3010002 1422566 299158 84990 61564 7795 -10397 9841 -1991 -3735
466c735a114H151f35p113K903l815K280l771k843K554J343l96O10J198p78m82
$$ -3735 -1114 8151 -635 -7748 -4845 -8660 -6380 -10151 -12994 -10440 -9097 -9493 -8883 -7685 -8463 -8945
450h945K955J214C143c03A227C58d427A754J0153o89l854e148i01E076o19j634
$$ -8945 -5990 -4776 3143 -303 1227 358 -4427 1754 11907 11218 7364 -5148 -901 5076 4457 2823
434B823d124j794k473L839a349k983a410j887n68l531a96E135d529F093j217a574
$$ 2823 -4124 -5918 -8391 -4552 -1349 -4332 -1410 -3297 -3865 -7396 -196 5135 -4529 6093 4876 -1574
417F172l30a61k706A314n04P08J283N61o86b8k563k399Q61i09B209J600C13e909
$$ 6172 5842 -161 -2867 1314 810 1518 2801 3362 2676 -28 -2591 -4990 -4129 -909 2209 3809 313 -5909
398A018a356k220j448o69o32j228j288K11K337K255J509M39m33j93Q31n08q455
$$ 1018 -1356 -3576 -5024 -5693 -6325 -7553 -8841 -8630 -6293 -4038 -2529 -2090 -2523 -2716 -1885 -2393 -10848
381a0848d854C05b934l647c80B250a0425D599L114j42j449A651B52c178k275M45
$$ -10848 -4854 305 -2934 -6581 -380 2250 -10425 4599 7713 7571 6122 1651 252 -3178 -5453 -5008
365e008J095r34o5A68f22b51m277l330g63j284k238r71k362a529B826a030n897
$$ -5008 -3913 -4847 -4912 168 -622 -251 -4528 -7858 -763 -2047 -4285 -5256 -7618 -1529 2826 -1030 -6927
348f927O86K463L59j122q46r53j75n25j719J37d071c29F062E21d733E381B422
$$ -6927 -6241 -3778 -3419 -4541 -5387 -6340 -6515 -7040 -8759 -8622 -4071 -329 6062 521 -4733 5381 2422
330B266N465I78a0102J147c751a757k298j213B376k65b197k896m205j534K991
$$ 2266 7731 978 -10102 -8955 -3751 -1757 -4055 -5268 2376 2111 -2197 -5093 -9298 -10832 -7841
315g841K059N97n24p04l000b222B460J263A24L226L6e952B537A258c245B30d801
$$ -7841 -5782 -5185 -5709 -6413 -9413 -2222 2460 3723 124 3350 3386 -5952 2537 1258 -3245 230 -4801
297e804O38J778O20A910d52q206L265A800M878K403k552j016p02d708r89q61R95
$$ -5804 -5166 -3388 -2768 1910 -452 -8658 -5393 1800 6678 9081 6529 5513 4811 -4708 -5697 -6558 -5563
280e563p42j289j368J276K719b428m335b937A066D90h82j532j941j307J04J283
$$ -5563 -6305 -7594 -8962 -7686 -4967 -2428 -6763 -2937 1066 490 -882 -2414 -4355 -5662 -5558 -4275
264d275k345k775a555J18k49m507K489k025k102o45N87Q28K31j66K6J024J859
$$ -4275 -6620 -9395 -1555 -1437 -1686 -6193 -3704 -5729 -7831 -8476 -7889 -7061 -6830 -6996 -6970 -5946 -4087
247d087j194B135K486J916L252k06m505H52d331j685I47K578O432J222j138k305
$$ -4087 -5281 2135 4621 6537 9789 9583 5078 852 -4331 -6016 947 3525 9957 11179 10041 7736
231G736B157a495m476J99R74J846j084A07J192J36f312j452b310j766A35M16b5
$$ 7736 2157 -1495 -5971 -5772 -4798 -2952 -4036 107 1299 1435 -6312 -7764 -2310 -4076 135 551 -25
213b122n699L075j272c12B815b739R4l315N7K943F565j214e592a12n376b563J216
$$ -2122 -7821 -4746 -6018 -312 2815 -2739 -2645 -5960 -5903 -2960 6565 5351 -5592 -112 -5488 -2563 -1347
196a347k112j660O31M51k115J779l344l0c390O10k794l10k397J17J067Q11O78
$$ -1347 -3459 -5119 -4488 -4037 -6152 -4373 -7717 -7747 -3390 -2780 -5574 -5884 -8281 -8164 -7097 -6286 -5608
179e608l19l43J169J876O01B813b739o93K81l381L165a397F146B6d707j50k518
$$ -5608 -5927 -6270 -5101 -3225 -2624 2813 -2739 -3432 -3151 -6532 -3367 -1397 6146 26 -4707 -4857 -7375
162g375K275d07E691g57j227m219J515a607E60K62d8j633j537L71Kp82i76q06
$$ -7375 -5100 -407 5691 -757 -1984 -6203 -4688 -1607 560 822 -48 -1681 -3218 -2847 -2845 -3627 -976 -1782
144a782k779K123N27L73j06m56j58L2L59k88j092k786l874M170A739c0237m1925
$$ -1782 -4561 -2438 -1911 -1538 -1644 -2100 -2258 -2226 -1867 -2155 -3247 -6033 -9907 -5737 1739 -30237 -72162
127g2162K2831h346E361M884a712k801B949f627f3n413K706l499D131K564a912
$$ -72162 -49331 -8346 5361 10245 -1712 -4513 2949 -6627 -63 -5476 -2770 -6269 4131 6695 -1912
111h096K128g29C169a878r31m516a614F30a582j277LP97M36I77c090J02O36H06
$$ -8096 -5968 -729 3169 -1878 -2809 -7325 -1614 630 -1582 -2859 -2856 -2059 -1623 977 -3090 -2988 -2352 806
92A1512B770i5F837A143d594k276L213k94B199M097j421A665j82J793J231b58
$$ 11512 2770 -95 6837 1143 -4594 -6870 -3657 -3951 2199 6296 4875 1665 1483 3276 4507 -258
75d214n54P27j065l111l902L037L391k790K072m282j635e064j409K845F628B723
$$ -4214 -4768 -4041 -5106 -8217 -12119 -9082 -5691 -8481 -6409 -10691 -12326 -5064 -6473 -3628 6628 2723
58e351a404n215m938k484J294l97N55M326c783l020A597G70b026N50A121J511
$$ -5351 -1404 -6619 -11557 -14041 -12747 -13144 -12589 -8263 -3783 -6803 1597 770 -2026 -1476 1121 2632
42B632a054J90m172p737O328a515k021A712b881k934m74l127A68R553B000f844
$$ 2632 -1054 -864 -5036 -12773 -6445 -1515 -3536 1712 -2881 -5815 -6289 -9416 168 9721 2000 -6844
25a6013J658N451M021J38a905C995j585e437k972p91b053G059K06a830A552b974
$$ -16013 -14355 -8904 -4883 -4745 -1905 3995 2410 -5437 -8409 -9200 -2053 7059 7265 -1830 1552 -2974
8c527A505i3o121j9l713L87K823j86
$$ -3527 1505 -93 -6214 -6233 -9946 -9559 -6736 -6922
0f922
$$ -6922
##PAGE= F1=1871.129123557
##FIRST=     3388.38724502563, 2822.10010593221, -6360
##DATA TABLE= (F2++(Y..Y)), PROFILE
1023f360B253r89e15k042q91N65O13Nj239j434q57J151a222B846q24d419k067
$$ -6360 2253 1264 -515 -2557 -3448 -2883 -2270 -2265 -3504 -4938 -5795 -4644 -1222 2846 2022 -4419 -6486
1006f486J711j957C817j786a415k090j38J130k22l523C34f63o84l528B85J094
$$ -6486 -4775 -6732 3817 2031 -1415 -3505 -3643 -2513 -2735 -6258 334 -663 -1347 -4875 285 1379
990A379c17j341j338Q75j149r28r29q43n78K12J756b194F0c778A863g668a252
$$ 1379 -317 -1658 -2996 -2121 -3270 -4198 -5127 -5970 -6548 -6336 -4580 -2194 60 -3778 1863 -7668 -1252
972d299k529Q83K962m460M48l99I42R73D11M77J917K40l20n93m52E66f83k712
$$ -4299 -6828 -5945 -2983 -7443 -6995 -7394 942 1915 411 888 2805 3045 2725 2132 1680 566 -683 -3395
954c395J69J33a208A478g17R5M2j105o183I47b784r20a230D43d082a944M58k014
$$ -3395 -3226 -3093 -1208 1478 -717 -622 -580 -1685 -7868 947 -2784 -3704 -1230 443 -4082 -1944 -1486 -3500
936c500j680j563k581K524J563J385E440K412K984l419A351g366C75I6h73l775
$$ -3500 -5180 -6743 -9324 -6800 -5237 -3852 5440 7852 10836 7417 1351 -7366 375 96 -873 -4648
920d648a998C42b680j661A824L318A6M818B120c990k699j788K534J915J281O04
$$ -4648 -1998 342 -2680 -4341 1824 5142 16 4834 2120 -3990 -6689 -8477 -5943 -4028 -2747 -2143
904b143l867b729j295k960K406k560q07L044j957J935b070A140b560j557A367
$$ -2143 -6010 -2729 -4024 -6984 -4578 -7138 -7945 -4901 -6858 -4923 -2070 1140 -2560 -4117 1367
888f04p452L487j273l57O49J043P6J51F1a500D418K045e38k915l199J015H49e801
$$ -604 -8056 -4569 -5842 -6199 -5550 -4507 -4431 -4280 61 -1500 4418 6463 -538 -3453 -6652 -5637 849 -5801
869b217j91O70f09l962k161k058a546l697K553k262k888J582K334j126a891B902
$$ -2217 -2408 -1738 -609 -4571 -6732 -8790 -1546 -5243 -2690 -4952 -7840 -6258 -3924 -5050 -1891 2902
852a048b08l151r12a923k785l431J126R23J1o56n05m30j058j32K526K952a020
$$ -1048 -208 -3359 -4271 -1923 -4708 -8139 -7013 -6090 -6079 -6735 -7240 -7670 -8728 -8860 -6334 -3382 -1020
834a13j36G22c451G155A866J290A232c260n355K016o27h86C735J350K974N85D269
$$ -113 -249 722 -3451 7155 1866 3156 1232 -3260 -8615 -6599 -7226 -886 3735 5085 8059 8644 4269
816E130c70p016K926g05n613a179M3m788b042F71L030a058J02j451l219k074K180
$$ 5130 -370 -7386 -4460 -705 -6318 -1179 -1136 -5924 -2042 671 3701 -1058 -956 -2407 -5626 -7700 -5520
799e520L81J308a778A187J827j021e009a543k214A189f589h60D210a12j829j183
$$ -5520 -5139 -3831 -1778 1187 3014 1993 -5009 -1543 -3757 1189 -6589 -860 4210 -112 -1941 -3124
783c124D255K090I81a006H3d568l398Q65Q81Q64c84G93Q15P03J168J441J195k576
$$ -3124 4255 6345 981 -1006 83 -4568 -7966 -7101 -6220 -5356 -384 793 1608 2311 3479 4920 6115 3539
765C539b901C145A045f803a208n168b236j03R35A350J73o10P19c769D613j942
$$ 3539 -2901 3145 1045 -6803 -1208 -6376 -2236 -2339 -1404 1350 1523 913 1632 -3769 4613 2671
749B671c587e61b54q89B112c775I44c968p13l119J898R05p04R1K61o92q01J17
$$ 2671 -3587 -561 -254 -1143 2112 -3775 944 -3968 -4681 -7800 -5902 -4997 -5701 -5610 -5349 -6041 -6842 -6725
731f725O29J182O61J30l71q34q31n41p4L21M44L3J481l483L170B77J568b683D061
$$ -6725 -6096 -4914 -4253 -4123 -4494 -5328 -6159 -6700 -6774 -6453 -6009 -5976 -4495 -7978 -4808 277 1845 -2683 4061
711b66m184j413e5B263a0886C973j807g963b255D07b75m550k97a06D991K77B071
$$ -266 -4450 -5863 -55 2263 -10886 3973 2166 -7963 -2255 407 -275 -4825 -5122 -106 4991 5268 2071
693f742K515j750j680J017J268N07l10k02l06J79J003j093B87K219d099C998j349
$$ -6742 -4227 -5977 -7657 -6640 -5372 -4865 -5175 -5377 -5683 -5504 -4501 -5594 287 2506 -4099 3998 2649
676B649B59b892l116k984j207K423K162b558e01G07j40a763k491l610I7am86k385
$$ 2649 259 -2892 -6008 -8992 -10199 -7776 -5614 -2558 -501 707 567 -1763 -4254 -7864 97 -1 -487 -2872
658b872J85j627j953k156j112J930K193K359a203k296o11n87J433J074N52B08
$$ -2872 -2687 -4314 -6267 -8423 -9535 -7605 -5412 -3053 -1203 -3499 -4110 -4697 -3264 -2190 -1638 208
641a658g41A249l55K590m16j162g16k773P08l800K078g54p345L897a558l104J308
$$ -1658 -741 1249 894 3484 3068 1906 -716 -3489 -2781 -6581 -4503 -754 -8099 -4202 -1558 -4662 -3354
624c354J254o247R17K676h05F82c306l378k427j224r5O90o1K51K168J664l678
$$ -3354 -2100 -8347 -7430 -4754 -805 682 -3306 -6684 -9111 -10335 -10430 -9740 -9801 -9550 -7382 -5718 -9396
607i396a582o481b678K79a084j863j15P83O91k1n36j740n00j598j622n74K333
$$ -9396 -1582 -8063 -2678 -2399 -1084 -2947 -3062 -2279 -1588 -1609 -2145 -3885 -4385 -5983 -7605 -8179 -5846
590e846b001B442L550F81b338m246k274a450A637f979f68l636q42g78j965K40
$$ -5846 -2001 2442 5992 681 -2338 -6584 -8858 -1450 1637 -6979 -668 -4304 -5146 -778 -2743 -2503
574b503c60B243K051M12k246A015a610n665b090m230b47G406j723k589e38l059
$$ -2503 -360 2243 4294 4706 2460 1015 -1610 -7275 -2090 -6320 -247 7406 5683 3094 -538 -3597
558c597j659n91q98q38J075K307J895M44q07j418K18j344j466J665k749a43j58
$$ -3597 -5256 -5847 -6745 -7583 -6508 -4201 -2306 -1862 -2669 -4087 -3869 -5213 -6679 -5014 -7763 -143 -301
541c01l638D856K018M54b358o60n538J957K332l847M38L500a190D592L139A008
$$ -301 -3939 4856 6874 7328 -2358 -3018 -8556 -6599 -4267 -8114 -7676 -4176 -1190 4592 7731 1008
524h551a384E613n82H3c690J715n24G742A649d273g9l963J455A089O82e401J324
$$ -8551 -1384 5613 5031 83 -3690 -1975 -2499 7742 1649 -4273 -79 -4042 -2587 1089 1771 -5401 -4077
507d077P68P22m71l00l61r43m00k38j051j052j965J938K188B92d110A816g120
$$ -4077 -3309 -2587 -3058 -3358 -3719 -4662 -5062 -5300 -6351 -7403 -9368 -7430 -5242 292 -4110 1816 -7120
489E029B349N794K219m490b182J1C6243j6686G472J82702J139789M87131m4666
$$ 5029 2349 8143 10362 5872 -2182 -2171 36243 19557 7472 190174 1329963 1817094 1772428
476A772428q21853B99158A09133C0301D889L08j100c481A244f218a049m179a268
$$ 1772428 950575 299158 109133 30301 4889 5197 4097 -3481 1244 -6218 -1049 -5228 -1268
462h600J058o83G026l142f199c64j013N37b60k502m491h68j116m693f83j350k034
$$ -8600 -7542 -8225 7026 3884 -6199 -364 -1377 -840 -260 -2762 -7253 -868 -1984 -6677 -683 -2033 -4067
445d067O8J322P47q26O37g05k059k557A316n95b9k009j203p231K872o47K72l21
$$ -4067 -3999 -2677 -1930 -2756 -2119 -705 -2764 -5321 1316 721 -29 -2038 -3241 -10472 -7600 -8247 -7975 -8296
427h296K37K613j245a544B503b993i19l152l94c00C051d065G27L187j954A97h34
$$ -8296 -8059 -5446 -6691 -1544 2503 -2993 -919 -4071 -4465 -300 3051 -4065 727 3914 1960 197 -834
409a875j532k394l197j506L307K748J321l55j059l613K212J338J456R78J19n055
$$ -1875 -3407 -5801 -8998 -10504 -7197 -4449 -3128 -3483 -4542 -8155 -5943 -4605 -3149 -2171 -2052 -7107
393g107J991j296K011b40C629D72d16D703L213J12c530q058N412f94k455l347
$$ -7107 -5116 -6412 -4401 -240 3629 472 -416 4703 7916 8028 -3530 -11588 -6176 -694 -3149 -6496
377f496K327P76p836G98K404J566n1A284h81m311j321L164a605m087J475B799
$$ -6496 -4169 -3393 -11229 798 3202 4768 4717 1284 -881 -5192 -6513 -3349 -1605 -5692 -4217 2799
360C425j57e183k915a913k561n66k1j18B592j110g306J69K488J470a117j545j507
$$ 3425 3268 -5183 -8098 -1913 -4474 -5040 -5061 -5179 2592 1482 -7306 -7137 -4649 -3179 -1117 -2662 -4169
343d169j638J139a401j440m389b891H08N477B395e139B906A67J89N472B356d808
$$ -4169 -5807 -4668 -1401 -2841 -7230 -2891 808 6285 2395 -5139 2906 167 356 5828 2356 -4808
326h3ej244l470q91P32k869R89K680A083K257c436H11P38b021j803l613a099E298
$$ -83 -5 -1249 -4719 -5610 -4878 -7747 -6758 -4078 1083 3340 -3436 811 1549 -2021 -3824 -7437 -1099 5298
307C115a404F12J837f609h48E76g217F53c690J376m782b634k132B672G14e623
$$ 3115 -1404 612 2449 -6609 -848 576 -7217 653 -3690 -2314 -7096 -2634 -4766 2672 714 -5623
290i852I56O704N20B727K77Q43h500L285m70r84K671K22A298K62B58b425l355
$$ -9852 956 7660 8180 2727 3004 3847 -8500 -5215 -5685 -6669 -3998 -3776 1298 1560 258 -2425 -5780
273e780J951a704b82j5p80j425l780K100o78j855k348J019K260K032j037O04J806
$$ -5780 -3829 -1704 -282 -297 -1077 -2502 -6282 -4182 -4860 -6715 -9063 -8044 -5784 -3752 -4789 -4185 -2379
256b379o16k692K511l80k358J565q44k187K50K190b019M0J58m4k02p20j342k389
$$ -2379 -2995 -5687 -3176 -3556 -5914 -4349 -5193 -7380 -7130 -4940 -2019 -1979 -1821 -1865 -2067 -2787 -4129 -6518
238f518j331L265a627E57J270j55q27b17k049m364L117k225J892k224b476K85
$$ -6518 -7849 -4584 -1627 557 1827 1672 845 -217 -2266 -6630 -3513 -5738 -3846 -6070 -2476 -2191
222b191P4m530j005J231j536N56M05J43O98j185A285b818P27B15c453M70j616
$$ -2191 -2117 -6647 -7652 -6421 -7957 -7401 -6996 -6853 -6155 -7340 1285 -2818 -2091 215 -3453 -2983 -4599
205d599m09b280m324l073r8L324J111K64j92J21J362j008k346k103L973j797j138
$$ -4599 -5008 -2280 -6604 -9677 -9775 -6451 -5340 -5076 -5268 -5147 -3785 -4793 -7139 -9242 -5269 -7066 -8204
188h204L930k53k019R67r8K192O41j926j805n4K818B07c670R03A895a122L47l68
$$ -8204 -4274 -4527 -6546 -5579 -5677 -3485 -2844 -4770 -6575 -6629 -3811 207 -3670 -2767 1895 -1122 -775 -1143
170a143C5e382B015N054a968k579j662k452K066f14B694h45k413a030A953L335
$$ -1143 35 -5382 2015 7069 -1968 -4547 -6209 -8661 -6595 -614 2694 -845 -3258 -1030 1953 5288
154E288L111r13K41R45l286A986b356p79j98p99l021R40k84P73J623a955C83J520
$$ 5288 8399 7486 7727 8672 5386 1986 -2356 -3135 -3333 -4132 -7153 -6213 -6497 -5724 -4101 -1955 383 1903
136A903O53g97C39c659q13J834a257l2922m2235K3406i994C784N600A257c465
$$ 1903 2556 -797 339 -3659 -4472 -2638 -1257 -34179 -76414 -53008 -9994 3784 9384 1257 -3465
120B82c274D517b076k799l027H40a969l420l516c490i33C872g54p69m498f20I235
$$ 282 -3274 4517 -2076 -4875 -7902 840 -1969 -5389 -8905 -3490 -933 3872 -754 -1523 -6021 -620 9235
102G982k955A581K568A000M771a972j46r27j589n50N65N78l52m60q99N4O11J005
$$ 7982 5027 1581 4149 1000 5771 -1972 -2118 -3045 -4634 -5184 -4619 -4041 -4393 -4853 -5752 -5698 -5087 -4082
84d082J247E3J503D28M838J60j077A517d166Q61j814J934J036k374j259M85l465
$$ -4082 -2835 53 1556 428 5266 5426 4349 1517 -4166 -3305 -5119 -3185 -2149 -4523 -5782 -5297 -8762
67h762H27D03a922l853k803L681a402A99h626b196l199k814J068K767J342J257
$$ -8762 827 403 -1922 -5775 -8578 -4897 -1402 199 -8626 -2196 -5395 -8209 -7141 -4374 -3032 -1775
51a775k67q45l641K665j578k685l72M196C09J597O99J050N60H2c534l423n68O92
$$ -1775 -2042 -2887 -6528 -3863 -5441 -8126 -8498 -4302 309 1906 2605 3655 4215 82 -3534 -6957 -7525 -6833
33f833b279j017m672A012P952j942c074K24o770j604e357r29a199B029c674n574
$$ -6833 -2279 -3296 -7968 1012 8964 7022 -3074 -2850 -9620 -11224 -5357 -6286 -1199 2029 -3674 -9248
17i248K115p82a478E704j208a074A809b561l668e82E02b320k812l471j706K812
$$ -9248 -7133 -7915 -1478 5704 4496 -1074 1809 -2561 -6229 -582 502 -2320 -5132 -8603 -10309 -7497
1g497J598
$$ -7497 -5899
0e899
$$ -5899
##PAGE= F1=1868.370472427
##FIRST=     3388.38724502563, 2822.10010593221, -5390
##DATA TABLE= (F2++(Y..Y)), PROFILE
1023e390G09Q77O29P74d980A566M346B81b306l3j94m151M79b972a016n060k420
$$ -5390 709 1586 2215 2989 -4980 1566 5912 281 -2306 -2339 -2533 -6684 -6205 -2972 -1016 -6076 -8496
1006h496K052j689J995K879J594h05l671J562l79l604B62g12H35e551b343j304
$$ -8496 -6444 -8133 -6138 -3259 -1665 -805 -4476 -2914 -3293 -6897 262 -712 835 -5551 -2343 -3647
990c647Q6Q26a351G0J115b546J13J02j310j157a309A044J48b828D70i778I3J5
$$ -3647 -3561 -2735 -1351 70 1185 -2546 -2433 -2331 -3641 -4798 -1309 1044 1192 -2828 470 -9778 93 108
972A08N0c932e58l856m325K280N73j49J34r2M9J260K137d0A944C12J258d645a220
$$ 108 158 -3932 -558 -4414 -8739 -6459 -5886 -6035 -5901 -5993 -5944 -4684 -2547 -40 1944 312 1570 -4645 -1220
952b195Q7B08e33j769j111R80o104E810A576b626k252j052p41k29K45R92K165
$$ -2195 -2108 208 -533 -2302 -3413 -2433 -8537 5810 1576 -2626 -4878 -5930 -6671 -6900 -6655 -5663 -3498
935c498j929B468L781e254J685E559L33L090p61B289i169a538l546j703J53M71
$$ -3498 -5427 2468 6249 -5254 -3569 5559 5892 8982 8221 2289 -9169 -1538 -5084 -6787 -6634 -6163
919f163R96J664Q21M19k55q91j102r81j340j031m29J092J561J814J717k905j60
$$ -6163 -5167 -3503 -2682 -2263 -2518 -3409 -4511 -5492 -6832 -7863 -8292 -7200 -5639 -3825 -2108 -5013 -5173
902e173k780c810j357l191M094F05N90a671F53J266M29A39e96k165m966L701J117
$$ -5173 -7953 -3810 -5167 -8358 -4264 605 1195 -1671 653 1919 2348 139 -596 -2761 -7727 -4026 -2909
885b909J392e7A031g082J397B740i44B393B80c488j348j37a913j984j133m06J71
$$ -2909 -1517 -57 1031 -7082 -5685 2740 -944 2393 280 -3488 -4836 -4973 -1913 -3897 -5030 -5436 -5265
868e265N1j313k340d285j157R83a204E907J058C110Q85b974j301a238A657b657
$$ -5265 -5214 -6527 -8867 -4285 -5442 -4459 -1204 5907 6965 3110 3995 -2974 -4275 -1238 1657 -2657
851f95k730j230R30J419k807C565c581k283J287n50K338j501D29a56A072K463
$$ -695 -3425 -4655 -3725 -2306 -5113 3565 -3581 -5864 -4577 -5127 -2789 -4290 429 -156 1072 3535
835C535J244j414g24m548a625A907K917e95o239J817j249M02J609A712J787j8
$$ 3535 4779 3365 -724 -5272 -1625 1907 4824 -595 -6834 -5017 -6266 -5864 -4255 1712 3499 3481
819C481m44A047b590l059a957j867e33p740A386a411o361d41n68j869j870q37
$$ 3481 3037 1047 -2590 -5649 -1957 -3824 -533 -8273 1386 -1411 -7772 -441 -1009 -2878 -4748 -5585
803e585P22k577b230f15A195K605j393K308O525C434d223a257j347b9m387a507
$$ -5585 -4863 -7440 -2230 -615 1195 3800 2407 4715 11240 3434 -4223 -1257 -2604 -29 -4416 -1507
786D728k67r06e208g30l193k554k000r77m6K86J309P67J491b49A104J98l92J03
$$ 4728 4461 3555 -5208 -730 -3923 -6477 -8477 -9454 -9500 -9214 -7905 -7138 -5647 -249 1104 1302 910 1013
768A013N31M49l82a013L95p03n489b080m200I73M80A55J37a763q38k400k874j881
$$ 1013 1544 1993 1611 -1013 -618 -1321 -6810 -2080 -6280 973 1453 155 292 -1763 -2601 -5001 -7875 -9756
750i756L937J885A159e992A753K485b527F530b006k095l890p16M128E37h90j319
$$ -9756 -5819 -3934 1159 -5992 1753 4238 -2527 6530 -2006 -4101 -7991 -8707 -4579 537 -890 -2209
734b209o87o1m558c414o97j251j368j285p50j45k83l45J256J838J005J108j833
$$ -2209 -2896 -2957 -7515 -3414 -4111 -5362 -6730 -8015 -8765 -8910 -9193 -9538 -8282 -6444 -5439 -4331 -6164
717f164b252f94A188d077C069b605m875L301B098B75i702L817l015r75L703J836
$$ -6164 -2252 -694 1188 -4077 3069 -2605 -7480 -4179 2098 275 -9702 -5885 -8900 -9875 -6172 -4336
701d336J653m378J831a037K46k113l077k146K332b342E28c83m284A356g77m276
$$ -4336 -2683 -7061 -5230 -1037 -791 -2904 -5981 -8127 -5795 -2342 528 -383 -4667 1356 -777 -5053
685e053M66j125j475b157F293B647e602F060j773d82n919J2a606j358q79l763
$$ -5053 -4587 -5712 -7187 -2157 6293 2647 -5602 6060 4287 -482 -6401 -6389 -1606 -2964 -3843 -7606
669g606b673A71b657j514R23j653l194D71L97k20a911e8E47h65k538l114k418
$$ -7606 -2673 171 -2657 -4171 -3248 -4901 -8095 471 868 648 -1911 -58 547 -865 -3403 -6517 -8935
652h935P93K272K464j516R8j493E3J583j13J710A084J645J070aB543a459m493
$$ -8935 -8142 -5870 -3406 -4922 -4824 -6317 53 1636 1523 3233 1084 2729 3799 -1 2543 -1459 -5952
635e952k744d225f62C979j421b711n074J626K113o87L95J435l292j099J137k083
$$ -5952 -8696 -4225 -662 3979 2558 -2711 -7785 -6159 -4046 -4733 -4338 -2903 -6195 -7294 -6157 -8240
619h240K449b622j981K000j797a531j090n406K894j511j287j431L706n03p59L240
$$ -8240 -5791 -2622 -4603 -2603 -4400 -1531 -2621 -8027 -5133 -6644 -7931 -9362 -5656 -6159 -6918 -3678
603c678R67J234h4I81O50K69k73c264B398j82R363E729B045m19b523l210H6e089
$$ -3678 -2711 -1477 -84 981 1631 1900 1627 -3264 2398 2216 11579 5729 2045 1626 -2523 -5733 86 -5089
584f362k456a569d01n591a043l461J526Mj199p36j32P83J226M08m47n94J108p358
$$ -6362 -8818 -1569 -401 -5992 -1043 -4504 -2978 -2974 -4173 -4909 -5041 -4258 -3032 -2624 -3071 -3665 -2557 -9915
566i915h74m588a368H415C711D34e276m697L167K467P38k16Jj2p81k282l319M439
$$ -9915 -874 -5462 -1368 8415 3711 434 -5276 -9973 -6806 -4339 -3601 -3817 -3816 -3828 -4609 -6891 -10210 -5771
548e771a770l227j922j276L881b53C91h269F206M611l773b777j386m009J628Q63
$$ -5771 -1770 -4997 -6919 -8195 -4314 -253 391 -8269 6206 10817 7044 -2777 -4163 -8172 -6544 -5681
532e681j161b153j058a278A846L037j764i115b210G932k487A555b424o17k201
$$ -5681 -6842 -2153 -3211 -1278 1846 4883 3119 -9115 -2210 7932 5445 1555 -2424 -3041 -5242
517e242D935n27b40A446c649j330m918O76K349J216K54L48P89Q10l535b365Q37
$$ -5242 4935 4408 -240 1446 -3649 -4979 -9897 -9221 -6872 -5656 -5402 -5054 -4265 -3455 -6990 -2365 -1528
500a528B5a35q448E549b886n633b326k167G60e958E83c829C010J315J389J798
$$ -1528 25 -135 -8583 5549 -2886 -8519 -2326 -4493 760 -5958 583 -3829 3010 4325 5714 7512
484G512j468K259J9034k085L11453K82559J69756o2353H7382k392C0301O237b745
$$ 7512 6044 8303 27337 25252 336705 619264 789020 726667 87382 84990 30301 36538 -2745
470f427a640k91A592g142E60b133N50p495J199K94F608k039e207a434j780j133
$$ -6427 -1640 -1931 1592 -7142 560 -2133 -1583 -9078 -7879 -7585 6608 4569 -5207 -1434 -3214 -4347
454d347k51J00m692c859j192l460M145b161p580Q49a970f28B670O8R06a378p588
$$ -4347 -4598 -4498 -9190 -3859 -5051 -8511 -4366 -2161 -9741 -8892 -1970 -628 2670 2738 3644 -1378 -8966
437h966A647M480j297B76d063l574j103P62K015J104N04J082k724b672B251a232
$$ -8966 1647 6127 4830 276 -4063 -7637 -8740 -7978 -5963 -4859 -4355 -3273 -5997 -2672 2251 -1232
420H66b389m402j137K875l247B85J423Q88P66P50j10j403d64m584l095c660c16
$$ 866 -2389 -6791 -7928 -5053 -8300 285 1708 2596 3362 4112 4002 2599 -464 -5048 -8143 -3660 -316
402A786J921d255k776b414n720k118L297K438R25m68j204m51K591I96K809A045
$$ 1786 3707 -4255 -7031 -2414 -8134 -10252 -6955 -4517 -3592 -4060 -5264 -5715 -3124 996 3805 1045
385D748L343j736c362p807L675a185q55k440k126L183o044a142B371L023k78f38
$$ 4748 8091 6355 -3362 -11169 -7494 -1185 -2040 -4480 -6606 -3423 -9467 -1142 2371 5394 5116 -638
368F50b935a076B807a049o310c668A429K185J50e899k044c334l972K343L7f32
$$ 650 -2935 -1076 2807 -1049 -7359 -3668 1429 3614 3764 -5899 -7943 -3334 -7306 -4963 -4926 -632
351B57f410n054N67K184L643B38i55j985k096Q12P73J711l398J840H01N345k128
$$ 257 -6410 -11464 -10897 -8713 -5070 238 -955 -2940 -5036 -4224 -3451 -1740 -5138 -3298 801 6146 4018
334D018A41K693a922l795m972e237h87B817K07g24m696N80K083j734l15j039A966
$$ 4018 141 2834 -1922 -5717 -10689 -5237 -887 2817 3024 -724 -5420 -4840 -2757 -4491 -4806 -5845 1966
316B698a548A101c1k91B222c891c89C801G77b612m697Q79j64C648J411h408A802
$$ 2698 -1548 1101 -31 -322 2222 -3891 -389 3801 777 -2612 -7309 -6430 -6594 3648 5059 -8408 1802
298a665j794l647J588l926K457j493j276m51K61L75M33O27R56N38j171L99j263
$$ -1665 -3459 -7106 -5518 -9444 -6987 -8480 -9756 -10207 -9946 -9571 -9138 -8511 -7555 -7017 -8188 -7789 -9052
281i052O39L274a947H94J538J58A105d589M70k285j545j404j129j7K274J676J037
$$ -9052 -8413 -5139 -1947 894 2432 2590 1105 -4589 -4119 -6404 -7949 -9353 -10482 -10499 -8225 -6549 -5512
264e512N55q90J634M01L00o92p96K94m22l069a713k599k381K336p17o65N47M50
$$ -5512 -4957 -5847 -4213 -3812 -3512 -4204 -5000 -4706 -5128 -8197 -1713 -4312 -6693 -4357 -5074 -5739 -5192 -4742
246d742K114J04a224A35Q28k67i85k014k710k087L50J617J999J625g82A13a596
$$ -4742 -2628 -2524 -1224 135 963 696 -985 -2999 -5709 -7796 -7446 -5829 -3830 -2205 -782 113 -1596
228d535K143l645j66M88d54G05j7c305l148j942j104d726g57B519a738j448E002
$$ -4535 -2392 -6037 -6203 -5715 -454 705 688 -3305 -6453 -8395 -9499 -4726 -757 2519 -1738 -3186 5002
210G05b103n36j754J382J224j749a08A044c683l332J094J317A15b620I44b163
$$ 705 -2103 -2639 -4393 -3011 -1787 -3536 -108 1044 -3683 -7015 -5921 -4604 115 -2620 944 -2163
193b961m950K882K84P85j700Q62j535m99R66J382J530J450c33l203k127k214J031
$$ -2961 -7911 -5029 -4745 -3960 -5660 -4798 -6333 -6832 -5866 -4484 -2954 -1504 -333 -3536 -5663 -7877 -6846
176f846J823O53J51k88O5Q46l15k191G40O59b988q45k706j133n1J76k090J298
$$ -6846 -5023 -4370 -4219 -4507 -4442 -3596 -3911 -6102 740 1399 -2988 -3833 -6539 -7672 -7723 -7547 -9637 -8339
158h339K383K954G09L568K772N13j467B876h12p03q2K32B124i39n502A04a367
$$ -8339 -5956 -3002 709 4277 7049 7562 6095 2876 -812 -1515 -1597 -1365 2124 -939 -6441 104 -1367
140b832q87P29g64A156a249j499H73c873J538k548p9k3994l2287J9209i110C70
$$ -2832 -3719 -2990 -764 1156 -1249 -2748 873 -3873 -2335 -4883 -4962 -28956 -61243 -42034 -9110 370
123E889k560I0a064D11P310B068e422k791a592l196k349r84R98K247a493C8e43
$$ 5889 3329 90 -1064 411 7721 2068 -5422 -8213 -1592 -4788 -7137 -8121 -7123 -4876 -1493 38 -543
105e174A461Q358p00m538B266L764k908L085a278j25l153k891q70K007K212J135
$$ -5174 1461 9819 9119 4581 2266 6030 3122 6207 -1278 -1403 -4556 -7447 -8317 -6310 -4098 -2963
89b963L99j429k492k843J695P21r85L50c703B78K196M09I54g910b684n423K760
$$ -2963 -2564 -3993 -6485 -9328 -7633 -6912 -7897 -7547 -3703 278 2474 2883 954 -7910 -2684 -8107 -5347
72e347e98J67j455m743j488D386Q88B632b951l275A096L481j49a1421a403A066
$$ -5347 -598 -431 -1886 -6629 -8117 4386 5274 2632 -2951 -6226 1096 4577 4428 -11421 -1403 1066
55F96J212E88a969M28k973R40k195G80L1f83A040a597l776l473K630K954a052
$$ 696 1908 588 -1969 -1541 -4514 -3574 -5769 780 811 -683 1040 -1597 -5373 -8846 -6216 -3262 -1052
37b188L71M37l088j749n65K958r24H83P0d20j968j671K0J119F48e199f49j398
$$ -2188 -1817 -1380 -4468 -6217 -6782 -3824 -4748 883 953 -420 -2388 -4059 -4039 -2920 648 -5199 -649 -2047
19b047o098J50K817j207K638j809J744a743I0a490o439b171k165k546K3K52J643
$$ -2047 -8145 -7995 -5178 -6385 -3747 -5556 -3812 -1743 90 -1490 -7929 -2171 -4336 -6882 -6859 -6607 -4964
2d964J067j409
$$ -4964 -3897 -5306
0e306
$$ -5306
##PAGE= F1=1865.611821297
##FIRST=     3388.38724502563, 2822.10010593221, -4599
##DATA TABLE= (F2++(Y..Y)), PROFILE
1023d599D874p51A356Q21e571E413O00c519j720K42D54J046F43a417l477m409
$$ -4599 4874 4123 1356 2177 -5571 5413 6013 -3519 -5239 -4997 454 1500 643 -1417 -4894 -9303
1007i303j013K645J115n35j360r49K89J385J731K042m985d58j172j903k303G29
$$ -9303 -10316 -7671 -6556 -7091 -8451 -9400 -9111 -7726 -5995 -3953 -8938 -458 -1630 -3533 -5836 729
990d68q2a68C20Oa710N38n44j585m95k910b476A607j85b261O55n098H68h27j091
$$ -468 -550 -168 320 326 -1710 -1172 -1716 -3301 -3796 -6706 -2476 1607 1422 -2261 -1606 -6704 868 -827 -1918
971a918k168L57q69N3J87b056f57a95j083k662l540p30c410C71b106k4l224a259
$$ -1918 -4086 -3729 -4598 -4545 -4358 -2056 -657 -195 -1278 -3940 -7480 -8210 -3410 371 -2106 -2130 -5354 -1259
952D713q78k35g46k135l909J928k759E426J57A056b786j440J316j48a452o93m12
$$ 4713 3835 3600 -746 -2881 -6790 -4862 -7621 5426 5583 1056 -2786 -4226 -2910 -3058 -1452 -2145 -2557
935b557j324G86L072f843b173E797k636K329j643A897i019d235k270j614r79J786
$$ -2557 -3881 786 3858 -6843 -2173 5797 3161 5490 3847 1897 -9019 -4235 -6505 -8119 -9098 -7312
919g312J321J141J88l82q21j421j125J071K456a984H1J071a095k634j206m561
$$ -7312 -5991 -4850 -4662 -5044 -5865 -7286 -8411 -7340 -4884 -1984 81 1152 -1095 -3729 -4935 -9496
903i496P76c949H98d112n50a252A1d97k314l66M02K60p32j580k204k127P94J700
$$ -9496 -8720 -3949 898 -4112 -4662 -1252 11 -497 -2811 -3177 -2775 -2515 -3247 -4827 -7031 -9158 -8364 -6664
885f664J851K101h54m537O05A298e57j824k736r37J272J287k70J43J007P39Nj008
$$ -6664 -4813 -2712 -854 -5391 -4786 1298 -557 -2381 -5117 -6054 -4782 -3495 -3765 -3622 -2615 -1876 -1871 -2879
867b879k557k449c147Jk455C717M427k684k221R40b402j083a122A064c971J919
$$ -2879 -5436 -7885 -3147 -3146 -5601 3717 8144 5460 3239 4179 -2402 -3485 -1122 1064 -3971 -2052
851b052m38o86l275L106i75B610e905L53J371k394J818K0J853j837k565r91J592
$$ -2052 -2490 -3176 -6451 -3345 -975 2610 -5905 -5552 -4181 -6575 -4757 -4737 -2884 -4721 -7286 -8277 -6685
834f685J329N10o13j403j643J533b929k785a987m167J973n000G63L281A542e21
$$ -6685 -5356 -4846 -5459 -6862 -8505 -6972 -2929 -5714 -1987 -6154 -4181 -9181 763 4044 1542 -521
817b068j085l69P88k166b193n656D213a179o241g90C14d168j788b945j962L17
$$ -2068 -3153 -3522 -2734 -4900 -2193 -7849 4213 -1179 -7420 -790 314 -4168 -5956 -2945 -4907 -4590
801d590B004K631j384K366B314m40P574C964b077l31p66Q37j428O92C287L931
$$ -4590 2004 4635 3251 5617 2314 1874 9448 3964 -2077 -2408 -3174 -2337 -3765 -3073 3287 7218
785G218M02e834a130n087j584L761a451M64j278l173j738K586h52B794n72o97
$$ 7218 7620 -5834 -1130 -6217 -7801 -4040 -1451 -987 -2265 -5438 -7176 -4590 -852 2794 2222 1525
769A525p4k21D4b574l194j860Q88N21p40J395K469A452J132j205e381J408a641
$$ 1525 1451 1230 44 -2574 -5768 -7628 -6740 -6219 -6959 -5564 -3095 1452 2584 1379 -5381 -3973 -1641
751a1382d596j665K12J679m819CJ972c546D980i99k649m063k021J795i62C507
$$ -11382 -4596 -6261 -6049 -4370 -9189 3 1975 -3546 4980 -999 -3648 -7711 -9732 -7937 -962 3507
734C552J98J63d986E335I26b672C233N6i58m273l489K09J710N73k13k45L65J049
$$ 3552 3750 3913 -4986 5335 926 -2672 3233 3289 -958 -5231 -8720 -8511 -6801 -6228 -6441 -6686 -6321 -5272
716e272J560J787k931A298d644j572g13A907r47g523a568l30q277c8A245C15g141
$$ -5272 -3712 -1925 -4856 1298 -4644 -6216 -713 1907 960 -7523 -1568 -1898 -10175 -38 1245 315 -7141
698d398J449f29m71M11m678c99n18d21J39o847G898B807e890Q20k964k329A911
$$ -4398 -2949 -629 -1100 -689 -5367 -399 -917 -421 -282 -7129 7898 2807 -5890 -5070 -8034 -10363 1911
680B353I74g029h57M28D67M14d211K066j229j284m413K183j120P91J820J965j673
$$ 2353 974 -7029 -857 -429 467 881 -4211 -2145 -3374 -4658 -9071 -6888 -8008 -7217 -5397 -3432 -5105
663e105j679A259O51l90a546F67J193E78a030n054J472J437l222k860p22J922
$$ -5105 -6784 1259 1910 1520 -1546 667 1860 578 -1030 -6084 -4612 -3175 -6397 -9257 -9979 -8057
647h057J701J023J407J286M41k73n99n42N33a507f01J58m75n49j356j112k754
$$ -8057 -6356 -5333 -3926 -2640 -2199 -2472 -3071 -3613 -3080 -1507 -601 -443 -918 -1467 -2823 -3935 -6689
630f689j703J337K650j45l24O58J701k066m415J203E21L071a954k160P08j991
$$ -6689 -8392 -7055 -4405 -4550 -4874 -4216 -2515 -4581 -8996 -7793 521 3592 -1954 -4114 -3406 -5397
614e397a270j600m624b837L80B110e138J470j123l645a188B168E35N028B198L928
$$ -5397 -1270 -2870 -7494 -2837 -2457 2110 -5138 -3668 -4791 -8436 -1188 2168 535 5563 2198 6126
598F126Q229E28b464M99B935P584A032b257A64L353A36b81o711J860k369a712
$$ 6126 14355 528 -2464 -1965 2935 10519 1032 -2257 164 3517 136 -281 -6992 -5132 -7501 -1712
581G36e766K802j137J45m22n99r81j301j083q69r44K392L079a369r605f29l089
$$ 736 -5766 -2964 -4101 -3956 -4378 -4977 -5958 -7259 -8342 -9211 -10155 -7763 -4684 -1369 -10974 -629 -3718
564c718d87A814a442m055m131Q46K445J876J729m67O6F95a196l149n66a552j468
$$ -3718 -487 1814 -1442 -5497 -9628 -8782 -6337 -4461 -2732 -3199 -3133 695 -1196 -4345 -4911 -1552 -3020
547c020k56k163J45b451j473J214n136B677K529q12d720j408j558J494q50L348
$$ -3020 -3276 -5439 -5294 -2451 -3924 -2710 -7846 2677 5206 4394 -4720 -6128 -7686 -6192 -7042 -3694
531c694i9p64E79K987M44L0f728b532A0000k232B938b904n470J677L215P29j815
$$ -3694 -99 -863 579 3566 4010 4040 -6728 -2532 10000 7768 2938 -2904 -8374 -6697 -3482 -2753 -4568
514d568l227l49c824B47J091b356k54M88n50n06R87n679c082B995K104D29e218
$$ -4568 -7795 -8144 -3824 247 1338 -2356 -2610 -2122 -2672 -3178 -2191 -7870 -3082 2995 5099 429 -5218
496E372e750l384M379m89f51n235b49p883h23C710l95K451r81K51I4J8476a5668
$$ 5372 -5750 -9134 -4755 -5244 -651 -5886 -249 -8132 -823 3710 3315 5766 4785 5036 94 18570 -15668
478C87858P6122n8806A19481n7917D889b745o659K976r02R80J889l26j305l487
$$ 387858 463980 405174 119481 61564 4889 -2745 -9404 -6428 -7330 -6350 -4461 -4787 -6092 -9579
464i579J484j545K674O29E348O64d005E807p44j452A722f493k762b922k141m513
$$ -9579 -8095 -9640 -6966 -6337 5348 6012 -4005 5807 5063 3611 1722 -6493 -9255 -2922 -5063 -9576
448i576d632K204m088q33a106n48r07o65l72Nl948b188O98L0j317m214j343K819
$$ -9576 -4632 -2428 -6516 -7349 -1106 -1654 -2561 -3226 -3598 -3593 -7541 -2188 -1490 -1460 -2777 -6991 -8334 -5515
430e515a836I73K223h13G02e611K422E7a977j277m7l669a501l5q867c730j014
$$ -5515 -1836 973 3196 -813 702 -5611 -3189 57 -1977 -3254 -3301 -6970 -1501 -1536 -10403 -3730 -4744
413d744MQ03Q52K09J9M65a071A200K808A159a970A794e973k56B143F82b099k189
$$ -4744 -4740 -3937 -3085 -2876 -2857 -2392 -1071 1200 4008 1159 -1970 1794 -5973 -6229 2143 682 -2099 -4288
395d288l103Q83m4J503b371A061L174K676k806K016K049l291a701p808J904a864
$$ -4288 -7391 -6508 -6552 -5049 -2371 1061 4235 6911 4105 6121 8170 4879 -1701 -9509 -7605 -1864
378f86j786o724L679m05C821L164R10A646c538c53k638a109D363b471p363c907
$$ -686 -2472 -9196 -5517 -5922 3821 6985 7895 1646 -3538 -353 -2991 -1109 4363 -2471 -9834 -3907
361H2i99l712l888P71K886m219c869j033c37j720j865j833j408r57l56O77J729
$$ 82 -999 -4711 -8599 -7828 -4942 -9161 -3869 -4902 -337 -2057 -3922 -5755 -7163 -8120 -8476 -7799 -6070
344f070K543r4Q82k165a50l129k803k339J782J673L36j087j837l27K411K162J528
$$ -6070 -3527 -3621 -2739 -4904 -150 -3279 -6082 -8421 -6639 -4966 -4630 -5717 -7554 -7881 -5470 -3308 -1780
327a780Q56c49o5n709K130J90j80a875n767L226a165i9E67g55B517K242d55R2
$$ -1780 -924 -349 -414 -6123 -3993 -3803 -3983 -1875 -7642 -4416 -1165 -99 567 -755 2517 4759 -455 -363
309c63A781c271o69K85J251k658H933D134c219C214g29o90l868K491k093b361
$$ -363 1781 -3271 -3940 -3655 -2404 -5062 8933 4134 -3219 3214 -729 -1419 -5287 -2796 -4889 -2361
292b195m8k643K354J263G93b296Q07B546f141K770l247K347k69l74J76Q46R98
$$ -2195 -2243 -4886 -2532 -1269 793 -2296 -1489 2546 -6141 -3371 -6618 -4271 -4540 -4914 -4738 -3892 -2894
275b894L7j075j504j235l13l56p34j505K415K861b011j867L77J619O18j487j731
$$ -2894 -2857 -3932 -5436 -6671 -6984 -7340 -8074 -9579 -7164 -4303 -2011 -3878 -3501 -1882 -1264 -2751 -4482
258d482j710j476j026j5J980c092n88J053l34L94j69k295J487a313A14L253L350
$$ -4482 -6192 -7668 -8694 -8709 -6729 -3092 -3680 -2627 -2961 -2567 -2736 -5031 -3544 -1313 114 3367 6717
241F717K023c955F941l379d28l136o76a602B101L773B197i89j522c15n242l385
$$ 6717 8740 -3955 6941 3562 -428 -3564 -4240 -1602 2101 5874 2197 -989 -2511 -315 -5557 -8942
225h942d250i40D501O3D82d837b79E3L213L549K964f272E72P090C132a73m640
$$ -8942 -4250 -940 4501 4564 482 -4837 -279 53 3266 6815 9779 -6272 572 7662 3132 -173 -4813
208d813l01K302D31b505f08j758o344L742R5K72A024c524B254i21E60a043I18
$$ -4813 -5114 -2812 431 -2505 -608 -2366 -8710 -4968 -4873 -4601 1024 -3524 2254 -921 560 -1043 918
190c540a079j606j944k889J144L93K305J515j550J321i05l365k367p31m7r14o00
$$ -3540 -1079 -2685 -4629 -7518 -6374 -5981 -3676 -2161 -3711 -2390 -905 -4270 -6637 -7368 -7415 -8329 -8929
173h929J60K75r5l07q9Q67R41J96k83o00M9J428L86a320j544M16A849r01f38j316
$$ -8929 -8769 -8494 -8589 -8896 -8985 -8118 -7177 -6981 -7264 -7864 -7815 -6387 -6001 -1320 -2864 -2448 1849 948 -638 -1954
153a954j262p68q53p82J485a029A28L445b133j475F974k142B043I08c317d78j580
$$ -1954 -3216 -3984 -4837 -5619 -4134 -1029 128 3573 -2133 -3608 6974 4832 2043 908 -3317 -478 -2058
136b058m892j94L92K718a679m417j587p012j9996J2218c821L67A825K668j443
$$ -2058 -6950 -7144 -6752 -4034 -1679 -6096 -7683 -14695 -34691 -22473 -3821 -3454 1825 4493 3050
121C050a079J10j092l89j192k382K771n44m82n78q93j613k75K336K618j875I33
$$ 3050 -1079 -969 -2061 -2450 -3642 -6024 -3253 -3797 -4279 -4857 -5750 -7363 -7638 -5302 -2684 -4559 933
103A076A68a397p63N08g69g9j242r1N2j265j581j480j977k030L219c151H5K013
$$ 1076 168 -1397 -2160 -1652 -769 -79 -1321 -1412 -1360 -2625 -4206 -5686 -7663 -9693 -6474 -3151 85 2098
85B098a125A716f74o665K196a306H34J016H53f103d73o601J37a428G606r69f461
$$ 2098 -1125 1716 -674 -7339 -5143 -1306 834 1850 853 -6103 -473 -7074 -6937 -1428 7606 6637 -6461
67f845A25O62N32D21e566B306N036N59g729a047C507L95A918a783P98K83p192
$$ -6845 125 787 1319 421 -5566 2306 7342 7901 -7729 -1047 3507 3902 1918 -1783 -985 -702 -7894
50g894c480l57a76A176e67h6j917k072q73n71r10j318k37K081K497k988b547B300
$$ -7894 -3480 -3837 -176 1176 -567 -86 -2003 -4075 -4948 -5519 -6429 -7747 -7984 -5903 -3406 -6394 -2547 2300
31B110a589O67k635l235o01L694g5k938C06c174c53l455l478K494J636k147a787
$$ 2110 -1589 -922 -3557 -6792 -7393 -3699 -75 -3013 306 -3174 -353 -3808 -7286 -4792 -3156 -5303 -1787
13C04K322a357A630A0g252c258j537j52p67j246j930L851l54
$$ 304 2626 -1357 1630 10 -7252 -3258 -4795 -4947 -5714 -6960 -8890 -5039 -5393
0e393
$$ -5393
##PAGE= F1=1862.853170167
##FIRST=     3388.38724502563, 2822.10010593221, -4360
##DATA TABLE= (F2++(Y..Y)), PROFILE
1023d360D326q99G62J208e353F745j543e137j264M69b142I12K190K54A326b732
$$ -4360 4326 3427 762 1970 -5353 6745 5202 -5137 -6401 -5932 -2142 912 3102 3356 1326 -2732
1006g364m59L320J879L88m77p17p25j285O75o482M772J997l912L095g90Q6b74
$$ -7364 -7823 -4503 -2624 -2236 -2713 -3430 -4155 -5440 -4765 -11247 -6475 -4478 -8390 -5295 -790 -704 -274
988b0Mp61m318J235j634j4J643j897K353A456n19b586K9q58e00C361b282m037
$$ -20 -16 -777 -5095 -3860 -5494 -5508 -3865 -5762 -3409 1456 937 -2586 -2557 -3415 -500 3361 -2282 -6319
970f319B818J428K62b386E076K2j203A609a631l752m010M653a095k630R35k671
$$ -6319 2818 4246 4508 -2386 5076 5098 3895 1609 -1631 -5383 -9393 -4740 -1095 -3725 -2790 -5461
954e461b716o1j556M97a710O17m617r33L38B331J894h62l134L9d45l333C094j234
$$ -5461 -2716 -2777 -4333 -3836 -1710 -1093 -5710 -6643 -6305 2331 4225 -862 -3996 -3957 -445 -3778 3094 1860
936A860a856k82Q14I91i350c83F082F71J692F05d3q378M11k691d394m259d060
$$ 1860 -1856 -2138 -1324 991 -9350 -383 6082 671 2363 605 -43 -8421 -8010 -10701 -4394 -8653 -4060
918d608j63o30n30m7M14J340a657k104A584N506k881a374o711c630D62i233b079
$$ -4608 -4771 -5401 -5931 -5978 -5564 -4224 -1657 -3761 1584 7090 4209 -1374 -8085 -3630 462 -9233 -2079
900b869p63p79K75J313P93j691A121J392k09p96F07d344j659J960k059j335J089
$$ -2869 -3632 -4411 -4136 -2823 -2030 -3721 1121 2513 2304 1508 607 -4344 -6003 -4043 -6102 -7437 -6348
883f348J935J803j12e1j61p063b237l023J726a712H83r6c340B825K227A964i979
$$ -6348 -4413 -2610 -2722 -51 -212 -7275 -2237 -5260 -3534 -1712 883 787 -3340 2825 5052 1964 -9979
865c597F78b685j621j214k62m9K15O67J693K43a364I58d347M23a836L17p241d68
$$ -3597 678 -2685 -4306 -5520 -5782 -5831 -5616 -4949 -3256 -3013 -1364 958 -4347 -3924 -1836 -1519 -8760 -468
846B43a090m693J35b031Q85M76l996a096j404j573j920k432J643b971F33d262
$$ 243 -1090 -5783 -5648 -2031 -1146 -670 -4666 -1096 -2500 -4073 -5993 -8425 -6782 -2971 633 -4262
829A57L194a404j767j387j080b698m405a164j710k416k502k01J842J101R4j182
$$ 157 3351 -1404 -3171 -4558 -5638 -2698 -7103 -1164 -2874 -5290 -7792 -7993 -6151 -5050 -4956 -6138
813f138J161M84J162J140m460a557I30A8c539J154K97Q65E004K639B824M32j419
$$ -6138 -4977 -4493 -3331 -2191 -6651 -1557 930 18 -3539 -2385 -2088 -1223 5004 7643 2824 3256 1837
796A837a456D716p76E72d517j875K453m77q30E52P392K300d519C043r68b612b76
$$ 1837 -1456 4716 3940 572 -4517 -6392 -3939 -4416 -5246 552 7944 10244 -4519 3043 2075 -2612 -276
778A564m51d68l311k181J678a384D761j974I74oJ037c805A471a144l447k761J372
$$ 1564 1113 -468 -3779 -5960 -4282 -1384 4761 2787 974 968 2005 -3805 1471 -1144 -4591 -7352 -5980
761e980Q42p75r20K641a215H50g133q6a356o740a911c60m246J819j892C585a156
$$ -5980 -5138 -5913 -6833 -4192 -1215 850 -7133 -7219 -1356 -8096 -1911 -360 -4606 -2787 -4679 3585 -1156
743e812B213f02k679l734r1k418K451b873C698j023M149a930G360C189a227H040
$$ -5812 2213 -602 -3281 -7015 -7106 -9524 -7073 -2873 3698 2675 6824 -1930 7360 3189 -1227 8040
726H134E51b283m496k64K931J707j348l769L105j235o49K49O60J703k325b429
$$ 8134 551 -2283 -6779 -7043 -4112 -2405 -3753 -7522 -4417 -5652 -6301 -6052 -5392 -3689 -6014 -2429
709A110R16K31d897A348a34r030A254K320c35n859K594k026a761Q33A184d313
$$ 1110 2026 2257 -4897 1348 -134 -9164 1254 3574 -335 -6194 -3600 -5626 -1761 -928 1184 -4313
692A045b828l234a060p739E715A778e899J062n895Q74E134j260a092n548R91N02
$$ 1045 -2828 -6062 -1060 -8799 5715 1778 -5899 -4837 -10732 -9858 5134 3874 -1092 -6640 -5649 -5147
676e147h06A747e961K790n77l021j853K242B28L752d20k376j382o34B365P301
$$ -5147 -806 1747 -5961 -3171 -3748 -6769 -8622 -6380 228 3980 -420 -2796 -4178 -4812 2365 9666
660I666j254a318A17J043a96k675p697c250J519l339k794r56J329J491O55O59
$$ 9666 8412 -1318 117 1160 -196 -2871 -10568 -3250 -1731 -5070 -7864 -8820 -7491 -6000 -5345 -4686
644d686J33j003j905k396P23L048K954J291k81j570j512K73J653a554m399m94
$$ -4686 -4553 -5556 -7461 -9857 -9134 -6086 -3132 -1841 -2122 -3692 -5204 -4931 -3278 -1554 -5953 -6447
628f447a223j963k176K363J392k387m874K353B95K890g99k273r43k914A80a254
$$ -6447 -1223 -3186 -5362 -2999 -1607 -3994 -8868 -6515 295 3185 -799 -3072 -4015 -6929 180 -1254
611e972K819a533E093a529j761r48k616L009j760K343E05N78L809o42F59b984
$$ -5972 -3153 -1533 5093 -1529 -3290 -4238 -6854 -3845 -5605 -3262 505 1083 4892 4250 659 -2984
594f720C033M115c657k670i34A095c618l042Q25J668o78J251q94j906K404K57
$$ -6720 3033 7148 -3657 -6327 -934 1095 -3618 -6660 -5835 -4167 -4845 -3594 -4488 -6394 -3990 -3733
578c733h62D10R34L12e726b95j644k158k063j644r99p65j92J62P27J218J335J530
$$ -3733 -862 410 1344 1656 -5726 -295 -1939 -4097 -6160 -7804 -8803 -9568 -9760 -9598 -8871 -7653 -6318 -4788
560d788J540J241O79N74n98k965j569A116K956M94a493l404J488a095j970j14
$$ -4788 -3248 -2007 -1328 -754 -1352 -4317 -5886 1116 4072 4566 -1493 -4897 -3409 -1095 -3065 -3179
544c179l956o95c336j731D748K954E36g040n78O77J400k291c05A437J178K475
$$ -3179 -7135 -7830 -3336 -5067 4748 7702 536 -7040 -7618 -6941 -5541 -7832 -305 1437 2615 5090
528E090K369I36K655f303a616A1509pC995o12j253f915b119e64E45a96m650j409
$$ 5090 7459 936 3591 -6303 -1616 11509 11502 3995 3383 2130 -6915 -2119 -564 545 -196 -4846 -6255
511f255M93b497g16q87j294l095j820K319o92K970c75B968H26b777R57o281K691
$$ -6255 -5762 -2497 -716 -1603 -2897 -5992 -7812 -5493 -6185 -3215 -375 2968 826 -2777 -1820 -8101 -5410
494e410m57k86J957j764b614n911c064B212g05F512l104O923D185J8304J17162
$$ -5410 -5867 -6153 -4196 -5960 -2614 -8525 -3064 2212 -705 6512 3408 10331 4185 22489 139651
479A39651Q7490N5588j4153j24924G795k598f427jB4059q167f851q77b552J244
$$ 139651 227141 282729 268576 143652 7795 5197 -6427 -6428 24059 15892 -6851 -7728 -2552 -1308
465a308B063a019q670M633K080B865L170c082G005j922A887a320m315J32K459
$$ -1308 2063 -1019 -9689 -5056 -2976 2865 6035 -3082 7005 5083 1887 -1320 -5635 -5503 -3044
450c044q41n034J529k083J51J023O9Q3J399J753J154l4j544j673j83K136J840
$$ -3044 -3885 -8919 -7390 -9473 -9322 -8299 -8230 -8147 -6748 -4995 -3841 -3875 -5419 -7092 -7275 -5139 -3299
433c299n686a754a5B802I51J043EJ306e003K219g94A929N119L011d782C163n88
$$ -3299 -8985 -1754 -15 2802 951 1994 5 1311 -5003 -2784 -794 1929 7048 10059 -4782 3163 2575
416B575f374K053l910J556J320q8R24O50a051A560O014k008A096d923m958M020
$$ 2575 -6374 -4321 -8231 -6675 -5355 -5443 -4519 -3869 -1051 1560 7574 5566 1096 -4923 -9881 -5861
400e861o26d75C406R17A356e492B531I86c754O24D872K391M28p73j718k074I33
$$ -5861 -6487 -475 3406 4323 1356 -5492 2531 986 -3754 -3130 4872 7263 7691 6918 5200 3126 933
382a472o348J434j426J379K446m416R55c713k094J837G25a440m964h86j961Q31
$$ -1472 -7820 -6386 -7812 -6433 -3987 -8403 -7448 -3713 -5807 -3970 725 -1440 -6404 -886 -2847 -2016
366b016A296e334m341d807e23o52m629m220K231J430j278c029j986J132j597L39
$$ -2016 1296 -5334 -9675 -4807 -523 -1175 -5804 -10024 -7793 -6363 -7641 -3029 -5015 -3883 -5480 -5141
350e141Q31L81J4J094A79M1b030l6Q55m467C31a747k532K047A728a307l490j151
$$ -5141 -4310 -3929 -3915 -2821 179 220 -2030 -2066 -1211 -5678 331 -1747 -4279 -2232 1728 -1307 -4797 -5948
332e948K330l646K458B78g63j338q83kl537K657j38N78a396p286M183k479j400
$$ -5948 -3618 -7264 -4806 278 -763 -2101 -2984 -2986 -6523 -3866 -4004 -3426 -1396 -8682 -4499 -6978 -8378
315h378J722J606O21L8P99a695D85e222l08J107r37K417G564a205A225K467h31
$$ -8378 -6656 -5050 -4429 -4391 -3592 -1695 485 -5222 -5530 -4423 -5360 -2943 7564 -1205 1225 3692 -831
$$ [...]
##END NTUPLES=nD NMR SPECTRUM
##END=
