##TITLE=XTC-1706e_1
##JCAMPDX= 6.0         $$ Bruker NMR JCAMP-DX V2.0
##DATA TYPE= NMR SPECTRUM
##DATA CLASS= NTUPLES
##ORIGIN= BRUKER
##OWNER= patiny
$$ 1.79 TOPSPIN		Version 3.0
$$ 2012-05-20 13:51:58.945 +0200  patiny@icmbsg005
$$ Compression mode = diff/dup
##.OBSERVE FREQUENCY= 400.13188181139
##.OBSERVE NUCLEUS= ^1H
##.ACQUISITION MODE= SIMULTANEOUS (DQD)
##.ACQUISITION SCHEME= undefined
##.AVERAGES= 16
##.DIGITISER RES= 23
##SPECTROMETER/DATA SYSTEM= spect
##.PULSE SEQUENCE= zgpr
##.SOLVENT NAME= D2O
##.SHIFT REFERENCE= INTERNAL, D2O, 1, 11.69961
##AUDIT TRAIL= $$ (NUMBER, WHEN, WHO, WHERE, PROCESS, VERSION, WHAT)
$$ ##TITLE= Audit trail, TOPSPIN		Version 3.0
$$ ##JCAMPDX= 5.01
$$ ##ORIGIN= Bruker BioSpin GmbH
$$ ##OWNER= patiny
$$ $$ /opt/data/patiny/nmr/XTC-1706e_1/11/pdata/1/auditp.txt
$$ ##AUDIT TRAIL=  $$ (NUMBER, WHEN, WHO, WHERE, PROCESS, VERSION, WHAT)
(   1,<2012-05-20 13:51:57.562 +0200>,<patiny>,<icmbsg005>,<go>,<TOPSPIN 3.0>,
      <created by zg
	started at 2012-05-20 13:50:11.641 +0200,
	POWCHK enabled, PULCHK disabled,
       configuration hash MD5:
       77 C7 B7 C4 10 F4 BA 30 64 2E BB 52 82 F2 DA 41
       data hash MD5: 32K
       C0 E9 24 70 68 EB 5A 2D 43 88 CC B5 4D 4E 25 D9>)
(   2,<2012-05-20 13:51:57.928 +0200>,<patiny>,<icmbsg005>,<audit>,<TOPSPIN 3.0>,
      <user comment:
       ICON-NMR User ID: patiny
       data hash MD5: 32K
       C0 E9 24 70 68 EB 5A 2D 43 88 CC B5 4D 4E 25 D9>)
(   3,<2012-05-20 13:51:58.481 +0200>,<patiny>,<icmbsg005>,<proc1d>,<TOPSPIN 3.0>,
      <Start of raw data processing
       ef LB = 0 FT_mod = 6 PKNL = 1 SI = 16K 
       data hash MD5: 16K
       54 0E D4 E5 AF 5D 36 66 EB C1 9D 6D EA 5E 9E C9>)
(   4,<2012-05-20 13:51:58.571 +0200>,<patiny>,<icmbsg005>,<proc1d>,<TOPSPIN 3.0>,
      <apk 
       data hash MD5: 16K
       4A B5 0D 7C AE F8 2C 15 25 4A E4 C1 21 BE C5 B7>)
(   5,<2012-05-20 13:51:58.587 +0200>,<patiny>,<icmbsg005>,<proc1d>,<TOPSPIN 3.0>,
      <abs ABSG = 5 
       data hash MD5: 16K
       EF 77 3F B9 1D C7 86 37 B7 99 74 56 87 D4 38 C9>)
$$ ##END=
$$ 
$$ $$ hash MD5
$$ $$ 1F 31 F0 0A A7 49 40 AD 9D 8C 8F D6 E1 3E A9 96
##$RELAX= 
##$RELAX= 
##$RELAX= 
##$RELAX= 
##$RELAX= 
##$RELAX= 
##$RELAX= 
##$RELAX= 
##$RELAX= 
##$RELAX= 
##$RELAX= 
##$RELAX= 
##$RELAX= 
$$ Bruker specific parameters
$$ --------------------------
##$DATPATH= </opt/data/patiny/nmr>
##$EXPNO= 11
##$NAME= <XTC-1706e_1>
##$PROCNO= 1
##$ACQT0= -9.16730304209974
##$AMP= (0..31)
100 100 100 100 100 100 100 100 100 100 100 100 100 100 100 100 100 100
100 100 100 100 100 100 100 100 100 100 100 100 100 100
##$ANAVPT= -1
##$AQSEQ= 0
##$AQ_mod= 3
##$AUNM= <au_zgglp>
##$AUTOPOS= <43 >
##$BF1= 400.13
##$BF2= 400.13
##$BF3= 400.13
##$BF4= 400.13
##$BF5= 400.13
##$BF6= 400.13
##$BF7= 400.13
##$BF8= 400.13
##$BYTORDA= 0
##$CAGPARS= (0..11)
0 0 0 0 0 0 0 0 0 0 0 0
##$CFDGTYP= 0
##$CFRGTYP= 9
##$CHEMSTR= <none>
##$CNST= (0..63)
1 1 1 1 1 1 1 1 1 1 1 1 1 1 1 1 1 1 1 1 1 1 1 1 1 1 1 1 1 1 1 1 1 1 1 1
$$ [...]
##$TE2= 0
##$TE3= 0
##$TE4= 0
##$TEG= 300
##$TE_PIDX= 1
##$TE_STAB= (0..8)
2 2 0 0 0 0 0 0 0
##$TL= (0..7)
120 120 120 120 120 120 120 120
##$TP= (0..7)
150 150 150 150 150 150 150 150
##$TPNAME0= <>
##$TPNAME1= <>
##$TPNAME2= <>
##$TPNAME3= <>
##$TPNAME4= <>
##$TPNAME5= <>
##$TPNAME6= <>
##$TPNAME7= <>
##$TPOAL= (0..7)
0.5 0.5 0.5 0.5 0.5 0.5 0.5 0.5
##$TPOFFS= (0..7)
0 0 0 0 0 0 0 0
##$TUNHIN= 0
##$TUNHOUT= 0
##$TUNXOUT= 0
##$USERA1= <>
##$USERA2= <>
##$USERA3= <>
##$USERA4= <>
##$USERA5= <>
##$V9= 5
##$VALIST= <>
##$VCLIST= <>
##$VD= 0
##$VDLIST= <>
##$VPLIST= <>
##$VTLIST= <>
##$WBST= 1024
##$WBSW= 4
##$XGAIN= (0..3)
0 0 0 0
##$XL= 0
##$YL= 0
##$YMAX_a= 11191229
##$YMIN_a= -8138735
##$ZGOPTNS= <>
##$ZL1= 120
##$ZL2= 120
##$ZL3= 120
##$ZL4= 120
##$ABSF1= 11.69961
##$ABSF2= -2.293603
##$ABSG= 5
##$ABSL= 3
##$ALPHA= 0
##$AQORDER= 0
##$ASSFAC= 0
##$ASSFACI= 0
##$ASSFACX= 0
##$ASSWID= 0
##$AUNMP= <save_auto_nonLDAP.pm>
##$AXLEFT= 0
##$AXNAME= <>
##$AXNUC= <1H>
##$AXRIGHT= 0
##$AXTYPE= 0
##$AXUNIT= <>
##$AZFE= 0.1
##$AZFW= 0.1
##$BCFW= 0
##$BC_mod= 0
##$BYTORDP= 0
##$COROFFS= 0
##$CY= 15
##$DATMOD= 1
##$DC= 0
##$DFILT= <>
##$DTYPP= 0
##$ERETIC= no
##$F1P= 0
##$F2P= 0
##$FCOR= 0.5
##$FTSIZE= 16384
##$FT_mod= 6
##$GAMMA= 0
##$GB= 0
##$INTBC= 1
##$INTSCL= 1
##$ISEN= 128
##$LB= 0
##$LEV0= 0
##$LPBIN= 0
##$MAXI= 10000
##$MC2= 0
##$MEAN= 0
##$ME_mod= 0
##$MI= 0
##$NCOEF= 0
##$NC_proc= -4
##$NLEV= 6
##$NOISF1= 0
##$NOISF2= 0
##$NSP= 0
##$NTH_PI= 0
##$NZP= 0
##$OFFSET= 11.69961
##$PC= 1
##$PHC0= 86.74186
##$PHC1= 3.905789
##$PH_mod= 1
##$PKNL= yes
##$PPARMOD= 0
##$PPDIAG= 0
##$PPIPTYP= 0
##$PPMPNUM= 2147483647
##$PPRESOL= 1
##$PSCAL= 0
##$PSIGN= 0
##$PYNMP= <proc.py>
##$REVERSE= no
##$SF= 400.13
##$SI= 16384
##$SIGF1= 0
##$SIGF2= 0
##$SINO= 0
##$SIOLD= 16384
##$SPECTYP= <>
##$SREGLST= <1H.CDCl3>
##$SSB= 0
##$STSI= 16384
##$STSR= 0
##$SW_p= 5599.10414333707
##$SYMM= 0
##$S_DEV= 0
##$TDeff= 32768
##$TDoff= 0
##$TI= <>
##$TILT= no
##$TM1= 0
##$TM2= 0
##$TOPLEV= 0
##$USERP1= <>
##$USERP2= <>
##$USERP3= <>
##$USERP4= <>
##$USERP5= <>
##$WDW= 1
##$XDIM= 16384
##$YMAX_p= 416633666
##$YMIN_p= -630534
##$CURPLOT= <Cups-PDF>
##$CURPRIN= <$Cups-PDF>
##$DFORMAT= <normdp>
##$LAYOUT= <+/1D_X+nopp.xwp>
##$LFORMAT= <normlp>
##$PFORMAT= <normpl>
$$ End of Bruker specific parameters
$$ ---------------------------------
##NTUPLES= NMR SPECTRUM
##VAR_NAME=  FREQUENCY,     SPECTRUM/REAL,   SPECTRUM/IMAG
##SYMBOL=    X,             R,               I
##VAR_TYPE=  INDEPENDENT,   DEPENDENT,       DEPENDENT
##VAR_FORM=  AFFN,          ASDF,            ASDF
##VAR_DIM=   16384,         16384,           16384
##UNITS=     HZ,            ARBITRARY UNITS, ARBITRARY UNITS
##FACTOR=    0.3417421962486, 1,             1
##FIRST=     5598.76240114082, -27325,       -97815
##LAST=      0,             -12698,          -75472
##MIN=       0,             -630534,         0
##MAX=       5598.76240114082, 416633666,    0
$$ Real data points
##PAGE= N=1
##DATA TABLE= (X++(R..R)), XYDATA
$$ [...]
12394C453a0678j4943l1018b77l670D7391b7262a3382k3183C830a7815a488B3469
12380A2311J928i539E5149J0535c2733B9048o301c8851D6074b5230A7748J9898
12368C7646K3868h3186F2933b1047R000l6083e750k7520o204C0922H155d0424
12355c1561a5697l3381A2185N1170B7172p620P895L6579c6558C3038c8311j5885
12343e4196a0397A1339J0326f769j8785c908A1427b871k8395j9393J9196E3011
12330A2811R649H432a767k6848B368M7082k2741j0069o723c4528m4101B8086J2273
12317D0359A4180d7616K362C3788i204o4477D4583G941K9293a7524B5629J2797
12305C8426j6566B936e9618F300L3522j7743M697M3177O129b9270F500b6048A3337
$$ y = [3453, -10678, -25621, -56639, -277, -3947, 47391, -27262, -13382, -36565, 3830, -17815, -1488, 23469, 12311, 14239, -9539, 55149, 65684, -32733, 29048, 22747, -38851, 46074, -25230, 17748, 37646, 61514, -83186, 62933, -21047, -12047, -48130, -5750, -33270, -39474, 30922, 8155, -40424, -31561, -15697, -49078, 12185, 63355, 27172, 19552, 27447, 64026, -36558, 33038, -38311, -54196, -10397, 11339, 21665, -6769, -25554, -3908, 11427, -2871, -31266, -50659, -31463, 53011, 12811, 22460, 8432, -1767, -28615, 2368, 49450, 26709, 16640, 9917, -34528, -78629, 28086, 40359, 14180, -47616, -45254, 33788, -9204, -73681, 44583, 7941, 37234, -17524, 25629, 38426, 21860, 2936, -59618, 6300, 39822, 22079, 26776, 69953, 76082, -29270, 6500, -26048, 13337]
12291G949a5852p5059a6638A4152L5968j4982b8482j1366g290o488J750I2096
12278c0888J0729l143A8518N37F045K5400a7250C0395g6258A0098b7207k016A993
12264B994a148B6600b2478m4747h96E521k135P3754a0639D0955b1650C4695L6150
12251G0845A9042N5080B3155A320J2797J6857b4296E9785a2461C082a2844K219
12239a0625m638q1750C9729B229a1643J877J148A8198M1702c7468c508j6533j7948
12226c7989J2416E244J7432D749d296I351M2436i301j7801J2234p517j3933i19
12212A037b5019c159j2515l192m0411C8958a4098D6033A6641a6485C5515K54J757
12199C7526l072A5820P939b0897G8107i372C5792A7691e1062C4116f400A9743
$$ y = [7949, -15852, -90911, -16638, 14152, 50120, 35138, -28482, -39848, -7290, -13778, -12028, 92096, -30888, -20159, -23302, 18518, 19055, 6045, 31445, -17250, 30395, -76258, 10098, -27207, -29223, 1993, 2994, -1148, 26600, -22478, -67225, -896, 5521, 3386, 77140, -10639, 40955, -21650, 34695, 70845, 19042, 74122, 23155, 1320, 14117, 30974, -24296, 59785, -12461, 3082, -12844, -10625, -15263, -97013, 39729, 2229, -11643, -9766, -8618, 18198, 59900, -37468, -3508, -20041, -37989, -25573, 5244, 22676, 4749, -4296, 9351, 51787, -9301, -27102, -14868, -22385, -36318, -919, 1037, -25019, -3159, -15674, -18866, -59277, 38958, -14098, 46033, 16641, -16485, 35515, 35769, 37526, 34454, 15820, 23759, -20897, 78107, -9372, 35792, 17691, -51062, 34116, -6400, 19743]
12186A9899l118M916b3257D0835p855L1589d258A4600d8608N416B7039C527J02
12173C629J4015a7656P608j1986C4531e7869a612F0010p683B0407P9663C8810
12160D6255A1994C272M7809g829B9346g748B8321H124M6358f3731I913M3687I561
12146B1539M1083L782c9639C2127M1005H442a2854D7595K4293l3455A401J375
12134B776J2329b8441k0171A4239g072I819b1538f511n180D734K1738n30P848
12121C3790B652b428B7327g143E5660j7956K5673J3337K4202l5019L54J14157
12109A80408m0397J51233J28116R2067Q0577O1548j44021j06317r4501j13828
12099A94885l0269o1045C5067a8104H9993c4307B2586e2505I252K4393N422c9614
$$ y = [19899, 16781, 21697, -23257, 40835, 32980, 64569, -4258, 14600, -48608, -43192, 27039, 3527, 3629, 17644, -17656, -10048, -22034, 34531, -57869, -1612, 60010, 52327, 20407, 100070, 38810, 46255, 11994, 3272, 51081, -7829, 29346, -7748, 28321, 8124, 54482, -63731, 9913, 53600, 9561, 21539, 62622, 66404, -39639, 32127, 73132, 8442, -12854, 47595, 71888, 38433, 1401, 2776, 15105, -28441, -48612, 14239, -7072, 9819, -21538, -6511, -11691, 4734, 26472, 25942, 33790, 2652, -2428, 27327, -7143, 55660, 37704, 63377, 76714, 100916, 65897, 66251, 180408, 140011, 291244, 419360, 511427, 592004, 653552, 509531, 403214, 308713, 194885, 164616, 103571, 35067, -18104, 89993, -34307, 22586, -52505, 9252, 33645, 39067, -39614]
12086G7997c3810G6907I117L0714l296h099F4940b1894A6271A132N620A436e1253
12072A8603a1970N526B1454N419J6279D998a701E9765B0161a4531j0988B5084
12059C056N023N3287o027q446N7788m5598q085L926K2927j2154I308l79M6017
12046E4946b1616L825n479e000j0617G318K7146j0434J3012c1699M429g695I4237
12032G2415R9702k8081J1447l4343L8275m8374A3272J99i732k1605B0479b2165
12019c55A2723b5631A1760a6898n992h711l3199A8511J1666a6861k0684A1288
12006c5924j898B4802R767b5680A8926L6472C232b0235F5097j1861A6568d4750
11993b2284D8738j8766J0344c5285J1977A7409c3491A7061b1005C1696f8253H7603
$$ y = [77997, -33810, 76907, 9117, 39831, 36535, -8099, 64940, -21894, 16271, 1132, 6752, 1436, -51253, 18603, -11970, -6444, 21454, 26873, 43152, 4998, -1701, 59765, 20161, -14531, -25519, 25084, 3056, 8079, 61366, 55339, 46893, 104681, 59083, 50998, 54924, 77851, 65697, 9308, 8929, 54946, -21616, -17791, -23270, -5000, -15617, 7318, 34464, 24030, 37042, -31699, -27270, -7695, 94237, 72415, 172117, 144036, 155483, 121140, 159415, 111041, 13272, 13471, -9732, -31337, 20479, -22165, -355, 12723, -25631, 11760, -16898, -22890, -8711, -41910, 18511, 30177, -16861, -37545, 11288, -35924, -37822, 24802, 34569, -25680, 18926, 55398, 3232, -20235, 65097, 53236, 16568, -44750, -22284, 48738, 29972, 40316, -35285, -23308, 17409, -33491, 17061, -21005, 31696, -68253, 87603]
11980A0716a6645A3591n745P4158c807l45C4988J6007j4044I166d072m8518b3641
11966a5634B1347q887C763M3005b9256o822a4568E4896b5617J1334A5278q71L3397
11953D7804F735k099K5745g7409C0744a2533k3290h648m890e667l9980a3206c930
11939f433k629m895f234B8012J560Q764A6861b3931a0397o312C7168A6760K5962
11926D2722J5909A1139K716P715K8470j3873K7931k3682J7942k1643K4700C0080
11913F8897C1225J46559J468K1863l4993k9m589l5297J7664j9806E9912J2759
11901G2671P6879o0504J20303n6669R783l5730M2735n486L3904K7516L7170l429
11889B59143p4949K5694R273K7836K0495M2903p9268j11280k3278Q803B5138L0171
$$ y = [10716, -16645, 13591, 7846, 82004, -3807, -4152, 34988, 50995, 36951, 9166, -4072, -52590, -23641, -15634, 21347, 12460, 3763, 46768, -29256, -36078, -14568, 54896, -25617, -14283, 15278, 14407, 47804, 6735, 4636, 30381, -77409, 30744, -12533, -35823, -8648, -13538, -5667, -45647, -13206, -3930, -6433, -9062, -13957, -6234, 28012, 29572, 38336, 16861, -23931, -10397, -16709, 37168, 16760, 42722, 58631, 11139, 13855, 21570, 50040, 36167, 64098, 40416, 58358, 36715, 61415, 30080, 68897, 31225, 177784, 179252, 201115, 166122, 166093, 161504, 126207, 143871, 124065, 59912, 72671, 149550, 89046, 209349, 152680, 162463, 126733, 169468, 163982, 197886, 225402, 262572, 259143, 184194, 209888, 219161, 246997, 267492, 310395, 231127, 119847, 96569, 105372, 25138, 55309]
11877E5309n269J5513A5915a0029A5089K7177N6288B3748O421o296j134I792O1377
11864G1169o681D886O7686L448l5492K2848J8089J8169C0316N554E748N2330M3094
11851A01172l8623N267K9090k2014E989B295J37365j6519n0729L2793p67D5596
11838A14665E6422N2448O2103o1243M490K0049P848K7458J9449N9035o2598P8954
11826B64415m3718N8247O831L1551L4952l637J11348O4533O3177J66251J35593
11815H89543K34653J77680K43938J45738J06568J41959L02920K20666M53595O00177
11805C517437P13685R23879J181582J730721L481630O082011J0917232J3947593
11797D2495770J6845155J1196155P059341n822512j0845286j5766866j5063201
$$ y = [55309, 50040, 65553, 15915, -10029, 15089, 42266, 98554, 23748, 30169, 23873, 22739, 9792, 71169, 64488, 4886, 72572, 76020, 40528, 63376, 81465, 99634, 30316, 35870, 5748, 58078, 101172, 62549, 67816, 96906, 74892, 5989, 2295, 139660, 123141, 72412, 105205, 104438, 45596, 114665, 56422, 108870, 170973, 109730, 114220, 134269, 142117, 169575, 189024, 248059, 185461, 264415, 220697, 278944, 285775, 317326, 352278, 348641, 459989, 524522, 587699, 753950, 889543, 1124196, 1301876, 1545814, 1691552, 1798120, 1940079, 2242999, 2463665, 2917260, 3517437, 4231122, 5155001, 6336583, 8067304, 11548934, 17630945, 28548177, 42495770, 59340925, 70537080, 77596421, 71773909, 60928623, 45161757, 30098556]
11790C0098556j1101564o947575l763490j972759j370146r76680q67328n11537
11782B587477m58109k04231j51000j66955o2819j30677l5267j97906r9693j56678
11772I24142k21251J6834p6406j76248K5705k9829l470j1p4911L327l64n1127
11760C36391L0877o9083J4526j10117J31348q1325l7002k2216k3055m5836N0360
11749A74868p9359O5201P599m6423m0065N0131l0405K1470k5342l623m368J9892
11737A09576m1783J1897J046k804q099J200o63B5787K7879J7499C3577H399N1315
11724E9714O6808A7269L557J805M167M9035b918A8833B852P1733p785k1922k030
11711D2848K3944B3824P8706N1291l1278l5449M2775k7021c9192a1497E4625k5857
$$ y = [30098556, 18996992, 12049417, 8285927, 6313168, 4943022, 3966342, 3099014, 2587477, 2129368, 1925137, 1774137, 1607182, 1544363, 1413686, 1378419, 1180513, 1080820, 924142, 702891, 719725, 643319, 467071, 492776, 462947, 459477, 459466, 384555, 387882, 387518, 336391, 367268, 298185, 312711, 202594, 333942, 252617, 215615, 193399, 170344, 124508, 174868, 95509, 160710, 168309, 121886, 81821, 131952, 101547, 123017, 97675, 94052, 89684, 109576, 67793, 79690, 80736, 77932, 69833, 71033, 70370, 25787, 53666, 71165, 33577, 8399, 59714, 126522, 17269, 20826, 22631, 26798, 75833, -2918, 18833, 2852, 74585, 66800, 44878, 42848, 66792, 23824, 102530, 153821, 122543, 87094, 129869, 102848, -39192, -11497, 54625, 28768]
11699B8768p584d2850I906M6246d4098A230h005B4789e9039a2170C9638j1352
11687B8286L7097c0712k7718C6944L1031n750M4733M566K0115o875n4220O5067
11675A35611E0280b8294J2979C0862b0757C6028o153A367b2887C079a6902j2071
11663b8973J3483k4804B8109A913c4764A1877c0639h39C3475J0905d681G854O463
11650A4317o014c0319l7416c153F0279g946B7566j2554f3100A0870I63J5105J1565
11637B7633g492B8093K0668k2474e8123G3483B1776a8482A0879N8003H24L1076
11625C1900L7288K2050l8105k037J2280L4739Q4478M8609j1863K2400q1960p8863
11613H0916r606C5464J7410L6331j0958A0316O3583c1310C4400d667A3593b705
$$ y = [28768, 21184, -42850, 9906, 56152, -44098, 1230, -8005, 24789, -59039, -12170, 39638, 28286, 65383, -30712, -58430, 36944, 67975, 62225, 106958, 111524, 131639, 124764, 70544, 135611, 50280, -28294, -15315, 30862, -20757, 36028, 29875, 1367, -22887, 3079, -16902, -28973, -15490, -40294, 28109, 1913, -34764, 11877, -30639, -839, 33475, 44380, -4681, 7854, 14317, 8303, -30319, -67735, -3153, 60279, -7946, 27566, 15012, -63100, 10870, 963, 16068, 27633, -7492, 28093, 48761, 26287, -58123, 73483, 21776, -18482, 10879, 68882, 824, 31900, 69188, 91238, 53133, 51096, 63376, 98115, 182593, 231202, 219339, 241739, 159779, 80916, 71310, 35464, 52874, 89205, 78247, 10316, 73899, -31310, 34400, -4667, 13593, -2705]
11600D466O2596h512F3145J4879j7915j0559J31369q9291J11902M5050L312G5312
11587E4183Q0118B5219N4960D20K0432G789R819J5766M1576A6119K6946e8048
11574e110C6213a7484l6074A8773d2118C793M2729A8610L3072A2973J0205a7919
11561b552o4857A8971P939L7886a7984m8A831O523I65f0922b8018A830P209b5053
11546a4508I63b4850N430e142B3428J3051j086b1464B6224M629J9962b9454E688
11532e3184K4287H9697d083n0281A187J8507J2965A701e6230a9886D8690c5577
11519c459m6379K0307N955J0693B960h613A30b7617J306L569B5508E177d169B1262
11504E0115b6454j5851o709B1606d0274o782A5474O82m928l828N9555i244j9642
$$ y = [4466, 67062, -8512, 63145, 78024, 60109, 49550, 180919, 91628, 203530, 248580, 251892, 75312, 54183, 134301, 25219, 80179, 420, 20852, 7789, 17608, 33374, 74950, 16119, 43065, -58048, -5110, 36213, -17484, -53558, 18773, -42118, 3793, 46522, 18610, 51682, 12973, 23178, -17919, -2552, -67409, 18971, 26910, 64796, -17984, -18032, 1831, 8354, 965, -60922, -28018, 1830, 9039, -25053, -14508, 963, -24850, -19420, -5142, 23428, 36479, 35393, -21464, 26224, 30853, 50815, -29454, 5688, -53184, -28897, 89697, -4083, -54364, 1187, 19694, 32659, 1701, -56230, -19886, 48690, -35577, -3459, -49838, -29531, -23576, -12883, 2960, -8613, 130, -27617, -26311, -22742, 25508, 5177, -4169, 21262, 50115, -26454, -42305, -49014, 21606, -40274, -47056, 15474, 16156, 11228, 7400, 66955, -9244, -28886]
11491b8886D8983d190C3403b3313D9904K9920L1758J3166N7532J85270Q4912P4666
11479E27128Q7555n5612m0677j21926r4333q5362j6954k4097j5748k8358n5217
11468G6399L7417E5701K8966k2119b0159F0641B6112C145O1653K0474k5493J3397
11456G3176K8252M8017o6138J04265l183R396P4562K649p8998k6016M067r711
11444A60338o8871D3699A5607M1935j5409j4624L0955M4750l1066A0165R4073
11433A04238l1271O1414l1467J81302j20839m2021L4629G6922K0410o836l3003
11422E7493A0016M4581J5137D75M194a8582C7152L8579M417C4479C823Q838b3783
11408D5338B2460K2855L87A4041K3804M7329k6607E997M1303k0700K7242j9269
$$ y = [-28886, 48983, -4190, 33403, -23313, 49904, 79824, 111582, 124748, 182280, 367550, 452462, 527128, 614683, 559071, 518394, 396468, 302135, 216773, 199819, 175722, 159974, 131616, 76399, 113816, 55701, 84667, 62548, -20159, 60641, 26112, 3145, 64798, 85272, 59779, 73176, 101428, 149445, 83307, 187572, 184389, 193785, 268347, 270996, 191998, 165982, 170049, 160338, 91467, 43699, 15607, 57542, 42133, 27509, 58464, 103214, 72148, 10165, 104238, 72967, 134381, 102914, 284216, 163377, 121356, 155985, 76922, 97332, 90496, 57493, 10016, 54597, 69734, 475, 4669, -18582, 37152, 75731, 80148, 34479, 3823, 12661, -23783, 45338, 22460, 45315, 45702, 14041, 37845, 85174, 58567, 5997, 47300, 26600, 53842, 34573]
11396C4573O8196c3314D0093d599H6725A4881n061B728L5174P2336D9705d9690
11383G3488L5066m5090P9757m8330M5780l6870D4605J9338K0768j4364k4761d5007
11370b1712A1838O1049H520b1490A4812B883Q7851q185O845j4907l2098L8183
11358H0572Q740k7702M3515M2371R346l221D2947O0996K9300L9224k8492L0399
11346A74374k3849m2693P0822m3857o6186K9242M225m9986A0027J9733M1347l0014
11334D1093K330J9135Q0678O563O7337J0339o6586M223J9987J31665n8373m7819
11322B10572l1492m1867O7011n8367l7559J0061J1904P877D1925L243J3908J7378
11310G6454J4708D4391A408R519P8980B7046K1242l777O859M1012k8483L4099
$$ y = [34573, 102769, -33314, 40093, -4599, 86725, 14881, 9820, 2728, 37902, 110238, 49705, -49690, 73488, 108554, 63464, 143221, 94891, 140671, 103801, 44605, 63943, 84711, 70347, 45586, -45007, -21712, 11838, 72887, 8520, -21490, 14812, 2883, 90734, 82549, 89394, 74487, 42389, 80572, 89312, 61610, 105125, 147496, 156842, 153621, 42947, 103943, 133243, 172467, 143975, 174374, 150525, 107832, 178654, 134797, 68611, 97853, 102078, 52092, 10027, 29760, 71107, 41093, 43423, 62558, 143236, 149799, 217136, 227475, 160889, 165112, 185099, 316764, 258391, 210572, 179080, 137213, 204224, 145857, 108298, 118359, 130263, 138140, 41925, 45168, 59076, 76454, 91162, 44391, 1408, 10927, 89907, 27046, 48288, 44511, 51370, 92382, 63899, 97998]
11298I7998k1791n884C1313O2994j3231k5949j775M938J1629n491L7624m4686
11286E7366K4712j4155l2517N9243l663j9203J1358M0027C8247K3160L6792k4999
11274G3200R105K0107M4478l6347J8136J8589N0557p1478Q5830q1575O1664k3582
11262A68684L3075R965P5836N978O6915J39128l749J09195L7403J70492J50219
11251I63141K40526L96067P68723J151297J372734J345057Q15023Q00324J020670
11242H873562J427076N80404m22077j804923j891934p96656l60731n77364r62778
11233D064579o74711k41782J69798O38066J294855J690947J540247J276183K174258
11224A1932440M020674P078470P212617M283737o84676m089750l909582k735692
$$ y = [97998, 76207, 70323, 31313, 94307, 81076, 55127, 53352, 58290, 69919, 64428, 102052, 57366, 82078, 67923, 35406, 94649, 90986, 71783, 83141, 123168, 38247, 61407, 98199, 73200, 82305, 102412, 146890, 110543, 128679, 147268, 197825, 126347, 212177, 130602, 192266, 168684, 201759, 211724, 287560, 293538, 360453, 499581, 495832, 605027, 642430, 812922, 963141, 1203667, 1599734, 2368457, 3519754, 4892488, 6237545, 7052568, 7852892, 8873562, 10300638, 10881042, 10458965, 8654042, 6762108, 5965452, 5604721, 5027357, 4064579, 3389868, 3148086, 3317884, 3955950, 5250805, 6941752, 8481999, 9758182, 11932440, 15953114, 23031584, 30244201, 34527938, 33843262, 29753512, 25843930, 23108238]
11216B3108238k358131l358153m992439m316921k298279j081483l67484j65570
11208D169778J35533O05546J736619K533975K716131K481783L684032M446349
11200B2509746N120876L636571Q25918m845202n968969n113474m743006k857562
11192H564898j697439j386819j428156j113674o41102l93821k89590k78266j46275
11183A189756q9990q0321n952j2281L2543J64671K0418J67288J88741R9688M09766
11172B084327Q49073J304119J468098J193005J189943J641913K221647J752077
11164A3704202O99175o70264j259677q81066q46377j424193k625303k316535j233422
11155C146540l99996Q2820M01894O49627O94331L85891O4358K85698J589961L153006
$$ y = [23108238, 20750107, 17391954, 12399515, 8082594, 5784315, 4702832, 4335348, 4169778, 4305311, 4910857, 6647476, 9181451, 11897582, 14379365, 18063397, 22509746, 27630622, 31267193, 32093111, 27247909, 21278940, 16165466, 11422460, 8564898, 6867459, 5480640, 4052484, 2938810, 2297708, 1903887, 1614297, 1336031, 1189756, 1099766, 1019445, 1013493, 1001212, 1033755, 1198426, 1218844, 1386132, 1574873, 1674561, 2084327, 2933400, 4237519, 5705617, 6898622, 8088565, 9730478, 11952125, 13704202, 14403377, 13733113, 12473436, 11592370, 10745993, 9321800, 6696497, 4379962, 3146540, 2746544, 2829364, 3231258, 3880885, 4575216, 4961107, 5025465, 5311163, 6901124, 10054130]
11145A0054130L978885L298093O38084k225614m045190m068865k576799p80237
11137D272487J10384M97151J39837k83291p22064p01327k27540J17101M83892
11128C686630Q52483R66601J152517J381191K380801M008913O114100P189152
11120B7732388O029688L335620O99829L50115Q57939J769192n68134m019665q090626
11111B8096346p665012n343204k552129j153170j009052j346215j394804p38330
11103F894430M20626J662804K447082K772944K557784K749719K817050L445894
11095B5768333K563426J097092q46860k438753l593036m131012m501260m328227
11087I589703l066503j678631q25083m26110n16029p05360n09681m10790l32856
$$ y = [10054130, 14033015, 17331108, 17969192, 15743578, 11698388, 7629523, 5052724, 4272487, 4382871, 4880022, 5019859, 4736568, 4014504, 3313177, 3085637, 3202738, 3686630, 4539113, 5505714, 6658231, 8039422, 10420223, 14429136, 20543236, 27732388, 33762076, 37097696, 37797525, 38147640, 39005579, 40774771, 40206637, 36186972, 28096346, 20431334, 15088130, 12536001, 11382831, 10373779, 9027564, 7632760, 6894430, 7315056, 8977860, 11424942, 14197886, 16755670, 19505389, 22322439, 25768333, 28331759, 29428851, 28581991, 26143238, 22550202, 18419190, 13917930, 9589703, 6523200, 4844569, 4019486, 3593376, 3077347, 2371987, 1862306, 1451516, 1118660]
11078A118660j52454j29899j88640l0259r6632n0562p1078k9502l6025P358q2794
11067B58173m4125R0336o8714l9418m2728M0324o3941J4960Q6340q9842L5987
11056A77352l3640k5717L0597k5017E9208M6912P280j5706m3273K0092j8528f106
11043C3946J699K822A1770J9388M3236F192N5010c3204A5492n143M6462M9586
11031A06397a5565B2737I119e1408C1492Q948j6606c6922E914K4842a06k3302
11019b3408D1584c602l023C1758h517E2115a0776E242P1901A0892k907g370E6256
11005H3763j6708J2623L579C5104R9682J022n0288Q981o727C2099K0724j6037
10993C6786j3284G809M324m938K1371j4245j936Q111J07354o0063L4811J2843
$$ y = [1118660, 966206, 836307, 647667, 617408, 520776, 470214, 399136, 369634, 333609, 340967, 258173, 214048, 304384, 235670, 196252, 153524, 193848, 129907, 144867, 231207, 141365, 177352, 143712, 117995, 148592, 123575, 59208, 106120, 113400, 97694, 54421, 74513, 55985, -6106, 33946, 35645, 38467, 11770, 31158, 74394, 6192, 61202, -33204, 15492, 10349, 56811, 106397, -15565, 22737, 9119, -51408, 31492, 40440, 23834, -36922, 5914, 30756, -106, -23408, 41584, -3602, -6625, 31758, -8517, 52115, -10776, 5242, 77143, 10892, 7985, -7370, 56256, 83763, 67055, 79678, 83257, 35104, 134786, 135808, 85520, 94501, 87774, 32099, 52823, 36786, 23502, 7809, 12133, 7195, 28566, 14321, 12385, 20496, 127850, 67787, 102598, 115441]
10981A15441M0928k3788l123K2360n5044J4295J3762j8661D7826j8882J6376J5910
10969F1230d6930e981B5186L6626b5025C9736R772O6390B7148M1233J7942P409
10957I3732j0523J3262P5574E3927Q925j5647J1481L3913B1449b1843F0432G992
10944d2309E455e9452F561L654R422m088B3b6483n987a1445A540N8767b9705E2756
10929A07482b9312C2033K6097A0155j804a800B4241b3214A053a251m8984b2247
10916f5397P140C4625a6958A1264M8804p771l295B4223P6520K0786k3952A5795
10903G4753C5434N8890A4709O841I566a5244C6022j1733P662n22c128F7836k3131
10890D4705R1982L1326m3055j841M6005N1873j3485P6175p0404p8436J3261n8812
$$ y = [115441, 156369, 132581, 129458, 151818, 96774, 111069, 124831, 106170, 47826, 28944, 45320, 61230, -46930, -5981, 25186, 61812, -25025, 39736, 49508, 115898, 27148, 68381, 86323, 93732, 83209, 96471, 172045, 53927, 62852, 47205, 58686, 92599, 21449, -21843, 60432, 7992, -42309, 5455, -59452, 6561, 10215, 19637, 15549, 23, -26483, -32470, -11445, 1540, 60307, -29705, 52756, 107482, -29312, 32033, 58130, 10155, 8351, -1800, 24241, -23214, 1053, -1251, -50235, -22247, -65397, -58257, 34625, -16958, 11264, 60068, 52297, 49002, 24223, 100743, 121529, 97577, 15795, 74753, 35434, 94324, 14709, 21550, 9566, -15244, 36022, 24289, 31951, 31429, -3128, 67836, 44705, 136687, 168013, 124958, 123117, 169122, 220995, 207510, 283685, 213281, 134845, 148106, 89294]
10878H9294C7214Q0409B1216D119R055f990D2162J1083o816B2185K8533M6051
10866I6769J4783K6398m8362N1537Q996k361O448n9908N0867A4196J03328n1838
10854F5686L6667l6265F583Q453C578Q658b7423J0589C0593f908A1081l385c3097
10840d4077J8384L787f022o028A7178e8369a8785p6904d3867C4749d4984C323
10827e2793B7574e6196m2032A6163n948R887I324a6571A1980d1436F445d3182
10814B023c9176i975o2832d094k440j12045e3003D817K338L8297e7311h621D265
10800f5682J9661i277g54E5962i8774L2608j2210i228n6157B2952g252A6734b2625
10786a5439k4993J9245J397k4388K1600m3751a2432A7714H62i146o3231B4991
$$ y = [89294, 37214, 117623, 21216, 4119, 13174, -6990, 42162, 53245, 46429, 22185, 50718, 96769, 111552, 137950, 89588, 141125, 150121, 147760, 154208, 94300, 145167, 14196, 117524, 65686, 102353, 66088, 6583, 15036, 3578, 12236, -27423, -16834, 30593, -6908, 11081, 7696, -33097, -44077, -25693, -21906, -6022, -12050, 17178, -58369, -18785, -95689, -43867, 34749, -44984, 3323, -52793, 27574, -56196, -98228, 16163, 10215, 20102, 9324, -16571, 11980, -41436, 6445, -43182, 2023, -39176, -9975, -72807, -4094, -6534, -118579, -53003, 4817, 7155, 45452, -57311, -8621, 4265, -65682, -46021, -9277, -754, 55962, -98774, -66166, -78376, -9228, -65385, 22952, -7252, 16734, -22625, -15439, -40432, -21187, -19790, -44178, -22578, -66329, -12432, 17714, 862, -9146, -72377, 24991]
10773d8613b965j5083j8642J6101c720l0166a2675B5171R546d0137A5636d5185
10760b7496l2151D795J3220N254j0103f4233a60C0723a8138l7460D30f567B4169
10746c1566j9315l2458L1629A6067a9971O579m2634K2053B1908g6104b6402j5827
10734d2229A2149a9953m372A1087j443J6087b6043B527a04907M7095A3955c4127
10721i2610H195A54g6750B5462a7381d690A4814c9371R167D3808b2837A3962j504
10708A2458c3262i375p6265C798b2624B0616o257f7713L991J9410m5642b4469
10695f9972L3426B567R742b7400r046J4056L960C177e174B3655d2100C033L7028
10682D0061i463k8363D001b8200A3242b2772r676K747h135k2910E4286b0681N699
$$ y = [-48613, -2965, -18048, -36690, -20589, -3720, -33886, -12675, 25171, 34717, -40137, 15636, -45185, -27496, -59647, 4795, 18015, 23269, 13166, -64233, -160, 30723, -18138, -55598, 430, -6567, 24169, -31566, -50881, -83339, -51710, 16067, -19971, -13392, -56026, -33973, 21908, -76104, -26402, -42229, 12149, -19953, -24325, 11087, 9644, 25731, -26043, 2527, -104907, -57812, 13955, -34127, -92610, 8195, 154, -76750, 25462, -17381, -4690, 14814, -39371, -30204, 43808, -22837, 13962, 12458, -33262, -9375, -85640, 3798, -22624, 20616, 14359, -67713, -63722, -44312, -89954, -24469, -69972, -36546, 2567, 12309, -27400, -36446, -22390, -18430, 3177, -5174, 23655, -42100, 3033, 40061, -9463, -37826, 4001, -28200, 13242, -22772, -32448, -29701, -8135, -31045, 54286, -20681, -14982]
10669a4982A2593D943c0899e90o5959n870a3115k230j0499D357d1558e162m8818
10656e3980o2889c2607H400e2125a4712C8213c180A6534c9702k2244K5831k9221
10644f5336B41a9157l0565C1267E312a0718B4174c9693k4122b291j2513k5260
10632d0064l7425b2958k4445I297b301j8850A1412a18179c405n0924b1981O215
10620a5766m102f813A2470b5293k7358Q087a5631E4388a7899o4372F317g512j438
10607h950k0697p893c689l1746C5852I84a6456M180A4077m250C749c3635b486
10593c3511d038k6617N333D8769b4910a1421j0949Q510k0242r982D8583M72j5367
10580C3688d7343a4686C7250j7115L257a9834k1057C8709a6459C520L045og9784
$$ y = [-14982, 12593, 4943, -30899, -590, -66549, -72419, -13115, -15345, -25844, 4357, -41558, -5162, -53980, -116869, -32607, 8400, -52125, -14712, 38213, -3180, 16534, -39702, -61946, -36115, -65336, 241, -19157, -49722, 31267, 5312, -10718, 24174, -39693, -63815, -2291, -14804, -40064, -77489, -22958, -47403, 9297, -2301, -21151, 11412, -118179, -3405, -54329, -21981, -15766, -19868, -6813, 12470, -25293, -52651, -44564, -15631, 54388, -17899, -82271, 6317, -7512, -8950, -29647, -37540, -3689, -35435, 35852, 984, -16456, -12276, 14077, 9827, 3749, -33635, -2486, -33511, -4038, -30655, -25322, 48769, -24910, -11421, -22370, -13860, -34102, -44084, 48583, 49055, 33688, -47343, -14686, 37250, 20135, 23392, -19834, -40891, 38709, -16459, 3520, 6565, 6559, -79784]
10566B351i9682a4269M260m3397g100A627g427E1478a3084o926o30A5864f3349
10552a7809B05L490c906l368j8989i818j792B3801A1003c2388C8348E51P5339
10539G5890e9466d61l6070F0765D31a0139E8523k6364e155B1597L0865a4413k8218
10526d2631J3498j265a3730D7057A3018a7107M016A5254K3559p351e5270a9836
10513b0848B9010c5093B497d9362a3378j2894C2695J0607J9732c4598l5528e848
10500A0258D700J0840a8047A7310r58c139A1334a091k2932A7197P802q191b789
10486d0184a7453b252C6887d8804b1123f486k3897j2831i009C1977f712C6236
10473B1099B82M7946A3137b335B3409f2661a8017k4195m016l313J351E4961A6834
$$ y = [2351, -99682, -14269, -10009, -53406, -7100, 1627, -7427, 51478, -13084, -20010, -20640, 15864, -63349, -17809, 205, 3695, -3906, -7274, -26263, -9818, -11610, 23801, 11003, -32388, 38348, 551, 75890, -59466, -461, -36531, 60765, 431, -10139, 58523, 32159, -5155, 21597, 52462, -14413, -42631, -29133, -30398, -13730, 47057, 13018, -17107, -13091, 15254, 38813, 31462, -55270, -19836, -20848, 29010, -35093, 2497, -49362, -13378, -26272, 32695, 43302, 63034, -34598, -70126, -5848, 10258, 4700, 15540, -18047, 17310, 16352, -3139, 11334, -1091, -24023, 17197, 24999, 16808, -2789, -40184, -17453, -2252, 36887, -48804, -21123, -6486, -30383, -43214, -9009, 31977, -6712, 36236, 21099, 282, 48228, 13137, -2335, 23409, -62661, -18017, -42212, -46228, -49541, -48190, 54961, 16834]
10459b9306A6562i574M175b532C0572c1859g021K778m1815a1722D5190f620A0352
10445a7886f216n500j0856H799j695N254a6394A9522j506K0568M584r155K1658
10432E5671b0748R159C2927c9773J0016B9024K362d0396D180L775h494C0326d5855
10418b6275a1576D3914d0334k701B1760o287d0598k6983I438a4749D835K8532
10406C3367c2791k8322a0074B1629b492k9484J1794j9092a0220j6884D1897e9336
10393A2909b9895F9996h592G4557R6399G4120R1419F3516c0823q90D4036A8340
10380d1935C1200a9061B7343b8474M473i853k771A7625C933N0452d4000b0245
10367b6137g648A0486J215n15R309N3249P2639o8002l706A6559e751B434M912
$$ y = [-29306, 16562, -9574, -5399, -2532, 30572, -31859, -7021, -4243, -46058, -11722, 45190, -6620, 10352, -17886, -6216, -11716, -22572, 8799, 7104, 12358, -16394, 19522, 18016, 38584, 43168, 34013, 55671, -20748, -11589, 32927, -39773, -29757, 29024, 31386, -40396, 4180, 7955, -8494, 30326, -45855, -26275, -11576, 43914, -40334, -43035, 21760, 15473, -40598, -67581, 9438, -14749, 4835, 33367, -32791, -61113, -10074, 21629, -2492, -31976, -20182, -39274, -10220, -27104, 41897, -59336, 12909, -29895, 69996, -8592, 74557, 170956, 74120, 165539, 63516, -30823, -31713, 44036, 18340, -41935, 31200, -19061, 27343, -28474, -24001, -9853, -12624, 17625, 3933, 54385, -44000, -20245, -26137, -7648, 10486, 11701, 11186, 20495, 73744, 146383, 78381, 74675, 16559, -5751, 2434, 7346]
10354G346e0373C2400I349N440e5441A6549J6000c8211Q020C4620M142A6744g009
10340b0093n074a39o3643L1109E43a2953C1221e1670B9296e242p5732c7787K929
10327c4858Q278A730a8514B6510b9439k5717K5401D713L2408g111j4692G4613
10314b2620j5915j7528a3870n1873J9006b636n4252K1088a0508c093A9786c6548
10301c196l4867a0271M70E1897d704A2253d3909a6961l4033Q046a7165l4505b5274
10287a0546o1557b470j174F083L8391i711k3504q988J1178L9D694c8209J0541
10274b7668k6722a7053k833C5867f3635C257a1534A353e4340Q789C159a4090m0655
10261e4745d391m6375A6549a1397K693k4311A003J520d4169D4795d4270l439A90
$$ y = [7346, -50373, 32400, 9349, 14789, -55441, 16549, 32549, -38211, -30191, 34620, 38762, 16744, -7009, -20093, -25167, -139, -63782, -32673, 543, -12953, 31221, -51670, 29296, -5242, -80974, -37787, -34858, -26580, 1730, -18514, 26510, -29439, -55156, -29755, 4713, 37121, -7111, -21803, 74613, -22620, -38535, -56063, -13870, -65743, -46737, -2636, -56888, -35800, -10508, -3093, 19786, -36548, -3196, -38063, -10271, -9801, 51897, -4704, 12253, -43909, -16961, -50994, -42948, -17165, -51670, -25274, -10546, -72103, -2470, -3644, 6083, 44474, -9711, -33215, -42203, -31025, -30986, 4694, -38209, -27668, -54390, -17053, -19886, 35867, -63635, 3257, -11534, 1353, -54340, -45551, 3159, -14090, -54745, -4391, -50766, 16549, -11397, -8704, -33015, 1003, 2523, -44169, 44795, -44270, -47709, 190]
10247h2043b829B1217a8572n422i040c213j300j5206i725B068f974l6346L465
10234c9855Q575A9587o013d5571i381k0771q733C4403F259M1419b379E924a1479
10220A172c8278a4296m777l6725g447b217l7880j5049b0944A484i1659H661a7849
10206B6664I58L8186H361d8452B5204a04003M5939I442a2389B0260b4322d674
10193d074J155F7787b4077J1526C7175L066k030c930l9918J4965o036j4805j6137
10180f5861B5161d9098E0321a3060n1530C5976e6084K2739B1189a3786j4663a0497
10167c7793B5761f0930D190L6251e5164j7473a3691j8501k7667a3240j4559l1062
10155e8861B5593c6356H51J721L4414h2621a773k3776D3612a3181j562e594G64
$$ y = [-82043, -2829, 21217, -18572, -23994, -9040, -3213, -4513, -19719, -9725, 2068, -6974, -43320, -39855, -31280, 19587, 13574, -45571, -9381, -30152, -38885, 34403, 6259, 47678, -2379, 5924, -11479, 1172, -38278, -14296, -19073, -55798, -7447, -2217, -40097, -55146, -20944, 1484, -91659, 8661, -17849, 26664, 958, 39144, 8361, -48452, 25204, -104003, -58064, 9442, -12389, 20260, -24322, -4674, -4074, -2919, 67787, -24077, -12551, 37175, 40241, 38211, -3930, -43848, -28883, -34919, -49724, -65861, 25161, -49098, 50321, -13060, -64590, 35976, -56084, -33345, 21189, -13786, -28449, -10497, -37793, 25761, -60930, 4190, 40441, -55164, -72637, -13691, -32192, -59859, -13240, -27799, -58861, 25593, -36356, 851, 2572, 36986, -82621, -1773, -25549, 43612, -13181, -14743, -5594, 764]
10141e5014J3107k1808K5980k1221A722d2352A827g6930F80e4687B320K578c0444
10127i346C027Q181i136B053h762A166c956j8767A9927b4742c109j0466I529c1543
10112b9968f007k3457A4227e7629K0033D9325d1595N022a1369D622i4602E196
10099d8509A2152a3684A2165c8459J6897j0095D4270a563I348b4093F6030j7478
10087D8552a0978A5807d5237B8282J6811e5242k1216i598C2225j2140h2728h57
10074D9252h912j5922J1954k0495A1987a6592J13o9723n210F601d0550j8080a6699
10060A5635K450a0405j7890j4382J2060l5372J0796P488A5578a3358I4524b679
10047A3718E889k62b3179D8437D56h2376d0167k3281B9046d6190I257d1400B846
$$ y = [-55014, -41907, -63715, -37735, -58956, 1722, -42352, 1827, -76930, 680, -54687, 2320, 4898, -30444, -9346, 3027, 11208, -9136, 2053, -8762, 1166, -3956, -22723, 19927, -24742, -3109, -13575, 9529, -31543, -29968, -6007, -29464, 14227, -57629, -37596, 49325, -41595, -36573, -11369, 4622, -94602, 5196, -48509, 12152, -13684, 12165, -38459, -21562, -31657, 44270, -1563, 9348, -24093, 66030, 48552, -10978, 15807, -45237, 28282, 45093, -55242, -76458, -9598, 32225, 20085, -82728, -857, 49252, -8912, -24834, -12880, -33375, 11987, -16592, -16479, -86202, -91412, 6601, -40550, -58630, -16699, 15635, 18085, -10405, -28295, -42677, -30617, -65989, -55193, -47705, 15578, -13358, 94524, -2679, 13718, 5889, 5627, -23179, 48437, 456, -82376, -40167, -63448, 29046, -46190, 9257, -41400, 2846]
10033a6142P383l4359h364e92p2954L1968J7175A521e3566F3601e9588b5707B857
10019a0988k5946M947a1413n2346A6140n052A877g3044L794B5264a3572A5682
10006C447f0258M726a1164j0061H641a3444m205a183j0577A3884a4787j9734p279
9993d1800J2435i9E4689b6720k8842a532l2481n087B7690b5047m1741F206J0292
9980A6498b1869m305C6084b0915k624A1838b7807A6060d7055G2651d5085o023
9968e1108N281c589k8690B2348L0173g471H282c8460F444k865P991b4869k3051
9955d7920A9226r560l429M4097j8735d6949f418n0404a9598A727a1232L410B1683
9941G122i5528b4838P738J885j0832k515J868q668R581K086j1761b739E021b4311
$$ y = [-16142, -8759, -43118, -8364, -592, -73546, -41578, -24403, 1521, -53566, 63601, -59588, -25707, 2857, -10988, -36934, -31987, -11413, -63759, 16140, 11088, 1877, -73044, -69250, 25264, -13572, 15682, 3447, -60258, -55532, -11164, -21225, 8641, -13444, -17649, -1183, -11760, 13884, -14787, -34521, -41800, -29365, -99, 54689, -26720, -55562, -1532, -34013, -39100, 27690, -25047, -66788, 6206, 16498, -21869, -26174, 36084, -20915, -23539, 11838, -27807, 16060, -47055, 72651, -45085, -51108, -45827, -3589, -32279, 22348, 52521, -7471, 8282, -38460, 6444, 3579, 11570, -24869, -47920, 19226, 9666, 6237, 50334, 31599, -46949, -6418, -56822, -19598, 1727, -11232, -7822, 21683, 7122, -95528, -24838, -17100, -15215, -26047, -28562, -26694, -35362, -25781, -23695, -35456, -2739, 5021, -24311]
9926e195m3409a5072r063B9878A978c6572h43k905k600l2472I532c7408j6024
9913e3432g367n007q073l108M05k6694d289j9520J439P943A4677J4839A93c8314
9898c4986p0244a5781k7153B2254g1189I189d4611h053k2532a52k2322G1526d3852
9884b9381a0083A3869b799k5194C3895P69c4240D1886a8313F780h014c346o3382
9871f6728G46b2421O540k4410k0076J2689J6998n5435L2287b3758a402D9671f499
9857c2750B1427e30n1169j6027D6048n973P186a8175P216m0115i076m2913a4303
9843c4560f40r586j5631B1268b2489H817J1635M784b1839B241d0598A601c2073
9829g6950b5595c222q138r787e55k1660j1393J57j8119B5227b5189K346D7181
$$ y = [-5195, -48604, -15072, -24135, 29878, 1978, -36572, -843, -3748, -6348, -38820, 9532, -37408, -53432, -7367, -12374, -20447, -23555, -23150, -49844, -4289, -23809, -22370, -14427, 14677, 29516, 193, -38314, -34986, -105230, -15781, -42934, 22254, -71189, 9189, -44611, -8053, -30585, -152, -22474, 71526, -43852, -29381, -10083, 13869, -2799, -27993, 33895, 34664, -34240, 41886, -18313, 6780, -8014, -3346, -66728, 746, -22421, -15881, -40291, -60367, -47678, -30680, -86115, -53828, -23758, -1402, 49671, -6499, -32750, 21427, -530, -51699, -67726, 46048, 40075, 47261, -18175, -10959, -51074, -9076, -51989, -14303, -34560, -640, -10226, -25857, 21268, -22489, 8817, 20452, 25236, -21839, 2241, -40598, 1601, -32073, -76950, -25595, -3222, -11360, -21147, -555, -22215, -33608, -33451, -51570, 25227, -25189, -22843, 47181]
9815b8222i406L644n8461a891m3742a6011o304c742j3755A5258a2371k4196C8488
9801a10213b1734L297A4342e2233H115K1011d1553F287R78J0417o799i584I234
9787G147b6750P89o088j1774B8926e6209E5188f6487g302C7691a6472P71l6135
9774e1836B2553p250a0339m6944K0536g720H864a195F891J7931d7838k6088L1292
9761d2634B2541a23212g026j8739k8257b0195r018k1934a9770N73p940L993f911
9747c8900a4185B9782i83k2800A5621c5033C2071g3392e649q398B3447c9045A0569
9733B7860a1650m3720J4727j6983a3622C0873d6782A3487d5621b2035H462a1460
9720f5195b5036a0887A8508D905L2046c0640j6796A7319e2561B7828a2996l8955
$$ y = [-28222, -9406, -5762, -64223, -1891, -45633, -16011, -22315, -3742, -17497, 15258, -12371, -36567, 38488, -110213, -21734, -18437, 14342, -52233, 8115, 29126, -41553, 6287, 7265, 17682, 10883, -9584, 9234, 7147, -26750, -25961, -32049, -43823, 28926, -56209, 55188, -66487, -7302, 37691, -16472, -15701, -51836, 22553, 15303, -10339, -57283, -36747, -7720, 8864, -1195, 6891, 24822, -47838, -73926, -42634, 22541, -123212, -7026, -25765, -54022, -20195, -29213, -51147, -19770, -19197, -27137, -23144, -6911, -38900, -14185, 29782, -983, -23783, 15621, -35033, 32071, -73392, -5649, -14047, 23447, -39045, 10569, 27860, -11650, -55370, -40643, -57626, -13622, 30873, -46782, 13487, -45621, -22035, 8462, -11460, -65195, -25036, -10887, 18508, 4905, 36951, -30640, -47436, 17319, -52561, 27828, -12996, -51951]
9708e1951D622d5992a8177l1107D2022j0656b5788I3122B9732c4475J6673r839
9696b7641e905B1203d7100C8164b9351J2540A7859e6227K3560c780n572M605k5342
9683c0089j2677H7301b3317C0085E719i872m0926B9618b8421B9895i7126L7369
9671e9757a3633j96B4536b4390a0733j1559D912f0731a9587G12L1473i627B0632
9657h626A4579b5856o995J5856j4833k9321k3894D2773b701D4049a7594q349D3196
9643b8420d751A7463e1250A0751g5294c1356a3373e387k7019Q405A7643a5711
9630A47b7261a2711D1660d7587K343f672E438K953b9706D138K4612d4917D42J2349
9616A2791f6329F554d1936e579B8624e8707E591e0006R005a7498C5053a4080F3671
$$ y = [-51951, 4622, -45992, -18177, -49284, 42022, 31366, -25788, 93122, 29732, -34475, -17802, -27641, -5905, 21203, -47100, 38164, -29351, -16811, 17859, -56227, -32667, -3780, -9352, -4747, -30089, -42766, 87301, -23317, 30085, 5719, -9872, -50798, 29618, -28421, 29895, -97126, -59757, -13633, -13829, 24536, -24390, -10733, -22292, 4912, -60731, -19587, 712, 32185, -9627, 20632, -8626, 14579, -25856, -32851, -16995, -31828, -61149, -85043, 42773, -2701, 44049, -17594, -25943, 43196, -28420, -4751, 17463, -51250, 10751, -75294, -31356, -13373, -5387, -32406, -24001, 17643, -15711, 147, -27261, -12711, 41660, -47587, -45244, -6672, 5438, 8391, -29706, 4138, 28750, -44917, 442, 12791, -66329, 6554, -41936, -5579, 28624, -58707, 5591, -50006, -41001, -17498, 35053, -14080, 63671]
9602b5023j3755L618D517c3906D030M9390I114K5977a5919l6321f264n4597k2088
9589h2949h859C729d6190D2977B0277a7885h477k5224q75A3289m312f124l1232
9576c7356A2077b7241j0658a0104k4217D795d3217N154a1208A1400d6515a2533
9563A4972K154L2375f479m2860j0892q42r74c577n140A030a4190C9821j2402a3735
9548h6291a9141D563c2289F52d5643a5375A9915f8719C3669f226o458R68A474
9534A457O273c8994i446j7941j3413a5693n729B6430b8903C4168e102C4533R0066
9521A24599o1245j2504A2643a0432k0258F0599H5e3830K404g315c085m5o362A4169
9506A7905b7812J0302b203m9345B4890d1175a265l5325a5187O130j957a548A1779
$$ y = [-25023, -38778, -35160, 4517, -33906, 4030, 53420, 9114, 35091, -15919, -52240, -6264, -60861, -82949, -8859, 3729, -46190, 42977, 20277, -17885, -8477, -33701, -34576, 13289, 8977, -6124, -37356, 12077, -27241, -37899, -10104, -34321, 4795, -43217, -38063, -11208, 11400, -46515, -12533, 14972, 17126, 49501, -6479, -49339, -60231, -61073, -62047, -3577, -8717, 1030, -14190, 39821, 27419, -13735, -86291, -19141, 4563, -32289, 652, -45643, -15375, 19915, -68719, 33669, -6226, -12684, -11716, 1474, 1457, 7730, -38994, -9446, -27387, -40800, -15693, -21422, 26430, -28903, 34168, -5102, 34533, 124599, 63354, 50850, 12643, -10432, -30690, 60599, 85, -53830, -51426, -7315, -3085, -3130, -9492, 14169, 17905, -27812, -17510, -2203, -51548, 24890, -41175, -1265, -36590, -15187, -9057, -11014, -1548, 11779]
9492b1340B7179d0619A339b8607k4195P977i562A2585e2540C3136c4494J0702
9480b3792p964b520m596l599C3998h911l4328P971I765J1117G130i157j3517n6181
9466g8855c0726J1950j1512g537j9481C3060j680I725e4035l593B4044a8169n849
9453b4018j458k6105F073a6709q234a715m2589m017j5044J7119k821E0187a814
9439b4322O865m6772J7978E4110b0015L437o7528C1614e0500a0876l5159b2673
9426e0022E7306a4976A5794e155k0517H610b3333k9938E1608G536a5307h28A701
9412D308c398j6079D59b5955c469C1654e659l6617p426b2110A9925a7438k4691
9399d2129M759J3798c125n407j6015Q360j3816e269F669a5865q8613F099a1987
$$ y = [-21340, 27179, -40619, 1339, -28607, -52802, -44825, -9562, 12585, -52540, 33136, -34494, -23792, -31756, -2520, -7116, -10715, 33998, -8911, -43239, -35268, 9765, 20882, 7130, -9157, -22674, -78855, -30726, -18776, -30288, -7537, -27018, 33060, 31380, 9725, -54035, -57628, 24044, -18169, -24018, -25476, -51581, 6073, -16709, -24943, -1715, -44304, -48321, -63365, -46246, -49067, 50187, -1814, -24322, -17457, -64229, -46251, 54110, -20015, -16578, -84106, 31614, -50500, -10876, -46035, -22673, -50022, 57306, -14976, 15794, -5155, -25672, 8610, -23333, -53271, 51608, 7536, -15307, -828, 1701, 4308, -3398, -19477, 459, -25955, -3469, 31654, -5659, -42276, -49702, -22110, 19925, -17438, -42129, -37370, -23572, -3125, -8532, -24547, -16187, -30003, -5269, 6669, -15865, -104478, 6099, -11987]
9385a0337j7525C129b9496k3101a3804p321D1266b9633j9471B6381g050l0006
9373c7056A2140N7873e0180K1215d763j8215j945J0074A0757N606a7556j6447
9361c4003a633C8788d2289j9896A9820b9547o096o4856b1106k2039a2465p524
9349a9989d757k2773J1434C9931c6907a72o554l6081f691k6854N572A131i8000
9335b1243l0157C0103f4214h136F524e6720a3815B5955a9894a759e43H013C514
9321c3303f901n002P98d673J752E1384L996h835k369o159j3474I403h966k7998
9307c6964C2677a1887F3454f0733J7942J3709D642b1087l9888a571k8539J3072
9295a7038D0015c4209n0340d0039J922j6419a583r892l3614j6838J0858M393A480
$$ y = [-10337, -27862, 3129, -29496, -52597, -13804, -21125, 41266, -29633, -49104, 26381, -7050, -37056, 12140, 70013, -50180, -28965, -4763, -22978, -24923, -14849, 10757, 16363, -17556, -34003, -1633, 38788, -42289, -62185, 19820, -29547, -35643, -100499, -21106, -43145, -12465, -19989, -4757, -27530, -16096, 39931, -36907, -172, -6726, -42807, -6691, -33545, -27973, 1131, -98000, -21243, -51400, 30103, -64214, -8136, 6524, -56720, -13815, 25955, -19894, -1759, -543, 8013, 3514, -33303, -6901, -11903, -11105, -4673, -2921, 51384, 55380, -8835, -11204, -17363, -30837, 9403, -8966, -36964, 32677, -11887, 63454, -60733, -42791, -29082, 4642, -21087, -60975, -1571, -30110, -17038, 40015, -34209, -84549, -40039, -38117, -54536, -1583, -11475, -45089, -61927, -51069, -46676, 1480]
9281g642D2640A5527f5470A2939c1156P126m209q147m251g482k3380k9193g160
9267H276d6690j3871R6b7967B1351b8390k0801a4426q809J939L790C7940a9070
9253a4737j3358B7391d6049J5555j5765a6002j8149a4710j1781J1419n344A3470
9240h4984b0846e941l4811J101m3667B6929a2233N383l84D3307B305K3071f1152
9226d4821A3712d1703a11A7548b5246E493c338j144l9017r260B6115c9443b876
9212c4859a5501l9209A8870C097d1204a5006E0513G091N12L6472A9329J5960j3157
9199B2132J7945j2811B915K536E64M5364e9376A9365d3731B0106M003m79c9787
9185b7185A5741e7885c65E19b95l1918D4005j2173C973h628B3437j1478e6259
$$ y = [-7642, 42640, 15527, -65470, 12939, -31156, -24030, -28239, -36386, -40637, -7482, -30862, -60055, -7160, 8276, -46690, -60561, -60465, -27967, 21351, -28390, -49191, -14426, -23235, -21296, -17506, 37940, -19070, -14737, -28095, 27391, -46049, -30494, -46259, -16002, -34151, -14710, -26491, -15072, -20416, 13470, -84984, -20846, -5941, -40752, -39651, -83318, 26929, -12233, -6850, -7234, 43307, 2305, 25376, -61152, -44821, 13712, -41703, -111, 17548, -25246, 5493, -3338, -4482, -43499, -52759, 26115, -39443, -2876, -34859, -15501, -54710, 18870, 3097, -41204, -15006, 50513, 7091, 7603, 44075, 19329, 35289, 22132, 40077, 27266, 2915, 5451, 564, 45928, -59376, 19365, -43731, 20106, 24109, 23630, -39787, -27185, 15741, -57885, -365, 519, -295, -32213, 44005, 31832, 3973, -8628, 23437, 11959, -56259]
9171E852f0610o73b3366j8637a7068E0055c0804a2225j7451k2093a8565o4277
9159h2842a8836n3455D1268f417o003p4140L7009b3169E947a035I754P0859b7252
9145a8642B6533C632a7723m5439a2121a24j7532C951m7a0677B4045a03857A385
9131C6443J7315c8083n638b279k8542A2979b0271B9513a7553k693R606A1874H94
9117d4668g997l3960a7920l0420B1261m297d5076j8548A5649d8371J2286k5048
9105f1133J1012J2004B3040a4541g114n901D3477a1083l336M942m1809k402d423
9091b5890a1648r359a426A6038a3256A0547k218K2357a011A0239b5086k1752G3805
9077F589L6776d8248a7515l2221M73J6882B9455d5198A6518a9709m048A5831a272
$$ y = [5852, -60610, -61283, -23366, -42003, -17068, 50055, -30804, -12225, -29676, -51769, -18565, -82842, -18836, -72291, 41268, -6417, -12420, -86560, -49551, -23169, 5947, -1035, 9754, 80613, -27252, -18642, 26533, 3632, -17723, -63162, -12121, -124, -17656, 3951, 3904, -10677, 24045, -103857, 1385, 36443, 53758, -38083, -43721, -2279, -30821, 12979, -20271, 29513, -17553, -20246, -10640, 11874, 894, -44668, -7997, -41957, -17920, -48340, 21261, 16964, -45076, -63624, 15649, -48371, -36085, -61133, -50121, -38117, 23040, -14541, -7114, -13015, 43477, -11083, -14419, -9477, -51286, -53688, -4423, -25890, -11648, -21007, -1426, 16038, -13256, 10547, 8329, 30686, -1011, 10239, -25086, -46838, 73805, 6589, 43365, -48248, -17515, -49736, -49263, -32381, 29455, -45198, 16518, -19709, -23757, 15831, -1272]
9063A0192a1520B624e9687e248B6052F51e0265J0231a8732f359m4595B1587N974
9050B7561E117c1868A220J9949I885h0972B2688c6836D676a571D6198b6755j5150
9037d1905j3918C0710a7709e016k5564L477j4757k538J6825O512m4958g834A1769
9023a189n3642N81B5411N837e947j4582d660E08f661n5618a4243o6672L5708N644
9009c9563j4610D5077A0451h1293B7793G239J5044M803i348D9511c891A82a1202
8995d5806J5904a0781A3329d417C1496f688m88j9161a1032B4102K3701k0489J1081
8982C8395g1523i33B4427b3222H5020A7893A020O012K1576d5380D643K2508A3025
8968e0626g380B4851c5447A1890b2195j5116B8385f7653J0473K2767F6865a1109
$$ y = [10192, -11520, 2624, -59687, -5248, 26052, 651, -50265, -40034, -18732, -6359, -50954, 21587, 27561, 5117, -31868, 1220, 21169, 9885, -80972, 22688, -36836, 4676, -1571, 46198, -26755, -41905, -55823, 30710, -17709, -5016, -30580, -27103, -41860, -44398, -27573, -21061, -66019, -7834, 11769, -1189, -54831, -54250, 25411, 31248, -5947, -20529, -4660, 508, -6661, -62279, -14243, -80915, -45207, -39563, -54173, 45077, 10451, -81293, 27793, 7239, 22283, 27086, -9348, 49511, -3891, 182, -11202, -45806, -29902, -10781, 13329, -4417, 31496, -6688, -7176, -26337, -11032, 24102, 47803, 27314, 38395, -71523, -933, 24427, -23222, 85020, 17893, 1020, 7032, 28608, -45380, 4643, 27151, 13025, -50626, -7380, 24851, -35447, 11890, -22195, -37311, 28385, -67653, -57180, -34413, 66865, -11109]
8955B9999Q025E73J1523b7873C4463J1193a320A4619J1748N1953B6051A022P1533
8942G2555H247J2270c299C0634J7761l193k212j1694j1369M4072B9237c1497G3227
8928a5434k798E5218k6841I621L4168K2628B3530P7924E799O7042B4910d018a945
8914B0146c2400B3440a3183A7659G864K2939a9872G2770B1269d7945D2740l747
8902C8993J4706j8974h7627K3657b2279C0418j0616d493B4886f9352e931o885
8890a2816B0318m643d78l2245k868C0688a9300r448F5434A4265N786f747l72c221
8875h166L561r790M952A5596c2239F6011G320Q130c0944B3486j0820a8327a25
8861g614B5074c2607A031b19C0202c351l0688A1183d8388J0997A4715F942M7341
$$ y = [29999, 38024, 573, 12096, -27873, 34463, 45656, -1320, 14619, 26367, 78320, 26051, 1022, 72555, 8247, 20517, -3299, 30634, 48395, 45202, 42990, 31296, 19927, 63999, 29237, -31497, 73227, -15434, -18232, 55218, 28377, 9621, 43789, 66417, 23530, 101454, 5799, 72841, 24910, -4018, -1945, 20146, -32400, 23440, -13183, 17659, 7864, 30803, -19872, 72770, 21269, -47945, 42740, 38993, 53699, 34725, -87627, -63970, -22279, 30418, 19802, -4493, 24886, -69352, -5931, -12816, 20318, 15675, -478, -32723, -35591, 30688, -19300, -28748, 65434, 14265, 20051, -6747, -7119, -3221, -8166, -4605, -14395, -9443, 15596, -32239, 66011, 7320, 15450, -30944, 23486, 12666, -18327, -125, -7614, 25074, -32607, 1031, -219, 30202, -3351, -34039, 11183, -48388, -37391, 14715, 6942, 54283]
8848E4283e1880A5033b675j5646C522L972J7328f690K610C4038n232Q582b566
8834F866g5724A4690a8124C6709a4369C1482L5997k2644a3512m4347a3482O502
8822f980C6301J1604a4703C5590a46F998J8352N2150A9257P1458j6905E825M4578
8809E0403j9308Q208L338A6065c2743B9639O262f846A0645c3808e491B2648K0153
8796D2801A1343b6380A4135c841C6341a2387E5513a126l683I7735a9980E4763
8783D5143B0978K807q782K598N731j1193J1088A292a4180e689A5387P728f6m192
8769d258D7156j9537J7682n357f417A03165c230B1d9038G126g68C407N438k475
8755F370J7875d2296n417A0450Q08C480a497m5018e411j1878j5492B0161e4670
$$ y = [54283, -51880, 15033, -2675, -18321, 3522, 7494, 24822, -6690, -4080, 34038, 28806, 37388, -2566, 6866, -75724, 14690, -18124, 36709, -14369, 31482, 67479, 44835, -13512, -57859, -13482, -6980, 36301, 47905, -14703, 35590, -146, 6998, 25350, 77500, 19257, 90715, 73810, 5825, 50403, 31095, 39303, 42641, 16065, -32743, 29639, 35901, -6846, 10645, -33808, -5491, 22648, 42801, 11343, -26380, 14135, -3841, 36341, -12387, 55513, -1126, -4809, 97735, -19980, 54763, 45143, 20978, 23785, 15003, 17601, 23332, 12139, 23227, 1292, -14180, -5689, 15387, 23115, -66, -4258, 47156, 27619, 45301, 39944, -6417, 103165, -3230, 21, -49038, 7126, -768, 3407, 8845, 6370, 24245, -42296, -47713, 10450, 11258, 3480, -1497, -46515, -5411, -17289, -32781, 20161, -54670]
8741f129l8835i15E474Q469m664c5084J6798A0915C787M2846j1526E283a2634
8727a2571j2145E5834c1721A5383e0394J3383A5654c023F3297j6590j0245a2778
8714a2168D704J3539b8568N345m18F8413B8305J2631m583K8228B6212h176m0503
8701d8679J7630R684f00l7825B296J0317a4891B7091b5131l4233a6592o091D0695
8687F354a2809A8895g0340a3913C3351j1199d3291a0751j3067e570D1756r146
8675C2610e9402K3400a4487l9182b1421q109J854I62f7659a8899C843b5172I281
8661b1708n7004c1657Q352F841b9961C3064A2471A720d4895A547i231j069l2418
8648d2718a2347C1753e15m2922l3489C444a125k0262H5465h0493c143D7524B0456
$$ y = [-6129, -44964, -915, 5474, 13943, 9279, -35084, -18286, 10915, 3787, 46633, 35107, 5283, -12634, -12571, -24716, 55834, -31721, 15383, -50394, -37011, 15654, -3023, 63297, 46707, 36462, -12778, -12168, 4704, 18243, -28568, -23223, -23641, 68413, 28305, 40936, 36353, 64581, 26212, -8176, -48679, -31049, -21365, -600, -38425, 2296, 12613, -14891, 27091, -25131, -59364, -16592, -22683, 40695, 6354, -12809, 18895, -70340, -13913, 33351, 22152, -43291, -10751, -23818, -5570, 41756, 32610, -59402, -36002, -14487, -53669, -21421, -29530, -27676, 962, -67659, -18899, 3843, -25172, 9281, -21708, -78712, -31657, -23305, 6841, -29961, 33064, 12471, 1720, -44895, 1547, -9231, -10300, -42718, -12347, 31753, -515, -43437, -76926, 3444, -1125, -21387, 85465, -80493, -3143, 47524, 20456]
8634D171N5569g952D238b7558k9790A5015b8700A9638p194d8530R928C6756j2609
8621B4147e20D9412F456d2273k6867C487b3530B7599g053A1848K0267c5983b735
8607e3080E8017b4571f487k826C1518b5230h199n715c711J821I075Q2581b4334
8593b9613j8554h646c958j459D3260f6358b4141F87N24b8149a0530A7273H22P537
8579H359a7383k828B4924b2415A4223a1902p793j0831K40l566a1516B4152d5558
8565d4884B2367a932k9235a2637A464L1052q193a3849j252I2414C7322d3126J1969
8552c1157j3913b158o568G062f1843A7344a1181j7259K843h526j9090P470A3703
8538E3301b0249B0166K3301F759C73a9173C5775d4871E4306B2255d9250H677a8958
$$ y = [4171, 59740, -7952, 4238, -27558, -57348, 15015, -28700, 19638, 12444, -48530, -38602, 36756, 24147, -520, 49412, 6456, -42273, -69140, 3487, -23530, 27599, -7053, 11848, 32115, -35983, -2735, -53080, 58017, -24571, -6487, -9313, 31518, -25230, -8199, -13914, -3711, -1890, 9075, 91656, -24334, -29613, -48167, -8646, -3958, -5417, 43260, -66358, -24141, 687, 1211, -28149, -10530, 17273, 822, 8359, -17383, -20211, 24924, -22415, 14223, -11902, -19695, -30526, -30286, -33852, -11516, 24152, -45558, -44884, 22367, -1932, -31167, -12637, 1464, 32516, 24323, -13849, -15101, 92414, 37322, -43126, -31157, -45070, -2158, -8726, 7062, -61843, 17344, -11181, -28440, -25597, -8526, -27616, -20146, 13703, 53301, -20249, 20166, 43467, 6759, 373, -19173, 35775, -44871, 54306, 22255, -49250, 8677, -18958]
8524E672P4148b766m725F41c1834B7325J9046b3738j4160A366M7128e3324A9237
8510c6052B6560G575a9139H276B471c8957B8766J925M195A3776f880q994A3360
8496G0009a717E7821k8762m144M3474L065k109k7745J5382g32D6151j5768N0077
8483H0460l5126A8363N9700C5188j842J1141i39J09C8713j2826j2479J7309I856
8469f3958B8581J1227E851N584J2925g025I071K3100o846d795A1855K705R404
8456B3964A0519K2532j0534d269k1448k5548A9398h042k8139F41M1963a0657K322
8443h335j0208Q484D2220D161d5358a7837l7904J8657b45k6632c526E6175a4089
8429I464a8228j3735k9599h801m4038b4527B0028g4951d129E4672a3943C9510
$$ y = [5672, 79820, -2766, -7491, 641, -31834, 27325, 46371, -23738, -37898, 1366, 48494, -53324, 19237, -36052, 26560, 7575, -19139, 8276, 2471, -38957, 28766, 30691, 34886, 13776, -6880, -15874, 13360, 70009, -1717, 57821, 29059, 24915, 68389, 71454, 69345, 41600, 56982, -732, 46151, 30383, 80460, 45334, 18363, 78063, 35188, 33346, 44487, -939, -830, 38713, 25887, 13408, 30717, 9856, -63958, 28581, 39808, 5851, 11435, 24360, -7025, 9071, 32171, 25325, -4795, 11855, 14560, 23964, 10519, 33051, 22517, -4269, -25717, -51265, 19398, -8042, -36181, 641, 42604, -10657, -8335, -18543, -10059, 42220, 4161, -45358, -17837, -55741, -37084, -245, -26877, -3526, 56175, -14089, 9464, -18228, -31963, -61562, -8801, -52839, -24527, 20028, -74951, -4129, 54672, -13943, 39510]
8416b1258e686A4032f6178D586d5300K1830I964J0220a9309m2180b4717P461M558
8403a2698k7378B3571e206j9169a0573k3194J4259L349k2766A1249g613o335J067
8390a2881B3605C289O476A199e2942B1625r816P3983a2881C4087c1316E027c1400
8376E2828e0600j5882a4364B128b377k7667k4133J7989J4627f397n1589A7057
8363g2794K9830a9367e627k0666B661J866c0571j8702K4129K054H068b9646m136
8350c3782l7144b1260j5198J512r548J3957i59q856j6755a2934m7236b6658K694
8337b3964I493a5470n3366a4520j2576L927J406i869b056D212d7793b3015D456
8323f594o758o8o1768A7542n641f5105a4101l0014C9476A0045J2914c8117n5993
$$ y = [-21258, -5686, 14032, -66178, 4586, -45300, -23470, 9964, 20184, -19309, -61489, -24717, -17256, -12698, -40076, 23571, -5206, -24375, -10573, -33767, -19508, -16159, -38925, 11249, -7613, -13948, -12881, 23605, 3289, 9765, 1199, -52942, 21625, 11809, 85792, -12881, 34087, -31316, 5027, -31400, 52828, -50600, -66482, -14364, 2128, -2377, -30044, -54177, -36188, -21561, -6397, -57986, 17057, -72794, -42964, -19367, -5627, -26293, 2661, 4527, -30571, -49273, -25144, -23090, 8068, -29646, -33782, -70926, -21260, -36458, -34946, -44494, -30537, -959, -9815, -26570, -12934, -60170, -26658, -23964, 9493, -15470, -68836, -14520, -27096, -23169, -21763, -9869, -2056, 4212, -47793, -23015, 4456, -6594, -13352, -13420, -75188, 17542, 11901, -65105, -14101, -44115, 39476, 10045, 22959, -38117, -94110]
8310i4110b5320o953g126m7058A1701J9331j1765a7658n2004B7410b8886h010
8297g6164b347j2360A8985g1224A299b4283b556p7578c4093j312C6719c0170k339
8284c2509J3879Q001I023a8242C6565n569p527b4976l9049d404m5605C353g0992
8270c7441a3006n9326e453j9783C6363K0967c5923A17391c0459D091J188a3497
8257E2866A8762O1199h511j7063B8104j0630p604e7D5612m020c5875A4681L8852
8244E3533M5875m3115B4630J5261j0357K0359b4704D6648n121m077K8259m712
8232F0997J03657p1640J5087C0610B238O9027l4818K8440P4604l1673E3575m234
8220D9341m013J7195I399J11793E2417J3094A4353K9318K5042j3132A6945J6764
$$ y = [-94110, -25320, -32273, -7126, -54184, 11701, 31032, 19267, -17658, -69662, 27410, -28886, -8010, -76164, -2347, -14707, 18985, -71224, 1299, -24283, -2556, -80134, -34093, -35405, 36719, -30170, -32509, -18630, -10629, 9023, -18242, 36565, 30996, 23469, -24976, -64025, -4404, -50009, 3353, -70992, -37441, -13006, -72332, -5453, -25236, 36363, 57330, -35923, 117391, -30459, 4091, 5279, -13497, 52866, 18762, 79961, -8511, -25574, 28104, 17474, 9870, -57, 45612, 41592, -35875, 14681, 53533, 99408, 56293, 24630, 39891, 29534, 49893, -24704, 46648, 41527, 37450, 65709, 60997, 164654, 93014, 108101, 30610, 2238, 71265, 36447, 64887, 139491, 107818, 53575, 49341, 45328, 62523, 9399, 121192, 52417, 65511, 14353, 43671, 68713, 55581, 16945, 33709]
8208C3709O675r379c6500C0299q563J5805h159k009B6486f4293K2600j3204J7245
8195c7652a0812l5663n84059f9730F18372B54102k999A4261N1702l046f218C8686
8182b8837E4811B2956C357N3079k1275b5573C9607l777K1108M095j8243J01766
8170A44556m4940D8804K7325M5335m4943J3645L7533m794k9595L8535j2947j2323
8158A06575J1756q170M7752n8514l025K8222E1189J37936q7249J3989p150n347
8146A03368J7054j1993j1768k5703J3477J664R1510n5594L4081O905o5707k5509
8134G1785O1921n0863J9029j9652M8460k8152l8297Q0401D7778J927O5781l1194
8122H4292J3928C4898L8630j7016j73K5733A7819M4188A9736M0122j8481M1615
$$ y = [33709, 40384, 31005, -36500, 30299, 21736, 37541, -8159, -10168, 26486, -64293, -41693, -54897, -37652, -10812, -46475, -630534, -69730, 618372, 254102, 251103, 14261, 65963, 62917, -6218, 38686, -28837, 54811, 22956, 3357, 56436, 35161, -25573, 39607, 35830, 56938, 61033, 42790, 144556, 99616, 48804, 76129, 121464, 76521, 90166, 127699, 122905, 93310, 131845, 118898, 106575, 118331, 110161, 157913, 99399, 96374, 124596, 51189, 189125, 101876, 115865, 108715, 103368, 120422, 108429, 96661, 70958, 84435, 86099, 177609, 122015, 156096, 163001, 97294, 71785, 133706, 82843, 101872, 82220, 130680, 102528, 64231, 144632, 47778, 49705, 115486, 84292, 98220, 34898, 73528, 56512, 56339, 82072, 17819, 62007, 19736, 59858, 41377, 82992]
8110H2992q467R304j3067p750G049L6736L4975A422f2031A7828F385N6723b693
8096D382a7676E7239A0618a8981F9694a5016j2438g581B8052L9092f792B523g0093
8082e1925b666B0584E196J4704L0536G113b3650R146p063i607L603B8544f0203
8068A4789b0268L495k2358J4561B0791a5920a302j8162m4552b4403A6796D635
8055f970j7902J0848A2349e8588a6111m8542A3190f6178D2780H06c1752A0219
8042B8805a0202D825c002l0665G1328E068K7802c4229C3499h632j995q047l889
8029b2563l0660j6807B2490b2578O648D8682d9030g695l205p560D6337j7450C554
8015b6584l4022a0327C8111h555E616c6213j0114J1896j6975C195b7451B1127
$$ y = [82992, 74525, 83829, 70762, 63012, 7049, 43785, 78760, 1422, -62031, 17828, 6385, 63108, -2693, 4382, -17676, 57239, 10618, -18981, 69694, -15016, -27454, -7581, 28052, 67144, -6792, 2523, -70093, -51925, -2666, 20584, 5196, 19900, 50436, 7113, -23650, -14504, -21567, -9607, -6004, 28544, -60203, 14789, -20268, -16773, -39131, -24570, 20791, -15920, -1302, -19464, -64016, -24403, 16796, 4635, -6970, -24872, -14024, 12349, -58588, -16111, -64653, 13190, -66178, 42780, 806, -31752, 10219, 28805, -10202, 4825, -3002, -33667, 71328, 5068, 32870, -34229, 33499, -8632, -10627, -18674, -22563, -53223, -70030, 22490, -22578, -15930, 48682, -49030, -7695, -10900, -18460, 46337, 28887, 3554, -26584, -60606, -10327, 38111, -8555, 5616, -36213, -46327, -34431, -51406, 3195, -27451, 21127]
8002A2981O496J50a1093m2327J5836a7780O978m6634a4908D149h870A8458b086
7988c2626Q854E894b6509k0225J0580B1220a7514B0015c147C3738m454c8032C032
7974c7948c842B7687A804P5600C5353H171J9145a8865D3213f3952J8708O484r46
7961c9706a5748j5848e013p5221a6098j9044J3469A4238a6161F9a7680m556n092
7948b7328f638B9416h3916f833A790M817J0724B121c7408p3912B4106c9750g899
7934b531A6126b024G179A961J086i287j853D1117J8201k5737J8044d5675N047
7921d0628B1728n700b9491E5685d509m1557A2408D369K3900a4108j0874E1751
7908a0533m909P572l3591J3559A5005p366c2513g56A4293d4568A9262b3136D6874
$$ y = [12981, 19477, 19627, -11093, -53420, -37584, -17780, -10802, -57436, -14908, 4149, -8870, 18458, -2086, -32626, -23772, 5894, -26509, -46734, -36154, 21220, -17514, 20015, -3147, 33738, 29284, -38032, 3032, -37948, -3842, 27687, 1804, 77404, 35353, 8171, 27316, -18865, 43213, -63952, -45244, -38760, -39706, -15748, -31596, -5013, -80234, -16098, -35142, -21673, 14238, -16161, 69, -17680, -22236, -27328, -6638, 29416, -83916, -6833, 1790, 6607, 17331, 2121, -37408, -111320, 24106, -39750, -7899, -2531, 16126, -2024, 7179, 1961, 3047, -9287, -11140, 41117, 59318, 33581, 51625, -45675, -40628, 21728, 16028, -29491, 55685, -4509, -46066, 12408, 4369, 28269, -14108, -24982, 51751, -10533, -15442, -7870, -41461, -27902, 15005, 7639, -32513, -756, 14293, -44568, 19262, -23136, 46874]
7894C3850b5072H4070C2474M05m004h32C1701a9557Q345C1852A0278j13J2890
7881B3055J7741e791B3241k417b1439D1712g82D6080j4488Q723A8391J2478a0079
7867g20D1046A1981N3529j1840J342j4403C057a8672A5992a3327D1353o497j4348
7854B0508p083P386l845J9494r969K8981k6775J8568j4581J2809B216L7721m407
7841C5530K209b6871B7159D506K1561l346O8708A5433J6205o041p810K3924K524
7828D4235k0962d2412A1544L7590k0238Q918K615F063c2525C8849J4830p01d070
7814E0403j941J1366F127L7058a0087A0375P21M062K0262j6053N7190K6432D7862
7800B5735a381j0257B1173K9100j082A8202J633K1560A0662J310a4993b325H024
$$ y = [33850, -25072, 84070, 32474, 32879, 28875, -832, 31701, -19557, -11212, 31852, 10278, 10165, 23055, 40796, -5791, 23241, 20824, -21439, 41712, -782, 46080, 31592, 40315, 18391, 30869, -10079, -720, 41046, 11981, 65510, 53670, 55012, 40609, 3057, -18672, 15992, -13327, 41353, 34856, 20508, 13425, 20811, 16966, 36460, 26491, 55472, 28697, 47265, 32684, 45493, 2216, 39937, 35530, 37739, -26871, 27159, 4506, 26067, 22721, 91429, 15433, 31638, 25597, 17787, 41711, 44235, 23273, -42412, 11544, 49134, 28896, 37814, 40429, 6063, -32525, 38849, 53679, 52978, -4070, 50403, 48462, 59828, 6127, 43185, -10087, 10375, 11096, 15158, 35420, 19367, 76557, 102989, 47862, 25735, -1381, -11638, 21173, 50273, 49191, 18202, 19835, 41395, 10662, 11972, -14993, -2325, 8024]
7786A6519n804Q662N6481a5225G1454B410J4298J9953b011H9809b6104E571J7227
7773B2798N360a7764G2591a3985n575B3225K2258A345a2495A07690c159A1391
7760C4378P499J9732b0834G2851C4178J2590r933A8036N4242a4951k1957H6331
7747E6146b0195A7118L9656R972J0134j5532a5781D0662A0265a1253G6940B1176
7734H643k417a9890A2422P9198c4909J4833B1606M150d0305k854e203G5613k7435
7721D8178b735k4972o098D5554A3890J3540d5231E1721E532N4827D360b9197j4569
7708d3766d661D3276R782j1956a1225E0204c2690B1245h76A67J4347d2449E4360
7694a353C5872A0681a387C1561a2918C0633b3621D754J9247a596I853L5098K7916
$$ y = [16519, 10715, 19377, 75858, -15225, 71454, 2410, 16708, 36661, -2011, 89809, -26104, 5571, 22798, 28158, -17764, 72591, -13985, -19560, 23225, 45483, 1345, -12495, 107690, -3159, 11391, 34378, 41877, 61609, -20834, 72851, 34178, 46768, 36835, 18036, 72278, -14951, -36908, 86331, 56146, -20195, 17118, 56774, 66746, 76880, 61348, -15781, 40662, 10265, -11253, 76940, 21176, 8643, 6226, -19890, 12422, 91620, -34909, -20076, 21606, 25756, -40305, -43159, -5203, 75613, 48178, -2735, -27707, -33805, 45554, 13890, 27430, -45231, 51721, 5532, 60359, 4360, -29197, -43766, -4661, 43276, 53058, 41102, -11225, 50204, -32690, 21245, -876, 167, 14514, -42449, 54360, -1353, 35872, 10681, -1387, 31561, -12918, 30633, -23621, 4754, 24001, -1596, 9853, 44951, 72867]
7681G2867A5244o598P1775A228J4969b855D8420g341l0113D1237j1285j2684M3331
7668F0599B7513f8657B6321L3923d7015c755A0982C85a913p32D8358f0981A4920
7654B9542L6443L591j7645A9065b7113C7014A4470e687G3753c6418C8351K5940
7642F4291J944n639d814B0117L0305P4662a2888B8207H379K6222M0309d813A3415
7628I3690C4285K1317m51L454a2474E4208K4971C1242l776K0854K2579k2093K9219
7615G8025k9544O971M1781D6865O504j6221J2350q414A193J9780M0774J5719k7742
7602D9724P947A8512L9293M9625m6687j576B6589J0928k786J5845L5951b4000
7589D8591A4011O133K8788j9084J419L529l599q545M6580A5085R185b944D6403
$$ y = [72867, 15244, 8646, 80421, 1228, 16197, -2855, 48420, -7341, -37454, 41237, 29952, 17268, 60599, 27513, -68657, 26321, 60244, -47015, -3755, 10982, 385, -1913, -2645, 48358, -60981, 14920, 29542, 65985, 69576, 51931, 19065, -27113, 37014, 14470, -5687, 73753, -36418, 38351, 64291, 66235, 60596, -4814, 20117, 50422, 125084, -12888, 28207, 8379, 34601, 74910, -4813, 13415, 93690, 34285, 55602, 55151, 58605, -12474, 54208, 79179, 31242, 27466, 48320, 70899, 48806, 78025, 48481, 55452, 97233, 46865, 53369, 37148, 49498, 41084, 1193, 20973, 61747, 77466, 49724, 57671, 18512, 57805, 107430, 60743, 59167, 26589, 37517, 34731, 50576, 86527, -24000, 48591, 14011, 20144, 48932, 29848, 31267, 34796, 31197, 22652, 69232, 15085, 24270, -2944, 46403]
7575h71E3694A3379J9070K8430Q185m777L6510C5532M93A0341J5311M7335m989
7562F7998B8128J2306M5171j4122A2864L0478N5264B9342M0017R40a2196l981
7550a6177B1531L3907q775k1470L2945j343O6919C6540L3522J718C4228L7502
7538G1730l4409O3096k9862P201J7575j1061j2465M1620l201C5987O3961C3631
7525A13873q672K8849N798E3575P6034l9077M6037L0271m4425l1710N710L7937
7513A34352j7781J7134k5839D5325M892M0044j1572j3219J6703K7930N0258j291
7501A59070F9390B7884Q4079l7536p69N3380m1066D0088M0699K7911J1055n0315
7489F9438j760j3255P2352L8598n2960E4954L9452C4423J4272j5491M7900k3003
$$ y = [-871, 53694, 13379, 32449, 60879, 69064, 64287, 100797, 35532, 36025, 10341, 25652, 72987, 67998, 28128, 40434, 85605, 71483, 12864, 43342, 98606, 29342, 69359, 70299, -12196, -16177, 21531, 55438, 46663, 25193, 58138, 56795, 123714, 36540, 70062, 71780, 34228, 71730, 37321, 100417, 70555, 77756, 95331, 84270, 71805, 113425, 110224, 35987, 99948, 33631, 113873, 105201, 134050, 139848, 53575, 129609, 90532, 136569, 166840, 122415, 90705, 96415, 134352, 116571, 133705, 107866, 45325, 50217, 90261, 78689, 65470, 82173, 110103, 160361, 159070, 69390, 27884, 111963, 74427, 73658, 127038, 85972, 40088, 80787, 108698, 119753, 69438, 67678, 54423, 126775, 165373, 112413, 54954, 94406, 34423, 48695, 33204, 81104, 58101]
7477E8101K0579k8799M1717C4182N1014B8793M881i532H6489C3815m820b300C9080
7463A19450m5014k7139L8630j7306L3487l2248k5855N310n494L513k0839J6186
7451D2681K3960j8445A0673N8735l0343P242N0333D2079A4919F993J9048K0393
7439D6434L1571L6432B6275L9331l2443Q1000N550n7386O568p35K2037q654M762
7426H6305k3479K4296q976j4167j5777K0264B9099N3722l3690P4977M849J2281
7414A41238l9590j4886J290N727j2141R182l5878N322J3419N9514j2792D5327
7401G0335k5422K293P8342m762j086n8172L7742l0994K5992K1261n015p32l9357
7388G0425L6825m6981M1554J3804L507K3390O553n0778j2650M3249N0551q8850
$$ y = [58101, 78680, 49881, 91598, 34182, 85196, 28793, 33674, -9532, 86489, 33815, 28995, -2300, 39080, 119450, 74436, 47297, 85927, 68621, 102108, 69860, 44005, 49315, 43821, 47334, 26495, 42681, 66641, 48196, 10673, 69408, 39065, 46307, 96640, 42079, 14919, 6993, 26041, 46434, 78005, 114437, 26275, 65606, 33163, 114163, 119713, 62327, 68895, 68160, 90197, 81543, 86305, 62826, 87122, 78146, 63979, 48202, 68466, 29099, 82821, 49131, 124108, 128957, 141238, 101648, 86762, 88052, 93779, 81638, 90820, 54942, 60264, 73683, 133197, 120405, 45327, 70335, 44913, 47206, 125548, 120786, 119700, 61528, 99270, 68276, 94268, 115529, 110514, 109782, 70425, 107250, 60269, 101823, 115627, 119134, 142524, 149077, 98299, 85649, 128898, 179449, 90599]
7376I0599J06628p0643k4754j96N4138l5630N2118j8463r95n379j0550L0941J4924
7363A82738K7737Q1598l6481k6233J09591m3590j2573J27384N8312R5410L71397
7352I35290L68453L99401L94482k7912l41542m03161m97769k23523j79905j09476
7342C14338J9639l6441k7188P837m4530n7219j3820K6981j7665J2349k6314K5261
7330A83228K9147k659r7284R6263o6509R8429n0329J6118J7789J3126k9378l831
7318B04110l5181Q968J4628K2207l5569L0871k1776p5983P0428j6586j9743l2320
7306A14054P5087k5669K05M5600o2178Q6376n2643R88J7901N068J1753O661l9751
7293A83452j8016J385J0647j8812k867m0913L3382P9619m596O7286q6393M0080
$$ y = [90599, 197227, 126584, 101830, 101634, 155772, 120142, 172260, 153797, 152802, 147423, 136873, 167814, 182738, 210475, 292073, 255592, 229359, 338950, 295360, 282787, 410171, 468483, 563893, 935290, 1303743, 1703144, 2097626, 2069714, 1728172, 1325011, 827242, 603719, 423814, 314338, 333977, 297536, 270348, 278185, 233655, 176436, 162616, 189597, 171932, 184281, 157967, 183228, 212375, 209716, 112432, 208695, 142186, 240615, 190286, 206404, 224193, 237319, 207941, 204110, 168929, 177897, 192525, 214732, 179163, 210034, 188258, 112275, 182703, 166117, 146374, 114054, 189141, 163472, 163677, 209277, 147099, 233475, 180832, 181820, 199721, 204789, 216542, 223203, 183452, 165436, 166821, 177468, 158656, 155789, 114876, 148258, 227877, 223281, 290567, 204174, 244254]
7281B44254j0458L7468o234o2760M3152n0460N8497p1565Q7515o2189O0755m9765
7269B18210m2281l6141J8679N7699j1729r735J1706k8790M8040O021n3829n447
7257A72403K2282K3820m4318n7088J4987O7036n8771l394K9483G7783R156J03308
7245A90247k908o2085L5304K3971l1900N5912p6782O2357n4218K872M8441m031
7233A87180O0583k7505R407n4626M4943k3255K1004J7201L96L4843p873L8098
7221C00396k9332M0781k7539M0355j6153M9880J5879j629k1334M1230j7245o657
7209C68632r695M1807n4103J1165n3648j7902L7121K9721n297K0873j07469J46508
7197D07713j03791Q7210j8887K2161O6243l5282M3757J4449J4196j3879K2684
$$ y = [244254, 233796, 271264, 265030, 202270, 245422, 194962, 253459, 181894, 269409, 207220, 267975, 218210, 175929, 139788, 158467, 216166, 204437, 194702, 206408, 177618, 225658, 231679, 177850, 172403, 194685, 218505, 174187, 117099, 132086, 199122, 140351, 136957, 166440, 77783, 86939, 190247, 187339, 125254, 160558, 184529, 152629, 208541, 131759, 194116, 139898, 142770, 191211, 187180, 247763, 220258, 229665, 175039, 219982, 196727, 217731, 234932, 235328, 270171, 262298, 300396, 271064, 311845, 284306, 324661, 308508, 358388, 374267, 372638, 351304, 392534, 375289, 368632, 358937, 400744, 346641, 357806, 304158, 286256, 323377, 353098, 347801, 368674, 261205, 407713, 303922, 391132, 372245, 394406, 460649, 425367, 469124, 483573, 497769, 483890, 506574]
7186E06574L3261k998j0055j3705P2305M551L4966O1528j333J16972O1452j9586
7174H43932N2139J01929K1503N4589M1321J43836K47355Q5641L00066J64648K31259
7163B288218L71765M20917M31939O76052O48470R32592J014667J319840J663343
7154I767803K001172K606182L367469M503254O108965Q905933J5308025L8185321
7146I0754124O5533483R7759515P9182502N6422282l5066640p5328591r5825297
7139A83431378p9863641m1697689j8876400j0977200p421634n507850m194235
7132A4892729l195276k250648j764105j253609r42554o78652n34141l72072l43223
7123C558449j73076j96874k43448j84082j61912j69105j59188j63679j57507j41078
$$ y = [506574, 539835, 536837, 526782, 513077, 585382, 589933, 624899, 686427, 685094, 802066, 863518, 843932, 896071, 998000, 1019503, 1074092, 1115413, 1259249, 1506604, 1592245, 1892311, 2056959, 2288218, 2659983, 3080900, 3512839, 4188891, 4837361, 5769953, 6784620, 8104460, 9767803, 11768975, 14375157, 17742626, 22245880, 28354845, 37260778, 52568803, 90754124, 156287607, 254047122, 333229624, 389651906, 354585266, 279256675, 183431378, 103567737, 61870048, 42993648, 32016448, 24594814, 19086964, 14892729, 11697453, 9446805, 7682700, 6429091, 5486537, 4807885, 4273744, 3901672, 3558449, 3385373, 3188499, 2945051, 2760969, 2599057, 2429952, 2270764, 2107085, 1949578, 1808500]
7113A808500j27060j54958m2165m7982j03495p9585q2159m9631o7664n4120J1511
7102A011192q7784l8500j04094K738n1035R99K6053q0994k6586j0425l4568J4205
7090F21201q116j2095l9853k0015m6973L4855l3374K8617n2481K5493m4649k6353
7078D26257n5140P1189K3785k6035j9386O538n0867M3208j9324k7062L3572j5605
7066C91130l2233l6446R9194n9030j8502k4406J0097L3528l5744m7211K1703l7700
7054B64380K9525M745J8609n0783K2333j6117o6938J06974m487j1309l1338L0200
7042B95794M4203m1757N6332j5k0847M8070q6330K8994k3939L5022j3977M8389
7030C69939o6316J6539n617K8765K7007L2343o4962M9813m9137P1612j7035j8568
$$ y = [1808500, 1681440, 1526482, 1484317, 1436335, 1332840, 1253255, 1171096, 1121465, 1053801, 999681, 1011192, 923408, 884908, 780814, 783552, 732517, 733516, 759569, 678575, 651989, 641564, 606996, 621201, 613085, 600990, 561137, 541122, 494149, 529004, 495630, 524247, 471766, 497259, 452610, 426257, 371117, 442306, 466091, 440056, 420670, 427208, 376341, 419549, 400225, 373163, 406735, 391130, 358897, 322451, 421645, 362615, 344113, 319707, 329804, 363332, 327588, 280377, 302080, 264380, 293905, 298650, 317259, 266476, 288809, 272692, 205754, 312728, 308241, 296932, 265594, 295794, 339997, 298240, 354572, 354557, 333710, 381780, 295450, 324444, 300505, 335527, 321550, 369939, 303623, 320162, 314545, 343310, 370317, 402660, 337698, 387511, 338374, 409986, 392951, 374383]
7018C74383l1752J18993n1664o78k1981N7654n8672k8766M5757Q1543m2311J5980
7006D58486r0643J18916l0937n0718K8384n326k9218j0104O4375j450o1597O0517
6994D50685j3726m1695m9066Q198J4688k0860n4011m5155J08431l4380j0183m0589
6982B72337k8836P838M5674M263J4082r4852K4752n0614L0101K9522l8638L8922
6970B54551n1585m2051K8501O3643j3062k8275N4225m7200J0882M1669m4766R581
6958B36113o9404M774j237Q8501q4449P520M4255o1763N8982m3968L7605p0390
6946A46539R3523j8126K5927J8275j7776R7310k9552O1853N3007k9789O4384J78967
6934F44542L50914M14373M28987K53982j22145l07829n04509l91316k68619m1532
$$ y = [374383, 342631, 461624, 409960, 409282, 387301, 444955, 386283, 357517, 403274, 484817, 442506, 458486, 367843, 486759, 455822, 405104, 433488, 428162, 398944, 388840, 453215, 451765, 390168, 450685, 436959, 395264, 346198, 354396, 369084, 348224, 294213, 249058, 357489, 323109, 312926, 272337, 243501, 251339, 297013, 301276, 315358, 220506, 245258, 194644, 224745, 254267, 215629, 254551, 202966, 160915, 189416, 253059, 239997, 211722, 265947, 218747, 229629, 271298, 226532, 236113, 166709, 171483, 170246, 258747, 174298, 181818, 226073, 164310, 223292, 179324, 216929, 146539, 240062, 221936, 247863, 266138, 248362, 345672, 316120, 377973, 430980, 401191, 465575, 644542, 995456, 1409829, 1838816, 2092798, 1970653, 1662824, 1158315, 766999, 498380, 456848]
6924D56848p4441N775j9995j04653J1688J2654l6927k8413m3496l7102J4506K8546
6912A84990o0831K5936K9154p6442m296J3330K1133j7147J6243L32J6240J9973
6900A68615P0367G1126J03700m4818J9264l1197j6793j1726M5872l5165J4027
6889A14290m3823K0922j698r962C7373R1915n8574r545C371N0590K9183L5346
6877A18490E6910K5520j6537A5639L3941J6026J458L5581M3l6226C1100p819J8475
6864D1756P8222G263J22443D5977k819M1685o105A0584M5625K6733B3427b464
6851E5839n154j2017N4724m4911J8875K372L4222D3869j1640L2835O383j7951
6839E3496L1043l4014k0254K910N1579k1614r185N1064J1853e2988F1201N2103
$$ y = [456848, 382407, 388182, 368187, 263534, 275222, 287876, 250949, 222536, 179040, 141938, 156444, 184990, 124159, 150095, 179249, 102807, 98511, 111841, 132974, 115827, 132070, 132402, 148642, 168615, 238982, 71126, 174826, 130008, 149272, 118075, 101282, 89556, 135428, 100263, 114290, 70467, 91389, 89691, 79729, 37373, 129288, 70714, 61169, 3371, 53961, 83144, 118490, 56910, 82430, 65893, 15639, 49580, 65606, 67064, 102645, 102688, 66462, 31100, 23281, 41756, 119978, 7263, 129706, 45977, 43158, 84843, 78738, 10584, 56209, 82942, 23427, -2464, 55839, 50685, 38668, 93392, 48481, 67356, 69728, 103950, 43869, 32229, 65064, 71447, 53496, 84539, 50525, 30271, 33181, 84760, 63146, 53961, 105025, 116878, -52988, 61201, 113304]
6827A13304k2695k2965C2504N0649l6327N1714L129K5017N4632l0040N7074M2242
6815B50594J20172P7246L12628N73186O31628K33148k064m75731p55998l54661
6805F10148k22561r4730o1778m522l0272j5102M7180L2471q2312j1236l7754p970
6793A21562L2589M2187k8194j5262O0375j4518k4160Q383l8404P0459k1118L6391
6781B30290K345K768K8038M3683L0755Q4494N3957K90564K72085L62716L26389
6770A728084J06154k34252k43224l78133k27334j42985k6481n726j5940N7626
6760F17789R7706P4419J47917K87008L68707P94721J339182J644794J595284N83606
6750G551133j94764j269554j195899p49297o16028o23131o45472m52169j29876
$$ y = [113304, 90609, 67644, 32504, 83153, 46826, 98540, 101669, 126686, 181318, 151278, 208352, 250594, 370766, 448012, 760640, 1333826, 1965454, 2198602, 2196538, 1720807, 964809, 610148, 387587, 292857, 231079, 226557, 196285, 181183, 228363, 260834, 178522, 167286, 129532, 121562, 154151, 196338, 168144, 152882, 213257, 198739, 174579, 182962, 144558, 215017, 193899, 230290, 232635, 235403, 263441, 307124, 337879, 422373, 476330, 766894, 1038979, 1401695, 1728084, 1834238, 1599986, 1356762, 978629, 751295, 608310, 581829, 576103, 560163, 617789, 715495, 789914, 937831, 1224839, 1593546, 2388267, 3727449, 5372243, 6967527, 7551133, 7356369, 6086815, 4890916, 4141619, 3525591, 2902460, 2256988, 1804819, 1674943]
6741A674943l3088L5532J92202L64399N90310J164113K026178K794441K612729
6732A1421759J539681J31229p03649p81271p80757j032646j897551k298790j556392
6723D041613r37689m39310k74813l3668J82294L63623O67334J389937K001105
6714F960426K096891J490652J171497P71888R33824M82164q28112k366258l215278
6705G497694k633549j376512q35481m66827k66278j52853n5053J29335L59701
6696B200177N94583O07620P46147R70913J265734J299177Q67521j35158j401962
6687G014752k096951j710070j021793n11139m53002j74533j40834j29313j00289
6678F76828N8175n1123O385J51717K05268M28009L88835L69683k1742k59825m95502
$$ y = [1674943, 1641855, 1677387, 1869589, 2233988, 2824298, 3988411, 6014589, 8809030, 11421759, 12961440, 13092669, 12389020, 11607749, 10826992, 9794346, 7896795, 5598005, 4041613, 3103924, 2664614, 2389801, 2356133, 2538427, 2902050, 3569384, 4959321, 6960426, 9057317, 10547969, 11719466, 12491354, 13425178, 13907342, 13079230, 10712972, 7497694, 4864145, 3487633, 2652152, 2185325, 1919047, 1766194, 1711141, 1840476, 2200177, 2794760, 3402380, 4148527, 5119440, 6385174, 7684351, 8551872, 8416714, 7014752, 4917801, 3207731, 2185938, 1674799, 1221797, 1047264, 906430, 777117, 676828, 735003, 683880, 690265, 841982, 1047250, 1475259, 1864094, 2233777, 2212035, 1952210, 1456708]
6667A456708m27176l45319r6682j21348p5616n967m1485n6191J7398n2115Q3330
6656C35537o48l3881p2565J35833k1783M3005j4663K6597J16567j13296M7009
6645D47712K8171J2624J17614M7412M1686N5058m3335N4063m9570K387J27315
6634H41137N1273K8753K9974N8507J21135J48903J05634K55039J63389K49670
6624B053414K40192L37725N05405N41657O83943P35701R37758J139126J483544
6615H658465J780194K306654L107667L988131N560876P354025J0391860J6671094
6607E9818966M5517264R6631452J25908805P5622958O452141p6192066j49036657
6600A84722863q6812968l6710682j7318530j1684071p915426n403875m160201
$$ y = [1456708, 1029532, 684213, 587531, 466183, 390567, 384600, 343115, 286924, 304322, 252207, 335537, 334889, 301008, 228443, 364276, 342493, 385498, 370835, 397432, 513999, 400703, 447712, 475883, 488507, 606121, 653533, 695219, 750277, 706942, 761005, 711435, 713822, 841137, 892410, 921163, 951137, 1009644, 1130779, 1279682, 1385316, 1640355, 1803744, 2053414, 2293606, 2631331, 3136736, 3678393, 4362336, 5098037, 6035795, 7174921, 8658465, 10438659, 12745313, 15852980, 19841111, 25401987, 32756012, 43147872, 59818966, 105336230, 201967682, 327876487, 403499445, 409951586, 333759520, 184722863, 97909895, 61199213, 43880683, 32196612, 24281186, 18877311, 14717110]
6593A4717110k988248k217068j752355j353351q92554p24055n08711m60921k41930
6584C577917l24355j73349k90668j55767j48428j06246j14026j43775j55798j58054
6574A807451j29690j97081q5107j40538L2880j23769p3820j20300j5680p5858
6564H78488j7835L1741l1677o9560q6527L144l9142l1944o2951L1455r241m6292
6552E49659o3832m3675K5212j3647m784J1485j2897m6635l3364J3103J4241k3321
6540C71545p3386J2744K310O81l9486M0933L459k3520m7420o840o1285L7667l4014
6527A83388j606J9139L314j3372r234l8154k792L4195j0230N2661l9938j0973
6515A66398o30l2038r364L061j7310L4178k612j8187B9823L1969L1779D0126K9624
$$ y = [14717110, 11728862, 9511794, 7759439, 6406088, 5513534, 4789479, 4280768, 3819847, 3577917, 3253562, 3080213, 2789545, 2633778, 2485350, 2379104, 2265078, 2121303, 1965505, 1807451, 1677761, 1480680, 1395573, 1255035, 1287915, 1164146, 1090326, 970026, 954346, 878488, 860653, 892394, 860717, 791157, 704630, 707774, 668632, 636688, 573737, 605192, 595951, 549659, 485827, 442152, 467364, 453717, 448933, 460418, 447521, 400886, 367522, 380625, 394866, 371545, 298159, 310903, 313213, 313894, 274408, 315341, 318800, 295280, 247860, 241020, 179735, 217402, 183388, 181782, 200921, 204235, 190863, 181629, 143475, 140683, 174878, 164648, 217309, 177371, 166398, 165768, 133730, 124366, 127427, 110117, 144295, 141683, 123496, 29823, 61792, 93571, 40126, 69750]
6502F9750L2930J1349A3765M4892K7032J832p298K4621J3633N7461l4587J069
6490A42420G1182J8177l1585K5217Q539C7705M2676k8744n201a030A9211R541
6478B8752J03161j4361N7302l3327k2906k754J7449M3287F2619J04322m6601k911
6466A17429R535K4676E9852L9743M054M637J6095j2159M6067R1844n4574q541
6454A87018O018R400M0882l5782J07077J4062q3484M4035k3018N9037P9J18340
6442D43664j8247O596M2517J8169N8380J5368J27653O1768k3221J08346L3282
6431H74275P7811K29445J58306J47729J78096J23464K75152K39497M11119N19296
6421C234190N36670P48117Q28706J044974J263139J522148K000772K373239L077693
$$ y = [69750, 102680, 114029, 13765, 58657, 85689, 87521, 80223, 104844, 118477, 175938, 141351, 142420, 71182, 89359, 57774, 82991, 91530, 37705, 80381, 51637, 46436, -1030, 19211, 28752, 131913, 117552, 174854, 141527, 118621, 115867, 133316, 176603, 62619, 166941, 120340, 117429, 126964, 151640, 59852, 99595, 103649, 108286, 124381, 112222, 158289, 250133, 195559, 187018, 193036, 202436, 243318, 207536, 314613, 328675, 245191, 289226, 266208, 325245, 325324, 443664, 425417, 432013, 474530, 492699, 551079, 566447, 694100, 755868, 732647, 840993, 874275, 952086, 1181531, 1339837, 1487566, 1665662, 1789126, 2064278, 2303775, 2714894, 3234190, 3770860, 4518977, 5347683, 6392657, 7655796, 9177944, 11178716, 13551955, 16629648]
6412A6629648L887341N745224Q481210J3185464K5976348P4380087J10764134
6405B59049456J22667436L4916774k4741052j36818810j20171453n9290807k3997214
6398E1614330j4210568r705112o135511m300483k993321j988317j743052j554514
6390H983452j804263j368062r68697o01581n00144l36798j86740k65128k09469
6381B742570k52964j60187j95586n3341j60511k01122j25373j14189j52255p3459
6371A253583m5800r9071o8255p5985l9116o0782J2448p5732k2377r3385l9386
6360F46142j5524l2805m5843k9448l2473M6139j9190K1663n3182k2674j2320K3405
6348D73890j66775R5745p9278P1683j05779J3868M0243o9971K7049l4287l4550
$$ y = [16629648, 20516989, 26262213, 34743423, 47928887, 73905235, 148285322, 259049456, 381716892, 416633666, 391892614, 255073804, 134902351, 75611544, 51614330, 37403762, 27698650, 21563139, 17262656, 14269335, 12281018, 10537966, 8983452, 7179189, 5811127, 4842430, 4240849, 3740705, 3403907, 3217167, 2952039, 2742570, 2489606, 2329419, 2133833, 2080492, 1919981, 1718859, 1593486, 1479297, 1327042, 1253583, 1207783, 1108712, 1040457, 964472, 925356, 864574, 877022, 801290, 778913, 685528, 646142, 630618, 597813, 551970, 522522, 490049, 536188, 516998, 538661, 485479, 462805, 450485, 473890, 307115, 402860, 323582, 395265, 289486, 303354, 343597, 273626, 300675, 266388, 231838]
6337B31838j4636K9928p0066l171l0563n0504J32760k9315r7150N3591Q0838p375
6325B26175l2864m4493j633q456J5237p358j8653P555Q3778q2131m0368O465l7179
6312F6075L3209D4396r221O8240k0164k9473N0896j7041L2460K1802o355C7716
6299A32119M0992E2421M3772M5885D4723K8233B897L7181j7806O3122f775E4986
6286I3427B6153K6888c0223E6613k4218m27j4847K8549o88o614K2393A7212R165
6273B6377L0306l574H367P2963A7504J1892a5273B9241K4294M698B4132A1453
6260G2244P591A07b235o844B6312k630L5317k5695L3227K4450B5646q07k256b1438
6245a4992L030D1547K7957B2312l130c4745E7394p554a715k060C2141K9667l0322
$$ y = [231838, 217202, 247130, 177064, 173893, 143330, 92826, 225586, 196271, 99121, 152712, 233550, 226175, 193311, 148818, 147185, 138729, 153966, 146608, 127955, 135510, 219288, 137157, 96789, 103254, 66075, 99284, 44396, 35175, 103415, 83251, 53778, 104674, 87633, 120093, 141895, 135540, 37716, 132119, 173111, 52421, 96193, 142078, 44723, 72956, 2897, 40078, 22272, 85394, -6775, 54986, 93427, 26153, 53041, -30223, 56613, 32395, 31968, 17121, 45670, 44982, 38368, 60761, 17212, 26377, 56683, 53109, 8367, 81330, 17504, 29396, -15273, 29241, 53535, 58233, 24132, 11453, 72244, 79835, 107, -2235, -9079, 26312, 23682, 58999, 33304, 66531, 90981, 25646, 24839, 22583, -21438, -14992, -11962, 41547, 69504, 22312, 19182, -34745, 57394, 49840, -1715, -3775, 32141, 61808, 31486]
6232C1486H467c1122D2018k145j1299c6550A1205K0262N0105B3081J1190J4229
6220D8500M095e606A13328e5337B5816N585I798M745Q5323A8708O682K4529L8074
6207H7993N204B7948I500K9136J19926J6710j5332K3434K0448J73345O7720L78886
6195H23773M84930P15505L27981m3742m09283o75410l95449j93394L9462L0149
6185G04522J34029Q4747K25426J86616L14921O49565J121745J821999K359720
6176G603290K468386J672262J98687j412548k223368k449901j821004j093500
6168B942304n23245l30613j12368p2733K0246J35337K35691P42411J337244K055248
6158F429522K359439J948806Q53317q08176j943947k388407k056871j326511p06647
$$ y = [31486, 8467, -31122, 42018, 39873, 28574, -36550, 11205, 31467, 81572, 23081, 34271, 48500, 52595, -5606, 113328, -55337, 25816, 31401, 9798, 14543, 99866, 18708, 25390, 49919, 87993, 93197, 27948, 9500, 38636, 158562, 175272, 159940, 183374, 203822, 377167, 444887, 823773, 1308703, 2024208, 2352189, 2308447, 1899164, 1223754, 828305, 634911, 674373, 704522, 838551, 923298, 1148724, 1335340, 1650261, 2299826, 3421571, 5243570, 7603290, 10071676, 11743938, 11942625, 10530077, 8306709, 5856808, 4035804, 2942304, 2419059, 2088446, 1976078, 1903345, 1923591, 2058928, 2294619, 3037030, 4374274, 6429522, 8788961, 10737767, 11591084, 10782908, 8838961, 6450554, 4393683, 3067172, 2360525]
6149B360525n05901j05639q3584k6417k5858J76490J42911K72551L57821N95272
6139C158171J265402K239768L231091L757553L268682J353606r56647l074016
6131A4243610l725104l235918k160856j285200n82612k63739o3020m6574Q9919
6122B970506K92812P66199J521526K554899L446124L281153K033454j33932k221593
6113A4511148l446613l415581k591236j594222r15828m55961l14996m01481k06195
6104A169035k26862k37462j16801r2339r3447Q623m0274p2992j6139p6238R3903
6093B99007n7889o2818K4506p0183j5424O360P778J0439k0585j2805J710N8847
6081A68943L057p4885R558l2283j404K1025k5580N680Q3801A3330O373N689K1686
$$ y = [2360525, 1854624, 1748985, 1665401, 1638984, 1613126, 1789616, 1932527, 2205078, 2562899, 3158171, 4423573, 6663341, 9894432, 13651985, 16920667, 18274273, 17317626, 14243610, 10518506, 7282588, 5121732, 3836532, 3253920, 2990181, 2927161, 2880587, 2970506, 3263318, 4029517, 5551043, 8105942, 11552066, 14833219, 16866673, 16732741, 14511148, 11064535, 7648954, 5057718, 3463496, 2547668, 2091707, 1776711, 1375230, 1169035, 942173, 704711, 587910, 495571, 402124, 410747, 370473, 297481, 281342, 205104, 299007, 241118, 178300, 202806, 132623, 117199, 123559, 131337, 141776, 121191, 108386, 110096, 168943, 172000, 97115, 106673, 74390, 72986, 94011, 68431, 74111, 157912, 13330, 19703, 25392, 47078]
6068D7078k1475p926K852J0387A4333P0625a1360D4918K7025A7950R748L7329
6056F5027A8813J0507Q5J970c3977e887K331F5264k0707j3362M8861D343L4054
6043C8397B925J6035J084J9305R591A1531M1072J1940A0572L0443J5242a1213
6030C787K1837N195m105M2609Q5O3104E9665h63B9402L3960k7535M2518r120j4251
6016E4974j4375J3991J9558L3035K82k4115L3741Q673K13k3072l5972Q9840O9468
6003B26241j5464O906J1905L0226R1842K6924N2797J30751M4242K07041J97732
5992A011143K66254K81544L28208M94750Q82323J482746K718901L899929M031259
5983A5397057K972536L37898k376222l939949l987635k894285j698984q99332
$$ y = [47078, 25603, 17677, 20529, 30916, 14333, 84958, -11360, 44918, 71943, 17950, 27698, 65027, 18813, 29320, 29405, 31375, -33977, -5887, -3556, 65264, 44557, 31195, 80056, 4343, 38397, 2925, 18960, 20044, 39349, 48940, 11531, 52603, 64543, 10572, 41015, 56257, -11213, 3787, 25624, 30819, 26714, 69323, 69408, 132512, 59665, -863, 29402, 63362, 35827, 78345, 69225, 54974, 40599, 54590, 74148, 107183, 107465, 83350, 117091, 125764, 125977, 102905, 66933, 156773, 226241, 210777, 217683, 229588, 259814, 351656, 378580, 431377, 562128, 606370, 813411, 1011143, 1277397, 1558941, 1887149, 2381899, 3264222, 4746968, 7465869, 11365798, 15397057, 18369593, 18707491, 16331269, 12391320, 8403685, 5509400, 3810416, 2911084]
5975B911084m00643l16651k27758k24224n0548J8352O5670M24216M60286O84147
5965C343931P34488J081239J793569K841803L653970L292350J442997j123189
5957A7061158l331577l998645l223342k048906j015941m83454l09144k7671J0711
5948B633189J36520N61245J153852K249517K723328K399050J043632p53499k396252
5939I750582k826260k322583j507974q24242m25069k68072j57000j61789m4223
5930A213370j13220J09357l1160J99934K11978K58970M06467J017256J734695
5921E007647K449524K540853J757559M7667j708478k610363k544743j727165j032788
5912B179713n69377k46725k88008j62971k21530j13675j50373q1457j8737q7382
$$ y = [2911084, 2510441, 2193790, 1966032, 1741808, 1691260, 1709612, 1775282, 2199498, 2659784, 3343931, 4078419, 5159658, 6953227, 9795030, 13449000, 16741350, 18184347, 17061158, 13729581, 9730936, 6507594, 4458688, 3442747, 2959293, 2650149, 2622478, 2633189, 2769709, 3330954, 4484806, 6734323, 9457651, 11856701, 12900333, 12146834, 9750582, 6924322, 4601739, 3093765, 2269523, 1844454, 1576382, 1419382, 1257593, 1213370, 1100150, 1209507, 1178347, 1378281, 1590259, 1849229, 2255696, 3272952, 5007647, 7457171, 9998024, 11755583, 11803250, 10094772, 7484409, 4939666, 3212501, 2179713, 1610336, 1363611, 1075603, 912632, 691102, 577427, 427054, 345597, 326860, 239478]
5902B39478j7395j5408M7051r7544R1349p9515K6752l518n6991M928L9051q0113
5890I8125j3789L1422j9407M3030J08687j17676P3949I0278O269L5536n4611K4442
5878A01914O510q942k4767A9526K3357O4975B733N7900B1066K5432K1366K9832
5866I7696J8437n4740k1953A60J8068M3156j0487L5680r571C7180N3615j8282
5854G2513R25l6420A4745J03507k2297M7163J81l509k050C3724J1197j639L9915
5841H3197m1035N5642k1510j9922o607j0545f19I3277k685l6497O3311r436l4950
5828G3020R804C6726Q1123o132k6596O352q267q753k1934N1267j9413H542M5922
5815E4464j0611M8692R1530m9971o4387j6798L8628p090L8948l4667M1173K5506
$$ y = [239478, 222083, 206675, 253726, 156182, 247531, 168016, 194768, 191250, 134259, 139187, 178238, 98125, 84336, 115758, 96351, 139381, 248068, 130392, 204341, 90278, 96547, 132083, 77472, 101914, 108424, 99482, 74715, 19526, 42883, 107858, 2733, 60633, 21066, 46498, 67864, 97696, 116133, 61393, 39440, 160, 18228, 61384, 50897, 86577, 77006, 37180, 90795, 72513, 73438, 37018, 14745, 118252, 95955, 143118, 143299, 139790, 137740, 33724, 44921, 43282, 83197, 42162, 97804, 76294, 56372, 49765, 39220, -619, 93277, 90592, 54095, 117406, 107970, 73020, 82824, 36726, 117849, 111717, 85121, 91473, 83206, 74453, 52519, 103786, 84373, 8542, 54464, 43853, 92545, 184075, 134104, 69717, 52919, 91547, 84457, 123405, 88738, 129911, 155417]
5803A55417P124k1370L3867o09J4863k7568N9509L1493N5033q5575R8251o5279
5791B55156K6140Q3265P2027k8339N1205l1893O8162O6703L5570J04352N3144
5780G55492J56996R4842J44948J56545K67686K98428K52912L89882N14281N89617
5770C621629P93057R15935J122960J391311J943968K466841L557435N112352R225413
5761C0150901K5284593N0850608O5497579M0214424J625045m3074645p4231488
5754I6317017m5617698j9566137r026010n625614l826550k784026k274345j607160
5746E989477j117169q72235p28029m04971l51738k85547j43793j64275j21639
5737A800081j23028k27368m5193j26348j14167Q407j15454l9822q7800j7722j29559
$$ y = [155417, 162541, 141171, 175038, 174429, 189292, 161724, 221233, 252726, 307759, 222184, 320435, 255156, 281296, 364561, 436588, 408249, 459454, 427561, 495723, 562426, 597996, 702348, 755492, 912488, 1007330, 1152278, 1308823, 1576509, 1874937, 2127849, 2517731, 3032012, 3621629, 4414686, 5330621, 6453581, 7844892, 9788860, 12255701, 15813136, 20925488, 30150901, 55435494, 106286102, 171783681, 211998105, 213623150, 170548505, 96317017, 50699319, 31133182, 22107172, 16481558, 12655008, 9870982, 7596637, 5989477, 4872308, 4000073, 3272044, 2867073, 2515335, 2229788, 2085995, 1921720, 1800081, 1677053, 1449685, 1404492, 1278144, 1163977, 1172384, 1056930, 1017108, 929308, 911586, 782027]
5726G82027j4098l1413j35720o8233M8311j50857N3164K946q0103J1707p8076
5715C39655M912j5786J295l2145J2801k7103p148k669m3397N4384l4186P136m4604
5702B13145q7629N5523l9830Q5298q9068O0640q6158L2558q385K4637p8102L121
5690H5750N8629m5970q548L9913m2802L108P901l4090q895B6200N6297d2891H2212
5676G9436k8154J3209C744O4864a2934A12564I564M3734p406j8943G199J1991
5664A9190p804M2737L9057A9802i08I313M804J8405K1121a7369A5361P2696k3115
5651F4942e706C3898C403L18F20P742M1468b1577j7584g19C9922j3276n633J0728
5637C1741j4450C234J8193a2888O138l859C3530k693L6680k0541d0993H631g645
$$ y = [782027, 767929, 736516, 600796, 532563, 580874, 430017, 483181, 486127, 406024, 417731, 339655, 344567, 328781, 330076, 297931, 310732, 283629, 276481, 273812, 230415, 284799, 250613, 257749, 213145, 125516, 181039, 141209, 226507, 137439, 198079, 111921, 144479, 136094, 160731, 82629, 85750, 144379, 98409, 89861, 129774, 86972, 90080, 97981, 63891, 54996, 26200, 82497, -42891, 82212, 79436, 51282, 64491, 3744, 68608, -12934, 112564, 9564, 53298, 45892, 26949, 7199, 19190, 11386, 54123, 93180, 19802, -908, 9313, 14117, 32522, 53643, -17369, 15361, 88057, 64942, -5706, 33898, 3403, 3721, 620, 8362, 49830, -21577, -39161, -719, 39922, 26646, 21013, 31741, 17291, 3234, 21427, -12888, -6750, -10609, 33530, 30837, 67517, 46976, -40993, 8631, -7645]
5623B3221e063B3016a6543a044A8598O978L7803O67B1120M3964E268J349a1217
5609G5201C0618j3900a8645b279C6373P741d5726B9823O065A6655o840C909J1520
5596A5429b6861B6056G950f7098B2527K6037A8037O194B350c2259R533a1096D9266
5582a2493m9055C9299c6258A5985a7663A3711Q579k528H041C469L5658b006A431
5568a500E481O275b8173E5543c0165Q192D8331P060A874J5295f91D7038j4972
5555C2066J1463I972P2037J0231j1112R0916p868K67600K88393L35037L2558k8704
5543A059060l97769k71362j48637j18142n4474m487l0215a9193G7751b9476A4025
5531C6630b2485A7593b2849P076E5579d630H717e2278D450a6001C6030K0176k0810
$$ y = [23221, -5063, 23016, -16543, -1044, 18598, 25576, 63379, 64046, 21120, 65084, 5268, 6617, -11217, 75201, 30618, 16718, -18645, -2279, 36373, 44114, -45726, 29823, 35888, 16655, 9815, 3909, 15429, -26861, 26056, 7950, -67098, 22527, 48564, 18037, 24231, 2350, -32259, -22726, -11096, 49266, -12493, -61548, 39299, -36258, 15985, -17663, 13711, 22290, 19762, 8041, 3469, 39127, -2006, 1431, -1500, 5481, 11756, -28173, 55543, -30165, -21973, 48331, 55391, 1874, 17169, -691, 47038, 32066, 43529, 9972, 82009, 92240, 81128, 172044, 164176, 431776, 720169, 1055206, 1087764, 1059060, 661291, 389929, 241292, 123150, 68676, 64189, 33974, -19193, 77751, -29476, 14025, 36630, -22485, 17593, -22849, -15773, 55579, -4630, 8717, -52278, 4450, -16001, 36030, 56206, 35396]
5518C5396d2641a7566A9612R756d5430h910A3146D776c5027D5288j7452b2659
5505a2332C1961d893B2933M850a1969M496C0614j1067r62b761C3734a3906O709
5492g197j013j339H0183a1307D6312d3056b1348Q353B1688N4442B6091L4263A7407
5478I4825a4712n716e78j0288D689g8393A204J1081a33B182b2582F5723k0812
5465D4911b1776a095B6573a7719k991D2410A2830M0704K916A2240b054A1485A280
5451c7802G3617c591n887l702l9165R641K1184m6105A6200a867A0685L703J6061
5438C0449j1857K2199A0556D462O3974A7462l785h32A782p74d4864C3139e281
5424E8362g12B8504H482J9055F038O379G50d2946C456i037C9852b9848B3283a4255
$$ y = [35396, -42641, -17566, 19612, 29368, -45430, -8910, 13146, 4776, -35027, 45288, 27836, -22659, -12332, 31961, -4893, 22933, 27783, -11969, -7473, 30614, 19547, 18585, -2761, 33734, -13906, -7197, -8210, -9549, 80183, -11307, 46312, -43056, -21348, -12995, 21688, 76130, 26091, 60354, 17407, 94825, -14712, -20428, -578, -10866, 4689, -78393, 1204, 12285, -133, 2182, -22582, 65723, 44911, -21776, -1095, 26573, -17719, -20710, 42410, 12830, 53534, 56450, 12240, -2054, 11485, 1280, -37802, 73617, -3591, -9478, -13180, -52345, -42704, -21520, -67625, 16200, -1867, 10685, 14388, 30449, 18592, 40791, 10556, 4462, 68436, 17462, 13677, -832, 1782, 1008, -44864, 33139, -5281, 58362, -712, 28504, 8482, 27537, 6038, 12417, 750, -42946, 3456, -9037, 39852, -29848, 23283, -14255]
5409C7788j4745a9858I359M4179a589j2996C8154I237K0372a3528A7298b7037
5396G968P353Q87i521k863B5908C107O7158B4850b0787e373a410A1418f5234i820
5381C2763J6592d0862k4908A6789f61j0813B2889G196b7153B030J0565b1461a0301
5367d6617B9571b9704E347b3845j5976B0746M6467a0002k3691B2272n513K6503
5355D3262a2209G424K1839A2100b693n627k7382A863d6018D896M0313b0765B7071
5341E6172B4011K5366e3616b6035M600k1511A9499L0878B93L6493o825J943e850
5327C3372c7009j2324A3948d022C2755A4497j77h009K051p3219L634h297l4295
5314d2592a7036K510D3046k413a3612F3327h5716A0040c8080E3300k5651I519
$$ y = [37788, 23043, -19858, 9359, 53538, -1589, -14585, 38154, 9237, 29609, -13528, 17298, -27037, 7968, 15321, 16208, -9521, -12384, 25908, 3107, 70265, 24850, -20787, -5373, -1410, 11418, -65234, -9820, 32763, 49355, -40862, -65770, 16789, -661, -11474, 22889, 7196, -27153, 2030, 12595, -21461, -10301, -46617, 29571, -29704, 5347, -23845, -39821, 20746, 67213, -10002, -33693, 22272, 16759, 43262, -12209, 7424, 29263, 12100, -2693, -8320, -35702, 1863, -46018, 4896, 45209, -20765, 27071, 56172, 24011, 49377, -53616, -26035, -21435, -42946, 19499, 50377, 293, 36786, 29961, 31904, -5850, 33372, -37009, -49333, 13948, -4022, 32755, 14497, 14320, -8009, -5958, -79177, -75543, -8297, -42592, -17036, -14526, 43046, 40633, -13612, 63327, -85716, 10040, -38080, 53300, 27649, 9519]
5301d321H3729E761K4883g1108E1774e033L82l4567b105l0380J0336B1671K5944
5288D7615E596c4994R559k996q204D2220i7053a0796C0528b484A3213b4523A0577
5274A4749h910k8303a7796E0976a2068B2713b0720R497B4413c4129R783j4911
5262c9257C2494N709k451o012m622b060A9298b8542D0406L0841h922l360A4979
5248F9721c0301D4439a007D069K7152g0B8174e8130K1035C003g576F4399B2845
5234F6508i768l1094J0742A2101C211a3713A9630K442d1807j9951b4910d97A6133
5220d2325C4276J5132a4695C4890D940e2239a2668E689L0627P290A4424d9543
5207B7781A458J9522m126l137N9232c909B9354J031D824K4236o483g9813B8875
$$ y = [-4321, 83729, 5761, 30644, -71108, 51774, -5033, -4651, -39218, -2105, -32485, -22149, 21671, 47615, 5596, -34994, -25435, -28431, -36635, 42220, -97053, -10796, 30528, -2484, 13213, -24523, 10577, 14749, -8910, -37213, -17796, 50976, -12068, 22713, -20720, -11223, 24413, -34129, -24346, -39257, 32494, 38203, 35752, 29740, 25118, -2060, 19298, -28542, 40406, 71247, -8922, -12282, 14979, 69721, -30301, 44439, -1007, 4069, 31221, -70, 28174, -58130, -37095, 3003, -7576, 64399, 22845, 66508, -9768, -40862, -30120, 12101, 3211, -13713, 19630, 22072, -41807, -61758, -24910, -497, 16133, -42325, 34276, 49408, -14695, 34890, 4940, -52239, -12668, 5689, 36316, 43606, 14424, -49543, 27781, 1458, 20980, 16854, 13717, 72949, -3909, 29354, 30385, 4824, 29060, 22577, -79813, 28875]
5193B2898a8128M395F3263k4386m092b3952F065d1600l7170C866f184D2369b3978
5179G502Q69J977M4371I17L6752b6344a2301A6622c327m4716K0915n302l6047
5166f8477a1858p324D7239h454c289A5208K0977d9539D1345c776A3300e6823A8630
5152h155B5026p494b3629e5k0903f729C3581m016J0197b524k2760L153j8574a1587
5137D978M7601b0095E16b6254E6339k0278b1068E8791d8928A79L9055e559m2806
5124d8365F7985E946K2287K6521r032c8724a4583B5254A0072c8378E288a3369
5111A1430b010l0713a3504L528E1790B4054d7189a981A0585b1070j07l9621D5524
5097b220G2342a2604p39c760j3612O555m2917A7311a8583D5499r841A6523c4029
$$ y = [22898, -18128, -13733, 63263, 38877, 34785, -23952, 6065, -41600, -78770, 3866, -6184, 42369, -23978, 7502, 8371, 10348, 54719, 917, 37669, -26344, -12301, 16622, -3327, -48043, -27128, -32430, -68477, -11858, -19182, 47239, -8454, -3289, 15208, 36185, -49539, 41345, -3776, 13300, -56823, 18630, -8155, 25026, 17532, -23629, -55, -20958, -6729, 33581, 29565, 39762, -2524, -25284, -22131, -40705, -11587, 4978, 52579, -20095, 516, -26254, 56339, 36061, -21068, 58791, -48928, 179, 39234, -5559, -48365, 67985, 5946, 28233, 54754, 45722, -38724, -14583, 25254, 10072, -38378, 5288, -13369, 11430, -2010, -32723, -13504, -9976, 51790, 24054, -47189, -1981, 10585, -21070, -21177, -60798, 45524, -2220, 72342, -12604, -13343, -3760, -17372, -10817, -53734, 17311, -18583, 45499, 35658, 16523, -34029]
5083A5177F806e360k0583B7855c6298H564a4157B1599b3145a0919j218k739p7500
5070i2376A2247R468K7141b9591C7387A4029d9964H725O535J493a5376a61A3406
5056A6693f380A4450J6097A4846b0603C1752L2784a3875o994b381p49k2455A0289
5042a1746A5996a3700C5917c186l8632F3545a2724a393l2110A2427e5262i327
5029C2036b5172D6494A5779b3399k4637C1972A4605b3676D3672D89e3216a8719
5016b8300D732K3227J0243G01P2011B1581d1093A0291K0090b2475B7985i655F0832
5002d2546c840j378o2634K3586B7889j1157e2663A1120A884a0495B5283F768Q005
4989A4773c0828E6754B7447h6564R029b8589j0623J2859b138A5920K6865o997
$$ y = [15177, 6806, -5360, -25943, 27855, -36298, 8564, -14157, 21599, -23145, -10919, -12137, -14876, -92376, 12247, 21715, 48856, -29591, 37387, 14029, -49964, 8725, 15260, 16753, -15376, -161, 13406, 16693, -6380, 14450, 30547, 14846, -20603, 31752, 64536, -13875, -20869, -2381, -3130, -25585, 10289, -11746, 15996, -13700, 35917, -3186, -41818, 63545, -12724, -1393, -33503, 12427, -55262, -9327, 32036, -25172, 46494, 15779, -23399, -48036, 31972, 14605, -23676, 43672, 489, -53216, -18719, -28300, 4732, 27959, 38202, 701, 72712, 21581, -41093, 10291, 30381, -22475, 27985, -9655, 60832, -42546, -3840, -5218, -67852, -44266, 27889, 16732, -52663, 11120, 1884, -10495, 25283, 6768, 14773, -30828, 56754, 27447, -86564, -77535, -28589, -39212, -26353, -2138, 15920, 42785, 35788]
4977C5788j3629d0899E5797B6570j0022c6411F3614A7358L090e8246a2075B4599
4964B6769I270b732B0334M031c1129D1427d2569C0233r674K6128c7916f554l49
4951f903A6724b0065p226K844m513a0618q414A9242o941k336a9703j8967k1006
4938e9676b3210a44l7679D3736A483a910l6885A5066a583j5494B4964C811M7224
4925E1035b4487m766a320n9599D8424b8951j6078h849B008J851c6730C0454D573
4911g346H893L5387a2846E2967A492h554F3133B362d7537A3310a1361A6835a3568
4897b7923j7309a4659F51L1938A3058f2933d093A7797G135a3520G454a9599i286
4883b1307I923b4541D0728d7967B5823g563k469J203G689R488Q778G11O554R531
$$ y = [35788, 22159, -40899, 55797, 26570, 16548, -36411, 63614, 17358, 20448, -58246, -12075, 24599, 26769, 9270, -2732, 20334, 24365, -31129, 41427, -42569, 30233, 20559, 46687, -37916, -6554, -6903, 16724, -20065, -27291, -24447, -28960, -10618, -19032, 19242, 12301, 9965, -19703, -38670, -59676, -23210, -144, -37823, 43736, 1483, -1910, -38795, 15066, -1583, -17077, 24964, 3811, 51035, -24487, -29253, -1320, -60919, 48424, -28951, -45029, -8849, 2008, 3859, -36730, 30454, 4573, -7346, 8893, 44280, -12846, 52967, 1492, -8554, 63133, 2362, -47537, 13310, -11361, 16835, -13568, -27923, -45232, -14659, 651, 32589, 13058, -62933, -4093, 17797, 7135, -13520, 7454, -19599, -9286, -21307, 9923, -24541, 40728, -47967, 25823, -7563, -10032, -8829, 7689, 17177, 25955, 711, 7265, 16796]
4869A6796R016g0242B0206B121a6035m570E9436d6959a9209B2808b2650l0016
4857e2666C1352c6134A0211r07J9071h495l9075A5689D204f7B0792D462a6211
4843a1274D7332a0738C38d3219d271A7376c8308A1279P336N74e386D4846k28J309
4829D5927B0832N1217a8461A1823b73n0302B2989C794c8607H400P8925C8594A016
4815e6378J9222F1954h952B4254O723j1135g2869l19B2851b6202A931C21L1915
4802C2236H057e2394a4004m843O360F4610A3079a989f6o178F402d7666d162m1762
4788d5924E5135j6152B612R496J5985c0625i360l510l0434b342j0078A4815a2645
4774a9854A2884l048K5407j3835p404a0220p976p3992a0833L240A6800K3141j9360
$$ y = [16796, 25812, -70242, 20206, 2121, -16035, -20605, 59436, -46959, -19209, 22808, -22650, -52666, 31352, -36134, 10211, 9304, 28375, -8495, -47570, 15689, 4204, -67, 20792, 4462, -16211, -11274, 47332, -10738, 338, -43219, -4271, 17376, -38308, 11279, 18615, 19189, -5386, 44846, 44618, 45927, 20832, 72049, -18461, 11823, -273, -50575, 22989, 3794, -38607, 8400, 87325, 38594, 1016, -56378, -37156, 61954, -8952, 24254, 30977, 19842, -72869, -73188, 22851, -26202, 1931, 321, 32236, 8057, -52394, -14004, -18847, -12487, 64610, 13079, -1989, -66, -6244, 6402, -47666, -4162, -45924, 55135, 38983, 2612, 12108, 28093, -30625, -9360, -12870, -43304, -2342, -12420, 14815, -12645, -19854, 12884, 9836, 35243, 21408, 14004, -10220, -18196, -92188, -10833, -7593, 16800, 39941, 20581]
4761B0581K2788c972j5599f085A5701L0465c6278B978L471M5251a0566E805f921
4747C3296j0541K8482A9536i9j7947B4227c597q588a161A020J4871b9373l38G521
4732d903p630n524O240D1468c2228r119J7991D7045A4492b5192j303L465a0762
4718c6296F41O572C161J8066c665I447f5173G6138B7182o874K9483B3276P333
4705C0609M0767c4724C0782j668a03464D6029j9804c3259r786a8187m0742B3768
4692d3757B7098J98K1880f7463h648k170n307j3945G841L7819a2690O185j7474
4679b3979A1550c482C989d6157a8687D057j793K658O011b8608J1703m1256J5240
4666d2921F5567a6183D3513p007J5115k2679b2719A3392i607H85J2506a6571A2801
$$ y = [20581, 43369, -3972, -19571, -6085, 15701, 46166, -36278, 2978, 6449, 51700, -10566, 5805, -6921, 33296, 22755, 51237, 19536, -99, -18046, 24227, -3597, -12185, -1161, 1020, 15891, -29373, -29711, 7521, -4903, -12533, -18057, -11817, 41468, -32228, -41347, -23356, 47045, 14492, -25192, -26495, -23030, -10762, -36296, 641, 7213, 3161, 21227, -3665, 9447, -65173, 76138, 27182, 20308, 49791, 23276, 30609, 71376, -34724, 30782, 29114, -103464, 46029, 26225, -33259, -43045, -18187, -58929, 23768, -43757, 27098, 27296, 49176, -67463, -8648, -10818, -16125, -30070, 7841, 45660, -12690, -6505, -23979, 11550, -3482, 3989, -46157, -18687, 4057, 2264, 4922, 10933, -28608, -16905, -58161, -42921, 65567, -16183, 43513, 36506, 51621, 28942, -22719, 13392, -9607, 885, 13391, -16571, 12801]
4652f922C0195i0q8534L2026c493o3342h522j0913d350B4459C523J846c9790A9277
4637i230j9661F1996f0761K2963l0069a710H20M071c1161l9046h550l2475D5809
4623a9236p35l7683C1444L684A0414P0735d875o3642a5040E1473D354b1061B8366
4609E2c443A1019K5628G559a926B2157a1717N450A4601Q186a4147j7241a715m6466
4595d8181D2380D535a1854F860q78e4770C6175G783M4167d9104i164C5960J4816
4582E0776Q532b3705b335A4892b231j2496l882j1741g368k2004P029A7253L3155
4569E0408P610a7976B4118h817A0136i932D138M3337A8527M209b1032C9071m112
4556C4959E602f4539K3352a8363E385M4809B3355c4423P096J2781A9721p54d2149
$$ y = [-6922, 30195, -90, -88624, -56598, -3493, -66835, -8522, -19435, -4350, 24459, 3523, 5369, -39790, 19277, -9230, -28891, 61996, -60761, -37798, -67867, -1710, 820, 4891, -31161, -70207, -8550, -41025, 45809, -19236, -19971, -57654, 31444, 35128, 10414, 81149, -4875, -68517, -15040, 51473, 4354, -21061, 28366, 52, -3443, 11019, 36647, 7559, -1926, 22157, -11717, -6267, 14601, 22787, -14147, -31388, -1715, -48181, 42380, 4535, -11854, 6860, 5982, -54770, 36175, 7783, 51950, -49104, -9164, 35960, 50776, 59308, -23705, -2335, 14892, -2231, -14727, -18609, -30350, -7368, -29372, -22343, 17253, 50408, 58018, -17976, 24118, -8817, 10136, -9932, 4138, 47475, 18527, 22736, -21032, 39071, 34959, 5602, -64539, -41187, -18363, 5385, 50194, 23355, -34423, -27327, -14546, 19721, 18967, -42149]
4542c2885j1753B0422M535K86L5570a2291n1395a4061O797B3786d6933C9282c7457
4528C097c722n0464B9446L3778b4359B8043p113a6574e986B0046b6939D1486p74
4515D0712j6599d3351Q895c157j6281D8911B3368b158B7654D250K6643j3895J2281
4502B9279e419j0705a315D790M6622f020A2327b7779k0853A1854a2246R47B3867
4488i503n7313D6927k2993F704d1007c442r483n7970a3256M791n557E2697j275
4475E1422B0144d200A8704c6983B9175A338f444q448G437c8267D8449L5572i231
4461A0005f8108D488d751H525j321L539K7003a0611d263a828M57m259k0101A7034
4446d2375E339k584J1845M9047A0102L3960B1130e002k7607k2474B172K3853D435
$$ y = [-32885, -44638, 20422, 24957, 25243, 60813, -12291, -63686, -14061, -7264, 23786, -46933, 39282, -37457, 3097, -3722, -54186, 29446, 63224, -24359, 28043, 20930, -16574, -5986, 20046, -26939, 41486, 40712, 24113, -43351, -34456, -3157, -19438, 48911, 23368, -2158, 27654, 4250, 30893, 16998, 29279, -5419, -16124, -1315, 4790, 51412, -6020, 12327, -27779, -48632, 11854, -12246, -11299, 23867, -9503, -66816, 46927, 23934, 6704, -41007, -3442, -12925, -70895, -13256, -8465, -14022, 52697, 51422, 20144, -4200, 18704, -36983, 29175, 1338, -6444, -14892, 7437, -38267, 48449, 84021, -9231, 10005, -68108, 4488, -4751, 8525, 7204, 10743, 37746, -10611, -4263, -1828, -1371, -5630, -25731, 17034, -42375, 5339, 2755, 14600, 63647, 10102, 44062, 21130, -5002, -32609, -55083, 2172, 26025, 4435]
4432A8262J9806L2514A2476k018K0002c3522C995e3951c385k0099A675c1035F4191
4418B5419d8469A8530d4237d743F7392A0746c0180F441L8149a4729k0104B1770
4405a8221E8305G364Q2874B3694r517m137l994f517G49a9024k1978P108C7506
4391a7712A6694b1790A9344f1053A6712c2330B387L5967j8330j342m123Q310e6494
4377b5206a0457j015j6009g829r941C5778j4618J7419c4316k4182g759A9108J6965
4364C6073A2573f2658d871A411N984K0411a6862j4671A5930c037o440A6257f0723
4350d4374D1558k0106O131d0865C0754b0337c4m453D3631k1466A301K4136J3977
4337C9414g0808a7112j1086c26r185j665G629L4763A6918C009J6025b3401j1306
$$ y = [18262, 38068, 70582, 12476, 10458, 30460, -33522, 3995, -53951, -3385, -23484, 1675, -31035, 64191, 25419, -48469, 18530, -44237, -4743, 67392, 10746, -30180, 6441, 44590, -14729, -34833, 21770, -18221, 58305, 7364, 90238, 23694, 14177, 10040, 6046, -6517, 749, -19024, -41002, -33894, 37506, -17712, 16694, -21790, 19344, -61053, 16712, -32330, 2387, 38354, 20024, 18682, 14559, 22869, -56494, -25206, -10457, -11472, -27481, -7829, -17770, 35778, 21160, 38579, -34316, -58498, -7759, 19108, 36073, 12573, -62658, -4871, 1411, 7395, 27806, -16862, -31533, 15930, -3037, -9477, 16257, -60723, -44374, 41558, 21452, 27583, -40865, 30754, -20337, -34, -4487, 43631, 22165, 1301, 25437, 39414, -70808, -17112, -28198, -326, -9511, -11176, 7629, 42392, 16918, 3009, 19034, -23401, -34707]
4324c4707C4557l110L0400B6247J6210a0120D598M6010e0427F4435k7922f7411
4311A4464c0914I463J0450j805b6977B4077d632k3069k5701A3227L9374k1461
4299C1140L707e7300a6042L686l0102A9775d6565D0275a8518Q718D7657c378C9655
4285h058D0995j2620J4194l750q512O977L122J7553M183R0221N2389J09282J26583
4272D40617J05992J8492j73202j27770q3333G0084O6932D1898M0391l5775R276
4261E5790L4961j7967O8353L1806J7880L5869M8237J52242J83595n4133O073j78995
4249C83711q0960j08021m3635k0835j3207j0533J9551j7178k2441K96K6557O852
4237A20157l9355o201C1734a743A01781R639M1931M3282j4646k545k5380l2863
$$ y = [-34707, 34557, 31447, 61847, 26247, 42457, -10120, 4598, 50608, -50427, 64435, 36513, -67411, 14464, -30914, 9463, 19913, 18108, -26977, 24077, -4632, -27701, -53402, 13227, 52601, 31140, 34847, -57300, -16042, -12356, -42458, 19775, -46565, 40275, -18518, -9800, 47657, -3378, 39655, -8058, 40995, 28375, 42569, 38819, 30307, 37284, 40406, 57959, 62142, 152363, 204752, 314034, 440617, 546609, 565101, 391899, 264129, 180796, 70084, 137016, 41898, 82289, 46514, 55790, 90751, 72784, 141137, 172943, 190823, 226692, 274929, 427171, 610766, 556633, 562706, 383711, 302751, 194730, 151095, 130260, 117053, 106520, 126071, 108893, 86452, 86748, 113305, 120157, 80802, 74601, 31734, -1743, 101781, 111420, 153351, 196633, 181987, 179442, 154062, 121199]
4225A21199g322A5725J8424j0976K7396j9556R306j333K9813k7093j8108N1058
4213G4656k6691Q0148k7684Q9303M0234o6936m4992Q517o1500f13D5926j3798
4201C2128k2J1717A1741b03D6476b761B2995J7302b7027G6354l2865K0489k2573
4188D1405K0545O2109A25Q4918a8985I2464B7632N9173A6691O713M6240L1233
4176A00877a3864G1185J2223j6664j7643A1586J4972A0498O5744K794k0632n674
4164E2730q800n589l551K5181r048L7714Q404A8821J20K0681K6752A4889O0795
4151G5684P80l0958O9926K7276o6718K3342m3363L5232r257l2530Q571L6405N7608
4138A51998j4053C4843R0919M0019n9541j7752M7599L2066J4937N7183p6145M7191
$$ y = [121199, -7322, 15725, 34149, 23173, 50569, 31013, 40319, 38986, 68799, 41706, 23598, 74656, 47965, 128113, 100429, 189732, 229966, 163030, 118038, 126555, 65055, -613, 45926, 32128, 32106, 43823, 11741, -203, 46476, -2761, 22995, 40297, -27027, 76354, 43489, 63978, 41405, 61950, 124059, 125, 85043, -18985, 92464, 27632, 86805, 16691, 23404, 69644, 100877, -13864, 71185, 83408, 66744, 49101, 11586, 26558, 10498, 76242, 79036, 58404, 52730, 43930, 38341, 34790, 59971, 50923, 88637, 97041, 18821, 18941, 39622, 66374, 14889, 75684, 76464, 45506, 115432, 142708, 75990, 99332, 55969, 91201, 81944, 49414, 57985, 94390, 151998, 137945, 34843, 125762, 165781, 106240, 88488, 136087, 168153, 183090, 240273, 164128, 211319]
4126B11319n7178K0241l3178J36389o3797K977Q2687k1990J5558N4242j1350M0907
4114C76827O6189l9870O0676J31273M6230q431J55105J2922J54717J12090J93975
4103A261703K58986K54238K11194L31329M94261N46662O65809R37503J160617
4094F122302J600319K114495L085116M922400J0684997K0753165K7656110K2340167
4086I9279071N417679j2909990k9029635k4960268j3423174o241165l342586k021376
4078A2768556j188021q96670r7486N62094J198608K102836L643299P620070J6641614
4069D2354900K5291298K5425829J0856353o591628k5420528k8397350j7234701
4062B6284173q359600m406184k908788j951947j721753j393999j026822p50210
$$ y = [211319, 154141, 174382, 141204, 277593, 213796, 216773, 299460, 277470, 293028, 347270, 335920, 376827, 443016, 403146, 463822, 595095, 641325, 632894, 787999, 800921, 955638, 1067728, 1261703, 1520689, 1774927, 1986121, 2317450, 2811711, 3358373, 4024182, 4961685, 6122302, 7722621, 9837116, 12922232, 17844632, 28529629, 49282794, 76938904, 99279071, 104696750, 91786760, 62757125, 37796857, 24373683, 18132518, 14789932, 12768556, 11580535, 10683865, 10586379, 11148473, 12347081, 14449917, 18093216, 25713286, 42354900, 67646198, 93072027, 103928380, 97336752, 71916224, 43518874, 26284173, 17924573, 13518389, 10609601, 8657654, 6935901, 5541902, 4515080, 3764870]
4054C764870o57784m34624k91432j59845j69062k23857k26079p6507j31094o0735
4044A333851j44281j09476M01j15320j04506p4683N5241j03140L3904j03621p4634
4033E93736L1253j06520M4571p2483l6699p5060P1646k9230m7975o9898J6211
4022C19552m5746M4955n0185k6588k000K0358j1890l2764L1123q196L0700m3660
4010B25659L6403o6020R274J5682o6938P213m5760Q9656p0779J3489n1643P8386
3998A74622o9630N5141j7637D2179Q3389N8649m8526l5410K8633B5748R1613k066
3986A15295K967B039P4594C5772K7895J4552M4394n0692O1880m0511J7676D2288
3973D0633N0489m2982L9500G466N7920A1903L539L5905A9854O1557l1054K5931
$$ y = [3764870, 3107086, 2672462, 2381030, 2221185, 2052123, 1828266, 1602187, 1525680, 1394586, 1333851, 1189570, 1080094, 1080495, 965175, 860669, 785986, 841227, 738087, 771991, 668370, 593736, 624989, 518469, 563040, 490557, 453858, 378798, 450444, 421214, 373239, 303341, 319552, 273806, 318761, 268576, 241988, 239988, 260346, 248456, 215692, 246815, 238619, 269319, 225659, 262062, 196042, 205316, 220998, 154060, 161273, 115513, 205169, 134390, 147879, 96236, 174622, 104992, 160133, 142496, 42179, 125568, 184217, 135691, 100281, 128914, 25748, 117361, 115295, 118262, 2039, 76633, 35772, 63667, 78219, 122613, 71921, 133801, 93290, 110966, 42288, 40633, 91122, 48140, 87640, 7466, 65386, 11903, 15442, 51347, 19854, 81411, 50357, 76288]
3961G6288M857j119C4503k37P1645n1553k0425j2846f900j355G2890j8652k6391
3948B7847I583j520J8506A0591J0062O3896b3891N346f664C0322N721j2751J29032
3935A52324L1235k8612Q8747Q789n2664H0542l4245K1502n243l938k1971n118
3923C1529A2767O7438C6215R6891b0009F280J31685K5219Q1550M9009L0163j02172
3911B21734E8308M5040l7417N797J2368C2538a1407H8164j2322J8078P5090O7448
3899B36458Q2663J18098J12382M757j16523j27850q0818o7471p5416L1618K4080
3888A41978o9903P876Q823L0517m298J6085l6227M0841J61363O0347K12207j4787
3876E54822l0417j78862j03336A09409j9775j8436A1297i979D0649j9117K0303
$$ y = [76288, 81145, 80026, 34503, 34266, 105911, 54358, 33933, 21087, -6900, -8255, 72890, 54238, 27847, 9583, 8063, 26569, 10591, 20653, 84549, -23891, -18545, -6664, 30322, 36043, 23292, 152324, 183559, 154947, 243694, 252483, 199819, 80542, 46297, 67799, 62556, 58618, 36647, 31529, 12767, 80205, 36215, 133106, -20009, 6280, 137965, 163184, 244734, 293743, 323906, 221734, 58308, 103348, 65931, 71728, 84096, 32538, -11407, 88164, 75842, 93920, 169010, 236458, 319121, 437219, 549601, 554358, 437835, 309985, 229167, 161696, 86280, 117898, 141978, 72075, 79951, 88774, 119291, 114993, 131078, 94851, 135692, 297055, 357402, 569609, 554822, 524405, 345543, 242207, 109409, 89634, 71198, 11297, -9979, 40649, 21532, 41835]
3865D1835A2049n281K5442i449E0542j7078A333f593E2715A7067E308K7207P3973
3852A06488A7994j663J1761f4620B5027J277c2377C990i198F123e3767C2781b6810
3838d555l6593f100A3210J1685D211e146j2249G554J9473d028n610A9785J7054
3825C6839A07J2570K0343b3059F6288B5267M1630i671j989c085j0589F9137b1765
3811b6631d960j7643O352C0910L1601A1808J3262c957k8077i887D2630B097O2244
3798F4341j0780b5421A2177l582b8061C660a536j5557D2382f0338b1639j6744
3786c8383i895E0773A2293D568J7084K3487j8753r764a5933l755M319e419D3953
3772a3168b185D1719A8606a3885l799A388b9152C2705h546A0500O573J0688A674
$$ y = [41835, 12049, 6768, 32210, -9449, 50542, 33464, 1333, -6593, 52715, 17067, 5308, 32515, 106488, 17994, 16331, 28092, -64620, 25027, 26304, -32377, 3990, -9198, 6123, -53767, 32781, -26810, -4555, -41148, -6100, 13210, 24895, 4211, -5146, -17395, 7554, 27027, -4028, -9638, 19785, 36839, 107, 12677, 33020, -23059, 66288, 25267, 66897, -9671, -11660, -3085, -13674, 69137, -21765, -26631, -4960, -22603, -16251, 30910, 62511, 11808, 25070, -3957, -32034, -9887, 42630, 2097, 64341, 53561, -25421, 12177, 8595, -28061, 3660, -1536, -17093, 42382, -60338, -21639, -38383, -9895, 50773, 12293, 4568, 21652, 45139, 26386, 16622, -15933, -19688, -15369, -5419, 43953, -13168, -2185, 41719, 18606, -13885, -17684, 1388, -29152, 32705, -8546, 10500, 17073, 27761, 1674]
3758c6280A1230b968l8500l4630L1735E3735L712a1355O83A7977e699A3397a0640
3744F389e5349k6019K9063J2352C4701A6265b7436F9895B4225C059a7526j6758
3732c4284a1823A7842K42D311N2924a4360N303k9335e528A7459K4047B098J1648
3719A3746k019Q174e5427e01q976C4875j2077d4885J6548l8367B943a4877r850
3706b4727D9408B2819K3200b574j9146q055Q660m5578b9153k1568a2106j1341
3694b3447F2145H808B986K1956b7827A8631j934g308C4594c5737P83A1179a5586
3680b700B2675c187p5017A5890e0537C0652A2316i58k4184d954a382C3343H44
3666A7955D705o13J2985K2633k198d156A2273K7458b6642Q881m0413H052J4653
$$ y = [-36280, 11230, -2968, -41468, -76098, -44363, 53735, 57447, -11355, -10672, 17977, -5699, 13397, -10640, 6389, -55349, -81368, -52305, -39953, 34701, 16265, -27436, 69895, 24225, 3059, -17526, -34284, -11823, 17842, 18084, 4311, 57235, -14360, -9057, -38392, -5528, 17459, 41506, 2098, 13746, 11727, 19901, -55427, -501, -9477, 34875, 22798, -44885, -28337, -66704, 2943, -14877, -24727, 49408, 22819, 46019, -2574, -21720, -29775, -21115, -66693, -29153, -50721, -12106, -23447, 62145, 8808, 2986, 24942, -27827, 18631, 16697, -7308, 34594, -35737, -34954, 11179, -15586, -2700, 22675, -3187, -78204, 15890, -50537, 30652, 12316, -958, -25142, -4954, -1382, 33343, 844, 17955, 4705, 4092, 17077, 39710, 37512, -4156, 12273, 39731, -26642, -17761, -58174, 8052, 22705]
3653B2705i416N07D7448c6846k593d824p168d946m971A9804M518A1401h765C686
3638C6022K8604a3496B4068a3334B7573f821p403j6442j1752G25J599a2291B3007
3624c904D718J3768P573g104m7266b0399j092G491K7905c3926h996p192I884e101
3609d1217k8007d429A5540D34O6211b3082Q364F2241a0352a429A5008b6019d47
3595E0663I96d5080h316I32J5103E816Q825c7149F783e2392a3351j8509a2735
3581c3665B973a6661n4433A1258c0167c851A5498K3138d238k0328B5913e0914
3568b0613A3662n990b8774N886M048L80j7003A0394f892p4134F937b8905A4658
3554h245j1095p817e036F4656A0270h96n6635E5313f7508A5087C50b8013R206
$$ y = [22705, -9416, -8909, 47448, -36846, -39439, -4824, -11992, -4946, -9917, 19804, 24322, 11401, -8765, 3686, 36022, 64626, -13496, 24068, -13334, 27573, -6821, -14224, -30666, -42418, 725, 2324, -12291, 23007, -3904, 4718, 18486, 26059, -7104, -54370, -20399, -21491, 7491, 35396, -33926, -8996, -16188, 9884, -5101, -41217, -69224, -4429, 15540, 434, 66645, -23082, -14718, 62241, -10352, -1429, 15008, -26019, -447, 50663, 996, -45080, -8316, 932, 16035, 5816, 14641, -37149, 6783, -52392, -13351, -31860, -12735, -33665, 2973, -16661, -71094, 11258, -30167, -3851, 15498, 38636, -4238, -24566, 25913, -50914, -20613, 13662, 7672, -28774, -22888, -18840, -18460, -35463, 10394, -6892, -81026, 6937, -28905, 14658, -8245, -19340, -27157, -5036, 64656, 10270, -896, -57531, 55313, -67508, 15087, 350, -28013, -18807]
3541a8807e041C2725b2207B4547a1789j0610E697N3514c6947I51b3218J1244E3087
3527B5335r675o315d73E38J4321m979c070B307K5954b1007A0348b3886B2073e603
3512a1954E1501k66D900L2520j0555a0335o7923B3019e7356I268l229J3024J4235
3499C3298f3216B790b8350g586k6985a813k5718j3037b129D34J4541E845R269
3486A5114b8497H319J587c0488k946a59l831C7464b732M32C944J9333A871b3880
3471C3584b5913A2095c5917hj4804L585l5243A7839a8311m6805a852C6852A3372
3457b9662A6767D499d407F4629c3249j9693C2098M92i310A0541j596M187j797
3444A1335d9522b1359j638k4855D899h962k5573j9060b2962q914A0674c5066J411
$$ y = [-18807, -5041, 32725, -22207, 24547, -11789, -22399, 5697, 59211, -36947, 951, -23218, -11974, 53087, 25335, 15660, 9345, -473, 538, 14859, 9880, -3070, 2307, 28261, -21007, 10348, -23886, 22073, -5603, -11954, 51501, 51235, 4900, 37420, 26865, -10335, -78258, 23019, -57356, 9268, 6039, 19063, 33298, -63216, 2790, -28350, -7586, -34571, -1813, -27531, -40568, -2129, 434, 14975, 5845, 15114, -28497, 8319, 9906, -30488, -33434, -159, -3990, 37464, -2732, -2300, 3944, 23277, 1871, -23880, 33584, -25913, 12095, -35917, -8, -14812, -11227, -46470, 17839, -18311, -65116, -1852, 36852, 13372, -29662, 16767, 4499, -4407, 64629, -33249, -52942, 32098, 32590, -9310, 10541, 8945, 13132, 11335, -49522, -21359, -22997, -47852, 4899, -8962, -34535, -53595, -22962, -31876, 10674, -35066, -33655]
3431c3655A4885j155l902K1754b5372E7844A2677N875P391f509B733a2503l903
3418a6406D86K2945D471L2468e459A4096d4929J0969i535n0023d172l658l0040
3405c7870B3053E231a3355E464d5776b001k4282e38I864e8348a5276l70B6359
3391c8115B1624b6497A957Q1332c9201B3441c4952g123B6809a6595C3910A2521
3378B2524d8840a4381q532J0281A4272L9167e1317I612a1327J631A5269C871c576
3364B0764a8076C3230b576k911k83r897r103N016q245H93a7512f000D5165L814
3350D8979a3922C6646a9934B113e2890a5392j8715l7356b389q191q1087c3022
3337b9678h725C8464b6790h101A7247a3020B0884e0647A0209l72c9047E119e3716
$$ y = [-33655, 14885, 13730, 9828, 31582, -25372, 57844, 12677, 18552, 25943, -6509, 2733, -12503, -16406, 486, 23431, 4471, 36939, -5459, 14096, -44929, -33960, -9535, -59558, -4172, -7830, -37870, 23053, 5231, -13355, 5464, -45776, -2001, -26283, -538, 9864, -58348, -15276, -15646, 26359, -38115, 21624, -26497, 1957, 83289, -39201, 23441, -34952, -7123, 26809, -16595, 33910, 12521, 22524, -48840, -14381, -22913, -12632, 14272, 53439, -51317, 9612, -11327, -9696, 15269, 3871, -3576, 20764, -18076, 33230, -2576, -5487, -5770, -15667, -24770, -19754, -27999, 893, -17512, -6000, 45165, 48979, -13922, 36646, -19934, 2113, -52890, -15392, -34107, -71463, -2389, -10580, -91667, -33022, -29678, -8725, 38464, -26790, -8101, 17247, -13020, 20884, -50647, 10209, 9837, -39047, 5119, -53716]
3323c5014B252P0107b5320k6915k8979L6981k5483B8475g3821a638A03539D6452
3310b110k9749M832H539K145k572c5519e388B4410l372i759A6484M879j496o292
3296A3575l161a1885n9738G259J6742K460f2279d576i50l6421a8253j7688B7545
3282A3802K307a6444j8183a5852A5558d6735B8149c2288Q595b584A1728d9819
3269E3300d322k0510k0441a9674C6096A7792d818j3225m5709a3330C367a5739
3256B3484f896C1391K4710A5348k707b5278O015B2882c8052J4644Q587F984d1090
3242g8609h239k517j123F1795b5020D0414b6312n800i459A862e9546j0437b8064
3228A134c203r145D9638b6912g712D619b1477C7294e4076A6068a8704b135C3000
$$ y = [-35014, 2252, 72359, -25320, -52235, -81214, -44233, -69716, 28475, -73821, -1638, 103539, 46452, -2110, -31859, -27027, 8539, 10684, 8112, -35519, -5388, 24410, 21038, -9759, 16484, 21363, 19867, 13575, 10414, -11885, -71623, 7259, 24001, 26461, -62279, -4576, -950, -37371, -18253, -35941, 27545, 13802, 16109, -16444, -34627, -15852, 15558, -46735, 28149, -32288, -23693, -2584, 11728, -49819, 53300, -4322, -24832, -45273, -19674, 36096, 17792, -4818, -18043, -63752, -13330, 3367, -15739, 23484, -6896, 31391, 56101, 15348, 12641, -25278, -19263, 22882, -38052, -23408, -14821, 6984, -41090, -78609, -8239, -10756, -11879, 61795, -25020, 40414, -26312, -32112, -9459, 1862, -59546, -69983, -28064, 1134, -3203, -12348, 49638, -26912, -7712, 4619, -21477, 37294, -54076, 16068, -18704, -2135, 33000]
3214h2111B8225H177K6579R781a1629A8384F484h019A1748K6021F379M432c8834
3200a4390j318J013a775j4975A128c7844j5531b45A1056j55c8708D4117A224e5631
3185d6915J4705J0564C0493b8940c422k2590k9351B5138G89d3920b1514E7817
3172e0772b1191P34C2125m285E577a1370j997E341A241J3309E024J4804Q628B503
3157c9175f626A0406e605k8092j393A9838N715c8693q58h796q9466D5707N261
3144E0968A8612e2387G461L463J9484b5258a1006j9188g504j9590d420r628P5
3131a3973l4499a328k071n4178E710J6066e4424b928a06l8479c005j5813B4383
3117g410c696B9640F523K5838e336o6995b256j7944A0110L287a5857d028C5500
$$ y = [-82111, 28225, 8177, 34756, 44537, -11629, 18384, 6484, -8019, 11748, 37769, 6379, 10811, -38834, -14390, -15708, -14695, -1775, -16750, 1128, -37844, -53375, -245, 11056, 10901, -38708, 44117, 1224, -55631, -46915, -32210, -21646, 30493, -28940, -3422, -26012, -55363, 25138, 789, -43920, -21514, 57817, -50772, -21191, -20457, 32125, 27840, 5577, -11370, -13367, 5341, 1241, 14550, 5024, 19828, 28456, 2503, -39175, -6626, 10406, -5605, -33697, -35090, 19838, 25553, -38693, -39551, -8796, -98262, 45707, 50968, 18612, -52387, 7461, 10924, 30408, -25258, -11006, -30194, -7504, -27094, -4420, -14048, -13973, -48472, -1328, -3399, -57577, 5710, 21776, -54424, -2928, -106, -38585, -3005, -18818, 24383, -7410, -3696, 29640, 6523, 32361, -5336, -72331, -2256, -20200, 10110, 13397, -15857, -4028, 35500]
3103a4141l2977J9033A8859d9996I04d9710J7876O595C1130b4125C310a0407n8829
3090f9236b0402F911b7754m2113K5805J7108C097J6530c4210J3751C8425c1730
3077B6004c5813a0950B7310b4809B1255F27M7355i930k9185J5349k995M661B7345
3063c1090P518H459B495e617I770d740A2496d2526C2376d6194e23B8213a4901
3049c9827A5838d041D489d1427C2133g4537n841b5889F217a6069k1018a3206j319
3036a4525C060b7987J3027A6505J2489e6284E823c6326G495c0322a0245r729m9057
3023f9031D3607c7004B707M0580B529H87c7204J2177k9352e895k6995h860B2374
3009F9321c8349J0031D111L451J6111a9008f877b521o8482O623C0227a4576E2170
$$ y = [-14141, -47118, -28085, 18859, -49996, 904, -49710, -31834, -25239, 31130, -24125, 3310, -10407, -69236, -20402, 6911, -27754, -69867, -44062, -26954, 3097, 19627, -34210, -20459, 38425, -31730, 26004, -35813, -10950, 27310, -24809, 21255, 627, 47982, -9930, -39115, -23766, -26761, -22100, 27345, -31090, -23572, 8459, 2495, -5617, 9770, -4740, 12496, -42526, 32376, -46194, -523, 28213, -14901, -39827, 15838, -4041, 4489, -41427, 32133, -74537, -80378, -25889, 6217, -16069, -37087, -13206, -14525, 3060, -27987, -14960, 16505, 28994, -56284, 5823, -36326, 7495, -30322, -10245, -19974, -69031, 43607, -37004, 2707, 43287, 2529, 887, -37204, -25027, -54379, -5895, -32890, -8860, 22374, 69321, -38349, -28318, 4111, 7562, 23673, -19008, -6877, -2521, -71003, -64380, 30227, -14576, 52170]
2995A5731L902D569c9082n3832a0389k6694a0226E109a2229l4073D218a9589k5920
2982d5509a8129C7855a1513p355n319l038C2474f3441G5067d1316i689j1365f578
2968B6277b4883j5104a2671B5051B118b7777B601K5095b4127a251m9608A349d262
2954C6949B331a6605b296I777K2217M736d0468k2075l2685a1986A3445f7706f650
2940B3132e9506G4458F804L427b3438D5130b9419J869j9408A1771r58c6989H066
2926c7706K034J1691E597J4076F271g7n709B4774a40573A5975o289L8838c524
2912B419d5462D973Q185h259c622k0711A5952c3908A550a3743B054b0656m156
2899b4812C4392h403c896B4703J6556a5488k7307A7345b4533c673G3962c0511
$$ y = [15731, 19633, 4569, -39082, -92914, -10389, -37083, -10226, 5109, -12229, -46302, 4218, -19589, -45509, -18129, 37855, -11513, -18868, -24187, -27225, 32474, -63441, 75067, -41316, -9689, -21054, -6578, 26277, -24883, -39987, -12671, 25051, 2118, -27777, 2601, 27696, -24127, -1251, -50859, 1349, -4262, 36949, 2331, -16605, -2296, 9777, 31994, 36730, -40468, -62543, -95228, -11986, 13445, -67706, -6650, 23132, -59506, 74458, 6804, 10231, -23438, 45130, -29419, -27550, -46958, 11771, 10813, -36989, 8066, -37706, -35672, -23981, 5597, 19673, 6271, -77, -5786, 24774, -140573, 15975, 9686, 48524, -3524, 2419, -45462, 4973, 13158, -8259, -3622, -24333, 15952, -33908, 1550, -13743, 2054, -20656, -24812, 34392, -8403, -3896, 24703, 41259, -15488, -42795, 17345, -24533, -3673, 73962, -30511]
2886C9599d3789b1182j7310c015C946K4519d9841J9933A9478a7937E3872d389
2873D518J1402a08A4062b2302p0252b035p861C5223c0750J007B7350a0940j9035
2860b9975o2712B9614A58a2909A1864M2214e8277b3102j2810B4453b9405n051
2848c4456o819C8955C908g503A1932b5932C0368j4655K0364c2855a0989D6237
2835a2247l0913C5955K1846e0124b1441C991a1542K776D3594A2960J228f6635
2822A9555L6582e6350K0842J6429l0434C5170c3195A2451a819l8008q096A4117
2809E2639k3156H850J6022e9775b1746j4780A7947J5874j4164f5877b2716m1225
2797f3941a1290l4972j0852i751A7109E118a7291E924b6987o422D0012j5994e4315
$$ y = [39599, -43789, -21182, -38492, -3015, 3946, 28465, -49841, -29908, 19478, -17937, 53872, -4389, 4518, 15920, -108, 14062, -22302, -92554, -2035, -9896, 35223, -30750, -29743, 27350, -10940, -29975, -92687, 29614, 158, -12909, 11864, 54078, -58277, -23102, -35912, 24453, -29405, -34456, -41275, 38955, 3908, -7503, 11932, -25932, 30368, 15713, 36077, -32855, -10989, 46237, -12247, -43160, 35955, 57801, -50124, -21441, 3991, -11542, -8766, 43594, 12960, 14188, -66635, 19555, 56137, -56350, -35508, -19079, -49513, 35170, -33195, 12451, -1819, -39827, -47923, 14117, 52639, 29483, 8850, 24872, -59775, -21746, -36526, 17947, 33821, 19657, -65877, -22716, -63941, -11290, -46262, -57114, -9751, 17109, 5118, -17291, 5924, -26987, -33409, 40012, 24018, -54315]
2783A7927e4623E0541R298h466l4167D288K7201o640q043F711a6368o0719B378
2769C7010J9606a3515F062i007m1027E088d990B5914d2089P544J332C6766j0733
2756B6033L7166A1018b7749j2044F1014B1859g4024A2924a8128L751E7577c7783
2743a6374m682l2964b0608D4288K339a7006G831b4518j6195J8966A4613d1988
2730D093a2783A284b2319A9585g5327C156K5657A97a404o409h68A6060J4766b1680
2715B4811b1210r895D1953A807J5136J0876d112D0335A3238a7439C1312b0575
2702a004l5884C605d5368j3350H8683e0207a6749J050J374o663l1677N201a9127
2688D1775b5562B0968a0807C439b2303j5921Q822J931P008j8458B5178i598j7421
$$ y = [17927, -54623, 50541, 59839, -8466, -42633, 4288, 31489, 24849, 16806, 6711, -16368, -77087, 2378, 37010, 56616, -13515, 6062, -9007, -50034, 5088, -4990, 25914, -42089, -34545, -33213, 36766, 26033, 63199, 11018, -27749, -39793, 61014, 21859, -74024, 12924, -18128, -14377, 57577, -37783, -16374, -21056, -54020, -20608, 44288, 46627, -17006, 7831, -24518, -40713, -21747, 14613, -41988, 4093, -12783, 1284, -22319, 19585, -75327, 3156, 28813, 197, -1404, -7813, -868, 16060, 30826, -21680, 24811, -21210, -31105, 41953, 1807, 16943, 27819, -4112, 40335, 13238, -17439, 31312, -20575, -1004, -36888, 3605, -45368, -58718, 88683, -50207, -16749, -15699, -14325, -20988, -52665, -47464, -19127, 41775, -25562, 20968, -10807, 3439, -22303, -38224, -29402, -27471, -20463, -38921, 25178, -9598, -27019]
2675b7019p26G057a1634A4075m483e1687D2943a6996E3228A3383K0299e6643A1277
2661D8618H508J7211O710e9865A2877A036J3660d2036a9751k1407I875e5253A269
2647a1099l1864m327l33g569n3409K0726J4504e036A593L4436c0025D871a3384
2633A4994K3771b050j5192D0658b7732R660r066D6795d0168k4560J4867C44c3709
2619A2489N5176A36a8256f93j6763l0585A6549R693c9318A2365m739d8588C5569
2605E0328A136b7527e245L84k9663G772J0246J7436J5163f6750E1666B5284a9513
2591a5167O259H898h170L488k1089A7577g12k5366m4963a1011m9032B1014K4475
2578D5489A8575b1994o967J0409o842A8938e96o405p469k5518Q043J1196O706
$$ y = [-27019, -27745, 7057, -11634, 14075, 9592, -51687, 42943, -16996, 53228, 13383, 33682, -56643, 11277, 48618, 8508, 25719, 32429, -59865, 12877, 1036, 14696, -42036, -19751, -41158, 9875, -55253, 1269, -11099, -42963, -47290, -47623, -7569, -60978, -40252, -25748, -5036, 1593, 36029, -30025, 4871, -13384, 14994, 38765, -2050, -17242, 40658, -27732, -18072, -27138, 46795, -40168, -64728, -49861, 344, -33709, 12489, 67665, 136, -18256, -693, -17456, -48041, 16549, 26242, -39318, 12365, 7626, -48588, 35569, 50328, 1136, -27527, -5245, -4861, -34524, 7772, 18018, 35454, 50617, -66750, 51666, 25284, -19513, -15167, -8908, 8898, -8170, -4682, -25771, 17577, -712, -26078, -71041, -11011, -60043, 21014, 45489, 18575, -21994, -28961, -18552, -25394, 18938, -596, -7001, -14470, -39988, -31945, -20749, -14043]
2565a4043k9574F059d3177J4989J0697l3779B24N7547d5747D8565E959e389l2172
2552c7561E0229A4015J8045i961m2561a7845j9041P383F448c2979I686J3255b9483
2538f775L23k8317j7493h33n1108c784o0018e527a844j5953B1714P0841c1160
2524a3305C0806f2081B4535C63b0281j6974j6297h327n1645K6746a0562m0410
2512e0972J5808d270j9176B552g251c516l3827H729c8720J0787F4567a1630p2228
2499h3858I685m238d1324q550E326G25M4991F289b436l8612a6027E2702A2289
2485b5735c17k0733b203j6552b664B6012b380j7794H1f049i48m8821E4629A8185
2470D1459D462h794E4778d1986C4024A6632d248J798r594D5519c022D6731a3318
$$ y = [-14043, -43617, 6059, -43177, -28188, -17491, -51270, 224, 57771, -45747, 48565, 5959, -5389, -37561, 50229, 14015, 32060, -9961, -52522, -17845, -36886, -29503, 6448, -32979, 9686, 22941, -29483, -6775, -6452, -34769, -52262, -833, -51941, -3784, -63802, -5527, -1844, -17797, 21714, 92555, -31160, -13305, 30806, -62081, 24535, 363, -20281, -37255, -53552, -8327, -59972, -33226, -10562, -50972, -35164, -4270, -23446, 2552, -7251, -3516, -37343, 8729, -38720, -27933, 64567, -11630, -83858, 9685, 5447, -41324, -49874, 5326, 725, 45716, 6289, -2436, -41048, -16027, 52702, 12289, -25735, -317, -21050, -2203, -18755, -2664, 26012, -2380, -20174, 81, -6049, -948, -49769, 54629, 18185, 41459, 4462, -8794, 54778, -41986, 34024, 16632, -4248, -2450, -12044, 45519, -3022, 46731, -13318]
2456A0629b8330A11b5383k8228A7453H674O720N062O013d1134m7621B0561H506
2442C1362b8816b233q084A7921G042O624e483m7762K4436B728a7624Q293E2777
2428a8776F9015a0763B3368j0822R018j0379f752d00D814b6978B2902i628E308
2414d1521H6981b56o3544c1760C1312h6768f247j287A9632f2531b1702D9084c931
2400b0618F452d0577Q724F345a7075h509A695c1107K859o672R634c677A6262a600
2385a0561m357k5398l0259K3855C2755e270A765J549d0352A6513e1079k2240a0955
2371d3890C1330a6134L191C922K2769a2586m688l5685C5011L0601e4178C9714
2358c1861a1172k558f698A5636a6361e503m2277b3868d149B9793b6032j3776H745
$$ y = [10629, -28330, 111, -25383, -53611, 17453, 8674, 15394, 20456, 26469, -41134, -88755, 20561, 8506, 31362, -28816, -2233, -10317, 17921, 7042, 13666, -5483, -53245, -28809, 2728, -17624, -9331, 52777, -18776, 69015, -10763, 23368, 12546, 21564, 11185, -6752, -400, 4814, -26978, 22902, -9628, 5308, -41521, 86981, -256, -63800, -31760, 31312, -86768, -6247, -7534, 19632, -62531, -21702, 49084, -3931, -20618, 6452, -40577, -31853, 6345, -17075, -8509, 1695, -31107, -28248, -34920, -25286, -3677, 16262, -1600, -10561, -14918, -40316, -70575, -46720, 32755, -5270, 1765, 3314, -40352, 16513, -51079, -73319, -10955, -43890, 31330, -16134, -12943, 3922, 26691, -12586, -17274, -52959, 35011, 65612, -54178, 39714, -31861, -11172, -13730, -6698, 15636, -16361, -5503, -47780, -23868, -4149, 29793, -26032, -39808, 8745]
2344a1768k7115A561b797A3033M2577a1611q987F4453I735k595a8334A1769d5405
2330e462I1a2546A9355b132l8094j3963B4679a349m1822j482B7932a2680A2357
2316F298a0802d287k0601k7065A7703c2252a813l55H482e799A5555J7498J9694
2303E2747c1550k2121c265l1773G08a3116c926o3I779L3901j6444A2596K7566
2290D0162b3733a1489J158C8987o553b1945j4269l3477L2520e507C0327b0230
2277B5632q9g9261A8313c1074R36a3117E3039f8947c354m504j9381k327A6722
2263C1023g6989a5721p065i500q435n7189A8549b1204p379d944B7490D610b2422
2249c1276B053J6458c0124c123B1500n709p339O27e6280b6739M453J386B6297
$$ y = [-11768, -38883, 1561, -2797, 13033, 55610, -11611, -20598, 64453, 9735, 7140, -18334, 11769, -45405, -5462, 91, -12546, 19355, -2132, -40226, -54189, 24679, -1349, -43171, -44653, 27932, -12680, 12357, 6298, -10802, -4287, -24888, -51953, 17703, -32252, -1813, -2168, 8482, -5799, 15555, 33053, 52747, -31550, -53671, -3265, -35038, 708, -13116, -3926, -3989, 9779, 43680, 27236, 12596, 40162, -23733, -11489, -10331, 38987, 32434, -21945, -36214, -69691, -37171, -5507, 30327, -20230, 25632, 25543, -79261, 18313, -31074, -30138, -13117, 53039, -68947, -3354, -7858, -27239, -29566, 16722, 31023, -76989, -15721, -22786, -9500, -17935, -75124, 18549, -21204, -28583, -4944, 27490, 4610, -22422, -31276, 2053, 18511, -30124, -3123, 21500, 15791, 8452, 9079, -56280, -26739, -22286, -20900, 26297]
2235B4539P135L203c9108K315G896a14910D8832a5055G187b2760E666M3994a6799
2221a5320M298E0155j9694A2876K3411A3875d8849Q988A798c5037A0837Q376a7670
2207i020l722j6889N14J4425L320E6219b2016N173j3109g127E842b7184k5196
2194e2380a8935D587J1424c9241l1445K6825j0914b6998e643o626B13a2314j177
2181a3491e427B6361j2239b0037G1487a9023h304B9401Q171m198j309a5784A496
2167D3596b4609A2134b3416B467b1591A1654h0536H903R5168a6002B9261j570
2155B7691a8416A1006a7608B79b8454K902F6110a9814m2603B0549d202j8951J627
2142b1526C89J2520a028m7213D5873c0959B5257h783C679a474j8546k7416b1161
$$ y = [24539, 31674, 34877, -39108, -36793, 7896, -114910, 48832, -15055, 7187, -22760, 5666, 49660, -16799, -15320, -11022, 50155, 30461, 12876, 36287, 13875, -48849, -39861, 1798, -35037, 10837, 19213, -17670, -9020, -12742, -29631, -29117, -14692, -11372, 56219, -22016, -16843, -29952, -7127, 5842, -27184, -52380, -18935, 4587, 16011, -39241, -70686, -43861, -54775, -26998, -5643, -12269, 213, -12314, -13491, -5427, 26361, 14122, -20037, 71487, -19023, -8304, 29401, 37572, 33374, 32065, -15784, 1496, 43596, -24609, 12134, -23416, 2467, -21591, 11654, -80536, 8903, 104071, -16002, 29261, 27691, -18416, 11006, -17608, 279, -28454, -25552, 66110, -19814, -62417, 20549, -4202, -23153, -21526, 389, 12909, -1028, -48241, 45873, -30959, 25257, -8783, 3679, -1474, -20020, -47436, -21161]
2128f159j3437C4324J2959g0206g658o7755B4640J274f35j0466n834j6271l7410
2115g0616L332b9034C123d2463D352d9717a5193A4199b3954B140Q8223b3108J0097
2102a3011j7080d260M53D0826F134b5360L177q30j3716B59L6797A6931f3411J3484
2088d9927D7707g7054A6308f1995C9342e1282b501D360c6133D590J7247H141J5910
2075B4051J0129K3547I497g822k3125a3296C0330j4480a1058F665O229c2139B5695
2061b3717A008c0214k6670G943f1405J4385A5966P045N782c0522C7741c4977g797
2047g537k7862j417a6732l6196D450L0773L375c5647b312C8584A3027K5660J1184
2034D9871B1565a2417n3256E0191c8532J1l128I158b0020B1018a5393H515a1113
$$ y = [-6159, -19596, 34324, 47283, -70206, -7658, -75413, 24640, 25914, -635, -11101, -16935, -33206, -70616, -67284, -29034, 3123, -42463, 4352, -49717, -15193, 14199, -23954, 2140, 90363, -23108, -13011, -30091, -4260, -3807, 40826, 6134, -25360, -22183, -23013, -36729, 259, 37056, 16931, -63411, -49927, 47707, -77054, 16308, -61995, 39342, -51282, -2501, 4360, -36133, 4590, 21837, 8141, 24051, 34180, 57727, 9497, -7822, -30947, -13296, 30330, 15850, -11058, 6665, 12894, -32139, 25695, -23717, 1008, -30214, -56884, 7943, -61405, -47020, 15966, 23011, 28793, -30522, 37741, -34977, -7797, -7537, -35399, -36816, -16732, -52928, 4450, 35223, 38598, -35647, -2312, 38584, 13027, 38687, 49871, 21565, -12417, -65673, 50191, -38532, -38521, -41649, 9158, -20020, 21018, -15393, 8515, -11113]
2020C6662a2381d105o971A7255C537M6115e557B852P012b0892m0475H2433A6417
2006b3574Q331P502J886m2037a5964j3856A1028c0217l896D9928k3977M4731f134
1992d6567B2648a7229A4545J5884b4079f404k348A1312n004a9747l284p266g304
1978D278c8829D2000i4574A9412a9324b311q99A2864c0816j2190k9760C7109b343
1964b1973A6663f503A9620b6877I4442i709k7774P03j408C872d5605B2383d1221
1950B0451M7499A6082K6308c7171l81A5607e8610I847d124r861E5907B0518a1329
1936F657L6013e3421q305A8277i751n1844R230a6139D4766A0035K7663i114j4914
1923b4028B8680j2932a0513L564j4233C328O1470b5633d540g71H408c8884f596
$$ y = [36662, -12381, -4105, -11076, 17255, 3537, 49652, -5557, 2852, 9864, -20892, -61367, 82433, 16417, -23574, -15243, -7741, -5855, -47892, -15964, -29820, 11028, -30217, -34113, 49928, 25951, 70682, -6134, -46567, 22648, -17229, 14545, 30429, -24079, -6404, -8752, 11312, 6308, -19747, -23031, -30297, -7304, 4278, -38829, 42000, -94574, 19412, -19324, -2311, -3210, 12864, -30816, -43006, -72766, 37109, -2343, -21973, 16663, -6503, 19620, -26877, 94442, -9709, -37483, -36780, -38188, 3872, -45605, 22383, -41221, 20451, 67950, 16082, 42390, -37171, -37552, 15607, -58610, 9847, -4124, -13985, 55907, 20518, -11329, 6657, 42670, -53421, -61726, 18277, -9751, -61595, -52365, -16139, 44766, 10035, 37698, -9114, -24028, 28680, 15748, -10513, -6949, -21182, 3328, 64798, -25633, -4540, -771, 8408, -38884, -6596]
1909A2255e247B1508Q756e783q7670C7053A6940d442J106E1483j5555L7763c3177
1895a5512B050a4263A0163Q436a6554A2122A417E62M3537j2092r309p314d0075
1881A8366N640N570K5245b8911o150k1099l5086K9749A4838K7220k0862e2461
1868A2210d674A3839h188A0075c878G7099b0330j3615l3980E3033I608e5055a13
1854a0978A1290b1292R024B0305n152d5462c600I282L7019B0196G623M8143j2765
1841D3001b2502J0245G712K2484j195m046h661j6717e657j5533Q680k5035J5183
1828b2362k6834H0275A2599b6601F328b1448C471h130D5296j2401e86A0259J1653
1815B1912f5573A0010f7545A9624c705j7222n4349K5937p858a2748D7744p533
$$ y = [12255, -5247, 21508, 30264, -5783, -93453, 37053, 16940, -4442, -3336, 51483, 35928, 73691, -33177, -15512, 2050, -14263, 10163, 18599, -16554, 12122, 1417, 562, 44099, 32007, 22698, 15384, -40075, 18366, 24006, 29576, 54821, -28911, -35061, -56160, -91246, -61497, 14838, 42058, 21196, -52461, 12210, -4674, 13839, -8188, 10075, -3878, 77099, -20330, -33945, -67925, 53033, 9608, -55055, -113, -10978, 11290, -21292, -12268, 20305, 15153, -45462, -3600, 9282, 46301, 20196, 7623, 55766, 43001, -22502, -12257, 7712, 30196, 29001, 24955, -8661, -25378, -5657, -21190, -12510, -37545, -22362, -49196, 80275, 12599, -26601, 6328, -21448, 3471, -8130, 45296, 32895, -586, 10259, 21912, -65573, 10010, -67545, 19624, -3705, -20927, -75276, -49339, -57197, -12748, 47744, 40211]
1803D0211a6577l0080d903n1243B2462p452c198p1777C3816F189a0125k4146A1937
1789B834f027m246E0426G976e209C0525d966l2322D178b2986f843m1227K3776
1776b4294B1725b6057N619D2121b0858q978o515q262R560A2911L6994n613J1116
1763E5408d6243K2225l704B4037b0054C527b6338F4882b5665A8401m804b2066
1750b467D7501b7122a0237C0132K9000D100f087k4708B1764a6046c563D7203a020
1736D6895a6893e296a879k2507G5935B0362N732f4018E8328B4764K0574b0505
1723g754H418a01739C0487a0034D201i031E9707e9140B0944K5316c4535k0688
1711e5223K2625B0400F354J3567e1828F388a6560e503C5087K4433A1708a5171
$$ y = [40211, -16577, -46657, -4903, -56146, 22462, 15010, -3198, -74975, 33816, 6189, -10125, -34271, 11937, 2834, -6027, -10273, 50426, 7976, -5209, 30525, -4966, -37288, 4178, -22986, -6843, -48070, -24294, 21725, -26057, -20438, 42121, -20858, -29836, -36351, -44613, -35053, 12911, 49905, 44292, 55408, -46243, -24018, -27722, 24037, -20054, 3527, -26338, 64882, -25665, 18401, 13597, -22066, -2467, 47501, -27122, -10237, 30132, 59132, 4100, -6087, -30795, 21764, -16046, -3563, 47203, -1020, 46895, -16893, -5296, -1879, -24386, 75935, 20362, 26094, -64018, 58328, 24764, 45338, -20505, -7754, 8418, -101739, 30487, -10034, 4201, -9031, 59707, -59140, 20944, 46260, -34535, -55223, -32598, 20400, 6354, 19921, -51828, 6388, -16560, -5503, 35087, 59520, 11708, -15171]
1698f604k152A4095i433I670d3861A5761m501C00h6684A7091a4872K240A5040
1684b2512A2966b2820D6507a6789E3367b1608m4947b1802j9974K0388F148K7777
1672C3925e0345L548B0445c5062Q593J3061k0780J430A2122L1289d2687J4872
1660b7815m7755a1160l0874F7998b4901D8877H163b034H1898a4935A3730f896
1647B9569c6657J923B4785c6104C5427j6827a8661m3752b7606A7652O62M598h036
1633e7772I053c0217B3474j1562e381A8915A554g415r849H513O6558d2824a2203
1619a5731A9017d588H692b2627B6960c1931l797j5433A7953e2489D3016j5465
1607B7551b7710I766a6799D2618c6063C5793h697E8533A6374c5235A3338b3142
$$ y = [-6604, -8756, 14095, -9433, 9670, -43861, 15761, 11260, 300, -86684, 17091, -14872, -12632, 15040, -22512, 12966, -22820, 46507, -16789, 53367, -21608, -66555, -21802, -41776, -21388, 6148, 33925, -50345, -46797, 20445, -35062, -26469, -13408, -34188, -32758, 12122, 43411, -42687, -27815, -75570, -11160, -42034, 67998, -24901, 48877, 8163, -2034, 81898, -14935, 13730, -6896, 29569, -36657, -34734, 24785, -36104, 35427, 18600, -18661, -62413, -27606, 17652, 18314, 22912, -8036, -57772, 9053, -30217, 23474, 11912, -5381, 18915, 1554, -7415, -17264, 8513, 75071, -42824, -12203, -15731, 19017, -4588, 8692, -22627, 26960, -31931, -35728, -51161, 17953, -52489, 43016, 27551, -27710, 9766, -16799, 42618, -36063, 35793, -8697, 58533, 16374, -35235, 13338, -23142]
1594E908M1081h1480I445a2005B1776i690A0974a5471a702m9859h237G226c5246
1580a2043C4118A5028b6767c245k1984D7534A9354L0826c8003A9722e0549C7926
1567C9772f133D9674d5801A942b5810l9933I539p42N9071c9864A5899k01I82K0618
1553B1600d0895F821N7819f994R42m3204J2038G992L42J6610J4645a7272A2353
1539g742l2103B8498A0940J5512q967M3061A0448g727o5291a2817j728b105F940
1525A1108K8591i089D4296e0607B6607N1017h683F662d3670C2173c1068C614J9012
1512B2626d054C0226c0698l0352J3276A5774i903m2029k9624g099A3559P825M0888
1499F2272l381j7944b1302B4644c1640J0916l2002K546A7513K2932A817a3894
$$ y = [5908, 46989, -81480, 9445, -12005, 21776, -9690, 10974, -15471, -1702, -51561, -8237, 7226, -35246, -12043, 34118, 15028, -26767, -3245, -25229, 47534, 19354, 50180, -38003, 19722, -50549, 37926, 39772, -6133, 49674, -45801, 1942, -25810, -65743, 9539, 8797, 67868, -39864, 15899, 15698, 982, 21600, -40895, 6821, 64640, -6994, -6052, -49256, -37218, 7992, 8334, 24944, 39589, -17272, 12353, -7742, -39845, 28498, 10940, 26452, 17485, 60546, 10448, -7727, -73018, -12817, -14545, -2105, 6940, 11108, 39699, -9089, 44296, -50607, 26607, 77624, -8683, 6662, -43670, 32173, -31068, 3614, 22626, -4054, 30226, -30698, -61050, -47774, 15774, -9903, -51932, -81556, -7099, 13559, 21384, 62272, 58891, 40947, -21302, 24644, -31640, -20724, -52726, -50180, 17513, 40445, 1817, -13894]
1486d0994j5336a7355A1787b193j449a377l1267E0081b6728C8674A3313e9311
1473g062C3762b5405A7087J235b4084K712j5699a6517n4774G114L0647f864k2491
1460b9355j5695E8696A7997Q105M971j2572e777B7609g856m4542m298a0506j3932
1447b4438K348A6332c843p484A9225a9490G524K8958J3647P406k4852c0676E0057
1433a7456k7269E1149a4111C9545A3287b6486C9013j8916D143c0134D519Q7647
1421I2166D787f416C1704b9768h746M309C4439b9107a0489k6792i250l895E3914
1407B0985b8202G9443k6246c0031J4579O322j4876C2329R404j5400H260c8085
1394d238r15j0099A7372e356j3671C9575r795a4854J435D09c5719a1965l0313
$$ y = [-40994, -56330, -17355, 11787, -2193, -3642, -1377, -32644, 50081, -26728, 38674, 13313, -59311, -7062, 33762, -25405, 17087, 18322, -24084, -21372, -37071, -16517, -71291, 7114, 37761, -6864, -29355, -45050, 58696, 17997, 26102, 31073, 18501, -5777, 27609, -7856, -52398, -56696, -10506, -24438, -22090, 16332, -3843, -11327, 19225, -19490, 7524, 36482, 50129, 57535, 32683, -30676, 50057, -17456, -44725, 51149, -14111, 39545, 13287, -26486, 39013, 20097, 4143, -30134, 4519, 92166, 4787, -6416, 31704, -29768, -8746, -4437, 34439, -29107, -10489, -37281, -9250, -13145, 53914, 20985, -28202, 79443, 53197, -30031, -15452, -9130, -24006, 32329, 41733, 26333, 8260, -38085, -4238, -5153, -15252, 17372, -5356, -19027, 39575, 29780, -14854, -13419, 409, -35719, -11965, -42278]
1381d2278A8284g0225C775N1642a7397A0476a491k3302j8858A4276b2815p40B2193
1367B1676E969J2090N4397A451a0314B9064p995J21r861b0175k1589J8644A9053
1353A7278f7388c1850J3523k8098h766A5094L1410a2652l5769B3390J8189i79
1340A5078d1140J2573C072M081d2176J4021G101Q586J472d9436J7223B2725K642
1327B5367c6171J7823f453E2584a7130B6303d8420a6159A5545b6551A5258J2250
1315B7508K0913c06k1582N732A8837K696a2186B1526j324D046f418m9146E5227
1301B1121h636A0389L0928B0127d4094A1618n800L2934g043b128k9385H29a9925
1287c371p7380b1312A2631o23b750j2382E3985b3759N580j9497F857a467k4184
$$ y = [-42278, 18284, -70225, 3775, 55417, -17397, 10476, -1491, -24793, -43651, 14276, -22815, -23555, 22193, 21676, 5969, 18059, 72456, 1451, -10314, 29064, 21069, 21190, 11329, -20175, -41764, -23120, 19053, 17278, -67388, -31850, -18327, -46425, -8766, 15094, 46504, -12652, -48421, 23390, 41579, -979, 15078, -41140, -28567, 3072, 7153, -42176, -28155, 7101, 15687, 17159, -49436, -32213, 22725, 25367, -36171, -18348, -6453, 52584, -17130, 26303, -48420, -16159, 15545, -26551, 15258, 27508, 48421, -306, -21888, -16156, 18837, 21533, -12186, 21526, 20202, 4046, -6418, -55564, 55227, 21121, -8636, 10389, 41317, 20127, -44094, 11618, 5818, 38752, -7043, -2128, -31513, 829, -19925, -3371, -80751, -21312, 12631, 12008, -2750, -15132, 53985, -23759, -18179, -37676, 6857, -1467, -25651]
1274b5651F6246F584b5193C1438a8558B5457O0247e0253b2567C34J4853e3061
1261f313D6244d1724F615a5680E9140o463c4908l0575E6872a9781E4387E556d9918
1247B5242a6871C4237B465b2246j6962O120J3162A4000c0275A1827b1726C6933
1234F102b5208j5383D5440Q313e6319q053C3666c7274a5733f178m4787b0740m204
1221b4944N539k487L811A0220J1572d4414C1176r788a6467A7753d1370B5922D828
1207G301j76d1099B0558J0191M9218A0899d3504a0745j4276C8353A377M314K2581
1194B8272d1934a990M10o612F210J5009L915L8566l1556j3129b3642A1085Q560
1181A9645a2905j2867g541j7274P758A8044b2072B3277d6342C5748d854l338E149
$$ y = [-25651, 66246, 6584, -25193, 31438, -18558, 25457, 85704, -50253, -22567, 334, 15187, -53061, -6313, 46244, -41724, 6615, -15680, 59140, 52677, -34908, -65483, 56872, -19781, 54387, 5556, -49918, 25242, -16871, 34237, 2465, -22246, -39208, -33088, -19926, 14000, -30275, 11827, -21726, 36933, 6102, -25208, -40591, 45440, 53753, -56319, -64372, 33666, -37274, -15733, -6178, -50965, -20740, -24944, -19405, -21892, -18081, 10220, 21792, -44414, 31176, 21388, -16467, 17753, -41370, 25922, 4828, 7301, 7125, -41099, 20558, 30749, 79967, 10899, -43504, -10745, -25021, 38353, 1377, 5691, 28272, -41934, -1990, -1580, -8192, 6210, 21219, 25134, 63700, 32144, 19015, -23642, 11085, 19645, -12905, -25772, -7541, -24815, -17057, 18044, -22072, 23277, -46342, 35748, -4854, -8192, 5149]
1167c2129c943n6224B5746d065q8588C7439B843J4305L4760d1667I227a2384B4045
1153c8249J8415P84C0259b5803J312A5939o796J9806j560b1850l805E0223c4332
1139A7406K3080K6129q012c4402O077a625D3419j4181q824b2245B0235a0071C9183
1125H835R947K3878F466N660b4396B1096e6775B2637d1606F6436b4191A0611d940
1111c0198J0933l3262D7317B3111A1357K6334a0603G5001f6528b4472l7081b388
1098B0090c968n1185J8211a2154K540A6190C364A631L8566a3892e711n1435E912
1084B1517c5969G381b6357F434d977C4780a9987D0559A7946B208f519l0556b856
1070a766n8732E7619A013Q307a9886D1258B231b9828k70K873A4506c2381H1519
$$ y = [-32129, -3943, -60167, 25746, -4065, -92653, 37439, 2843, 17148, 51908, -41667, 9227, -12384, 24045, -38249, -19834, -19050, 30259, -25803, -24491, 15939, 9143, 28949, 27389, -21850, -25655, 50223, -34332, 17406, 40486, 66615, 58603, -34402, -28325, -1625, 43419, 29238, 20414, -22245, 20235, -10071, 39183, 8835, 18782, 42660, 6466, 12126, -24396, 21096, -56775, 22637, -41606, 66436, -24191, 10611, -4940, -30198, -19265, -52527, 47317, 23111, 11357, 37691, -10603, 75001, -66528, -24472, -61553, -2388, 20090, -3968, -55153, -36942, -12154, -9614, 16190, 3364, 1631, 40197, -13892, -5711, -57146, 5912, 21517, -35969, 7381, -26357, 6434, -4977, 34780, -19987, 40559, 17946, 2208, -6519, -37075, -2856, -1766, -60498, 57619, 1013, 9320, -19886, 41258, 2231, -29828, -30098, -27225, 14506, -32381, 81519]
1056b4850C28c3710k197e709o9387B0686D278M9J5099L2127b1173C802A32b3882
1041b3156J764c063j4742k210J289l4839f03m0691E3774a6335l625B2976L4423
1028E7399j2834K2284A747K5816N4250G582L1386a3320b521k5412J0587A317a2335
1014d2159A5970d7534A9436M386B800L697r85A647d1116M766F5710B7210a7018
1000e0394a6821A2945c7361B4575a6291E172e3619B5427a471l124e96E611a8466
986H524q46A693M7627b1416A2962J6495j3389M493i1112b3294A6424f95B7414
972H4446b4718B885J0904K3696d033o965M227C7072b7783D9664g7654a322l9147
959d0469k2005K0336B5894d068p566l1178K1340k2811D549J7441J9168A1923N9559
$$ y = [-24850, 328, -33710, -35907, -5709, -75096, 20686, 4278, 4327, 19426, 51553, -21173, 3802, 132, -23882, -23156, -21392, -3063, -17805, -20015, -18726, -53565, -603, -41294, 53774, -16335, -19960, 22976, 57399, 44565, 66849, 1747, 27563, 81813, 7582, 38968, -13320, -2521, -27933, -17346, 1317, -12335, -42159, 15970, -47534, 19436, 23822, 2800, 6497, 5512, 1647, -41116, -36350, 65710, 27210, -17018, -50394, -16821, 12945, -37361, 24575, -16291, 5172, -53619, 25427, -1471, -4595, -596, 5611, -18466, 8524, 7678, 1693, 49320, -21416, 12962, 29457, 16068, 20561, -91112, -23294, 16424, -695, 27414, 84446, -24718, 2885, 13789, 37485, -4033, -10998, -6771, 37072, -27783, 49664, -77654, -1322, -40469, -62474, -42138, 25894, -4068, -11634, -42812, -21472, -44283, 4549, 21990, 41158, 11923, 71482]
946G1482c9159E9659b0668C8381k203b590l0542j308I121A997J6775h360m245
933a2605B5742H304e3219A8480F16h0210J8565C4267a6449C1536k409L3728l1280
920C1575f478b928j6705B0K6835a3602A0353J5394e058l4384B4857c3754D629
906E4660A7179J8104E302O112e698l4517E4924k7438e3741B9059j1655J1859b2006
892B2841d716G892d0040H741M284a1522F826f3437D572Q323c082C8838a0487E5973
877b4943n3622C9431b3100j12J1043A2630K9113C025P01J1475c3815C907Q555
864A2462a1030j9387A4310N1114c3155a0560c990m3814I455N965b3834B1354d1899
850b2233Q311C2572R029a6687k244E7464J8270B8238A3494O834N3133a9912E0350
$$ y = [71482, -39159, 59659, -20668, 38381, 36178, -2590, -33132, -34440, 9121, 1997, 18772, -8360, -12605, 25742, 8304, -53219, 18480, 616, -80210, -61645, 34267, -16449, 31536, 29127, 62855, 31575, -6478, -2928, -19633, 20, 26855, -13602, 10353, 25747, -5058, -39442, 24857, -33754, 4629, 54660, 17179, 35283, 5302, 11414, -5698, -40215, 54924, 27486, -53741, 29059, 17404, 29263, -22006, 22841, -4716, 7892, -40040, 8741, 13025, -11522, 6826, -63437, 4572, 12895, -3082, 38838, -10487, 55973, -24943, -78565, 39431, -23100, -23212, -12169, 12630, 41743, 3025, 3726, 15201, -33815, 3907, 12462, -11030, -30417, 14310, 65424, -33155, -10560, -3990, -47804, 9455, 15420, -23834, 21354, -41899, -22233, -13922, 32572, 41601, -16687, -18931, 57464, 75734, 28238, 13494, 20328, 73461, -19912, 50350]
836A3913M6360c3111A9401A217a8982b334C2856e9387A2322d5632J0497J2034
824b3101A5237E092b207H169O0058A2677K623d533B7810j2495o563a1244C806
810A6247A405K3280J455a9501j5499c08n3161A897L1606A4662J6332i181j453
797a0634k8106A7033p746J2672J6451D586Q5031A3347a1921j730B1175q473L829
784A6531J4696j3331i0713A2409N134b6595C5068c1420E59K0556K2748h760D099
770A0358L1860d1350A4425a3438C8094b0851a337A8969a4413j578C8400j5837
758B2563p262B849N1740a083k0741E5330B1424M52J3938J8649b941D680b9848
744D6373e8150K1314a2096j4512k4934A193K288P6029a6491A7813L50h641m0622
$$ y = [13913, 60273, -33111, 19401, 1217, -18982, -2334, 32856, -59387, 12322, -45632, -35135, -23101, 15237, 5092, -2207, 8169, 68227, 12677, 15300, -4533, 27810, 15315, 8752, -11244, 3806, 16247, 1405, 24685, 26140, -19501, -35000, -308, -53469, 1897, 33503, 14662, 30994, -9181, -10634, -38740, 17033, 9287, 21959, 38410, 4586, 89617, 13347, -11921, -13651, 21175, 12702, 16531, 31227, 17896, -90713, 12409, 17543, -26595, 35068, -31420, 559, 21115, 43863, -8760, 4099, 10358, 42218, -41350, 14425, -13438, 38094, -20851, -1337, 18969, -14413, -15991, 38400, 22563, 15301, 2849, 54589, -1083, -21824, 55330, 21424, 21876, 35814, 54463, -2941, 4680, -29848, 46373, -58150, -36836, -12096, -26608, -51542, 1193, 3481, 79510, -16491, 17813, 18163, -8641, -49263]
731d9263B6123k802a3348M406j8903k951A2210k319K7969d5607g775A8537d757
717a8081j1624E2293b3078m180A8425a4823P90L512L883l702A4212b0060A379
703b5906D3226J3589n662k1637K5683a1137c368k6689A3840J1384j2174c170F83
689B3236f718K708A0409d217B0148b6615m602D992f0428H525h0834D2004a4524
675E3237B100K3980a8454a569D8034M872n110A3643b4750C9169C476Q986b1794
661D7804c8893B6391c0356A5721K6629a0228m801P172n080m0653E2032c9492G754
647a9941k267A9618J5399f720A8264N1695k8236a4833d455A2344J2755a2357l0211
634d2568A8292E402L9458R945a9632B1298i920C4432i1738a4241A6023b1932B4337
$$ y = [-49263, 26123, 23321, -13348, -8942, -27845, -30796, 12210, 9891, 37860, -45607, -7775, 18537, -4757, -18081, -29705, 52293, -23078, -27258, 18425, -14823, -14033, -10521, -6638, -10340, 14212, -20060, 1379, -25906, 43226, 56815, 51153, 29516, 55199, -11137, -3368, -30057, 13840, 25224, 13050, -3170, 683, 23236, -6718, -4010, 10409, -4217, 20148, -26615, -31217, 4992, -60428, 8525, -80834, 42004, -14524, 53237, 2100, 26080, -18454, -1569, 48034, 52906, 47796, 13643, -24750, 39169, 3476, 12462, -21794, 47804, -38893, 26391, -30356, 15721, 42350, -10228, -15029, -7857, -12937, -53590, 52032, -39492, 7754, -19941, -22208, 19618, 35017, -6720, 18264, 69959, 41723, -14833, -4455, 12344, 25099, -12357, -42568, 18292, 5402, 44860, 54805, -19632, 21298, -9920, 34432, -91738, -14241, 16023, -21932, 24337]
620C1726H677b4129N632k1408A153K9238j3174r92i504D7581p394c229A4778F393
605B2850J5160b294l5139F0438B5402p783a0504j0944J0283L03A1121a7273d723
591g434E6353E701e9625a7793D1150A9485j481a0034L825k2622A3556o169a6408
577c9804j0831J7445G25J717J9170a0493E5091k738A4012a4486c210E2139I783
563a1909A8116e261A6734f082a999l047B2709J8650a6281c554N73j1386B2937
549b844E2080b3319c083A1892c325l3645A9283J64g734H075f0735E4553a1651
535D6306c4861a5805C0485b2670A6890J0543m21K0010B108N348J8135b5276B3761
521A3929n38M6083i185j4759D6663j9461h820R14E7374A5901d0749a3053A0959
$$ y = [31726, 8677, -24129, -18497, -39905, 1153, 30391, 17217, 16225, -9504, 47581, 40187, -3229, 14778, 6393, 22850, 38010, -2294, -37433, 60438, 25402, 17619, -10504, -21448, -11165, -10862, 11121, -17273, -4723, -7434, 56353, 5701, -59625, -17793, 41150, 19485, 18004, -10034, -6209, -28831, 13556, 7387, -16408, -39804, -50635, -33190, 725, 2442, 21612, -10493, 55091, 52353, 14012, -14486, -3210, 52139, 9783, -11909, 18116, -5261, 16734, -6082, -1999, -5046, 22709, 41359, -16281, -3554, -2981, -14367, 22937, -2844, 52080, -23319, -3083, 11892, -3325, -36970, 19283, 19447, -7734, 8075, -60735, 54553, -11651, 46306, -34861, -15805, 30485, -22670, 16890, 27433, 27012, 47022, 2108, 7456, 25591, -25276, 23761, 13929, 13391, 59474, -9185, -23944, 46663, 27202, -8820, -7906, 57374, 15901, -40749, -13053, 10959]
507A9178b4362B9039K6310d339E772b169E4013A9311b5211D9409g1167F890L6251
494D3141A4763K9763B684N1353B764J4265N842J5378A3288K53a0051F3023c14
480b1409B7967d7630J1756C0660r511L33M9393E084a3337A3051M0570d1292I6030
466B9192c3707m081D027L8575b0681C0752j5288a8822D8201A6678O0968a7076
453c8510b652k9180F3793a7829N846k167j5430E1731f845j7784A908O5826A5012
439A3172c7506C1608b7229Q120B7591L5868b3177h803k5866J0569C6434f7003
426b0041A0961K6543A4084j234c3273C8408H119g48a10o5974e248E1797f772B3272
411B2187a3434A0826L2116D774J5224a5247E9763a2801B0282c0714L591C6562
$$ y = [19178, -24362, 29039, 55349, -4339, 5772, -2169, 54013, 19311, -25211, 49409, -71167, 6890, 43141, 14763, 44526, 2684, 54037, 2764, 17029, 22871, 38249, 13288, 13541, -10051, 63023, -314, -21409, 27967, -47630, -35874, 30660, 21149, 21482, 70875, 5084, -13337, 13051, 53621, -41292, 96030, 29192, -33707, -37788, 4027, 42602, -20681, 30752, 15464, -18822, 48201, 16678, 77646, -17076, -38510, -2652, -31832, 63793, -17829, -11983, -14150, -29580, 51731, -6845, -24629, 1908, 67734, 15012, 13172, -37506, 31608, -27229, -19109, 27591, 63459, -23177, -8803, -34669, -24100, 36434, -67003, -20041, 10961, 37504, 14084, 12850, -33273, 38408, 8119, -748, -110, -66084, -5248, 51797, -6772, 23272, 22187, -13434, 10826, 42942, 4774, 19998, -15247, 59763, -12801, 20282, -30714, -27123, 36562]
398d2875B9068M0619B8697L8181k9861a8630k4054g412E4252c8571C6975B637
385f5979E2661A2645P368a3334A415K624a6845A801J347L1365d3968a4679n0206
372f4885b2518E4667A1939M0979B1000g031B3977a04686a3972A3909D556a6890
359E844b9138D9327A1723N959c285k634l1769A4171K1404O470j2107I761O2716
346G2477d2678q974B480J8916K1667j0046E155K3639n568A1208M024b7124D067
332B0983r445a751I970c1163a0287D1211A1007N157L7014e6660E7998H015J4149
319B2164J1516D419P955c590k0758C5054f1283K7579B5314K6422M44b8652C2919
305a7489C6701M4804G854L3105A8173c3214i245g04A6360M0543B212a0632E519
$$ y = [-42875, 29068, 69687, 28697, 66878, 37017, -18630, -42684, -7412, 54252, -38571, 36975, 2637, -65979, 52661, 12645, 20013, -13334, 1415, 4039, -16845, 1801, 3148, 34513, -43968, -14679, -64885, -22518, 54667, 11939, 52918, 21000, -7031, 23977, -104686, -13972, 13909, 4556, -16890, 5844, -29138, 49327, 11723, 17682, -3285, -5919, -37688, 14171, 35575, 42045, 29938, 9761, 72477, -42678, -51652, 2480, 21396, 43063, 33017, 5155, 28794, 23226, 11208, 15232, -27124, 4067, 20983, 11538, -1751, 9970, -31163, -10287, 41211, 11007, 16164, 53178, -56660, 57998, 8015, 22164, 33680, 4419, 12374, -3590, -24348, 35054, -61283, -33704, 25314, 51736, 52180, -28652, 32919, -17489, 36701, 81505, 7854, 40959, 18173, -33214, -9245, -704, 16360, 56903, 2212, -10632, 5519]
291a9265E4036i825j1639m2151J4699B0754d1998B1599a7387Q099F9349B7092
278c5377O102D281d559E1309a2703C9200M87j6723A0077i006A2974K6270a8191
264E5275e860j2111F847f087m5858E9795c0287C2330c711l3564d354j5755D9157
250D1449A1765e8278D8507m362A8825L9382j5942B078M9196j5796b095k7434B8460
236b0101F1599f014B820e228j7400e914C9515a2695e91k2788A8042A140J3618
223A4758J2911L4736g879E3831a1095l0445a97B4627n109E638a001C5488G889
209B1373j43d3843a4026k6574A179Q338J5716l92A232M7611B4338J6051c4472
195d5431B2278a2168C2354d672A1679d1236j118f152n6639J1836A4680J7059L2050
$$ y = [-19265, 54036, -9825, -21464, -63615, -48916, 20754, -41998, 21599, -17387, -9288, 69349, 27092, -35377, -29275, 4281, -4559, 51309, -12703, 39200, 39687, 22964, 10077, -9006, 12974, 39244, -18191, 55275, -5860, -17971, 6847, -6087, -51945, 59795, -30287, 32330, -3711, -37275, -4354, -20109, 49157, 41449, 11765, -58278, 48507, 44145, 18825, 58207, 42265, 2078, 51274, 35478, -2095, -29529, 28460, -20101, 61599, -6014, 2820, -5228, -22628, -5914, 39515, -12695, -591, -23379, 18042, 1140, 14758, 27669, 62405, -7879, 53831, -11095, -41540, -197, 24627, 19518, 5638, -1001, 35488, 7889, 21373, 21230, -43843, -14026, -40600, 1179, 9517, 25233, 24841, 1232, 48843, 24338, 40389, -34472, -45431, 22278, -12168, 32354, -4672, 11679, -41236, -42354, -6152, -62791, -50955, 14680, 31739, 63789]
182F3789A6739g612F630P889n650R927d7618B6411d0110D526a6447D2845L100
169D5945A8131d3635o361g794k960B9849d481k0388B6826G987c1095j5506a9387
155b0245j3837F48M234J4551n322M5123b6275m360R778a600m8642A4999a6547
$$ y = [63789, 16739, -7612, 6630, 14519, 8869, 18796, -47618, 26411, -40110, 4526, -16447, 42845, 45945, 18131, -43635, -49996, -7794, -10754, 29849, -4481, -24869, 26826, 7987, -31095, -46601, -19387, -20245, -34082, 648, 4882, 19433, 14111, 59234, -26275, -30635, -20857, -1600, -50242, 14999, -16547]
$$ [...]
##END NTUPLES=NMR SPECTRUM
##END=
