##TITLE=Analysis number 329081
Compound Code ac 12788
Project Code adrs
Chemist Name fwd
##JCAMPDX= 6.0         $$ Bruker NMR JCAMP-DX V2.0
##DATA TYPE= NMR SPECTRUM
##DATA CLASS= NTUPLES
##ORIGIN= Bruker BioSpin GmbH
##OWNER= nmr
$$ XWIN-NMR		Version 3.5
$$ Tue Jul 31 08:44:00 2007 GMT Daylight Time (UT+1h)  MAYBRIDGE\nmr@NMR_250MHZ
##.OBSERVE FREQUENCY= 250.131544655141
##.OBSERVE NUCLEUS= ^1H
##.ACQUISITION MODE= SIMULTANEOUS (DQD)
##.ACQUISITION SCHEME= undefined
##.AVERAGES= 16
##.DIGITISER RES= 18
##SPECTROMETER/DATA SYSTEM= dpx250
##.PULSE SEQUENCE= zg30
##.SOLVENT NAME= DMSO
##.SHIFT REFERENCE= (INTERNAL, DMSO, 0, 16.522)
##AUDIT TRAIL= $$ (NUMBER, WHEN, WHO, WHERE, WHAT)
$$ ##TITLE= Audit trail, XWIN-NMR		Version 3.5
$$ ##JCAMPDX= 5.01
$$ ##ORIGIN= Bruker BioSpin GmbH
$$ ##OWNER= nmr
$$ C:\u/data/dgb/nmr/ADRS/1700/pdata/1/auditp.txt
$$ ##AUDIT TRAIL=  $$ (NUMBER, WHEN, WHO, WHERE, WHAT)
(   1,<2007-07-31 08:43:32.87 +100>,<MAYBRIDGE\nmr>,<NMR_250MHZ>,
      <created by zg, POWCHK disabled, PULCHK disabled
       configuration hash MD5:
       76 6E 9A 78 1E 09 19 81 EC 84 63 8F B0 6A 59 2D
       data hash MD5: 64K
       C7 5C 38 F4 02 56 20 67 E8 D9 36 46 99 CD C9 3C>)
(   2,<2007-07-31 08:43:49.42 +100>,<MAYBRIDGE\nmr>,<NMR_250MHZ>,
      <Start of raw data processing
       ef LB = 0.3 FT_mod = 6 PKNL = 1 SI = 32K 
       data hash MD5: 32K
       60 AE C1 AA 82 99 A0 EA 67 60 40 3E 26 3D D2 F2>)
(   3,<2007-07-31 08:43:51.17 +100>,<MAYBRIDGE\nmr>,<NMR_250MHZ>,
      <apk 
       data hash MD5: 32K
       FB 76 04 7E 3F 55 24 00 17 A2 6F E0 2F D0 20 55>)
(   4,<2007-07-31 08:43:51.89 +100>,<MAYBRIDGE\nmr>,<NMR_250MHZ>,
      <abs ABSG = 5 
       data hash MD5: 32K
       47 A7 70 07 64 ED 72 51 39 14 34 BE A2 08 D6 49>)
$$ ##END=
$$ 
$$ hash MD5
$$ BA 74 D9 3E AF FB A6 5A EC 5B 02 99 89 EC 48 65
##$RELAX= 
##$RELAX= 
##$RELAX= 
##$RELAX= 
##$RELAX= 
##$RELAX= 
##$RELAX= 
$$ Bruker specific parameters
$$ --------------------------
##$DU= <C:\u>
##$EXPNO= 1700
##$NAME= <ADRS>
##$PROCNO= 1
##$TYPE= <nmr>
##$USER= <dgb>
##$AMP= (0..31)
100 100 100 100 100 100 100 100 100 100 100 100 100 100 100 100 100 100 
100 100 100 100 100 100 100 100 100 100 100 100 100 100 
##$AQSEQ= 0
##$AQ_mod= 3
##$AUNM= <au_zg>
##$AUTOPOS= <4 >
##$BF1= 250.13
##$BF2= 250.13
##$BF3= 250.13
##$BF4= 250.13
##$BF5= 500.13
##$BF6= 500.13
##$BF7= 500.13
##$BF8= 500.13
##$BYTORDA= 1
##$CFDGTYP= 0
##$CFRGTYP= 5
##$CHEMSTR= <none>
##$CNST= (0..31)
1 1 145 1 1 1 1 1 1 1 1 1 1 1 1 1 1 1 1 1 1 1 1 1 1 1 1 1 1 1 1 1 
##$CPDPRG= <>
##$CPDPRG1= <>
##$CPDPRG2= <>
##$CPDPRG3= <>
##$CPDPRG4= <mlev>
##$CPDPRG5= <mlev>
##$CPDPRG6= <mlev>
##$CPDPRG7= <mlev>
##$CPDPRG8= <mlev>
##$CPDPRGB= <>
##$CPDPRGT= <>
##$D= (0..31)
0 1 0 0 0 0 0 0 0 0.06 0 0 0 0 0 0 0.0002 0 0 0 0 0 0 0 0 0 0 0 0 0 0 
0 
##$DATE= 1185867811
##$DBL= (0..7)
120 120 120 120 120 120 120 120 
##$DBP= (0..7)
150 150 150 150 150 150 150 150 
##$DBP07= 0
##$DBPNAM0= <>
##$DBPNAM1= <>
##$DBPNAM2= <>
##$DBPNAM3= <>
$$ [...]
##$SUBNAM7= <"">
##$SUBNAM8= <"">
##$SUBNAM9= <"">
##$SW= 20.6930455092707
##$SWIBOX= (0..15)
0 0 3 0 0 0 0 0 0 0 0 0 0 0 0 0 
##$SW_h= 5175.983436853
##$TD= 65536
##$TD0= 1
##$TE= 296.16
##$TE2= 300
##$TE3= 300
##$TEG= 300
##$TL= (0..7)
0 120 120 120 120 120 120 120 
##$TP= (0..7)
150 150 150 150 150 150 150 150 
##$TP07= 0
##$TPNAME0= <>
##$TPNAME1= <>
##$TPNAME2= <>
##$TPNAME3= <>
##$TPNAME4= <>
##$TPNAME5= <>
##$TPNAME6= <>
##$TPNAME7= <>
##$TPOAL= (0..7)
0.5 0.5 0.5 0.5 0.5 0.5 0.5 0.5 
##$TPOFFS= (0..7)
0 0 0 0 0 0 0 0 
##$TUNHIN= 0
##$TUNHOUT= 0
##$TUNXOUT= 0
##$USERA1= <user>
##$USERA2= <user>
##$USERA3= <user>
##$USERA4= <user>
##$USERA5= <user>
##$V9= 5
##$VALIST= <valist>
##$VCLIST= <CCCCCCCCCCCCCCC>
##$VD= 0
##$VDLIST= <DDDDDDDDDDDDDDD>
##$VPLIST= <PPPPPPPPPPPPPPP>
##$VTLIST= <TTTTTTTTTTTTTTT>
##$WBST= 1024
##$WBSW= 4
##$XGAIN= (0..3)
0 0 0 0 
##$XL= 0
##$YL= 0
##$YMAX_a= 290275
##$YMIN_a= -262506
##$ZGOPTNS= <>
##$ZL1= 120
##$ZL2= 120
##$ZL3= 120
##$ZL4= 120
##$ABSF1= 16.522
##$ABSF2= -4.171173
##$ABSG= 5
##$ABSL= 3
##$ALPHA= 0
##$AQORDER= 0
##$ASSFAC= 0
##$ASSFACI= 0
##$ASSFACX= 0
##$ASSWID= 0
##$AUNMP= <proc_1d>
##$AZFE= 0.1
##$AZFW= 0.1
##$BCFW= 0
##$BC_mod= 0
##$BYTORDP= 0
##$COROFFS= 0
##$CY= 12.5
##$DATMOD= 1
##$DC= 0
##$DFILT= <>
##$DTYPP= 0
##$F1P= 14.0000005364418
##$F2P= -0.99999901652339
##$FCOR= 0.5
##$FTSIZE= 32768
##$FT_mod= 6
##$GAMMA= 0
##$GB= 0
##$INTBC= 1
##$INTSCL= 1
##$ISEN= 128
##$LB= 0.3
##$LEV0= 0
##$LPBIN= 0
##$MAXI= 10000
##$MC2= 0
##$MEAN= 0
##$ME_mod= 0
##$MI= 0
##$NCOEF= 0
##$NC_proc= -4
##$NLEV= 6
##$NOISF1= 0
##$NOISF2= 0
##$NSP= 0
##$NTH_PI= 0
##$NZP= 0
##$OFFSET= 16.522
##$PC= 1
##$PHC0= -58.38802
##$PHC1= 5.822091
##$PH_mod= 1
##$PKNL= yes
##$PPARMOD= 0
##$PSCAL= 4
##$PSIGN= 0
##$REVERSE= no
##$SF= 250.13
##$SI= 32768
##$SIGF1= 0
##$SIGF2= 0
##$SINO= 400
##$SIOLD= 32768
##$SREGLST= <1H.DMSO>
##$SSB= 0
##$STSI= 32768
##$STSR= 0
##$SW_p= 5175.98343685301
##$SYMM= 0
##$S_DEV= 0
##$TDeff= 65536
##$TDoff= 0
##$TI= <Analysis number 999999
Compound Code 99
Book Reference 9
Project Code 9>
##$TILT= no
##$TM1= 0
##$TM2= 0
##$TOPLEV= 0
##$USERP1= <user>
##$USERP2= <user>
##$USERP3= <user>
##$USERP4= <user>
##$USERP5= <user>
##$WDW= 1
##$XDIM= 32768
##$YMAX_p= 491479890
##$YMIN_p= -218553
$$ End of Bruker specific parameters
$$ ---------------------------------
##NTUPLES= NMR SPECTRUM
##VAR_NAME=  FREQUENCY,     SPECTRUM/REAL,   SPECTRUM/IMAG
##SYMBOL=    X,             R,               I
##VAR_TYPE=  INDEPENDENT,   DEPENDENT,       DEPENDENT
##VAR_FORM=  AFFN,          ASDF,            ASDF
##VAR_DIM=   32768,         32768,           32768
##UNITS=     HZ,            ARBITRARY UNITS, ARBITRARY UNITS
##FACTOR=    0.157963299565203, 1,           1
##FIRST=     4132.6476996994, 0,             0
##LAST=      -1043.33573715361, 0,           0
##MIN=       -1043.33573715361, -218553,     0
##MAX=       4132.6476996994, 491479890,     0
$$ Real data points
##PAGE= N=1
##DATA TABLE= (X++(R..R)), XYDATA
$$ [...]
16214f6602J4949j9311L1915J5312N3229l7706R535K0882l1485k7893l698j0524
16202e1397m7530J4910Q6039K1122k4275k4652K983j210m016L1664j9402l7944
16190e3708j6978K2892J5815L7088j8222n4792l1270p677J2319j9852l4881M2095
16178a07171L0568k3259M5759M4205P434M6624M1243n6450K7516l0576j4762k0764
16166i633n985N0448p577k6086r159k1376j3183j1343k4391m9046J4224N3300
16154e9807L8790K6135q59J2638O143k2086N6667O3132m0248k3130l3343o7473
16142d3441k4161O7531L4436q0450p0243k5266J0563M6519P7024j6323k5454l230
16130e2495L3457P94n483k1407J5164J7308K8070l7131K2309M8245L9401K8382
$$ plain form
16214 -66602 -51653 -70964 -39049 -23737 29492 -8214 1321 22203 -9282 -37175 -40873 -51397
16202 -51397 -98927 -84017 2022 23144 -1131 -25783 -22800 -24010 -28026 3638 -15764 -53708
16190 -53708 -70686 -47794 -31979 5109 -13113 -67905 -99175 -106852 -94533 -114385 -149266 -107171
16178 -107171 -76603 -99862 -54103 -9898 -2464 44160 85403 28953 56469 25893 11131 -9633
16166 -9633 -15618 34830 27253 1167 -7992 -29368 -42551 -53894 -78285 -127331 -113107 -59807
16154 -59807 -21017 5118 4259 16897 23040 954 57621 120753 80505 57375 24032 -43441
16142 -43441 -67602 -71 34365 -46085 -116328 -141594 -131031 -84512 -7488 -23811 -49265 -52495
16130 -52495 -19038 -18244 -23727 -45134 -29970 -12662 15408 -21723 586 48831 88232 116614
16118A16614j13182q6993O6204K1545n6900j8476L5754K0355j6636j8831k6109
16107g6655j9839M394J0983M9441k2609k7709j8761J4223Q245R396j780K2188
16095d8483M0102k0518j5966j6067k0457K4305J19l2302O944O076M9062K290l0492
16082e5387l587P97O534k5838K8935L9512m3865K6615K7351K205l7355j2111N544
16069d0650L2150N1066K5786k411p1353N2071J2865p3009k4385p903K1332l3633
16057e8074K339j387k4010M0040j3838k076N6985k2657m9166j5068K4934K9660
16045c2318J4588k3758J0430J6535l6685k2521J7576n305K3159j2949L0437m6268
16033f7079m1331K3991K8718K2646L9459k4640j3427r661k2718L0342M71k2703
$$ plain form
16118 116614 3432 -83561 -17357 4188 -52712 -71188 -35434 -15079 -31715 -50546 -76655
16107 -76655 -96494 -92100 -81117 -31676 -54285 -81994 -100755 -86532 -78287 -68891 -70671 -48483
16095 -48483 -8381 -28899 -44865 -60932 -81389 -57084 -56965 -89267 -82323 -76247 -27185 -24895 -55387
16082 -55387 -58974 -58177 -51643 -77481 -48546 -9034 -52899 -26284 1067 3272 -34083 -46194 -40650
16069 -40650 -8500 42566 68352 65941 -5412 46659 59524 -13485 -37870 -45773 -24441 -58074
16057 -58074 -55735 -57122 -81132 -41092 -54930 -57006 -21 -22678 -71844 -86912 -61978 -32318
16045 -32318 -17730 -41488 -31058 -14523 -51208 -73729 -56153 -61458 -38299 -51248 -20811 -67079
16033 -67079 -108410 -84419 -55701 -33055 6404 -18236 -31663 -41324 -64042 -33700 -33229 -55932
16021e5932R439k801K0046m8728j570M7234L8360j3226J1680o6556K877M4572
16009a4605N1046l7144k8179N7968o318l0596M167L5819l699k9009K4013N03l5138
15996a1172L1447L1310k9590m1048K4209k4416J245M3135J7674O70k8312O5851
15984H1003K9953n3079n3933N7022K6445L2253P181N159q8838k3880K7125M6695
15972I3106L8947k5159L8775R1208j7891k461K650m2036o9120j8813k7649L0379
15960I1936m3897o2564J1724L5585J8790m0813l0477p503L2195O7758j0208J8811
15948H1337O7620l571J5638q780n7061m5223p70J0073P186k9570K6795m0435o0759
15935c7520L5167K6635O139M3086J5815l5586k7536l1381j7531k9209j9467j0452
$$ plain form
16021 -55932 -46493 -49294 -29248 -77976 -79546 -32312 6048 -7178 4502 -62054 -59177 -14605
16009 -14605 36441 -703 -28882 29086 22768 -7828 -3661 32158 28459 -550 23463 23966 -11172
15996 -11172 20275 51585 21995 -19053 5156 -19260 -18015 25120 42794 43464 15152 81003
15984 81003 110956 57877 3944 60966 87411 119664 126845 132004 43166 19286 46411 93106
15972 93106 132053 106894 145669 236877 218986 216525 219175 177139 108019 89206 61557 91936
15960 91936 48039 -14525 -2801 32784 51574 10761 -19716 -27219 4976 72734 62526 81337
15948 81337 148957 145386 161024 152244 95183 49960 49190 59263 66449 36879 63674 23239 -37520
15935 -37520 -2353 24282 30421 73507 89322 53736 26200 -5181 -22712 -51921 -71388 -81840
15923h1840J7729l432M9079j458l4131o2715K3364L1092R945M2695O7746J1112
15911F9186m8682p128j0773K8853q504l3145l607K7585j7640K8977j518n1692
15899b8088J7438O812k4596L4188k9121n4325n107N7882N1149L0812n2672o6681
15887f2309K2982k815l99J5867J1530K1697k3434K47M5337L2249m8024m6410J32
15874c3350j134m1514q978M7158J0706j1000q846j5745M5685K5023P128k3886
15862h753j5471k8285J5723j6770l2355O5727P100P119n442k4797m097j7539k269
15849f0109L5676k0470L3325J03788k2643m1466q7069j4912M6645M3549m5773
15838b9459j01471n5262K2301J23735L9754m5650m3344j1025K8621p549m2854
$$ plain form
15923 -81840 -64111 -67543 -18464 -19922 -54053 -116768 -93404 -62312 -52367 -9672 58074 69186
15911 69186 20504 13376 2603 31456 22952 -10193 -13800 13785 -3855 25122 23604 -28088
15899 -28088 -10650 -3838 -28434 5754 -23367 -77692 -82799 -24917 26232 57044 4372 -62309
15887 -62309 -39327 -42142 -42541 -26674 -15144 6553 -16881 -16634 28703 60952 12928 -33482 -33350
15874 -33350 -34484 -75998 -84976 -37818 -27112 -38112 -46958 -62703 -17018 8005 15133 -8753
15862 -8753 -24224 -52509 -36786 -53556 -85911 -20184 -13084 -5965 -11407 -36204 -40301 -57840 -60109
15849 -60109 -24433 -44903 -11578 92210 69567 28101 -58968 -73880 -27235 16314 -29459
15838 -29459 -130930 -186192 -163891 -40156 -402 -46052 -89396 -100421 -71800 -79349 -122203
15827a22203j8130M7284N000M2198m9404N621L211l051k5293M8524P8857J0338
15815B2952P206l5733k9780l2849m8605O936P3493J6309n769m99K019M5075L1950
15802E2705N9295l4287k7624j41151l9644M3709l846m9955L7101N7520J9128k4891
15790e1940M624Q525k140l6248l0651L703L4783K2933J9096r394j446l5461j9007
15777i2623O4658M5550k0518J2734P261k862j8879J6437R5163j0762l1640o142
15765E8377m4091p3124o57O8642N3270j9304p8017o4317n3588j911P9778N8692
15753a6250K1055j3091J3795L3111l1021j9764m6917o3272j6137P4466j8681l9053
15741a21759M7428K1594L160J9225M6581j0768l7573l4278K2642N8617n8311l3991
$$ plain form
15827 -122203 -140333 -93049 -88049 -45851 -95255 -89634 -86423 -89474 -114767 -66243 12614 22952
15815 22952 30158 -5575 -35355 -68204 -116809 -109873 -36380 -20071 -25840 -26339 -24320 20755 52705
15802 52705 112000 77713 50089 -91062 -130706 -86997 -90843 -140798 -103697 -46177 -27049 -51940
15790 -51940 -47316 -38791 -40931 -77179 -107830 -104127 -69344 -46411 -27315 -36709 -38155 -73616 -92623
15777 -92623 -27965 17585 -2933 9801 17062 14200 -4679 11758 106921 96159 64519 58377
15765 58377 14286 -58838 -59495 9147 62417 43113 -34904 -99221 -152809 -154720 -74942 -16250
15753 -16250 4805 -8286 5509 38620 7599 -12165 -59082 -122354 -138491 -64025 -82706 -121759
15741 -121759 -74331 -52737 -49577 -30352 16229 5461 -32112 -66390 -43748 14869 -43442 -77433
15729g7433O0060m703m1951N223j8587l183L5212J6414j5139m5182N0618P533
15717c1118L3527K0187k19J0662l0401p9934J222Q5081P586n1065r141p264O194
15704d4683O9174L584j5309j7646l318m3977j9391N6585j1737k7846m4489r4564
15692a93617M4940J25654L6141o2267k0629N358p2137l1677P9069N342j0711K559
15680i1975l9966j1251M7841O7345k9j4441m2184L8567L9200l5283L9752j6380
15668a8804k8737j9098l2151j4290P1265M0199l2442J0199r539n553L241l9666
15656g5376k0378P94J6375L4252k5297k9299L0977J3290L261L5619J5652J1184
15644A1054n5083j2328N3410k5607p346K4590N1962K1625k3066J2487j7931J3694
$$ plain form
15729 -77433 -17373 -22076 -64027 -58804 -77391 -80574 -45362 -28948 -44087 -89269 -38651 -31118
15717 -31118 2409 22596 22377 33039 2638 -77296 -76074 9007 16593 -34472 -43613 -50877 -44683
15704 -44683 24491 28075 12766 -4880 -8198 -52175 -71566 -14981 -26718 -54564 -99053 -193617
15692 -193617 -148677 -23023 13118 -49149 -69778 -64420 -136557 -168234 -89165 -83823 -94534 -91975
15680 -91975 -131941 -143192 -95351 -28006 -28035 -42476 -84660 -46093 -6893 -42176 -2424 -18804
15668 -18804 -47541 -66639 -98790 -113080 -41815 -1616 -34058 -23859 -33398 -38951 -35710 -75376
15656 -75376 -95754 -94960 -78585 -44333 -69630 -98929 -67952 -54662 -51401 -15782 -130 11054
15644 11054 -44029 -56357 -2947 -28554 -35900 -11310 40652 62277 39211 51698 33767 47461
15632D7461J7793K7840k5144l9459o4082L9956Q0329L863j5123k2331n6675j9560
15620b5132N2374J0463J1894R127j1008k7708m2955n378J3150p2884j875P4849
15608a5083L2323j0147j760j120k5914j9626K9433Q699j5600R086k5980j9633
15596e5322K6024J1116K2229j7415J987M177k8749M058J1447j8092K3190j9240
15584c4590l025L66n1478O921M6442J1483j8105k8454r4462M5776J9786N4377
15572d4963N2443M982k8696L2109J7908P849k172n5735r9658k4042O3493M2216
15560c4266L5146K3027q7702j6510l9999l180k1054m3050Q3009N1880k9970p211
15548h9880J0288Q6435K9187m4903j9616k2011J0827k3347k7793J0274K4215M9876
$$ plain form
15632 47461 65254 93094 67950 28491 -35591 4365 84694 88557 73434 51103 -5572 -25132
15620 -25132 27242 37705 49599 58726 47718 20010 -22945 -28323 -15173 -88057 -89932 -15083
15608 -15083 17240 7093 5333 4213 -21701 -41327 -11894 -3195 -18795 -9709 -35689 -55322
15596 -55322 -29298 -18182 4047 -13368 -11381 -7204 -35953 -31895 -20448 -38540 -15350 -34590
15584 -34590 -37615 -37249 -88727 -81806 -35364 -23881 -41986 -70440 -164902 -119126 -99340 -44963
15572 -44963 7480 12462 -16234 15875 33783 41632 39460 -16275 -115933 -139975 -76482 -34266
15560 -34266 880 23907 -63795 -80305 -120304 -123484 -144538 -187588 -104579 -52699 -82669 -89880
15548 -89880 -79592 6843 36030 -8873 -28489 -50500 -39673 -63020 -90813 -80539 -56324 -6448
15536f448K2272j8595k3907l6821n1824L408P3228K3829L6993K1827L011l3050
15524A3923m7477k831j9703J1531K0107M2417m4753J8622K6737l4120l0710k6655
15512g2912k9291j1353M4644K1945J4768L45k4485j8163j5325J5858j1618K6110
15500e9477K0585M9685q317L1433J5439o2633m838K1979J009l675l4841j2880
15488d6531J4975m4374K8733K5982M5004Q125m6002J1013J4384l3477O685L0734
15476A5251J7814k0667k7643R001l378j7720R380O4897j2739k0283m4237o0357
15464i0681m4832J7899Q476O338P3179L9228L5014q396j9820k3017o1073m0245
15452a07930k0827M3811N1459Q1841m452l9470n974m5715m9290r009K2369K4747
$$ plain form
15536 -6448 15824 -2771 -26678 -63499 -115323 -111915 -38687 -14858 22135 43962 46973 13923
15524 13923 -33554 -36385 -56088 -44557 -24450 17967 -26786 -8164 18573 -15547 -46257 -72912
15512 -72912 -102203 -113556 -68912 -46967 -32199 -31854 -56339 -74502 -89827 -73969 -85587 -59477
15500 -59477 -38892 10793 2476 33909 49348 -13285 -18123 3856 4865 1190 -33651 -46531
15488 -46531 -31556 -75930 -47197 -21215 23789 31914 -14088 -3075 11309 -22168 -15483 15251
15476 15251 33065 12398 -15245 -6244 -9622 -27342 -17962 46935 34196 13913 -30324 -90681
15464 -90681 -135513 -117614 -109138 -102800 -29621 9607 44621 36225 16405 -6612 -67685 -107930
15452 -107930 -128757 -84946 -33487 48354 43902 4432 -1542 -47257 -96547 -105556 -83187 -58440
15440e8440K4946J3158j4902k6898k9220K3921L2237p022K9705O5913m328o2761
15428a3691j9241j0360O850K0646l3985l7379J6415l1967O4633N541j4632J8923
15416b8247J3519j3747K990P268O1677J1471j9390k6722k4902L594j7304l2573
15404f2366K6191k0719l4650L2321P9234r652o8090m1148Q002j4512O006k9330
15392a28713K6234M9443M9409J5420o4023N561M0638l6764m3960l501M998k7834
15380a13092K189M0178J6636L3948j1244j8396Q6319j5339j4477L3424o9880o570
15368c6304K6418l1119K6412N256q0323k7544M0210K4650j4585k54M4163L1120
15356H100r840J7568N3870q594J6775q153k7823l6634L068j6869K4282J62l1346
$$ plain form
15440 -58440 -33494 -20336 -35238 -62136 -91356 -67435 -35198 -42220 -12515 53398 49070 -13691
15428 -13691 -32932 -43292 -36442 -15796 -49781 -87160 -70745 -102712 -38079 -32538 -47170 -28247
15416 -28247 -14728 -28475 -25485 -18217 43460 54931 35541 8819 -16083 -12489 -29793 -62366
15404 -62366 -36175 -56894 -91544 -59223 20011 10359 -57731 -98879 -90877 -105389 -99383 -128713
15392 -128713 -102479 -53036 -3627 11793 -52230 -46669 -6031 -42795 -86755 -90256 -85258 -113092
15380 -113092 -110903 -70725 -54089 -20141 -31385 -49781 36538 21199 6722 40146 -29734 -36304
15368 -36304 -9886 -41005 -14593 -9337 -89660 -117204 -76994 -52344 -66929 -67183 -23020 8100
15356 8100 -1740 15828 69698 61104 77879 69726 41903 5269 8337 -8532 15750 15912 -15434
15343a5434K3552n2544q1216K3715M0351L6245J0345r8134l7827j2580N4013O416
15331a03098J8955J03197J4725j1833L2514l5040m9735k1444K9322O2813J863
15320D2239n0290o8122l7050Q213k2820L2358N3864K4375J6033k6412j3650j2479
15308e3741Q663O172j6258J7810K4267j2959L918p1383J2362O2461L9532M9702
15296G0546L0597J6694k8264r964n7446r3090J5155j0494L4498N8152l4985M3196
15284C4595m054j8292L5762J7853n1406K800K7695J8041o6233m8912L5491q952
15272b5612N518q190j0227l4214K3718k1134m2379l583j07K6352K3943k4738M635
15259h6018L2122J5381m510k3971j1958J7320J5102L3205l6013J2156q826M2113
$$ plain form
15343 -15434 8118 -44426 -125642 -101927 -61576 -25331 -14986 -113120 -150947 -163527 -109514 -103098
15331 -103098 -84143 19054 33779 21946 54460 19420 -30315 -51759 -22437 40376 42239
15320 42239 -8051 -76173 -113223 -105010 -127830 -95472 -41608 -17233 -1200 -27612 -41262 -53741
15308 -53741 -45078 -38906 -55164 -37354 -13087 -26046 -22128 -93511 -81149 -18688 20844 70546
15296 70546 101143 117837 89573 79609 22163 -70927 -55772 -66266 -31768 26384 -8601 34595
15284 34595 30541 12249 48011 65864 14458 17258 44953 62994 -3239 -52151 -16660 -25612
15272 -25612 -20094 -28284 -38511 -72725 -49007 -70141 -112520 -116103 -116210 -89858 -65915 -90653 -86018
15259 -86018 -53896 -38515 -43025 -66996 -78954 -61634 -46532 -13327 -49340 -37184 -46010 -3897
15247c897K4381J785k8294p744J0434M6225M6165R576M2338n3472o4856l8658
15235a6017k2985k3908n3087l4982K5128J7543P7005m3077n2652L4175P3963N1045
15223C2151k7444n7643J8410L4032m4566n2043k7847J1459J11013P76k0548J8864
15211c386R087k2382m1837K7578q620l6641J5493N1926K1656J0928k6355k7522
15199c0075j2656l029m1688J8424M3390L7921l6744j2101K0234k3129j7969j0384
15187f7806j0645M3344j5462k4269N1541j86p5880j0694M1271L0742j028j1128
15175e0200K0921N9990L2445K3086k4701l5414m2462n8968o9257k7500J9790N2966
15163i9304N2672K0262J7758j2003j6746J5778K526k581L0126j5377n8087r981
$$ plain form
15247 -3897 20484 22269 -6025 -13769 -3335 42890 89055 98631 140969 87497 22641 -16017
15235 -16017 -39002 -62910 -115997 -150979 -125851 -108308 -31303 -74380 -127032 -92857 -18894 32151
15223 32151 4707 -52936 -34526 -494 -45060 -97103 -124950 -113491 -2478 -1702 -22250 -3386
15211 -3386 5701 -16681 -58518 -30940 -39560 -76201 -60708 -8782 12874 23802 -2553 -30075
15199 -30075 -42731 -45760 -87448 -69024 -25634 12287 -24457 -36558 -16324 -39453 -57422 -67806
15187 -67806 -78451 -35107 -50569 -74838 -23297 -23483 -99363 -110057 -68786 -38044 -39072 -50200
15175 -50200 -29279 30711 63156 86242 61541 26127 -16335 -75303 -144560 -172060 -152270 -99304
15163 -99304 -46632 -26370 -8612 -20615 -37361 -21583 -19057 -21638 8488 -6889 -64976 -74957
15151g4957J5743J1267K2280K3846k6179J9348N23j9268K6099K6496l5804m1892
15139e2498m1821J5761M7168k5766k6636k5823R496m14J0407J0899j584J682P0099
15126i030j1014J0549k103m4050m4616K7702Q1921j2547k6266j1274J0200J4339
15114a6189L5166j704M4590k9279L0795l4921o0877r0304M92O939J4604j6187
15102a16875N4734Q2408K2072N9Q680N8613j9925j9149j16124m4747K7324M4995
15090a7935J3507l9456K9680J1870m952k546L609m509J5473j7569M7052m9969
15078a5745r2185q626K8978K813K6650K8640L2528j7855l4353k4473j1542J1064
15066g4106N3550p576O0076K5269L683j5958k7298o2790j4197O1637O8212K4746
$$ plain form
15151 -74957 -59214 -47947 -25667 -1821 -28000 -8652 -8129 -27397 -1298 25198 -10606 -52498
15139 -52498 -94319 -78558 -31390 -57156 -83792 -109615 -100119 -100533 -90126 -79227 -80811 -79129 -9030
15126 -9030 -20044 -9495 -11598 -55648 -100264 -72562 9359 -3188 -29454 -40728 -30528 -16189
15114 -16189 18977 17273 61863 32584 63379 28458 -32419 -122723 -122231 -115292 -100688 -116875
15102 -116875 -62141 20267 42339 42398 51078 109691 89766 70617 -45507 -90254 -62930 -17935
15090 -17935 -4428 -43884 -14204 -2334 -7286 -9832 -6223 -10732 4741 -12828 34224 -15745
15078 -15745 -107930 -116556 -87578 -84765 -58115 -29475 3053 -14802 -49155 -73628 -85170 -74106
15066 -74106 -20556 -28132 31944 57213 60896 44938 17640 -45150 -59347 2290 70502 95248
15054I5248l5115o1753k1853k262j0933m0382M5625M0923L4810l5886l4565K2574
15042c569q517l3940n87J6284J9742l8955J039J0918p8997o6574j8664O6350M5234
15029i0236M0164R2633j1060l3340P874K3753L0876m1709m4589K6905n703l7860
15017d2292J4860L7166l848p212p75L7372k2890P826j7530r448K451j0639L7100
15004B2141l1195L2169l9770o3897M3499R2320m0382o1093m451L212l2935L1926
14992d8456R2563j3965l4870o1854Q8L2032K366j9047j8589M0276J8967P674p903
14979a0718k7704J3925L5458q577L043k3578r039K8713J6436j9401N5341m8815
14967E084p9495l0333O762L3006m941J3830l4486O1716n449p207Q677J2692k3424
$$ plain form
15054 95248 60133 -1620 -23473 -25735 -36668 -77050 -31425 9498 44308 8422 -26143 -3569
15042 -3569 -12086 -46026 -46613 -30329 -10587 -49542 -48503 -37585 -116582 -183156 -201820 -135470 -90236
15029 -90236 -50072 42561 31501 -1839 6035 29788 60664 18955 -25634 1271 -4432 -42292
15017 -42292 -27432 9734 5886 -1326 -2101 35271 12381 20207 2677 -6771 -4320 -14959 22141
15004 22141 -9054 23115 -16655 -80552 -37053 55267 14885 -46208 -50659 -47447 -80382 -48456
14992 -48456 44107 30142 -4728 -66582 -66494 -34462 -32096 -51143 -69732 -29456 -10489 -2815 -10718
14979 -10718 -38422 -24497 10961 2384 5427 -18151 -27190 1523 17959 -1442 53899 5084
14967 5084 -74411 -104744 -97982 -64976 -69917 -56087 -90573 -28857 -34306 -41513 -32836 -20144 -43568
14954d3568k9450K1841K5819R727k1620J099n8720L9554J4336o6949J0114Q4316
14942a3501P9719r875n4541n423K8100j5660j9096l0484J9128j4093j8653M6245
14930h134l7144Q003J7372k9511m2632K7488K8821o7496j5936L0125K6807n0092
14918a12329k1835O9590J9168K5686O393k1496L0522l6077L1358R995m8823J5800
14906c2048M2472j7431j4633L1453M6796k5362q374K2991k2244l60j3918N487
14894A4829p4121l5117J8921J4585j0204k9283N5732J6784l8113m2377J7431J9401
14882g1532P968R856K724l4299k8252M7413j230Q600M21K3761m2579q0964K6314
14869a31799P4246K9526J4553n0337m0180K0912J3387L9674k752J0841m2681k6669
$$ plain form
14954 -43568 -73018 -51177 -25358 -15631 -37251 -36152 -94872 -55318 -40982 -107931 -97817 -13501
14942 -13501 66218 56343 1802 -3621 24479 8819 -10277 -40761 -21633 -35726 -54379 -8134
14930 -8134 -45278 -37275 -19903 -49414 -92046 -64558 -35737 -103233 -119169 -89044 -62237 -112329
14918 -112329 -134164 -64574 -45406 -19720 -13327 -34823 -4301 -40378 -9020 975 -47848 -32048
14906 -32048 10424 -7007 -21640 9813 56609 31247 22873 45864 23620 23260 9342 14829
14894 14829 -59292 -94409 -75488 -60903 -71107 -100390 -44658 -27874 -65987 -108364 -90933 -71532
14882 -71532 -63564 -53708 -50984 -85283 -113535 -66122 -67352 -58752 -58331 -34570 -77149 -158113 -131799
14869 -131799 -57553 -28027 -13474 -63811 -103991 -83079 -69692 -30018 -32770 -21929 -64610 -91279
14857i1279J2624k684K6955J0355M885K9696j7866l0596l2009J143L8514J0647
14845c9615K1551J0669P718L8618Q5209o0417j00473k1296Q242P7628L9656J2040
14833G9530m7763k8970j5970q5852M5892J37097K0995q3466o9817J6918M045J6700
14821a0661J3020l8709k6600K9160L509J8069J1774l7937p4718Q91K3712O2897
14809b5593N8375O9238L2049p0268j06436p3746K1728O7204J4739j6768o884L4891
14797a471n4314j2739J3071O840K6244O9801K8479q3999j6934J0356o3447K4308
14785e3805N1212o750k059j8696O042K6817k7324j805Q169J248k5679k6292K6386
14772d2536O0719M0597r217n6411j9605N3741l5530j3959L3903j9280o8524l9679
$$ plain form
14857 -91279 -78655 -81339 -54384 -44029 -39144 -9448 -27314 -57910 -89919 -88776 -50262 -39615
14845 -39615 -18064 -7395 323 38941 124150 63733 -36740 -58036 -49794 27834 67490 79530
14833 79530 31767 2797 -13173 -99025 -53133 83964 104959 21493 -48324 -31406 -27361 -10661
14821 -10661 2359 -36350 -62950 -33790 -30281 -12212 -438 -38375 -113093 -112202 -88490 -25593
14809 -25593 32782 102020 134069 63801 -42635 -116381 -94653 -27449 -12710 -29478 -36362 -1471
14797 -1471 -55785 -68524 -55453 -48613 -22369 47432 75911 -8088 -25022 -14666 -78113 -53805
14785 -53805 -2593 -9343 -11402 -30098 -24056 2761 -24563 -26368 -18199 -16951 -42630 -68922 -42536
14772 -42536 18183 58780 49563 -6848 -26453 27288 -8242 -22201 11702 -7578 -76102 -115781
14760a15781L1795J1521L3923M1553l1087l1841j6768L3542K9486m1770m2851
14749i8278k4339J2219J3781m1401n535k9028q070O5065R4235N4520k909K036
14737C2296k5532j8470p551O7465R33k9669K044m8701j2541L982J2818K8560j5512
14724i878n342M1580j7325k4775p6961l4163K4197K2583O8315P3192J1420j8247
14712E4596o0599o504m8272p4910Q011J00665P9334o1764q4373K6304O6336J0963
14700I787k6972k5014l7767J6105J5413K3729L2034k7961k0815k6024L2692j0195
14688d4988J1287R7818J4470m9717r917K9573L2633n7164l9042j8651J4461L6467
14676A7230P694Q685k9216M095K8493l3096l1619Q326Q384o574K715j8605l7504
$$ plain form
14760 -115781 -83986 -72465 -38542 3011 -28076 -59917 -76685 -43143 -13657 -55427 -98278
14749 -98278 -122617 -110398 -96617 -138018 -143553 -172581 -180651 -115586 -21351 33169 30260 32296
14737 32296 6764 -11706 -19257 48208 49141 19472 21516 -27185 -39726 -35744 -22926 5634 -9878
14724 -9878 -15220 26360 9035 -15740 -92701 -126864 -102667 -80084 -11769 61423 72843 54596
14712 54596 -6003 -12507 -60779 -135689 -127678 -27013 52321 -9443 -93816 -67512 -1176 9787
14700 9787 -17185 -42199 -79966 -63861 -48448 -24719 7315 -20646 -41461 -67485 -34793 -44988
14688 -44988 -33701 64117 78587 28870 18953 48526 81159 23995 -15047 -33698 -19237 17230
14676 17230 24924 33609 4393 8488 36981 3885 -27734 -19408 -11024 -17598 -14883 -33488 -70992
14663g0992N161L5752N637P5845J7374l9565q136j6678m2876j5295N931K394r404
14650e4852j3508N6654L5809p0555m7050O672L666J1517Q6830M3164l6006M922
14638B7263P568n663j749j898J1222m0765p3127m6080n087K2404j1797M3512M1413
14625c2784M0924j5017J2091m3622K3865O8137m3141n9327n0368q244o088K305
14613a11269o010L9124K1403L5592L3835n110k6684j2070l1574l53J7119m32K9589
14600a6840j3705J0845J2836N0927J9360k6637j4129j9211r2432N1626L1267L7370
14588C1277m8107n2717L687O5184j2592J3995M0979n1104j01871J9139N0624k084
14576d3590K4098k0029J7832L7094L0170m0055m2019M3507M7314j7850l2325J5640
$$ plain form
14663 -70992 -65831 -30079 -24442 51403 68777 29212 21076 4398 -38478 -53773 -47842 -45448 -54852
14650 -54852 -68360 -11706 24103 -46452 -93502 -86830 -83164 -71647 15183 58347 22341 27263
14638 27263 34831 29168 27419 25521 36743 -4022 -77149 -123229 -128316 -105912 -117709 -74197 -32784
14625 -32784 8140 -6877 5214 -38408 -14543 53594 10453 -48874 -99242 -107486 -113574 -111269
14613 -111269 -117279 -78155 -56752 -21160 12675 7565 -19119 -31189 -62763 -63116 -45997 -46429 -16840
14600 -16840 -30545 -19700 -6864 44063 63423 36786 22657 3446 -88986 -37360 -6093 31277
14588 31277 -16830 -69547 -65860 -676 -13268 727 41706 -9398 -111269 -92130 -41506 -43590
14576 -43590 -19492 -39521 -21689 15405 45575 5520 -36499 7008 54322 36472 4147 19787
14564A9787L7537j9568K8002K1074j5434k6991p4419M4977R7841j6077k7858J4970
14552H3841k8935l9974q761L9686L6108Q345J2014M3881q7888L3367J6784k8655
14540G9813N2628l5302p8467j0758J2919n2876k0497J4878J3492l6933K8764J1282
14528b1057K7370N3828n0021j5780j220O2755J9914k3384J826N878J1277k7094
14516D4292k2175N5131K1285p8410J5196J441o2537k4136m0256m3865L1851O280
14504i5903j5833M3393Q5110K0649l2740m0790M2523o994j8741m2747L182p0976
14492a29867K3405O6249L6120N790k7499Q440J1746M2636n0748J2102J8855L3254
14480E0483j6687m4524P1160j8714m8756J2032o2971j2184R00K3556J3338n240
$$ plain form
14564 19787 57324 37756 65758 86832 71398 44407 -30012 14965 112806 96729 68871 83841
14552 83841 54906 14932 6171 45857 81965 90310 102324 146205 58317 91684 108468 79813
14540 79813 132441 97139 18672 7914 20833 -32043 -52540 -37662 -24170 -61103 -32339 -21057
14528 -21057 6313 60141 10120 -5660 -6880 55875 75789 52405 54231 60109 71386 44292
14516 44292 22117 77248 98533 20123 35319 36760 -25777 -49913 -90169 -134034 -102183 -95903
14504 -95903 -111736 -68343 16767 37416 4676 -36114 6409 -585 -19326 -62073 -58891 -129867
14492 -129867 -106462 -40213 -4093 1697 -25802 -17362 -5616 37020 -13728 -1626 17229 50483
14480 50483 33796 -10728 60432 41718 -7038 4994 -57977 -70161 -69261 -45705 -32367 -37607
14468c7607Q145n36m489J3215N3258l8357l6014p7975l3690M1118O4907J7950
14456c0075m0889j6439P0459K6961k0831L1910l2237l994K2291o906l1708j9158
14444e0616P2848P8148J5645q6794q9571r20M245N8698M693j5034J5069N1557
14432E7968K1857L7403l5865j10547m205M5551M2970l189K950k2459l7146J8009
14420A3297K4834J2119M642Q71J3596L3310k5068R2825O9669n0385q6236j6717
14408H6757K6062L449L4292l8949M5556l1067j5906K3655m35k8862J1798K6340
14396A42690j1372k4268p1292M022L5494l7771K5060k8010k3420Q3464K2763p2719
14384D4641j9979N374J2773m8732l0804L6041M7393J3224L0233j2328k5745n0016
$$ plain form
14468 -37607 -29462 -29998 -34487 -21272 31986 -6371 -42385 -120360 -154050 -112932 -48025 -30075
14456 -30075 -70964 -87403 -16944 10017 -10814 21096 -11141 -15135 7156 250 -31458 -50616
14444 -50616 22232 100380 116025 29231 -60340 -61260 -57015 1683 6376 -8658 6411 57968
14432 57968 79825 117228 81363 -29184 -33389 12162 55132 51943 54893 32434 -4712 13297
14420 13297 38131 50250 54892 55763 69359 102669 77601 170426 240095 189710 103474 86757
14408 86757 112819 116268 150560 111611 157167 126100 110194 133849 133414 104552 116350 142690
14396 142690 131318 107050 35758 39780 75274 37503 62563 34553 11133 94597 117360 44641
14384 44641 24662 30036 42809 -5923 -36727 -686 46707 59931 90164 77836 52091 2075
14372B075j4738J1354k1184L0687j1936k1177L2960O420j0618K9501k0510j8355
14360e521n370L4046M7785k3489o0004k0940O4934q89l5981L6227J8056l3373
14348A5481l5281J0054Q0257L2891p191l2527K0106L7480N583o2973n7154o7922
14336f1196J215O8109M816k1833J6767J7898J0078m877n4290l5178O7244L0593
14324C9346k9020L4867M5915R36j2590L468J1699n0338q5115K6831O3063O2307
14312A11369k083k8409j9385j532J3850j4264j8542K7740L3559q528J3749o4002
14300D3522o2605k7314J067j5305j6226O383N8362K6850m0083L8087J2776j0505
14288A5009k1482k0299L9711M4623l8239J2610j8525m3594J0458K610M1645p754
$$ plain form
14372 2075 -12663 -1309 -22493 8194 -3742 -24919 8041 14461 3843 33344 12834 -5521
14360 -5521 -10891 23155 70940 47451 -12553 -33493 31441 30552 -5429 30798 48854 15481
14348 15481 -19800 -9746 70511 103402 96211 63684 83790 121270 126853 63880 6726 -61196
14336 -61196 -59981 8128 12944 -8889 7878 25776 35854 30977 -23313 -58491 8753 39346
14324 39346 10326 45193 91108 92044 79454 82922 94621 44283 -40832 -14001 49062 111369
14312 111369 109286 80877 61492 59960 73810 59546 41004 68744 102303 93775 107524 43522
14300 43522 -19083 -46397 -45330 -60635 -76861 -70478 -12116 14734 -25349 12738 25514 15009
14288 15009 -6473 -26772 12939 57562 19323 31933 13408 -30186 -19728 -17118 24527 16773
14276A6773J9543K7189K3589j7551n4549k7102j8772j5197k9529P116K3427j0609
14264e5672N3302M703k2889N5280L8789n7350j1139j1786j1640J0888m8951l3390
14252h9855l1181L7007J4517j0270K507L2648J4046p553L9147J8322o9832p5766
14240a26263l134j7704N753J7552N1933J8876R165O0475M7446o4949l1496m7610
14228g9956L6444M6682K0056O098m6582r25Q3505n1850r7272K4284J02264L0016
14216G2764j2050p135q27j8306m6356N1331K8084q568k4821l1152K3632L0213
14204E6809r470o467k0681m9756j3239R1240l1452p1495L0503O5463k0350r1618
14192g0513k3682J362k4616k1667M20L6384L5879K9691L00L0972L3545K6582j7195
$$ plain form
14276 16773 36316 63505 87094 69543 14994 -12108 -30880 -46077 -75606 -68490 -45063 -55672
14264 -55672 -2370 2333 -20556 34724 73513 16163 5024 -6762 -18402 -7514 -56465 -89855
14252 -89855 -121036 -84029 -69512 -79782 -77275 -44627 -30581 -38134 1013 19335 -50497 -126263
14240 -126263 -129397 -147101 -141348 -123796 -71863 -52987 -43822 16653 64099 -850 -32346 -79956
14228 -79956 -43512 3170 23226 29324 -17258 -18183 65322 13472 -83800 -59516 42748 72764
14216 72764 60714 53579 52752 34446 -11910 39421 67505 58937 34116 2964 26596 56809
14204 56809 47339 40872 20191 -29565 -42804 48436 16984 -54511 -24008 41455 21105 -70513
14192 -70513 -94195 -92833 -117449 -139116 -138696 -102312 -66433 -36742 -36442 -5470 28075 54657 37462
14179C7462M357o2784p5108K9824l2680p4P2113J2248q9357P1605N7557P0865
14167I6028k845q6250p2651j3958Q586K6860L4445M762K08j1726N9889J2714n7138
14154a076p8606P568m2909M6865N7324k2570j9593L8253n38L662k7591k3520K3408
14141c9323K9450L0877M4431m967n6541L3021n8659n9416J1150M9422K916k464
14129b0103N7951J8335R098n3319l4215j7065J9686L2731K3135N437l2998o2394
14117e3721l853L401n893k4789L8541K7990J5991j9158p544L3231K5257m9513
14105b0060K478N8526L5626L1952L3171J662j0523m0242l3415l2336K2117J3944
14093F2900m7279n6570K0948L5430K6796L7449j7448r076m2644l9519Q6q3437
$$ plain form
14179 37462 41819 -20965 -96073 -66249 -98929 -99003 -26890 -14642 -103999 -32394 25163 96028
14167 96028 93183 6933 -65718 -79676 -71090 -44230 -9785 -5023 -4815 -16541 43348 56062 -1076
14154 -1076 -79682 -72114 -115023 -68158 -10834 -33404 -52997 -14744 -15282 -11620 -39211 -62731 -39323
14141 -39323 -9873 21004 65435 60468 3927 36948 -21711 -81127 -69977 -20555 -17639 -20103
14129 -20103 37848 56183 65281 11962 -22253 -39318 -19632 13099 36234 41671 8673 -53721
14117 -53721 -57574 -54173 -60066 -84855 -46314 -18324 -2333 -21491 -29035 4196 29453 -20060
14105 -20060 -17582 40944 76570 108522 141693 143355 132832 92590 59175 26839 48956 62900
14093 62900 15621 -40949 -20001 15429 42225 79674 62226 53150 10506 -29013 -28927 -112364
14081a12364p1500M1085J06473L9764N644l4276M6093j4647K278j678n8796J3425
14069c8499K5291N8233M0272k3891m1615l3688j3294j8490l4448L9488J1681o19
14057b9579j5367j1916J0085K8812N961m3041o5877J3471P0964o402M1394M054
14045B559j5451l6042L5768L9782m4965l9701p0476k1409K4597K9199L4892M4150
14033a7097M0918L5499q3596k6393L3093Q0898l63N804J7415n575l3389l3785
14021A3429m6200J0795j6496M0305k5585k8275K8575l4015K2482L0956L9667n1549
14009a5911k0281l1865K5050J8168j4561j729k6902J4651k6837l6184k8423K7208
13997a17616L2686K2096P0540L1408J6446l0086j2215j0624J0916k220q658M9109
$$ plain form
14081 -112364 -183864 -142779 -36306 3458 9102 -25174 20919 6272 8550 6872 -51924 -38499
14069 -38499 -13208 45025 85297 61406 19791 -13897 -27191 -45681 -80129 -40641 -28960 -29579
14057 -29579 -44946 -56862 -46777 -17965 -12004 -55045 -120922 -107451 -36487 -42889 -1495 2559
14045 2559 -12892 -48934 -13166 26616 -18349 -58050 -128526 -149935 -125338 -96139 -61247 -17097
14033 -17097 23821 59320 -24276 -50669 -17576 63322 62959 68763 86178 80603 47214 13429
14021 13429 -32771 -21976 -38472 1833 -23752 -52027 -23452 -57467 -34985 -4029 35638 -15911
14009 -15911 -36192 -68057 -43007 -24839 -39400 -41129 -68031 -53380 -80217 -116401 -144824 -117616
13997 -117616 -84930 -62834 7706 39114 55560 25474 13259 2635 13551 11331 2673 51782
13985E1782j4112l5761l898M7839o7838l0252K518j0578J4628O4352N8315M4825
13973A21820J0289o4772q4700n284J5399J2164m3359L0955M6800J5174k6426j708
13961B6352Q930N4575K1279j720n5458p9207m1832j6702k6097n19Q0886L9424
13949I911M259m6387q1124k944J04438L807o076K3983p2903j9458K6041K2033
13937c4420j6728j4794j6198K1999L1253r439O1773O2824j6587j4240n0948M3730
13925D8225L055L4163q147p228n523M0505L0947q7022q6086J4797L9089O858k0924
13912B709P620o20L2709k4830m1616K8624k847K3937L0141m0556q0357l1710K6796
13899g0000P1982J8769L3829Q1478J1438n8956k3618j2706J0230M3530P023o4168
$$ plain form
13985 51782 37670 1909 -1989 45850 -21988 -52240 -49722 -60300 -45672 18680 76995 121820
13973 121820 132109 67337 -17363 -22647 -7248 4916 -38443 -7488 39312 54486 28060 26352
13961 26352 35282 89857 111136 109416 53958 -25249 -67081 -83783 -109880 -110399 -29513 9911
13949 9911 14170 -32217 -113341 -116285 -11847 -8040 -14116 9867 -63036 -82494 -56453 -34420
13937 -34420 -51148 -65942 -82140 -60141 -28888 -38327 23446 86270 69683 55443 4495 48225
13925 48225 51280 85443 77296 70068 64545 105050 135997 48975 -37111 -22314 16775 23633 2709
13912 2709 10329 9709 42418 17588 -24028 4596 1749 25686 55827 15271 -65086 -96796 -70000
13899 -70000 1982 20751 54580 136058 147496 88540 64922 52216 62446 105976 112999 48831
13887D8831o1943q5447L8991J05895L8263l0343q3061o7474K6646M6836N3175
13876C0369m0255N187K0224j1871P577Q512K5578j9368k2109O470n5562M8085
13864B837j5278n950R79J1381k2702N4561M6534l073o8480m4058k9005K8635J0519
13851c3100L8063M866P975k1454m3586j0889M4345k2114m5125p040M5656j2848
13839e5251j0265O3983K751j7896K3389J0245K0776k2033k212q993l9609K1658
13827a3457J2008j3014n8772n0253L1449L9938j5660J0808k1448K441P1419N0232
13815D5691l6245l8554K5702N5081k1772l834J7867M29P399l2388k1633K9255
13803B6998p757n4954K2513L6062L326o7802r8323K1707O5796K2367k3770K2088
$$ plain form
13887 48831 -13112 -98559 -59568 46327 84590 54247 -28814 -96288 -69642 -22806 30369
13876 30369 -9886 -4699 15525 3654 11231 19743 45321 25953 3844 10314 -45248 2837
13864 2837 -12441 -18391 -17412 -6031 -28733 25828 72362 69289 809 -43249 -72254 -43619 -33100
13851 -33100 4963 9829 17804 -3650 -47236 -58125 -13780 -35894 -81019 -88059 -42403 -55251
13839 -55251 -65516 -1533 1218 -16678 6711 16956 37732 15699 13487 4494 -35115 -13457
13827 -13457 -1449 -14463 -73235 -123488 -92039 -52101 -67761 -56953 -78401 -75960 -4541 45691
13815 45691 9446 -29108 -3406 51675 29903 26069 43936 44365 51764 19376 -2257 26998
13803 26998 19241 -35713 -13200 22862 26188 -41614 -139937 -118230 -52434 -30067 -53837 -31749
13791c1749n4653j10618k1209N1052N7830L5025R261k9169P807K0442R772P2353
13779A6144j3711R713M6152m0523n807M4602L2478O598o3394l0903j0361L755
13767e257K9750o7349j7870m415R665O1492N7735n1541j0847n3882m3836J4620
13755h1735M5480P8491k9945q335m796J1932l0175k5525j4992N0910l4010J1636
13743c1064K7019N898l4935k2873J2110L2063k1247m7418r531K9534N2618j0323
13731a8149P4261J359m3216K3481k1186p6378k3967J16102K9380j6357r35m0780
13719C615q327M794K0678m395l5387L8980K4092k4921j80P044n095q348n1985
13706c9435m2494J7257L7849M8922n603m1668N695M5906j725o1618p8213j9617
$$ plain form
13791 -31749 -86402 -197020 -218229 -167177 -109347 -74322 -65061 -94230 -86423 -65981 -56209 16144
13779 16144 2433 12146 58298 17775 11968 56570 89048 95646 32252 1349 -9012 -5257
13767 -5257 24493 -42856 -60726 -65141 -55476 6016 63751 12210 1363 -52519 -96355 -81735
13755 -81735 -36255 42236 12291 3956 -840 11092 -19083 -44608 -59600 -8690 -42700 -31064
13743 -31064 -4045 1853 -33082 -55955 -43845 -11782 -33029 -80447 -89978 -60444 -7826 -18149
13731 -18149 56112 57471 14255 37736 16550 -59828 -83795 32307 61687 45330 44395 3615
13719 3615 -4712 82 20760 16365 -19022 19958 44050 19129 18949 25993 20898 12550 -39435
13706 -39435 -81929 -64672 -26823 22099 16496 -25172 -19477 26429 24704 -36914 -115127 -134744
13694a34744K9684Q1359M0679j1515K8028K59l6139j3496L6772M744M5593N5420
13682A26644j2230o3275l9263j7606O7027K3081N3844o781r8589k5572j9959N2769
13670D0090N591J8532n3438k6555L6916J3263N924N132K1503k6808K3076l6177
13658B7049m4142L1372K2369r361o0361l7521L4290M8697Q400J7766r386j7679
13646A1493m6859j0406R710j746L4404M0833m8497l0317N1230j4395k088Q273
13634A635J5906n2116o5100K1253N0530M103L9081L605l1502j8432K111L5663
13622F737q32k9380K0379N5634N7237j817o4269l927m5105L7310M0693o4557n1693
13609d3590L4556J9977O793Q4549m5938m7691k2641j8654K5287n160n2759L3831
$$ plain form
13694 -134744 -105060 -23701 16978 5463 33491 33750 -2389 -15885 20887 25631 71224 126644
13682 126644 114414 51139 11876 -5730 61297 84378 138222 131441 32852 7280 -12679 40090
13670 40090 45681 64213 10775 -15780 21136 34399 40323 45455 66958 40150 63226 27049
13658 27049 -17093 14279 36648 27287 -33074 -70595 -36305 12392 20792 38558 29172 11493
13646 11493 -35366 -45772 -36062 -37808 -3404 37429 -11068 -41385 9845 -4550 -6638 1635
13634 1635 17541 -34575 -99675 -78422 -27892 -23789 15292 18897 -12605 -31037 -28926 6737
13622 6737 5905 -23475 -3096 52538 109775 107958 43689 39762 -5343 31967 72660 8103 -43590
13609 -43590 -9034 10943 17736 102285 56347 8656 -13985 -32639 -7352 -12512 -65271 -31440
13597c1440O7381L1012l3563j7808N0607l212L03j3179n9221o2811k5018L1529
13585f5420J8384p231p952m6878P552N1297M0770R007j5197K7856m6937R668O329
13572a8752O336n382P310K1911K1596N5698q877l9416J2176l3206m625R516l0912
13559f627l8676L3906k6585K65L711M9724Q02n2138m9551N7757r74J6353L8728
13546B6695J0876j359k0845m2216l466K3279J9024P82l4708J0746J5976j3859
13534i075o868J6890P980J944L9109K906o95K1378J0832M6827k4635l9772m4673
13521B2148l8235l1278L3041P2402p274j7433k6991n8091k40N4307L8578j2626
13509B8308L5541M011k8281k0850L6392k259m9144j0782J2057o485j8635M0871
$$ plain form
13597 -31440 35941 66953 33390 15582 66189 62977 63280 50101 -9120 -71931 -96949 -65420
13585 -65420 -47036 -54267 -62219 -109097 -101545 -50248 -9478 -471 -15668 12188 -34749 -25081 -18752
13572 -18752 -12416 -17798 -10488 11423 33019 88717 79840 40424 52600 19394 14769 24285 -6627
13559 -6627 -45303 -11397 -37982 -37717 -34006 15718 16520 -35618 -85169 -27412 -28386 -12033 26695
13546 26695 37571 36212 15367 -26849 -30315 -7036 11988 12770 -21938 -11192 4784 -9075
13534 -9075 -15943 947 8927 10871 49980 52886 52191 73569 84401 131228 106593 66821 22148
13521 22148 -16087 -47365 -14324 58078 50804 33371 6380 -51711 -51951 2356 40934 28308
13509 28308 63849 67860 39579 18729 55121 52862 3718 -7064 4993 -1492 -20127 20744
13497B0744K6721M766l0254n0571K5149L5024O222P494K994l908n07K8239K7484
13484I9597m550n3035l2979m742Q792K3696N691M603j1714n1829k4975M5205N5673
13471E9433o989R527o0644K258M3193n867o568K5044N0430m8691L668K2932K4164
13458A11890n3040m0526O526k1504Q12N3892J7029k0083M1136k2952o1440o8566
13446e6826J8711J21590m4607k6731M5480l069m0335j5142k0852n559j2923O3600
13434B3337L0007O6917k7005j8445m4368m1931j0235L1938p199J0637j3808o023
13422f178M022o924J9632J8734l9471m8925l3818J303L6779m707O8065n120J3732
13409A7124M55n4017L6090L0355L255Q081p247m9673n7567l4652Q9686O1722l330
$$ plain form
13497 20744 47465 52231 21977 -28594 -3445 31579 37801 45295 48289 44381 43874 72113 99597
13484 99597 95047 42012 9033 4291 13083 36779 42470 47073 35359 -16470 -41445 3760 59433
13471 59433 52444 61971 1327 3585 46778 40911 34343 59387 109817 61126 64794 87726 111890
13458 111890 58850 18324 24850 3346 4158 58050 75079 54996 96132 73180 11740 -56826
13446 -56826 -38115 83475 38868 12137 57617 54548 14213 -929 -21781 -27340 -40263 23337
13434 23337 53344 120261 93256 74811 30443 -11488 -21723 10215 3016 13653 -155 -6178
13422 -6178 -2156 -9080 10552 29286 -10185 -59110 -92928 -91625 -54846 -59553 8512 3392 17124
13409 17124 17579 -36438 -348 30007 33262 41343 34096 -15577 -73144 -107796 -18110 43612 40282
13396D0282l283K9971k2054k175M5321q590p9141L7254N3699k1660M4879K009
13384A16512o078k9555k4345m9201J1611N0476j8970p6469q618k0038r133L3161
13372c0647Q285L7673K809m9026O906L0503Q4460j3773m7144n5809O5167O6026
13360A05430L782M155q1273n4924j2745J381P0238M750o2175o3793P538P1598
13348f038L6475J731M4561k6066m4077o7454Q490J6095j0568l1360K5272M0823
13336a2116Q71N3487r223K6165O6442J6079j4337k7492l7403n3068n2670j0759
13324e4024L4337k9690l4734J9665Q8032P371L221k1396K5620J313J2195m813
13312D7097J278L2484o0456J149M3605j4851J961m4549O629L5367J2876M789K3107
$$ plain form
13396 40282 36999 66970 44916 42741 88062 79472 331 37585 91284 69624 114503 116512
13384 116512 110434 80879 56534 7333 18944 69420 50450 -26019 -34637 -54675 -63808 -30647
13372 -30647 -22362 15311 18120 -30906 -24000 6503 90963 77190 30046 -25763 39404 105430
13360 105430 109212 113367 32094 -22830 -35575 -34194 36044 40794 -21381 -85174 -77636 -6038
13348 -6038 30437 32168 76729 50663 6586 -60868 -52378 -36283 -46851 -78211 -52939 -12116
13336 -12116 -11245 42242 33019 59184 125626 141705 127368 99876 62473 9405 -43265 -54024
13324 -54024 -19687 -49377 -84111 -64446 23586 30957 34178 12782 38402 39715 51910 47097
13312 47097 48375 80859 20403 21552 65157 50306 52267 7718 14347 49714 62590 67379 90486
13299I0486k5238j6096q516Q14K2016P6502M9756j4614j1665n8371o3407K7078
13287F8745J3775J9315m1416n8891p8332j7204R452P9932M3366j9778P805k1829
13275D940K48Q8761K2251m4573l8649N129l0006r187M22L2644m5402j8491N788
13262b6125j4611N6802M9453Q325J4461J5122K2992l706p4349K012J9324l9252
13250C0448K4517k614K9854j5300m5542o916K9455l1712k2682J9896k9357o621
13238b6574K6206J6528m2532k4281r86M4751M3416J0332K0655m4212k6246k4717
13226b7660J4309O034p719K6041N4666k3188Q672M5852M3137L9378o1698r3947
13214B3877m2864k8684K2856M651l02J1080L510q230K5907N686L876k5205J8882
$$ plain form
13299 90486 65248 49152 40636 41450 63466 139968 189724 175110 163445 105074 41667 68745
13287 68745 82520 101835 60419 1528 -76804 -94008 -84556 -4624 38742 18964 26769 4940
13275 4940 5188 93949 116200 71627 32978 38107 8101 -1086 -664 31980 -13422 -31913 -26125
13262 -26125 -40736 16066 65519 73844 88305 103427 126419 122713 48364 50376 69700 30448
13250 30448 54965 52351 82205 66905 21363 14447 43902 12190 -10492 9404 -19953 -26574
13238 -26574 -368 16160 -26372 -50653 -51639 -6888 36528 46860 67515 23303 -2943 -27660
13226 -27660 -13351 -7317 -15036 11005 65671 42483 51155 97007 140144 179522 117824 23877
13214 23877 -18987 -47671 -24815 -20164 -20466 -9386 -5876 -14106 11801 17487 21363 -3842 15040
13201A5040o9748j7323K4195N2966L6122J941k498N371L764o0709k2633O727M4322
13188A7537N5110J3555N764N855L4403r718j4865q158n9117l8600N8743J5124
13176G5633l9621n7147L0900M8284k3886o0147L1364Q4237l722Q01n5623l9833
13164h760N076o0021o8998r576L8247J08355Q4108N0591J0196o2321k2605M1357
13152A05649M6608n2891j3858K42j053j1427n0865m3074L944L1732n9548K7599
13140a6942j3709K1708q374j4779M7620K9615k9721l2812N8754M2988p1884p3407
13128f0943l7521K9130j0260J6604J0559j2349r6790K3436R7158K2253L771O5008
13116E0056K3919o8540j06263L0976J2887j6453L9792O7244M9899k1388k2773
$$ plain form
13201 15040 -54708 -72031 -47836 5130 41252 43193 40695 46066 49830 -10879 -33512 -26785 17537
13188 17537 72647 86202 91966 97821 132224 122506 107641 99483 40366 1766 60509 75633
13176 75633 36012 -21135 9765 58049 34163 -25984 5380 89617 85895 86696 31073 -8760
13164 -8760 -3684 -63705 -132703 -142279 -104032 4323 88431 139022 149218 86897 64292 105649
13152 105649 152257 99366 85508 85750 84697 73270 22405 -20669 -16725 15007 -44541 -16942
13140 -16942 -30651 -8943 -17317 -32096 15524 45139 15418 -17394 41360 84348 12464 -60943
13128 -60943 -98464 -69334 -79594 -62990 -52431 -64780 -161570 -138134 -40976 -18723 -14952 50056
13116 50056 73975 5435 -100828 -69852 -56965 -73418 -33626 33618 83517 62129 39356
13105C9356k099P677l0579M6087N5705J6074J2793o9819o0919j0459K8847L361
13093C6025l4311J3849J0150K3J4681k073m854K136k1000l8555o167M4336k3434
13080i194K2365K7482k580L0003Q0k1297j9198R725J1626J9490K7494o3850l8542
13067f396L7649j6272n4501K0612O849K6852k6145M2760M5573p1111m0565P6217
13055D1522k4633P779R031p4088M1486L3646k385j2746J3935L7128M1199J4137
13043A26011p113O773k1997l0378j2467p552J5437o996k6312j7119k5338m1713
13031d8764J7530L0399l0180n9144P839N5936M2073N5033k7229J6211l9210L6301
13019E6795K0215j8133P441M355K1029l7874n2660j6360J2973Q1936l1298j4593
$$ plain form
13105 39356 37257 44934 14355 60442 116147 132221 145014 75195 14276 3817 32664 36025
13093 36025 1714 15563 25713 25736 40417 38344 33490 35626 14626 -23929 -30096 14240 -9194
13080 -9194 13171 40653 38073 68076 68156 46859 27661 37386 49012 68502 95996 32146 -6396
13067 -6396 31253 14981 -39520 -18908 -12059 14793 -11352 31408 76981 5870 -34695 41522
13055 41522 16889 24668 33699 -40389 1097 34743 32358 19612 33547 70675 111874 126011
13043 126011 118898 125671 103674 73296 60829 53277 68714 61718 35406 18287 -7051 -48764
13031 -48764 -31234 -835 -31015 -90159 -82320 -26384 15689 70722 43493 59704 20494 56795
13019 56795 77010 58877 66318 70673 91702 53828 1168 -15192 -2219 79717 48419 33826
13007C3826m5969j2596N541m1355j8926N5608L1178m7238J7300M6902L6040o898
12995E3413n3751l0016M4086L9300M979O3354J0547n2192L4882K0552l3769r7214
12983D171p404P0546O523n7314M095J3205j8310m842L4099J1412J7494m5922j3345
12970A4408J4684k7185o390M7365J2389n256j3362j7779Q877j7799o196L755k5308
12957a7797M758K624j0162k1980j8325J0777j0545L2342J1324K6722N4743L219
12945F7700o9945k8604k2573j1109J0413L4902P6605O5554p2139r3527k5415J0085
12933e8053N5667M4578j1745k9060J8335k3512L3346P6153N5136n3441o6533j5388
12921B5483j4438l6698j49P383J9416K7455j4288M9397M3946K0221k0675m2319
$$ plain form
13007 33826 -12143 -24739 -19198 -60553 -79479 -23871 7307 -39931 -22631 24271 60311 53413
12995 53413 -338 -30354 13732 53032 58011 121365 131912 79720 114602 135154 101385 4171
12983 4171 -3233 67313 73836 16522 20617 33822 15512 10670 44769 56181 73675 27753 14408
12970 14408 29092 1907 -4483 42882 55271 50015 36653 18874 27751 9952 3756 7511 -17797
12957 -17797 -13039 -10415 -20577 -42557 -60882 -50105 -60650 -28308 -16984 9738 64481 67700
12945 67700 -2245 -30849 -53422 -64531 -54118 -19216 57389 122943 50804 -42723 -68138 -58053
12933 -58053 -2386 42192 30447 1387 19722 -3790 29556 105709 160845 107404 40871 25483
12921 25483 11045 -25653 -25802 -18419 997 28452 14164 63561 107507 127728 107053 64734
12909F4734j3915k0222K5832j6648q3530l0937J9521L2809N2623J4875l5784n0373
12897d1015K0056k4082N187P9048J6864J6508p001p538J2142p908k2387P4050
12885A13924q838k5601p076m3990K0969p524k0745N925O4280L0114k10m4538m291
12872G2399j104n9766j5777p29K3058J4571Q5021M7736p4113l5575M8337k9268
12860G4790k5983J750Q178l3239m9235q009j1095R8465L4572j6821k864L1665
12848A02174q708j3545k9276o5791m6993K2431L6191m6685L2317N0296m5395Q6794
12836G3810M4856J4362l3564m4852M7138M3087m2417k5694l2256m6452j4419k0521
12824c6922K380N922m147j0594P7685K1677J6791n5317n2208j0100N2070J9223
$$ plain form
12909 64734 50819 30597 56429 39781 -43749 -74686 -55165 -22356 30267 45142 9358 -41015
12897 -41015 -20959 -45041 -39854 39194 56058 72566 65565 58027 70169 62261 39874 113924
12885 113924 105086 79485 72409 28419 49388 41864 21119 27044 91324 121438 121228 76690 72399
12872 72399 71295 11529 -4248 -4977 18081 32652 117673 165409 91296 55721 104058 74790
12860 74790 48807 50557 58735 25496 -23739 -31748 -42843 55622 90194 73373 70509 102174
12848 102174 93466 79921 50645 -15146 -62139 -39708 -3517 -50202 -17885 32411 -12984 73810
12836 73810 118666 133028 99464 54612 101750 144837 102420 76726 44470 -1982 -16401 -36922
12824 -36922 -34542 -28620 -32767 -43361 34324 56001 72792 17475 -34733 -44833 7237 26460
12812B6460Q263J5989L5690m3025m5069R1872M9213P732K6057r382j44735l5766
12800a6701N6703J2901J02664L732m0960l0693k4099k4687J4004k5753l9424O149
12788f164k6905j5641O6939L4075O9830Q602Q224l9519k8660p1555Q209j6094
12776h659J7265L9951K5293M4656L8144j6360l5107k8952J0578j2629K7078L228
12764A04486m949k5839k2534J9351J7551k461K3572k7269j744L0234q5603o1235
12752c6440J726L7202M5032R451m892m916L3978M0378l181L377m0453N291K1471
12739A08024k5730o528m280J6981m9346o5598J9885J7261J1955l0512M0027N4889
12727H7028k4277n9604m8617N3004L4256P6957J6677K2202J5857o3316k2875O120
$$ plain form
12812 26460 34723 50712 86402 43377 -1692 90180 139393 147125 173182 163800 19065 -16701
12800 -16701 40002 52903 155567 159299 118339 87646 63547 38860 52864 27111 -12313 -6164
12788 -6164 -33069 -48710 18229 52304 122134 130736 138960 99441 70781 -774 7435 -8659
12776 -8659 8606 48557 73850 118506 156650 140290 105183 76231 86809 74180 101258 104486
12764 104486 99537 73698 51164 70515 88066 85605 109177 81908 80164 110398 24795 -36440
12752 -36440 -34714 2488 47520 56971 52079 47163 81141 121519 118338 121715 81262 86553 108024
12739 108024 82294 75766 71486 88467 39121 -26477 -6592 10669 22624 -7888 32139 87028
12727 87028 62751 3147 -45470 7534 41790 118747 135424 157626 173483 110167 87292 93412
12715I3412j4850j3137K3373m4520J7620M8701J2470J3367J5220k812k3145K4619
12703A50318k8555L8704M5188J6811k9498o8411n6251N792K2170L607M0290l7396
12691A02769n9168J5065J0073l4988L5950o992j9596M4882k268m604o2675n3054
12679c4606k8097J4392M9411J5105Q947K8729K9186p6525n9111K9550L356j0557
12667c0220M3681L1012N8175J2515L3711o457l3207J9359M675k3452K7015J4767
12655A51574o008l7049j2246O292o789n1855Q330L8323J0098o1750k6075J2077
12643B4922m8829l6565L6058J6922K4593L4241N8678K1258m3738m9185r2O408
12631D4671j06282K3395M3100M1244m098l7298R141K3222J9452K9964J6925L880
$$ plain form
12715 93412 78562 65425 88798 44278 61898 110599 123069 136436 151656 148844 125699 150318
12703 150318 121763 160467 205655 222466 192968 124557 68306 74098 96268 99875 140165 102769
12691 102769 43601 58666 68739 33751 69701 62709 43113 87995 85727 81123 18448 -34606
12679 -34606 -62703 -48311 1100 16205 25152 53881 83067 6542 -52569 -23019 -19663 -30220
12667 -30220 13461 44473 102648 115163 148874 142417 109210 128569 133244 109792 136807 151574
12655 151574 145566 108517 96271 102563 95774 43919 52249 90572 100670 38920 12845 24922
12643 24922 -23907 -60472 -24414 -7492 17101 51342 110020 131278 87540 38355 38263 44671
12631 44671 -61611 -38216 4884 46128 42030 4732 13873 37095 56547 86511 103436 107316
12619A07316o122l2826L9966M6929N8593k2762m3806j2114j9090J1429N703j6942
12607A16274j975K3214N8085k1078m1526k5456n425L4253l1522j8626k3806j2779
12595D9633P524M3448L0196j1259P355l8933j3162K0443N028j2725P821L4248
12583A29617P56k8341l015N591o276Q0680j9287m8638J53m2156J1856M0228J4578
12570A35746L3557j4763l127K6891L421j1789n2295L5744J269j6827J0941k0716
12558A28052p4027m5729m822R2297N4081K9387L302k6099j148o274O8041o846
12546B10215m4292r7788o2434N6599O4153j7334l5517J8158P134J4872k8974J0651
12534I5443K9534J5103M3831P0848l7438o6791p0160n1840Q985O6098N7569J4802
$$ plain form
12619 107316 101194 68368 108334 155263 213856 191094 147288 135174 116084 127513 133216 116274
12607 116274 114299 137513 195598 174520 132994 107538 102113 136366 104844 86218 62412 49633
12595 49633 57157 100605 130801 119542 126897 87964 74802 95245 100273 87548 95369 129617
12583 129617 130373 102032 99017 104608 98332 179012 159725 111087 111240 69084 80940 121168 135746
12570 135746 169303 154540 151413 178304 181725 169936 117641 153385 154654 137827 148768 128052
12558 128052 54025 8296 3474 95771 149852 179239 182541 156442 155294 149020 217061 210215
12546 210215 165923 68135 5701 62300 126453 109119 73602 91760 98894 113766 84792 95443
12534 95443 124977 140080 183911 254759 217321 150530 80370 28530 37515 103613 161182 175984
12522A75984L9418r076j5102K0381o541k5951j9943m3581p3755o652J8667N3416
12510A07265M4824n075R031k0093K4784q368L229k8558n6159J3333j9712o656
12498E7845L337r675M8717O1551n7351L3633o212k5412j9540k369O7078J19148
12486B70750J7725q4330j0965N1661m479p3334k9078M4689m699k890j8491n852
12474A50707N5920p467j6161K6730j5175l8267k443p404M7277m649j4856Q530
12462A82742k8925j2560L7149M6709N1292l8583k1319J9286K3067l8583m202j8850
12450A97223o8145q983M6662K653m5693o845L6733J633J0702l1057k7862N6581
12438A63602j1624m806M778J2590l7680k2144L1290J8225P4983J6361n4652n0201
$$ plain form
12522 175984 215402 206326 191224 211605 205064 179113 159170 115589 41834 35182 53849 107265
12510 107265 152089 147014 156045 135952 160736 152368 155597 127039 70880 84213 64501 57845
12498 57845 61182 51507 100224 161775 104424 138057 131845 106433 86893 84524 151602 270750
12486 270750 288475 204145 193180 244841 240362 167028 137950 182639 177940 175050 156559 150707
12474 150707 206627 199160 182999 209729 194554 156287 153844 146440 193717 189068 174212 182742
12462 182742 153817 141257 178406 225115 276407 237824 216505 235791 258858 220275 216073 197223
12450 197223 129078 120095 166757 169410 123717 116872 153605 155238 165940 134883 107021 163602
12438 163602 151978 147172 151950 164540 126860 104716 136006 154231 229214 245575 190923 140722
12426A40722P380l7083j569N0446O0074Q250n7052n8515j3112O0809L9935l7456
12414A62829q691K9085J6649O0533k4842p3479J182J08J3966L9015j7043l0577
12402A68735l1937K0730K5913L5702J3254k1291r181j5103J5655k4144o4374k322
12390A11637p767P8425L8729K159l618J0099j4279K008L5183L3208n2049n9489
12378A74246J9208L0981j9019Q890j3036l2576J157J7289j3284J953Q54j7351
12366A59312r704Q1005J7257K9677j4490p909k2883q585k2069O7066L3602L4177
12354C36456m0786j3661j5158k2054J5241M505p4286L8601R4058m039m0612N295
12342B83560J0774m3605l0294M7351o508o7390J855J1693j771p847k155N8920
$$ plain form
12426 140722 148102 111019 109450 159896 219970 228220 171168 112653 99541 160350 200285 162829
12414 162829 154138 183223 199872 260405 235563 162084 163266 163374 177340 216355 199312 168735
12402 168735 136798 157528 183441 219143 232397 211106 201925 186822 202477 178333 113959 111637
12390 111637 103870 182295 221024 223183 219565 229664 215385 217393 252576 285784 233735 174246
12378 174246 193454 224435 205416 214306 201270 168694 169851 187140 173856 175809 176663 159312
12366 159312 149608 230613 247870 277547 263057 255148 232265 223680 201611 268677 302279 336456
12354 336456 295670 282009 266851 244797 260038 264543 190257 228858 322916 318877 278265 283560
12342 283560 294334 250729 220435 267786 261278 193888 195743 207436 205665 197818 195663 254583
12330B54583Q609j647k0958m073R020K0641K4m1472l8184J35L9862R2163L0636
12317C49339m0328m0304p810m3380M9044k1609K571q003K8137k169K6210L3501
12305C25199J410M4754M4585k0205n9036m1974K6304l9185j3706J7991J9550k6496
12293B79191l3414K0882m39p327l8269N3605J12481L2177l2650k0016K2186l8843
12281C49564j697N8374O2920n6204m8176q09j0061m7708n5760L3750O0073q216
12269C36050Q468J0447K1422L2133m3054q3718n137l9679O541N5649L4656L927
12257C37705J3322N371N874j2728K4339L6971J7432k8838m0487K7867j543Q94
12245C86179M4314K0904l763j7719j5351r398K7388Q3723p472m6195J7658J7057
$$ plain form
12330 254583 263192 261545 240587 236514 245534 266175 266199 224727 186543 186678 226540 318703 349339
12317 349339 309011 268707 260897 217517 266561 244952 247523 239520 267657 265488 291698 325199
12305 325199 326609 371363 415948 395743 336707 294733 321037 281852 268146 286137 305687 279191
12293 279191 245777 266659 266220 258893 220624 274229 386710 418887 386237 366221 388407 349564
12281 349564 347867 406241 469161 412957 364781 363972 353911 306203 250443 284193 344266 336050
12269 336050 344518 354965 376387 408520 365466 281748 276611 236932 243473 299122 333778 337705
12257 337705 351027 356398 362272 349544 373883 410854 428286 399448 358961 386828 385285 386179
12245 386179 430493 451397 447634 429915 414564 405166 432554 516277 508805 462610 480268 497325
12233D97325o963n0317q5592n8305M7975R4234O4058K5835K330j1393k1206l2915
12221D65066L40M0344m3623l4359j6154o282O5879l2738n192O7323K5732k9564
12209D96772o2705M401J2979R071J6540Q5122J7156l1207r529n6954n9612k5707
12197C96327L7589R5243J4032O536m2331m998j4230K87N6491o372p840M7294L7889
12184F15917k1150K514k7537n0712l7226O0731K1092R991l7256n033O0960P536
12172E99827L8729j1575p4894l9639L6273L8317J3236n266M402K0246N1066J1230
12160F81952k9003J0357J9664M3655L191J4473J4438J4992l2762p0584n6569l768
12148F10036O1584K784J124M8351N4403L5448J1718N822j5800R439K845k2524
$$ plain form
12233 497325 490362 440045 354453 296148 344123 438357 502415 528250 530580 519187 497981 465066
12221 465066 465406 505750 462127 427768 411614 405332 471211 438473 433281 500604 526336 496772
12209 496772 434067 438468 451447 460518 477058 562180 579336 548129 538600 481646 422034 396327
12197 396327 433916 529159 543191 549727 507396 502398 488168 488455 544946 538574 530734 578028 615917
12184 615917 594767 597281 569744 519032 481806 542537 563629 573620 536364 531331 592291 599827
12172 599827 638556 626981 552087 512448 548721 587038 600274 595008 599410 619656 670722 681952
12160 681952 652949 663306 682970 726625 729816 744289 758727 773719 740957 670373 613804 610036
12148 610036 671620 674404 675528 723879 778282 813730 825448 831270 815470 824909 827754 805230
12136H05230M3028J2858k468j415j063K2492P0913K5419p586l98l6888k5293L6446
12123I41275N8790k891n3077K9673J2364O638J9200p21J7903j2585m6237M1215
12111A011547O6541L9015q906k7685J5632M6210n7645n0375k0395j1829P6376
12100A078486K312j9592N0148N1604N519l0768k6457j0313P0049M4930K2248L0586
12088A268752N6935L5934j4946l6017m4793Q2087L1188R628m624r891k44O8306
12076A442315J51o0363m6943L4465J5129O6644J04987N0735n4163k3485P6852
12065A606324J19414K7193l3588K277J6434P4188j5208m75Q8425M5106j9782p0998
12053A839310L2978R7833J6198J7039L7067M9375L3528K0740o5000m019O5748
$$ plain form
12136 805230 848258 861116 858648 857233 856170 878662 949575 974994 967408 967010 930122 904829 941275
12123 941275 1000065 997174 944097 973770 986134 992772 1011972 1011251 1029154 1016569 970332 1011547
12111 1011547 1078088 1117103 1108197 1080512 1096144 1142354 1084709 1034334 1013939 1002110 1078486
12100 1078486 1080798 1061206 1111354 1162958 1168477 1137709 1111252 1100939 1170988 1215918 1238166 1268752
12088 1268752 1325687 1361621 1346675 1310658 1265865 1347952 1379140 1388768 1384144 1374253 1374009 1442315
12076 1442315 1442466 1382103 1335160 1369625 1384754 1451398 1556385 1607120 1552957 1529472 1606324
12065 1606324 1725738 1752931 1719343 1721620 1738054 1812242 1797034 1796559 1884984 1930090 1910308 1839310
12053 1839310 1872288 1970121 1986319 2003358 2040425 2089800 2123328 2144068 2079068 2075049 2140797
12042B140797P1269O0461L4675p0811j5481l0921Q414M9835J19163N7077k3813
12031B400665p663K3165O2495O4741J07484N2880m2858L8345L2122Q4979K4491
12020B840846Q94K361O2355J7470K5121Q5008Q9229J04804K7350L2450J07821
12009C395709L2603N0109M1780P4231P0500O6946j0534N0778P8513K2999O5654
11998C939288L3221Q6726J15371L3901R2170P9139J09280L9450J15175O4009K8905
11987D736635J05475O5601J23896J01022N9616R7741J05289J41201J29358J8911
11977E684745N1257R6464J07989J16450O4497O2884J35090J69058J66199J47486
11967F802119Q1763J10197J23568J31532J41224P9626J36447J25025J28532J17937
$$ plain form
12042 2140797 2212066 2272527 2307202 2236391 2220910 2189989 2198403 2248238 2367401 2424478 2400665
12031 2400665 2393002 2416167 2478662 2543403 2650887 2703767 2660909 2699254 2731376 2816355 2840846
12020 2840846 2841740 2844101 2906456 2923926 2949047 3034055 3123284 3228088 3255438 3287888 3395709
12009 3395709 3428312 3478421 3520201 3594432 3664932 3731878 3721344 3772122 3850635 3873634 3939288
11998 3939288 3972509 4059235 4174606 4208507 4300677 4379816 4489096 4528546 4643721 4707730 4736635
11987 4736635 4842110 4907711 5031607 5132629 5192245 5289986 5395275 5536476 5665834 5684745
11977 5684745 5736002 5832466 5940455 6056905 6121402 6184286 6319376 6488434 6654633 6802119
11967 6802119 6883882 6994079 7117647 7249179 7390403 7470029 7606476 7731501 7860033 7977970
11957G977970K03286J67041J27045K00858J39447J22586J08178J41532J51002
11948I338945J46702J34042J12105J33173J02435J32883J11943J33456J18522
11939A0464206J48349J37342J22123J11276J61968J03750P9941J65201J09586
11930A1603742J12985J12460Q8682P2805R7341N6322M8330Q916P8923Q8927M755
11919A2374188n534P432R992j0366j601L6317m2056o3626n4929K4876p0125l0458
11907A2174110n1115r0922j21758j03555q3728j09201j00009j13522j56571j36614
11897A1107115q2863j35149j20613j74356j33873j34110j66869j08586k12352
11888I838344j03103q2139j79331j53917j41967j43370j27135j10753j46042j44101
$$ plain form
11957 7977970 8181256 8348297 8475342 8676200 8815647 8938233 9046411 9187943 9338945
11948 9338945 9485647 9619689 9731794 9864967 9967402 10100285 10212228 10345684 10464206
11939 10464206 10612555 10749897 10872020 10983296 11145264 11249014 11328955 11494156 11603742
11930 11603742 11716727 11829187 11917869 11990674 12088015 12144337 12192667 12201583 12280506 12369433 12374188
11919 12374188 12368654 12376086 12386078 12375712 12374111 12410428 12368372 12304746 12249817 12274693 12204568 12174110
11907 12174110 12122995 12032073 11910315 11806760 11723032 11613831 11513822 11400300 11243729 11107115
11897 11107115 11024252 10889103 10768490 10594134 10460261 10326151 10159282 10050696 9838344
11888 9838344 9735241 9653102 9473771 9319854 9177887 9034517 8907382 8796629 8650587 8506486
11878H506486j56828p2860q7670j43494j66698j55723j58783j36378j86187j45989
11868G095876j41116j40279j77031r6408k4452o9411q2069j66765j30203p5567
11858E992575j09639r4022j12932q8870o4609r5319p4757m6446j35292j18059
11848E052630q7625n9105q7054p2641p7546j28787l7044p4810p2873j08456r2582
11837D154107r1053q5888r5342q3812k5878l8873k8087m221n8209j00986l6206
11826C505552l5377q7906K493Q298n1563m6144k5346j06551j22535o0220r1931
11815B888770l451O797r6845r2280n9334o5860k5994L699m2683O461L2236k6041
11803B525475o2174l9302J607l9159r6241r8610K1499J1206m6148j4774n2787
$$ plain form
11878 8506486 8349658 8276798 8189128 8045634 7878936 7723213 7564430 7428052 7241865 7095876
11868 7095876 6954760 6814481 6637450 6541042 6516590 6447179 6365110 6198345 6068142 5992575
11858 5992575 5882936 5788914 5675982 5587112 5522503 5427184 5352427 5305981 5170689 5052630
11848 5052630 4965005 4905900 4818846 4746205 4668659 4539872 4502828 4428018 4355145 4246689 4154107
11837 4154107 4063054 3977166 3881824 3798012 3772134 3733261 3705174 3700953 3642744 3541758 3505552
11826 3505552 3470175 3382269 3384762 3393060 3341497 3295353 3270007 3163456 3040921 2980701 2888770
11815 2888770 2885319 2892116 2795271 2702991 2643657 2577797 2551803 2555502 2512819 2519280 2551516 2525475
11803 2525475 2463301 2423999 2425606 2386447 2290206 2191596 2213095 2224301 2178153 2163379 2110592
11792B110592o7592o640K2551k1871m3410R493n441j00574o5732J3050l5365k4509
11780A784552m7459m1584j5115J833j8760l1892J0984k6804l1422N4565m774n8002
11768A576122p8192r099K715k357N0583n7151o0724K785L1873l193j1413J1080
11756A453029l5372p9360j0769R365K3122j5108n6376m3146j066k7468l4838k0290
11744A161723P603j5713K2229L78l1189Q058L7001j5915K2042L1771J0912p1677
11732A167223o2537o1050l5032j744K1041k2122L8480P32K5876k0934o0972j8223
11720I70738j3390o408Q1939P2814m0046m0684N5151l1891n6170j9049l3410j3459
11708I26135L6418P858m802k1490m4556p060k5565J2527K5403P595m6786j4387
$$ plain form
11792 2110592 2043000 2036360 2058911 2037040 1993630 2003123 1997682 1897108 1831376 1844426 1809061 1784552
11780 1784552 1737093 1695509 1680394 1682227 1663467 1631575 1642559 1615755 1584333 1638898 1634124 1576122
11768 1576122 1497930 1488831 1491546 1489189 1539772 1482621 1421897 1424682 1456555 1453362 1441949 1453029
11756 1453029 1417657 1338297 1327528 1336893 1360015 1344907 1288531 1245385 1244319 1216851 1182013 1161723
11744 1161723 1169326 1153613 1175842 1176220 1145031 1153089 1190090 1174175 1196217 1227988 1238900 1167223
11732 1167223 1104686 1043636 1008604 1006860 1027901 1005779 1044259 1044991 1070867 1049933 988961 970738
11720 970738 957348 950940 1032879 1105693 1065647 1024963 1080114 1048223 992053 973004 939594 926135
11708 926135 962553 970411 965609 944119 899563 892503 866938 879465 904868 912463 865677 851290
11696H51290M3399K3286L3537O794j121m5746p484l5925P2248J05173K5608n6766
11684A014293o9019j815Q280k6195j1610o8116n4631O8042J6236j6457p5259j1625
11672G72124o181l0049J9482r187P660J6064Q02l6451p200N546m4800N935L5467
11659G29212K5144J2511l0032o1786j4164k2340m1488n5710P168L6985L7832M8816
11647F72148M8313m6172n4114K0745J7351k1039k1017L876m0329J6830O1071K3857
11635F81520q6853q8213l9251m3482K7124L4815k4693k4309k2009L9893P2732
11624E27274n5756o4312j9300N7936o235o2059J8412J9942M287j135l4703J4185
11612C98536j0652R478K7350J111k0525j0135L4042R710K3929L635j03128l6614
$$ plain form
11696 851290 894689 917975 951512 958306 957185 911439 903955 868030 940278 1045451 1071059 1014293
11684 1014293 945274 943459 951739 925544 913934 845818 791187 859229 875465 859008 783749 772124
11672 772124 765943 735894 755376 746189 753849 769913 770715 734264 727064 732610 687810 693745 729212
11659 729212 754356 766867 736835 675049 660885 638545 597057 541347 548515 585500 623332 672148
11647 672148 720461 674289 620175 640920 658271 637232 616215 620091 579762 596592 657663 681520
11635 681520 594667 506454 467203 423721 450845 485660 460967 436658 414649 454542 527274
11624 527274 471518 407206 387906 445842 439607 377548 395960 415902 420189 419054 384351 398536
11612 398536 387884 397362 424712 425823 405298 395163 429205 438915 462844 466479 363351 326737
11600C26737r112K765k522j1728j04246K7592L0252M411P7761k7745M435j438
11588C17162o6351n01P2993J0607l1598o910M1859m0750l4053p225R8402m48J5394
11575C68581l5878m0409M7131L7393M7819L9406P782k8735l5837k7678k6210n6261
11563B97104j9634l3760j4085O63N4602L1685M9891J5547j5162k5228j3217l2292
11551B96114j1969J8677L0883k33l6666J4132K1477p031m0646j638J0119J3381
11539C06600j4159l0743j8714j7139m106Q0415P0255M434J0589K884j4279m3469
11527C32568p6810l1126j3497L7638J6093k1254J0278J5483P61o6833J7012j3254
11515B07059j0256l231M1813M2268L121n0249n2194L2674M6541K166k5199k9142
$$ plain form
11600 326737 317625 320390 317868 306140 201894 229486 259738 264149 341910 314165 318600 317162
11588 317162 250811 250310 323303 333910 302312 295402 337261 296511 262458 255233 353635 353187 368581
11575 368581 332703 292294 339425 376818 424637 464043 471825 443090 407253 379575 353365 297104
11563 297104 277470 243710 229625 230288 284890 316575 366466 382013 366851 341623 328406 296114
11551 296114 284145 302822 333705 333472 296806 310938 332415 325384 284738 283100 293219 306600
11539 306600 292441 261698 242984 225845 221739 302154 372409 376843 387432 390316 376037 332568
11527 332568 255758 224632 211135 248773 264866 243612 253890 269373 270134 203301 220313 207059
11515 207059 196803 193572 235385 277653 280774 230525 178331 211005 257546 259712 234513 205371
11503B05371k4716n062q130l4591o0314K2765N0690N9233N6873j1631k8442n4302
11491A67744j4000N9927L0990m0678l1733j2824J7531L3813k2341l2037L3993
11480A90385R7849l1889p5072j1428m6930J0222K8373k5002L680Q9159K4560k9932
11468B23975p7656j0763O3195M5715J9869J3434j941k4890p93J1016p8905l1512
11456A50744j2744N2331L7083L326k5059k1315N5581O873l227j670p848m9161
11444A84914L4174N2827o157L1558j813l1335m8880k5021j2385P5583j9219k7893
11432B06353K855O841l0272N0843N5124M2668r6139n0846j2824P098N1191k5719
11420B07173n3727m1858P67M0059K8199J0467l864j5041n4110l4803R96p667O3504
$$ plain form
11503 205371 180655 175593 167463 132872 72558 95323 146013 205246 262119 250488 222046 167744
11491 167744 153744 213671 244661 203983 172250 159426 176957 210770 188429 156392 190385
11480 190385 288234 256345 181273 169845 122915 133137 161510 136508 140188 229347 253907 223975
11468 223975 146319 135556 198751 244466 264335 277769 275828 250938 250145 261161 182256 150744
11456 150744 138000 190331 227414 230740 205681 184366 239947 246820 243593 241923 234075 184914
11444 184914 219088 271915 265758 297316 295503 264168 215288 190267 177882 253465 234246 206353
11432 206353 209208 216049 185777 236620 291744 334412 238273 187427 174603 181701 232892 207173
11420 207173 153446 111588 112355 152414 180613 191080 187216 172175 118065 83262 84258 76591 140095
11407A40095K6740n1701M0923L7597K2759m0766M752k2967m2359p975n335J5588
11395A17351r922L7652M5946n3204J1631l4347q150N4354J5746q3629l8843P2043
11383A26628N5691J5964L7194n7995l714M520j8210j0527j979K0222L6000j2912
11371A90882m5969J3998o1564j7171J6197K3159M0843P3577r623k1468j3712l0107
11359A59042J3024O1130n7286p3733m041q264L6168j0260j0865k4882K9068M6550
11347A55651M77j6570m7868k6727M1360K3253J0733J8208m65k5471j3999j6270
11335A02312N8056K8181p942m7239q2340J0414O3160L73k9384m1692j2569P7090
11323A18420M0097r099j1143R460l1722K019k4729N1909K8176M005N535l3039
$$ plain form
11407 140095 166835 115134 156057 193654 216413 175647 180399 157432 115073 107098 101763 117351
11395 117351 107429 145081 191027 137823 149454 115107 106957 161311 177057 93428 54585 126628
11383 126628 182319 198283 235477 177482 173768 178288 160078 149551 147572 167794 203794 190882
11371 190882 144913 158911 97347 80176 96373 119532 160375 233952 224329 202861 189149 159042
11359 159042 172066 233196 175910 102177 98136 89872 126040 115780 104915 80033 109101 155651
11347 155651 156128 139558 91690 64963 106323 129576 140309 158517 158052 132581 118582 102312
11335 102312 160368 188549 180607 133368 51028 61442 124602 124975 95591 53899 41330 118420
11323 118420 158517 149418 138275 147735 116013 118032 93303 145212 173388 177393 182928 149889
11311A49889J0890j9259L8551k7617o4854q5056P6181R6322J8021J5774l7916
11300A70926m175K860j5354l159J1236n7055P397L2986P104j1808o2007m8921
11288C0030l8249k0877K5645M3986O5891N6674k1978j9240j8919J0234K9262k9962
11276A12497n1425J6194L3881m3894o6978k189Q4897j9411J7546R3108K0910m2111
11264A53025J7672K7601l4638m1742R915N6861K1675p1673l4294K8917L0401L3064
11252A96784N499j7710M0491l8816K8117M4449j6083l8018k4812m4035K4305j3851
11240A46320l7174l149J8488k2712n5567p1900M2507Q5226M1062n8764j6348M4788
11228A12777j140K6373K8653m175K0276M740k5008K8047K4028o5566o2769O02
$$ plain form
11311 149889 160779 141520 180071 152454 87600 2544 78725 175047 193068 208842 170926
11300 170926 166751 169611 154257 151098 162334 105279 112676 145662 152766 140958 78951 30030
11288 30030 -8219 -29096 -3451 40535 106426 163100 141122 121882 102963 113197 142459 112497
11276 112497 61072 77266 111147 67253 275 -1914 82983 63572 81118 174226 195136 153025
11264 153025 170697 198298 163660 121918 131833 188694 210369 138696 104402 133319 163720 196784
11252 196784 202283 184573 225064 186248 214365 258814 242731 204713 179901 135866 160171 146320
11240 146320 109146 105997 124485 101773 46206 -25694 16813 102039 143101 84337 67989 112777
11228 112777 111637 138010 166663 162488 182764 187504 162496 190543 214571 149005 86236 86838
11216H6838M2728k8280j7122R5372M2210O294m1157k7958k0316l249m6553j0674
11204G8133O9417l1071j6260k5437l074K6817L7043J638n7233R471k551L446l1126
11191E9213j589K1908l9661J6772M4542N4884L088K324N7719L2592p188p8629
11179A65975l8262J5931j201o2080j0454O4259k9216l9240k8818K0834m9233L1825
11167D0320O9588m067l6200N0873L3151m7657k5477K9292O1632j6346N2770J4536
11155B22415l771l3326q774J1829L118p8580M4115M5339Q889m4997J9405J608
11143A87270m0983m8473M869j682l0217K23k225L7502N6888n2539j3212O8319
11131A65740J7889m3210j7763j4775L4663M3833J1313j2137l5735J4253J2975
$$ plain form
11216 86838 129566 101286 84164 179536 221746 228040 186883 158925 138609 135360 88807 78133
11204 78133 147550 116479 100219 74782 71708 98525 135568 137206 79973 89444 86893 90339 59213
11191 59213 57624 79532 39871 56643 101185 156069 159157 161481 219200 251792 244604 165975
11179 165975 127713 143644 142443 80363 69909 134168 104952 65712 36894 57728 8495 40320
11167 40320 109908 105841 69641 120514 153665 106008 80531 109823 171455 155109 207879 222415
11155 222415 218644 185318 176544 188373 191491 112911 157026 202365 211254 166257 185662 187270
11143 187270 146287 97814 102683 101001 70784 71007 68782 106284 163172 110633 97421 165740
11131 165740 183629 140419 122656 107881 142544 186377 197690 185553 149818 164071 177046
11120A77046j9033m3785r369j797L3604K2689M28l7089j4739j9596Q91k4398J3783
11107G8635N2662J9761q671k0155K3148P4331L3698j6818m5702r2411j17500m907
11095b3929P2286O1164L0998J3061J5435j02008l7062J16427K6209j082K1638
11084A93137m8151l8681K0447J2356m0833k9186J5466J6174m8002k707K5931P995
11072H3946L1681L8205N109n7199n3712M026L9137k2048l807k5577K7845R5858
11060A63464J8773n049j0863m8867k6014l999N9769M7105J4626L0648k4005k0444
11048A95144L6479Q5095L8474m0831j7517M5439N080O806j9125K4917M4756L9813
11036D44530N2900P334k4914l5547N1036O1788l5506p9653l291j6608L1554j8165
$$ plain form
11120 177046 158013 114228 104859 103062 136666 159355 159783 122694 107955 88359 89250 64852 78635
11107 78635 131297 151058 142387 122232 145380 219711 253409 236591 190889 98478 -19022 -23929
11095 -23929 48357 109521 140519 153580 169015 67007 29945 146372 172581 171499 193137
11084 193137 144986 106305 126752 139108 98275 69089 84555 100729 52727 50020 75951 83946
11072 83946 115627 153832 158941 101742 48030 52056 91193 69145 65338 39761 67606 163464
11060 163464 182237 177188 166325 117458 91444 87445 147214 194319 208945 239593 215588 195144
11048 195144 231623 316718 355192 314361 296844 342283 347363 354169 335044 359961 404717 444530
11036 444530 497430 504764 479850 444303 495339 557127 521621 441968 438677 422069 453623 435458
11024D35458N7114Q1417O1228J24666L9908q374j5160m3026j10898m0733l1994
11013E49606q4261R660J4519r523P4487M0513j9568j15867j9301J5244j2339J2729
11001D55899O963P9167K4196P497j9766l7604r410k6300k6861m1552n0380m139
10989C57710M3256N3288l5495L5224O0999Q2212O3454P8218J05755K05152K21165
10978A270938M13263M06412K64307J96107N4516p626j9190J9911L1675o2437j08119
10967B459757k30250l43139l89786l53733k29380q9966j27262j49639q5757l4874
10957D25971r001j0596n8694k0705k8046m886R387J0938O970N0491M7427o1164
10945C58092m0062o4057m583k515L5042j1386n6974l5316L612L1763K7932L214
$$ plain form
11024 435458 492572 573989 635217 759883 799791 791417 776257 733231 622333 581600 549606
11013 549606 465345 475005 489524 480001 554488 595001 575433 459566 440265 455509 443170 455899
11001 455899 462862 542029 566225 573722 553956 516352 506942 480642 453781 412229 361849 357710
10989 357710 400966 454254 418759 453983 514982 597194 660648 738866 844621 1049773 1270938
10978 1270938 1684201 2090613 2354920 2551027 2605543 2597917 2578727 2598638 2630313 2567876 2459757
10967 2459757 2229507 1886368 1496582 1142849 913469 823503 696241 546602 460845 425971
10957 425971 416970 406374 347680 326975 298929 294043 303430 314368 321338 371829 419256 358092
10945 358092 318030 253973 249390 246875 281917 270531 213557 178241 181853 213616 241548 244762
10933B44762K590k9171M1801K6329m1416Q22L268l7609J1051n048J266M0573K1891
10920B81109J7934K8958k1363l5944m661o6898l593M304K1523l1627l9506J4781
10908A65017K2833n478l0039o8473J3659M4567M8008J3772N701j7671Q089L4913
10896B34898j1864N0167L434k0966K7095j7836J5330r918j3602L2425J4761q2962
10884B20962m2867j373M8890p721m718M6329J683P7531M0154m6908k7809l9735
10872B64418J4177K7052J5272J3531n301k86J8203N409L4897M5522k8787k9158
10860C74949n905M0696o78j00M727l7332J0094L7703l8823q3417p6243L0186N1911
10847C07768L3821N3812J2294P0512k8110L9829J23751J06886K3762o2808l6944
$$ plain form
10933 244762 247352 218181 259982 286311 244895 245717 248985 211376 222427 217379 218645 259218 281109
10920 281109 299043 328001 306638 270694 266033 199135 195542 199846 221369 189742 150236 165017
10908 165017 187850 182372 152333 83860 97519 142086 190094 203866 209567 191896 199985 234898
10896 234898 223034 273201 276635 255669 282764 264928 280258 270340 256738 289163 303924 220962
10884 220962 178095 176722 225612 217891 213173 259502 261185 338716 378870 331962 304153 264418
10872 264418 278595 305647 320919 334450 329149 328863 347066 352475 387372 432894 404107 374949
10860 374949 369044 409740 409062 408962 413689 376357 386451 424154 385331 301914 225671 255857 307768
10847 307768 341589 395401 407695 478207 450097 489926 613677 720563 744325 681517 644573
10836F44573l8684j224j8257n8684j9450K0936J2805n028k7622K9266k7566K4360
10824E35425J6913L507p0913j9263L3120l5108n0902j3019k8954l5150L5840M7848
10812D19344k3002j9417Q455k8164R443m6819K6917N003m0367k0517N0619L5593
10800C77088l4407k9240K450O8416j2778l6447J532m3974j1010J0799L9406O9447
10788D01282q770n3966M843j8491n396n672m731Q3400M6657K6296K3262m3833
10776D44881j1475O9241M9269J5595j8504j2642m8332m5037p567N4757n1309q6213
10764C52664k8137P413K9019k6153N8712P5063L3841O2591M1645n7303j973J7367
10752E64749m171k7851k0602l3361N5011N6826K9209o4697k5764K706j0182k4873
$$ plain form
10836 644573 605889 604665 586408 527724 508274 529210 542015 536987 509365 538631 511065 535425
10824 535425 552338 555845 484932 465669 498789 463681 412779 399760 370806 335656 371496 419344
10812 419344 396342 376925 385380 357216 366659 319840 346757 351760 311393 290876 341495 377088
10800 377088 342681 313441 315891 384307 371529 335082 336614 292640 281630 292429 331835 401282
10788 401282 392512 338546 343389 324898 319502 313830 309099 392499 439156 465452 488714 444881
10776 444881 433406 502647 551916 567511 549007 536365 488033 442996 435429 490186 438877 352664
10764 352664 324527 331940 360959 334806 393518 468581 502422 565013 606658 549355 547382 564749
10752 564749 560578 532727 512125 478764 533775 590601 619810 555113 529349 532055 521873 497000
10740D97000q299k8879P4544N0267n675j653L3754K1932L8025j5151m6091j12469
10728D97305L19N3986K2144M1656P6553O6639J906m2971n2468J8354K7714k3787
10716F87350n5462J4378P8751q377K1142M3013J2670J1910l3227M3822L6029M0341
10704H92340P7290P2120J04268j249K6598M3653M6182J7600N1032J34400P1921
10693A536155o818l3282o2218K3880J2043n9369n5963o6085j2185M9382M7933
10682A373473n2533l7303j5824k6479k14o144O95j4902q743N1248L9404Q2659
10670A385337P0710Q0289K6900j9454j098K0354L5278L9026J04469L5208n6236
10659A720783M1910N9067o9466k9787j0909Q4704Q0936O6560J7581p7364O188
$$ plain form
10740 497000 488701 459822 534366 584633 578958 577305 611059 632991 671016 655865 609774 497305
10728 497305 497624 551610 573754 615410 691963 758602 760508 717537 665069 683423 711137 687350
10716 687350 631888 646266 725017 716640 737782 780795 793465 805375 772148 815970 851999 892340
10704 892340 969630 1041750 1146018 1144769 1171367 1215020 1261202 1278802 1329834 1464234 1536155
10693 1536155 1529337 1496055 1433837 1457717 1469760 1410391 1354428 1288343 1276158 1325540 1373473
10682 1373473 1320940 1283637 1267813 1241334 1241120 1234976 1235671 1220769 1212026 1263274 1302678 1385337
10670 1385337 1456047 1536336 1563236 1543782 1542684 1563038 1598316 1637342 1741811 1777019 1720783
10659 1720783 1762693 1821760 1752294 1722507 1711598 1796302 1877238 1943798 1961379 1884015 1890203
10648A890203P6976O7396L6209O5944N8849P6327J10863M8284J20771J97559J24291
10637B873672N0676J13108J76159J73868J71532K75375K90443L21612L28326K92279
10627E067050K78133L71051N07229N78028P73339J051162J414218J844912K407310
10618A4292432L294312M177268M991636N327348M459645K393487m1172j422469
10610C7472487j493146n55774R89136K907410N239972P679377R913000J0459483
10602G2611945P953307K508598l299205o391420n972624l481444k45314L271510
10594F6955353O980637J0657480J3460644J3582537R032328L75223p947690j1574583
10586A01521929j0316798o584994k543208J160304M674605Q010540J0679817J1727949
$$ plain form
10648 1890203 1967179 2034575 2070784 2136728 2195577 2271904 2382767 2431051 2551822 2749381 2873672
10637 2873672 2924348 3037456 3213615 3387483 3559015 3834390 4124833 4446445 4774771 5067050
10627 5067050 5345183 5716234 6223463 6801491 7574830 8625992 10040210 11885122 14292432
10618 14292432 17586744 21764012 26755648 32082996 36542641 38936128 38894956 37472487
10610 37472487 35979341 35423567 36412703 39320113 44560085 52239462 62152462 72611945
10602 72611945 80565252 83073850 79774645 73383225 67410601 63929157 63683843 66955353
10594 66955353 73935990 84593470 98054114 111636651 120668979 121044202 113096512 101521929
10586 101521929 91205131 84620137 82076929 83237233 87911838 95922378 106602195 118330144
10578A18330144J0214914O936032N581810R707529K0061048L5773465N4710867
10571B61315809P1196970P2551718N1411681K7087220P916492p832725j0665768
10564D72981397N32362L886169j1130112k9903673n2058430p2818774p6701777
10557B34787162o1598786m2783532k9202431k0330469j4703343j0891514q179415
10550D7097672o304729m821698l742274l119718k734494k472614k327062k151625
10542A9423458j820378j382326j154372j222058j156670j104689j126650r78804
10534I477511p89529o45376n25246l99299l70602l03696l24784k85401k91767
10525E541811k65371k73991k52392k91202k94116k68135j30830j82018j95497
$$ plain form
10578 118330144 128545058 135481090 141062900 150770429 170831477 206604942 261315809
10571 261315809 332512779 405064497 456476178 483563398 491479890 483647165 472981397
10564 472981397 473513759 477399928 466269816 436366143 384307713 311488939 234787162
10557 234787162 173188376 130404844 101202413 80871944 66168601 55277087 47097672
10550 47097672 40792943 35971245 32228971 29109253 26374759 23902145 21575083 19423458
10542 19423458 17603080 16220754 15066382 13844324 12687654 11582965 10456315 9477511
10534 9477511 8687982 8042606 7517360 7118061 6747459 6443763 6118979 5833578 5541811
10525 5541811 5276440 5002449 4750057 4458855 4164739 3896604 3765774 3583756 3388259
10516C388259j49257j70149j56377j12266j17809q1295n5236p2767j29074r4592
10506B249437q9728r7844r8194p6937P937o207l0054p2645o1308q7797p4979j29199
10494A432482j7831M5940L4994m1129p8512o0100r2345q9850q8414J1460o386
10483A050309l5724l487k2981l6074k9864m6660q446N7390J6456k7980J8582P7123
10471A008644o3139J4062J0644k6855p1983j2005p520M337p715L4429J0471r0569
10459H02801J4325O8360n5027r2833r0221n6438J537J4001J9739M286j1496J6551
10447F35585j4939N373K1779l3982n7300Q3736J10031P5708L4435l6286j4699
10436H09441M7496n4285n9008J7112K1514n9479m0127j2380N300p971k2328j6156
$$ plain form
10516 3388259 3239002 3068853 2912476 2800210 2682401 2601106 2545870 2473103 2344029 2249437
10506 2249437 2159709 2061865 1963671 1886734 1894671 1888464 1858410 1785765 1724457 1636660 1561681 1432482
10494 1432482 1414651 1460591 1495585 1454456 1375944 1315844 1223499 1133649 1045235 1056695 1050309
10483 1050309 1014585 1011098 988117 952043 922179 875519 867073 924463 940919 912939 931521 1008644
10471 1008644 945505 959567 970211 943356 871373 859368 851848 856185 848470 882899 893370 802801
10459 802801 817126 885486 830459 737626 647405 590967 592504 606505 626244 630530 619034 635585
10447 635585 620646 626019 647798 613816 556516 640252 750283 825991 860426 824140 809441
10436 809441 856937 802652 743644 760756 782270 722791 682664 670284 675584 667613 645285 629129
10424F29129J7182j0460O4751M2793l7055N3460N4419P6324M6490J16687J79229
10413A232949J32454Q1746N3581J2932m4535m8705k5849q405n4709j27660j08038
10402A095761r6670j70664j20805l8437p9456j08241m5801j8828o3378m2695J2705
10391C23491K3303J311o8494n1324O870k1572J5940N6016m6116m9793k2206J2185
10379A79611l0960k0087k5356N672J0672P4444K466L620J2008l5124n7570j0091
10367A09305j808K594p394j786K0688k6931M538j0521j1203O363R703K5855L7400
10354A56803j1909Q554l722L600j7613N4302j665L416J7529J6037j6021K3947
10342B33258K2695L1730k1309j12641m1633P6202M2251j2888M337R343k4656L3906
$$ plain form
10424 629129 646311 635851 700602 743395 706340 759800 814219 890543 937033 1053720 1232949
10413 1232949 1365403 1447149 1500730 1513662 1469127 1420422 1394573 1386168 1331459 1203799 1095761
10402 1095761 999091 828427 707622 669185 589729 481488 435687 416859 353481 310786 323491
10391 323491 346794 348105 279611 228287 235157 213585 229525 285541 239425 189632 167426 179611
10379 179611 148651 128564 103208 108880 119552 193996 196462 200082 212090 176966 119396 109305
10367 109305 107497 110091 102697 100911 121599 94668 99206 88685 77482 83845 93548 119403 156803
10354 156803 144894 153448 149726 153326 135713 190015 188350 191766 209295 225332 209311 233258
10342 233258 255953 287683 266374 153733 112100 188302 230553 217665 222002 231345 206689 240595
10330B40595K8120J8666l3689n6600K5357L6843M3045k4808l9099k5310o530L5588
10318B42178l0878p0010K6209m2165k4737O1606K1256K2678q5302n7860m0108
10307B2867j8520j307K1837P3795m282o4754L2345J712o4071N3024L2111J1994
10295I6751n0257k3993L0461K5884K3441K5415R393l4792l0102m24J1395q142
10283G5030J5166N9151j00859o5639J9326k6366j9262k9060Q9155N6377M7158
10272A20177k5698n5042l5370l465k717K1432M7654k591k3390j3689k5454l529
10260a682Q0768M051n1303l5512J7412j4508K2020j5750k0257m3071N142P755
10248d4935M8322j557K6837m4869J1563L4488K2176k2190L0193L5439K9033l4108
$$ plain form
10330 240595 268715 287381 253692 197092 222449 259292 302337 277529 238430 213120 206590 242178
10318 242178 211300 141290 167499 125334 100597 162203 183459 206137 120835 62975 22867
10307 22867 4347 3040 24877 98672 94390 29636 61981 63693 -378 52646 84757 96751
10295 96751 46494 22501 52962 78846 102287 127702 137095 102303 72201 71777 83172 75030
10283 75030 90196 149347 48488 -17151 2175 -24191 -43453 -72513 16642 73019 120177
10272 120177 94479 39437 4067 602 -2115 19317 66971 64380 40990 27301 1847 -1682
10260 -1682 79086 83137 31834 -3678 13734 -774 21246 5496 -14761 -57832 -52690 -44935
10248 -44935 3387 1830 28667 -16202 -4639 29849 52025 29835 60028 95467 124500 90392
10236I0392q6854m162Q9559O4373l3020k7171l0266K7273O175m7254k5174L5606
10224E9477q281o801M5409M8031K972j7158j0306J4771J1930k6071j04969m730
10212D274P672k2149j1782k1717M4710K1793L1899o363L2440N9477J234K1177
10200A62665j7900m0157l3052k641j0893j5384N7312N7521n9804p1140L5727M9632
10188A11886L9472L1647k0050l4138k8943Q073K3942J9673N8329M5550K3958L3998
10176C13397j7142L6292j0527N4348J2273j2232K8105L2875Q0315J07464J51172
10165G76340J79469J20041P522N5060J19266K32750K81321L72871L90297L18669
10155B853606J66992P6154l9181n8562l8561r4090j37205k35753k67992l04001
$$ plain form
10236 90392 3538 -624 88935 153308 120288 93117 62851 90124 96299 49045 23871 59477
10224 59477 51196 44395 89804 137835 140807 123649 113343 128114 140044 113973 9004 4274
10212 4274 11946 -10203 -21985 -43702 1008 22801 54700 48337 80777 140254 141488 162665
10200 162665 144765 104608 71556 68915 58022 42638 99950 157471 97667 26527 62254 111886
10188 111886 151358 183005 162955 128817 99874 107947 131889 151562 209891 255441 279399 313397
10176 313397 296255 332547 322020 376368 388641 376409 404514 437389 517704 625168 776340
10165 776340 955809 1075850 1083372 1138432 1257698 1490448 1771769 2144640 2534937 2853606
10155 2853606 3020598 3096752 3057571 2999009 2960448 2866358 2729153 2493400 2225408 1921407
10145A921407l50197k57512j37688j49111j49202j29830o4674k9880r3027l9180
10135E21106l6533o0979j9751k1790j990K9681m1704l6833n6626n7307k9150K5459
10123B13583M1331P407m6774j4284l6863r7599o7560m561L9766P799j0448J6227
10111D8024K7035j0814l746j7133K0092M2539N0768k5403n3742k6102O975M6267
10099A04760K9823J5261l6242o7736P25L9969N3415p885n3200n726J9457l1618
10087F1003n17j5155n5464J3321J01656L4084l4661j22271k2658R3373K7113P495
10075H7319P306K7005k2620k1692J6590L3582n2503k0726L0766j8178k2441p6766
10063c2358n935O5952N1091m4693k9965J5638L6818L3684l4813n241J4485j829
$$ plain form
10145 1921407 1571210 1313698 1176010 1026899 877697 747867 683193 653313 560286 521106
10135 521106 484573 423594 403843 382053 380063 409744 368040 331207 274581 217274 188124 213583
10123 213583 254914 262321 215547 201263 164400 66801 -759 -5320 34446 42245 31797 48024
10111 48024 75059 64245 60499 43366 63458 105997 156765 131362 77620 51518 58493 104760
10099 104760 134583 149844 113602 45866 46591 86560 139975 132090 78890 73164 92621 61003
10087 61003 60486 45331 -10133 3188 104844 138928 104267 -18004 -40662 52711 79824 87319
10075 87319 94625 121630 99010 77318 93908 127490 74987 54261 85027 66849 44408 -32358
10063 -32358 -38293 27659 78750 34057 4092 19730 56548 90232 55419 50178 64663 62834
10051F2834j2824j4221j2185K2915K027K9088Q508K3994N444j3773k2575m6173
10039C3059n910K5845Q122O2554k3655k5440m0418M6J6235J0809N1998K4281m9576
10026H7950j3067l3863j7086K2983M019k8756K3888P736o6225l5396N6664L2120
10014D0967j6626J3345l7766j9864j4053l0398K0573j0695J7908R615J4098O250
10002f646M661O7985n6188M060J5077J6466M8128K6827L037m3640q3950l5615
9990c9798J0257p095P5443K5692k9624O361n4132o6217K2859K5586j8446j8260
9978f7374R009k6932N7181L8099j3329n5868L5727m3412J8225L7292q78K855Q4666
9965G5261M6221o012o4466n5343K151o5343J8696m5020N9061P4425k9655k2187
$$ plain form
10051 62834 50010 35789 23604 46519 48546 77634 86142 110136 115580 101807 79232 33059
10039 33059 27149 52994 61116 123670 100015 74575 34157 34203 50438 61247 113245 137526 87950
10026 87950 74883 41020 23934 46917 50936 22180 46068 53804 -12421 -47817 8847 40967
10014 40967 24341 37686 -80 -19944 -33997 -64395 -43822 -54517 -36609 -26994 -12896 -6646
10002 -6646 -1985 66000 9812 13872 28949 45415 93543 120370 123407 79767 -4183 -39798
9990 -39798 -29541 -36636 38807 64499 34875 41236 -12896 -79113 -56254 -30668 -49114 -67374
9978 -67374 -58365 -85297 -28116 9983 -3346 -59214 -23487 -66899 -48674 -11382 -12260 -9405 75261
9965 75261 121482 115470 51004 -4339 -2188 -67531 -48835 -93855 -34794 39631 9976 -12211
9953a2211l4065M8222J7131l5699Q63P056n2720l1529N5958J01629j165r1158
9941b7688l1218k2500K8192J3806M9662J0986N267K2006j0614l8802M3622J0058
9929E2777k4147k9337K8681J0508L5450n6375l7858j9399r59l1086K2061N7412
9917G728L9527l1248L204M50k8074L7269P224k8726K1116K1904M888m7188Q795
9904A6869k441l7161l2295J027j5818J8229L9131j7228l9257K8171N7018K864
9892A9109j0199M2714J0843m445j4374J2543k5954o2379l8639K1391O3396K8592
9880D2598m1536l5620k8214N312k4543k8249j9076K0506M0384N9293J3333m7726
9868d3538j3041N8929J9421n880L6417l0323K0314L2134L0865k8154n868M4082
$$ plain form
9953 -12211 -46276 1946 19077 -16622 -15759 -8703 -61423 -92952 -36994 64635 63470 -27688
9941 -27688 -58906 -81406 -53214 -39408 10254 21240 26507 48513 37899 -903 42719 52777
9929 52777 28630 -707 27974 38482 73932 17557 -20301 -39700 -40659 -71745 -49684 7728
9917 7728 47255 16007 19211 19661 -8413 28856 36080 7354 28470 50374 55262 8074 16869
9904 16869 14428 -22733 -55028 -54001 -69819 -51590 -12459 -29687 -68944 -40773 16245 19109
9892 19109 8910 51624 62467 58022 43648 56191 30237 -32142 -70781 -49390 14006 42598
9880 42598 1062 -34558 -62772 -57460 -82003 -110252 -129328 -108822 -68438 -9145 4188 -43538
9868 -43538 -56579 2350 21771 15891 52308 21985 42299 74433 105298 77144 71276 115358
9856A15358K1088l7594J6493n181j7761q4619L937J426L3703J5254j0449L7113
9844H8768j5371k5360k5449l3248n6699m9882K2343M1537J2824r027M163N9381
9832A3980K0032P991L1429j2423k3205k3474k3805p944j7826P4551m080l2641
9820B585Q292n8071j0125Q6966r157o6105j7664j9066q622J3335M3627M3563O8252
9807G7810K2023m5321n9562K6609M120m5568j1777J0701O735L8013j2678K8706
9795C9811l101o1281K1572j6103j4469p643q0072L6229Q5897k5255j2081l7842
9783g4338k729k743k1730j56L3912P1613Q759j5224M1127J66l2467j1381M6125
9770D0934j4945n9744m1804M3768K4291J4014M1900r256O0835m3065m2435m99
$$ plain form
9856 115358 136446 98852 115345 110164 92403 7784 11721 13147 46850 62104 51655 88768
9844 88768 73397 48037 22588 -10660 -67359 -117241 -94898 -53361 -40537 -49564 -45401 13980
9832 13980 34012 42003 73432 61009 37804 14330 -9475 -17419 -35245 39306 35226 2585
9820 2585 10877 -47194 -57319 29647 20490 -45615 -63279 -82345 -90967 -77632 -34005 9558 77810
9807 77810 99833 54512 -5050 21559 25679 -19889 -31666 -20965 -14230 23783 11105 39811
9795 39811 36710 -24571 -2999 -19102 -33571 -41214 -121286 -85057 840 -24415 -36496 -74338
9783 -74338 -77067 -79810 -101540 -101696 -67784 3829 12588 -2636 38491 38657 6190 -5191 40934
9770 40934 25989 -33755 -75559 -31791 -7500 6514 48414 39158 99993 56928 14493 13994
9758A3994m1480n0520l4793K9715O485J1289P1261N2903j1267J1494K6554r978
9746G5657q6742j8295Q651n2688k8799N4261L2183J5938l6114N7875L3806N867
9734F1600j1226K1345M353n4497R602K1107k2553K1304J2812k9601k9620m129
9722D97K8860K8831k5664l8751K468K8564J8344L2115l2915m2603k3800L9412
9710A5358N7070j0005O143L5383J1016K267n0376j0571r699N7944K6056j1360
9698A19226J7013m8996o6076m9176K0757M2370j5248k591Q8761L7290k4299k6318
9686I2713n8725j6977k251o078k3735K4697K6226q711k0015r0658R520L2252J8246
9673b3496L2733L2891m578J5416O0361L2704n5613l0143p555p9734o1866O8688
$$ plain form
9758 13994 -27486 -78006 -112799 -83084 -76599 -65310 5951 58854 47587 59081 85635 75657
9746 75657 -11085 -29380 -20729 -73417 -102216 -47955 -15772 166 -35948 21927 55733 61600
9734 61600 50374 71719 76072 21575 31177 52284 29731 51035 63847 34246 4626 497
9722 497 29357 58188 32524 -6227 -3759 24805 43149 75264 42349 -254 -24054 15358
9710 15358 72428 62423 68566 103949 114965 117232 66856 56285 46586 104530 130586 119226
9698 119226 136239 87243 21167 -28009 -7252 35118 19870 17279 106040 143330 119031 92713
9686 92713 33988 17011 14760 8682 -15053 9644 35870 27159 7144 -83514 -73994 -41742 -23496
9673 -23496 9237 42128 37550 52966 113327 146031 90418 60275 52720 -27014 -88880 -20192
9661b0192O1779Q0866L3268l1685o460K3395K5425O3957P9388J18786K20138O7377
9649G16042p8170j69444j46506r5116o5728n0815j2968l7088j335O0712n25j5995
9637A03064k3276l5638m2544k636k0962M8419K2641j8153k2244L3322l466j9848
9625A8679k8675l2758L5972j9072j2082p097K8061j6331O2523j1083o36J2084
9613B9585j7741o1634n9995m839N1167O594j1791J4832K5798P6074k8461P384
9601B6973k5217o345O6167Q48n9665L0483L4743j8924K2698m420l9486p945O7215
9588H7125P190m2519k5889o335j2147L5760N0636m1776o5657J2776K9978K6417
9576E5559Q63j4988L51o9592j8991k0898N646Q974J7288M4718k8696k8446O0855
$$ plain form
9661 -20192 41587 122453 155721 124036 117576 140971 166396 230353 309741 428527 648665 716042
9649 716042 637872 468428 321922 226806 161078 110263 97295 60207 58872 119584 119059 103064
9637 103064 79788 44150 1606 -1030 -21992 26427 49068 30915 8671 41993 38527 18679
9625 18679 -9996 -42754 -6782 -25854 -37936 -45033 -16972 -33303 29220 18137 17501 29585
9613 29585 11844 -49790 -109785 -114624 -63457 -56863 -68654 -53822 -28024 48050 19589 26973
9601 26973 1756 -4589 61578 62426 2761 33244 67987 49063 71761 67341 27855 19910 87125
9588 87125 94315 51796 25907 19572 7425 43185 93821 52045 -13612 -836 29142 55559
9576 55559 56422 41434 41785 -27807 -46798 -67696 -62050 -53076 -35788 8930 -19766 -48212 12643
9563A2643L9623K2485j342l7885j566j1579J7457L6852k916j1269j10p270J0975
9550F6098O388j0207K0856M0478k0393o2067n2533M560M0010j6444J8463M5231
9538H0440M6296k3963j9790k3321l3624L856K6863J7714n0641K1919O5248N1670
9526A62667N234j16444l4034P7800k396o0078l650J1093J3483P619j170m0708
9514A9416k5935n702m768k2504L7359M4674k0292M201K1631J3748J066l6062l7785
9501a0953Q142L3968N1274N9697Q204R68J1812m8393k9400l6918r646L7645n8315
9488A8085l7752l951L7764M5442k8484k894J0041K8706j7622q1722j6427J6427
9476c2387J1406N24L9233M1245J0560l6655j7445j2176M3518L7666r0849j7317
$$ plain form
9563 12643 52266 74751 73409 35524 33958 22379 39836 76688 73772 62503 62393 55123 66098
9550 66098 72486 62279 83135 123613 103220 41153 -11380 -6820 33190 16746 35209 80440
9538 80440 126736 102773 82983 59662 26038 29894 56757 74471 23830 45749 110997 162667
9526 162667 167901 51457 17423 95223 92827 32749 29099 40192 53675 61294 60124 19416
9514 19416 -6519 -12221 -16989 -39493 -2134 42540 22248 26449 48080 61828 62894 26832 -10953
9501 -10953 -2811 31157 82431 142128 150332 151300 163112 114719 85319 48401 38755 76400 18085
9488 18085 -19667 -23618 14146 59588 31104 28210 38251 66957 49335 -32387 -48814 -32387
9476 -32387 -20981 -20457 18776 60021 70581 33926 16481 4305 47823 85489 -5360 -22677
9464b2677M2720J2528q6597k5089M4937O2691M5207m7397K5337M179M414l3691
9452B6562K6049O286l7263J167L6659n2884m0050M6225L4219L4466p0l876l5793
9439D1697M0004l5391n1055Q153L7087L1512N1914M2818M432n7358m2602l7032
9427C4179m5287l408k3356j2087m2857L1979R9768n3777o6513P4182o1936J2623
9415e6490N6119j657n2437N9439N4910n9119k5363L9827m153o2434J9201K3631
9403h526K0456M1777l307J0427R438l3041L0770M5030n7286p591M371j2986m2913
9390c381J5861O6426l0765n0760K3698J8375M819j9599J594M875k8155K6546K9224
9377E8758L8078R406j0443J6361J687m6814k9796j0246M5482O1738l2275k3832
$$ plain form
9464 -22677 20043 32571 -54026 -79115 -34178 28513 73720 26323 51660 55839 60253 26562
9452 26562 52611 58897 21634 22801 59460 6576 -33474 12751 46970 81436 81366 77490 41697
9439 41697 81701 46310 -4745 3408 40495 72007 123921 166739 171171 113813 71211 34179
9427 34179 -11108 -14516 -37872 -49959 -92816 -60837 38931 -14846 -81359 -7177 -69113 -56490
9415 -56490 -371 -2028 -54465 4974 59884 765 -24598 15229 11076 -51358 -32157 -8526
9403 -8526 11930 53707 50400 60827 70265 37224 67994 113024 55738 48147 52518 39532 -3381
9390 -3381 12480 78906 48141 -2619 21079 39454 44273 24674 26268 31143 2988 29534 58758
9377 58758 96836 106242 95799 112160 113847 67033 37237 26991 72473 134211 101936 78104
9365G8104N5211j1871j3939l0810L6585j7848l084m1096n6962k0237L9548M1505
9353E5106O6204J0789r289N5659j6147n3344n4347O250L0746M2773l0530m5076
9341E8794r087m3597N1168n13J3034K1005m4872m5887j0887K1780N0344R2971
9329A54253K3545j3725J1678n0340r547m9619L6953N5822k1140n8462p8431K0225
9317B1212J0136M2446R8323J3395j6928o0011n1525K9317K1796k2559J8493J4773
9305A18868l6208o5975l6866O9720M2583l8664J0605P2677K9431l0823j07355
9294B7993k769K5222J1935N8189J9947M2841p711l0676L9501L7235k6531j3259
9282A81917L9360m748k4906l4803m6113m0960m4709L8931Q8571q6484m2314l2490
$$ plain form
9365 78104 133315 121444 107505 76695 113280 95432 92348 51252 -5710 -25947 13601 55106
9353 55106 121310 132099 122810 178469 162322 108978 54631 60881 91627 134400 103870 58794
9341 58794 49707 6110 57278 56765 69799 90804 45932 45 -10842 10938 61282 154253
9329 154253 177798 164073 175751 125411 115864 66245 103198 159020 137880 79418 987 21212
9317 21212 31348 73794 172117 185512 168584 108573 57048 86365 108161 85602 104095 118868
9305 118868 82660 16685 -20181 49539 92122 53458 64063 136740 166171 135348 27993
9294 27993 25224 50446 62381 120570 140517 183358 175647 144971 184472 221707 195176 181917
9282 181917 221277 216529 191623 156820 110707 69747 25038 63969 152540 66056 23742 -8748
9270h748P0586Q8314j2164M0662J0305o636L898k2483k6960K5155n983o9148k8162
9257E8636K0001j7364M531N633N7888J3352j110r05k3167P049J4086k2199l4587
9244H1844M4397M2116p396j4507Q720m585j484j3049J3252K8020M9868K32o6468
9231A60960J6468j0961m5545J0130j9692J4626K6908r717L0256M0942k4709o5627
9219A24039m0259k3871o534J3733o928P6338R0521n7107k4463k8530l947O3611
9207A76603l5529k4174J2656r25j8964j3824K9066P574L6562J9225j009m6606
9195A40655k6981L1980P534P2782L2597q8048o7264n7496l007J7821L0876Q9008
9183A80457l1648o6351M896L4300M581K271k4432K5734j7908j8228L9975O6918
$$ plain form
9270 -8748 61838 150152 137988 178650 188955 182319 186217 163734 136774 161929 155946 86798 58636
9257 58636 78637 61273 65804 71437 129325 142677 141567 140662 117495 124544 138630 116431 81844
9244 81844 126241 168357 160961 146454 155174 150589 149105 136056 149308 177328 227196 227428 160960
9231 160960 177428 166467 120922 131052 111360 125986 152894 143177 173433 214375 189666 124039
9219 124039 83780 59909 53375 67108 60180 136518 227039 169932 145469 116939 112992 176603
9207 176603 141074 116900 129556 128631 109667 95843 124909 132483 169045 188270 187261 140655
9195 140655 113674 145654 153188 225970 258567 170519 103255 45759 42752 60573 91449 180457
9183 180457 148809 82458 87354 121654 126235 128506 104074 129808 111900 93672 133647 200565
9171B00565o35l6508o655j7376n0731L0704j2142L8302J8950R613k651m5226k1846
9158A04364k8548J2940R93k5780J7864K2426L1801O4220R6353j5804n3924j4206
9146B12699L633j4880p0913l426O1604L3947r687n3900l2746j4626N6221j2287
9134A55639L087L4799l0194o1229j4649N1955P222L4488o901p5656l5998P0433
9122A32996M3379M269J1941m2004j1204j8424m5067L9164n420j9435l2315Q091
9110F5971N3821L3904J8903j7148J0481n4344m0282m041L3420M5996K7747j5228
9098A59200q931M0378k2737l8703J8240l0345p5093N697j4384M0477P917K4995
9086A06711k2972L191P2538m376m3539N1231l3848n1332l8281K391M4390O8911
$$ plain form
9171 200565 199930 163422 156767 139391 88660 119364 107222 145524 164474 174087 171436 126210 104364
9158 104364 75816 88756 89749 63969 81833 104259 136060 200280 296633 280829 226905 212699
9146 212699 216332 201452 130539 127113 188717 222664 212977 159077 126331 111705 167926 155639
9134 155639 158726 193525 163331 102102 87453 139408 146630 181118 174217 98561 62563 132996
9122 132996 176375 180644 192585 150581 139377 120953 75886 115050 109630 90195 57880 65971
9110 65971 119792 153696 172599 155451 165932 111588 71306 67265 100685 146681 174428 159200
9098 159200 150269 190647 167910 129207 147447 117102 42009 47706 33322 73799 81716 106711
9086 106711 83739 86930 159468 155092 111553 162784 128936 77604 39323 41714 86104 155015
9074A55015M1041l884L4742l2105m5952k3577M4742j1028J3451J605q2230m0140
9062E1680L3480R4995N2453m1155j5112o002K4597K5843L2340p074j7705l8351
9050A89989J1408K3164m1895K9299l1460n6926K1199L3797K0065k4971j0417l890
9038A59362l8894O4820M9700L4245k2067K5135j3175l0125o248L9276N0709n7918
9026B54820n7885M7252P425P9414j8266p8448q997L8466k5886j9690m6711M1385
9014B12879L279k7770k9309O3822J3748j626J3465o0940j9838J3886J1088J1159
9002B03843R98K782k5619l3201l0533J267L6854J6466p924M5134K3465j3m9536
8989A83983K4459J7266l8859L2017K9841m8941m8294j4422P487l2702m2332K5346
$$ plain form
9074 155015 196056 192172 226914 194809 148857 125280 170022 158994 172445 174050 91820 51680
9062 51680 85160 180155 232608 191453 176341 170339 194936 220779 253119 246045 228340 189989
9050 189989 201397 224561 182666 211965 180505 123579 144778 178575 198640 173669 163252 159362
9038 159362 120468 185288 234988 269233 247166 272301 259126 229001 222753 262029 312738 254820
9026 254820 196935 244187 251612 331026 312760 234312 225315 263781 237895 218205 171494 212879
9014 212879 216158 188388 159079 222901 236649 235023 248488 187548 167710 181596 192684 203843
9002 203843 204841 207623 182004 148803 118270 119537 156391 172857 164933 210067 233532 233519 183983
8989 183983 208442 225708 186849 218866 248707 199766 151472 137050 144537 111835 69503 94849
8977I4849K8286j3873O445M272L3321N9428K8745K7822N4336m7845p1994n0762
8965A53030o753L1978J7077K6565L3689n837o1091m8941L0509J4886J7901L9173
8953B42186J5340J0454N981n0771k4648j9761l9670M1033j8693n2686N009J2148
8941A25922J07491M2422m9042m7908k6038j6343J3194M2148n115p996J0194J0450
8929A99379J6297N0582K9977l3048K6430j87m3994n1330P8430M3496O390n1012
8917B71410o5378L943J5741K5450K2063J6667j1373j4754j1733l3564M0159J1753
8905B70384k8317J7474K492r6808k9693M0426L0715J1249j1632j787J4265N9309
8893B78077j5539J1192N3621K27l3491l7645k1900m9128L2881J1615k3098K0331
$$ plain form
8977 94849 123135 109262 115707 119979 153300 212728 241473 269295 323631 275786 203792 153030
8965 153030 146277 178255 195332 221897 255586 249749 188658 139717 170226 185112 203013 242186
8953 242186 257526 267980 273961 223190 198542 178781 139111 180144 161451 108765 113774 125922
8941 125922 233413 275835 226793 178885 152847 136504 149698 191846 186731 178735 188929 199379
8929 199379 215676 266258 296235 263187 289617 289430 245436 194106 272536 316032 322422 271410
8917 271410 206032 209975 225716 251166 273229 289896 278523 263769 252036 218472 258631 270384
8905 270384 242067 259541 262033 165225 135532 175958 206673 217922 206290 204503 218768 278077
8893 278077 262538 273730 327351 327578 294087 256442 234542 185414 218295 229910 206812 227143
8881B27143M2246K8458m0468k2141j2971l4231R4871L6643N0164J664o6625n196
8869B99557m9469m3229j3688L5335N6828K2773L4955K701l8658l2970J4800M1291
8857C30226m931k8255l1983m7448M07k9723L9423J5725K7293m7730o5302o7658
8845I0044K416M7139J9699K5298j5964L4008M9289k6498R467n063j4987K6503
8833B41351J4726k7789k5739K5444P185J165N3494n019K4161l2735j8258M6183
8821C04169J5204o490l6060m815j1732k5518J4631M8618k5379K0287K4308Q087
8809C25310k4234m6883J2492q523m123J4927P4886K4900j0829o5260J1316J1422
8797C15401j340k2393j1873j5890M9766M1121q311j8448l0606J4733p985k1594
$$ plain form
8881 227143 269389 297847 257379 235238 222267 188036 282907 319550 369714 371378 304753 299557
8869 299557 250088 206859 193171 228506 285334 308107 343062 345763 307105 274135 288935 330226
8857 330226 325295 297040 265057 217609 218016 188293 227716 243441 270734 223004 157702 90044
8845 90044 92460 139599 159298 184596 168632 202640 251929 225431 234898 229835 214848 241351
8833 241351 256077 228288 202549 227993 235178 236343 289837 284818 308979 276244 257986 304169
8821 304169 319373 312883 276823 272008 260276 234758 249389 298007 272628 292915 317223 325310
8809 325310 301076 254193 266685 258162 254039 268966 343852 368752 357923 292663 303979 315401
8797 315401 314061 291668 279795 263905 313671 354792 346481 328033 297427 312160 304175 282581
8785B82581k5656P4966k2023o4404j8419p498Q618n416J202L966O4864N0191K2091
8772C65063j2825k0179J8456r357J3704J1706J7339L6876K4191k6169k9821j1700
8760C77284K5671M1823m9889j6612N532Q702l8466l2605k4505O7106L2165m5563
8748C50643r589N2180k9296p2230J2517M7052L083j6171L3882K7225m7153L264
8736C55407k5344M754p363K0685J1150K0403n0705p824o688O1247J00282k3424
8724D52580o3248M2168j4389j6335j2523m4320M7402l201l985M8563J2681l3665
8712D11728K9227p0992o5954N8216N4642j2744l1206P2597J0678o0953l1030k5696
8700C38513J9283M2778N2549M316l099k4213l7643N2687R7095k6633j03185q2494
$$ plain form
8785 282581 256925 331891 309868 245464 227045 219547 228165 222749 223951 227917 292781 342972 365063
8772 365063 352238 332059 350515 341158 354862 366568 383907 420783 444974 418805 388984 377284
8760 377284 402955 444778 394889 378277 383809 392511 354045 321440 296935 364041 396206 350643
8748 350643 341054 393234 363938 291708 304225 351277 354360 338189 372071 399296 352143 355407
8736 355407 330063 334817 327454 348139 359289 379692 328987 321163 314475 375722 476004 452580
8724 452580 389332 431500 417111 400776 388253 343933 391335 388134 384149 432712 445393 411728
8712 411728 440955 369963 304009 362225 416867 404123 372917 445514 456192 395239 364209 338513
8700 338513 357796 400574 453123 457439 454340 430127 392484 445171 542266 515633 412448 329954
8688C29954P8171L2722j2053K5026K8627k1342q7070M5711O6764N4348J9749M8337
8676F08944l7462j19937j3345j2138q0466j0041M9039M7799L1987J6383l2163
8665D48600j7483O334K0966M6004N6046j0387n4567N0819K2409k2889j4095L5170
8653E66927j2011l2498K508N2370q147k0426J5707J1865L7482M9372Q210n3504
8641F17855m5129l7729m6481M5572N9836p162j8023Q6647N7855J5604P814R531
8629G46190k1831m132n023J4075k0506l1596j1569O8727K030K0588N245L0916
8617G93114l1808K7071k5222m0269l0122O3342P2294p14l0806k686P7329K5152
8605H96675n1890q076Q230J2690Q11M0657M2129L8440p650L8635j711J4021O6757
$$ plain form
8688 329954 408125 440847 428794 453820 482447 461105 374035 419746 486510 540858 560607 608944
8676 608944 571482 451545 438200 426062 345596 335555 384594 432393 464380 480763 448600
8665 448600 431117 437451 458417 504421 560467 550080 495513 546332 568741 545852 531757 566927
8653 566927 554916 522418 524926 577296 569149 548723 564430 576295 613777 663149 671359 617855
8641 617855 572726 534997 488516 534088 593924 586762 568739 655386 713241 728845 736659 746190
8629 746190 724359 720227 715204 729279 708773 677177 665608 734335 736365 756953 762198 793114
8617 793114 761306 788377 763155 722886 692764 756106 828400 827686 796880 794194 871523 896675
8605 896675 844785 836709 844939 857629 858440 899097 941226 979666 972016 1010651 1008940 1022961 1089718
8592A089718R3767P6154N7238M7414k583M8319k65N0098J34306J46362R3729K0697
8580A854954Q6512O6921Q063M6334J0281Q0934L0635q3247j74203j15981j63001
8569A648202j01323r5861o3070m7922n242m8538m7059n3363q0932o0637K4154
8558A068409N685q302m2538o1316n7333l667J9988m2273j9124k0510P43q885k2668
8545H08209k316N9536j1792J7530l3l2335m9229k0513J0945M0161j0866n5542
8533G53755o974J1126K420m9592m9291k3004J1676J5217M6314K9602o633l2245
8521G02371K3757k9369m7271L3907L2945J5739J6978J403k95K5529k0634j6721
8509G38339j0928n113n535M5293q693j7032j3360K2868n8068n2130j0569L8970
$$ plain form
8592 1089718 1183485 1259639 1316877 1364291 1361708 1410027 1409762 1459860 1594166 1740528 1834257 1854954
8580 1854954 1941466 2008387 2016450 2062784 2073065 2153999 2184634 2101387 1927184 1811203 1648202
8569 1648202 1546879 1451018 1387948 1340026 1334784 1286246 1239187 1185824 1104892 1044255 1068409
8558 1068409 1074094 1065792 1023254 961938 904605 900938 920926 878653 859529 839019 839762 830877 808209
8545 808209 805893 865429 853637 871167 871134 838799 789570 769057 780002 820163 809297 753755
8533 753755 746781 757907 760327 710735 661444 638440 650116 665333 711647 741249 734616 702371
8521 702371 726128 696759 649488 683395 716340 732079 749057 750460 750165 775694 755060 738339
8509 738339 727411 722298 716763 762056 753363 736331 722971 745839 687771 635641 625072 664042
8497F64042j6892P5488L9152m6482k7552j1292j7543q715J8447l8077O499p507
8485F29568j3848O775P0517p050j1973j2577L0053L0703K9943k3194m0642o2485
8473F25790j1189Q7476N6107L1167o8234r9580j1936K3172k3697J4896k8818p483
8461E87671m7155k7975j9997K0180Q6781J195j8812K6647M4620N8879k3539K3065
8449G11560R69n9046j1897J9443k8774j836R894k1009P795k8752j1798k2248k2851
8436E41450K4300j6586j6561K1727J4830J4519N4653n717k0967k0399O8284J7299
8424F76832k57n7359o5335k276O479L613q752l9219p4460N2943J07515J7885j2550
8411F05059K9727O794q8632j8982L5674m394p7489k7961K5475L277K1410J0039
$$ plain form
8497 664042 647150 722638 761790 715308 687756 676464 658921 650206 668653 630576 637075 629568
8485 629568 615720 622495 693012 685962 673989 661412 691465 722168 752111 728917 688275 625790
8473 625790 614601 702077 758184 789351 721117 621537 609601 632773 609076 623972 595154 587671
8461 587671 540516 512541 492544 512724 599505 600700 581888 608535 653155 712034 688495 711560
8449 711560 712529 653483 641586 661029 632255 630419 640313 619304 627099 598347 586549 564301 541450
8436 541450 565750 549164 532603 554330 569160 583679 638332 632615 611648 591249 659533 676832
8424 676832 676575 619216 553881 551605 558084 561697 552945 513726 439266 492209 599724 617609 605059
8411 605059 634786 641580 552948 533966 569640 565246 487757 459796 485271 488548 509958 519997
8399E19997j4750l1195q865M6235O6011j6399l6151O782m2282m8856o0167j8388
8387C61972k7071k372K0757N2177Q6432o133l4813K6523j6555m6523k9589K7853
8375D12658J2112m7804N157J9189P750j8264m8649K3504P0906N6911p681K1141
8363E06930m5226l4395J1197n1107j6894N8869K0474K5673m3292l0026N1698O344
8351D60245j3513K0022l5785o5791k1073J254j1445Q4518N322j9131J8567L5988
8339D59178k400m8267O1039q495l4880n1190L0221L0462l7089P496K7674j0732
8327D23017l838r937l1947m6104l2952p422J5752p843j6867j503r291N499J1011
8314B87575O565L0160P1108j690l4187Q800J9436J435M3123p777n3131Q914K3044
$$ plain form
8399 519997 505247 474052 465187 511422 577433 561034 524883 531665 489383 440527 380360 361972
8387 361972 334901 332529 353286 405463 491895 485762 450949 477472 460917 414394 384805 412658
8375 412658 424770 376966 382123 401312 409062 390798 342149 365653 436559 493470 485789 506930
8363 506930 461704 427309 438506 387399 370505 429374 449848 475521 432229 402203 453901 460245
8351 460245 446732 466754 430969 365178 344105 345359 333914 418432 423754 404623 423190 459178
8339 459178 456778 408511 469550 461055 426175 374985 405206 435668 398579 406075 433749 423017
8327 423017 419179 409242 377295 331191 298239 290817 306569 298726 281859 280356 271065 276564 287575
8314 287575 294140 324300 395408 393718 359531 368331 387767 389202 432325 424548 371417 380331 403375
8301D03375N308j7698k1962l4597K2243M0065n0228K9244o946n018k9353m3899
8289B90534O892j2506k3836K3195M0034J7310K7752R71l1985k6403J9714M4542
8277C76214J8270j4018m4294o6521K2690J7408k7805K423M7838O5948L4283l3478
8265C98958p6063J1443j8281m0523J5899N1543K5934k8349J7954m5956n8691L4011
8253B87879R7142M578q239j461l548j8075n2372j8430M8301J4211O957k4213n1878
8240B80852j0315j817K1291L4768k163j7048J0899q660J8129n644K462j061m7601
8227B74092l800l1292M1146L0479l1092o1376R098M8731O917j3856M170N1764
8215C24981N102j2838k1861p6848K6258Q852k4738Q0229L5328n2361j1536J4139
$$ plain form
8301 403375 408683 390985 369023 334426 356669 396734 346506 375750 368804 363786 334433 290534
8289 290534 297426 284920 261084 284279 324313 341623 369375 370346 338361 311958 331672 376214
8277 376214 394484 380466 336172 269651 292341 309749 281944 284367 332205 398153 432436 398958
8265 398958 322895 334338 316057 275534 291433 342976 368910 340561 358515 312559 253868 287879
8253 287879 385021 389599 381360 379899 376351 358276 305904 287474 335775 349986 356943 332730 280852
8240 280852 270537 268720 290011 324779 322616 305568 316467 307807 325936 320292 322754 321693 274092
8227 274092 270292 239000 280146 310625 279533 218157 227255 275986 282903 269047 273217 324981
8215 324981 330083 317245 295384 218536 244794 253646 228908 309137 344465 292104 280568 294707
8203B94707r532k8173l5862J4369k0387j0648j1129N7730J4050K9138j5154j1815
8191B67294K6676J4627m9027q2928L684J0538L496o765M0681k151q5706j9870
8179A20549R7844P3647j0565k03n555j9117r971l3428J8727J5609K7482M5005
8167C20024K8264k8851Q0424J9247r2999O50L5666m941p2081l2409M8255L1024
8155C32273M8124L0065l0485l3272j1705p1367N471j078j2883k0844J1422m7267
8143A98454o6991P51O8226N2082L1050k505k1494K8279K8487j6289K3802J8363
8131C42215k8286M815j7602J545P474K1623k3975J2083N282L0845j5381k7557
8119C13081l2206M5717R865K535K9690j510j4088j0065k9858q033M1692K2383
$$ plain form
8203 294707 285175 257002 221140 235509 215122 204474 193345 251075 265125 294263 279109 267294
8191 267294 293970 308597 259570 176642 180326 190864 194360 187595 228276 226125 140419 120549
8179 120549 218393 292040 281475 281272 275717 256600 246629 213201 231928 247537 275019 320024
8167 320024 348288 319437 399861 419108 326109 326759 362425 357484 285403 252994 301249 332273
8155 332273 380397 410462 379977 346705 335000 263633 269104 268026 255143 234299 245721 198454
8143 198454 131463 132214 200440 252522 283572 281067 259573 287852 316339 300050 323852 342215
8131 342215 313929 318744 301142 302687 310161 331784 307809 319892 325174 356019 340638 313081
8119 313081 280875 326592 336457 338992 368682 367172 353084 343019 313161 305128 346820 369203
8107C69203j0883j0395l0881r287M242j7274L9819N1578M1972L6306m4555L9353
8095D59198K2410J508k7642J8090k2480r1021o9776P6187J0140q326J4828k4015
8083C59101q925N3673K9415j7568l6089L7746j5362j8640k2514L6414p471n9677
8071C30103P723M0097J6877K9677J644m4144l5590J0928m142J2618M911r24p418
8058C62360O8186K2319k1390k3029o971L7130k9762Q158K9564J3277J6269J7824
8046D93935j6114k214J9534k0778o1916l4680L6630k6074N7596K5479L057J5393
8034D89848m1964m4850m460l3949L9981J1063J950Q1447N6674J6145M4730n8354
8022E58261p7868m7247M134M5336M2724K9245M6732J7377n8504m6783J2427P5517
$$ plain form
8107 369203 358320 347925 317044 307757 311999 294725 334544 386122 428094 464400 419845 459198
8095 459198 481608 483116 455474 473564 451084 360063 290287 366474 376614 368288 383116 359101
8083 359101 350176 403849 433264 415696 379607 417353 401991 383351 360837 397251 389780 330103
8071 330103 337826 377923 394800 424477 426121 381977 346387 357315 353173 365791 370702 369778 362360
8058 362360 430546 452865 431475 408446 401475 438605 408843 417001 446565 459842 476111 493935
8046 493935 477821 475607 495141 474363 412447 377767 414397 388323 445919 471398 474455 489848
8034 489848 447884 403034 398574 364625 404606 415669 417619 499066 555740 571885 616615 558261
8022 558261 480393 433146 437280 482616 525340 554585 601317 618694 560190 513407 525834 601351
8010F01351j0033m6433L3087O4640l5267p1043L7297J06576j501j3399J426K3724
7998F90425j5385j1113P2604K3843l2282q790O2788P6210m6354K4338m6686k7428
7986G62170m6042m830N3573M7734R9639M6137K3141N5033R089L5928K7297K9285
7974A138154j2822l3787k9156m5031O737j9464M5637p8160l6983k6448q580L498
7962I03595j3683n172J8106k7641l6331j0396k2592n910k4040J6205l6456J1876
7950G67561K1464O6111j6740M0452N8980L1956K9765M3422o299j0721L3213K0248
7938A079412K4496Q197K3247p795j9189N306o805P919q2103p5318o3048o4481
7926H29838M877K3244j0388p9630k2538L8324L9918P302l0978j03483n3606Q248
$$ plain form
8010 601351 591318 544885 577972 642612 607345 536302 573599 680175 678674 665275 666701 690425
7998 690425 675040 663927 736531 760374 728092 719302 782090 858300 811946 836284 789598 762170
7986 762170 716128 711298 764871 812605 912244 958381 981522 1036555 1045644 1081572 1108869 1138154
7974 1138154 1125332 1091545 1062389 1017358 1024095 1004631 1050268 972108 935125 908677 900097 903595
7962 903595 889912 884740 902846 875205 838874 828478 805886 799976 775936 792141 755685 767561
7950 767561 789025 855136 838396 878848 937828 969784 999549 1042971 1036672 1025951 1059164 1079412
7938 1079412 1103908 1112105 1135352 1127557 1108368 1113674 1106869 1114788 1032685 957367 894319 829838
7926 829838 834715 857959 847571 767941 745403 783727 823645 830947 799969 696486 642880 651128
7914F51128l8747K8160K1748m138O481L3908q049l9992r033M972N4173k048k1060
7901F77503L0547k8509j799N6113M2843k56l301j7697m4258l0831j9965J1594
7889F71984l0763k3188Q1832j362l6322M118P9745k9089l4743K784k7552j5307
7877F42137M7055k1206L492m539q5319l3095K2497N393o3473j3586k4556Q0920
7865E55720N5445j2380p579J3505K6029K9311k1773L196K4642K8807M6773k6615
7853G15081j1009K7846J4447k3431j4491k7747n1738l5143K9897J1954m3412p704
7841E84550J8177k3571l5217k4150k5144n613j8583k8691k2475M6442O346m0973
7829D31098J7405M6405K8326P186N3648J1937o9957m4670k3709j8130O4941j5775
$$ plain form
7914 651128 612381 640541 662289 658151 664632 698540 690491 650499 641466 646438 700611 698563 677503
7901 677503 708050 679541 677742 733855 776698 776442 773141 755444 711186 680355 660390 671984
7889 671984 641221 618033 699865 698503 662181 666299 746044 716955 682212 684996 657444 642137
7877 642137 689192 667986 671478 666939 581620 548525 571022 576415 512942 499356 474800 555720
7865 555720 611165 598785 591206 604711 630740 660051 638278 641474 666116 694923 741696 715081
7853 715081 704072 731918 746365 722934 708443 680696 628958 593815 623712 635666 592254 584550
7841 584550 602727 579156 543939 519789 494645 489032 470449 441758 419283 465725 472071 431098
7829 431098 448503 494908 523234 530420 584068 596005 526048 481378 457669 439539 504480 488705
7817D88705m2009K2992j05M7764L2119N3806o2038m2729K769m4748K5388L9823
7805E21737K9722k1333P367o565k6835l7642o3795l3232L8787j353l5291j3545
7793C58022K1676J2282k5514k8831l1106J8353q262M1351K1055K2952K9824k4593
7781D07209k4062k9155K3787L8712J6512k187l1643o4971l1457m441M5325k5791
7769C17838r635j0919J9272n0324m6390m824J9345N6579O0210l6059l6335o60
7757B78098k1996K5032L438r896k9743n3947M1504M9925M0994N9196n112k1801
7745C55692j6561m8353m5971l8600l6316K2349j5253M4662K7645m536p0772l5390
7733A38596N3279M5305L5474k565m4591l5485K5430l131k1005j4422K7330J0636
$$ plain form
7817 488705 446696 469688 469583 517347 549466 603272 541234 498505 501274 456526 481914 521737
7805 521737 551459 530126 537493 530928 504093 466451 402656 369424 408211 406858 371567 358022
7793 358022 379698 391980 366466 337635 306529 324882 316620 357971 379026 401978 431802 407209
7781 407209 383147 353992 377779 416491 433003 430816 399173 334202 302745 298304 343629 317838
7769 317838 308203 297284 316556 266232 219842 215018 234363 290942 351152 315093 278758 278098
7757 278098 256102 281134 284572 274676 244933 190986 232490 282415 323409 382605 377493 355692
7745 355692 339131 290778 244807 206207 169891 192240 176987 221649 249294 244758 173986 138596
7733 138596 191875 237180 272654 270089 225498 190013 215443 212312 191307 176885 204215 214851
7721B14851p7681m8830N0478K5652J6438K190m064j0460k3616M3554J7567N5298
7709B61377K1033o8074n8208l5067L243P7392j0768k1396k2797L716K3703K3297
7697A97451L9403l3204o7992r7880j0203M0295J764O5719J804j9507M2900o968
7685A53582M0307P0174l2794j0124j1452P640L5408o0118k6162J895n015N8049
7673B21390K0844n0893p6746l810k2074L89J5177P9209k1680k2124m5890k1314
7661G2478M1248J8354K810K7428o4362n3148J6925N0580k0015N8222j3146j2426
7649A24948N1370J0227m6961n1991j7803O31Q931j393M2449l525J0689j7811J342
7636A11103J9086q088p560k419J566l421p675j7591k7188j605l3227J4679L2651
$$ plain form
7721 214851 137170 88340 138818 164470 180908 183098 179034 168574 144958 188512 206079 261377
7709 261377 282410 214336 156128 121061 124304 201696 190928 169532 146735 150451 174154 197451
7697 197451 236854 203650 135658 37778 27575 67870 69634 135353 137157 117650 160550 153582
7685 153582 193889 264063 231269 221145 209693 217333 252741 192623 166461 168356 163341 221390
7673 221390 242234 191341 114595 110785 88711 89100 104277 183486 161806 139682 93792 72478
7661 72478 113726 132080 134890 162318 97956 44808 61733 112313 92298 150520 137374 124948
7649 124948 176318 186545 139584 87593 69790 70421 79352 77959 120408 116883 127572 109761 111103
7636 111103 130189 122101 114541 112122 113688 110267 102592 85001 57813 56208 22981 37660 70311
7623G0311J5393j2360N68K8691l5208l8468L5660k059P8627L2968p567k617l6475
7610A27464j3670r651o9546m5313L2369M8945L9946m6582k2915j6015Q292O6009
7598I9333L2363n735k7895j6317N024K3079j520l0488k9224l7585o1515Q900N2072
7585A0492N1529J8410L0051m7710k2693M6219J9330K3995l7219q3245J1439K477
7573B3075k2298J713K6611k8550O8041M2755K2973j6935l9745o160K8975J466
7561A01921l7086m0727Q542M2906K3841l2414m5375l7324l299L8091O1311K1103
7549A01490n8325J0975P84l1797K7195N8021j2071n8926o4872q836M5523L2039
7537D1200j4714n2714L7205L7158K4500k2850L0236O851k8017L6432J953k267
$$ plain form
7623 70311 85704 73344 73912 102603 67395 28927 64587 62528 141155 174123 166556 163939 127464
7610 127464 113794 104143 34597 -10716 21653 70598 110544 63962 41047 25032 33324 99333
7598 99333 131696 125961 98066 81749 86773 109852 108332 77844 48620 11035 -50480 -41580 10492
7585 10492 62021 80431 110482 62772 40079 86298 105628 129623 92404 9159 20598 23075
7573 23075 777 2490 29101 551 68592 111347 134320 117385 77640 71480 100455 101921
7561 101921 64835 24108 32650 75556 99397 66983 21608 -15716 -19015 19076 80387 101490
7549 101490 43165 54140 54924 23127 50322 108343 96272 37346 -27526 -36362 9161 41200
7537 41200 26486 -26228 10977 48135 72635 49785 80021 86872 58855 95287 97240 94973
7525I4973k2587J5996m3734n6201m9614N6256K3274J6719j5605K4918J482l5657
7513A0220N7961N0454l0768l5023J7772k540o194o6272M683q173L9823j401J1912
7500D2454m5634l0702M6917R176l0055L9435M579j1594M9058n7272k5808n256
7488a4702K4664N0645P967L7407K3846N472q967j8469p510j7341k9994O434M5205
7475A04657k5361J6505O5446k1911r6547q9414l3458O2997k4416j1957K0170k5428
7463e8717k3751k3825M4400O3581N488l3400P3901k0376j26680j9218R2111M9700
7451B3214k3760l0809L2545M7606o4192q0264M2880P8477j1185l47k4842Q228
7439b449l7901p2625j0342m190P4148O5430m0114j5964P6484J0760k8207k1458
$$ plain form
7525 94973 72386 88382 44648 -11553 -61167 -4911 18363 35082 19477 44395 45877 10220
7513 10220 68181 118635 87867 52844 70616 68076 61882 -4390 293 -7880 31943 30542 42454
7500 42454 -3180 -33882 13035 22211 -7844 31591 36170 24576 73634 16362 -9446 -14702
7488 -14702 9962 60607 68574 105981 129827 135299 126332 107863 100353 83012 53018 59452 104657
7475 104657 79296 95801 161247 139336 42789 -46625 -80083 -17086 -41502 -53459 -33289 -58717
7463 -58717 -82468 -106293 -61893 1688 7176 -26224 47677 27301 -99379 -118597 -26486 23214
7451 23214 -546 -31355 1190 48796 -15396 -95660 -52780 25697 14512 14165 -10677 -2449
7439 -2449 -40350 -112975 -123317 -127507 -53359 12071 -28043 -44007 32477 43237 15030 -6428
7427f428j5443r281j1649P030n985m306L5785r540k7041Q3220O5101J6701p3784
7414D4380n2522j3119k5300O912R1649M3205l3630k6134M8837k8097o066j5588
7402C4527l7684O7130J5405j5864n9841N974J1302M3937j6807l6180M4514J4484
7390G0897j1188j1115N900p9216m9201M8315J4372K783J5801l0802n929N750o9684
7377i3317L7095P672j9544r65J5731K2796O750L7850N7258l3163j9494L7336J7998
7364G4003p93n0692n8674K6165K3245j443L0542k218l5569M317r134j9657l2612
7351e2520o0393R387J9718O0106K9195m170n6226k4234M5826K6950L969J9773
7339A7381K2449n7239l1660p45j5005N2008N0173j6201j6599l942K4591K7164
$$ plain form
7427 -6428 -21871 -31152 -42801 -35771 -41756 -46062 -10277 -19817 -46858 36362 101463 118164 44380
7414 44380 -8142 -21261 -46561 -39649 52000 95205 61575 35441 84278 56181 50115 34527
7402 34527 -3157 63973 79378 63514 3673 9647 20949 64886 48079 11899 56413 70897
7390 70897 59709 48594 54494 -24722 -73923 -25608 -11236 -8453 7348 -23454 -29383 -23633 -93317
7377 -93317 -56222 -48550 -68094 -69059 -53328 -30532 -23782 14068 71326 38163 18669 56005 74003
7364 74003 73210 22518 -36156 -9991 13254 11811 42353 40135 4566 8883 -251 -19908 -52520
7351 -52520 -112913 -103526 -83808 -23702 5493 1323 -54903 -79137 -33311 -6361 -2392 17381
7339 17381 39830 -17409 -49069 -49814 -64819 -12811 37362 21161 4562 620 25211 52375
7327E2375K5473K2298k4973Q833L99o0135k3605L555J6608O0508L8588J0252j3025
7314A17151k5327j8175k8603j2365J8208m2225k9555K2921L4543l8091j3685l7313
7302e2516K2304N1689M3085k8050J5307K8228l9759n0173m416l0508n7164L8340
7290f3633N2100l833o501M3324K2536m1724J220J0565m6319j0184k618k5471K3579
7277d6959P686L0764L6518L8080k364j6658k5537J9386p855m7810r440k9745n014
7264e8948O9787P3345k9997m2117K0242K1134m898K790k2077n2669l5618n1074
7252a10100l0973J4031K0869R4286O2118j0603k8530L3276k4580M873j6934k751
7240D982o0728Q623M7327K5524j4889j4487l5005j5015k3139L1102K9356l9925
$$ plain form
7327 52375 77848 100146 75173 84006 84405 24270 665 4220 20828 81336 119924 130176 117151
7314 117151 91824 73649 45046 32681 50889 8664 -20891 2030 36573 -1518 -15203 -52516
7302 -52516 -30212 21477 64562 36512 51819 80047 40288 -9885 -14301 -44809 -101973 -63633
7290 -63633 -11533 -15366 -21867 21457 43993 2269 3489 14054 -32265 -42449 -45067 -70538 -46959
7277 -46959 -39273 -8509 28009 66089 63725 47067 21530 40916 33061 -14749 -24189 -53934 -58948
7264 -58948 10839 84184 54187 12070 32312 53446 48548 51338 29261 -23408 -59026 -110100
7252 -110100 -141073 -127042 -106173 -11887 50231 39628 11098 44374 19794 24667 7733 4982
7240 4982 -55746 -47123 204 25728 10839 -3648 -38653 -53668 -76807 -45705 -16349 -56274
7228e6274J8495O8233K2430k0650l335k7760p4735J1407R0616O4635J1318n4042
7216E0338k5915K8160J3969q1709l8543N0601P6855O539j2291l0161p7930K4014
7204a6073N1665k5663n8672q926N1833N6282K998Q040O425J266K6960m8514k531
7191D5090K3969l6777k643Q802j0591L278q3287l1343K0216L9048N736N837O523
7178f142q092k2084K6920j4616m2709P995M7558K2785P3928J3668j8286L102k6066
7165E7961q526m7221l0941P375J0710K5052L1743j6181K7562Q980m178M539m0346
7152B6529l5246J5434N9601k6629p1539J9216L3460M0743K0006q034j09357n8448
7140i4264N1010l5711j19O9634O3044P553n529j4643k1061K574M633J0173M9578
$$ plain form
7228 -56274 -37779 30454 52884 32234 28899 1139 -73596 -62189 28427 93062 104380 50338
7216 50338 24423 52583 66552 -15157 -53700 -3099 73756 80295 68004 37843 -40087 -16073
7204 -16073 35592 9929 -48743 -57669 -5836 50446 53444 61484 67909 69175 96135 47621 45090
7191 45090 69059 32282 29639 38441 27850 31128 -52159 -83502 -63286 -24238 -18502 -12665 -6142
7178 -6142 -14234 -36318 -9398 -24014 -66723 -58728 -11170 11615 85543 99211 80925 84027 57961
7165 57961 49435 2214 -28727 -21352 -10642 14410 46153 29972 57534 66514 62336 66875 26529
7152 26529 -8717 6717 66318 39689 -31850 -12634 20826 61569 81575 73541 -35816 -94264
7140 -94264 -43254 -78965 -79084 -9450 53594 61147 55618 40975 19914 22488 27121 37294 86872
7127H6872j3243l6743k2182j2892m0819o330O9966M4268M6610o1689p0468k1297
7115c7947K0198m5601o8946K540O9068K0918o7303R624K4203N5431P1559l0643
7103B3101k1487k656K5596o6124R143P416j1777O960M681j2394l3430J6488k5489
7090g9972k6820m4188M3895J04916j3836J2611L0919O8043m6393l1004K3575k32
7078D1514j5000M760k5707k4017K7518K3967l2356l5551l2929L7345j199M5753
7066A4098L607P9969J443k7211J8886k0705j6085l9572l7748q4988O067K019K0686
7053g9534k413M2105N598j5046j566p642M9154l669j8522P1553J3391l7768p4981
7040e9340l0423O8600L8111l762M04j0276L9475K247O749M9881Q233n6032k2339
$$ plain form
7127 86872 73629 36886 14704 1812 -39007 -45337 24629 68897 115507 53818 -16650 -37947
7115 -37947 -17749 -63350 -132296 -129756 -60688 -39770 -107073 -97449 -73246 -17815 53744 23101
7103 23101 1614 -1042 24554 -41570 -32427 -25011 -36788 -29828 -25147 -37541 -70971 -54483 -79972
7090 -79972 -106792 -150980 -107085 -2169 -16005 -3394 27525 95568 49175 18171 41746 41514
7078 41514 26514 31274 5567 -18450 9068 33035 679 -34872 -67801 -30456 -31655 14098
7066 14098 17705 97674 99117 71906 90792 70087 54002 14430 -23318 -108306 -102239 -100220 -79534
7053 -79534 -81947 -39842 -34244 -49290 -50856 -58498 -9344 -13013 -31535 40018 53409 15641 -59340
7040 -59340 -89763 -21163 16948 13186 13590 3314 42789 45036 51785 101666 109899 53867 31528
7027C1528K7357J9447L9595n3029k8136m7681l8820K2762L9618j6225o6904q983
7015g9471j9852N6875N5172j7405j8189o252L7035K7812m4908l5377l12P0604
7003B5732J2514p4135n2817J5629M9948r954P071l3979l3653Q740K9673j0174
6991f5405l8247Q812K3160l8036K2301k829J1291L2196L2593o0494j71J7348k1081
6978g8562L6272L1533k42J8653l9398r561K9712J1508N7133J7134j4598m1384
6966A8200M6845J4560l5853q419l735k7674K1736J785m490j9242o5946p9081L3990
6953a07324J06265K8975o0600J4553r822l8298K8373K1741N1469l0m6436J0589
6941e45q96k8066k9655J8632p5694R184L3312L1035N8981O6138J3704l6195k5867
$$ plain form
7027 31528 58885 78332 117927 64898 36762 -10919 -49739 -26977 12641 -3584 -70488 -79471
7015 -79471 -99323 -42448 12724 -4681 -22870 -29122 7913 35725 -9183 -44560 -44872 25732
7003 25732 38246 -35889 -88706 -73077 -23129 -33083 -26012 -59991 -93644 -84904 -55231 -65405
6991 -65405 -103652 -94840 -71680 -109716 -87415 -90244 -78953 -46757 -14164 -74658 -74829 -57481 -78562
6978 -78562 -42290 -10757 -10999 7654 -31744 -41305 -11593 -85 57048 74182 59584 18200
6966 18200 65045 79605 43752 35333 31598 3924 25660 27445 22955 3713 -62233 -141314 -107324
6953 -107324 -1059 27916 -32684 -18131 -27953 -66251 -37878 -16137 35332 35302 -11134 -545
6941 -545 -1441 -29507 -59162 -40530 -116224 -107040 -73728 -42693 16288 82426 96130 59935 34068
6928C4068R775L3986l1630m2787P547n649O4886J6084l0220o3022k4821j39l8568
6915g0490m7489M986Q8993P3773m4936o4665l0616L7024J5234l0384J700L1194
6903c5676m1142j7754L2053o029J6695J4875o9715k1038M8513j4535L5527l9393
6891i7619j9157O6036J8573J9616k754L5860k3807n3591N547j3289n1035J0858
6879a04762J3121J3112j4557K0127N1036L2903j9902p2305k0273J3540N6929j8968
6867d9999J6389J9782O248j9385M4728l136L7286l4534n2353O404K6545N8342
6855E6317M4762p0105k8586O3881K4048l4201j8923l9106l0769l9210L6211K1221
6843a4460P5875M2766J6894o502p1616k5650k3814k6536O6683L3974l1172k2690
$$ plain form
6928 34068 43843 77829 46199 3412 10959 5310 70196 86280 56060 -6962 -31783 -31922 -70490
6915 -70490 -117979 -112993 -24000 49773 4837 -59828 -90444 -53420 -38186 -68570 -66870 -35676
6903 -35676 -76818 -94572 -62519 -68548 -51853 -36978 -106693 -127731 -79218 -93753 -58226 -97619
6891 -97619 -116776 -50740 -32167 -12551 -15305 20555 -3252 -56843 -51296 -64585 -115620 -104762
6879 -104762 -91641 -78529 -93086 -72959 -21923 10980 -8922 -81227 -101500 -87960 -31031 -49999
6867 -49999 -33610 -13828 -7580 -26965 17763 14627 51913 17379 -34974 -28570 -2025 56317
6855 56317 101079 30974 2388 66269 90317 56116 37193 -1913 -32682 -71892 -35681 -14460
6843 -14460 61415 104181 121075 114573 42957 17307 -6507 -33043 33640 67614 36442 13752
6831A3752O182m3971o723l5180J8789N8060K3315p096P635o1965r045L8958P0319
6818G3030o5110l2156k8089j5718K4655K935J7460N1899L95p840M784o7645r321
6805e0721P2804k985j9299J2913l8088j1534j6642L4666K6411n6432k9679M5378
6793c3208J18857k5087j4888N799k2629m2231k8784J4110j5007K7683O293M5611
6781C6519m140r691l209n5250j4671N6853p915o5438J8682J03236l5405m3338
6769b3767J7593l7794J0348M4422l9332k9392k0128N068m477J2672n8262m5858
6757a68907J02878N0606J9059n5691J2646j477L2710K2720j4392k1374O423N556
6745i243J8199n589j7394m3881M2650J5287j1590j6889l4803L8289K0303o0703
$$ plain form
6831 13752 19934 -24037 -30760 -65940 -47151 10909 34224 27128 34763 -27202 -36247 2711 73030
6818 73030 7920 -24236 -52325 -68043 -43388 -40453 -22993 28906 29301 21461 26245 -41400 -50721
6805 -50721 22083 19098 -201 12712 -25376 -36910 -53552 -18886 7525 -48907 -78586 -33208
6793 -33208 85649 60562 45674 51473 28844 -13387 -42171 -28061 -43068 -15385 -9092 36519
6781 36519 32379 22688 19479 -35771 -50442 6411 -1504 -66942 -48260 54976 19571 -23767
6769 -23767 -6174 -43968 -33620 10802 -28530 -57922 -78050 -72982 -77459 -64787 -123049 -168907
6757 -168907 -66029 -15423 3636 -52055 -39409 -40886 -8176 14544 152 -21222 -14799 -9243
6745 -9243 8956 3367 -14027 -57908 -15258 29 -11561 -28450 -63253 -24964 -4661 -65364
6733f5364j3734l5078K6398L0154N3452m7809m7086j292J5745N505M4178N2150
6721A7219J0607o1950n1756M3821M0937J1041q37l8478L2209P593L314O460L579
6708B3759l4269n7812l4976K6078K6833l68M2392M9691k8382j4679L1320n6034
6696b6447j610l7090j382k3480O307N2216r1046q6727M6302k3530K9114M0109
6684a17264R2634M0969k7501N818k8023k1517k5945J4066n360L3976M8518j6537
6672f166n4684p896K816P552K6953Q066j9966j1217m9499l8980M7991N3177K7503
6659a4350j6074q9154o2970P8243O7714j3458K310K7941R587j0910j9614j9527
6647f0262P415k3525K5248L463l8820K414Q2082l015m2504k6187K7216L8327J2546
$$ plain form
6733 -65364 -79098 -114176 -87778 -57624 -4172 -51981 -99067 -100359 -84614 -79109 -34931 17219
6721 17219 27826 -34124 -85880 -42059 -1122 9919 9082 -29396 2813 10406 13720 20180 23759
6708 23759 -10510 -68322 -103298 -77220 -50387 -50755 -8363 41328 12946 -1733 29587 -26447
6696 -26447 -28057 -65147 -66529 -90009 -83702 -31486 -122532 -209259 -162957 -186487 -157373 -117264
6684 -117264 -24630 16339 -11162 -5344 -33367 -54884 -80829 -66763 -72123 -38147 10371 -6166
6672 -6166 -60850 -68746 -65930 -58378 -31425 -23359 -43325 -54542 -104041 -143021 -95030 -41853 -14350
6659 -14350 -30424 -119578 -182548 -104305 -36591 -50049 -47739 -19798 -10211 -21121 -40735 -60262
6647 -60262 -52847 -76372 -51124 -47661 -86481 -84067 -1985 -5000 -47504 -73691 -46475 -8148 4398
6634D398J3807k9151n348m7116L40J6111J0640P1689p3784q6131l8723J02043
6622f1225L3188j9235K9553N5633l5981m175n6106N1585K7875K21l562L1658P323
6609E6752j0895L6426l2296j042R8354n0391j29607J5503P5361k8864o9219o6402
6597a06320L5128J1827j2624N6890J734j22547o1447L0534P1810k8345K4187J6711
6585h2462j40m1940P6972J1418Q301J3162j4603J3879J244j4170k2678L5603k170
6572a7584J7663M1897K7516q222j7684j5964k4268J8214K0676l8451J2834L011
6560A9638K7268j907o3701n900L2596q430n9131n5665k3062L8567M1023n0693
6548a09397J1064R3419P8001l9524r3317m694l6702K0680K3766N4572J1525j4560
$$ plain form
6634 4398 18205 -10946 -16294 -63410 -63070 -46959 -36319 35370 -38414 -124545 -163268 -61225
6622 -61225 -28037 -47272 -17719 37914 1933 -2242 -58348 -6763 21112 21333 17771 49429 56752
6609 56752 45857 82283 49987 48945 147299 96908 -32699 -17196 58165 29301 -39918 -106320
6597 -106320 -71192 -59365 -71989 -15099 -13365 -135912 -197359 -166825 -95015 -123360 -99173 -82462
6585 -82462 -82602 -124542 -47570 -36152 -27851 -14689 -29292 -15413 -14169 -28339 -51017 -15414 -17584
6572 -17584 79 41976 69492 61270 43586 27622 3354 21568 42244 3793 16627 19638
6560 19638 46906 44999 -18702 -24602 7994 -436 -59567 -115232 -138294 -99727 -58704 -109397
6548 -109397 -98333 -4914 73087 33563 -59754 -64448 -101150 -80470 -56704 -2132 9393 -5167
6536e167N2790J1220j6154R20K1904K9826M2324o0199k9499m4629o3021j4920
6524g4605M9768K6811l2203O9022k3032m2659m2420l986J1746M7115L2201k6478
6512h720j8872J8306N4206M069j3513L2149N3877l4311j0826k5809k776j2430
6500C5350j8873L3326K9221K1897n1652n6965k018k1874L6262L6950L7178o4889
6488A3913n9663k6211N12k0804P518m3692K6032j9885O4889M4169k5012P582L6174
6475E522L6331k0645l6539p016O6674N3819m670l9694l8763o590M397J1521j5664
6462H683J5721n8950j7464J2973M6546j2963K5166K0746o0708m3229L1170R741
6450b2568Q015O199L0230P026l7109J946Q304k9591K6406N487j6268K0166L1867
$$ plain form
6536 -5167 47623 58843 42689 43609 65513 95339 137663 77464 47965 3336 -59685 -74605
6524 -74605 -24837 1974 -30229 38793 15761 -26898 -69318 -73304 -61558 -14443 17758 -8720
6512 -8720 -27592 -9286 44920 48989 35476 67625 121502 87191 76365 50556 47780 35350
6500 35350 16477 49803 79024 100921 49269 -7696 -9714 -31588 4674 41624 78802 13913
6488 13913 -45750 -71961 -71449 -92253 -84735 -128427 -102395 -122280 -57391 -13222 -38234 -30652 5522
6475 5522 41853 21208 -15331 -22347 44327 98146 93476 53782 15019 8429 12826 24347 8683
6462 8683 24404 -34546 -52010 -39037 7509 -5454 19712 40458 -20250 -63479 -32309 -22568
6450 -22568 -14553 -8354 21876 28902 -8207 -6261 2043 -27548 -1142 4345 -11923 8243 40110
6437D0110l655r14L286n2985k807l9722l2255K1876J3390N5662k9675L40J783
6424b5566l6522m3J5943k1261K7792M0781m1671p6605J2393O3269R269k8025m4053
6411a04299Q0699Q2275j3045j3811J403L7726j7501K1618J1426K1446k6295k1412
6399F0230j994J0931L0501P693k4157p005K4421j8782m4466p7672k5818J0861
6387e5257N1935P5893j1083Q391l6018q4188j2803Q898K2636M0454L2570p800
6375C3628K7893j0959p205k5141l2254j3290O9340o958k9691M089n773Q912l3962
6362b1371R082M2325M1225j9531n2101Q14J7595K4761j1166o0324M7771L5651
6350E4731m5597n5461J9525K453n9816L4507K0947K497J3862n0873l8701m3426
$$ plain form
6437 40110 36455 35541 38827 -14158 -16965 -56687 -88942 -67066 -53676 1986 -27689 -27349 -25566
6424 -25566 -62088 -62131 -46188 -67449 -39657 1124 -40547 -117152 -104759 -41490 -32221 -60246 -104299
6411 -104299 -23600 58675 45630 31819 33222 70948 53447 75065 86491 107937 81642 60230
6399 60230 58236 69167 99668 107361 83204 76199 100620 81838 37372 -40300 -66118 -55257
6387 -55257 -3322 72571 61488 69879 33861 -50327 -63130 -54232 -31596 8858 41428 33628
6375 33628 61521 50562 43357 18216 -14038 -27328 42012 35054 5363 9452 3679 12591 -21371
6362 -21371 -12289 30036 71261 51730 -371 443 18038 42799 31633 -28691 19080 54731
6350 54731 9134 -46327 -26802 -24349 -84165 -49658 -28711 -26214 -12352 -63225 -101926 -145352
6338a45352J6894R0165J4727K524Q8218j311n4573k4280N3148K3204l8593J7665
6326D2436l5927l7795j9716M6486j3871k925j5731l6808M538k5260n2910K1366
6314a26117L2684L6841j0600R53O5416L4598k4295K6572o3425r91j6012k3375
6302f7751j4978k5331M1387R4672m6307k4950j3612k6101j8062j4857K0966P8244
6290a6680L7691L615k43j0103o1332k0934J5052K4888L3269n4946J4710L8888
6278C875n439k7142k9348K5026K265j1257j02453L081Q393n639J3891o4547k9259
6265b18553M7419R054j3264N91l195M0570N2930P881m3124N6361M2237K2671k0783
6252a9205l6236m6892J2428P575o3899Q698Q2322M9373O5636J5261m5300m326
$$ plain form
6338 -145352 -128458 -38293 -23566 -21042 67176 65865 11292 -12988 40160 63364 24771 42436
6326 42436 6509 -31286 -51002 -4516 -18387 -21312 -37043 -73851 -69313 -94573 -147483 -126117
6314 -126117 -93433 -56592 -67192 -66239 -823 33775 9480 36052 -27373 -28364 -44376 -67751
6302 -67751 -82729 -108060 -66673 27999 -18308 -43258 -56870 -82971 -101033 -115890 -94924 -16680
6290 -16680 21011 24626 24383 14280 -47052 -67986 -52934 -28046 5223 -49723 -35013 3875
6278 3875 -1564 -28706 -58054 -33028 -30763 -42020 -144473 -141392 -132999 -138638 -124747 -189294 -218553
6265 -218553 -171134 -162080 -175344 -174753 -177948 -137378 -84448 -76567 -119691 -63330 -21093 1578 -19205
6252 -19205 -55441 -102333 -89905 -82330 -146229 -137531 -55209 -5836 59800 75061 29761 25435
6240B5435P1804M1237o8533n2692o270j0912p443N6277q383m4114K1987M9138
6228F7531j8867q1074J4365n8708l8471k0713J9583O1405M443J3528L6373L9040
6216C8435j5900L902r308L4205J4076n8012k7415l2384o2633J7699k4045j5116
6204a36496M0357L4493l1049J5492L3235L5200k0452r610J3777K4097m2277M27
6192d2806K271M5156n1663m0943K1584m299L441j6872J5026K9572L5380n6588
6180f0741l4464L6347L7582l5972Q472L098l5677J2315O2006j7542m3381P4093
6168F136L7251k4111m388j2845M1482J7302O989J1397K4684k5369r7745K6384
6156G167L2590p4004J4944L7012p916q0100P223j9871K6566O6012K3133l0106
$$ plain form
6240 25435 97239 138476 69943 17251 10981 69 -7374 48903 40520 -3594 18393 67531
6228 67531 48664 -32410 -18045 -76753 -115224 -135937 -116354 -54949 -50506 -36978 -605 38435
6216 38435 22535 26437 17129 51334 65410 7398 -20017 -52401 -115034 -97335 -121380 -136496
6204 -136496 -96139 -61646 -92695 -77203 -43968 -8768 -29220 -38830 -25053 -956 -43233 -42806
6192 -42806 -40535 4621 -47042 -87985 -66401 -70700 -67259 -84131 -69105 -39533 -4153 -60741
6180 -60741 -95205 -58858 -21276 -57248 -48776 -45678 -81355 -69040 -7034 -24576 -67957 6136
6168 6136 43387 19276 14888 2043 43525 60827 67816 79213 103897 78528 -19217 7167
6156 7167 39757 -34247 -19303 17709 9793 -70307 -63084 -82955 -56389 9623 32756 2650
6144B650n7829N2366J006o5765J0864K8644L0992j172l9553J8651N3836J127l8616
6131b799K338K9151l6784o0274l981J5440M3774j8585O8420K3595j4184R01l3620
6118A3392l3374n4364R851R830l253L2258N768l3888k2664k8530K0669K7339O1865
6105D899Q1662k6136j3240M762N1176K4007K2919j13208n3130P8777q290n5896
6093a698k4021J8976k1647o54K4514k0056R910M3789n0747K3650j0461m6802j385
6080e6632K0925J821j0983O163K4456O3853k5755l1551L4911j5366l7688k8631
6068e4477P8488J328j9562m3906K8838k310k0480m523J6002l8490Q171K8334O1823
6055C9236j6267o4602O133k2967L2737L4083O9323J3766l2495K3172O652k2306
$$ plain form
6144 2650 -55179 -2813 -1807 -67572 -56708 -28064 2928 1756 -37797 -19146 34690 35817 -2799
6131 -2799 -461 28690 -8094 -68368 -72349 -56909 -13135 -31720 36700 60295 46111 47012 13392
6118 13392 -19982 -74346 -64495 -54665 -57918 -25660 -19892 -53780 -76444 -104974 -84305 -56966 4899
6105 4899 86561 60425 47185 51947 103123 127130 150049 36841 -16289 62488 54198 -1698
6093 -1698 -25719 -6743 -28390 -29044 -4530 -24586 -14676 29113 -21634 2016 -8445 -55247 -56632
6080 -56632 -35707 -33886 -44869 -38706 -14250 49603 23848 -7703 27208 11842 -25846 -54477
6068 -54477 24011 25339 5777 -38129 -9291 -11601 -32081 -36604 -20602 -59092 -50921 -22587 39236
6055 39236 22969 -41633 -35500 -58467 -25730 8353 77676 91442 58947 82119 88771 66465
6043F6465N058o4133k5896j9455l3875K8499J6165o081j4167l9192J9712j983
6031f8883k2197M7406K3845M9049L8214l5422k6524j6095P4644K7745n6844k3407
6019A1531j7269n6263j1058l4261p655K1216L9737l2719n2641M9148N1882n1823
6007i0175p0406L5278p783p184N0952P7332L3023k6471o5289M4697M3968n7065
5995c9123J1252Q890K2770M9945l0684k2469L3453K2200n430l2102j6010j5043
5983a2351J6357J2832l866j9775j8741p193N7194O652K6797j1731k0200o5390
5971c9415n016j1897J7507M8151j3134o5835l6941K2476L9728J7577m7409m3635
5959a17843k6099N6329O8096L840l4014j3443M0597q438K981M0504J3086M3135
$$ plain form
6043 66465 71523 7390 -18506 -37961 -71836 -43337 -27172 -33253 -47420 -86612 -66900 -68883
6031 -68883 -91080 -43674 -19829 29220 67434 32012 5488 -10607 64037 91782 34938 11531
6019 11531 -5738 -62001 -73059 -107320 -114975 -93759 -54022 -86741 -139382 -90234 -38352 -90175
6007 -90175 -160581 -125303 -133086 -140270 -89318 -11986 21037 -5434 -70723 -26026 17942 -39123
5995 -39123 -27871 -18981 3789 53734 23050 581 34034 56234 50804 18702 2692 -12351
5983 -12351 4006 16838 12972 -6803 -25544 -32737 24457 31109 57906 46175 25975 -39415
5971 -39415 -44431 -56328 -38821 9330 -3804 -69639 -106580 -84104 -44376 -26799 -74208 -117843
5959 -117843 -143942 -87613 -19517 -15677 -49691 -63134 -22537 -30975 -27994 12510 25596 68731
5947F8731n442m0098J6960J160q0514o2776O1714Q4614L6874M772p004r698q3214
5934a3921o5783l5043P537K0810K7629J3131o8091k7281K9551J7955K7289k9082
5922i5299m627M2531K0439j3807l7601l789L1574J4675M301J6123R842p059M2166
5909A9469n6210m377N5221p955j2242J9327M8944Q7900n7542j36644n1268l0952
5897a26329J3025J4102r137k432M6090K1001k1167P3846J1147j3522J1133J8183
5885C5940m5201q646K8527k7674K975p784M9243N620o9619l455M0571m9969j9464
5872f8936N3570m8001k2503M4710J8015n138J2830n0706j7618P6516Q2188l2185
5860D2742J4104j3681n4909j0527j4043m3481J5953O2990j7858k2027P223L4595
$$ plain form
5947 68731 63289 23191 40151 41311 -39203 -101979 -40265 44349 81223 85995 78991 69293 -13921
5934 -13921 -79704 -114747 -107210 -86400 -58771 -45640 -113731 -141012 -111461 -93506 -66217 -95299
5922 -95299 -99926 -57395 -36956 -50763 -88364 -92153 -60579 -45904 -41603 -25480 -15638 -22697 19469
5909 19469 -36741 -41118 14103 6148 -6094 13233 62177 150077 92535 -44109 -95377 -126329
5897 -126329 -113304 -99202 -108339 -110771 -64681 -43680 -64847 8999 20146 6624 17757 35940
5885 35940 -9261 -17907 10620 -17054 -14079 -21863 27380 33000 -36619 -40074 497 -49472 -68936
5872 -68936 -15366 -63367 -85870 -41160 -23145 -28283 -15453 -66159 -83777 -7261 74927 42742
5860 42742 56846 43165 -11744 -22271 -36314 -79795 -63842 -852 -18710 -40737 -33514 1081
5848A081J993o3226n7167m0254j1685M2004J3488J9789O2361J9654n3041P402
5836e7601P624l887N703j5875L5661K9560K9676j4724l4586m499k1478k0987J5901
5823d9512J8773J6243J6632J4380l2094J447k3892j6687K4785l6174K7096M6591
5811G588l696K5506k7570p452J205O673K4397j3954j417o7691j4522J8365M416
5798d8152M875j618K8861K8171K1268q387L6886O227q1937m0313K4057k0993K3218
5785b7837O5760o488l5249k1812J3570O6343J5155m9830m7198j6279L6658L6189
5773B8982j9799q4442p929K4727N7332L069j8640j5799l4284j6222L8411K9585
5761a5009L7062L841k7498L122k389m5398j9272L0781m5312J6653K294m5897J8137
$$ plain form
5848 1081 3074 -60152 -117319 -157573 -169258 -127254 -113766 -93977 -31616 -11962 -65003 -57601
5836 -57601 -49977 -53864 -48161 -64036 -28375 1185 30861 16137 -18449 -22948 -44426 -65413 -49512
5823 -49512 -30739 -14496 2136 16516 -15578 -14131 -38023 -54710 -29925 -66099 -39003 7588
5811 7588 3892 29398 1828 -5624 -4419 2254 26651 12697 11280 -56411 -70933 -52568 -48152
5798 -48152 -43277 -44895 -16034 12137 33405 25018 61904 68131 -13806 -54119 -30062 -51055 -27837
5785 -27837 37923 31435 -3814 -25626 -12056 54287 69442 19612 -27586 -43865 -7207 28982
5773 28982 9183 -75259 -83188 -58461 -1129 1940 -16700 -32499 -66783 -83005 -44594 -15009
5761 -15009 22053 25894 -1604 1518 -871 -46269 -65541 -34760 -80072 -63419 -61125 -107022 -88885
5748h8885o748j0846K2614J6030P3738M3465k4965k2979j7431K4600k0297j1636
5736b3340J672L5132m7742m7932M1928L3361j9490J4121K064m8086K0230L8156
5724G4L6596J0678n3800j7420m3480L8321K9146m2524n1985K6535O8781K8042
5712B8964r441m3211p2720j2783P8880M4661k9604J8265K4987M1893n279m6280
5700A8332m9471P803M7026j1931n7640l469j3237J8469M837N1984Q161k1159m4840
5687d5135k2269K3017R3339N8109k2258l4473k4533l4869q6080M254M1047J683
5675d8168J0338N465J1289o669O833J5265N3158j0082j4271p711p5926K515L3880
5662b4084p013k7445Q990K8582j177j276o430K0338m6865k6499N7488K5430K0692
$$ plain form
5748 -88885 -95633 -106479 -83865 -67835 5903 49368 24403 1424 -16007 8593 -11704 -23340
5736 -23340 -21668 13464 -34278 -82210 -40282 -6921 -26411 -12290 -10226 -58312 -38082 74
5724 74 36670 47348 -6452 -23872 -67352 -29031 115 -42409 -94394 -67859 922 28964
5712 28964 19523 -23688 -96408 -109191 -30311 14350 -15254 3011 27998 69891 64612 18332
5700 18332 -31139 -23336 23690 11759 -45881 -49350 -62587 -44118 -39281 12703 20864 -295 -45135
5687 -45135 -67404 -44387 48952 107061 84803 50330 25797 -9072 -95152 -90898 -49851 -48168
5675 -48168 -37830 -32365 -21076 -27745 -20912 -5647 47511 37429 23158 15447 -60479 -57964 -24084
5662 -24084 -31097 -58542 -49552 -20970 -22147 -23423 -29853 -9515 -56380 -82879 -25391 39 20731
5649B0731m3749l1671j8168j5428q806J0197J0487J1152J7593M4514m3097Q715
5637c7530j1628N3462M6516L424l2305j6n8621o2289J9600m0119J3525P9508p185
5624c3658K2665L7790K5615m9009m0748j1009M853K2167k4287m0559O8728J0482
5612f970p15q710J4425m0515J0729k5474K3479j1516K14j2752m036Q1K9194Q239
5598b4327K7342j356j5356L458L4567p847k554K6907L075j2093m2035j2078Q263
5585a4034j8822q41n703P94L795J0345l0300l9324N5103O2946M1965J6506l5728
5572D6702J1247l2059j4457n030j084L8627L046n2232j7674j0670L853J6468J6813
5559C550n035k9078l1049j2273M855Q55j5621Q2401K9364n5273q3395k7617m714
$$ plain form
5649 20731 -23018 -54689 -72857 -88285 -97091 -86894 -76407 -65255 -47662 -3148 -46245 -37530
5637 -37530 -49158 4304 50820 54244 21939 21923 -36698 -98987 -79387 -119506 -105981 -26473 -33658
5624 -33658 -10993 26797 52412 3403 -37345 -48354 -43501 -21334 -45621 -86180 -17452 -6970
5612 -6970 -7685 -16395 -1970 -42485 -31756 -57230 -33751 -45267 -45053 -57805 -61841 -61760 -32566 -24327
5598 -24327 3015 1659 -13697 -10239 24328 16481 13927 40834 43909 31816 -10219 -22297 -14034
5585 -14034 -32856 -33697 -39400 -38606 -34811 -24466 -54766 -94090 -38987 23959 65924 82430 46702
5572 46702 57949 25890 11433 6403 5319 43946 46992 -5240 -22914 -33584 -29731 -13263 3550
5559 3550 -1485 -30563 -61612 -73885 -69030 -68175 -83796 -1395 27969 -27304 -110699 -138316 -143030
5546a43030L6494N2425Q9479j3650J3561J7212K7451p631n66m5704l4725k4776
5534c3460l6918m1282M2701M1512N8105j8656m4875J1398m2050L4475l134K90
5522c1894K0802q523M6170L483r680k458p252J8124j0263r307l290K1798M1951
5509F9661k9956l589k9573n7005n394j9179j9745K6742L3424J3014o6044r768
5497i7412k8272N4131L3153j5925M2606j6384k3148O6186J1872j3606l2124P156
5485a1767l8037m117r277L3956J6171m6721J6554j6314R823O225O521L7860L6164
5472C7041o3370K928J084L3081K8725J9287J9952J6854M3704o784q1070l2844
5460A8588O417q039j2334l8484n3344n2832l1519r314M0960R4110J00644M384
$$ plain form
5546 -143030 -106536 -54111 35368 21718 35279 52491 79942 72311 71745 26041 -8684 -33460
5534 -33460 -70378 -111660 -68959 -27447 30658 12002 -32873 -21475 -63525 -29050 -32184 -31894
5522 -31894 -11092 -19615 26555 30038 20358 17900 10648 28772 18509 9202 5912 27710 69661
5509 69661 39705 36116 6543 -50462 -55856 -75035 -94780 -68038 -34614 -21600 -87644 -97412
5497 -97412 -125684 -71553 -38400 -54325 -11719 -28103 -51251 14935 26807 13201 -18923 -11767
5485 -11767 -49804 -53921 -63198 -29242 -13071 -59792 -43238 -59552 -49729 -43504 -36983 877 37041
5472 37041 -26329 -23401 -22317 10764 39489 58776 78728 95582 139286 132502 51432 18588
5460 18588 25005 16966 4632 -33852 -87196 -140028 -171547 -180861 -139901 -45791 54853 59237
5448E9237k9547n9977J4857K7564m487k772L2508K8982o0032q1885M2211k2756
5436e6097m8532k660N1056L8013J121Q6417K4949q7763m2577n3191l5196M4817
5424g9643N4381k3385K4887N1392J2187q140k4333L2394P829l0304J6978m0467
5412f224O254p6263K884j4615J5941N1912l2719k1068M3805l816K176k8602l5344
5399i5679K900L4043r928j35K5314J4329m0796j4426l8577J1805P1996K3453J2787
5386b914K9881l108J3645k734l4409l6197n0567J8534K6621J2474M6299j5502
5374B023j3126L0196J7846j974Q485j3463R169K0362k9940p4708J5679N3287J4765
5361C8601J942J3589L3495L2256m231m8682o0148J7229K1493M417l3190j7595
$$ plain form
5448 59237 29690 -30287 -15430 12134 7647 4875 37383 66365 6333 -75552 -33341 -56097
5436 -56097 -104629 -107289 -56233 -18220 -17099 69318 94267 6504 -36073 -89264 -124460 -79643
5424 -79643 -25262 -48647 -23760 27632 39819 31679 7346 39740 47569 17265 34243 -6224
5412 -6224 30 -76233 -73349 -87964 -72023 -20111 -52830 -73898 -30093 -33909 -31733 -60335 -95679
5399 -95679 -92779 -58736 -68664 -68799 -43485 -29156 -69952 -84378 -122955 -111150 -39154 -15701 -2914
5386 -2914 26967 23859 37504 34770 361 -35836 -86403 -67869 -41248 -28774 17525 2023
5374 2023 -11103 19093 36939 34965 43450 29987 39156 59518 29578 -45130 -29451 23836 38601
5361 38601 40543 54132 87627 119883 115652 66970 6822 24051 45544 49961 16771 -824
5349h24L5510J2729l9348k6789m583j87q4j5157n080k65J6353L5918l3804m1840
5335f7451o257M1156K9464m0004l7357k1979J5870q809p494J1200M5810P2989
5323B7138J4834m4566j2161k4681P505P238M5051k1374l4375k6396M585P512J1975
5310c7715J8846o601L9002L576l1324l158N3353L5671k4620r1193m1146j0281
5298i5590Q2259K8271q385j8966q071j4926P719N170q486j118k4402j3509J49
5285f9885K5089P4438P993l4397L1389p087l5811M3254m0485k2627Q197J8679
5273a253J021M8440J6376m3480o4024m7422K6182K2517l5111q538J6223Q635P128
5260e3306m531K7047K0117l1368J8219K024j2675l9309l0897L4095J6860K9930
$$ plain form
5349 -824 34686 47415 8067 -18722 -23305 -23492 -23576 -38733 -43813 -44078 -27725 8193 -25611 -67451
5335 -67451 -73708 -32552 -3088 -43092 -80449 -102428 -86558 -95367 -102861 -91661 -45851 27138
5323 27138 41972 -2594 -14755 -39436 -31931 -24693 20358 -1016 -35391 -61787 -57202 -49690 -37715
5310 -37715 -18869 -25470 13532 17108 -14216 -17374 35979 71650 47030 -44163 -85309 -95590
5298 -95590 -13331 14940 6555 -12411 -20482 -35408 -27689 -22519 -31005 -32123 -56525 -70034 -69885
5285 -69885 -44796 29642 37635 3238 34627 27540 -8271 34983 -5502 -28129 -19932 -1253
5273 -1253 -232 48208 64584 21104 -42920 -90342 -64160 -41643 -76754 -85292 -69069 -60434 -53306
5260 -53306 -57837 -30790 -10673 -42041 -23822 -21798 -34473 -73782 -104679 -70584 -53724 -23794
5248b3794k3714l2843m382Q040J707M1415L5376M7281L78n0606n3873p975k0319
5235h3309l7334l7355N2352J7628L7747M0958k2778l6337J2200N0185n920J641
5223a0322r8509l3674P9825L0786l2881l5863L4715K040j2920J8784M5655N7415
5211D5051M767j7255j9843k6729j8282m4822J4770q066M3538R9199L5031o4354
5199D3005o2387j8601p605N219J0831K0986k2715k1583J7484N9794j4930j3956
5187d458m7922j5926j245k5390L9540K5953Q920j1153j2552L7193J887m6586k8387
5174h0126j326Q407L29j2072k458O5941n631j0904L6376J744L1917j2585L2958
5161E2570j1671m8584l5748M858J0675L9728q202J555j6413j562K3578j8428O1105
$$ plain form
5248 -23794 -47508 -80351 -84733 -76693 -74986 -33571 1805 49086 49464 -1142 -55015 -62990 -83309
5235 -83309 -120643 -157998 -105646 -88018 -50271 -9313 -32091 -68428 -56228 -6043 -11963 -10322
5223 -10322 -108831 -142505 -62680 -31894 -64775 -100638 -65923 -63883 -76803 -58019 -12364 45051
5211 45051 49818 32563 12720 -14009 -32291 -77113 -62343 -70409 -26871 72328 107359 43005
5199 43005 -19382 -37983 -45588 -40369 -29538 -8552 -31267 -52850 -35366 24428 9498 -4458
5187 -4458 -52380 -68306 -69551 -94941 -55401 -29448 -20528 -31681 -44233 -7040 -5153 -51739 -80126
5174 -80126 -81452 -73045 -72716 -84788 -87246 -21305 -26936 -37840 -1464 280 32197 19612 52570
5161 52570 40899 -7685 -43433 -38575 -27900 11828 3626 5181 -11232 -12794 10784 -7644 53461
5148E3461J8203l2157Q147o437k5594K4388J7454K3720m6274j0584m4365l0199
5136e0237Q280j1436R422L788n3667R668J1861L8842M4049L073m0775M5405j6539
5123A734l5178j9263k8696R668j1384m244N6328J6729M9454q0915n474M5098k47
5110f390K3924p402j9535j4517R135j2739K0867J7912k7057l1604Q374j2196M3229
5097g999M2297l904K4525j8983q20p005p1862n2028Q1493K2277J32M943l1386
5084a8320L6179L4672r413n0334n430M332l2671M487N007k7214J6556j3410M5720
5071i839N7415k6l0023J7767N0810j9081m3866R606j0969j4313j3615P3697M6909
5058A14472q5259p7198J6997l414k0113j0544K9429l314q1l773m9285m7019Q393
$$ plain form
5148 53461 71664 39507 47654 41217 15623 40011 57465 81185 34911 24327 -20038 -50237
5136 -50237 -41957 -53393 -43971 -40183 -93850 -84182 -72321 -33479 10570 13643 -27132 18273 1734
5123 1734 -33444 -52707 -81403 -71735 -83119 -87363 -31035 -14306 35148 -45767 -51241 -6143 -6390
5110 -6390 17534 10132 -9403 -23920 -14785 -27524 -6657 11255 -15802 -47406 -39032 -51228 -7999
5097 -7999 34298 30394 54919 35936 35116 28111 -43751 -95779 -14286 7991 8123 13066 -18320
5084 -18320 17859 52531 43118 -7216 -12646 -8314 -40985 -36498 -31491 -58705 -42149 -55559 -9839
5071 -9839 47576 47550 17527 35294 86104 67023 23157 32763 21794 7481 -6134 67563 114472
5058 114472 29213 -47985 -30988 -34402 -54515 -65059 -35630 -38944 -39025 -42798 -92083 -139102 -130709
5045a30709Q5607O7118J4364k4899j7361m9879l0972k3009M3779k829l2892O9953
5033c1729M6822p4702p1034L2447O4448J6507k4822J7727O1872n907n383m827
5021B1419n9682k0250l952J6924M949o94k9930l9700J7712L8135l6432l9613N2091
5008g9023M7004j4086M603L3015K0358Q140N8598K229J2570J9092n9234m4494
4996H772k3145N8610L5653M5762n6542q4748n1928o785J5539p840K0118n429m9607
4983a01570J3742r154o173J038J3044L2598O7034l6100q7758K5721K9622L1617
4971b6339L5166r400m0127M20J0881L0928J0541J9955j2620R358N1405m1046l4141
4958D981m6909j5885J5225L9910k581l8928m2992N7102q467o8606n9471k8258
$$ plain form
5045 -130709 -45102 22016 36380 11481 -5880 -55759 -86731 -109740 -65961 -68790 -101682 -31729
5033 -31729 15093 -59609 -130643 -98196 -33748 -17241 -42063 -24336 37536 31629 26246 21419
5021 21419 -38263 -58513 -62465 -45541 -40592 -41286 -71216 -110916 -93204 -55069 -91501 -131114 -79023
5008 -79023 -32019 -46105 -41502 -8487 11871 20011 78609 80838 93408 112500 53266 8772
4996 8772 -14373 44237 79890 125652 69110 -15638 -67566 -74351 -58812 -66652 -46534 -51963 -101570
4983 -101570 -87828 -96982 -103155 -102117 -89073 -56475 10559 -25541 -113299 -87578 -57956 -26339
4971 -26339 8827 -573 -40700 -40280 -29399 1529 12070 32025 19405 28763 80168 39122 4981
4958 4981 -41928 -57813 -42588 -2678 -5259 -44187 -87179 -30077 -38544 -107150 -166621 -194879
4946a94879K9492R0969P9682N9121k2262k3938k3586l1530k8389k5651J8253N1467
4934b1251k1911j7170J0214p9857L5835L0467L0273K6212k2508j8345K4846J0701
4922a2494K0296k054n0146j265L3537K6603n0937l6410k4364L7959J4554l2974
4910g7695K5697J406p9320n023L831j1600l2225K0236O1887L8473L8554L9592
4898B3813n102k2135n0280m7380K4838L9916n393k225j1115K1223k8797K0231
4886d2406j8058j4611K330N5980M6172j8444m438k0517M8638R0449N468r8669
4874C1894l8398j6725l7795M426J1574j4294L6715K4546J9275l7410m149o964
4862b7305Q388M0734p217m7580j7666N9445N26k540J2540l908O933l1183J345
$$ plain form
4946 -194879 -165387 -74418 5264 64385 42123 18185 -5401 -36931 -65320 -90971 -72718 -21251
4934 -21251 -43162 -60332 -50118 -129975 -94140 -63673 -33400 -7188 -29696 -48041 -23195 -12494
4922 -12494 7802 5748 -44398 -45663 -12126 14477 -36460 -72870 -97234 -59275 -44721 -77695
4910 -77695 -51998 -50592 -129912 -134935 -131104 -142704 -174929 -154693 -92806 -54333 -15779 23813
4898 23813 18711 -3424 -53704 -101084 -76246 -36330 -41723 -43948 -55063 -33840 -62637 -42406
4886 -42406 -60464 -75075 -72745 -16765 29407 10963 6525 -13992 34646 125095 130563 31894
4874 31894 -6504 -23229 -61024 -56598 -45024 -59318 -22603 1943 21218 -16192 -20341 -27305
4862 -27305 -18917 21817 14600 -32980 -50646 8799 9325 6785 19325 15417 22350 -8833 -7488
4849g488j1899Q37K2466n4224j8172N4024L7767Q2378M2182l3658m1269J7675
4837I0619n4223n6292L0595K2742J5291j2220J8203n223p3545k2063J1626L7482
4825B992J1030k165K185K7607j8119n5553K0212l6555n7124j7063O0395L9606
4813b2552L733k3742L5949K6949m7451o5019k5621O9706k5041O076N0684J993
4801a4336O24L505N4923j8822Q524K4368l8866m9761J5352M3039Q22k5350M044
$$ plain form
4849 -7488 -19387 -18550 3916 -50308 -68480 -14456 23311 105689 147871 114213 72944 90619
4837 90619 36396 -19896 10699 33441 48732 36512 54715 49492 -24053 -46116 -34490 2992
4825 2992 14022 11857 14042 41649 23530 -32023 -11811 -48366 -105490 -122553 -62158 -22552
4813 -22552 -18819 -42561 -6612 20337 -27114 -92133 -117754 -48048 -73089 -67013 -16329 -14336
4801 -14336 -13712 -10207 44716 25894 34418 58786 19920 -29841 -14489 28550 29372 4022 8066
$$ [...]
##END NTUPLES=NMR SPECTRUM
##END=
