##TITLE=XTC-1693_2
##JCAMPDX= 6.0         $$ Bruker NMR JCAMP-DX V2.0
##DATA TYPE= nD NMR SPECTRUM
##DATA CLASS= NTUPLES
##NUM DIM= 2
##ORIGIN= BRUKER
##OWNER= patiny
$$ 1.79 TOPSPIN		Version 3.0
$$ 2012-05-20 12:36:23.053 +0200  patiny@icmbsg005
$$ Compression mode = diff/dup
##.OBSERVE FREQUENCY= 400.131585362325
##.OBSERVE NUCLEUS= ^1H
##.ACQUISITION MODE= SIMULTANEOUS (DQD)
##.ACQUISITION SCHEME= Echo-Antiecho
##.AVERAGES= 4
##.DIGITISER RES= 23
##SPECTROMETER/DATA SYSTEM= spect
##.PULSE SEQUENCE= hmbcetgpl3nd
##.SOLVENT NAME= D2O
##.SHIFT REFERENCE= INTERNAL, D2O, 1, 7.267922
##AUDIT TRAIL= $$ (NUMBER, WHEN, WHO, WHERE, PROCESS, VERSION, WHAT)
$$ ##TITLE= Audit trail, TOPSPIN		Version 3.0
$$ ##JCAMPDX= 5.01
$$ ##ORIGIN= Bruker BioSpin GmbH
$$ ##OWNER= patiny
$$ $$ /opt/data/patiny/nmr/XTC-1693_2/14/pdata/1/auditp.txt
$$ ##AUDIT TRAIL=  $$ (NUMBER, WHEN, WHO, WHERE, PROCESS, VERSION, WHAT)
(   1,<2012-05-20 12:36:21.124 +0200>,<patiny>,<icmbsg005>,<go>,<TOPSPIN 3.0>,
      <created by zg
	started at 2012-05-20 12:14:14.049 +0200,
	POWCHK enabled, PULCHK disabled,
       configuration hash MD5:
       77 C7 B7 C4 10 F4 BA 30 64 2E BB 52 82 F2 DA 41
       data hash MD5: 4K * 128
       C9 CE D5 03 0E 87 6D 9D 5C 50 3E E8 F0 43 00 DE>)
(   2,<2012-05-20 12:36:21.187 +0200>,<patiny>,<icmbsg005>,<audit>,<TOPSPIN 3.0>,
      <user comment:
       ICON-NMR User ID: patiny
       data hash MD5: 4K * 128
       C9 CE D5 03 0E 87 6D 9D 5C 50 3E E8 F0 43 00 DE>)
(   3,<2012-05-20 12:36:22.122 +0200>,<patiny>,<icmbsg005>,<proc2d>,<TOPSPIN 3.0>,
      <Start of raw data processing
       xfb same F2: SI = 2K WDW = 3 SSB = 4 FT_mod = 6 PKNL = 1 F1: SI = 1K ME_mod = 2 NCOEF = 32 WDW = 4 SSB = 2 FT_mod = 6 PHC0 = 0 PHC1 = 0
       data hash MD5: 2K * 1K
       5D E1 4D 8E B2 6C E6 D5 5D 8F 73 DE 4B D2 3A E0>)
(   4,<2012-05-20 12:36:22.235 +0200>,<patiny>,<icmbsg005>,<proc2d>,<TOPSPIN 3.0>,
      <abs2 F2: ABSG = 5 ABSF1 = 7.267922 ABSF2 = 0.6563141
       data hash MD5: 2K * 1K
       2A F5 DF A5 F5 41 EA 2E 08 03 86 80 31 18 D0 A4>)
(   5,<2012-05-20 12:36:22.407 +0200>,<patiny>,<icmbsg005>,<proc2d>,<TOPSPIN 3.0>,
      <abs1 F1: ABSG = 5 ABSF1 = 210.754 ABSF2 = -11.10083
       data hash MD5: 2K * 1K
       54 DF DC 49 52 FF 6A 9A B1 F9 AE F8 7E 41 42 28>)
$$ ##END=
$$ 
$$ $$ hash MD5
$$ $$ 09 13 D0 89 AE 8F 9F D6 57 30 F4 3F F1 7B C3 71
##$RELAX= 
##$RELAX= 
##$RELAX= 
##$RELAX= 
##$RELAX= 
##$RELAX= 
##$RELAX= 
##$RELAX= 
##$RELAX= 
##$RELAX= 
##$RELAX= 
$$ Bruker specific parameters
$$ --------------------------
##$DATPATH= </opt/data/patiny/nmr>
##$EXPNO= 14
##$NAME= <XTC-1693_2>
##$PROCNO= 1
##$ACQT0= 1000000
##$AMP= (0..31)
100 100 100 100 100 100 100 100 100 100 100 100 100 100 100 100 100 100
100 100 100 100 100 100 100 100 100 100 100 100 100 100
##$ANAVPT= -1
##$AQSEQ= 0
##$AQ_mod= 3
##$AUNM= <au_getlinv>
##$AUTOPOS= <41 >
##$BF1= 400.13
##$BF2= 100.612769
##$BF3= 400.13
##$BF4= 400.13
##$BF5= 400.13
##$BF6= 400.13
##$BF7= 400.13
$$ [...]
##$SIGF1= 7.267922
##$SIGF2= 0.6563141
##$SINO= 0
##$SIOLD= 2048
##$SPECTYP= <>
##$SREGLST= <1H.DMSO>
##$SSB= 4
##$STSI= 2048
##$STSR= 0
##$SW_p= 2645.50264550265
##$SYMM= 0
##$S_DEV= 2431705
##$TDeff= 4096
##$TDoff= 0
##$TI= <>
##$TILT= no
##$TM1= 0
##$TM2= 0
##$TOPLEV= 100
##$USERP1= <>
##$USERP2= <>
##$USERP3= <>
##$USERP4= <>
##$USERP5= <>
##$WDW= 3
##$XDIM= 2048
##$YMAX_p= 292273024
##$YMIN_p= -191901230
##$CURPLOT= <Cups-PDF>
##$CURPRIN= <$Cups-PDF>
##$DFORMAT= <normdp>
##$LAYOUT= <+/2D_inv.xwp>
##$LFORMAT= <normlp>
##$PFORMAT= <normpl>
$$ Bruker specific parameters for F1
$$ ---------------------------------
##$ACQT0= 0
##$BF1= 100.612769
##$FnMODE= 6
##$NUC1= <13C>
##$O1= 10043.8343986724
##$SFO1= 100.622812834399
##$SW= 221.832681201688
##$SW_h= 22321.4283611104
##$TD= 128
##$ABSF1= 210.754
##$ABSF2= -11.10083
##$ABSG= 5
##$ABSL= 0
##$ALPHA= 0
##$AQORDER= 0
##$ASSFAC= 0
##$ASSFACI= 0
##$ASSFACX= 0
##$ASSWID= 0
##$AUNMP= <>
##$AXLEFT= 0
##$AXNAME= <F1>
##$AXNUC= <13C>
##$AXRIGHT= 0
##$AXTYPE= 0
##$AXUNIT= <>
##$AZFE= 0.1
##$AZFW= 0.5
##$BCFW= 0
##$BC_mod= 0
##$BYTORDP= 0
##$COROFFS= 0
##$CY= -3
##$DATMOD= 1
##$DC= 0
##$DFILT= <>
##$DTYPP= 0
##$ERETIC= no
##$F1P= 210.76350402832
##$F2P= -11.0913240743493
##$FCOR= 0.5
##$FTSIZE= 1024
##$FT_mod= 6
##$GAMMA= 0
##$GB= 0
##$INTBC= 1
##$INTSCL= 1
##$ISEN= 128
##$LB= 0
##$LEV0= 0
##$LPBIN= 256
##$MAXI= 10000
##$MC2= 5
##$MEAN= 0
##$ME_mod= 2
##$MI= 1
##$NCOEF= 32
##$NC_proc= -11
##$NLEV= 6
##$NOISF1= 0
##$NOISF2= 0
##$NSP= 0
##$NTH_PI= 0
##$NZP= 0
##$OFFSET= 210.754
##$PC= 4
##$PHC0= 0
##$PHC1= 0
##$PH_mod= 1
##$PKNL= no
##$PPARMOD= 1
##$PPDIAG= 0
##$PPIPTYP= 0
##$PPMPNUM= 2147483647
##$PPRESOL= 1
##$PSCAL= 1
##$PSIGN= 0
##$PYNMP= <>
##$REVERSE= no
##$SF= 100.612769
##$SI= 1024
##$SIGF1= 210.754
##$SIGF2= -11.10083
##$SINO= 0
##$SIOLD= 1024
##$SPECTYP= <>
##$SREGLST= <>
##$SSB= 2
##$STSI= 1024
##$STSR= 0
##$SW_p= 22321.42836111
##$SYMM= 0
##$S_DEV= 2431705
##$TDeff= 256
##$TDoff= 0
##$TI= <>
##$TILT= no
##$TM1= 0
##$TM2= 0
##$TOPLEV= 0
##$USERP1= <>
##$USERP2= <>
##$USERP3= <>
##$USERP4= <>
##$USERP5= <>
##$WDW= 4
##$XDIM= 128
##$YMAX_p= 292273024
##$YMIN_p= -191901230
$$ End of Bruker specific parameters
$$ ---------------------------------
##NTUPLES= nD NMR SPECTRUM
##VAR_NAME=  FREQUENCY1,    FREQUENCY2,      SPECTRUM
##SYMBOL=    F1,            F2,              Y
##.NUCLEUS=  13C,           1H
##VAR_TYPE=  INDEPENDENT,   INDEPENDENT,     DEPENDENT
##VAR_FORM=  AFFN,          AFFN,            ASDF
##VAR_DIM=   1024,          2048,            2048
##UNITS=     HZ,            HZ,              ARBITRARY UNITS
##FACTOR=    21.7982698838965, 1.29174933862434, 1
##FIRST=     21204.543296753, 2644.21089616403, 921687
##LAST=      -1095.08679447308, 0,           516695
##MIN=       -1095.08679447308, 0,           -191901230
##MAX=       21204.543296753, 2644.21089616403, 292273024
##PAGE= F1=21204.54329675
##FIRST=     21204.543296753, 2644.21089616403, 921687
##DATA TABLE= (F2++(Y..Y)), PROFILE
$$ [...]
##PAGE= F1=5705.973409302
##FIRST=     21204.543296753, 2644.21089616403, 431692
##DATA TABLE= (F2++(Y..Y)), PROFILE
1241A003451k34135J688872R94462A430654h04244p34940C493496f96450D632354
$$ 1003451 769316 2458188 3452650 1430654 -804244 -1539184 3493496 -696450 4632354
1231A240043l31955a345473C940228r77756c287069A003830a092713k067333E146532
$$ 1240043 908088 -1345473 3940228 2962472 -3287069 1003830 -1092713 -3160046 5146532
1221a680497l979204E842882c792638g60492B4691J744062m50143J008781k61478
$$ -1680497 -5659701 5842882 -3792638 -760492 24691 1768753 1318610 2327391 2065913
1212B065913E31740c589229D168423c882950E945993F68466e41339E226180c281856
$$ 2065913 531740 -3589229 4168423 -3882950 5945993 668466 -541339 5226180 -3281856
1202b230587A46741a970966m55810A076068a213675q7196A999730f780193D066194
$$ -2230587 146741 -1970966 -2426776 1076068 -1213675 -1300871 1999730 -6780193 4066194
1192i92849l491472b81797G15779K495993f40340j792483I472503a185156q38709
$$ -992849 -4484321 -281797 715779 3211772 -640340 -2432823 9472503 -1185156 -2023865
1183b023865Q1500k135076B26983c479173B766934a521044B759664b205103M90507
$$ -2023865 -1942365 -4077441 226983 -3479173 2766934 -1521044 2759664 -2205103 -1714596
1174a714596F27768J795207E43406B730a545695C965924A338708L32230m05098
$$ -1714596 627768 2422975 543406 2730 -1545695 3965924 1338708 1670938 1265840
1165A265840g35564B387556b027833p1573C949915E40948J296415b529193e33659
$$ 1265840 -735564 2387556 -2027833 -2099406 3949915 540948 1837363 -2529193 -533659
1155b194209a027496B637761J399779a271614H71975a417096O33967A355914N54399
$$ -2194209 -1027496 2637761 4037540 -1271614 871975 -1417096 -783129 1355914 1910313
1146A910313q75225b888728E018266c038811D252623a497488B003140a22412m384594
$$ 1910313 1035088 -2888728 5018266 -3038811 4252623 -1497488 2003140 -122412 -4507006
1137d507006J961267A10429d94142q02114C498943P71007c365034B093268p11889
$$ -4507006 -2545739 110429 -494142 -1296256 3498943 4269950 -3365034 2093268 1381379
1128A381379a430279D550245j288660b212203C600755J303968c798423C393196
$$ 1381379 -1430279 4550245 3261585 -2212203 3600755 4904723 -3798423 3393196
1119a068800C224109f071394D053375j897698a257244k824558B686627b169067
$$ -1068800 3224109 -6071394 4053375 2155677 -1257244 -4081802 2686627 -2169067
1110C367939d675752E026560i56966k540843F806639B655707f210838e44322A306318
$$ 3367939 -4675752 5026560 -956966 -3497809 6806639 2655707 -6210838 -544322 1306318
1100C420774A060436h17470k936896i70390A423252C64943b451387B004486E75843
$$ 3420774 1060436 -817470 -3754366 -970390 1423252 364943 -2451387 2004486 575843
1090C277890i83706C983322a541183k315046a498271j27385l271565b36082n923032
$$ 3277890 -983706 3983322 -1541183 -3856229 -1498271 -1625656 -4897221 -236082 -6159114
1081f159114A375890a986572C467020a059491B156998B07063b470431I8896L765310
$$ -6159114 1375890 -1986572 3467020 -1059491 2156998 207063 -2470431 98896 3864206
1072C864206F37002a206693a21104m216864A183177g03252j21495e4271E926454
$$ 3864206 637002 -1206693 -121104 -4337968 1183177 -703252 -824747 -54271 5926454
1062b749456J321666D51452c139430a508728M74052M82721D038462e079831E014356
$$ -2749456 -1427790 451452 -3139430 -1508728 -1034676 -551955 4038462 -5079831 5014356
1052a896034j33606E196710c976045N23632P84641o99342I616345f806357A580460
$$ -1896034 -2029640 5196710 -3976045 -3452413 -2667772 -3367114 9616345 -6806357 1580460
1042c987044A094116K0976b25303l263560H6556K604109A134456b1723l95691
$$ -3987044 1094116 1115092 -225303 -3488863 86556 2690665 1134456 -21723 -417414
1033d17414D845089A35915b762547H47498L510162e68284k66603n596631A250134
$$ -417414 4845089 135915 -2762547 847498 4357660 -568284 -834887 -6431518 1250134
1023C403773a420590O43848A719615b154419C504658d1123B031240a07547B88792
$$ 3403773 -1420590 -776742 1719615 -2154419 3504658 -41123 2031240 -107547 288792
1013d676157e24801m88865D030041A34054K185057a745438B752134E10204b843729
$$ -4676157 -524801 -1013666 4030041 134054 2319111 -1745438 2752134 510204 -2843729
1003c879121I463041B16035c48841l569228D91186H6824d302657G965616b078916
$$ -3879121 9463041 216035 -348841 -3918069 491186 86824 -4302657 7965616 -2078916
993H96220m05035d20614I41581b872882B74130O328642A094205b357800P29412
$$ 896220 491185 -420614 941581 -2872882 274130 6602772 1094205 -2357800 -1628388
984a628388C085322e851021d69438B484577R80806a707105E749864a304501q09017
$$ -1628388 3085322 -5851021 -469438 2484577 3465383 -1707105 5749864 -1304501 -2113518
975b113518M73378A219396d356874H37132b184176C357234b492910B075020J134884
$$ -2113518 -1640140 1219396 -4356874 837132 -2184176 3357234 -2492910 2075020 3209904
966C209904O78822a822251d03164B704570h079670C513795q52307c913002a769929
$$ 3209904 3888726 -1822251 -403164 2704570 -8079670 3513795 2661488 -3913002 -1769929
956A479043a982075b93195F91592b38702j453203A473851C18070e310722E580331
$$ 1479043 -1982075 -293195 691592 -238702 -1691905 1473851 318070 -5310722 5580331
946c816164f97747m569465F05849L958119b56305n656527I39116L886275b391999
$$ -3816164 -697747 -5267212 605849 4563968 -256305 -5912832 939116 4825391 -2391999
936G85488d174982q53211A308835d20821j368272h68727C654162c877344B934872
$$ 785488 -4174982 -5028193 1308835 -420821 -1789093 -868727 3654162 -3877344 2934872
926B764835f84317n544067A146960K172578E77203J255530H6294c332600C04365
$$ 2764835 -684317 -6228384 1146960 3319538 577203 1832733 86294 -3332600 304365
916D637452B145865f683886a882388A948263O94593a789349h91022f3302j016513
$$ 4637452 2145865 -6683886 -1882388 1948263 2642856 -1789349 -891022 -63302 -1079815
907a079815j225481b33088l152606E86692L138387c708267a730469g65577A390172
$$ -1079815 -2305296 -233088 -3385694 586692 3725079 -3708267 -1730469 -765577 1390172
897b744627D343986e333408B420194i90928j417150A746274K930103A24992a979399
$$ -2744627 4343986 -5333408 2420194 -990928 -2408078 1746274 4676377 124992 -1979399
887C161674a885668C362057g804231E028828c044337a017889A457977d17038E078340
$$ 3161674 -1885668 3362057 -7804231 5028828 -3044337 -1017889 1457977 -417038 5078340
877b446496D437799A269441g2833j16972m81147B425178g85794n196275C944729
$$ -2446496 4437799 1269441 -72833 -189805 -670952 2425178 -785794 -5982069 3944729
867B009177K822692a037970D57661b575039B613613K70313a937526j955339A2583
$$ 2009177 4831869 -1037970 457661 -2575039 2613613 2883926 -1937526 -3892865 12583
857C121623h671371a758794B961995L22718f15106D205328c026702K88127B106152
$$ 3121623 -8671371 -1758794 2961995 3284713 -615106 4205328 -3026702 -2738575 2106152
847B967996A378712h41536K46608J96917C18355L06986J348877a115601j454002
$$ 2967996 1378712 -841536 -594928 -398011 318355 625341 1974218 -1115601 -2569603
838b569603E921511b2400m183806Q74624B337908L291337B80310L457252A444402
$$ -2569603 5921511 -22400 -4206206 -3331582 2337908 5629245 280310 3737562 1444402
828H25105a90271B218229a436590M91182B623665G83432a35404C540353a14817
$$ 825105 -190271 2218229 -1436590 -945408 2623665 783432 -135404 3540353 -114817
818h15085k028356c62298c1049D051965b129115C33643J934583e574594o96045
$$ -815085 -2843441 -362298 -31049 4051965 -2129115 333643 2268226 -5574594 -6270639
809f270639B396453a238110C563307n11340a944788r01456D715619b020670j394330
$$ -6270639 2396453 -1238110 3563307 3051967 -1944788 -2846244 4715619 -2020670 -3415000
800c415000B31303g346944A427873b706974E11804J961737I14975K007367b838341
$$ -3415000 231303 -7346944 1427873 -2706974 511804 2473541 914975 2922342 -2838341
790i45972B182666H55609c161899F25707b402463j910425J386628A560815a822825
$$ -945972 2182666 855609 -3161899 625707 -2402463 -4312888 -2926260 1560815 -1822825
780B227410g120947D466392d767744A349851J577881B43252a855584E771112B529921
$$ 2227410 -7120947 4466392 -4767744 1349851 2927732 243252 -1855584 5771112 2529921
770A722882L645612e503744C915753J478697b133605C456576D43709N508435e830817
$$ 1722882 5368494 -5503744 3915753 5394450 -2133605 3456576 443709 5952144 -5830817
760c02555j319644C845595c14166k345263B953878c931846J248712k425387F234024
$$ -302555 -1622199 3845595 -314166 -2659429 2953878 -3931846 -2683134 -5108521 6234024
750C7747b337655J031867B678975q63402K688302A772126e639099B063269m15450
$$ 37747 -2337655 -1305788 2678975 1815573 4503875 1772126 -5639099 2063269 1647819
741A647819M27906d371762B888217c127655A897110Q33801a308332j545564k306008
$$ 1647819 2075725 -4371762 2888217 -3127655 1897110 2730911 -1308332 -2853896 -5159904
732e159904a819747P11827N7626o97615g86855D13490O71352J664664b727256
$$ -5159904 -1819747 -1107920 -1050294 -1747909 -786855 413490 1084842 2749506 -2727256
722A614621e05387B473890b310376j355436m13183G55537i6335A513279n32926
$$ 1614621 -505387 2473890 -2310376 -3665812 -4078995 755537 -96335 1513279 980353
713I80353a388214A744041g50287F458394g474219L270995A233211c993425D381996
$$ 980353 -1388214 1744041 -750287 6458394 -7474219 -4203224 1233211 -3993425 4381996
703B5089638A0465047L477079o037914a8140696j6211401d820043o743608J818647
$$ 25089638 10465047 13942126 7904212 -18140696 -34352097 -4820043 -11563651 -9745004
695i745004H605250A347829K4750165m935697k46239K1622719d349753l2917457
$$ -9745004 8605250 1347829 26097994 21162297 20916058 42538777 -4349753 -37267210
687c7267210J7299290M86484r352798A833988P899693b67338E468544a353036
$$ -37267210 -19967920 -19481436 -28834234 1833988 9733681 -267338 5468544 -1353036
678B679746j30388G71004e904489C588046d231685c31856A608138f1768j166748
$$ 2679746 2549358 771004 -5904489 3588046 -4231685 -331856 1608138 -61768 -1228516
669a228516n422266C025434a989281I9606e473594p927068n204958I218677J889764
$$ -1228516 -6650782 3025434 -1989281 99606 -5473594 -13400662 -18605620 9218677 11108441
660A1108441J9399770j1599397E478010K7122569H046353g115489j6742260p515882
$$ 11108441 30508211 18908814 5478010 32600579 8046353 -7115489 -23857749 -31373631
652c1373631a1943850c997193D45851Q989972Q7467a384854A5937586k473805
$$ -31373631 -11943850 -3997193 445851 9435823 9523290 -1384854 15937586 13463781
644A3463781A223905e5137j7303995d764986A537153a031872J75345B231980F12009
$$ 13463781 1223905 -55137 -17359132 -4764986 1537153 -1031872 -856527 2231980 612009
634A011690N65556o68999d80884Q1504k782562B795024b41445k971104g17560
$$ 1011690 1577246 908247 -480884 -399380 -3181942 2795024 -241445 -3212549 -717560
624b260004G52892a254016A157495L44616a217184A140322b937630j349578J734012
$$ -2260004 752892 -1254016 1157495 1502111 -1217184 1140322 -2937630 -4287208 -2553196
615b553196p661528A146478a1778764p581421k4163437o6758208I616702K62846025
$$ -2553196 -10214724 1146478 -11778764 -19360185 -43523622 -110281830 9616702 272462727
607B72462727n7675682e1874656n0975200b7070298a1123827n125615f838958
$$ 272462727 214787045 -51874656 -102849856 -27070298 -11123827 -16249442 -6838958
599c399490l85010Q72565L26502p51948E466156c123890K74988D099489i098906
$$ -3399490 -3784500 -2911935 -2585433 -3337381 5466156 -3123890 -2848902 4099489 -9098906
589b070153a6868l85869C28838M99394a140927k412073B627824a010071K03313
$$ -2070153 -16868 -402737 328838 828232 -1140927 -3553000 2627824 -1010071 -806758
580h06758A70653L071765e799789A048605a295269l63250A609325L508678b682386
$$ -806758 170653 3242418 -5799789 1048605 -1295269 -1658519 1609325 5118003 -2682386
570B438564a106363J37149I29821g44649j609515L73224l175771A451088A45183
$$ 2438564 -1106363 -969214 929821 -744649 -2354164 -1980940 -5156711 1451088 145183
560A401956c435094C049446G58822a318936H18872J04640L240112g161024D984312
$$ 1401956 -3435094 3049446 758822 -1318936 818872 923512 4163624 -7161024 4984312
550B327166B08303K536751e32701H28945c390077B030057L411944d668112B404246
$$ 2327166 208303 2745054 -532701 828945 -3390077 2030057 5442001 -4668112 2404246
540e36505A875698b05615C03504a989924F20555J884833E5644b878916k4968C129710
$$ -536505 1875698 -205615 303504 -1989924 620555 2505388 55644 -2878916 -2903884 3129710
529d015012D052305g93621C851407c214594b5119G05656a866033A917499G47405
$$ -4015012 4052305 -793621 3851407 -3214594 -25119 705656 -1866033 1917499 747405
519d028740G53953h0818B718751d381917E28922e197525L82211J298884a582345
$$ -4028740 753953 -80818 2718751 -4381917 528922 -5197525 -4815314 -3516430 -1582345
509a567112F23565J568535c775948J010650D525359d781055C223219a420242C869379
$$ -1567112 623565 2192100 -3775948 -2765298 4525359 -4781055 3223219 -1420242 3869379
499A188399d074817K029389B58783b221504A63791a35723l586664A922588b46352
$$ 1188399 -4074817 -2045428 258783 -2221504 163791 -135723 -3722387 1922588 -246352
489a709443B309143C50236a496412G816095a112589L74055E94086J974579d614615
$$ -1709443 2309143 350236 -1496412 7816095 -1112589 -738534 594086 2568665 -4614615
479a053440C081490K513357B340250G42064J507788e744052d39211q99605m204259
$$ -1053440 3081490 5594847 2340250 742064 2249852 -5744052 -439211 -1338816 -5543075
470e543075H403107a42662l542231D626225G3439N33359J182909c213404a410992
$$ -5543075 8403107 -142662 -3684893 4626225 73439 606798 1789707 -3213404 -1410992
460D96598J41930L62924o3727M004146f823242H104197H5643b202655B989183
$$ 496598 638528 1001452 937725 4941871 -6823242 8104197 85643 -2202655 2989183
450a002728A22637J102839O63120d371592G06912d655504O29093B1501b613035
$$ -1002728 122637 1225476 1888596 -4371592 706912 -4655504 -4026411 21501 -2613035
440a617196A688592J349395g79268B461534a750877h0260C827173A900468d176936
$$ -1617196 1688592 3037987 -779268 2461534 -1750877 -80260 3827173 1900468 -4176936
430a387442n30977j209572e6470B77624N054241B445364a8300k059940P53819
$$ -1387442 -1918419 -3127991 -56470 277624 5331865 2445364 -18300 -2078240 -1324421
421a324421b07275n96429A895519b872787H04286b64475n73845A206323k08829
$$ -1324421 -207275 -803704 1895519 -2872787 804286 -264475 -838320 1206323 997494
412I97494j90752Q03692N92314p31550J20301a644747B029064C8264L644244c29314
$$ 997494 806742 1610434 2202748 1471198 1591499 -1644747 2029064 38264 3682508 -329314
401C321065h139m10841l681247O12108a092741C735262c229895C401080j272428
$$ 3321065 -8139 -418980 -4100227 -3488119 -1092741 3735262 -3229895 3401080 2128652
392B128652g37135G670291a767236C041999L97534D89838R45645C17897M495215
$$ 2128652 -737135 7670291 -1767236 3041999 3439533 489838 1435483 317897 4813112
383D813112c349198d81218k855397a460862r41007A480114j07388l29884j93312
$$ 4813112 -3349198 -481218 -3336615 -1460862 -2401869 1480114 1372726 1042842 849530
374H49530B24847a285736C096468a544007l01130C822800a566457l82577C251477
$$ 849530 224847 -1285736 3096468 -1544007 -1845137 3822800 -1566457 -1949034 3251477
364c787196p26499A145707L332931a951044J43891I93949C13337K964265K470594
$$ -3787196 -4513695 1145707 4478638 -1951044 -1807153 993949 313337 3277602 5748196
355E748196b208579D97879K115616e26001k932230a484552B070700e27777j343878
$$ 5748196 -2208579 497879 2613495 -526001 -3458231 -1484552 2070700 -527777 -1871655
346a871655D06569J433321J286953H29588e93124k594810I9831f30025m52381
$$ -1871655 406569 1839890 3126843 829588 -593124 -3187934 99831 -630025 -1082406
337a082406a0676B182154e27567D520207c13067l096330C5491K375701b481670
$$ -1082406 -10676 2182154 -527567 4520207 -313067 -3409397 35491 2411192 -2481670
327B017577Q13865a866726F2549M441858e86418A098012b381413H15312b569195
$$ 2017577 2831442 -1866726 62549 4504407 -586418 1098012 -2381413 815312 -2569195
317E969560b692034C644796H76459c274679I72962i56261B988830A176977M96058
$$ 5969560 -2692034 3644796 876459 -3274679 972962 -956261 2988830 1176977 1673035
308A673035J864610a109101c36850C205268A146044e07067a10122j694996B309189
$$ 1673035 3537645 -1109101 -336850 3205268 1146044 -507067 -110122 -1805118 2309189
298c689277J393446A541860b239975R79960l363747e20814j54110C678843b604393
$$ -3689277 -2295831 1541860 -2239975 -1260015 -4623762 -520814 -674924 3678843 -2604393
288I21767i18756A885902K854863g91241k915616f30343j766845P24150C530455
$$ 921767 -918756 1885902 4740765 -791241 -3706857 -630343 -2397188 -1673038 3530455
278a407444G38165j53915c911094j282382i82450K17129m38966B326302p17970
$$ -1407444 738165 584250 -3911094 -5193476 -982450 -765321 -1204287 2326302 1608332
269A608332j18118A5997c98536P4853j172290H12159a003191l110024H76984A9993
$$ 1608332 1490214 15997 -398536 -323683 -1495973 812159 -1003191 -4113215 876984 19993
258b502268A0669433C242925J596090c671821F45894b259025A651004F1091M25931
$$ -2502268 10669433 3242925 4839015 -3671821 645894 -2259025 1651004 61091 487022
249D87022K078411g42440B30242h02238l501163a93963I66836K998577A044649
$$ 487022 2565433 -742440 230242 -802238 -4303401 -193963 966836 3965413 1044649
239C04755a7389k678155a263826A288342a268113C921846a363606D775403E39291
$$ 304755 -17389 -2695544 -1263826 1288342 -1268113 3921846 -1363606 4775403 539291
229c51851a72784m09637j823619j073270F8128R63513D8064c591121Q53906C841023
$$ -351851 -172784 -582421 -2406040 -3479310 68128 1031641 48064 -3591121 -2737215 3841023
218A42730b880780C187508b198437C15523L58324K33806g04792A167339a305599
$$ 142730 -2880780 3187508 -2198437 315523 673847 907653 -704792 1167339 -1305599
208g542736B549454c560850F86107l09108a648500A967868a459278o323370C57591
$$ -7542736 2549454 -3560850 686107 376999 -1648500 1967868 -1459278 -7782648 357591
198F25706l0497a325016E887339a141154j889872A406481C97128L524868A224263
$$ 625706 595209 -1325016 5887339 -1141154 -3031026 1406481 397128 3921996 1224263
188e89401l10526d11046B009118b878580a77725k007864h9318A552823h20373
$$ -589401 -899927 -411046 2009118 -2878580 -177725 -2185589 -89318 1552823 -820373
178a470747m19404E163162c473288M44775m423937A9896610J62711674D4274168
$$ -1470747 -1890151 5163162 -3473288 -3028513 -7452450 19896610 182608284 44274168
169A630351a02599131j8502551l8739090g9212236e794451H8217311M5997723
$$ 1630351 -102599131 -121101682 -159840772 -79212236 -5794451 88217311 134215034
162A34215034b534835I702873C261480d853482B825936H84540J160310E8755J249626
$$ 134215034 -2534835 9702873 3261480 -4853482 2825936 884540 2044850 58755 1308381
153A308381i10404E376034b963593A058822d217025C327303e425484G40087M861811
$$ 1308381 -910404 5376034 -2963593 1058822 -4217025 3327303 -5425484 740087 5601898
144E601898E21880d68464A19748M143323f639765B492306b372609B632715b396167
$$ 5601898 521880 -468464 119748 4263071 -6639765 2492306 -2372609 2632715 -2396167
134b151883a94747A964052h68766o43652A476421P74389a03744j404503B272426
$$ -2151883 -194747 1964052 -868766 -1512418 1476421 2250810 -103744 -1508247 2272426
124A861479b692792B182935N08867d32542A926935e629923C708109B5c349495
$$ 1861479 -2692792 2182935 2691802 -432542 1926935 -5629923 3708109 25 -3349495
114f87032A578441d44857C261272a437401a17606I33253a799918A659875N33037
$$ -687032 1578441 -444857 3261272 -1437401 -117606 933253 -1799918 1659875 2192912
105B192912b081391E821963c182103B84147h83988F07452J367545D80725f005578
$$ 2192912 -2081391 5821963 -3182103 284147 -883988 607452 1974997 480725 -6005578
95A310457m96602R82917D84452K074792C67226A18466N023484h233752A108589
$$ 1310457 813855 1796772 484452 2559244 367226 118466 5141950 -8233752 1108589
85C11775d590565a882835B161964a495409B497481h00984j951063B044996a377056
$$ 311775 -4590565 -1882835 2161964 -1495409 2497481 -800984 -2752047 2044996 -1377056
75b804699d22001A268986i28139l312212C956158a112808E34962J068280a562112
$$ -2804699 -422001 1268986 -928139 -4240351 3956158 -1112808 534962 1603242 -1562112
65b416973H86335b213352j948100D53225a654357A756807J923274M2419d35556
$$ -2416973 886335 -2213352 -4161452 453225 -1654357 1756807 3680081 3722500 -435556
55B385831b955924g40202k010907A929301b260324d69857l321764D554261b623696
$$ 2385831 -2955924 -740202 -2751109 1929301 -2260324 -469857 -3791621 4554261 -2623696
45f25858j522296a060055C547300a148199I32033a403843E236560d265637F99587
$$ -625858 -2148154 -1060055 3547300 -1148199 932033 -1403843 5236560 -4265637 699587
35C585724b663911d80634k790274C946366h49752B786761D453L267008a847515
$$ 3585724 -2663911 -480634 -3270908 3946366 -849752 2786761 4453 3271461 -1847515
25a804077B397314m82076a575648B678104a767186K43081H58199N74394b152765
$$ -1804077 2397314 1915238 -1575648 2678104 -1767186 -1524105 858199 1432593 -2152765
15c00658B93675b402095Q66572A208211b117990b86234B88107K320035h33557
$$ -300658 293675 -2402095 -1535523 1208211 -2117990 -286234 288107 2608142 -833557
5a41519k058369B03917a988066m72949E864853
$$ -141519 -2199888 203917 -1988066 -2461015 5864853
##PAGE= F1=5684.175139418
##FIRST=     21204.543296753, 2644.21089616403, 555255
##DATA TABLE= (F2++(Y..Y)), PROFILE
2047E55255O82494f99330l782934B94048h51562j231681P28285c84105C225550
$$ 555255 1237749 -699330 -4482264 294048 -851562 -2083243 -1354958 -384105 3225550
2037i40175j179458E73919a580141P48474o583547A866128n3575I00972d588020
$$ -940175 -2119633 573919 -1580141 -831667 -7415214 1866128 1812553 900972 -4588020
2027C3016g45753B223476r98361m80877R74404c52060k183013E91096a201521
$$ 33016 -745753 2223476 1225115 744238 1718642 -352060 -2535073 591096 -1201521
2017E748773a79499p396620D597447p30331a958958C703396a727668A329380b198436
$$ 5748773 -179499 -7576119 4597447 3867116 -1958958 3703396 -1727668 1329380 -2198436
2007D47841e520224m75005A354436R01385J265213b803080j218401a171885E818315
$$ 447841 -5520224 -5995229 1354436 2255821 3521034 -2803080 -4021481 -1171885 5818315
1997C862926d691713g74418q35056A809616e571569E023372b673795d01152A494508
$$ 3862926 -4691713 -774418 -1609474 1809616 -5571569 5023372 -2673795 -401152 1494508
1987b26512A683523n05934J445629h41431B413141b791442j649101B127151o48913
$$ -226512 1683523 1177589 2623218 -841431 2413141 -2791442 -4440543 2127151 1478238
1978A478238m14707C81571Q43797c922009g08706D265508d548746b098139j17612
$$ 1478238 1063531 381571 1225368 -3922009 -708706 4265508 -4548746 -2098139 -2215751
1969b215751B588559L479125e94103o965j914474a62522l111277i8973C795751
$$ -2215751 2588559 6067684 -594103 -601068 -2515542 -162522 -3273799 -98973 3795751
1959i52200q83506D107647E07520j92537a155418E78607b845905B052423a490165
$$ -952200 -1835706 4107647 507520 314983 -1155418 578607 -2845905 2052423 -1490165
1949a890721I32452c110581D048741b591277H540282b335817B407558b194759
$$ -1890721 932452 -3110581 4048741 -2591277 8540282 -2335817 2407558 -2194759
1940a520503f3759D782643A472670b953823F923586a491784O19191B52074K000336
$$ -1520503 -63759 4782643 1472670 -2953823 6923586 -1491784 -872593 252074 2252410
1931B252410J113233d258490C512595a187944j172434F26241R63683b865130H51375
$$ 2252410 3365643 -4258490 3512595 -1187944 -2360378 626241 1589924 -2865130 851375
1921h14100F432310d961999a852905h83287B368380J775718e556591a107467c12472
$$ -814100 6432310 -4961999 -1852905 -883287 2368380 4144098 -5556591 -1107467 -312472
1911C591970j074798d913022b127491C103302b048952A122925a968910C942610
$$ 3591970 2517172 -4913022 -2127491 3103302 -2048952 1122925 -1968910 3942610
1902a072418o53621A323362a156245B776925d06488E250971A945121d405688a427940
$$ -1072418 -1726039 1323362 -1156245 2776925 -406488 5250971 1945121 -4405688 -1427940
1892c686092H113976G04526R26600f27080j919761C728405a336708C229651D99632
$$ -3686092 8113976 704526 1631126 -627080 -2546841 3728405 -1336708 3229651 499632
1882I33148i1098C447536A414276J899969J094465c825019Q29218a242323A230387
$$ 933148 -91098 3447536 1414276 3314245 4408710 -3825019 -2995801 -1242323 1230387
1872a0237390E941242c534629A181095e3962B285587h72255q6621l152796D183317
$$ -10237390 5941242 -3534629 1181095 -53962 2285587 -872255 -958876 -4111672 4183317
1862c542253J486284B06010b782563I37017L571069B9937O71205J472K655223
$$ -3542253 -2055969 206010 -2782563 937017 4508086 29937 701142 702614 3357837
1853C357837b541426F003516e848377A116161a064190j189923J006714K27739
$$ 3357837 -2541426 6003516 -5848377 1116161 -1064190 -2254113 -1247399 -1019660
1845a019660n37770e46856n68726C785529A41849J6444h07229A458457L7453d637079
$$ -1019660 -1557430 -546856 -1115582 3785529 141849 158293 -807229 1458457 1495910 -4637079
1834i7085j607446C718672e262726I44397B40512J012446e70400j740868C040381
$$ -97085 -1704531 3718672 -5262726 944397 240512 1252958 -570400 -2311268 3040381
1824B47184g621679b812491C310066c892094a625414k053134F97651L160284j076819
$$ 247184 -7621679 -2812491 3310066 -3892094 -1625414 -3678548 697651 3857935 2781116
1815B781116f843339E1167J263092i36063H85801b680487B620606O971901e581366
$$ 2781116 -6843339 51167 1314259 -936063 885801 -2680487 2620606 9592507 -5581366
1805A34506L763948j272919b215507A388940A64004L52978a350401B422027j144192
$$ 134506 3898454 2625535 -2215507 1388940 164004 516982 -1350401 2422027 1277835
1796A277835o4201J861695b256j35501B07406K529480e914070A345056a294499
$$ 1277835 1213634 3075329 -2256 -137757 207406 2736886 -5914070 1345056 -1294499
1786A691096b85202A599106j19390b030267C336975I17914m50202a913030L18533
$$ 1691096 -285202 1599106 1479716 -2030267 3336975 917914 467712 -1913030 -1594497
1777a594497H05152e46253j620471N58117M01700K10353A771930J60943K280474
$$ -1594497 805152 -546253 -2166724 -1608607 -1206907 -996554 1771930 1932873 4213347
1768D213347f394525F935378B717466a480661K82183D547976a537019B286062
$$ 4213347 -6394525 6935378 2717466 -1480661 -1198478 4547976 -1537019 2286062
1759c329642A449982a186595A780445p30384C16444H5529c104574A005081K794999
$$ -3329642 1449982 -1186595 1780445 1050061 316444 85529 -3104574 1005081 3800080
1750C800080c426508h63263a44864r7223C566250c496495D75048b79802l706256
$$ 3800080 -3426508 -863263 -144864 -242087 3566250 -3496495 475048 -279802 -3986058
1741c986058D732733J181494F61585b487826o79853O58413P13665C343343e156643
$$ -3986058 4732733 5914227 661585 -2487826 -3167679 -2509266 -1795601 3343343 -5156643
1731A469595a035690A605697b834551C421079I07441Q86315b91806A211082L412407
$$ 1469595 -1035690 1605697 -2834551 3421079 907441 1793756 -291806 1211082 4623489
1722D623489e104628a357145A223524g87014C293769b193402C90805c173055A462266
$$ 4623489 -5104628 -1357145 1223524 -787014 3293769 -2193402 390805 -3173055 1462266
1712a612470B557202a539647B654899m97638b756478D48105a495233A648981O405651
$$ -1612470 2557202 -1539647 2654899 2157261 -2756478 448105 -1495233 1648981 8054632
1703H054632c979089f53532E731442a034236l559343D136069c097004d73012m14031
$$ 8054632 -3979089 -653532 5731442 -1034236 -4593579 4136069 -3097004 -473012 -887043
1694h87043l864791C92260K11674a886494A930541a698019A759794e576247F756928
$$ -887043 -4751834 392260 603934 -1886494 1930541 -1698019 1759794 -5576247 6756928
1684b672561A282666K141976c561987M41724P95106d52429A704837d155922h45417
$$ -2672561 1282666 3424642 -3561987 -3120263 -2325157 -452429 1704837 -4155922 -845417
1674E111141a259191B86974e194779E504579c188013B302024i11416j6026B551936
$$ 5111141 -1259191 286974 -5194779 5504579 -3188013 2302024 -911416 -927442 2551936
1664B170701F89698d78520A528852e51754D64753b029229A284344c90423D920228
$$ 2170701 689698 -478520 1528852 -551754 464753 -2029229 1284344 -390423 4920228
1654A773621A54705L651875a215421C194087d002436A085289d71369D54768D2648
$$ 1773621 154705 3806580 -1215421 3194087 -4002436 1085289 -471369 454768 42648
1644h59061k420368A068675O68679K928173B0611N05104d116208D005831n43296
$$ -859061 -3279429 1068675 1737354 4665527 20611 525715 -4116208 4005831 3462535
1635C462535f5075j44881j873346j247434A037153b125417A934806h73338A158502
$$ 3462535 -65075 -209956 -2083302 -3330736 1037153 -2125417 1934806 -873338 1158502
1625A738097c987354B94097h77693k56992A042918J849072b064937F44389B78846
$$ 1738097 -3987354 294097 -877693 -1134685 1042918 2891990 -2064937 644389 278846
1615b679529K39147f89478A845020c842923G011789A600465e894149d53755C317
$$ -2679529 -2440382 -689478 1845020 -3842923 7011789 1600465 -5894149 -453755 3317
1605a576201A290008M928746h3546D13714b198646A245646b97279A622913d068329
$$ -1576201 1290008 6218754 -83546 413714 -2198646 1245646 -297279 1622913 -4068329
1595a201519l146843B337305e775515D492073A09627K16847a939145e36687e808
$$ -1201519 -4348362 2337305 -5775515 4492073 109627 326474 -1939145 -536687 -5808
1585E28831c303752C757315b561630C094058j041676m33685a181835e40846j71215
$$ 528831 -3303752 3757315 -2561630 3094058 2052382 1618697 -1181835 -540846 -712061
1576g12061D248695a83119q5739B789783p90548n18227b384023m05722D200208
$$ -712061 4248695 -183119 -268858 2789783 1999235 1481008 -2384023 -2789745 4200208
1566a324755l02749P12201k467854D51257a943866f06133n0508A460998a222615
$$ -1324755 -1627504 -915303 -3383157 451257 -1943866 -606133 -656641 1460998 -1222615
1556H275273e012340M53969E04695b475195C58682i36576j177445A532388O67507
$$ 8275273 -5012340 -4558371 504695 -2475195 358682 -936576 -2114021 1532388 2199895
1547B199895d540705C475405i21392A017698B1716f828961f20611J54793a88314
$$ 2199895 -4540705 3475405 -921392 1017698 21716 -6828961 -620611 -465818 -188314
1537B537438B19866M56228b442072F937232f62788E49716i61668C358684d039667
$$ 2537438 219866 676094 -2442072 6937232 -662788 549716 -961668 3358684 -4039667
1527a539970B232429a388213l444939c150E86509L280265r15095i9252l13818
$$ -1539970 2232429 -1388213 -4833152 -3150 586509 3866774 2951679 -99252 -413070
1518d13070k432621A981111G44195O10636K399366H24468b687082K3997E04336
$$ -413070 -2845691 1981111 744195 1354831 3754197 824468 -2687082 -2663085 504336
1508A493162h61458B831011J891960a025586A921422b037282E398212b880971
$$ 1493162 -861458 2831011 4722971 -1025586 1921422 -2037282 5398212 -2880971
1499d981517A055191b236770H91576J188414h00017B300726c693914A672299c833670
$$ -4981517 1055191 -2236770 891576 2079990 -800017 2300726 -3693914 1672299 -3833670
1489B687795c097854f53752A667469O22986b316505j315000D159882E37415L811919
$$ 2687795 -3097854 -653752 1667469 2290455 -2316505 -3631505 4159882 537415 4349334
1480D349334K749208e719656F96441P47603d330742g04362j283324C136371b79178
$$ 4349334 7098542 -5719656 696441 1444044 -4330742 -704362 -1987686 3136371 -279178
1470a51276j693301A071042B03861J121410l89393K29607i73066A363197n128
$$ -151276 -1844577 1071042 203861 1325271 935878 1165485 -973066 1363197 1358069
1461A358069J645006a173019k05488m73501C235353b285461C580422d428k795540
$$ 1358069 3003075 -1173019 -1378507 -1852008 3235353 -2285461 3580422 -4428 -2799968
1452b799968G35366K322336k55120G32534J92957a142395A22956a493039C599621
$$ -2799968 735366 3057702 2802582 732534 925491 -1142395 122956 -1493039 3599621
1442b531164A318548P06530f267100E653097b045838K45529C022817n00944c863542
$$ -2531164 1318548 2025078 -6267100 5653097 -2045838 -1800309 3022817 2521873 -3863542
1432E104231c151336A715578M52812f12468I68207O609224H40439A98653K126797
$$ 5104231 -3151336 1715578 2168390 -612468 968207 7577431 840439 198653 2325450
1423B325450h236725b198723H025219d201194A787150J642080d999919h00458
$$ 2325450 -8236725 -2198723 8025219 -4201194 1787150 3429230 -4999919 -800458
1414b044343C863871j830338d463417M10834H189622A802629J569266C77771J410396
$$ -2044343 3863871 2033533 -4463417 -4052583 8189622 1802629 3371895 377771 1788167
1405A788167o39186k41903b691461C298975j054378a743752A75855b151995d95167
$$ 1788167 1148981 907078 -2691461 3298975 2244597 -1743752 175855 -2151995 -495167
1395a682122q84708F46566c198749c75149A290177l994h461896C049476d244528
$$ -1682122 -2566830 646566 -3198749 -375149 1290177 1286183 -8461896 3049476 -4244528
1385A561688J127357d293731D726445b05896l272414f60647j746270B360476p14986
$$ 1561688 2689045 -4293731 4726445 -205896 -3478310 -660647 -2406917 2360476 1645490
1376A645490E54688J61696J92790b471350a65298F64570k54063h422293B978446
$$ 1645490 554688 716384 909174 -2471350 -165298 664570 410507 -8422293 2978446
1366B217142b992479D50271g86597r6654j498633C532245r08899b152574D896589
$$ 2217142 -2992479 450271 -786597 -883251 -2381884 3532245 2623346 -2152574 4896589
1356F54474b505797A535680l9141c882937R99478A661172c770034F85190g76004
$$ 654474 -2505797 1535680 1496539 -3882937 -2883459 1661172 -3770034 685190 -776004
1346H9536b70750A807455a742954C904797F73214g550636b525874n32615H96637
$$ 89536 -270750 1807455 -1742954 3904797 673214 -7550636 -2525874 -3058489 896637
1336B562412a48429B978379b343843G809854c055466A634449e367997A624247
$$ 2562412 -148429 2978379 -2343843 7809854 -3055466 1634449 -5367997 1624247
1327F77179N000565b166134b96267B770266a952536A510564d104613G272313b914650
$$ 677179 5677744 -2166134 -296267 2770266 -1952536 1510564 -4104613 7272313 -2914650
1317b404359D441590b71268A508456e106819c5872j428290j528575I919015e541386
$$ -2404359 4441590 -271268 1508456 -5106819 -35872 -1464162 -2992737 9919015 -5541386
1307c26987E40170c454758C735515N67694a107476j696698j004615I10502d164238
$$ -326987 540170 -3454758 3735515 4303209 -1107476 -2804174 -3808789 910502 -4164238
1297b639597B816169E9134R04511g26865F34243a291428j356377B442837j031462
$$ -2639597 2816169 59134 963645 -726865 634243 -1291428 -2647805 2442837 1411375
1288A411375K465767c710181I08516J589102K456979c128537E051888A577799
$$ 1411375 3877142 -3710181 908516 2497618 4954597 -3128537 5051888 1577799
1279A878510j40067G57151c231746B050255a798945K46896A91289b249318a10955
$$ 1878510 1738443 757151 -3231746 2050255 -1798945 -1552049 191289 -2249318 -110955
1269e75494k340608B291033C93196K918864A063315a236328A365823b853805E203606
$$ -575494 -2916102 2291033 393196 3312060 1063315 -1236328 1365823 -2853805 5203606
1259A874343A85813b129910C243830f4164B06055N2200O41906b977161C348111
$$ 1874343 185813 -2129910 3243830 -64164 206055 258255 900161 -2977161 3348111
1249H521503f583611L168083H04789A31369a397229C115405n56966j056093C73772
$$ 8521503 -6583611 -3415528 804789 131369 -1397229 3115405 2558439 1502346 373772
1239A045172L116699A237646g70754j11653C949799f69421F234668C68821J226870
$$ 1045172 4161871 1237646 -770754 -882407 3949799 -669421 6234668 368821 1595691
1230A595691b319851C894851o49803b759122A689760D40531d388951D422228a497367
$$ 1595691 -2319851 3894851 3245048 -2759122 1689760 440531 -4388951 4422228 -1497367
1220e808939E644030d529112f14004A49021J435284R2398J234846k57789B96350
$$ -5808939 5644030 -4529112 -614004 149021 1584305 1676703 2911549 2653760 296350
1210c961769D232700c227006E661881D71029c15006D475638c183386a216656F8039
$$ -3961769 4232700 -3227006 5661881 471029 -315006 4475638 -3183386 -1216656 68039
1200b568192k97014A728739l84814a342775A555278d981406E069797d43440m708667
$$ -2568192 -2865206 1728739 1343925 -1342775 1555278 -4981406 5069797 -443440 -5152107
1191e152107e87483A036417K404381e24190j976006I256598a929496K90040j61597
$$ -5152107 -587483 1036417 3440798 -524190 -2500196 9256598 -1929496 -1639456 -1801053
1182a801053j496866B16303c260199B249554a334917C091707a820065P70510G61728
$$ -1801053 -3297919 216303 -3260199 2249554 -1334917 3091707 -1820065 -1049555 761728
1172C435260F54495i07686j040817C686484A715196l30481J33405i45763B365977
$$ 3435260 654495 -907686 -1948503 3686484 1715196 1384715 1518120 -945763 2365977
1162a375368j596624D022184F02020O93039b759675b71885j517031L58775B873192
$$ -1375368 -2971992 4022184 602020 1295059 -2759675 -271885 -1788916 -1430141 2873192
1152C701620a635124A307357c16925l47924A257493M18947l31419c015017D747830
$$ 3701620 -1635124 1307357 -316925 -664849 1257493 1676440 1345021 -3015017 4747830
1142b855944D597758b457700B811675A16166c946609J308739c29592B36300d50340
$$ -2855944 4597758 -2457700 2811675 116166 -3946609 -2637870 -329592 236300 -450340
1132C484860J67794c201776B096719m01380a905911D306364B110852b355066C587325
$$ 3484860 3652654 -3201776 2096719 1695339 -1905911 4306364 2110852 -2355066 3587325
1122D770563d045799B808002h13333C504990e941987C831566A380199a438493
$$ 4770563 -4045799 2808002 -813333 3504990 -5941987 3831566 1380199 -1438493
1113d242044A524998a882072B769834d330983E616048h96645k711071G447339
$$ -4242044 1524998 -1882072 2769834 -4330983 5616048 -896645 -3607716 7447339
1104B572471f399692F3418d20338C640533A249576b85322m586965h02511B421035
$$ 2572471 -6399692 63418 -420338 3640533 1249576 -285322 -4872287 -802511 2421035
1094A409388b091060B030771G84150K352854a088424C475801f95176l243756J812835
$$ 1409388 -2091060 2030771 784150 3137004 -1088424 3475801 -695176 -3938932 -2126097
1085b126097O5777k104862a33456n695852A591034a661142C467528c16634A937237
$$ -2126097 -2060320 -4165182 -133456 -5829308 1591034 -1661142 3467528 -316634 1937237
1075A36597a953648G2861L362477A87826N65034B39425c993108C51358d35841
$$ 136597 -1953648 72861 3435338 187826 752860 239425 -3993108 351358 -435841
1065g68949b88290F372760b338876M72205D85179c116902J127058j05971h11650
$$ -768949 -288290 6372760 -2338876 -1866671 485179 -3116902 -1989844 -2095815 -811650
1055C629791c639600D905094a897797L61207E514631c803808l35981J788592r39077
$$ 3629791 -3639600 4905094 -1897797 -1536590 5514631 -3803808 -4139789 -2351197 -3290274
1046c290274A0070358g175021H92812c791560A189327l14769a057418j799958
$$ -3290274 10070358 -7175021 892812 -3791560 1189327 874558 -1057418 -2857376
1038b857376g54792B818444j376767A98526f89272D394117A176369b224391I85204
$$ -2857376 -754792 2818444 1441677 198526 -689272 4394117 1176369 -2224391 985204
1028D309863d4521r01709m839655I24725K613557a499613b84895A522508b077251
$$ 4309863 -44521 -946230 -5785885 924725 3538282 -1499613 -284895 1522508 -2077251
1018C537707B62684J719228G76269a041064l357833E16701a796151E096293B60943
$$ 3537707 262684 1981912 776269 -1041064 -4398897 516701 -1796151 5096293 260943
1008A867663b062481B888280B09044a781656k396399H974058E01360e56534k670857
$$ 1867663 -2062481 2888280 209044 -1781656 -4178055 8974058 501360 -556534 -3227391
999c227391F00596F296c665367G854328b013145G56043A68179c06431A004191
$$ -3227391 600596 6296 -3665367 7854328 -2013145 756043 168179 -306431 1004191
989c510456F01532O193836A078699b083402J57492B766306e366866D15908A82870
$$ -3510456 601532 6795368 1078699 -2083402 -1925910 2766306 -5366866 415908 182870
979C660648a246896C768798h64531q16870L61970A139290e160520A200974b167050
$$ 3660648 -1246896 3768798 -864531 -1681401 -1319431 1139290 -5160520 1200974 -2167050
969B017445b170383A776636J148697N50609a295158J09500B372450g265475C153876
$$ 2017445 -2170383 1776636 2925333 3475942 -1295158 -1185658 2372450 -7265475 3153876
959C409057c837478J753876A468234a493659L86407I23912I3460b018478B501726
$$ 3409057 -3837478 -2083602 1468234 -1493659 -1107252 923912 93460 -2018478 2501726
949G13686e775322E743813c316682e01983n475824A045178K954026g06234m580183
$$ 713686 -5775322 5743813 -3316682 -501983 -5977807 1045178 3999204 -706234 -5286417
940e286417A79252M849738c160732I84393c745672j163644A707212e93710j005632
$$ -5286417 179252 5028990 -3160732 984393 -3745672 -4909316 1707212 -593710 -1599342
931a599342P52413C731215c794615B717172j73473a645376l303902A321284K692650
$$ -1599342 -846929 3731215 -3794615 2717172 2543699 -1645376 -4949278 1321284 4013934
922D013934D29162J845205A01210b426639C35927M092915A902942e696496b477835
$$ 4013934 429162 2274367 101210 -2426639 335927 4428842 1902942 -5696496 -2477835
912A553306J698762b003085b23470H92183a183973m57584H7184c192171E73704
$$ 1553306 3252068 -2003085 -223470 892183 -1183973 -1641557 87184 -3192171 573704
902C863847c805955R17471g84201A767157b539994E361880e249651B690790a282890
$$ 3863847 -3805955 -2888484 -784201 1767157 -2539994 5361880 -5249651 2690790 -1282890
892b053229A447821L460283A43031b219989C474404b072240C241434h097606D997942
$$ -2053229 1447821 4908104 143031 -2219989 3474404 -2072240 3241434 -8097606 4997942
882b242026i24288A585636B54404M083775b085122D871802A186422E43800k04917
$$ -2242026 -924288 1585636 254404 4338179 -2085122 4871802 1186422 543800 338883
873C38883a197477B847229h18481n398989E101641B463819J951104a132137H31340
$$ 338883 -1197477 2847229 -818481 -6217470 5101641 2463819 4414923 -1132137 831340
863c336380B588800m59724a269192k494947E21055O2705g352401b173889C665588
$$ -3336380 2588800 2129076 -1269192 -3764139 521055 583760 -7352401 -2173889 3665588
853C867931C7899L505816b122159j016985A826505L62375m73780e66660f9439
$$ 3867931 37899 3543715 -2122159 -3139144 1826505 2188880 1715100 -566660 -69439
843g11179C53212Q76773L16275i87615j643073E340080E62658c612259q69344
$$ -711179 353212 1229985 1546260 -987615 -2630688 5340080 562658 -3612259 -4481603
834d481603B196118M206887B34446L294674A726720n12974B70680K067757a807879
$$ -4481603 2196118 6403005 234446 3529120 1726720 1213746 270680 2338437 -1807879
824a64282B674511I04879l11573K711093B52024d74389k217485C49735c9589B826335
$$ -164282 2674511 904879 593306 3304399 252024 -474389 -2691874 349735 -39589 2826335
813c034375H22319J114357f290012o5228B065217a631738C455133j439097b842447
$$ -3034375 822319 1936676 -6290012 -6355240 2065217 -1631738 3455133 2016036 -2842447
803b070979D683853b981264N05207B69309f453802E13422c047414F17787J996401
$$ -2070979 4683853 -2981264 -2476057 269309 -6453802 513422 -3047414 617787 2614188
794B614188a4621B796552b498193Q54108B146248C16850c430369A499456a825353
$$ 2614188 -14621 2796552 -2498193 -1644085 2146248 316850 -3430369 1499456 -1825353
784d349977a885678A095625a153335A532219f256459E214442e675449A411494
$$ -4349977 -1885678 1095625 -1153335 1532219 -6256459 5214442 -5675449 1411494
775C173059B78360b340942F359236A532889J09821L125797e623631D004465M56109
$$ 3173059 278360 -2340942 6359236 1532889 1642710 4768507 -5623631 4004465 4460574
766D460574b135257C075161A68067N079130d733692i46723R0719C953152i02670
$$ 4460574 -2135257 3075161 168067 5247197 -4733692 -946723 -856004 3953152 -902670
756b607782B769622d288325J885513k613570F783927b87063j780380O96455B164761
$$ -2607782 2769622 -4288325 -2402812 -5016382 6783927 -287063 -2067443 -1370988 2164761
746B560135K680693A795557f481480A680203N00253k06060d623264B743974c960141
$$ 2560135 5240828 1795557 -6481480 1680203 2180456 1974396 -4623264 2743974 -3960141
736A832139P85750a914814J96349m259010a552601M01005d63147p47826O2290
$$ 1832139 2617889 -1914814 -1718465 -5977475 -1552601 -1151596 -463147 -1210973 -1148683
727a148683d03295A522313Q55828c146650I54060i58788B086404b441015j971580
$$ -1148683 -403295 1522313 2378141 -3146650 954060 -958788 2086404 -2441015 -4412595
718d412595J0526B73428c75142A214752J17865a710943A925451b39021E070083
$$ -4412595 -4402069 273428 -375142 1214752 1332617 -1710943 1925451 -239021 5070083
708f726998K524746A413578d932272D424556K1185931A1491254K567957n972952
$$ -6726998 -4202252 1413578 -4932272 4424556 25610487 11491254 14059211 8086259
700H086259b0304439j6722907e396492o999202P02044I380582A350032K8216113
$$ 8086259 -20304439 -37027346 -5396492 -12395694 -11693650 9380582 1350032 29566145
692B9566145n651954m90423K0428550c352071l8409453K0390766J464561j1510929
$$ 29566145 23914191 23423768 43852318 -3352071 -41761524 -21370758 -19906197 -31417126
684c1417126A326969Q054700E24894N636264a301050B971961r03676q70533f353190
$$ -31417126 1326969 9381669 524894 6161158 -1301050 2971961 2068285 1197752 -6353190
674C720227d529654b94348A352486A96797a60271o398133B670128a879530E79821
$$ 3720227 -4529654 -294348 1352486 196797 -160271 -6558404 2670128 -1879530 579821
664f536096q484169n688260A0257407J031039K1019608j2660611F408440K7125219
$$ -6536096 -15020265 -20708525 10257407 11288446 32308054 19647443 6408440 33533659
656C3533659I263826g137182j6652699j1412540a3859029c572404a06094A0342040
$$ 33533659 9263826 -7137182 -23789881 -35202421 -13859029 -3572404 -106094 10342040
647A0986125e58610A6901742k282589B727745b37274j8410830d352658B741223
$$ 10986125 -558610 16901742 14619153 2727745 -237274 -18648104 -4352658 2741223
638b301293i33352B319063F44634Q09284j94603k82145g17406a18478l488606
$$ -2301293 -933352 2319063 644634 1453918 1259315 977170 -717406 -118478 -3607084
629c607084B660160b79694k659926J439009q01882D60002b424891I22941J090569
$$ -3607084 2660160 -279694 -2939620 -1500611 -2302493 460002 -2424891 922941 2013510
620B013510h71746H23643b746073r31968M86634p102869F21936a2287938r083743
$$ 2013510 -871746 823643 -2746073 -3678041 -3191407 -10294276 621936 -12287938 -21371681
611b1371681k6347447p0570130H644547K83628477o2470234e5502633n3640752
$$ -21371681 -47719128 -118289258 8644547 292273024 229802790 -55502633 -109143385
604a09143385b8826564a2830544m040920g491084b794167j661847M31081J407752
$$ -109143385 -28826564 -12830544 -16871464 -7491084 -2794167 -4456014 -4024933 -2617181
596b617181n28084E421524c296447M47523D121193i200743a920124I20025g53977
$$ -2617181 -3145265 5421524 -3296447 -2848924 4121193 -9200743 -1920124 920025 -753977
586f33889A422456a502195j791523B847227c00252o59491A090991K513671e995906
$$ -633889 1422456 -1502195 -3293718 2847227 -300252 -959743 1090991 3604662 -5995906
576I24223h64481j188219A679443L160598d061365B657607b091035R17807A475311
$$ 924223 -864481 -2052700 1679443 4840041 -4061365 2657607 -2091035 -1173228 1475311
566e65486r22433n24921k335387A889150b63404A844154c614953B476484G88141
$$ -565486 -1487919 -2012840 -4348227 1889150 -263404 1844154 -3614953 2476484 788141
556a891361A492202C53087L907894g197512E156342B465348B59411J868216D60822
$$ -1891361 1492202 353087 4260981 -7197512 5156342 2465348 259411 2127627 460822
546B18616c766123A643376L788162f253662B198678E72173J614785c87869F26801
$$ 218616 -3766123 1643376 5431538 -6253662 2198678 572173 2186958 -387869 626801
536a514991f13181B791775G66258c960414J201984D119855c892863D590753h80928
$$ -1514991 -613181 2791775 766258 -3960414 -2758430 4119855 -3892863 4590753 -880928
526D124349b812287H66160K32307a384409B026424j59239d444646A411197A93668
$$ 4124349 -2812287 866160 1098467 -1384409 2026424 1867185 -4444646 1411197 193668
516C000139e383315G53115d720317l89780K261973J060395P65220A326552K3086
$$ 3000139 -5383315 753115 -4720317 -5110097 -2848124 -1787729 -1022509 1326552 1349638
507A349638c120671R88124D744622d096415B601097a820765C729917I42514c894914
$$ 1349638 -3120671 -2132547 4744622 -4096415 2601097 -1820765 3729917 942514 -3894914
497a863333D49472a661992c15891C74332b894327B091551a34558k001949B064567
$$ -1863333 449472 -1661992 -315891 374332 -2894327 2091551 -134558 -2136507 2064567
487A196733b179388H347173a370020M26063F95768M91782c782835a561113C325367
$$ 1196733 -2179388 8347173 -1370020 -943957 695768 1187550 -3782835 -1561113 3325367
477E153765B438646I63730J301247e885891c77901j193110l328734H543796A99348
$$ 5153765 2438646 963730 2264977 -5885891 -377901 -1571011 -4899745 8543796 199348
467c859430D667008e98361A174814O78397c566869J490922G53024l44284J383519
$$ -3859430 4667008 -598361 1174814 1853211 -3566869 -2075947 753024 408740 1792259
458A792259E59689M717444f171456G550750C68047a424536A800557a333575E41557
$$ 1792259 559689 5277133 -6171456 7550750 368047 -1424536 1800557 -1333575 541557
448A029334J207702d879715b41151m131512O68913A9178b681737C77283J019227
$$ 1029334 2237036 -4879715 -241151 -4372663 -3703750 19178 -2681737 377283 1396510
439A396510J232939a663598B902022a147855b96299D178769A048233c670217i86856
$$ 1396510 2629449 -1663598 2902022 -1147855 -296299 4178769 1048233 -3670217 -986856
429g69697j879408f85656a73702F196682B477458g0995k321789i90803A8645a508059
$$ -769697 -2649105 -685656 -173702 6196682 2477458 -70995 -2392784 -990803 18645 -1508059
418B963412c434683A776709a151071m25790A095836m10929A82982K528245o47470
$$ 2963412 -3434683 1776709 -1151071 -1576861 1095836 684907 182982 2711227 2063757
409B063757l15340l11627b404340B626347a12332D555984d78557C092052g56889
$$ 2063757 1748417 1436790 -2404340 2626347 -112332 4555984 -478557 3092052 -756889
399g64037k705815l38624e47723A883712b798916C195677r01318a106104G196774
$$ -764037 -3469852 -3808476 -547723 1883712 -2798916 3195677 2294359 -1106104 7196774
389b165776A612884K678526a34108A368717D31098L652638c192548g27991k375462
$$ -2165776 1612884 4291410 -134108 1368717 431098 4083736 -3192548 -727991 -3103453
380c103453a467633k305241A816265J24340n58497E14492L7577a872640C390808
$$ -3103453 -1467633 -3772874 1816265 1940605 1382108 514492 552069 -1872640 3390808
370a126496o38496C594901a530728p91995C081946d015864L67489A276895L478794
$$ -1126496 -1764992 3594901 -1530728 -2322723 3081946 -4015864 -3648375 1276895 4755689
361D755689c014291h67337I27733j36349J497995K615958b836286C05052K969188
$$ 4755689 -3014291 -867337 927733 791384 2289379 4905337 -2836286 305052 3274240
352C274240c67423l488455a136451A393495f55736j902041a65242B081935J14461
$$ 3274240 -367423 -3855878 -1136451 1393495 -655736 -2557777 -165242 2081935 2196396
343B196396b6p43682l789006H1779f03285r0881F9490J698342i26209D926263
$$ 2196396 -26 -743708 -4532714 81779 -603285 -694166 69490 1767832 -926209 4926263
332a072897m007704D90420J386857a939046B522294m02431b561231B61023L776104
$$ -1072897 -5080601 490420 1877277 -1939046 2522294 2119863 -2561231 261023 4037127
323D037127f38723A680657a955642F5199b694309E806393c245179C905836a82500
$$ 4037127 -638723 1680657 -1955642 65199 -2694309 5806393 -3245179 3905836 -182500
313c386636A181858f95495C337259j362263q67894K196579e05151J85212C788562
$$ -3386636 1181858 -695495 3337259 1974996 1107102 3303681 -505151 -319939 3788562
303H99149a88868K6166k225722B254537c934586J564901B514381b410320a093549
$$ 899149 -188868 -162702 -2388424 2254537 -3934586 -2369685 2514381 -2410320 -1093549
293c863728a759095e68611B720057c092159A725277g49555B265380K602545e37832
$$ -3863728 -1759095 -568611 2720057 -3092159 1725277 -749555 2265380 4867925 -537832
283c460629a225442p3445j43905C628492a523103D88801O34365d011125j81174
$$ -3460629 -1225442 -1298887 -1442792 3628492 -1523103 488801 1123166 -4011125 -4192299
274d192299c76714l11677L30203B561009r11926F83420A58210B7335K02291b468665
$$ -4192299 -376714 -688391 -358188 2561009 1649083 683420 158210 27335 229626 -2468665
263A124014i72232k839565H72137A87428a552880A0907208C401546J165742c307214
$$ 1124014 -972232 -3811797 872137 187428 -1552880 10907208 3401546 4567288 -3307214
253C58887b076064F69971d154A643160L72280a296275d85140l03933l275044b61671
$$ 358887 -2076064 669971 -4154 1643160 2015440 -1296275 -485140 -789073 -4064117 -261671
242G59778K850736C0079Q91214A24576c192067g55567b49967n51315C470244a485025
$$ 759778 3610514 30079 921293 124576 -3192067 -755567 -249967 -801282 3470244 -1485025
231D884649E9543L76135A32490c24384k563092l79978E4841J155745D26485c003392
$$ 4884649 59543 435678 132490 -324384 -2887476 -3267454 54841 1210586 426485 -3003392
220c500961D216332b8292k309839C495796b517921b43217H59537m10547h78680
$$ -3500961 4216332 -28292 -2338131 3495796 -2517921 -243217 859537 448990 -878680
210I89383a996535n865425B944944c418218F77568l13414a816032A813716a034257
$$ 989383 -1996535 -7861960 2944944 -3418218 677568 364154 -1816032 1813716 -1034257
200h097269E75626R9966B11171a669277E699451g31548k814182A598088E75964
$$ -8097269 575626 675592 211171 -1669277 5699451 -731548 -3545730 1598088 575964
190C706288A60323O58934a479874a54315B329815b525183b94354j726869c86534
$$ 3706288 160323 819257 -1479874 -154315 2329815 -2525183 -294354 -2021223 -386534
180H85868A72865a260342r61405E503356e189209K229325m521123B2557377J77841464
$$ 885868 172865 -1260342 -2221747 5503356 -5189209 -2959884 -7481007 22557377 200398841
171B00398841D6847367A91592a09814316k2662107l8186012Q5233885f016999
$$ 200398841 46847367 191592 -109814316 -132476423 -170662435 -85428550 -6016999
163I3388521N2697859a859666H887465C630988d967706B826248r34768L19493
$$ 93388521 146086380 -1859666 8887465 3630988 -4967706 2826248 1891480 2210973
155B210973D35358R33757c39274D272450c682264I89144c755129C905475e386794
$$ 2210973 435358 1369115 -339274 4272450 -3682264 989144 -3755129 3905475 -5386794
145F23725M610503A164698h67219b12232D542672g922575B383009b613549B388743
$$ 623725 5234228 1164698 -867219 -212232 4542672 -7922575 2383009 -2613549 2388743
135a971145R65379d97299A836398a096184K87865C052026F51683m3624c91573
$$ -1971145 -1005766 -497299 1836398 -1096184 -808319 3052026 651683 608059 -391573
125A799903R72633b245488A691411Q95796h5802A666372e963165C746524G14880
$$ 1799903 2772536 -2245488 1691411 2587207 -85802 1666372 -5963165 3746524 714880
115c280059a426895B523348h77709B656270a089054N21672A613535b888991A271902
$$ -3280059 -1426895 2523348 -877709 2656270 -1089054 -567382 1613535 -2888991 1271902
105B517327b086515F103613b608818b15338j337960E21075J588362C50651e981519
$$ 2517327 -2086515 6103613 -2608818 -215338 -1553298 521075 2109437 350651 -5981519
95D90379M90266J143806n06030Q07575a4631E28615L684889g981381A079274I6297
$$ 490379 980645 2124451 1618421 2425996 -14631 528615 4213504 -7981381 1079274 96297
84d684821a315474A502164h65234B987476a454191k18820A228680h48238k790979
$$ -4684821 -1315474 1502164 -865234 2987476 -1454191 -1673011 1228680 -848238 -3639217
75c639217g37205A459465f01656l455865B863923a093828E05549J270646h60256
$$ -3639217 -737205 1459465 -601656 -4057521 2863923 -1093828 505549 1776195 -860256
65b292205D11428b507843k160671E54085b101110A548311L133733k202194g92796
$$ -2292205 411428 -2507843 -4668514 554085 -2101110 1548311 4682044 2479850 -792796
55B233734b771287J115852p75361A785169a869589f7431l944250D493931a582847
$$ 2233734 -2771287 -1655435 -2430796 1785169 -1869589 -67431 -4011681 4493931 -1582847
45a424171j16474J52054C203232a230161A182620a601764C923239c964331F68830
$$ -1424171 -1540645 -1388591 3203232 -1230161 1182620 -1601764 3923239 -3964331 668830
35C813274b438404J180130k364762D024671a324572A749568H72185J960184a343093
$$ 3813274 -2438404 -1258274 -3623036 4024671 -1324572 1749568 872185 2832369 -1343093
25a493126A865258L77516h60115A929416a672919o16801A163283N60860b565292
$$ -1493126 1865258 2242774 -860115 1929416 -1672919 -2289720 1163283 1724143 -2565292
15e44418D22036b824695J355984A303398b081359d0346C68669J362517e32157
$$ -544418 422036 -2824695 -1468711 1303398 -2081359 -40346 368669 1731186 -532157
5a83222k544235I8290a411869j320720F278097
$$ -183222 -2727457 98290 -1411869 -2732589 6278097
##PAGE= F1=5662.376869535
##FIRST=     21204.543296753, 2644.21089616403, 856964
##DATA TABLE= (F2++(Y..Y)), PROFILE
2047H56964O18645f98341k921512D21532h55453j235775O70675A26700L059674
$$ 856964 1475609 -698341 -3619853 421532 -855453 -2091228 -1420553 126700 3186374
2038C186374a267986o54034I05385a370962b54325q011757A877957j49430j91430
$$ 3186374 -1267986 -1922020 905385 -1370962 -254325 -8266082 1877957 1728527 1537097
2029A537097d253238A25600B8173K208178n09668n33762N42397B47204a925704
$$ 1537097 -4253238 125600 28173 2236351 1726683 1192921 1735318 247204 -1925704
2019H64402f61578E817656a323844o074063C996347J72429a995478C006519a973005
$$ 864402 -661578 5817656 -1323844 -7397907 3996347 4168776 -1995478 3006519 -1973005
2009A548090b612121H13006f247991P15818A604882m69328K494743c208542r9665
$$ 1548090 -2612121 813006 -6247991 -5532173 1604882 1135554 3630297 -3208542 -3308207
2000c308207a534195F598727k565909d685347D6987a913899A815522e392472D245909
$$ -3308207 -1534195 6598727 4032818 -4685347 46987 -1913899 1815522 -5392472 4245909
1990b502070i30697A826591A47358J341763L9683K36199i70574A414194b197639
$$ -2502070 -930697 1826591 147358 1489121 1528804 1765003 -970574 1414194 -2197639
1980d378940B183220o34664M5935E42392J167973c759980i03110E982732e756066
$$ -4378940 2183220 1548556 1594491 542392 1710365 -3759980 -903110 5982732 -5756066
1970b068233K21481C179868K890251d60388j93617j147987d8815k931212d50378
$$ -2068233 -1846752 3179868 6070119 -460388 -654005 -1801992 -48815 -2980027 -450378
1960D216319a170149p6091D070964g51721G38850a314715F23904d271082B461171
$$ 4216319 -1170149 -1246240 4070964 -751721 738850 -1314715 623904 -4271082 2461171
1950a738652J18832H22545b866757C276636a282565H412827b205106B242972b265035
$$ -1738652 -1619820 822545 -2866757 3276636 -1282565 8412827 -2205106 2242972 -2265035
1940i74305h6192C943761A603495b766424F653266h51722N0052A353446j11363
$$ -974305 -86192 3943761 1603495 -2766424 6653266 -851722 -801670 1353446 1242083
1931A242083K687618d089205B729494i84289k183026C42196K287456b203224G55325
$$ 1242083 3929701 -4089205 2729494 -984289 -3167315 342196 2629652 -2203224 755325
1921g90040F671911c514038a695623N62108A660737L007597e095825a760530i2073
$$ -790040 6671911 -3514038 -1695623 -1133515 1660737 4668334 -5095825 -1760530 -92073
1911C472824q73705e070428b230165C593780d051482A776703a795191C273740
$$ 3472824 2599119 -5070428 -2230165 3593780 -4051482 1776703 -1795191 3273740
1902c13831j653419A804450i83362A936760a83476E142555A848354e801416a655573
$$ -313831 -1967250 1804450 -983362 1936760 -183476 5142555 1848354 -5801416 -1655573
1892c805522H033360A128100Q03557a077182j471103C897618i35237C164514G11222
$$ -3805522 8033360 1128100 1931657 -1077182 -2548285 3897618 -935237 3164514 711222
1882A220037A01838L514359A337970K031276k94662b737896M12860k27127G13236
$$ 1220037 101838 3616197 1337970 3369246 3074584 -2737896 -2325036 -2552163 713236
1872a0135309F519456c695486H28092a360321B098444e44190n37690k542033C604785
$$ -10135309 6519456 -3695486 828092 -1360321 2098444 -544190 -1081880 -3623913 3604785
1862d118543J704479A295660b429638H33202M495703d54142A75385N26220M015500
$$ -4118543 -2414064 1295660 -2429638 833202 5328905 -454142 175385 701605 4717105
1853D717105c301688E408387e551330A469293a256171o03987e11672K15256j257263
$$ 4717105 -3301688 5408387 -5551330 1469293 -1256171 -1860158 -511672 -296416 -1553679
1844a553679g13003K08687C366406C73684c19291j527953B100486G36951e120922
$$ -1553679 -713003 -504316 3366406 373684 -319291 -1847244 2100486 736951 -5120922
1834A574377a732907C521664e934220A735744g145A827885a269270j367879B572348
$$ 1574377 -1732907 3521664 -5934220 1735744 -7145 1827885 -1269270 -2637149 2572348
1824d81156o753368c030418C197573d001760h51800l460539A262884K868043j813014
$$ -481156 -7234524 -3030418 3197573 -4001760 -851800 -4312339 1262884 4130927 2317913
1815B317913f862200B93902P74429a188745G89499c661555C118212P511570f204941
$$ 2317913 -6862200 293902 1068331 -1188745 789499 -3661555 3118212 10629782 -6204941
1805A17635L985304r38141a817972A098269l26010J40180a457630C597720o06677
$$ 117635 4102939 3164798 -1817972 1098269 772259 912439 -1457630 3597720 2991043
1796B991043B2230K521096G86885e24507C06411K701400f002335H75757a788537
$$ 2991043 22230 2543326 786885 -524507 306411 3007811 -6002335 875757 -1788537
1786A905514a38276A250380E32649a984717C421337E25895a97322r80325j51552
$$ 1905514 -138276 1250380 532649 -1984717 3421337 525895 -197322 -1177647 -1329199
1777a329199A95139P27592a649326L59778j65442L29584A195379P14537J709138
$$ -1329199 195139 922731 -1649326 -1289548 -1454990 -1125406 1195379 1909916 3619054
1768C619054f511509G195762A705324a252360J08287D233092b022232C238782
$$ 3619054 -6511509 7195762 1705324 -1252360 -1144073 4233092 -2022232 3238782
1759c026067A024083a068627H75269M54975a79501C63542c354626B189229J198329
$$ -3026067 1024083 -1068627 875269 1330244 -179501 363542 -3354626 2189229 3387558
1750C387558b407671P64981a62273j288830C614982d003553G07397h94239l738753
$$ 3387558 -2407671 -1642690 -162273 -1451103 3614982 -4003553 707397 -894239 -4632992
1741d632992E150390j79280A128056a615976j174726J301945o89956C015277e940996
$$ -4632992 5150390 4971110 1128056 -1615976 -2790702 -1488757 -2178713 3015277 -5940996
1731G28173a283795A550326b977926C174676A139556L11029d69609A33571L395633
$$ 728173 -1283795 1550326 -2977926 3174676 1139556 1450585 -469609 133571 3529204
1722C529204d275758a998043A080047a17708B905735c482374A801037b829757
$$ 3529204 -4275758 -1998043 1080047 -117708 2905735 -3482374 1801037 -2829757
1713A355573a913829B735757b088333C382072r66973b262196a057329j97399A464240
$$ 1355573 -1913829 2735757 -2088333 3382072 2415099 -2262196 -1057329 -1254728 1464240
1703G846589d359268A47145O057815C4844d572924D772433c587080a296524K54769
$$ 7846589 -4359268 147145 6204960 34844 -4572924 4772433 -3587080 -1296524 -1041755
1694a041755k993478H69483B22623b128469B491625a939307A235155d629190F172383
$$ -1041755 -4035233 869483 222623 -2128469 2491625 -1939307 1235155 -4629190 6172383
1684c284387A945143J332432c743171K18994J587317C79094J069677c969224a086400
$$ -3284387 1945143 3277575 -3743171 -3524177 -1936860 379094 1448771 -3969224 -1086400
1674F205696a531436a84958n271236E633602c594944A869955a387507c03329B376135
$$ 6205696 -1531436 -184958 -5456194 5633602 -3594944 1869955 -1387507 -303329 2376135
1664B322517G74371e97347A440668h20271E92233a711989A678553G3818L189294
$$ 2322517 774371 -597347 1440668 -820271 592233 -1711989 1678553 73818 3263112
1655C263112A227552n32894K757006a350481B660217c154578A505581D26668a16243
$$ 3263112 1227552 694658 3451664 -1350481 2660217 -3154578 1505581 426668 -116243
1645b18926M6532k669190A16312J672754L173407a64797j64790m098421C840276
$$ -218926 -172394 -2841584 116312 1789066 4962473 -164797 -329587 -4428008 3840276
1635B755154a19724k97873r71722k703285A368009a649329A922628g47616B02441
$$ 2755154 -119724 -417597 -1389319 -4092604 1368009 -1649329 1922628 -747616 202441
1625B341943d081605D21034b067931R56651A933321O60726b224782d4025o66272
$$ 2341943 -4081605 421034 -2067931 -1111280 1933321 2594047 -2224782 -44025 -710297
1616g10297j518651p81585f08090A332243d358516F601397A775566e545829a393045
$$ -710297 -2228948 -3010533 -608090 1332243 -4358516 6601397 1775566 -5545829 -1393045
1606A74687a941210A517290M524296I4327b26648j902586H43441A75922J628121
$$ 174687 -1941210 1517290 6041586 94327 -226648 -2129234 843441 175922 1804043
1597A804043d346801a736704k640786B113551e425566D537794C05194A20409b613568
$$ 1804043 -4346801 -1736704 -4377490 2113551 -5425566 4537794 305194 120409 -2613568
1587h03646E6282P02741c044842C961680a430687C305679j296661J51253b330059
$$ -803646 56282 759023 -3044842 3961680 -1430687 3305679 2009018 2160271 -2330059
1577f95358l49918D263865C28026F7247L233575j614770k05455b515901n17912
$$ -695358 -1045276 4263865 328026 67247 3300822 1686052 1480597 -2515901 -3033813
1568c033813E162382i38872l19377j58869j082334D94122b054248e83836n26719
$$ -3033813 5162382 -938872 -1258249 -1417118 -2499452 494122 -2054248 -583836 -1110555
1559a110555A129858A87710P296125e907111J043604E32050b004733b53927j409886
$$ -1110555 1129858 187710 7483835 -5907111 -4863507 532050 -2004733 -253927 -1663813
1550a663813o10969A859925R33584d786502C970089d43458F19229b61793o211218
$$ -1663813 -2274782 1859925 2793509 -4786502 3970089 -443458 619229 -261793 -6473011
1541f473011a171734e0769m26894B955070D32645J77392b133438E949842d93814
$$ -6473011 -1171734 -50769 -477663 2955070 432645 610037 -2133438 5949842 -493814
1531E70082b328960C223754e462152h30092B170028i93486m798333c86663G63585
$$ 570082 -2328960 3223754 -5462152 -830092 2170028 -993486 -5791819 -386663 763585
1521C546572q62370e93641B10201b545463A593987n65218J925577J069173F24526
$$ 3546572 2684202 -593641 210201 -2545463 1593987 1028769 2954346 4023519 624526
1511b874423J51312C42078P02890a518499B276289L351650a514302A880289a903412
$$ -2874423 -2723111 342078 1044968 -1518499 2276289 5627939 -1514302 1880289 -1903412
1501F178016d152546J434A116591a971868A231713M93818a076576A620176b612708
$$ 6178016 -4152546 -4151112 1116591 -1971868 1231713 1725531 -1076576 1620176 -2612708
1491A118300b789952B802974c654999i17993A320060J106394b604380l4005D636261
$$ 1118300 -2789952 2802974 -3654999 -917993 1320060 2426454 -2604380 -2638385 4636261
1481b60161C488367M592756f280344H26914N71303c867229i45129l49591B899427
$$ -260161 3488367 8081123 -6280344 826914 1398217 -3867229 -945129 -1294720 2899427
1471G5861a64659j660619E17038d5893A013955P17651D94191f22997A134837K89128
$$ 75861 -164659 -1825278 517038 -45893 1013955 1731606 494191 -622997 1134837 1423965
1461A423965J688328a211456o15426Q19572C808270b204017C199395A39139b482827
$$ 1423965 3112293 -1211456 -1826882 -1007310 3808270 -2204017 3199395 139139 -2482827
1451D85128J751008Q85867G54447P14158a085300c55739j955945C253038b631572
$$ 485128 2236136 3122003 754447 1468605 -1085300 -355739 -2311684 3253038 -2631572
1441B243169l3962f097587E243848b638691R55696B814349P47181d626075E639984
$$ 2243169 2209207 -6097587 5243848 -2638691 -1682995 2814349 3561530 -4626075 5639984
1431c167749A583042Q81792e56421A599026O934769E0741L88100J945313i232885
$$ -3167749 1583042 2464834 -556421 1599026 8533795 50741 438841 2384154 -9232885
1421b231134H804916b981299A006580K424264e372810e57062q13412D320779A005809
$$ -2231134 8804916 -2981299 1006580 3430844 -5372810 -557062 -1370474 4320779 1005809
1411d741347J172029G786221A882387J928102B58353J720475I82703M71977c088250
$$ -4741347 -3569318 7786221 1882387 3810489 258353 1978828 982703 1454680 -3088250
1401C697099q94102a611660H23540a188750l04055n87572n97131A40889b670401
$$ 3697099 2802997 -1611660 823540 -1188750 -1492805 -2080377 -2677508 140889 -2670401
1391a10586B627715C16454h470391C068805d435595E68437L142597d877850D837748
$$ -110586 2627715 316454 -8470391 3068805 -4435595 568437 3711034 -4877850 4837748
1381a388140k195708c45003j846202A938054q81310C46560P83700g0125k322437
$$ -1388140 -3583848 -345003 -2191205 1938054 1056744 346560 1130260 -70125 -2392562
1372b392562E85818C3187L35431h711616C121360j549139b365345A89656a097876
$$ -2392562 585818 33187 368618 -8711616 3121360 1572221 -2365345 189656 -1097876
1362c76539j706340C303070q48006b361641E182811a65765k371912A246855K61937
$$ -376539 -2082879 3303070 2455064 -2361641 5182811 -165765 -2537677 1246855 1508792
1353A508792c531511N34104E62773c897265F34590g33931B85462l6589J557295
$$ 1508792 -3531511 -2997407 562773 -3897265 634590 -733931 285462 248873 1806168
1344A806168b230420D082792d0462o210871b682727k17776F58896K158879b20563
$$ 1806168 -2230420 4082792 -40462 -6251333 -2682727 -2900503 658896 2817775 -220563
1334B744418a741839H281617b969139A574571d851079A141014C24789O023269
$$ 2744418 -1741839 8281617 -2969139 1574571 -4851079 1141014 324789 6348058
1326F348058a900284d54791B060845i00169A599371d753701F629945c309021J259378
$$ 6348058 -1900284 -454791 2060845 -900169 1599371 -4753701 6629945 -3309021 -2049643
1317b049643D120175A06165b17449m564382B14162a907821j563834I175659e307830
$$ -2049643 4120175 106165 -217449 -4781831 214162 -1907821 -3471655 9175659 -5307830
1307d08280F22258b901113D275423m46660c10396k643006j684957B08108b848140
$$ -408280 622258 -2901113 4275423 3828763 -310396 -2953402 -4638359 208108 -2848140
1297b826350C381882D21740L73077d04092A068062a575518j515272B760105H32981
$$ -2826350 3381882 421740 794817 -404092 1068062 -1575518 -3090790 2760105 832981
1287C744728c295061A243167J900842K192141b405867C043406j059073p7612l18509
$$ 3744728 -3295061 1243167 3144009 5336150 -2405867 3043406 1984333 1906721 1588212
1278A588212D54974c424401A718361a281465j82026D15848b345291D55750e72189
$$ 1588212 454974 -3424401 1718361 -1281465 -1463491 415848 -2345291 455750 -572189
1268b204779A635388o76435K334437A544956a801499A740946b854729E656839
$$ -2204779 1635388 958953 3293390 1544956 -1801499 1740946 -2854729 5656839
1259A736273b09193k018668D186523e96816k03524H74088k21629c186332D007105
$$ 1736273 -209193 -2227861 4186523 -596816 -800340 874088 652459 -3186332 4007105
1249H121562g630796c809831H27336l79315a272996B310586Q67280j393908a84628
$$ 8121562 -7630796 -3809831 827336 448021 -1272996 2310586 3177866 1783958 -184628
1239b22965D547785H98861g65606a65635D239685e11314G200280d46315B203876
$$ -222965 4547785 898861 -765606 -165635 4239685 -511314 7200280 -446315 2203876
1229c251318C643037j83709b038580B148661m4576e693056C461447a227000m593314
$$ -3251318 3643037 3459328 -2038580 2148661 2104085 -5693056 3461447 -1227000 -5820314
1220e820314E345625e070367f13999A22883J204744Q13968J205011l29722A32282
$$ -5820314 5345625 -5070367 -613999 122883 1327627 2141595 3346606 3016884 132282
1210d306310D267867b582193E170700A89384a5474C479501b959070b23646a7351
$$ -4306310 4267867 -2582193 5170700 189384 -15474 3479501 -2959070 -223646 -17351
1200c165715O4077B205815J784925a366007A082646c194519E891830A25960e485049
$$ -3165715 -3101638 2205815 3990740 -1366007 1082646 -3194519 5891830 125960 -5485049
1190i32769A242946K355494d10360k074375H739004b891394a217707l07998j073164
$$ -932769 1242946 3598440 -410360 -2484735 8739004 -2891394 -1217707 -1525705 -2598869
1181b598869C76177c019849A825523i76487C372423a495916b34980H19494L287987
$$ -2598869 376177 -3019849 1825523 -976487 3372423 -1495916 -234980 819494 4107481
1172D107481G65722a922186k98999C162362j073364A025383N65509a076490B503011
$$ 4107481 765722 -1922186 -2221185 3162362 2088998 1025383 1590892 -1076490 2503011
1162g83870l150242C996405E99274K27787c257211b3175j312599l77723B872142
$$ -783870 -3934112 3996405 599274 827061 -3257211 -23175 -1335774 -1713497 2872142
1152C276185a943426A691347G52343e83038A172698K51117J55920c116006D310627
$$ 3276185 -1943426 1691347 752343 -583038 1172698 1423815 1579735 -3116006 4310627
1142b614571D725867c248148C309756B08185c125165M27512g71639H37389D09392
$$ -2614571 4725867 -3248148 3309756 208185 -3125165 -2697653 -771639 837389 409392
1132C059047k09530c075775B031451k32949b242603D024563G98598b450957C398791
$$ 3059047 2849517 -3075775 2031451 1798502 -2242603 4024563 798598 -2450957 3398791
1122D563557d064422B198262e14572C634878e534266C481772E24596a677841k553810
$$ 4563557 -4064422 2198262 -514572 3634878 -5534266 3481772 524596 -1677841 -4231651
1113d231651B77045a519577B094300c971206E988000i32750k666977G654928B572651
$$ -4231651 277045 -1519577 2094300 -3971206 5988000 -932750 -3599727 7654928 2572651
1103f389383G34070b185505C644531A291940B10383e859747f71031C304896j270947
$$ -6389383 734070 -2185505 3644531 1291940 210383 -5859747 -671031 3304896 2033949
1094B033949a457223B012955I12881K001664a256427B969445F1182c928205J335735
$$ 2033949 -1457223 2012955 912881 2914545 -1256427 2969445 61182 -3928205 -2592470
1085b592470N4227p06050a4863n613429A817002a360574C498835D66718J130598
$$ -2592470 -2538243 -3244293 -14863 -5628292 1817002 -1360574 3498835 466718 1597316
1076A597316B7540a376935B9088K890469b39986B833497F62886c313648c22206
$$ 1597316 27540 -1376935 29088 2919557 -239986 2833497 662886 -3313648 -322206
1066c00523l68077J1669F569026a915196m73225D96569c013225P53398r93147
$$ -300523 -668600 -656931 6569026 -1915196 -2388421 496569 -3013225 -2259827 -3252974
1057c252974a148965C105099b389700D629232a675502N87619E401960c415439
$$ -3252974 -1148965 3105099 -2389700 4629232 -1675502 -1087883 5401960 -3415439
1048d618127a884446j594601A0179136g209685D28075c523301A177246m71582
$$ -4618127 -1884446 -3479047 10179136 -7209685 428075 -3523301 1177246 705664
1040G05664a847174j43831M02676B675362r77677F18704a057205C740943j590510
$$ 705664 -1847174 -1991005 -1588329 2675362 1697685 618704 -1057205 3740943 2150433
1031B150433a832322A156210L009132E68780a178084l808030E63099L120115a656259
$$ 2150433 -1832322 1156210 4165342 568780 -1178084 -4986114 563099 3683214 -1656259
1021A35330J077726a850236C418987D76576J461418k84075b507348j494485A561994
$$ 135330 1213056 -1850236 3418987 476576 1937994 1653919 -2507348 -4001833 1561994
1011b470913F150713D11546J031203b312889B882208f8927o13204l658949G840139
$$ -2470913 6150713 411546 1442749 -2312889 2882208 -68927 -682131 -4341080 7840139
1001F54582g68768j686949F99750a66515k872241G282407a923116G99732a93958
$$ 654582 -768768 -2455717 699750 -166515 -3038756 7282407 -1923116 799732 -193958
991c08629I15862c937561G64093N882163A164853a884049l20464B302855d725462
$$ -308629 915862 -3937561 764093 6646256 1164853 -1884049 -2204513 2302855 -4725462
981A302320b213133D097617g59069A765786d59693n82138J75336I16097e755698
$$ 1302320 -2213133 4097617 -759069 1765786 -459693 -1041831 -866495 916097 -5755698
971A488922b028869H17219a964947A492255J169727K38632f84272j555066A938065
$$ 1488922 -2028869 817219 -1964947 1492255 2661982 2900614 -684272 -2239338 1938065
961f169761B794398J378903c513168J224021A218257a098578o77669A118919D05076
$$ -6169761 2794398 4173301 -3513168 -2289147 1218257 -1098578 -1776247 1118919 405076
951b315834C364994A088455e874035E920171b790566d77408n714942A409588J930861
$$ -2315834 3364994 1088455 -5874035 5920171 -2790566 -477408 -6192350 1409588 3340449
942C340449a194793l363901d74443E077651c875842A481036c199731j470000B095067
$$ 3340449 -1194793 -4558694 -474443 5077651 -3875842 1481036 -3199731 -4669731 2095067
932g98090n65587N50034C648566c562091B581902m16884b626041q84752A523184
$$ -798090 -1363677 -813643 3648566 -3562091 2581902 2165018 -2626041 -3510793 1523184
922D667025C12923K285062F7415a405910B41331L780694A581241d583099J529136
$$ 4667025 312923 2597985 67415 -1405910 241331 4022025 1581241 -4583099 -3053963
913c053963A033101K655236b200660B03116J488250a316896N81877D22700c050364
$$ -3053963 1033101 3688337 -2200660 203116 1691366 -1316896 -735019 422700 -3050364
903E73935L028718c801423k22432g98336B029775b115505F142104d709597B815816
$$ 573935 3602653 -3801423 -4023855 -798336 2029775 -2115505 6142104 -4709597 2815816
893a479118j6033A179738L677982A14286b332788C615789b353215C242915h070895
$$ -1479118 -1495151 1179738 4857720 114286 -2332788 3615789 -2353215 3242915 -8070895
883D570870a230520L73544A724014G86742K849201a536324E125553H72265L46118
$$ 4570870 -1230520 -856976 1724014 786742 3635943 -1536324 5125553 872265 1218383
874A218383n01862a712834C004729h98310n310808F094977B736325J197924a170356
$$ 1218383 716521 -1712834 3004729 -898310 -6209118 6094977 2736325 3934249 -1170356
864A053254c958726B469104j213889f93077k713932A112809a873791l748749b483953
$$ 1053254 -3958726 2469104 1255215 -693077 -3407009 1112809 -1873791 -5622540 -2483953
854D376848l44913G36141J898958a234596k197730A366412q3297O75231c52017
$$ 4376848 4031935 736141 2635099 -1234596 -3432326 1366412 1283115 1958346 -352017
844C25163a022627B29741J492467o51720i06362j683740D587250I34743b932851
$$ 325163 -1022627 229741 1722208 1070488 -906362 -2590102 4587250 934743 -2932851
834e294107A921791N006774E0353L238299j549395J22397G12322J651999b193317
$$ -5294107 1921791 6928565 50353 3288652 1739257 1861654 712322 2364321 -2193317
824F66869J943001I76097K17043J787315E16895b75090j843456H85666b99279
$$ 666869 2609870 976097 1193140 2980455 516895 -275090 -2118546 885666 -299279
814A490434c943887A324497L54279f803466L53697A683273a948217C335022H06235
$$ 1490434 -3943887 1324497 1678776 -6803466 -6449769 1683273 -1948217 3335022 806235
804c616570a064963D384832c815966a475276C55585e247451f27720k567704F20933
$$ -3616570 -1064963 4384832 -3815966 -1475276 355585 -5247451 -627720 -3195424 620933
794B645931h73827B559868b079872k35717B184411c18720l002098B342713a281699
$$ 2645931 -873827 2559868 -2079872 -2315589 2184411 -318720 -3320818 2342713 -1281699
784d199768h11940E50647d75990H50479e431097E551213f365222A406393J805052
$$ -4199768 -811940 550647 -475990 850479 -5431097 5551213 -6365222 1406393 3211445
775C211445B07238b449237F583440D32921J149387K496772e627725C894024n14964
$$ 3211445 207238 -2449237 6583440 432921 1582308 4079080 -5627725 3894024 3379060
766C379060b102851B580284f8984D258569c574183a586968a40613D045402a602221
$$ 3379060 -2102851 2580284 -68984 4258569 -3574183 -1586968 -140613 4045402 -1602221
756b574493B456736d529951b085800k743957G123259e32696j281161M03222A685754
$$ -2574493 2456736 -4529951 -2085800 -4829757 7123259 -532696 -1813857 -1410635 1685754
746C052637K691209A894641g247522A288209J231837p95420d694379B477807d724432
$$ 3052637 5743846 1894641 -7247522 1288209 2520046 1724626 -4694379 2477807 -4724432
736A563755Q28382b481009c71602o211407i41707l81366E2049g01816q43718K98096
$$ 1563755 2392137 -2481009 -371602 -6583009 -941707 -1323073 52049 -701816 -1545534 -1247438
726a247438A887139L9623c457222B25949a419720A800014b545973k607661M96736
$$ -1247438 1887139 1926762 -3457222 225949 -1419720 1800014 -2545973 -5153634 -4656898
717d656898c27613a20137F16411Q79747a994518A847671C01160L461121e637432
$$ -4656898 -327613 -120137 616411 1496158 -1994518 1847671 301160 3762281 -5637432
707d173298A520294e391662D253990J9972770A1673270J662272n485453b1019027
$$ -4173298 1520294 -5391662 4253990 24226760 11673270 13335542 7850089 -21019027
698c7129693e674049p090296m04607I413806A273466K9752983n723674r46065
$$ -37129693 -5674049 -12764345 -13168952 9413806 1273466 31026449 25302775 24356710
690B4356710J7925011b292244m0619125K1323869K580019j2557580G77796P825535
$$ 24356710 42281721 -2292244 -42911369 -21587500 -19007481 -31565061 777796 8603331
682H603331A128028N473693a233195C100817A467973P8638f629057C674448d682567
$$ 8603331 1128028 6601721 -1233195 3100817 1467973 1546611 -6629057 3674448 -4682567
672b15636A082797B94491L89699f301547B174047a699423I30823g416395q596449
$$ -215636 1082797 294491 684190 -6301547 2174047 -1699423 930823 -7416395 -16012844
663a6012844n563221A0691330M66969K0527746j2740968G095038K5021866I656145
$$ -16012844 -21576065 10691330 11158299 31686045 18945077 7095038 32116904 9656145
654g016391j4700857j5012857a4956113c092400h12745A0768464R33265C33414
$$ -7016391 -21717248 -36730105 -14956113 -3092400 -812745 10768464 11701729 333414
645A6908788j907488D308369f15075j8192002c745385C829001c489748a316672
$$ 16908788 15001300 4308369 -615075 -18807077 -3745385 3829001 -3489748 -1316672
636B443209E35122J181865p78190J57272h11676a2634m053244B366766c86421
$$ 2443209 535122 1716987 938797 1096069 -811676 -12634 -4065878 2366766 -386421
626b717255K86561L1202A54859c490924G06737J764270e80742D55366b499857
$$ -2717255 -2430694 -2399492 154859 -3490924 706737 2471007 -580742 455366 -2499857
616b742306r62975o178719a5347j2642126r365497k6474042o8747944G011715
$$ -2742306 -3705281 -9884000 -15347 -12657473 -22022970 -48497012 -117244956 7011715
607B89380695o2838479e5153758n1804852b9127647a3891490k645892g700780
$$ 289380695 226542216 -55153758 -106958610 -29127647 -13891490 -16537382 -7700780
599b205879k811094o9516b305944o46115E132238c461131O35389C853972h837495
$$ -2205879 -5016973 -5086489 -2305944 -2952059 5132238 -3461131 -2825742 3853972 -8837495
589a923251A834916a402986k47088A809428a816250j243267B991370D09244a144599
$$ -1923251 1834916 -1402986 -1650074 1809428 -1816250 -3059517 2991370 409244 -1144599
579A954546J837956f256674H60134d80330j904180A628235K699888e300980B557719
$$ 1954546 3792502 -6256674 860134 -480330 -2384510 1628235 4328123 -5300980 2557719
569c021817a366243A980173d80729j41005j573096j229116B048530g01902B294144
$$ -3021817 -1366243 1980173 -480729 -621734 -2194830 -3423946 2048530 -701902 2294144
559c838659A719975F75466b521069B188126a93028D006794f958428E132057B422372
$$ -3838659 1719975 675466 -2521069 2188126 -193028 4006794 -6958428 5132057 2422372
549B21679J089737K39192a12821l992346A024018M029185g341205A845026j38937
$$ 221679 1311416 1550608 -112821 -4105167 1024018 5053203 -7341205 1845026 1706089
540A706089N38506e07802G94987a209921o56734B740506j337710e171274b263780
$$ 1706089 2244595 -507802 794987 -1209921 -1866655 2740506 1402796 -5171274 -2263780
530D860157c720489D765468i86179D181600b419429A626152k05592i32265B080728
$$ 4860157 -3720489 4765468 -986179 4181600 -2419429 1626152 1420560 -932265 2080728
520B745496d811614A845034D61415K668904f288321I16279d247713j234232b023590
$$ 2745496 -4811614 1845034 461415 3130319 -6288321 916279 -4247713 -5481945 -2023590
510a984191d94437B038027D21489b325869R00662D568162c404411A788780b147773
$$ -1984191 -494437 2038027 421489 -2325869 -1425207 4568162 -3404411 1788780 -2147773
500C439286D12765c698861a720658F42980a135277K23823G36556a951385B147100
$$ 3439286 412765 -3698861 -1720658 642980 -1135277 -911454 736556 -1951385 2147100
490h7671k552172A786402N2238b835333H530925a539305L35131G60717b93381
$$ -87671 -2639843 1786402 1838640 -2835333 8530925 -1539305 -1204174 760717 -293381
480c117619J284085C183401J345392k093345A074187J110082e858299c51414j528953
$$ -3117619 -1833534 3183401 4528793 2435448 1074187 2184269 -5858299 -351414 -1880367
471a880367k190347H195854D82261c950024D459508a315668A766246k56803c853334
$$ -1880367 -4070714 8195854 482261 -3950024 4459508 -1315668 1766246 1509443 -3853334
461b613274H88379b13802B647124F2715N366331e384652F749579G32292h81569
$$ -2613274 888379 -213802 2647124 62715 5429046 -5384652 6749579 732292 -881569
451B92338a537339I05252j98793J666250e090101a447726k651517J040700A7285
$$ 292338 -1537339 905252 706459 2372709 -5090101 -1447726 -4099243 -3058543 17285
441b796746B375888A025735Q83922b216499C124428e67480k2830D199998G1604
$$ -2796746 2375888 1025735 1909657 -2216499 3124428 -567480 -590310 4199998 71604
431c168611f56817C98048b140434P69009e35551F853695B281433A31304b678915
$$ -3168611 -656817 398048 -2140434 -1371425 -535551 6853695 2281433 131304 -2678915
421g29205B33287b211639C972863c816981B557740b012115k56032H54585B10314
$$ -729205 233287 -2211639 3972863 -3816981 2557740 -2012115 -2268147 854585 210314
411e11386C479359j736765L9059n10426c129994B992894b69823E016651f09740
$$ -511386 3479359 1742594 1781653 1271227 -3129994 2992894 -269823 5016651 -609740
401B732842a715557P07418j859157j197082b44777p618k203520B759773l23197
$$ 2732842 -1715557 -1008139 -2867296 -4064378 -244777 -252395 -2455915 2759773 2436576
392B436576a472710F280901b609357i6275D985391h30445A215671D45186K594694
$$ 2436576 -1472710 6280901 -2609357 -96275 4985391 -830445 1215671 445186 3039880
383C039880c017517a056591j823183J251718l472799B016777K82417o07993C455
$$ 3039880 -3017517 -1056591 -2879774 -1628056 -5100855 2016777 2299194 1691201 3455
373H34994b392681C597638i14510p89123B960505a631343r99671B868049d219006
$$ 834994 -2392681 3597638 -914510 -1703633 2960505 -1631343 -2631014 2868049 -4219006
363b662328A368601L412343c997200a7384G35292M04552K04910K400896c315602
$$ -2662328 1368601 4780944 -3997200 -17384 735292 1139844 1344754 3745650 -3315602
353I0123L528406b31933l956092h04864E41213h68790k436933h25884B150062
$$ 90123 3618529 -231933 -4188025 -804864 541213 -868790 -3305723 -825884 2150062
343A358078h64699k81188m381140I4031g17302K16743H0944J038293a006497E191198
$$ 1358078 -864699 -1145887 -5527027 94031 -717302 -500559 80944 1119237 -1006497 5191198
332a833637m436715F53174P20040a501460B912804A352891c243648D12473K986583
$$ -1833637 -6270352 653174 1373214 -1501460 2912804 1352891 -3243648 412473 3399056
323C399056g73658B156294a587838f05671k097661E296023c696628C867884a333566
$$ 3399056 -773658 2156294 -1587838 -605671 -2703332 5296023 -3696628 3867884 -1333566
313c311526A430948d95963C544892j064723C90245K550584a56237F8825L983285
$$ -3311526 1430948 -495963 3544892 2480169 390245 2940829 -156237 68825 4052110
304D052110E47283c0510j94897k770520B027806d137704J601959C368545b581073
$$ 4052110 547283 -30510 -225407 -2995927 2027806 -4137704 -2535745 3368545 -2581073
294a053457j832451l96815c88625A626708b950437B287896e14880B452604K413105
$$ -1053457 -2885908 -3282723 -388625 1626708 -2950437 2287896 -514880 2452604 4865709
285D865709c97994k784373J371901b76491q51548C574799a656434E2549J449600
$$ 4865709 -397994 -3182367 -1810466 -276491 -1128039 3574799 -1656434 52549 1502149
276A502149c913429O36336B41845g49940D69869K106233r88401b00496C57805
$$ 1502149 -3913429 -3277093 241845 -749940 469869 2576102 1587701 -200496 357805
266A35054O19895c502437A371136a064872k345718G77454B20372e33667A0516523
$$ 135054 754949 -3502437 1371136 -1064872 -3410590 777454 220372 -533667 10516523
256C420972N70143b976416G5832a745590b84373Q3684B773997A308821a827516
$$ 3420972 3991115 -2976416 75832 -1745590 -284373 -200689 2773997 1308821 -1827516
246a179804L33062k763809c71819E50859K474645h96529A485162I9507c386502
$$ -1179804 -846742 -3610551 -371819 550859 3025504 -896529 1485162 99507 -3386502
236b39674j654268d15660B934763a635341D853155c32646A060568C50760a26973
$$ -239674 -1893942 -415660 2934763 -1635341 4853155 -332646 1060568 350760 -126973
226c351427L85516b8600A296622n67460b386742j856445D513459i74j601768C600615
$$ -3351427 -2965911 -28600 1296622 729162 -2386742 -4243187 4513459 -974 -1602742 3600615
215b929040g02076H92364h0008q18587F80754b629657n253384C269128c072252
$$ -2929040 -702076 892364 -80008 -898595 680754 -2629657 -7883041 3269128 -3072252
205E82588k87379b015675A495553e03288p572619H95771l24796c24837j548534
$$ 582588 295209 -2015675 1495553 -503288 -8075907 895771 570975 -324837 -1873371
196a873371E180710E7116d011813A698898G29099K541476i22648B192580b047289
$$ -1873371 5180710 57116 -4011813 1698898 729099 3270575 -922648 2192580 -2047289
186C499K494764b268712d18090j329761g57369A43775J105079a016348j562895
$$ 3499 2498263 -2268712 -418090 -1747851 -757369 143775 1248854 -1016348 -2579243
177b579243E666850f600805b724907m449680B3251762J78942591D5838208a051027
$$ -2579243 5666850 -6600805 -2724907 -7174587 23251762 202194353 45838208 -1051027
168a08608307k4673293l4673538Q3134772e785455I1280853N5707208a144340
$$ -108608307 -133281600 -167955138 -84820366 -5785455 91280853 146988061 -1144340
160G570257l538884d924288B677499o3788m12025H06714M33180D18654K511125
$$ 7570257 4031373 -4924288 2677499 2613711 2201686 806714 1239894 418654 2929779
151B929779d361255G99301c137592D267702e069466E25113M202781A805140a296028
$$ 2929779 -4361255 799301 -3137592 4267702 -5069466 525113 4727894 1805140 -1296028
141e78810D679793h833396B198731b763862B066758a474378A98274g92854A777624
$$ -578810 4679793 -8833396 2198731 -2763862 2066758 -1474378 198274 -792854 1777624
131a293129I9085M437311g62927A152726l89103N77021K088686a595010A135981
$$ -1293129 99085 4536396 -762927 1152726 763623 1340644 3429330 -1595010 1135981
121B449660C09652J158739f377690C734822A487693c040901R79240C382056a235914
$$ 2449660 309652 1468391 -6377690 3734822 1487693 -3040901 -2061661 3382056 -1235914
111B179328g00204l21744B099781c932038G94904K057648a884599F022421a957035
$$ 2179328 -700204 -1021948 2099781 -3932038 794904 2852552 -1884599 6022421 -1957035
101g93082j081299C95294J796902C67502e708387b35815A253666J226318J46731
$$ -793082 -1874381 395294 2192196 367502 -5708387 -235815 1253666 2479984 2626715
92B626715j81947d49857H75000K302887g298760A074775e8405m420147g96505
$$ 2626715 2444768 -449857 875000 3177887 -7298760 1074775 -58405 -4478552 -796505
82H88036B7118L334401b029076d24157C89474a26540m100234a000631A616180
$$ 888036 27118 3361519 -2029076 -424157 389474 -126540 -4226774 -1000631 1616180
72a65910l205209A619530h62338F68990J174622h7755k075208b8483k642553k273206
$$ -165910 -3371119 1619530 -862338 668990 1843612 -87755 -2162963 -28483 -2671036 -4944242
62d944242G59517b403966A467988M144577A119585a041292A889348b292361k3356
$$ -4944242 759517 -2403966 1467988 5612565 1119585 -1041292 1889348 -2292361 -2315717
53b315717M81280A601702a154907a2328l790027D240619d18656j600851g03307
$$ -2315717 -1834437 1601702 -1154907 -12328 -3802355 4240619 -418656 -2019507 -703307
43a522217B632454a195596A327814a616975B666036c317351G61145L216801b024095
$$ -1522217 2632454 -1195596 1327814 -1616975 2666036 -3317351 761145 3977946 -2024095
33a922108j998448D194374a536857G42211J036826N57258i28842K4114A297441
$$ -1922108 -3920556 4194374 -1536857 742211 1779037 2336295 -928842 -904728 1297441
23B652433g3141A354996a373058j339000A345207Q18559b641149f04989F56779
$$ 2652433 -73141 1354996 -1373058 -2712058 1345207 2163766 -2641149 -604989 656779
13c083764a209172A410539a810401C33296K65971L40910d5181j6932k912149B69331
$$ -3083764 -1209172 1410539 -1810401 333296 599267 940177 -45181 -62113 -2974262 269331
2g12444k002224F537682
$$ -712444 -2714668 6537682
##PAGE= F1=5640.578599651
##FIRST=     21204.543296753, 2644.21089616403, 937992
##DATA TABLE= (F2++(Y..Y)), PROFILE
2047I37992N71226h33269j924548D43160a116281j083951M71322E14280K346333
$$ 937992 1509218 -833269 -2757817 443160 -1116281 -2200232 -1728910 514280 2860613
2038B860613a807386l0970A038383a188725A98168h909332A609360j91758M19883
$$ 2860613 -1807386 -1838356 1038383 -1188725 198168 -8909332 1609360 1417602 1837485
2029A837485c960091F9434O02308J293561K18662p89219J68413F38488a423569
$$ 1837485 -3960091 69434 671742 1965303 2183965 1394746 1563159 638488 -1423569
2019I80231b96796E455986b296962m854169C333707Q02516b034205B102217b358855
$$ 980231 -296796 5455986 -2296962 -7151131 3333707 4136223 -2034205 2102217 -2358855
2009A599467c137329A107049f991513J922361A758617a2040C331417c580828J022938
$$ 1599467 -3137329 1107049 -6991513 -5069152 1758617 -12040 3331417 -3580828 -2557890
2000b557890N07161F905285k890604d634786F85442b325432A604519e297141C336595
$$ -2557890 -2050729 6905285 4014681 -4634786 685442 -2325432 1604519 -5297141 3336595
1990b314928O42329A951800D02481O46772O63448p93660a246370A93812a593039
$$ -2314928 -1672599 1951800 402481 1049253 1712701 919041 -1246370 193812 -1593039
1980d368703B180706p51121M75628E30860J441869c692590a447128G453729f700372
$$ -4368703 2180706 1429585 1905213 530860 1972729 -3692590 -1447128 7453729 -6700372
1970b053079M01230C735870J994158d00683l49779m14945a20882k396775i37024
$$ -2053079 -1651849 3735870 5730028 -400683 -750462 -1165407 -120882 -2517657 -937024
1960D373432a398104e76963C715376b166366A092160a402305E28001e614300B732160
$$ 4373432 -1398104 -576963 3715376 -2166366 1092160 -1402305 528001 -5614300 2732160
1950b413906R25089E38937b582187B099758D3205P671245b173205A924204b451606
$$ -2413906 -1488817 538937 -2582187 2099758 43205 7714450 -2173205 1924204 -2451606
1940b46222q2501B977022j373149b730259E928877c94203l79455B420074a8192
$$ -246222 -328723 2977022 1603873 -2730259 5928877 -394203 -773658 2420074 -18192
1930D329763c967659A807407g33482l432462d4381C559847a517496D62868g81756
$$ 4329763 -3967659 1807407 -733482 -4165944 -44381 3559847 -1517496 462868 -781756
1920F471334b006380L98161J27765H10216M084071d835830K365530H4193L072641
$$ 6471334 -2006380 -1608219 -1480454 810216 4894287 -4835830 -2470300 84193 3156834
1911C156834n69428e177106b359222C829431f011116B334989a663111B462719
$$ 3156834 2587406 -5177106 -2359222 3829431 -6011116 2334989 -1663111 2462719
1902D45487b260545B057008h50803H85931B3131M523351A533071f960803b029851
$$ 445487 -2260545 2057008 -850803 885931 23131 4546482 1533071 -6960803 -2029851
1892c786490G404664A340180P69112a498472j188231C913493e95069B784599I18317
$$ -3786490 7404664 1340180 2109292 -1498472 -2686703 3913493 -595069 2784599 918317
1882A345451C88745L347797A051512K156796A601454a471251l13726k033879A54524
$$ 1345451 388745 3736542 1051512 3208308 1601454 -1471251 -1784977 -3818856 154524
1872i559381F681649c725470C77256b609025A777573b55446j046161j645137B857504
$$ -9559381 6681649 -3725470 377256 -2609025 1777573 -255446 -1301607 -2946744 2857504
1862d540749J783738B169815b112957F89494M976633i87728b60828F46438N275823
$$ -4540749 -2757011 2169815 -2112957 689494 5666127 -987728 -260828 646438 5922261
1853E922261d004005D801233e116842A782429a525731R558E7054L70360a618980
$$ 5922261 -4004005 4801233 -5116842 1782429 -1525731 -1516173 57054 427414 -1618980
1843g90301g4149B900753E26746g88131k059677B525884f2865n252387C201285
$$ -790301 -74149 2900753 526746 -788131 -2847808 2525884 -62865 -5315252 3201285
1833a766242C181217f427850B522876c01631B387781a950960r18592B056639a295423
$$ -1766242 3181217 -6427850 2522876 -301631 2387781 -1950960 -2869552 2056639 -1295423
1823f862998c221984B927574d209062i1777m773443A638465K786913A784937f620731
$$ -6862998 -3221984 2927574 -4209062 -91777 -4865220 1638465 4425378 1784937 -6620731
1813E80861J09968a558703F04378d644713C483534P655599f899815h3241D230063
$$ 580861 690829 -1558703 604378 -4644713 3483534 11139133 -6899815 -83241 4230063
1803C607448a186858D60891Q57448k03787a540508D746040m65063a141944A878270
$$ 3607448 -1186858 460891 1318339 1114552 -1540508 4746040 4280977 -1141944 1878270
1793A457580h84003D31338K687426e886778C39088b137876A990108H3950Q89183
$$ 1457580 -884003 431338 3118764 -5886778 339088 -2137876 1990108 83950 973133
1784I73133g20461j113235C289469E9075i27912d07089q60366c79067B232778
$$ 973133 -720461 -1833696 3289469 59075 -927912 -407089 -1267455 -379067 2232778
1774a174163Q0993n78444L02280E78104J187968J120907f564312G167852F78012
$$ -1174163 -1093170 -1671614 -1369334 578104 1766072 2886979 -6564312 7167852 678012
1764a057061R9084C647494b448074C972420b615324E61045i96478B5721J664440
$$ -1057061 -957977 3647494 -2448074 3972420 -2615324 561045 -996478 25721 1690161
1755A690161g52614E59929c586930C111696k60477a214225j159257g9440k408466
$$ 1690161 -752614 559929 -3586930 3111696 2851219 -1214225 -2373482 -79440 -2487906
1746b487906C486512d310466H76079a402033l843890E384109j560720A478874
$$ -2487906 3486512 -4310466 876079 -1402033 -5245923 5384109 3823389 1478874
1737g92771j348715d49182k081364B656140f438894c5537j491425A400282c011729
$$ -792771 -2141486 -449182 -2530546 2656140 -6438894 -35537 -1526962 1400282 -3011729
1727B761317A367187m04823g15217k37063B350905c299996P60528H17929l37095
$$ 2761317 1367187 962364 -715217 -952280 2350905 -3299996 -2539468 817929 480834
1718D80834J943287d341385C203776b577771A263016b166546B746308b511404
$$ 480834 2424121 -4341385 3203776 -2577771 1263016 -2166546 2746308 -2511404
1709C904083j230360a823329n54710a053763A453324N751451d592355H31162N666519
$$ 3904083 2673723 -1823329 -2378039 -1053763 1453324 7204775 -4592355 831162 6497681
1700F497681I65122d466855E147816c856331J684234R62680j850826A289891a70765
$$ 6497681 965122 -4466855 5147816 -3856331 -2172097 -1209417 -3060243 1289891 -170765
1690b320516B711722b228184F99647c525594E006651c705406B606417L28320c711657
$$ -2320516 2711722 -2228184 699647 -3525594 5006651 -3705406 2606417 2934737 -3711657
1680c809721a315781A126957N6197c796976a366973G151057a771976f52666m795108
$$ -3809721 -1315781 1126957 1183154 -3796976 -1366973 7151057 -1771976 -652666 -5447774
1671e447774E324763c759183A430833b035458B86911J851088M09742A130331f69496
$$ -5447774 5324763 -3759183 1430833 -2035458 286911 2137999 2547741 1130331 -669496
1661A202200a073520F98669a373632A899162G44163O83116E94664P17338J763912
$$ 1202200 -1073520 698669 -1373632 1899162 744163 1427279 594664 1312002 3075914
1652C075914a361611B157988b423444A700144n16304f40562J49207E26318b457379
$$ 3075914 -1361611 2157988 -2423444 1700144 1183840 -640562 -491355 526318 -2457379
1642h75718A675369L338080b68064q92416l261101C517184j742976a00113n40677
$$ -875718 1675369 5013449 -268064 -1160480 -4421581 3517184 1774208 -100113 -640790
1633f40790K28810m405769A562257a048808A966992f66240j8822B700057d036516
$$ -640790 -411980 -4817749 1562257 -1048808 1966992 -666240 -685062 2700057 -4036516
1623E03385c000461a090423B685691o35393b297479h12799q15590j19716j608286
$$ 503385 -3000461 -1090423 2685691 2050298 -2297479 -812799 -1628389 -1748105 -3356391
1614c356391e96003H85065d594850E898850A746405e065490b287001D14213b326917
$$ -3356391 -596003 885065 -4594850 5898850 1746405 -5065490 -2287001 414213 -2326917
1604A683558M073147A52869h81383j030092C38569K91512J250712d371099J967526
$$ 1683558 5756705 152869 -881383 -1911475 338569 630081 1880793 -4371099 -2403573
1595b403573j751621A717831d836970D381111C98396a25757k901182a065207A86962
$$ -2403573 -4155194 1717831 -4836970 4381111 398396 -125757 -3026939 -1065207 186962
1585A023656b793468C961062d42519C367085j376702M65080c428728g34913o53214
$$ 1023656 -2793468 3961062 -442519 3367085 1990383 2455463 -3428728 -734913 -1388127
1576a388127D289297G57003C77998L037127A553911m4272b678924m37068F034439
$$ -1388127 4289297 757003 377998 3415125 1553911 1509639 -2678924 -3115992 6034439
1566e21408l92983j015189L16624E40069b136999e29146q99702H20083O76024
$$ -521408 -914391 -1929580 -1612956 540069 -2136999 -529146 -1428848 820083 1496107
1557A496107N043440f386618J370461F54355a511337g54819j382151k82360B024908
$$ 1496107 6539547 -6386618 -5016157 654355 -1511337 -754819 -2136970 -2419330 2024908
1547C286174d841430D220621B59849j0614e58827n405462a678979D31155h70756
$$ 3286174 -4841430 4220621 259849 249235 -558827 -5964289 -1678979 431155 -870756
1537C290573F51911j20660a778255D793526b58217E74606c562635C032161f764600
$$ 3290573 651911 531251 -1778255 4793526 -258217 574606 -3562635 3032161 -6764600
1527A68002J994774e52160n978319g21803I96138K082545r07549a330456G23471
$$ 168002 2162776 -552160 -6530479 -721803 996138 3078683 2171134 -1330456 723471
1517a908983H94634K99187L480670m87246C81309c054160L79178I85Q76112b027004
$$ -1908983 894634 1193821 4674491 4187245 381309 -3054160 -2674982 985 877097 -2027004
1506A639582M773283a948889A657342a633631F648298e295974K062591A323746
$$ 1639582 6412865 -1948889 1657342 -1633631 6648298 -5295974 -3233383 1323746
1497a599866A517203k36144a201797I56864a625612E02961a489498B719089c820647
$$ -1599866 1517203 1281059 -1201797 956864 -1625612 502961 -1489498 2719089 -3820647
1487a193975I74834J458851b873968J406293D870103a053567B592397O168124
$$ -1193975 974834 2433685 -2873968 -1467675 4870103 -1053567 2592397 8760521
1479H760521f587058A000104K22590c563639h54764K68817B509290D81708g8428
$$ 8760521 -6587058 1000104 1222694 -3563639 -854764 -585947 2509290 481708 -78428
1469a579869f6588l16554G78385J695508i9601k61027H59683N20142J654321a146765
$$ -1579869 -66588 -383142 778385 2473893 -99601 -360628 859683 1379825 3034146 -1146765
1458b143251b09677D241907b280380B791097B87860b147797B69041J087470J973801
$$ -2143251 -209677 4241907 -2280380 2791097 287860 -2147797 269041 1356511 3330312
1449C330312G19639J316661i88455Q3229k034077B765950b668364B925380o69904
$$ 3330312 719639 2036300 -988455 -905226 -2939303 2765950 -2668364 2925380 2255476
1440B255476e624963D739540b868420J202744B612365J511481e112805F041347
$$ 2255476 -5624963 4739540 -2868420 -1665676 2612365 4123846 -5112805 6041347
1431b954734A527736J283914e27044B162385P044548h61906G24331J670113i596411
$$ -2954734 1527736 2811650 -527044 2162385 9206933 -861906 724331 2394444 -9596411
1421a950729H939061a739117B59010L046456e367752d71628j11494D481981f1619
$$ -1950729 8939061 -1739117 259010 3305466 -5367752 -471628 -583122 4481981 -61619
1411d864223J914586G140477A980118K097436C1556K103498F93694J247149c337422
$$ -4864223 -2949637 7140477 1980118 4077554 31556 2135054 693694 1940843 -3337422
1401D144643p46217a445942A451892a31876k272446j83366k3600c80966j605487
$$ 4144643 3398426 -1445942 1451892 -131876 -2404322 -2587688 -2611288 -380966 -1986453
1392a986453A82455L820278e53427p736905B999340d392434b57690D400235e273500
$$ -1986453 182455 4002733 -553427 -8290332 2999340 -4392434 -257690 4400235 -5273500
1382D869690b481625j069484B27905a936377A309730E24446G2740J495797a047191
$$ 4869690 -2481625 -3551109 227905 -1936377 1309730 524446 72740 1568537 -1047191
1372b265833A346671e56728D11693h781888C160540F86818a670032a13549j194889
$$ -2265833 1346671 -556728 411693 -8781888 3160540 686818 -1670032 -113549 -1308438
1363a308438F7588a680827B960788o01441b500286E242273a018734j268469H82769
$$ -1308438 67588 -1680827 2960788 2359347 -2500286 5242273 -1018734 -2287203 882769
1353A516611c149115J99861f50992l160426E55578f10057D02978M10198R81073
$$ 1516611 -3149115 -2949254 -650992 -3811418 555578 -610057 402978 813176 1794249
1344A794249b812242D129497h07340l874682J941328J63872D55152K597916b24528
$$ 1794249 -2812242 4129497 -807340 -4682022 -2740694 -2576822 455152 3053068 -224528
1334B485296a070948H390742b841525A414901c945467E17901b86692F861395a633590
$$ 2485296 -1070948 8390742 -2841525 1414901 -3945467 517901 -286692 6861395 -1633590
1324e70993A318663A49579J462865e189486E873351c619687a670266C560236E39664
$$ -570993 1318663 149579 1612444 -5189486 5873351 -3619687 -1670266 3560236 539664
1314b236212k037131E63137b143766j545509H006429d924504d47376G33113b502374
$$ -2236212 -4273343 563137 -2143766 -3689275 8006429 -4924504 -447376 733113 -2502374
1304D563779j222062E72411b951320k320821a57744r33637j765632C878452H29834
$$ 4563779 3341717 572411 -2951320 -5272141 -157744 -1091381 -2857013 3878452 829834
1294E18267F5806J438726a785322j734842C042159C26980L171257c014512A732896
$$ 518267 65806 1504532 -1785322 -3520164 3042159 326980 3498237 -3014512 1732896
1284C742314J792844a558258H21918J426992k72676n68286C86811c385710A242021
$$ 3742314 5535158 -1558258 821918 2248910 1976234 1407948 386811 -3385710 1242021
1274f31607p12434G77960b444337A123495f96172o19947I24351L62690J888694
$$ -631607 -1344041 777960 -2444337 1123495 -696172 -1316119 924351 1287041 3175735
1265C175735j120934b362592B025180b690406E531144A740379d56965j830292
$$ 3175735 2054801 -2362592 2025180 -2690406 5531144 1740379 -456965 -2287257
1257b287257D816929a069854p29852A659615D80989c205151D007955L393654h348401
$$ -2287257 4816929 -1069854 -1799706 1659615 480989 -3205151 4007955 7401609 -8348401
1247d066967I34780k90783a106735A514435K174274j822749g80194l91967D627990
$$ -4066967 934780 643997 -1106735 1514435 3688709 1865960 -780194 -1172161 4627990
1237D81720g47430F24328L750010a70306G437084a136006B726122d000027C325142
$$ 481720 -747430 624328 4374338 -170306 7437084 -1136006 2726122 -4000027 3325142
1227C611913a137558B373296J327842f870644B379359h32583m839007D986709
$$ 3611913 -1137558 2373296 3701138 -6870644 2379359 -832583 -5671590 4986709
1218e377102g31431B13J046745J644991R84181n31194A03654d591118D305444
$$ -5377102 -731431 213 1046958 2691949 3676130 3144936 103654 -4591118 4305444
1208a973451D569746a71423C93293J991642b588477F94607e2614l615888N76360
$$ -1973451 4569746 -171423 393293 2384935 -2588477 694607 -52614 -3668502 -3092142
1199c092142B502358L922760a324832F15790a512976F498741F87203e496898a280346
$$ -3092142 2502358 6425118 -1324832 615790 -1512976 6498741 687203 -5496898 -1280346
1189A362299K355948b98627k024194H010710c940289g54208l31712q87186G42305
$$ 1362299 3718247 -298627 -2322821 8010710 -3940289 -754208 -1085920 -1973106 742305
1179b745443A547368d52362C600733a231888G15264o613L722993I27115b946458
$$ -2745443 1547368 -452362 3600733 -1231888 715264 708651 4431644 927115 -2946458
1169b316955B475259l2235F34306Q66724a090585B809496b53201m645516C908950
$$ -2316955 2475259 2443024 634306 1501030 -1090585 2809496 -253201 -4898717 3908950
1159E65192l4712c902323B25825h25312j016025B668102J70545b170980B015539
$$ 565192 530480 -3902323 225825 -825312 -1841337 2668102 2838647 -2170980 2015539
1149A719505e02339A093685J19658N09371c164147C756454b296842D644955c750153
$$ 1719505 -502339 1093685 1213343 1722714 -3164147 3756454 -2296842 4644955 -3750153
1139C537014A71852b104766n98504a147912A284421m3223J065496l30008c002639
$$ 3537014 171852 -2104766 -2703270 -1147912 1284421 1241198 2306694 1976686 -3002639
1129A912456j68226b387478C776799e28455j926093C049523J263461c815717A649331
$$ 1912456 1744230 -2387478 3776799 -528455 -2454548 3049523 4312984 -3815717 1649331
1119a85998C626009d910213C072585c04389j612930k158813h98068j65504A401727
$$ -185998 3626009 -4910213 3072585 -304389 -1917319 -4076132 -898068 -1063572 1401727
1109c559702F118825a018775k433499G430737B676082f166473A468020c809012
$$ -3559702 6118825 -1018775 -3452274 7430737 2676082 -6166473 1468020 -3809012
1100C453636A167051m77581f600301e69898D042953j806675e91348A960500r58107
$$ 3453636 1167051 689470 -6600301 -569898 4042953 2236278 -591348 1960500 1002393
1091A002393J634575a466168B508729G11868c815559R62136j51238Q65632A24150
$$ 1002393 2636968 -1466168 2508729 711868 -3815559 -2853423 -3004661 -2139029 124150
1081e501010B042378a086223C491480A257766m7039i4282o97784g413B385397
$$ -5501010 2042378 -1086223 3491480 1257766 1210727 -94282 -792066 -7413 2385397
1071e86701D817038A138529b367134g79339b79276k37481o41290F512069a524652
$$ -586701 4817038 1138529 -2367134 -779339 -279276 -516757 -1158047 6512069 -1524652
1061b885231D52514b799799N63055k126986a518361B493152a409952D185657a204738
$$ -2885231 452514 -2799799 -2236744 -4363730 -1518361 2493152 -1409952 4185657 -1204738
1051f73585D802671b869087j914144a283856k620079I984420f909312A88067c184848
$$ -673585 4802671 -2869087 -4783231 -1283856 -3903935 9984420 -6909312 188067 -3184848
1041A080237m48417b498013i53067j353669B312070m06650p01259a503324B932932
$$ 1080237 631820 -2498013 -953067 -2306736 2312070 1905420 1204161 -1503324 2932932
1031C025204a636220A372866K549940A274158a506939k580502A87901L657083
$$ 3025204 -1636220 1372866 3922806 1274158 -1506939 -4087441 187901 3844984
1023C844984a868084D70939L61664a466911C167466E61689J350116N48303c959215
$$ 3844984 -1868084 470939 832603 -1466911 3167466 561689 1911805 2460108 -3959215
1013c534412B525619c005943G150926F00767M61539b474077B764991c10964C58091
$$ -3534412 2525619 -3005943 7150926 600767 1062306 -2474077 2764991 -310964 358091
1003d310234F213412F84381i78243o41150G92715d04116k056627F340328a809843
$$ -4310234 6213412 684381 -978243 -1619393 792715 -404116 -2460743 6340328 -1809843
993A002516e71733J82767F85943d087106G62335N415978A337077a781657o53714
$$ 1002516 -571733 -388966 685943 -4087106 762335 6178313 1337077 -1781657 -2435371
984b435371A731605c988655B138121d456450D706366b44273f8531m5490q6202
$$ -2435371 1731605 -3988655 2138121 -4456450 4706366 -244273 -68531 -114021 -200223
975b00223q4850E71261f072019A682895a779202a35286j778206A250285J184888
$$ -200223 -285073 571261 -6072019 1682895 -1779202 -135286 -1913492 1250285 2435173
966B435173k29029a8145l484858A440763d905848B467328K456101b918173N33158
$$ 2435173 2206144 -18145 -3503003 1440763 -4905848 2467328 4923429 -2918173 -2385015
957b385015G84811g94728j451342A273030n72710b568626C998190A419300e585625
$$ -2385015 784811 -794728 -2246070 1273030 700320 -2568626 3998190 1419300 -5585625
947F096712b280449f05508n267313A685590R76375a677568k095454a006753E035288
$$ 6096712 -2280449 -605508 -5872821 1685590 2661965 -1677568 -3773022 -1006753 5035288
937d543060B247457b549486j800978B491680a020295o8414L29144C407841c164104
$$ -4543060 2247457 -2549486 -4350464 2491680 -1020295 -1088709 -759565 3407841 -3164104
927B529812q44078c509672J496268A736638L514218B34388K547537A2270c46923
$$ 2529812 1685734 -3509672 -2013404 1736638 5250856 234388 2781925 12270 -346923
917A9804L438573A208775c424601j53602D32896L510790b337036C59521J905485
$$ 19804 3458377 1208775 -3424601 -3578203 432896 3943686 -2337036 359521 2265006
908B265006a459060C53610M26206b948410F15076K317584c651853j379850h03451
$$ 2265006 -1459060 353610 779816 -2948410 615076 2932660 -3651853 -5031703 -803451
898B176129a496283F607763c753998B823359a583042g62320I75362L568322E1804
$$ 2176129 -1496283 6607763 -3753998 2823359 -1583042 -762320 975362 4543684 51804
888b321939C602653b678920C382556g689945C765065i1882p30154A889660p01306
$$ -2321939 3602653 -2678920 3382556 -7689945 3765065 -91882 -822036 1889660 1188354
879A188354J816505g93716E200905C09577J613360I54009b179833B900879a004645
$$ 1188354 3004859 -793716 5200905 309577 1922937 954009 -2179833 2900879 -1004645
869e935206F828369B846347N70624a147597A151365d334368B279978C32071b36834
$$ -5935206 6828369 2846347 3416971 -1147597 1151365 -4334368 2279978 332071 -236834
859b847545A781688d001891L26028R90629E118625j338929A452400N9415d03269
$$ -2847545 1781688 -4001891 -3675863 -2685234 5118625 3779696 1452400 1511815 -403269
849c628488G89487C71705J742521a77759E92345a312344b2188B099941E98964
$$ -3628488 789487 371705 2114226 -177759 592345 -1312344 -22188 2099941 598964
839h51921j570302C727337A060954b201012l457223A547391N608255b24004C086312
$$ -851921 -2422223 3727337 1060954 -2201012 -5658235 1547391 7155646 -224004 3086312
829A515089J201339A143796J153010b556443A473840R73342I93436O58959R75943
$$ 1515089 2716428 1143796 2296806 -2556443 1473840 2447182 993436 1652395 2628338
820B628338F67483b30003r70977A247945g83199A81049d735885A806080k02899
$$ 2628338 667483 -230003 -1200980 1247945 -783199 181049 -4735885 1806080 1603181
811A603181g008071N15896A268299b144702C224028d34950l714627A17798L759304
$$ 1603181 -7008071 -6492175 1268299 -2144702 3224028 -434950 -4149577 117798 3877102
802C877102d447840d90646E14651c824668a846555j277225E48042K038508a587080
$$ 3877102 -4447840 -490646 514651 -3824668 -1846555 -3123780 548042 2586550 -1587080
792B289552a606401j276548B303797i63623j888022C116059h34189l035919B76746
$$ 2289552 -1606401 -2882949 2303797 -963623 -2851645 3116059 -834189 -3870108 276746
782a3155A67233M9585d658166E465783f729255A370593J646575B8495b136060
$$ -13155 167233 216818 -4658166 5465783 -6729255 1370593 3017168 28495 -2136060
772F422077f57847A559220J787404e457645C587955j229415b021848B026157b30071
$$ 6422077 -657847 1559220 3346624 -5457645 3587955 2358540 -2021848 2026157 -230071
762C114163b423496K27072E06146L624407b326954k02814B101870d591352a740183
$$ 3114163 -2423496 -2196424 506146 4130553 -2326954 -2529768 2101870 -4591352 -1740183
752d551609G273675f07560r47732J45553A292808K013538K719382B110357g837715
$$ -4551609 7273675 -607560 -1555292 -1409739 1292808 3306346 6025728 2110357 -7837715
742I62635J693905j274364d560597B150912e344851A201588Q79440b925969A125675
$$ 962635 2656540 1382176 -4560597 2150912 -5344851 1201588 2081028 -2925969 1125675
732f890982c3912j536555D68575b18344j700783j09994B191769o92294c608943
$$ -6890982 -33912 -1570467 468575 -218344 -1919127 -2029121 2191769 1499475 -3608943
722d87925j330890A669457b605841l219828J040106i99988F80492a73285A507769
$$ -487925 -1818815 1669457 -2605841 -5825669 -4785563 -999988 680492 -173285 1507769
712b181721A512353o51796J764438d262261J74321A581841e380823C929214J7385320
$$ -2181721 1512353 860557 2624995 -4262261 -4087940 1581841 -5380823 3929214 21314534
703B1314534j0230653P70712m624134b0165645j4443638e598825o928418j401375
$$ 21314534 11083881 11854593 7230459 -20165645 -34609283 -5598825 -12527243 -13928618
695a3928618H697799A128345K9019958m955322j732040J4654380a183672l9300716
$$ -13928618 8697799 1128345 30148303 25192981 23460941 38115321 -1183672 -40484388
687d0484388J9992009L609594j2237917B74947P262829A532644N200649a123884
$$ -40484388 -20492379 -16882785 -29120702 274947 7537776 1532644 6733293 -1123884
678C107412H05476J054987f684176C494691d653329i5800H45306B74057J009792
$$ 3107412 805476 1860463 -6684176 3494691 -4653329 -95800 845306 274057 1283849
669A283849e848937A615484a418688A147719h004175q125855m952981A0491718
$$ 1283849 -5848937 1615484 -1418688 1147719 -8004175 -16130030 -21083011 10491718
660A0754926J8191041j1948665G504214K1080090I295300f727295j1282954j7557431
$$ 10754926 28945967 16997302 7504214 28584304 9295300 -6727295 -18010249 -35567680
652c5567680a4959220b568631R66078A0692475R38529A294507J4765050j504638
$$ -35567680 -14959220 -2568631 -1602553 10692475 11631004 1294507 16059557 14554919
644A4554919E814045a249706j6428413b951136D738492d488648a950545B636324
$$ 14554919 5814045 -1249706 -17678119 -2951136 4738492 -4488648 -1950545 2636324
635C25160J530209F89759N94900g06261a8319m511419A998431e17175j983752
$$ 325160 1855369 689759 1284659 -706261 -18319 -4529738 1998431 -517175 -2500927
626b500927p84033P84335h1935m199960E56468K308028c16158A39737b174778
$$ -2500927 -3284960 -2500625 -81935 -4281895 556468 2864496 -316158 139737 -2174778
616a577166k430518m928659f73047j2114917q283175k4614903o1428537E028825
$$ -1577166 -4007684 -8936343 -673047 -12787964 -21071139 -45686042 -107114579 5028825
607B64542713n8595497e0832523m5890808b7924203J3711041j092037g361071
$$ 264542713 205947216 -50832523 -96723331 -27924203 -14213162 -15305199 -7361071
599a619198l749021o18344a714037j027577D689654c546928Q17778C373937h005626
$$ -1619198 -5368219 -5986563 -1714037 -2741614 4689654 -3546928 -2729150 3373937 -8005626
589b031225B719816b301557k95413B007361b003108q27593C150632A101065a304171
$$ -2031225 2719816 -2301557 -2596970 2007361 -2003108 -2830701 3150632 1101065 -1304171
579B764568J090921f513630I24505a22063k374485A491904K153945f203446B216186
$$ 2764568 3855489 -6513630 924505 -122063 -2496548 1491904 3645849 -6203446 2216186
569c775526a478145B472629d13808B41282b463986Q6535A939648a085980B801563
$$ -3775526 -1478145 2472629 -413808 241282 -2463986 -2377451 1939648 -1085980 2801563
559c886588I14785m06862c079377B974773e94643C423571f356300D974041B254184
$$ -3886588 914785 507923 -3079377 2974773 -594643 3423571 -6356300 4974041 2254184
549A70008K28969K350256a01917m214017C11421M083705g827461A442412J375023
$$ 170008 398977 2749233 -101917 -4315934 311421 4395126 -7827461 1442412 2817435
540B817435o93217d92652H48705a040733j896287B433173m32234f325762a406415
$$ 2817435 2124218 -492652 848705 -1040733 -2937020 2433173 2000939 -6325762 -1406415
530E287903c440239D583947a038896D079737a986411B236699m95668d56312B131940
$$ 5287903 -3440239 4583947 -1038896 4079737 -1986411 2236699 1741031 -456312 2131940
520C388656e024724B096204H10146K354133f966994A090955c760224k102120a028297
$$ 3388656 -5024724 2096204 810146 3164279 -6966994 1090955 -3760224 -5862344 -1028297
510b077074F4044K710304d46330r22574f20045D102673b700013H99054b259863
$$ -2077074 64044 2774348 -446330 -1368904 -620045 4102673 -2700013 899054 -2259863
500C075887c25942l088111a546361I05800e95993r20933I98564i29789B168241
$$ 3075887 -325942 -3414053 -1546361 905800 -595993 -1516926 998564 -929789 2168241
490b9694l096192A576106P44789c309587H411274a500292Q1271H35827a693904
$$ -29694 -3125886 1576106 2320895 -3309587 8411274 -1500292 -1419021 835827 -1693904
480b613296P73078B761165J103685j480881A138422R32646e586825b81588j907637
$$ -2613296 -1840218 2761165 3864850 2383969 1138422 2071068 -5586825 -281588 -2189225
471b189225q35108G436404G49910c892996D105252a962548B432705H52682c961767
$$ -2189225 -3024333 7436404 749910 -3892996 4105252 -1962548 2432705 852682 -3961767
461b922976I82523a117909C564270d40707E482185d491617E838016A250748e09846
$$ -2922976 982523 -1117909 3564270 -440707 5482185 -4491617 5838016 1250748 -509846
451a312606k44990A304372C42240K000831d931891K232879j055891J621354A03434
$$ -1312606 -1557596 1304372 342240 2343071 -4931891 -2699012 -3754903 -2133549 103434
441b831978D244145F74699M02848b376617C208939E2229h62163D024826h68942
$$ -2831978 4244145 674699 1077547 -2376617 3208939 52229 -862163 4024826 -868942
431b639866c31483A645370a556242m28012g04398G331334A963086F46370b811995
$$ -2639866 -331483 1645370 -1556242 -1984254 -704398 7331334 1963086 646370 -2811995
421d57096D89855b749704D881548c883117C212135b728616m2940E71997b80250
$$ -457096 489855 -2749704 4881548 -3883117 3212135 -2728616 -2771556 571997 -280250
411a153775C969530A339003L03925m47551c662762C188964c39460E150327f20163
$$ -1153775 3969530 1339003 1642928 1195377 -3662762 3188964 -339460 5150327 -620163
401B349105b745083a053737j206975j905543a03735k257275K34789B195783L87313
$$ 2349105 -2745083 -1053737 -2260712 -4166255 -103735 -2361010 -2126221 2195783 2583096
392B583096a716728E100261b998925J144660E516029a483080A104266D27845J405186
$$ 2583096 -1716728 5100261 -2998925 -1854265 5516029 -1483080 1104266 427845 1833031
383A833031b752419a346503j241046P20667m315613B168223L13649m48775e89334
$$ 1833031 -2752419 -1346503 -2587549 -1866882 -6182495 2168223 2481872 2033097 -589334
373A148174b719432C777089h58566p26336B201723a782494r73884B709803d323598
$$ 1148174 -2719432 3777089 -858566 -1584902 2201723 -1782494 -2756378 2709803 -4323598
363a535056A486299L161842d743927G71609k54309R10154E94154J895255c520540
$$ -1535056 1486299 4648141 -4743927 771609 517300 1427454 594154 2489409 -3520540
353f5084C709102f0421m299689d46546J22560p57269k916841a421285B115660
$$ -65084 3709102 -60421 -4360110 -446546 -323986 -1081255 -3998096 -1421285 2115660
343G47199a602192j06902m233266B25599h88967d12131A08369K80011g31724E404478
$$ 747199 -1602192 -1709094 -5942360 225599 -888967 -412131 108369 388380 -731724 5404478
332b469190m384243F94126K84010a099911C272701F41690c772053F09247K095469
$$ -2469190 -6853433 694126 978136 -1099911 3272701 641690 -3772053 609247 2704716
323B704716i02049B582177a205958J29369j449135D603404c897189C644017b423428
$$ 2704716 -902049 2582177 -1205958 -1076589 -2525724 4603404 -3897189 3644017 -2423428
313b918228A801292b96990C716898r46133c73582B515754E46Q19825L219726B00888
$$ -2918228 1801292 -296990 3716898 2770765 -373582 2515754 546 820371 4040097 200888
302F6838b23223l291456A709464d164248J448444D104802b649373a070773o38886
$$ 66838 -223223 -3514679 1709464 -4164248 -2715804 4104802 -2649373 -1070773 -1709659
293a709659l132339i3251E48371b133550B640096a58624B516574K276972c22380
$$ -1709659 -4841998 -93251 548371 -2133550 2640096 -158624 2516574 4793546 -322380
283b800792M77336F76965f41590C416438a708589d70102A785738c530242J075729
$$ -2800792 -2323456 676965 -641590 3416438 -1708589 -470102 1785738 -3530242 -2454513
274b454513I08141h86112A280606J198963j003566a001450F75222g372A296596
$$ -2454513 908141 -886112 1280606 2479569 1476003 -1001450 675222 -7372 1296596
264d446407A602091a203339j678824F03618A83208L81160R031052C360523j21505
$$ -4446407 1602091 -1203339 -2882163 603618 183208 564368 9595420 3360523 3239018
255C239018b625425a28813j091924J82712d39529C879449E62144b268778N28304
$$ 3239018 -2625425 -128813 -1220737 -1038025 -439529 3879449 562144 -2268778 -1740474
246a740474Q52950k016511d59897D19694J905021a641173B003608a398l240002
$$ -1740474 -887524 -2904035 -459897 419694 2324715 -1641173 2003608 -1398 -3241400
237c241400C24515c457914g4340B428302a742401D801825e60452A519901E26084
$$ -3241400 324515 -3457914 -74340 2428302 -1742401 4801825 -560452 1519901 526084
227C9577c699497J153499a23893A320094l10325a738434l125677D746868B94646
$$ 39577 -3699497 -2545998 -123893 1320094 1009769 -1738434 -4864111 4746868 294646
217g20900C584315c352856i82617H16291e87768j12212C08780c133991m373746
$$ -720900 3584315 -3352856 -982617 816291 -587768 -699980 308780 -3133991 -7507737
208g507737C532515b531432D74204B22970b187666A089061A19828g633632A371471
$$ -7507737 3532515 -2531432 474204 222970 -2187666 1089061 119828 -7633632 1371471
198C57715i48146r45416D497695A210075d342590A758025q59522J828270a925147
$$ 357715 -948146 -1893562 4497695 1210075 -4342590 1758025 898503 2726773 -1925147
188C447414b515871A47241K412562b087552e03127q12341J76562N43619B411580
$$ 3447414 -2515871 147241 2559803 -2087552 -503127 -1315468 -1138906 -595287 2411580
178g23514k170928E685385g564137b260489m226203B1793162J65621672D1573560
$$ -723514 -2894442 5685385 -7564137 -2260489 -6486692 21793162 187414834 41573560
169a961198r7209382k4132816k8790463P4695844e133843H2241848N4209264c95585
$$ -1961198 -99170580 -123303396 -152093859 -77398015 -5133843 82241848 136451112 -395585
160E964376j520627d699745B387495O24454r77611q47911j84514K43633L03569
$$ 5964376 4443749 -4699745 2387495 3011949 2034338 1186427 1001913 1245546 1549115
151A549115d939613E08216b368920D391419d490895D74991L645317j689636a717939
$$ 1549115 -4939613 508216 -2368920 4391419 -4490895 474991 4120308 2430672 -1717939
141i30220D629635i265182A951440b774129A696432i24624A374422a049026A781696
$$ -930220 4629635 -9265182 1951440 -2774129 1696432 -924624 1374422 -1049026 1781696
131a448195A157345M649319a943412A492381L88162I31183K847375h38836E57964
$$ -1448195 1157345 5806664 -1943412 1492381 1880543 931183 3778558 -838836 557964
121B296835G34940O11738f815697C681936j403441b703597J43053D100960a534862
$$ 2296835 734940 1346678 -6815697 3681936 2278495 -2703597 -2560544 4100960 -1534862
111A988801c41981j117908B344409d806618B12429K968236a525377E527952a278672
$$ 1988801 -341981 -1459889 2344409 -4806618 212429 3180665 -1525377 5527952 -1278672
101a398498m59862B17873J969684D97557e213843h31829A580634J245479N25386
$$ -1398498 -1858360 217873 2187557 497557 -5213843 -831829 1580634 2826113 3351499
92C351499p61631i55539A112646J023336f244177A065399a68484l877538c97333
$$ 3351499 2589868 -955539 1112646 2135982 -6244177 1065399 -168484 -4046022 -397333
82C24189O78117K551729b513336H61969d57685G20114d595155a263569A690714
$$ 324189 1002306 3554035 -2513336 861969 -457685 720114 -4595155 -1263569 1690714
72C04710b272977B69849d75401I50317P99182F94139b041156d88002k265584k251877
$$ 304710 -2272977 269849 -475401 950317 1749499 694139 -2041156 -488002 -2753586 -5005463
62e005463I99757b605278A446751M877827b94495r47653A331054a649687j058288
$$ -5005463 999757 -2605278 1446751 6324578 -294495 -1242148 1331054 -1649687 -2707975
53b707975a089023A337633b65288j19229k876183C738970G24222b465712B55517
$$ -2707975 -1089023 1337633 -265288 -384517 -3260700 3738970 724222 -2465712 255517
43a541745A753473a132202A313737a563920A516491b454572H79557L114355a461912
$$ -1541745 1753473 -1132202 1313737 -1563920 1516491 -2454572 879557 3993912 -1461912
33b535488j716451D343836a553633b36569B568578q84522g23278a53250F03361
$$ -2535488 -4251939 4343836 -1553633 -236569 2568578 1684056 -723278 -153250 603361
23C017318E91317K74954i78673j923851A271998J330903b450820e59766H52634
$$ 3017318 591317 866271 -978673 -2902524 1271998 2602901 -2450820 -559766 852634
13c356368h97471A390634a442664F77681J73751A61613K98999F8665c060046E67635
$$ -3356368 -897471 1390634 -1442664 677681 851432 161613 460612 68665 -3060046 567635
2h2877k449627F471475
$$ -82877 -2532504 6471475
##PAGE= F1=5618.780329767
##FIRST=     21204.543296753, 2644.21089616403, 884259
##DATA TABLE= (F2++(Y..Y)), PROFILE
2047H84259N81375i86618r02155D86987a509705p79533J57114H46740J548087
$$ 884259 1465634 -986618 -1888773 486987 -1509705 -2289238 -2132124 846740 2394827
2038B394827b412493O71332A067573i30250F20282i189062A213374k16706Q97873
$$ 2394827 -2412493 -1741161 1067573 -930250 620282 -9189062 1213374 996668 1894541
2029A894541c601166i447A261169K90145J115026j218950j19979l69423i60052
$$ 1894541 -3601166 -9447 1261169 1551314 2666340 1447390 1327411 957988 -960052
2019A048222a4574D852963b846420l880378B763794J117998a931271A164377b744021
$$ 1048222 -14574 4852963 -2846420 -6726798 2763794 3881792 -1931271 1164377 -2744021
2009A590332c624596A420156g569898L035800A960472i90067B801159c780970
$$ 1590332 -3624596 1420156 -7569898 -4534098 1960472 -990067 2801159 -3780970
2000a706930q35258F843684k930175d413212A257776b700371A327110e180959
$$ -1706930 -2542188 6843684 3913509 -4413212 1257776 -2700371 1327110 -5180959
1991B570185b003583m50580A979610F58599j23425J330894B66904a533845N03206
$$ 2570185 -2003583 -2454163 1979610 658599 535174 1866068 266904 -1533845 -1030639
1982a030639J33109l404629B244315r56657Q28741D62898J671146c606509J451387
$$ -1030639 -897530 -4302159 2244315 1287658 2116399 462898 2134044 -3606509 -2155122
1973b155122H716379g222680a914141M13622D313327R74245b66926m79221K12355
$$ -2155122 8716379 -7222680 -1914141 -1500519 4313327 5287572 -266926 -746147 -533792
1964e33792b36097j549834M06350D355226a483933B69719K932067c452287A496200
$$ -533792 -236097 -1785931 -1379581 4355226 -1483933 269719 3201786 -3452287 1496200
1954a299611D42733f606966B978213c353228a365859B55051b106950G30594P06843
$$ -1299611 442733 -6606966 2978213 -3353228 -1365859 255051 -2106950 730594 1437437
1945A437437N208720b093115A598277b615578G16920f35386B082093m56024b677985
$$ 1437437 6646157 -2093115 1598277 -2615578 716920 -635386 2082093 1626069 -2677985
1935D962398H082g38026C526051a317552D634550c751150I54381c55464m766412
$$ 4962398 8082 -738026 3526051 -1317552 4634550 -3751150 954381 -355464 -5121876
1926e121876c63888D442504f68181A20033f48411F002545d25268j009400l25435
$$ -5121876 -363888 4442504 -668181 120033 -648411 6002545 -425268 -1434668 -1760103
1917a760103B7446M899806d585623J532927C40037K475432j89433e093061b358409
$$ -1760103 27446 4927252 -4585623 -3052696 340037 2815469 2626036 -5093061 -2358409
1907C931705g638855B848041a439948A722970m01974b455452B213027f19947a54192
$$ 3931705 -7638855 2848041 -1439948 1722970 1320996 -2455452 2213027 -619947 -154192
1897C17410L325977A146724g596851b375533j110785F426504A474685P93071a683451
$$ 317410 3643387 1146724 -7596851 -2375533 -3486318 6426504 1474685 2267756 -1683451
1887b810533C930183b42423B245759r93404J89988n83569L100962F99035K303483
$$ -2810533 3930183 -242423 2245759 1252355 1442343 858774 3959736 699035 3002518
1878C002518B46187D3005a285725l535152b86397q057268F464716c459261a4831
$$ 3002518 246187 43005 -1285725 -4820877 -286397 -8343665 6464716 -3459261 -14831
1868c534113A471301H0243a420055n92062B118027d643812J734681B816756a701818
$$ -3534113 1471301 80243 -1420055 -2012117 2118027 -4643812 -2909131 2816756 -1701818
1858F75026M891982a426011d52385F94916O297300d435063D345433d396476B174244
$$ 675026 5567008 -1426011 -452385 694916 6992216 -4435063 4345433 -4396476 2174244
1848a726626O65394E49813O82200a618104f48061B96336K227731F97581a030642
$$ -1726626 -1061232 549813 1232013 -1618104 -648061 296336 2524067 697581 -1030642
1838c598860B873147g23589m348550D756061a677006B852504f582547C403144
$$ -3598860 2873147 -723589 -5072139 4756061 -1677006 2852504 -6582547 3403144
1829d76477C001046b398305m63736A669864b006977m448389c223150B656690d400943
$$ -476477 3001046 -2398305 -2862041 1669864 -2006977 -6455366 -3223150 2656690 -4400943
1819G20439e164748A963373K845421A343953f030527A042715C10984a876903D64659
$$ 720439 -5164748 1963373 4808794 1343953 -6030527 1042715 310984 -1876903 464659
1809e357451C833658P394948g497473c53692D402572l60666b13710j19654A866396
$$ -5357451 3833658 11228606 -7497473 -353692 4402572 4041906 -213710 -333364 1866396
1799A243925a470641E899246p48828b030125A258351Q54354a072951G28600K450753
$$ 1243925 -1470641 5899246 5150418 -2030125 1258351 2112705 -1072951 728600 3179353
1790C179353e431988g7801k140633B060844D78612M69367b048457N93906C100989
$$ 3179353 -5431988 -77801 -2218434 2060844 478612 947979 -2048457 -1454551 3100989
1780c61154j215389D51611a282110N05507C398789f66965k36015q47927J51974
$$ -361154 -1576543 451611 -1282110 -776603 3398789 -666965 -902980 -1750907 -1598933
1771a598933G6604J581518N12784f444241G037815a63478o28856K75024B931054
$$ -1598933 76604 1658122 2170906 -6444241 7037815 -163478 -792334 -517310 2931054
1761b648941D518596b028003B10855h58489K76689B203236a267850G73468c668403
$$ -2648941 4518596 -2028003 210855 -858489 -581800 2203236 -1267850 773468 -3668403
1751C846937j538742A34569b872153B03601c192734C269267d276827A099397a662394
$$ 3846937 2308195 134569 -2872153 203601 -3192734 3269267 -4276827 1099397 -1662394
1741e688844E523800B712715r20193F4087a211021F40213b709585B391703f490428
$$ -5688844 5523800 2712715 1792522 64087 -1211021 640213 -2709585 2391703 -6490428
1731f48792j018885A282715b812941B313768o43520D03982i19603r48576A283530
$$ -648792 -1667677 1282715 -2812941 2313768 1670248 403982 -919603 -1868179 1283530
1721b172738o71427E59270N05247Q70202d563650D558120b320647A295542b264088
$$ -2172738 -2844165 559270 1064517 1934719 -4563650 4558120 -2320647 1295542 -2264088
1711B677162b678477D278042j266720a357832j999162g94002A693279M582194
$$ 2677162 -2678477 4278042 3011322 -1357832 -3356994 -794002 1693279 6275473
1703F275473d603041A459698N189127A797109d217222E340314c823445Q80767
$$ 6275473 -4603041 1459698 6648825 1797109 -4217222 5340314 -3823445 -2942678
1695b942678a284975n48632A705475d61635j898523B751967b453275B89365b235835
$$ -2942678 -1284975 -1833607 1705475 -461635 -2360158 2751967 -2453275 289365 -2235835
1685C482481c825518C308295q11029c375155m72629d64815A860229q34037c569020
$$ 3482481 -3825518 3308295 2497266 -3375155 -3847784 -464815 1860229 1026192 -3569020
1675a511521G932450a903810R14270m097369D701379c556525A076136b711329
$$ -1511521 7932450 -1903810 -989540 -5086909 4701379 -3556525 1076136 -2711329
1666H94331R99447J000626j118717f12533I01957a191488H70930i62330B001518
$$ 894331 1893778 2894404 1775687 -612533 901957 -1191488 870930 -962330 2001518
1656A619947c88386c2409B051380P07783a159394A751218a787707A752509j3017
$$ 1619947 -388386 -32409 2051380 2759163 -1159394 1751218 -1787707 1752509 1739492
1647A739492i90004L07976A267387b069331L18149A522956L368089b31989j608484
$$ 1739492 -990004 -682028 1267387 -2069331 -1751182 1522956 4891045 -231989 -1840473
1638a840473k176786C138231F50089B3645h05277H68293e404121A697079c26627
$$ -1840473 -4017259 3138231 650089 23645 -805277 868293 -5404121 1697079 -326627
1628B146389e65542q24996B865271c798841F29638c560816a039819C299975A346783
$$ 2146389 -565542 -1390538 2865271 -3798841 629638 -3560816 -1039819 3299975 1346783
1618b249303P21378q22818J148684k166543f25767E86354d471936E044122A564136
$$ -2249303 -1527925 -2350743 -1202059 -3368602 -625767 586354 -4471936 5044122 1564136
1608d417093J400074G44877b676815A878185L558359A50145a453998m1991b09599
$$ -4417093 -3017019 744877 -2676815 1878185 5436544 150145 -1453998 -1495989 -209599
1598A100600Q00657d132727J012748n11573A224091d019925D074453D43213c60238
$$ 1100600 1901257 -4132727 -3119979 -3631552 1224091 -4019925 4074453 443213 -360238
1588c103058a280599D44398Q69092b518103C775050C49665K959583j274875M45659
$$ -3103058 -1280599 444398 1313490 -2518103 3775050 349665 3309248 2034373 2480032
1579B480032d380589f10191j054509D358338A095609m10552K382742j397508m1491
$$ 2480032 -4380589 -610191 -1664700 4358338 1095609 685057 3067799 1670291 1628800
1570A628800b796931j89275F647515e9883n16282j793989g71562F25802b152631
$$ 1628800 -2796931 -2986206 6647515 -59883 -576165 -2370154 -771562 625802 -2152631
1560d09137j151122E91811K062077K868584f385558J424130H77299i99053q0917
$$ -409137 -1560259 591811 2653888 5522472 -6385558 -4961428 877299 -999053 -1079970
1551a079970j218191k26602B060169J623050d733526D238117A137775e3420p75571
$$ -1079970 -2298161 -2524763 2060169 3683219 -4733526 4238117 1137775 -53420 -828991
1542h28991m451332b087728I70578a349448C554630H71665l91505a384406C569930
$$ -828991 -5280323 -2087728 970578 -1349448 3554630 871665 480160 -1384406 3569930
1532E0214N44407d564508B823051g821072A367874Q45741i8266o863580i50056
$$ 50214 594621 -4564508 2823051 -7821072 1367874 2213615 -98266 -6961846 -950056
1522A258383J316719j118359b278466A136576i59506g3738A168765N140866k035451
$$ 1258383 2575102 1456743 -2278466 1136576 -959506 -73738 1168765 6309631 4274180
1513D274180A24439c186609O69532d50932I78315b348223I72523O037011b292946
$$ 4274180 124439 -3186609 -2517077 -450932 978315 -2348223 972523 7009534 -2292946
1503A308847a255949F750555f164105b295047A676339a140309A714169H27775
$$ 1308847 -1255949 6750555 -6164105 -2295047 1676339 -1140309 1714169 827775
1494a174060C51317h18198a14255a5002B473445c605809a479201F65584J617472
$$ -1174060 351317 -818198 -114255 -15002 2473445 -3605809 -1479201 665584 2283056
1485B283056c098790b15778D890289a807599A742602P259968f612629A184153
$$ 2283056 -3098790 -215778 4890289 -1807599 1742602 9002570 -6612629 1184153
1476I59240c396731d58783H2904J862176I17419A01498a179646N37056j36926
$$ 959240 -3396731 -458783 82904 1945080 917419 101498 -1179646 -642590 -779516
1467g79516F27016K470006f09796b33225E70659O08160J628136i91918j302175
$$ -779516 627016 3097022 -609796 -233225 570659 1178819 2806955 -991918 -2294093
1458b294093D52668M057781b562504B384449D14361a826582I7057L54909K926508
$$ -2294093 452668 4510449 -2562504 2384449 414361 -1826582 97057 451966 3378474
1449C378474F10332J954098h66128o61243j824220B132402b668208C351292j219544
$$ 3378474 610332 2564430 -866128 -1527371 -3351591 2132402 -2668208 3351292 2131748
1440B131748d919660D142154b755935R89403B395534J648721e309172F225678
$$ 2131748 -4919660 4142154 -2755935 -1766532 2395534 4044255 -5309172 6225678
1431b547185A486818J658100e30763B587222O892820a886936A010968J327976
$$ -2547185 1486818 3144918 -530763 2587222 9480042 -1886936 1010968 2338944
1423B338944i364404a455192H308045f03705J52848C016551e026331e87880A70829
$$ 2338944 -9364404 -1455192 8308045 -603705 -450857 3016551 -5026331 -587880 170829
1413D330995a127433l698665b285224F264463B063614K051076c14481B200838
$$ 4330995 -1127433 -4826098 -2285224 6264463 2063614 4114690 -314481 2200838
1404B58702K059818c468511D580584o20750a342664A967996H96756c184960l3150
$$ 258702 2318520 -3468511 4580584 3959834 -1342664 1967996 896756 -3184960 -3218110
1395c218110P87851i11656l17768D20471M833255a318527o658877B807030d144414
$$ -3218110 -2430259 -911656 -1229424 420471 5253726 -1318527 -7977404 2807030 -4144414
1385i06104D683240e448086D738787c407802m6538I64577a706971D61360D788
$$ -906104 4683240 -5448086 4738787 -3407802 -3454340 964577 -1706971 461360 4788
1375b87477A932676a965698k03264B009360a171643D98351h668949C052638d26414
$$ -287477 1932676 -1965698 -2168962 2009360 -1171643 498351 -8668949 3052638 -426414
1365a073214e03973r63642C62147a242193B450163j47774b576798E038071a889431
$$ -1073214 -503973 -1467615 362147 -1242193 2450163 2302389 -2576798 5038071 -1889431
1355a839719D33240J004279b822328J0846Q56314j590422C91321d77143D01506
$$ -1839719 433240 1437519 -2822328 -2811482 -1955168 -3545590 391321 -477143 401506
1345A325574M04420c479848C986401a658480j415826L05166O17538B31683K964236
$$ 1325574 1729994 -3479848 3986401 -1658480 -3074306 -2769140 -2151602 231683 3195919
1336C195919a89484B162633d62803H083378b783053A097905b797009b76519q68201
$$ 3195919 -189484 2162633 -462803 8083378 -2783053 1097905 -2797009 -276519 -1144720
1327a144720G136048a436618g11817E35734N26032M32341e453291D927885c867132
$$ -1144720 7136048 -1436618 -711817 535734 1061766 1494107 -5453291 4927885 -3867132
1317a363177B689085I38168d384221O84524I12768b259022j462232F480657d463908
$$ -1363177 2689085 938168 -4384221 -3699697 912768 -2259022 -3721254 6480657 -4463908
1307e15183G68499b323069D530133j773706j350952b888265k829825b76209H60702
$$ -515183 768499 -2323069 4530133 2756427 1405475 -2888265 -5718090 -276209 860702
1297b787203D208411A197905H7108M83355J270982a991121j960157C165351a40324
$$ -2787203 4208411 1197905 87108 570463 1841445 -1991121 -3951278 3165351 -140324
1287C072329b941429B255706J906482J241563g65464o85766B264556k78639q22706
$$ 3072329 -2941429 2255706 4162188 5403751 -765464 -1451230 2264556 1985917 1163211
1278A163211D77207c140849E84918a7900j232629A155554b607185A765745i85811
$$ 1163211 477207 -3140849 584918 -17900 -1250529 1155554 -2607185 1765745 -985811
1268d10297A20042J134152J617546l67339b976085B125870b466608D758553A798726
$$ -410297 120042 1254194 2871740 2504401 -2976085 2125870 -2466608 4758553 1798726
1258f49854j755960E015445a541124j302735B387468C16522c105502C282680L079231
$$ -649854 -2405814 5015445 -1541124 -2843859 2387468 316522 -3105502 3282680 6361911
1249F361911h752235d269603A026275l93564i95673F89267L253351A662817a418739
$$ 6361911 -8752235 -4269603 1026275 632711 -995673 689267 3942618 1662817 -1418739
1239a801823D318296h2106p29060A361927K877650B49921O568790a773535C019789
$$ -1801823 4318296 -82106 -811166 1361927 4239577 249921 6818711 -1773535 3019789
1229d576497B930795O43799b23615B247033K682223g820728A161617d24669n064620
$$ -4576497 2930795 3574594 -223615 2247033 4929256 -7820728 1161617 -424669 -5489289
1220e489289D478793e558376a053164b85330F50782K503334O52780q94352A25164
$$ -5489289 4478793 -5558376 -1053164 -285330 650782 3154116 3806896 2912544 125164
1210d917291D226952a548557C840639g31453H02783L99617b194728A366768a20383
$$ -4917291 4226952 -1548557 3840639 -731453 802783 1202400 -2194728 1366768 -120383
1200d120954J175613B492959N742101a309776E1078a37774F739220A079243e355937
$$ -4120954 -2945341 2492959 8235060 -1309776 51078 -137774 6739220 1079243 -5355937
1190a727525A292001K409933c20134j789079G040410e063595c80666k15352r42839
$$ -1727525 1292001 3701934 -320134 -2109213 7040410 -5063595 -380666 -596018 -1538857
1181a538857A194643b558957A320201H1965L555235a152304A636286B48186M055700
$$ -1538857 1194643 -2558957 1320201 81965 3637200 -1152304 1636286 248186 4303886
1172D303886A049328d012284J677531A587284J043547A26181J020819a092944
$$ 4303886 1049328 -4012284 -2334753 1587284 2630831 126181 1147000 -1092944
1163C146296I2230e904852C667181D02806n4056d690438C55614c82139j535650
$$ 3146296 92230 -5904852 3667181 402806 348750 -4690438 355614 -382139 -1917789
1154a917789B177817J52302b433161B148400K43178e13082H61750J05173O70159
$$ -1917789 2177817 2330119 -2433161 2148400 2391578 -513082 861750 966923 1637082
1145A637082c264415C013442b024788D255134c998930C423743i4854j000328j663753
$$ 1637082 -3264415 3013442 -2024788 4255134 -3998930 3423743 -94854 -1095182 -2758935
1136b758935J231715A449388M24908o45282k03101c120135A626841j59921b435915
$$ -2758935 -1527220 1449388 1874296 1229014 1025913 -3120135 1626841 1466920 -2435915
1126C488389a845563o04883B436302J479940c418359A107689B1489L354524d265988
$$ 3488389 -1845563 -2450446 2436302 3916242 -3418359 1107689 21489 3376013 -4265988
1116B545763a129067j099874j693933J937279f34518F30206c195769E869406a229561
$$ 2545763 -1129067 -2228941 -3922874 -1985595 -634518 630206 -3195769 5869406 -1229561
1106c276434F699577B760403e858220B130075e250292B977514G47287L00346g116351
$$ -3276434 6699577 2760403 -5858220 2130075 -5250292 2977514 747287 1047633 -7116351
1096f19912D488826A949288C07323J449373p80802J233039a817495B004213q79473
$$ -619912 4488826 1949288 307323 1756696 975894 2208933 -1817495 2004213 1124740
1087A124740c714108P09816n22806i92598A64168e500532B131200i52741C267044
$$ 1124740 -3714108 -3004292 -3527098 -992598 164168 -5500532 2131200 -952741 3267044
1077A896811G24522c27756m0864a33924A782154i28622F358443A527437a367924
$$ 1896811 724522 -327756 -368620 -133924 1782154 -928622 6358443 1527437 -1367924
1067a106640d62911L2106j463597F097222a327020k031825B11293b577333N93534
$$ -1106640 -462911 -430805 -1894402 6097222 -1327020 -3358845 211293 -2577333 -1983799
1058a983799l416803a996204A721077h60198C462994f08144K06909C598338b354494
$$ -1983799 -5400602 -1996204 1721077 -860198 3462994 -608144 -401235 3598338 -2354494
1048d676632g01380l895670I436268f421379C3170b899752H05581k59565c054137
$$ -4676632 -701380 -4597050 9436268 -6421379 33170 -2899752 805581 546016 -3054137
1038F1740b938487A676454K73609j58712b120997A921228J735568a778031A530126
$$ 61740 -2938487 1676454 1950063 1791351 -2120997 1921228 3656796 -1778031 1530126
1028C459408j511150b018069j242903b91016C911065b219758E96340k82400a047695
$$ 3459408 1948258 -2018069 -3260972 -291016 3911065 -2219758 596340 313940 -1047695
1018B694725C74688J417545J228565e354290K198831C206947c493572G935435
$$ 2694725 374688 1792233 3020798 -5354290 -3155459 3206947 -3493572 7935435
1009G27385j02218b642200B463441f18709A138094d152109D200767E02099a293259
$$ 727385 625167 -2642200 2463441 -618709 1138094 -4152109 4200767 502099 -1293259
999h50446G73733g84831j279826E040410a786463A212826a044698M32816B23995
$$ -850446 773733 -784831 -2064657 5040410 -1786463 1212826 -1044698 -611882 223995
989d028237E02485M829141A463337a892370q01613I85850c328511B762636f417144
$$ -4028237 502485 5331626 1463337 -1892370 -2693983 985850 -3328511 2762636 -6417144
979E256045A87464a693221D3689O66657C00747B6359f168670A666133a541591
$$ 5256045 187464 -1693221 43689 710346 300747 26359 -6168670 1666133 -1541591
969h86872j256654I66650J185087q15543E65476d995565H21466c689534B087524
$$ -886872 -2143526 966650 2151737 1336194 565476 -4995565 821466 -3689534 2087524
959E511768b160770l29564A33836f70475j913160A278883l99416b867159D255658
$$ 5511768 -2160770 -2490334 133836 -670475 -2583635 1278883 879467 -2867159 4255658
949A586582e033903F145971a929836i48398m191123A766322J58227b215601q57132
$$ 1586582 -5033903 6145971 -1929836 -948398 -5139521 1766322 1924549 -2215601 -3072733
940c072733a511762D870949e262952C110790a914561k176807B818814a344247
$$ -3072733 -1511762 4870949 -5262952 3110790 -1914561 -4091368 2818814 -1344247
931h83226J07342B921304b693920B453133A071330d278871f52054A845702L790490
$$ -883226 -775884 2921304 -2693920 2453133 1071330 -4278871 -652054 1845702 5636192
922E636192I5884K619606a31646E73948d11691B693021G19750b394637j725189
$$ 5636192 95884 2715490 -131646 573948 -411691 2693021 719750 -2394637 -4119826
913d119826b91960C928267b466441A55250K297474a681063A451563l83045b961897
$$ -4119826 -291960 3928267 -2466441 155250 2452724 -1681063 1451563 1068518 -2961897
903F29023J177171c428624k484036h84050B117660h17791F618594b568395B661132
$$ 629023 1806194 -3428624 -5912660 -884050 2117660 -817791 6618594 -2568395 2661132
893a690306D495P62410L145956a20421k170311C367768c081422C565311g045102
$$ -1690306 4495 766905 3912861 -120421 -2290732 3367768 -3081422 3565311 -7045102
883B551849I90577i13677B002597o21521R97569C9410M980549e76277B533512
$$ 2551849 990577 -913677 2002597 1381076 2378645 39410 5019959 -576277 2533512
873I87909b645396B474911a202124m276093G127724B739979O1953a149121A070705
$$ 987909 -2645396 2474911 -1202124 -5478217 7127724 2739979 2801932 -1149121 1070705
863d469939A964340f53214g640k200583B429284e705035a808189j045646E829243
$$ -4469939 1964340 -653214 -7640 -2208223 2429284 -5705035 -1808189 -2853835 5829243
853C080505j009768A59734R6287c819124H5034e12733B115761a04329F62116a641131
$$ 3080505 2070737 159734 256021 -3819124 85034 -512733 2115761 -104329 662116 -1641131
842d37587B294331I7831h81040j312309B752425H55387a536926m058877A028317
$$ -437587 2294331 97831 -881040 -2193349 2752425 855387 -1536926 -5595803 1028317
832F984510f10245B900847A032593K588197A494354N69445b936288B114281J6156
$$ 6984510 -610245 2900847 1032593 3620790 1494354 2063799 -2936288 2114281 2130437
823B130437H83945J014390L28055F21211d11494a45317A376709a509918M58187
$$ 2130437 883945 1898335 2226390 621211 -411494 -145317 1376709 -1509918 -1051731
814a051731m321596B164783m57458f912551M16739G59917b259711C066984a640108
$$ -1051731 -5373327 2164783 1707325 -6912551 -6495812 759917 -2259711 3066984 -1640108
804d418783A334388J821750d892046C30320L59671b372608o85678J63909C57859
$$ -4418783 1334388 3156138 -4892046 330320 689991 -2372608 -3058286 -2894377 357859
794B389817b168767A994567a181269k169496B434649a601457n47015C711411e93700
$$ 2389817 -2168767 1994567 -1181269 -3350765 2434649 -1601457 -2148472 3711411 -593700
784c444495A278086f00204F75122d04769l580321D916117f761787A275701J248344
$$ -3444495 1278086 -600204 675122 -404769 -3985090 4916117 -6761787 1275701 2524045
775B524045c20951j151848E833685a694903A519529J031126e130158C037431A504217
$$ 2524045 -320951 -1472799 5833685 -1694903 1519529 2550655 -5130158 3037431 1504217
765a946233A402041c49018A894060a411148j403026A009459L122402c045572N41797
$$ -1946233 1402041 -349018 1894060 -1411148 -2814174 1009459 4131861 -3045572 -2503775
756b503775A728821d479834a435575k809660G196105d91024q39649q9261I61760
$$ -2503775 1728821 -4479834 -1435575 -4245235 7196105 -491024 -1330673 -1419934 961760
746C299987K762319B410840h233415G12727J823351I47698d272774A767404e819309
$$ 3299987 6062306 2410840 -8233415 712727 2536078 947698 -4272774 1767404 -5819309
736H21040Q39701c242754B618486f920962A032153a884113G11782A85474b268420
$$ 821040 1660741 -3242754 2618486 -6920962 1032153 -1884113 711782 185474 -2268420
726b724006B399276A135925c614690a163910r85689A675069b666693l751552J617028
$$ -2724006 2399276 1135925 -3614690 -1163910 -2149599 1675069 -2666693 -6418245 -4801217
717d801217a737843A893009a087631A362073b277226H98954M73618L01023b743290
$$ -4801217 -1737843 1893009 -1087631 1362073 -2277226 898954 1372572 1673595 -2743290
707c971320A576998e015054C459075J3960187p574034j10826l484512a7920603
$$ -3971320 1576998 -5015054 3459075 17419262 9845228 9734402 6249890 -17920603
698b9932374e205611o449493k217262G275187H79026K6092079l372899k867074
$$ -29932374 -5205611 -11655104 -13872366 7275187 879026 26971105 23598206 20731132
690B0731132J1298302i1160l4892644J6766740M326447j0545112a45754F287087
$$ 20731132 32029434 -91160 -34983804 -18217064 -13890617 -24435729 -145754 6287087
681A701841M778811a004323B991439I5378K030049f544732C185390d459481A2750
$$ 1701841 6480652 -1004323 2991439 95378 2125427 -6544732 3185390 -4459481 12750
671F32123A42885J457931e227244A027544a057147A198293h260663p023688m090276
$$ 632123 142885 1600816 -5227244 1027544 -1057147 1198293 -8260663 -15284351 -19374627
662a9374627I673956M09928J4565016j0505513o571928J5922907H312172f299786
$$ -19374627 9673956 10083884 24648900 14143387 7571459 23494366 8312172 -6299786
653a3348186j8489568a3797345b062101l81177A0109238O86418B277683J2249146
$$ -13348186 -31837754 -13797345 -2062101 -2443278 10109238 10795656 2277683 14526829
645A4526829j241095o245245b223120j3140982b034088E381894e255877K474374
$$ 14526829 13285734 7040489 -2223120 -15364102 -2034088 5381894 -5255877 -2781503
637b781503B874012C0210J862921E41195R65730d02824a04813m889546A601285
$$ -2781503 2874012 30210 1893131 541195 1506925 -402824 -104813 -4994359 1601285
627f64136j621598j587627J282610b13450m487299D75663K671736h8705K7627
$$ -664136 -2285734 -3873361 -2590751 -213450 -4700749 475663 3147399 -88705 -61078
618f1078j726208c20656l749343l432451a294232j1332888n941402k1239707m9798444
$$ -61078 -1787286 -320656 -4069999 -7502450 -1294232 -12627120 -18568522 -39808229 -89606673
609h9606673C014664K19531550n0429130d3274504l7079282b5424430J1587372
$$ -89606673 3014664 222546214 172117084 -43274504 -80353786 -25424430 -13837058
602a3837058M48941f467754a050462m408253j205437i54519j570070D160160c518823
$$ -13837058 -13388117 -6467754 -1050462 -5458715 -6664152 -954519 -2524589 4160160 -3518823
592b545760B740312f784468b214835C530128c382251J340B021540b022083o04700
$$ -2545760 2740312 -6784468 -2214835 3530128 -3382251 -3380911 2021540 -2022083 -2626783
583b626783C379588j643509a413549C497278L20678f727037A139393B00861b271609
$$ -2626783 3379588 1736079 -1413549 3497278 3817956 -6727037 1139393 200861 -2271609
573A282277J564337f634551A701002d273764a473438B949125c07502A071346b780855
$$ 1282277 2846614 -6634551 1701002 -4273764 -1473438 2949125 -307502 1071346 -2780855
563a242838A583763a365399C381307c586238A67700J80396c463504C869011g81014
$$ -1242838 1583763 -1365399 3381307 -3586238 167700 348096 -3463504 3869011 -781014
553B543269e372422D720572A999227A53918e27202D026151B44623d345078c58107
$$ 2543269 -5372422 4720572 1999227 153918 -527202 4026151 244623 -4345078 -358107
543C541399g713045A064616K770026A891528b98424H09246i83331k678019A948343
$$ 3541399 -7713045 1064616 3834642 1891528 -298424 809246 -983331 -3661350 1948343
533B567945g256630b33170E364301c030948D066905i95806C869574a489436B658874
$$ 2567945 -7256630 -233170 5364301 -3030948 4066905 -995806 3869574 -1489436 2658874
523B103532G0232K135471J604729e009368B201345q93114J825532g325900A322339
$$ 2103532 70232 2205703 3810432 -5009368 2201345 1308231 3133763 -7325900 1322339
513c246852k958572A15551b002619F77102K843761a134189b64000B79867L181163
$$ -3246852 -6205424 115551 -2002619 677102 3520863 -1134189 -264000 279867 3461030
504C461030a989429B8954b062170B699320a203482j794013a290711A272847a9006
$$ 3461030 -1989429 28954 -2062170 2699320 -1203482 -2997495 -1290711 1272847 -19006
494b045048A198188A11814K099581H7087c520739A507120J183957c481866H041226
$$ -2045048 1198188 111814 2211395 87087 -3520739 1507120 2691077 -3481866 8041226
484a176412l32767I52964b858723O04208O69038B175655J111516r60497j118261
$$ -1176412 -1509179 952964 -2858723 -2254515 -1585477 2175655 3287171 2326674 1208413
475A208413P65865e037777a16266k318446O67001F360866A029464c651280C698380
$$ 1208413 1974278 -5037777 -116266 -2434712 -1767711 6360866 1029464 -3651280 3698380
465b446273C195267g156l804844Q66079A103823b165700D522138h60383E505697
$$ -2446273 3195267 -7156 -3812000 -2945921 1103823 -2165700 4522138 -860383 5505697
455c537548D941715A953027b41790k552334a368186A819754A0245K179034d377646
$$ -3537548 4941715 1953027 -241790 -2794124 -1368186 1819754 10245 2189279 -4377646
445c796009N15102a014830C43996b682021E837797D27320j24069b141141C234691
$$ -3796009 -3280907 -1014830 343996 -2682021 5837797 427320 303251 -2141141 3234691
435G59020a030148C790006a627533m37735D0064K973988h74399j540574f10179
$$ 759020 -1030148 3790006 -1627533 -2065268 40064 3014052 -874399 -2414973 -610179
425G657628A627585j36735b696216a03625H26406b980051E615212c535899C796665
$$ 7657628 1627585 1490850 -2696216 -103625 826406 -2980051 5615212 -3535899 3796665
415c204396K27158C27621f60381r73444D249761I52025M54447j18761c871500
$$ -3204396 -2977238 327621 -660381 -1633825 4249761 952025 1406472 1287711 -3871500
405C279410b49279E060098d31370B033290c696707h34122p91341k418313c6113
$$ 3279410 -249279 5060098 -431370 2033290 -3696707 -834122 -1625463 -4043776 -36113
395d137143a751828A613090J136611a733077C839932c255701j52480E885053a992431
$$ -4137143 -1751828 1613090 2749701 -1733077 3839932 -3255701 -3408181 5885053 -1992431
385A147222D35120J96357b343810Q52007o71827N2686m726801B349397J74742
$$ 1147222 435120 631477 -2343810 -1491803 -2163630 -2110944 -6837745 2349397 2524139
376B524139p4772a170148A547297b749591C979408i01667m44126A589761a901009
$$ 2524139 2449367 -1170148 1547297 -2749591 3979408 -901667 -1345793 1589761 -1901009
366b607174B688128d263144b59838A681027K770112e118195A523416C64991J345797
$$ -2607174 2688128 -4263144 -259838 1681027 4451139 -5118195 1523416 364991 1710788
357A710788A55413J179697c359186i6048C622734A88291d299036b9001j020917
$$ 1710788 155413 1335110 -3359186 -96048 3622734 188291 -4299036 -29001 -1049918
348a049918j67575l314460a809049B050727D38308b069152k50806l320620E46263
$$ -1049918 -1217493 -4531953 -1809049 2050727 438308 -2069152 -2319958 -5640578 546263
338a027364c39690B23503b72879a17456E644494b871870l915922G74485k3193
$$ -1027364 -339690 223503 -272879 -117456 5644494 -2871870 -6787792 774485 751292
329G51292f68436C671966H2527d022659I27097J134691i44877C009044g50745
$$ 751292 -668436 3671966 82527 -4022659 927097 2061788 -944877 3009044 -750745
319a260108q52632C900311c729773C356524c308826J195381B355693d5567C948010
$$ -1260108 -2112740 3900311 -3729773 3356524 -3308826 -2113445 2355693 -45567 3948010
309B941120a079831B087868C3620J847676J936019d0559A99682a10620l726176
$$ 2941120 -1079831 2087868 33620 1881296 3817315 -40559 199682 -110620 -3836796
300c836796A358287c892142J054760D726254b530421a075791c92661n773285C37150
$$ -3836796 1358287 -3892142 -2837382 4726254 -2530421 -1075791 -392661 -6165946 337150
290c74818l36854B829071C60934K164248K179600b63834j996505m54765A569292
$$ -374818 -711672 2829071 360934 2525182 4704782 -263834 -2260339 -2715104 1569292
280G1709L124001a593947O22732B032546b811594J100665A640590a034761B070209
$$ 71709 3195710 -1593947 -971215 2032546 -2811594 -1710929 1640590 -1034761 2070209
270B391428j037662a572320A144263c19225A889354e162443A857690a313486r06118
$$ 2391428 1353766 -1572320 1144263 -319225 1889354 -5162443 1857690 -1313486 -2219604
261b219604C58450A41081J590119O570132C273540q28123b210517b03051k77396
$$ -2219604 358450 141081 1731200 8301332 3273540 2445417 -2210517 -203051 -480447
252d80447r74494f42094D953188a17492k448667M88794h33951j105868d73110
$$ -480447 -1454941 -642094 4953188 -117492 -2566159 -2077365 -833951 -1939819 -473110
242D26660J191279b143696B478902i2673k684271I63352d783298B53872J787163
$$ 426660 1617939 -2143696 2478902 -92673 -2776944 963352 -4783298 253872 2041035
233B041035a749302D824626e70722A812868F94180A90939c855187J857854a85868
$$ 2041035 -1749302 4824626 -570722 1812868 694180 190939 -3855187 -1997333 -185868
223A312125K544a073502m209349D922712H78763B21370L313423c711001a032691
$$ 1312125 1314669 -1073502 -5282851 4922712 878763 221370 3534793 -3711001 -1032691
213F68176i95320b49805f8068l395895l220351C744859a830374D12476A91342
$$ 668176 -995320 -249805 -68068 -3463963 -6684314 3744859 -1830374 412476 191342
203b287405F64959J46166f755482B025586H2158a595735j20769C797159j142849
$$ -2287405 664959 811125 -6755482 2025586 82158 -1595735 -1716504 3797159 2654310
194B654310d473085A814681o94558J048515b769456D503087b820383C39868K214410
$$ 2654310 -4473085 1814681 1120123 2168638 -2769456 4503087 -2820383 339868 2554278
185B554278a952210e19702j86091p74923K12369C626485c79982k736956E580333
$$ 2554278 -1952210 -519702 -705793 -1480716 -1268347 3626485 -379982 -3116938 5580333
175g996429a538876l881877A8383697J40254852C4947070b462313q0741436k1205603
$$ -7996429 -1538876 -5420753 18383697 158638549 34947070 -2462313 -83203749 -104409352
167a04409352k1519682O1449409d169585F7889850M8240544C63971L930452N37146
$$ -104409352 -125929034 -64479625 -4169585 67889850 116130394 363971 4294423 4831569
159D831569d301018A973048J094765j345438j57321G31023J267917B98952e378193
$$ 4831569 -4301018 1973048 3067813 1722375 1565054 731023 1998940 298952 -5378193
149A22838a481415D259486c703513D84444K949421m26559b111882Q70091D343757
$$ 122838 -1481415 4259486 -3703513 484444 3433865 3007306 -2111882 -1241791 4343757
139i184368A633632b622423A292151c60580B423844a257600A816432a573318B285675
$$ -9184368 1633632 -2622423 1292151 -360580 2423844 -1257600 1816432 -1573318 2285675
129F742580b887716A585362J282412E77326L209262i5323b1542B124013r72220
$$ 6742580 -2887716 1585362 2867774 577326 3786588 -95323 -21542 2124013 1151793
120A151793J32217g203196C574782n53189b365151n60230D613429a813811B167586
$$ 1151793 1284010 -7203196 3574782 3021593 -2365151 -2925381 4613429 -1813811 2167586
110a07214j768907B301299e421007e04876C453775a093400D604941f48081j354489
$$ -107214 -1876121 2301299 -5421007 -504876 3453775 -1093400 4604941 -648081 -2002570
101b002570M23731c3430B046879F60271d564814a298957A879507J219808N30675
$$ -2002570 -1578839 -33430 2046879 660271 -4564814 -1298957 1879507 3099315 3629990
92C629990q28863a560006A179159k5995d939093I97593b77226l225163b01134
$$ 3629990 2801127 -1560006 1179159 1153164 -4939093 997593 -277226 -3502389 -201134
82b17822A859595J630630b923145B005884a322236A583336d813928a595235A616339
$$ -217822 1859595 3490225 -2923145 2005884 -1322236 1583336 -4813928 -1595235 1616339
72G06172i40390k05720c0059A231695J87051k6320a965439R23500j795330k076512
$$ 706172 -940390 -1146110 -30059 1231695 1418746 1392426 -1965439 -1041939 -2837269 -4913781
62d913781A168942b777155A381059N282655a726137K40354E16190a008736j868608
$$ -4913781 1168942 -2777155 1381059 6663714 -1726137 -1485783 516190 -1008736 -2877344
53b877344c75278I33513l26116a239495j303061B930022j255961b861889A176700
$$ -2877344 -375278 933513 607397 -1239495 -2542556 2930022 1674061 -2861889 1176700
43a566497D98386a159659A076362a591492D50147a552827H93807K856684h39320
$$ -1566497 498386 -1159659 1076362 -1591492 450147 -1552827 893807 3750491 -839320
33c194802j531548D327876a482155K57702C053364G66742h57297E99346c26709
$$ -3194802 -4726350 4327876 -1482155 -1224453 3053364 766742 -857297 599346 -326709
23C179609I17390C31571f39468k385996H06693K047976b114640e32598H35552
$$ 3179609 917390 331571 -639468 -3025464 806693 2854669 -2114640 -532598 835552
13c846043g10813A086224a158111H01020J57888g13101G79664B1251c158079G99319
$$ -3846043 -710813 1086224 -1158111 801020 958908 -713101 779664 21251 -3158079 799319
2B54593b364416E906498
$$ 254593 -2364416 5906498
##PAGE= F1=5596.982059883
##FIRST=     21204.543296753, 2644.21089616403, 779671
##DATA TABLE= (F2++(Y..Y)), PROFILE
2047G79671O87424a057606L5222F52612a923862l38616k35570A165907P49383
$$ 779671 1467095 -1057606 -1022384 652612 -1923862 -2262478 -2498048 1165907 1915290
$$ [...]
##END NTUPLES=nD NMR SPECTRUM
##END=
