##TITLE=XTC-1731o_3
##JCAMPDX= 6.0         $$ Bruker NMR JCAMP-DX V2.0
##DATA TYPE= nD NMR SPECTRUM
##DATA CLASS= NTUPLES
##NUM DIM= 2
##ORIGIN= BRUKER
##OWNER= patiny
$$ 1.79 TOPSPIN		Version 3.0
$$ 2012-05-21 02:29:23.696 +0200  patiny@icmbsg005
$$ Compression mode = diff/dup
##.OBSERVE FREQUENCY= 400.131591127025
##.OBSERVE NUCLEUS= ^1H
##.ACQUISITION MODE= SIMULTANEOUS (DQD)
##.ACQUISITION SCHEME= Echo-Antiecho
##.AVERAGES= 4
##.DIGITISER RES= 23
##SPECTROMETER/DATA SYSTEM= spect
##.PULSE SEQUENCE= hmbcetgpl3nd
##.SOLVENT NAME= D2O
##.SHIFT REFERENCE= INTERNAL, D2O, 1, 7.26493
##AUDIT TRAIL= $$ (NUMBER, WHEN, WHO, WHERE, PROCESS, VERSION, WHAT)
$$ ##TITLE= Audit trail, TOPSPIN		Version 3.0
$$ ##JCAMPDX= 5.01
$$ ##ORIGIN= Bruker BioSpin GmbH
$$ ##OWNER= patiny
$$ $$ /opt/data/patiny/nmr/XTC-1731o_3/14/pdata/1/auditp.txt
$$ ##AUDIT TRAIL=  $$ (NUMBER, WHEN, WHO, WHERE, PROCESS, VERSION, WHAT)
(   1,<2012-05-21 02:29:21.789 +0200>,<patiny>,<icmbsg005>,<go>,<TOPSPIN 3.0>,
      <created by zg
	started at 2012-05-21 02:07:14.723 +0200,
	POWCHK enabled, PULCHK disabled,
       configuration hash MD5:
       77 C7 B7 C4 10 F4 BA 30 64 2E BB 52 82 F2 DA 41
       data hash MD5: 4K * 128
       98 21 9B 85 B3 9A C1 3D 5C 06 3B C2 FA 8E EA EA>)
(   2,<2012-05-21 02:29:21.854 +0200>,<patiny>,<icmbsg005>,<audit>,<TOPSPIN 3.0>,
      <user comment:
       ICON-NMR User ID: patiny
       data hash MD5: 4K * 128
       98 21 9B 85 B3 9A C1 3D 5C 06 3B C2 FA 8E EA EA>)
(   3,<2012-05-21 02:29:22.739 +0200>,<patiny>,<icmbsg005>,<proc2d>,<TOPSPIN 3.0>,
      <Start of raw data processing
       xfb same F2: SI = 2K WDW = 3 SSB = 4 FT_mod = 6 PKNL = 1 F1: SI = 1K ME_mod = 2 NCOEF = 32 WDW = 4 SSB = 2 FT_mod = 6 PHC0 = 0 PHC1 = 0
       data hash MD5: 2K * 1K
       7E 2C C8 6A 02 87 9F 6A E1 FE DD D0 8E 42 3E 26>)
(   4,<2012-05-21 02:29:22.851 +0200>,<patiny>,<icmbsg005>,<proc2d>,<TOPSPIN 3.0>,
      <abs2 F2: ABSG = 5 ABSF1 = 7.26493 ABSF2 = 0.68812
       data hash MD5: 2K * 1K
       FD 6C E9 DD E9 CA BC 86 5A E0 E4 45 E2 08 5C D5>)
(   5,<2012-05-21 02:29:23.024 +0200>,<patiny>,<icmbsg005>,<proc2d>,<TOPSPIN 3.0>,
      <abs1 F1: ABSG = 5 ABSF1 = 210.754 ABSF2 = -11.10083
       data hash MD5: 2K * 1K
       F4 5C 02 39 46 C6 F6 BE 9B BB 57 BD 62 2E 67 7D>)
$$ ##END=
$$ 
$$ $$ hash MD5
$$ $$ 64 B0 FD 9B EF 03 B3 EF 39 70 2F 4A 87 72 66 CF
##$RELAX= 
##$RELAX= 
##$RELAX= 
##$RELAX= 
##$RELAX= 
##$RELAX= 
##$RELAX= 
##$RELAX= 
##$RELAX= 
##$RELAX= 
##$RELAX= 
$$ Bruker specific parameters
$$ --------------------------
##$DATPATH= </opt/data/patiny/nmr>
##$EXPNO= 14
##$NAME= <XTC-1731o_3>
##$PROCNO= 1
##$ACQT0= 1000000
##$AMP= (0..31)
100 100 100 100 100 100 100 100 100 100 100 100 100 100 100 100 100 100
100 100 100 100 100 100 100 100 100 100 100 100 100 100
##$ANAVPT= -1
##$AQSEQ= 0
##$AQ_mod= 3
##$AUNM= <au_getlinv>
##$AUTOPOS= <53 >
##$BF1= 400.13
##$BF2= 100.612769
##$BF3= 400.13
##$BF4= 400.13
##$BF5= 400.13
##$BF6= 400.13
##$BF7= 400.13
##$BF8= 400.13
$$ [...]
##$SIGF1= 7.26493
##$SIGF2= 0.68812
##$SINO= 0
##$SIOLD= 2048
##$SPECTYP= <>
##$SREGLST= <1H.DMSO>
##$SSB= 4
##$STSI= 2048
##$STSR= 0
##$SW_p= 2631.57894736843
##$SYMM= 0
##$S_DEV= 2425909
##$TDeff= 4096
##$TDoff= 0
##$TI= <>
##$TILT= no
##$TM1= 0
##$TM2= 0
##$TOPLEV= 100
##$USERP1= <>
##$USERP2= <>
##$USERP3= <>
##$USERP4= <>
##$USERP5= <>
##$WDW= 3
##$XDIM= 2048
##$YMAX_p= 182619571
##$YMIN_p= -302859798
##$CURPLOT= <Cups-PDF>
##$CURPRIN= <$Cups-PDF>
##$DFORMAT= <normdp>
##$LAYOUT= <+/2D_inv.xwp>
##$LFORMAT= <normlp>
##$PFORMAT= <normpl>
$$ Bruker specific parameters for F1
$$ ---------------------------------
##$ACQT0= 0
##$BF1= 100.612769
##$FnMODE= 6
##$NUC1= <13C>
##$O1= 10043.8343986724
##$SFO1= 100.622812834399
##$SW= 221.832681201688
##$SW_h= 22321.4283611104
##$TD= 128
##$ABSF1= 210.754
##$ABSF2= -11.10083
##$ABSG= 5
##$ABSL= 0
##$ALPHA= 0
##$AQORDER= 0
##$ASSFAC= 0
##$ASSFACI= 0
##$ASSFACX= 0
##$ASSWID= 0
##$AUNMP= <>
##$AXLEFT= 0
##$AXNAME= <F1>
##$AXNUC= <13C>
##$AXRIGHT= 0
##$AXTYPE= 0
##$AXUNIT= <>
##$AZFE= 0.1
##$AZFW= 0.5
##$BCFW= 0
##$BC_mod= 0
##$BYTORDP= 0
##$COROFFS= 0
##$CY= -3
##$DATMOD= 1
##$DC= 0
##$DFILT= <>
##$DTYPP= 0
##$ERETIC= no
##$F1P= 210.76350402832
##$F2P= -11.0913240743493
##$FCOR= 0.5
##$FTSIZE= 1024
##$FT_mod= 6
##$GAMMA= 0
##$GB= 0
##$INTBC= 1
##$INTSCL= 1
##$ISEN= 128
##$LB= 0
##$LEV0= 0
##$LPBIN= 256
##$MAXI= 10000
##$MC2= 5
##$MEAN= 0
##$ME_mod= 2
##$MI= 1
##$NCOEF= 32
##$NC_proc= -11
##$NLEV= 6
##$NOISF1= 0
##$NOISF2= 0
##$NSP= 0
##$NTH_PI= 0
##$NZP= 0
##$OFFSET= 210.754
##$PC= 4
##$PHC0= 0
##$PHC1= 0
##$PH_mod= 1
##$PKNL= no
##$PPARMOD= 1
##$PPDIAG= 0
##$PPIPTYP= 0
##$PPMPNUM= 2147483647
##$PPRESOL= 1
##$PSCAL= 1
##$PSIGN= 0
##$PYNMP= <>
##$REVERSE= no
##$SF= 100.612769
##$SI= 1024
##$SIGF1= 210.754
##$SIGF2= -11.10083
##$SINO= 0
##$SIOLD= 1024
##$SPECTYP= <>
##$SREGLST= <>
##$SSB= 2
##$STSI= 1024
##$STSR= 0
##$SW_p= 22321.42836111
##$SYMM= 0
##$S_DEV= 2425909
##$TDeff= 256
##$TDoff= 0
##$TI= <>
##$TILT= no
##$TM1= 0
##$TM2= 0
##$TOPLEV= 0
##$USERP1= <>
##$USERP2= <>
##$USERP3= <>
##$USERP4= <>
##$USERP5= <>
##$WDW= 4
##$XDIM= 128
##$YMAX_p= 182619571
##$YMIN_p= -302859798
$$ End of Bruker specific parameters
$$ ---------------------------------
##NTUPLES= nD NMR SPECTRUM
##VAR_NAME=  FREQUENCY1,    FREQUENCY2,      SPECTRUM
##SYMBOL=    F1,            F2,              Y
##.NUCLEUS=  13C,           1H
##VAR_TYPE=  INDEPENDENT,   INDEPENDENT,     DEPENDENT
##VAR_FORM=  AFFN,          AFFN,            ASDF
##VAR_DIM=   1024,          2048,            2048
##UNITS=     HZ,            HZ,              ARBITRARY UNITS
##FACTOR=    21.7982698838965, 1.28495065789474, 1
##FIRST=     21204.543296753, 2630.29399671054, 874840
##LAST=      -1095.08679447308, 0,           -1196918
##MIN=       -1095.08679447308, 0,           -302859798
##MAX=       21204.543296753, 2630.29399671054, 182619571
##PAGE= F1=21204.54329675
##FIRST=     21204.543296753, 2630.29399671054, 874840
##DATA TABLE= (F2++(Y..Y)), PROFILE
$$ [...]
##PAGE= F1=5684.175139418
##FIRST=     21204.543296753, 2630.29399671054, -1655460
##DATA TABLE= (F2++(Y..Y)), PROFILE
1221I49532c2518D546044b812720g55535B19653b036475a88749B694430g18520
$$ 949532 -32518 4546044 -2812720 -755535 219653 -2036475 -188749 2694430 -718520
1211b428118C085774A70278c1184r77299D506068b969562B061364d861436k13868
$$ -2428118 3085774 170278 -31184 -1008483 4506068 -2969562 2061364 -4861436 -5075304
1202e075304A025554C12306K302675J26582c884386a775267I42919g37271H612462
$$ -5075304 1025554 312306 2614981 2741563 -3884386 -1775267 942919 -737271 8612462
1192a42064p07108c59693l372641N44089G37135d83554n51826m727403E115260
$$ -142064 -849172 -359693 -3732334 -3188245 737135 -483554 -1035380 -5762783 5115260
1182B267986b937655B020423b19656j85002C048893e411243D80629J300146a409557
$$ 2267986 -2937655 2020423 -219656 -404658 3048893 -5411243 480629 1780775 -1409557
1172a160167j711978E388577a287452k272851o71251A562808a831378A806364
$$ -1160167 -2872145 5388577 -1287452 -3560303 -4231554 1562808 -1831378 1806364
1163C820906a775376j970727C206736o73066b375211a183503A18945R70219b382106
$$ 3820906 -1775376 -3746103 3206736 2533670 -2375211 -1183503 118945 1089164 -2382106
1153D60088a433823E126228d044713B03042L39793N38944M36923b113530C482434
$$ 460088 -1433823 5126228 -4044713 203042 542835 1081779 1518702 -2113530 3482434
1143a288093k171006c14383A553984K088954f56656j962941i78919j237576D891216
$$ -1288093 -3459099 -314383 1553984 3642938 -656656 -2619597 -978919 -2216495 4891216
1133A247064a558209D463253e35786j394362k1279D478036K33332L09450k167205
$$ 1247064 -1558209 4463253 -535786 -1930148 -1951427 4478036 4711368 5020818 2853613
1124B853613o59589c575910a313549F98406e34427i7200m66448B31756M459914
$$ 2853613 2194024 -3575910 -1313549 698406 -534427 -97200 -563648 231756 4691670
1115D691670k005129k00336C76577a123031B876948b26521C910476b646062E56931
$$ 4691670 2686541 2486205 376577 -1123031 2876948 -226521 3910476 -2646062 556931
1105e174636A963692I53573F6514a728281F96430c322097A56859N38307J133076
$$ -5174636 1963692 953573 66514 -1728281 696430 -3322097 156859 695166 1828242
1096A828242b833644C792351g07778p21422N98431a67492j84440I45522a687651
$$ 1828242 -2833644 3792351 -707778 -1429200 -830769 -167492 -351932 945522 -1687651
1086A451352J383169E55271L787436A451806g00592r79101C974065f71439b63442
$$ 1451352 2834521 555271 4342707 1451806 -700592 -1679693 3974065 -671439 -263442
1076d258327F986227c763924J138503A112324N415006h062548C313924J507775
$$ -4258327 6986227 -3763924 -2625421 1112324 6527330 -8062548 3313924 4821699
1068D821699a698538B827492a418269j098259a74820B711461l95017b570182B019994
$$ 4821699 -1698538 2827492 -1418269 -2516528 -174820 2711461 2316444 -2570182 2019994
1058d952812E517737L449a188020F653641b839231J72967A324633c776461D623673
$$ -4952812 5517737 5521186 -1188020 6653641 -2839231 -2666264 1324633 -3776461 4623673
1048d839147k794032i65150B164208E95227a044696D044403r80045j470015c587465
$$ -4839147 -7633179 -965150 2164208 595227 -1044696 4044403 3064358 1594343 -3587465
1038D626835c327961j829937b505819j0775A155234b819947a098997K61353G68245
$$ 4626835 -3327961 -5157898 -2505819 -2516594 1155234 -2819947 -1098997 -837644 768245
1028g323155i99889k037205C318667J33122g911656B087259B16486K30226g429019
$$ -7323155 -999889 -3037094 3318667 3451789 -7911656 2087259 216486 446712 -7429019
1018B47974N35370b357461G313623A803432K071929C65875K259814G44047J488343
$$ 247974 783344 -2357461 7313623 1803432 3875361 365875 2625689 744047 2232390
1009B232390b223367A174516K427564a182662C11817a116037o44108A405203c958226
$$ 2232390 -2223367 1174516 3602080 -1182662 311817 -1116037 -1760145 1405203 -3958226
999b82129p63770r31944N0084K59343j047836B008093J872368c022676a204961
$$ -282129 -1045899 -1977843 -1927759 -1668416 -2716252 2008093 3880461 -3022676 -1204961
989f1163o070146e29850K10058G781177a946651P27300q56306q3080j71150O9902
$$ -61163 -6131309 -529850 -319792 7781177 -1946651 -1219351 -2075657 -2158737 -2329887 -2259985
979b259985c01562m10134l53161J85590B754385E90916Q62154B09915a680730
$$ -2259985 -301562 -711696 -1064857 -879267 2754385 590916 1453070 209915 -1680730
969c188072C636631b323072h44129B082473G26301F5474b436996D25164A71680
$$ -3188072 3636631 -2323072 -844129 2082473 726301 65474 -2436996 425164 171680
959G8812a507415B542826H32005b900739k68055B989662b078538C68009J32566
$$ 78812 -1507415 2542826 832005 -2900739 -3168794 2989662 -2078538 368009 500575
950E00575K518646a867368I0090N875359b342498J111315A175442b385626D339303
$$ 500575 3019221 -1867368 90090 5965449 -2342498 -1231183 1175442 -2385626 4339303
940a447031C447374a012282C558325c878808B77502K827231K047994b41851k638477
$$ -1447031 3447374 -1012282 3558325 -3878808 277502 3104733 5152727 -241851 -2880328
931b880328M68358A815355c57627F35716b296042I97421d429177D225827j273711
$$ -2880328 -2411970 1815355 -357627 635716 -2296042 997421 -4429177 4225827 2952116
922B952116a655966C497269B77550O13284k54777g672746C016088L18014k65114
$$ 2952116 -1655966 3497269 277550 890834 636057 -7672746 3016088 3334102 3068988
913C068988K818666b929604A568061b085116j872544g17406E154092c631905J714859
$$ 3068988 5887654 -2929604 1568061 -2085116 -3957660 -717406 5154092 -3631905 -1917046
904a917046G5349d60642j817895g55860j415808F346346B176256b130422B514423
$$ -1917046 75349 -460642 -2278537 -755860 -2171668 6346346 2176256 -2130422 2514423
894C289192b211741j453191a38891H93397d104121C913963j948059c759372b00483
$$ 3289192 -2211741 -3664932 -138891 893397 -4104121 3913963 1965904 -3759372 -200483
884F90618b290922A302172d74541C194484b180427A01919J469431N850908B203066
$$ 690618 -2290922 1302172 -474541 3194484 -2180427 101919 1571350 7422258 2203066
874b044981C300243o42286I88367N014877i251700M347289C038133R61572d294989
$$ -2044981 3300243 2657957 988367 6003244 -9251700 -4904411 3038133 3999705 -4294989
864d650687a737370j18574E330990b903793D435691a219848B057648i74187j223846
$$ -4650687 -1737370 -1855944 5330990 -2903793 4435691 -1219848 2057648 -974187 -2198033
855b198033B418864b139040O69995m85685C393698i04381l664924E104722a993625
$$ -2198033 2418864 -2139040 -1469045 -1954730 3393698 -904381 -4569305 5104722 -1993625
845C140480f7402E907058i68613c55580B533915f32421A030075R92144R31995
$$ 3140480 -67402 5907058 -968613 -355580 2533915 -632421 1030075 2022219 2954214
836B954214j350962b953231a455332C711569c454428A454738a406235A478400
$$ 2954214 1603252 -2953231 -1455332 3711569 -3454428 1454738 -1406235 1478400
827B050188a932924B068920a499865C488071B79719d929399H318054F82115R68582
$$ 2050188 -1932924 2068920 -1499865 3488071 279719 -4929399 8318054 682115 1650697
818A650697M792657b482659J4933e95627Q9270o647701a044990B705330e741830
$$ 1650697 6443354 -2482659 -2467726 -595627 -506357 -7154058 -1044990 2705330 -5741830
808B199752k36921a789409B90756c729428A240492a958146B0264K6300M816327
$$ 2199752 1962831 -1789409 290756 -3729428 1240492 -1958146 20264 46564 4862891
799D862891C31203e571023B467701j109220M895383B455542c843888D802527b58942
$$ 4862891 331203 -5571023 2467701 1358481 6253864 2455542 -3843888 4802527 -258942
789b056264B76153a624484C955787I8629a723142r22615B859924k73399g022132
$$ -2056264 276153 -1624484 3955787 98629 -1723142 -2645757 2859924 2586525 -7022132
779F009317c798083A488015J519296L955024b596647q96236A20594K191666J259609
$$ 6009317 -3798083 1488015 3007311 6962335 -2596647 -3492883 120594 2312260 3571869
770C571869a921282l075695I62377c301162J601763O18596j302207B448969b860467
$$ 3571869 -1921282 -4996977 962377 -3301162 -1699399 -1080803 -2383010 2448969 -2860467
760f71894D194990H09630b60612A770541H25981a069600k934298g20932j841979
$$ -671894 4194990 809630 -260612 1770541 825981 -1069600 -4003898 -720932 -2562911
751b562911m945845G926092B8914b539055I0120d9458o46586A105341d164992
$$ -2562911 -7508756 7926092 28914 -2539055 90120 -49458 -696044 1105341 -4164992
741b578150D633952j184955C76139J720386d874981A547680Q61861n91473h8097
$$ -2578150 4633952 3448997 376139 2096525 -4874981 1547680 2409541 1818068 -88097
731e70012B519642r24221a619333l268653G252118i43198j411536n366128E358832
$$ -570012 2519642 1595421 -1619333 -4887986 7252118 -943198 -2354734 -7720862 5358832
721a513226I21524c929046A507833m14915a63479j737086A342386c571138B84445
$$ -1513226 921524 -3929046 1507833 1092918 -163479 -1900565 1342386 -3571138 284445
711A334168e918634B394373b83119B613672A241360J942922R48633a118310I54875
$$ 1334168 -5918634 2394373 -283119 2613672 1241360 3184282 4132915 -1118310 954875
701a551576A1804271E286510j852941a8803360K528241m573544m886541A860817
$$ -1551576 11804271 5286510 3433569 -18803360 -16275119 -20848663 -25735204 1860817
692B0927657l314991J576631O501721j1784875q89248a4279892j765557j419931
$$ 20927657 17612666 19189297 25691018 13906143 13016895 -14279892 -16045449 -17465380
684a7465380m5837444K6867880H441550j91643K261503K7902797H128811D99531
$$ -17465380 -63302824 -36434944 8441550 8249907 10511410 38414207 8128811 499531
675D77940K186476e000655B152950d654983l15469B919864B23204f772477E309855
$$ 477940 2664416 -5000655 2152950 -4654983 -4970452 2919864 223204 -6772477 5309855
665d001300J636430a126703j131189C228870d802379A570938h700823G955642
$$ -4001300 -2364870 -1126703 -2257892 3228870 -4802379 1570938 -8700823 7955642
656D0091009A4644921F575972i047972j0170829D77393c7519566N412712J3037566
$$ 40091009 14644921 6575972 -9047972 -19218801 477393 -37519566 -32106854 -19069288
648a9069288f129995C0962878p057993o18658p845353F296837a1603517A3069354
$$ -19069288 -6129995 30962878 23904885 23286227 15440874 6296837 -11603517 13069354
639c231652j2797617k352428P662179D772856K270899c25381C14985I4887L457896
$$ -3231652 -16029269 -18381697 -10719518 4772856 7043755 -325381 314985 94887 3552783
630C552783f86335C384983e316803B936785b361153E9913d344314F214374l065314
$$ 3552783 -686335 3384983 -5316803 2936785 -2361153 59913 -4344314 6214374 3149060
621C149060A405504e17378A388618R86157K586124A847228e604284b106026m48846
$$ 3149060 1405504 -517378 1388618 2374775 4960899 1847228 -5604284 -2106026 -2554872
612b554872A759302J18749b937223C771358e85922C551832Q862529J821598M1902314
$$ -2554872 1759302 1878051 -2937223 3771358 -585922 3551832 12414361 14235959 56138273
603E6138273J14654874n5602382b54767121m8092677d2507557H0127046B0923016
$$ 56138273 170793147 115190765 -254767121 -302859798 -42507557 80127046 20923016
595A4788392m900705k353635l276070O829511E54233K926541r34980d357143C997819
$$ 14788392 9887687 7534052 4257982 11087493 554233 3480774 2545794 -4357143 3997819
585B770083c753816F273728f929775E440921a495705B639013K838278a735492
$$ 2770083 -3753816 6273728 -6929775 5440921 -1495705 2639013 5477291 -1735492
576b313576C53922K885266a752680C223994a319682k624195I608987a390221F39054
$$ -2313576 353922 3239188 -1752680 3223994 -1319682 -3943877 9608987 -1390221 639054
566A829170c000336F982915a077200D845943A233908b680738a309086F2217N079484
$$ 1829170 -3000336 6982915 -1077200 4845943 1233908 -2680738 -1309086 62217 5141701
557E141701b958814a023817d02788m269443C925765b050106D355023B153019b313222
$$ 5141701 -2958814 -1023817 -402788 -4672231 3925765 -2050106 4355023 2153019 -2313222
547B987511P94189d839322b027182A059932d246200F31206e285441a12524j44674
$$ 2987511 3781700 -4839322 -2027182 1059932 -4246200 631206 -5285441 -112524 -257198
538b57198E320795A510015a008334D390987a463266L4668l361000C582352a289294
$$ -257198 5320795 1510015 -1008334 4390987 -1463266 -1428598 -4789598 3582352 -1289294
528d180222a870053B523775a0372699D221312A711954d873584b027004B121149
$$ -4180222 -1870053 2523775 -10372699 4221312 1711954 -4873584 -2027004 2121149
519C25678a060490p79879A736440e5757j095383e39897B673432b151641A020493
$$ 325678 -1060490 -1840369 1736440 -55757 -1151140 -539897 2673432 -2151641 1020493
509A280003c446760B68282K018682d625159J616593A138665Q57263A10273L310419
$$ 1280003 -3446760 268282 2286964 -4625159 -3008566 1138665 1995928 110273 3420692
500C420692A662761b47212D174905f89802C315349j103249L417546f30507j146441
$$ 3420692 1662761 -247212 4174905 -689802 3315349 2212100 5629646 -630507 -1776948
491a776948M71545r52932G02284L174834a074929A21657b655312C839259e77262
$$ -1776948 -1305403 -2258335 702284 3877118 -1074929 121657 -2655312 3839259 -577262
481D42780b488452C375501c337820p67474A289938C92539R77462D55092K127010
$$ 442780 -2488452 3375501 -3337820 -4105294 1289938 392539 1370001 455092 2582102
472B582102c664963B484991a812696C271615a488195l532149D087740A985565
$$ 2582102 -3664963 2484991 -1812696 3271615 -1488195 -5020344 4087740 1985565
463b212151B277624a509250C912696B15641b438621D110213B56641L479052a100149
$$ -2212151 2277624 -1509250 3912696 215641 -2438621 4110213 256641 3735693 -1100149
453A290639g09076A842805m40992a133269D141232D04878a380603E45776P97498
$$ 1290639 -709076 1842805 1401813 -1133269 4141232 404878 -1380603 545776 1343274
444A343274N73950c59898C51333b443294B523619c095994E857532b218816A128638
$$ 1343274 1917224 -359898 351333 -2443294 2523619 -3095994 5857532 -2218816 1128638
434d80937J57047A177590J611855b82858B182922e782560A326071b708950C25407
$$ -480937 -323890 1177590 2789445 -282858 2182922 -5782560 1326071 -2708950 325407
424c813617B745000a747701E590172b530859A395708d080645A259151b654224
$$ -3813617 2745000 -1747701 5590172 -2530859 1395708 -4080645 1259151 -2654224
415a882713C117751d952284b390646B506060e137725E00002c651873p27016I36397
$$ -1882713 3117751 -4952284 -2390646 2506060 -5137725 500002 -3651873 -4378889 936397
405C442427L58644h2937j805935A826604a636030B820163c658215h71824A094625
$$ 3442427 3801071 -82937 -1888872 1826604 -1636030 2820163 -3658215 -871824 1094625
395a81506o08215l554057F456893b640176p47307A843839b447145B0567J35Q67720
$$ -181506 -789721 -4343778 6456893 -2640176 -3387483 1843839 -2447145 20567 20702 888422
385H88422b814024a11361j465795D416087d254084D80859J92273K824019d1798
$$ 888422 -2814024 -111361 -1577156 4416087 -4254084 480859 673132 3497151 -41798
375c029045B43780L367621J680434b542725D33910J812368o66270c629113J710733
$$ -3029045 243780 3611401 5291835 -2542725 433910 2246278 1580008 -3629113 -1918380
366a918380O481E66181b045767B562483J229486n83952I86350f612203D12586
$$ -1918380 -1911899 566181 -2045767 2562483 3791969 3208017 986350 -6612203 412586
356c550532e10563F260623F62080M08406a109651e23415o43298B550512a623107
$$ -3550532 -510563 6260623 662080 1070486 -1109651 -523415 -1166713 2550512 -1623107
346B164941a896172o42093F03380b246340A028612b239358A830940b403659j435506
$$ 2164941 -1896172 -2538265 603380 -2246340 1028612 -2239358 1830940 -2403659 -3839165
337c839165B548945q86337i44139A830337H3055c440182D604220H40479b020447
$$ -3839165 2548945 1662608 -944139 1830337 83055 -3440182 4604220 840479 -2020447
327C360348Q08188A862078e006049G198445F37105a774456q97741J062273o80891
$$ 3360348 4168536 1862078 -5006049 7198445 637105 -1774456 -2672197 -1609924 -2290815
318b290815H427258A209336c098119D401258d174951A958841F77838A57673O01251
$$ -2290815 8427258 1209336 -3098119 4401258 -4174951 1958841 677838 157673 758924
309G58924J090803d89740m145091r3085b035443a76045C78728K56988C13950e55887
$$ 758924 1849727 -489740 -4634831 -4727916 -2035443 -176045 378728 635716 313950 -555887
298c98133C032490c759905A89178K085349b341459D38978c58583A062586a557730
$$ -398133 3032490 -3759905 189178 2274527 -2341459 438978 -358583 1062586 -1557730
288f07044m70520C125748a605056E823547o65538f102057E096893a0038359B520045
$$ -607044 -1077564 3125748 -1605056 5823547 5158009 -6102057 5096893 -10038359 2520045
278B614612E18405c16186k191416C137255f74853n775545C145576F76740b607680
$$ 2614612 518405 -316186 -2507602 3137255 -674853 -6450398 3145576 676740 -2607680
268B844839a116493B506776b333545G32766C35071I2567f21094K5529j154100
$$ 2844839 -1116493 2506776 -2333545 732766 335071 92567 -621094 -595565 -1749665
259a749665A527228a212703M70443A410539K846699c225730C13221M509870C03838
$$ -1749665 1527228 -1212703 -742260 1410539 4257238 -3225730 313221 4823091 303838
249f812602A505109b697965h28194A254316e74235A92690b542396O24205A77953
$$ -6812602 1505109 -2697965 -828194 1254316 -574235 192690 -2542396 -1918191 177953
239C71092R70599a190657B739000b549846A953134j78853R64966c821341m034969
$$ 371092 1341691 -1190657 2739000 -2549846 1953134 1774281 2739247 -3821341 -7856310
230g856310C822359d212389b004849E575022d070n53705E943422c037102B568374
$$ -7856310 3822359 -4212389 -2004849 5575022 -4070 -557775 5943422 -3037102 2568374
220B091976a257996K08210F79585b315158M6183G859797a405840j593955D9501
$$ 2091976 -1257996 -1049786 679585 -2315158 -2268975 7859797 -1405840 -2999795 49501
210A983827l28158j5801J663033g74868B31170J921865e041197h3326F13445a568247
$$ 1983827 1655669 1639868 3302901 -774868 231170 2153035 -5041197 -83326 613445 -1568247
199b740416D979907j465145a551887k846510D811814i73651a20133k577604b9150
$$ -2740416 4979907 3514762 -1551887 -4398397 4811814 -973651 -120133 -2697737 -29150
189b800863c47508k085039a64074C24975b661866C705571G92120b300454f10359
$$ -2800863 -347508 -2432547 -164074 324975 -2661866 3705571 792120 -2300454 -610359
179a089481B561332a977619F554293e984846B573142A043806g00355C877521e832074
$$ -1089481 2561332 -1977619 6554293 -5984846 2573142 1043806 -700355 3877521 -5832074
169A852552g15123F08379O026085L897702J9169983K338306a62702651K1862284
$$ 1852552 -715123 608379 6634464 10532166 29702149 32040455 -162702651 -140840367
161a40840367N6649881a6841211A15389974J1897239N5332358I0851479m1442152
$$ -140840367 -84190486 -16841211 115389974 127287213 182619571 90851479 49409327
154D9409327a78469447a5121678J9156g248503c484612k778241b159260O59101
$$ 49409327 -178469447 -15121678 -15102522 -7248503 -3484612 -6262853 -2159260 -1500159
146a500159k465835A426124B52546b598917L9177j18286R35084A622716f505809
$$ -1500159 -3965994 1426124 252546 -2598917 -2559740 -2678026 -1742942 1622716 -6505809
136D359018a83266j870652B651614n08723c371575E576643B39257a685640H60664
$$ 4359018 -183266 -2053918 2651614 2142891 -3371575 5576643 239257 -1685640 860664
126a726029A29356d646337a726937g82999L79045C156713a764096A315994a750021
$$ -1726029 129356 -4646337 -1726937 -782999 -403954 3156713 -1764096 1315994 -1750021
116f1162E44349P50167b484935d08548A024805c901966a76378m7369k199949C432507
$$ -61162 544349 1294516 -2484935 -408548 1024805 -3901966 -176378 -223747 -2423696 3432507
105f48793B039872a393039C68235L181466A18265h476202B665895a791971B398086
$$ -648793 2039872 -1393039 368235 3549701 118265 -8476202 2665895 -1791971 2398086
95h10m90563C502109e087397D67497N58424b711799D082367F59725e1116B668204
$$ -810 -491373 3502109 -5087397 467497 1025921 -2711799 4082367 659725 -51116 2668204
84A57583J120055E53865b004A235722J819465J293658a706459r62140M41917A377523
$$ 157583 1277638 553865 -2004 1235722 3055187 4348845 -1706459 -2668599 -2226682 1377523
73a861117A528284B89111L196J577193p54257d43560D363579d797614a6439C208544
$$ -1861117 1528284 289111 292307 1869500 1115243 -443560 4363579 -4797614 -16439 3208544
62f94578m850416A823205h06989I76589f70272J84945F515782k275448d137376
$$ -694578 -5544994 1823205 -806989 976589 -670272 -485327 6515782 4240334 -4137376
52A89925e858135g93828j415533P52664A743337n30186e125575e24615B480411
$$ 189925 -5858135 -793828 -2209361 -1456697 1743337 1213151 -5125575 -524615 2480411
42I37936J291811c79849H13203h90406A80638L396806F99569b907207l68228E874197
$$ 937936 2229747 -379849 813203 -890406 180638 3577444 699569 -2907207 -3275435 5874197
31B631801o84225b608690A655474a491156H37462i6200A574465B08024b120499
$$ 2631801 1947576 -2608690 1655474 -1491156 837462 -96200 1574465 208024 -2120499
21C137654d373955B979463J471626c048355b73461r44202K97576o87380A233969
$$ 3137654 -4373955 2979463 4451089 -3048355 -273461 -1217663 -920087 -1607467 1233969
11B493759j14219a525089r07088A412161a245825c08527k55216l099500A783010
$$ 2493759 2379540 -1525089 -2432177 1412161 -1245825 -308527 -563743 -3663243 1783010
1A53447f07717
$$ 153447 -607717
##PAGE= F1=5662.376869535
##FIRST=     21204.543296753, 2630.29399671054, -1770498
##DATA TABLE= (F2++(Y..Y)), PROFILE
2047a770498B8664i25910A325280J564681k06535d419739A012313e41335I8360
$$ -1770498 28664 -925910 1325280 2889961 2683426 -4419739 1012313 -541335 98360
2037A301992N68530q71729P86566a575106k136584C920186d22822B635930g5831
$$ 1301992 1870522 998793 1785359 -1575106 -3711690 3920186 -422822 2635930 -75831
2027H671e393549C607606L05353A172228b8252j135197B534094a390051L1658
$$ 8671 -5393549 3607606 3912959 1172228 -28252 -1163449 2534094 -1390051 -1358393
2018a358393H48720d77980A790644E19548d256681C545771a268096k816092E104408
$$ -1358393 848720 -477980 1790644 519548 -4256681 3545771 -1268096 -4084188 5104408
2008A477428c803823A087828A0361K349361d078605g52857C29283L880529b377634
$$ 1477428 -3803823 1087828 10361 2359722 -4078605 -752857 329283 4209812 -2377634
1998B703061P8632d338232R85118h82980j462384G10971a317249E96345K686606
$$ 2703061 2781693 -4338232 -3353114 -882980 -2345364 710971 -1317249 596345 3282951
1989C282951d374865I97674L38549N056373A416451J607997b330166k08843d02819
$$ 3282951 -4374865 997674 1336223 6392596 1416451 3024448 -2330166 -2539009 -402819
1979d24775a00347k32953l145779a87412k602669k270748b26683j355948G780397
$$ -424775 -100347 -333300 -3479079 -187412 -2790081 -5060829 -226683 -1582631 7780397
1969D04359L9033K709882c934749A200340d300227a813393j645189P33400E576817
$$ 404359 443392 3153274 -3934749 1200340 -4300227 -1813393 -3458582 -2725182 5576817
1959c735414E22912d75137A158186c90807A52083d75016D817763A079212c263238
$$ -3735414 522912 -475137 1158186 -390807 152083 -475016 4817763 1079212 -3263238
1949a18612D800217A66032L17909b82782c001A811588J536222b094773P18325
$$ -118612 4800217 166032 483941 -282782 -3001 1811588 3347810 -2094773 -1376448
1940a376448D37851e50403C207449A329398m31267g101228G3061P68708c350102
$$ -1376448 437851 -550403 3207449 1329398 898131 -7101228 73061 841769 -3350102
1930b005047j497074J614137k467271a731412F429257A622914e143702C267234
$$ -2005047 -3502121 -1887984 -4355255 -1731412 6429257 1622914 -5143702 3267234
1921a661023n982958A25264Q47550i6504m35806a76840k138198a146367A487343
$$ -1661023 -7643981 125264 972814 -96504 -532310 -176840 -2315038 -1146367 1487343
1911B17655J273567e705228A566948d323282D181402H76424d160719A473553o0740
$$ 217655 1491222 -5705228 1566948 -4323282 4181402 876424 -4160719 1473553 1412813
1902A412813b748960C74053g91017j430814h12899k558697B976473f23775a47793
$$ 1412813 -2748960 374053 -791017 -2221831 -812899 -3371596 2976473 -623775 -147793
1892c300946D065335l07762L863784I65820a953565A547152C8679c478781f74066
$$ -3300946 4065335 3757573 7621357 965820 -1953565 1547152 38679 -3478781 -674066
1882D56063b99896A056086b456421E17918c999913G884909B2976L870251d658244
$$ 456063 -299896 1056086 -2456421 517918 -3999913 7884909 22976 3893227 -4658244
1872e535815H05515b820699B195094C73958O65712R953d665943a88842B192394
$$ -5535815 805515 -2820699 2195094 373958 1039670 1049623 -4665943 -188842 2192394
1862c695204C356168n78804c389306B15818K85522L03163A24361a586335A00945
$$ -3695204 3356168 2777364 -3389306 215818 501340 804503 124361 -1586335 100945
1852D122891A316178A31387O05811J517866R6460b432742A034972D21607k4393
$$ 4122891 1316178 131387 737198 2255064 2351524 -2432742 1034972 421607 397214
1843C97214a078671l89526E01673e166192A095534a208537A122273d922181a157844
$$ 397214 -1078671 -1468197 501673 -5166192 1095534 -1208537 1122273 -4922181 -1157844
1833a090227B18665a251819l11402D827345b71609p98355n20877G808594g384411
$$ -1090227 218665 -1251819 -1563221 4827345 -271609 -1069964 -1590841 7808594 -7384411
1823b505170M18734j506636A879151a355365D016713H20996J769547h45718F4630
$$ -2505170 -2086436 -3593072 1879151 -1355365 4016713 820996 2590543 -845718 64630
1813A630521L73152d531574O81173i00084k702443C615242a01263j796577L42512
$$ 1630521 2003673 -4531574 -3850401 -900084 -3602527 3615242 -101263 -1897840 -1555328
1804a555328k7678B463296b172176B497241N73732c487422P16934H45692b473681
$$ -1555328 -1583006 2463296 -2172176 2497241 3070973 -3487422 -2770488 845692 -2473681
1794f464513E645742a446780f82278A06045a345222B294216a336944l534190F556181
$$ -6464513 5645742 -1446780 -682278 106045 -1345222 2294216 -1336944 -4871134 6556181
1784f88034B860042b127216M61169B296502c16170B234097a482611H76922M59690
$$ -688034 2860042 -2127216 -1666047 2296502 -316170 2234097 -1482611 876922 1336612
1775A336612c317808B309025D53890J3707J119338a45049A695494H8959a48480
$$ 1336612 -3317808 2309025 453890 467597 1586935 -145049 1695494 88959 -148480
1765a543471B419604C02929L863721G14108J909971f82596k658290I56511M00756
$$ -1543471 2419604 302929 4166650 714108 2624079 -682596 -3340886 956511 1357267
1756A357267f001787f45613A042455b00275C380092r27519d653883B900669J00690
$$ 1357267 -6001787 -645613 1042455 -200275 3380092 2452573 -4653883 2900669 3001359
1747C001359J278149a028135A646243H2298J44701M78002C43525l5385K750944
$$ 3001359 4279508 -1028135 1646243 82298 226999 705001 343525 308140 3059084
1738C059084A523760D43312a420435H74114f080842a034936A869169n29272d75664
$$ 3059084 1523760 443312 -1420435 874114 -6080842 -1034936 1869169 1339897 -475664
1728I48559k31301L788533k190522D4820N321575d764896a298187B839219A321282
$$ 948559 717258 4505791 2315269 44820 5366395 -4764896 -1298187 2839219 1321282
1718b450299a151805A826699J707343e525398a692593G99307J492236b113106
$$ -2450299 -1151805 1826699 3534042 -5525398 -1692593 799307 2291543 -2113106
1709B380587a781052A139163a443073A021983a947103k33496k371312b226907
$$ 2380587 -1781052 1139163 -1443073 1021983 -1947103 -2180599 -4551911 -2226907
1700c527924B879787a879438l08521k478007C443951c952256D406893b202111
$$ -3527924 2879787 -1879438 -2187959 -4665966 3443951 -3952256 4406893 -2202111
1691D034236f3595k169022C535309a402919C762919a868012k080332B009014a059647
$$ 4034236 -63595 -2232617 3535309 -1402919 3762919 -1868012 -3948344 2009014 -1059647
1681B399843n20847L470720a597757A198378E41375K729946b437506B046617L874756
$$ 2399843 1878996 5349716 -1597757 1198378 541375 3271321 -2437506 2046617 5921373
1672E921373A098546c09213C64858O675797c478865f72558l52413B959764p96805
$$ 5921373 1098546 -309213 364858 7040655 -3478865 -672558 -1024971 2959764 2162959
1663B162959I14324B62335R42871C80485M671872k266757d69016m272919D726946
$$ 2162959 914324 262335 1205206 380485 5052357 2785600 -469016 -4741935 4726946
1653e722749B126982J305190A569153a426464l379125a637838o01899C176221
$$ -5722749 2126982 3432172 1569153 -1426464 -4805589 -1637838 -2239737 3176221
1644I92377a594350B643974a732076J36019D526918c370324c55202F97713N456935
$$ 992377 -1594350 2643974 -1732076 -1596057 4526918 -3370324 -355202 697713 6154648
1635F154648l008997A554958C25471f269640E39699J256027a67272B50695Q48312
$$ 6154648 3145651 1554958 325471 -6269640 539699 1795726 -167272 250695 1099007
1626A099007b42619A959389e99123r09314P44395H74577g76680A939439a15259
$$ 1099007 -242619 1959389 -599123 -1508437 -764042 874577 -776680 1939439 -115259
1616E005079c989770D60082d344533F621213a359980j84560B510405r08780a589437
$$ 5005079 -3989770 460082 -4344533 6621213 -1359980 -1544540 2510405 1601625 -1589437
1606C445903A415713K229223D85473e467773f96293A785994N5935K849349q39476
$$ 3445903 1415713 3644936 485473 -5467773 -696293 1785994 1841929 4691278 3851802
1597C851802b283585A878740b238809k05455A911021c201792J507480D166723
$$ 3851802 -2283585 1878740 -2238809 -2444264 1911021 -3201792 -1694312 4166723
1588a59043E073425c339040A10940d554131A976728b106946A632690D22041c356239
$$ -159043 5073425 -3339040 110940 -4554131 1976728 -2106946 1632690 422041 -3356239
1578a776574m68349C095784e606252A47129a373700j767912E520477d21691j0667
$$ -1776574 -2244923 3095784 -5606252 147129 -1373700 -3141612 5520477 -421691 -432358
1569d32358l98075A789499a530414B75675b176333p33644d81987H99892J516155
$$ -432358 -830433 1789499 -1530414 275675 -2176333 -2909977 -481987 899892 2416047
1560B416047b396506H84046j58110a205407j643893C067956c596918e59349I56911
$$ 2416047 -2396506 884046 725936 -1205407 -2849300 3067956 -3596918 -559349 956911
1550c312568a21961l179859E70457b53097A602837L431390h972286b646636q43931
$$ -3312568 -121961 -3301820 570457 -253097 1602837 5034227 -8972286 -2646636 -3490567
1541c490567B005548a505436C149258b425960F19643c006615j02461J335750A864599
$$ -3490567 2005548 -1505436 3149258 -2425960 619643 -3006615 -3109076 -1773326 1864599
1531d797507h64109B85646b061053A899992C32715f30447C544921a31760C074147
$$ -4797507 -864109 285646 -2061053 1899992 332715 -630447 3544921 -131760 3074147
1521b261091A134126K833692c070532a270409K02358l349329A326531C00134K129064
$$ -2261091 1134126 3967818 -3070532 -1270409 -1068051 -4417380 1326531 300134 2429198
1512B429198g633930A073861D21412M382446A676429d092033J740222O82299A203667
$$ 2429198 -7633930 1073861 421412 4803858 1676429 -4092033 -2351811 -1669512 1203667
1502i92049c89549B225501a817075K11723A783206a7100I41094h93490A57621
$$ -992049 -389549 2225501 -1817075 -1605352 1783206 -17100 941094 -893490 157621
1492b216116B837167b081152A794589a537311A954613i66799A206606e408592
$$ -2216116 2837167 -2081152 1794589 -1537311 1954613 -966799 1206606 -5408592
1483C157996a209376c85173F514899k897552b145891j203709E340414a839072
$$ 3157996 -1209376 -385173 6514899 3617347 -2145891 -3349600 5340414 -1839072
1474c228615n103880B919549e77271B509180d00527q25429I06331N104092c091151
$$ -3228615 -8332495 2919549 -577271 2509180 -400527 -1225956 906331 6010423 -3091151
1464F52720J421785d197740D406344b437398D261628d76900A847039b604759B617903
$$ 652720 2074505 -4197740 4406344 -2437398 4261628 -476900 1847039 -2604759 2617903
1454A73455K729112g332470C075161c117295j232976a751571B30577g32292l68721
$$ 173455 2902567 -7332470 3075161 -3117295 -4350271 -1751571 230577 -732292 -1101013
1445a101013M39872D03808R2219K27156a094064D45170O09310K50950g192232
$$ -1101013 -661141 403808 496027 723183 -1094064 445170 1054480 1305430 -7192232
1435a325900d47467F18379J923247a580632j973262C226651a668099B119326i71893
$$ -1325900 -447467 618379 2541626 -1580632 -3553894 3226651 -1668099 2119326 -971893
1425i56277F14937L398595a650452B188944K364449d201825D018682j238008d948783
$$ -956277 614937 4013532 -1650452 2188944 4553393 -4201825 4018682 2780674 -4948783
1415C379726A11874b138568A349368a467468d67122F034595i631298a157065A457770
$$ 3379726 111874 -2138568 1349368 -1467468 -467122 6034595 -9631298 -1157065 1457770
1405a787320A151001R630K195517M34355A01008a820736G93262c004260a205011
$$ -1787320 1151001 1160631 3356148 3790503 101008 -1820736 793262 -3004260 -1205011
1395H59924K266803e696502c12818g996I1696b017444J97209n600399A801800
$$ 859924 3126727 -5696502 -312818 -7996 91696 -2017444 -1820235 -7420634 1801800
1385C819473E06997b181221g47226b09972C784213j071913c155375j337784a911984
$$ 3819473 506997 -2181221 -747226 -209972 3784213 2712300 -3155375 -4493159 -1911984
1375I47829c57682B358334a205711C379633b550949m25056D271087i05681d32360
$$ 947829 -357682 2358334 -1205711 3379633 -2550949 -2976005 4271087 -905681 -432360
1365A076707L879894K963026e679841D513675A510311a022464j872886A736966
$$ 1076707 4956601 7919627 -5679841 4513675 1510311 -1022464 -2895350 1736966
1356G322090B734180p35901b049440G860375c978220G20335H6835d706614a681751
$$ 7322090 2734180 1998279 -2049440 7860375 -3978220 720335 86835 -4706614 -1681751
1346A637863J239796a784777B999969a688217A256681f2366n25554I74626h10194
$$ 1637863 2877659 -1784777 2999969 -1688217 1256681 -62366 -587920 974626 -810194
1336A430915a482800D810620a488360A844301d553092A613415J052442L3780a274961
$$ 1430915 -1482800 4810620 -1488360 1844301 -4553092 1613415 2665857 2699637 -1274961
1326C563159e231210H82042b922720C672711a200880k63968L95857D767161h96247
$$ 3563159 -5231210 882042 -2922720 3672711 -1200880 -1464848 -1068991 4767161 -896247
1316E214623A432774d218646g43490j995852A978209r2377o89331b273691J125179
$$ 5214623 1432774 -4218646 -743490 -2739342 1978209 1885832 1196501 -2273691 -1148512
1307a148512q84096C949805e08184I448218c942742J841257P16161B456539a403422
$$ -1148512 -2032608 3949805 -508184 9448218 -3942742 -2101485 -1385324 2456539 -1403422
1297c799209A345390F27033b140017c44506k543308F074488D44103A4025K30990
$$ -3799209 1345390 627033 -2140017 -344506 -2887814 6074488 444103 14025 245015
1288B45015K184138b382537d9147l113517B071662c151003B078438A68345J790345
$$ 245015 2429153 -2382537 -49147 -3162664 2071662 -3151003 2078438 168345 1958690
1279A958690c145225a142648n71769B19418f60013D795888g26418K22012A030956
$$ 1958690 -3145225 -1142648 -1714417 219418 -660013 4795888 -726418 -504406 1030956
1269B097822j06430n87317e480786A368559d148244a92676m250277A101149a107178
$$ 2097822 1991392 1404075 -5480786 1368559 -4148244 -192676 -4442953 1101149 -1107178
1259b233801A178631l8148i33998j957729P55825B67584K667750a049775A861687
$$ -2233801 1178631 1140483 -933998 -2891727 -2135902 267584 2935334 -1049775 1861687
1249b291679B454366d186715A340570E76031a968564F242836c42069j072713l467369
$$ -2291679 2454366 -4186715 1340570 576031 -1968564 6242836 -342069 -1414782 -4882151
1240d882151E7226J313532A38564c529639B22356L147342I13319a627964B00845
$$ -4882151 57226 1370758 138564 -3529639 222356 3369698 913319 -1627964 200845
1230C836340b363162E1394b513149B338071a728680P53198E385448c973981A209192
$$ 3836340 -2363162 51394 -2513149 2338071 -1728680 -975482 5385448 -3973981 1209192
1220B86398L774021a616914g44596a17576j743788e39294B911341D37669c163429
$$ 286398 4060419 -1616914 -744596 -117576 -1861364 -539294 2911341 437669 -3163429
1210B430070G36181A66835a299771E586336c259482A429745d951279N73613A292931
$$ 2430070 736181 166835 -1299771 5586336 -3259482 1429745 -4951279 -4377666 1292931
1200d81898C212020j317863c372819J196382G76639a330075H504416c1790q66187
$$ -481898 3212020 1894157 -3372819 -2176437 776639 -1330075 8504416 -31790 -897977
1191h97977b31867l479933J219132I38295H3076i54118n277295E651595k818550
$$ -897977 -231867 -3711800 -2492668 938295 83076 -954118 -6231413 5651595 2833045
1182B833045c092756B427543a216807e5159B931515e335748A781361J44410a251823
$$ 2833045 -3092756 2427543 -1216807 -55159 2931515 -5335748 1781361 1925771 -1251823
1172i62281j633031F026435i16971k685599o31901D09504a669363B008932K147603
$$ -962281 -2595312 6026435 -916971 -3602570 -4234471 409504 -1669363 2008932 4156535
1163D156535a813812j235502C396825k92525c729277d45218a68969A720186c386792
$$ 4156535 -1813812 -3049314 3396825 3104300 -3729277 -445218 -168969 1720186 -3386792
1153D98755a583159E008317d022506D5207J091636j54598p2447a850740C315496
$$ 498755 -1583159 5008317 -4022506 45207 1136843 982245 909798 -1850740 3315496
1143a093777j997674A31084J699111J098088i46741j499280a97062j826704D402654
$$ -1093777 -3091451 131084 1830195 2928283 -946741 -2446021 -197062 -2023766 4402654
1133A076447h29629C368113A35470b130074L10592D694682M07993l66423j709960
$$ 1076447 -829629 3368113 135470 -2130074 -1819482 4694682 5102675 4736252 3026292
1124C026292j430350c581878a172082H2649L31517A84300a92571A222537L809855
$$ 3026292 1595942 -3581878 -1172082 82649 414166 184300 -192571 1222537 5032392
1115E032392A455593J134024F11406a517956B405337H40325L234807c584855F96731
$$ 5032392 1455593 2589617 611406 -1517956 2405337 840325 4075132 -3584855 696731
1105d321272A348471j54726e2953j514402F66184c566759E25019L18582J116269
$$ -4321272 1348471 1193745 -52953 -1567355 666184 -3566759 525019 843601 1959870
1096A959870b152372C801600g32212l98954O5404M22660b50951B79825b192344
$$ 1959870 -2152372 3801600 -732212 -1131166 -1065762 -643102 -250951 279825 -2192344
1086A039445J478784D70431M038989A657043g31983p73629D524990a325017B53886
$$ 1039445 2518229 470431 4509420 1657043 -731983 -1505612 4524990 -1325017 253886
1076d338153G566749d088516J989847A099916M502904i056412C621387R10490
$$ -4338153 7566749 -4088516 -2098669 1099916 5602820 -9056412 3621387 4531877
1068D531877a415803C059730a757704k90235I44854K005337r23115b565928A149515
$$ 4531877 -1415803 3059730 -1757704 -2047939 944854 2950191 2027076 -2565928 1149515
1058d533840E725244r0729b099465F254629c094587M47245B217741d667919D214012
$$ -4533840 5725244 5634515 -2099465 6254629 -3094587 -2647342 2217741 -4667919 4214012
1048d054695k887681i04711A122552n04797a096056D785543j728667j266877d798033
$$ -4054695 -6942376 -904711 1122552 617755 -1096056 4785543 3056876 1789999 -4798033
1038D635573c466905j992794K556498m34556A403699b945883e37656Q7325H78892
$$ 4635573 -3466905 -5459699 -2903201 -3337757 1403699 -2945883 -537656 -450331 878892
1028h150829i43377k016693D038278q53584g936253A358671a89587C70573f724335
$$ -8150829 -943377 -2960070 4038278 3184694 -7936253 1358671 -189587 370573 -6724335
1018F110d30757j904531H538124E75357L617420g1243B267419a7436B749742a481486
$$ 6110 -430757 -2335288 8538124 575357 4192777 -71243 2267419 -17436 2749742 -1481486
1007A172825J132021d42149C1568a661793l28113A35303b986630a97547r34181
$$ 1172825 2304846 -442149 31568 -1661793 -1989906 135303 -2986630 -197547 -1131728
998a131728j380402P93376k78180j09168A741424K402455c098599h30852L64675
$$ -1131728 -2512130 -1718754 -1996934 -2106102 1741424 4143879 -3098599 -830852 -466177
989d66177n461491a169184D04832P058582b088208e71241j050842k095499J485438
$$ -466177 -5927668 -1169184 404832 7463414 -2088208 -571241 -1622083 -3717582 -2232144
980b232144l35031C4793a182790M99961r94180C016612F86861M40156e53598k57149
$$ -2232144 -2567175 34793 -1182790 -682829 -1677009 3016612 686861 1127017 -553598 -810747
970h10747k079935C955864a960212f27730B239725I43299a74782k109727E13418
$$ -810747 -2890682 3955864 -1960212 -627730 2239725 943299 -174782 -2284509 513418
960B69673D1084a985425C398980A015442c009880L38752B561970a906170h7527
$$ 269673 41084 -1985425 3398980 1015442 -3009880 -2671128 2561970 -1906170 -87527
950G29262J662329a385376a82948F508017b642978a223701A260710b034417C697174
$$ 729262 2391591 -1385376 -182948 6508017 -2642978 -1223701 1260710 -2034417 3697174
940a022346C862039g41648C647862d364365A36039K927445K433301a03482l596135
$$ -1022346 3862039 -741648 3647862 -4364365 136039 3063484 5496785 -103482 -3699617
931c699617J848432A129227a416898A140432b774398A566106d778053C818353
$$ -3699617 -1851185 1129227 -1416898 1140432 -2774398 1566106 -4778053 3818353
922C146116b166496C987612B28387J34948N30483f322981C628930r52004k80729
$$ 3146116 -2166496 3987612 228387 363335 893818 -6322981 3628930 2676926 2396197
913B396197L942241c721180A208571b702477j834577d1990E168889c396956J653626
$$ 2396197 6338438 -3721180 1208571 -2702477 -4537054 -41990 5168889 -3396956 -1743330
904a743330C97397c71906k527626c53089k146940F692419A821700a247405B023773
$$ -1743330 397397 -371906 -2899532 -353089 -2500029 6692419 1821700 -1247405 2023773
894C289638b424537n99096e27015b45690k568374D177318j886773c417106B45261
$$ 3289638 -2424537 -3023633 -527015 -245690 -2814064 4177318 2290545 -3417106 245261
884C93682b397211A066900i49372C272397b711623D80258P33611O932337B437393
$$ 393682 -2397211 1066900 -949372 3272397 -2711623 480258 1213869 8146206 2437393
874b985923D146059j501133D06697M476469h751305d308574B840444J464677c592671
$$ -2985923 4146059 2644926 406697 4883166 -8751305 -4308574 2840444 4305121 -3592671
864d379242a414976J06960E271230c192226C804223a588969B785660a167369l87294
$$ -4379242 -1414976 -1308016 5271230 -3192226 3804223 -1588969 2785660 -1167369 -1554663
855a554663A787613a607453p90551O54778C644992a259585k947089E580430b504238
$$ -1554663 1787613 -1607453 -2398004 -1743226 3644992 -1259585 -4206674 5580430 -2504238
845C353607A96721N143395D7381i86719B659409b74223C34233R07633K609796
$$ 3353607 196721 5340116 47381 -986719 2659409 -274223 334233 1241866 3851662
836C851662A084095b341822a107952B780733d086437A498179h98789A412173O74963
$$ 3851662 1084095 -2341822 -1107952 2780733 -4086437 1498179 -898789 1412173 2087136
827B087136a749322A904578a949076C191163j568706d728599F711225a99553A893763
$$ 2087136 -1749322 1904578 -1949076 3191163 1622457 -4728599 6711225 -199553 1893763
817F381381b569971K72653J126820A3880g537043a066290B292734e334852I85352
$$ 6381381 -2569971 -2297318 -1170498 13880 -7537043 -1066290 2292734 -5334852 985352
807A915214b341933C75528c303385A281346a984437d05766B65539M507446E63541
$$ 1915214 -2341933 375528 -3303385 1281346 -1984437 -405766 265539 4772985 563541
797e614479B479105l84102L480595B658277c936250D211256a79858j247420e84284
$$ -5614479 2479105 2095003 5575598 2658277 -3936250 4211256 -179858 -1427278 -584284
787b990036D039803D16540b373282m93459B842063q65511f901451F710088b290978
$$ -2990036 4039803 416540 -2373282 -2866741 2842063 1976552 -6901451 6710088 -2290978
777H67732K076169L697057a952426j412611A90678J906758J529237b877313k377593
$$ 867732 2943901 6640958 -1952426 -3365037 190678 2097436 3626673 -2877313 -5254906
768e254906H12106c708662a446649r70307P98045B024025b899338h51248D046434
$$ -5254906 812106 -3708662 -1446649 -2416956 -1618911 2024025 -2899338 -851248 4046434
758H23691B59754K194982G68560a366729k315689c31556j762057n600080G589404
$$ 823691 259754 2454736 768560 -1366729 -3682418 -331556 -2093613 -7693693 7589404
748e02414k609551D05450a41206O8851A243928d565715J966414D698349j724978
$$ -502414 -3111965 405450 -141206 -72355 1243928 -4565715 -2599301 4698349 2973371
739B973371b72662A338755e172579A986763Q38979D98326b77100h8895B539766
$$ 2973371 -272662 1338755 -5172579 1986763 2825742 498326 -277100 -88895 2539766
729A534693b422241j761438F919399a243204p90160n177965E562336b565573G28746
$$ 1534693 -2422241 -4183679 6919399 -1243204 -2033364 -7211329 5562336 -2565573 728746
719c621680I94948O54091i88428j164749B877396c423654F5176J338859g879895
$$ -3621680 994948 1649039 -988428 -2153177 2877396 -3423654 65176 1404035 -7879895
709B877320A004264J167208r53977K692320k61934d34104A356762a427178A1775497
$$ 2877320 1004264 2171472 1217495 3909815 3647881 -434104 1356762 -1427178 11775497
699D528261P0314b0306954N811622q386561j705663B128970K1203313p532431
$$ 4528261 4598575 -20306954 -14495332 -22881893 -24587556 2128970 23332283 15799852
691A5799852L266718M597741j0611633P87422a4253669j814277j920635m4654040
$$ 15799852 19066570 23664311 13052678 13840100 -14253669 -16067946 -17988581 -62642621
683f2642621K7255051H896029p30136K570519K7056615H966890B03966L68587
$$ -62642621 -35387570 8896029 8165893 10736412 37793027 8966890 203966 572553
675E72553K345017e140051B105177d776269k38141B611432g2326n489601D591168
$$ 572553 2917570 -5140051 2105177 -4776269 -5014410 2611432 -72326 -5561927 4591168
665c736596M78148J463936P5512D109160e020624A960899i000937H065530L3137765
$$ -3736596 -3258448 -1794512 -1719000 4109160 -5020624 1960899 -9000937 8065530 41203295
656D1203295A4307138o751362i717559r199591A36816c5250516M684765J2857245
$$ 41203295 14307138 7555776 -9717559 -18917150 136816 -35250516 -30565751 -17708506
648a7708506f125831B7766409m924687J650404r472581E695652a1221985A4451134
$$ -17708506 -6125831 27766409 22841722 24492126 15019545 5695652 -11221985 14451134
639c515480j2361706m910063J0047019D535016L678476e80725A913588A01776
$$ -3515480 -15877186 -20787249 -10740230 4535016 8213492 -580725 1913588 101776
630B911603d43087C481281e674485D040915b674669g47398l645039E891751k708332
$$ 2911603 -443087 3481281 -5674485 4040915 -2674669 -747398 -4392437 5891751 3183419
621C183419I21089c22487B344609J74783L451076A116443e309163b226818j06887
$$ 3183419 921089 -322487 2344609 2519392 5970468 1116443 -5309163 -2226818 -2333705
612b333705B261104j5042b245209C553795g48267C620752Q097862L586409M1170056
$$ -2333705 2261104 2246062 -2245209 3553795 -748267 3620752 11718614 15305023 56475079
603E6475079J14783475n6638139b55307876m2431498d2927340H0416647B2261834
$$ 56475079 171258554 114620415 -255307876 -297739374 -42927340 80416647 22261834
595A4265515m260600k441707C692460P563490E93850L010554q58624d285232C259296
$$ 14265515 10004915 7563208 3692460 11255950 593850 3604404 2745780 -4285232 3259296
585A505757c114784E922984f690310E457448a925980B012536L321526a611795
$$ 1505757 -3114784 5922984 -6690310 5457448 -1925980 2012536 5334062 -1611795
576b692300F81692K556003a816196C489296h53639k059188H379424i82412A34380
$$ -2692300 681692 3237695 -1816196 3489296 -853639 -2912827 8379424 -982412 134380
566A816067c488160G248676i07836D076151A558044c016773a353052a61310E067590
$$ 1816067 -3488160 7248676 -907836 4076151 1558044 -3016773 -1353052 -161310 5067590
556c779696g26000K60396m279590C813450a675302D248069j877797c196584C115862
$$ -3779696 -726000 -465604 -4745194 3813450 -1675302 4248069 2370272 -3196584 3115862
546C794633e465508b044195H52484d124651b69174m865523d70587b34276E222838
$$ 3794633 -5465508 -2044195 852484 -4124651 -269174 -5134697 -470587 -234276 5222838
536A232176e06759D076577a687992O9880l183264C216183a761436l282150a731598
$$ 1232176 -506759 4076577 -1687992 -1618112 -4801376 3216183 -1761436 -5043586 -1731598
526A850524i649104D351934A382236e862714i11354A158262A8322g01257j118223
$$ 1850524 -9649104 4351934 1382236 -5862714 -911354 1158262 18322 -701257 -1819480
517a819480B088981B69675a549785f21125B258402a234758B11611J347467c680783
$$ -1819480 2088981 269675 -1549785 -621125 2258402 -1234758 211611 1559078 -3680783
507b06246B208080d563931J194083I93753R33568I9561L500637j261522e71785
$$ -206246 2208080 -4563931 -3369848 993753 1927321 99561 3600198 2338676 -571785
497C919939e03698D517885A720288K602800a87257j265559l51143N9067A01576
$$ 3919939 -503698 4517885 1720288 4323088 -187257 -1452816 -1803959 -1744892 101576
487D577773a449327c31904j672897C269729g38258C00306c470973C131204c441475
$$ 4577773 -1449327 -331904 -2004801 3269729 -738258 300306 -3470973 3131204 -3441475
477c461753A291232b15708B172205C54963K190461c904311B633492a280298B057287
$$ -3461753 1291232 -215708 2172205 354963 2545424 -3904311 2633492 -1280298 2057287
467a809692l805166D133322j667777b705769B313667a736066C497389a42430k422950
$$ -1809692 -5614858 4133322 2465545 -2705769 2313667 -1736066 3497389 -142430 -2565380
458b565380C355862G06599L309444a916052F42981g7448A530403J97162b098519
$$ -2565380 3355862 706599 4016043 -1916052 642981 -77448 1530403 1727565 -2098519
448D104253E35709a459209B61465J135172O45087i05071F82262c054824B402479
$$ 4104253 535709 -1459209 261465 1396637 2041724 -905071 682262 -3054824 2402479
438c685593E303712b401504G3519b73968a33962B701913q87197c3334B052386
$$ -3685593 5303712 -2401504 73519 -273968 -133962 2701913 1814716 -33334 2052386
428f330656A137262b684282g00232k938076C786378a819369E421306b226332A090642
$$ -6330656 1137262 -2684282 -700232 -3638308 3786378 -1819369 5421306 -2226332 1090642
418c402365A790530b735918O43364C029867d917848b148688B370323d807604A77626
$$ -3402365 1790530 -2735918 -2092554 3029867 -4917848 -2148688 2370323 -4807604 177626
408b542980k368205A700524P94714J001329A50341a323506B161739h98775B363850
$$ -2542980 -4911185 1700524 2495238 3496567 150341 -1323506 2161739 -898775 2363850
398d844415f49237A552390a028878r72620j042876E713394b551728p45798A669138
$$ -4844415 -649237 1552390 -1028878 -2001498 -3044374 5713394 -2551728 -3297526 1669138
388b023277C04649A30864K14569b608392C59109c018765C654746c951158E87901
$$ -2023277 304649 130864 345433 -2608392 359109 -3018765 3654746 -3951158 587901
378F33850L143579D33220b613057A074775J524698K337498b026012e34206B195993
$$ 633850 3777429 433220 -2613057 1074775 2599473 4936971 -2026012 -534206 2195993
368A160164c552525a346501m26411H45087b339113B502621J347675p24560H5774
$$ 1160164 -3552525 -1346501 -1772912 845087 -2339113 2502621 3850296 3125736 85774
358g434050D4858b807695a191102E895727A69130P96417h82040K43181q33115
$$ -7434050 44858 -2807695 -1191102 5895727 169130 965547 -882040 -638859 -1471974
349a471974A928700a468133B171827a837887p67967G43816b503327D77368b240465
$$ -1471974 1928700 -1468133 2171827 -1837887 -2605854 743816 -2503327 477368 -2240465
339A479114a960059j870739B744387r09092a617344B297450b25344l321608D444359
$$ 1479114 -1960059 -3830798 2744387 1835295 -1617344 2297450 -225344 -3546952 4444359
329A112957b461810C581460Q41497A797137d374024E713364C45960a774036p37886
$$ 1112957 -2461810 3581460 4422957 1797137 -4374024 5713364 345960 -1774036 -2511922
320b511922h76780k346398I339347F96690c971363D111251d391746A337588D19206
$$ -2511922 -876780 -3223178 9339347 696690 -3971363 4111251 -4391746 1337588 419206
310A616354E88059J928291e51518l514540j349856b346587G90923f31513G92825
$$ 1616354 588059 2516350 -551518 -4066058 -5415914 -2346587 790923 -631513 792825
300g04630E5809A4877K859458d167659B38794K052475b358001e21020l62902I22643
$$ -704630 55809 14877 2874335 -4167659 238794 2291269 -2358001 -521020 -883922 922643
289a452143d66099p96344B922658a918503F105450j722687e004738D877319i278699
$$ -1452143 -466099 -1262443 2922658 -1918503 6105450 4382763 -5004738 4877319 -9278699
279B666783K7319a70750j8541k384232C166144g18585o180476B981916G06152
$$ 2666783 2694102 -170750 -189291 -2573523 3166144 -718585 -6899061 2981916 706152
269b407035B067993d89426B470890b882528B048084b49753e5437k41835j131904
$$ -2407035 2067993 -489426 2470890 -2882528 2048084 -249753 -55437 -297272 -1429176
260a429176N26129G43756a121543M99502A143217M282606c356818e8885B908214
$$ -1429176 -903047 743756 -1121543 -622041 1143217 5425823 -3356818 -58885 2908214
250F79060e951368B652179b773726g51645G44201g70170G7995b191757K1862G47716
$$ 679060 -5951368 2652179 -2773726 -751645 744201 -770170 77995 -2191757 -2169895 747716
239C19882P88651d39859B460146b762846A669520J86042P79052c979040k476198
$$ 319882 1108533 -439859 2460146 -2762846 1669520 1855562 2634614 -3979040 -6455238
230f455238C269212d633435a756617D360335E12303d76609F995957b956325B550698
$$ -6455238 3269212 -4633435 -1756617 4360335 512303 -476609 6995957 -2956325 2550698
220H89986g04753m66623A131285b977756J024210H577354a535612j63134C45603
$$ 889986 -704753 -1171376 1131285 -2977756 -1953546 8577354 -1535612 -1698746 345603
210I65238R97881l97257J495347a228077L58691B877750f063736C67689L99322
$$ 965238 1963119 1565862 3061209 -1228077 -869386 2877750 -6063736 367689 767011
201G67011b044923K11643D895987p09142b274255j771977E298042b57135k58311
$$ 767011 -2044923 -1833280 4895987 4186845 -2274255 -4046232 5298042 -257135 -515446
192e15446k672115A562228c369549J433899l90002G5284N00397c066513C506780
$$ -515446 -3187561 1562228 -3369549 -1935650 -2325652 75284 575681 -3066513 3506780
182H15685b367989d94577j370090B988855a679537F800380e972581C728536a48824
$$ 815685 -2367989 -494577 -1864667 2988855 -1679537 6800380 -5972581 3728536 -148824
172a301349C392446e276876A640879a24277A400227M602152M463854J8497287
$$ -1301349 3392446 -5276876 1640879 -124277 1400227 6002379 10466233 28963520
164B8963520L508666a64592605K2276245N7433083a7484771A14476361J2922834
$$ 28963520 32472186 -164592605 -142316360 -84883277 -17484771 114476361 127399195
157A27399195N0728287q8703430m0469327a76786600a5601380J163130f373779
$$ 127399195 178127482 89424052 48954725 -176786600 -15601380 -14438250 -6373779
149c598472k837324a821679O15377k125793I77015A31167a999597j108963R23874
$$ -3598472 -6435796 -1821679 -1206302 -3332095 977015 131167 -1999597 -3108560 -2184686
140b184686M27214A863011f170594C548882C31402a877287A492098J336478c540395
$$ -2184686 -1757472 1863011 -6170594 3548882 331402 -1877287 1492098 2828576 -3540395
130D591537F24460a587384I47620i90004c20960l821661J608399a90739H20208
$$ 4591537 624460 -1587384 947620 -990004 -320960 -4142621 -2534222 -190739 820208
120A379545b018469A185250a654705A27429N9049i1917k155179b21114A324813
$$ 1379545 -2018469 1185250 -1654705 127429 186478 -91917 -2247096 -221114 1324813
110c673425a142190d48364j369889C298707a501838B366545a512820F798L548649
$$ -3673425 -1142190 -448364 -1818253 3298707 -1501838 2366545 -1512820 6798 3555447
101C555447B26013h093372B730625a830674B476373d90177I2947L740197e391127
$$ 3555447 226013 -8093372 2730625 -1830674 2476373 -490177 92947 3833144 -5391127
91C92898L15858b752762D682058A13542B6930K551492B46805J223425E51630j9094
$$ 392898 708756 -2752762 4682058 113542 26930 2578422 246805 1470230 551630 532536
81E32536J75792J998297R02556a627623n70437Q6217A840909b298013A483783
$$ 532536 708328 2706625 3609181 -1627623 -2198060 -2111843 1840909 -2298013 1483783
71d07866d7312G98225Q03041h42119E430563d706007E43946K923073a336722m780253
$$ -407866 -47312 798225 1601266 -842119 5430563 -4706007 543946 3467019 -1336722 -6116975
61f116975B195461f94988G15203h80747M05180E816177o66595c975191a026195
$$ -6116975 2195461 -694988 715203 -880747 -475567 5816177 5149582 -3975191 -1026195
51c558037a360209M80827r38498A383098L30931d943347a451336B789407C25316
$$ -3558037 -1360209 -879382 -1817880 1383098 1714029 -4943347 -1451336 2789407 325316
41A762567I1613N88676h27671A025342J889671A361596c530209n4617E400616
$$ 1762567 91613 680289 -827671 1025342 2915013 1361596 -3530209 -3584826 5400616
31B786364j057179a994163A870255a171148B39598a426561B370690D15368a800558
$$ 2786364 1729185 -1994163 1870255 -1171148 239598 -1426561 2370690 415368 -1800558
21C218265d891422B797269K155421b887393b84650n56093O0517n29405A282359
$$ 3218265 -4891422 2797269 4952690 -2887393 -284650 -840743 -780226 -1309631 1282359
11A939630K11748a125572q86222A320687e35316D49204h14500k167966B097711
$$ 1939630 2151378 -1125572 -2011794 1320687 -535316 449204 -814500 -2982466 2097711
1A98022g38669
$$ 198022 -738669
##PAGE= F1=5640.578599651
##FIRST=     21204.543296753, 2630.29399671054, -1831140
##DATA TABLE= (F2++(Y..Y)), PROFILE
2047a831140d33575B43006J21215K654036q09235d092678A331251c98327R5160
$$ -1831140 -433575 243006 364221 3018257 2209022 -4092678 1331251 -398327 -303167
2038c03167B578934o61444H56836O33666a534843k030373C797735a51376B791733
$$ -303167 2578934 1917490 856836 1490502 -1534843 -3565216 3797735 -151376 2791733
2028b51388G9519f330246C610354O48679A512787A15185g52845B481188b217552
$$ -251388 79519 -6330246 3610354 4259033 1512787 115185 -752845 2481188 -2217552
2018a542843E26668f16546B052684H88207d427641D622115b062361k455336E964503
$$ -1542843 526668 -616546 2052684 888207 -4427641 4622115 -2062361 -4517697 5964503
2008A370384c176135A345941A9706K394939d069732d92521m3186D837083b566459
$$ 1370384 -3176135 1345941 19706 2414645 -4069732 -492521 -535707 4837083 -2566459
1998B170009M43488c519083k03283e89797k277572H66807e71069A26299L027548
$$ 2170009 2613497 -3519083 -3722366 -589797 -2867369 866807 -571069 126299 3153847
1989C153847d273433C71987R31505M201915B148773R81632b259287n90654c13714
$$ 3153847 -4273433 371987 1303492 5505407 2148773 3130405 -2259287 -2849941 -313714
1979f13522D4172b80274k871412c11144k140133k416415d07193j558967H101285
$$ -613522 44172 -280274 -3151686 -311144 -2451277 -4867692 -407193 -1966160 8101285
1969b08029A0379L280028d046764F66007c939601Q28514o46535Q64289D883993
$$ -208029 10379 3290407 -4046764 666007 -3939601 -3111087 -3757622 -2893333 4883993
1959c065869a49621F6226R54210i75909A096986a590047D416478C57023c141864
$$ -3065869 -149621 66226 1020436 -975909 1096986 -1590047 4416478 357023 -3141864
1949B55220M006087c52962F49297D0749P74781P26677J394533a924790R46374
$$ 255220 4261307 -352962 649297 40749 815530 1542207 2936740 -1924790 -978416
1940i78416H67308d13222B082877n66290n48996f290419a7256E13973c728135
$$ -978416 867308 -413222 2082877 1516587 967591 -6290419 -17256 513973 -3728135
1930a849542j684816g68878m346134a637312E708202I60829c579586C163521a659884
$$ -1849542 -3534358 -768878 -5115012 -1637312 5708202 960829 -3579586 3163521 -1659884
1920g917766A22282J85718a53678A50024d34140k278399i45234A914998D31233
$$ -7917766 122282 308000 -153678 150024 -434140 -2712539 -945234 1914998 431233
1910B247346f050017A378417c903193C941816E77779d445758F00995Q41379b729048
$$ 2247346 -6050017 1378417 -3903193 3941816 577779 -4445758 600995 1442374 -2729048
1900a19305j530362r03870h86114k466930C215186h56551B53610b581866B692143
$$ -119305 -1649667 -2553537 -886114 -3353044 3215186 -856551 253610 -2581866 2692143
1890C173397M563393G04938b018580H59921l11613c553751g20538C09448a29797
$$ 3173397 7736790 704938 -2018580 859921 548308 -3553751 -720538 309448 -129797
1880I69996b544779i5173m167316G771677H3342L807827d490292j644128C75525
$$ 969996 -2544779 -95173 -4262489 7771677 83342 3891169 -4490292 -6134420 375525
1870c443902A318040k88323m44980J40133d179429d89808B058768c691097C813975
$$ -3443902 1318040 1029717 584737 724870 -4179429 -489808 2058768 -3691097 3813975
1860A693617c502490A72627L86484Q9389B8899a250782e55595E143880A861134
$$ 1693617 -3502490 172627 559111 648500 28899 -1250782 -555595 5143880 1861134
1850a24255A356002P66370J297567c588294H28773P4225J334494a706013M76169
$$ -124255 1356002 2122372 3419939 -3588294 828773 902998 2237492 -1706013 -1229844
1841a229844A660285e645623I40319f45700G53367d479534a121930m24718d73758
$$ -1229844 1660285 -5645623 940319 -645700 753367 -4479534 -1121930 -1546648 -473758
1831a092119j98781D556369b30083n11856n44839G601188f753090a956805j001445
$$ -1092119 -1290900 4556369 -230083 -741939 -1286778 7601188 -6753090 -1956805 -2958250
1822b958250j472497A583504a398929D600006F80859K151085a402166F4564J931055
$$ -2958250 -4430747 1583504 -1398929 4600006 680859 2831944 -1402166 64564 1995619
1813A995619r07985d464834R55645h83558k027517C488653a91749o00788j259809
$$ 1995619 1087634 -4464834 -3509189 -883558 -2911075 3488653 -191749 -792537 -2052346
1804b052346M1693B010721a205198B272704L09891d072727J635972A441062a993058
$$ -2052346 -2010653 2010721 -1205198 2272704 2582595 -4072727 -2436755 1441062 -1993058
1794f955648F074728a923714O00444G84060a639128B255866d94857m543334E581831
$$ -6955648 6074728 -1923714 -1323270 784060 -1639128 2255866 -494857 -5038191 5581831
1784e80235A794478a646744M87593B424674d91517B332069a966663A095597K49363
$$ -580235 1794478 -1646744 -1159151 2424674 -491517 2332069 -1966663 1095597 1344960
1775A344960b655623A983241F75308j72781J518015D2249M89526B17405a78175
$$ 1344960 -2655623 1983241 675308 502527 2020542 42249 531775 217405 -178175
1765a850263B783318e1692B652664I30435J870309a499035j872028F31110J615983
$$ -1850263 2783318 -51692 2652664 930435 2800744 -1499035 -3371063 631110 2247093
1756B247093f744609a49821A399175a47370C698604j295918d325594C482938j71887
$$ 2247093 -6744609 -149821 1399175 -147370 3698604 2402686 -4325594 3482938 3311051
1747C311051Q07023a117471B295038A2657Q03338k15671c08278A4013K737659
$$ 3311051 4118074 -1117471 2295038 12657 815995 600324 -308278 14013 2751672
1738B751672A195382C64153a341501A417154f467012a011337A089587N35387a002001
$$ 2751672 1195382 364153 -1341501 1417154 -6467012 -1011337 1089587 1624974 -1002001
1728A558222l97769K746575j412162a32655F008763d139592a458975A629067o01822
$$ 1558222 1160453 3907028 2494866 -132655 6008763 -4139592 -1458975 1629067 1027245
1719A027245b087738Q65510B050553J425358e143733b053670B94977R07502a711300
$$ 1027245 -2087738 -1222228 2050553 3475911 -5143733 -2053670 294977 1202479 -1711300
1709A930156a687563I93474h03955b07832k325402M12179j998459J643192j645026
$$ 1930156 -1687563 993474 -803955 -207832 -2533234 -2121055 -4119514 -2476322 -4121348
1700d121348B883898b948339k07590o21753D004126d746379D898575a678374C120200
$$ -4121348 2883898 -2948339 -3155929 -3777682 4004126 -4746379 4898575 -1678374 3120200
1690e92867j596259C419161a310827D084615a990498j561979A154041f24635B805928
$$ -592867 -2189126 3419161 -1310827 4084615 -1990498 -3552477 1154041 -624635 2805928
1680B483533J290451a194415A229433J31079J950837a683671B425689K343408
$$ 2483533 3773984 -1194415 1229433 1360512 3311349 -1683671 2425689 4769097
1672D769097E93755k52081K01250N732292c689468e87958q42957C884265A516393
$$ 4769097 593755 341674 542924 6275216 -3689468 -587958 -1430915 3884265 1516393
1662E97743N03621K35722C86246M872067j868438A42420d824986D357777e493844
$$ 597743 1101364 1337086 386246 5258313 3389875 142420 -4824986 4357777 -5493844
1652A356816J680528o44188b118919k781336a207912r04758B781734G08938a883295
$$ 1356816 3037344 2393156 -2118919 -4900255 -1207912 -2112670 2781734 708938 -1883295
1642A692435b038171M93087D578179b741567I6276K40558M752961j020804A366838
$$ 1692435 -2038171 -1545084 4578179 -2741567 96276 336834 5089795 4068991 1366838
1632d35860n494230G05862J055646a74332D23223J178328a93085A156076c76380
$$ -435860 -5930090 705862 1761508 -174332 423223 1601551 -193085 1156076 -376380
1622b379700g38970A065903f35234A362994d75411D486469c589686A057355c735828
$$ -2379700 -738970 1065903 -635234 1362994 -475411 4486469 -3589686 1057355 -3735828
1612F491537f68376n22432A413531L24188b908701D615964A612631J183943F32470
$$ 6491537 -668376 -1190808 1413531 1737719 -2908701 4615964 1612631 2796574 632470
1602e159318e80522A668736L40815K899070q79484c387842E51651a476036j25694
$$ -5159318 -580522 1668736 2009551 4908621 4029137 -3387842 551651 -1476036 -1601730
1593a601730A830682c208123K01705C832354F29084M891634b496105a34623m656247
$$ -1601730 1830682 -3208123 -3006418 3832354 629084 5520718 -2496105 -134623 -4790870
1584d790870B713959a619429A538078e94588k475533i58116r33183B229499e261631
$$ -4790870 2713959 -1619429 1538078 -594588 -3070121 -958116 -1891299 2229499 -5261631
1574C63853a102880k365573F455421d8953j36572k17171A587407a248071D36353
$$ 363853 -1102880 -3468453 6455421 -48953 -185525 -402696 1587407 -1248071 436353
1564b402050j148853A55615Q45945J972469c333069H56935P37031a000185j606680
$$ -2402050 -3550903 155615 1001560 2974029 -3333069 856935 1593966 -1000185 -2606865
1555b606865C496166d194563b1667B17120c364533b47825l272358G56138h93349
$$ -2606865 3496166 -4194563 -21667 217120 -3364533 -247825 -3520183 756138 -893349
1545B68963N675684i492661c478158L80354B266732h31757C226991b145403D57839
$$ 268963 5944647 -9492661 -3478158 -3097804 2266732 -831757 3226991 -2145403 457839
1535b583279j103798h21898A553153d597818a298277g2043j988487A810669D22089
$$ -2583279 -3687077 -821898 1553153 -4597818 -1298277 -72043 -2060530 1810669 422089
1525c85271D024794B38300K867601a384486A171574K248006b780945R70593Q06528
$$ -385271 4024794 238300 3105901 -1384486 1171574 3419580 -2780945 -1810352 -1003824
1516a003824l857906A972253B52367K290593h469190A761346q69918M253687A261967
$$ -1003824 -4861730 1972253 252367 2542960 -8469190 1761346 891428 5145115 1261967
1506d509815J630634Q81375A351681a026266A7100J483699a729924p4929A667254
$$ -4509815 -2879181 -1997806 1351681 -1026266 17100 1500799 -1729924 -1804853 1667254
1496A01888P32874f20261A04688b428306B979709b189755A384941b03264B991139
$$ 101888 834762 -620261 104688 -2428306 2979709 -2189755 1384941 -203264 2991139
1486a703740A992248d522351C397978a366748K77016F598162k967301b354221
$$ -1703740 1992248 -4522351 3397978 -1366748 -1089732 6598162 3630861 -2354221
1477c659062E066262a476473q13244n645619C067897i25238B306490e82825K43264
$$ -3659062 5066262 -1476473 -2289717 -7935336 3067897 -925238 2306490 -582825 -339561
1468c39561I51422M412162c518786C08191J225575e309395D745330c052370D167397
$$ -339561 951422 5363584 -3518786 308191 1533766 -5309395 4745330 -3052370 4167397
1458b97202A484415a674147I57403A51864K889949g883735B736558c820619o89413
$$ -297202 1484415 -1674147 957403 151864 3041813 -7883735 2736558 -3820619 -4510032
1449d510032a088458g4491l24511n32547n40851E59706b44396D37436a707225
$$ -4510032 -1088458 -74491 -399002 -931549 -1472400 559706 -244396 437436 -1707225
1439G48594J025948k20399g237562i55202M70590E39090J835952a793027r03373
$$ 748594 1774542 1554143 -7237562 -955202 -484612 539090 2375042 -1793027 -2696400
1430b696400B666816i44017A488854a286381k0573F34634M524493a261520A340074
$$ -2696400 2666816 -944017 1488854 -1286381 -1306954 634634 5159127 -1261520 1340074
1420E005698e254387C849023j277056d325222B984987F93578b125856A322472
$$ 5005698 -5254387 3849023 2571967 -4325222 2984987 693578 -2125856 1322472
1411a013897A10680N984203a0221656d30070A044628a295947A213453m94477K259414
$$ -1013897 110680 6094883 -10221656 -430070 1044628 -1295947 1213453 718976 2978390
1402B978390L45226E18096b299142E25489b711148R65504A859806J157465e479723
$$ 2978390 3323616 518096 -2299142 525489 -2711148 -1745644 1859806 3017271 -5479723
1392e04347K7510K19069j406745k9527m675401A006605K304727E15060b224530
$$ -504347 -476837 -257768 -1664513 -1694040 -6369441 1006605 3311332 515060 -2224530
1382C862c85632C698105j036809b765861q66782J364976G19418f35482B493340
$$ 3862 -385632 3698105 2661296 -2765861 -3632643 -2267667 719418 -635482 2493340
1372G109L369600b087701r47248D397980i67589A85857J161893L441554K751334
$$ 7109 3376709 -2087701 -3034949 4397980 -967589 185857 1347750 4789304 7540638
1363G540638e641709D520786A508502i82417j644651B251727N590704C024168
$$ 7540638 -5641709 4520786 1508502 -982417 -2627068 2251727 7842431 3024168
1354B508877b211364G414670c669291A02343d05659m683844K288478B385858m21683
$$ 2508877 -2211364 7414670 -3669291 102343 -405659 -5089503 -2801025 2385858 1964175
1345A964175a714382C330012a509205F62226d31098j12882E00976h93299A442096
$$ 1964175 -1714382 3330012 -1509205 662226 -431098 -543980 500976 -893299 1442096
1335g97269E677042a250897B003838d367836A775750m13703K201829a746647D407728
$$ -797269 5677042 -1250897 2003838 -4367836 1775750 1362047 3563876 -1746647 4407728
1325e071998H45252c279265B642410a036153J38629q189D540200a358272F916046
$$ -5071998 845252 -3279265 2642410 -1036153 -897524 -905713 4540200 -1358272 6916046
1315A831730d289469a223897j117423A366668J154826H40565b214211Q37105j180599
$$ 1831730 -4289469 -1223897 -2341320 1366668 2521494 840565 -2214211 -1377106 -2557705
1306b557705C067649B93745Q544197b972412N23220f32180B108736a273404l088940
$$ -2557705 3067649 293745 8837942 -2972412 -2449192 -632180 2108736 -1273404 -4362344
1297d362344A262778k04982b507512a00338k453772E363040F14231a83267H7528
$$ -4362344 1262778 1057796 -2507512 -100338 -2554110 5363040 614231 -183267 87528
1287B702610c226391F02311c973203B123299b937097B714138D03416J611707c387898
$$ 2702610 -3226391 602311 -3973203 2123299 -2937097 2714138 403416 2015123 -3387898
1277e27935j596647h3924j04405D959888a097684N1002I78360K262468j304164
$$ -527935 -2124582 -83924 -188329 4959888 -1097684 -1046682 978360 3240828 1936664
1268A936664F55214e222147A644669d241974a086642l629275A836075a134473
$$ 1936664 655214 -5222147 1644669 -4241974 -1086642 -4715917 1836075 -1134473
1259b887055F41770J331190a011741j772655J355628F10474K284350a242566B780895
$$ -2887055 641770 1972960 -1011741 -2784396 -1428768 610474 2894824 -1242566 2780895
1249b636264B526901d601292B255178C89198b322418E920705a78185j044462l460800
$$ -2636264 2526901 -4601292 2255178 389198 -2322418 5920705 -178185 -1222647 -4683447
1240d683447g2734A469234B8833c763919g4129B706499A338976b201868E25336
$$ -4683447 -72734 1469234 28833 -3763919 -74129 2706499 1338976 -2201868 525336
1230C826647b730329C38073b088142B720214a860467Q84462D918003c308786A502730
$$ 3826647 -2730329 338073 -2088142 2720214 -1860467 -976005 4918003 -3308786 1502730
1220E88281L022207a99108m83188c09103j414340g52905B814548j299343c685014
$$ 588281 3610488 -199108 -682296 -309103 -1723443 -752905 2814548 1515205 -3685014
1210A760740n14901B47827a396458F329511c322004H27717d861064J268127A530330
$$ 1760740 1245839 247827 -1396458 6329511 -3322004 827717 -4861064 -3592937 1530330
1200a165870C734404A174906b632717J59693E46697a833665G678409A10303h51170
$$ -1165870 3734404 1174906 -2632717 -2473024 546697 -1833665 7678409 110303 -851170
1190i2550l512513a736528A133107E17110g86127n798545F130523k951920c162381
$$ -92550 -3605063 -1736528 1133107 517110 -786127 -6584672 6130523 3178603 -3162381
1180B800646b245546C68324K330281e032718C028370r72873i77869J51685j538466
$$ 2800646 -2245546 368324 2698605 -5032718 3028370 2055497 -977869 -826184 -2364650
1171b364650F415936c87088l090337p17543f15544q81622B152579K119223a789998
$$ -2364650 6415936 -387088 -3477425 -4194968 -615544 -1497166 2152579 4271802 -1789998
1161b234496C510096r7527d780100B72219d01939B124376d232101D04429a685633
$$ -2234496 3510096 3412569 -4780100 272219 -401939 2124376 -4232101 404429 -1685633
1151D940557c863783h4253A960767E36869m9688a604011C070859i04218j793646
$$ 4940557 -3863783 -84253 1960767 536869 487181 -1604011 3070859 -904218 -2697864
1142b697864F13275J399343K05985a244488j042835I10295a624073C650393H49912
$$ -2697864 613275 2012618 2218603 -1244488 -2287323 910295 -1624073 3650393 849912
1132d7958B054047I69973b296184P44184D679962M16488p64037j205466H71452
$$ -47958 2054047 969973 -2296184 -1552000 4679962 5096450 4332413 3126947 871452
1122c497382h59388M2205A313895E46654A42161J878902L197619A10645K591477
$$ -3497382 -859388 -817183 1313895 546654 142161 2021063 5218682 110645 2702122
1113B702122H96454a768934A893407K76313J828901d020417H06968c308391F26285
$$ 2702122 896454 -1768934 1893407 2169720 3998621 -4020417 806968 -3308391 626285
1103A374025D454a223928F00946c705441H31499K71901R21357a446822C702036
$$ 1374025 4454 -1223928 600946 -3705441 831499 1103400 2024757 -1446822 3702036
1093g34985o6024m04028J72113b69525L4602k224246F72203J464910C36809M043556
$$ -734985 -801009 -1205037 -1032924 -269525 -234923 -2459169 672203 2137113 336809 4380365
1083D380365A820737g01866o20598D694255a826123H34050d114334G734064d244195
$$ 4380365 1820737 -701866 -1322464 4694255 -1826123 834050 -4114334 7734064 -4244195
1073a514250A042368L636644i852971C593235O48042i84062C163084b109458P86043
$$ -1514250 1042368 4679012 -9852971 3593235 4241277 -984062 3163084 -2109458 -1323415
1064a323415B030549R07753j268855b464736D58082c986023E760881k99568b964840
$$ -1323415 2030549 2938302 1669447 -2464736 458082 -3986023 5760881 5461313 -2964840
1054E722556c140513O61041C113429e257358C605570c217963k790136f92093A2229
$$ 5722556 -3140513 -2479472 3113429 -5257358 3605570 -3217963 -6008099 -692093 12229
1044F97697a092168E360213k301289j142845e848295D653481c214543k344658
$$ 697697 -1092168 5360213 3058924 1916079 -5848295 4653481 -3214543 -5559201
1036e559201K443960p00665A780885b928433A07367a87544A015372h932508g17753
$$ -5559201 -3115241 -3815906 1780885 -2928433 107367 -187544 1015372 -8932508 -717753
1026c021903D665472j705149g762463G01257g34024C34801e672529b48045j383254
$$ -3021903 4665472 2960323 -7762463 701257 -734024 334801 -5672529 -248045 -1631299
1017a631299n80883I244161f66244D370984e25137A841620f09092C045568h23350
$$ -1631299 -2212182 9244161 -666244 4370984 -525137 1841620 -609092 3045568 -823350
1007A105970K14305C17455b12715k072696J16218Q49689o18055e8656j111873
$$ 1105970 1320275 317455 -212715 -2285411 -2169193 -1319504 -1937559 -58656 -1170529
998a170529j552615J305202p57941Q42602A394845K830451b871781e49110j00728
$$ -1170529 -2723144 -1417942 -2175883 -1333281 1394845 4225296 -2871781 -549110 -649838
989f49838m823970a660803A171677N709121b171664B44991a189938l838631a940826
$$ -649838 -5473808 -1660803 1171677 6880798 -2171664 244991 -1189938 -5028569 -1940826
979b887132D91756a216509d19080j947611C139209E85787K34050a393065A63212
$$ -2887132 491756 -1216509 -419080 -2366691 3139209 585787 819837 -1393065 163212
969b453455D145756a488706A8178K280571j035541c42659j721201D84758q2445
$$ -2453455 4145756 -1488706 18178 2298749 1263208 -342659 -2063860 484758 402313
960D02313A6900b386859D654555G65089b554226M27080A899134a619516g12041
$$ 402313 16900 -2386859 4654555 765089 -2554226 -2127146 1899134 -1619516 -712041
950A052621N69286h88538d41215F809927b591491a167220A418544a663396B784492
$$ 1052621 1621907 -888538 -441215 6809927 -2591491 -1167220 1418544 -1663396 2784492
940f46465D357617d19164C571562d804721A32945K955335K473486A13245d490474
$$ -646465 4357617 -419164 3571562 -4804721 132945 3088280 5561766 113245 -4490474
930a227194C24606b489044A669261c020292B225982e001327C473964k99403b566034
$$ -1227194 324606 -2489044 1669261 -3020292 2225982 -5001327 3473964 3174561 -2566034
920D100618A59501a56377A105975d573872C999772A972780j73157M814770d395744
$$ 4100618 159501 -156377 1105975 -4573872 3999772 1972780 1799623 6614393 -4395744
910H76199c188107j794756F70757M402519b960840J458881G01836a14421l225151
$$ 876199 -3188107 -4982863 670757 5073276 -2960840 -1501959 701836 -114421 -3339572
901c339572B29647b745911F900752A432673b87264A580782J606643b481795L25187
$$ -3339572 229647 -2745911 6900752 1432673 -287264 1580782 3187425 -2481795 -2156608
892b156608h74481n80305K18410C961464j254864b931553H72018A47290b346232
$$ -2156608 -874481 -1454786 -1236376 3961464 2706600 -2931553 872018 147290 -2346232
882I02948a555982C220355b912563I55935j44899P690856B436177c659159D952055
$$ 902948 -1555982 3220355 -2912563 955935 811036 8501892 2436177 -3659159 4952055
872B561152b1383C587577g894948c610326B656588J599760b813763j136656i87127
$$ 2561152 -21383 3587577 -7894948 -3610326 2656588 4256348 -2813763 -3950419 -987127
862f52887E020519c483057C242876a838841C516452a282397M95201A174955a049469
$$ -652887 5020519 -3483057 3242876 -1838841 3516452 -1282397 -787196 1174955 -1049469
852c221529a560220C838414a358100k352846F075826b979287C891456D19669M128318
$$ -3221529 -1560220 3838414 -1358100 -3710946 6075826 -2979287 3891456 419669 4547987
843D547987A015303a466188B724143b1355k81338C08982M371279F42066a323088
$$ 4547987 1015303 -1466188 2724143 -21355 -302693 308982 4680261 642066 -1323088
833f92397A499027d607196A668937c02607A292465R07954a480228A696622b247251
$$ -692397 1499027 -4607196 1668937 -302607 1292465 2200419 -1480228 1696622 -2247251
823B868186j33695d288765D545239h74634B315960L665207b364512K55728M37195
$$ 2868186 2734491 -4288765 4545239 -874634 2315960 5981167 -2364512 -2108784 -1671589
814a671589F15320g473549h58921A778595d750548b41691A794017b777218E51556
$$ -1671589 615320 -7473549 -858921 1778595 -4750548 -241691 1794017 -2777218 551556
804b756737A357514a879569h40914D69792M154543F63127e578044B438959L99181
$$ -2756737 1357514 -1879569 -840914 469792 4624335 663127 -5578044 2438959 2838140
795B838140J189648j178781c804364C535137F403h21943l32046l051941C773776
$$ 2838140 4027788 2849007 -3804364 3535137 6403 -821943 -1153989 -4205930 3773776
785H44211b843290m7625B730915j319412f491236G088229f53505B37131K601386
$$ 844211 -2843290 -2890915 2730915 1411503 -6491236 7088229 -653505 237131 2838517
776B838517L305449a097985j989254C56173J565209J589544c784512j455897H05696
$$ 2838517 6143966 -1097985 -3087239 356173 1921382 3510926 -3784512 -5240409 805696
766d067481a100638k480409h80725A589300b782248i73605C615553H95218L6457
$$ -4067481 -1100638 -3581047 -880725 1589300 -2782248 -973605 3615553 895218 931675
757I31675K097606H16851a570405j693111A49436a575400n970346G101842h98557
$$ 931675 3029281 816851 -1570405 -3263516 149436 -1575400 -7545746 7101842 -898557
747c499042G12688C3134M02712J028622d761650K245530D572263j966324e24956
$$ -3499042 712688 33134 435846 1464468 -4761650 -2516120 4572263 2605939 -524956
737E83571e167138B257019Q27165e69160L1467E59700K085245j178371c102184
$$ 583571 -5167138 2257019 3084184 -569160 -537693 559700 2644945 1466574 -3102184
727c605375F487750a352051l48843m713274E634701c456556E87632c171102D06507
$$ -3605375 6487750 -1352051 -1700894 -6414168 5634701 -3456556 587632 -3171102 406507
717B187267a671775n52367D418139c150433a70653A500841i482000C467574j219619
$$ 2187267 -1671775 -2224142 4418139 -3150433 -170653 1500841 -9482000 3467574 2247955
708B247955m07405n04839L093101j175171E00679J268577a122650A1304590C699722
$$ 2247955 1840550 1335711 4428812 3253641 500679 1769256 -1122650 11304590 3699722
698E620780b0210308P977487j0919465J251270B452769K2011760j1363496N009730
$$ 5620780 -20210308 -12232821 -23152286 -21901016 2452769 24464529 13101033 18110763
690A8110763J701254q066712K308292a3265263j875222k467683l9456799K5585053
$$ 18110763 19812017 11745305 14053597 -13265263 -15140485 -17608168 -57064967 -31479914
682c1479914I092218j307862K770476K3830009I453279C7717O49265K471841e198610
$$ -31479914 9092218 7784356 10554832 34384841 9453279 37717 686982 3158823 -5198610
672B091792d527968m24994B356549b08119l681720C735411c494326m59572J560895
$$ 2091792 -4527968 -4952962 2356549 -208119 -3889839 3735411 -3494326 -3953898 -2393003
663b393003a113133D745744e061369B414035h907889H074400L0999606A3566151
$$ -2393003 -1113133 4745744 -5061369 2414035 -8907889 8074400 39074006 13566151
654H226899i681872q018110b02513l0336344L911112J1321349e722920B3066852
$$ 8226899 -9681872 -17699982 -202513 -30538857 -26627745 -15306396 -5722920 23066852
645B0028653M023893j0190601E140954a0127229A4597114c585228j0940218p697279
$$ 20028653 24052546 13861945 5140954 -10127229 14597114 -3585228 -14525446 -22222725
637b2222725a0173033D352279M092302g29425C436292A60020K254049a77914C533311
$$ -22222725 -10173033 4352279 8444581 -729425 3436292 160020 2414069 -177914 3533311
627e807034E049339b806812J316013k731759E214578j832717C99451C4712L159029
$$ -5807034 5049339 -2806812 -1490799 -4222558 5214578 3381861 399451 34712 3193741
618C193741n83872M265534C76360d770094b147704J88525B637665o915a424343
$$ 3193741 2609869 6875403 376360 -4770094 -2147704 -1959179 2637665 2630750 -1424343
608C142479g28736C780848O725536N241269L6703115J05838337n3183285b35657018
$$ 3142479 -728736 3780848 10506384 15747653 52450768 158289105 105105820 -235657018
599b68660563c9811422G4427496B2247130r302301l642214j783968C163931P868399
$$ -268660563 -39811422 74427496 22247130 12944829 9302615 7518647 3163931 11032330
591A1032330F61746K919563o05678d049831B512765B53094b188946E520167f106075
$$ 11032330 661746 3581309 2975631 -4049831 2512765 253094 -2188946 5520167 -6106075
581E400919b205213A368492L803095a415208j503357A029976K163448a795166
$$ 5400919 -2205213 1368492 5171587 -1415208 -2918565 1029976 3193424 -1795166
572C845566d51506j291448F596372c88786N1513A927878c685299G336205f12241
$$ 3845566 -451506 -1742954 6596372 -388786 -337273 1927878 -3685299 7336205 -612241
562C363531A636412c221701a213808c18619D773192d021757c96101l1861m195851
$$ 3363531 1636412 -3221701 -1213808 -318619 4773192 -4021757 -396101 -427962 -4623813
553d623813C545140a089412D105044j573502c932006C068086O40505e847164a950144
$$ -4623813 3545140 -1089412 4105044 2531542 -3932006 3068086 3708591 -5847164 -1950144
543I33535c775077a073916l661871g40996a18473D990020I28105A41889L505728
$$ 933535 -3775077 -1073916 -4735787 -740996 -118473 4990020 928105 141889 3647617
534C647617a651921n2116k699684B851047b273674l297709a430103A110900h281776
$$ 3647617 -1651921 -1704037 -4403721 2851047 -2273674 -5571383 -1430103 1110900 -8281776
524D315615A419139f484093G54851A04236b66406R955j365377B369919G34367
$$ 4315615 1419139 -6484093 754851 104236 -266406 -256451 -1621828 2369919 734367
514a779549g02054B033789c52777j36283A869309c651519d22703B046195d176843
$$ -1779549 -702054 2033789 -352777 -489060 1869309 -3651519 -422703 2046195 -4176843
504c736810I75135P37521B25377L613589r16960g16779C562377a61277E406728
$$ -3736810 975135 1712656 225377 3838966 2922006 -716779 3562377 -161277 5406728
494A368983J579451B89573h98953j183594R38307c58142E050396a667861f78538
$$ 1368983 2948434 289573 -898953 -2082547 -1144240 -358142 5050396 -1667861 -678538
484a262105B842020h09224D10611d364411B948382c696048J032408A179517f91488
$$ -1262105 2842020 -809224 410611 -4364411 2948382 -3696048 -2663640 1179517 -691488
474B954377D10349K091936c922956B744034f93881A012316a982393l963108D120952
$$ 2954377 410349 2502285 -3922956 2744034 -693881 1012316 -1982393 -5945501 4120952
464B992090b892186B365674a802214C113828b65806k232906B546828A171854K813880
$$ 2992090 -2892186 2365674 -1802214 3113828 -265806 -2498712 2546828 1171854 3985734
455C985734b549909A14956O33320P53262L67230b852941C894222G72964a568578
$$ 3985734 -2549909 114956 748276 1501538 1868768 -2852941 3894222 772964 -1568578
445A16166J396095O40698a355796A005816c235161B265929d123127D593525b367702
$$ 116166 1512261 2152959 -1355796 1005816 -3235161 2265929 -4123127 4593525 -2367702
435i44384b7171G0325M125503I32831B60449J598337f630851I61386b617546J006868
$$ -944384 -27171 70325 4195828 932831 260449 1858786 -6630851 961386 -2617546 -1610678
425a610678j527200D612932a811614E398759a944649I81812b511160B406954b665349
$$ -1610678 -3137878 4612932 -1811614 5398759 -1944649 981812 -2511160 2406954 -2665349
415b177494B833812d680821a755696B200597c917165a41252j226233l783076B493683
$$ -2177494 2833812 -4680821 -1755696 2200597 -3917165 -141252 -1367485 -5150561 2493683
405A634340J583868E26128g78171B407904a9658A895191e869374d75253B106030
$$ 1634340 3218208 526128 -778171 2407904 -19658 1895191 -5869374 -475253 2106030
395a637126j551281J560653D861797b466314k66461A481766a367931G12737k07725
$$ -1637126 -3188407 -1627754 4861797 -2466314 -2732775 1481766 -1367931 712737 505012
386E05012e7297k244349H50274d215101B853140c533468G44386L62276K814078
$$ 505012 -57297 -2301646 850274 -4215101 2853140 -3533468 744386 1106662 3920740
377C920740I70752b043080A770843k07468K890193a370305o0010B190589H03298
$$ 3920740 970752 -2043080 1770843 1563375 4453568 -1370305 -1430315 2190589 803298
367c259384f00074q09365A220893b396471B438502J561440j201972g97966p052438
$$ -3259384 -600074 -1409439 1220893 -2396471 2438502 3999942 2797970 -797966 -7850404
358g850404b75565j548002j34E495120a55822I40083d31132k72611j051722A378695
$$ -7850404 -275565 -1823567 -1823701 5495120 -155822 940083 -431132 -703743 -1755465 1378695
347a250008B173208a511691r39929I61485b631177A04947b143837A107633a209627
$$ -1250008 2173208 -1511691 -2451620 961485 -2631177 104947 -2143837 1107633 -1209627
337c647179B792278p35692b224130B622189c83216l141731D157383A327242b764657
$$ -3647179 2792278 2056586 -2224130 2622189 -383216 -3524947 4157383 1327242 -2764657
327C701968R34139A757327c547501D082645G1806a635861n72883e5185l816583
$$ 3701968 4636107 1757327 -3547501 4082645 71806 -1635861 -2208744 -55185 -3871768
318c871768I980897A84938d454027C701315d280254G91332A69574K934002E02509
$$ -3871768 9980897 184938 -4454027 3701315 -4280254 791332 169574 3103576 502509
308C344756e16163k807579k471592b535040A850728a639099A133902a676412H42470
$$ 3344756 -516163 -3323742 -5795334 -2535040 1850728 -1639099 1133902 -1676412 842470
298E11807K184420d441759D78286J882403b213801P54204K11145H78176a313137
$$ 511807 2696227 -4441759 478286 2360689 -2213801 -1459597 -1248452 878176 -1313137
288a22135j222172B693174b019968F171822k717979c486589D581487h300632B815551
$$ -122135 -1344307 2693174 -2019968 6171822 3453843 -3486589 4581487 -8300632 2815551
278B814625f64643C1529b492500C210306f19095o228403B816214G26386b137614
$$ 2814625 -664643 31529 -2492500 3210306 -619095 -6847498 2816214 726386 -2137614
268A409697B71106K184327c247768C389639h01437f9372H4128a895353A75058
$$ 1409697 271106 2455433 -3247768 3389639 -801437 -69372 84128 -1895353 175058
258A57845a104700c40068A062849N254504c268290b37085A124152K9828d718903
$$ 157845 -1104700 -340068 1062849 6317353 -3268290 -237085 1124152 1153980 -4718903
248C795901b652540e95164C29274h69268F5763a725472m72879A356240D01865
$$ 3795901 -2652540 -595164 329274 -869268 65763 -1725472 -2198351 1356240 401865
238I40695D07926J809042b990494A580247L56355O34538c744662j462800B841432
$$ 940695 407926 2216968 -2990494 1580247 1936602 2571140 -3744662 -5207462 2841432
228d907217a327370C185611A284578c25415G896601b730024B577664c46550b2927
$$ -4907217 -1327370 3185611 1284578 -325415 7896601 -2730024 2577664 -346550 -22927
218a345386A771741c294231a499311I232493a646488b28125D84458B3620K321347
$$ -1345386 1771741 -3294231 -1499311 9232493 -1646488 -228125 484458 23620 2344967
209B344967p61575J134437a743831K23768C388158f793485I27505L3477b329950
$$ 2344967 1583392 2717829 -1743831 -1520063 3388158 -6793485 927505 960982 -2329950
199g72505D581774L12432b575195r66263E818874E58923g96298k679998C076528
$$ -772505 4581774 4894206 -2575195 -3541458 5818874 558923 -796298 -3476296 3076528
189c751832M00838J373188D53288L46594c230754C378058H20342b314310d25351
$$ -3751832 -3350994 -1977806 453288 799882 -3230754 3378058 820342 -2314310 -425351
179b529863C166228a127456F760449e745433D873740a182208m80410B731166d508102
$$ -2529863 3166228 -1127456 6760449 -5745433 4873740 -1182208 -1662618 2731166 -4508102
169A550612D64658J794838L042494M698626J6278582M397083a52833067K0531342
$$ 1550612 464658 2259496 5301990 10000616 26279198 30676281 -152833067 -132301725
161a32301725N3973537a7450002A05247378J2524419M2705405p9447844l7016955
$$ -132301725 -78328188 -17450002 105247378 117771797 160477202 81029358 44012403
154D4012403a60272471a5311441K827272e280173J668949k322642a353928L84067
$$ 44012403 -160272471 -15311441 -12484169 -5280173 -3611224 -5933866 -1353928 -969861
146i69861j483370F60540e0888j294246k194683a362684j85443B070066e460630
$$ -969861 -2453231 660540 -50888 -1345134 -3539817 -1362684 -1548127 2070066 -5460630
136B738668E74650a617309C58262L149120c487212C445874A114522a275984A193336
$$ 2738668 574650 -1617309 358262 3507382 -3487212 3445874 1114522 -1275984 1193336
126a78115l53643l054413L52741F09459J371311f30942j444891A110918a431791
$$ -178115 -531758 -3586171 -3233430 609459 1980770 -630942 -2075833 1110918 -1431791
116D02978a11287j152702n69707B26133J309031c380124J336431e64629m41697
$$ 402978 -111287 -1263989 -1833696 226133 1535164 -3380124 -2043693 -564629 -1006326
107a006326C155454b225216B644182a533214b83814C531804B35353g230610B644548
$$ -1006326 3155454 -2225216 2644182 -1533214 -283814 3531804 235353 -7230610 2644548
97a711365B644194h61258H64417L240862e372881C96851J6132b600864E223293
$$ -1711365 2644194 -861258 864417 4105279 -5372881 396851 412983 -2600864 5223293
87b72253G1212K412260D18861J150886G32395L83282B67196K120719M46203a479379
$$ -272253 71212 2483472 418861 1569747 732395 1115677 267196 2387915 2834118 -1479379
76a418500m64504B325264b437912A380996i18253K62069c8714B118057a173286
$$ -1418500 -1883004 2325264 -2437912 1380996 -918253 -656184 -38714 2118057 -1173286
66F447366d339908A110594K468065a811538m752082B710704e50871G55221a095791
$$ 6447366 -4339908 1110594 3578659 -1811538 -6563620 2710704 -550871 755221 -1095791
56d11652E122431O66117c475909J339218R91337m22560C31469a995400A017556
$$ -411652 5122431 5788548 -3475909 -2136691 -1145354 -1567914 331469 -1995400 1017556
46B128634d386062b116869C075860c42179A457580F62409j6043f28646A864424
$$ 2128634 -4386062 -2116869 3075860 -342179 1457580 662409 646366 -628646 1864424
36B307366l84476c836934J14548D758499j853125j412790a317400B097633g68940
$$ 2307366 1922890 -3836934 -3722386 4758499 2905374 1492584 -1317400 2097633 -768940
26e36306k230399C202707F52526a452926C227443d932513B381862K949360b605663
$$ -536306 -2766705 3202707 652526 -1452926 3227443 -4932513 2381862 5331222 -2605663
16a97747o7726k44126l74140A353070M5800M44290g08821o76389A132409B70825
$$ -197747 -265473 -509599 -883739 1353070 1398870 1843160 -708821 -1385210 1132409 270825
5A228346i83141j259229B390501B71891g27528
$$ 1228346 -983141 -2242370 2390501 271891 -727528
##PAGE= F1=5618.780329767
##FIRST=     21204.543296753, 2630.29399671054, -1738175
##DATA TABLE= (F2++(Y..Y)), PROFILE
2047a738175g73300A294363d34697C039719j395753c636667A877950a77460m24644
$$ -1738175 -773300 1294363 -434697 3039719 1643966 -3636667 1877950 -177460 -602104
2038f02104C893626j945565G39242M30082a206923j958517C623971B27343K676620
$$ -602104 3893626 1948061 739242 1169324 -1206923 -3165440 3623971 227343 2903963
2029B903963a10451A36815f708313C625124Q00780A883554C80227a99056B246264
$$ 2903963 -110451 136815 -6708313 3625124 4425904 1883554 380227 -199056 2246264
2019b863517a409093C37520f36958B346430j056048d426456E666690b678794j999956
$$ -2863517 -1409093 337520 -636958 2346430 1290382 -4426456 5666690 -2678794 -4678750
2010d678750F645667A534548b305166A813668A29087K516735c867454D1610a403337
$$ -4678750 6645667 1534548 -2305166 1813668 129087 2645822 -3867454 41610 -1403337
2000E187394b583551A718962P20123b371976j441003c26968k836203A090295A88643
$$ 5187394 -2583551 1718962 2439085 -2371976 -3812979 -326968 -3163171 1090295 188643
1990c20930B975559d027504e9967A435286K910462j502672M26216b100851q48923
$$ -320930 2975559 -4027504 -59967 1435286 4345748 2843076 3269292 -2100851 -2949774
1981b949774d7042q87799D63840a24464k571108b78069j539591k641644e11097
$$ -2949774 -47042 -934841 463840 -124464 -2695572 -278069 -1817660 -4459304 -511097
1971b225439H180878e92609J77520C410456c950537E3389c290683r55458N84269
$$ -2225439 8180878 -592609 -415089 3410456 -3950537 53389 -3290683 -4246141 -3661872
1962c661872P49144D125576b048039i09488F82848P40156a527579B015584b522602
$$ -3661872 -2912728 4125576 -2048039 -909488 682848 1423004 -1527579 2015584 -2522602
1952C906172b41529k622806G00710K669888g75612I18830C08523J377001l60670
$$ 3906172 -241529 -2864335 700710 3370598 -775612 918830 308523 1685524 1324854
1943A324854J227875a432471d25802A287289h9318I34184Q20908q06563e029300
$$ 1324854 2552729 -1432471 -425802 1287289 -89318 934184 1755092 948529 -5029300
1933i6341D11703d010509a553319j856905C64320e386936a289912D962155D20785
$$ -96341 411703 -4010509 -1553319 -3410224 364320 -5386936 -1289912 4962155 420785
1923a576914B889681a756238n971999A04372d82039a08576H73982g04702k047989
$$ -1576914 2889681 -1756238 -7728237 104372 -482039 -108576 873982 -704702 -2752691
1914b752691f34234B448550G86825J942883f284535A421102c464723C793968C34469
$$ -2752691 -634234 2448550 786825 2729708 -6284535 1421102 -3464723 3793968 334469
1904d386377a18930A455883b486355e86802j821976k32957i09044k158497C363713
$$ -4386377 -118930 1455883 -2486355 -586802 -2408778 -2641735 -909044 -3067541 3363713
1894a008564G71721a764653A598151Q51016N164901G24804b149622B23855J016470
$$ -1008564 771721 -1764653 1598151 2449167 7614068 724804 -2149622 223855 1240325
1885A240325c375339f57453A76935B2876R72603b474877f04668l568060G533833
$$ 1240325 -3375339 -657453 176935 22876 995479 -2474877 -604668 -4172728 7533833
1875B43949L670531d143115k308589G7929c952639C42991J302101B82569K28195
$$ 243949 3914480 -4143115 -6451704 77929 -3952639 342991 1645092 282569 510764
1866E10764c677663e67285A852963c516152D094627F61634c554394A78105M82977
$$ 510764 -3677663 -567285 1852963 -3516152 4094627 661634 -3554394 178105 661082
1857F61082j36058F7095g44255m29043E981827B362026b25332B000149O6009K374094
$$ 661082 525024 67095 -744255 -1173298 5981827 2362026 -225332 2000149 2066158 4440252
1847D440252d367727G12594Q77847K538634b247266i15246B940833e918165E94793
$$ 4440252 -4367727 712594 1590441 4129075 -2247266 -915246 2940833 -5918165 594793
1837B6209J82567c714541i73453j001647R82800J28077n218D142472c694l45576
$$ 26209 208776 -3714541 -973453 -1975100 -992300 -864223 -869441 4142472 -3694 -349270
1827c49270l92783G287239e841767a243388k519975j017232A140988a163926E081060
$$ -349270 -742053 7287239 -5841767 -1243388 -3763363 -4780595 1140988 -1163926 5081060
1817E69421K429743a981004A99218K350968A68895d240331J209253g90754j242830
$$ 569421 2999164 -1981004 199218 2550186 168895 -4240331 -3031078 -790754 -2033584
1808b033584C364353b66476D80544b480105J92859A719563a26947B068438J23689
$$ -2033584 3364353 -266476 480544 -2480105 -2287246 1719563 -126947 2068438 2192127
1799B192127d657178b013085B078899a482295n435952F471050b221094L10542
$$ 2192127 -4657178 -2013085 2078899 -1482295 -6918247 6471050 -2221094 -1910552
1791a910552A576492a713234B211241C55629d975864D481296d46308D58807a004319
$$ -1910552 1576492 -1713234 2211241 355629 -4975864 4481296 -446308 458807 -1004319
1781f87615B424594e86820B402500b370938A372370p7425a774239A643689o73155
$$ -687615 2424594 -586820 2402500 -2370938 1372370 1294945 -1774239 1643689 970534
1772I70534k73448J704290C08505c74665C77316b58677j568331C160176c82729
$$ 970534 697086 2401376 308505 -374665 377316 -258677 -1827008 3160176 -382729
1762A096969j7399J742155b216110r96946D21923K838083g122948B04991J386698
$$ 1096969 1079570 2821725 -2216110 -3213056 421923 3260006 -7122948 204991 1591689
1753A591689a9803C982768j633012c710277C711835r2907L14149a120276B932690
$$ 1591689 -19803 3982768 2349756 -3710277 3711835 3618928 3933077 -1120276 2932690
1743B8781J465721E21078h87942a86689B499276G91638C01554a290989B001532
$$ 28781 1494502 521078 -887942 -186689 2499276 791638 301554 -1290989 2001532
1733f401778i89831C89300J329121a263628B298217o07747J613611o61106b44701
$$ -6401778 -989831 389300 1718421 -1263628 2298217 1690470 3304081 2642975 -244701
1723F633874c527752a590597F16017p8979a595725N56606B232413R35029d464748
$$ 6633874 -3527752 -1590597 616017 537038 -1595725 -1039119 2232413 3167442 -4464748
1713b447468a56959H9243a359812A621248a603145G87903e9339j180789j806817
$$ -2447468 -156959 89243 -1359812 1621248 -1603145 787903 -59339 -1240128 -3046945
1704c046945Q49524j433853J108629j928366C007236c932401j03070J234878D579563
$$ -3046945 -2197421 -3631274 -2522645 -4451011 3007236 -3932401 -4035471 -2800593 4579563
1694e213065E205900h94466A985926a048365r27265C134058a212792D357896a863803
$$ -5213065 5205900 -894466 1985926 -1048365 -1975630 3134058 -1212792 4357896 -1863803
1684c013953C70735a85453C213694j90499j265389e05460A436989O82492J082954
$$ -3013953 370735 -185453 3213694 3023195 1757806 -505460 1436989 2119481 3202435
1675C202435f35182B743888P48370B39584R01755m00834M732818c770281b89297
$$ 3202435 -635182 2743888 3492258 239584 1141339 740505 5473323 -3770281 -289297
1665a831474D751399H02439B67035J721660n54162D04071M674118j089404G94242
$$ -1831474 4751399 802439 267035 1988695 1434533 404071 5078189 3988785 794242
1655d618368C867170e016429E22490J936692Q41053b574907k004340g58357j175998
$$ -4618368 3867170 -5016429 522490 2459182 3300235 -2574907 -4579247 -758357 -1934355
1646a934355B495121B68083b045846H94056b241007R11558D461886b078124E59127
$$ -1934355 2495121 268083 -2045846 894056 -2241007 -1329449 4461886 -2078124 559127
1636i9554C835682J114067A150382a240479m219304I19766P34414c88615F89272
$$ -99554 3835682 4949749 1150382 -1240479 -5459783 919766 1654180 -388615 689272
1626A945524b13464A39864f6405l135861f74860A203200d40140H10287f61930
$$ 1945524 -213464 139864 -66405 -3202266 -674860 1203200 -440140 810287 -661930
1616C905834c023454A754775c240429F286691d3618r44547C31321J508033d151074
$$ 3905834 -3023454 1754775 -3240429 6286691 -43618 -988165 331321 1839354 -4151074
1606E497951A691325J71610H88915d701373c89208A357276Q07500K656158p66982
$$ 5497951 1691325 1862935 888915 -4701373 -389208 1357276 2164776 4820934 4053952
1597D053952d314374g09746J65189j81938A733342c110398j036169C477528A367898
$$ 4053952 -4314374 -709746 -544557 -726495 1733342 -3110398 -4146567 3477528 1367898
1587E762882a644167d45361m125674C350713i78116A446992a691555q88976c74233
$$ 5762882 -1644167 -445361 -4571035 3350713 -978116 1446992 -1691555 -2580531 -374233
1577a481447A296261d652880G38234g23206k916085F819079D90217A20939F0065
$$ -1481447 1296261 -4652880 738234 -723206 -3639291 6819079 490217 120939 60065
1567A342979h57365D51902b569365j385478G20758M07657K213226d161955H26209
$$ 1342979 -857365 451902 -2569365 -3954843 720758 1128415 3341641 -4161955 826209
1557B469194h78075j460091C799136d427498E46403d62337k686305c95673l253546
$$ 2469194 -878075 -2338166 3799136 -4427498 546403 -462337 -3148642 -395673 -3649219
1548c649219G79884a458834L68444F588202i723323d250402J541715B433208a69736
$$ -3649219 779884 -1458834 -1090390 6588202 -9723323 -4250402 -2708687 2433208 -169736
1538C011208a693773C43324b134701j953417A53285R93749d304749a681252b87859
$$ 3011208 -1693773 343324 -2134701 -4088118 153285 1147034 -4304749 -1681252 -287859
1528a990873A661840D71058g2826D373046E24209K188995d88192A202133J482653
$$ -1990873 1661840 471058 -72826 4373046 524209 2713204 -488192 1202133 2684786
1519B684786b522575K64391i27252m358362B485840C12620K162382h902175B623858
$$ 2684786 -2522575 -2258184 -927252 -5285614 2485840 312620 2475002 -8902175 2623858
1509A288059M131953G34478d894970J588561R47782A424251a007032D00534L14421
$$ 1288059 5420012 734478 -4894970 -3306409 -2358627 1424251 -1007032 400534 714955
1500G14955a625432l94280A563510C75804K88037c19456A17922b416065B925774
$$ 714955 -1625432 -2019712 1563510 375804 663841 -319456 117922 -2416065 2925774
1490b206277A043777L51856K091621b331295B915058c713002C486526a685935
$$ -2206277 1043777 1395633 3487254 -2331295 2915058 -3713002 3486526 -1685935
1481a870298F397349l115861b383769j685383D649193a118789j31523n885470
$$ -1870298 6397349 3281488 -2383769 -4069152 4649193 -1118789 -1250312 -7135782
1473g135782C013386a344988B166719g39535C49715O58879L640026c727608b02785
$$ -7135782 3013386 -1344988 2166719 -739535 349715 1008594 4648620 -3727608 -202785
1463H99780f355459E100252c659085D001894i1087A110164g36117b57151A0921
$$ 899780 -6355459 5100252 -3659085 4001894 -91087 1110164 -736117 -257151 10921
1453C101999g878021B259248d403670j50909b79857q3502I206g54528j515193
$$ 3101999 -7878021 2259248 -4403670 -4554579 -279857 -363359 9206 -754528 -2269721
1444b269721F93173a037010C51799b119803A003710J483804q46634g170212e29114
$$ -2269721 693173 -1037010 351799 -2119803 1003710 2487514 1640880 -7170212 -529114
1434d59458D18554J753464a835416r932B132092b52414D27907a594429J09947
$$ -459458 418554 2172018 -1835416 -1845348 2132092 -252414 427907 -1594429 -1484482
1425a484482F80495N484569i11206D98688M612481e927504C597795j316603c530654
$$ -1484482 680495 6165064 -911206 498688 5111169 -5927504 3597795 2281192 -3530654
1415B568225A185707b077079A214933e94992F82128N209184a0522452B49216M82604
$$ 2568225 1185707 -2077079 1214933 -594992 682128 5891312 -10522452 249216 731820
1406G31820h66629A395020A99681K362507K27573H96231b815923D10513b591171
$$ 731820 -866629 1395020 199681 2562188 2789761 896231 -2815923 410513 -2591171
1396b106540B703695o7227e004142f95395j49675N7004m87754j05625l685099
$$ -2106540 2703695 2636468 -5004142 -695395 -845070 -788066 -1275820 -1381445 -5066544
1387e066544A23882K513354D50754b222038G22679g30557C594455r93919b448239
$$ -5066544 123882 2637236 450754 -2222038 722679 -730557 3594455 2600536 -2448239
1377b431885l09107D57533g83341B545365A007199K412159a477098j486506D310009
$$ -2431885 -2740992 457533 -783341 2545365 1007199 3419358 -1477098 -2963604 4310009
1367a043765G95524Q30625K781040K606117e458436D291211A606493i21853j320785
$$ -1043765 795524 1626149 4407189 7013306 -5458436 4291211 1606493 -921853 -2242638
1358b242638B531104N507812C284516l76485b225986F791845c432107c78366m95782
$$ -2242638 2531104 8038916 3284516 2908031 -2225986 6791845 -3432107 -378366 -874148
1349h74148m348842J193881C017936I93910a718598C564746a232713a0283q05532
$$ -874148 -5222990 -4029109 3017936 993910 -1718598 3564746 -1232713 -10283 -815815
1340h15815c80622a9538j059930A433858a71691F415552a141773B025385c908714
$$ -815815 -380622 -19538 -1079468 1433858 -171691 6415552 -1141773 2025385 -3908714
1330A928997A90283M082958b205920D978294d567903G31017c458509A741967i71117
$$ 1928997 190283 4273241 -2205920 4978294 -4567903 731017 -3458509 1741967 -971117
1320c23703l59915D188776a883323H461468B009016d113416a789994j73838H20174
$$ -323703 -683618 4188776 -1883323 8461468 2009016 -4113416 -1789994 -1963832 820174
1310B982985E49278b120510M58066j128049A907608r44257P096627a891484q53844
$$ 2982985 549278 -2120510 -1662444 -2790493 1907608 963351 8059978 -1891484 -2745328
1301b745328A12393J509997i89493l742427I75165N72654b834944B33735b203922
$$ -2745328 112393 1622390 -989493 -4731920 975165 1547819 -2834944 233735 -2203922
1291D466893F60289d36292b8143B870001d023055A096970d449664B039334b711937
$$ 4466893 660289 -436292 -28143 2870001 -4023055 1096970 -4449664 2039334 -2711937
1281C183155F03282J370641c561502b27378k284666b68415A95633M708807a334343
$$ 3183155 603282 1973923 -3561502 -227378 -2512044 -268415 195633 4904440 -1334343
1271a629722H37109L180564A828592i6288m760679A939076d225796a738938l172793
$$ -1629722 837109 4017673 1828592 -96288 -4856967 1939076 -4225796 -1738938 -4911731
1262d911731B806726a328912k062243A84502K350292i80367j694660f61325A049962
$$ -4911731 2806726 -1328912 -3391155 184502 2534794 -980367 -2675027 -661325 1049962
1252B851677a389701C483309b963113B651757d981184C094411A45645b790246
$$ 2851677 -1389701 3483309 -2963113 2651757 -4981184 3094411 145645 -2790246
1243E429773a71651p37489l315641b50901A447875i8403l810899c08101A626031
$$ 5429773 -171651 -909140 -4224781 -250901 1447875 -98403 -3909302 -308101 1626031
1233A722992b829433H76939K716746b995244F90982a614008B926482a995654i18869
$$ 1722992 -2829433 876939 3593685 -2995244 690982 -1614008 2926482 -1995654 -918869
1223D041754b380728A790635H04910K447057A258434e97142J96980j282225h33027
$$ 4041754 -2380728 1790635 804910 3251967 1258434 -597142 -400162 -1682387 -833027
1213B410100l1348c991898A135759M98527A55404a351967F527322c173211B81653
$$ 2410100 2378752 -3991898 1135759 1634286 155404 -1351967 6527322 -3173211 281653
1203d630375J820848A668555a775493D110084E81578a794336q67487B17762b254237
$$ -4630375 -2809527 1668555 -1775493 4110084 581578 -1794336 -2661823 217762 -2254237
1193F283609B27453g64613H688c464963i99484A267405n64001e84694o242705
$$ 6283609 227453 -764613 8688 -3464963 -999484 1267405 703404 -584694 -6827399
1184f827399F479432C230309c170864C062069c227305H04360J524135d545138
$$ -6827399 6479432 3230309 -3170864 3062069 -3227305 804360 2328495 -4545138
1175D056299j919829f40910j56067j464019F528845B16357c217387r43468a500241
$$ 4056299 2136470 -640910 -796977 -2260996 6528845 216357 -3217387 -4160855 -1500241
1165a362959B201242J920629a737070L35511C490686j13354e464920H88574e99950
$$ -1362959 2201242 4121871 -1737070 -1401559 3490686 3377332 -5464920 888574 -599950
1155B244397d930604A63984a783170D883789c605867b36297B928755c17133B13746
$$ 2244397 -4930604 163984 -1783170 4883789 -3605867 -236297 2928755 -317133 213746
1145a463291B737996g62364j587161A062673J004737n64379a581722o11931B230901
$$ -1463291 2737996 -762364 -2349525 1062673 2067410 1503031 -1581722 -2193653 2230901
1135a066080B650187E17534J75770p2575J203343b451816J207574D317822L54955
$$ -1066080 2650187 517534 693304 620729 1824072 -2451816 -1244242 4317822 4672777
1126D672777q58771o77496D595c364524d31698j541680B057838I35479C77099
$$ 4672777 3814006 3136510 4595 -3364524 -431698 -1973378 2057838 935479 377099
1116B534541K643773a277031B782908A201053a894186A349984K213266R0361d012012
$$ 2534541 5178314 -1277031 2782908 1201053 -1894186 1349984 3563250 3653611 -4012012
1106H13691b280517a84518A419041A93477g62467D87328c762116A023365L87742
$$ 813691 -2280517 -184518 1419041 193477 -762467 487328 -3762116 1023365 1411107
1097A411107N39163h51715C445856g61067K56377p76169m4849d48538j90631j904827
$$ 1411107 1950270 -851715 3445856 -761067 -504690 -1280859 -1325708 -448538 -639169 -2543996
1087b543996C08150J398702A08143L782658A906638f67636n10072D408749b206707
$$ -2543996 308150 1706852 108143 3890801 1906638 -667636 -1177708 4408749 -2206707
1077A411550c675794G451055d285188i68527I01145K867910a0418105C196377
$$ 1411550 -3675794 7451055 -4285188 -968527 901145 3769055 -10418105 3196377
1068C900793d54898C081982b481716d49815B952681k95932A210373b384734I5137
$$ 3900793 -454898 3081982 -2481716 -449815 2952681 2656749 1210373 -2384734 95137
1058c390110E592860n56515c824486E065935c059270Q52450C901512e561138B772284
$$ -3390110 5592860 5036345 -3824486 5065935 -3059270 -2206820 3901512 -5561138 2772284
1048b388826k579472d49301o87125G95908a080672E697204k652614j116040f684658
$$ -2388826 -4968298 -449301 -1136426 795908 -1080672 5697204 3044590 1928550 -6684658
1038D639884b649303k787105K265074q13611B239575b835460G49606f8498A125709
$$ 4639884 -2649303 -5436408 -3171334 -3984945 2239575 -2835460 749606 -68498 1125709
1028i605698c67919k900805E095076k353960g449350A20113a405220B72149d419273
$$ -9605698 -367919 -3268724 5095076 2741116 -7449350 120113 -1405220 272149 -4419273
1018e39295k251252P49698I315033a851901D347290a013310A331521a024249C017413
$$ -539295 -2790547 -2040849 9315033 -1851901 4347290 -1013310 1331521 -1024249 3017413
1008b81699I44383k57909L30512d65749k587424P40818n35631i53437H7719a233000
$$ -281699 944383 686474 1016986 -465749 -3053173 -2312355 -2847986 -953437 87719 -1233000
997b624276a095319j133318e46650I37064L156379b409617d69981j61161m233556
$$ -2624276 -1095319 -2228637 -546650 937064 4093443 -2409617 -469981 -631142 -4864698
988d864698a971698A833197M149673b193859A097802h39332n187450a527322j703868
$$ -4864698 -1971698 1833197 5982870 -2193859 1097802 -839332 -6026782 -1527322 -3231190
979c231190A026745i41227c43654k599471C061138A97434L15482b327948A151618
$$ -3231190 1026745 -941227 -343654 -2943125 3061138 197434 512916 -2327948 1151618
969a951630D146130i67554I70559J242742n81846d85678j344391C14542J93065
$$ -1951630 4146130 -967554 970559 2213301 1631455 -485678 -1830069 314542 507607
960E07607c4667k701275F159856c9289j647245O8851I99692a289446j66034A394379
$$ 507607 -34667 -2735942 6159856 -39289 -1686534 -1617683 999692 -1289446 -1455480 1394379
949G61973d69706k48838F764816b265854a098121A585095a337653A638152c76232
$$ 761973 -469706 -718544 6764816 -2265854 -1098121 1585095 -1337653 1638152 -376232
939D764327h4961C300858e166882A85377K957725K199128C26969e207257f68539
$$ 4764327 -84961 3300858 -5166882 185377 3143102 5342230 326969 -5207257 -668539
929e41224k990149B113547c072054B833248e162034C174225j96537b852062C797433
$$ -541224 -3531373 2113547 -3072054 2833248 -5162034 3174225 2977688 -2852062 3797433
919E1436f82567A216577b746086D075151A246668K4572N356190d939228E32381
$$ 51436 -682567 1216577 -2746086 4075151 1246668 1271240 6627430 -4939228 532381
909c567153j770934A291925L500329b403250J148061I08907B67437c622908H69164
$$ -3567153 -5338087 1291925 4792254 -2403250 -1255189 908907 267437 -3622908 869164
899b931037F884146I84785l53801N03998J817828b425270a176360k7831j481721
$$ -2931037 6884146 984785 630984 1134982 2952810 -2425270 -1176360 -1204191 -2685912
890b685912D11046K800864q9516b399483A577430f4601k120279G85162b358748
$$ -2685912 411046 3211910 3122394 -2399483 1577430 -64601 -2184880 785162 -2358748
880B999717b852047A453174C22385Q130271B156127d100577E616165B364875c14995
$$ 2999717 -2852047 1453174 322385 8452656 2156127 -4100577 5616165 2364875 -314995
870B123934f812748b952428B469004J347362b059842j403219e35615C8660M491226
$$ 2123934 -6812748 -2952428 2469004 3816366 -2059842 -3463061 -535615 38660 4529886
861D529886c807446B746658b038198D152263a372905A7077N81575e43991l416027
$$ 4529886 -3807446 2746658 -2038198 4152263 -1372905 17077 598652 -543991 -3960018
852c960018a492542C893917a250562j920091F471018c420895D707357E39759L003794
$$ -3960018 -1492542 3893917 -1250562 -3170653 6471018 -3420895 4707357 539759 3543553
843C543553j730632a818442B644577H8472h68297Q5244E270843B62876c5566k51220
$$ 3543553 1812921 -1818442 2644577 88472 -868297 -783053 5270843 262876 -35566 -286786
833b86786i9078m916805A929160B57345Q19360J268263a191224A441139b450661
$$ -286786 -99078 -5015883 1929160 257345 1076705 2344968 -1191224 1441139 -2450661
823B502416R91245c698062B082347a370691B809272K462462a944341q553j68807
$$ 2502416 3493661 -3698062 2082347 -1370691 2809272 5271734 -1944341 -1952894 -2121701
814b121701A225648g089696d50452A140820d131414a383663A531190c087653G51343
$$ -2121701 1225648 -7089696 -450452 1140820 -4131414 -1383663 1531190 -3087653 751343
804b177226A370344a707115M15270E65674L812286E39381e511627B292457J212313
$$ -2177226 1370344 -1707115 -1291845 565674 4377960 539381 -5511627 2292457 3504770
795C504770A577477J378760c470140B796976B34280c34129j139047l715218C161008
$$ 3504770 1577477 2956237 -3470140 2796976 234280 -334129 -1473176 -5188394 3161008
785A271534c149086L80482B515707H13263e872783G070513H83455d00209B632575
$$ 1271534 -3149086 -2768604 2515707 813263 -5872783 7070513 883455 -400209 2632575
775E449690a50101k568935E64147J139288J481566d648530l45043I36785d424006
$$ 5449690 -150101 -2719036 564147 1703435 3185001 -4648530 -4993573 936785 -4424006
765g54720l794936b81596A124045b583614a085314B865903I87243O63179J719821
$$ -754720 -4549656 -281596 1124045 -2583614 -1085314 2865903 987243 1650422 3370243
756C370243I14590a734680j070667F31892a101646o061583F451264a193182k570992
$$ 3370243 914590 -1734680 -2805347 631892 -1101646 -7163229 6451264 -1193182 -3764174
747c764174I45919C64142L57442R60347d761370K357402D223247j903223d32979
$$ -3764174 945919 364142 721584 1681931 -4761370 -2403968 4223247 2320024 -432979
737a83638m713268B287245Q03669a380814N01543A311984J414060A340314c679855
$$ -183638 -4896906 2287245 3090914 -1380814 -879271 1311984 2726044 1340314 -3679855
727c254142E949690a336007p5650m065270E505406d175456D44701b648645b95551
$$ -3254142 5949690 -1336007 -1411657 -5476927 5505406 -4175456 444701 -2648645 -295551
717B628415b209487K4173E748088b835796d83492A569578a0569657D022900p55044
$$ 2628415 -2209487 -2185314 5748088 -2835796 -483492 1569578 -10569657 4022900 3267856
708C267856A577536o7826L112353j677047j451645O70387f74561A0404977B852162
$$ 3267856 1577536 1509710 4622063 2945016 1493371 2163758 -674561 10404977 2852162
698F310312a8513469Q582855j1781362L600553B763174K1220886I772420O723127
$$ 6310312 -18513469 -9930614 -21711976 -18111423 2763174 23984060 9772420 16495547
690A6495547j670231m745388L481617a1528235j880001l032685l1103367K2066390
$$ 16495547 14825316 10079928 13561545 -11528235 -13408236 -16440921 -47544288 -25477898
682b5477898H948341j861345K714462J8956527I423276d4698G53034K536913e273556
$$ -25477898 8948341 7086996 9801458 28757985 9423276 -44698 753034 3289947 -5273556
672B057347c996224p95571B101391b51261j712973B725213c340300j113831J510385
$$ 2057347 -3996224 -4791795 2101391 -251261 -1964234 2725213 -3340300 -4454131 -2943746
663b943746e60516E066327e017191B831022h508644G938166K5995408A2431218
$$ -2943746 -560516 5066327 -5017191 2831022 -8508644 7938166 33933574 12431218
654H425677i073670o781927e86826k3695918L171206Q839135d993680A7654508
$$ 8425677 -9073670 -15855597 -586826 -24282744 -21111538 -12272403 -4993680 17654508
645A5979604N969845j0038841D596100h492602A3504334c483328q878292j0121963
$$ 15979604 21949449 11910608 4596100 -8492602 13504334 -3483328 -12361620 -22483583
637b2483583i086924D159163L533578h33552D680300A92059J781609A2266L485853
$$ -22483583 -9086924 4159163 7692741 -833552 4680300 192059 1973668 12266 3498119
628C498119e784650E820908b829673O61487j761791D165520m90396a92811D55192
$$ 3498119 -5784650 5820908 -2829673 -2168186 -3929977 4165520 3675124 -192811 455192
618C827119j250311M951292c63642l720654a958163M32322B776448J87700e71239
$$ 3827119 2576808 7528100 -363642 -4084296 -1958163 -1525841 2776448 2964148 -571239
608B452523e68262C960907M915144O546899K9218808Q9528412m5815386a99779504
$$ 2452523 -568262 3960907 8876051 15422950 44641758 134170170 88354784 -199779504
599b21225220c3986070F3248658B0727885r799650k998093o19959B672581P648403
$$ -221225220 -33986070 63248658 20727885 10928235 7930142 7310183 2672581 10320984
591A0320984F65294K675145j91342c758442A739858h92043k30607E027293e296230
$$ 10320984 665294 3340439 3149097 -3758442 1739858 -892043 -1122650 5027293 -5296230
581E168565b413966G58181M173291a212456j889629A315069J739794a766445D177585
$$ 5168565 -2413966 758181 4931472 -1212456 -3102085 1315069 3054863 -1766445 4177585
571a98932m02854D390646B82341h22688B068375c669902G178343b87117B677260
$$ -198932 -601786 4390646 282341 -822688 2068375 -3669902 7178343 -287117 2677260
561A374636c362180i53606M72747D277725c843402a41393k39044m014990C037230
$$ 1374636 -3362180 -953606 -480859 4277725 -3843402 -141393 -380437 -4395427 3037230
551c54735C894318j353833d503610B741617O89202f034221a845458A245382c287784
$$ -354735 3894318 2540485 -4503610 2741617 3430819 -6034221 -1845458 1245382 -3287784
541a788160k404334i82956B1245M617236E19435K99595K201381a391107l50118
$$ -1788160 -4192494 -982956 21245 4638481 519435 819030 3020411 -1391107 -1741225
532a741225j962671B435745b871716k944568a081628B80330f484740D046815A692250
$$ -1741225 -3703896 2435745 -2871716 -5816284 -1081628 280330 -6484740 4046815 1692250
522f740390B683087a037297M20439A65884a336259B471151A228155a900672h53309
$$ -6740390 2683087 -1037297 -616858 165884 -1336259 2471151 1228155 -1900672 -853309
512A895376C39484a093513B090647c466591d09641A705499c589477n59691A007693
$$ 1895376 339484 -1093513 2090647 -3466591 -409641 1705499 -3589477 -4149168 1007693
502A270409D07110L618297p42495g55909C030950B46065N613144A076856M40063
$$ 1270409 407110 4025407 3282912 -755909 3030950 246065 5859209 1076856 1516919
493A516919F40873b41174j970686e72854j95934E184477a824774Q49925L72111
$$ 1516919 640873 -241174 -2211860 -572854 -768788 5184477 -1824774 -974849 -602738
484f02738B516806i27296F76090e131155B741171d143950a865491I40530a098610
$$ -602738 2516806 -927296 676090 -5131155 2741171 -4143950 -1865491 940530 -1098610
474C552635E32910J818574c815943B693697a70994A06604b082988l989505C958778
$$ 3552635 532910 2351484 -3815943 2693697 -170994 106604 -2082988 -6072493 3958778
464C434574b882290B347291a827779B739197b69323k064661A668919j38279K068549
$$ 3434574 -2882290 2347291 -1827779 2739197 -269323 -2333984 1668919 1530640 3599189
455C599189c054086c27933A603788O9788J22747c451226C468017A027528a808994
$$ 3599189 -3054086 -327933 1603788 1673576 1796323 -3451226 3468017 1027528 -1808994
445B7233J557688N63982a807925A236945c064627B001365d479323C662022b264293
$$ 27233 1584921 2148903 -1807925 1236945 -3064627 2001365 -4479323 3662022 -2264293
435a940669A51607K7456N302043A10814L72343J027405f758115F82603b610109
$$ -1940669 151607 179063 5481106 110814 483157 1510562 -6758115 682603 -2610109
425b434167J1472E048809a822359E347326a708520I79467a554793B981068b551188
$$ -2434167 -2422695 5048809 -1822359 5347326 -1708520 979467 -1554793 2981068 -2551188
415b237261B430431d360947a379437A889670b565950e60131K13590m860625C140338
$$ -2237261 2430431 -4360947 -1379437 1889670 -2565950 -560131 -346541 -5207166 3140338
405H32993K063104I19778c75568B434234H25136N02553f701637d74367B605636
$$ 832993 2896097 919778 -375568 2434234 825136 1327689 -6701637 -474367 2605636
395b080224k298810c19837C909958b502593O26064A197220f12583A115173m9099
$$ -2080224 -4379034 -319837 3909958 -2502593 -1876529 1197220 -612583 1115173 1066074
386A066074d16730j603454A224980e105907A944384c141007H26685J103793J864175
$$ 1066074 -416730 -2020184 1224980 -5105907 1944384 -3141007 826685 1930478 3794653
377C794653A423522a460420B174697D18372L386866g07328j616714B142277D18409
$$ 3794653 1423522 -1460420 2174697 418372 3805238 -707328 -2324042 2142277 418409
367b898524A14710i69255A548111b328844B252894J873057j953025a699961o141034
$$ -2898524 114710 -969255 1548111 -2328844 2252894 4125951 2172926 -1699961 -7840995
358g840995f62159o8118j731287D981053d13799H86612A02381h23261j306674
$$ -7840995 -662159 -730277 -2461564 4981053 -413799 886612 102381 -823261 -2129935
349b129935H06272a091450B051962i97059j188701A086132b730938a84357j971055
$$ -2129935 806272 -1091450 2051962 -997059 -2185760 1086132 -2730938 -184357 -2155412
340b155412F83553c25799l088038B589361l78017b832322B651719e22034k972190
$$ -2155412 683553 -325799 -3413837 2589361 2211344 -2832322 2651719 -522034 -3494224
331c494224C649956A349594c032072C582799J096518A615510b674054B427854
$$ -3494224 3649956 1349594 -3032072 3582799 4679317 1615510 -2674054 2427854
322c03874j176922m26625F72078d267655A0179916d22138m213751C116439c976927
$$ -303874 -1480796 -1907421 672078 -4267655 10179916 -422138 -4635889 3116439 -3976927
312B32039a75005D350418C66752L772975e15302k065887l348166b751913B825570
$$ 232039 -175005 4350418 366752 4139727 -515302 -2581189 -5929355 -2751913 2825570
302b680509A520335b637720A600320o81032J461055d687270G48772J606094b039980
$$ -2680509 1520335 -2637720 1600320 919288 2380343 -4687270 748772 2354866 -2039980
292b390253Q24795G73437a290439B93342a441547B342014b058229E879555B376167
$$ -2390253 -1565458 773437 -1290439 293342 -1441547 2342014 -2058229 5879555 2376167
282a832270D115204g361907B835979j0721a078511B17490b420348C131122e43055
$$ -1832270 4115204 -7361907 2835979 2825258 -1078511 217490 -2420348 3131122 -543055
272f430366B543199E93493a951779G79244K04086J334715c524085D527180a413803
$$ -6430366 2543199 593493 -1951779 779244 983330 2318045 -3524085 4527180 -1413803
262a10395C76150b022970A231476c72515q92208h2783A066473N736162c104816
$$ -110395 376150 -2022970 1231476 -372515 -1264723 -82783 1066473 6802635 -3104816
252c61733j25179A575930c368570D736229b490972d84416a05261r03948B6874
$$ -361733 -486912 1575930 -3368570 4736229 -2490972 -484416 -105261 -1009209 26874
242a324323q09378A828395D79746K28019M54943P30826c284724A490258L93541
$$ -1324323 -2133701 1828395 479746 707765 1162708 1893534 -3284724 1490258 1883799
233A883799N23822c273059j005633B435740e144664h87950B011300O8154b38500
$$ 1883799 2407621 -3273059 -4278692 2435740 -5144664 -887950 2011300 2079454 -238500
223H370630b515617B498090a652029E99065a702483B374432c420706a031319I597422
$$ 8370630 -2515617 2498090 -1652029 599065 -1702483 2374432 -3420706 -1031319 9597422
213a896227A161638C42759i26706B612060j049399N80296b482515O91557C481178
$$ -1896227 1161638 342759 -926706 2612060 1562661 2142957 -2482515 -1790958 3481178
203g347123A414555l80640b532597B08215L670293J548285b591566m74300F209462
$$ -7347123 1414555 1033915 -2532597 208215 3878508 5426793 -2591566 -3065866 6209462
193A271478a115537k604025D228014d102722n13473a553749G82451Q3719c303291
$$ 1271478 -1115537 -3719562 4228014 -4102722 -4616195 -1553749 782451 866170 -3303291
183C188422F73841b281960e58908k646264C009411d91983F254976e486618E723853
$$ 3188422 673841 -2281960 -558908 -3205172 3009411 -491983 6254976 -5486618 5723853
173b134118K48944A807237c726770A443309n64251K116627J432247M609232J2885632
$$ -2134118 -1885174 1807237 -3726770 1443309 879058 2995685 4427932 9037164 21922796
164B1922796M829571a29772133J7104737M6969417a6852199H9263720J0577037
$$ 21922796 26752367 -129772133 -112667396 -65697979 -16852199 89263720 99840757
157I9840757L2888947o5622787l1748012a31900758a4550135M946740d262107
$$ 99840757 132729704 67106917 35358905 -131900758 -14550135 -9603395 -4262107
149c673545j355039i44992P488o04355C44742d42541l97781l127403d61671q32113
$$ -3673545 -5028584 -944992 -937504 -1541859 344742 -442541 -840322 -3967725 -461671 -1293784
139a293784B069942d593279A851372C28752a460302O28315D031046c393650B085067
$$ -1293784 2069942 -4593279 1851372 328752 -1460302 -831987 4031046 -3393650 2085067
129A517296i24992A430279E04289f51031k534165p32759A371707J465611b853521
$$ 1517296 -924992 1430279 504289 -651031 -3185196 -3917955 1371707 2837318 -2853521
119b082350I15441a274856F04497d98121j805501R09246G58614P20806c207989
$$ -2082350 915441 -1274856 604497 -498121 -2303622 -1394376 758614 1479420 -3207989
109b960028g17017b30763B839175b926529B693276a609229f56887C317061B484
$$ -2960028 -717017 -230763 2839175 -2926529 2693276 -1609229 -656887 3317061 2484
99f137366B262784a591197B712712a255918A603711K535764e181034C07463A135
$$ -6137366 2262784 -1591197 2712712 -1255918 1603711 4139475 -5181034 307463 1135
89b444987E508068e88137f4701B190502E10263R18705n33595O56230b33861A965019
$$ -2444987 5508068 -588137 -64701 2190502 510263 1428968 895373 1551603 -233861 1965019
78A916593a419212e88261j127576B648429b488670A050873a409477k11642g71874
$$ 1916593 -1419212 -588261 -1715837 2648429 -2488670 1050873 -1409477 -1621119 -771874
68B454161a570752G154484c894065A471776J911519b246264m766164C151024e44362
$$ 2454161 -1570752 7154484 -3894065 1471776 3383295 -2246264 -7012428 3151024 -544362
58I39921a463820d60428D330679J637520b805316m00191I88216a663770A189711
$$ 939921 -1463820 -460428 4330679 5968199 -2805316 -3205507 988216 -1663770 1189711
48b166551E05492J729209c630346R73946C158999a163641A143090j6592E44818
$$ -2166551 505492 2234701 -3630346 -2656400 3158999 -1163641 1143090 1126498 544818
38d70098B478452q10305M95212d014801J84383C847662j004923A066213g88222
$$ -470098 2478452 1668147 2163359 -4014801 -3830418 3847662 2842739 1066213 -788222
28B178027e04734j079232k572291C831372G63194a292091C004170d625579A566464
$$ 2178027 -504734 -1583966 -4156257 3831372 763194 -1292091 3004170 -4625579 1566464
18E416033b378423a97926C07800c03564k02437A261111n26838N97882d71599k94855
$$ 5416033 -2378423 -197926 307800 -303564 -506001 1261111 734273 1332155 -471599 -766454
8g66454F82161K95786Q17696a216299m43393B483490A95010g30869
$$ -766454 682161 977947 1795643 -1216299 -1659692 2483490 195010 -730869
##PAGE= F1=5596.982059883
##FIRST=     21204.543296753, 2630.29399671054, -1586223
##DATA TABLE= (F2++(Y..Y)), PROFILE
2047a586223N39351B033155a046263B867800I89373c174872B524084D7948h68635
$$ -1586223 -1046872 2033155 -1046263 2867800 989373 -3174872 2524084 47948 -868635
2037E044535A872383E87443J54217f61480j995542C332069E92138K292038B50391
$$ 5044535 1872383 587443 741660 -661480 -2657022 3332069 592138 2884176 250391
2027A03376f620119C573786P52637k144604F78486l22976J439121c371210a060203
$$ 103376 -6620119 3573786 4326423 2181819 678486 355510 1794631 -3371210 -1060203
2017B11490f31539B485729q71275d358476F501486c128155j507506G009336A824313
$$ 211490 -631539 2485729 1614454 -4358476 6501486 -3128155 -4635661 7009336 1824313
2007a336349B417948B54997K658897c579661F91101b289880E175254b507720A280869
$$ -1336349 2417948 254997 2913894 -3579661 691101 -2289880 5175254 -2507720 1280869
1997B177947a072478k635527b25475l085496A285385n51586g30701B653763c748328
$$ 2177947 -1072478 -3708005 -225475 -3310971 1285385 733799 -730701 2653763 -3748328
1987c50593A587159J379631L83457m803a963694r62603B69439a375215A069036
$$ -350593 1587159 2966790 3350247 3345444 -1963694 -2926297 269439 -1375215 1069036
1977C4651b233893b31327p77867k978606f10149j847101G943581h05856j02123
$$ 34651 -2233893 -231327 -1009194 -3987800 -610149 -2457250 7943581 -805856 -907979
1968i07979C397090c737292f77448j770917k776123J953353L95290C281145h31274
$$ -907979 3397090 -3737292 -677448 -2448365 -5224488 -3271135 -2875845 3281145 -831274
1958a823229A264473R96188b069123B743039c305365C225147g92222j744753A088587
$$ -1823229 1264473 2260661 -2069123 2743039 -3305365 3225147 -792222 -2536975 1088587
1948B113797a156483A207352D27260K020758A073670J064178f88044A62029J421365
$$ 2113797 -1156483 1207352 427260 2448018 1073670 2137848 -688044 162029 1583394
1939A583394C17580b58141A917329G77469c530822b51030D42702d246586a262821
$$ 1583394 317580 -258141 1917329 777469 -3530822 -251030 442702 -4246586 -1262821
1929c199987A327961e299669g63362D143727i9186E65402J810013b040070n095791
$$ -3199987 1327961 -5299669 -763362 4143727 -99186 565402 2375415 -2040070 -7135861
1920g135861a8419j464798e5038A509300a050440j533840c31948B944815A172592
$$ -7135861 -18419 -1483217 -55038 1509300 -1050440 -2584280 -331948 2944815 1172592
1910B778136f490972A649627c139437C680914F9410d059115g60153A408270b124788
$$ 2778136 -6490972 1649627 -3139437 3680914 69410 -4059115 -760153 1408270 -2124788
1900a108247j966710M64062i53937j666750C343333a220260A264504i95288H65166
$$ -1108247 -3074957 -2610895 -953937 -2620687 3343333 -1220260 1264504 -995288 865166
1890A538566N676024I46501b421668c99343A968042c011013e95928b3032G3821
$$ 1538566 7214590 946501 -2421668 -399343 1968042 -3011013 -595928 -23032 73821
1880A041730b306333a072264k750510G078463D24661L433933c727600k784608
$$ 1041730 -2306333 -1072264 -3822774 7078463 424661 3858594 -3727600 -6512208
1872f512208a54569m228375g33915B086655I6092K30952c249899d73457A480121
$$ -6512208 -154569 -4382944 -733915 2086655 96092 327044 -3249899 -473457 1480121
1862c274830D140331c36664l267561A57579N47041C37451A09547a93370j617204
$$ -3274830 4140331 -336664 -3604225 157579 704620 337451 109547 -193370 -1810574
1853a810574F531015B715019b37018B546924n34737L195555d837780E90321J796325
$$ -1810574 6531015 2715019 -237018 2546924 2012187 5207742 -4837780 590321 2386646
1844B386646L403295b742209f32184D179838f028025d125F75639e91568k164125
$$ 2386646 5789941 -2742209 -632184 4179838 -6028025 -4125 675639 -591568 -2755693
1835b755693h23296j589340J065833f64590K43728C544299C08395A3780c9161
$$ -2755693 -823296 -2412636 -1346803 -664590 -420862 3544299 308395 13780 -39161
1825F757722d814711d76444m078694j52491E09911g07140E323879D17793K592379
$$ 6757722 -4814711 -476444 -4555138 -4707629 509911 -707140 5323879 417793 3010172
1816C010172b602782C68565K760400g80678l145938J403378f98898m62187C188803
$$ 3010172 -2602782 368565 3128965 -780678 -3926616 -2523238 -698898 -1161085 3188803
1806c84595A745657b877464M15445A529990o10192R29569K501e238475a602876
$$ -384595 1745657 -2877464 -2462019 1529990 919798 1849367 1851868 -5238475 -1602876
1796B636731a018323n348373F747953b391726q7953B350983a613817B117541j022719
$$ 2636731 -1018323 -6366696 6747953 -2391726 -2479679 2350983 -1613817 2117541 1094822
1787A094822d804989C347607c76466p12946b85504r8347B210389f68900B392225
$$ 1094822 -4804989 3347607 -376466 -1089412 -285504 -383851 2210389 -668900 2392225
1777b766117A620508m93909h11384A246199K1745l02220J676209E87630i62967
$$ -2766117 1620508 1126599 -811384 1246199 1267944 965724 2641933 587630 -962967
1767D83186d56798j051918C446801f83840L25410A100205J520137b851178o8255
$$ 483186 -456798 -1508716 3446801 -683840 -358430 1100205 2620342 -2851178 -2919433
1758b919433B77888L950105g126223C41414J190743A33958M021180j902470b921690
$$ -2919433 277888 4227993 -7126223 341414 1532157 133958 4155138 2252668 -2921690
1748C433937L85724j25553a109435C439348G1989K077260C94024a372315c44945
$$ 3433937 3819661 3694108 -1109435 3439348 71989 2149249 394024 -1372315 -344945
1738B264643C05259j02358a321897B503954e927922a085528b47831A550637a293159
$$ 2264643 305259 202901 -1321897 2503954 -5927922 -1085528 -247831 1550637 -1293159
1728C020911p84119M35266K0840c46576G155166c041778J360552a84631h1013
$$ 3020911 2236792 2672058 2692898 -346576 7155166 -3041778 -1681226 -184631 -81013
1718a102061M38154B290197L32900c610077P55331e42935m61468j02158A407220
$$ -1102061 -663907 2290197 2623097 -3610077 -2854746 -542935 -1004403 -1106561 1407220
1708a601459D93082K05635b005049j451180R92526o57084P07101k118589C181359
$$ -1601459 493082 698717 -2005049 -3456229 -2463703 -3120787 -2413686 -4532275 3181359
1698d768831j3456a911016E064615e347798E271851E0862O78603a440298k33966
$$ -4768831 -4782287 -1911016 5064615 -5347798 5271851 50862 729465 -1440298 -1674264
1689a674264B664398a167164D512405a552256q10134c67612A95743L358225j58385
$$ -1674264 2664398 -1167164 4512405 -1552256 -2362390 -367612 195743 3553968 3395583
1680C395583e25769D20215J336185R85116J86513E97799K324031p76026C4112
$$ 3395583 -525769 420215 1756400 2741516 2928029 597799 2921830 2145804 34112
1670B005786H97058L726657c752332A67174b222593E493333h29q9935B869940
$$ 2005786 897058 4623715 -3752332 167174 -2222593 5493333 -829 -90764 2869940
1660A456729C65824M181799o2545A421025d183121C218489d356858c84834A678120
$$ 1456729 365824 4547623 4485078 1421025 -4183121 3218489 -4356858 -384834 1678120
1650D211649b833493j052416c62717j366937B281941c54608j736264B38862b382179
$$ 4211649 -2833493 -3885909 -362717 -1729654 2281941 -354608 -2090872 238862 -2382179
1640i50767D157571a448965I59642f09234B473227L237571H44407a993627k988430
$$ -950767 4157571 -1448965 959642 -609234 2473227 5710798 844407 -1993627 -4982057
1631d982057A203648K23094g97617A007362J058349c38925o77297B78985c924940
$$ -4982057 1203648 1426742 -797617 1007362 2065711 -338925 -1016222 278985 -3924940
1621f16065A226859b32339B83937g06803C281553b339401B441467b880951E957015
$$ -616065 1226859 -232339 283937 -706803 3281553 -2339401 2441467 -2880951 5957015
1611C93013i50557K69309A889070e256208F032593A621566p33914L37077d148458
$$ 393013 -950557 -681248 1889070 -5256208 6032593 1621566 887652 1224729 -4148458
1601a77874H42245J435552K115559n03167e008352a835050D10888A03126J489675
$$ -177874 842245 2277797 4393356 3890189 -5008352 -1835050 410888 103126 1592801
1592A592801b945118k066077C090134j095484L775050h77511M9385l079908C848943
$$ 1592801 -2945118 -5011195 3090134 1994650 5769700 -877511 -828126 -3908034 3848943
1582b44972A324735b825874R11811g3958r78426C43112c834253A250568b99359
$$ -244972 1324735 -2825874 -1914063 -73958 -1052384 343112 -3834253 1250568 -299359
1572c666989F610871A101605D56268m099N94583c89288B87514b671454j454869
$$ -3666989 6610871 1101605 456268 452169 1046752 -389288 287514 -2671454 -4126323
1563d126323A155235J40999K191053d837772G72789K464126h57574j228422C923697
$$ -4126323 1155235 1296234 3487287 -4837772 772789 3236915 -857574 -2085996 3923697
1553d277435A105914a068894j628761e67442l077487F20999a894706m97267F966268
$$ -4277435 1105914 -1068894 -2697655 -567442 -3644929 620999 -1894706 -2391973 6966268
1543i607408M696474b363517B472338D54232K074818a106310B62772a667808k616118
$$ -9607408 -4910934 -2363517 2472338 454232 2529050 -1106310 262772 -1667808 -4283926
1534d283926A124309m56859c974106J948483c53085j519425A433464D80192k02608
$$ -4283926 1124309 667450 -3974106 -2025623 -353085 -1872510 1433464 480192 277584
1525B77584M291172F94830J252922C08721R16927N68063b348983k10932h33066
$$ 277584 4568756 694830 1947752 308721 1225648 1793711 -2348983 -2559915 -833066
1515e681095B868336D68650J751476h901482C577852A597585M023579A08420e204299
$$ -5681095 2868336 468650 2220126 -8901482 3577852 1597585 5621164 108420 -5204299
1505c616981Q77727A373894i38894G31394h1000j432970p12439A487186o69020
$$ -3616981 -2739254 1373894 -938894 731394 -81000 -1513970 -2226409 1487186 818166
1496H18166D01927A0305J81791b183275B671098b163063G92509K318826K98852
$$ 818166 401927 10305 192096 -2183275 2671098 -2163063 792509 3111335 3410187
1487C410187b770077C967665c058345C419139b095892o60864E920218B566933
$$ 3410187 -2770077 3967665 -3058345 3419139 -2095892 -2756756 5920218 2566933
1478b258094k225236D113545g81366a62688n888016B775979a809645B111013h52878
$$ -2258094 -4483330 4113545 -781366 -162688 -6050704 2775979 -1809645 2111013 -852878
1468H28766K56767K818138c684551h11760B25603g268724E489351d219623C753209
$$ 828766 1085533 3903671 -3684551 -811760 225603 -7268724 5489351 -4219623 3753209
1458A43019N39605A57407i05606b44720C079954g327516A693476d819196L23091
$$ 143019 682624 157407 -905606 -244720 3079954 -7327516 1693476 -4819196 -4496105
1449d496105F44017f31824D79965e81598k394837H24614a809625D49441b313781
$$ -4496105 644017 -631824 479965 -581598 -2976435 824614 -1809625 449441 -2313781
1439A195226J976699A563985f978766g8171k74533B24162J747909a700357O56382
$$ 1195226 3171925 1563985 -6978766 -78171 -352704 224162 1972071 -1700357 -1043975
1430a043975A649633C49876i20234r38837M16730G25268O206799f02507b97192
$$ -1043975 1649633 349876 -920234 -1859071 -1442341 725268 6932067 -602507 -297192
1420D857381f157481C255087j332245b616488B193393o30033b001486A038531
$$ 4857381 -6157481 3255087 1922842 -2616488 2193393 1563360 -2001486 1038531
1411b11359A210004M243254a0509209H66333l77472e25267A649083c42514B173375
$$ -211359 1210004 5453258 -10509209 866333 488861 -525267 1649083 -342514 2173375
1401B234627r96772c323412D62612b663958M06403C327687j323495d292780h56794
$$ 2234627 1237855 -3323412 462612 -2663958 -2257555 3327687 2004192 -4292780 -856794
1391a053867m09267O15686n1575k686260g67949A899056C12472b144498A420673
$$ -1053867 -1463134 -847448 -899023 -3585283 -767949 1899056 312472 -2144498 1420673
1381a248699C472776r19085b211387i84766k305736A92432g66810B477057p28872
$$ -1248699 3472776 2553691 -2211387 -984766 -3290502 192432 -766810 2477057 1748185
1372A748185J732231g81404j951737D006858a121304A362503N84752J860212K618703
$$ 1748185 3480416 -781404 -2733141 4006858 -1121304 1362503 1947255 3807467 6426170
1363F426170e103460C825714A817833h38834r07375B573782N291150C558151l31286
$$ 6426170 -5103460 3825714 1817833 -838834 -1746209 2573782 7864932 3558151 3226865
1354C226865b091616F051901c306303g03968n95657l796942j58412C524064H7221
$$ 3226865 -2091616 6051901 -3306303 -703968 -1299625 -5096567 -5254979 3524064 87221
1344a777655C685251h44811J42548m66208a32903l87251q38358A439611C67311
$$ -1777655 3685251 -844811 -702263 -1168471 -132903 -520154 -1358512 1439611 367311
1334F974260a174884A931387c172650B078094g76855D817158b624559E241611
$$ 6974260 -1174884 1931387 -3172650 2078094 -776855 4817158 -2624559 5241611
1325c762151E58993c397140A016617i84412B27681d10926C804167b433036I722725
$$ -3762151 558993 -3397140 1016617 -984412 227681 -410926 3804167 -2433036 9722725
1315A935739c671085J257498P98896D01826K836172C63390a983938K4275p83163
$$ 1935739 -3671085 -2413587 -1614691 401826 3237998 363390 -1983938 -1959663 -2742826
1306b742826E71257R01590N713412g49253k199581H19009K34251e71058m330102
$$ -2742826 571257 1472847 7186259 -749253 -2948834 819009 1053260 -571058 -4901160
1297d901160E13420J585787c068386F35871a849900C478638E75613g24376f2780
$$ -4901160 513420 2099207 -3068386 635871 -1849900 3478638 575613 -724376 -62780
1287B919886d699192A440358d596917A850044b468981C483133G74697J062668
$$ 2919886 -4699192 1440358 -4596917 1850044 -2468981 3483133 774697 1837365
1279A837365c641484b33882k626594c33943E01389M136647a421870p88479F47574
$$ 1837365 -3641484 -233882 -2860476 -333943 501389 4638036 -1421870 -2210349 647574
1269D393036A668785g79402l603441B333658d082830K013260k912875C914419
$$ 4393036 1668785 -779402 -4382843 2333658 -4082830 -2069570 -4982445 3914419
1260a659442k050898a14087B809360h24819j734391A19799J457029J254201a468008
$$ -1659442 -3710340 -114087 2809360 -824819 -2559210 119799 1576828 2831029 -1468008
1250C942562c254075B817080e267409C795993a37716l167633D827187b88638j77525
$$ 3942562 -3254075 2817080 -5267409 3795993 -137716 -3305349 4827187 -288638 -466163
1241d66163l011777d33980A299965b30351l712496d99388B21901J832302c451318
$$ -466163 -3477940 -433980 1299965 -230351 -3942847 -499388 221901 2054203 -3451318
1231A248727J908825c133892A080907a129269B917826b094968g86041B821595
$$ 1248727 3157552 -3133892 1080907 -1129269 2917826 -2094968 -786041 2821595
1222a185414B080967I26765K152039m49953d64932O8795j339583g45004A784242
$$ -1185414 2080967 926765 3078804 2628851 -464932 -396137 -1735720 -745004 1784242
1212B972201d048539F44008J253469i6523j088980F098715b790791a36652m121553
$$ 2972201 -4048539 644008 1897477 -96523 -1185503 6098715 -2790791 -136652 -4258205
1203d258205b053208A700633b305617D337321A50309i49973j739362a82144k372759
$$ -4258205 -2053208 1700633 -2305617 4337321 150309 -949973 -2689335 -182144 -2554903
1194b554903D575316C16262f43283G7924c290313c04431A346825E96084c53396
$$ -2554903 4575316 316262 -643283 77924 -3290313 -304431 1346825 596084 -353396
1184f913555F687230B992981c096571C196632d048366A247398O14603c875405
$$ -6913555 6687230 2992981 -3096571 3196632 -4048366 1247398 1862001 -3875405
1175D776771B178059b48542o09036j434194F420985H54186b811780j309172J925280
$$ 4776771 2178059 -248542 -857578 -2291772 6420985 854186 -2811780 -4120952 -2195672
1166b195672R33788B173122J565038a636212e93301C342116l33826e700127A391194
$$ -2195672 -1261884 2173122 3738160 -1636212 -593301 3342116 3008290 -5700127 1391194
1156g33552B102753e452712a68119j695374D832714c241926d11348C979801a523209
$$ -733552 2102753 -5452712 -168119 -1863493 4832714 -3241926 -411348 3979801 -1523209
1146H9777a454782B361336f50590j409972A464667N58219H17033a934941k20312
$$ 89777 -1454782 2361336 -650590 -2060562 1464667 2022886 817033 -1934941 -2155253
1137b155253C673483c66325A509365I6213J260395g74416B591966b564700i50941
$$ -2155253 3673483 -366325 1509365 96213 1356608 -774416 2591966 -2564700 -950941
1127C580152L34052o80828j43206i53232k224230H9527c246569B598618j248624
$$ 3580152 3914204 3233376 3090170 -953232 -3177462 89527 -3246569 2598618 1349994
1118A349994E07367K241615K157572b578107B832258j289132a871083H37961L997070
$$ 1349994 507367 2748982 4906554 -2578107 2832258 1543126 -1871083 837961 4835031
1109D835031j750528c618937G05193a331415L19039A317102D97913b08755C68647
$$ 4835031 3084503 -3618937 705193 -1331415 -1012376 1317102 497913 -208755 368647
1099c718212A109315O36791j7859d33365C043001h04522b53922j025897j84545
$$ -3718212 1109315 1746106 1728247 -433365 3043001 -804522 -253922 -1279819 -1464364
1090a464364P00643j91332j512420e2824A294170b01898C066841j134598f38441
$$ -1464364 -763721 -955053 -2467473 -52824 1294170 -201898 3066841 1932243 -638441
1080a067124C701853b462975A963695c074437F774127d220911d98194F90962K224498
$$ -1067124 3701853 -2462975 1963695 -3074437 6774127 -4220911 -498194 690962 2915460
1071B915460a0677367B480752J017273A64562K656316b832087E03083L140432
$$ 2915460 -10677367 2480752 3498025 164562 2820878 -2832087 503083 3643515
1063C643515j489318F72170b428432A94925b772771E257897p92562d667402D333688
$$ 3643515 2154197 672170 -2428432 194925 -2772771 5257897 4465335 -4667402 4333688
1053b882063J053418D523361e572020A752193a585728k328384b62031j978638
$$ -2882063 -1828645 4523361 -5572020 1752193 -1585728 -3914112 -262031 -2240669
1045b240669I16954a060185E800805k769310j194363g241760D599357a832256
$$ -2240669 916954 -1060185 5800805 3031495 1837132 -7241760 4599357 -1832256
1036e032532J957605p95021B768059b702600A348634e9133A203772a0054841I7085
$$ -5032532 -3074927 -3869948 2768059 -2702600 1348634 -59133 1203772 -10054841 97085
1026c682932E282592B526618g018238c47731j781833A62621c090980h44283k992675
$$ -3682932 5282592 2526618 -7018238 -347731 -2129564 162621 -3090980 -844283 -3836958
1017c836958a831872H762365b871634D118017a507486G71668a232027B639016
$$ -3836958 -1831872 8762365 -2871634 4118017 -1507486 771668 -1232027 2639016
1008A66258N46188k92738J210921g26011l242775J580150j895770a13920B39322
$$ 166258 712446 419708 1630629 -726011 -3968786 -2388636 -4284406 -113920 239322
998a352225q74123g76951j367862A33069K58209L379403a766184f57224K50330
$$ -1352225 -2226348 -776951 -2144813 133069 391278 3770681 -1766184 -657224 -406894
989d06894l759745b038444B297674K486767b121648A890154e74461o059822a034425
$$ -406894 -4166639 -2038444 2297674 4784441 -2121648 1890154 -574461 -6634283 -1034425
979c567184A629308d73477Q340k901784B777568d98181B24139c311627B099757
$$ -3567184 1629308 -473477 -465137 -3366921 2777568 -498181 224139 -3311627 2099757
969a424305C945836d20086B102018j14543L5560f16987r83557C2118N30756a12204
$$ -1424305 3945836 -420086 2102018 1987475 2023035 -616987 -1600544 32118 562874 -112204
958c018490G748649a383639e75626o03593g4021q78749j282172A718822a06078
$$ -3018490 7748649 -1383639 -575626 -1179219 -74021 -952770 -2234942 1718822 -106078
948a76481q32574F340796a737312P19469A732584a079435C54247b18142D957880
$$ -176481 -1009055 6340796 -1737312 -1017843 1732584 -1079435 354247 -218142 4957880
938B59559K598086e372888B34198K982999J675815D87055e767265b56152j101334
$$ 259559 2857645 -5372888 234198 3217197 4893012 487055 -5767265 -256152 -1357486
929a357486l101272B401411b950903C284430e272551B927867l80514c002923C116834
$$ -1357486 -4458758 2401411 -2950903 3284430 -5272551 2927867 2547353 -3002923 3116834
919h0317j111968A213695a079681C868725E57483K63611N521177e306105A68236
$$ -80317 -1192285 1213695 -1079681 3868725 557483 821094 6342271 -5306105 168236
909c841648j773666A734403K560873a784182P50328I83898k29387c755440A473679
$$ -3841648 -5615314 1734403 4295276 -1784182 -1033854 983898 754511 -3755440 1473679
899c047596F603863D90998R33878F60079J935793b277769a78618j327305k349996
$$ -3047596 6603863 490998 1424876 660079 2595872 -2277769 -178618 -1505923 -3855919
890c855919A941010K3349J512048a886374B283568b31915j706053G10846c366021
$$ -3855919 1941010 1964359 3476407 -1886374 2283568 -231915 -1937968 710846 -3366021
880B612178b582429A924493b59156H054390A612589d333119F075196B046502d72147
$$ 2612178 -2582429 1924493 -259156 8054390 1612589 -4333119 6075196 2046502 -472147
870E45923e620216b414087B288581P36435a394562j589552a12626G17806L081301
$$ 545923 -5620216 -2414087 2288581 3025016 -1394562 -2984114 -112626 717806 3799107
861C799107d155110B322280b229443D625225a469300G98090H4705a37057m473003
$$ 3799107 -4155110 2322280 -2229443 4625225 -1469300 798090 84705 -137057 -4610060
852d610060a571940C769386i84052j662742F674272c799331E711408E35129J859550
$$ -4610060 -1571940 3769386 -984052 -2646794 6674272 -3799331 5711408 535129 2394679
843B394679k8955b051745B366497E3662a324831o77869E498570d5041A361181
$$ 2394679 2365724 -2051745 2366497 53662 -1324831 -2002700 5498570 -45041 1361181
833F4099a922849l362218B259394F88585O7874J729295i23353A170519b593177
$$ 64099 -1922849 -5285067 2259394 688585 756459 2485754 -923353 1170519 -2593177
823B099423J740210c022062c66337j339670C286997J045425a383258m72864o65489
$$ 2099423 3839633 -3022062 -366337 -1706007 3286997 4332422 -1383258 -1856122 -2521611
814b521611A804081f518056A35215K61862c594326J232584A090754c244056I31094
$$ -2521611 1804081 -6518056 135215 397077 -3594326 -2361742 1090754 -3244056 931094
804a629747A245849a512256k17249D95178L532011A50925e436445B017822K024855
$$ -1629747 1245849 -1512256 -1729505 495178 4027189 150925 -5436445 2017822 4042677
795D042677a612847B938381b936796B048113D56388b3566j551114m286852B257632
$$ 4042677 -1612847 2938381 -2936796 2048113 456388 -23566 -1574680 -5861532 2257632
785A615121c300807P65839B220214A28141e122261F654838B141085a015232B300777
$$ 1615121 -3300807 -2534968 2220214 128141 -5122261 6654838 2141085 -1015232 2300777
775D568352G88375b300505G80772O02684J265602e445244Q89846A208351d790543
$$ 4568352 788375 -2300505 780772 1383456 2649058 -5445244 -4555398 1208351 -4790543
765d75238m821053A07377N22276b360693J154549A814133p33267J246116J071211
$$ -475238 -5296291 107377 629653 -2360693 -1206144 1814133 1080866 2326982 3398193
756C398193A024052a893025m57757A047199g29083n910932E652467a404054k546863
$$ 3398193 1024052 -1893025 -2350782 1047199 -729083 -6640015 5652467 -1404054 -3950917
747c950917A067025l19099k1479J103347d561769K245898C657769j570071g3716
$$ -3950917 1067025 747926 726447 1829794 -4561769 -2315871 3657769 2087698 -73716
737i52135l445581B052920P45674a937320O55969B113467N78160A133342d155497
$$ -952135 -4397716 2052920 2798594 -1937320 -1281351 2113467 2691627 1133342 -4155497
727c161675E325220a247998N8228l336713E138512d699784B69001b103403R87631
$$ -3161675 5325220 -1247998 -1189770 -4526483 5138512 -4699784 269001 -2103403 -1115772
718a115772B917748b584236M90037F706460b540508i05068A579993a1029331D421452
$$ -1115772 2917748 -2584236 -2094199 6706460 -2540508 -905068 1579993 -11029331 4421452
708C931691A351404L15513K766385j709508l64564J87835a03642I160342B052061
$$ 3931691 1351404 1666917 4433302 2723794 2359230 2547065 -103642 9160342 2052061
698F528845a5451128P505137j0937732N133133C014317J8813478F153228Q342861
$$ 6528845 -15451128 -7945991 -18883723 -13750590 3014317 21827795 6153228 14496089
690A4496089m982765j308199M158066i322407j793056l543611k1066587J7249329
$$ 14496089 9513324 8205125 12363191 -9322407 -11115463 -14659074 -35725661 -18476332
682a8476332H434308k318082K292759J3454681H792178g1932G38932K499978e427160
$$ -18476332 8434308 6116226 8408985 21863666 8792178 -71932 738932 3238910 -5427160
672A973048c275096j241990A807526b48733b484A588973c305600j448807J309251
$$ 1973048 -3275096 -4517086 1807526 -248733 -2484 1588973 -3305600 -4754407 -3445156
663c445156a48953E065530d972337C141898g891329G644814J8912239A0969882
$$ -3445156 -148953 5065530 -4972337 3141898 -7891329 7644814 26557053 10969882
654H055402h064875n645295a032988j6529657K567549N922006d024923A2335312
$$ 8055402 -8064875 -13710170 -1032988 -17562645 -14995096 -9073090 -4024923 12335312
645A1370070P098459r191182D042438f544167A1384143c237881o591968j1646730
$$ 11370070 18468529 9277347 4042438 -6544167 11384143 -3237881 -9829849 -21476579
637b1476579g589310C915822K171378i29801E517370A53002J377624F7059L294918
$$ -21476579 -7589310 3915822 6087200 -929801 5517370 153002 1530626 67059 3361977
628C361977e649316F263549b792029K8104q22406B804092J194883h48559H59612
$$ 3361977 -5649316 6263549 -2792029 -2763925 -3586331 2804092 3998975 -848559 859612
618D187836j797380N448155a065191k264370J603342O23990B620867N89895B39876
$$ 4187836 2390456 7838611 -1065191 -3329561 -1726219 -1102229 2620867 3210762 239876
608A474198b92781D115074K867593P327768K0027006O8840848l5874710a54356184
$$ 1474198 -292781 4115074 6982667 14310435 34337441 103178289 67303579 -154356184
599a64004996b6657237D8878781A7821283H427462k298123P56751B244779O858801
$$ -164004996 -26657237 48878781 17821283 8427462 6129339 6886090 2244779 9103580
591I103580E53946K303331L57405c484006I60866a821579d9335D439225d362554
$$ 9103580 553946 2857277 3214682 -3484006 960866 -1821579 -49335 4439225 -4362554
581D708398b597380B61761M326713a035995k287326A493152J323768a770916D403198
$$ 4708398 -2597380 261761 4588474 -1035995 -3323321 1493152 2816920 -1770916 4403198
571a25436C87315J611024I37200a326911B177005c497969F752727A0213K005822
$$ -125436 387315 1998339 937200 -1326911 2177005 -3497969 6752727 10213 2016035
562B016035G59662c466777f04186p4274C639058c412809b3298l47825l742819
$$ 2016035 759662 -3466777 -604186 -678460 3639058 -3412809 -23298 -371123 -4113942
553d113942B268055D89502L133761j267971d873630B107767Q17927f052593a789137
$$ -4113942 2268055 489502 3623263 2355292 -4873630 2107767 2925694 -6052593 -1789137
543A725226b718459L34797j193005a214183A57334M071206b2367A450925P20070
$$ 1725226 -2718459 -2383662 -3576667 -1214183 157334 4228540 -22367 1450925 2170995
534B170995i13035q38077j048121A965372c537049k283597g55624J38001l839586
$$ 2170995 -913035 -1751112 -2799233 1965372 -3537049 -5820646 -755624 -617623 -4457209
525d457209C541988j457396f619948D597057b206773a067436E09395a011907B346562
$$ -4457209 3541988 2084592 -6619948 4597057 -2206773 -1067436 509395 -1011907 2346562
515A687040a932207Q45010A776423G67529a574673B160558c205776a73974A158460
$$ 1687040 -1932207 -1087197 1776423 767529 -1574673 2160558 -3205776 -173974 1158460
505b893129j679064A064566m73558J8935L495421p32578g19839B320560F75009
$$ -2893129 -4572193 1064566 591008 609943 4105364 3372786 -719839 2320560 675009
495E858744H07559I4960O81452l38276b222900h2525j086466D951844a958366
$$ 5858744 807559 94960 776412 438136 -2222900 -82525 -1168991 4951844 -1958366
485a223923a22753B286059a164475A044530e669543B476317d727839a155257F22164
$$ -1223923 -122753 2286059 -1164475 1044530 -5669543 2476317 -4727839 -1155257 622164
475a447760C875772F87245J368894c624306B430513B42388f45191j491409l867311
$$ -1447760 3875772 687245 2056139 -3624306 2430513 242388 -645191 -2136600 -6003911
466f003911C626095J08547b744172B236970a881429B406087b13396j894309G76911
$$ -6003911 3626095 3734642 -2744172 2236970 -1881429 2406087 -213396 -2107705 776911
456A732475J173265c424512f60209B387854l83781m24693c890034B868418A276808
$$ 1732475 2905740 -3424512 -660209 2387854 2004073 1579380 -3890034 2868418 1276808
446b195894b7708A583287M23430b278931A367822b588002A577828d762473B540025
$$ -2195894 -27708 1583287 2006717 -2278931 1367822 -2588002 1577828 -4762473 2540025
436b169512o98476B32137n5438O297730f18004E96582M11589f728566B71657b675828
$$ -2169512 -2867988 232137 176699 6474429 -618004 596582 1008171 -6728566 271657 -2675828
425c136320a543124E034993a872865E169437a477118A060837f16909C470105b424721
$$ -3136320 -1543124 5034993 -1872865 5169437 -1477118 1060837 -616909 3470105 -2424721
415b286041A819458d001160a086021A429254h46003k46996D19752e121911C554224
$$ -2286041 1819458 -4001160 -1086021 1429254 -846003 -1092999 419752 -5121911 3554224
405A41738K400889j259091a40728B215525o62017F71608g241107f67873B993130
$$ 141738 2542627 1283536 -140728 2215525 1553508 671608 -7241107 -667873 2993130
395b359882l157874G69076K186916b673975h57649H27293A88424J285161L24735
$$ -2359882 -5517756 769076 2955992 -2673975 -857649 827293 188424 1473585 1798320
386A798320g35413j058937A449649e567573I59403b815905H08796K181762L95678
$$ 1798320 -735413 -1794350 1449649 -5567573 959403 -2815905 808796 2990558 3386236
377C386236j644613i11177B266034h10797C067579g0570l108139B062016A5148
$$ 3386236 1741623 -911177 2266034 -810797 3067579 -70570 -3178709 2062016 15148
367b519846F99074e07178A783616b156851A936131K268491A328785b556618m773787
$$ -2519846 699074 -507178 1783616 -2156851 1936131 4204622 1328785 -2556618 -7330405
358g330405a121670D32362c045134D382933f01537H06692j32879i93847j598170
$$ -7330405 -1121670 432362 -3045134 4382933 -601537 806692 673813 -993847 -2592017
349b592017B28105a001193A805653b86065j536591A066764b792787c89816j950543
$$ -2592017 228105 -1001193 1805653 -286065 -1822656 1066764 -2792787 -389816 -2340359
340b340359B81789L33575c149232B169430J29875c391374B383569f61288k794699
$$ -2340359 281789 615364 -3149232 2169430 2299305 -3391374 2383569 -661288 -3455987
331c455987B959746A175180c250441C221322J329685A371678a785742I69271g70185
$$ -3455987 2959746 1175180 -3250441 3221322 4551007 1371678 -1785742 969271 -770185
321a308983l20740A246809d343652I929937a095220l419310B432475c514130c07578
$$ -1308983 -1629723 1246809 -4343652 9929937 -1095220 -4514530 2432475 -3514130 -307578
311e84472E235690A75152M658247e51934j330098l895811K758582C667877c657811
$$ -584472 5235690 175152 4833399 -551934 -1882032 -5777843 -3019261 3667877 -3657811
301A937679c502995B247760j046512P43395d884749A021633J259327a836522j365304
$$ 1937679 -3502995 2247760 1201248 1944643 -4884749 1021633 2280960 -1836522 -3201826
292c201826J387771E89294a391748G64553a534580A910010b049264E257693A314573
$$ -3201826 -1814055 589294 -1391748 764553 -1534580 1910010 -2049264 5257693 1314573
282b26018C530622f554996B744139j9175a405350C80437b372212B935356e09845
$$ -226018 3530622 -6554996 2744139 2724964 -1405350 380437 -2372212 2935356 -509845
272e685518B196170C15232a846965B19507J393969M51944c670803E386499b032546
$$ -5685518 2196170 315232 -1846965 219507 1613476 2065420 -3670803 5386499 -2032546
262a88545E86860a749086B163770h51773o83852A07887J077086N759878b869035
$$ -188545 586860 -1749086 2163770 -851773 -1535625 107887 1184973 6944851 -2869035
252d26365j355685A947213b010376E439862b291798c82199j42257o44899a1419
$$ -426365 -1782050 1947213 -2010376 5439862 -2291798 -382199 -524456 -1169355 -11419
242a004258r59783B158838E74190j31796J368139k74709c549007A355258L77851
$$ -1004258 -1964041 2158838 574190 442394 1810533 1535824 -3549007 1355258 1733109
233A733109M33048b585691j006807B096603e302789d48521I34263J898434a82409
$$ 1733109 2166157 -2585691 -3592498 2096603 -5302789 -448521 934263 2832697 -182409
223H350416b302739B333006b882452A141672b180270B877758c360894e16197I632697
$$ 8350416 -2302739 2333006 -2882452 1141672 -2180270 2877758 -3360894 -516197 9632697
213b259650B399398g752j783927B753510j204274j53826c403249a639395C158928
$$ -2259650 2399398 -7752 -1791679 2753510 1549236 1395410 -3403249 -1639395 3158928
203g668690A826534q13845b595023A062703J772076K930867b316886l01844F481650
$$ -7668690 1826534 1012689 -2595023 1062703 2834779 5765646 -2316886 -2618730 6481650
193A864112a444956k451491D973034d398725j197619a040376A052450k14921c261443
$$ 1864112 -1444956 -3896447 4973034 -4398725 -5596344 -1040376 1052450 837529 -3261443
183B988464D42078b225280h53209k976920B652303B32463N106282e198867F213725
$$ 2988464 442078 -2225280 -853209 -3830129 2652303 232463 5338745 -5198867 6213725
173b909879J011215G41830b940083A365973k13896K465352j50426M247718Q881823
$$ -2909879 -1898664 741830 -2940083 1365973 1152077 3617429 3467003 7714721 16596544
164A6596544M743690i9601688J2759054L7749336a5686238F9367526P294717K3091105
$$ 16596544 21340234 -99601688 -86842634 -49093298 -15686238 69367526 76662243 99753348
156I9753348m9538152B4607519i6557732a3443294f106488K725675l50946j06576
$$ 99753348 50215196 24607519 -96557732 -13443294 -6106488 -3380813 -3731759 -3838335
148c838335e78700m47840M10445I6407i73964d59805l836328D35239i72459A905007
$$ -3838335 -578700 -1026540 -616095 96407 -973964 -459805 -4296133 435239 -972459 1905007
137c593035A007031c57133j023334n74023D470560c227738F83986J166093e03925
$$ -3593035 1007031 -357133 -1380467 -1954490 4470560 -3227738 683986 1850079 -503925
127A695691o24724f26202k292477j556429B065088J315165e004667a979333F37560
$$ 1695691 1070967 -626202 -2918679 -4475108 2065088 3380253 -5004667 -1979333 637560
117a159495G89459i02830k200056h73900A400074j85782c110922o44518h31575
$$ -1159495 789459 -902830 -3102886 -873900 1400074 1214292 -3110922 -3755440 -831575
107D83503J928456c497813B568137a668735O29959B978474c80444m484954A689556
$$ 483503 2411959 -3497813 2568137 -1668735 -1038776 2978474 -380444 -4865398 1689556
97a412690B722676a592384B317823J666328d761720A81256d30473j817877E583985
$$ -1412690 2722676 -1592384 2317823 3984151 -4761720 181256 -430473 -2248350 5583985
87g14562b87525A741997E85200N55628o9969Q11431g13773A534072n39596a369885
$$ -714562 -287525 1741997 585200 1140828 1070859 1882290 -713773 1534072 994476 -1369885
76B56102a551823B866654b449271E74146a826467r30579a314255B639236a933450
$$ 256102 -1551823 2866654 -2449271 574146 -1826467 -2757046 -1314255 2639236 -1933450
66G533508c334359A660727J315095b539202m818478C539464f01846A333261a894056
$$ 7533508 -3334359 1660727 2975822 -2539202 -7357680 3539464 -601846 1333261 -1894056
56e44524C576494K204299a931950k135993B737676a668025A741578b278653e0598
$$ -544524 3576494 5780793 -1931950 -4067943 2737676 -1668025 1741578 -2278653 -50598
46B072388b644680l56165C112582a987854H84551O35448D54287b86110B906592
$$ 2072388 -2644680 -3000845 3112582 -1987854 884551 1519999 454287 -286110 2906592
36A141867R88625d026050K15610B833414j31894E34016c59207B200528c42854
$$ 1141867 2130492 -4026050 -3810440 2833414 2701520 534016 -359207 2200528 -342854
26b721104k665425D273063H39487a264040B648750c907168D71406M827349b127987
$$ -2721104 -5386529 4273063 839487 -1264040 2648750 -3907168 471406 5298755 -2127987
16b19911I11504a13260R795A077546E9858O95416c48630a22856G4248J568074
$$ -219911 911504 -113260 -103465 1077546 59858 755274 -348630 -122856 74248 1642322
6A642322N40492a406935K18995B456795D8479f58134
$$ 1642322 2182814 -1406935 -1187940 2456795 48479 -658134
##PAGE= F1=5575.183789999
##FIRST=     21204.543296753, 2630.29399671054, -1514329
##DATA TABLE= (F2++(Y..Y)), PROFILE
2047a514329J58433B268872a502096B393224B12625b857980C102566A70724a210476
$$ -1514329 -1355896 2268872 -1502096 2393224 212625 -2857980 3102566 170724 -1210476
2037E823404A578398C22179A06208b3537k200027B837109G99699J823609F80451
$$ 5823404 1578398 322179 106208 -23537 -2223564 2837109 799699 2623308 680451
$$ [...]
##END NTUPLES=nD NMR SPECTRUM
##END=
