##TITLE=Analysis number 329217
Compound Code btb 09254
Project Code adrs
Chemist Name stores
##JCAMPDX= 6.0         $$ Bruker NMR JCAMP-DX V2.0
##DATA TYPE= NMR SPECTRUM
##DATA CLASS= NTUPLES
##ORIGIN= Bruker BioSpin GmbH
##OWNER= nmr
$$ XWIN-NMR		Version 3.5
$$ Mon Aug 13 10:16:44 2007 GMT Daylight Time (UT+1h)  MAYBRIDGE\nmr@NMR_250MHZ
##.OBSERVE FREQUENCY= 250.131544655141
##.OBSERVE NUCLEUS= ^1H
##.ACQUISITION MODE= SIMULTANEOUS (DQD)
##.ACQUISITION SCHEME= undefined
##.AVERAGES= 16
##.DIGITISER RES= 18
##SPECTROMETER/DATA SYSTEM= dpx250
##.PULSE SEQUENCE= zg30
##.SOLVENT NAME= DMSO
##.SHIFT REFERENCE= (INTERNAL, DMSO, 0, 16.522)
##AUDIT TRAIL= $$ (NUMBER, WHEN, WHO, WHERE, WHAT)
$$ ##TITLE= Audit trail, XWIN-NMR		Version 3.5
$$ ##JCAMPDX= 5.01
$$ ##ORIGIN= Bruker BioSpin GmbH
$$ ##OWNER= nmr
$$ C:\u/data/dgb/nmr/ADRS/440/pdata/1/auditp.txt
$$ ##AUDIT TRAIL=  $$ (NUMBER, WHEN, WHO, WHERE, WHAT)
(   1,<2007-08-13 10:16:19.37 +100>,<MAYBRIDGE\nmr>,<NMR_250MHZ>,
      <created by zg, POWCHK disabled, PULCHK disabled
       configuration hash MD5:
       76 6E 9A 78 1E 09 19 81 EC 84 63 8F B0 6A 59 2D
       data hash MD5: 64K
       BB 35 32 88 F9 B2 6F 3D FC 60 92 32 3D F9 9D 74>)
(   2,<2007-08-13 10:16:33.65 +100>,<MAYBRIDGE\nmr>,<NMR_250MHZ>,
      <Start of raw data processing
       ef LB = 0.3 FT_mod = 6 PKNL = 1 SI = 32K 
       data hash MD5: 32K
       DA 87 77 93 B9 71 92 14 9A 72 DD 80 19 3F 25 D2>)
(   3,<2007-08-13 10:16:35.36 +100>,<MAYBRIDGE\nmr>,<NMR_250MHZ>,
      <apk 
       data hash MD5: 32K
       F2 E9 D1 4D CE 8A 3F 1F 71 62 F9 21 29 B7 42 BF>)
(   4,<2007-08-13 10:16:36.06 +100>,<MAYBRIDGE\nmr>,<NMR_250MHZ>,
      <abs ABSG = 5 
       data hash MD5: 32K
       E0 2F D0 FD 8D D6 CB F0 6A 59 2A 98 5C B7 AC 1A>)
$$ ##END=
$$ 
$$ hash MD5
$$ 7E B1 29 9E D8 87 8E A2 15 51 A8 73 52 A3 F0 AE
##$RELAX= 
##$RELAX= 
##$RELAX= 
##$RELAX= 
##$RELAX= 
##$RELAX= 
##$RELAX= 
$$ Bruker specific parameters
$$ --------------------------
##$DU= <C:\u>
##$EXPNO= 440
##$NAME= <ADRS>
##$PROCNO= 1
##$TYPE= <nmr>
##$USER= <dgb>
##$AMP= (0..31)
100 100 100 100 100 100 100 100 100 100 100 100 100 100 100 100 100 100 
100 100 100 100 100 100 100 100 100 100 100 100 100 100 
##$AQSEQ= 0
##$AQ_mod= 3
##$AUNM= <au_zg>
##$AUTOPOS= <6 >
##$BF1= 250.13
##$BF2= 250.13
##$BF3= 250.13
##$BF4= 250.13
##$BF5= 500.13
##$BF6= 500.13
##$BF7= 500.13
##$BF8= 500.13
##$BYTORDA= 1
##$CFDGTYP= 0
##$CFRGTYP= 5
##$CHEMSTR= <none>
##$CNST= (0..31)
1 1 145 1 1 1 1 1 1 1 1 1 1 1 1 1 1 1 1 1 1 1 1 1 1 1 1 1 1 1 1 1 
##$CPDPRG= <>
##$CPDPRG1= <>
##$CPDPRG2= <>
##$CPDPRG3= <>
##$CPDPRG4= <mlev>
##$CPDPRG5= <mlev>
##$CPDPRG6= <mlev>
##$CPDPRG7= <mlev>
##$CPDPRG8= <mlev>
##$CPDPRGB= <>
##$CPDPRGT= <>
##$D= (0..31)
0 1 0 0 0 0 0 0 0 0.06 0 0 0 0 0 0 0.0002 0 0 0 0 0 0 0 0 0 0 0 0 0 0 
0 
##$DATE= 1186996578
##$DBL= (0..7)
120 120 120 120 120 120 120 120 
##$DBP= (0..7)
150 150 150 150 150 150 150 150 
##$DBP07= 0
##$DBPNAM0= <>
##$DBPNAM1= <>
##$DBPNAM2= <>
##$DBPNAM3= <>
$$ [...]
##$SUBNAM6= <"">
##$SUBNAM7= <"">
##$SUBNAM8= <"">
##$SUBNAM9= <"">
##$SW= 20.6930455092707
##$SWIBOX= (0..15)
0 0 3 0 0 0 0 0 0 0 0 0 0 0 0 0 
##$SW_h= 5175.983436853
##$TD= 65536
##$TD0= 1
##$TE= 296.16
##$TE2= 300
##$TE3= 300
##$TEG= 300
##$TL= (0..7)
0 120 120 120 120 120 120 120 
##$TP= (0..7)
150 150 150 150 150 150 150 150 
##$TP07= 0
##$TPNAME0= <>
##$TPNAME1= <>
##$TPNAME2= <>
##$TPNAME3= <>
##$TPNAME4= <>
##$TPNAME5= <>
##$TPNAME6= <>
##$TPNAME7= <>
##$TPOAL= (0..7)
0.5 0.5 0.5 0.5 0.5 0.5 0.5 0.5 
##$TPOFFS= (0..7)
0 0 0 0 0 0 0 0 
##$TUNHIN= 0
##$TUNHOUT= 0
##$TUNXOUT= 0
##$USERA1= <user>
##$USERA2= <user>
##$USERA3= <user>
##$USERA4= <user>
##$USERA5= <user>
##$V9= 5
##$VALIST= <valist>
##$VCLIST= <CCCCCCCCCCCCCCC>
##$VD= 0
##$VDLIST= <DDDDDDDDDDDDDDD>
##$VPLIST= <PPPPPPPPPPPPPPP>
##$VTLIST= <TTTTTTTTTTTTTTT>
##$WBST= 1024
##$WBSW= 4
##$XGAIN= (0..3)
0 0 0 0 
##$XL= 0
##$YL= 0
##$YMAX_a= 440163
##$YMIN_a= -381769
##$ZGOPTNS= <>
##$ZL1= 120
##$ZL2= 120
##$ZL3= 120
##$ZL4= 120
##$ABSF1= 16.522
##$ABSF2= -4.171173
##$ABSG= 5
##$ABSL= 3
##$ALPHA= 0
##$AQORDER= 0
##$ASSFAC= 0
##$ASSFACI= 0
##$ASSFACX= 0
##$ASSWID= 0
##$AUNMP= <proc_1d>
##$AZFE= 0.1
##$AZFW= 0.1
##$BCFW= 0
##$BC_mod= 0
##$BYTORDP= 0
##$COROFFS= 0
##$CY= 12.5
##$DATMOD= 1
##$DC= 0
##$DFILT= <>
##$DTYPP= 0
##$F1P= 14.0000005364418
##$F2P= -0.99999901652339
##$FCOR= 0.5
##$FTSIZE= 32768
##$FT_mod= 6
##$GAMMA= 0
##$GB= 0
##$INTBC= 1
##$INTSCL= 1
##$ISEN= 128
##$LB= 0.3
##$LEV0= 0
##$LPBIN= 0
##$MAXI= 10000
##$MC2= 0
##$MEAN= 0
##$ME_mod= 0
##$MI= 0
##$NCOEF= 0
##$NC_proc= -3
##$NLEV= 6
##$NOISF1= 0
##$NOISF2= 0
##$NSP= 0
##$NTH_PI= 0
##$NZP= 0
##$OFFSET= 16.522
##$PC= 1
##$PHC0= -56.8703
##$PHC1= 6.092153
##$PH_mod= 1
##$PKNL= yes
##$PPARMOD= 0
##$PSCAL= 4
##$PSIGN= 0
##$REVERSE= no
##$SF= 250.13
##$SI= 32768
##$SIGF1= 0
##$SIGF2= 0
##$SINO= 400
##$SIOLD= 32768
##$SREGLST= <1H.DMSO>
##$SSB= 0
##$STSI= 32768
##$STSR= 0
##$SW_p= 5175.98343685301
##$SYMM= 0
##$S_DEV= 0
##$TDeff= 65536
##$TDoff= 0
##$TI= <Analysis number 999999
Compound Code 99
Book Reference 9
Project Code 9>
##$TILT= no
##$TM1= 0
##$TM2= 0
##$TOPLEV= 0
##$USERP1= <user>
##$USERP2= <user>
##$USERP3= <user>
##$USERP4= <user>
##$USERP5= <user>
##$WDW= 1
##$XDIM= 32768
##$YMAX_p= 549172418
##$YMIN_p= -82123
$$ End of Bruker specific parameters
$$ ---------------------------------
##NTUPLES= NMR SPECTRUM
##VAR_NAME=  FREQUENCY,     SPECTRUM/REAL,   SPECTRUM/IMAG
##SYMBOL=    X,             R,               I
##VAR_TYPE=  INDEPENDENT,   DEPENDENT,       DEPENDENT
##VAR_FORM=  AFFN,          ASDF,            ASDF
##VAR_DIM=   32768,         32768,           32768
##UNITS=     HZ,            ARBITRARY UNITS, ARBITRARY UNITS
##FACTOR=    0.157963299565203, 1,           1
##FIRST=     4132.6476996994, 0,             0
##LAST=      -1043.33573715361, 0,           0
##MIN=       -1043.33573715361, -82123,      0
##MAX=       4132.6476996994, 549172418,     0
$$ Real data points
##PAGE= N=1
##DATA TABLE= (X++(R..R)), XYDATA
$$ [...]
18492A981990M0821O0533M5766K7153K4801O6372P5129Q6502O6787P3480P9911
18481B629245Q6617P0995L1708J8068M4302L7856O4185N3877M6019O9018O6111
18470C218001P0126Q3488R0078R4694R6518Q9483R9967J25089J06860J13084J28158
18459D315546J25747J18078J20154J16530J21401J22473J56930J63228J50190
18450E510277J62727J52481J75348J75340J65155J93866J96464J94393K31177
18441G157228K25219K11685K21730K38765K43699K18605K30556K54948K63457
18432I265892K61821K57724K56006K57129K61139K56047K49433K43798K35009
18423A1543998K30175K32990K14827K05006J75490J76815J69560J35674J59608
$$ y = [1981990, 2022811, 2083344, 2129110, 2156263, 2181064, 2247436, 2322565, 2409067, 2475854, 2549334, 2629245, 2715862, 2786857, 2818565, 2836633, 2880935, 2918791, 2982976, 3036853, 3082872, 3151890, 3218001, 3288127, 3371615, 3461693, 3556387, 3652905, 3742388, 3842355, 3967444, 4074304, 4187388, 4315546, 4441293, 4559371, 4679525, 4796055, 4917456, 5039929, 5196859, 5360087, 5510277, 5673004, 5825485, 6000833, 6176173, 6341328, 6535194, 6731658, 6926051, 7157228, 7382447, 7594132, 7815862, 8054627, 8298326, 8516931, 8747487, 9002435, 9265892, 9527713, 9785437, 10041443, 10298572, 10559711, 10815758, 11065191, 11308989, 11543998, 11774173, 12007163, 12221990, 12426996, 12602486, 12779301, 12948861, 13084535, 13244143]
18414A3244143J36216J07407J00926Q7664N6306L5192L5360J3224l0236k5939
18404A3760263k9452p8986j06730j09296j22912j32130j68193j62843j89373j95881
18394A2464467k06284k21874k35020k15160k37160k39659k47519k62859k63757
18385A0335175k47106k31776k60516k65522k34379k39995k52171k66979k56916
18376H079815k38087k07290j99389k05365k11577k22795k10238j84081j81414
18367F219579j77020j66161j66164j66676j55005j42487j51644j48690j36987
18358D808745j32142j32102j24393j28352j11084j01948j13953j00659r5199j04930
18348C663983j08211r4190q2462p9683p4280p4013q1750o6950o1416n8261o2563
$$ y = [13244143, 13380359, 13487766, 13588692, 13676356, 13732662, 13767854, 13803214, 13816438, 13786202, 13760263, 13730811, 13651825, 13545095, 13435799, 13312887, 13180757, 13012564, 12849721, 12660348, 12464467, 12258183, 12036309, 11801289, 11586129, 11348969, 11109310, 10861791, 10598932, 10335175, 10088069, 9856293, 9595777, 9330255, 9095876, 8855881, 8603710, 8336731, 8079815, 7841728, 7634438, 7435049, 7229684, 7018107, 6795312, 6585074, 6400993, 6219579, 6042559, 5876398, 5710234, 5543558, 5388553, 5246066, 5094422, 4945732, 4808745, 4676603, 4544501, 4420108, 4291756, 4180672, 4078724, 3964771, 3864112, 3768913, 3663983, 3555772, 3461582, 3379120, 3299437, 3225157, 3151144, 3069394, 3002444, 2941028, 2882767, 2820204]
18337B820204o5526o5395p8472p0830n9231n2514n7239o5745l3196l2970m4652
18326B194434l2811k5847n6986m9863n5317n6810m0573l9811m7818k2219k5271
18315A741108l3659l7831k8313j6009j9897k8502j5664k4785k2525l7859m3810
18304A432254j8143j4624m147k8895m5997j1646j3444l2198j2326r232j6698k0810
18292A204094k1518k3606j2160O884j2179l6007k5747l2257N776j2290j2670j484
18280A026836j1086k4889k2799j9400j831L676j5789k0853j0887K995j6851r836
18268H79286j4364r171k3907k0388o750j3393k8169r189R496J0874o803j2917
18256G54605m237J5702j730q162j27M331j2284J2689R538n245j2923m4483J46
$$ y = [2820204, 2754678, 2689283, 2610811, 2539981, 2480750, 2428236, 2370997, 2305252, 2272056, 2239086, 2194434, 2161623, 2135776, 2078790, 2028927, 1973610, 1916800, 1876227, 1836416, 1788598, 1766379, 1741108, 1707449, 1669618, 1641305, 1625296, 1605399, 1576897, 1561233, 1536448, 1513923, 1476064, 1432254, 1414111, 1399487, 1395340, 1366445, 1320448, 1308802, 1295358, 1263160, 1250834, 1241602, 1224904, 1204094, 1182576, 1158970, 1146810, 1153694, 1141515, 1105508, 1079761, 1047504, 1053280, 1040990, 1028320, 1026836, 1015750, 990861, 968062, 948662, 946831, 950507, 934718, 913865, 902978, 905973, 889122, 879286, 864922, 855751, 831844, 811456, 804706, 791313, 763144, 753955, 763451, 774325, 767522, 754605, 750368, 766070, 764340, 756178, 756051, 760382, 748098, 760787, 770325, 765080, 752157, 707674, 707820]
18243G07820j3513l9303j878J0514o57k7697j7552j7801k1212K659P867M998r981
18230E84264j9685P110N988q671R41n577r095J0571j5360n996K6843P016l761
18217E74588j32j850j5190m5621j6508M439j5079p916Q046n961j731J4915J8607
18204E10607j0413q623k507J8058O892N701J6159L3759n425j1675k4436k4856
18192E03241r148k6114k0559k5934l172N630J85p279O227j1550q33J3554p391
18179D16857j0581N010Q715Q772J916q311j1607M849J019J0907L614R96J1861
18166D44017K3807J8343J4118J132k5660k4259q741j5371j7854R645N66k196o671
18153D10876p010Q207j0255J3271J6745K3263K9376p24J8179J5363J9917P138
$$ y = [707820, 694307, 655004, 653126, 663640, 662983, 635286, 617734, 599933, 578721, 581380, 589247, 594245, 584264, 564579, 571689, 577677, 569006, 569947, 564370, 555275, 565846, 550486, 544490, 571333, 578349, 574588, 574456, 572606, 557416, 511795, 495287, 499726, 484647, 476731, 484777, 478816, 477085, 492000, 510607, 500194, 491571, 489064, 507122, 514014, 519715, 535874, 569633, 564208, 552533, 528097, 503241, 494093, 467979, 447420, 421486, 418314, 423944, 424129, 416850, 423077, 411527, 410694, 424248, 416857, 406276, 411286, 420001, 428773, 430689, 422378, 410771, 415620, 416639, 427546, 431160, 432156, 444017, 467824, 486167, 500285, 501417, 475757, 451498, 442757, 427386, 409532, 419177, 419743, 417547, 410876, 403866, 412073, 401818, 415089, 431834, 455097, 484473, 483749, 501928, 517291, 537208, 544346]
18141E44346r85j9031j3220p406J803J9899P624p592J5907j2582j5258j0950k0114
18128D82441j0420J8587Q483j2615K3942K2991J8066L6758J7149J6206M8662N5049
18116G25299M0294M6851L7001J9962N376l4278n9519l0535R433P384K2135N0931
18104H40334N7000J2965K3132N6840O7617O5862O9237R9655J52401K09023K84079
18093A938145M25456O46528R70371J453748K124635K904804L494648L738066L582860
18084B1279261K293923n28873k727727k563106p65059P59018N22736j553344l390059
18075A3326770l607137k741705j792612j143606p35358m92764l55532k29195j32515
18066B096346n6370L892L9754K4129k5038l8561p1859j17875j01273j8652L6794
$$ y = [544346, 543361, 524330, 511110, 503704, 505507, 525406, 533030, 525438, 541345, 528763, 513505, 502555, 482441, 472021, 490608, 499091, 486476, 510418, 533409, 551475, 588233, 605382, 621588, 670250, 725299, 765593, 812444, 849445, 869407, 874783, 840505, 780986, 750451, 759884, 767268, 789403, 840334, 897334, 910299, 933431, 990271, 1057888, 1123750, 1192987, 1292642, 1445043, 1654066, 1938145, 2363601, 3010129, 3980500, 5434248, 7558883, 10463687, 13958335, 17696401, 21279261, 23573184, 23044311, 20316584, 17753478, 16988419, 17747437, 18270173, 16716829, 13326770, 9719633, 6977928, 5185316, 4041710, 3306352, 2813588, 2458056, 2228861, 2096346, 2039976, 2043868, 2083622, 2107751, 2082713, 2044152, 1972293, 1854418, 1753145, 1734493, 1771287]
18055A771287M1382P0869P6240J06843J23781J52638K09950K84520L97029N58755
18045C793294P94296J192836J819764K741081L837409M663576M525140L285528
18037B6652924K761277M748637Q732113J1695402R241010k67252r869093j3091055
18029D0603963j1223217q138458n511117l585246k243943j216646l70802L64102
18021H678636R25022R16004P399j277090j917988j722203j168474p25857m58597
18012C256852k73057j61955j25172j13869r6986o6918k0335P62K7483P1335J27369
18001B625509J75756L20781N76517R41980J344159J596333J419837O30976m17682
17992I214166j026779r86612n60775p355N80005J342124K516039M386524O973608
$$ y = [1771287, 1812669, 1883538, 1959778, 2066621, 2190402, 2343040, 2552990, 2837510, 3234539, 3793294, 4587590, 5780426, 7600190, 10341271, 14178680, 18842256, 23367396, 26652924, 29414201, 34162838, 42894951, 54590353, 63831363, 63564111, 53695018, 40603963, 29380746, 21242288, 15731171, 12145925, 9901982, 8685336, 8314534, 8678636, 9603658, 10519662, 10527061, 9249971, 7331983, 5609780, 4441306, 3715449, 3256852, 2983795, 2821840, 2696668, 2582799, 2485813, 2418895, 2398560, 2399322, 2426805, 2498140, 2625509, 2801265, 3122046, 3698563, 4640543, 5984702, 7581035, 9000872, 9631848, 9214166, 8187387, 7200775, 6640000, 6632645, 7212650, 8554774, 11070813, 15457337, 22430945]
17983B2430945R329256R075269L633447m763561r670185r389506o723339m225917
17975I696409k568445j628472j083301p43901n28048l72354l01474k62596k08811
17966A999007j61939j19123p3486n4066m6349l5552l9642n8172o6016m8650j9790
17955A276222q89P654N774k109m059m9100p2873j13252j17022r9244o9812m2225
17943G19065k5171p984k5720l1513k8767l2857k6791k8176l1746l82M535n32K0523
17930E04484N230J5840Q920o62j4602j8194p804k1992p417j2607n793J0167O38
17917D56208J4003K2191L346m514N525K4257J3567l3062j8486K3785M859r346
17905E02333j2176l1201M585K90p683K59j1399m095O979j1097j2431K0924k709
$$ y = [22430945, 31760201, 40835470, 44468917, 39705356, 30035171, 20645665, 13922326, 9696409, 7127964, 5499492, 4416191, 3672290, 3144242, 2771888, 2470414, 2207818, 1999007, 1837068, 1717945, 1644459, 1590393, 1544044, 1508492, 1468850, 1410678, 1344662, 1296012, 1276222, 1275333, 1282987, 1288761, 1286652, 1282593, 1233493, 1160620, 1047368, 930346, 831102, 761290, 719065, 693894, 685910, 660190, 628677, 599910, 567053, 540262, 512086, 480340, 479958, 484493, 483961, 504484, 509714, 525554, 534474, 533812, 519210, 501016, 493212, 471220, 463803, 451196, 445403, 455570, 456208, 470211, 492402, 495748, 491234, 496759, 521016, 534583, 501521, 483035, 506820, 511679, 502333, 490157, 458956, 463541, 463831, 456148, 456407, 445008, 440913, 447892, 436795, 424364, 445288, 442579]
17892D42579j7325l5847l4781j7852K322J0382j5093k3034j4554r608l656N347
17880B88880j6221k6408j845j5088K5284P367j159K991k0668j3560J3785J0117
17868B53475K0799K2993N608L139K560J6769k779P015J1986R081k5974j8345J5350
17855C21677m491j1905O206p032N654K3639J8085J5612K6290J9294J6584J8633
17843D48246R943p815r925n178j5206R279r848j1157Q876j4734k4742k791J854
17830C76802M859O141m757j0393l1454j732Lk8371p906o955j786K6617L2212j869
17816C51411r182O386r246k8467m231o221j372R770J3733L725M346O333O297J1516
17802C54798J9398J0444N073M889L6438K2902k7864k9488o755l298o596k123n750
$$ y = [442579, 425254, 389407, 354626, 336774, 339096, 349478, 334385, 311351, 296797, 287189, 283533, 288880, 272659, 246251, 244406, 229318, 254602, 261969, 260810, 263801, 243133, 229573, 243358, 253475, 274274, 297267, 302875, 306014, 308574, 325343, 322564, 329579, 341565, 350646, 324672, 306327, 321677, 317186, 305281, 311487, 304455, 310109, 333748, 351833, 367445, 393735, 413029, 429613, 448246, 458189, 450374, 440449, 435271, 420065, 429344, 419496, 408339, 417215, 402481, 377739, 374948, 376802, 381661, 387802, 383045, 372652, 341198, 339466, 339469, 311098, 303192, 296237, 294451, 321068, 353280, 351411, 342229, 348615, 339369, 310902, 306671, 300450, 299078, 308848, 322581, 326306, 330652, 336985, 343282, 354798, 374196, 384640, 389713, 394602, 431040, 453942, 426078, 396590, 389835, 386537, 379941, 377818, 372068]
17789C72068j0487K7930K6686P541R164J500j4913P498j349r039j4450o1j626
17776D00462j6579P16J883j03Q643j7036k3020j0563n464J5461J8931J0701J6011
17763D00043J9427j3961j6181j2506j1198K325j9923r835k714L392J1167J2334
17751C62370P760J1495K1655J1132n365k536k410m649o238K6698L048K0009J401
17738D44370j8369n922L782J1873K3476J869J571l811K6095M062k3488j9233j3910
17725D32365J1314K0638J7053N748o955O703J1128K9478J6577j6015r993J9022
17713E37063J2789k201Q624q263J800r21j7724q788N365l944M747K4067K4383
17700E76997K1872M852O302L588J833j1321J2144r167k735Q829J0935J2876Q466
$$ y = [372068, 361581, 389511, 416197, 423738, 432902, 434402, 419489, 426987, 425638, 416599, 402149, 402088, 400462, 383883, 384599, 386482, 386379, 395022, 377986, 354966, 344403, 338939, 354400, 373331, 384032, 400043, 419470, 405509, 389328, 376822, 365624, 367949, 348026, 338191, 335477, 338869, 350036, 362370, 370130, 381625, 403280, 414412, 409047, 406511, 404101, 399452, 393214, 419912, 422960, 442969, 444370, 426001, 420079, 423861, 435734, 459210, 461079, 462650, 458839, 484934, 488996, 465508, 446275, 432365, 443679, 464317, 481370, 487118, 480163, 486866, 497994, 527472, 544049, 528034, 518041, 537063, 549852, 547651, 556275, 548012, 549812, 548891, 531167, 522379, 527744, 523800, 528547, 552614, 576997, 598869, 603721, 610023, 613611, 615444, 604123, 616267, 607100, 604365, 613194, 624129, 637005, 645471]
17687F45471l363J0863N958p507j1662k063K0747J2067J9576J0971l420R828K1771
17674G29237J4483J378j0492O254K0675R645J3879K7464K707q940R006L4859K1598
17661H71753J0833j7388J29K8009J4727J414J4362J8844R44K3803K4036J0729
17649A002195J1419J9031R677K2100J5463J0266M353Q994J0843J1088K3392L2816
17637A181637J8845N148q435q383K3806L9681J6877J3535K2520J5754O577L344
17625A330906O729L2029L1814K1398J4129O725K4561P213J9711L0585K6357K0198
17613A572355J5877L1941M3536J8089K3397M6196M7937K0172L1540L8876M2211
17602A932127M1001K8446M5167M8916M7484N3991L8328N2870O2952O6552Q0695
$$ y = [645471, 642108, 652971, 658929, 651422, 639760, 637697, 658444, 670511, 690087, 701058, 697638, 707466, 729237, 743720, 745098, 734606, 740860, 761535, 771180, 785059, 812523, 815230, 806290, 815296, 850155, 871753, 882586, 865198, 865327, 893336, 908063, 909477, 923839, 942683, 943627, 967430, 991466, 1002195, 1013614, 1032645, 1042322, 1064422, 1079885, 1090151, 1094504, 1103498, 1114341, 1125429, 1148821, 1181637, 1200482, 1205630, 1197195, 1188812, 1212618, 1252299, 1269176, 1282711, 1305231, 1320985, 1327562, 1330906, 1337635, 1369664, 1401478, 1422876, 1437005, 1443730, 1468291, 1475504, 1495215, 1525800, 1552157, 1572355, 1588232, 1620173, 1663709, 1681798, 1705195, 1751391, 1799328, 1819500, 1851040, 1889916, 1932127, 1973128, 2001574, 2046741, 2095657, 2143141, 2197132, 2235460, 2288330, 2351282, 2417834, 2498529]
17591B498529O1883N8181P0392O9204O5050O0063Q1113Q3224M6383M6113N8374
17580C198509P7858P3702O9239Q2315P5505P6342R3350Q1802Q0006J04420J07117
17569D120165J13531J05899Q8260J10310J33458J32137J29656J22223J42730J72342
17559E370711J46453J47118J56737J82596J84242J73912J95831J93888K04685
17550F956173K25577K32603K42938K28177K47587K49985K60920K60148K47181
17541I151289K70319K96764L04092L05587K99230K72171K42830K63216K44235
17532A1649733K39910K39169K37738K40235K38181K03503J91269J91490J82997
17523A3614225J43598J26003J36274J16601J14233Q7530O8983M2925K3209L7928
$$ y = [2498529, 2560412, 2618593, 2688985, 2758189, 2823239, 2883302, 2964415, 3047639, 3094022, 3140135, 3198509, 3276367, 3350069, 3419308, 3501623, 3577128, 3653470, 3746820, 3828622, 3908628, 4013048, 4120165, 4233696, 4339595, 4427855, 4538165, 4671623, 4803760, 4933416, 5055639, 5198369, 5370711, 5517164, 5664282, 5821019, 6003615, 6187857, 6361769, 6557600, 6751488, 6956173, 7181750, 7414353, 7657291, 7885468, 8133055, 8383040, 8643960, 8904108, 9151289, 9421608, 9718372, 10022464, 10328051, 10627281, 10899452, 11142282, 11405498, 11649733, 11889643, 12128812, 12366550, 12606785, 12844966, 13048469, 13239738, 13431228, 13614225, 13757823, 13883826, 14020100, 14136701, 14250934, 14338464, 14407447, 14450372, 14473581, 14511509]
17513A4511509K7161p728n1176o1656n1592p1517r2096j07445j27366j24123j40857
17502A3703114j56645j72230j59939j68845j48767j50552j45502j44513j18021
17493A2338100j11847j16989j15987r2278m9912j2143J9936L5878O2971P8227
17483A2035956R7858J56004K88267M48680O81058J018720J527784K223613L169790
17474B1647730M404644N958694P762742R007568Q751304P924602P567999N290897
17466G8316180O1962l685036l648114j837562L85156K678821M299950N788710
17458H2360067P527206O543641K168374q02314l031000p652376j1443922j1215469
17450F4454207q937084o689027m504923k419881p09431K73085l49591k593279
$$ y = [14511509, 14538670, 14530942, 14479766, 14418110, 14366518, 14295001, 14202905, 14095460, 13968094, 13843971, 13703114, 13546469, 13374239, 13214300, 13045455, 12896688, 12746136, 12600634, 12456121, 12338100, 12226253, 12109264, 11993277, 11900999, 11851087, 11838944, 11858880, 11894758, 11957729, 12035956, 12133814, 12289818, 12578085, 13026765, 13707823, 14726543, 16254327, 18477940, 21647730, 26052374, 32011068, 39773810, 48781378, 57532682, 65457284, 73025283, 78316180, 78378142, 74693106, 71044992, 69207430, 69592586, 72271407, 76571357, 82360067, 89887273, 96430914, 98599288, 97796974, 94765974, 87113598, 75669676, 64454207, 55517123, 48828096, 44323173, 41903292, 41193861, 41466946, 41117355, 38524076]
17442C8524076m387558m650068m352250m061766l509099k671926j861879j242668
17434A1786862q09568m98672k50187J8145L62110Q12597J389502K046334K581904
17425A7439027K852878L273815L886817L486669K313200K493817L902049N522687
17417D5170959P354424Q326027O417208K738534j043437m801825p550866p451672
17409D9159352n238146k635460k81099J253128R40183p48625k256243k940222
17401C7252868l326774l642641l784835l538257k861978j852336o42512M88553
17393A8092088J295229J401253N44476j098609k580930l168713k964128k362115
17385I158551j670488j109714p41000n42685m10614l05999k30467j79871j41317
$$ y = [38524076, 34136518, 29486450, 25134200, 21072434, 17563335, 14891409, 13029530, 11786862, 10977294, 10478622, 10228435, 10246580, 10608690, 11421287, 12810789, 14857123, 17439027, 20291905, 23565720, 27452537, 30939206, 33252406, 35746223, 39648272, 45170959, 52525383, 60851410, 67268618, 70007152, 68963715, 64161890, 56611024, 49159352, 43921206, 41285746, 41004647, 42257775, 43197958, 42449333, 40193090, 37252868, 33926094, 30283453, 26498618, 22960361, 20098383, 18246047, 17603535, 18092088, 19387317, 20788570, 21333046, 20234437, 17653507, 14484794, 11520666, 9158551, 7488063, 6378349, 5637349, 5094664, 4684050, 4378051, 4147584, 3967713, 3826396]
17376C826396p8913k2712N0273J18189K24940L59165N69128R03959J439853K215387
17366I605665L185936M041601M410281L855142K049222j57309j274943j045991
17358B4669604k27619L89514R7734j228337k621419l063711k562881j469926q1578
17349A3901381J231127K105069K296635J570385J18369j065885j223242o38876
17341A8294963k5088O8655p20594j915439k727073k831664k404136j806930j231237
17332D701457q35836n87570m16422l27873k57128k15857j59708j55758j12727
17323A632578r5274r4115p4461o7266o1224o1464n5671l8510m1173l9201l7649
17312I66570l0457k6666k9848k5952j6265l8013m9247k5151k3385k2580n597q387
$$ y = [3826396, 3747483, 3724771, 3775044, 3893233, 4118173, 4477338, 5046466, 5950425, 7390278, 9605665, 12791601, 16833202, 21243483, 25098625, 27147847, 26990538, 25715595, 24669604, 24441985, 24831499, 24929233, 23700896, 21079477, 18015766, 15452885, 13982959, 13901381, 15132508, 17237577, 19534212, 21104597, 21222966, 20157081, 18933839, 18294963, 18269875, 18338530, 17617936, 15702497, 12975424, 10143760, 7739624, 5932694, 4701457, 3865621, 3278051, 2861629, 2533756, 2276628, 2060771, 1901063, 1745305, 1632578, 1537304, 1443189, 1368728, 1301462, 1240238, 1178774, 1123103, 1084593, 1043420, 1004219, 966570, 936113, 909447, 879599, 853647, 837382, 799369, 750122, 724971, 701586, 679006, 673409, 665022]
17300F65022n29p130k2786j8711q772j2045k19k3274j0643L561Q310J0595J099
17287E84478j9527j6106q827j1335q682j3272M383n587j2787l267r686k9968k9233
17274D20584l470k8312q165P572r413J948J6869P907j2660k315N759Q968p63j3078
17260C91431k334L12l385k5707K656K4121J6444j0638j4908P318K265K588K1285
17247D11448J7294l561j2196o890M347N610p242j1364Q74k7464j2924l734J5858
17234C70056L1048R026j6090l047j6770j6002M926R899j0824j1915J1065j4583
17222C46789k7964k1485K878M874N628m216j6083j2914r920j2885P215P51J0663
17209B73331l057K669m132r611m980r795k5721j0871Q672J5546J743p354R838
$$ y = [665022, 664493, 657363, 634577, 615866, 607094, 595049, 594830, 571556, 560913, 564474, 572784, 583379, 584478, 564951, 548845, 540018, 528683, 520001, 506729, 511112, 505525, 492738, 489471, 479785, 449817, 420584, 417114, 388802, 380637, 388209, 378796, 380744, 397613, 405520, 392860, 390545, 396304, 405272, 404509, 391431, 389097, 389409, 386024, 360317, 362973, 387094, 403538, 392900, 377992, 385310, 387575, 390163, 411448, 428742, 425181, 412985, 406095, 410442, 416052, 408810, 397446, 398320, 370856, 357932, 354198, 370056, 401104, 410130, 394040, 390993, 374223, 358221, 363147, 373046, 362222, 350307, 361372, 346789, 318825, 297340, 300218, 305092, 310720, 306504, 290421, 277507, 267587, 254702, 261917, 262668, 273331, 270274, 272943, 268811, 259200, 254220, 244425, 218704, 207833, 216505, 232051, 233794, 226440, 236278]
17196B36278L419l0247r917m804J670J1727J402J6606J0251k0187Q701n386m220
17183B15293q083J8974l575K80j0796k499k175j5389j882R15N545l2o176N948
17169A96348J1431j7874k7987k363P862L2459k098j054j7079j9409J3590M946
17157A78772l7502j5389J699o020J3221J2491r050k007k039o41j982p604K2159
17144A46108l434o072j039n818k475m370j5151p64p417P061Q142N468k534j5007
17130A02698p663J8354K2832J7147M800j9909j3352k795j523j2731j33J2331J6523
17117A36579j8395j9263J6305j4234J801O55J1451J0854J2677o261j4350J6260
17105A34079L188J399M475n698j1297k3655O712L0059K0223j8339q782K257j4704
$$ y = [236278, 239697, 209450, 199533, 194729, 196399, 208126, 209528, 226134, 236385, 216198, 224899, 219513, 215293, 207210, 226184, 222609, 222889, 212093, 209594, 207419, 192030, 190148, 191063, 196608, 196576, 190400, 196348, 207779, 189905, 161918, 159555, 167417, 199876, 197778, 196724, 179645, 160236, 173826, 178772, 141270, 125881, 127580, 121560, 134781, 147272, 138222, 136215, 134176, 133535, 131553, 123949, 146108, 142674, 136602, 135563, 129745, 127270, 122900, 107749, 106985, 99568, 106629, 114771, 120239, 117705, 102698, 95035, 113389, 136221, 153368, 158168, 138259, 124907, 122112, 120589, 107858, 107725, 120056, 136579, 118184, 98921, 115226, 100992, 102793, 103448, 114899, 125753, 138430, 132169, 117819, 134079, 137267, 138666, 143141, 137443, 126146, 102491, 109203, 139262, 159485, 141146, 132364, 134621, 119917]
17092A19917k0517J0531K537P916J098r425j6216j0532m29J8223L5220m510j8198
17079A15615R119j310n795j0358j8396N201J2620O880j910o946m343O449J7592
17066A24418j9084j3668O272L23L373N364p088j042j9745j320K5664P274j8255
17053I2486j6510R805k288k507P144O060K916l013n975j0323k288m128j0426l198
17039E7755j2098J0200J4365J986K2836J33K810J098P595M807j2865o897J5637
17026A07362J2180k4921k3443j3010j268k443J5581J8001k0361p407R007J3962
17014H3240j4929J3655J7062m165r976J9700l140j2700j9634M03j86R121J4855
17001I3306R869J0761j2934j3405K1562P509j1827j4671q535q818P18j1487J0051
$$ y = [119917, 99400, 109931, 112468, 120384, 121482, 112057, 95841, 85309, 84880, 103103, 138323, 133813, 115615, 124734, 123424, 117629, 107271, 88875, 94076, 106696, 113576, 111666, 104720, 100377, 106826, 124418, 105334, 91666, 97938, 98261, 101634, 106998, 99910, 98868, 79123, 77803, 103467, 110741, 92486, 75976, 85781, 83493, 80986, 88130, 94190, 97106, 94093, 88118, 77795, 75507, 71379, 60953, 57755, 45657, 55857, 70222, 72208, 95044, 95177, 97987, 99085, 106680, 111487, 98622, 91725, 107362, 119542, 94621, 71178, 58168, 56900, 54457, 70038, 88039, 67678, 60271, 69278, 83240, 68311, 81966, 99028, 94863, 84887, 104587, 101447, 88747, 69113, 69516, 69330, 78451, 93306, 103175, 113936, 101002, 87597, 109159, 116668, 104841, 90170, 81635, 72817, 73535, 62048, 72099]
16988G2099K8253L745Q266O284j5090j9910K275l763L929J9883J56J9964k407
16975A23684p36J3485J6688K3767M6041M3603K7500J4257L332J748J606N594J9786
16962C40355K4529K0045O862K7506L0441J995O426J9449k570j2648M436L428k4496
16949D45758l1679j1130k4266k0978q769J0227m519k0151j5932l4468k8443l0404
16937B25246k3410k1587k5543j787j421j9268j3257k3642M678n789j7575M161
16925H0806l054j3253R814K5084l64M789L5138J9269n59J1680K1246L9933J9470
16912B49999J011N568K6362J9925K0703J1929q304j2108l4166j570O912j3311
16900B72950N080r220J747R682K259k1199j6799j2991j9977k3491k0713j9312
$$ y = [72099, 100352, 104097, 112363, 118647, 103557, 83647, 85922, 82159, 86088, 105971, 106127, 126091, 123684, 122948, 136433, 153121, 176888, 222929, 266532, 294032, 308289, 311621, 313369, 314975, 320569, 340355, 364884, 384929, 391791, 419297, 449738, 451733, 458159, 477608, 475038, 462390, 466826, 470254, 445758, 414079, 402949, 378683, 357705, 348936, 359163, 354644, 334493, 318561, 284093, 255650, 225246, 201836, 180249, 154706, 152919, 151498, 132230, 118973, 95331, 100009, 94220, 76645, 80806, 77752, 64499, 74313, 99397, 99033, 103822, 138960, 158229, 157670, 169350, 190596, 230529, 249999, 251010, 256578, 282940, 302865, 323568, 335497, 327193, 315085, 280919, 279349, 286261, 272950, 278030, 268810, 270557, 280239, 282498, 261299, 244500, 231509, 211532, 188041, 167328, 148016]
16888A48016L567l36p332j2860l341N26j848J5368o1j4720j5951j0786m084j2977
16874H3181O345r746l624q725j6820r324K732j556J978m561r186J8539J6228J0842
16860G6303J8421J6741J3846J0856J8724M510J3313m098O076J585j9675n46p377
16847A48679j7381l316J3291N845J179k6033l855K3061R661j1335J0588J2382
16835A62766R441k143j7464j7756l051n856j2834k8359k5642R684J3306N588k3233
16822F4447N75K124j5825K2209P070j2786n866L417R387j5644q656j2867K144
16809C9729O283k0100M062N711N66j3653k4426K841Q300J6842L560j0100J2908
16796C2523k176j095p211k0364j6511K3686l07m576K273J4808q132r140j397l715
$$ y = [148016, 151583, 151247, 143915, 131055, 127714, 128240, 126392, 141760, 141699, 126979, 111028, 100242, 96158, 83181, 89526, 79780, 76156, 67431, 50611, 41287, 44019, 42463, 44441, 39880, 30694, 49233, 65461, 76303, 94724, 111465, 125311, 136167, 154891, 159401, 172714, 168616, 174692, 176277, 156602, 156056, 148679, 131298, 127982, 141273, 147118, 148297, 122264, 118409, 141470, 151131, 139796, 150384, 162766, 172207, 170064, 152600, 134844, 131793, 125937, 113103, 84744, 59102, 68786, 82092, 87680, 64447, 65022, 67146, 51321, 73530, 80600, 67814, 61948, 65365, 74752, 59108, 50452, 37585, 39729, 46012, 25912, 29974, 35685, 36251, 22598, -1828, 1013, 9313, 26155, 29715, 19615, 32523, 30347, 29252, 22041, 1677, -14834, 8852, 8545, 3969, 6242, 21050, 12918, 3778, 2381, -1334]
16782a334R424Q657j2498r084o45R870M447k3266J274J9394J853Q062K821P268
16768B6243N661j6447P872J0651j2228j4475K934m190J5931K5501P170q661j1747
16755C4215j4177p604P226j525N658J3894o01k9031J279K2942p771J2456K1790
16742E8751k719k1827R994L685l482l90j6673N134l098o817j30P105k76L573q572
16727B4258J1611Q883j6788N682J7206j4168j7827J4282j09n34K861J157n253
16714C1261k173k5543l531j4586K703J6070o263J277J4376R092l000k3780P419
16701C322K58J533q804L953J7603L061n302m181J2761M207n217r513j063J1735
16687B4353O015k5673k4339m865J8124L5224m497j0324N576O855j0964j3236q788
$$ y = [-1334, 8090, 16747, 4249, -4835, -5480, 4390, 8837, -14429, -13155, 6239, 8092, 16154, 18975, 26243, 31904, 15457, 23329, 33980, 21752, 7277, 10211, 6021, 21952, 47453, 54623, 45962, 34215, 20038, 12434, 19660, 18135, 23793, 37687, 37086, 8055, 9334, 32276, 24505, 36961, 58751, 56032, 34205, 44199, 47884, 44402, 44012, 27339, 32473, 29375, 22558, 22428, 29533, 29257, 32830, 24258, 35869, 44752, 27964, 33646, 50852, 36684, 18857, 33139, 33030, 32496, 35357, 36514, 31261, 29088, 3545, 14, -14572, -11869, 4201, -2062, -785, 13591, 22683, 19683, -4097, 3322, 3580, 5113, -3691, 262, 17865, 20926, 15624, 11443, 24204, 28411, 23194, 13681, 12618, 24353, 30368, 4695, -19644, -24509, -6385, 28839, 24342, 14018, 19594, 26449, 15485, 2249, -6539]
16674f539o290J1048j1735M466L0173J8182o537K162Q801J1457k1902k2187o824
16661D275M50J1774K119j7231m511N817J2363O984n673j1160j2579J1726K6141
16648C0495n050k5396O22J1512J6034J50m805k92j4047K400J2641O921r90J214
16634C1409p867q452o00M436r545o568n867j0306L211J1721K485K074J5096J7041
16620C8268o538r500k905O437p210k650n535j4408L55J7348J853j7739p366J5996
16606F406L889o323j596m654j6357Q427K8134R975j850M20J6001o539j4517n255
16592A6161R049q900j413k080P900Q07j5390j8760R417o395p7P013j1730P29K5663
16577A1994M531o429j3965j5672O116P735j5880k5861J4966K5842j5982k419J3443
$$ y = [-6539, -12829, -1781, -13516, -9050, 21123, 39305, 32768, 34930, 43731, 55188, 33286, 11099, 4275, 4725, 16499, 18618, 1387, -3124, 2693, 15056, 22040, 16367, 5207, -7372, 4354, 30495, 25445, 49, 671, 12183, 28217, 28367, 23562, 23270, 9223, 11623, 24264, 31185, 30195, 31409, 23542, 15090, 14490, 18926, 9381, 2813, -3054, -13360, -10149, 1572, 4057, 6131, 21227, 38268, 31730, 22230, 19325, 25762, 18552, 15902, 10367, -4041, -3686, 13662, 15515, -2224, -9590, 6406, 10295, 3972, 2376, -2278, -18635, -10208, 17926, 27901, 26051, 26471, 42472, 35933, 21416, 16161, 25210, 16310, 14897, 12817, 20717, 21524, 6134, -12626, -3209, -9604, -9681, -2668, -14398, -13669, 11994, 16525, 10096, -3869, -19541, -13425, -5690, -21570, -47431, -32465, -6623, -22605, -25024, -11581]
16564a1581J3452n733k7170O132K0793O641J4037J5734j3506k7056o15k83J5077
16551E922M879j370j5210m389k11J27J2837O276n546j3411L945K0497l172J2340
16537B3514q420J2487K2598J378j2446Q795J2857j8395j3244n973r241L239N429
16524B2578j2545n633R290J076J1709j8172l190o373j0505n502p7j0186k483L442
16510b6571m225l508L5902J5022j1479k736R414j555q900M77P337J1012M936k6530
16496a404L968J1616o188k944J1158j6408j2858j3401N516R117J4151J0275R155
16483B1753k2498j1937M506J3560l044q90J2758J4690N182q636j2529J6180J0256
16470C9351l6906j3007K7821K7178j9188j0306l656j0373J8708l122j5749j4798
$$ y = [-11581, 1871, -3862, -31032, -24900, -4107, 2534, 16571, 32305, 18799, -8257, -8872, -9155, 5922, 10801, 9431, -5779, -10168, -10379, -10252, 2585, 8861, 3315, -10096, -6151, 14346, 11174, 23514, 15094, 27581, 50179, 51557, 39111, 47906, 60763, 42368, 29124, 23151, 13910, 17149, 22578, 10033, 4400, 13690, 14766, 26475, 8303, 5113, -1260, -11765, -17267, -17344, -27530, -30013, -26571, -30796, -34304, 1598, 16620, 5141, 2405, 11819, 10264, 1364, 1841, 9178, 20190, 25126, -1404, 2564, 14180, 7992, 5048, 16206, -202, -13060, -26461, -20945, -11828, 2323, 12598, 21753, -745, -12682, -8176, 5384, 2340, 1450, 14208, 28898, 34080, 25444, 12915, 29095, 39351, 2445, -10562, 17259, 44437, 25249, 14943, 11287, 914, 19622, 16500, 751, -14047]
16458a4047N082J585k907o6l312J2287j785o292K1915J9748n49K828l559p077
16444B3851n238P972L556n37J0826q142j2714j0330K294O690p137j3056J393L480
16430B908J1542J2877m708m34Q798k6170j3944r894o525K357P366J0674J0513
16417E360Q27j911m380O573m203j124m446J8054J6625r499o410l055m996j6866
16403i451p093o556N316m990k354n32N859K697q61Q050Q179J1433j2588m412l717
16388a1020o598r371l481O273P782j544j274M430J859p017k356Q371J3668K1940
16374B1662J446p440j514o301p361p643J1409k252R85N695J6319J5788k1937j2303
16360F553O420j1568j1046J3308r036Q178N797K58J2751j0560j0846K047k116
$$ y = [-14047, -8965, -7380, -10287, -10353, -13665, -1378, -3163, -9455, 12460, 32208, 31659, 34487, 30928, 23851, 18613, 26585, 30141, 29604, 40430, 32288, 19574, 9244, 11538, 18228, 11091, -1965, -572, 2908, 14450, 27327, 22619, 22185, 30983, 4813, -9131, -19025, -25550, -23193, -15827, -5153, 5360, 6187, 4276, -104, 6469, 2266, 1142, -3304, 14750, 31375, 21876, 15466, 12411, 7415, -9451, -16544, -23100, -17784, -22774, -25128, -25660, -19801, -17104, -17965, -9915, -1736, 9697, -2891, -7303, -11020, -17618, -26989, -30470, -24197, -16415, -17959, -19233, -14803, -12944, -19961, -22317, -13946, -278, 21662, 23108, 15668, 14154, 7853, 492, -7151, 4258, 2006, 2991, 8686, 25005, 40793, 18856, 6553, 12973, 1405, -9641, 3667, -5369, 2809, 8606, 8864, 21615, 11055, 209, 2256, 140]
16347A40j0446r892J7588K1376J5653J0340j7079j9106r693J8729K252Q751m593
16334B4020j2445j1597Q19p42j3353M148j414q893q518J3480p855j5455L656J0633
16320b3516j7525o530K4505j1524q51j323k2N760J190K643m745j1948K8286L3659
16306A8059k972n228o471J6078j692r530R824J602m922o600j2424N099P473R18
16292I214j3360j7880K88J1840J0545O917k116l611j976j1152N840J879Q044J8030
16278B2502o852j3700J1878L148J0205j329j4185j8444l114J7574J5611J534l414
16265B1414r909j177J037l380j0254L10p498N119M293j8206K060N89k767Q934
16251i435j501k3818j669K9479K393l654M937k227J0972J0392J0965J9724m914
$$ y = [140, -10306, -20198, -2610, 18766, 34419, 44759, 27680, 8574, -1119, 17610, 19862, 28613, 24020, 11575, -22, 797, 55, -13298, -9150, -10564, -19457, -27975, -14495, -22350, -37805, -34149, -23516, -41041, -47571, -23066, -34590, -35441, -36764, -36786, -31026, -29836, -27193, -31938, -43886, -15600, 18059, 15087, 9859, 3388, 19466, 17774, 8244, 18068, 19670, 14748, 8148, -4276, 823, 8296, 9214, -4146, -22026, -21738, -9898, 647, 7564, 5448, 1837, -139, -11291, -5451, -3572, 4472, 22502, 15650, 1950, 13828, 16976, 27181, 25852, 11667, -6777, -9891, 7683, 23294, 24828, 21414, 11505, 10328, 11365, 7985, -2269, -1959, -9457, -4338, -45, -18251, -16191, -15602, -18369, -9435, -10936, -34754, -36423, -6944, -4551, -8205, -3268, -5495, 5477, 15869, 26834, 46558, 41644]
16238D1644j3077N3k588M918R139j4305j3490j2293j0117P946R533P256n857K154
16224A0916j807N258o31O512j3337k2643M130M705k490k038O92n87J6587R681
16210A4948k1503k335J271P646j820j5700l512j2661r036K5181J4813J0380m848
16197B824j9776l883l133k75J6137K1823O009o773j2911j0104j2540J4115K4188
16184A5701J497m987j0068j1193J1349P316r684M147k894k2428N024K4351J3194
16171B1325l521r438j2621j1291q256p781L715R72n200j4786M236J6031M613Q779
16157a3223n325j0027L073P754K557J3323r989O297J6361p874n361K0123O06p470
16143A0825J5136Q561j2073m833o025K079J684k2542j7993N063J7973k804K095
$$ y = [41644, 28567, 28620, 26032, 30950, 40089, 25784, 12294, 1, -10116, -2170, 7363, 14619, 8762, 10916, 9109, 14367, 13736, 20248, 6911, -15732, -11602, -6897, -9387, -11425, -10733, -11320, 5267, 14948, -6555, -8890, -7619, 27, -1793, -17493, -21005, -33666, -42702, -17521, -2708, 7672, 2824, -16952, -20835, -23968, -24243, -8106, 13717, 19726, 12953, 42, -10062, -22602, -8487, 15701, 17198, 12211, 2143, -9050, 2299, 9615, -69, 4078, 1184, -21244, -16220, 8131, 21325, 17804, 8366, -4255, -15546, -23802, -31583, -27868, -26896, -32096, -46882, -42646, -26615, -22002, -13223, -18548, -28575, -25502, -17748, -15191, -1868, -11857, -5560, 10801, 2927, -2434, 17689, 18295, 10825, 25961, 34522, 22449, 17616, 11591, 13670, 15354, -7188, -25181, -20118, -2145, -4949, -2854]
16130b854j3774k2521o568K9903J3800K651p043j3506Q204J7892O863R28o979
16117F996N349Q677J5017m751M260M402O94j1034k1045k1371j1152k49R913J3264
16103a030M360j1808O575q05p15M348N481K4599j3841k5011m299j335P296J0402
16089D217o674n717L000J5769K200L470p317j6837q676J4229P073O781L654J1843
16075B7015J1652p657l629m775p284j2243j748j9593k0649m633J3878Q327q276
16062b9615p159j650j847N581k166j0380l031J9805J7174J2431o266n096q477
16049b0696J0199J2188q012k693N626j055O862j0578j2605J197L347r860j0452
16036c6532K8024J6540p484j9437q1M142O148P838K699J1828j215k1639P685Q153
$$ y = [-2854, -16628, -39149, -45717, -15814, -2014, 637, -6406, -19912, -11708, 6184, 13047, 13975, 6996, 12345, 21022, 36039, 31288, 35548, 39950, 40644, 29610, 8565, -12806, -23958, -24207, -14294, -1030, 3330, -8478, -1903, -2708, -3423, 925, 6406, 31005, 17164, -7847, -12146, -13481, -6185, 4217, -2457, -8174, -5174, 10595, 12795, 16265, 8948, -7889, -16565, -2336, 4737, 11518, 15172, 27015, 38667, 31010, 27381, 22606, 15322, 3079, 1331, -18262, -38911, -43544, -29666, -21339, -29615, -36774, -38424, -40271, -34690, -36856, -47236, -50267, -30462, -13288, -857, -7123, -12219, -20696, -10497, 1691, -6321, -9014, -3388, -4443, 2419, -8159, -20764, -19567, -16220, -26080, -36532, -8508, 8032, 548, -18889, -18970, -14828, -8680, -842, 1857, 13685, 12470, -9169, -1484, 6669]
16022F669q846k559M037j5918N512K0528j702N794l617j3096j7094J93K754r581
16008b6926J08M369L748p348J5200O336O033L202j2113r179K2556m216n991J3865
15994I644r348l687l564m273R982K581n121j2405K771K1192J1131J477j5131k132
15980C117J1969o342p095j358J0025J0432p0l037j23K838P108p469p036J1938
15966B4897Q274j6749j2456r753Q129M13L593Q656M997n72m99P60J270p815l078
15951A0067n918P033J6417n989n906r10j9630K741K1518P10J678j7628j2452J957
15937f312R73J5204j5026k4173J733k1M590k2507j2959j7443o182J8384J7448
15924d6291J6218N081p332n548J1872K1393J1914m083J3968M859j6041j6816j2740
$$ y = [6669, -2177, -4736, -699, -16617, -11105, 9423, 7721, 13515, 9898, -3198, -20292, -20099, -17345, -26926, -26818, -22449, -18701, -26049, -10849, -4513, 1520, 4722, -7391, -16570, 5986, 1770, -4221, 9644, 296, -3391, -6955, -11228, -1246, 1335, -3786, -16191, -13420, 7772, 18903, 20380, 5249, 3117, 15086, 8744, 1649, 291, 10316, 20748, 20678, 17641, 17518, 20356, 27464, 19995, 12959, 24897, 33171, 16422, 3966, -5787, 2342, 2755, 6348, 15004, 20001, 19429, 18930, 19690, 20960, 13145, 10067, 4149, 11182, 27599, 21610, 15704, 14794, -4836, -2095, 19423, 20133, 21811, 4183, -8269, -6312, -5339, 9865, -5161, -29334, -27601, -27622, -23032, -45539, -58498, -75941, -82123, -63739, -46291, -30073, -24992, -32324, -37872, -26000, -4607, 7307, 3224, 17192, 22051, 6010, -10806, -23546]
15911b3546L34k562J3000J372K750J4900m4L870n558J0225J2553r831l817Q780
15897B2426k0798p861O721K334P118M547j4442k528O085j4537Q440J830o800R830
15883B365O500M883m087q512j3738L092J6291M022K947J7978j7989j7769K196
15870a821o854L521J1255o014p670l44J0564J4716J798j6302l674N730J3227Q751
15856B6883p740Q86k3310j9299K0768l456n582r403J9312P014O086j8869J697
15843e013Q736j5856N155J440k8833j2232L600Q647J0212K420o02n777n44J5784
15829a2863R573J738N446J0306R161K729R5Q841j5048j1944N050R368k8654j8846
15815b5048R541K034j0542o262J6946k966j107O143J2778n189K81R686J6630r969
$$ y = [-23546, -23212, -25774, -12774, -11402, -8652, 6248, 6204, 10074, 4516, 14741, 27294, 17463, 13646, 22426, 1628, -6233, 488, 2822, 9940, 14487, 45, -2483, 3602, -10935, -2495, -665, -7465, 2365, 8865, 13748, 9661, 1149, -12589, -9497, 6794, 10816, 13763, 31741, 13752, -4017, -1821, -8675, -5154, 6101, 87, -7583, -7927, 2637, 17353, 19151, 2849, -825, 4905, 18132, 26883, 19143, 20029, -3281, -22580, -1812, -5268, -10850, -20253, -941, 6073, 12159, -6710, -5013, 3723, -12133, -6978, -5538, -34371, -46603, -43003, -34356, -24144, -21724, -22326, -28103, -28647, -12863, -3290, -1552, 3894, 14200, 23361, 26090, 26185, 35026, 19978, 8034, 13084, 22452, -6202, -25048, -15507, -13473, -24015, -30277, -13331, -16297, -17404, -11261, 1517, -3672, -3391, 6295, 22925, 12956]
15801A2956J861k4180j2619J8315J393p702o413P69J1506r610j6663l674M16K5409
15787h236p055k3073P696J6060Q496Q414l601o863q587j35j879J8245L743m953
15773a728J1600j3208k8982R556J8293q830j7788O894K6557J9455q105r790K137
15760F061M360j291O416J9078r944k5873n006O707J6285j5283k905N664l780l655
15746c166k823j3542K939K7189O533p094j9210p783k169o148M103O090p24K5475
15732I670J1355l2324p181m757P127J4183J926k5461j1504R342J0580P264j0070
15719a9850m195m444j3333J3525K6827j903j5028j9515l93Q365L500q193K2832
15706a1805R841R714J1516Q026j4098k3904O616J5050j2443o818K117q79K0286
$$ y = [12956, 14817, -9363, -21982, -3667, -2274, -9976, -16389, -15620, -4114, -13724, -30387, -34061, -33645, -8236, -15291, -38364, -30668, -14608, -6112, 2302, -1299, -8162, -16749, -16884, -18763, -518, 3225, -1728, 9872, -3336, -32318, -22762, -4469, -13299, -31087, -24193, 2364, 21819, 13714, 3924, 6061, 10421, 9130, 15546, 34624, 24680, -1193, -6199, 508, 16793, 1510, -1395, 4269, 489, -3166, -5989, -19531, -16592, 10597, 17130, 10036, -9174, -16957, -19126, -25274, -21171, -15081, -15805, 9670, 21025, -11299, -18480, -23237, -16110, -1927, -1, -25462, -36966, -27624, -17044, -9780, -19850, -24045, -28489, -41822, -28297, -1470, -3373, -18401, -37916, -38309, -29944, -26444, -34637, -11805, -1964, 7750, 19266, 27292, 13194, -10710, -4094, 10956, -1487, -8305, -6188, -7067, 13219]
15693A3219P339q932l3092k36J4994k018J218N811l183j1450M617o95j2309K815
15679b1902J3537P882N032K2785N619q123j4384k2753J482J3768J2932j0862j1621
15666f608J3510J0593r487L34J2785K46o754j5425k2021R221o902J2752J8731
15653A0975k6827N489m423M126N444O923Q2p660q931n888J1582K594j8034M48
15639b4100J4660l574O596L0881J5856n271k8620j4366p872R23N927O365M932
15626B337P884l835k798L976k905j7671o28K2770j462j8747q282n266l166r268
15612c7061L914J4122Q131p83n716K2581k730n497r18P834j0447L278J5916J7272
15598B9896J6591l0860j6549p754m347R780Q237q176k3560n871J376K2105J8606
$$ y = [13219, 20558, 11626, -21466, -21702, -6708, -8726, -7508, -1697, -4880, -16330, -11713, -12408, -24717, -21902, -8365, -483, 4549, 27334, 32953, 24830, 10446, -12307, -10825, 2943, 15875, 5013, -6608, 6902, 17495, 8008, 8342, 21127, 21373, 14619, -806, -22827, -13606, -20508, -7756, 10975, -15852, -10363, -14786, -10660, -5216, 1707, 1789, -5871, -14802, -20690, -9108, -6514, -24548, -24100, -9440, -13014, -6418, 24463, 40319, 35048, 6428, -7938, -15810, -14887, -8960, -2595, 2337, 10221, 6386, 3588, 7564, 4659, -13012, -13640, 9130, 7668, -11079, -19361, -24627, -27793, -37061, -33147, -19025, -10894, -11677, -17393, 5188, 2458, -3039, -3957, 3877, -6570, -3292, 12624, 29896, 46487, 15627, -922, -8676, -13023, -3243, 4994, -3182, -26742, -32613, -31237, -9132, 9474]
15585I474J1891m760m918K87j1480N022m932j0501j4787j4171J5299K1553k7734
15572b9757M288O937P495l041J1511n435K266J0415J7237l589j7226j0440j390
15559a0729N647J3534j1043L668M160n890k3692Q294K7044J9663j0522P470L640
15546C1244l7335l695k369L034N40j7466p617Q291J4397j2214j0950n221m193
15533d3554K0834L321J257J6022m417k0097o357K5364J5470r10J528j5600M826
15520b313K088K8757J0260k0014m407P656p116J0294r815k2657K003J5545l378
15507F903j1788R35M742p468n776j5470j2470N665n100J1832K0757O394q807J3447
15493C796j1482N195M795K25k0053j486J6466j374j739M361m052j656q91l683
$$ y = [9474, 21365, 16605, 11687, 11974, 494, 5516, 584, -9917, -24704, -38875, -23576, -2023, -29757, -25469, -18532, -11037, -14078, -2567, -8002, -5736, 4679, 21916, 18327, 1101, -9339, -10729, -5082, 8452, -2591, 1077, 5237, -653, -24345, -16051, 10993, 30656, 20134, 27604, 31244, -6091, -9786, -12155, -9121, -8581, -26047, -33664, -25373, -10976, -23190, -34140, -39361, -43554, -22720, -19399, -18142, -2120, -6537, -26634, -32991, -7627, 7843, 6933, 8461, -7139, -2313, -225, 28532, 38792, 18778, 14371, 22027, 14911, 25205, 15390, -7267, -5264, 10281, 6903, -4885, -3950, 792, -6676, -12452, -27922, -40392, -34727, -39827, -27995, -7238, -844, -9651, 3796, -7686, -2491, 2304, 2529, -17524, -19010, -2544, -3918, -5657, -1296, -5348, -7004, -7895, -11578]
15479a1578M38o280K150p52J4068L219l924n476L784n095p505j2231j7386K6710
15465a9858J6202r134k9581n505J1512J9468K9384R767n809k4093k0327M79j0632
15452c8127J680J1213j4088q515K851m804J6030J2640k964l144Q038K2785N497
15439I092j6892j7072l19K2919j181j1214R479O959q501p647q73p686k493J2178
15425a3251K5568N10q712N249j1287l577J7728j0430k570k106N939R96o065K841
15411H33o069l7541j3855J4228K9017o86M870R528p173m203k4541k549l905n071
15397d7117p581L5503J8142J308q555l241m612J0005L2170K669k4314j5627j650
15384a2900p934K1344J0204J3334O507P77l4226k1655M724J6434R518q271q583
$$ y = [-11578, -11140, -17420, -15270, -16022, -1954, 1265, -2659, -8135, -4351, -9446, -16951, -29182, -46568, -19858, -3656, -12790, -42371, -47876, -36364, -16896, 12488, 22255, 16446, -7647, -27974, -27495, -38127, -36447, -25234, -39322, -47837, -44986, -49790, -33760, -21120, -24084, -27228, -19190, 3595, 9092, -7800, -24872, -25191, -2272, -3453, -14667, -5188, 1771, -6730, -14377, -15250, -22936, -25429, -13251, 12317, 12827, 4115, 9364, -1923, -5500, 12228, 1798, -772, -2878, 3061, 4057, -2008, 833, -5236, -42777, -56632, -42404, -13387, -14073, -9203, 325, -6848, -11051, -35592, -38141, -42046, -47117, -54698, -19195, -1053, 255, -8300, -11541, -16153, -6148, 26022, 28691, 4377, -11250, -12900, -20834, 510, 10714, 24048, 30555, 31332, -2894, -24549, -19825, -3391, 6127, -2144, -10727]
15371a0727k212p850L283J2768o706j2972o454J2828J0085J4144p659k3804r047
15358c4323J2032R462j3226K598K6195M839p088J1190M763k1774l551k0434Q808
15345b0509K0400O03J7806N623j9822o714R72j937n65M244L65M151o114O011r956
15330e442o569K681q433k211m470L453J1752K4835k711k0547j7549R333r84O437
15316a0425J6429J5113j0252k3544l436K0183N557o36j7020L398J6829P444J3200
15303C2840M063j382k308P235j3589k472J9945K0754J2886J4304J2808K3866L1698
15290A60648L5765J0473k8482l0569j1855j6806k0349k2290l2498k6519j1350
15279F168j2109J2070o951j658J80J1302n555O957J3321n641J238J913m312k0056
$$ y = [-10727, -12939, -20789, -17506, -4738, -11444, -24416, -30870, -18042, -7957, 6187, -1472, -25276, -34323, -22291, -12829, -26055, -23457, 2738, 7577, 489, 11679, 16442, -5332, -8883, -29317, -20509, -109, 494, 18300, 23923, 4101, -2613, -1641, -3578, -4143, 101, 466, 4617, -1497, 4514, -5442, -12011, -9330, -17763, -19974, -24444, -20991, -9239, 15596, 12885, -7662, -25211, -15878, -16862, -10425, 6004, 21117, 10865, -12679, -16115, 4068, 9625, 8989, -8031, -4633, 12196, 19640, 32840, 36903, 35521, 33213, 40448, 26859, 24387, 44332, 65086, 77972, 92276, 105084, 128950, 160648, 196413, 206886, 178404, 147835, 135980, 119174, 98825, 76535, 44037, 17518, 6168, -5941, 6129, -822, -2480, -2300, 9002, 3447, 10404, 23725, 18084, 19322, 21235, 16923, -3133]
15265c133j3188Q551Q982J3244l324k215M93k947q813j2999m053J2797M199O793
15251D387J6291m346r479P564N671J018k2970j5247L010j1966N301J9798J0564
15238I596p398R393O724n697J0688Q296j0756k5761n848K5147o916k478j001J0067
15224A4056o38m643j9063k21L903r017p958O694M253M739P544J2775M921k1964
15210d619q100J1778p516J2994K725O435R111j3534j9089J0405J0254P740j9630
15197a046l752J1718n145r637J2408j3134p969K505R191P864j8289l142p723j73
15183b6324R454m274J4072J8756M175K007o143j866o014P882J1571m092O110K919
15169B8233l2910j0680J4737J2271j5671J960O833L612n532P268o982K774O362
$$ y = [-3133, -16321, -7770, 1212, 14456, 11132, 8917, 9410, 6463, -2350, -15349, -19402, -6605, -2406, 4387, 20678, 16332, 6853, 14417, 20088, 21106, -1864, -17111, -14101, -26067, -20766, -968, 9596, 2198, 11591, 18315, 12618, 23306, 31602, 20846, -4915, -10763, 14384, 7468, 4990, 3989, 14056, 13418, 8775, -10288, -10509, -6606, -15623, -23581, -16887, -12634, -7895, -351, 12424, 17345, -4619, -12719, -941, -8457, 4537, 7262, 13697, 22808, 9274, -9815, 590, 10844, 18584, -1046, -4798, 6920, 1775, -7862, 4546, -8588, -16557, -14052, -4861, 3003, -15286, -18428, -26151, -26324, -16870, -21144, -7072, 11684, 15859, 17866, 11723, 9857, 3843, 11725, 23296, 19204, 25314, 28233, -4677, -15357, -620, 11651, -4020, -2060, 4773, 8385, 2853, 10121, 3139, 5913, 12275]
15156A2275M396M492k941j0931j1245o86J7519K4148L032k6495q384N49n734K499
15142B494P589J3396n249r52l2862n166j235j1321Q76j540P131Q644J1252J0168
15128C225m043j0318K5597J2219j5450j4686k7505m438J1197J7013J0740K018
15116E569Q820P481M077k0752M820k144j0628j1957M158j1661J932q396M5J9158
15102i478K3788l978k9701Q317P399L752p159M751J813p683P189R278N13k336
15088F465n906q284l189R548K7603M968J5765k3834j6725J1659o391N097j7947
15075a171j7335j2000j014K0869K2246j3592j5858o384l546K078N863l850J1371
15062a2323K2011j0306p232R585j1131q515J1573j465N199J308J3468r915j3636
$$ y = [12275, 16671, 21163, 18222, 7291, -3954, -4640, 12879, 37027, 40059, 13564, 5180, 5729, -5, 2494, 10083, 23479, 18230, 17278, -15584, -20750, -21985, -33306, -32430, -33970, -26839, -18195, -6943, 3225, -818, -11136, 14461, 26680, 11230, -3456, -30961, -35399, -24202, -7189, 3551, 5569, 14389, 21870, 25947, 5195, 10015, 7871, -2757, -14714, -10556, -22217, -20285, -28681, -28636, -9478, 14310, 10332, -19369, -11052, -3653, 99, -7060, -2309, -496, -8179, -990, 8288, 8801, 6465, 559, -7725, -10914, -1366, 26237, 31205, 46970, 23136, 6411, 18070, 11679, 16776, -1171, -18506, -30506, -31520, -10651, 11595, -1997, -17855, -24239, -27785, -25707, -19844, -23694, -12323, 9688, -618, -7850, 1735, -9396, -17911, -6338, -7803, -2604, -1296, 12172, 2257, -11379]
15049a1379Q902L869j6056r386J1849J1377J9091k877j2563L04l697N37N151k546
15035B576j4535n045N460p834J754J0178M106N800j4380j4662n33O691P484J4791
15021A851n300m471R72J107o97l181K285M639j5677j5433J5083K6270K1017j3901
15007A4564o295p547N184K315l714O130M188n819k892J106O306L445j3165j0346
14993f540k2370P382k430K403Q319Q102J0124J1472j2225l367r445k7522r522
14980d5619Q133J9434M814j6678j627K594J4712J2213j513M171J6375J0863k873
14967B4999l46r359O488j2968P70j0076j0480M513j358P394J693o076J838m493
14953g461r854p164K2344J2819k0863j4261J0466P630q769K1793p642r961L043
$$ y = [-11379, -2477, 1392, -14664, -24050, -12201, -824, 18267, 15390, 2827, 3131, -566, -29, 5122, 2576, -11959, -17004, -11544, -19378, -17624, -7446, -3340, 2460, -11920, -26582, -27115, -20424, -12940, 1851, -3449, -7920, -6948, -5841, -6538, -9719, -7434, -2795, -18472, -33905, -18822, 7448, 28465, 14564, 8269, 722, 5906, 8221, 4507, 10637, 14825, 9006, 6114, 7220, 13526, 16971, 3806, -6540, -28910, -21528, -23958, -21555, -13236, -5134, 4990, 16462, 4237, 870, -8575, -36097, -45619, -37486, -18052, -13238, -29916, -31543, -28949, -14237, -2024, -3537, 634, 17009, 27872, 24999, 24653, 15294, 21782, 8814, 9584, -492, -10972, -6459, -7817, -423, 1270, -4806, -2968, -7461, -17315, -24479, -2135, 10684, -10179, -24440, -13974, -6344, -15113, 6680, -962, -10923, -7880]
14940g880l111j8465k390J5885O73K748k8605P429L855J8388J9164m492j509P571
14926I261n124k2677r14J0634j815r551J2001O973K2479Q565l045K938j2534o567
14912A0624Q24j1095j6068L930J5384q312k1J0290J3311L615l314K446j9484m930
14898b800k453J7252R124n211j6517q401J797J866L781L550J9501M738J0632p964
14884B8895P771Q13j6922k6123m579j2784k174K431K527J4742j6440J693K1035
14871H85P291k835j765m64k3566j48q180K658J2649P112O876k644j8384r191q000
14856c7706q280n595k178J1759J1756K4690J2745O781L54K703m367j7770m327
14843i435K934P796J4061j4680j7781l350N068J894j6903l749K3249J255m552
$$ y = [-7880, -10991, -29456, -31846, -15961, -15288, -12540, -41145, -33716, -29861, -11473, 7691, 3199, 1690, 9261, 4137, -18540, -19454, -8820, -10635, -20186, -8185, -1212, 21267, 29832, 26787, 29725, 17191, 10624, 11448, 353, -15715, -11785, 3599, -4713, -4734, 5556, 18867, 22482, 19168, 21614, 2130, -2800, -5253, 11999, 21123, 15912, -605, -9006, -7209, -5343, -1562, 1988, 21489, 26227, 36859, 28895, 36666, 37479, 20557, -5566, -10145, -22929, -25103, -22672, -20145, -5403, -21843, -20150, 885, 8176, 5341, 3576, 3112, -20454, -20602, -28782, -26124, -13475, -6363, 513, -2131, -20515, -29706, -37706, -45986, -51581, -53759, -42000, -30244, -5554, 7191, 13972, 14326, 17029, 12662, -5108, -9435, -6501, 1295, 15356, 676, -17105, -20455, -15387, -13493, -30396, -34145, -10896, -9641, -14193]
14830a4193P19J4323j4969j5257J1756R929J3983J6990O348j2204r330j2338j0871
14817a5114o421j2688K1080j424J733o537k0350L488P193K6698o034l61M367M33
14803c937J1244J6340J992j3144k5748J4514M634n379o679j647J029K177j168
14790e772j1999m779k2645P306K1651J5939J2212m029l482J5551L789n728N144
14777B3158J855n021k1431p407k227j0264q329L451P586K0994j0742l659J7007
14764D971J2979L488q099l0163n898r27J0936J2904q633p251j1737q233R159K2596
14750c908K9636J322j2253j1177p414J6849n21j9912o461r08J9833J1479K126
14737A8691k0158o742L3829J7234q989q804n560j2465R285j099l528J3589J730
$$ y = [-14193, -13474, 849, -14120, -29377, -17621, -7692, 6291, 23281, 29629, 17425, 8095, -4243, -15114, -21535, -34223, -13143, -14567, -12834, -19371, -39721, -36233, -29040, -2342, -8376, -8737, -4370, -3937, 7307, 23647, 25639, 12495, -13253, 1261, 5895, 516, -6163, -7810, -6781, -4604, -5772, -17771, -22550, -45195, -37889, -16238, -299, 11913, 7884, 4402, 19953, 23742, 18014, 23158, 25013, 19992, -1439, -8846, -11073, -21337, -29666, -26215, -18629, 2365, -8377, -12036, 4971, 17950, 21438, 13339, -16824, -22722, -23649, -12713, 191, -8442, -15693, -27430, -35663, -26504, -3908, 25728, 27050, 14797, 3620, -3794, 13055, 12534, -7378, -13839, -14747, 5086, 16565, 18691, -1467, -8209, 25620, 42854, 33865, 25061, 19501, 7036, 16321, 15222, 11694, 25283, 27013]
14724B7013q708l731o607j7073Q833J3886k397Q946o342j7852l444p950n310K321
14710a8415K0604K0449M25n884J3783J3086k6436j8949j3011j850J0308J1440
14698E550k5184j6481J6365J8066M868L339n241j6297J0377J4866K0950r174o905
14685A5099r023j5849K737O060p389k2573o399J3570M552r404K856J9152J1803
14672E192n359n764o826q039N703N966j0405n871j0032M540j765m784J6399M553
14658a6492p529J8971J1192k0499j5612J9373R206j1582r219R352M827M72R726
14645B186m414k1221k8493j2435J8209K2025J1719N816K3293K0975m011j7366
14633A6283K026o04j2500Q290q282j6853n203O96J1152Q474o459Q85O144l22J3846
$$ y = [27013, 18305, 14574, 7967, -9106, -273, 13613, 11216, 20162, 13820, -4032, -7476, -15426, -20736, -18415, 2189, 22638, 23063, 17179, 30962, 44048, 17612, -1337, -14348, -16198, -5890, 5550, -19634, -36115, -19750, -1684, 3184, 6523, 1282, -15015, -4638, 10228, 31178, 22004, 15099, 6076, -9773, -7036, -976, -8365, -30938, -37337, -23767, -19215, -28619, -25763, -6611, 5192, -167, -5931, -12757, -20796, -15093, -9127, -19532, -25403, -35435, -30895, -32660, -37444, -21045, -16492, -24021, -5050, 6142, -14357, -29969, -10596, -1390, -12972, -22191, -12839, -8012, -7540, 2186, -2228, -23449, -51942, -64377, -46168, -24143, -12424, -6608, 16685, 37660, 33649, 16283, 18309, 17705, 5205, 13495, 5213, -11640, -16843, -16147, -4995, 3479, -2980, -2095, 4049, 3727, 17573]
14618A7573j1338K891P507j955m456K391o239j0437m611j473m819j7334M391M607
14604b3302k441J4063R101m540L620N4K637J8408M374J0932k2073J2202o445n031
14590A1559j1997k478O193K607J768m279J1249L207j1590k0355r793K639J0664
14577a0606J0253k198J1792J6183k0431q283m22J1752J8996J7729k546m129l0741
14564G349L522M569j5858r06O746J1644q257l189l352J2404M138J57j2465j3580
14550g078k066M907n484m726N842J399N990L534J3403K931Q035l645q101L747
14536A8688p023k6290p44K393R378M684J1213P427p424k4687k300J1733J3718
14523A0766k6059k0150r165J6004J5286o56J350J1180q452j1392P407J3994K1234
$$ y = [17573, 6235, 9126, 16633, 14678, 10222, 12613, 6374, -4063, -8674, -10147, -14966, -32300, -27909, -23302, -25743, -11680, -2579, -7119, -3499, -3445, -808, 17600, 21974, 32906, 10833, 23035, 16590, 11559, -438, -2916, 3277, 5884, 7652, 3373, 14622, 17829, 6239, -14116, -23909, -21270, -10606, -353, -2551, 9241, 25424, 4993, -3290, -3712, 8040, 27036, 44765, 42219, 38090, 7349, 10871, 15440, -418, -1324, 5422, 17066, 8809, 5620, 2268, 14672, 18810, 18967, 6502, -7078, -9144, -4237, -9721, -14447, -8605, -7206, -1216, 2318, 15721, 18652, 26687, 23042, 14941, 18688, 11665, -14625, -15369, -12976, -3598, 1086, 12299, 19726, 12302, -12385, -14685, -2952, 10766, -15293, -35443, -44608, -28604, -13318, -13974, -12624, -1444, -9896, -21288, -13881, 113, 21347]
14510B1347J8723n857L886P334K153q837k1553j3076l660N904j0468m145m862
14497a3111k2981j7513P116K8370M877q857n447J6602J7245M437p270n951l629
14484f112K756J5624J7466k251k1591o340j5067N497J4039m97P79J5776j0166
14471I913k319j070p840N289P467j2253R11J163p588j4149k0623J0350j390m448
14457c6587P955P117K1948P458o75j3672j6714K008j556O143J9868o637m033J77
14443g200J3585r35l891K2502J5931j5900k4438P268Q611j9591j832P149P506
14430H765j2996K820m684r247j1989J3914J772k7397j1464J1742K5080M6801L833
14417C6950j7147k1659j375K1938j8002j4327J397J3659J4215R21o363K080J1794
$$ y = [21347, 40070, 34213, 38099, 45433, 47586, 38749, 17196, 4120, 460, 6364, -4104, -8249, -13111, -36092, -53605, -46489, -18119, -13242, -22099, -27546, -10944, 6301, 10738, 3468, -2483, -6112, -3356, 12268, 29734, 27483, 5892, -448, -15515, -10018, 4021, 3524, 4303, 20079, 9913, 7594, 6524, -1316, 3973, 11440, -813, 98, 1261, -6327, -20476, -41099, -30749, -32139, -36587, -28632, -21515, 433, 7891, 7216, -6456, -23170, -21162, -22718, -16575, 3293, -3344, -7377, -7200, 6385, 5450, 1559, 24061, 39992, 24092, -346, 6922, 15533, -4058, -5890, 1259, 8765, -4231, -1411, -6095, -15342, -27331, -13417, -11645, -39042, -50506, -38764, -13684, 33117, 36950, 19803, -1856, -3231, 18707, 705, -13622, -12225, 1434, 15649, 16570, 10207, 12287, 24081]
14404B4081j0294j3871j021J1583J8286N682j0660q390j2920P66L613j7244N212
14391e177J6457j1722J8736J9165m258j0335j1147p753N378N682L929r042j5111
14378e198K072J4723J6686J3650j3486j0930j2430j4547J0411K0801j737j9348
14366F67l1Q434Q590l091J0179l167j6433J3095Q743j1886O149P310j203k0122
14352G234p877N774R704L092k779p540j4724L758P200n077p981R283P018L753
14338A0838L888j1982q753k117q517m010M949L247P562L542J887M929L301J3986
14324B2750p162J2306r69k2873Q896O037O900r885k619P445M301r064k2162o400
14310a2499J5681J0173m296J2586o77j0038J388R186J3083n345j0840k1145J742
$$ y = [24081, 13787, -84, -1105, 10478, 28764, 34446, 23786, 15396, 2476, 3242, 6855, -10389, -5177, 11280, -442, 18294, 37459, 33201, 22866, 11719, 3966, 9344, 15026, 18955, 9913, -5198, -3126, 11597, 28283, 41933, 28447, 17517, 5087, -9460, 951, 21752, 20015, 667, 636, 9070, 17660, 14569, 24748, 21581, 5148, 18243, 26986, 15100, 21249, 28559, 27356, 7234, -643, 5131, 14835, 17927, 15148, 7608, -7116, -3358, 3842, -1235, -9216, 67, 7085, 10838, 14726, 2744, -6009, -8126, -16643, -20653, -15704, -12457, -4895, -1353, 534, 5463, 8764, 22750, 15588, 27894, 26925, 4052, 12948, 18985, 25885, 16000, 13381, 20826, 25127, 16063, -6099, -12499, 3182, 13355, 9059, 21645, 20968, 10930, 12318, 21504, 34587, 29242, 18402, -2743, -1001]
14297a001k294n749J5742J2501N711m185j0747R34k973q701J0449M361K208j581
14283A4675M660n377l316p487L470j6909j7065J0640P136j5932Q97J0391J9835
14270E618k964k3567R79R609P694K1536L500j5279r290J723l653j0755J655m442
14256a7636j6501N41K1999K2881M474J2882j4023k3890j348J6941k289j6372N372
14243f969R485p205K411O999Q55p413k574k2778r390K6074J3736o129j1358j125
14229a5381n441K0306l23M386L636P576j8163j5453q989o516J8279j586J6023
14216a646J2705j851R43L187O597J7080q848q368j1182K197k2426k2743N597K106
14202b6652J727o756j2908l279J7862K1814J1145K1339Q36j3472J997j5931N155
$$ y = [-1001, -3295, -9044, 6698, 19199, 24910, 20725, 9978, 10912, 7939, -762, 9687, 14048, 16256, 14675, 19335, 13958, 10642, 3155, 6625, -10284, -27349, -16709, -9573, -25505, -24608, -14217, 5618, 2654, -20913, -19934, -10325, -2631, 18905, 22405, 7126, -2164, -441, -4094, -14849, -13194, -17636, -34137, -33596, -11597, 11284, 15758, 28640, 14617, -9273, -10621, 6320, 4031, -12341, -6969, 2516, -4689, -2278, 4721, 5576, -1837, -4411, -27189, -36579, -10505, 3231, -2898, -14256, -15381, -20822, -516, -839, 3547, 7183, 14759, -3404, -18857, -27846, -34362, -16083, -17669, -1646, 11059, 9208, 10151, 13338, 19935, 37015, 28167, 19799, 8617, 10814, -11612, -34355, -28758, -26652, -24925, -31681, -44589, -47868, -30006, -8192, 2953, 24292, 25128, 11656, 13653, -2278, 2877]
14189B877j2954j0113K4565J1463j4218j5541J7608J572m019j0758j4247J1570
14177a2195N843k690j822O919q80j782j1756j9716N800J6521N16J2430J246J538
14163b8Q950n844j658n806k071q845p203q168J6309O48j2983j3466K3248K2146
14149E229N616j6574K911k934j0684j1397N778M623q390M637L826J0996m826p562
14135a8751L090n902P227n43j246Q515M798j5031m210K1295Q239j2169j7629M46
14121b1871k675J9244J8486J1947J1716j8667l2117j1348P155J7921J4714r062
14109E443l38N104K129j0209j589k6401J4849K4139r474j4744K362J7690Q956
14096A7917J174j7380j1003J539j9766P577N256J655J9354J1378q65Q979J0848
$$ y = [2877, -10077, -20190, 4375, 15838, 1620, -13921, 3687, 5259, 1240, -9518, -23765, -12195, -6352, -9042, -10864, -3945, -4825, -6607, -18363, -38079, -32279, -15758, -15242, -2812, -1566, -28, 8922, 3078, 1420, -4386, -6457, -15302, -22505, -30673, -14364, -13716, -26699, -40165, -16917, 5229, 10845, -5729, -2818, -5752, -16436, -27833, -22055, -17432, -25822, -21185, -17359, -6363, -11189, -18751, -15661, -21563, -14336, -14879, -16125, -7610, -2812, -17843, -22053, -758, 7481, -4688, -22317, -21871, -24546, -5302, 13184, 25131, 36847, 18180, -13937, -25285, -18130, -209, 14505, 5443, 5105, 10209, 12338, 2129, 540, -25861, -11012, 13127, 3653, -11091, -8729, 8961, 17917, 19091, 1711, -9292, -7753, -27519, -19942, -14686, -13031, 6323, 17701, 16836, 25815, 36663]
14083C6663j7710k0171k3754Q551K3679Q412q84o740j1139j2413Q5K0502P992
14070A3073k0635j1273Q856J2559J3886J0714j8353j2485K414j8375o391k085
14058b8095L682l530L492l073M993K2191o342m249k613k4795n182K7461K9888
14045A3828O010j2476j1134j938n34j3654M734L5019O112j7551p225j2498O08
14032a0699P6P012j7733L315J7812O938P611O048r339r549J911J0048P403l759
14018A7095j7413k1579J5190J2678J114j11P096R933J723j359j6009j0399j3177
14005a5218J0320j213k3330Q44Q857P425J8269J419j0135r600R680L618j1877
13992a0941J3394J1283R546Q043l4186l1834K908K3175J4873M222j3990K305J9989
$$ y = [36663, 18953, -1218, -24972, -16421, 7258, 15670, 14786, 8046, -3093, -15506, -15421, 5081, 13073, -7562, -18835, -9979, 2580, 16466, 27180, 8827, -3658, -1244, -19619, -26010, -28095, -24413, -27943, -24451, -27524, -22531, -340, -6682, -10931, -13544, -38339, -43521, -16060, 13828, 19838, 7362, -3772, -5710, -6244, -19898, -15164, 19855, 25967, 8416, 1191, -11307, -10699, -10623, -3611, -21344, -18029, -217, 6721, 14332, 20380, 11041, 1492, 3403, 13451, 20854, 17095, -318, -21897, -6707, 5971, 7085, 6974, 14070, 24003, 25726, 24367, 8358, -2041, -15218, -4898, -6111, -29441, -28597, -19740, -12315, 5954, 7373, -2762, -12362, -2682, 936, -10941, 2453, 13736, 23282, 31325, -2861, -34695, -31787, -8612, 6261, 10483, -3507, -1202, 18787]
13979A8787p139j2129k687j2995J3224J8987M589j7043j0190J3268N464Q724j0141
13966A0719k4479K4134J1015K053j0089j4541m129L019J8938j239N176J0759m985
13953B6351j584j5640k2658m175J4118K4277R116j7524P264k875k2199N371J7215
13940A7057R512j8450k3647L687K1330J0532J2367J1080k595o266r663k3048j2876
13927a0980K930J2100k018m536k096K5498L412m306J265J75l464j3266p071r874
13913a2231K364L1633R482j5624o618J078q448J172J5446l411n691J5423j6824
13900G751k1034K089L387j7299m265J3835N474j586Q350J906k6905R606L448p49
13886a5992J020k817o379j1770N302J3037J1182J7778j3406k7298K1436J9872
$$ y = [18787, 11648, -481, -3168, -16163, -2939, 16048, 20637, 3594, -6596, 6672, 12136, 20860, 10719, -13760, 10374, 21389, 23442, 13353, -1188, -5317, -2298, 16640, 15401, 20577, 31336, 26351, 24767, 9127, -13531, -17706, -3588, 20689, 29805, 12281, 19545, 16670, -5529, -158, 17057, 26569, 8119, -15528, -11841, 9489, 20021, 32388, 43468, 40873, 34607, 24944, 1896, -10980, -8050, 4050, 2032, -2504, -4600, 20898, 24310, 20004, 21269, 21444, 17980, 4714, -2357, -12231, -9867, 21766, 31248, 15624, 9006, 10084, 1636, 2808, 18254, 14843, 9152, 24575, 7751, -13283, -11194, -7807, -25106, -29371, -15536, -10062, -11648, -3298, -1392, -28297, -18691, -15243, -15992, -14972, -17789, -24168, -35938, -30636, -17599, -6417, 11361, -2045, -29343, -7907, 11965]
13874A1965Q055j3089q113M606Q009j5352o20J0341n335R628J1041q430j6401
13861c695J251j2157l486K999N493l393q254M484J4568J2149j386o512j4221L678
13847h482L0789J2130j620k496j3581j8073k331Q173k913j7528J8475K2085j7011
13834G617k6651J2734L170N819O908k4036j2884M212j2516J9663J8171P415Q291
13821A7913o230j2864j003M817o420J2162P742L750j440r587k0819k0034Q728
13808b3285J3938k3650k562o803L747k45J0871o933m103K198j297j4950j2300
13795f5374K0970J5487K1569O009k1984m444J8309L2459R77r602j9971j7221r339
13782c2155m282L207O090K1176J4877K21j2115o255J5236J2192j1442o892O034
$$ y = [11965, 20020, 6931, -1182, 3424, 11433, -3919, -4539, 5802, 467, 10095, 21136, 12706, -3695, -2444, -14601, -18087, -15088, -9595, -12988, -21242, -16758, -2190, 9959, 8573, 2061, -12160, -8482, 22307, 34437, 32817, 30321, 16740, -1333, -3664, 4509, 1596, -15932, 2543, 24628, 7617, -19034, -6300, -3130, 2689, 9597, -14439, -27323, -23111, -35627, -15964, 2207, 9622, 17913, 11683, -1181, -2184, 2633, -3787, 8375, 16117, 19867, 18427, 8840, -11979, -32013, -23285, -9347, -32997, -35559, -42362, -38615, -38860, -27989, -34922, -39025, -36827, -38124, -53074, -65374, -44404, -28917, -7348, -1339, -23323, -27767, -9458, 23001, 23978, 14376, -5595, -22816, -32155, -36437, -33230, -27140, -5964, 8913, 9134, -2981, -9236, 6000, 18192, 6750, -142, 5892]
13769E892P544n668J219J2539r088j0131r517N976J0437j2047J6818J5853M765
13756C4592j9037n144M499q668o244J7015K555J738j0187r909j0954J5279q864
13743c329p564K455L948J9591J0179j8249j2272J7426Q268k3588P931q241R017
13730E572P366K711O207j9865k1561P083L1141N76Q810N244K756K93j9353l0283
13716a3303j4786J2924J0327J046j397l751J152n234K559M080J0148J9082J0522
13703C3369m312k0162j4670J253J3809M740l547J3576J3599J490j2452m190J570
13690B4073j1385j8055Q806J3246L975k64k1791q381O231Q505P860N590j5248
13677C162k2499P543J5928J730N900m474r523j3679P196J8719J2469j6994Q313
$$ y = [5892, 13436, 7768, 8987, 21526, 12438, 2307, -7210, -1234, 9203, -2844, 13974, 29827, 34592, 15555, 10411, 14910, 6242, -2, 17013, 19568, 21306, 11119, 1210, -9744, 5535, -3329, -10893, -8438, -4490, 15101, 25280, 7031, -5241, 12185, 20453, -3135, 4796, -3445, 5572, 12938, 15649, 21856, 1991, -19570, -12487, 18654, 19230, 28040, 33284, 36040, 36333, 16980, -13303, -28089, -15165, -4838, -3792, -5189, -8940, -7788, -13022, -10463, -6383, 3765, 22847, 33369, 29057, 8895, -5775, -4522, 9287, 14027, 10480, 24056, 37655, 39145, 26693, 22503, 24073, 12688, -5367, 3439, 16685, 20660, 20396, -1395, -9776, -3545, 4960, 12820, 18410, 3162, -19337, -11794, 4134, 5864, 11764, 7290, -2233, -15912, -8716, 10003, 22472, 5478, 13791]
13664A3791J0739j1302j6676k596p022j692J8097J2663j249p512j6518N54J5374
13651F651J1099L751Q29o912j3561l484j936J9812J7180j2728k8615M52J5029
13638G567m602L510K2428j2440l6007j7090J4296J4551Q440j285p764j838J4726
13625D492j5909j2279J6986J9263r741R988q004l993n865J1769J4099k1488p392
13612h074J7534N377l0277p276J919Q665R491L004j6726J0277M819m200J8895
13599A3428O622j452p94n170J373L023K092P661k1686o653J1437l493N772Q704
13585B0864K0686j1026k5899j1126M644j3610M14O566P118L123J6402J8028L2138
13572F8322L100j8533k2385k003j0526r932l444p861O154O587r618M029R486n296
$$ y = [13791, 24530, 13228, -3448, -6044, -13066, -14758, 3339, 16002, 14753, 7241, -9277, -8723, 6651, 17750, 21501, 22330, 15418, 1857, -1627, -3563, 16249, 33429, 20701, -7914, -7462, 7567, 2965, 6475, 28903, 16463, -19544, -36634, -22338, -7787, 653, -632, -8396, -10234, 4492, -11417, -23696, -6710, 12553, 2812, 12800, 4796, 803, -5062, 6707, 20806, -682, -8074, 9460, 14837, -15440, -22716, -20797, -12132, -2641, 363, -16363, -6086, -1267, -5467, 13428, 20050, 18598, 17804, 12634, 14007, 17030, 19122, 26783, 5097, -1556, 9881, 6388, 12160, 20864, 41550, 30524, 4625, -6501, -1857, -15467, -15053, -8487, -1369, 1754, 18156, 36184, 68322, 71422, 52889, 30504, 28501, 17975, 8043, 4599, -3262, 2892, 9479, -139, 3890, 13376, 8080]
13558H080O558O200j0755k5384o99J1189K1690o257j0078p839o031M639P459L85
13544h43k498J1142k4173j4837J1274P785P832j824m967N57k383N32p0j2057J4090
13529a0440R486P340N95p623J624J1920l015n629J7635L536N883J09j2403j45
13515A8873k45q455J3693n124j7420j2146j1707R536l118l081k758J004N301J7744
13501B097j221L425p754J2296l73Q763J5565j2704l024O890J2144o191j1377K681
13487B1217J3244Q387j4267o110K16J6953j5642o658n646L3J0418l208O101J0583
13473C5621K5558K871k226j1064j3316N175J6561k4853k4847j7740p423K44J3332
13460b107J1779k6424j4511J0596J7392J4812p376q39J4015P923M310j5688j2156
$$ y = [8080, 14638, 20838, 10083, -15301, -16000, -4811, 16879, 10622, 544, -7295, -13326, -8687, -1228, -843, -3341, 7801, -16372, -31209, -19935, -12150, -4318, -6142, -11109, -10552, -12935, -12403, -12473, -24530, -10440, -954, 6386, 6981, -642, 982, 12902, 9887, 4258, 21893, 25429, 31312, 31421, 19018, 18873, 18628, 10173, 23866, 18742, 1322, -10824, -22531, -12995, -16113, -19194, -21952, -20948, -15647, 2097, 876, 4301, -3453, 8843, 8470, 17233, 32798, 20094, 17070, 23960, 36104, 29913, 18536, 21217, 34461, 42848, 28581, 22471, 22687, 39640, 23998, 17340, 11694, 11727, 22145, 18937, 25038, 35621, 61179, 64050, 61824, 50760, 37444, 42619, 59180, 34327, 9480, -8260, -15683, -15439, -2107, 9672, -16752, -31263, -20667, -3275, 11537, 4161, 3322, 17337, 25260, 29570, 13882, 1726]
13447A726L639Q351m659q337j3395K7997J8068j1181L724m868L253o856m542J6138
13433B9058K2581m838K082N847k6410k7920r142K290K0467O050K941P924J545
13420C2475j6421j2729L852R887J1830j832r976o092O592j2494p456r133J2174
13407F77L640j2176P697J3311J9973q238j7519n466j5231j1504N533J6320K1923
13394A8940J1545Q13l045K562J060j3607j2597J3158K1866l066k0019n013k0261
13381g664j0584J8821O183L754k174J3961Q105k440J894m053J857J146j864j9557
13367G385j5291R920J2542p812J4460m561j4158J6297J0219r321p443J0735P858
13354C0830K240Q393j0540n561j391k0481L874J0441J546N473J2930n655q300
$$ y = [1726, 5365, 13716, 9057, 720, -12675, 15322, 33390, 22209, 25933, 21065, 24318, 17462, 12920, 29058, 51639, 46801, 48883, 54730, 28320, 400, -8742, -6452, 14015, 20065, 23006, 30930, 32475, 16054, 3325, 7177, 17064, 28894, 27062, 17086, 10994, 17586, 5092, -2364, -11497, 677, 4317, -7859, -162, 13149, 33122, 24884, 7365, 1899, -13332, -24836, -19303, -2983, 18940, 30485, 31298, 28253, 30815, 31875, 18268, 5671, 18829, 40695, 37629, 17610, 12597, -7664, -18248, 573, 6756, 10510, 8336, 22297, 30402, 27962, 29856, 25803, 27660, 28806, 26942, 7385, -7906, 2014, 14556, 6744, 21204, 16643, 2485, 18782, 29001, 19680, 12237, 22972, 30830, 33070, 41463, 30923, 25362, 23971, 3490, 7364, 17805, 19351, 24824, 37754, 32099, 23799]
13341B3799m784J5574J9462j4847r288L861L662J0737q291p170n286q070j0949
13328H410L925K5788m99p296j4251j3540n33J8395J4871j7175j7197M253O993
13315A2144O0j232k0603J944J0262k246N999p147Q718J222J129J06P14L54l68
13300A1056o563m721M353K0131J4344K522O51J1392K954j6052j2698o573j4817
13287E979n527N171j1067m138R296J8097N17l912K2325L219j8110j3684j345j739
13273E082k2382p104k335J0115J4423N901K052R614R211L752Jm408l0568l119
13259i765K1350M65J9809J9805l601j3699j5403M150K1479k944r570j0481l936
13246A7659L158O913p4r542N756R575j7448J8588R534r591j872N793J0431k0700
$$ y = [23799, 19015, 34589, 54051, 39204, 29916, 33777, 37439, 48176, 39885, 32715, 27429, 19359, 8410, 12335, 38123, 37624, 30328, 16077, 2537, 2004, 20399, 35270, 18095, 898, 5151, 12144, 12204, 10972, -9631, -7687, 2575, 329, 6328, -819, 7899, 9121, 10250, 10356, 11070, 11424, 11056, 4493, -228, 4125, 24256, 38600, 41122, 41773, 53165, 56119, 40067, 27369, 20796, 5979, 452, 5623, -5444, -9582, -286, 17811, 18328, 14416, 36741, 39960, 21850, 8166, 6821, 5082, -17300, -24404, -26739, -16624, -2201, 3700, 5752, 15366, 24577, 28329, 28330, 23922, -6646, -9765, 11585, 12050, 31859, 51664, 48063, 34364, 18961, 23111, 44590, 41646, 32076, 21595, 17659, 20817, 27730, 27656, 18114, 23870, 33445, 15997, 34585, 44119, 34528, 32656, 38449, 48880, 28180]
13232B8180j7628j0844r741Q611L2309P529L94q337j3500N848O255r180j1220
13219H676J9085L4198p423l5020n824M726R596k614k3643j8491L1244J5459M275
13206C4244K147j1077j4290o08K315J2497o409q456M386N4k1924j292J4615R246
13192A5448K71j26j2779p599j6280j2097J1499N209l690q957N549J7072N246R716
13178H482N246J3620J5569J472O320J653j6791j3462m768M117J8980R56j6875
13165B4519j4736L13o741p224p10j397J0301q533n837j1378O631m4k07J030P37
13150a3276R797J3186J1472O027J7586K1537j8061k8192Q727J771k9l495M241
13137C1291j3384l653K329K712N360o527j070j0956L920j3673j7814n98K1520
$$ y = [28180, 10552, -292, -10033, -1422, 30887, 38416, 38810, 30473, 16973, 22821, 29076, 19896, 8676, 27761, 61959, 54536, 19516, 13692, 18418, 28014, 25400, 1757, -16734, 14510, 29969, 34244, 36391, 25314, 11024, 10416, 12731, 25228, 18819, 10363, 14749, 14803, -7121, -8413, 6202, 15448, 15719, 15593, 2814, -4785, -21065, -33162, -21663, -16454, -20144, -29101, -23552, -6480, -1234, 8482, 13728, 27348, 42917, 44389, 50709, 52362, 35571, 22109, 17341, 21458, 40438, 41394, 24519, 9783, 10096, 3355, -3869, -4579, -5976, 4325, -4208, -10045, -21423, -14792, -14836, -15043, -14013, -13276, -3479, 9707, 21179, 27206, 44792, 66329, 48268, 20076, 28803, 30574, 30545, 27050, 31291, 17907, 14254, 16583, 19295, 24655, 18128, 17058, 6102, 10022, -3651, -21465, -22063, -543]
13124e43K4790o897q428R57J4796J1197j4267J2094n249j4665R129R434n768q847
13110A7733J7467J8530Q889j5212P053q083j4483R964J628j4896k6615O870J4534
13097B3379q559k6755J0562K8654J4438M266q035j1293n378J6491Q137m181j7
13084D1709Q042K0286K723R174J2474L4039K5869K1735j5117l5003j8925k1058
13072H5948j0651j4148J353J3143q855n959j8196j5501J4577P778q898m775l615
13059C2201k4461O955J2270k16j5232K376M316k0143j0221J0045K4430J3591O482
13046D2393J4553L32Q53l645j884P177J9059R704J9121L1415K5983L6963P5586
13033B77610J01957O2054P17p1870j14029p8582l5379j8972j9277p831j8982r582
$$ y = [-543, 24247, 17350, 8922, 9879, 24675, 35872, 21605, 33699, 28450, 13785, 22914, 32348, 26580, 17733, 35200, 53730, 62619, 47407, 54460, 46377, 31894, 41858, 43486, 28590, 1975, 8845, 23379, 14820, -11935, -1373, 27281, 41719, 45985, 37950, 26657, 21279, 37770, 45907, 41726, 41709, 49751, 70037, 72760, 81934, 94408, 128447, 154316, 176051, 160934, 125931, 107006, 85948, 75297, 61149, 62502, 75645, 66790, 60831, 42635, 27134, 41711, 49489, 40591, 35816, 32201, 7740, 14695, 26965, 26749, 11517, 13893, 18209, -1934, -12155, -2110, 22320, 35911, 42393, 56946, 57278, 58131, 54486, 52602, 59779, 78838, 88542, 107663, 139078, 165061, 202024, 277610, 379567, 441621, 442338, 370468, 256439, 177857, 142478, 123506, 104229, 96398, 77416, 67834]
13021F7834p472l731j2453j1931O977P995j2936L0359J7520M856r524j1550k612
13008F3332m130J1982J4442J4940J704m641P596L4023L2770K2056K9362M6507
12996B69943N7276Q3100J30310K16014L38235M95404O35299N93127J88352l40470
12986B666590o14978n98432m55726l01045j89721j01514n2994o5089m0013j6052
12976B31026k1634j3713k2398k5774j8995p283n106j7296m881J0759l790k1858
12964G9057k4640P596p15n663L068Q732L229R448m795o203O173J7978Q684k0813
12950H1136k7349l589J2064J7793q48K1833R481K3778L2804P095j9471m4306m3853
12937F6568k0967m217n538k5713K636L4825J6636k1253l121j797N315Q003K708
$$ y = [67834, 60362, 56631, 44178, 32247, 39224, 47219, 34283, 64642, 82162, 87018, 77494, 65944, 63332, 59202, 71184, 85626, 100566, 102270, 97629, 105225, 139248, 172018, 194074, 223436, 269943, 327219, 410319, 540629, 756643, 1094878, 1590282, 2225581, 2818708, 3007060, 2666590, 2051612, 1453180, 997454, 696409, 506688, 405174, 352180, 287091, 247078, 231026, 209392, 195679, 173281, 147507, 128512, 121229, 116123, 98827, 93946, 104705, 100915, 79057, 54417, 62013, 61298, 55635, 58703, 67435, 70664, 80112, 75317, 69114, 75287, 93265, 101949, 81136, 53787, 50198, 62262, 80055, 79207, 101040, 110521, 134299, 167103, 174198, 154727, 110421, 66568, 45601, 41384, 35846, 10133, 12769, 47594, 64230, 42977, 39856, 38059, 43374, 51377, 54085]
12924E4085P224p659k0137m025L066K428K178j9690m286O885j237K603q239O099
12910A9295J082j3851J4106J0796J2149L222J740J1086q016j1269M542P285j0269
12897D1898M963N652j4620l62Q78p189k633P809K0976j7895j9586o201N953K1097
12883D0740l222O62N16j230K812J8964k511j1347n592J0787J412o595j9611N337
12869C1122O492L577L227p508j3779j4577j881K6596n222k112J1184r164j2066
12856A5889Q691Q908j720M567P837Q926N213l677R88K8660M5308K0450k1846k2892
12842A05302k2137j6904j3556O09O900Q253q891n949r618r687k1098R35K1805
12829C5964N444l10k728j6706M931J9492J1428o441l339J281J451M17J3094Q016
$$ y = [54085, 61309, 53650, 33513, 29488, 32554, 34982, 37160, 17470, 13184, 20069, 18832, 21435, 13196, 19295, 20377, 6526, 20632, 31428, 43577, 46799, 48539, 59625, 51609, 40340, 44882, 52167, 41898, 46861, 52513, 37893, 37531, 38409, 31220, 28587, 36396, 57372, 39477, 19891, 13690, 19643, 40740, 37518, 38180, 38696, 37466, 40278, 59242, 56731, 45384, 39792, 50579, 51991, 45396, 25785, 31122, 37614, 41191, 44418, 36910, 23131, 8554, 6673, 33269, 28047, 25935, 37119, 27955, 15889, 24580, 33488, 31768, 36335, 44172, 53098, 58311, 54634, 55622, 84282, 129590, 150040, 128194, 105302, 83165, 66261, 52705, 53314, 60214, 68467, 59576, 53627, 44009, 34322, 13224, 14159, 35964, 41408, 41098, 38370, 21664, 26595, 46087, 57515, 51074, 47735, 49016, 50467, 50884, 63978, 71994]
12815G1994J096j3144o924n733Q621K0474o579o0n843K008M652L6103J5908J9323
12801A41896J9585K0613P712r769k4525n046J4567K2918J3113p616k0892k1214
12789A51342j0230j3063q92j6339M708M6825K5804L020j9683m699j2840r072j2001
12776A32880k0412j7500J2765K769k932j928J5851j871k2232l777k0183k1706
12764E1724J1812K6492J6635n994L688J0809L646K06k060m304O868j3844l207
12751A02471j0271P352K4600K027j1213k0141k6672P830P640r105j2594k2743
12739C9181O395M0053L3091K1035R132j0826k7713q824o75J7559N666L2523J1648
12726A68245k5761k779j574p423M194r681N652P2K383R063q201n705m76j5994
$$ y = [71994, 73090, 59946, 53022, 47289, 55910, 76384, 69805, 69745, 63902, 65910, 70562, 106665, 122573, 141896, 161481, 182094, 189806, 180037, 155512, 150466, 165033, 187951, 201064, 193448, 172556, 151342, 141112, 128049, 127157, 110818, 115526, 162351, 188155, 191175, 171492, 166793, 153953, 144881, 132880, 112468, 94968, 107733, 110502, 107570, 105642, 121493, 119622, 97390, 93613, 73430, 51724, 63536, 90028, 106663, 100669, 104357, 115166, 118812, 119018, 116958, 112654, 119522, 105678, 102471, 92200, 99552, 124152, 126179, 114966, 94825, 68153, 75983, 83623, 74518, 61924, 39181, 45576, 85629, 118720, 139755, 148887, 138061, 110348, 101524, 100849, 118408, 124074, 156597, 168245, 142484, 139705, 138131, 130708, 134902, 125221, 130873, 130945, 133328, 142391, 134190, 128485, 128009, 112015]
12712A12015k8422k6458j6612P774K54o444J3871K1456J3261K3224M0863J8662
12700A73444j961r5k298K0449L748j9767j5818p810R25K966K199J2213q831r791
12686A49573J2477J1821q338O032m74j955p048l67P868M309p030j8340k1120K9122
12672A56530O5114Q8041R5909J01715R5591K2175o2779q3910n0998M9100Q6422
12661E62910O1963j0559p7125p1291m1684j6457L493k9498m2672j906L8989J3846
12649C90009M511k353q098j6230k2739j4733J3125M298j670k89m165k554M868
12636C43980K5441K0825R315J6909N4278L9838L0913J7540J9730J4131N447j4141
12624E84206l2671m0146k1211j6277J1583K9091j3334j717J6384P523j3448J0091
$$ y = [112015, 83593, 57135, 40523, 48297, 48551, 42107, 55978, 77434, 90695, 113919, 154782, 173444, 171483, 171388, 169090, 189539, 193287, 173520, 157702, 149892, 150817, 153783, 155982, 168195, 159364, 149573, 162050, 173871, 165533, 171565, 171091, 169136, 162088, 161721, 169589, 173898, 166868, 148528, 127408, 156530, 221644, 309685, 405594, 507309, 602900, 625075, 562296, 478386, 427388, 476488, 562910, 624873, 614314, 537189, 465898, 424214, 407757, 411250, 381752, 339080, 337174, 376163, 390009, 394520, 392167, 384069, 367839, 345100, 330367, 343492, 347790, 346120, 345831, 341666, 339112, 343980, 369421, 390246, 399561, 416470, 470748, 510586, 541499, 559039, 578769, 592900, 598347, 584206, 551535, 511389, 490178, 473901, 485484, 514575, 501241, 499524, 515908, 523431, 509983, 520074]
12612E20074K3026Q133K5417L1985K9995J4812J5549Q612O125r128o005P736K2918
12599F99249J5633J5033K9376K8207J4487L0974O1089N5950J7590L5854M4889
12588A048331M5450M8939P3387R3248J39107K01309K51411K60536J30856m7970
12578B244604q8458q5288m5971J4514N8833P4432R8967J08762J25076J28475J17347
12567B751293J05478J39783J79811K08186K46115K66065L27846L94990M54133
12558E073700N57215O94337Q26394J003700J229199J525586J919662K331533K529876
12549A7691202K442945K483854L205858M649434O827336J0119611J5323459K4103310
12541H6847009L9217237O3964739R8470297J28261901J12034262K0376973q9175163
$$ y = [520074, 543100, 551233, 576650, 608635, 638630, 653442, 668991, 677603, 683728, 674600, 668595, 676331, 699249, 714882, 729915, 759291, 787498, 801985, 832959, 894048, 949998, 967588, 1003442, 1048331, 1093781, 1142720, 1216107, 1309355, 1448462, 1649771, 1901182, 2161718, 2292574, 2244604, 2156146, 2070858, 2024887, 2039401, 2098234, 2172666, 2271633, 2380395, 2505471, 2633946, 2751293, 2856771, 2996554, 3176365, 3384551, 3630666, 3896731, 4224577, 4619567, 5073700, 5630915, 6325252, 7151646, 8155346, 9384545, 10910131, 12829793, 15161326, 17691202, 20134147, 22618001, 25823859, 30473293, 37300629, 47420240, 62743699, 86847009, 126064246, 190028985, 288499282, 416761183, 528795445, 549172418, 459997255]
12534D59997255j33707700j11629563p1671886m2663590k6104210j6911031j1475529
12527D5833746p949151n562496l930528k936115k642379k899434k972477k537392
12519A4403774j960828j491452j211546j017809q43645p20707o37558n60798m94125
12510E465306m74267m17558l65004l53728k94472k52515k22384k15971j71213
12501B698194j54776j36953j15742q3024p9202r3794j07033j21574r6439o9734
12491A639923m2488l4196l6751n8449p2122n8552o2250m4612m9272l3192m7925
12480A100114n8904k7316k7401l1558j8535m0998k6845m2208k4783l0941l7707
12469G32918m6793k8155l0958l3070j9167r522j376Q504O211K7780N49j0352j3844
$$ y = [459997255, 326289555, 214659992, 142988106, 100324516, 74220306, 57309275, 45833746, 37884595, 32322099, 28391571, 25455456, 22813077, 19913643, 16941166, 14403774, 12442946, 10951494, 9739948, 8722139, 7878494, 7157787, 6520229, 5959431, 5465306, 4991039, 4573481, 4208477, 3854749, 3560277, 3307762, 3085378, 2869407, 2698194, 2543418, 2406465, 2290723, 2207699, 2128497, 2034703, 1927670, 1806096, 1709657, 1639923, 1597435, 1563239, 1526488, 1468039, 1395917, 1337365, 1275115, 1230503, 1181231, 1148039, 1100114, 1041210, 1013894, 986493, 954935, 936400, 895402, 868557, 826349, 801566, 770625, 732918, 686125, 657970, 627012, 593942, 574775, 565253, 563877, 572381, 578592, 606372, 606921, 596569, 582725]
12456E82725k6828k2976j7486j863Q642j9384k5703j5439j4415l6825k5899p607
12444C76942j0927j7796J5191K1253J1241Q355j200q284j1579j9240m0917j6010
12432C07029l484L572p946l0437l4892j8562j7644j0781L3003L3088k693J0449
12420B60702K5477J1217l546K3385R731k692j4741q305j184N028L8295K8014j4907
12407C56474m7685m6579k0592J8763K7712K3322O777p65K7k2103r481j3766j5040
12394B57064p824k200J275J2226J2030k214j2518k783O603k0708l2971o291Q411
12381B10100M606M082M714n335J436o959o664j4975J4020J7857q976j3666n147
12368A95093J3545J2494N621j6523j1971j1250j7415j5505p401N726l247l504
$$ y = [582725, 555897, 532921, 515435, 513572, 522214, 502830, 477127, 461688, 447273, 410448, 384549, 376942, 366015, 348219, 363410, 384663, 395904, 404259, 403059, 394775, 383196, 363956, 323039, 307029, 303545, 307117, 299171, 268734, 233842, 215280, 197636, 186855, 219858, 252946, 250253, 260702, 286179, 297396, 293850, 317235, 326966, 324274, 309533, 301228, 300044, 305072, 343367, 371381, 356474, 308789, 262210, 241618, 260381, 288093, 311415, 318192, 317427, 317454, 295351, 285870, 272104, 257064, 249240, 247040, 248315, 260541, 272571, 270357, 257839, 255056, 261659, 240951, 207980, 201689, 210100, 214706, 218788, 223502, 218167, 219603, 212644, 205980, 191005, 205025, 222882, 213906, 200240, 195093, 208638, 221132, 226753, 210230, 198259, 187009, 169594, 154089, 146688, 152414, 149167, 145663]
12356A45663J1995r432N182P491P95r658k5393l0896k128j1792j2015K0467k858
12343H7421K4053L2774p982l4648j7258j9965Q152L1980L5333J9468m002p822
12331A47504l454J5523L6370K8244m359k6596j6934r314k184K6421J6717J2043
12319B19981J8595N217J198K0327O9518P7506R0265J07221J22010R6835Q6288
12308I14961N9980J0442k2225l5628n8206o6870p4497p4826n8576p3729p8434
12297D42392o3932n4349n9158k2503o545j5125n815J2573k641j2512p606l195
12285B01584l4322o247P910j5526k6141J1074J5752N755j4634k4764j6242k405
12273A01794L271J5021o478J6841J4114J430r561k2326k955L901k069l0722l1449
$$ y = [145663, 157658, 148226, 153408, 160899, 161694, 152036, 126643, 95747, 93619, 81827, 69812, 90279, 87421, 111474, 144248, 136266, 101618, 84360, 64395, 72547, 104527, 139860, 159328, 155326, 147504, 144050, 159573, 195943, 224187, 219828, 193232, 176298, 166984, 164800, 191221, 207938, 219981, 238576, 243793, 244991, 265318, 334836, 412342, 502607, 609828, 731838, 828673, 914961, 974941, 985383, 963158, 927530, 869324, 802454, 727957, 653131, 594555, 520826, 442392, 378460, 324111, 264953, 242450, 235905, 220780, 214965, 227538, 224897, 212385, 204779, 201584, 167262, 161015, 168925, 153399, 127258, 138332, 154084, 159839, 145205, 120441, 104199, 101794, 105065, 120086, 113608, 130449, 144563, 145993, 136432, 114106, 111151, 115052, 112983, 82261, 50812]
12260E0812k2667J8727K4481j517j0837o614J5496K2222N923o590Q09j0277m026
12247G5942p608N263o249o96N652K177J0788J2479P607m311l2843j4859O558l402
12233E6498j2047j7708M289q991Q330K6130K4720R877J02K3326J6643j864J3153
12220A42458L6472M4887L1335N3848O1775N9481N2464L8696J1890p743l8381j8182
12208D69000k0908l1785l7133l6035l6273k0469l8196m1425l2331l0279k2186
12197A21980O074J0485J511J0200M41N033Q342J5813r355r013J4059J6976P602
12184B00148N068m442k8066l6469j0014r10Q609l993q215n320j3163L677O299
12171A13209O917n78q01J7874J219q660K8670J2850j4579M835k236j9612o002
$$ y = [50812, 28145, 46872, 71353, 69836, 58999, 52385, 67881, 90103, 96026, 89436, 90245, 79968, 75942, 68334, 73597, 67348, 66652, 72304, 74481, 85269, 97748, 105355, 101044, 68201, 53342, 59900, 56498, 44451, 26743, 31032, 22041, 30371, 56501, 81221, 91098, 91200, 114526, 131169, 129305, 142458, 178930, 223817, 255152, 309000, 370775, 430256, 482720, 521416, 533306, 525563, 487182, 469000, 448092, 416307, 379174, 343139, 306866, 286397, 248201, 206776, 174445, 144166, 121980, 128054, 138539, 140050, 150250, 150691, 155724, 164066, 179879, 170524, 161511, 175570, 192546, 200148, 205216, 200774, 172708, 136239, 126225, 125315, 133924, 129931, 121716, 116396, 103233, 106910, 113209, 120126, 119548, 118747, 136621, 137840, 129180, 157850, 170700, 156121, 160956, 158720, 139108, 133106]
12158A33106j0091K709K244J7099M58m037J0924P118L225M521Q80L511k623j4671
12144A54373j903J0284j9574q670j4116J6160q440k6069k129r541J1841M977j5966
12131I1227r587J5195K660o470j269k216O776j4323J202J9173N720q490N524Q141
12117A13263j7297j8010P989K987J080k973l848O70k274J1482J1227m348K1100
12104A21048O599j1768j0802K7250J1191J189j1476p175N472K1905J7233K7904
12092A98570K8618N3j6101J8462L5278K6675L1132N7489P0177Q4445J27718K22513
12080H85029L54138M98630N83874M17988k9407m89577o16664n06513l29560j93402
12070E74536j25255n9410k6985k6737j8818q744k6334j9021j8403j8366J4113
$$ y = [133106, 123015, 125724, 127968, 145067, 145525, 141488, 152412, 159530, 162755, 167276, 168156, 171667, 169044, 154373, 152470, 162754, 143180, 134510, 120394, 136554, 128114, 102045, 99916, 90375, 102216, 107193, 91227, 81640, 96835, 99495, 93025, 91756, 89540, 96316, 81993, 83195, 102368, 108088, 99598, 105122, 113263, 95966, 77956, 85945, 88932, 90012, 87039, 83191, 83861, 81587, 93069, 104296, 99948, 121048, 127647, 115879, 105077, 132327, 143518, 144707, 133231, 126056, 131528, 153433, 170666, 198570, 227188, 227241, 211140, 229602, 264880, 291555, 322687, 380176, 450353, 534798, 662516, 885029, 1239167, 1737797, 2321671, 2739659, 2710252, 2220675, 1604011, 1097498, 767938, 574536, 449281, 389871, 362886, 336149, 317331, 308587, 282253, 263232, 244829, 226463, 240576]
12059B40576K4677N706j0138k9780j8336p433M213j1135R103n081J750O251J276
12046B11649k5064l073J0952K2734J9672L723Q269J9453O446K9574K6739K3610
12034C54684J9159J2318K0157L7464J0434r647j2201k3776j2530N610r518j1807
12022C80347L629k917j8381p842l330r289r920N674N216L2607l886j8299o199
12009C47410L195k237j9376L593K7899P100l257j1484q898n737l521K1784M669
11996C61140J0211L1603K3855J9182L374q359q559o986J7454Q289Q790O442J9164
11983D85600L0467K5776R267j143J8813L0229M5086K9797R705R811Q805K3338
11971G25551L1568M2303K8621K2351K4257L4780K9261L3519M8838M9486K6428
$$ y = [240576, 265253, 270959, 260821, 231041, 212705, 205272, 209485, 198350, 207453, 202372, 204122, 210373, 211649, 186585, 183512, 194464, 217198, 236870, 240593, 248862, 268315, 274761, 304335, 331074, 354684, 373843, 386161, 406318, 443782, 454216, 444569, 432368, 408592, 396062, 401672, 392154, 380347, 383976, 381059, 362678, 354836, 351506, 342217, 332297, 337971, 343187, 375794, 371908, 353609, 347410, 350605, 348368, 328992, 332585, 360484, 367584, 364327, 352843, 343945, 338208, 334687, 356471, 361140, 371351, 402954, 426809, 445991, 449365, 441006, 432447, 425461, 442915, 451204, 459994, 466436, 485600, 516067, 541843, 551110, 549967, 568780, 599009, 644095, 673892, 683597, 693408, 702213, 725551, 757119, 799422, 828043, 850394, 874651, 909431, 938692, 972211, 1021049, 1070535, 1096963]
11960A096963L8242M1791O4648N9690N9140O7937R2817P3678Q2657J19328Q8152
11949A885043J18468J65570J68197J86018K17003K39473K61634L34876L66076
11940C942358M31741N38408O74326Q38756J088371J426197J955878K763953M046647
11931A7706635O006923Q773521J1878677J3313055R378039q12235j0026777j2250509
11923D3967329r515626o094613l645069k014781q75422J1814Q81373J918040L202286
11914B7835331M873123P071086R759935J2719147J5674290J8260250J9918940
11907A16112102K0054509J8373736J4860907R791934L575403l093572r299683
11900A70375336j4369914j7932968j9714269j9659163j8098240j5679272j2891576
$$ y = [1096963, 1135205, 1176996, 1241644, 1301334, 1360474, 1428411, 1521228, 1594906, 1677563, 1796891, 1885043, 2003511, 2169081, 2337278, 2523296, 2740299, 2979772, 3241406, 3576282, 3942358, 4374099, 4912507, 5586833, 6425589, 7513960, 8940157, 10896035, 13659988, 17706635, 23713558, 32487079, 44365756, 57678811, 67056850, 66244615, 56217838, 43967329, 34451703, 28357090, 24712021, 22697240, 21821818, 21833632, 22715005, 24633045, 27835331, 32708454, 39779540, 49539475, 62258622, 77932912, 96193162, 116112102, 136166611, 154540347, 169401254, 179193188, 182768591, 179675019, 170375336, 156005422, 138072454, 118358185, 98699022, 80600782, 64921510, 52029934]
11893E2029934j0066511p546556n489065l996792k990330k313542j893422j612901
11885A6120815j382624j231174j155188j081169j035975r93116r67813r02927
11877G370829q11315p08475o42280n62971m76049m08912l39978k83197k39803
11868B897849k08106j75094j42589j38489j27999j10238r1516j11086p5862o1375
11858A655495r5828q2857p3531n1242m0724m6072n8366o9137n0114l5255k5635
11847A026734l4555m2833n9587l1760j3412q887q200l5811m5979k4958k0706k2991
11835F77055j8160m749n440k0802j6504J3983k9372m2241k0452j5765M397J4724
11823E36674M063p969j2213m2267l7303r571l768j9509r517J106P02m177o670
$$ y = [52029934, 41963423, 34416867, 28927802, 24931010, 21940680, 19627138, 17733716, 16120815, 14738191, 13507017, 12351829, 11270660, 10234685, 9241569, 8273756, 7370829, 6559514, 5851039, 5208759, 4645788, 4169739, 3760827, 3420849, 3137652, 2897849, 2689743, 2514649, 2372060, 2233571, 2105572, 1995334, 1903818, 1792732, 1716870, 1655495, 1559667, 1476810, 1403279, 1352037, 1311313, 1265241, 1206875, 1137738, 1087624, 1052369, 1026734, 992179, 949346, 889759, 857999, 844587, 835700, 827500, 791689, 745710, 720752, 700046, 677055, 658895, 654146, 648706, 627904, 611400, 625383, 596011, 553770, 533318, 517553, 521950, 536674, 540737, 532768, 520555, 478288, 440985, 431414, 427646, 408137, 398620, 399726, 400428, 396251, 389581]
11810C89581j1115j9352k349K0435k7671n414k137q158n833k866k361l3008j7394
11797B72358q150K17N195j5439L076J4966Q97N19R543j8353J6309N997k6943k9364
11783B30828L270J2943L3399N499j1060k112J4230m226k069j7840j8355j0964
11771B33543r957K183J147J526J1300K301n146o910M656K1264q551j8616r290
11758B19450K448o315o172P907L177j8788j0571Q426N508k4743k1924n245J3123
11745A66281J1516N283l139k0179p601m610L201m771n758N546l16j0956j4985
11732A19512N302J2073N668q245j3406j5355j931J000J4611R967N774j076o080
11719A27814j7540k2651m850O08J593n705k693m091k2631j3253J3904M248L04
$$ y = [389581, 378466, 359114, 356765, 377200, 349529, 344115, 341978, 333820, 327987, 325121, 322760, 289752, 272358, 264208, 264425, 269620, 254181, 257257, 272223, 273120, 273639, 283182, 264829, 281138, 287135, 260192, 230828, 234098, 247041, 280440, 285939, 274879, 272767, 286997, 282771, 280702, 262862, 244507, 233543, 223586, 225769, 226916, 228442, 239742, 242043, 236897, 229987, 234643, 255907, 247356, 228740, 219450, 221898, 215583, 209411, 217318, 220495, 201707, 191136, 199562, 205070, 180327, 158403, 153158, 166281, 177797, 183080, 179941, 159762, 152161, 147551, 150752, 145981, 140223, 145769, 145453, 134497, 119512, 124814, 136887, 142555, 134310, 120904, 105549, 103618, 104618, 119229, 129196, 134970, 133894, 127814, 110274, 87623, 82773, 83381, 84974, 79269, 76576, 72485, 49854, 36601, 50505, 54753, 55057]
11706E5057K6160J556r889K496L653K777M724p91K4077J377j0462k6224j2449
11693F2062M59J2648r543J0796J9626M984j222j4798j7403o098K238J8431K2057
11680A04237l689m322J831j0296o628q076J3565N669O860j6620k5816j7641J2693
11667E1767J5550J0849M412q003j1584k0655o355J7575J5127K7042m647j1126
11655G9952p591M115J1792j686K365j6225q272k392M887K889p018J1829J4457
11642H9102k459q506r693j0285j5097M32J2263j1411J2482n314j3393J8399n254
11629E1266m53Q401O188P677o667r665M584L542J7726j1609j1157J9835J8739
11616I8407Q118k7052k8827l650K348p071j0032j1711q945K8500k70q210Q813
$$ y = [55057, 81217, 82773, 72884, 75380, 79033, 81810, 86534, 85743, 109820, 111197, 100735, 74511, 62062, 62521, 75169, 65626, 76422, 96048, 101032, 99810, 85012, 67609, 61511, 63749, 82180, 104237, 100548, 96226, 98057, 87761, 81133, 73057, 86622, 92291, 99151, 82531, 56715, 39074, 51767, 67317, 78166, 82578, 74575, 62991, 42336, 35981, 53556, 68683, 95725, 91078, 79952, 72361, 76476, 88268, 86582, 88947, 72722, 64450, 62058, 66945, 69834, 62816, 74645, 89102, 86643, 78137, 68444, 58159, 43062, 43494, 55757, 44346, 56828, 51514, 38121, 56520, 51266, 50813, 59214, 65402, 73079, 66412, 56747, 61331, 64873, 82599, 70990, 59833, 79668, 98407, 106525, 79473, 50646, 46996, 49344, 42273, 32241, 20530, 11585, 40085, 39815, 31605, 40418]
11603D0418j3235r16Q927j3169k8318j7151L927K8041J0634j0859j1707j0999
11591a4407l571J5989J9824K267L098l144Q708j828J1263K3568m912k1839j3445
11578B1571Q675K64P124o957J826N678J991j1469Q047P138J0946q109p661p913
11564C1151K17j0701M201j126K9K3352j2072j9774o437K57N359q103k800J0864
11550A4417J034J9478K0500q989N296J5700M800j7824l243j3997m910K0236l173
11537D9325k3771J011R553q279k699K7285n438M121q8r835O618M467L940q251
11523D7959O678R037j3956J11J9340J7003J4624K375q884J566J380m05j3395o813
11509G6620J1355K9600K5491K8094L3998M2145O2319Q0494Q3429P3253O5848R3103
$$ y = [40418, 27183, 26267, 35194, 22025, -6293, -23444, -19517, 8524, 19158, 8299, -3408, -14407, -17978, -1989, 17835, 20102, 23200, 20056, 28764, 26936, 38199, 61767, 56855, 35016, 21571, 30246, 30510, 37634, 30677, 32503, 38181, 40172, 28703, 36750, 43888, 54834, 46725, 39064, 31151, 31368, 20667, 24868, 23742, 23771, 47123, 35051, 15277, 8840, 9097, 14456, 6353, 3553, 14417, 15451, 34929, 55429, 46440, 51736, 67436, 72236, 54412, 51169, 37172, 32262, 52498, 49325, 25554, 26565, 36118, 27839, 25140, 52425, 46987, 51108, 51020, 41185, 47803, 52270, 56210, 47959, 54637, 63674, 49718, 49829, 69169, 86172, 100796, 103171, 94287, 95853, 97233, 96828, 83433, 76620, 87975, 117575, 143066, 171160, 205158, 247303, 309622, 390116, 473545, 546798, 612646, 705749]
11497G05749P5869L8453M1521J2027k6558l8709o9884q4831q2707q9804q1021
11486D00105q0316l5364m7656l4051j7967j8853k6858j8931j7728K612m893k8144
11474G1956P890o079o722J4428P557K752n682k439j3939q130o458j1417Q34J1709
11460E6260j18k2036j0378l088k3984j5796K288J3036J6190k51j745J3856K6294
11447E0528M154r275R95l681j9669Q27o778n754Q310l338J873K4357J3906j0153
11433D6302p163j27J0865j179N103j8415j7366L273r593j841K4742p951p24J455
11419B7381Q751p305K6032L896m0840j2010J2405L548q144j6081J0810L858r39
11406A1362J0519J9583o433j7035r978L151j2657O233J2805j0348K90m624K936
$$ y = [705749, 781618, 820071, 861592, 873619, 847061, 808352, 738468, 653637, 570930, 481126, 400105, 319789, 284425, 236769, 202718, 184751, 165898, 139040, 120109, 102381, 104993, 100100, 71956, 79846, 73767, 67045, 81473, 89030, 91782, 86100, 83661, 69722, 61592, 55134, 43717, 44551, 56260, 56142, 34106, 23728, 20640, -3344, -19140, -16852, -3816, 12374, 12123, 10378, 24234, 50528, 54682, 45407, 46402, 42721, 23052, 23879, 17101, 11347, 19657, 16319, 18192, 42549, 56455, 46302, 39139, 39012, 49877, 48698, 53801, 35386, 18020, 21293, 11700, 9859, 34601, 26650, 25926, 27381, 36132, 28827, 54859, 58755, 17915, 5905, 18310, 21858, 13714, -2367, 8443, 12301, 11362, 21881, 41464, 35031, 17996, 8018, 11169, -1488, 4745, 17550, 7202, 7492, 2868, 5804]
11393E804J1505N945l231P03J1924R85l807j5832k1996N578O055p89K324J3437
11379A8605j6908m922J3535k1510j2607K665J3474O668M053K3795J3815q436R713
11366D1940o771m022j5287p161n993q740o439k407O637o48N682k7076Q43K2008
11352g434J2515J5830R638R31L412p472j4714L243N268M668k889p365j3739o427
11338d535J698l1313n749J3689P172j6926J7998K2784J6622j5369n508P32P73
11325B068n684M5K4580J077j2642r225n36K6917P99k8834q272L130L688K2041
11311A9152j0944P47J2426O92Q579J2091j565q609m561J0183J2124q857q634j4779
11297A8045j2296n870K839J7205K8223q336k6784j125M951o432M675r524l209
$$ y = [5804, 17309, 23254, 20023, 20726, 32650, 33635, 29828, 13996, -8000, -2422, 3633, 2844, 5168, 18605, 1697, -3225, 10310, -11200, -23807, -21142, -7668, -1000, 3053, 26848, 40663, 32227, 41940, 35169, 31147, 15860, 8699, 2706, -6034, -12473, -14880, -8243, -8891, -3209, -30285, -29442, -7434, 5081, 20911, 30549, 31480, 34892, 27420, 12706, 15949, 21217, 25885, 22996, 15631, 1892, -4535, -2837, -34150, -39899, -26210, -19038, -35964, -17966, 4818, 21440, 6071, 563, 1295, 2068, -3616, -3571, 21009, 22086, 9444, 219, -317, 26600, 27399, -1435, -9707, -6577, -2889, 19152, 8208, 8955, 21381, 22073, 30652, 42743, 41178, 32569, 28008, 38191, 50315, 41458, 32824, 18045, 5749, -121, 2718, 19923, 48146, 39810, 13026, 11901, 16852, 10420, 15095, 5571, 2362]
11284B362N325r41k1867k585J2047R507R764r396j584Q731k796n11M118J267J7721
11269C1162J3270p537L628M049k1877k2116R399l52j2145r04k441k962J3698N264
11255A0136j2483J222R754N046l019j4650p807R721m318N56M337n069n701j7685
11241b9960J1957J111j13K1089m085j3721j3555N662O217j274O442N089J0050
11228D909o06j0193j3025N768L0884k2843J7710P481J0136J0178j4502o432J56
11215A9621q318n894J3115k3839k156n145j6292J0421J5796J0251k948n83L63
11202D392j287j1113J685P412r598j6724l389J6199J0405K786l818l69P106n173
11188a486J0768p93j3942K229L2067K329j0449j0298K439q609j4139Q475J8995
$$ y = [2362, 7687, 6746, -15121, -17706, -5659, 3848, 13612, 4216, 2632, 11363, 8567, 8056, 12174, 13441, 31162, 44432, 36895, 40523, 44572, 22695, 579, 9978, 9626, -2519, -3423, -5864, -8826, 4872, 10136, -2347, -1125, 8629, 13675, 10656, -3994, -11801, -2080, -6398, -5842, -1505, -6574, -12275, -29960, -18003, -16892, -17005, 4084, -1, -13722, -27277, -21615, -15398, -16672, -10230, -5141, 4909, 4303, -5890, -18915, -13147, 17737, -5106, 12604, 20085, 30221, 40399, 25897, 19465, 19621, 11303, 5409, 18524, -5315, -7471, -12616, -28908, -18487, -2691, 7560, 4612, 4029, 4392, 3105, -8008, -6323, 1089, -8509, -25233, -28622, -12423, -2018, 768, -3050, -3419, 3687, -1486, 9282, 8489, -5453, -3224, 28843, 31172, 20723, 10425, 12864, 4255, -9884, -1409, 17586]
11175A7586J6078j5356j0594j0666m488J82K5952O902j7260j5608k140j0067p720
11162b7199R963P44l427n60J6194J2079k625o538j7215Q821j0812r228J1406J0029
11148h368J3815K0678J6858M165J8784p51k2738k7063o34J0354j1388r319K832
11135G225k848J6172q86l050p763l94r34k0455k900J3377N062m24q631J4459j5882
11120g872O812O180M614J0799L75j1980M156J1898m500k2161j6303Q679j0710
11107b0013n196J077Q224o190K193o8K0133L355m861O506l316k3026J4616K6240
11093A9674Q346n032k2098k8097N523L751m153Q709K1450M755m558L295p628j2412
11079h475O091K90J9109J0364r948j4156m052j684r028l682J0366o691o045J4989
$$ y = [17586, 33664, 18308, 7714, -2952, -7440, -7258, 18694, 25596, 8336, -7272, -9412, -19479, -27199, -17236, -16492, -19919, -20479, -4285, 7794, 5169, -1369, -18584, -9763, -20575, -29803, -18397, -8368, 5447, 26125, 42983, 47148, 65932, 65181, 42443, 15380, 14746, 25100, 13712, 4393, 7225, 4377, 20549, 19663, 16613, 8850, 8456, 7522, -12933, -15833, -2456, 2606, 2182, -6449, 8010, -7872, -1060, 5120, 9734, 20533, 20908, 8928, 13084, 24982, 20482, -1679, -17982, -9303, -20013, -25209, -24132, -15908, -22098, -19905, -19973, 160, 3515, -1346, 5160, 1844, -21182, -6566, 19674, 28020, 22988, 890, -27207, -21684, -17933, -22086, -13377, 8073, 12828, 8270, 11565, 3937, -8475, -2384, -2094, 17015, 27379, 17431, 3275, -777, -2461, -11489, -15171, -4805, -11496, -17541, -2552]
11065b552l074K8836K311j7986N195O980j5011j6094j4467m931N874J0343J3691
11052h85K078N46M223Q462J7519J8676J8486K8402k595l892j4529j4866N965j7843
11038D9747O63J163J3628J8714L060J6731L7651m290q935n044j6858j7742Q592
11025I7080J9508J3529J4928J3246J8859L2933J895k5419l3829m3645K076M074
11013A15235J5420J3065n567J991K1715N504k8229j0408k2640k9086j7130j0022
11001D9848J0367R118n374k5439j0155J0060K4095j6456k6106Q00J1989l224J0325
10988C9848J1968J6578k3634j9115j096K671L081n251l055J2411K854J3069k4212
10975B6117j1930o08J3798N076K336l326k881j817J968j0331j5129l57j1352N59
$$ y = [-2552, -5626, 23210, 25521, 7535, 12730, 19710, 4699, -11395, -25862, -30793, -24919, -14576, -885, 1193, 1739, 5962, 14424, 31943, 50619, 69105, 97507, 94912, 91020, 76491, 61625, 67590, 49747, 50410, 51573, 65201, 83915, 86975, 103706, 141357, 137067, 128132, 123088, 106230, 88488, 97080, 116588, 130117, 145045, 158291, 177150, 210083, 211978, 186559, 152730, 109085, 111161, 115235, 130655, 143720, 138153, 140144, 161859, 167363, 139134, 128726, 106086, 77000, 59870, 49848, 60215, 69333, 63959, 38520, 28365, 38425, 62520, 46064, 19958, 20758, 32747, 29523, 39848, 51816, 68394, 44760, 25645, 24549, 27220, 30301, 25050, 21995, 34406, 37260, 50329, 26117, 14187, 13579, 27377, 32453, 34789, 31463, 28582, 26765, 28733, 18402, 3273, 2916, -8436, -7877]
10961g877O336o615p722J5158K1652J0312J046j2413j6418N274M427Q021R355
10948C0536n657j896N351N067o314j7950l629l059N254R932M267j6821Q37j8755
10934a2837q476K2718Q793q747p194p714R106K968L019l239L642r655j3622k377
10920b3615n121J4784J8732k072o598J3108j1469K817J0287R096J2649J159k5513
10907H244k223L058K029j2294P604J3970o655N22p604Q025R809P222L370j6444
10893A8633j9216L36J4857Q300N351r787j0724J1027J5883j5095k6261J2526R397
10880A5227R16j1073n370k584P419O561j0415k883L571j343M819J8029n495j0278
10866G101J172o688k923K8130N402j606o642P189N918j4794n562K1026J3293J234
$$ y = [-7877, -1541, -8156, -15878, -720, 20932, 31244, 32290, 19877, 3459, 8733, 13160, 21181, 30536, 24879, 22983, 28334, 33401, 27087, 9137, 5508, 2449, 7703, 17635, 21902, 5081, 5918, -12837, -21313, 1405, 10198, 1451, -5743, -13457, -4351, -1383, 1636, -1603, 2039, -7616, -21238, -23615, -28736, -13952, 4780, 2708, -3890, 9218, -2251, 566, 10853, 19949, 32598, 33757, 8244, 6021, 9079, 11108, -1186, 6418, 20388, 13733, 14255, 6651, 14676, 24485, 31707, 35077, 18633, -583, -247, 14610, 22910, 28261, 18474, 7750, 18777, 34660, 19565, -6696, 5830, 15227, 16143, 5070, -300, -2884, 4535, 11096, 681, -2202, 1369, 26, 4845, 22874, 17379, 7101, 8273, 1585, -1338, 26792, 32194, 30588, 23946, 31135, 37053, 22259, 16697, 37723, 51016, 52250]
10852E2250j7140o529m162J2178o856K748J4081l470j9908L805j2904k2909K777
10839f039J5379J260O919L317j1362k0841j009k047J0400K9667J917k3855N124
10826H830M944J1385m643N570K696J3743K521J1909r435j6056k686N834n310r753
10812A9549K2747K476j6421p990k3119j807r086J8008P181O956n830k9668j3936
10799c0940K2772K6074J0279k4114j1381R814j876q167k395K1914p332j9556p357
10786b2265R158O384m081l453O980j2011p549j2196l594J6104L2265L1444l850
10773C3336k0624Q01R59j5779k745L4876O377q27j1401k1425k0739J1986J5719
10760A0514N784J5287K0575m899j9850l351J1643L750P582o425p705j2138k261
$$ y = [52250, 35110, 28581, 24419, 36597, 29741, 32489, 46570, 43100, 23192, 26997, 14093, -8816, -6039, 9340, 10600, 17519, 20836, 9474, -11367, -12376, -14423, -4023, 25644, 27561, 3706, 8830, 13774, 25159, 20516, 26086, 28782, 42525, 45046, 56955, 47520, 31464, 28778, 34612, 29302, 19549, 42296, 44772, 28351, 20361, -2758, -4565, -13651, 4357, 11538, 18494, 12664, -17004, -30940, -8168, 17906, 28185, 4071, -7310, 2504, 628, -7539, -9934, 11980, 4648, -14908, -22265, -13107, -6723, -10804, -14257, -7277, -19288, -26837, -39033, -42627, -26523, 5742, 37186, 33336, 12712, 13513, 14472, -1307, -4052, 30824, 37201, 36374, 24973, 3548, -17191, -5205, 10514, 16298, 31585, 52160, 47261, 27411, 24060, 35703, 39453, 47035, 40610, 32905, 20767, 18506]
10747A8506L994K3587J4164l3634j1120k956M732M836N847R586q649p095r068
10734A2730J1948K5765J9149j0544j0473o364J945j9540O13L423Q15P732J8777
10721E5976J6245k736R279P610J9518J1859N880j044k3088r555o60n667q18L503
10707H6302j959k408j2729O812J9249o783L548K68l1009j042L0017K392j8947
10694G3711J0879k578j0942J076j2373K971O639M481m804m01R350j5065P262J939
10680G2145l757n268L786J4274J3811j168r36n151L641q053k8045r651l078j8
10666D2532J357R568L7964N401J7887K766r612q948n926K856J8600K0974J9416
10653A54835J5873p757J2466N701Q172Q28j2010Q291l420p890M979j2226J2593
$$ y = [18506, 22500, 46087, 60251, 26617, 15497, 12541, 17273, 22109, 27956, 37542, 28893, 21798, 12730, 24678, 50443, 69592, 59048, 48575, 42211, 44156, 24616, 25229, 28652, 29467, 37199, 55976, 72221, 69485, 78764, 86374, 105892, 117751, 123631, 122587, 99499, 89944, 89284, 83617, 82799, 86302, 84343, 81935, 69206, 76018, 95267, 88484, 92032, 92300, 61291, 60249, 90266, 92658, 73711, 84590, 82012, 71070, 72146, 59773, 62744, 69383, 73864, 69060, 68659, 78009, 62944, 70206, 72145, 68388, 63120, 66906, 81180, 94991, 93823, 92887, 87736, 91377, 83324, 55279, 45628, 42550, 42532, 43889, 53457, 91421, 96822, 114709, 117475, 107863, 98915, 92989, 95845, 114445, 135419, 154835, 170708, 162951, 175417, 181118, 189290, 190118, 178108, 186399, 182979, 175089, 180068, 167842, 180435]
10640A80435K4616L1863J2092K8465L0523K0061M2334O4063O9501Q3153N8183
10629F45289N1257N2165O3443R2238J28263J59411J95409K66575L95004N66265
10619B615319P94054J053406J423363J760407J809629J420204N62046k94142p35932
10610A0408354o74221k82387K76591R52193J773317K717516L577137L733462K571968
10601B5053930K53111j864153k666451k282595j302399j75144J019539K310789
10593B0346627L637010M642978M554455K493824j041904l962534m859092m122542
10585B1688822k773231j447611k41575R07720J924369K570172K290614P35759
10577B5655039j631980l428216l793113l113093k120682j226597m99186J09725
$$ y = [180435, 205051, 236914, 249006, 277471, 307994, 328055, 370389, 434452, 503953, 587106, 645289, 696546, 748711, 812154, 904392, 1032655, 1192066, 1387475, 1654050, 2049054, 2615319, 3409373, 4462779, 5886142, 7646549, 9456178, 10876382, 11438428, 11144286, 10408354, 9734133, 9451746, 9728337, 10680530, 12453847, 15171363, 18748500, 22481962, 25053930, 25307041, 23442888, 20776437, 18493842, 17191443, 17016299, 18035838, 20346627, 23983637, 28626615, 33181070, 35674894, 34632990, 30670456, 25811364, 21688822, 18915591, 17467980, 17226405, 18134125, 20058494, 22628666, 24919280, 25655039, 24023059, 20594843, 16801730, 13688637, 11567955, 10341358, 9842172, 9951897]
10569I951897N36025P25298M83780k03695j111940j734507j840654j584534j182539
10560D039131q71208o42729m65801l25180k42001j79696j43559j30574j11375
10551I27008j03256j05696p2090p8083n6044m3630k3483j3643k7399l7273k6815
10540C39596j3319k9624k6771j5759j8982n341O637j2750j1281O298o895k7853
10528A83956q074j6676o280l090O111J8001n769k1927L973n495J1388N413J0212
10515A71743p082j6025k2219l4368j9872p037J0804o687N855K0282l034r937M479
10502H6902j1082j9805k0107J6517J5905M811J3545J2880m112o119j0155l652
10490G5528J1031j2992r521N584M118m13p065J9215l810j9987N503J4188j2478
$$ y = [9951897, 10487922, 11213220, 11697000, 11493305, 10381365, 8646858, 6806204, 5221670, 4039131, 3167923, 2525194, 2059393, 1734213, 1492212, 1312516, 1168957, 1038383, 927008, 823752, 718056, 645966, 567883, 511839, 468209, 444726, 431083, 403684, 366411, 339596, 326277, 296653, 269882, 254123, 235141, 229800, 236437, 223687, 212406, 218704, 211809, 183956, 175882, 159206, 152926, 149836, 155947, 173948, 168179, 146252, 150225, 144730, 156118, 161531, 171743, 164661, 148636, 126417, 92049, 72177, 65140, 75944, 69257, 75112, 95394, 92360, 82423, 86902, 75820, 56015, 35908, 52425, 68330, 73141, 86686, 99566, 95454, 89335, 79180, 75528, 86559, 73567, 64046, 69630, 73748, 73335, 66270, 85485, 81675, 61688, 67191, 81379, 68901]
10477F8901j2690j7656N94J5973K0584K03n089O723k54M255q841j3146J7201J666
10463G8424l7733j4313K6245J3015j6221M789j0089p746O974p926j406j5702M147
10450B2458j4519J3123J4868K1065P326r737j0410M412j895K575R201J208j974
10437E7701j1782k2172m507L007j3864k2352M577J8585Q336J0484J7809O848j0432
10424D2238j1607j5500J334J2691k2709k239O939M926P85J738o369j0166j0826
10411h765J0224Q614l979O450n920R299J1911j0847k778J4425j452j6552J459
10398A2089R477r186J139O59o026j423L259j157O808Q321L356O444L86J46j0982
10383B3310j315l883j5139n844J3776j0332r569K7411j285j0755R071n489j3156
$$ y = [68901, 56211, 38555, 39149, 55122, 75706, 75909, 70820, 77543, 77289, 81544, 72703, 59557, 76758, 78424, 40691, 26378, 52623, 65638, 49417, 54206, 44117, 36371, 43345, 35419, 34013, 18311, 22458, 7939, 21062, 35930, 56995, 64321, 54584, 44174, 48586, 46691, 49266, 58467, 59675, 57701, 45919, 23747, 19240, 22247, 8383, -13969, -9392, 9193, 17529, 28013, 45822, 52670, 42238, 30631, 15131, 16465, 29156, 6447, 4208, 11147, 16073, 16858, 18596, 12227, 2061, -8765, 1459, 10073, 6094, 12544, 6624, 15923, 27834, 16987, 14209, 28634, 27182, 10630, 12089, 21566, 12380, 13519, 14178, 8152, 6729, 9988, 8831, 15639, 23960, 27316, 33760, 34146, 34292, 23310, 21995, 18112, 2973, -2871, 10905, 573, -8996, 18415, 17130, 6375, 15446, 9957, -3199]
10370c199J0983J5852k905p247O544J159R962K1559O687k3062K529m914j6199
10357A7749j1747O616j5332K136J4214J751R977k283n104j0778j9245O161N628
10344b57j1964Q523K1927K267j3003p022R500J8804P148j4451l417q338K665R153
10330B1535P831M39j6127j5228l118N98J4600P657N103L210j1341k0490r765J1307
10316c789J4640J1656m690k506J0156m724K713J3827J3869j2814j9019j3536r216
10303c433l268L149Q415Q056M978N849N72j125j0780o927j3353j3218k003k5584
10289d8672Q957K4208K728r411R901J6632J463N622N07j176q360M457k445N108
10275I519J569j1634r701N211J056q498m099m945J1379J3622n956O96J5270q659
$$ y = [-3199, 7784, 23636, 20731, 13484, 20028, 21187, 31149, 52708, 59395, 36333, 38862, 33948, 17749, 6002, 12618, -2714, -578, 13636, 15387, 25364, 23081, 17977, 7199, -12046, -5885, -257, -12221, -3698, 18229, 20496, 7493, 471, 9971, 28775, 35923, 21472, 18055, 9717, 12382, 21535, 29366, 29805, 13678, -1550, -4668, -4070, 10530, 18187, 23290, 26500, 15159, -5331, -15096, -3789, 10851, 22507, 17817, 15311, 25467, 20743, 23456, 37283, 51152, 38338, 19319, 5783, -3433, -6701, -3552, 4863, 12919, 17897, 23746, 24318, 23193, 12413, 5486, -7867, -21085, -23088, -48672, -39715, -15507, -12779, -22190, -12289, 4343, 5806, 11428, 11935, 10759, 2399, 6856, 4411, 9519, 11088, -546, -10247, -5036, -3980, -12478, -16577, -21522, -10143, 3479, -2477, -1781, 13489, 4830]
10261D830K048j041J1300N319j587R488P131o283k2858j9005o978J1543O411j857
10247a539j7059K981m200J8224J780q152N805J3625nk0467KJ2699L826J2380j2421
10232G479m712n53k272m2k798r284j3630O943M596J2575J9757l522k3451m328
10218a3242K1319j3650p486l72K59K1051n048j4587Q639N814n020j0880P840K2178
10204A6815J4455j9723j1915j771l364N917J7897J61p279q175j1905K7824K2809
10191D1746l992q904M399J5872K590n042j1239l837J8793L650J4551o20j640J1330
10177G7657n414j1572n559q79J641j00p912j6726J8309K1999K0533L3833J2147
10164A37957p074j8416o634n985k856J2483K3584J3862J8198K6602J2477J0072
$$ y = [4830, 6878, 5837, 17137, 22456, 20869, 30357, 37488, 31205, 8347, -10658, -17636, -6093, 318, -1539, -18598, -15617, -19817, -1593, 187, -7965, -2160, 11465, 11460, -9007, -9005, 3694, 7520, 19900, 7479, 2767, 2214, -58, -100, -2898, -12182, -25812, -18869, -14273, -1698, 18059, 14537, -8914, -13242, 8077, -5573, -13059, -13431, -13172, 7879, 2831, -11756, -3117, 2697, -2323, -13203, -5363, 16815, 31270, 11547, -368, -2139, -5503, 414, 18311, 18472, 11193, 3018, -8887, 18937, 41746, 37754, 28850, 33249, 49121, 51711, 46669, 35430, 31593, 50386, 54036, 68587, 67967, 66327, 77657, 72243, 60671, 55112, 54233, 55874, 55774, 47862, 31136, 49445, 71444, 91977, 125810, 137957, 130883, 112467, 105833, 99848, 96992, 109475, 133059, 146921, 165119, 191721, 204198, 214270]
10152B14270k1586j7371k2975k7192k9504q921J2532O159K8167M1934K3204j7221
10140A81496q621l6875l0787l4844l2106j6430J2266n152K2822J1361k0043p460
10128C5627k012j3725j358P037J803l303r203M922Q871r658J0582j3586k5737
10115i740l195R020O726J1068J5684m177j1863j8863J914K1532J7536j2469m2139
10102a8966k2655Q587K9625K196n60q584j3849j2020l499l895M483L1970J8162
10089A0995J0914q116l216J0467K809j036j736k1035o358j4466l785Q736P392
10076h435l734K31k260j0068J0515K4764K717j4359J4369q93j1039J4928L939
10063B0675M493j919j6742k1210l000r847K0204R992j1652m798R36K117K425m635
$$ y = [214270, 192684, 175313, 152338, 125146, 95642, 86721, 99253, 105412, 133579, 175513, 198717, 181496, 172875, 136000, 105213, 70369, 38263, 21833, 34099, 28947, 51769, 63130, 43087, 35627, 33615, 19890, 18532, 25569, 27372, 24069, 14866, 19788, 28659, 19001, 29583, 15997, -9740, -12935, -3915, 2811, 13879, 29563, 25386, 13523, -5340, -3426, 18106, 35642, 23173, -18966, -41621, -33034, -3409, -1213, -1773, -10357, -24206, -36226, -39725, -43620, -39137, -7167, 10995, 21909, 13793, 10577, 21044, 23853, 22817, 21081, 46, -6312, -20778, -24563, -15827, -8435, -12169, -11938, -14198, -24266, -13751, 11013, 13730, -629, 13740, 12847, 1808, 16736, 20675, 25168, 23249, 6507, -14703, -17703, -27550, -7346, 2646, -9006, -13804, -12868, -10751, -8326, -12961]
10049a2961j2669J9845J1514q528N785n730r919r67J7188r135j31k297n532j8512
10035c2049o418K3138J5129L500J2076j612q413j1345p469j2266R40K429J0441
10022a1919P238K150m753p622l116J8882J3824p395R316J6438j4834m937q137
10009E135r732o190J4168J338J6754R158l607M598j0466r517o267j0940J264O933
9995B629j8634j3536J7168j640L399L175n120j1217J926Q852J0025j1298r415
9982b3686j0895M97q168O096L2836p397L830L949M898o040j0331J4830J5250j6714
9968a045j7224J674N145J9673J8580J2260R810j8399j2437m073l619K612j6817
9955c860o944J4300L919J6358j2220j2596l361J0995J820O124p720k0637J318
$$ y = [-12961, -25630, -5785, 5729, -2799, 2986, -2744, -12663, -13630, 3558, -5577, -5708, -8005, -13537, -32049, -38467, -15329, -200, 3300, 15376, 13764, 5351, -5994, -13463, -25729, -24789, -22360, -11919, -4681, -2531, -7284, -14906, -18022, 860, 14684, 7289, 16605, 33043, 18209, 13272, 5135, -4597, -10787, 3381, 4719, 21473, 30631, 27024, 31622, 21156, 11639, 5372, -5568, -4304, 2629, -16005, -29541, -12373, -14013, -10614, -7439, -12559, -23776, -21850, -12998, -2973, -14271, -23686, -34581, -34084, -42252, -36156, -3320, -10717, -6887, -2938, 1960, -4080, -14411, 419, 15669, -1045, -18269, -16595, -11450, 8223, 26803, 39063, 48873, 30474, 18037, 13964, 10345, 12957, -3860, -10804, 3496, 7415, 23773, 11553, -1043, -4404, 6591, 8411, 14535, 6815, -13822, -12504]
9942a2504M806O514J2762J1741l019j5130n129J2899L4224J5341K3555N8350M860
9929A49270n9544l8430k0839k0926j0789J47P485O309j5224p21K4523M152L270
9916B8683r756j5764r509m224J5605J0534l6589j4759J1028O315j4736O61J6008
9903a6503R002n724j351p763J6680J0566P961k2379n301M113l488L099J0900n315
9889e503q837L547M096K6697J6311j7248j5015O390o674R553n962j7675O386J3486
9875I552R922Q236j4694l432k240m545n400j9889j4078l158K1734K3860k322k2822
9861a9276J8173Q832j4794M508K3753p500j1632R215L55J315q171k2525l433J4522
9847f658l042j3167J5144J6120j339j0512l256m417j978k72q416j1484J1390M630
$$ y = [-12504, -7698, -1184, 11578, 23319, 20300, 5170, 41, 12940, 47164, 62505, 86060, 144410, 149270, 89726, 51296, 30457, 9531, -1258, -1111, 6374, 12683, -2541, -3262, 21261, 25413, 28683, 18927, 3163, -6346, -10570, 5035, 15569, -21020, -35779, -24751, -18436, -33172, -32511, -16503, -7501, -13225, -14576, -22339, -5659, 4907, 12868, -9511, -14812, -10699, -14187, -11088, -188, -5503, -14340, -10793, -6697, 20000, 36311, 19063, 4048, 10438, 3764, 13317, 7355, -10320, -3934, 9552, 19474, 27710, 13016, 9584, 7344, 2799, -2601, -22490, -36568, -39726, -17992, 5868, 3546, -19276, -1103, 7729, -7065, -2557, 21196, 13696, 2064, 11279, 11634, 12949, 4778, -17747, -21180, -6658, -9700, -22867, -7723, 8397, 7058, -3454, -6710, -11127, -13105, -13377, -21793, -33277, -21887, -17257]
9833a7257J5316J2539j0213j23k18J0492J165p68M886j56j3562k8391o084Q213
9819b4161J5338k258J7070K324J685O223J5776m126K846L893j6561j4254J4692
9806A8487L087m082k1084N553l186J2167N160Q25n503J183J0887k108K496K18
9792B4100J5355K4188M6P066J0805J9099L4589O9612Q6994J70562L38480M82614
9780A283510M47240J12168l28970n23031l93077k31207j14411n6014n0633k4503
9770A21072k1801o009j2872k2599j5813k4677Q650R017j0451k4162n571m684J6536
9757F636J5440Q63l470R68o173j6283n000Q299o330O003q327j4188p51J423K4181
9742C291J7475Q019k3778l3357O63J0695K1947q179j6685j1731l986R985Q794
$$ y = [-17257, -1941, 10598, 385, 262, 44, 10536, 11701, 10933, 15819, 15663, 2101, -26290, -32374, -24161, -8823, -11081, 5989, 8313, 9998, 16221, 31997, 27871, 30717, 34610, 18049, 3795, 18487, 21574, 17492, -3592, 1961, -1225, 10942, 16102, 16927, 11424, 12607, 23494, 21386, 23882, 24100, 39455, 63643, 63689, 70755, 81560, 100659, 135248, 204860, 291854, 462416, 800896, 1283510, 1730750, 1842918, 1513948, 990917, 597840, 366633, 252222, 196208, 145575, 121072, 99271, 93262, 80390, 57791, 41978, 17301, 25951, 34968, 24517, 355, -5216, -9900, 6636, 22076, 22939, 19469, 20437, 14264, -2019, -7019, 1280, -5050, 953, -7374, -21562, -22313, -20890, 3291, 20766, 28785, 5007, -28350, -27687, -16992, 4955, -3224, -19909, -31640, -35626, -25641, -16847]
9729a6847J633K2137J979n441k3632M804R725L025l716J372N67M062j150J138
9715c44j2616k3535N34K4575O11N245m856l888j000l0412L1790J8037K548L426
9701A0115J7303K0407k2604j9671l882N31j2732J620l513J7735R578j369r76P50
9687A3292j1395R55J0163n12K4478j758p072J1069J893j0795k9688j7685J264
9674a5791J6095P286J4795l18m736l152k291j9587k7782m21J9128J8206K3222
9661B4654R97p939r210M246J3242K3895Q779k341j9851l146j2508l3163N288M890
9647b167Q028O146Q419l575k2664j058J5724J4094o466L32L227J947q117o461
9633G409j6500k141M834K341j1706O701m991J3481r086j742L377K464p440K1255
$$ y = [-16847, -15214, 6923, 8902, 3461, -20171, -15367, -5642, -2617, -6333, -4961, -4394, -332, -1482, -344, -12960, -36495, -35961, -11386, -10775, -5530, -10386, -14274, -15274, -45686, -13896, 4141, 6689, 10115, 27418, 47825, 25221, 5550, 1668, 2199, -10533, -8913, -12426, 5309, 14887, 13518, 12542, 13292, 1897, 2852, 13015, 12503, 36981, 35223, 28151, 39220, 41113, 30318, 630, -17055, -15791, 304, 7590, 22385, 22067, 17331, 14179, 11888, -7699, -35481, -35902, -16774, 1432, 24654, 25651, 17712, 8502, 12748, 25990, 49885, 58664, 56323, 36472, 33326, 20818, -12345, -7057, -2167, 5861, 12007, 20426, 16851, -5813, -6871, 8853, 22947, 16481, 16813, 20040, 21987, 13870, 7409, -9091, -11232, -6398, -4057, -15763, -9062, -14053, -572, -9658, -11400, -8023, -5559, -12999, 8256]
9619H256k465j514o277j6706j4279l925R536K4350m591n341Q787p29J7398J484
9605A3984l606q706k302q133j2020L0064K9765J7352K240l4916k3142l885j0225
9592a3530J9809R927q477j3704j8216r19J3857j1367j0541J1657J7630l006k3901
9579c0781r282J0346J0949P05L532j0059L324L7015O557k073m889j4877l162J442
9565a253L489P107r24j8236j7318Q718P26J0423J3688J3461L432k01j7337M171
9551I946L05J0543J0998j0074n125P909K769q650j2963Q725J3550j2187m792l807
9537G147m167j1640P890J005o568J0136n296Q738J7849k6342j8501J4297M620
9524h32r244m523n315k884L061K365j4993r988J2296Q472O069o251O209J0046
$$ y = [8256, 5791, 4277, -2000, -18706, -32985, -36910, -27374, -3024, -7615, -12956, -4169, -4898, 12500, 13984, 10378, 1672, -630, -8763, -20783, 9281, 39046, 56398, 58638, 23722, 580, -3305, -13530, 6279, 16206, 7729, -5975, -24191, -25110, -11253, -22620, -33161, -21504, -3874, -6880, -30781, -40063, -29717, -18768, -18063, -14531, -24590, -21266, 15749, 22306, 20233, 15344, 467, -2695, -1253, 2236, 9343, 8419, -9817, -27135, -18417, -17691, -7268, 6420, 19881, 23313, 23112, 5775, 9946, 10251, 20794, 31792, 21718, 16593, 24502, 27271, 18621, 5658, 14383, 27933, 15746, 10954, 7147, 2980, -8660, -770, 235, -6333, 3803, -1493, 7245, 25094, -1248, -19749, -5452, -832, -10076, -14599, -19914, -22798, -19737, -17372, -32365, -42353, -30057, -21585, -15516, -21767, -15558, -5512]
9510e512r131J8315J7343j497P381J1804m363j0558k9754J7029J1979r736n535
9497G765j7357o184O793J3647J6242K088j7441p304O320j9599o655J5942J7412
9484A1669j1064j4951N892R127l495j1238M683J261k660j34N284p89O482K252
9470B319O537K0790o571k2252j6555J1705O245J4830J2048J9071J1614j1362j9845
9457B8574l0366l3453j064R566J1720O132j5145L405J0669N784n627j0020J7919
9444a906Q64j0960m044J7231J786J741l038r388q806j2075J0148J1040J2622j969
9430C246q366O419J4829l530j6333j2886K1071j7363k5346q169K4241K2378j1350
9417a1159n074Q167J0942R451J6553k826J0920J0508j7585j6711n815k2620l22
$$ y = [-5512, -14643, 3672, 21015, 19518, 26899, 38703, 34340, 23782, -5972, 11057, 23036, 13300, 7765, -9592, -15776, -8983, 4664, 20906, 22994, 5553, -1751, 4569, -15030, -21685, -5743, 11669, 605, -14346, -8454, 673, -2822, -14060, -9377, -8116, -10776, -10910, -5626, -6415, 67, 2319, 8856, 29646, 23075, 823, -15732, -4027, 2218, 17048, 29096, 48167, 59781, 48419, 28574, -1792, -35245, -36309, -26743, -15023, -8891, -24036, -20631, -9962, -4178, -9805, -19825, -1906, -1042, -12002, -16046, 1185, 2971, 4712, 1674, -7714, -16520, -28595, -18447, -7407, 5215, 3246, -5120, 1299, 16128, 12598, -3735, -16621, 4450, -12913, -38259, -46428, -22187, 191, -11159, -16233, -8066, 2876, 12327, 28880, 26054, 36974, 47482, 29897, 13186, 7371, -15249, -15571]
9404a5571k606P284J1278K631J2496J16j2630J2435J3011q520l0719m982J4545
9391a232k103k1241Q19J561o516J4247J974p980L538P631R812J1614r009l0341
9377b7226j2136J8072J1493N535m326j499q379M658J7578J2128k429j5586o663
9364h780j2268L383p90N576J9838R485L620N024p731k4828j7951N584m132k2218
9350d6188P723K9874J3224m440j2731Q700Q796O696o134L623k637J1533O251J6358
9336D0648M20k2267k8650k257P740J0997o737O258j4075p642J4015j2112O972
9323f690M835L735J4379J6350k186j6115j9389j0199J1161O790J5304k509J7276
9310C2742J1037L929j6219j6007M818j7815k1441Q191L984R01J0207l117j799
$$ y = [-15571, -18177, -10893, 385, 3016, 15512, 15628, 2998, 15433, 28444, 19924, -10795, -15777, -1232, -3335, -24576, -23757, -22196, -28712, -14465, -12491, -20471, -16933, -9302, 510, 12124, 3115, -27226, -39362, -21290, -9797, -4262, -8588, -10087, -18466, -13808, 3770, 15898, 13469, -2117, -8780, -21048, -17665, -18455, -12879, 6959, 16444, 20064, 25088, 17357, -7471, -25422, -19838, -23970, -46188, -38465, -8591, 4633, 193, -12538, -3838, 4958, 11654, 5520, 9143, 6506, 18039, 24290, 40648, 41068, 18801, -9849, -12106, -4366, 6631, -106, 6152, -7923, -15565, -1550, -13662, -6690, -1855, 1880, 16259, 32609, 30423, 14308, -5081, -15280, -4119, 2671, 17975, 15466, 32742, 43779, 47708, 31489, 15482, 20300, 2485, -18956, -10765, -6781, -5880, 4327, 1210, -589]
9297e89j72M746J1056J456j9300k59Q01l287N319L161N657k2385j9553R061j703
9282b5991K95J0555J3017K019p56k276j285j918N308o405j224Q747r541o358J4177
9267a636J2777K064j2291l184m153j8048R117R596Q62P200L2M629j8519n027k449
9252a9030N582j230j2115j2832l329K866K3088P194J432m046J913j7377L283K7580
9238B979m173n366p326O451k974J6663K177O561k302j035j469m627j8294r440
9224b2175j972j3682J0703l136R150J1267j9395l241J0301j0271r700J3506N366
9211b3279M692K2250j3044M254k348j524r495r648k084M804n416J3458J8139P300
9197H059j9985K596K1933J328n881J4444j7799q114j1078P865J064r746J215q207
$$ y = [-589, -761, 3985, 15041, 16497, -2803, -3062, -2261, -5548, -229, 2932, 8589, -13796, -33349, -24288, -25991, -25696, -15141, -2124, -105, -861, -3137, -4422, -6340, -1032, -7437, -8661, 86, -9455, -15813, -1636, 11141, 13205, 914, -2270, -6423, -24471, -15354, -5758, -4896, 2304, 2336, 6965, -11554, -16581, -19030, -13448, -14678, -26793, -39625, -42954, -40088, -17000, -9806, -8374, -12420, -10507, -27884, -24601, 2979, -1194, -6560, -13886, -7435, -10409, 6254, 8431, 14992, 12690, 11655, 10186, 5559, -12735, -22175, -24147, -37829, -27126, -30262, -21112, -9845, -29240, -32481, -22180, -32451, -42151, -28645, -23279, -18587, 3663, -9381, -5127, -7475, -8999, -18494, -28142, -30226, -25422, -30838, -17380, 759, 8059, -11926, -9330, 12603, 13931, 8050, 22494, 4695, -3419, -14497, -6632, -5568, -15314, -14099, -22306]
9183b2306J7117J8125k686p236r016m510J3774J9858N594n235p925j0892o834
9170b172n889K027n88K07J2051P243n959R1Q85l913K00R071p230m215k332O234
9154E711n740O278n146l362J1044o893K043L3k919K2202r510j7173l565M0j2351
9139a9308k381K6092J654m893j5445J8303J4340L894j4829l346P0o504J226p504
9125h631J30l936J7373k046j0327j0950p962J1145Q378N090p776k586m455O613
9111i940Q129J798Q195k570L747K0267n474Q41N846J7124j1101m370j5178j4627
9097B687q953K004p668N37K0538J5124l544J9151m509l1339o554j4581J296K215
9083a3596R185q01n112Q715J3716K5937p482k3318k360J2946K8244j7295k9015
$$ y = [-22306, -5189, 12936, 10250, 3014, -6002, -10512, 3262, 23120, 28714, 23479, 15554, 4662, -2172, -8061, -6034, -6622, -6415, 5636, 12879, 6920, 7011, 7896, 3983, 4183, 13254, 6024, 1809, -523, 5711, -29, 6249, 1103, -2259, 8785, 1892, 3935, 3968, 1049, 23251, 13741, -3432, -6997, -6957, -19308, -21689, 4403, 6057, 1164, -14281, 4022, 18362, 22256, 7427, 4081, 4151, -2353, -1127, -8631, -8501, -12437, 4936, 2890, -7437, -18387, -26349, -15204, -6826, -1736, -9512, -12098, -16553, -9940, -1811, -13, 8182, 5612, 9359, 29626, 24152, 24993, 30839, 47963, 36862, 32492, 17314, 2687, -6266, -4262, -11930, -11393, 9145, 24269, 20725, 39876, 35367, 4028, -2526, -17107, -15811, -13596, -4411, -5212, -10324, -1609, 12107, 38044, 30562, 7244, 4884, 17830, 46074, 28779, -236]
9070b36Q585j0926r368R680j5907r875J0785P790m834m51J544N304n142K456L183
9055g412q750J7876m103L139P492o577O39k430K44m560Q126L754R312l685q617
9040D448N84J0975K630j0281o832J1853o259N639Q611m239j3651j7555k5600O355
9026c3322L1843J6823j3374j0864M522j4519m338J9308O085j2737l861J219j1537
9013b4752m147K4197p77j4243q70k804j0982R068K0895R3m538O80K8422j5849
8999D393m772J1747O052N905j1813q482l586P732n153k444j0444l121J0544J0869
8985G427j4892m442J4136M838j5823j3400j1838l406R692J7121J7723K0195K2136
8972D9467l0076k0699k599M457J2773M420M930p03m263L065k154j7465p841L02
$$ y = [-236, 8349, -2577, -11945, -2265, -18172, -28047, -17262, -9472, -14306, -14757, -13213, -7909, -13051, -10595, -7412, -16162, 1714, -2389, 750, 8242, 1665, 2304, -126, 118, -4442, 3684, 7438, 16750, 13065, 4448, 5032, 16007, 18637, 8356, 1524, 13377, 7118, 12757, 21368, 17129, 3478, -14077, -39677, -33322, -1479, 15344, 1970, -8894, -4372, -18891, -23229, -3921, 2164, -10573, -14434, -13215, -24752, -28899, -4702, -5479, -19722, -20592, -23396, -34378, -25310, -4415, -4322, -8860, -8180, 20242, 4393, -379, 11368, 17420, 23325, 11512, 3030, -556, 7176, 2023, -421, -10865, -13986, -3442, 7427, -7465, -11907, 2229, 7067, -8756, -22156, -33994, -37400, -27708, -10587, 7136, 27331, 49467, 19391, -1308, -3907, 550, 13323, 17743, 22673, 21970, 17707, 20772, 18618, 1153, -6688, -6386]
8958f386K0047Q898K404Q89j3003P986p570J01m18m659j3681R961R915L348j9190
8943a358n490J1984J029r675P408Q622k093K0384Q963Q969n282k3179J4800Q359
8929D3441L975j8571j2360k990J0658m858n090k71j1247N48M386N394K0437J7661
8915E1113n459P288k9783k0615P284o422j2257k986O887O954k5661l214K1961
8902d910R064k724j4881k2296Q081K349n559K7185J1664k6764O55R597N231j619
8888d927j1159Q716R78r55l795N047J2390m950J3349p934j8660L495J781J0172
8874C548J40P886r165m913n70R759Q385J932j5475q640m077j182k328o548J8382
8859b866J4117j617N207o663k9730l957J1210J0692k575J4582l758j7068o451
$$ y = [-6386, 13661, 22559, 24963, 25852, 12849, 20835, 13265, 13366, 12948, 8289, -5392, 4569, 14484, 17832, -1358, -6848, 5136, 6165, -3510, 3898, 12520, 10427, 30811, 39774, 48743, 43461, 20282, 35082, 43441, 47416, 28845, 16485, 13495, 24153, 19295, 14205, 13934, 2687, 3235, 7621, 13015, 33452, 51113, 45654, 52942, 23159, 2544, 9828, 3406, -8851, -11837, -4950, 2004, -23657, -26871, -4910, 4154, 1430, -13451, -35747, -27666, -25317, -30876, -3691, 7973, -18791, -18136, -8539, -3308, -4927, -16086, -7370, -6392, -7347, -11142, -6095, 6295, 1345, 14694, 6760, -11900, -8405, -6624, 3548, 3688, 11574, 2409, -2504, -3074, 6685, 15070, 17002, 1527, -7113, -11190, -12372, -14700, -21248, -2866, 11251, 9634, 14841, 8178, -21552, -25509, -14299, -3607, -6182, 8400, 4642, -12426, -18877]
8846a8877J4805Q070J0444J8926L032k434J9376j3049k0339m865q999m790q104
8833f804k1220l872N523O450Q631R025k6137J1184K3196j6444k3118n421J6218
8820b2789P224K4911J3600n048m919j6710j5495k2J769P225K0893K687k9502j984
8806a8160O958j4972J4802l368M6J1075p704P482o690M036J2914o076k2589L278
8792a8968J1340K5339m287j1444P355P383j3035k5733l521j119j0401N929J4386
8779a6776J0976n217R07N882j1026J8269J2528q751j3989J1337J8673L392j0873
8766A5332O317l008j6730O746J1527R71K843j0782q166J871J5909J1447j4867
8753A9410j8330l953L451o523O059m79J509J653Q064J4318q512l098n346J1950
$$ y = [-18877, -4072, 3998, 14442, 33368, 36400, 33966, 53342, 40293, 19954, 15089, 6090, 1300, -6804, -28024, -31896, -26373, -19923, -11292, -2267, -28404, -17220, 5976, -10468, -33586, -39007, -22789, -15565, 9346, 22946, 17898, 12979, -3731, -19226, -19248, -17479, -10254, 10639, 13326, -16176, -18160, -11202, -26174, -11372, -14740, -14694, -3619, -11323, -3841, -10531, -6495, 6419, 343, -22246, -18968, -7628, 17711, 13424, 1980, 9335, 16718, 3683, -22050, -25571, -26690, -37091, -31162, -16776, -5800, -11017, -10110, -4228, -15254, 3015, 15543, 6792, -7197, 4140, 22813, 26205, 15332, 21649, 18641, 1911, 8657, 20184, 21155, 23998, 13216, 5050, 6921, 22830, 34277, 19410, 1080, -2873, 578, -5945, 114, -365, 1144, 2797, 10861, 25179, 16667, 13569, 8223, 20173]
8739B0173J334q258k3870j516K7080j3755j7787J512j461k0367N665J3193j536
8726a9593n622J3211J3976K11K976P46j5036j403J2861J4500j3313J1449K1532
8713C6495r728j7648Q305o145p065p469J6681J2725M497J1943j967p169j651q456
8699B3348j2388l865k0239j1449O524J1576P888m325J2797m079j1337k1963K0506
8686g006L0390r339J3050M994k1090L643M799j1615J2538j903J247p653j5936
8673c881j1800J0107M889O808R109l526k458j2173j6240J2956J2018Q542K580
8660A6931M200Q465j0136J800j1745j2261j0278K7748M892j0251j4611J1954M826
8647A1534K1366J941r712l308M961K578p456j0251m683r399j2589P970K1226J1392
$$ y = [20173, 21507, 13249, -10621, -12137, 14943, 1188, -16599, -15087, -16548, -36915, -31250, -18057, -19593, -25215, -12004, 1972, 2183, 5159, 5905, -9131, -10534, 2327, 16827, 3514, 14963, 36495, 26767, 9119, 17424, 11279, 4214, -3255, 13426, 26151, 30648, 42591, 40624, 33455, 31804, 23348, 10960, 7095, -13144, -24593, -18069, -6493, 1395, -2930, 9867, 5788, -5549, -27512, -7006, 23384, 14045, 27095, 32089, 10999, 14642, 19441, 7826, 20364, 18461, 19708, 12055, -3881, -15681, -5574, -685, 6123, 15232, 11706, 9248, -2925, -19165, -6209, 5809, 14351, 16931, 21131, 29596, 19460, 21260, 9515, -2746, -13024, 14724, 19616, 9365, -5246, 6708, 11534, 32900, 34841, 25129, 21821, 26782, 29360, 21904, 11653, 6970, -2429, -15018, -7048, 14178, 25570]
8633B5570O705n645j2754j2472J4263P820N224J5338j4820k147n563K046j4492
8620I073j3124K0225K1366p309K696N785P322R760k240J7392M926k10M457j8973
8606F1146j0582J6571J8346N784l878j0733P472j4844j1014Q441k153r215Q058
8593F3399O118K387O290j914l982o016j5860k176j6643K661N384K041r995j3348
8579A8346r721J0380k612K146L750L525O676K434j152j5021r865K767o179o000
8565e26J7166J4025j1395j4693J0880n595j8589K731J3447P292j8205J934m710
8552f238p45J3771J9679J3287j1756j2211R14k7929N383L465l313r957N047K3737
8538A3134K8178O3753R2733J37440J34861M2532r7920j39564j13755m3886j3178
$$ y = [25570, 32275, 26630, 13876, 1404, 15667, 23487, 28711, 44049, 29229, 27082, 21519, 23565, 9073, -4051, 16174, 37540, 30231, 32927, 38712, 46034, 55794, 53554, 70946, 75872, 75662, 80119, 61146, 50564, 67135, 85481, 91265, 87387, 76654, 84126, 69282, 58268, 66709, 64556, 55341, 63399, 69517, 71904, 78194, 76280, 72298, 66282, 50422, 48246, 31603, 34264, 39648, 41689, 31694, 18346, 8625, 19005, 16393, 18539, 22289, 25814, 32490, 34924, 33772, 18751, 8886, 11653, 5474, -526, 16640, 30665, 19270, 4577, 15457, 9862, -8727, -5996, 7451, 14743, -3462, -1528, -6238, -6983, 6788, 26467, 39754, 27998, 15787, 16701, -11228, -5845, -2380, -5693, -15650, -10603, 13134, 41312, 105065, 197798, 335238, 470099, 512631, 414711, 275147, 161392, 117506, 104328]
8527A04328k0682j9218k6137j6566q296L162L730k07J6568O368Q282n598j4633
8514C1101p675j7484Q251J4841N065N031p143p655j8267p222j4882L25J2336R797
8500F419m687R48J4633K0630J0000L9255J0869L5109Q9037J50351K35005K86216
8488H93785P9385k07037l08419k18600r6094l2410l1218l1374J0374Q251J6306
8477H2949q284k6819j9045j0848J5270m760m243k688n511L458R348j0707j7118
8464A002J3155L457M456J1018J1588m08j0301o601P102J6419J1962j6272p311
8451C9266O49O733K7786K9969K5916P2603R4010J22179M9103j03533j26775r0184
8439A47722o0249l8385k65m141k8225J0460m835K462K0693k1178l2165m938J5458
$$ y = [104328, 83646, 64428, 38291, 21725, 13429, 16591, 20321, 20114, 36682, 43050, 51332, 45734, 31101, 23426, 5942, 14193, 29034, 34099, 39130, 31987, 24332, 6065, -1157, -16039, -15714, -3378, 6419, 1732, 2680, 17313, 37943, 47943, 87198, 98067, 133176, 222213, 372564, 607569, 893785, 973170, 766133, 457714, 239114, 143020, 110610, 79392, 48018, 58392, 66643, 82949, 74665, 47846, 28801, 17953, 33223, 28463, 24220, 21532, 16021, 19479, 28827, 18120, 1002, 14157, 17614, 22070, 33088, 44676, 44268, 33967, 27366, 34468, 50887, 62849, 46577, 39266, 39915, 46648, 74434, 104403, 130319, 202922, 296932, 419111, 468214, 364681, 237906, 147722, 87473, 49088, 48823, 44682, 16457, 26917, 22082, 24544, 45237, 24059, -8106, -13044, 2414]
8426B414o350k0507p679j1144L227K7255L6789j698j2954j5412K63j2837K2667
8413D034O818j6973k0399q015l101J5851M19m12q353m190K1297K6785N744P72
8399B0277j7326R637P275K695r833q067M289n294j0771k381O228n592m46M831
8385d478p999M775P165m579J1537O709l264J1825J3339Q685j2231j6756j8301
8372c573q063L792O782J8041J389k9668p351J0383m866R940J6593L687p94j333
8358A4959Q696l854N97p31j1855J164O338j6926j8874O635J2137J6597l741P493
8344A8635O95q308o338J0177n399l7834m709K6850J4651k3170q539J527K0760
8331a002R838O798j7766j0613k737l62O732j6804j499p712l836K1794K6500J5251
$$ y = [2414, -3936, -24443, -32122, -43266, -40039, -12784, 24005, 22307, 9353, -6059, -5796, -18633, 4034, 10852, -6121, -26520, -34535, -37636, -21785, -21366, -21778, -30131, -34321, -13024, 13761, 19505, 20277, 2951, 12588, 19863, 22558, 12725, 4658, 8947, 3653, -7118, -9499, -3271, -8863, -9309, -4478, -12477, -7702, -537, -5116, 6421, 13130, 9866, 21691, 35030, 43715, 31484, 14728, -3573, -11636, -7844, -1062, 16979, 18368, -11300, -18651, -8268, -13134, -3194, 13399, 17086, 16292, 14959, 23655, 19801, 20398, 19667, 7812, 8976, 15314, -1612, -20486, -13851, -1714, 14883, 11142, 18635, 19330, 11022, 4684, 14861, 9462, -28372, -33081, -6231, 8420, -14750, -23289, -21762, -1002, 8836, 15634, -2132, -12745, -15482, -15844, -9112, -25916, -27415, -35127, -38963, -17169, 9331, 24582]
8317B4582n427J3281l213p624P835l565j5945j7486N419J6003N475q194O421M288
8303B1850j4431j6100j1921n151r654L110L181l283J1733P623K738J1939K804
8290D438j3748k802J6887J3316N939n826k2756k6983j750J0060J9030p407o870
8277a8472J0971n734J089J2403M055j3834n222m913J958M217J3348K1862J687
8264B3415j886N847p565n811p808n801j6470m376P864J173p635j1214n871J1144
8250b4994J4344K1662N621q913j1243k2647J2522J7054K3423j8425j7047O962
8238a681J858J505K0404L30q18j1942k0927Q736J6825K0991P299j8439j9323L584
8224H402M453M106r234o863q4k5949J0008J5887Q669K059p687k455K429n057Q947
$$ y = [24582, 19155, 32436, 29223, 21599, 29434, 25869, 9924, -7562, -2143, 13860, 19335, 11141, 17562, 21850, 7419, -8681, -20602, -25753, -35407, -32297, -29116, -32399, -20666, -13043, -10305, 1634, 4438, -9310, -12112, 4775, 18091, 24030, 18204, -4552, -31535, -33285, -23225, -4195, -11602, -18472, -7501, -13235, -12146, 257, 4312, -9522, -14744, -19657, -17699, -13482, -134, 21728, 23415, 21529, 27376, 19811, 14000, 6192, 391, -16079, -20455, -12591, -11418, -19053, -30267, -36138, -24994, -10650, 11012, 16633, 7720, -3523, -26170, -13648, 3406, 26829, 8404, -8643, -1681, 177, 1682, 22086, 22416, 21598, 9656, -11271, -2535, 14290, 35281, 42580, 24141, 4818, 8402, 12855, 16961, 7727, 864, 780, -25169, -15161, 726, 9395, 11454, 3767, 1312, 3741, -1316, 7631]
8209G631J5584p302j5931p852q564o060m065N070J4858Q486l572k1359L913K5920
8195F757J2502p422J076m344n415J0831N039j8660K374k0391j3498J8891J1125
8182a135p270k8493R88O085J6144J5694j194q37P205j1024j7701J7653L2875n882
8168B3108j2766j2361o555N02O977l017J8257J8534M45k4940j9313j0472j472
8155b3073K299P559j133Q473m142K1390p508j8305K4472L182j0959o215j1023
8142a4983r593Q05K0872J229k739J1302q952Q106j1956j2141J700J6116R643p614
8128A795Q624j7539j6604J286J5809K6369Q311j4410l923M888J246J2661m292
8115B4221r940J4340L909q420P36j281p208j4383n076l438r593j1361R065Q529
$$ y = [7631, 23215, 15913, -18, -7870, -16434, -22494, -26559, -21489, -6631, 1855, -1717, -23076, -19163, 6757, 19259, 11837, 12913, 8569, 3154, 13985, 19024, 364, 2738, -17653, -31151, -12260, -1135, -8405, -36898, -35910, -29825, -13681, 2013, 819, -18, 7187, -3837, -21538, -3885, 28990, 23108, 10342, -2019, -8574, -8072, -1095, -4112, 14145, 32679, 33124, 8184, -11129, -21601, -23073, -20774, -13215, -14348, -5875, -10017, 11373, 3865, -14440, 10032, 13214, 2255, -3960, -14983, -24576, -23771, -2899, -1670, -4409, 6893, -2059, 6047, -5909, -18050, -16350, -234, 9409, 1795, 10419, -7120, -23724, -22438, -6629, 19740, 28051, 13641, 9718, 14606, 15852, 28513, 24221, 14281, 28621, 32530, 24110, 24846, 23565, 16357, 1974, -3102, -6540, -16133, -27494, -18429, -9900]
8101i900M021J1375L252k072j3262p786r245O063O045J0636j4481J1517K5974
8088B2137J094N838P155j7058k3865k7911p023l058L11K1409J3671k878Q235j3871
8074a5814J3457L20j4276J62L1256j7305j5793O812Q976l281j1277R628J7905
8061A0770q505j5226l136L3268J2785o824J4136P12o199j264J9427M207l1767
8048B2384j3728p629n341P808m51L286l77J1689q279j1942k040P104K1577l911
8034B0150o70K595j943n782O292Q422j1170p586r528R413n920j2186n168K1100
8020H019J7707o414j4362m263N265k559p544K1446K7413o560j6784l472J2170
8007C0062k365j9012n695O639K2964j0984j1456J1854K2001J6043l325m995K4365
$$ y = [-9900, -5879, 5496, 8748, 6676, -6586, -14372, -23617, -17554, -11509, -873, -15354, -3837, 22137, 23231, 29069, 36224, 19166, -4699, -32610, -39633, -42691, -42380, -20971, -7300, -10178, -1943, -15814, -2357, -2037, -16313, -16151, 15105, -2200, -17993, -11181, -2205, -5486, -16763, -7135, 10770, 2265, -12961, -16097, 17171, 29956, 23132, 37268, 37980, 31781, 30517, 49944, 54151, 22384, 8656, 1027, -4314, 3494, 3043, 6329, 5952, 17641, 9362, -2580, -4620, 2484, 24061, 20150, 19480, 22075, 20132, 14350, 20642, 29064, 17894, 10308, 780, 10193, 4273, -7913, -13081, 8019, 25726, 19312, 4950, 687, 5952, 3393, -4151, 17295, 44708, 38148, 21364, 17892, 30062, 27697, 8685, 2990, 9629, 32593, 21609, 10153, 22007, 44008, 60051, 56726, 51731, 76096]
7994G6096M492K5311K6738j1739l4620l4236J3N653K4233j715l0400k8826K448
7981B3448K487l977j36L019j0981k4544n636r12J1871O416M502j7170k3982J6236
7967a9359J3965L534J3923j301L227j5251j594o478l995J5934J9281O671J6372
7954D4929J8468n548J0828M542P930P598j6240j2071j0646J2277j5931j3433k3370
7941I333j734Q918q090L615J1879P328l350q120M88m995J078R637J0023K102K132
7926D0244k3515k2907J947R573l320L195K8331Q636p757O153M599j3205k9347
7913B627O233p697j1575p570m766K0423P824K0277p352j3884M480K4725O698Q741
7899D9184j0190j7104k0705j7579N303n979J0859J1883J2211m44j0967j0519j6139
$$ y = [76096, 80588, 105899, 132637, 120898, 86278, 52042, 52055, 57708, 81941, 80226, 49826, 21000, 23448, 25935, 21958, 21822, 24841, 13860, -10684, -16320, -17232, -5361, 1055, 5557, -11613, -35595, -19359, -5394, -1860, 12063, 10762, 13989, -1262, -2856, -9334, -13329, 2605, 21886, 28557, 44929, 63397, 57849, 68677, 73219, 81149, 88747, 72507, 60436, 49790, 62067, 46136, 32703, 9333, 7599, 16517, 8427, 12042, 23921, 31249, 27899, 19779, 20267, 15272, 16350, 25987, 36010, 38112, 40244, 16729, -6178, -4231, 5342, 2022, 5217, 33548, 42184, 34427, 40580, 45179, 31974, 2627, 8860, 1163, -10412, -17982, -22748, -2325, 5499, 25776, 18424, 4540, 9020, 33745, 40443, 49184, 38994, 21890, 1185, -16394, -11091, -17070, -6211, 5672, 17883, 17439, 6472, -4047, -20186]
7886b0186K6644J8957M083j5178k4007k2536J2434K3582r366j2705j3125j268
7874c2671J4288Q429L709l027j9356j0929N971P057J9010R279p515r620J581m02
7860a4196P151p916R197K623J4735Q119n220k4917n994J1320Q517j0275J1807
7847D951Q933J4360p794J537P007J03k1j4082j0069o444l18N2P651j1292p811
7832a3237J1816j312j1331j128R197J142j0936N964P532R015J924j0672l808J308
7818d526N42L728M998L254L723j9898j2686N013k336K473r355J9126K3371j1060
7804F367l706r495q511O959J2593j3558K557J817l647K086j0701K521N227J9075
7790I584J1963r485j256j5288Q026J1063j2677q805M505J4695q04k0381p01J0668
$$ y = [-20186, 6458, 25415, 29498, 14320, -9687, -32223, -19789, 3793, -5573, -18278, -31403, -32671, -18383, -9954, -6245, -9272, -28628, -39557, -33586, -26529, -7519, 1760, -5755, -15375, -13794, -14196, -7045, -14961, -5764, -3141, 11594, 19713, 14493, -10424, -16418, -5098, 3419, -6856, 4951, 13884, 28244, 20450, 21987, 28994, 29097, 29076, 14994, 4925, -1519, -1837, -1785, 5866, -5426, -13237, -1421, -2733, -14064, -15192, -5995, -4853, -15789, -9825, -2293, 6722, 8646, -2026, -5834, -4526, -3984, -256, 4742, 7996, 11719, -8179, -20865, -15852, -18188, -15715, -25070, -5944, 17427, 6367, 2661, -6834, -15345, -8386, 4207, -9351, -6794, -4977, -8624, -6538, -17239, -14718, -9491, 9584, 21547, 12062, 10806, -4482, 3544, 14607, 1930, -6875, -2370, 12325, 11521, -8860, -9561, 1107]
7776A107R232o10R818j2759o786k357N000K34k0175n177M429J0056J9098l776
7762G334p459j3288n249K2830l132M566n502P94J3058j9305j7248j6096N383L4454
7748A140L841k0083k288J7926N540k2378r681K778n164K8094L3431j7288j7415
7735a547J843j2918J0957J6907p996J1924Rr953k4272m972O544Q875O448j7418
7721a5569m02o313o361J7661P005k712j7685j8953l754M717J1321R837J3500m927
7707a2635j3451j8372J7168j2753P421J6867J3369J6336J5035k3401j1158N970
7695C96J697l02K585p899k1038n643O464J8419J0755r304j4981Q988M906k222
7681g179J0680p511j4603J2200N68j2823j6682l858J9087m905q590K6491O392
$$ y = [1107, 10339, 9729, 19547, 6788, 2, -2355, 2645, 2879, -17296, -22473, -18044, -7988, 11110, 7334, -125, -13413, -18662, 4168, 1036, 5602, 100, 894, 13952, -5353, -22601, -38697, -33314, 1140, 4981, -15102, -17390, 536, 6076, -16302, -25983, -23205, -28369, -275, 33156, 15868, -1547, 296, -12622, -1665, 15242, 7246, 19170, 19179, 9226, -15046, -20018, -13474, -4599, 1849, -15569, -15971, -22284, -28645, -10984, -3979, -6691, -24376, -43329, -47083, -42366, -31045, -21208, -7708, -12635, -26086, -44458, -27290, -40043, -32622, -15755, -2386, 13950, 28985, 5584, -5574, 396, 2093, 1791, 4376, -3523, -24561, -30204, -23740, -5321, 5434, -3870, -18851, -9863, -4957, -7179, 3501, -4010, -18613, -6413, -5845, -18668, -35350, -39208, -20121, -25026, -33616, -7125, -733]
7668g33q069J4595k191M594n328k460K368J4437n38k119l218O095N704j7680q39
7653D618L024J212K872j5438j3184j2017J6797j1964j8161j346K449j057J2925
7640b9270J1082N592j5042k3896K931O248K1341J9589J0276K1667k0435r083J91
7627A191j5560J2444k053j593p371J187Q488J2501J101p645O987J1877K745r531
7613A4768j4803o843rm555p146K2818P530J156j1064j381p264j7639R53M411j38
7598a9206J3305J3728L22J8706m985p75K88j6385r83l720K54n159k3118o05J3806
7583a4527K0175o046n430j383J9011K0350j0483j9974k979P843K199n796o833
7570c873J6081J3294r957m381k6977o161J2501o78j0919j9028O907J7472R4k537
$$ y = [-733, -8802, 5793, 3602, 8196, 2868, 408, 2776, 17213, 16675, 14556, 11338, 17433, 23137, 5457, 4618, 7642, 8854, 11726, -3712, -16896, -28913, -12116, -24080, -42241, -43587, -41138, -42195, -29270, -18188, -12596, -27638, -51534, -48603, -42355, -21014, -1425, 8851, 30518, 10083, 1000, 1191, -14369, -1925, -3978, -5571, -12942, -11755, -3267, 9234, 10335, 2690, 9677, 21554, 24299, 14768, -35, -6878, -6887, -11442, -18588, 4230, 11760, 12916, 1852, 471, -6793, -24432, -23479, -19068, -19206, -5901, 7827, 8149, 26855, 21870, 21095, 21383, 4998, 4015, 295, 549, -4610, -27728, -28333, -14527, 5648, -398, -5828, -7211, 11800, 32150, 21667, 1693, -1286, 6557, 8756, 2960, -3873, 12208, 25502, 15545, 11164, -15813, -21974, -9473, -10151, -21070, -40098, -33191, -15719, -15625, -18162]
7556a8162J5391n993n122R454j0124m436J5384n208r56j0467R161R896n157q258
7542a4597R768j2570j9817o51k505J6553m01m641P014J3827K159k3804l407m833
7528c7905n250L455q572Q690Q026m598J1195J9230P998j5462J644J0307n206O363
7514h5k388j4787K523J8525J7421L633q104Q838O566j0955l170o852k1024j6616
7500b6475m46P152N284Q965q969L328O513J4678k972j0626m120q466M921j8785
7486c0018j3528J0558J43L717j7246Q684J7818J4200M465K5196N86J499O7j119
7472B5022j613j1777l2203j929J1752J2903O904k94j3135m984O249J7377l27k7863
7458a3918L642K2682j0074j2556k4887n114M285L1926R283j1978j089O898q473
$$ y = [-18162, -2771, -8764, -13886, -4432, -14556, -18992, -3608, -8816, -9772, -20239, -11078, -1182, -6339, -14597, -4829, -17399, -37216, -37867, -40372, -23819, -24220, -28861, -21847, -8020, -5861, -29665, -33072, -37905, -43155, -39700, -48272, -39582, -31556, -36154, -24959, -5729, 2269, -13193, -11549, -1242, -6448, -85, -2473, -17260, -14737, 3788, 21209, 24842, 16738, 25576, 32142, 21187, 18017, 11165, -9859, -26475, -26921, -19769, -14485, -5520, -14489, -11161, -4648, 10030, 7058, -3568, -7688, -16154, -11233, -30018, -43546, -32988, -32845, -29128, -46374, -37690, -19872, -5672, -1207, 23989, 24575, 26074, 26141, 25022, 23409, 11632, -20571, -22500, -10748, 2155, 9059, 8765, -4370, -9354, -3105, 14272, 13945, -13918, -10276, 12406, 2332, -10224, -35111, -40225, -35940, -4014, 5269, -6709, -7798, -900, -9373]
7445i373L210J7388j4508R88J4601J6064j1920j1272k928L824J8419j349l0414
7432g270Q723k435O019K055j4170m672J8515L832N676l815r173l164j9968O120
7418a3727K6297J878L436K2632J2019r037j1148k4292j7566l237R28j404O5M373
7404h783m214J856O268p3n714J1070P258j5640K408R563n186n208n727L310K207
7389f605Q10K370J618k436o26j0227j0598P808r369J832L213n201L850j2831N148
7374c1244J4655J773o34k20j137L379K7258p434O65m470k794J164l583N089J3706
7359A6173l726m669J0930n147j1615J530J447J0445o587O591n666o132M566M795
7345A2935k827j1753j3619r176n794K6566K0919j3966n235Q270J7700o899k3007
$$ y = [-9373, -6163, 11225, -3283, -2295, 12306, 28370, 16450, 5178, 2250, 6074, 24493, 23144, -7270, 1453, -982, 5037, 7092, -7078, -11750, 6765, 10597, 16273, 12458, 3285, 121, -19847, -13727, 12570, 14448, 17884, 40516, 52535, 43498, 32350, 8058, -9508, -12745, -11817, -13221, -13156, -8783, -12997, -11141, -4873, -4946, -10660, 410, 7668, -7972, -5564, 3999, -1187, -6395, -12122, -8812, -6605, -5795, -3425, -1807, -4243, -4869, -15096, -25694, -17886, -27255, -25423, -22210, -27411, -23561, -36392, -31244, -16589, -14816, -15450, -15670, -16807, -13428, 13830, 6396, 7061, 2591, -203, 961, -2622, 2467, 16173, 12447, 7778, 18708, 13561, 1946, 3476, 4923, 15368, 8781, 15372, 9706, 3574, 8140, 12935, 10108, -1645, -15264, -24440, -30234, -3668, 17251, 3285, -1950, 6320, 24020, 17121, -5886]
7332e886j2235J5680K268k702o395K305l610q516O305J9231K93p568Q642N204
7318A3016k089J4010R730k651q167p198l976M017l512M553K945j536r579q664
7304H99J7483K814k9746j3685N687P176J1084m787p48q967O437J6809J0741m942
7290A6255n792o442J2102o323j1741J2172P051j920L055m891l276j407l9J500
7276A0304j440J5352n431j1460L1952J1596k6236k2086J812J0629j4903q218j4895
7263b3024N250J7680N102j606J3552m500l0062j8357J720P694L390K3141J2447
7250A2427J4447j7843q730p317k2062j384R111M216J0353K1784n829J3752M054
7237B6979j8005j204J910j3228q632j4998o002l791J5946n838n324K380L2168
$$ y = [-5886, -18121, -2441, -173, -2875, -9270, -6965, -10575, -19091, -12786, 6445, 6738, -830, 7812, 13016, 10927, 24937, 34667, 32016, 23849, 16651, 12675, 16692, 13180, 17733, 20678, 19142, 9563, 899, 18382, 21196, -8550, -22235, -16548, -9372, 1712, -3075, -3823, -12790, -6353, 10456, 21197, 16255, 10463, 4021, 16123, 9800, -1941, 10231, 17282, 15362, 18417, 13526, 10250, 8843, 8804, 10304, 8864, 24216, 18785, 7325, 39277, 50873, 24637, 2551, 4363, 14992, 89, -8129, -23024, -17774, -94, 5008, 3402, 16954, 12454, -17608, -35965, -34245, -26551, -23161, -20, 12427, 26874, 9031, 301, -7016, -29078, -30462, -21351, -17135, -6782, 15002, 9173, 22925, 26979, 8974, 7770, 9680, -3548, -12180, -27178, -33180, -36971, -21025, -26863, -32187, -29807, 2361]
7224B361L199j3313P305o692N885m071n534j0921j3764K0510R434J51N603p260
7210g107R961Q732Q602j355j5082j8620k618K3519L658j5611j2228N860J8976
7197F687K574k0099j5184m760P731N084k1481q76K3862K8734R087j0239n699J3811
7183A9232P94k2499o908N102L679M295k864j1835P14o785o133P959k337p236Q24
7168b3998k8642j758L0687J735L813K211o395j0607j973J3975j04R736Q774L4385
7154C1839J818M6o249q974M488j432j0686j3321n130r435r257J683j386J6167
7140i829J246j6043o736J3970m09K477P629j562q04L203L482o141j788j459k628
7125a5392K572k952n714l62l911K2265J3107j530J3350j4283r530m739N048n576
$$ y = [2361, 5560, -7753, -448, -7140, -1255, -5326, -10860, -21781, -35545, -15035, -5601, -5450, 153, -7107, 2854, 11586, 20188, 18833, 3751, -14869, -17487, 6032, 9690, -5921, -18149, -12289, 6687, 9261, -10838, -26022, -30782, -23051, -17967, -39448, -40324, -16462, 12272, 21359, 11120, 5421, 19232, 20026, -2473, -9381, -4279, -600, 3695, 831, -11004, -10290, -17075, -23208, -15249, -17586, -24822, -23998, -52640, -54398, -23711, -21976, -18163, -15952, -22347, -32954, -34927, -20952, -21056, -11320, -2546, 31839, 33657, 33703, 27454, 18480, 22968, 21536, 10850, -2471, -7601, -17036, -26293, -24610, -25996, -9829, -8583, -24626, -31362, -17392, -17801, -15324, -7695, -9257, -10061, -6858, -3376, -9517, -11305, -12764, -15392, -12820, -15772, -21486, -21848, -25759, -3494, 9613, 8083, 21433, 7150, -2380, -7119, -2071, -7647]
7111g647j6854J2575J4670L677n720n859K307R79K3166J1102N184l680j6810j8648
7097a558j4890j8603O99K3075M998J2125o266k698j4116n784J930j855N647N819
7083a1477L448J8289l049M718j8590k6032K724J4574R613q141k2151J6215K4913
7070E054O235J528j3204j314l823j1630O309j3451j2433M031J4691J0222n067
7057a2852L916N770J0277M462j6841j5632q443m403q297J5066J6097K1432Q543
7044A9095R899J2172o360l123N004n887k8816k4432M324J5745O417K511j3407
7031f858j3004P882o820l203L345n783q09j868L584O8n830R004L282j2664J431
7016b8243J3363K4280L939L259m592j9458j6871K974l838r3K1133P36j1828R820
$$ y = [-7647, -24501, -11926, 2744, 6421, 701, -5158, -2851, -1872, 21294, 32396, 37580, 33900, 17090, -1558, -16448, -35051, -34352, -11277, -6279, 5846, -420, -3118, -17234, -23018, -21088, -22943, -17296, -11477, -8029, 10260, 7211, 11929, -6661, -32693, -29969, -15395, -5782, -13923, -36074, -19859, 5054, 11289, 12817, -387, -1701, -5524, -17154, -10845, -24296, -36729, -32698, -18007, -7785, -12852, -8936, -3166, 7111, 11573, -5268, -20900, -29343, -33746, -42043, -26977, -10880, 10552, 19095, 28994, 41166, 34806, 31683, 36687, 30800, 1984, -22448, -18124, -2379, 4038, 6549, -6858, -19862, -11980, -18800, -22003, -18658, -24441, -25250, -27118, -23534, -23466, -29296, -20292, -17010, -29674, -28243, -14880, 9400, 13339, 16598, 12006, -7452, -24323, -21349, -25187, -25280, -4147, -3411, -15239, -5419]
7002e419J9429O492p325n23J382j6660j4598l249O873J3128k116k7041N846R647
6988a4134P632Q765L767P999L224k9843j0453P803P070M81K3314l831j1873k4250
6974b4329j0482J0453K2758o262R628N899j7802r433o321K045k694m000R845J7558
6960c137J0661N028m168p708o896p786R820L45J3661L022J7411l718j4086j063
6946A1386M521m956j6682K11J0041J1117J2065M52j4051k778k320k269n784J3060
6932A4013J8880L942j8831j4776j3508J432l717O107M854p433m243K1708J740
6919A0168Q66Q869j6620j2634J0558p600M41p647P16J4884J3354R966O176M412
6905C5909k0362j7116j8791N434K246J939j6055K0841Q223O864m232r364j0291
$$ y = [-5419, 14010, 20502, 13177, 12654, 14036, -2624, -17222, -20471, -13598, -470, -2586, -29627, -23781, -14134, -6502, 2263, 6030, 14029, 17253, -12590, -23043, -15240, -8170, -7689, 15625, 11794, -79, -24329, -34811, -24358, -1600, -7862, 1766, 7665, -10137, -19570, -25891, -23846, -26540, -30540, -20695, -3137, 7524, 12552, 8384, 676, -6220, -14006, -4186, -3841, 9820, 12842, 30253, 26535, 12449, 11386, 15907, 10951, -5731, -5520, 4521, 15638, 27703, 28155, 14104, 11326, 9006, 6737, 953, 14013, 32893, 36835, 18004, 3228, -10280, -8848, -12565, -6458, -1604, -9037, -13280, 8428, 10168, 11034, 19903, 3283, -9351, 1207, -6393, -5952, -13599, -12883, 2001, 15355, 25321, 31497, 35909, 15547, -1569, -20360, -14926, -12680, -10741, -26796, -5955, 2268, 9132, 4900, -4464, -14755]
6892a4755N233J2905O896r757p371Q80Q059K675q39k907k01q730r060Q893R315
6877A236R464K2344m132k5212l726J2516j3557m948N539l40k1m264j3509J1375
6863g235J2951M018j0522l887k476k4782J4383K0802k634j5747j4146n081J6619
6850a7737J0715J2603L19o445j2238M974l460k425o791M398K7053n688m626o01
6836E1J4072j5408j0201L856j267J602N664O270j305k800k20K4190L713j5893
6822A2324p434p103P158o679o172O667j800n606l402L200M507K16J021k817Q527
6807B607K206m302n905j7905M613J0946J6793m486n710k2528q309J3059M510P737
6793f674K4186K570j5593K918L917O497r336l2534j6509J6511K0037J2632q958
$$ y = [-14755, -9522, 3383, 10279, 522, -6849, -5969, 2090, 4765, 3926, 1019, 818, -7912, -16972, -8079, 1236, 10700, 33044, 28912, 3700, -26, 12490, -1067, -6015, -476, -816, -837, -5101, -18610, -7235, 5716, 9734, -788, -4675, -7151, -31933, -17550, 3252, 618, -15129, -29275, -34356, -17737, -7022, 5581, 5900, -545, -12783, -7809, -11269, -13694, -20485, -16087, 10966, 5278, 652, 51, 14123, -1285, -11486, -7630, -8897, -7295, -1631, 4639, 3334, 534, 314, 24504, 28217, 12324, 4890, -2213, 4945, -1734, -7906, -1239, -3039, -8645, -12047, -8847, -4340, -4124, -3103, -5920, 2607, 4813, 511, -5394, -23299, -18686, -7740, 9053, 4567, -1143, -23671, -31980, -18921, -14411, -6674, 17512, 20082, 4489, 7407, 11324, 17821, 8485, -24049, -40558, -24047, -4010, 8622, -336]
6780c36j5838L933J339J49R789r810l514J0542N651Q974j6955m763M315q989J4121
6765a392K0521m967k52J2554k051j9077O888J7068J0715o033k0124k4755k292
6752a3197J1175K2551L32J1440M417N372J795p282k7286k6853L274P71J67L601
6738i723J5394K065j8335k7465K3550J1651J7249k957j5857k6700M234K4020R143
6725F269k254j2961J580p727N693N586l753M403j0052K620K7135n005k0991l0595
6711d0052j536P749m021n340q157j919J149K4018J3648L023J738J1654L208j4063
6697h901Q822J6357R661j4343j4533j4454j0863n618N843J7197P800R425J3071
6684A9464M79K556M219o51r94j0905J6999Q03j0308k6395l611J0278n974j2681
$$ y = [-336, -16174, -12241, -10902, -10753, -964, -10774, -14288, -3746, 1905, 10879, -6076, -10839, -6524, -15513, -1392, 19129, 14162, 13910, 26464, 24413, 5336, 12224, 29292, 40007, 33974, 13850, -10905, -13197, -2022, 20529, 20861, 32301, 36718, 42090, 43885, 36603, 9317, -17536, -14262, -13491, -13324, -9723, 5671, 7736, -10599, -38064, -14514, -2863, 14386, 11429, -4428, -31128, -26894, -2874, 6269, 4015, -8946, -7366, -15093, -9400, -3814, -7567, -3164, -13216, -10596, 16539, 11534, -9457, -40052, -41588, -33839, -37860, -43200, -51357, -53276, -52127, -28109, -14461, -11438, -9700, 1954, 5162, -8901, -79, 16278, 25939, 11596, -2937, -17391, -28254, -33872, -28029, -10832, -3032, 6393, 19464, 19943, 22499, 26718, 26067, 25073, 14168, 31167, 31970, 21662, -4733, -8344, 1934, -4040, -16721]
6670a6721j8846K9048K3525l699j2148K356j1363j7257J5704J4519K092j5094
6658g884P500N248N558P797R89n154j2742k4910M855J1576N362l445j5914J37
6644b1027K060M329N450k2029K19J2581j4418K91J3959K387j1697N558M284j4266
6630c2319r64K7885K1636m45k6182o604Q706j4127o765M861K0256J2089j2253
6617d226J5556q470j9201j2714K4680J0666q103j0265L466P271j7644j0092j5853
6604d4929O704L2639O191j8907L37L82m556m45p39R394j579r861P456j0859j3188
6589d1960l571J1071J4918P986L326m836p207m213J2590J5106O942J5586j0872
6576A4866o290p167J585P589O740j705j0825Q03K758j3068L90N675o953J1075
$$ y = [-16721, -35567, -6519, 17006, 13307, 1159, 3515, -7848, -25105, -9401, 5118, 7210, -7884, -384, 4864, 10422, 18219, 19208, 14054, 1312, -23598, -18743, -7167, -1805, -5250, -21164, -21027, -18967, -14638, -9188, -31217, -30998, -18417, -32835, -32544, -18585, -16198, -27895, -22337, -18053, -32319, -33283, -5398, 16238, 15793, -10389, -16993, -8287, -22414, -29179, -24318, -4062, 8027, -4226, 11330, 2860, -16341, -29055, -4375, 6291, -1812, -12077, -8611, -1340, -18984, -29076, -44929, -38225, -5586, 605, -18302, -17965, -17583, -22139, -22584, -23323, -13929, -15508, -25369, -17913, -28772, -41960, -45531, -34460, -19542, -11556, -8230, -13066, -20273, -24486, -11896, 3210, 10152, 25738, 14866, 8576, 1409, 2994, 10583, 17323, 15618, 4793, 5596, 8354, -4714, -4324, 1351, -5602, 5473]
6562E473k693J729j717Q963l774j3883O554K458L943P860j8139M065j2387O162
6548e386K7637j5520k4721j181m443J8175K1296k0314R44J1357j213J2787J0401
6535B9819K284j7173k0567j3955J2766J1271Q847J002l199j4802m69N602j8987
6522a7561Q785M102L025p078m714o753j3830Q161J1767J511N998J2052k125K830
6508F170J7217l812k1961k73m830j0138L067n684j2039K715J1245N750p734j393
6494b1700P227J1284J1748j3997N740Q199q075j435R61J644n099j6269N863L212
6480a0697k293J561N71p948p903J7882K5320P895m037j6376j75M940j0865k3995
6466b6120l270J125R707J1266j063m881P883n181O117J5612J2116j410q11R126
$$ y = [5473, 2780, 4509, 2792, 11755, 7981, -5902, 652, 3110, 7053, 14913, -3226, 839, -11548, -5386, 22251, 6731, -17990, -19171, -23614, -5439, 15857, -4457, -3513, 7844, 6631, 19418, 29819, 32103, 14930, -5637, -19592, -6826, 4445, 13292, 14294, 11095, -3707, -4176, 1426, -17561, -8776, -4674, -1649, -8727, -13441, -20194, -34024, -25863, -14096, -12585, -6587, 5465, 3340, 6170, 23387, 19575, -2386, -2659, -7489, -17627, -14560, -20244, -32283, -29568, -18323, -12573, -20307, -21700, -14473, -3189, 8559, -5438, 302, 8501, 426, -1009, -48, 1596, -3503, -19772, -13909, -10697, -12990, -11429, -10858, -18806, -26709, -8827, 16493, 24388, 20351, 3975, 3800, 8740, -2125, -26120, -29390, -28265, -18558, -7292, -8355, -13236, -5353, -10534, -4417, 11195, 23311, 21901, 21090, 30216]
6452C0216l372j4246J1494r454n904n795j7120O806K8925N105j7709q29P746Q71
6438A6734k6935n70J3891K319J88j1271n432K438J846O26p005O485M834J7509
6424A5657J2783n811j0175j4018J6202J743j0667j3909J1405K7216k3734l953
6412B739L059J1904k372j780q130j6878k159J0097j2942k4124J4190L6407j940
6399H071Q50M309k3012L715J7589O984j7418M512j7666j1149L4560J5068j8009
6386H404j0332J0770J3675o745j6442k661N866J803l349l354k625K089j4170P753
6372i318J2720j8577P021m400K7235L4007j9471j4568p809p602L834n205j2379
6359a4512O112j0593j0780J2842J4064J2627j0098j8784j990J4524J7915J8224
$$ y = [30216, 26844, 12598, 24092, 14638, 8734, 2939, -14181, -7375, 21550, 26655, 8946, 8117, 15863, 16734, -10201, -10771, 3120, 5439, 5627, -5644, -11076, -8638, -6792, -6166, -13171, -6686, -1852, 15657, 28440, 22629, 12454, -1564, 14638, 16381, 5714, -8195, 3210, 30426, 6692, 2739, 5798, 17702, 15330, 13550, 5420, -11458, -13617, -3520, -16462, -40586, -26396, 10011, 8071, 8921, 13230, -9782, -6067, 11522, 18506, 1088, 5600, -12066, -23215, 11345, 26413, 8404, -1928, 8842, 22517, 15772, -670, -3331, 2535, 4338, 989, -2365, -4990, -2901, -17071, -9318, 3402, -15175, -8154, -12554, 14681, 48688, 29217, 14649, 6840, -762, 3072, -2133, -14512, -8400, -18993, -29773, -16931, -2867, 9760, -338, -19122, -21112, -6588, 11327, 29551]
6347B9551K357j3767L271p686r673J0153J744J0983O637q89k0297m001j8882j1642
$$ y = [29551, 31908, 18141, 21412, 13726, 4053, 14206, 15950, 26933, 33570, 32681, 12384, 8383, -10499, -22141]
$$ [...]
##END NTUPLES=NMR SPECTRUM
##END=
