##TITLE=Analysis number 329554
Compound Code btb 10019
Project Code adrs
Chemist Name hajos
##JCAMPDX= 6.0         $$ Bruker NMR JCAMP-DX V2.0
##DATA TYPE= NMR SPECTRUM
##DATA CLASS= NTUPLES
##ORIGIN= Bruker BioSpin GmbH
##OWNER= nmr
$$ XWIN-NMR		Version 3.5
$$ Thu Sep 13 09:35:26 2007 GMT Daylight Time (UT+1h)  MAYBRIDGE\nmr@NMR_250MHZ
##.OBSERVE FREQUENCY= 250.131544655141
##.OBSERVE NUCLEUS= ^1H
##.ACQUISITION MODE= SIMULTANEOUS (DQD)
##.ACQUISITION SCHEME= undefined
##.AVERAGES= 16
##.DIGITISER RES= 18
##SPECTROMETER/DATA SYSTEM= dpx250
##.PULSE SEQUENCE= zg30
##.SOLVENT NAME= DMSO
##.SHIFT REFERENCE= (INTERNAL, DMSO, 0, 16.522)
##AUDIT TRAIL= $$ (NUMBER, WHEN, WHO, WHERE, WHAT)
$$ ##TITLE= Audit trail, XWIN-NMR		Version 3.5
$$ ##JCAMPDX= 5.01
$$ ##ORIGIN= Bruker BioSpin GmbH
$$ ##OWNER= nmr
$$ C:\u/data/dgb/nmr/ADRS/1430/pdata/1/auditp.txt
$$ ##AUDIT TRAIL=  $$ (NUMBER, WHEN, WHO, WHERE, WHAT)
(   1,<2007-09-13 09:35:02.68 +100>,<MAYBRIDGE\nmr>,<NMR_250MHZ>,
      <created by zg, POWCHK disabled, PULCHK disabled
       configuration hash MD5:
       76 6E 9A 78 1E 09 19 81 EC 84 63 8F B0 6A 59 2D
       data hash MD5: 64K
       16 4C DA 2A 57 2B 9A 2F CE 3A F6 43 2E 84 13 23>)
(   2,<2007-09-13 09:35:15.42 +100>,<MAYBRIDGE\nmr>,<NMR_250MHZ>,
      <Start of raw data processing
       ef LB = 0.3 FT_mod = 6 PKNL = 1 SI = 32K 
       data hash MD5: 32K
       A8 F4 F8 82 C2 2B D4 50 17 FD 52 A2 1C E1 52 0E>)
(   3,<2007-09-13 09:35:17.06 +100>,<MAYBRIDGE\nmr>,<NMR_250MHZ>,
      <apk 
       data hash MD5: 32K
       8E 15 95 BF F2 E0 37 6A A4 10 F5 9F 27 2B A9 A5>)
(   4,<2007-09-13 09:35:17.76 +100>,<MAYBRIDGE\nmr>,<NMR_250MHZ>,
      <abs ABSG = 5 
       data hash MD5: 32K
       2C 4E A6 6C F5 33 A9 3B 69 A9 6F 5A F7 62 13 2C>)
$$ ##END=
$$ 
$$ hash MD5
$$ 51 ED E7 55 6A DE 25 0B 72 25 82 72 9D 85 83 06
##$RELAX= 
##$RELAX= 
##$RELAX= 
##$RELAX= 
##$RELAX= 
##$RELAX= 
##$RELAX= 
$$ Bruker specific parameters
$$ --------------------------
##$DU= <C:\u>
##$EXPNO= 1430
##$NAME= <ADRS>
##$PROCNO= 1
##$TYPE= <nmr>
##$USER= <dgb>
##$AMP= (0..31)
100 100 100 100 100 100 100 100 100 100 100 100 100 100 100 100 100 100 
100 100 100 100 100 100 100 100 100 100 100 100 100 100 
##$AQSEQ= 0
##$AQ_mod= 3
##$AUNM= <au_zg>
##$AUTOPOS= <52 >
##$BF1= 250.13
##$BF2= 250.13
##$BF3= 250.13
##$BF4= 250.13
##$BF5= 500.13
##$BF6= 500.13
##$BF7= 500.13
##$BF8= 500.13
##$BYTORDA= 1
##$CFDGTYP= 0
##$CFRGTYP= 5
##$CHEMSTR= <none>
##$CNST= (0..31)
1 1 145 1 1 1 1 1 1 1 1 1 1 1 1 1 1 1 1 1 1 1 1 1 1 1 1 1 1 1 1 1 
##$CPDPRG= <>
##$CPDPRG1= <>
##$CPDPRG2= <>
##$CPDPRG3= <>
##$CPDPRG4= <mlev>
##$CPDPRG5= <mlev>
##$CPDPRG6= <mlev>
##$CPDPRG7= <mlev>
##$CPDPRG8= <mlev>
##$CPDPRGB= <>
##$CPDPRGT= <>
##$D= (0..31)
0 1 0 0 0 0 0 0 0 0.06 0 0 0 0 0 0 0.0002 0 0 0 0 0 0 0 0 0 0 0 0 0 0 
0 
##$DATE= 1189672501
##$DBL= (0..7)
120 120 120 120 120 120 120 120 
##$DBP= (0..7)
150 150 150 150 150 150 150 150 
##$DBP07= 0
##$DBPNAM0= <>
##$DBPNAM1= <>
##$DBPNAM2= <>
##$DBPNAM3= <>
$$ [...]
##$SUBNAM7= <"">
##$SUBNAM8= <"">
##$SUBNAM9= <"">
##$SW= 20.6930455092707
##$SWIBOX= (0..15)
0 0 3 0 0 0 0 0 0 0 0 0 0 0 0 0 
##$SW_h= 5175.983436853
##$TD= 65536
##$TD0= 1
##$TE= 296.16
##$TE2= 300
##$TE3= 300
##$TEG= 300
##$TL= (0..7)
0 120 120 120 120 120 120 120 
##$TP= (0..7)
150 150 150 150 150 150 150 150 
##$TP07= 0
##$TPNAME0= <>
##$TPNAME1= <>
##$TPNAME2= <>
##$TPNAME3= <>
##$TPNAME4= <>
##$TPNAME5= <>
##$TPNAME6= <>
##$TPNAME7= <>
##$TPOAL= (0..7)
0.5 0.5 0.5 0.5 0.5 0.5 0.5 0.5 
##$TPOFFS= (0..7)
0 0 0 0 0 0 0 0 
##$TUNHIN= 0
##$TUNHOUT= 0
##$TUNXOUT= 0
##$USERA1= <user>
##$USERA2= <user>
##$USERA3= <user>
##$USERA4= <user>
##$USERA5= <user>
##$V9= 5
##$VALIST= <valist>
##$VCLIST= <CCCCCCCCCCCCCCC>
##$VD= 0
##$VDLIST= <DDDDDDDDDDDDDDD>
##$VPLIST= <PPPPPPPPPPPPPPP>
##$VTLIST= <TTTTTTTTTTTTTTT>
##$WBST= 1024
##$WBSW= 4
##$XGAIN= (0..3)
0 0 0 0 
##$XL= 0
##$YL= 0
##$YMAX_a= 351058
##$YMIN_a= -278825
##$ZGOPTNS= <>
##$ZL1= 120
##$ZL2= 120
##$ZL3= 120
##$ZL4= 120
##$ABSF1= 16.522
##$ABSF2= -4.171173
##$ABSG= 5
##$ABSL= 3
##$ALPHA= 0
##$AQORDER= 0
##$ASSFAC= 0
##$ASSFACI= 0
##$ASSFACX= 0
##$ASSWID= 0
##$AUNMP= <proc_1d>
##$AZFE= 0.1
##$AZFW= 0.1
##$BCFW= 0
##$BC_mod= 0
##$BYTORDP= 0
##$COROFFS= 0
##$CY= 12.5
##$DATMOD= 1
##$DC= 0
##$DFILT= <>
##$DTYPP= 0
##$F1P= 14.0000005364418
##$F2P= -0.99999901652339
##$FCOR= 0.5
##$FTSIZE= 32768
##$FT_mod= 6
##$GAMMA= 0
##$GB= 0
##$INTBC= 1
##$INTSCL= 1
##$ISEN= 128
##$LB= 0.3
##$LEV0= 0
##$LPBIN= 0
##$MAXI= 10000
##$MC2= 0
##$MEAN= 0
##$ME_mod= 0
##$MI= 0
##$NCOEF= 0
##$NC_proc= -5
##$NLEV= 6
##$NOISF1= 0
##$NOISF2= 0
##$NSP= 0
##$NTH_PI= 0
##$NZP= 0
##$OFFSET= 16.522
##$PC= 1
##$PHC0= -71.68014
##$PHC1= 7.824448
##$PH_mod= 1
##$PKNL= yes
##$PPARMOD= 0
##$PSCAL= 4
##$PSIGN= 0
##$REVERSE= no
##$SF= 250.13
##$SI= 32768
##$SIGF1= 0
##$SIGF2= 0
##$SINO= 400
##$SIOLD= 32768
##$SREGLST= <1H.DMSO>
##$SSB= 0
##$STSI= 32768
##$STSR= 0
##$SW_p= 5175.98343685301
##$SYMM= 0
##$S_DEV= 0
##$TDeff= 65536
##$TDoff= 0
##$TI= <Analysis number 999999
Compound Code 99
Book Reference 9
Project Code 9>
##$TILT= no
##$TM1= 0
##$TM2= 0
##$TOPLEV= 0
##$USERP1= <user>
##$USERP2= <user>
##$USERP3= <user>
##$USERP4= <user>
##$USERP5= <user>
##$WDW= 1
##$XDIM= 32768
##$YMAX_p= 374437697
##$YMIN_p= -477884
$$ End of Bruker specific parameters
$$ ---------------------------------
##NTUPLES= NMR SPECTRUM
##VAR_NAME=  FREQUENCY,     SPECTRUM/REAL,   SPECTRUM/IMAG
##SYMBOL=    X,             R,               I
##VAR_TYPE=  INDEPENDENT,   DEPENDENT,       DEPENDENT
##VAR_FORM=  AFFN,          ASDF,            ASDF
##VAR_DIM=   32768,         32768,           32768
##UNITS=     HZ,            ARBITRARY UNITS, ARBITRARY UNITS
##FACTOR=    0.157963299565203, 1,           1
##FIRST=     4132.6476996994, 0,             0
##LAST=      -1043.33573715361, 0,           0
##MIN=       -1043.33573715361, -477884,     0
##MAX=       4132.6476996994, 374437697,     0
$$ Real data points
##PAGE= N=1
##DATA TABLE= (X++(R..R)), XYDATA
$$ [...]
26013d727k24212j05919O6018M6088J7846l5550P4513R1690L8388l7832p24j17816
26001a92237n935J0863N8891O7728R3192M7545P9475M5249j48497n2459l9627
25990c5812j5029K3383q1733j4241J00846P6546L8563M6159j12332j19037o3414
25979a56101l7980m882j3345O4468Q0241M1155k046k0757J04154J03068N020j32764
25967C0231m0199M4040O6061J19768r9633l0117O1569J7926J7057J208K9920n243
25955B12588o2668j14191m1524J0653k503m6423J41o8896k6014J08351J26965
25944I6479l0797Q635j03549J8436K1422R206L5743O910k070j02612k5260J4570
25932e2887J14323j24223k3343p4126o0385J66712q0990p628M6796K930l0600
$$ plain form
26013 -4727 -228939 -334858 -268840 -222752 -204906 -240456 -165943 -74253 -35865 -73697 -74421 -192237
26001 -192237 -198172 -187309 -128418 -60690 32502 80047 159522 204771 56274 3815 -35812
25990 -35812 -50841 -27458 -109191 -123432 -22586 53960 92523 138682 26350 -92687 -156101
25979 -156101 -194081 -198963 -212308 -147840 -67599 -26444 -28490 -49247 54907 157975 162995 30231
25967 30231 -9968 34072 100133 219901 120268 90151 151720 169646 186703 187911 217831 212588
25955 212588 149920 35729 -5795 4858 2355 -44068 -43927 -112823 -138837 -30486 96479
25944 96479 65682 74317 -29232 -10796 10626 19832 55575 62485 60415 -42197 -67457 -52887
25932 -52887 61436 -62787 -86130 -160256 -220641 -53929 -134919 -142547 -95751 -92821 -123421
25921a23421L089J05545R1974L3711q1419K2670Q3361j1853k1623r0184K4116
25910C5966M1949M2926K4219j01587j29538N032J15499J07289q9555K449n4150
25899D99o6425M7011O5945J7002r3052j2171l7563K3399M7409Q9228O1757j9071
25887A23968J2289r4291o1968P1796J77753m2664k8361l6467r0820j28130K207
25876i4688M3523L8084n6371K0605J21457O797k8094j51675K0522J20559R7532
25865A38251j8689L095r5309n1290o7078K4414O7907P2198p03j3845J09965J5092
25853A84008j57367o5116K18P9136l8932L7768l2243K1048Q4804j54288j09216
25842a50180r5334K8620p6952O0136J20419Q0349J03869j9152j32963k1002Q5459
$$ plain form
25921 -123421 -120332 -14787 77187 110898 29479 52149 135510 123657 102034 11850 35966
25910 35966 77915 120841 145060 43473 -86065 -81033 34466 141755 52200 54649 499
25899 499 -65926 -18915 47030 64032 -29020 -41191 -78754 -55355 -7946 81282 143039 123968
25887 123968 136257 41966 -20002 51794 229547 186883 158522 122055 31235 -96895 -94688
25876 -94688 -51165 -13081 -69452 -48847 72610 79407 51313 -100362 -79840 40719 138251
25865 138251 119562 122657 27348 -23942 -91020 -66606 1301 73499 72796 58951 168916 184008
25853 184008 26641 -38475 -38257 40879 1947 39715 7472 28520 113324 -40964 -150180
25842 -150180 -245514 -216894 -293846 -233710 -113291 -32942 70927 51775 -81188 -102190 -16731
25831a6731o8062m0705J6793M9809P3267L2648Q6280L581j46924J2130J28191
25820A30277Q3162j02647k10623J1372J99826L9923r1590j05100n441l4238J36559
25809E1480J18742m2293m9343Q7916k6722j4334j10353l7476P1887j4629J7250
25798E2125J4803L7645L937k30721n8236J20824N0914n4826k379n596j23115m8468
25786b43093K5241O0667Q7349l1405m0221O9295K5276p3444J4728J081O8175L1698
25774d653J4245l5482J6499O3335J01617q2922j8954P6783O1918k4942o3458l2675
25762G1311l2812l2087L547j3546q250l8464L1405l1711J506L3086M0810K6594
25750E1389N8979N1539R7191J4576n9026j0698j17794l224J77164J20692j59831
$$ plain form
25831 -16731 -84793 -125498 -108705 -58896 14371 47019 133299 136880 -10044 2086 130277
25820 130277 213439 110792 -99831 -88459 111367 151290 59700 -45400 -50841 -85079 51480
25809 51480 170222 127929 78586 166502 139780 125446 15093 -22383 49504 34875 52125
25798 52125 66928 104573 108510 -122211 -180447 -59623 -8709 -63535 -65914 -71510 -194625 -243093
25786 -243093 -217852 -157185 -69836 -101241 -141462 -72167 -46891 -120335 -105607 -104526 -36351 -4653
25774 -4653 9592 -25890 -9391 53944 155561 72639 53685 130468 192386 167444 103986 71311
25762 71311 38499 6412 9959 -3587 -11837 -50301 -18896 -50607 -49101 -16015 24795 51389
25750 51389 110368 161907 259098 273674 214648 203950 86156 82932 260096 380788 220957
25739B20957j11747k391M839l5250R475o3974p2413L6972J19582O3569n8672p6493
25727C4454Q4566k6307m0674p1230o1197j28052Q5945J17634J7416O060J34827
25716A53442L5602p7526q0767j0427O6461P4713l2828o6337m4873k1318O7229
25705F3371J8584P785o0875p7971N9814J3957j27968p4840R6402P9036P6998q0542
25693f249k9850M8348J4528O3101p3257l9336Q5795q3309O527R3369K7130r7494
25681I303M4793K371N8632j7866o8412j0829L8068P286j3168p6790J7715M5650
25669C6753r0965k2586J01207J6451o0557m5822j27l6529J06687J53642L982p1055
25657I1081o9476j701n0895L0499J14654M4044L9309l4015o0951o6187m7350p8321
$$ plain form
25739 220957 109210 106819 111658 76408 85883 21909 -50504 -13532 106050 169619 110947 34454
25727 34454 119020 92713 52039 -19191 -80388 -208440 -122495 -4861 12555 18615 153442
25716 153442 189044 111518 30751 20324 86785 161498 128670 62333 17460 -3858 63371
25705 63371 81955 89740 28865 -49106 10708 24665 -103303 -178143 -81741 -2705 74293 -6249
25693 -6249 -36099 12249 26777 89878 16621 -22715 63080 -20229 -13702 79667 106797 9303
25681 9303 54096 56467 115099 97233 28821 17992 56060 63346 50178 -26612 -8897 36753
25669 36753 -54212 -76798 24409 40860 -19697 -65519 -65646 -102175 4512 158154 162136 91081
25657 91081 21605 19904 -30991 -492 114162 158206 197515 163500 102549 36362 -10988 -89309
25645h9309j929J05298J00359M972m4823l1966J8336M8818j22469j30673o2813
25634b06199n0498J61417Q5197j69633Q8679P2026P9639j9944j45890j8299L2021
25623i1484l5393J9728R4230J7614k1916M4587J27389k0077j7448m8440n687k2859
25611D0244m3851N0638j27030J8873J02119J445P36j687J7158O3067l206j07153
25599A1353M415J839N1928j8108M4846n038o161P9264N3995j31110k53861j81312
25587c47950P2550N7361K551P8519J1252n8970P0167Q8727n1635m6319O0269J02445
25575C8967J25703O5545n8264q6029l2057P4393L3893N5462p0065j42477L5595
25564D0666l8680j3131j1063R987j13681J6360L610p7755P5743j4807J4275L7424
$$ plain form
25645 -89309 -91238 14060 114419 119391 74568 42602 60938 109756 -12713 -143386 -206199
25634 -206199 -256697 -95280 -10083 -179716 -91037 -19011 60628 40684 -105206 -123505 -91484
25623 -91484 -126877 -107149 -12919 4695 -17221 27366 154755 134678 117230 68790 63103 40244
25611 40244 -3607 47031 -79999 -61126 40993 42438 43174 41487 58645 121712 118506 11353
25599 11353 15768 17607 69535 51427 96273 91235 85074 164338 218333 87223 -166638 -347950
25587 -347950 -275400 -218039 -215488 -136969 -125717 -184687 -114520 -25793 -77428 -123747 -63478 38967
25575 38967 164670 230215 171951 85922 53865 128258 162151 217613 147548 5071 40666
25564 40666 1986 -11145 -22208 -12221 -125902 -109542 -105932 -183687 -107944 -122751 -108476 -71052
25552g1052o6408l5597n6471r8493K0589J02451J14434O9587Q2882P6714r1285
25541D7351p1069o3339J7005L1870R9003J2678r2329n0480m6144k5554O1351R6695
25529A7038J9841j8545R1815k4073k3060n1365M5573j31925k4247K2133J45625
25518F8810J20393k08361j66065K29719J43641m4738m6743k7117o7390N7376J0289
25507F9814K369k8535l4093j67913m6660R7307J8795j9493O9154N6065J8536m4553
25495i207m9811o2095k0052M7284N7103M4682j7020p8589o9690m5441K6850L5054
25483a40932P2379o193o6280J12468L9055q7769J11466L5304l9092j15983m6108
25472a31685O3696q90j5104p2077q9913L7029O0554J47090j5578j35817p3475
$$ plain form
25552 -71052 -137460 -173057 -229528 -328021 -307432 -204981 -90547 -20960 61922 138636 47351
25541 47351 -23718 -87057 -70052 -38182 60821 73499 -18830 -69310 -115454 -141008 -79657 17038
25529 17038 36879 18334 110149 86076 63016 11651 57224 -74701 -98948 -76815 68810
25518 68810 189203 -19158 -185223 44496 188137 143399 96656 69539 2149 59525 69814
25507 69814 72183 43648 9555 -158358 -205018 -107711 -88916 -108409 -39255 16810 35346 -9207
25495 -9207 -59018 -121113 -141165 -93881 -36778 7904 -9116 -87705 -157395 -202836 -175986 -140932
25483 -140932 -68553 -74746 -141026 -28558 10497 -77272 34194 69498 30406 -85577 -131685
25472 -131685 -67989 -68879 -83983 -156060 -245973 -208944 -148390 -1300 -16878 -152695 -226170
25461b26170M2471J34328R6849o3883R3547R391n1179n9132Q7667m5183O9043
25450H7749R071j06111m4658p861R154L2064P953r6936l3824n2206n2370N4396
25438a93579P9497j3831m9907Q2511O3017P572L3492P1770k9270O0216J1936p4734
25426D8690r1674L0945J00517q552m6858J7480q2473p7270R9698J1897n207p819
25414a0626L7129K7152J9874p4309n6080j12080R3550J04286l4362j03334q0753
25403a89553N6415q932l1994j5992J9679L5528R806J04684M995P6823l9078N5487
25391G7868P8529N0582J11697l5468j30926n1736K6125J363k2187j3556J03018
25380A95309J2183p1042p7419p3226l8631l1144P5231j20013l3102J4627M7990
$$ plain form
25461 -226170 -183699 -49371 47478 -16405 77142 86533 35354 -23778 63889 18706 87749
25450 87749 96820 -9291 -53949 -61810 -52656 -20592 -12639 -109575 -143399 -195605 -247975 -193579
25438 -193579 -114082 -127913 -177820 -95309 -32292 -24720 8772 80542 51272 111488 123424 48690
25426 48690 -42984 -12039 88478 79926 33068 50548 -31925 -109195 -9497 2400 -2807 -10626
25414 -10626 26503 53655 73529 -780 -56860 -168940 -75390 28896 -5466 -108800 -189553
25403 -189553 -133138 -142070 -174064 -190056 -170377 -134849 -125043 -20359 -15364 61459 22381 77868
25391 77868 156397 206979 318676 283208 152282 100546 126671 128034 105847 92291 195309
25380 195309 207492 136450 59031 -14195 -52826 -83970 -8739 -128752 -161854 -147227 -99237
25369i9237Q7927l9024J01142J24240P3252q1955j03179m9114M5438M8527p1631
25358C6386O911M0600K5486P9789K9281k6555r8795k7581p4661o7102L0653J43030
25346I7442k616o3395K8022L872K8144L9334j10500n5841k9710L446p275O4767
25334d310K0117M7233l1131o5079p8626p6877M5130Q6818R1109P002J2250l3725
25322A9911N4122J23632J9056m7263m2887n0077r5348O5956J2355p5072J08664
25311I3049L5808j8932M0841R4335k6149n6639q3099L1508J19491k6516M502k0295
25299A87904j10253K2384k6722L8867J4408P2296N4971q465m7908j51526j24806
25288g8850P4879J25603q0934r4815N647M5010J5461l6957j2502N6179L6309J8949
$$ plain form
25369 -99237 -11310 -50334 50808 175048 248300 166345 63166 14052 59490 108017 36386
25358 36386 43297 83897 109383 189172 218453 191898 93103 65522 -9139 -76241 -45588 97442
25346 97442 94826 31431 59453 63325 91469 130803 20303 -35538 -65248 -61802 -69077 -4310
25334 -4310 15807 63040 31909 -33170 -111796 -188673 -143543 -56725 34384 41386 53636 19911
25322 19911 74033 197665 216721 169458 126571 76494 -18854 47102 59457 -15615 93049
25311 93049 128857 109925 150766 245101 218952 162313 79214 110722 230213 203697 208199 187904
25299 187904 77651 100035 73313 112180 126588 198884 253855 245390 197482 45956 -78850
25288 -78850 -3971 121632 40698 -54117 -48470 -3460 12001 -24956 -37458 18721 55030 73979
25276G3979P3090j11397r4910k6079L4150L5010M7607J01162O7417j9257o5867
25265A14905j18960j27548J9175Q9606L8887n945M1076m9293K3589m7420j02433
25254a24361k6501r817N0411o8381O4731m6035O0629j40889l178J728J59602M2234
25242c9827L4714K1091M9353q1305m5550j43289P0389P7270p6392N4309L6901
25231d2336J08550N6028J7746P1022P0718m6179j12173l3972l3268Q097r1431
25220b7198k267K9290J62491J8333j1916q7307m6450r5818L3798P2278L1597j44545
25208f7714j62295l3112J12900M5324J89393R8082k0012p5968r993o4991J6047
25197B7661k2234j11354j2166N3140K9573m8271p226P1623M5603k9435j37924
$$ plain form
25276 73979 147069 35672 -59238 -85317 -51167 -16157 31450 132612 200029 180772 114905
25265 114905 -4055 -131603 -112428 -22822 16065 10120 51196 1903 25492 -21928 -124361
25254 -124361 -150862 -160679 -110268 -178649 -113918 -159953 -99324 -240213 -243391 -241663 -82061 -39827
25242 -39827 -5113 15978 65331 -15974 -61524 -204813 -134424 -57154 -133546 -79237 -42336
25231 -42336 66214 122242 139988 211010 281728 235549 123376 89404 56136 64233 -27198
25220 -27198 -29465 -175 162316 180649 168733 81426 34976 -60842 -27044 45234 76831 -67714
25208 -67714 -230009 -263121 -150221 -104897 84496 182578 162566 86598 76605 11614 27661
25197 27661 5427 -105927 -118093 -64953 -35380 -83651 -90877 -19254 26349 -3086 -141010
25186a41010j7212k22K9253P6838J5482m6695k2541R0173O2213r952j05883p0095
25174a39651n7303j2378J7439N3027j2575n9087N6674Q3419l6330J7243J42928
25163E3406O5615o8103J5832l9283q8321J49687J02409l9299R025J43735J3906
25152C18609j33393k59903l3800J35631L0802N5456J7556p7164r8754j04485m6811
25141a96256R7083L8994J34553q6203M2349o8898j14630p0949O2661P8480m1437
25130a24253K4692o1489j3708J52529J83587l0249q2458m6645o0529o4158J35167
25119A2486J40307l157j2909P241j57485j45005P2574J13165Q035m398M3566O2651
25107A37071k4011J2869j4889P9694k9667l3648n8955j4426q9078j33822P9688
$$ plain form
25186 -141010 -158222 -158444 -129191 -52353 -36871 -83566 -106107 -15934 46279 36327 -69556 -139651
25174 -139651 -196954 -209332 -191893 -138866 -151441 -210528 -153854 -70435 -106765 -89522 53406
25163 53406 119021 50918 66750 27467 -60854 88833 191242 151943 160968 304703 318609
25152 318609 185216 -74687 -108487 27144 57946 113402 130958 53794 -44960 -149445 -196256
25141 -196256 -99173 -60179 74374 -11829 30520 -38378 -153008 -223957 -161296 -82816 -124253
25130 -124253 -99561 -161050 -174758 -22229 161358 131109 48651 2006 -58523 -122681 12486
25119 12486 152793 149636 136727 143968 -13517 -158522 -85948 27217 35252 30854 74420 137071
25107 137071 113060 125929 111040 190734 161067 127419 68464 54038 -35040 -168862 -89174
25096h9174J30376P2956q662j37516j30683N3479N5450m2869Q685P5435J43763
25085A31240N931J05424k2975j70831P4132N2833j5702j22987j37793l8985N4507
25074h5206p1745O1305K6896N1513j955n0113O1472l6358O2228K2143N708l3972
25062A1916L0514O4357j40399K3795J87789j1502l8499O2096L8569j13272p0908
25051D4456k1532N5918n8469J24851J4013j31294l8116Q314p4310p5715N6697
25040i5187N3813m5241j7012K6163J9954M4505m5645J6618m7311O5296m0463J13821
25028D9311N8085p8871m7539j3988j5788Q2911k6745M177M5654J4987n5261J8998
25016C5931m897j2150l8405j00978j01297Q916J4987K8637J8272Q261j8149J4461
$$ plain form
25096 -89174 41202 114158 105496 -32020 -162703 -109224 -53774 -96643 -87958 -12523 131240
25085 131240 137171 242595 219620 48789 122921 175754 160052 37065 -100728 -139713 -85206
25074 -85206 -156951 -95646 -68750 -17237 -19192 -69305 -7833 -44191 18037 40180 45888 11916
25062 11916 42430 106787 -33612 -9817 177972 166470 127971 190067 228636 115364 44456
25051 44456 22924 78842 20373 145224 159237 27943 -10173 -1859 -76169 -151884 -95187
25040 -95187 -41374 -86615 -103627 -77464 -57510 -13005 -58650 -42032 -89343 -24047 -64510 49311
25028 49311 107396 28525 -19014 -33002 -48790 34121 7376 11553 57207 72194 16933 35931
25016 35931 31034 18884 -19521 -120499 -221796 -212880 -197893 -169256 -150984 -142723 -160872 -146411
25004a46411M8745m8778r9739L8020j9219J7469P4790J3163M5000M3879r9475
24993a32556M6219M6903n1816j02303R4932K1540p6188P7617J50056m1033k4635
24982H736k0396q6607o5473p686k3203n3612K496J40604M6140n528M8737K9600
24970A3808O5790K8148m0614q7162l3206r8445l6813J720J29734K4946O5207Q4899
24958A18012l6538l2006l5915J13288P3555j04130o4644L7459R0372L1027n5803
24947A34677j04975N4013R0095J7332j23988q9380O7881J8317j53344q844P6796
24936b1420L7765l9656M3034M1601j0046M8056L4902j6270q9762J77270K3036
24925B28510j01070j86889p2874R9416N7017R2309J7491P983q3444o7060L5277
$$ plain form
25004 -146411 -97666 -146444 -246183 -208163 -227382 -209913 -135123 -121960 -76960 -33081 -132556
24993 -132556 -86337 -39434 -91250 -193553 -98621 -77081 -153269 -75652 74404 33371 8736
24982 8736 -11660 -98267 -163740 -171426 -194629 -248241 -245745 -105141 -59001 -64529 -15792 13808
24970 13808 79598 107746 67132 -20030 -53236 -151681 -188494 -186774 -57040 -32094 33113 118012
24958 118012 81474 49468 13553 126841 200396 96266 31622 69081 159453 190480 134677
24947 134677 29702 83715 173810 191142 67154 -22226 45655 63972 -89372 -98216 -21420
24936 -21420 16345 -23311 19723 61324 51278 99334 134236 117966 28204 205474 228510
24925 228510 127440 -59449 -132323 -32907 24110 116419 133910 141893 58449 -8611 26666
24914B6666L3590p3671j24126j13509N8181J09805N0460K47j1820O7011O8761
24903I1595o726j28786j10581q9113j67Q6401M5166J2702l4478J6774J8907n8346
24891a56652o2577N2582R8734J27221j3091m509j2015j7449j4475o1613N9277
24880d567K8353K5983j17637p4606L2878N1954L9242l711J01375O454O0423Q960
24868A55101n8227k9558m3411p6771j34279k4420K4596P6021J27968K955K7776
24857D7751O6276K9357m3574j25725l2268J4054O3527k3159L4719J2807J3030
24846E6795j1310p8456J07645J08619l9425m8988l5113Q00M1750J26917O7518
24835B96752r0418M9803j23432n9251O5510k8718L3729j9069l1256j09986m5694
$$ plain form
24914 26666 60256 -13415 -137541 -251050 -192869 -83064 -32604 -32357 -44177 22834 91595
24903 91595 84869 -43917 -154498 -243611 -243778 -157377 -112211 -99509 -133987 -117213 -98306 -156652
24891 -156652 -219229 -166647 -67913 59308 46217 41708 29693 12244 -2231 -63844 -4567
24880 -4567 23786 49769 -67868 -142474 -109596 -57642 -18400 -22111 79264 85718 146141 155101
24868 155101 96874 67316 23905 -52866 -187145 -211565 -186969 -110948 17020 19975 47751
24857 47751 114027 143384 99810 -25915 -58183 -44129 19398 -3761 30958 43765 56795
24846 56795 45485 -32971 74674 183293 143868 94880 59767 60567 102317 229234 296752
24835 296752 206334 256137 132705 73454 138964 110246 143975 124906 93650 -16336 -62030
24824f2030N9818k0766o4875j19173J9116J19233L6752p7305L7878l382O9569
24813e165O7089M0008J9249j9696J7412J12118O164j47204m1653l6199p5547O701
24801e6723L9750N9519Q0359k6117n1136o9417k7253m9972J4777l6503K3227J9999
24789g9490J1991r6498m6748J20685J15803N7101m2413j52181k8286J08091J23771
24778I1826j177o5488l1145k2898j09953n1417J02632J44805O3307J72242n6746
24767B35988j43626r0982j7911p3n1191L8613n3752M4530K6524m8234J47459m689
24755H2656L6777j42985p620N210O2015K8135J6906p9746q5774Q8658L4550N903
24743D4685p0644k129R3930j17540k4036o7487p8995J5707N5456N9123n5339N3687
$$ plain form
24824 -62030 -2212 -22978 -87853 -207026 -187910 -68677 -31925 -109230 -71352 -74734 -5165
24813 -5165 61924 101932 121181 101485 118897 231015 237179 89975 48322 12123 -63424 -56723
24801 -56723 -16973 42546 122905 96788 45652 -23765 -51018 -100990 -86213 -122716 -99489 -79490
24789 -79490 -67499 -163997 -210745 -90060 25743 82844 40431 -111750 -140036 -31945 91826
24778 91826 90649 25161 -5984 -28882 -138835 -190252 -87620 57185 120492 292734 235988
24767 235988 92362 1380 -16531 -16604 -67795 -29182 -82934 -38404 -11880 -60114 87345 82656
24755 82656 119433 -23552 -31172 -25962 36053 64188 81094 1348 -84426 4232 38782 44685
24743 44685 -25959 -28088 65842 -51698 -75734 -143221 -222216 -206509 -151053 -91930 -147269 -93582
24731i3582J61069K4265j22837n8839R9052m591k6961Q2129M8767N9030j1846
24720A55656j6818l9115l6381q7187M2482Q6330o2806j6452j942M3516o3056j09511
24708a05284p3217K8425J25855p5903r4894Q9384J02948O6646J15909K2272m7799
24697A54342j34964o5871m796J06955J908j39178R0285O7050P704R694j31504
24686c8375p5638k8840O7723J72632n0972j9230K5839l8361n7411m5135R5689
24675G921J1860k2977N1776M0757O3735J5880j00406p1388j32986n4715K7507
24664a63036J02459Q7980r9170j44930P3628J35638P3215O4757n3429j07330p3443
24653a03661m9907M3990N8087L2815R8216N899N2066j6306o26j687n5299M9336
$$ plain form
24731 -93582 67487 91752 -31085 -89924 9128 4537 -22424 59705 108472 167502 155656
24720 155656 138838 99723 63342 -23845 18637 104967 42161 25709 23767 67283 4227 -105284
24708 -105284 -178501 -150076 -24221 -100124 -195018 -105634 -2686 63960 179869 202141 154342
24697 154342 19378 -46493 -51289 55666 57574 -81604 8681 75731 83435 93129 -38375
24686 -38375 -114013 -142853 -75130 97502 46530 27300 53139 14778 -42633 -87768 7921
24675 7921 19781 -3196 48580 89337 153072 168952 68546 -2842 -135828 -190543 -163036
24664 -163036 -60577 27403 -71767 -216697 -143069 -7431 65784 130541 77112 -30218 -103661
24653 -103661 -153568 -109578 -51491 -18676 79540 85439 137505 121199 120573 118886 63587 112923
24641A12923O458N1268L7739n9657o6575r8243L0535P8450K4056L2769R6554N789
24629B52066R3769j6410j32233j26688l2864N7671j48404p3272L9385Q4654L7686
24618C5360k715n3591N3730k3920n2309L2321L8196k0288j00677P5245L6551p102
24606A0801L1592q7147N7967J04362n2401J15268J07520m2222j42906r8430r250
24595d846l5723J50350M3932k0309l4008l8508N762K610m5044l4433q675L3670
24583A4778n7472l7423M1821m4338j70727j00568M6661J09325k7106P955m479
24572b21573L688J28387J88689J4477J20732J5237l5583o5859k9159M3889l3708
24561A29217o8347o7954K9416M7723k3478j23198k147Q2419R5827m6972K2243
$$ plain form
24641 112923 119381 170649 208388 148731 82156 -16087 14448 92898 116954 149723 246277 252066
24629 252066 345835 329425 197192 70504 37640 95311 -53093 -126365 -86980 -2326 35360
24618 35360 32645 -20946 32784 8864 -43445 -11124 27072 6784 -93893 -18648 17903 10801
24606 10801 42393 -44754 13213 117575 65174 180442 287962 245740 102834 4404 -4846
24595 -4846 -40569 109781 153713 133404 99396 60888 66650 69260 24216 -10217 -18892 14778
24583 14778 -42694 -80117 -38296 -82634 -253361 -353929 -307268 -197943 -225049 -217094 -221573
24572 -221573 -217885 -89498 99191 113668 234400 249637 214054 148195 119036 162925 129217
24561 129217 60870 -7084 22332 70055 46577 -76621 -78768 3651 99478 52506 74749
24550G4749O854L5518l6826j08966j0569J40618K8942J1616Q1907q3221j90577
24539d9955p5211j0329J36894Q2167p6591j411L7365o3010k8648k252N170N0060
24527D249R3497K437N3930r851o2319j5605m2198J943n6466j65726l8449K4873
24515b09685J55240J74216k5437j35698n656j7898o2262L0085J51151M3795l9787
24504E8064p9522r0241m9817J01916J24072K4657L9093m0212q0665M1141M2026
24493I0512j37980n7834l642m1640J13503O4941l9735r1143P4392M0176j27634
24482a16084P9619k4087O5502R430m3281p1410N583M3665L972j15945k5978J44655
24470d4359J17856R0596n0618j36755n2746j4150k3677O4188P5378O2756Q2678
$$ plain form
24550 74749 81603 117121 80295 -28671 -39240 101378 130320 141936 223843 140622 -49955
24539 -49955 -125166 -135495 1399 83566 6975 5564 42929 -20081 -48729 -50981 -45811 4249
24527 4249 97746 100183 154113 144262 81943 66338 24140 26083 -30383 -196109 -234558 -209685
24515 -209685 -54445 119771 94334 -41364 -47020 -64918 -127180 -97095 54056 97851 58064
24504 58064 -21458 -111699 -161516 -59600 64472 89129 128222 88010 7345 48486 90512
24493 90512 -47468 -105302 -108944 -150584 -37081 27860 -11875 -103018 -28626 11550 -116084
24482 -116084 -36465 -60552 4950 14380 -28901 -100311 -94728 -51063 -47091 -163036 -189014 -44359
24470 -44359 73497 164093 113475 -23280 -76026 -90176 -113853 -49665 25713 88469 171147
24459A71147L9354j595o6497l0544k6761j9308M2686k3698q661n4635Q852q0858
24447e0518L0552o0241l1722n602K4733j2546J51447P5619r6262K7033k9632q1214
24435e8353q7178M9465J3866P9932L5557j51868r1565J60663J18896m6840J6482
24424C9057r510N0690q5347l5232N7951m2192j5916O3880M8598P354r5946O2748
24412D6135J44740r3626l2812O9471n5575j15501m2504l7058N2479Q8936J19406
24401A44091L1632j21959j22103J15255P1683M3990K9192m9958J1848k1666n0399
24390H1606r9103m4734N6238N1438p8800R3186M587P9757L6148j47720n2638j6197
24378c6232Q6465N9082n4730k2699P9550K6292o9927j01650j2217K9023J2033
$$ plain form
24459 171147 210501 208906 142409 111865 85104 65796 108482 84784 76123 21488 30340 -50518
24447 -50518 -19966 -80207 -111929 -117531 -92798 -105344 46103 121722 25460 52493 22861 -58353
24435 -58353 -145531 -96066 -82200 -2268 33289 -118579 -210144 -49481 69415 22575 39057
24424 39057 29547 80237 -5110 -40342 17609 -24583 -40499 23381 71979 79333 -16613 46135
24412 46135 190875 97249 64437 133908 78333 -37168 -79672 -116730 -64251 24685 144091
24401 144091 175723 53764 -68339 46916 118599 162589 191781 141823 153671 132005 81606
24390 81606 -17497 -62231 -5993 45445 -33355 59831 64418 144175 180323 32603 -20035 -36232
24378 -36232 50233 109315 54585 31886 111436 137728 67801 -33849 -46066 -17043 -5010
24367e010l7323q4280O7015k5624N143L4015j5620L5452m5011k20656K2945K40455
24355b8499p185j6707j8025N4940o8101O2724Q7821K07045n57o434q810l1827
24343B26385k0224l8992J0486J0902j65720j73018l6693R778J01823J81029J39529
24332B45285M5975j11408l1451K2556j30317p9480P4993L8531p4414j4739J516
24321a2953o3841r5012J2844P2736O6342p5729q9703O8407O6316o3778M1535R4946
24309B2110Q2962j8882p6784J5521Q7543m8555q5059P9376j0917n8069j77632
24298a88386o0064P9477k094R1106J08777N658j49145j7825J17599k7485O5630
24287B3248J1872l0139J0710L5490r4538m8559P4988K3216J30353K9392n3840
$$ plain form
24367 -5010 -42333 -126613 -59598 -85222 -80079 -46064 -61684 -26232 -71243 -291899 -268954 -28499
24355 -28499 -35684 -52391 -70416 -15476 -83577 -20853 66968 274013 273456 267022 258212 226385
24343 226385 206161 167169 177655 188557 22837 -150181 -186874 -177096 -75273 105756 245285
24332 245285 291260 179852 148401 170957 40640 -38840 36153 74684 270 -14469 -12953
24321 -12953 -76794 -171806 -158962 -86226 -19884 -95613 -185316 -116909 -50593 -114371 -72836 22110
24309 22110 105072 86190 9406 24927 112470 63915 -21144 58232 47315 -10754 -188386
24298 -188386 -248450 -168973 -171067 -79961 28816 34474 -114671 -132496 -14897 -42382 23248
24287 23248 35120 4981 15691 51181 -43357 -91916 -16928 6288 136641 166033 112193
24276A12193P2938o0702k516L8190n6159p9848M4032j3252m7911M9471k1703N3783
24264H8516j07413j21215N9652J05078Q3021R859p8058m8239J2072M6406j2956
24253C6723o8511j4175m2720M4903j9724l2298J47811P6688J3932r9031j03676
24242f0078K7942R8634n8496P599J4373J07293p769m9640P762l4157m4135j5024
24230e696k0282p7087r9599n9835J10339N4520p1456N2835J27502L933j32909
24219a17735j2499J7235J9770N5160L7023m664k01899j05492l0600J09314J34784
24208i9603N5711r7885Q4114O6423r033R9034j8199p1599o8186j20943l7147J6904
24196b00409J05191J12853N4432o4271L7082P7324o1578j7726o4976L5802R0320
$$ plain form
24276 112193 185131 124429 121913 160103 103944 24096 68128 54876 6965 56436 34733 88516
24264 88516 -18897 -140112 -80460 24618 107639 117498 39440 -8799 3273 49679 36723
24253 36723 -31788 -45963 -88683 -43780 -63504 -95802 52009 128697 142629 43598 -60078
24242 -60078 -32136 66498 8002 15601 29974 137267 129498 79858 87620 53463 9328 -5696
24230 -5696 -25978 -103065 -202664 -262499 -152160 -97640 -169096 -116261 11241 15174 -117735
24219 -117735 -130234 -112999 -93229 -38069 -1046 -5710 -207609 -313101 -343701 -234387 -99603
24208 -99603 -43892 -141777 -57663 8760 -273 98761 80562 8963 -59223 -180166 -217313 -200409
24196 -200409 -95218 17635 72067 7796 44878 122202 60624 42898 -22078 13724 104044
24185A04044M478j40875l8138j8748m9699J27739J73926J5180R852O776o8763
24174A25772r437K9739j5690l8433k0593J35855k9231k8112r9212j323R5968l5455
24162A09848j27290k5825R755J10678J37569n8531l6537j32247l6785j06796j996
24151a58157j6643N0210Q1985m7857k6479K4822J01194J20278j28952r3868j04767
24140a98234K1896N5660J53643k3306q5228k6884O8712J43363O7533q5772j19091
24129b7708N3920l9338j58823r4253N053J08555M6678M4568P6967k93j60760n9837
24117b05271J40850Q848P5228q069L7167o107j02025k02627R94J25102J6287J64745
24105D5122K0479j52636l9299J60850Q0813Q5442q465j25288j44542n4890P2805
$$ plain form
24185 104044 108522 -32353 -70491 -89239 -138938 -11199 162727 177907 187759 194535 125772
24174 125772 116335 146074 130384 91951 71358 207213 177982 149870 50658 49335 145303 109848
24162 109848 -17442 -43267 -33512 77166 214735 156204 119667 -12580 -49365 -156161 -158157
24151 -158157 -174800 -124590 -42605 -90462 -116941 -92119 9075 129353 401 -93467 -198234
24140 -198234 -176338 -120678 32965 9659 -75569 -102453 -33741 109622 177155 91383 -27708
24129 -27708 26212 -13126 -171949 -266202 -261149 -152594 -105916 -61348 15619 15326 -145434 -205271
24117 -205271 -64421 -55573 19655 11586 48753 42646 -59379 -262006 -261012 -135910 -119623 45122
24105 45122 65601 -87035 -126334 34516 115329 200771 192306 67018 -77524 -132414 -59609
24094e9609m5154j5428L8717J39733J32216O6958m3463r6229j4117N964p2947
24083C6641k7027j16416k785q0833L4038N574m3495k1080P8466J56565M2164K9681
24071I1493p4040j5825J37231p3903o7956N0076n1592j32078q0939l0396N8116
24060a89813J6649J09340J17694N2281K2820k4603k7811j8738q6383J00147R1785
24049A63368N057r1852j943O8341J4384n8451k1318O0565o546n0821r0626j41751
24037a51593K5222Q2009l7743j01395k5028J22548K7308J17070Q0561M3500M1048
24026B23507o366K0118O180j19418J7331j08364l4239P443P5323N0718O4688K1385
24014B18306n2506j63564O40P9830L5985N5041o7596P762m756K9100J1782N2508
$$ plain form
24094 -59609 -104763 -120191 -81474 58259 190475 257433 213970 117741 103624 109588 36641
24083 36641 9614 -106802 -109587 -190420 -156382 -150808 -194303 -215383 -136917 19648 61812 91493
24071 91493 17453 1628 138859 64956 -3000 47076 -4516 -136594 -217533 -247929 -189813
24060 -189813 -173164 -63824 53870 106151 128971 104368 76557 57819 -28564 71583 163368
24049 163368 168425 76573 74630 142971 157355 98904 77586 138151 131605 80784 -9842 -151593
24037 -151593 -126371 -44362 -82105 -183500 -208528 -85980 -58672 58398 138959 182459 223507
24026 223507 217141 237259 243439 124021 141352 32988 -1251 6192 81515 132233 196921 218306
24014 218306 165800 2236 2876 82706 118691 173732 106136 113898 109142 138242 150024 202532
24002B02532j36141j0665l7612n7271l29j07455Q7902L9572m3693M1805P9591
23991E8236J1454O2928n303o250k2562k8104m6669M9591K8058m9366j1052q6399
23979d5438r4292O9953K6161m2678j5231o634M9015l013K0257L688n2482J5182
23967g5512N284P1532J4206n8820j8868L829Q4878Q989J02870r4602j05972n071
23955f7257L0593L0898k3786J8483k9836n3874P5915k3521J19748n1295j01972
23944g5904L5920M9053j64225M2052J45666m2309p4562l0853J52704l9400l6422
23933c8280o5130p525N2865Q6794K3131r5964j2234l824N795j659q5571p8531
23921b20133j1743J01194L4631m5219j25962k706R1126n3407P3066P8242L4934
$$ plain form
24002 202532 66391 55726 18114 -39157 -39486 -146941 -59039 -19467 -63160 -21355 58236
23991 58236 69690 132618 127315 121065 98503 70399 23730 73321 101379 52013 40961 -45438
23979 -45438 -139730 -69777 -43616 -86294 -101525 -108159 -59144 -62157 -41900 -38212 -90694 -75512
23967 -75512 -70228 1304 15510 -43310 -62178 -58349 26529 35518 138388 43786 -62186 -67257
23955 -67257 -36664 -5766 -29552 -11069 -40905 -94779 -18864 -42385 77363 26068 -75904
23944 -75904 -39984 9069 -155156 -113104 32562 -9747 -84309 -115162 37542 -1858 -38280
23933 -38280 -103410 -110935 -58070 28724 51855 -44109 -56343 -60167 -54372 -56031 -141602 -220133
23921 -220133 -231876 -130682 -96051 -141270 -267232 -269938 -178812 -232219 -159153 -80911 -45977
23910d5977L6529o712l7785M612j9498p413L1533K4178l7897n3675k4172q494
23898a44771j10800J4730N2558N9245P7010J4670J0640J7770o3709k0633N5558
23887c7732q938j9194J45318N1734j37825k4106J82288m8521l8854O7037p207
23876A24000q2623o3183R3605J1231L3621J8720l7284k7747o551p9227l9142R1202
23864C6622J00562M2265l8624J8517j18752k6425N8967n7490l8878M4903N7850
23853G9517O4273Q4973j4421O0009j2405j09149j35171j07290Q3001m5442k8821
23842h0926P7782O7826j5247n3560m7907K4496j7890O866m2243j7063j730j31937
23830b31533M8985J59561N8904j63550p9452O14n3227m1899J58886J13551k4407
$$ plain form
23910 -45977 -9448 -16160 -53945 -49333 -68831 -76244 -44711 -20533 -58430 -112105 -136277 -144771
23898 -144771 -255571 -240841 -188283 -129038 -52028 -37358 -26718 -8948 -72657 -93290 -37732
23887 -37732 -46670 -65864 79454 131188 -6637 -30743 151545 103024 64170 131207 124000
23876 124000 41377 -21806 71799 83030 116651 135371 98087 70340 63789 -15438 -54580 36622
23864 36622 137184 179449 140825 159342 40590 14165 73132 15642 -23236 21667 79517
23853 79517 143790 228763 214342 274351 261946 152797 17626 -89664 -6663 -52105 -80926
23842 -80926 -3144 64682 49435 -4125 -52032 -27536 -45426 -38560 -80803 -97866 -99596 -231533
23830 -231533 -182548 -22987 35917 -127633 -207085 -206471 -259698 -301597 -142711 -29160 -53567
23819e3567l9556Q688k8913J50639O5033n3809j38551P7469L243k9317l7892j43660
23807b20193N8648J57001J03797m3451J9263m0313j00234j75445N407L4344K1277
23796a79899N6799M9205R4682n3430K9806L9163j54432P7905P6862j04079k4101
23785i1519O406N7839O0702k1641j42158m681L2986L6762N2739K0040j01557n0874
23773a44956p2957j1402K2690M0020J3553N5784m1828l5727J24559J31298j4352
23762F6682n8211j8062K9496o7592o0301m4611j8253L1222Q446P1596J73719J33101
23750B47232m1901j19556l7592j18893j04683o7626J26174M5009N785r0876R9017
23739e7910R3245o7562j9529k6566m435J42062N0676l3578P240o0604j09333R3366
$$ plain form
23819 -53567 -93123 -84435 -113348 37291 102324 48515 -90036 -12567 -9324 -38641 -76533 -220193
23807 -220193 -161545 -4544 99253 55802 75065 34752 -65482 -240927 -235520 -201176 -179899
23796 -179899 -123100 -73895 20787 -32643 -2837 36326 -118106 -40201 36661 -67418 -91519
23785 -91519 -85113 -27274 33428 11787 -130371 -135052 -102066 -65304 -12565 7475 -94082 -144956
23773 -144956 -217913 -229315 -206625 -166605 -153052 -97268 -139096 -174823 -50264 81034 66682
23762 66682 8471 -9591 19905 -47687 -107988 -152599 -170852 -139630 -131184 -59588 114131 247232
23750 247232 205331 85775 48183 -70710 -175393 -243019 -116845 -71836 -66051 -156927 -57910
23739 -57910 35335 -32227 -51756 -78322 -82757 59305 109981 76403 83643 23039 -86294 7072
23727G072l1386m0519q1416m6067J8023N7680O2345K5345j9857M99J3787k4742
23715e9236J00250k233j04952n0642N6145m0130m6628Q3578K1335J46374M4466
23704A48327k0836O1861J2557r7206k6867N5008k922J1680J5962j12426l0082
23693A5056o0183L9844J03950j0034n1331L341o3814m6881P9244P578M3134J06929
23681A66833k6989j23851j13022l0790j09395L0678L4541L9464p5540k4452O5626
23670a66897L8544j06758O0227J22646n4057j42524l4930P7191O8822l6770p1562
23659b46068L6295J10950J61280M957k7981j1597P5720k7028J4424R0245O7594
23648B48791r669p2535M8684O219j37449j21123J6970q0034q703Q9391N6887Q4930
$$ plain form
23727 7072 -24314 -64833 -146249 -192316 -174293 -116613 -54268 -28923 -48780 -48281 -34494 -59236
23715 -59236 41014 38781 -66171 -116813 -60668 -100798 -147426 -63848 -42513 103861 148327
23704 148327 127491 189352 201909 104703 77836 132844 129922 141602 157564 45138 15056
23693 15056 -45127 -5283 98667 88633 37302 40643 -23171 -70052 9192 16770 59904 166833
23681 166833 139844 15993 -97029 -127819 -237214 -206536 -171995 -132531 -208071 -232523 -166897
23670 -166897 -128353 -235111 -174884 -52238 -106295 -248819 -283749 -206558 -137736 -174506 -246068
23659 -246068 -209773 -98823 62457 67414 39433 27836 103556 76528 90952 181197 248791
23648 248791 239122 166587 215271 221490 84041 -37082 -20112 -100146 -108849 -19458 37429 122359
23636A22359n0753N7818K5182m8102O4879L3103j1714L4271n9145j09839P6841
23625A34900l5544o4227J16293P1566p3190m7750o2437o2370j07392r2487j0836
23614b33474l8995Q0447O3370J2916O5186M3181Q011O2044p0931j72665J0855
23603a70055P2325J3340n3957r404M390R2291Q9029m4478Q2808K6220p1595r0593
23591e9679j0694N7593L8928m7322j0963J24071L0946l1067j30675o7295m9840
23580a55997l1485K6609J51197R4377K6787j05215p2001K3682P6323R228P210
23569E0715J2261L6320P1215l9449l0266P851j6508m5507j7584L842P5100K7231
23557A35221K7977m5011j26273j34501j16322R5585J60141K7878Q141l4642M2869
$$ plain form
23636 122359 71606 129424 154606 106504 171383 204486 192772 227043 167898 58059 134900
23625 134900 99356 35129 151422 222988 149798 102048 39611 -22759 -130151 -222638 -233474
23614 -233474 -272469 -192022 -128652 -115736 -50550 -7369 642 62686 -8245 -180910 -170055
23603 -170055 -97730 -84390 -138347 -147751 -143361 -51070 37959 -6519 76289 102509 30914 -59679
23591 -59679 -70373 -12780 26148 -21174 -32137 91934 122880 91813 -38862 -106157 -155997
23580 -155997 -187482 -160873 -9676 84701 111488 6273 -65728 -42046 34277 43505 50715
23569 50715 62976 99296 170511 131062 100796 108647 92139 46632 29048 32890 107990 135221
23557 135221 163198 118187 -8086 -142587 -258909 -163324 -3183 24695 32836 -1806 41063
23546D1063O764m6609p0609J29543K3854o9349L2134m2713j30764M5158J1406
23535g0122J5600p4567q2407L1179R9320n5070j37226M4079K666O4147J63875
23524A474L4076J3106n9596q7123n2243M9237N557P4749j7699j48202p3471J32532
23512a27603K3232L2903M5246J01610Q3259j42694L004m1236Q2381L9076k6971
23501G2207j25117L0839L219J9936J6528N0100P4499N4692j0254r71M8298n9541
23489A74435m3234k6123p1533j34720J212J11956j00545O4142J32119p205l0119
23478G0385l6804K2172O556J2458o9024N1675n4842N1855j16590N9006J73394
23467A70241J18429j37165j61197J8484M7971J45047m2103j25937j34800L4387
$$ plain form
23546 41063 47827 1218 -69391 60152 84006 14657 46791 4078 -126686 -81528 -70122
23535 -70122 -54522 -129089 -211496 -180317 -80997 -136067 -273293 -229214 -226548 -162401 1474
23524 1474 35550 48656 -10940 -98063 -150306 -101069 -95512 -20763 -38462 -186664 -260135 -127603
23512 -127603 -104371 -71468 -26222 75388 158647 15953 18957 -22279 60102 99178 72207
23501 72207 -52910 -22071 -18852 1084 17612 67712 142211 196903 186649 185678 233976 174435
23489 174435 131201 105078 33545 -101175 -99963 11993 -88552 -24410 107709 100504 70385
23478 70385 33581 55753 62309 74767 5743 57418 2576 54431 -62159 -3153 170241
23467 170241 288670 151505 -9692 8792 56763 201810 159707 33770 -101030 -66643
23457f6643K9114p8610J6206k0388R642P2633N5430m0292m8982R171K0511m548
23445d6756M5542O3832O3720L6757j18470l7856m6721Q4584o2780J1814Q9669
23434H3335N9380j8840j36737j0471r9371q621J16555l1187P342j10254k9824
23423a78693P4850r227k9011J178n0779Q4506L2389N1048Q4444J25969o11p1390
23411A14673j08061M4744J42869J5323q6697j43088k3212m1767q3596N660N4711
23400a08441j4061J17688J31341O6483J03326j51713l7259K1635m0246j30338
23390d1585n7687Q5289o9641K7708M5333j2756q6317O2105J43132q679j00258
23379a3356j41745n983J08757K7644K3132J7562q7194j81596J44322N6851q8729
$$ plain form
23457 -66643 -37529 -116139 -99933 -120321 -110679 -38046 17384 -22908 -71890 -62719 -42208 -46756
23445 -46756 -1214 62618 126338 163095 44625 6769 -39952 44632 -18148 -6334 83335
23434 83335 142715 123875 -12862 -23333 -122704 -131325 -14770 -45957 -38615 -148869 -178693
23423 -178693 -103843 -113070 -142081 -140903 -191682 -107176 -74787 -23739 60705 186674 186063 114673
23411 114673 6612 51356 194225 209548 122851 -20237 -43449 -85216 -168812 -163152 -108441
23400 -108441 -122502 -4814 126527 193010 296336 144623 107364 128999 88753 -41585
23390 -41585 -99272 -13983 -83624 -55916 -10583 -23339 -109656 -47551 95581 86902 -13356
23379 -13356 -155101 -161084 -52327 -24683 -1551 16011 -71183 -252779 -108457 -51606 -140335
23368a40335n0681j47913J7691K02644J58201P467n4413N016m6336L140N7059
23357A1540n0551k5456j44030N79O1399Q9481N3041R699l0611k8727o7517l3514
23345a54667L1983P7939O8541K8146M1485p6909j2836M1266m9691k399j6475m9799
23333g3416M1807J5981o1097J7443N3592J8943J6305n8018j10086l2326N1794
23322a19078k7586j15192j4906P5943J84230l8096j3116J6320O3382m2130r0550
23311a20779Q1999r693J62951Q4805j45338j55523J42913J23410j07954j65998
23301a09207j35169Q6921P5503Q5418P2166R867q0726j9778l6042P8282K1139
23290D8374j34444p0679k4567j3805O1965l4696K6900N7674r224K833o7457M0053
$$ plain form
23368 -140335 -191016 -338929 -321238 -118594 39607 47074 -7339 -2323 -48659 -45519 11540
23357 11540 -39011 -64467 -208497 -207918 -146519 -57038 -3997 5702 -24909 -53636 -121153 -154667
23345 -154667 -122684 -44745 23796 51942 93427 16518 3682 44948 -4743 -7142 -23617 -73416
23333 -73416 -31609 -15628 -76725 -59282 -5690 13253 29558 -28460 -138546 -170872 -119078
23322 -119078 -146664 -261856 -276762 -200819 -16589 -54685 -67801 -51481 11901 -30229 -120779
23311 -120779 -38780 -48473 114478 199283 53945 -101578 41335 164745 56791 -109207
23301 -109207 -244376 -157455 -81952 3466 75632 85499 4773 -15005 -51047 27235 48374
23290 48374 -86070 -156749 -181316 -195121 -133156 -167852 -140952 -83278 -92502 -89669 -157126 -117073
23278a17073R0723L0283m9139l4227J1464k4690k8237J33423r3809r5234m9396
23267b25912m0524n1680J11178J43093Q6923N0053j1263n8944J4224k4555j02179
23256a09586N586N6630p964j2885Q631n302m0527r0119o9042q1565O5853R1653
23244a88637P7421J3977j8891P1685O2516O2824N4329o0495j41856p7299R881
23233a34545L584k8224J7187K0616P5134J30893J9980j0676k9186j49613k505
23222h7355q3692j4396L5584M6333J8366N9426n0971J39483J68781j1299j16375
23211A03885j62953j16772J00811J39120o004q8151n6563R6920O2853p6574k48246
23200b51674l4241Q5898L2573N7911j41426n4436J11532J30123J3093q2554j0467
$$ plain form
23278 -117073 -26350 3933 -45206 -79433 -67969 -92659 -120896 12527 -81282 -176516 -225912
23267 -225912 -266436 -318116 -206938 -63845 23078 73131 61868 2924 17148 -7407 -109586
23256 -109586 -104000 -47370 -55334 -68219 -59588 -64890 -105417 -195536 -264578 -346143 -280290 -188637
23244 -188637 -111216 -97239 -116130 -44445 18071 80895 135224 74729 -67127 -144426 -134545
23233 -134545 -130961 -159185 -141998 -121382 -46248 84645 104625 93949 64763 -84850 -87355
23222 -87355 -171047 -185443 -149859 -103526 -85160 -25734 -76705 62778 231559 220260 103885
23211 103885 -59068 -175840 -75029 64091 58087 -30064 -86627 10293 73146 -3428 -251674
23200 -251674 -285915 -200017 -167444 -109533 -250959 -305395 -193863 -63740 -50647 -133201 -143668
23189a43668J7321m7479L1649r0225Q8029l3445O7525O0196P8503O8262l324q1051
23177A2293m9365L8187l4729j65598N2872J19627j59720j47564K9217N8928Q7751
23166a58101J25121M8856R1492q234r6719o9804p223J06876j2031n5688n9045
23155i4500R5597L1824j594l1126k335K1066k6453o6083k4165N5528M4369J52292
23143A54420o5281p895l2805Q0593q6829l8140N701J08174L1188j2300K0842p1632
23131H6036O6613n7782K2688j11806j05379k7685m3376O2209L3710k23p9611k556
23119a57162N1104J08929R7367j8296j9833J3175L3958O8997q6212K215j00829
23108f587k4016n4067R2772N3241J3883j09836k4085L4628N6159j7681n3751j810
$$ plain form
23189 -143668 -126347 -173826 -142177 -232402 -144373 -177818 -110293 -50097 28406 96668 93344 12293
23177 12293 -37072 1115 -33614 -199212 -146340 -26713 -186433 -333997 -304780 -245852 -158101
23166 -158101 -32980 15876 107368 99134 2415 -67389 -74612 32264 20233 -35455 -94500
23155 -94500 1097 32921 31327 201 -2134 18932 -7521 -73604 -97769 -42241 2128 154420
23143 154420 89139 81244 48439 129032 42203 4063 9764 117938 149126 136826 157668 86036
23131 86036 152649 94867 117555 5749 -99630 -127315 -170691 -108482 -74772 -74995 -154606 -157162
23119 -157162 -106058 2871 100238 81942 62109 75284 109242 178239 92027 94242 -6587
23108 -6587 -30603 -84670 8102 61343 75226 -34610 -58695 -24067 32092 14411 -39340 -41150
23096d1150Q5494q1452N0801K4993r3306l2302P5440q0840P2562j5752k2301j5210
23084g3023m278Q2890L8401l4565n9926q6465k2776M8425K2147o3733o1712J9463
23072a95152J3142K0682P3485K1440O1968l7497l4637J7658k6127q8967n5176
23061b29181J11462l3074j73948p300N2929J3425J347P0451J4131J14920J49351
23050H4513j28463J852L8731K5382J01190p800j80350K0820J21699q507r8142
23039b9075N9404N7943j01858m6549M4306J16149R1483o9700q7755l4439j43638
23028a43729r962P8097l1193K8949K4243K8991K9861M0124O330j14269q6356Q1287
23016f7627K9567n0939j6845J6771o8627l9122k3852k5446j02741J87064K06664
$$ plain form
23096 -41150 44344 -37108 13693 38686 -54620 -86922 -11482 -92322 -19760 -35512 -57813 -73023
23084 -73023 -77301 5589 43990 9425 -50501 -136966 -159742 -111317 -89170 -152903 -214615 -195152
23072 -195152 -182010 -161328 -87843 -66403 -4435 -41932 -76569 -58911 -85038 -174005 -229181
23061 -229181 -117719 -150793 -324741 -332041 -279112 -265687 -264340 -193889 -179758 -64838 84513
23050 84513 -43950 -42098 -3367 22015 123205 115405 -64945 -44125 77574 69067 -29075
23039 -29075 30329 88272 -13586 -60135 -15829 100320 191803 122103 34348 -91 -143729
23028 -143729 -153691 -75594 -106787 -77838 -53595 -24604 5257 45381 51711 -62558 -148914 -67627
23016 -67627 -38060 -88999 -105844 -89073 -157700 -196822 -220674 -246120 -348861 -161797 44867
23005D4867N580o1982J7925K1311k2327j74168j36747O3587J33015Q366Q1935
22994a8638L9100q0730m667P3161L5222o7769N7834n3414j00324J6404m6014J754
22982a48081O2569j5309j10765J8451P2345j17546m6220M6201Q7139J13716P5548
22971C8048J9671l2664M0263m7613J6407K200o4148P7629q5849l2842n3823J8108
22959a04613o2428P9638Q5174m2677n4656l255q2115Q6503O6554r923J13074K0432
22947I1708p6917j05197L8682o184J18310M5346M6797k6218K3013J5580m3205
22936A21715L2000r2949q2890J315J2949p8384o2114p3405J5308q35M4491J5772
22924a47027J01058l4488O2187J02414P1081l5664q1339p6807k3420O2174K6885
$$ plain form
23005 44867 50447 -11535 6390 27701 5374 -168794 -305541 -241954 -108939 -100573 -18638
22994 -18638 20462 -60268 -64935 8226 43448 -24321 33513 -19901 -120225 -103821 -149835 -148081
22982 -148081 -85512 -100821 -211586 -193135 -120790 -238336 -284556 -238355 -151216 -37500 38048
22971 38048 57719 25055 65318 17705 34112 36312 -27836 49793 -36056 -68898 -122721 -104613
22959 -104613 -167041 -87403 -2229 -44906 -99562 -102817 -184932 -98429 -31875 -41798 71276 91708
22947 91708 14791 -90406 -51724 -57908 60402 105748 152545 126327 149340 164920 121715
22936 121715 153715 60766 -22124 -20809 -7860 -86244 -148358 -221763 -206455 -207290 -162799 -147027
22924 -147027 -45969 -80457 -18270 84144 155225 119561 38222 -38585 -62005 169 27054
22913B7054j13666k8763k8503L6234R2027n9876r2689L1205l720J05928Q984Q2212
22901E6427L6681o2908j22057K9226P7360K9341o2485M6621R1874j56331j50643
22890a86894K1863J42664Q1541m7102P3760J6934n5940j80481r4627m8835K6491
22879b50626J74141M8663j32385j48826L8434L5552n0870n55L3047J84685J66711
22868I7971K6328K399n5115p5952K6222M905p3924m4425M3929O0527N8629r7834
22856b6340N0081N3523J0219J14507n9875p8268q8261j38005j04230L7223J47665
22845h1761N0752Q2676P1418M3040o9582o8225l2948J2100l0510K0470J77655
22834A75085J7391l9848p1228p5323K0797l8263L5081j03472j27771P2954K00975
$$ plain form
22913 27054 -86612 -115375 -143878 -107644 -15617 -75493 -168182 -136977 -140697 -34769 -25785 56427
22901 56427 93108 30200 -91857 -62631 14729 44070 -18415 28206 120080 -36251 -186894
22890 -186894 -165031 -22367 59174 12072 85832 102766 46826 -133655 -228282 -277117 -250626
22879 -250626 -76485 -27822 -160207 -309033 -270599 -235047 -285917 -286472 -253425 -68740 97971
22868 97971 124299 126698 71583 -4369 21853 26758 -47166 -91591 -47662 12865 71494 -26340
22856 -26340 23741 77264 87483 201990 142115 63847 -24414 -162419 -266649 -229426 -81761
22845 -81761 -31009 51667 123085 166125 96543 28318 -4630 7470 -23040 -2570 175085
22834 175085 192476 152628 81400 6077 26874 -11389 23692 -79780 -207551 -134597 66378
22823F6378N4026j43354k2661o507J3381j4840j00718r7097L2664J29538L4831
22812e4359l449n8079k2326R6963N4498O3566J5690J4682N8621p5556k22703J0561
22800a21891J66236L6156l7239m2288j26220l7809J1637K8112j02603M8102K7376
22789a50431J56238J6515r6735k123J3492M4985J9835j0437j15188n7678j10255
22778b91782k6061J60869J60318J5089o382j842J13166R5526j21343j87459j34329
22767b24230N1312J82122L366j2415L423k0139o9220n1486j04691J08290N9871
22756g3797O0542K5470O9303Q3144p9335p6412J8386K3568P157l9444j54641J1052
22744a25007K7865N2916o4777k915o2875K2290J27205Q2049Q9094m7217j99340
$$ plain form
22823 66378 120404 -22950 -45611 -52118 -38737 -53577 -154295 -251392 -218728 -89190 -54359
22812 -54359 -57808 -115887 -138213 -41250 13248 76814 92504 107186 165807 90251 -132452 -121891
22800 -121891 44345 80501 43262 974 -125246 -163055 -151418 -123306 -225909 -177807 -150431
22789 -150431 5807 22322 -74413 -76536 -63044 -18059 1776 -8661 -123849 -181527 -291782
22778 -291782 -317843 -156974 3344 18433 12051 10209 123375 218901 97558 -89901 -224230
22767 -224230 -172918 9204 12570 155 3578 -16561 -85781 -137267 -241958 -133668 -73797
22756 -73797 -13255 12215 81518 164662 85327 8915 27301 50869 58026 18582 -136059 -125007
22744 -125007 -97142 -44226 -109003 -111918 -174793 -152503 -25298 56751 145845 98628 -100712
22733a00712m4079J22917L6167j05323m99R7008M7875n0498j67227Q389j7149
22722a73131j8710P2139O2788P217r8557Q5363O6580J805j00681j10792L0144
22711a75835L2555J6982j9577K1281m1538j02558M5778M2720R0159p86n0980J5889
22699a25910J02432r9979J6909J25853r2396j2701Q5655N1120O3481j8023l8383
22688E8058p8610k5387k2737J5955M7472L8847K0267j11929O0849P6073l8445
22677D0413m3721J0672o1401r120n9437L5312j58861j40561N2116J63144K34970
22666F3526l6087o9849l8805r9675p2488Q1922K36856p7411j67908l9316J7053
22655b02182O6856K9891K1919L5741J7488m8219Q0708n3760m7884j07241K2051
$$ plain form
22733 -100712 -144791 -21874 14293 -91030 -91529 5479 53354 2856 -164371 -155982 -173131
22722 -173131 -191841 -119702 -56914 -49697 -148254 -62891 3689 5494 -95187 -205979 -175835
22711 -175835 -143280 -126298 -145875 -124594 -166132 -268690 -222912 -180192 -90033 -90819 -141799 -125910
22699 -125910 -23478 -123457 -106548 19305 -73091 -85792 -137 50983 114464 96441 58058
22688 58058 -20552 -45939 -68676 -52721 -5249 33598 53865 -58064 2785 78858 40413
22677 40413 -3308 7364 -54037 -63157 -122594 -87282 -246143 -386704 -334588 -171444 63526
22666 63526 27439 -42410 -81215 -180890 -253378 -171456 65400 -12011 -179919 -219235 -202182
22655 -202182 -135326 -105435 -83516 -47775 -30287 -78506 2202 -51558 -99442 -206683 -184632
22644a84632O2936O5556Q0710J12719K7455j11693o7470q1439m405R7635K4468
22633B1840P0268p8930o842Q1471J05590o1199j12952j10869j1798O5674R8780
22622F1033n1724k1893m0647q2411m413m5996q575N9869J4235j32818R3098J91749
22610C1507O7529p9226n6785J8180K2499J6864O0894L337m7764L840k0951J1208
22598C1132K4414j25119k1425K4807p300l3401O8174j5565J261O4343N4561r8416
22586c2534j00817j8350Q1491J03540j17727o0238m05K2290l0072Q6041M527O0381
22574a873N8341k5440n6655p1906L6107r4683M1609P7974J0604M014K5537K2569
22562B6198K8626P0287o3474J3869l3144j11308k8790O6981N7409N6571N4932
$$ plain form
22644 -184632 -121696 -56140 24570 137289 164744 53051 -14419 -95858 -100263 -2628 21840
22633 21840 92108 13178 6336 87807 193397 132198 19246 -91623 -103421 -37747 61033
22622 61033 9309 -12584 -53231 -135642 -140055 -186051 -194626 -134757 -120522 -253340 -160242 31507
22610 31507 99036 19810 -36975 -18795 3704 20568 81462 84799 37035 40875 19924 31132
22598 31132 55546 -69573 -90998 -66191 -73491 -106892 -38718 -54283 -53022 11321 65882 -32534
22586 -32534 -133351 -151701 -70210 33330 -84397 -144635 -145040 -122750 -152822 -66781 -62254 -1873
22574 -1873 56468 31028 -25627 -97533 -61426 -156109 -114500 -36526 -25922 -21908 3629 26198
22562 26198 54824 125111 61637 75506 42362 -68946 -97736 -30755 26654 83225 138157
22551A38157j8506j72899l5836J0886L9941M2715L5087k933o5985N8696J7593
22540D6916r946q3648q8513o4952q168R0708M9670j3773k2402j868R3018J7061
22528D103j5478j12830R0681P9071L3729M8499j2645j15759j27745L5847K5476
22517f7051o9103q8758p692J4484J61594L3484q3052o6374J48440J13107N6398
22506A45477k5854K2783P74j18714m1219J255j1220P1553J46817n789l7625n9648
22494H8590j42906j36813L8859P7061j413q7784J4299O6996J27238J0578j00188
22483d5483L5756k7664N2036J4626n488J04132n0153k01835o0578M2700J3070
22472a28881J2058M7568O4695Q645j43045k6955M3448Q9206K1679Q0743O8456
$$ plain form
22551 138157 119651 -53248 -89084 -78198 -38257 4458 39545 36612 -29373 29323 46916
22540 46916 36970 -46678 -135191 -200143 -208311 -117603 -67933 -81706 -104108 -105976 -12958 4103
22528 4103 -11375 -124205 -33524 45547 79276 127775 115130 -629 -128374 -92527 -67051
22517 -67051 -136154 -224912 -232604 -218120 -56526 -23042 -106094 -172468 -24028 89079 145477
22506 145477 119623 142406 143180 24466 -16753 -15498 -26718 44835 191652 185863 148238 88590
22494 88590 -54316 -191129 -152270 -75209 -76622 -164406 -150107 -83111 44127 54705 -45483
22483 -45483 -9727 -37391 14645 29271 23783 127915 77762 -124073 -184651 -141951 -128881
22472 -128881 -116823 -69255 -4560 4085 -138960 -165915 -122467 -33261 -11582 69161 137617
22461A37617j03932M4729P1555q6654r5258j77574r2863J32265J39889j689J45072
22450A13157K4590p7614q5703k955P2914J6183n8422R99K4930N0007r5372j08377
22438a25663Q326J3661P3841L0854n1311j2722J03876R6156J1290q6769M460m6787
22426A9212p4204M3483k0635Q7585J21026N1834p6732q0159n6479O627J20575
22415A42133P7313o12n6614j54292j08930J05345K4338O8539j29642m7918j6563
22404i6903k6795N0451N420k9762j32384K8584K9881J42972J59864j0068j20969
22393B91q8918m5299k8345m5049j536J35652R6550r1386m7034L3779k352o4056
22381a47703J876p0515l0979J03793J19272p6707j33981N7666Q4232J7291N3575
$$ plain form
22461 137617 33685 78414 149969 63315 -31943 -209517 -302380 -170115 -30226 -31915 113157
22450 113157 137747 60133 -25570 -28525 44389 60572 2150 3149 28079 78086 -17286 -125663
22438 -125663 -117337 -103676 -29835 1019 -50292 -63014 40862 137018 148308 61539 65999 19212
22426 19212 -54992 -11509 -32144 55441 176467 228301 151569 71410 14931 21558 142133
22415 142133 219446 218834 162220 7928 -101002 4343 28681 97220 -32422 -80340 -96903
22404 -96903 -123698 -73247 -67827 -97589 -229973 -201389 -171508 -28536 131328 121260 291
22393 291 -88627 -133926 -162271 -207320 -208856 -73204 23346 -68040 -115074 -81295 -83647 -147703
22381 -147703 -145827 -216342 -247321 -143528 -24256 -100963 -234944 -177278 -93046 -75755 -22180
22370b2180N9760P1356m814j15931m697Q430j9662q6621R2829J4458j11413p118
22358a25603J4846J59924N1560j24624j18660R771N585N4382N7380N2547m5000
22347g892l699N9918m09q656q030J0863L4219J464j5172P413n759o0499j09980
22334a06219n7106o9366N1354L0240O1631k918K6245P0871k8542Q0144Q2879r0678
22322D8535j13580J5094m9478n902m875o0385j08L0948P094N6447n8599L4823
22310i9986M9954l8426Q9650k2328J7058o6705j03627P5112J29528n2201L2500
22299A0529j9120m5973J3172J16503o4480p2755J2316k610j6337n5574P1971M906
22287d7452N2031o7284o0867l8599N694L8570o6060l6936j7489R0905M9759M4847
$$ plain form
22370 -22180 37580 108936 104122 -11809 -16506 -8076 -27738 -114359 -21530 -7072 -118485 -125603
22358 -125603 -110757 49167 100727 -23897 -142557 -132786 -127201 -72819 -15439 37108 -7892
22347 -7892 -11591 48327 47918 39262 31232 42095 76314 77778 62606 70019 64260 3761 -106219
22334 -106219 -163325 -232691 -181337 -151097 -89466 -92384 -66139 4732 -23810 56334 139213 48535
22322 48535 -65045 -49951 -99429 -105331 -110206 -170591 -170699 -139751 -132657 -76210 -134809 -99986
22310 -99986 -50032 -88458 1192 -21136 -4078 -70783 -174410 -99298 30230 -21971 10529
22299 10529 -8591 -54564 -41392 75111 10631 -62124 -49808 -52418 -68755 -124329 -52358 -47452
22287 -47452 4579 -62705 -123572 -162171 -156477 -117907 -183967 -220903 -238392 -147487 -97728 -52881
22275e2881J43376K2148q3940k2258N8516m1053n5170Q0957o721k6516j4103K4326
22263B6681k9863N7693L5289m5436L3158N7156j20993j39705p4254k9890R374
22252b20790J03J12492j4304q5103l629M5644N6263M9699k0786R575J44696m0426
22240C3434j21377k4975m6832O4813p5264Q596R3879N9356K9793M6815L475l0014
22228D1699j35385j81877o6509q655J75272K24797M621l7165J7709O3472O1284
22217A59263K4642J967j16365l6660L4201l1222K1566j9545r4749L4325j9872
22206d2449M5757J50886o9473j4357m80J9908q8733j36550p4861n5066J1940J81959
22194g1519K8665m8561M0522L0133p1602j5620j6138K3259j735J00485n0780j4461
$$ plain form
22275 -52881 90495 112643 28703 6445 64961 23908 -31262 49695 42974 16458 2355 26681
22263 26681 -3182 54511 89800 44364 77522 134678 13685 -126020 -200274 -230164 -220790
22252 -220790 -220687 -108195 -122499 -207602 -211231 -165587 -109324 -59625 -80411 -70836 73860 33434
22240 33434 -87943 -112918 -159750 -94937 -170201 -161605 -67726 -8370 21423 68238 71713 41699
22228 41699 -93686 -275563 -342072 -350727 -175455 49342 53963 16798 34507 97979 159263
22217 159263 183905 185872 69507 32847 67048 35826 57392 37847 -56902 -22577 -42449
22206 -42449 3308 154194 84721 70364 69884 89792 1059 -135491 -210352 -265418 -253478 -71519
22194 -71519 -42854 -91415 -50893 -20760 -92362 -107982 -124120 -100861 -102596 -2111 -52891 -67352
22182f7352K651o9662p2547j05953k1371K5199J10166m2852R7271J40060j3719
22171a8109j3324r8159k6193K5072o867J28640J47980k765o7748k8288l2149p4102
22159f6012p6036R7846M3364q5401J13469K4051L3227q3535p5703M5396j1402
22148d0736O683j1734l6755l4071R0565j41757n6497N1246k1295o8322P0162R3286
22136i9225O7296n7055k9932n7911L6948m0444o9885J52419O6466L5238j07532
22125a03617M5839M6321O6834J33p1192Q6498j3713q306J0606R347J1738K4724
22113A05212J9092j14421n7713L190K4304R2839p5021N6856Q4289K432n3346k8644
22101E9069k3517N5039r1240j4174o677o726J5490J20912J72946J2756p3311n9398
$$ plain form
22182 -67352 -64701 -134363 -206910 -312863 -334234 -309035 -198869 -241721 -144450 -4390 -18109
22171 -18109 -31433 -129592 -155785 -130713 -137580 -8940 139040 136275 68527 40239 8090 -66012
22159 -66012 -142048 -44202 -838 -86239 27230 51281 84508 973 -74730 -29334 -40736
22148 -40736 -34053 -45787 -82542 -116613 -26048 -167805 -224302 -173056 -194351 -262673 -192511 -99225
22136 -99225 -31929 -88984 -118916 -176827 -139879 -180323 -250208 -97789 -31323 3915 -103617
22125 -103617 -57778 -11457 55377 55510 -15682 70816 57103 48797 59403 68750 80488 105212
22113 105212 124304 9883 -47830 -44640 -20336 72503 -2518 54338 138627 141059 87713 59069
22101 59069 35552 90591 -649 -14823 -21500 -28226 -12736 108176 281122 293878 220567 161169
22089A61169L9047p7105k31585k089O4160J42331Q719o7335l6256k9565k14378
22078b42887r236J01117M9591N6977Q3912k376l3345q5915Q4959l6827r6945o7181
22066a98156M8576Q0751L3110k882m3424N7290K7217l3841J49520K5613j5507
22055A28267j46433m0748O8646J03704M4065m8808p0956p5540M3813K2594m7655
22044a9051l3510O9644r6954J09925N3317p3267l3788q1967J0105K5212o1130
22033a31464Q5611Q0469N4638l8547R3735j4672k36967m2386M5425L7793J0886
22022e5479q1438K8356M3597J5455j7683n4083P6269P0960k9604m2539L3821J3831
22010A463j48622K0324J6463O9731K9161j32092j21002K9529J10798L7826K6022
$$ plain form
22089 161169 200216 123111 -108474 -110563 -46403 95928 104647 37312 1056 -28509 -242887
22078 -242887 -252123 -151006 -101415 -44438 39474 37098 3753 -82162 2797 -34030 -130975 -198156
22066 -198156 -149580 -68829 -35719 -38601 -82025 -24735 2482 -31359 118161 143774 128267
22055 128267 -18166 -58914 9732 113436 157501 108693 37737 -37803 6010 28604 -19051
22044 -19051 -52561 17083 -79871 30054 83371 10104 -23684 -105651 -95546 -70334 -131464
22033 -131464 -45853 34616 89254 50707 144442 129770 -107197 -149583 -104158 -66365 -55479
22022 -55479 -136917 -108561 -64964 -49509 -67192 -121275 -45006 25954 -3650 -46189 -12368 1463
22010 1463 -147159 -126835 -110372 -40641 -11480 -143572 -264574 -235045 -124247 -86421 -60399
21999f0399l9199q7173l0728O2070n3552q9525N8405J49541k851p8036M1144K6294
21987a04009O7132O8540L652j0372l9135j03196n0217R8484P0272P9417R5985
21976A76553j3988l307j35545k8284j82540Q911R7323n524N5986O5385N1558M4853
21964A31381q2266o2080p86p653J46064q7338j87201J0325L4541J07094J02342
21953A04423n0047O454j17956q1238J1074k0429N320R7233J2305m8114N672j7257
21941i2560K4731J02141r2135M0458Q4529L6268j14431j34165l9395K2289j2105
21930a74375r8859L3879J80702J29270P6523j0815p6999j07207o0901Q7321K534
21919a8927m1924m9031Q8308j4709r4737q9258P8217M9974k7710q0681P842N7646
$$ plain form
21999 -60399 -99598 -186771 -217499 -155429 -208981 -298506 -240101 -90560 -93411 -171447 -130303 -104009
21987 -104009 -36877 31663 35315 24943 -14192 -117388 -167605 -69121 1151 80568 176553
21976 176553 162565 159258 23713 -4571 -187111 -178200 -80877 -86401 -30415 34970 86528 131381
21964 131381 49115 -12965 -13751 -21404 124660 37322 -149879 -139554 -105013 2081 104423
21953 104423 54376 60830 -57126 -138364 -127290 -147719 -142399 -45166 -32861 -80975 -75303 -92560
21941 -92560 -67829 34312 -57823 -17365 67164 103432 -10999 -145164 -184559 -162270 -174375
21930 -174375 -273234 -239355 -58653 70617 147140 136325 59326 -47881 -108782 -21461 -18927
21919 -18927 -60851 -109882 -21574 -36283 -131020 -220278 -142061 -92087 -119797 -200478 -192636 -134990
21907a34990N2218j2988l6467Q3385K6944K7031k4470J53574j7336j71383j24597
21896a79079R4308J4866M990P5156N6562n2193j24672o1061M5173Q5054l8338
21885g9234R1995m620j05524M1345r7658k1558n2935Q1040P8763n3208o0835J3430
21873a68999o1233P8784Q909n69N4342K5544n4649N1921L1677J70367k8452j81915
21861g4273l8560o0927q0814q181J17427J12768l137K35668n9028k17198q6513
21850a62768o3387Q7779N2099M4192q347n5j33145r713j8169J17247K01400R1899
21838A99032k961N4457j5839k2193O7916K0061j26522q2891q8941p5986k2264
21827i6131L7773L1451L6273l2710p2247q9418r8331J00151Q7472M7075J4220
$$ plain form
21907 -134990 -82772 -95760 -132227 -48842 -21898 5133 -19337 134237 116901 -54482 -179079
21896 -179079 -84771 -69905 -64915 10241 66803 14610 -110062 -171123 -125950 -40896 -79234
21885 -79234 12761 8141 -97383 -56038 -153696 -175254 -228189 -147149 -68386 -121594 -182429 -168999
21873 -168999 -230232 -151448 -142539 -143108 -88766 -63222 -117871 -65950 -34273 136094 107642 -74273
21861 -74273 -112833 -173760 -254574 -262755 -145328 -32560 -35697 199971 140943 -76255 -162768
21850 -162768 -226155 -138376 -86277 -42085 -50432 -50487 -183632 -193345 -211514 -94267 107133 199032
21838 199032 196071 250528 234689 212496 280412 300473 173951 91060 2119 -73867 -96131
21827 -96131 -58358 -26907 9366 -23344 -95591 -185009 -283340 -183189 -95717 -48642 -34422
21816c4422j55139n5719k2667N766k4680L2704m3241m6115P0808K48949J58767
21805A35011L4533j77290J492l6860j28933n283N5428L6315j2201o4091l864J6795
21793a48948Q3815l5964k4139M028k6864m251M3203R521K1737p8068j3997J02283
21781f7644l544P359q437N3887l5484k0275M0393j2435j61846O4798J38328Q2614
21769G7714J0816m5051o9292l7340l4020o4402O4377R9363J7157j24127n2839
21758a57644n754n144R7424J37647r1101K9025N737m3669o146R6317J00192j47388
21746I496j65209k2023l811p7311O9855q534p2597J03434p3669L3747k2815N8889
21734a70548M9576P7439J06716J0497K3453o8814o8580j3630k9101q3151L7478
$$ plain form
21816 -34422 -189561 -245280 -267947 -262181 -286861 -254157 -297398 -343513 -272705 -23756 135011
21805 135011 169544 -7746 -6254 -43114 -172047 -177330 -121902 -85587 -97788 -161879 -165743 -148948
21793 -148948 -65133 -101097 -125236 -121208 -148072 -152323 -109120 -99599 -77862 -155930 -169927 -67644
21781 -67644 -71188 -63829 -72266 -18379 -53863 -74138 -33745 -46180 -208026 -143228 -4900 77714
21769 77714 88530 43479 -25813 -63153 -97173 -161575 -97198 2165 19322 -104805 -157644
21758 -157644 -163398 -168542 -71118 66529 -24572 4453 10190 -33479 -39625 56692 156884 9496
21746 9496 -155713 -177736 -181547 -258858 -189003 -197537 -270134 -166700 -240369 -206622 -229437 -170548
21734 -170548 -120972 -43533 63183 73680 97133 28319 -40261 -53891 -82992 -166143 -128665
21723a28665N3208J61953P5326r9547j36347R0242l8288P4349k5994j14120r0561
21712a78444Q610l4057M396k5618M3873o8774j4817j09882J19255J29543L5344
21701i0571L447J6389J4792N7605Q8821J1745K7626N996j09827j29747j41425
21690b45149p8242J25160O5287k754n0532m1975J27168p6368K7230L2194O7378
21679e0603o0183n0490J10669M4329j6323R0374J39579N4436o3873j09506n5711
21668C2698Q6884K8817P1719p0654l4186O3000O7960N5579j38111j4504o9841
21657G9361k5982P1482L4639q5060K0915J9237j9526j08756m0295n66J7991N2126
21645A5566P4145j2613j41977r9831j30668l945n5496L2310J64845p410J3500
$$ plain form
21723 -128665 -75457 86496 161822 62275 -74072 16170 -22118 52231 26237 -87883 -178444
21712 -178444 -169834 -203891 -199495 -225113 -181240 -250014 -264831 -374713 -255458 -125915 -90571
21701 -90571 -87124 -70735 -55943 1662 90483 102228 129854 135850 26023 -103724 -245149
21690 -245149 -323391 -198231 -132944 -135698 -186230 -228205 -101037 -177405 -150175 -117981 -50603
21679 -50603 -110786 -161276 -50607 -6278 -22601 67773 207352 261788 197915 88409 32698
21668 32698 119582 148399 220118 149464 115278 178278 246238 301817 163706 149202 79361
21657 79361 53379 124861 159500 74440 95355 114592 95066 -13690 -53985 -54551 -36560 15566
21645 15566 89711 77098 -64879 -164710 -295378 -299323 -354819 -322509 -157664 -165074 -151574
21634a51574k8658j26357R4436J16147R7007k6650n5355K4494N1365M1494m4539
21623h190M6542O7090l6570j47825M0821J28665j8050j21858j04166l3542k4932
21612b12015j03136J94601J73463n2517r2351l4546J3411P9406N6510n5121N68
21601c1727P4160J3257j14362j48760M4082j25327J11150K06004j21920j15930
21591b09373M2784O2857J1450k6065M1375J9145r175N6378J05699O7387n8226
21580A04236k1797J7490j27725p8507o3256J1296l0069k3640M6796P3361k326
21569i4141j03596L0763J03095J8047j9188J4850j6424L0923L8217J33906O6599
21558B03051j1102n4649j75767q2614j0210P939O8150k1699O562L4325R7258K179
$$ plain form
21634 -151574 -180232 -306589 -212153 -96006 1001 -25649 -81004 -56510 -5145 36349 -8190
21623 -8190 38352 105442 68872 -78953 -38132 90533 72483 -49375 -153541 -187083 -212015
21612 -212015 -315151 -120550 52913 396 -91955 -126501 -113090 -33684 22826 -32295 -31727
21601 -31727 42433 55690 -58672 -207432 -163350 -288677 -177527 28477 -93443 -209373
21591 -209373 -166589 -103732 -92282 -118347 -76972 -57827 -67002 -10624 95075 162462 104236
21580 104236 82439 99929 -27796 -106303 -169559 -158263 -188332 -211972 -165176 -91815 -94141
21569 -94141 -197737 -166974 -63879 -45832 -65020 -50170 -66594 -35671 2546 136452 203051
21558 203051 191949 137300 -38467 -121081 -131291 -123352 -55202 -76901 -70339 -36014 61244 63423
21546F3423p7780j26693j0273R572R877J15340M6124l3913k2567o8475k7884n7168
21534a80417n4096J7950P1199N3129j8529q3790J49676l8571n9758N688l941J10569
21522c0891j0930k5760M4715j17944k0062J3466J29673J13016j9263q4129m2000
21511e0109M3939R734J5004q3575j48092q4689k5408Q958J38045J9435n4533r963
21499b21254j04362N1243J10751J2108m3684O185j5802k3515O6211J09675J6920
21488c5524j14553O486J9456M358m4270l6127m0679M1140L629r0901Q459Q756
21476b69770r683M8397J39704L858l7218Q8020q8762j54545J8086Q0921J15076
21465f5916O9731J0374L4361j97993p7545M3204J33728O6934L1591L0090j1963
$$ plain form
21546 63423 -14357 -141050 -151323 -141751 -131874 -16534 29590 -4323 -26890 -95365 -123249 -180417
21534 -180417 -234513 -216563 -145364 -92235 -110764 -194554 -44878 -83449 -143207 -137519 -141460 -30891
21522 -30891 -41821 -67581 -22866 -140810 -160872 -147406 -17733 95283 76020 -8109 -50109
21511 -50109 -6170 3564 18568 -65007 -213099 -297788 -323196 -314238 -176193 -156758 -211291 -221254
21499 -221254 -325616 -274373 -163622 -151514 -195198 -189013 -204815 -228330 -162119 -52444 -35524
21488 -35524 -150077 -143591 -124135 -119777 -164047 -200174 -240853 -199713 -196084 -286985 -278526 -269770
21476 -269770 -279453 -231056 -91352 -87494 -124712 -36692 -125454 -279999 -261913 -180992 -65916
21465 -65916 3815 14189 48550 -149443 -226988 -183784 -50056 16878 48469 78559 66596
21454F6596o5379j3254n9701o8373J5578N1141K3319m550j631L6607L1997L9240
21442E1590j01425j47786N9047Q7102J6483j3072N0719R9587l0529j57406n3253
21431a38943J42897J09883p0315j4206J12826L6875j02866n4012r4609N0361K5420
21420C311J9834O6977q2140q9478l4873O4579k4046l8979M6189P5419n5106Q487
21408c9826q4651J1511j5911M205Q1007P9646J61690j9507o5061J326j27839J10
21396a3300J38057J34730p9686q7362j09359q245N9233O6237l3394j25252k8019
21385h6360J19934K1534P525q228l4900p002q4622r7760j545J27805N4092m1351
21373c0878m0657n2154k2593J16267l5515Q9031j20094j00990o989J16564L4949
$$ plain form
21454 66596 1217 -12037 -71738 -140111 -124533 -73392 -50073 -54623 -56254 -19647 12350 51590
21442 51590 -49835 -197621 -138574 -51472 -34989 -48061 2658 102245 71716 -85690 -138943
21431 -138943 3954 113837 43522 29316 142142 179017 76151 22139 -72470 -22109 3311
21420 3311 23145 90122 7982 -81496 -116369 -51790 -75836 -114815 -68626 6793 -48313 -39826
21408 -39826 -124477 -112966 -128877 -124672 -43665 35981 197671 178164 113103 114429 -13410 -13300
21396 -13300 124757 259487 179801 92439 -16920 -25165 34068 100305 66911 -58341 -86360
21385 -86360 33574 55108 62633 54405 19505 12503 -72119 -169879 -171424 -43619 10473 -30878
21373 -30878 -71535 -123689 -146282 -30015 -65530 23501 -96593 -197583 -204572 -88008 -53059
21362e3059l0813l2446q4291L4223M661o3068J19485R7573K7586m2484l1630k5051
21350g9314Q554j1725p2032q5113N6670N4733J18112k4236r7511J839N2265J02814
21338B5056o4866p4728n4702J16516J47840m857l6502m2138j17647L2934Q5830
21327A2736Q5027J13225n8314p4812j45733K4445R9415o2140M674J6767m0643
21316b5353p6388p0455j4008J39567L0171J5714K3558p6442k3257p4563p4798
21305b26254r2195M6468K3320K839k6164j27103L1896R5594N0009j8527K7109
21294b13008j7703K6662J64472k1090n3606k715r6579q0770N7624J85160k3886
21283g5439o1569K3435k4742J55859P4275M8575m9807j41873l228M3949j05714
$$ plain form
21362 -53059 -83872 -116318 -200609 -166386 -161725 -224793 -105308 -7735 19851 -22633 -54263 -79314
21350 -79314 -70760 -82485 -154517 -239630 -182960 -128227 -10115 -34351 -131862 -130023 -77758 25056
21338 25056 -39810 -114538 -169240 -52724 95116 90259 53757 11619 -106028 -73094 12736
21327 12736 97763 210988 152674 77862 -67871 -43426 55989 -6151 -1477 15290 -25353
21316 -25353 -101741 -172196 -186204 -46637 -16466 -752 22806 -53636 -76893 -151456 -226254
21305 -226254 -318449 -271981 -248661 -245822 -271986 -399089 -367193 -271599 -221590 -240117 -213008
21294 -213008 -230711 -204049 -39577 -60667 -114273 -116988 -213567 -294337 -236713 -51553 -75439
21283 -75439 -137008 -113573 -138315 17544 91819 140394 90587 -51286 -54514 -10565 -116279
21272a16279o859K8291J02238p0635P5095R992K0883p3706k8895k8057O0489N0871
21260B3428M2896j1706o7661O8827M5727p7346L5037j2686q1835p6639L5463K3598
21248e2897K1926p4936r5332n688j0015L3076r1702l164Q1117o0748O601J8414
21236b33348O9272J08973L5142O3903p1788n5002Q6340j00521J4937J59465J3421
21225I0794p9047o9338n7799M1654J45712j03815l260P9643L0541l0134o9922
21214b4971l0012q6638k6699N9526J07648L0054L2128K5581k3836l8188L3229
21203E7822N5108r218p8957j60881J7116J28978l7287j51686Q3217J26596P0316
21192A01124L8758j60410o4335M1919J4148N2687L1169r2726L076P2764K4484
$$ plain form
21272 -116279 -123138 -94847 7391 -63244 11851 21843 42726 -30980 -59875 -87932 -27443 23428
21260 23428 66324 54618 -13043 55784 101511 24165 59202 46516 -35319 -111958 -76495 -52897
21248 -52897 -30971 -105907 -201239 -206927 -216942 -183866 -275568 -278732 -197615 -258363 -251762 -233348
21236 -233348 -164076 -55103 -19961 43942 -27846 -82848 3492 -97029 -82092 77373 90794
21225 90794 11747 -57591 -115390 -73736 71976 -31839 -35099 44544 75085 44951 -24971
21214 -24971 -54983 -141621 -168320 -108794 -1146 28908 61036 86617 62781 24593 57822
21203 57822 112930 103712 24755 -136126 -119010 9968 -27319 -179005 -95788 30808 101124
21192 101124 139882 -20528 -84863 -42944 -28796 23891 55060 -37666 -34590 38174 62658
21181F2658m7059K389J16414l218J905j2125m2676N7587R7928k54N3016l5383
21169B51182j59289r4677k869M3194o3995p6908L1549p64J08449O0385m8458j10847
21157f3048n2139Q0834J4426Q257K2711n2788N7021k965L3505K3810J8365L9035
21145A27024j65914j3780J35501p974j96291j5528P3931j02357M7429J6417J9205
21134h2337J27246J23724K0019Q7713J49396K37254K88100J78020K53937J86755
21124A569827P5649O0969M5556l0209j41212j31545l939q832j89757q2117j63691
21113A000699k71309j50687j01183m2m462n0910l5399J14319m289K6695L1476
21102E54908J41749l7796J26725R0877K6339r5910j67395j27693q5333M529j06348
$$ plain form
21181 62658 15599 17988 134402 131184 133089 120964 78288 135875 233803 233549 286565 251182
21169 251182 91893 -2784 -5653 37541 -26454 -103362 -71813 -72577 35872 96257 47799 -63048
21157 -63048 -115187 -34353 -19927 -11670 11041 -41747 15274 12309 45814 69624 87989 127024
21145 127024 -38890 -52670 82831 74857 -121434 -136962 -63031 -165388 -117959 -101542 -82337
21134 -82337 44909 168633 188652 276365 425761 663015 951115 1129135 1383072 1569827
21124 1569827 1645476 1706445 1752001 1721792 1580580 1449035 1445096 1436264 1246507 1164390 1000699
21113 1000699 729390 578703 477520 477478 473016 422106 386707 501026 496737 523432 554908
21102 554908 696657 658861 785586 876463 902802 806892 639497 511804 426471 431000 324652
21091C24652r9614j05451p6155j2927o306k9986J10755J02288L27q2108j3660
21080A11815K3483r1786R715J3303L6820R221K8098j3351q8066O5218Q5906p134
21068A83242n5586j41572j01968O3864N118K2106O1289O1149L9309m6994j36596
21057d6639O0012J08050J9410N7193K9672j45648p6804n0838n2170K1559j2007
21046h8210J9137P8184J62316L0981j5129Q3903J27910M3691m169j2757j03074
21035C22783N3044K2422J02226J49043L4069n7328j22456n8045j82274j96433
21025F7051J0099L2774q1334o5466j0285m8469K9662R6745K0867r2470p6910q5193
21013b02929j2248j858R4526K07296R7483j338m1277j17807j04360K591M2238
$$ plain form
21091 324652 225038 119587 43432 30505 24199 -5787 104968 207256 207583 125475 111815
21080 111815 135298 43512 53227 66530 103350 112571 140669 127318 39252 104470 190376 183242
21068 183242 127656 -13916 -115884 -52020 -46902 -24796 36493 97642 136951 89957 -46639
21057 -46639 13373 121423 140833 198026 227698 82050 5246 -45592 -97762 -76203 -88210
21046 -88210 -69073 9111 171427 202408 187279 271182 399092 442783 438614 425857 322783
21035 322783 375827 398249 500475 649518 683587 626259 503803 445758 263484 67051
21025 67051 77150 109924 28590 -36876 -47161 -95630 -65968 30777 51644 -40826 -117736 -202929
21013 -202929 -215177 -217035 -122509 84787 182270 180932 139655 21848 -82512 -79921 -37683
21002c7683N5386k7252k0644J26860K5389m1888K4966j7585O4118J26718o0658
20991B17727m381J8873j00972m4980L8424L9462p2732P679M8546J1957n905j26425
20979B7273P045P1382j4730L9783j17044j12620m440M8178M2530k8923K1053Q5203
20967F4690k0182k8343q4329n6553n2509p9299J78041O4596l0261l0080q6251
20956a60480K166O0217q0054q4224l0646r653P7830Q3238M2392J13859Q2534k10474
20944a13295M323Q442J17577M3141j2605J3977l4824m6234m8124j0484o7995o2490
20932b08591R0873L7597r3226N791K6418K62n9018P9533l6059m4721m6752N1254
20920a96639Q2255N928L5599P9055J8490n55R4661k4943o4269L1842j10158q8264
$$ plain form
21002 -37683 17703 -9549 -30193 96667 122056 80168 105134 87549 151667 278385 217727
20991 217727 213346 232219 131247 86267 124691 164153 91421 99100 147646 159603 153698 27273
20979 27273 34318 105700 90970 130753 13709 -98911 -103351 -55173 -12643 -41566 -20513 64690
20967 64690 44508 16165 -68164 -124717 -177226 -256525 -78484 -13888 -44149 -74229 -160480
20956 -160480 -158314 -98097 -178151 -262375 -293021 -302674 -224844 -141606 -99214 14645 97179 -113295
20944 -113295 -108972 -100530 17047 60188 47583 61560 26736 -19498 -67622 -78106 -146101 -208591
20932 -208591 -117718 -80121 -173347 -167556 -141138 -140876 -199894 -120361 -156420 -201141 -247893 -196639
20920 -196639 -114384 -108456 -72857 6198 24688 24133 118794 93851 29582 61424 -48734 -136998
20908a36998j26196R5782K1734q1400q2061O1880L3341J40151J26455r044j09762
20897f6118k9539l756L8452m2004J22265J3688J3087o3018m1346N524J0357l1897
20885g4305j75j12494Q0576J31555l3697n6329Q092l3970K3582l3869j01090Q0456
20873a21668P226Q9636L642j39884J21254Q5852q8612n1981P2990l4280k8534
20862h4359k5453J0158J9439k7000l8476P6211j41115j0241P5541J11863J08077
20851G4645q7055O5569K0907l1539l0191M2555P4550p0157J0708l2686j57023
20840a19717k1190m2436M051J17654j02944j3457J51761J36821N5283J06806o7951
20829B04681j04043Q2900J4956N8957K0208R5727l5701j2468M0747o0785j01166
$$ plain form
20908 -136998 -263194 -167412 -145678 -227078 -309139 -247259 -213918 -73767 52688 43644 -66118
20897 -66118 -95657 -99413 -60961 -102965 19300 32988 46075 -16943 -58289 -52765 -42408 -74305
20885 -74305 -74480 -186974 -106398 25157 -8540 -64869 -56777 -90747 -67165 -101034 -202124 -121668
20873 -121668 -114442 -24806 -21164 -161048 -39794 46058 -42554 -94535 -21545 -55825 -84359
20862 -84359 -109812 -99654 -80215 -107215 -145691 -69480 -210595 -220836 -145295 -33432 74645
20851 74645 -12410 53159 74066 42527 12336 54891 129441 59284 69992 37306 -119717
20840 -119717 -140907 -183343 -179292 -61638 -164582 -178039 -26278 110543 165826 272632 204681
20829 204681 100638 183538 198494 257451 277659 373386 337685 325217 365964 305179 204013
20818B04013M966r7095J00305r3633m1795k176l0463k7570l5472L9247r769k6868
20806a6310m847j7864K5881k4094m4140k5862m2928J3042l806N9667q420j25339
20794b15020J15533J30028j708N3437l5336L7515L8088j15939Q1122Q8248L246
20783A79214r6647j57757o1773M3108o9456J36712P0347Q260j18230q6519j3099
20772a65840N2036o2697o1912o1592N7898J48118J64993m2937J6156O1240K9437
20761A34900k4003r6510L5274M5494l2626j43232m6048L4495J21354J58414J3715
20750B01227l2004j00612j00667l5065j07242m877J94874J90368j05634j30683
20740c0315R775R3838l0875j03638n2406J40357N4545R0519K4533m5909M6353
$$ plain form
20818 204013 208979 111884 212189 118556 76761 74585 44122 16552 -18920 20327 10558 -16310
20806 -16310 -21157 -39021 -13140 -37234 -81374 -107236 -150164 -137122 -140928 -81261 -89681 -215020
20794 -215020 -99487 30541 28833 82270 46934 84449 122537 6598 87720 175968 179214
20783 179214 82567 -75190 -136963 -93855 -163311 -26599 43748 52008 -66222 -152741 -165840
20772 -165840 -113804 -176501 -238413 -300005 -242107 -93989 71004 28067 44223 105463 134900
20761 134900 110897 14387 49661 95155 62529 -80703 -126751 -92256 29098 187512 201227
20750 201227 169223 68611 -32056 -67121 -174363 -179240 15634 206002 100368 -30315
20740 -30315 -20540 73298 42423 -61215 -113621 26736 81281 171800 196333 150424 196777
20729A96777J4998k1703j39799q725J39612R2545p5881p0452o0488P8026P7810
20718B22720N6033m166p449n5129k8041j97760j51620J72394J79598k1519j78180
20707a3119K398O3580K4481m1456k32p5553O0878J64126j792j11689k2631J75492
20695B24483J16820J04827n0990l9604j11094k5148M2220n3087p8018R623O0604
20684B00636N5229N5734m490P7508j7672j1123N3956j33771n1292M4020m026j87761
20672G6948J0386J88345R1310k1781n1803k5264p2023q6554j20712O5530P5468
20661A29850K8153r6378p1076R9756O9648k5636j57185j0785N8063L613J0287
20650C8310J48898m5075p1763K8512J5608J14072n0091n6879O7943m0979J11536
$$ plain form
20729 196777 211775 190072 50273 41548 181160 273705 197824 127372 66884 144910 222720
20718 222720 278753 274587 267138 212009 183968 -13792 -165412 6982 186580 165061 -13119
20707 -13119 -10721 52859 77340 35884 35652 -39901 20977 185103 183311 71622 48991 224483
20695 224483 341303 446130 395140 355536 244442 219294 261514 208427 130409 140032 200636
20684 200636 255865 311599 307109 384617 366945 355822 409778 276007 224715 268735 264709 76948
20672 76948 87334 275679 366989 345208 293405 268141 196118 109564 -11148 54382 129850
20661 129850 158003 61625 -9451 90305 159953 134317 -22868 -33653 24410 28023 38310
20650 38310 187208 142133 70370 98882 114490 228562 178471 121592 189535 148556 260092
20639B60092K50958J50241j72139k89318m3563J13096q132K4196P8604N8655N755
20628D28445R6174J41092n508P5489R196J19329J00247r8875K1850Q6285J19225
20617A092949J96884L61149K19508K17202J97398K12466J69441L28527L50496
20608C346020L42439J52515j6591q0885O0546J58691O9653O4240J11941K4144
20598D232713J78569L64812K12977K26798M48598N72796L97053K39256N77269
20589G450841O33866N52609Q51834J186154J466864J586239J995048K573358L450700
20580B1747513N124725P626583J1688105J8679048K9021792L9968805M3086714
20573A76943285L5050176K3299649J8011895K6225472L8368326L6273679J1766053
$$ plain form
20639 260092 511050 661291 489152 199834 156271 269367 261235 285431 364035 422690 428445
20628 428445 524619 665711 660203 735692 744888 864217 964464 865589 887439 973724 1092949
20617 1092949 1289833 1650982 1870490 2087692 2285090 2497556 2666997 2995524 3346020
20608 3346020 3688459 3840974 3824383 3743498 3804044 3962735 4032388 4096628 4208569 4232713
20598 4232713 4411282 4776094 4989071 5215869 5664467 6237263 6634316 6873572 7450841
20589 7450841 8084707 8637316 9489150 10675304 12142168 13728407 15723455 18296813 21747513
20580 21747513 26872238 34498821 46186926 64865974 93887766 133856571 176943285
20573 176943285 211993461 235293110 253305005 279530477 317898803 354172482 365938535
20566C65938535j9227655l7864874l5175486k1709940j6488034k4582417l6877366
20559A74012763m2605815l7341188k6527157j6855683j0750115p400593n184745
20552B7347467l684923k878777k184752j904521j680444j294072j021084p50464
20544A1948430q28177p92669p08562n84084m70285m46748m14897m03261l88707
20535F911040k69129j50773k05735j93534k09063k89930j70689L1616j30274k74867
20525E048662m31858l83684l06811l30961l88499k70999k25706k73746k53736
20516B182662k66871k40916j75191j20001J8802L0891m9722k01888O491K8464
20506A212721j5291r397k7211p3150J3642L299j06296q2711o6471j550m8894k4576
$$ plain form
20566 365938535 346710880 308846006 273670520 251960580 235472546 210890129 174012763
20559 174012763 131406948 94065760 67538603 50682920 39932805 32532212 27347467
20552 27347467 23662544 20783767 18599015 16694494 15014050 13719978 12698894 11948430
20544 11948430 11120253 10327584 9619022 9034938 8564653 8117905 7703008 7299747 6911040
20535 6911040 6641911 6491138 6285403 6091869 5882806 5592876 5422187 5453803 5323529 5048662
20525 5048662 4616804 4233120 3926309 3595348 3206849 2935850 2710144 2436398 2182662
20516 2182662 1915791 1674875 1499684 1379683 1398485 1429376 1379654 1177766 1184257 1212721
20506 1212721 1197430 1188033 1160822 1087672 1101314 1104613 998317 915606 849135 847585 798691 774115
20494G74115M6991n8746q1590j3286k9055J44792j2667L786r6614j65204l4275
20483D78247Q3839N1065Q156l7208P370J3931r8119j46416j0131Q5441J16009
20472E52184n224m1610n4630j20380l1719m8983p210J18969M1320j00950k4478
20461B77289R698j30803j16183J31606L9466K5114j46913j2664N5923Q9199Q111
20450B29843n1107R3452K5324J22070p1279j58964r6503P9852J3709L2755n521
20439B13631K8739k7419M7323J7524l7915j04563m8836n8744k2626M8861J32400
20428A88375m9649p6530L2542j20980j34164J29027K1556O865K6758m8786p6121
20417a01107Q7996K9897q609j2266j2603j55397J6429q5545M894J27503j223q6742
$$ plain form
20494 774115 821106 762360 680770 667484 638429 783221 770554 774340 677726 512522 478247
20483 478247 562086 613151 621307 584099 591469 605400 507281 360865 350734 436175 552184
20472 552184 546960 505350 450720 330340 298621 249638 242428 361397 402717 301767 277289
20461 277289 286987 156184 40001 171607 211073 236187 89274 76610 132533 221732 229843
20450 229843 178736 272188 297512 419582 348303 189339 92836 172688 186397 219152 213631
20439 213631 242370 214951 262274 279798 241883 137320 88484 29740 7114 55975 188375
20428 188375 138726 62196 94738 -26242 -160406 -31379 -9823 -2958 23800 -24986 -101107
20417 -101107 -13111 16786 8177 -4089 -16692 -172089 -155660 -241205 -236311 -108808 -110031 -196773
20405a96773o2909P4279N4557k1704k1095p8940l6190J29142m801k3180Q8195
20394i9419M0276j7313M0934Q2070k5478j62862k4978J74819L1987k5140k2689
20383g793j16919R5191J5004N1431r062J2477J10303m341K5363M5880q0005k10063
20371g2534j23363j7016Q0626j08011r1695p9979R0952J72087M8852q8047L4728
20360a53400O6995N7149N3149o8073k7340l752m3761q5343l9441R4631J68428
20349A9242N9797m9926j10802O7969l3692k5091N4166K2941Q6790j14669L498
20338a9777O1840o0795K3971J4760o8891n3448K6974N7342J67879R1907o1237
20327A80525k8399K3351L2624P6377l1063j45159k3219J3769R282n5229n0090
$$ plain form
20405 -196773 -259682 -185403 -130846 -152550 -173645 -252585 -288775 -159633 -164434 -187614 -99419
20394 -99419 -59143 -76456 -35522 46548 21070 -141792 -166770 8049 40036 14896 -7793
20383 -7793 -124712 -29521 -14517 36914 27852 40329 150632 146291 171654 217534 137529 -72534
20371 -72534 -195897 -212913 -132287 -240298 -331993 -411972 -321020 -148933 -100081 -188128 -153400
20360 -153400 -86405 -29256 23893 -44180 -71520 -75272 -119033 -204376 -243817 -149186 19242
20349 19242 79039 29113 -81689 -13720 -47412 -72503 -18337 4604 91394 -23275 -19777
20338 -19777 42063 -18732 5239 19999 -48892 -102340 -75366 -18024 149855 241762 180525
20327 180525 152126 175477 208101 284478 253415 108256 85037 98806 108088 52859 2769
20316B769K7533l9862k9285j9902J26433O6991k1508j17681R665K3284r099J09579
20304A28917N2492j57282j20522M4075K9030L93k9986l1284l4790J30345Q2364
20293I3752p6893r4910j6158L0812k3784N4819q4896o7981K9340R3074J97587
20282A34762J4868m0886q2532j18061j40050K0043Q5460R9384K9526j77758m1220
20271b16464J10554k5773P9085O032p9054L2476P842n0983M9972J7257k2173o796
20259i8025m8112j15397k502K8010O9517Q6740j0182M3588Q9733j02152q3207
20248a41989L2359J68831j1856l6149P2341R4643p4896j29657o7168j858Q0801
20237a4598M5023J4264R668Q6021k4027j23857l4966o9804o8221J40956M2609
$$ plain form
20316 2769 30302 -9560 -38845 -58747 67686 134677 113169 -4512 5153 28437 19338 128917
20304 128917 181409 24127 -96395 -52320 -23290 -22897 -52883 -84167 -118957 11388 93752
20293 93752 16859 -78051 -94209 -63397 -87181 -32362 -117258 -185239 -155899 -62825 134762
20282 134762 149630 108744 26212 -91849 -231899 -211856 -126396 -27012 2514 -175244 -216464
20271 -216464 -105910 -131683 -52598 -46566 -125620 -93144 -85302 -136285 -86313 -69056 -91229 -98025
20259 -98025 -146137 -261534 -264036 -236026 -166509 -79769 -89951 -46363 43370 -58782 -141989
20248 -141989 -109630 59201 47345 11196 83537 178180 103284 -26373 -93541 -95399 -14598
20237 -14598 30425 44689 54357 140378 116351 -7506 -42472 -112276 -180497 -39541 3068
20226C068M188K4845l6268j74221n2050J49624J17400l4406j07728j31170M7060
20215a89658J17222M6854l0477N06L854l3040j7387j0694L0256J48493O7423k4609
20203A08743M5736q8463o9209l4478R3370M0146p8678J19787R9068j7088j19787
20192I9147M2651M111o01L4541m205l2313j68739m8305Q1718k5246O5290J03712
20180A51761j14888q4052P6716j8536L0169M9386m4599n8216l7750j9916K3521
20169d6404P7924L5025j27021n0653O2750J40484j49227o1317m5474L3992Q4248
20158d5673J46299K1732m539j06917q794M4791k0613P7530M266r0727q7562o6281
20146a36488K1218N0525J1481j0804l2339m9258O3739J59884m9206l8658k5610
$$ plain form
20226 3068 7256 32101 -4167 -178388 -230438 -80814 36586 2180 -105548 -236718 -189658
20215 -189658 -72436 -25582 -56059 -55553 -51699 -84739 -102126 -112820 -82564 65929 133352 108743
20203 108743 154479 66016 -3193 -37671 55699 95845 17167 136954 236022 218934 99147
20192 99147 141798 145909 145308 179849 175644 143331 -25408 -73713 8005 -17241 48049 151761
20180 151761 36873 -47179 29537 11001 41170 90556 45957 -12259 -50009 -69925 -46404
20169 -46404 31520 66545 -60476 -111129 -48379 92105 -57122 -118439 -163913 -129921 -45673
20158 -45673 100626 122358 117819 10902 2108 46899 26286 103816 108082 17355 -70207 -136488
20146 -136488 -115270 -64745 -53264 -64068 -96407 -145665 -81926 77958 28752 -9906 -35516
20135c5516l9211q1043L5826J7136j36254p1218L7994J56907R3758P4496Q4009
20124A36884j6180k6293m311Q0125J00103p116j40984n6608N552o3394J4758k4985
20112b449j06691N9842q032M6057q811k2453j4224p8314j928Q6Q1343K5853J1249
20099a8472m1119p9295M2083J5913M2866k7711K2034k08628K9221J41929j32089
20088b13268J5244K35677l7511j3104L2557p2053p0810n7122L9825K2033P343
20077a11189m0339R7862R5670r032j15851j01231k1328Q0712L4400K509r4472
20066a82289m0370O4120N2272R9796J9171j9365N3801n0944o7093j3498J05854
20055B1455M8204j8973j6752J8243O0337p0167k34952J0408Q0700J7487j11517
$$ plain form
20135 -35516 -74727 -155770 -119944 -102808 -239062 -310280 -272286 -115379 -21621 52875 136884
20124 136884 120704 94411 90100 170225 270328 263212 122228 65620 71172 7778 22536 -2449
20112 -2449 -109140 -49298 -57330 -11273 -20084 -42537 -56761 -135075 -137003 -136917 -55574 -29721 -18472
20099 -18472 -59591 -138886 -96803 -80890 -38024 -65735 -43701 -252329 -223108 -81179 -213268
20088 -213268 -198024 37653 142 -12962 19595 -52458 -123268 -180390 -140565 -118532 -111189
20077 -111189 -151528 -53666 42004 32972 -82879 -184110 -205438 -124726 -90326 -87817 -182289
20066 -182289 -222659 -158539 -106267 -6471 12700 -6665 47136 -3808 -70901 -84399 21455
20055 21455 69659 50686 33934 52177 112514 42347 -192605 -182197 -101497 -84010 -195527
20044a95527j17069L1069p1304O893J90874J61705J3657m942j15366K161J47261
20033D9412p145J5178k0777n4872j299m9876n3332M5220N483k9967J332j35433
20021b36076n8225J12643Q7122L9808J23841J98459J47136K73349J44228R5369
20011I27654J73501J37800Q2527J63708K52231J15735j28639j14406j89589j11606
20001A308916j14147j23167l71275j66599o2230l8451j36169r0873r9172m3698
19991F3135p4092p9562o4326M636j5369j4903n4216j6968M8950J20277K7228Q6155
19979C0945M6775K7501L1824N2344L359o3643p7718P6876M8514r3795m8946j3451
19967B0585P878P7127n6203j11991N4259P5647l7709O2539J24136M0235l6782
$$ plain form
20044 -195527 -312596 -281527 -352831 -345938 -155064 6641 20298 15356 -100010 -97849 49412
20033 49412 42267 57445 36668 -18204 -19503 -69379 -122711 -77491 -72008 -101975 -100643 -236076
20021 -236076 -294301 -181658 -94536 -54728 69113 267572 414708 688057 832285 927654
20011 927654 1101155 1238955 1321482 1485190 1737421 1853156 1724517 1610111 1420522 1308916
20001 1308916 1194769 1071602 700327 533728 471498 433047 296878 206005 106833 63135
19991 63135 -10957 -90519 -154845 -150209 -165578 -180481 -234697 -251665 -202715 -82438 -55210 30945
19979 30945 77720 105221 137045 189389 192748 129105 51387 128263 176777 82982 34036 20585
19967 20585 28463 105590 49387 -62604 -8345 67302 29593 92132 216268 256503 219721
19956B19721P5079n5379M1750L6320k8395k14763k333J24783k0687K7816K6318
19945B30230m2169q449P231j02124j9496M4826j5503k5611m1527J7414R287j6134
19933C7975o8191r756n5738p2563P4763J61797l2693O6260k9955J9430J4500j4639
19921I1190l1158m0698L0586p7655j3151K4817j72039m6800K36054P0372j20833
19910d9315q5673O8401K7932r1667O002L6875R5257R1749M2467K4793j14741j8456
19898C3624M9067K3059R6878r328j12367q1041K8032j5148O2311J41668Q0333
19887B97088j1519k9579J7747j63476j55347k2960R6132N6619K194n006l1597
19876E0296O0505P8613j14064r5394o9082k6745J03807O1812J1774L2952R7990
$$ plain form
19956 219721 294800 239421 281171 317491 289096 74333 72000 196783 176096 203912 230230
19945 230230 188061 179612 186843 84719 65223 110049 94546 68935 27408 44822 54109 37975
19933 37975 -30216 -39972 -95710 -168273 -93510 68287 35594 101854 71899 91329 105829 91190
19921 91190 60032 19334 49920 -27735 -40886 -16069 -188108 -234908 1146 71518 -49315
19910 -49315 -134988 -66587 -38655 -130322 -124320 -87445 7812 99561 142028 166821 52080 33624
19898 33624 82691 105750 202628 193300 80933 -108 27924 12776 75087 216755 297088
19887 297088 285569 255990 273737 110261 -45086 -68046 28086 84705 86899 81893 50296
19876 50296 110801 189414 75350 -20044 -89126 -115871 -12064 49748 61522 94474 192464
19865A92464m4136j68905j33862n201j21174j6413P9989j3894o8974L0333M0006
19854b29767k5709R595O3315R6258P1975n6139j02854O0325O8081o319q5402p3023
19842b09664r856L6592J26876J44686L3905j3322k4347K6238r1805n426P8566
19831I2443k2163M3405p3686p5701o2181J1888J16628M9882j72580q2311j8225
19820a92601J49260J05550m7487j38690q3079m9870j32504J40343J29677J06938
19810a2463N8059o8372l1384Q8138n9762p689J6742j05220L3878L6375P8946q539
19798A8709q5661r6877l0657n1627K12255J39623m7295N4395M0265K8722N5713
19787B37565j08633k00088J1337m3896O1788l2552K2672M678M8247K2456n5577
$$ plain form
19865 192464 148328 -20577 -154439 -159640 -280814 -297227 -217238 -231132 -300106 -269773 -229767
19854 -229767 -255476 -245881 -182566 -86308 -14333 -70472 -173326 -113001 -44920 -51239 -136641 -209664
19842 -209664 -219520 -182928 -56052 88634 122539 109217 84870 111108 19303 13877 92443
19831 92443 70280 113685 39999 -35702 -97883 -85995 30633 80515 -92065 -174376 -192601
19820 -192601 -43341 62209 14722 -123968 -207047 -256917 -389421 -249078 -119401 -12463
19810 -12463 45596 -22776 -54160 33978 -25784 -33473 -16731 -121951 -88073 -51698 27248 18709
19798 18709 -66952 -163829 -194486 -246113 -33858 105765 58470 112865 153130 181852 237565
19787 237565 128932 -71156 -59819 -103715 -41927 -74479 -51807 -47129 1118 23574 -32003
19776c2003N2457M4920j02811O6j6210o5793j0431j0158j4628P8037N6054n0063
19764g0563j1925k6534K952L5248M8369J8029l611l8580n2941j45186l3758L2012
19752b46488J15572J10219L6833k17460o7059L0625K0360M3908N9306o4253j6663
19741a95100O438p6386j9464N0523K8565p312R7953L5887M5317p158n3658N6720
19729c7675N1800j67873r268R0965P2081o9736k5777O0574p3213o4714j26462
19718b99298m7908L7308K8682P1436Q6514P3771K5180q7577N8218J743j22339
19707a74270j1595N7944K11080n8787j12707o2571Q5465J15674O1898q4312q3380
19696e5561j03146m1038j3192n647R2760J62213P6756K2046q2983p5231m4250
$$ plain form
19776 -32003 20454 65374 -37437 -37371 -53581 -119374 -129805 -139963 -154591 -76554 -20500 -70563
19764 -70563 -82488 -109022 -106070 -70822 -22453 -4424 -8035 -46615 -99556 -244742 -278500 -246488
19752 -246488 -130916 -20697 16136 -201324 -268383 -237758 -217398 -173490 -114184 -178437 -195100
19741 -195100 -188662 -265048 -284512 -233989 -205424 -212736 -114783 -78896 -33579 -40737 -94395 -37675
19729 -37675 14125 -153748 -163016 -72051 30 -69706 -95483 -34909 -108122 -172836 -299298
19718 -299298 -347206 -309898 -281216 -209780 -123266 -49495 -24315 -111892 -53674 -51931 -174270
19707 -174270 -185865 -127921 83159 24372 -88335 -150906 -65441 50233 112131 27819 -55561
19696 -55561 -158707 -199745 -212937 -218584 -125824 36389 113145 135191 52208 -23023 -67273
19685f7273N4513M2857o903p3679l2212o7899M0426J7913O5235L1397m052Q8774
19673H9097j05937k20564J5017O6189K04327N9002n0014J2914O2151l2102q1751
19662A8329J9051n3826r3439J78K8363Q1227P3452O7508l5616k16722l3110N4228
19650i0377n5526o0660O8161K440O5457k3794l285N765l8825n7149P094j8026
19638a98725O3492n7900n3639l9270k2707k7796J331J80099K14799L7000j00578
19627c894l9098n0958j2502L4209J4798M0286k648O1243O4324l3104j04431j01415
19615a33190J1504O5826n8455m9153N4463M191M8649Q0903q7014Q729K5613k1115
19603d9049j2243j8699L6292L4322K6662j51849k233R5227L7900J12866O6533
$$ plain form
19685 -67273 -12760 30097 23194 -50485 -82697 -150596 -110170 -92257 -27022 4375 323 89097
19673 89097 -16840 -237404 -222387 -156198 48129 107131 57117 70031 132182 100080 18329
19662 18329 37380 -16446 -109885 -109707 -81344 -117 73335 140843 105227 -111495 -144605 -90377
19650 -90377 -145903 -206563 -138402 -135962 -70505 -94299 -97584 -91819 -130644 -187793 -180699 -198725
19638 -198725 -135233 -193133 -246772 -286042 -308749 -336545 -335214 -155115 59684 96684 -3894
19627 -3894 -42992 -93950 -106452 -72243 -57445 -17159 -19807 41436 105760 72656 -31775 -133190
19615 -133190 -121686 -55860 -114315 -163468 -109005 -104814 -56165 24738 -62276 -53547 -27934 -49049
19603 -49049 -61292 -79991 -43699 -9377 17285 -134564 -136797 -41570 -3670 109196 175729
19592A75729J8394j57224j20026n3856O6470o8825o5978l8435o2243J41375J29914
19581c4705r8350j25849Q8248P6835j09270k7676J40567L7798J16070J88875J159
19570B53702j63181j08600L1695M0671n599l8515j43726j3554k3K7776q0289o9456
19558b69099J8253J85281P829o5646m3917R5970R0087j2395R381N480n4169k95
19546c3240J8228N0705p5902j5984J2656J4387j9257r7761j00870M2762O9359
19535a34917j15653l8106O6842J23928P9583l5136m7414Q2396O8597o0086q7684
19524i7650m9949l2231j8131J3076L4274l1265k5270M1237M1844l1587L8190R2765
19512b4697R2197q0054l4326m7064j7395m124M9241L8542J1585m7810L3779J58356
$$ plain form
19592 175729 194123 36899 -83127 -136983 -70513 -139338 -205316 -243751 -305994 -164619 -34705
19581 -34705 -133055 -258904 -170656 -93821 -203091 -230767 -90200 -52402 63668 252543 253702
19570 253702 90521 -18079 13616 54287 48688 10173 -133553 -147107 -147130 -119354 -199643 -269099
19558 -269099 -250846 -65565 -57736 -123382 -167299 -71329 18758 6363 15744 21224 -32945 -33240
19546 -33240 -15012 35693 -40209 -56193 -43537 -29150 -48407 -146168 -247038 -204276 -134917
19535 -134917 -250570 -288676 -221834 -97906 -18323 -53459 -100873 -18477 50120 -9966 -97650
19524 -97650 -147599 -179830 -197961 -184885 -150611 -181876 -207146 -165909 -124065 -155652 -117462 -24697
19512 -24697 67500 -12554 -46880 -93944 -111339 -115463 -66222 -27680 -16095 -63905 -30126 128230
19500A28230J07004k09400m3631L3835M2005N5711r191K1671N2215j13689p285
19489E7475m4877J2638Q3780L5748k071N9985K4704q5265q167R5565K21121J01088
19477E51724j21101J7027J00214P0831L8529j4395j66539q8723J3928m6674Q496
19466C63317J25176k3413j17071k23457j20684k9018P5237n2400r4504Q8817K7445
19455A9445n546m0082O3889J34974r688o9039q3545k0782n8128l4473k8221K8951
19443a02245k7357K5807O2909L4896J29381l3883m9181M1930p3640N0171J93243
19432B52031K6583R6061L0564N6593j0861j37067p32J71361J13670J6547O3677
19421F78427p8580q0227o7117l2874K7608l5441n3228q3035j8192R6261j77426
$$ plain form
19500 128230 235234 25834 -17797 16038 58043 113754 104563 126234 178449 64760 57475
19489 57475 12598 25236 109016 144764 142693 202678 227382 142117 133950 229515 450636 551724
19477 551724 430623 447650 547864 618695 657224 642829 476290 387567 401495 354821 363317
19466 363317 488493 465080 348009 124552 3868 -25150 50087 -2313 -96817 -8000 19445
19455 19445 13899 -26183 37706 172680 162992 93953 10408 -10374 -68502 -102975 -131196 -102245
19443 -102245 -129602 -103795 -40886 -5990 123391 89508 40327 82257 8617 58788 252031
19432 252031 278614 374675 405239 461832 450971 313904 313172 484533 598203 614750 678427
19421 678427 599847 519620 452503 419629 447237 411796 358568 275533 257341 353602 176176
19410A76176M1782l90J6420p3293j41296J9797J8909m9390j7012N2633J30578
19399A74914P1852O8157j9962l5700p0252n7084j6114k4941l0232r3099N0278
19388A7817J15664R8808q4862p6297O137L2294m4840j1061j66626K574L022L5663
19376g1707J76797Q7449p5392p7912j27529p4155Q8631L7103n2235N5465K629
19365c0856j117n8795K9215P8126K1781m6332N9530J43321M495M4779J2783l0545
19353B26385N9955N6761K4402o6176q4796m1414l0350p4347J6895k7766n9399
19342A50Q9366M3977n1502r5501O5428R249O7632N4852M8474n581j55661j38877
19330f7994L6729O8570J7818L8003J4174J198j8744Q874q9478j68262k3750K5125
$$ plain form
19410 176176 217958 217568 233988 160695 19399 39196 58105 8715 -8297 44336 174914
19399 174914 246766 314923 294961 259261 189009 131925 115811 90870 60638 -32461 17817
19388 17817 133481 232289 147427 71130 77267 109561 64721 53660 -112966 -110392 -107370 -71707
19376 -71707 105090 192539 117147 39235 -88294 -162449 -73818 -36715 -88950 -33485 -30856
19365 -30856 -31973 -90768 -61553 16573 38354 -7978 51552 194873 199368 244147 256930 226385
19353 226385 286340 343101 367503 301327 216531 175117 144767 70420 87315 59549 150
19342 150 89516 133493 81991 -13510 51918 61167 128799 183651 232125 226544 70883 -67994
19330 -67994 -31265 37305 55123 93126 107300 108498 89754 98628 9150 -159112 -182862 -157737
19318a57737K0960M0257O6433O7297j16829L1238M3929K0842P9249N2886Q7554
19307B36079J00219Q17m9491j28875r8273o8733O5458J37387m3152n7020r7792
19296c376j1599l2276r6853L9229M2966J2554R8052J05089K3425K7579o5032j8849
19284A20909n7145n9508J53644Q5658J5161M9510o9768j11778r042m8532n5600
19273A3509j4694L0385P6227p4682j37025o9224k8209p7003L6912q11k7399M8835
19261b23179L5795o7407P9986R0144R9390J54359j16605j75548J44701l6767j20691
19250a35822r5643N0974l3821L2848l8576j3916O1640K4455n8312p945P1359K9893
19238a12866J67358R0119L917m2345P7926K9048p8525q462m1989n5324Q8894J20715
$$ plain form
19318 -157737 -136777 -96520 -30087 37210 -79619 -48381 -4452 16390 95639 148525 236079
19307 236079 336298 337115 287624 158749 60476 -8257 57201 194588 151436 94416 -3376
19296 -3376 -14975 -47251 -144104 -104875 -61909 -49355 48697 153786 177211 204790 139758 120909
19284 120909 63764 4256 157900 243558 258719 308229 238461 126683 117641 69109 13509
19273 13509 -1185 29200 105427 30745 -106280 -175504 -203713 -280716 -243804 -244615 -272014 -223179
19261 -223179 -187384 -254791 -174805 -84661 14729 169088 52483 -123065 21636 -15131 -135822
19250 -135822 -231465 -180491 -214312 -181464 -220040 -233956 -172316 -147861 -206173 -214118 -142759 -112866
19238 -112866 54492 144611 148528 106183 184109 213157 134632 126170 84181 28857 117751 238466
19226B38466Q1173N505K6569n7680j18922k8024n8751j7338n8021j1228K6918
19215B8667P1145m6044K7655J21372o5169n3602L9504j06897O9643O8034K9124
19204A83432j42356l9081J0558j7890o9788k9857J3025q6920j09805n7193J9227
19193c26648J3912R4289K07340l3406j44741n4566O6853N2760m0699o1921j0284
19182b37111J25501J14239j35960K4845O9859Q0539j4279N5655m2578M139k6289
19171A8560J5698J48053j6341n2923M0876Q7867q7815q5518n5929P3793l8n2271
19159C4012o0410p3376N2527R3519l0269j497n0711o5228R7755n8702j95960J7274
19147b41066J13927J41335K16543l5896j18809J2986o376P7698M5006k6874k03608
$$ plain form
19226 238466 319639 325144 351713 294033 175111 147087 88336 70998 12977 1749 28667
19215 28667 99812 53768 81423 202795 137626 84024 123528 16631 86274 154308 183432
19204 183432 41076 1995 12553 -5337 -75125 -104982 -91957 -178877 -288682 -345875 -326648
19193 -326648 -312736 -218447 -11107 -44513 -189254 -243820 -176967 -124207 -164906 -226827 -237111
19182 -237111 -111610 2629 -133331 -108486 -38627 41912 27633 83288 40710 44849 18560
19171 18560 34258 182311 165970 113047 153923 241790 153975 68457 12528 86321 86283 34012
19159 34012 -26398 -99774 -47247 46272 16003 14506 -36205 -101433 -3678 -62380 -258340 -241066
19147 -241066 -127139 14196 230739 194843 76034 89020 82644 160342 205348 178474 -25134
19136b5134l4540l9903J9997j9881K6827P391n84O7998P7221L8823L508M4582
19124A66305q6274m8405M4856J05456j221m4389j9023j40944r7639K05302l9638
19113D4386J27266K5680l0780n6114p303l9228o2083M3915O1868K9177r615J3262
19101A40431j9519O5820n5461o9622l0199o2083n5982P0136K8711m5858n5926
19090h9552J6046R9930J03407m359l7401k1323K6896M987m7003p7905K28J18969
19078I2920J28659m0029j41334N0943K19340j9151p0178K0969o5937j81605o5239
19067g0642J8243J12684O3188o5672P7088O5724O3630O3238j09599n1957N2192
19056B18117R5482O8690k7707R6235J45721L1920j1375n2359o505J02931J71749
$$ plain form
19136 -25134 -59674 -99577 -79580 -99461 -72634 -65243 -65827 2171 79392 118215 121723 166305
19124 166305 80031 31626 76482 181938 180717 136328 117305 -23639 -121278 84024 44386
19113 44386 171652 197332 166552 110438 103135 63907 1824 45739 107607 136784 127169 140431
19101 140431 120912 186732 131271 61649 31450 -30633 -86615 -16479 12232 -33626 -89552
19090 -89552 -73506 26424 129831 125472 88071 66748 93644 98631 51628 -26277 -26049 92920
19078 92920 221579 181550 40216 91159 310499 291348 221170 242139 176202 -5403 -70642
19067 -70642 -52399 60285 123473 57801 134889 200613 264243 327481 217882 165925 218117
19056 218117 313599 382289 354582 450817 596538 628458 617083 564724 558219 661150 832899
19045H32899J22997k2067K7445J47590K3006j58269j61401q9447j9175N57r6577
19034F07558n8996J2401n3700j06824M0902o5128l4074m4918q9805J6031J61270
19023C84717k3427M2219M0897L3331J44521j5297Q3334L8331J0882J7081Q6408
19012H42997J58477R3229r1840O3771J29181K05341K42185K03215J68293J1847
19002B026696Q5075K14510K40081K47752K15998L59476N64420M88809L19768L79778
18992E142363M67690O23028O96233Q75373J265012J612947K353991L689531N714737
18983B2440905Q416076J0755458J0050128P645922O455477Q893554J4859497J7936944
18975A07453961J4300043P494076o83206l368691n10001K490591N012306K595585
$$ plain form
19045 832899 955896 933829 961274 1108864 1131870 973601 812200 722753 703578 704135 607558
19034 607558 548562 560963 507263 400439 441341 376213 342139 297221 207416 223447 384717
19023 384717 361290 403509 444406 477737 622258 606961 690295 728626 739508 756589 842997
19012 842997 1001474 1094703 1002863 1066634 1195815 1401156 1643341 1846556 2014849 2026696
19002 2026696 2111771 2326281 2566362 2814114 3030112 3389588 3954008 4442817 4762585 5142363
18992 5142363 5610053 6233081 6929314 7804687 9069699 10682646 13036637 16726168 22440905
18983 22440905 30856981 41612439 51662567 59308489 65763966 74657520 89517017 107453961
18975 107453961 121754004 129248080 128564874 125196183 124686182 127176773 132189079 134784664
18967A34784664o037401j3265367j6882997j4209364q517562o212489p661112
18960F1998372j0518661j1678536r921265o858793m324947k774384k080463j437159
18952A2404164j077760q33081n25063m90140l59046l86165l89623j28727j0606
18943H203953J22176L4026m6435J44267K97985M99252P77040J068682J707174
18934A2808120K554125L747855O144734R221514J1793928J1605113R579377P610296
18926G5065062R184900J5283149J9170282J6276590R288457l40200l677371o68640
18918A39582229J915658M281540K081571n604500j2707941j7747389j6787761
18911I5013407j0936437p133179p870895j1177929j3147106j1616351q191769
$$ plain form
18967 134784664 128747263 115481896 98598899 84389535 75871973 69659484 61998372
18960 61998372 51479711 39801175 29879910 23021117 18696170 15921786 13841323 12404164
18952 12404164 11326404 10493323 9968260 9478120 9119074 8732909 8343286 8214559 8203953
18943 8203953 8326129 8360155 8313720 8457987 8755972 9255224 10032264 11100946 12808120
18934 12808120 15362245 19110100 25254834 34476348 46270276 57875389 67454766 75065062
18926 75065062 84249962 99533111 118703393 134979983 144268440 143928240 140250869 139582229
18918 139582229 141497887 145779427 147860998 142256498 129548557 111801168 95013407
18911 95013407 84076970 76943791 69072896 57894967 44747861 33131510 24939741
18904B4939741n085238l318042k468613j752753j454238j225587r38152p18171
18896G978947o88853p27931n27846m64546l95683l34318l99159k66295k00709
18887C973607k92078k86809k23374k36877j51217j92374j58734k00433j36223
18878B095488n795o8077j51537j75866j27278j3563l5818j391J5106N498J74005
18867A710772J20798K0130k08846j08647j79338n6922p4081n7129L7829Q0305
18857A284871o107q9154j06078j77917r1083P3819o5560q635p8753j41863J6076
18846F09616k3830P9722R1750M1966o3876j14377j10822j43653r1295J11937J13650
18835E00788M7517j18347m5075K7362R4720R4693j7978J9087N9378M0047n8694
$$ plain form
18904 24939741 19854503 16536461 14067848 12315095 10860857 9635270 8697118 7978947
18896 7978947 7290094 6562163 6034317 5569771 5174088 4839770 4440611 4174316 3973607
18887 3973607 3681529 3394720 3171346 2934469 2783252 2590878 2432144 2231711 2095488
18878 2095488 2089693 2021616 1870079 1694213 1566935 1553372 1517554 1516163 1531269 1536767 1710772
18867 1710772 1831570 1851700 1642854 1534207 1354869 1297947 1223866 1166737 1204566 1284871
18857 1284871 1278764 1189610 1083532 905615 814532 888351 822791 814156 735403 593540 609616
18846 609616 585786 665508 757258 799224 735348 620971 510149 366496 275201 387138 500788
18835 500788 548305 429958 384883 412245 506965 601658 583680 602767 662145 702192 643498
18824F43498j49066j12881m3981q0817j2594m9718N0794p9931L4649p3402m456
18813A22095L1165R7715J59952L9710k3945L7386j9887O829j40791m1184N4586
18802C23631Q1664q6988p4664N5870Q0326J3230l548q1431r1648k195J39704J16500
18790D70451n7433j81169N6915O1908J4514r0639j51459k5609J8510M1911j1898
18779A46002o7877J7279P823n7198q3103J10510J11759j26051j21111O7640k0223
18768a4550p193J08640j1192N351J05197L0675j25142k7472M5033j19818J3422
18757B951Q8985M9489O5705J18852K8373j02673p2063M6504K8483J3695N7224
18746C25525J72160N5312q8958O3867p0661j31909p9521J48521L6031n5433p1503
$$ plain form
18824 643498 494432 381551 337570 256753 244159 194441 245235 165304 199953 126551 122095
18813 122095 153260 250975 410927 450637 426692 464078 444191 451020 310229 269045 323631
18802 323631 405295 318307 243643 299513 379839 393069 389521 308090 216442 214247 353951 470451
18790 470451 413018 231849 288764 350672 365186 274547 123088 97479 115989 157900 146002
18779 146002 78125 95404 103227 46029 -37074 73436 185195 59144 -61967 5673 -14550
18768 -14550 -21743 86897 75705 81056 186253 216928 91786 64314 109347 -10471 2951
18757 2951 91936 141425 207130 325982 354355 251682 179619 226123 254606 268301 325525
18746 325525 497685 552997 464039 527906 457245 325336 245815 394336 430367 374934 303431
18735C03431L1354r2762p9537N5314J574j19425M783J22402k2767j12345k6212
18724F5810p7270m0104K1382j9959o3545Q6232Q0677J09030J37289j0528N3145
18713C42159L1045j9214j22022j40873N0113Q7398L0564r1722k15870O9263J31630
18702A52471j2270p7133J05105N9209q4373J20900k1392j30709m5416K8183L1627
18691A26202p709j8609N1905r9781j21433Q8593R5755m0725J8366J52870K7034
18680B72468q5454o5659J1465k3150R3194r8896o4274K5716J14506K0250j52800
18669D7366r5343l093Q5810l3914L8762P3900Q3661P9069j0779o0384J592k0294
18657A86353j27469j8234q6046Q8310J3903j0508J08690n4005N61Q336o7734l0294
$$ plain form
18735 303431 334785 242023 162486 217800 219374 99949 104732 227134 204367 92022 65810
18724 65810 -11460 -51564 -30182 -50141 -113686 -27454 53223 162253 299542 289014 342159
18713 342159 373204 353990 231968 91095 141208 228606 259170 167448 -48422 20841 152471
18702 152471 140201 63068 168173 227382 143009 263909 242517 111808 66392 94575 126202
18691 126202 118493 99884 151789 52008 -69425 19168 114923 74198 92564 245434 272468
18680 272468 187014 121355 132820 109670 202864 103968 39694 65410 179916 200166 47366
18669 47366 -47977 -51070 34740 826 39588 113488 197149 276218 265439 205055 206647 186353
18657 186353 58884 40650 -45396 42914 56817 46309 154999 100994 101555 109891 42157 11863
18645A1863J00753K7188q5213J05463J02983j10880m5287M6381J01146L7462J6404
18634C08263j12237j6292Q3272Q3943j5709j25439o1834j04532O5132J38986Q1556
18623C25109M096n7911L4138n500j46796m3460O033J29575J75704k8079J3646
18612D06555j7333J31499j0288j26756n7904P9390p1072q3904O2032m5080m8638
18601B18501Q5000J27872J8768j31896j8484j5621M5058M8151J0255J7080l4650
18590C70034q2328N3249L0039R7842P2067O9691M7541R6472J44162R250m4857
18579H63162M2451J5066Q6377Q1911O0454P5242p093K5107J61648J10909J34245
18568A649479K14192L13100K41281L52179K70179M42332L35554M30260O07424
$$ plain form
18645 11863 112616 139804 54591 160054 263037 152157 106870 153251 254397 291859 308263
18634 308263 196026 179734 263006 346949 331240 205801 143967 39435 104567 243553 325109
18623 325109 329205 271294 305432 299932 153136 109676 115709 245284 420988 392909 406555
18612 406555 389222 520721 510433 383677 325773 405163 334091 250187 312219 267139 218501
18601 218501 303501 431373 450141 318245 299761 284140 329198 377349 387604 404684 370034
18590 370034 287706 340955 370994 468836 540903 610594 658135 754607 898769 908019 863162
18579 863162 905613 920679 1007056 1088967 1149421 1224663 1217570 1242677 1404325 1515234 1649479
18568 1649479 1863671 2176771 2418052 2770231 3040410 3482742 3818296 4248556 4855980
18559D855980J061257J520618K439616L602685N092575N800387M798313M023275
18551C3194706M250793O033863P380785N613035L694602K410554K241787J890362
18543F6710487J250407P10963J288993J846431q20515l408205o151713p483869
18535E3942979o247794n098887n061220n804536o508250n946979m420008k821712
18527A2033593j670137j185339r93430o97286n92252m35738j97556n6612L7345
18518F242588R1616L19650L48291K70903L97095O15010P14206Q52606R31901J138615
18508A1922481J483457J922183K662578L859852N961494R458613J3975519J7088330
18500F8334507J6734952J4923981J3580885J5473663K0220843J9099739J3714843
$$ plain form
18559 4855980 5917237 7437855 9877471 13480156 18572731 24373118 29171431 33194706
18551 33194706 37445499 43479362 50860147 56473182 60167784 62578338 64820125 66710487
18543 66710487 67960894 68671857 69960850 71807281 70986766 67578561 61426848 53942979
18535 53942979 47695185 42596298 37535078 31730542 25222292 19275313 14855305 12033593
18527 12033593 10363456 9178117 8184687 7487401 6895149 6459411 6261855 6205243 6242588
18518 6242588 6334204 6653854 7002145 7273048 7670143 8285153 8999359 9851965 10783866 11922481
18508 11922481 13405938 15328121 17990699 21850551 27812045 37270658 51246177 68334507
18500 68334507 85069459 99993440 113574325 129047988 149268831 168368570 182083413
18493A82083413N842232p25830q73077J642551J327559j331873k852278n268833
18485A79843864p863437j2260847j8637188j8226345j4082967j1635542j2459345
18478H4678193j5565655j5862664j2566733q168292n055542l396104k378245j681941
18470B0003017j422935j097610q29957l33951j32588n7338J38587O12292J557613
18461A8437130K496536M063902O631665J1221478J8649706K8136927L3035258
18454A22672602K0445207p470484k5924212k3358326r070255O331950J9885728
18447A03512210K6796317J4799011j3302803l3074599l2020064k1227656j2471145
18440C3011271p309214m353446k904712k222702j660732j107436q15126n91123
$$ plain form
18493 182083413 187925645 187199815 186326738 187969289 189296848 187964975 185112697 179843864
18485 179843864 171980427 159719580 141082392 122856047 108773080 97137538 84678193
18478 84678193 69112538 53249874 40683141 32514849 27459307 24063203 21684958 20003017
18470 20003017 18580082 17482472 16652515 16318564 16185976 16128638 16267225 16879517 18437130
18461 18437130 20933666 24997568 31629233 42850711 61500417 89637344 122672602
18454 122672602 143117809 135647325 109723113 86364787 77294532 83626482 103512210
18447 103512210 130308527 145107538 131804735 98730136 66710072 45482416 33011271
18440 33011271 25702057 21348611 18443899 16221197 14560465 13453029 12637903 12046780
18432A2046780l99544l13850j31344j69750M0244L77401M85575N75329R00798
18423A3411639J081834J667548K338677L314537N166116Q740215J5049372K4393069
18415G5163007L3786064L2793962J2141900j6427427k8636835k0522290m560212
18408H3738169J0493924K2509173K4796820R584973j4362827k5793490j9898755
18401I1067987j1393138j0876950j3328802j1749821p018918j913602L033693
18394C7820449O853600N893418j747030r493540j0698261p608229m353568k707020
18386A3959819j788846j338833r35175p51236n47684l89623k65135k94804m77310
18377G171173m63819l06377k41605k18812j99051N3354K07666L17758M50566P75594
$$ plain form
18432 12046780 11647236 11333386 11202042 11032292 11072536 11449937 11935512 12510841 13411639
18423 13411639 14493473 16161021 18499698 21814235 26980351 35720566 50769938 75163007
18415 75163007 108949071 141743033 153884933 137457506 108820671 88298381 83738169
18408 83738169 94232093 116741266 141538086 151123059 136760232 110966742 91067987
18401 91067987 79674849 68797899 55469097 43719276 36700358 34786756 37820449
18394 37820449 44674049 50567467 48820437 39326897 28628636 21020407 16666839 13959819
18386 13959819 12170973 10832140 9896965 9145729 8598045 8208422 7943287 7648483 7171173
18377 7171173 6707354 6400977 6159372 5940560 5741509 5794863 6002529 6320287 6770853 7546447
18367G546447J333936K020367L177809N495426R256478J4054247J6065974Q753851
18359F7704535m631320j2890311j1199903m360721K696657Q982278J2113417O854105
18351F5268737n455890j4763571j4726473j0019236n854477l542044k262479j550061
18343G094506j015226p65012o74209m61872l45947k50722l00721j68667j04793
18334C007337k39365j91734j01806j13171j72148k12669k3712l8570j26239r8244
18324A689679j14838k36222k4120l0466o3170k1546l2450j9080j03762m4186l6087
18313I63752P9570k0331m3676L931j51765n7288J78387L8632j42663j80589N1269
18302G19229k24J0232O1281k2238j72734j48487r9656O9881O2917O2356J6911
$$ plain form
18367 7546447 8880383 10900750 14078559 19573985 28830463 42884710 58950684 67704535
18359 67704535 63073215 50182904 38983001 34622280 37318937 46301215 58414632 65268737
18351 65268737 59812847 45049276 30322803 20303567 14449090 10907046 8644567 7094506
18343 7094506 6079280 5314268 4640059 4178187 3832240 3581518 3280797 3112130 3007337
18334 3007337 2767972 2576238 2474432 2361261 2189113 1976444 1952732 1914162 1787923 1689679
18324 1689679 1574841 1338619 1314499 1284033 1220863 1199317 1166867 1147787 1044025 999839 963752
18313 963752 1043322 1022991 979315 983246 831481 774193 952580 991212 848549 667960 719229
18302 719229 719005 729237 790518 768280 595546 447059 347403 417284 480201 542557 559468
18291E59468j06401l1469l6805K1948m6605L9743O8284n1209n554N7893n1202
18280D18091j5733J471N0123m4066M438Q0110p4348l9353J0883K472J5033J1893
18268D21014m7588o1882L1073J9271n5618O9758N2769j67007O3134K52496M9461
18257F26881n6825J7120M3315K8721J65078L8775P275N2857k7171M3327R9058
18246A038411R8070K34072L06325K77431K09830m9589j31733j88051k23292j84878
18236A386596j46287k18787j95521k08757L1823K4508j08605Q5403J21835j22353
18226F49855p6392J5297k5212r9625l5453N0611j3436k4588j0426k0966o7479
18215C42186p3403j27324K2443J31701m8050j5720p1659j5467k0649m438L8333
$$ plain form
18291 559468 453067 421598 384793 406741 360136 399879 468163 416954 411400 469293 418091
18280 418091 402358 403829 453952 409886 414324 494434 420086 380733 391616 394088 409121 421014
18268 421014 373426 311544 342617 361888 306270 376028 428797 261790 324924 577420 626881
18257 626881 570056 587176 630491 659212 824290 863065 870340 923197 896026 939353 1038411
18246 1038411 1136481 1370553 1676878 1954309 2164139 2114550 1982817 1794766 1571474 1386596
18236 1386596 1240309 1021522 826001 617244 649067 673575 564970 650373 772208 649855
18226 649855 573463 588760 563548 463923 428470 479081 465645 441057 430631 409665 342186
18215 342186 268783 141459 163902 295603 247553 231833 160174 144707 124058 119620 157953
18204A57953R300p3239L8618K6368m9631j12465n4173o1966J3766J68004J07561
18193A70096J652J6156r333k4070m057P5864j973n7408N0142J07770l5381p4857
18181B14601P7230M9776k2764J9093k9776l9358L8281M1256L5621J21570j12459
18170C93071o032r9631l1225L8026k7580L7079p7607L5257P0184Q8010K8482m7483
18158D00551l2177j392r0539r6517j27397k0059R2260o822K514M2244j0879j10448
18146D1339L5257m3522j4915o4116K8654M5939k3398r4884N5365J22005J71725
18135B59449L5888L5809j03389j56634K8928Q2672J01871M4534l8582o2014j4005
18124B14527J5296O6645J12694J33766R2281q7644q5922r1050m9990J81841J98520
$$ plain form
18204 157953 167253 94014 132632 159000 109369 -3096 -57269 -119235 -105469 62535 170096
18193 170096 171748 187904 178571 154501 150444 226308 224335 166927 217069 324839 289458 214601
18181 214601 291831 341607 318843 337936 308160 268802 307083 348339 383960 505530 393071
18170 393071 387039 287408 256183 294209 266629 303708 226101 261358 331542 419552 448034 400551
18158 400551 368374 366982 276443 179926 52529 32470 124730 117908 120422 162666 151787 41339
18146 41339 76596 33074 18159 -45957 -17303 28636 5238 -89646 -34281 87724 259449
18135 259449 295337 331146 227757 71123 100051 182723 284594 329128 290546 228532 214527
18124 214527 229823 296468 409162 542928 635209 547565 461643 370593 320603 502444 700964
18113G00964K61529j14516j63490j79370j92378L8632J44109Q3411O8580l5103
18103F12368j28677o7781j24336m7745O0597n6427j55823n7671Q798n1491O284
18092a904J21873j0P3582J9676Q9247L7636J0730R9495L1138L4730J5927k6221
18080E05899j2476j90220l5708q130n0344J27417J18934J31409J78039K18146
18070I82966L18136K26328L8724K4251j32918j63504k0511N2114j66166k99833
18060H59587j77660J7753r2318k51410k075K8421q4719o1252r9184j38042k7730
18049b8629J39743J02807K0881P792N1465N7981N3321J6888J424M6451l1313k5205
18037D13606o2098O4906J93344J21468o7556R2563J55864P7198K374M1285J02005
$$ plain form
18113 700964 962493 847977 684487 505117 312739 351371 495480 578891 647471 612368
18103 612368 483691 415910 291574 243829 304426 247999 92176 34505 43303 -8188 -1904
18092 -1904 119969 119959 193541 213217 302464 340100 350830 450325 481463 516193 532120 505899
18080 505899 493423 303203 267495 259365 209021 336438 455372 586781 764820 982966
18070 982966 1301102 1527430 1566154 1590405 1457487 1293983 1273472 1325586 1159420 859587
18060 859587 681927 699680 607362 355952 353877 382298 297579 236327 137143 -899 -28629
18049 -28629 111114 213921 234802 242594 294059 352040 405361 422249 423673 470124 438811 413606
18037 413606 351508 416414 609758 731226 663670 756233 912097 989295 991669 1032954 1134959
18026A134959R2165J92433J41746M6425J90361J57795k1723K0578N2055j445N9222
18015B064571l4359M9116P3376j23884j22262O3782J36643J96152L91317L03802
18005B998254J36761J08705O4216L7529q827P76K3352P3077o5934Q2224J97676
17994C647809J22156K20351M66607Q09490J071725J377246J990399L009806M659749
17985A7375338P677017J2884222K0118797K5925587K1187467J978276j7398636
17978H9748068k2330567j5092410m990240M621918J4058527K1271439J8691368
17971A05978103K408431j7548875k5979466k1409117j3053435p560026m787938
17964A8047677l161895k243363j576607r57700m02620k81311k50778k24795j02568
$$ plain form
18026 1134959 1227124 1419557 1561303 1607728 1798089 1955884 1934161 1954739 2006794 2005349 2064571
18015 2064571 2030212 2079328 2152704 2028820 1906558 1970340 2106983 2303135 2694452 2998254
18005 2998254 3135015 3243720 3307936 3345465 3336638 3337414 3360766 3433843 3367909 3450133 3647809
17994 3647809 3769965 3990316 4456923 5266413 6338138 7715384 9705783 12715589 17375338
17985 17375338 25052355 37936577 58055374 83980961 105168428 107146704 89748068
17978 89748068 67417501 52325091 47334851 51956769 66015296 87286735 105978103
17971 105978103 108386534 90837659 64858193 43449076 30395641 22835615 18047677
17964 18047677 14885782 12642419 11065812 10108112 9705492 9424181 9173403 8948608 8846040
17955H846040k8066q7428Q3978K6780J29405N47524R12674J346907J940204L068598
17945A6786616M855098P808684J2729882J9015650K2832848J4647266n125464
17938I3550580j8300655j6783994p624888J649493J0559137K0073025K8406144
17931A11528842K8928385J8004089l26173j8884825k9615981k7991327j8617212
17924F3025798p970829J643741J1110950J8390703J5495313j32332j7321076k3407668
17916F0834600j8688902j1886966p197562m608247l055968k002587j319979r08893
17908A1165496p44316o42923l94058l53211m78784m22946k04628k27176n9436
17899G638018R9745J67832N12442J129363J581067K268722L711560O052661J0373809
$$ plain form
17955 8846040 8817974 8730546 8814524 8841304 8970709 9518233 10430907 11777814 13718018 16786616
17945 16786616 21641714 29450398 42180280 61195930 84028778 98676044 93550580
17938 93550580 75249925 58465931 50841043 52490536 63049673 83122698 111528842
17931 111528842 140457227 158461316 158135143 139250318 109634337 81643010 63025798
17924 63025798 55054969 56698710 67809660 86200363 101695676 101563344 84242268 60834600
17916 60834600 42145698 30258732 23061170 18452923 15396955 13394368 12074389 11165496
17908 11165496 10421180 9778257 9384199 9030988 8552204 8129258 7924630 7697454 7638018
17899 7638018 7737763 7905595 8418037 9547400 11128467 13397189 17108749 23161410 33535219
17890C3535219J6589930K1174150J5210414k601494j6678402j7100669r759254
17883D0369894j940924N266840J2338599J6576252J1239895m502906j7921497
17876F1426153j9822322j4242877q382271m913317l048976k048432j485830j063901
17868F418227p39461m77635m36425k19696k31639l16109j87924l34101m33330
17859C041907j94977j07146M8789o2172j70380k05811j28282j81503j02293J5131
17849A953263k21263k11529j14229o7707N2500J4798j08992j33654j43493q8091
17839I31603R269k7499O935l845P2048r0557j13067j36009q2417O4630M883K2108
17827F58082m1504j8019l7116r3621j17762n0220q910O2435K0922K8104j2731
$$ plain form
17890 33535219 50125149 71299299 86509713 83908219 67229817 50129148 40369894
17883 40369894 38428970 43695810 56034409 72610661 83850556 79347650 61426153
17876 61426153 41603831 27360954 18978683 14065366 11016390 8967958 7482128 6418227
17868 6418227 5678766 5201131 4764706 4545010 4313371 3997262 3809338 3475237 3041907
17859 3041907 2846930 2739784 2788573 2726401 2556021 2350210 2221928 2040425 1938132 1953263
17849 1953263 1732000 1520471 1406242 1338535 1391035 1405833 1296841 1163187 1019694 931603
17839 931603 940872 913373 920308 916463 988511 897954 784887 648878 566461 631091 635974 658082
17827 658082 616578 598559 561443 467822 350060 299840 290930 353365 374287 402391 389660
17816C89660n7373K578n4461j01006o9396Q092k1128Q2221L1095N6478R3688l1348
17804C29100n8581o3222J53983N8123p1000n4880j90089m7063J89785J69294R8161
17793E13611J0323q3306r4384L1168M0224o0715q3857J020J06619L3252l6370
17782C77585r622j16158j37862O9853k3769q1280k953p2185q4881n1737Q0011
17771e2998O7961M807O5659r913l268o3588Q7086n1815m1649L1562K2157o2119
17759f118p0224o4006J4341J003Q3082O3159O2623J9932n246J2235r6129n2313
17747c7661P7782O7703L2028M6344n8855M7034j1602j42371O5078N1366K5345
17736A62191q8125j00442Q4701k8029p2680J27544L0966l3962M429k4511r98o0500
$$ plain form
17816 389660 332287 334865 280404 179398 110002 118094 96966 179187 210282 266760 360448 329100
17804 329100 270519 207297 361280 419403 348403 293523 103434 56371 246156 415450 513611
17793 513611 523934 440628 346244 377412 417636 356921 273064 274084 380703 413955 377585
17782 377585 367963 251805 113943 183796 160027 78747 75794 3609 -81272 -133009 -52998
17771 -52998 14963 19770 85429 75516 72248 8660 95746 43931 2282 33844 56001 -6118
17759 -6118 -76342 -140348 -126007 -125004 -41922 21237 83860 103792 98546 110781 14652 -37661
17747 -37661 40121 107824 139852 186196 127341 174375 162773 20402 85480 136846 162191
17736 162191 74066 -26376 58325 30296 -42384 85160 116126 82164 86593 62082 61084 584
17724E84Q878J8786j1771j9253m1363j52972K6841J10715J03876J03603L6040
17713A83964l1257n9559j1873R8302L4771M8483J0374o9096j04606M5650O1768
17702B06921m9698M2889J24579J15M8333o9698j60749o9467j7499L7335M5541
17691A38602Q2176Q829q593K2849q4399p8669p2634j33282Q24O777m6769J00183
17679f4106K31622O8682n1044L0800J0055p7081k5937j39828r9207N6577N8909
17668e58n025N6431L5904m033j17434k654L7301m768J15475k4143j08447k6388
17656d8339N4326L0679j70387p2404K15669J26353J6235l2242O6629K0879j60808
17645D6590n5113j23755N6637M0586j0589K0015j3190P649J14819J64546J05603
$$ plain form
17724 584 9462 28248 16477 -2776 -44139 -197111 -170270 -59555 44321 147924 183964
17713 183964 152707 93148 81275 179577 214348 262831 273205 204109 99503 145153 206921
17702 206921 157223 200112 324691 324806 373139 303441 142692 73225 55726 93061 138602
17691 138602 220778 229607 221014 243863 159464 80795 8161 -125121 -124297 -117520 -164289 -64106
17679 -64106 167516 236198 185154 215954 226009 148928 122991 -16837 -116044 -59467 -558
17668 -558 -5583 50848 86752 82719 -34715 -37369 -68 -4836 110639 86496 -21951 -48339
17656 -48339 5987 36666 -133721 -206125 9544 135897 152132 119890 186519 207398 46590
17645 46590 -8523 -132278 -75641 -35055 -45644 -25629 -38819 -31170 83649 248195 353798
17634C53798J1382j15322j93589R984M7076J01880q261j65420l941M3762q140
17623G3209M9263j6255j25494N0911Q3643J8775O3309O492L583P0270m6733r6450
17611A34523J3020m8007J03200J21182J77595J88619J57479R6825J13689K13185
17601A271310J04208P8164J99037J87243k6226l2630m5017k65650k08871j9130
17591A242438J4992k31673j82976k25440j81203j21115K2173q0198j62720j1413
17581H2865J31223n3044q2277J2699L3300M3885j0868n5043k0628K5833n5461
17570E2484r2720m3724L0924M024q5572m2033J15446J60887K1562l1250l399j01432
17558a4803n3020j5751n3101k9828J3369J2685K6816n4254O2892P9117k9359m7075
$$ plain form
17634 353798 365180 249858 56269 66253 113329 215209 206948 41528 37587 81349 73209
17623 73209 122472 106217 -19277 31634 115277 134052 197361 203853 207436 277706 230973 134523
17611 134523 147543 99536 202736 323918 501513 690132 847611 944436 1058125 1271310
17601 1271310 1375518 1453682 1652719 1839962 1813736 1781106 1736089 1470439 1261568 1242438
17591 1242438 1257430 1025757 842781 617341 436138 315023 337196 256998 94278 82865
17581 82865 214088 161044 78767 91466 124766 168651 157783 102740 82112 107945 52484
17570 52484 -40236 -83960 -53036 -49012 -134584 -176617 -61171 99716 121278 90028 86629 -14803
17558 -14803 -67823 -83574 -136675 -166503 -153134 -140449 -113633 -167887 -104995 -25878 -55237 -102312
17546a02312j8381M7655M0928Q9819j07572m9164Q9696J19005q791R2430r2689
17535A00624j17880R461o5019p4698o9401M1184R6530O6069j0550q442J41942
17524A09820q5555r963l2833j33369o6841M4821O8949j05170q9175n8198J33972
17513b23542J14931M9730P1875R9133j08562j9870J03228Q8532p7156j12825l5165
17502d9691M8028K3161J5853k3098K037O7921Q6965j2839l1996j8805m9770m6760
17490A1006K1791k2701J31735N2298o7792n8674k10040j11021j06360j5833J78279
17479a97312J41277j0147M9587j6365n2019n5909P8487J21574J10179Q3787J0193
17468B63332O5384N2825N98j06721j88623j09934n291P5744N1394J23782J19682
$$ plain form
17546 -102312 -120693 -73038 -32110 57709 -49863 -99027 -9331 109674 100883 193313 100624
17535 100624 -17256 -7795 -72814 -147512 -216913 -175729 -79199 -13130 -23680 -32122 109820
17524 109820 24265 14302 -18531 -151900 -218741 -173920 -104971 -210141 -299316 -357514 -223542
17513 -223542 -108611 -58881 12994 112127 3565 -16305 86923 175455 98299 -14526 -49691
17502 -49691 -1663 21498 37351 14253 16290 84211 171176 158337 126341 107536 57766 11006
17490 11006 32797 10096 141831 194129 126337 67663 -142377 -253398 -359758 -375591 -197312
17479 -197312 -56035 -66182 -16595 -32960 -84979 -140888 -62401 59173 169352 253139 263332
17468 263332 328716 381541 382139 275418 86795 -23139 -28430 47314 98708 222490 342172
17457C42172P6531n4053o1782j29430j90641j1726N3190l5302k2463j17996N2278
17446i9222q665J3264J28147j4749j18748k0122N3826J40817q8529j7508J12530
17435H1041N9081M1062o9614m4731j568J73087J43576N8956L627j14376j34177
17424A95964l341O072M1835J61127R3446M8789J7156L7385m8977o6246j18911
17413C64299J8113k4546k6985J20643j1227r3010q8946Q8611M8302Q8868M212
17402D88334j16342j6918j80484J6008P9488o968j36577p6366q0865J0929P6443
17391E6682p3265J5277Q0398m2822j18351J8917l0548Q28l7681M1841J20602M4761
17379G6639J11737J2078k9859N4443N1960j61172o809J49632K6303O8847o012
$$ plain form
17457 342172 418703 364650 302868 173438 -17203 -28929 24261 -11041 -33504 -151500 -99222
17446 -99222 -107887 -94623 33524 18775 -99973 -120095 -66269 74548 -13981 -31489 81041
17435 81041 140122 181184 111570 66839 65271 238358 381934 440890 444517 330141 195964
17424 195964 192623 198695 240530 401657 495103 543892 561048 598433 549456 483210 364299
17413 364299 382412 357866 330881 451524 440297 347287 258341 346952 395254 484122 488334
17402 488334 371992 355074 174590 190598 270086 263118 126541 50175 -30690 -19761 56682
17391 56682 -16583 -1306 79092 36270 -82081 -63164 -93712 -92884 -130565 -88724 31878 76639
17379 76639 188376 200454 170595 225038 276998 115826 109017 258649 284952 353799 347787
17368C47787K6514L3804j7855j45730o2908l884q1524q2477J1573J5768j22409
17357h1341l2834K0336k4743O3241N7330K94P7827M3426R7422L2641K049j00494
17345A55154r3162j913K4925N6021p6574K690n2673p3154m8573q030N7794J44521
17333H7026N5254l6474N3796p031j28786J4687r815J10731Q8161o2918L2996L8259
17321B35886o4731j05680p8411n2840j68783J12110K28421k4879J44017k0723
17311B04387p0873q7274P5559L4571q4339j06070J17997M267o9169j17635Q0845
17300a7734J43008O7707L824N4295O9733L0809m5369j21655O3190m1652l9702
17289A66454o565J471q4727l6774J0054j8895O296P4550Q6490Q1290j1738r8648
$$ plain form
17368 347787 374301 408105 390250 244520 181612 177728 96204 13727 25300 41068 -81341
17357 -81341 -114175 -93839 -118582 -55341 1989 2283 80110 123536 220958 253599 255648 155154
17345 155154 61992 60079 85004 141025 64451 67141 14468 -58686 -107259 -115289 -57495 87026
17333 87026 142280 105806 159602 152571 23785 38472 28657 139388 227549 164631 197627 235886
17321 235886 171155 65475 -12936 -65776 -234559 -122449 105972 81093 225110 204387
17311 204387 133514 46240 121799 156370 72031 -34039 83958 88225 19056 -98579 -17734
17300 -17734 125274 192981 196805 251100 320833 351642 306273 184618 247808 206156 166454
17289 166454 159889 161360 76633 39859 49913 31018 37314 111864 198354 279644 267906 169258
17277A69258R4199m2317p4719p251m4247m0963N0817N9517k3010r7112j72404
17266a28232l3242J00609O5641l4542l7772P694M3277L4579O2978p7936r739J45043
17254A38358M0065q8891P3089J09933n7702L717j21354k7689N772j5178k2539
17243C7581j5776M1788j7439n6831m1367P0405N850P8525J18017O2559j8358k3780
17231B41174j04401R648q301L4630j3311m099J14342m268p3508m5804L2997m8324
17219A30775o1644p9082n8892J90734K0209l7614J4585k7145l8897j09794L4494
17208b2271J04516n6135j51593m8797P0345O9119J56286M4352j36661q305J60105
17197A80961O6004P8099p774j57570o3026L1447k5392L7836J10956O4379n3006
$$ plain form
17277 169258 263457 221140 146421 139170 94923 53960 104777 164294 141284 44172 -128232
17266 -128232 -161474 -60865 4776 -29766 -67538 -59844 -16567 18012 80990 3054 -6685 138358
17254 138358 178423 89532 162621 272554 214852 218569 97215 69526 75298 60120 37581
17243 37581 21805 63593 46154 -10677 -52044 18361 24211 102736 220753 283312 264954 241174
17231 241174 136773 146421 138120 172750 159439 155340 269682 265414 191906 146102 179099 130775
17219 130775 69131 -9951 -68843 121891 142100 104486 119071 91926 53029 -56765 -22271
17208 -22271 82245 26110 -125483 -174280 -103935 -34816 121470 165822 29161 20856 180961
17197 180961 246965 325064 317290 159720 96694 128141 102749 140585 251541 315920 262914
17186B62914n1185J5831j07298j16835m4427J21168J09257J19714J7320J3884
17176C40343n7527j09222M5841l9473k430P5339R3124j85234o7493N2025L3857
17165A79150r4043j36873M4963J58215J8455K7206M38M7194M32J0132J11899J7167
17153C84335Q9711k3267J14279O5724n2620o1394j6942N6931L0458J92069P7761
17142H57045n7920P2350K10124j5880J03921N0010k8786j5147J78216K7486O630
17131A388049O1006L9460L5701q0784Q7172J12843J35970K21919K19594L14526
17121B535456K68010K52907L40506O04014O84261P44187P78461Q49653Q95456
17112G952911J046449J411959J590850J917896K302675K764201L674950N784361
$$ plain form
17186 262914 211729 227560 120262 3427 -41000 80168 189425 309139 326459 340343
17176 340343 282816 173594 219435 179962 177532 252871 345995 160761 93268 145293 179150
17165 179150 85107 -51766 -6803 151412 169867 197073 197511 244705 245137 255269 367168 384335
17153 384335 474046 450779 565058 630782 578162 516768 499826 556757 587215 779284 857045
17142 857045 799125 871475 1081599 1065719 1169640 1219650 1190864 1175717 1353933 1381419 1388049
17131 1388049 1449055 1488515 1524216 1443432 1530604 1643447 1779417 2001336 2220930 2535456
17121 2535456 2803466 3056373 3396879 4000893 4685154 5429341 6207802 7057455 7952911
17112 7952911 8999360 10411319 12002169 13920065 16222740 18986941 22661891 28446252
17104B8446252R607499J5751819K5113792L5477034M0137920L5616550K5349898
17097B15500764J6789771J8246190L2267618M3973377L6849867J0810110k0991270
17090C53446427m2332983m0590912k4198458j3702493j7408357k8789672l8988343
17083A47435209l9819001l1092984k0585258j2828467q188441n426432l926742
17076B5567884l145443k508351k240201k040338j747411j264394j063334j000749
17068A0557663j073797j055355q42471o44442o34243m59080l95248m10813k71227
17059D770987k15423k83555k74421k38009k25227j78216k36650k09148k35106
17050B675232j35813j14218j80491q0115K366n0978q2264M132n1828j01015j28600
$$ plain form
17104 28446252 38053751 53805570 78919362 114396396 154534316 190150866 215500764
17097 215500764 232290535 250536725 282804343 326777720 363627587 374437697 353446427
17090 353446427 311113444 270522532 246324074 232621581 215213224 186423552 147435209
17083 147435209 107616208 76523224 55937966 43109499 34921058 29494626 25567884
17076 25567884 22422441 19914090 17673889 15633551 13886140 12621746 11558412 10557663
17068 10557663 9483866 8428511 7586040 6941598 6307355 5848275 5453027 5042214 4770987
17059 4770987 4555564 4272009 3997588 3759579 3534352 3356136 3119486 2910338 2675232
17050 2675232 2539419 2425201 2244710 2164595 2166961 2115983 2033719 2037851 1986023 1885008 1756408
17039A756408k03058p6863Q4084N8418l5918j14535q2836l3176j55171k26503
17029I70850r1801M105l2513J22297k3874l459K7855j2330J9799R972K6827j10502
17017I07226r8890l7152l9600L2987K627k2009j1717q3809l6393j00573r8252
17006D14445j0045J9966J51145o6041j37833R1462Q7698N2786j45269n0884N8408
16995D65838n2593j37653m2603O4239M2263J19198j15628j15379j14941J22049
16985B34790P3146n4800N0774m4282L6j9705r1679J08993j5719m3653M5728J23875
16973C67504K4718p7522q8718k2795n4810M4078O4885N2810l3706M9565N093L071
16961C34173j16747M6241M8007k5279m3584j51585m0730q056K6048M3443m5997
$$ plain form
17039 1756408 1553350 1476487 1560571 1618989 1583071 1468536 1385700 1352524 1197353 970850
17029 970850 879049 883154 850641 972938 949064 945605 973460 961130 980929 990901 1017728 907226
17017 907226 808336 771184 731584 764571 767198 745189 733472 649663 613270 512697 414445
17006 414445 404400 424366 575511 509470 371637 463099 550797 603583 458314 407430 465838
16995 465838 413245 275592 232989 297228 339491 458689 343061 227682 112741 234790
16985 234790 307936 253136 303910 259628 259664 239959 148280 257273 241554 197901 243629 367504
16973 367504 392222 314700 225982 203187 148377 192455 257340 310150 276444 326009 331102 334173
16961 334173 217426 263667 311674 286395 242811 91226 50496 42440 68488 111931 65934
16950F5934l6812q4420O507o0367k9484R0016l0779R8160K0231k829R5562k9892
16938A01827m6183j4520l6916q8595J2280M0430n420L9087P6821l7022J9510L5497
16926I6796n21k5959r0786m8569M6755K0447J02494k8010l4602L5902M7374P2926
16914A94247R5665j9979j62820p4418J42511J65303R276j14521j20516k0976L83
16903I4155K7004L2621p7063o2713J2037m65n3513L9758M2096N7575n5753J3506
16891F9245J55369K6614j92866j38187J351J06914J04196n3773j4249J27172K6625
16880B18411o1329o2585k1807M3123M4168q6129o6053L592j25077j6653j4639
16869a44978J06760J25683j12447m4881K8618K9209Q8296Q6014L5289r2312j7561
$$ plain form
16950 65934 29122 -55298 -48791 -109158 -138642 -48626 -79405 18755 38986 36157 131719 101827
16938 101827 55644 41124 4208 -84387 -72107 -31677 -37097 1990 78811 41789 61299 96796
16926 96796 96275 70316 -20470 -69039 -22284 -1837 100657 72647 38045 73947 121321 194247
16914 194247 289912 269933 107113 32695 175206 340509 349785 235264 114748 93772 94155
16903 94155 121159 153780 76717 14004 26041 25576 -27937 11821 53917 111492 55739 69245
16891 69245 224614 251228 58362 -79825 -78474 28440 132636 78863 64614 191786 218411
16880 218411 157082 94497 72690 115813 159981 73852 7799 11391 -113686 -130339 -144978
16869 -144978 -38218 87465 -24982 -69863 -41245 -12036 76260 162274 197563 105251 87690
16858H7690j8962l0535k1931j7479l8389P9242O0986p8004J4104M7270n064j05730
16846b6802o2662J2002P7739R4125O4318j6210l1749j02671J2918M5309j26820
16835f0503m6154J15472R5325K0100J1693j45287j489j2238p9460k61N8244Q6187
16823D1629M3149O9324j32287o8062J524J07702N3447L4403k0200m1328Q8339
16812A77640K2051M3154r6138l3929j85279m4476N1655O3858J75440J08410J6843
16801B99229j54799r7712r2553J6124M0685J31000k0501p069M8755o7963j43286
16790d8090j0234l2575Q2066J29408k1227J23656P190q5552o30j16819m1814J5079
16778D58L7481p528k1881J60416J42303j23963k15844O2179K7939K0932M668l5425
$$ plain form
16858 87690 68728 38193 16262 -1217 -39606 39636 100622 22618 36722 83992 78928 -26802
16846 -26802 -89464 -77462 277 94402 158720 142510 110761 8090 21008 66317 -60503
16835 -60503 -106657 8815 104140 124240 135933 -9354 -10843 -23081 -102541 -102802 -44558 41629
16823 41629 84778 154102 21815 -46247 -44723 62979 116426 150829 130629 89301 177640
16812 177640 199691 242845 146707 112778 -72501 -116977 -65322 -1464 173976 282386 299229
16801 299229 144430 46718 -45835 -29711 10974 141974 121473 114404 163159 95196 -48090
16790 -48090 -58324 -90899 -8833 120575 99348 223004 230194 144642 144012 27193 -14621 458
16778 458 37939 30411 8530 168946 311249 187286 -28558 33621 61560 82492 87160 51735
16766E1735J07253J10928k2193o1067l3628l713K4619q9294J0244q7424o7452
16755e9992R9009J1051r7708L597O1092P524n2321R8169n5314P7941Q3911j60881
16743A6078p139q728r9475J65606J16185K1866j02387N3442Q9904n2745j79939
16732A2668m6060O6743R8756J32448l5879j70770j19861m180R3514L6608J17497
16721A81484m0086j73451j40987M0313O660j9974R0147J37054N2457k5866k7485
16710H0266M3747m1733L961m8603K8972N2677m0258R4353J9219m0074l3536j35760
16698a6769j70462M5445Q7480j355J7919N2436N6156k814O38P4980j6603j73781
16686d6730M1724n156n8451q7943J61609J69588J41944n405j94490j05846M8530
$$ plain form
16766 51735 158988 269916 247723 186656 153028 149315 173934 84640 94884 7460 -59992
16755 -59992 39017 50068 -47640 -44043 17049 24573 -27748 70421 15107 93048 176959 16078
16743 16078 8939 211 -99264 66342 182527 204393 102006 155448 245352 192607 12668
16732 12668 -33392 33351 132107 264555 228676 57906 -61955 -66135 27379 63987 181484
16721 181484 141398 -32053 -173040 -132727 -126067 -146041 -55894 81160 133617 107751 80266
16710 80266 124013 82280 86241 37638 66610 119287 79029 173382 192601 152527 118991 -16769
16698 -16769 -187231 -141786 -54306 -55661 -37742 14694 70850 68036 68674 143654 127051 -46730
16686 -46730 -5006 -10162 -68613 -156556 5053 174641 316585 311180 116690 10844 59374
16675E9374L380j8584J6491p2968L1963J38823L7343r0840M5412Q494J6769n769
16663A69888j41570j09233Q9753J39283m013m7131p2138M462O1518n788j30873
16652d5842K2839K2854K0230J36693N0424Q5811q8835r7730K564K3920O2452J04308
16640B99688k392k8985l3217n6020j7631J67406J34027o9940r2942j26227p7612
16629I6155m175l0318K2601O1417p65o4641j06695k7934l8948J67393R2645j5199
16617A51536L0008O8018P5554j6659p1797O3515k7577r7918k3738m2992J8369
16606A26319o1628o172k9354J96759N1118j23830j9012J75607K2667l0456k4267
16595B77751n0153J35866J63657O7327K02532J31072J98926J30087K6997K44952
$$ plain form
16675 59374 62754 44170 60661 -12307 19656 158479 195822 104982 150394 158888 175657 169888
16663 169888 28318 -80915 8838 148121 144108 96977 24839 29301 90819 85031 -45842
16652 -45842 -23003 -149 20081 156774 207198 293009 204174 106444 109008 132928 195380 299688
16640 299688 297296 268311 235094 179074 161443 328849 462876 392936 299994 173767 96155
16629 96155 91980 61662 84263 145680 144915 80274 -26421 -54355 -93303 74090 166735 151536
16617 151536 181544 249562 325116 308457 236660 300175 272598 174680 150942 107950 126319
16606 126319 64691 58519 29165 225924 277042 153212 134200 309807 332474 302018 277751
16595 277751 227598 363464 527121 594448 796980 928052 1126978 1257065 1284062 1529014
16585A529014K72170J82115l895q4161j75638j47469j42577q0226r1746j06829
16575A150758j62890k29589k31705n9570l1448j01197j00456o5065Q4147R8774
16565C51759M0138L4223m7640J4113P1638j10263j11642p1244n0920L3748J02651
16554B56561j08779k08633q205J04233J33346m959m1612q0742N080Q7052O1346
16543A94688n9697o8999J00678J82418r3080j09707K2190p9527P5494J1438l5522
16532A40374J5168k1204m3647m6093O9445J15563N7786O8J82263Q2749o9595j46021
16520C36856j27395j0369M9476P3674p2388N487L1149r8638m057J31770j9781
16509B95784L6242Q9606j93481j07328N766Q8214p5966j13411j49466J8461J23233
$$ plain form
16585 1529014 1801184 1983299 1979404 1895243 1719605 1572136 1429559 1349333 1257587 1150758
16575 1150758 987868 758279 526574 467004 435556 334359 233903 168838 252985 351759
16565 351759 391897 426120 378480 392593 464231 353968 242326 171082 120162 153910 256561
16554 256561 147782 -60851 -69056 35177 168523 163564 121952 41210 46290 133342 194688
16543 194688 134991 65992 166670 349088 256008 146301 168491 88964 164458 175896 140374
16532 140374 155542 134338 90691 44598 114043 229606 287392 287460 469723 552472 482877 336856
16520 336856 209461 199092 248568 322242 249854 255341 286490 187852 183795 315565 295784
16509 295784 332026 421632 228151 120823 126589 214803 138837 25426 -124040 -105579 17654
16498A7654J61616l183k20290L8228J14407m4063O1418L4973o4224J02538J71293
16487C70367l8513p6124p3118L1953r4439p5818q104J32879K4986o882j02466
16476H4721J3138O7167P3862j00503q7309P542J17390P8041l638N9685L1797J2332
16464C54225j2510O291m4240M174o4663p4255L7368o8867J9412m8358N6596M3422
16452B08595O1610J8598M2044r4171o5040J10191R9550O6595R8904J67889o0131
16441F54634r7619j51044j1988M9492R3758J45494o821K6107J56537Q171K7284
16430H94005J04120R153k5481k8049R2558L3789j57270j89519o1365R8604j79808
16419E90737j27795l0427K4643l2248O8972O4885q1598L1673q0382r4086n8269
$$ plain form
16498 17654 179270 176087 -44203 -5975 108432 64369 125787 160760 96536 199074 370367
16487 370367 331854 255730 182612 214565 120126 44308 36204 169083 194069 187187 84721
16476 84721 97859 165026 238888 138385 51076 58618 176008 254049 250411 310096 341893 354225
16464 354225 341715 348006 303766 307940 243277 169022 206390 137523 156935 108577 165173 208595
16452 208595 270205 288803 330847 236676 171636 281827 381377 447972 546876 714765 654634
16441 654634 557015 405971 393983 443475 537233 682727 675906 702013 858550 866721 894005
16430 894005 998125 1007278 981797 953748 1046306 1080095 922825 733306 671941 770545 590737
16419 590737 462942 432515 457158 424910 493882 558767 477169 508842 428460 334374 276105
16408B76105P7699R0054p4018l3246R1773o0517j43470K0893Q0946k5010R863
16397C11072P1000j22839O6332l72j726Q1256K7050o9971L0468J03345m7414q5454
16385C62747j2257M6202m0981j5848j08933R4037K31757P8859r8175q626J4430
16374E43212j33102q8835m9411K8004J02213K0157J10873K4358P7902J08660l0248
16363G13783r5343r6408k158l2844j49673l463O2131M8842J12837K0123o3752
16352E14075k1433r4124j6340J56450N4770m31O3421n2752n6857o3876P1304J54075
16340G08282O2455m1438J20239l4936j20399m2775l1380n4215n0661O8203J21581
16329G04956N8994j06844J0697n8623O0965J5861N5642L6727j50776k9337P4206
$$ plain form
16408 276105 353804 443858 369840 336594 428367 367850 224380 245273 326219 301209 311072
16397 311072 382072 259233 325565 325193 323467 404723 431773 361802 392270 495615 448201 362747
16385 362747 350490 396692 355711 339863 230930 324967 556724 635583 537408 528782 543212
16374 543212 410110 321275 271864 299868 402081 422238 533111 557469 635371 744031 713783
16363 713783 618440 522032 519874 487030 337357 333894 396025 444867 557704 577827 514075
16352 514075 492642 398518 382178 538628 593398 592967 656388 603636 546779 482903 554207 708282
16340 708282 770737 729299 849538 814602 694203 651428 620048 565833 515172 583375 704956
16329 704956 763950 657106 667803 609180 670145 686006 741648 778375 627599 598262 672468
16318F72468n4590q4595o4600R5177L6241P094J22213K54908k6482j08878M6103
16307H95059O4466P3857j22805j22320K6315k9825l3771k170m3892j07329j6779
16296E80806M104N8758M0690m7454M1449K25231J14183r2990M501j25421J3536
16285H17393P8330k9296l3534Q0203o1991q9422J2949M9148P9010K18514L4645
16274A155949l3893r5358P0852P5186Q9440O3636j51987l9742L7590j40350j32021
16263H99302J05867J87713o8330q5871n75J9728l8101J27104Q3886J0157Q1936
16252A322816M6601M9415J50345R5446q0841m5182k9813j27985O7644O1371O3042
16241A572859Q8412m795j16853p2184l102K8210n690J7248L7533J40933j1569
$$ plain form
16318 672468 617878 533283 468683 563860 600101 607195 729408 984316 957834 848956 895059
16307 895059 959525 1033382 910577 788257 814572 784747 750976 748806 704914 597585 580806
16296 580806 584910 643668 684358 636904 678353 903584 1017767 924777 929278 803857 817393
16285 817393 895723 866427 832893 913096 851105 761683 774632 823780 902790 1121304 1155949
16274 1155949 1122056 1026698 1097550 1172736 1262176 1325812 1173825 1134083 1171673 1031323 899302
16263 899302 1005169 1192882 1124552 1038681 1038106 1057834 1019733 1146837 1230723 1240880 1322816
16252 1322816 1369417 1418832 1569177 1664623 1583782 1538600 1508787 1380802 1448446 1509817 1572859
16241 1572859 1661271 1656476 1539623 1467439 1464337 1492547 1486857 1504105 1541638 1682571 1671002
16230A671002k7772j82645m6779J0031Q5019M2338o7261k8406j8011J06161R8061
16219A641738Q508J23128Q1240q5042r3012J68704K0817J9660J14855L3729r7143
16208A937182n0137q741p6060n8180Q6282J27757j6661q0123N0581P0568J49736
16197B132204L5443m9194k728n8953l8681M7414O8313P4448r413k1429l0936J6799
16185B163287M0324j0684q483k6023O4628P4693N2810J32835R9266J04802L1502
16174B718957j65708M9723k6137Q0656R1704R3328K1377m5052J33237j0255k1230
16163B920600J49840J0370k0639J1308M2014N5992J04110P7528R7233N4394L5434
16152C538184m2318J58846O8907N2888k6143l540N7154j2605P740J71204J90651
$$ plain form
16230 1671002 1643230 1460585 1413806 1423837 1508856 1551194 1483933 1455527 1437516 1543677 1641738
16219 1641738 1650246 1773374 1854614 1769572 1676560 1845264 1866081 1885741 2000596 2034325 1937182
16208 1937182 1887045 1878304 1802244 1744064 1830346 1958103 1941442 1861319 1911900 1982468 2132204
16197 2132204 2167647 2118453 2115725 2056772 2018091 2065505 2133818 2208266 2198853 2177424 2146488 2163287
16185 2163287 2203611 2192927 2184444 2158421 2223049 2297742 2350552 2483387 2582653 2687455 2718957
16174 2718957 2553249 2602972 2576835 2657491 2749195 2842523 2863900 2818848 2952085 2941830 2920600
16163 2920600 3070440 3080810 3060171 3071479 3113493 3169485 3273595 3351123 3448356 3502750 3538184
16152 3538184 3495866 3654712 3723619 3776507 3750364 3746824 3803978 3791373 3799113 3970317 4160968
16141D160968J38959P5440M531M5665N4271Q9348J30303K06573J16714L4772P6311
16130E133855L9971P8883O7687R0754j6244m5551N2534J84034Q0098J48705K58630
16119F073356J32890p283o8222M8429J69256k2421M2370J51197K02129K48694
16109F970395P5469O8452K29004J94512J32297J86180J54804J77298J63587J34812
16099H486810J66047J77006K24266J49753J77529J77806K74831K76538J47741
16090A0258327J80989K36341L89078L51478J31881J18942K50600K76260M35784
16081A2629680M32287K67048K96101K43434L99978N53917L67194L70551M34229
16072A5994419M35822L85638M55511M96813M63318O02543O94898M78277M23131
$$ plain form
16141 4160968 4299927 4375367 4379898 4425563 4479834 4569182 4699485 4906058 5022772 5057544 5133855
16130 5133855 5173826 5252709 5320396 5411150 5394906 5349355 5401889 5585923 5666021 5814726 6073356
16119 6073356 6206246 6198963 6130741 6179170 6348426 6326005 6368375 6519572 6721701 6970395
16109 6970395 7045864 7114316 7343320 7537832 7670129 7856309 8011113 8188411 8351998 8486810
16099 8486810 8652857 8829863 9054129 9203882 9381411 9559217 9834048 10110586 10258327
16090 10258327 10439316 10675657 11064735 11416213 11548094 11667036 11917636 12193896 12629680
16081 12629680 13061967 13329015 13625116 13868550 14268528 14822445 15189639 15560190 15994419
16072 15994419 16430241 16815879 17271390 17768203 18231521 18834064 19528962 20007239 20430370
16063B0430370O37448P67004O90185O81608P10342Q58903Q98405P82765P26896
16054B7183926Q34041J046435R60003J126733J156612J148073J076969J256483
16046C5789275J414557J522267J463850J528055J632087J716140J647233J788706
16038D8502170J985312K209016K266878K283968K492180K613563K563687K761764
16030F7678538L048401L218241L160969L208573L408308L687252L827893L733048
16022I4971223L845979L952248M086325M109579M020460L942991L973717L904035
16014A26806557L757046L548611L342929L076168K678430K311096J864833J398148
16006A48783818Q61896L57621p8955o61350j328448j731165j952231k362145k770654
$$ plain form
16063 20430370 21067818 21834822 22525007 23206615 23916957 24775860 25674265 26457030 27183926
16054 27183926 28017967 29064402 30024405 31151138 32307750 33455823 34532792 35789275
16046 35789275 37203832 38726099 40189949 41718004 43350091 45066231 46713464 48502170
16038 48502170 50487482 52696498 54963376 57247344 59739524 62353087 64916774 67678538
16030 67678538 70726939 73945180 77106149 80314722 83723030 87410282 91238175 94971223
16022 94971223 98817202 102769450 106855775 110965354 114985814 118928805 122902522 126806557
16014 126806557 130563603 134112214 137455143 140531311 143209741 145520837 147385670 148783818
16006 148783818 149645714 150003335 149924380 149263030 147934582 146203417 144251186 141889041 139118387
15997A39118387l075425l198746l516955l719332l843348l721225l877444m013091
15989A10152821m057448m005069l890372l699946l543345l519072l446321l357825
15981H0633423l144590l129817k966946k691792k673162k451754k498863k476439
15973E8600060k227578k063642k017111j904546j857750j922505j801313j622959
15965D3182656j386974j348432j419074j475814j347900j100119j104648j049022
15957C2950673j017317j073825j020394q87780q73918q64916p85216p55230p82289
15948B4889788p48189o85008o60146o68058o32393o91860o33872n53292m47976
15939A9168994m73227n41684m64915k99638l83173m90949m44639o18448m32937
$$ plain form
15997 139118387 136042962 132844216 129327261 125607929 121764581 118043356 114165912 110152821
15989 110152821 106095373 102090304 98199932 94499986 90956641 87437569 83991248 80633423
15981 80633423 77488833 74359016 71392070 68700278 66027116 63575362 61076499 58600060
15973 58600060 56372482 54308840 52291729 50387183 48529433 46606928 44805615 43182656
15965 43182656 41795682 40447250 39028176 37552362 36204462 35104343 33999695 32950673
15957 32950673 31933356 30859531 29839137 28951357 28077439 27212523 26427307 25672077 24889788
15948 24889788 24141599 23456591 22796445 22128387 21495994 20804134 20170262 19616970 19168994
15939 19168994 18695767 18154083 17689168 17389530 17006357 16515408 16070769 15452321 15019384
15930A5019384k77733k11525k83857k61158k27918l89647l46232m11487k84584
15921A2325243k35951k22573p7292k52749l00106l09470k23829k50255j97322
15912A0255696j70423j96338k19302j75371j77253q6439j90361j52524k36425
15903H651260p5643j84667l45281j60573j24796j55404o4811j32153j58864j14351
15893G134717k1847j7407j71895k28269j59774j184j44689Rr4072j24324j98329
15882E972936k4733j31430q5592l8815q8002q0287j66618p9875l4110K2872J6646
15871E282992l3571o0092j94728l58154j14612P8747m4083j60166q6456l1127
15861D278750j44187p0216L5049r841j04129l8165r3324j11669q4964m4049P2157
$$ plain form
15930 15019384 14741651 14530126 14246269 13985111 13757193 13367546 13021314 12609827 12325243
15921 12325243 12089292 11866719 11789427 11536678 11236572 10927102 10703273 10453018 10255696
15912 10255696 10085273 9888935 9669633 9494262 9317009 9230570 9040209 8887685 8651260
15903 8651260 8575617 8390950 8045669 7885096 7760300 7604896 7540085 7407932 7249068 7134717
15893 7134717 7112870 7095463 6923568 6695299 6535525 6534341 6389652 6389661 6295589 6171265 5972936
15882 5972936 5948203 5816773 5731181 5692366 5604364 5524077 5357459 5277584 5243474 5266346 5282992
15871 5282992 5249421 5189329 4994601 4636447 4521835 4600582 4556499 4396333 4309877 4278750
15861 4278750 4134563 4064347 4099396 4089555 3985426 3947261 3853937 3742268 3657304 3613255 3685412
15850C685412N7281j09499j98717o0162m6494p2051m2808M7828l6081m9810m5473
15839C129426P6478M6805j54097k0998k8332J8692L3759J55992O2087j66663j38148
15828C015001p7403l4507j9008P6387j14227j58347L0052o1343J3008J5485p2199
15817B612899l0252n094L1037o0854n7937L296m5933q4742J1929K3927r3750o4141
15805B240385j864q297J32024J129j9439n7645k94360j02819P4385K5037n0431
15794A938105J3507l1408r5145l6220p09O0243k3021q7747N7333Q1047j63845
15783A712140L5895P0453k6475M9007R4893j5522n0133p5840r5561m4670p68j87
15771A653232o0126j02871r7167M4969J06548J6691p6100K4279j08506k4387O5350
$$ plain form
15850 3685412 3742693 3633194 3434477 3374315 3327821 3255770 3212962 3260790 3224709 3174899 3129426
15839 3129426 3205904 3252709 3098612 3077614 3049282 3067974 3101733 3257725 3319812 3153149 3015001
15828 3015001 2937598 2903091 2884083 2960470 2846243 2687896 2717948 2656605 2669613 2685098 2612899
15817 2612899 2582647 2577553 2608590 2547736 2489799 2493095 2447162 2362420 2374349 2398276 2304526 2240385
15805 2240385 2238521 2230224 2362248 2363377 2343938 2286293 1991933 1889114 1963499 1988536 1938105
15794 1938105 1951612 1920204 1825059 1788839 1788130 1848373 1825352 1737605 1794938 1875985 1712140
15783 1712140 1748035 1818488 1792013 1841020 1935913 1920391 1870258 1794418 1698857 1654187 1653419 1653232
15771 1653232 1593106 1490235 1393068 1438037 1544585 1561276 1485176 1509455 1400949 1376562 1441912
15760A441912j4924j49379k6073j0627L5027k7320k5041K1976P3816O3608n7528
15749A325447j33496o3834M4225L119p8587M8299M0720k1172l4680j0702M3792
15738A163131M0390l4918q7483O0290J28160j47156K0352M0284k263m8254m0446
15727A092087o366Q5142l4153j99376O6014J20640J7009P5364j8835P8614q0222
15716A195918m6211L7317j60712j1279J2652pJ2332K8490L804r6726l0606L5377
15704I80349K994o8442n7008L2860j7517J21618O2494r3385r3594K1496M6430
15693I38295n4522O8947J27654p7114n9276j88544j53335M791J08377O7814j41250
15682F41837n6364P1069N4279r007M2232N3123R1561j14086m1171j9720J0904
$$ plain form
15760 1441912 1426988 1277609 1251536 1240909 1275936 1248616 1223575 1245551 1319367 1382975 1325447
15749 1325447 1191951 1128117 1172342 1175461 1096874 1145173 1185893 1164721 1130041 1119339 1163131
15738 1163131 1203521 1168603 1081120 1141410 1269570 1122414 1142766 1183050 1180787 1132533 1092087
15727 1092087 1085721 1170863 1136710 937334 1003348 1123988 1140997 1216361 1197526 1276140 1195918
15716 1195918 1149707 1187024 1026312 1015033 1027685 1027678 1040010 1068500 1072304 975578 944972 980349
15704 980349 983343 914901 857893 890753 873236 994854 1057348 963963 870369 891865 938295
15693 938295 883773 952720 1080374 1003260 943984 755440 602105 606896 715273 783087 641837
15682 641837 585473 656542 710821 701814 744046 797169 888730 774644 733473 713753 724657
15671G24657J34696P183k10824o0631p148K1661M5411L5266J52443r5999q9999
15660F56716k7338L3430k9264k8340R7964O2400l8372Q7949l4367j21322m7243
15649F12213N2157K9462m7249J36393p530k7915n7876j29390L7149J90M1817l434
15637F35987K6158M0897j10283M1985Q2327j9312j64641j95097K5101J50910P9213
15626E93245m2664L4402m3991m3945q7110j36953O9232J38757J20960l9544L2441
15615E94830o3156q6472O9516K9981N8289K8796M610j70147m6780M8644M7010
15604E15121O178k5789p5655p2288j9417Q9648Q1357L4323k7615r8467P6137L2113
15592E15646l1431n7499P6669J4351n6723j7539L2943N4914j6378j2412m7502
$$ plain form
15671 724657 859353 866536 655712 595081 587933 609594 655005 690271 842714 746715 656716
15660 656716 629378 662808 633544 605204 703168 765568 727196 815145 780778 659456 612213
15649 612213 664370 693832 646583 782976 775446 747531 689655 560265 597414 597604 639421 635987
15637 635987 662145 703042 592759 634744 717071 697759 533118 338021 363122 514032 593245
15626 593245 550581 584983 540992 497047 409937 272984 342216 480973 601933 562389 594830
15615 594830 531674 445202 514718 544699 602988 631784 636394 466247 419467 468111 515121
15604 515121 521299 495510 419855 347567 328150 417798 499155 533478 505863 407396 483533 515646
15592 515646 484215 426716 503385 517736 461013 443474 476417 531331 514953 502541 455039
15581D55039q6394L2828k4489n4756N174J9546O4811J1078r5041K3780K5850P7133
15569D54559o7110k5571K84P8685J27866k0069j48849l5672N7958K9209q8891
15558C62399Q8850j7689p6773m751J32282K8135k5171o8007o408L2214r96j56559
15546B87526N2952K3878j8111M9165K7433N507l124j1708q0438L260n148m814
15534C26378m4626j08198k6149M3072J71465J8893p9070J36031p5492j85414n699
15523A71191n2500m8468J42117R8259j6132m0041N5629j5123J6177Q3170M5231
15512D39510j25500j76407k1787Q9062O2666j9281J52819M4525j18522J1752j1726
15501C27111j125j06100j50604l0911J11010O0372J06439O5741J15998N8641j1704
$$ plain form
15581 455039 368645 401473 376984 322228 327402 346948 411759 422837 327796 351576 377426 454559
15569 454559 387449 361878 362162 440847 568713 548644 399795 364123 422081 451290 362399
15558 362399 451249 433560 356787 352036 484318 512453 487282 419275 412867 445081 444085 287526
15546 287526 340478 364356 346245 395410 422843 428350 425226 413518 333080 336340 331192 326378
15534 326378 281752 173554 147405 190477 361942 380835 301765 437796 362304 176890 171191
15523 171191 118691 70223 212340 310599 294467 254426 310055 294932 311109 394279 439510
15512 439510 314010 137603 115816 204878 267544 248263 401082 445607 327085 338837 327111
15501 327111 325986 219886 69282 38371 149381 209753 316192 381933 497931 556572 544868
15490E44868j58397j85631Q9872m2254J10500O6190n1481n0243O74M4534L011
$$ plain form
15490 544868 386471 200840 290712 248458 358958 425148 373667 323424 324098 368632 371643
$$ [...]
##END NTUPLES=NMR SPECTRUM
##END=
