##TITLE=XTC-1731o_2
##JCAMPDX= 6.0         $$ Bruker NMR JCAMP-DX V2.0
##DATA TYPE= NMR SPECTRUM
##DATA CLASS= NTUPLES
##ORIGIN= BRUKER
##OWNER= patiny
$$ 1.79 TOPSPIN		Version 3.0
$$ 2012-05-21 00:14:27.385 +0200  patiny@icmbsg005
$$ Compression mode = diff/dup
##.OBSERVE FREQUENCY= 400.13188181139
##.OBSERVE NUCLEUS= ^1H
##.ACQUISITION MODE= SIMULTANEOUS (DQD)
##.ACQUISITION SCHEME= undefined
##.AVERAGES= 16
##.DIGITISER RES= 23
##SPECTROMETER/DATA SYSTEM= spect
##.PULSE SEQUENCE= zg30
##.SOLVENT NAME= D2O
##.SHIFT REFERENCE= INTERNAL, D2O, 1, 11.697
##AUDIT TRAIL= $$ (NUMBER, WHEN, WHO, WHERE, PROCESS, VERSION, WHAT)
$$ ##TITLE= Audit trail, TOPSPIN		Version 3.0
$$ ##JCAMPDX= 5.01
$$ ##ORIGIN= Bruker BioSpin GmbH
$$ ##OWNER= patiny
$$ $$ /opt/data/patiny/nmr/XTC-1731o_2/10/pdata/1/auditp.txt
$$ ##AUDIT TRAIL=  $$ (NUMBER, WHEN, WHO, WHERE, PROCESS, VERSION, WHAT)
(   1,<2012-05-21 00:14:25.549 +0200>,<patiny>,<icmbsg005>,<go>,<TOPSPIN 3.0>,
      <created by zg
	started at 2012-05-21 00:12:20.698 +0200,
	POWCHK enabled, PULCHK disabled,
       configuration hash MD5:
       77 C7 B7 C4 10 F4 BA 30 64 2E BB 52 82 F2 DA 41
       data hash MD5: 64K
       6E 28 3E 10 76 2D F7 42 DA EE 77 41 C1 8F 21 E1>)
(   2,<2012-05-21 00:14:26.137 +0200>,<patiny>,<icmbsg005>,<audit>,<TOPSPIN 3.0>,
      <user comment:
       ICON-NMR User ID: patiny
       data hash MD5: 64K
       6E 28 3E 10 76 2D F7 42 DA EE 77 41 C1 8F 21 E1>)
(   3,<2012-05-21 00:14:26.677 +0200>,<patiny>,<icmbsg005>,<proc1d>,<TOPSPIN 3.0>,
      <Start of raw data processing
       ef LB = 0.3 FT_mod = 6 PKNL = 1 SI = 64K 
       data hash MD5: 64K
       83 75 CB 4C 0D 8B D1 E7 19 73 CB 20 AE F2 BF 96>)
(   4,<2012-05-21 00:14:27.040 +0200>,<patiny>,<icmbsg005>,<proc1d>,<TOPSPIN 3.0>,
      <apk 
       data hash MD5: 64K
       05 55 D1 92 24 35 2B D5 7A 8B 7D C6 E4 FD 0A C1>)
(   5,<2012-05-21 00:14:27.071 +0200>,<patiny>,<icmbsg005>,<proc1d>,<TOPSPIN 3.0>,
      <abs ABSG = 5 
       data hash MD5: 64K
       51 88 0B 31 7A B5 B8 97 67 A6 9A AD AB E6 6B B4>)
$$ ##END=
$$ 
$$ $$ hash MD5
$$ $$ 8B 5D 4E 0F 3C 89 E5 E2 1A 9C E8 0A CC 6A 66 70
##$RELAX= 
##$RELAX= 
##$RELAX= 
##$RELAX= 
##$RELAX= 
##$RELAX= 
##$RELAX= 
##$RELAX= 
##$RELAX= 
##$RELAX= 
##$RELAX= 
##$RELAX= 
##$RELAX= 
$$ Bruker specific parameters
$$ --------------------------
##$DATPATH= </opt/data/patiny/nmr>
##$EXPNO= 10
##$NAME= <XTC-1731o_2>
##$PROCNO= 1
##$ACQT0= -3.02521000389291
##$AMP= (0..31)
100 100 100 100 100 100 100 100 100 100 100 100 100 100 100 100 100 100
100 100 100 100 100 100 100 100 100 100 100 100 100 100
##$ANAVPT= -1
##$AQSEQ= 0
##$AQ_mod= 3
##$AUNM= <au_zg>
##$AUTOPOS= <52 >
##$BF1= 400.13
##$BF2= 400.13
##$BF3= 400.13
##$BF4= 400.13
##$BF5= 400.13
##$BF6= 400.13
##$BF7= 400.13
##$BF8= 400.13
##$BYTORDA= 0
##$CAGPARS= (0..11)
0 0 0 0 0 0 0 0 0 0 0 0
##$CFDGTYP= 0
##$CFRGTYP= 9
##$CHEMSTR= <none>
##$CNST= (0..63)
1 1 145 1 1 1 1 1 1 1 1 1 1 1 1 1 1 1 1 1 1 1 1 1 1 1 1 1 1 1 1 1 1 1 1
$$ [...]
##$TE1= 298.3799
##$TE2= 0
##$TE3= 0
##$TE4= 0
##$TEG= 300
##$TE_PIDX= 1
##$TE_STAB= (0..8)
2 2 0 0 0 0 0 0 0
##$TL= (0..7)
0 120 120 120 120 120 120 120
##$TP= (0..7)
150 150 150 150 150 150 150 150
##$TPNAME0= <>
##$TPNAME1= <>
##$TPNAME2= <>
##$TPNAME3= <>
##$TPNAME4= <>
##$TPNAME5= <>
##$TPNAME6= <>
##$TPNAME7= <>
##$TPOAL= (0..7)
0.5 0.5 0.5 0.5 0.5 0.5 0.5 0.5
##$TPOFFS= (0..7)
0 0 0 0 0 0 0 0
##$TUNHIN= 0
##$TUNHOUT= 0
##$TUNXOUT= 0
##$USERA1= <>
##$USERA2= <>
##$USERA3= <>
##$USERA4= <>
##$USERA5= <>
##$V9= 5
##$VALIST= <>
##$VCLIST= <>
##$VD= 0
##$VDLIST= <>
##$VPLIST= <>
##$VTLIST= <>
##$WBST= 1024
##$WBSW= 4
##$XGAIN= (0..3)
0 0 0 0
##$XL= 0
##$YL= 0
##$YMAX_a= 5803476
##$YMIN_a= -2502930
##$ZGOPTNS= <>
##$ZL1= 120
##$ZL2= 120
##$ZL3= 120
##$ZL4= 120
##$ABSF1= 11.697
##$ABSF2= -2.290992
##$ABSG= 5
##$ABSL= 3
##$ALPHA= 0
##$AQORDER= 0
##$ASSFAC= 0
##$ASSFACI= 0
##$ASSFACX= 0
##$ASSWID= 0
##$AUNMP= <save_auto_nonLDAP.pm>
##$AXLEFT= 0
##$AXNAME= <>
##$AXNUC= <1H>
##$AXRIGHT= 0
##$AXTYPE= 0
##$AXUNIT= <>
##$AZFE= 0.1
##$AZFW= 0.1
##$BCFW= 0
##$BC_mod= 0
##$BYTORDP= 0
##$COROFFS= 0
##$CY= 15
##$DATMOD= 1
##$DC= 0
##$DFILT= <>
##$DTYPP= 0
##$ERETIC= no
##$F1P= 0
##$F2P= 0
##$FCOR= 0.5
##$FTSIZE= 65536
##$FT_mod= 6
##$GAMMA= 0
##$GB= 0
##$INTBC= 1
##$INTSCL= 1
##$ISEN= 128
##$LB= 0.3
##$LEV0= 0
##$LPBIN= 0
##$MAXI= 10000
##$MC2= 0
##$MEAN= 0
##$ME_mod= 0
##$MI= 0
##$NCOEF= 0
##$NC_proc= -4
##$NLEV= 6
##$NOISF1= 0
##$NOISF2= 0
##$NSP= 0
##$NTH_PI= 0
##$NZP= 0
##$OFFSET= 11.697
##$PC= 1
##$PHC0= 120.9687
##$PHC1= -12.36862
##$PH_mod= 1
##$PKNL= yes
##$PPARMOD= 0
##$PPDIAG= 0
##$PPIPTYP= 0
##$PPMPNUM= 2147483647
##$PPRESOL= 1
##$PSCAL= 4
##$PSIGN= 0
##$PYNMP= <proc.py>
##$REVERSE= no
##$SF= 400.13
##$SI= 65536
##$SIGF1= 0
##$SIGF2= 0
##$SINO= 0
##$SIOLD= 65536
##$SPECTYP= <>
##$SREGLST= <1H.D2O>
##$SSB= 0
##$STSI= 65536
##$STSR= 0
##$SW_p= 5597.01492537316
##$SYMM= 0
##$S_DEV= 0
##$TDeff= 65536
##$TDoff= 0
##$TI= <>
##$TILT= no
##$TM1= 0
##$TM2= 0
##$TOPLEV= 0
##$USERP1= <>
##$USERP2= <>
##$USERP3= <>
##$USERP4= <>
##$USERP5= <>
##$WDW= 1
##$XDIM= 65536
##$YMAX_p= 434544287
##$YMIN_p= -57983
##$CURPLOT= <Cups-PDF>
##$CURPRIN= <$Cups-PDF>
##$DFORMAT= <normdp>
##$LAYOUT= <+/1D_H.xwp>
##$LFORMAT= <normlp>
##$PFORMAT= <normpl>
$$ End of Bruker specific parameters
$$ ---------------------------------
##NTUPLES= NMR SPECTRUM
##VAR_NAME=  FREQUENCY,     SPECTRUM/REAL,   SPECTRUM/IMAG
##SYMBOL=    X,             R,               I
##VAR_TYPE=  INDEPENDENT,   DEPENDENT,       DEPENDENT
##VAR_FORM=  AFFN,          ASDF,            ASDF
##VAR_DIM=   65536,         65536,           65536
##UNITS=     HZ,            ARBITRARY UNITS, ARBITRARY UNITS
##FACTOR=    0.0854036701259332, 1,          1
##FIRST=     5596.92952170303, 6970,         -864
##LAST=      0,             13795,           -36584
##MIN=       0,             -57983,          0
##MAX=       5596.92952170303, 434544287,    0
$$ Real data points
##PAGE= N=1
##DATA TABLE= (X++(R..R)), XYDATA
$$ [...]
39369C20625J8706J1530M379k383o881l769q521k1667k7106k9159k9360k4047
$$ 320625 339331 350861 355240 352857 345976 342207 333686 312019 284913 255754 226394 202347
39357B02347k1974k3673j9649j8587k1207j9183j5489j3774j1763o997n149k177
$$ 202347 180373 156700 137051 118464 97257 78074 62585 48811 37048 30051 24902 22725
39345B2725K914Q43m036m729l910l431m121A086O06N714L033l059l056B74f501
$$ 22725 25639 26482 22446 17717 13807 10376 6255 1086 1692 7406 10439 7380 4324 274 -6501
39329a2304j009j39K003c359E525L809k975G30f497r372o827j251K810K271L466
$$ -12304 -13313 -13452 -11449 -3359 5525 9334 6359 730 -6497 -15869 -22696 -23947 -21137 -18866 -15400
39314a5400P658C607J2408N156n861D977g243r788n607m699P21J857K169O181
$$ -15400 -7742 3607 16015 21171 15310 4977 -7243 -17031 -22638 -27337 -26616 -24759 -22590 -16409
39300a6409L559M036K500K503J805n872m278K638d407a482k589l408m754n818
$$ -16409 -12850 -8814 -6314 -3811 -2006 -7878 -12156 -9518 -4407 -1482 -4071 -7479 -12233 -18051
39286a8051J16N6k05M399J293k912j531J260m00l008p052q198J213J3526g360
$$ -18051 -17935 -17879 -18084 -13685 -12392 -15304 -16835 -15575 -15975 -18983 -26035 -34233 -33020 -19494 -7360
39270e78C012H24f091n865l084k0J236m35k49J384L283K315a744G703N696m825
$$ -578 3012 824 -6091 -11956 -15040 -15060 -13824 -14259 -14508 -13124 -9841 -7526 -1744 7703 13399 8574
39254H574d193q166k025L41j946M36O349B99N216J11B27f858k284M457B438M014
$$ 8574 -4193 -12359 -14384 -14043 -15989 -15553 -9204 299 5515 5626 227 -6858 -9142 -4685 2438 6452
39238F452J803B824c555k013k425o66J501n431j1112m892M169N320Q174d109d6
$$ 6452 8255 2824 -3555 -5568 -7993 -8659 -7158 -12589 -23701 -28593 -24424 -19104 -10930 -4109 -46
39222A729E08Q07j53b359m064n382p099l036O754N481j496M43J828M3K283K747
$$ 1729 508 1315 1162 -2359 -6423 -11805 -18904 -21940 -15186 -9705 -11201 -10758 -8930 -8887 -6604 -3857
39206c857J425k688q451p296m535k387j067L278J0631N463K458a971i11J48E066
$$ -3857 -2432 -5120 -13571 -20867 -25402 -27789 -28856 -25578 -14947 -9484 -7026 -1971 -911 -763 5066
39190H847J513K132K695K572k984m630k590j778k714c655p505N79K829k636k053
$$ 8847 10360 12492 15187 17759 14775 10145 7555 5777 3063 -3655 -11160 -10581 -7752 -10388 -12441
39175a2441K0j24j959l267r40N788a648G206M349n294f451r215l854R86N507M458
$$ -12441 -12421 -12545 -14504 -17771 -18711 -12923 -1648 7206 11555 6261 -6451 -15666 -19520 -18534 -13027 -8569
39159h569J232J364L31n633j2733l350P081M150M657K027k200k573L102c042E204
$$ -8569 -7337 -5973 -5642 -11275 -24008 -27358 -20277 -16127 -11470 -9443 -11643 -14216 -11114 -3042 5204
39143A4716O548K036k864o603o692B775a282j48F142J666A901c412l449c295B283
$$ 14716 21264 23300 20436 13833 7141 2775 -1282 -1430 6142 7808 1901 -3412 -6861 -3295 2283
39127g33p550j258b786H628J0818L297l259k089L151k738E711d612O29C138M847
$$ -733 -8283 -9541 -2786 8628 19446 22743 19484 17395 20546 17808 5711 -4612 -3983 3138 7985
39112G985K763m0M76p37m412q46L169L956R105O126l998o614l034N84j065o303
$$ 7985 10748 10708 11184 10447 6035 5189 8358 12314 21419 27545 23547 16933 13899 14483 13418 7115
39096G115F67e496o614j305L938J938n654o423l54M361K619M209M340k306J023
$$ 7115 667 -5496 -12110 -13415 -9477 -7539 -13193 -19616 -19970 -15609 -12990 -8781 -4441 -6747 -5724
39081e724b70j550j035C417Q268M946L62m008D943c421r287l660M175M727Q75
$$ -5724 -270 -1820 -2855 3417 11685 16631 16993 12985 4943 -3421 -12708 -16368 -12193 -7466 -6591
39066f591J635A013N241k838g48j48C533O717R214K199m604p208D804J568M464
$$ -6591 -4956 1013 6254 3416 -748 -896 3533 10250 19464 21663 17059 9851 4804 6372 10836
39051A0836O951O713R83o436C510a5393j5161o22a4248C857J0510K985l357n280
$$ 10836 17787 24500 25483 19047 3510 -15393 -30554 -31176 -14248 3857 14367 17352 13995 8715
39037H715C460e005m417g59G978k804b384q733n314L878M832k30J475a20F126
$$ 8715 3460 -5005 -9422 -759 7978 5174 -2384 -11117 -16431 -12553 -7721 -7951 -6476 -120 6126
39021H275J492K858J638F540f778q740j691q14k881J332R155c393l531o505n816
$$ 8275 9767 12625 14263 6540 -6778 -15518 -17209 -18023 -20904 -19572 -10417 -3393 -6924 -13429 -19245
39006a9245J907O693Q84n551n073l214n29K293N406P194c127E925N629J756J509
$$ -19245 -17338 -10645 -9761 -15312 -20385 -23599 -24128 -21835 -16429 -9235 -3127 5925 11554 13310 14819
38991A4819j348l931B837c494m874j455R27J674K391a931B971K972j744g99l747
$$ 14819 13471 9540 2837 -3494 -8368 -9823 -8896 -7222 -4831 -1931 2971 5943 4199 -799 -4546
38976d546j028n586l935k875n764j671M019N743o11n806J972O173M658r02l955
$$ -4546 -5574 -11160 -15095 -17970 -23734 -25405 -21386 -15643 -16254 -22060 -20088 -13915 -9257 -10159 -14114
38961a4114j593K128J655k429l157J750J691j475n99J014J470m792q933n325K334
$$ -14114 -15707 -13579 -11924 -14353 -17510 -15760 -14069 -15544 -16143 -15129 -13659 -18451 -27384 -32709 -30375
38946c0375R266J0082J760o662j957k16J273M186N897a22rm698k324a241F480
$$ -30375 -21109 -11027 -9267 -15929 -17886 -18102 -16829 -12643 -6746 -122 -131 -4829 -7153 -1241 6480
38930G893j438J556k354A219M34j42d33PB742Q865P922k869G478B882n14E38b657
$$ 7893 6455 8011 5657 1219 1653 1511 -433 -426 2742 11607 19529 16660 7478 2882 2368 538 -2657
38912e230j0239j4965q607j937p34k315l947L709J2088J4108e923B523L800L548
$$ -5230 -15469 -30434 -39041 -40978 -41712 -44027 -47974 -44265 -32177 -18069 -5923 2523 6323 9871
38898I871L836K526J892L140l052p250l654J041M082l060A182c707d17I591J2752
$$ 9871 13707 16233 18125 21265 18213 10963 7309 8350 12432 9372 1182 -3707 -417 9591 22343
38883B2343J1334M728j913p203q934q86M470l293p432E252a779j093r29k258b324
$$ 22343 33677 38405 36492 29289 20355 19469 23939 20646 13214 5252 -1779 -2872 -3801 -6059 -2324
38867E981K754k206k313a34n685k396J782b655B464M126J694l7j031n53k742a600
$$ 5981 8735 6529 4216 -134 -5819 -8215 -6433 -2655 2464 6590 8284 8247 7216 6663 3921 -1600
38850a0914o015K930N875A919L998b987j2509m368Q10k302M552g150c209k171
$$ -10914 -16929 -13999 -8124 1919 5917 -2987 -15496 -19864 -19054 -21356 -16804 -7150 -3209 -5380
38836e380k644j009L170B062J1340P855j424m667n412k789J931J603D720a481
$$ -5380 -8024 -9033 -5863 2062 13402 21257 19833 15166 9754 6965 8896 10499 4720 -1481
38821B094O397J085k097j935j953o75J604K243K677L042m11m191C515L7M921O718
$$ 2094 8491 9576 7479 5544 3591 2916 4520 6763 9440 12482 12071 7880 3515 3552 8473 15191
38805A5191M419J030m40J689j958q622m929l8j32K045K53J851O624J897l448P4
$$ 15191 19610 20640 20200 21889 19931 11309 6380 6342 6210 8255 8508 10359 16983 18880 15432 15506
38789A5506L85p011d12n922l0J499O61J237I9K388N185Q368M160n64o62K153K808
$$ 15506 15891 8880 -412 -6334 -6364 -4865 -4204 -2967 99 2487 7672 16040 20200 19636 18974 21127 23935
38772B3935M352L779j954j0095E930a492C914J0924K746n351B613d040n701j0167
$$ 23935 28287 32066 30112 20017 5930 -1492 3914 14838 17584 12233 2613 -4040 -9741 -19908
38758a9908o268M460i920B454O263K037K038K834K540K960J324J375J188J817
$$ -19908 -26176 -21716 -9920 2454 8717 10754 12792 15626 18166 21126 22450 23825 25013 26830
38744B6830M378J717j323j159n225m903k763l448m731k231J382J900m30Q15K643
$$ 26830 31208 32925 31602 30443 25218 20315 17552 14104 9373 7142 8524 10424 9994 10809 13452
38729A3452p91F091b037m122b278E696P805L868l701C924d740k47b323f83A022
$$ 13452 12661 6091 -2037 -6159 -2278 5696 13501 17369 13668 3924 -4740 -4987 -2323 -683 1022
38713D854O411M239n126l182K449l840c508j1787q753k915J257M467P914b879
$$ 4854 11265 15504 10378 7196 9645 5805 -3508 -15295 -24048 -26963 -25706 -21239 -13325 -2879
38698C817K254O78J030J194k070A089c691k557j56M43Q45b9F305B816f514l868
$$ 3817 6071 6749 7779 8973 6903 1089 -3691 -6248 -6404 -5961 -5116 -29 6305 2816 -6514 -10382
38682a0382M721H062J5628P968k813o274k970m439F638m76N051O165P768P683
$$ -10382 -5661 8062 23690 31658 28845 22571 19601 15162 6638 6162 11213 17378 25146 32829
38668C2829L862n250q302q006n466O34M034K02j886K584K717l499n556l866A454
$$ 32829 36691 31441 23139 15133 9667 10301 14335 14537 12651 15235 17952 14453 8897 5031 1454
38652e22C79J239K177L172o48K622K995J89L071K466m10o96O54K042N144M556
$$ -522 379 1618 3795 6967 6319 8941 11936 12125 15196 17662 17252 16556 17210 19252 24396 28952
38636B8952j79j756k954j693O941J4462J1428q9n892p527q369o885j056K972K421
$$ 28952 28773 27017 24063 22370 29311 43773 55201 55112 49220 41693 33324 26439 25383 28355 30776
38621C0776M645M703N274M658K613R8o129o034k331k243j146P60j812l374k212
$$ 30776 35421 40124 45398 50056 52669 52767 46638 40604 38273 36030 34884 35644 33832 30458 28246
38606B8246Q74M12l426q33N706K763K093J580o471r125p027l627L695P487M651
$$ 28246 29120 29532 26106 25273 30979 33742 35835 37415 30944 21819 14792 11165 14860 22347 26998
38591B6998L64R62K095L606O733O580K711k065l747m104k347l156m814m146r30
$$ 26998 27362 28324 30419 34025 40758 47338 50049 47984 44237 40133 37786 34630 29816 25670 24740
38576B4740N296J676m621r09L019M831P969N964K174K852J538L29M596L878O93
$$ 24740 30036 31712 27091 26182 29201 34032 42001 47965 50139 52991 54529 54858 59454 63332 64025
38561F4025n718r717p315j0247q718K056N341O452P919P083P582N210m469l957
$$ 64025 58307 48590 41275 31028 22310 24366 29707 36159 44078 51161 58743 63953 59484 55527
38547E5527j90R71r67n011m592J758j988r888p747L235R101O897J929l926k192
$$ 55527 55337 56308 55341 50330 45738 47496 45508 35620 27873 31108 40209 47106 49035 45109 42917
38532D2917k63K088O502P849P319L804j224J397M570o87j937j873n282j300J079
$$ 42917 42654 44742 51244 59093 66412 70216 68992 70389 74959 74272 72335 70462 65180 63880 64959
38517F4959r14J545P154N879N234L619N456R083N096n82n832k091K266L016M494
$$ 64959 64045 65590 72744 78623 83857 87476 92932 102015 107111 106529 100697 98606 100872 103888 108382
38502A08382K730k626m779l497L227J0962O085l350o731o751l346q73m329q83
$$ 108382 111112 108486 103707 100210 103437 114399 120484 117134 110403 103652 100306 99433 95104 94221
38488I4221P556M594J964K299J841M140O398O496K485j030K521J212m232j525
$$ 94221 101777 106371 108335 110634 112475 116615 123013 129509 131994 130964 133485 134697 130465 128940
38474A28940K49K073P591J1340P395N041L801J878q85l782m347r08J92M09K685
$$ 128940 129189 131262 138853 150193 157588 162629 166430 168308 167423 163641 159294 158386 158578 158987 161672
38459A61672N972R547J2221J3562J1965J101l616L675Q719R579P860N295M480
$$ 161672 167644 177191 189412 202974 214939 216040 212424 216099 224818 234397 242257 247552 252032
38446B52032K922L094O818N530L505R025J0953P107J1799J1734M997L335N662
$$ 252032 254954 258048 264866 270396 273901 282926 293879 300986 312785 324519 329516 332851 338513
38433C38513J2440J4692J5951J7079J9102J7026J8822K5862K2020J3040R640J3652
$$ 338513 350953 365645 381596 398675 417777 434803 453625 479487 501507 514547 524187 537839
38421E37839J7519K2933K8839K7768K4561K7881L0139L5374M0175L2395K7335
$$ 537839 555358 578291 607130 634898 659459 687340 717479 752853 793028 825423 852758
38410H52758L2841M0711M3292M0490L6926L7049N0582O2181O4948O8792O6575
$$ 852758 885599 926310 969602 1010092 1047018 1084067 1134649 1196830 1261778 1330570 1397145
38399A397145O6164P0321P4066Q3383R7941J04369J05565J04500J16831J39911
$$ 1397145 1463309 1533630 1607696 1691079 1789020 1893389 1998954 2103454 2220285 2360196
38389B360196J49206J51293J70041J94890K10962K23743K48214K78567L11302
$$ 2360196 2509402 2660695 2830736 3025626 3236588 3460331 3708545 3987112 4298414
38380D298414L53516L95622M40015M92406N58008O38900P17436Q06311R09728
$$ 4298414 4651930 5047552 5487567 5979973 6537981 7176881 7894317 8700628 9610356
38371I610356J037096J195153J389115J635873J946659K324884K774502L275336
$$ 9610356 10647452 11842605 13231720 14867593 16814252 19139136 21913638 25188974
38363B5188974L763335M183050M512775M760139M927207M980134M872061M505054
$$ 25188974 28952309 33135359 37648134 42408273 47335480 52315614 57187675 61692729
38355F1692729L751076K603054J265726K2560j081185k232017l517357m790961
$$ 61692729 65443805 68046859 69312585 69335145 68253960 66021943 62504586 57713625
38347E7713625n750568o114885n848778n205584m460479l768426l185200k691488
$$ 57713625 51963057 45848172 39999394 34793810 30333331 26564905 23379705 20688217
38339B0688217k258738j897090j619916j416941j274057j151838j022996r00706
$$ 20688217 18429479 16532389 14912473 13495532 12221475 11069637 10046641 9145935
38331I145935p92469o95652o11024n41631m86238m32164l86710l49088l08737
$$ 9145935 8353466 7657814 7046790 6505159 6018921 5586757 5200047 4850959 4542222
38322D542222k76292k60548k49386k31705k06232j84811j73184j66337j59033
$$ 4542222 4265930 4005382 3755996 3524291 3318059 3133248 2960064 2793727 2634694
38313B634694j49777j36012j20995j08073j02165r7348r3655q7926q2092p8223
$$ 2634694 2484917 2348905 2227910 2119837 2017672 1920324 1826669 1738743 1656651 1578428
38303A578428o9228o1276n9651n8195n5974n4176n5132n4915m8611l3774k6357
$$ 1578428 1509200 1447924 1388273 1330078 1274104 1219928 1164796 1109881 1061270 1027496 1001139
38292A001139l1731l4976l5365l7109l3656k5791j9862k2107k7509k6295k5776
$$ 1001139 969408 934432 899067 861958 828302 802511 782649 760542 733033 706738 680962
38281F80962k8365j9832j2555j0526j5986k0336j4975j3345j2719j0189r221j2515
$$ 680962 652597 632765 620210 609684 593698 573362 558387 545042 532323 522134 512913 500398
38269E00398j6516j4522r674r341j1578j3373q764k390n242j0776j4853j4608
$$ 500398 483882 469360 459686 450345 438767 425394 416630 414240 408998 398222 383369 368761
38257C68761j0804o983n997n839k010j929l856p207q336m482K991J603o233j2268
$$ 368761 357957 350974 344977 339138 337128 335199 331343 324136 315800 311318 314309 315912 309679 297411
38243B97411j3665q707n083k552l302p083p349p970m472k497p863r586q702m240
$$ 297411 283746 275039 269956 267404 264102 257019 249670 241700 237228 234731 226868 217282 208580 204340
38229B04340J848N185O496O630J2485J2568n229k1411j9627j0754j0843j3387
$$ 204340 206188 211373 217869 224499 236984 249552 244323 222912 203285 192531 181688 168301
38217A68301j0031q913q967o506m649l437j252K716R67k055j558k23o4N4M126
$$ 168301 158270 149357 140390 133884 129235 125798 124546 127262 128229 126174 124616 124393 124329 124383 128509
38202A28509K685m01j949l350l805m492n722q506o327k865k580L902M245k947
$$ 128509 131194 130793 128844 125494 121689 117197 111475 102969 96642 93777 91197 95099 99344 96397
38188I6397J539N805k123m672K834k781p707n535l216M58N474Q294N334O19j012
$$ 96397 97936 103741 101618 96946 99780 96999 89292 83757 80541 80999 86473 94767 100101 100720 99708
38173I9708K107J371o843r466R7O583L336k986r587j0932n237K072O337M302o7
$$ 99708 101815 103186 96343 86877 86974 93557 96893 93907 84320 73388 68151 70223 76560 80862 80795
38158H0795R69k630l496K133L231k977o273q116j845J903m293r184q788l053O715
$$ 80795 81764 79134 75638 77771 81002 78025 71752 63636 61791 63694 59401 50217 41429 38376 45091
38143D5091P137M736J593n901k179L704M896M798M936O009k517q520m355k483
$$ 45091 52228 56964 58557 52656 50477 54181 59077 63875 68811 74820 72303 63783 59428 56945
38129E6945l988n371m305q629q138k292M9P16k680l370K90K148Q20j411J895K591
$$ 56945 52957 47586 43281 34652 26514 24222 24271 24987 22307 18937 19227 21375 22195 20784 22679 25270
38113B5270L261O298O149J889R23N782K573n92J398n2k765l172l571m904m288
$$ 25270 28531 34829 40978 42867 43790 49572 52145 51553 52951 52899 50134 46962 43391 38487 34199
38098C4199p697j1134n931J475K535J642N211N786o195G269l118L834L791O081
$$ 34199 26502 15368 9437 10912 13447 15089 20300 26086 19891 7269 4151 7985 11776 17857
38084A7857O167o5p978m210L331K56j490m75J041L049Q223M814J07L635J973o703
$$ 17857 24024 23959 15981 11771 15102 15358 13868 13393 14434 17483 25706 30520 30627 34262 36235 29532
38068B9532p607k606M847J1674J0141k57l345m544l412K723J60l462l647j940
$$ 29532 21925 19319 24166 35840 45981 45724 42379 37835 34423 37146 37306 33844 30197 28257
38054B8257j34R64o597G649a515n574q724p558n093k081M636J0953c925f14l069
$$ 28257 28123 29087 22490 7649 -1515 -7089 -15813 -23371 -28464 -30545 -25909 -14956 -3925 -614 -3683
38039c683k167L73a779o72k508r41l70J856b041C326R593J0197M416k337j0900
$$ -3683 -5850 -5477 -1779 -2451 -4959 -5900 -6270 -4414 -2041 3326 12919 23116 27532 25195 14295
38024A4295E435Q12O213R68E169i43j034C972P271J717k173D678b483o158k157
$$ 14295 5435 6247 12460 13428 5169 -943 -1977 3972 11243 12960 10787 4678 -2483 -8641 -10798
38009a0798L394H09Q533O508K98l658q41r99J098j105k646m74q52B870d440n876
$$ -10798 -7404 809 9342 15850 16148 12490 11649 10650 11748 10643 7997 7523 6671 2870 -4440 -10316
37993a0316M299A378K177L183P600N548j316m703p33J726K585k58q570A729M330
$$ -10316 -6017 1378 3555 6738 14338 19886 18570 13867 13134 14860 17445 17187 8617 1729 6059
37978F059J3215N513o748n065k015k135l617k467b228m574k192L454B470O814
$$ 6059 19274 24787 18039 12974 10959 8824 5207 2740 -2228 -6802 -8994 -5540 2470 9284
37964I284K874k888l007q33k446h89j430h02m276o566P13e185K379j392l793l077
$$ 9284 12158 9270 6263 5430 2984 -889 -2319 -802 -5078 -11644 -10931 -5185 -2806 -4198 -7991 -11068
37948a1068K094d004a240k717l450K896B285K449A715b932r604j1474j083Q829
$$ -11068 -8974 -4004 -1240 -3957 -7407 -4511 2285 4734 1715 -2932 -12536 -24010 -25093 -16264
37934a6264P933L502C38J169c679j238J712A62L850J934k794E56a879M6B343N731
$$ -16264 -8331 -4829 338 1507 -3679 -4917 -3205 162 4012 5946 3152 556 -1879 -1833 2343 8074
37918H074K938R37l262A058b805k852K455A078a765k383A559J0605N490k673p254
$$ 8074 11012 11949 8687 1058 -2805 -5657 -3202 1078 -1765 -4148 1559 12164 17654 14981 7727
37903G727c809r457R85c931C813P347L742l311C826b807q276q729K41K916M228
$$ 7727 -3809 -13266 -12281 -3931 3813 11160 14902 11591 3826 -2807 -11083 -19812 -19571 -16655 -12427
37888a2427M340J126k13K298a134C623N720K016K736K723o330C210e51l256l126
$$ -12427 -8087 -6961 -7174 -4876 -1134 3623 9343 11359 14095 16818 10488 3210 -551 -3807 -6933
37873f933l606J572M436J174m274q977j2113m643L060N957O091O347J708l886
$$ -6933 -10539 -8967 -4531 -3357 -7631 -16608 -28721 -33364 -30304 -24347 -18256 -11909 -10201 -14087
37859a4087J279L402J160k882K637A518M149q61d09p528p819m819J511P699a151
$$ -14087 -12808 -9406 -8246 -11128 -8491 1518 5667 4806 -409 -7937 -15756 -20575 -19064 -11365 -1151
37843F748J723j344j280e31j0642p811n3K278R45K607d300D447K810P5R20M469
$$ 6748 8471 7127 5847 -531 -11173 -18984 -19037 -16759 -15814 -13207 -4300 4447 7257 7332 8252 12721
37827A2721K703l398n409k051K192N680J368n502E04c473Q04k764m818m12K172
$$ 12721 15424 12026 6617 4566 6758 12438 13806 8304 504 -3473 -2669 -5433 -10251 -10663 -8491
37812h491J764a959P87n488l037K23P84K923A826K705J762o41e426p438R58M911
$$ -8491 -6727 -1959 -1172 -6660 -9697 -9474 -8690 -5767 1826 4531 6293 5652 -5426 -12864 -11906 -6995
37796f995A898J2485J2434K695n541j0709B754b563a05E924Q670O880j588p249
$$ -6995 1898 14383 26817 29512 23971 13262 2754 -2563 -105 5924 14594 21474 19886 12637
37782A2637A148d784J296A197J542f92n274j957c826A717N963N531L427m276D685
$$ 12637 1148 -4784 -3488 1197 2739 -692 -5966 -7923 -3826 1717 7680 13211 16638 12362 4685
37766D203N497N204k183D645a754o46d15j172q1C220N923M655j376l957j602j294
$$ 4203 9700 14904 12721 4645 -1754 -2400 -415 -1587 -1668 3220 9143 13798 12422 8465 6863 5569
37750E569k521e05E20M865M645J527C648a1142j3949p515j350L3k129p85Q286
$$ 5569 3048 -505 520 5385 10030 11557 3648 -11142 -25091 -32606 -33956 -33923 -36052 -36837 -28551
37735b8551J1816h246b622A512M772J36A997h46C748N248o65k831K98k600a501
$$ -28551 -16735 -8246 -2622 1512 6284 6420 1997 -846 3748 8996 8331 5500 5798 3198 -1501
37719g281q197m518p21j387l867J51P747P900M099K198K69J567D340Q406M378
$$ -7281 -15478 -19996 -20717 -22104 -25971 -25820 -18073 -10173 -6074 -3876 -3607 -2040 4340 12746 17124
37704A7124l902E696f520j2860r486k962M062O041N269M849r49j0100l782rm93
$$ 17124 13222 5696 -6520 -19380 -28866 -31828 -27766 -21725 -16456 -11607 -12556 -22656 -26438 -26447 -26940
37689b6940J355k130o422l36L669L316J333k32n61J953M436O156N403c414h5H07
$$ -26940 -25585 -27715 -34137 -34473 -30804 -27488 -26155 -26387 -26948 -24995 -20559 -14403 -9000 -3414 -85 807
37672a204l640k70N04J72K63m134j0405o212M285O457L362e167C469L949j248
$$ -1204 -4844 -5114 -4610 -4438 -4175 -8309 -18714 -24926 -20641 -14184 -10822 -5167 3469 7418 6170
37657F170A877n88J404q67b120o779l388j010j985p504n155K083P146h736L456
$$ 6170 1877 1289 2693 1826 -2120 -8899 -12287 -13297 -15282 -22786 -27941 -25858 -18712 -8736 -5280
37642e280j150j21p13R50n89j703M41O11c464k157o441j022K573e170b017H00
$$ -5280 -6430 -6551 -7264 -6314 -6903 -8606 -8165 -7554 -3464 -5621 -12062 -13084 -10511 -5170 -2017 800
37625E873j284a224p626n899k036n033q324m046J763K226J54K34M215N115K171
$$ 5873 4589 -1224 -8850 -14749 -16785 -21818 -30142 -34188 -32425 -30199 -30045 -29811 -25596 -20481 -18310
37610a8310J302M29J017L147K654d502J077l407q74j307j438M58K675P45P51O61
$$ -18310 -17008 -16579 -15562 -12415 -9761 -4502 -3425 -6832 -7706 -9013 -10451 -9993 -7318 -6573 -5822 -5161
37594e161j816K912B261O181K170J290n79D639b343r264p914m782M98L345O490
$$ -5161 -6977 -4065 2261 8442 10612 11902 11323 4639 -2343 -11607 -19521 -24303 -23805 -20460 -13970
37579a3970f326a580a0m919j0258o752j752k87j955J878P011O552A082J1626K566
$$ -13970 -6326 -1580 -10 -4929 -15187 -21939 -23691 -23978 -25933 -24055 -17044 -10492 1082 12708 15274
37564A5274l361E399d452m802K577J41k890p976q980k256J598K743R047d432E11
$$ 15274 11913 5399 -4452 -9254 -6677 -6536 -9426 -17402 -26382 -28638 -27040 -24297 -15250 -4432 511
37548A311J143h01n583J492a056m862r228l749N185M667K045K518k985p605n050
$$ 1311 2454 -801 -6384 -4892 -1056 -5918 -15146 -18895 -13710 -9043 -6998 -4480 -7465 -15070 -20120
37533b0120j264O07j001k102k022P83N002N224J771l65l172l804k805l061N630
$$ -20120 -21384 -20777 -21778 -23880 -25902 -25119 -20117 -14893 -13122 -13487 -16659 -20463 -23268 -26329 -20699
37518b0699h287A71J259b138m693j555n617j3106j0320R44O341M552M898P954
$$ -20699 -8287 171 1430 -2138 -6831 -8386 -14003 -27109 -37429 -36485 -30144 -25592 -20694 -12740
37504a2740O333j418o571j649M715M115j262k010d513E577L787B865f538n669
$$ -12740 -6407 -7825 -14396 -16045 -11330 -7215 -8477 -10487 -4513 5577 9364 2865 -6538 -12207
37490a2207j057N16O74j650n051n592n350j280K665L059J986q47j645m103o591
$$ -12207 -13264 -12748 -12074 -13724 -18775 -24367 -29717 -30997 -28332 -25273 -23287 -24134 -25779 -29882 -36473
37475c6473o372q61P846J1388i747I24N25C17b685q043j2675j2406j583J113m901
$$ -36473 -42845 -43706 -35860 -24472 -9747 924 1449 317 -2685 -10728 -23403 -35809 -37392 -36279 -41180
37460d1180n602k345K065J1540J1735O786L215M96K237K133l290o739n535N28
$$ -41180 -46782 -49127 -47062 -35522 -23787 -17001 -13786 -13290 -11053 -8920 -12210 -18949 -24484 -23956
37446b3956K945j048o702j259M049M960J908o970r003j475N516P639M354k148
$$ -23956 -21011 -22059 -28761 -30020 -25971 -21011 -19103 -26073 -35076 -36551 -31035 -23396 -19042 -21190
37432b1190l008k40o26J099N075P755b774A774a509o988L98H26J0796P026M33
$$ -21190 -24198 -24438 -25064 -23965 -18890 -11135 -2774 1774 -1509 -8497 -8099 826 11622 18648 19081
37417A9081m261F985B652J129J021k356d647j1151o373K25N780P330M121f27B471
$$ 19081 14820 6985 2652 3781 4802 2446 -4647 -15798 -22171 -21946 -16166 -8836 -4715 -627 2471
37401b56l863p58J153n72J469k419p002P74e353A830O338l864c596k476J042m07
$$ -256 -4119 -4877 -3724 -4296 -2827 -5246 -12248 -11474 -5353 1830 8168 4304 -3596 -6072 -5030 -5437
37385e437b145F03a000G94M320P19K021J043j123L066N279K381k539G036b372
$$ -5437 -2145 603 -1000 794 5114 5833 7854 8897 7774 10840 16119 18500 15961 7036 -2372
37369e005c67F930O664P654J231n455H323C53f2j670m205k290K530K300h03E558
$$ -5005 -367 6930 13594 21248 22479 17024 8323 353 -62 -1732 -5937 -8227 -5697 -3397 -803 5558
37352G183A864b967n094N45e50D981M837K522j946k197l049L35N686P842O395
$$ 7183 1864 -2967 -8061 -7516 -550 4981 9818 12340 10394 8197 5148 5483 11169 19011 25406
37337B5406N572K134l119r70j396L932J0104J0566J3265J7527J6590J1835Q250
$$ 25406 30978 33112 29993 29023 27627 31559 41663 52229 65494 83021 99611 111446 119696
37324A19696O482P124P000R549J8163K0298K2681K6808L0683L0174K6366J9669
$$ 119696 126178 133302 140302 149851 168014 188312 210993 237801 268484 298658 325024 344693
37312C44693P807k526q163j2545j7662k2926k4038k3593k7903l3532k8854j8292
$$ 344693 352500 349974 341811 329266 311604 288678 264640 241047 213144 179612 150758 132466
37300A32466j8458k4662j7688n454L885N598k54q415o109r557k1255A3112l348
$$ 132466 114008 89346 71658 66204 70089 75687 75433 67018 60909 51352 30097 13112 9764
37287I764N504O605Q11n650l600m373D495j880g09l260a277D012r32b451k755
$$ 9764 15268 21873 22684 17034 13434 9061 4495 2615 -709 -3969 -1277 4012 3080 -2451 -5206
37272e206k440k479r91l966j670L727f162G08M036B092b218m797o229k89K550
$$ -5206 -7646 -10125 -11116 -15082 -16752 -13025 -6162 708 4744 2092 -2218 -7015 -13244 -13533 -10983
37257a0983p9k277p396p015k754L153M497N52l971m468k386K696L616N689K111
$$ -10983 -11062 -13339 -20735 -27750 -30504 -27351 -22854 -22302 -26273 -30741 -33127 -30431 -26815 -21126 -19015
37242a9015J215M304M131M644J531j1168j2009k036O627P545K721J006j006j843
$$ -19015 -17800 -13496 -9365 -4721 -3190 -14358 -26367 -28403 -21776 -14231 -11510 -10504 -11510 -13353
37228a3353L827M461j701J87c198i01k267n442l402k875q44e969C805N210N64
$$ -13353 -9526 -5065 -6766 -6579 -3198 -901 -3168 -8610 -12012 -14887 -15731 -5969 3805 9015 9579
37213I579k722k348J548P532L393n699A898g298p897m393k725Q3L408K931n92
$$ 9579 6857 4509 6057 13589 16982 11283 1898 -7298 -15195 -19588 -22313 -22230 -18822 -15891 -16483
37198a6483p04L098j340o344n782n063k145J880J804L328M917K506J815O006e719
$$ -16483 -17187 -14089 -15429 -21773 -27555 -32618 -34763 -32883 -31079 -27751 -22834 -20328 -18513 -12507 -5719
37182c195f00A611a584o092m678m07O136a270j812q887j2135p356j489L820O248
$$ -3195 -600 1611 -1584 -7676 -12354 -12761 -6625 -1270 -3082 -11969 -24104 -31460 -32949 -29129 -22881
37167b2881L453n466k978N87N429Q672L863L0j983l024j22e928F59L549R02D76
$$ -22881 -19428 -24894 -27872 -27285 -21856 -13184 -9321 -9291 -11274 -14298 -14420 -5928 659 4208 5110 476
37150d875l416K134g91k525q579l335J146j794o644m443L179L396P3K726g835
$$ -4875 -8291 -6157 -791 -3316 -11895 -15230 -14084 -15878 -22522 -26965 -23786 -20390 -20317 -17591 -7835
37134b51B45c681m203n676k726O179b674E061J1398M913m820H074l718j366i01
$$ -251 245 -3681 -7884 -13560 -16286 -10107 -2674 5061 16459 21372 16552 8074 4356 2990 -901
37118c417j850j346J778j056p254o466m482O44L742N75p065o505k025N20P068
$$ -3417 -5267 -6613 -4835 -5891 -13145 -19611 -24093 -23449 -19707 -19132 -26197 -32702 -34727 -34207 -27139
37103b7139J1285g175a449A783a547p383n584j946n3l737j116M493m84n995l492
$$ -27139 -15854 -7175 -1449 1783 -1547 -8930 -14514 -16460 -16513 -20250 -21366 -16873 -17357 -23352 -26844
37088b6844K720L117J885l06n111k359O22j02J801M657P18l754O0L041K895K027
$$ -26844 -24124 -21007 -19122 -19428 -24539 -26898 -26276 -26378 -24577 -19920 -19202 -22956 -22896 -19855 -16960 -14933
37072a4933M183c908f06J55p41n587m991P75L695L078k979n008k38L267l211n572
$$ -14933 -10750 -3908 -606 -451 -1192 -6779 -11770 -10995 -7300 -4222 -7201 -12209 -12447 -9180 -12391 -17963
37056a7963N434i65I369L106E151i12m516n463r65j907p424l409k338J691N493
$$ -17963 -12529 -965 9369 12475 5151 -912 -5428 -10891 -11856 -13763 -21187 -24596 -26934 -25243 -19750
37041a9750L486P504c656m275q124l852j646n04J501L559L393L176L730b897c7
$$ -19750 -16264 -8760 -3656 -7931 -16055 -19907 -21553 -22057 -20556 -16997 -13604 -10428 -6698 -2897 -37
37025F61L70a604n264n193k794J838J08J226N797C518P686L167L05m646D653a64
$$ 661 1031 -1604 -6868 -12061 -14855 -13017 -12909 -11683 -5886 3518 11204 14371 14676 10030 4653 -164
37008A769J1855P343n23r53k805l812p74L19k538m160o33k365e047o100j691N307
$$ 1769 13624 20967 20444 19491 16686 12874 12100 12419 9881 5721 5088 2723 -5047 -11147 -12838 -7531
36992g531i1H82c916j566J724k386q988o491J327M364O16l957j483J484N332N672
$$ -7531 -91 882 -3916 -5482 -3758 -6144 -15132 -21623 -20296 -15932 -15316 -19273 -20756 -19272 -13940 -8268
36976h268K933d34I633N476k259m624a157j0897r529p52g845E887M865M030K899
$$ -8268 -5335 -434 9633 15109 12850 8226 -1157 -12054 -21583 -22335 -7845 5887 10752 14782 17681
36961A7681l227n859A538c279j090k052j059n019p230J722Q389b620I92b083l971
$$ 17681 14454 8595 1538 -3279 -4369 -6421 -7480 -12499 -19729 -18007 -9618 -2620 992 -2083 -6054
36946f054a868D236L232m40j584K395L343J0j704k056J25l768a728l792m549n119
$$ -6054 -1868 4236 7468 7028 5444 7839 11182 11192 9488 7432 7557 3789 -1728 -5520 -10069 -15188
36930a5188l055k002J084N770e428D666O640K068k41j150k935k511j133k377l30
$$ -15188 -18243 -20245 -19161 -13391 -5428 4666 11306 13374 13133 11983 9048 6537 5404 3027 2697
36915B697m54d1j916l366k476b174A1512R943J531m484p090n482k456j88l12L402
$$ 2697 2243 -41 -1957 -5323 -7799 -2174 11512 21455 22986 18502 11412 5930 3474 3286 2974 6376
36899F376J546j306o89j735d42o362p389m987O25J450J174N770b664b69k656j22
$$ 6376 7922 6616 5927 4192 -442 -6804 -14193 -19180 -18555 -17105 -15931 -10161 -2664 -269 -2925 -3047
36883c047i96H56A31a169m173o871o768q045l221M511N685L941N87l387m979n569
$$ -3047 -996 856 131 -1169 -5342 -12213 -18981 -27026 -30247 -25736 -20051 -16110 -15523 -18910 -23889 -29458
36867b9458j094P070J0660c718F276L498n32j249l655A207d268k876Q08K790H99
$$ -29458 -30552 -23482 -12822 -3718 6276 9774 9242 7993 4338 1207 -4268 -7144 -6336 -3546 899
36851C877k91b824q689k568L344j462o228j762J148J420K526k72K417d738E715
$$ 3877 3586 -2824 -11513 -14081 -10737 -12199 -18427 -20189 -19041 -17621 -15095 -15367 -12950 -4738 5715
36835I956C905a393k566n603j165K358L92J675j579l626j435n593p225k454p171
$$ 9956 3905 -1393 -3959 -9562 -10727 -8369 -7977 -6302 -7881 -11507 -12942 -18535 -25760 -28214 -35385
36820c5385o600M923J2344J1857c488E31a465n57k942j042a241B114h51q58a16
$$ -35385 -41985 -37062 -24718 -12861 -3488 531 -1465 -2022 -4964 -6006 -1241 2114 -851 -1709 -116
36804E608M052l157A318m72L109j807d109o784l109J954K848N55K102c065a218
$$ 5608 9660 6503 1318 846 3955 2148 -4109 -10893 -14002 -12048 -9200 -8645 -6543 -3065 -1218
36788e29l61m29o62l446o507m961J80K439j655j363L614L868M21k302j796K392
$$ -529 -890 -1319 -1981 -5427 -11934 -16895 -16715 -14276 -15931 -17294 -13680 -9812 -9391 -11693 -13489 -11097
36772a1097J825q96nM733K594Q87I92j95b582k095K096L83j318j950j152a421
$$ -11097 -9272 -10168 -10173 -5440 -2846 -1959 992 797 -2582 -4677 -2581 -2198 -3516 -5466 -6618 -1421
36755B573c841q996j107N9k823J171P144a748C26a571q314j1588q085J597K032
$$ 2573 -3841 -12837 -13944 -13885 -16708 -15537 -8393 -1748 326 -1571 -9885 -21473 -29558 -27961 -25929
36740b5929m27m50J454M878j053k423J29J350P299e655b746j912k427n00K15J275
$$ -25929 -26356 -26806 -25352 -20474 -21527 -23950 -23821 -22471 -15172 -5655 -2746 -4658 -7085 -7585 -7370 -6095
36724f095b922B19L704J304a011l562J708E24h7q619j2460j0856k310N982J929
$$ -6095 -2922 219 3923 5227 -1011 -4573 -2865 524 -87 -8706 -21166 -32022 -34332 -28350 -26421
36709b6421L97K534O127P716J766O19j0n63k465J768a955C788j146a809k339r111
$$ -26421 -26024 -23490 -17363 -9647 -7881 -7262 -7272 -7835 -10300 -8532 -1955 3788 2642 -1809 -4148 -13259
36693a3259r539n8M846L633k392k979l06M425M928d646b75I51a995r718o799K872
$$ -13259 -22798 -22856 -18010 -14377 -16769 -19748 -20054 -15629 -10701 -4646 -275 951 -1995 -11713 -18512 -15640
36677a5640g519c544l145k709c892a468o623l636N45Q79L177L227J438P63F78
$$ -15640 -7519 -3544 -6689 -9398 -3892 -1468 -8091 -11727 -11182 -10303 -7126 -3899 -2461 -1698 678
36661C033a065o370R82A849N068B700f200j0119m413Q265a195A204n49c849o316
$$ 3033 -1065 -7435 -6453 1849 6917 2700 -6200 -16319 -20732 -12467 -1195 1204 655 -3849 -10165
36646a0165P8c116G182K113B142d080k478Q58J417A431L066M97Q83K569O22C327
$$ -10165 -10087 -3116 7182 9295 2142 -4080 -6558 -5700 -4283 1431 4497 4994 5877 8446 9068 3327
36629e049n282j793p07K765L845b362a05K0m81k925m965k317K95j170m890q375
$$ -5049 -10331 -12124 -12831 -10066 -6221 -2362 -105 -85 -566 -3491 -8456 -10773 -10478 -11648 -16538 -24913
36613b4913p591J284K427J365M436K928j34J88M126M979c466D968j600c750m280
$$ -24913 -32504 -31220 -28793 -27428 -22992 -20064 -20198 -20010 -15884 -10905 -3466 4968 3368 -3750 -8030
36598h030l409m860L43L230M716L573a197F93b717m082m262l462J732L318K147
$$ -8030 -11439 -16299 -15956 -12726 -8010 -4437 -1197 693 -2717 -6799 -11061 -14523 -12791 -9473 -7326
36583g326J322J077j261n202l212L093N469a580P78k506m116k246K736l60m213
$$ -7326 -6004 -4927 -6188 -11390 -14602 -11509 -6040 -1580 -802 -3308 -7424 -9670 -6934 -7294 -11507
36568a1507K009L824K773A732N953M793m698c796j0015K811g1G248J406k240I85
$$ -11507 -9498 -5674 -2901 1732 7685 12478 7780 -3796 -13811 -11000 -71 7248 8654 6414 985
36552A544k10c463n24A639O450K790L938k02k713j681k371q59B906a078D778J2791
$$ 1544 1334 -3463 -3987 1639 8089 10879 14817 14615 11902 10221 7850 6991 2906 -1078 4778 17569
36536A7569P882j407k092K357L929k753m930j863J91j867n087D200f194m703d228
$$ 17569 25451 24044 21952 24309 28238 25485 20555 18692 18883 17016 11929 4200 -6194 -10897 -4228
36520D416L396R93B798a974g7C292K665J160j941B587K10p95a814n193k214K448
$$ 4416 7812 8805 2798 -1974 -77 3292 5957 7117 5176 2587 2797 2002 -1814 -7007 -9221 -6773
36504f773a231D412A459e940j029M69k383l700l472P02L057M727K842J557J554
$$ -6773 -1231 4412 1459 -5940 -6969 -6500 -8883 -12583 -16055 -15353 -12296 -7569 -4727 -3170 -1616
36489a616g81D16g08q31k077E87O943K408q35J56C691d898l582K972J605j911
$$ -1616 -781 416 -708 -1539 -3616 587 7530 9938 9103 9259 3691 -4898 -8480 -5508 -3903 -5814
36473e814O01J429d48B190J541A729h025o785j023J186M545K004l400l966k285
$$ -5814 -5213 -3784 -448 2190 3731 1729 -8025 -14810 -15833 -14647 -10102 -8098 -11498 -15464 -17749
36458a7749n75n51j636j296p19k431l566k420K122L454L543K458K660M736N256
$$ -17749 -18324 -18875 -20511 -21807 -22526 -24957 -28523 -30943 -28821 -25367 -21824 -19366 -16706 -11970 -6714
36443f714K643l712N45b922J09k019b036E096M577P77A868i306r152o419o76K854
$$ -6714 -4071 -7783 -7238 -2922 -2813 -4832 -2036 5096 9673 10450 1868 -9306 -18458 -24877 -25553 -22699
36427b2699Q33j628J702M565m53o957q178l129L254J148L134J1933c458a183n098
$$ -22699 -21866 -23494 -21792 -17227 -17680 -24637 -32815 -35944 -32690 -31542 -28408 -16475 -3458 -1183 -6281
36412f281p279n876J439J358j797j095K07L265j222l309O239d291L36r062r548
$$ -6281 -13560 -19436 -17997 -16639 -18436 -19531 -19324 -16059 -17281 -20590 -14351 -4291 -3955 -13017 -22565
36397b2565n539k156N090a2364b795C83K044F11h54F49g62k806n197O27c29C909
$$ -22565 -28104 -30260 -25170 -12364 -2795 383 2427 611 -854 649 -762 -3568 -8765 -8138 -329 3909
36380B263I21L09b84h2C810m34K084J0183M925o619D519e318j2038o317l907k026
$$ 2263 921 1230 -284 -82 3810 3376 5460 15643 20568 13949 4519 -5318 -17356 -23673 -27580 -29606
36364b9606j965K677R783R076R36o938n724K734R261a925A75a993j924J755j394
$$ -29606 -31571 -28894 -19111 -10035 -9099 -16037 -21761 -19027 -9766 -1925 175 -1993 -3917 -2162 -3556
36349c556r700j0492m961N57N256K787k638L24L083L149q14k568j877n342m780
$$ -3556 -13256 -23748 -28709 -28152 -22896 -20109 -22747 -22423 -19340 -16191 -17005 -19573 -21450 -26792 -31572
36334c1572J603O609K152j09O40J029O40m162K11q95j117j124k78K401K474J395
$$ -31572 -29969 -23360 -21208 -21317 -20677 -19648 -19008 -23170 -22959 -23854 -24971 -26095 -26373 -23972 -21498 -20103
36318b0103K053J950J60l382n653m889o287l075N966R628K306n776l124K422K669
$$ -20103 -18050 -16100 -15940 -19322 -24975 -29864 -36151 -39226 -33260 -23632 -21326 -27102 -30226 -27804 -25135
36303b5135M579M819J301N229c892a368a25A269P049O331K003j568n547C030A026
$$ -25135 -20556 -15737 -14436 -9207 -3892 -1368 -125 1269 8318 14649 16652 15084 9537 3030 1026
36287E062Q700L877o871B402a215k670k191K83k472n539J582e498A349O580O271
$$ 5062 13762 17639 10768 2402 -1215 -3885 -6076 -5793 -8265 -13804 -12222 -5498 1349 7929 14200
36272A4200L559j788G368B071r2D47l6c012l563J42J565g2E271K870k872e012
$$ 14200 17759 15971 7368 2071 1979 447 411 -3012 -6575 -6433 -4868 -72 5271 8141 5269 -5012
36255a6083o299j369M759K400K444K516M429d43E008j391G40d464n043l84l021
$$ -16083 -22382 -23751 -18992 -16592 -14148 -11632 -7203 -443 5008 3617 740 -4464 -9507 -9891 -12912
36240a2912m724j346J09k492n960n874l789J217J439k808m515M97J0557J3974
$$ -12912 -17636 -18982 -18873 -21365 -27325 -33199 -36988 -35771 -34332 -37140 -41655 -41158 -30601 -16627
36226a6627Q154K482j319m973l322j003J395L108p38n295o098p136r804m460J514
$$ -16627 -8473 -5991 -7310 -12283 -15605 -16608 -15213 -12105 -12843 -18138 -24236 -31372 -41176 -45636 -44122
36211d4122N319J0279J2720M953k947J568N249c455B26K621K143O414L740N28
$$ -44122 -38803 -28524 -15804 -10851 -13798 -12230 -6981 -3455 226 2847 4990 11404 15144 15672
36197A5672k185l275A465g689M93K382O13K5q29j314J018K141a186j499m119o792
$$ 15672 13487 10212 1465 -7689 -7196 -4814 -4201 -4176 -5005 -6319 -5301 -3160 -1186 -2685 -6804 -13596
36181a3596q912j815N021L854j447l740k962q69L194O377e887D388K967C527d021
$$ -13596 -22508 -24323 -19302 -15448 -16895 -20635 -23597 -24466 -21272 -14895 -5887 4388 7355 3527 -4021
36165a4473o573m826m076J620L052L340L923L688M726c180F035M305P54k0K58
$$ -14473 -21046 -25872 -29948 -28328 -25276 -21936 -18013 -14325 -9599 -3180 6035 10340 11094 11074 11332
36150A1332j303C357d320m01P81k861k737K605b807k214r952r420o191l153M209
$$ 11332 10029 3357 -4320 -4721 -3940 -6801 -9538 -6933 -2807 -5021 -14973 -24393 -30584 -33737 -29528
36135b9528O128N582K230N70N777b707a240m037m519n003k589j911k311L193M749
$$ -29528 -23400 -17818 -15588 -15018 -9241 -2707 -1240 -5277 -9796 -14799 -17388 -19299 -21610 -18417 -13668
36120a3668K326j417k076o880k365K789J707N310N286O16K175b536h31r76o507
$$ -13668 -11342 -12759 -14835 -21715 -24080 -21291 -19584 -14274 -8988 -8372 -6197 -2536 -831 -1807 -8314
36105h314n783p562j0060k511N761Q080Q316N17q571p781K420O700J318m566n833
$$ -8314 -14097 -21659 -31719 -34230 -28469 -20389 -12073 -11556 -20127 -27908 -25488 -18788 -17470 -22036 -27869
36090b7869j609O870Q676J061n003m542M13j949K145Q372O217L458G32J187J825
$$ -27869 -29478 -22608 -13932 -12871 -17874 -22416 -22003 -23952 -21807 -13435 -7218 -3760 732 1919 3744
36075C744N203k364a542k578a046A879d692j2584m619L839Q185e07D606r02B77
$$ 3744 8947 6583 -1542 -4120 -1046 1879 -4692 -17276 -21895 -18056 -9871 -507 4606 3704 277
36059c057j610M73J854D42a142l944L28R79g47l39p231p392m508n200o987n158
$$ -3057 -4667 -4194 -2340 442 -1142 -5086 -4758 -3779 -747 -1086 -8317 -15709 -20217 -25417 -32404 -37562
36043c7562J478M552P863J0883O047l69q409o930j373j531j562O85O118P797J673
$$ -37562 -36084 -31532 -23669 -12786 -6739 -7108 -15517 -22447 -23820 -25351 -26913 -26228 -20110 -12313 -10640
36028a0640l85M206b968r22J202C784L710k949e991j0009L53O507b626B36c440
$$ -10640 -11025 -6819 -2968 -3890 -2688 3784 7494 4545 -5991 -16000 -15647 -9140 -2626 236 -3440
36012i658m567l452K382J212l320L170e365B18K500N13L54N32i18n464k108J684
$$ -9658 -14225 -17677 -15295 -14083 -17403 -14233 -5365 218 2718 3231 3585 4117 -918 -6382 -8490 -6806
35996f806B04P750r16f337j2039r93h568F308J0126L619j16q00l187m193m185
$$ -6806 204 7954 7038 -6337 -18376 -19369 -8568 6308 16434 20053 19937 19137 15950 11757 7572
35981G572p37K73k283r06A195K152L761o71O71L327p53m512J863N097r50j654
$$ 7572 6835 7108 4825 3919 1195 3347 7108 6437 7108 10435 9682 5170 7033 12130 11180 9526
35965I526p64C229g293n085J900b500C395M20J175M953M768l702D200A610J225
$$ 9526 8762 3229 -7293 -12378 -10478 -2500 3395 3815 4990 9943 14711 11009 4200 1610 2835
35950B835O897N416J508j736j042N273R383J895o597r323m696k930A073J106R96
$$ 2835 9732 15148 16656 14920 13878 19151 28534 30429 23832 14509 9813 6883 1073 2179 3175
35935C175c161n829p091o082q06L230q91k627K310p5j302K669O143O265C81N729
$$ 3175 -3161 -8990 -16081 -22163 -22969 -19739 -20630 -23257 -20947 -21022 -22324 -19655 -13512 -7247 381 6110
35919F110B004e759k532r07k549j404J205N331L038n392q875n310o51N912h818
$$ 6110 2004 -5759 -8291 -9198 -11747 -13151 -11946 -6615 -3577 -8969 -17844 -23154 -23805 -17893 -8818
35903c683o59M97i12j017l466m53J212m03J056F78L802q7g88o639r707q821M81
$$ -3683 -4342 -3845 -912 -1929 -5395 -5848 -4636 -5039 -3983 678 4480 4393 -788 -7427 -17134 -25955 -25474
35886b5474Q667f895h2H755O703j430F644B250N288M834J117J282k110m899B403
$$ -25474 -16807 -6895 -82 8755 15458 14028 6644 2250 7538 12372 13489 14771 12661 7762 2403
35870e09a31B226J132c686j2996r504J579R690O137m514k752L922J96j877J897
$$ -509 -131 2226 3358 -3686 -16682 -26186 -24607 -14917 -8780 -13294 -16046 -12124 -11928 -13805 -11908
35855a1908M336K360j435J636d20G80A45J092L800K830P816O883j816l862L594
$$ -11908 -7572 -5212 -6647 -5011 -420 780 145 1237 5037 7867 15683 22566 20750 16888 20482
35840B0482L840k92j74j483l007j214k188j213n48l483D511I44M821J0078P769
$$ 20482 24322 24030 23856 22373 19366 18152 15964 14751 14203 10720 4511 944 5765 15843 23612
35825B3612L374l722q148o965p82K372P210O913m641E885H85L287J133J970L715
$$ 23612 26986 23264 15116 8151 7369 9741 16951 23864 19223 5885 885 4172 5305 7275 10990
35810A0990L273J226l162D279b864p546o980k003L340N342M019J771a65I542J1261
$$ 10990 14263 15489 12327 4279 -2864 -10410 -17390 -19393 -16053 -10711 -6692 -4921 -165 9542 20803
35795B0803P552J074j521J673P532P528K681n915j2741j1986m268N518P122L014
$$ 20803 28355 29429 27908 29581 37113 44641 47322 41407 28666 16680 12412 17930 25052 28066
35781B8066j418j0071H235l509C05d070o561n9M437b668D034N850O94k185L165
$$ 28066 26648 16577 8235 4726 305 -4070 -10631 -10690 -6253 -2668 4034 9884 10578 8393 11558
35766A1558O192Q541P560L629N74r27p90j040l018l933j339O820Q954Q663R471
$$ 11558 17750 26291 33851 37480 38054 37127 36337 35297 32279 28346 27007 33827 42781 51444 60915
35751F0915j291r914o388j228O128P728K013j822P9M525O494N235K797L241N393
$$ 60915 59624 49710 43322 42094 48222 55950 57963 56141 56220 60745 67239 72474 75271 78512 83905
35736H3905P437M078j531L80J64m77P15j782J798O960Q853R305M308L713O765
$$ 83905 91342 95420 93889 94269 94433 93956 94671 92889 94687 101647 110500 119805 124113 127826 134591
35721A34591L975N636R883Q355L872K207L146K225l436l434k309p283q967j051
$$ 134591 138566 144202 154085 162440 166312 168519 171665 173890 170454 167020 164711 157428 148461 147410
35707A47410O785J0168J1090Q366O350R808J1469R544K125J021N928R633R314
$$ 147410 154195 164363 175453 183819 190169 199977 211446 220990 223115 224136 230064 239697 249011
35694B49011O007O585L619l115p86N988J0832J4564J4169J0626J0618J2128J0938
$$ 249011 255018 261603 265222 262107 261321 267309 278141 292705 306874 317500 328118 340246 351184
35681C51184J1329J2514Q788Q092O751Q204J3843J3057O008j920o049J699O718
$$ 351184 362513 375027 383815 391907 398658 406862 420705 433762 439770 437850 431801 433500 440218
35668D40218M473J987m773r634p033L506Q521L625J320K582K509K339j270k395
$$ 440218 444691 446678 441905 432271 425238 428744 437265 440890 442210 444792 447301 449640 448370 445975
35654D45975p583j0431l936q20j126J653N572L249n189o748K609J4205J3604P877
$$ 445975 438392 427961 424025 423205 422079 423732 429304 432553 427364 420616 423225 437430 451034 458911
35640D58911Q975J0488L353k5J678k667n026L237L743m318l232Q0p46n92O64J952
$$ 458911 467886 478374 481727 481702 483380 480713 475687 478924 482667 478349 475117 475197 474451 473859 474523 476475
35624D76475J715p50n644j5460j7781j0741m157n478r102j2851r624k740o829
$$ 476475 478190 477440 471796 456336 438555 427814 423657 418179 409077 396226 386602 383862 377033
35611C77033r770q975o434n754o780p984r214q797k244O3m542r344p530O01j56
$$ 377033 367263 358288 351854 346100 339320 331336 322122 313325 311081 311144 306602 297258 289728 290329 290173
35596B90173n503k551j311n880p545n064n023o284r938r156n393j424K362j681
$$ 290173 284670 282119 280808 274928 267383 262319 257296 251012 241074 231918 226525 225101 227463 225782
35582B25782o203r201n589j524j937k001m198j0365j7497j2003K820L694k531
$$ 225782 219579 210378 204789 203265 201328 199327 195129 184764 167267 155264 158084 161778 159247
35569A59247o482r235p038l463N07m075q761p878n238k477j898J882M285j267
$$ 159247 152765 143530 136492 133029 133536 129461 120700 112822 107584 105107 103209 105091 109376 108109
35555A08109o234r131o343k531j584k77J956K524N228L11n553k811k802l544o12
$$ 108109 101875 92744 86401 83870 82286 82009 83965 86489 91717 92028 86475 83664 80862 77318 76706
35540G6706J108k372j1044j2971l218N911Q497K568k523k997l860l523l969n551
$$ 76706 77814 75442 64398 51427 48209 54120 62617 65185 62662 59665 55805 52282 48313 42762
35526D2762m701k331j999k265J877P035M452k895l309o93l379k587k251m656j96
$$ 42762 38061 35730 33731 31466 33343 40378 44830 41935 38626 37933 34554 31967 29716 25060 24864
35511B4864O073M762L692M514N042n4l181n777j0027r528m551q76L951J0586Q430
$$ 24864 30937 35699 39391 43905 48947 48893 45712 39935 29908 20380 15829 14953 18904 29490 37920
35496C7920j698j2430r456l93J717M835R438M834k227J099N195K576r38k730M567
$$ 37920 36222 23792 14336 13943 15660 20495 29933 34767 32540 33639 38834 41410 40472 37742 42309
35481D2309N146Q78j292j643r69O27m03k12l722l320j278k594n43M831M705m192
$$ 42309 47455 48333 47041 45398 44429 45056 44653 44441 40719 37399 36121 33527 32984 37815 42520 38328
35465C8328p918o168j489K360P135J1160P440o59n947p394j0419j1358m005L666
$$ 38328 30410 24242 22753 25113 32248 43408 50848 50189 44242 36848 26429 15071 11066 14732
35451A4732P559M271M07k909m311l789m147K197P951P714M772l409o019o836o925
$$ 14732 22291 26562 26969 24060 19749 15960 11813 14010 21961 29675 34447 31038 25019 18183 11258
35436A1258j252J293k721K060J0427Q909K277J91M405K004o30J536M26m969j1150
$$ 11258 10006 11299 8578 10638 21065 29974 32251 32442 36847 38851 38221 39757 40183 35214 24064
35421B4064j0438F624k501A638J642L005J933N787P055P683R969N333m004j0084
$$ 24064 13626 6624 4123 1638 3280 6285 8218 14005 21060 28743 38712 44045 40041 29957
35407B9957j0396m025k999o72M092K703l695p46J307J173J148K61l473o262P06
$$ 29957 19561 15536 12537 11865 15957 18660 14965 14219 15526 16699 17847 18108 14635 8373 9079
35392I079M403L637N002M229n23k369r15p50J39m731n668k553l368B646j043L138
$$ 9079 13482 17119 22121 26350 25827 23458 22543 21793 21932 17201 11533 8980 5612 2646 1603 4741
35376D741O368L451l162p92M332k3m998D880A910F7J286J808N005N169M885N711
$$ 4741 11109 14560 11398 10606 14938 14915 9917 4880 1910 67 1353 3161 8166 13335 18220 23931
35360B3931O3o888l741q77J674n56k157N25P87j422m038J9K37j971j245L23L666
$$ 23931 23994 17106 13365 12488 14162 13606 11449 11974 12761 11339 7301 7320 7557 5586 4341 4664 8330
35343H330M516Q72j074L028M630K625j471l095j22J063K990L119K55n5N208Q305
$$ 8330 12846 13718 12644 15672 20302 22927 21456 18361 18239 19302 22292 25411 25666 25611 30819 39124
35327C9124O6o496p72P597Q818L738j475n342n934m603j348N989L221l924j0462
$$ 39124 39190 32694 31922 39519 48337 52075 50600 45258 39324 34721 33373 39362 42583 38659 28197
35312B8197j0962q6J0042M949n327n858r291C029c760o682O63d557C246J0883
$$ 28197 17235 17149 27191 32140 26813 20955 11664 3029 -3760 -10442 -9779 -4557 3246 14129
35298A4129O551k808k429k90P73M703M326P51k224m53J162K501O86p43M231O292
$$ 14129 20680 17872 15443 15153 15926 20629 24955 25706 23482 23029 24191 26692 27378 26635 30866 37158
35282C7158J825l544k750p520j0587C922b135k069l18j446k764L665B399M972
$$ 37158 38983 35439 32689 25169 14582 3922 -2135 -4204 -4522 -5968 -8732 -5067 2399 7371
35268G371N334O441M411R90M239P473L162j098o168n413n10p71o249q861l13O217
$$ 7371 12705 19146 23557 24547 28786 36259 39421 38323 32155 26742 26232 25461 19212 10351 10038 16255
35252A6255P584K301k429k722n560n960M079J3107O031m070n853l434l295m298
$$ 16255 23839 26140 23711 20989 15429 9469 13548 26655 32686 28616 22763 19329 16034 11736
35238A1736n633j874J674P65O55L688J312n299A104a691j581j236k10n744m920
$$ 11736 6103 4229 5903 6668 7323 11011 12323 7024 1104 -1691 -3272 -4508 -4718 -10462 -15382
35223a5382L387N221R57b849F552R985M127j480J796M559J889k492l655k830j953
$$ -15382 -11995 -6774 -5817 -2849 6552 16537 20664 19184 20980 25539 27428 24936 21281 18451 16498
35208A6498j046M780K404j193j585n024n655B627e232q328n295L367f827c67B562
$$ 16498 15452 20232 22636 21443 19858 14834 9179 2627 -5232 -13560 -18855 -15488 -6827 -367 2562
35192C703D85g990o062M82L782M136B76M854j359b962j691A72N057A835e778J570
$$ 3703 485 -7990 -14052 -13570 -9788 -5652 276 5130 3771 -2962 -4653 172 5229 1835 -5778 -4208
35176d208a151l374l228L185A90N067K509j682m09O576O057J315k421m794n977
$$ -4208 -1151 -4525 -7753 -4568 190 5257 7766 6084 5675 12251 18308 19623 17202 12408 6431
35161F431k918K758M076K829J100o714A216B31a64l075k058b292D185Q344R612
$$ 6431 3513 6271 10347 13176 14276 7562 1216 231 -164 -3239 -5297 -2292 4185 12529 22141
35146B2141K036q404E108d703n925l287Q79M442a686F473A77a7737p625K513P55
$$ 22141 24177 15773 5108 -4703 -10628 -13915 -13036 -8594 -1686 6473 177 -17737 -25362 -22849 -22094
35131b2094j611k876K715O007P668M790q74O39K645A24M508M309L414L914J281
$$ -22094 -23705 -26581 -23866 -17859 -10191 -5401 -6275 -5636 -2991 124 4632 8941 12355 16269 17550
35116A7550p81L099K094k312l639k956o82j388l461H97a380j18j482m1q19k124
$$ 17550 16769 19868 21962 19650 16011 13055 12373 10985 7524 897 -1380 -1498 -2980 -3021 -3840 -5964
35100e964K58J838j110l464n399p581k203O275O875K553K906J654f66r71m320
$$ -5964 -5706 -3868 -4978 -8442 -13841 -21422 -23625 -17350 -10475 -7922 -5016 -3362 -666 -1637 -5957
35085e957j182m64J23f24I955Q508O248M358J271j323m574q515o288k023j044
$$ -5957 -7139 -7603 -7480 -624 9955 18463 24711 29069 30340 29017 24443 15928 9640 7617 6573
35070F573k685p0K613M20j928c422r634l180K929M986c928J155o51A58P495K602
$$ 6573 3888 3818 6431 6851 4923 -3422 -13056 -16236 -13307 -8321 -3928 -2773 -3424 158 7653 10255
35054A0255l419j383k069O17k94j798D34L40M882P123L635k268o714k988p16j416
$$ 10255 6836 5453 3384 4001 3707 1909 434 774 5656 12779 16414 14146 7432 4444 3728 2312
35038B312M87r57b756m415r33J723A06O563K948J7k056l192A056b142n091m926
$$ 2312 2799 1842 -2756 -7171 -8104 -6381 106 6669 9617 9634 7578 4386 1056 -2142 -7233 -12159
35022a2159l289j141L897e156O92m516q97n37j015q01k304m678k108M115L528
$$ -12159 -15448 -16589 -12692 -5156 -4464 -8980 -9877 -10414 -11429 -12230 -14534 -19212 -21320 -17205 -13677
35007a3677r90m659l138Q05N988O700L497J014R48a404j344q70J577i14k32c63
$$ -13677 -14667 -19326 -22464 -21659 -15671 -8971 -5474 -4460 -3512 -1404 -2748 -3618 -2041 -914 -1146 -363
34990d776j0407l585L099Q15j667k271j459L962g473B214R552J986j540j150m10
$$ -4776 -15183 -18768 -15669 -14854 -16521 -18792 -20251 -16289 -7473 2214 11766 13752 12212 11062 10652
34975A0652R26l138A274d952k707l023m616l536J213N640d695G76Q99h14n261
$$ 10652 11578 8440 1274 -4952 -7659 -10682 -15298 -18834 -17621 -11981 -4695 776 1675 -814 -6075
34960f075n182k320j558l392L722c994D274K930k603B00d546n913k245J890J588
$$ -6075 -11257 -13577 -15135 -18527 -14805 -3994 4274 7204 4601 200 -4546 -10459 -12704 -10814 -9226
34945i226l966m702K327L464K931L274a282C203M513L230D352d062a230H272R063
$$ -9226 -13192 -17894 -15567 -12103 -9172 -5898 -1282 3203 7716 10946 4352 -4062 -1230 8272 17335
34930A7335M236K991l121q624m522r30k594F05a906A4N65M071O546L119Q13j181
$$ 17335 21571 24562 21441 12817 8295 7365 4771 605 -1906 14 579 4650 11196 14315 15128 13947
34914A3947j789l161J004N954L000L269M909L508j929l363j548M561Q838J0554
$$ 13947 12158 8997 10001 15955 18955 22224 27133 30641 28712 25349 23801 28362 37200 47754
34900D7754J5521J1553o83n312k23K295K859M318P091J0768J4781J9505J8063
$$ 47754 63275 74828 74145 68833 68610 70905 73764 78082 85173 95941 110722 130227 148290
34887A48290R074J0823J9799K2119J9398K1909K6553K9604L1395L2232L8318M5535
$$ 148290 157364 168187 187986 210105 229503 251412 277965 307569 338964 371196 409514 455049
34875D55049M9240N1955N3859N4688M9173M2055M0119L0870J8849J2853P120q426
$$ 455049 504289 556244 610103 664791 713964 756019 796138 827008 845857 858710 865830 857404
34863H57404j5709k3941l4842m1380m4444m4127m2577m4316m6844m4698l9273
$$ 857404 841695 817754 782912 741532 697088 652961 610384 566068 519224 474526 435253
34852D35253m0022l7738k8007k1047j0357n045q315j1334k949Q053P228N229Q502
$$ 435253 395231 357493 329486 308439 298082 293037 284722 273388 270439 278492 285720 290949 299451
34839B99451J3633K1966K9460L3644K9732K4941K7422L3549M2347M5729M3618
$$ 299451 313084 335050 364510 398154 427886 452827 480249 513798 556145 601874 645492
34828F45492M7336M7654L9151L5826L3413K1797J0966N094m083k2844l4010l4777
$$ 645492 692828 740482 779633 815459 848872 870669 881635 886729 882646 859802 825792 791015
34816G91015m3114n2241n0327m7895n1051n2018m6337l6270l5759m4712n0125
$$ 791015 747901 695660 645333 597438 546387 494369 448032 411762 376003 331291 281166
34805B81166m0729k4320j6387j0980j4685j9603k1489j9653j0024n13J315l557
$$ 281166 240437 216117 199730 188750 174065 154462 132973 113320 103296 102783 104098 100541
34793A00541j0296r445m265m395j2697j4083r595l731M694P048K219J141r2k273
$$ 100541 90245 80800 76535 72140 59443 45360 35765 32034 36728 43776 45995 47136 47044 44771
34779D4771l90M399j2p216o769j0674j1989j156J1138J2696L195k035m440l374
$$ 44771 44381 48780 48768 41552 34783 24109 12120 10964 22102 34798 37993 35958 31518 28144
34765B8144n330p432k381m60E057B51L06J694N766O458P732N977K525J477k649
$$ 28144 22814 15382 13001 12541 5057 251 557 2251 8017 14475 22207 28184 30709 32186 29537
34750B9537o073r297A589c768J582M75M77j576l828J642a50k475k469b243G78
$$ 29537 23464 14167 1589 -3768 -2186 -1711 -1234 -2810 -6638 -4996 -150 -2625 -5094 -2243 778
34734b150m182m859J219c253B151Q083N534j735l531C814H33b895n998k255M667
$$ -2150 -6332 -11191 -9972 -3253 2151 10234 15768 14033 10502 3814 833 -2895 -8893 -11148 -6481
34719f481c052b62E752N603N936k111E580a935B375N380B622g369o737k189L508
$$ -6481 -3052 -262 5752 11355 17291 15180 5580 -1935 2375 7755 2622 -7369 -14106 -16295 -12787
34704a2787b702G821n31d814j1371m512j684J78L024N042M106m05k107j926k333
$$ -12787 -2702 7821 7290 -4814 -16185 -20697 -22381 -22203 -19179 -14137 -10031 -10436 -12543 -14469 -16802
34689a6802L881N476J664k6a12F054B534e458o251l465r81O143d540k005l953
$$ -16802 -12921 -7445 -5781 -5807 -112 6054 2534 -5458 -11709 -15174 -16155 -10012 -4540 -6545 -10498
34674a0498k560o68L114c660D483M043K2M93K586K071n619b814o470m0L682b698
$$ -10498 -13058 -13726 -10612 -3660 4483 8526 8548 9041 11627 13698 8079 -2814 -9284 -9324 -5642 -2698
34657e152o689m493M236d194H26O91d720j0940m420L855M057P17N034b104m635
$$ -5152 -11841 -16334 -12098 -4194 826 1517 -4720 -15660 -20080 -16225 -12168 -11451 -6417 -2104 -6739
34642f739q495k425Q809b309m843k637J704l27j263j588J881M49p92L9o80J206
$$ -6739 -15234 -17659 -8850 -2309 -7152 -9789 -8085 -8412 -9675 -11263 -9382 -8933 -9725 -9686 -10366 -9160
34626i160J934k561o637j392K016J962L612b700p74k239K679d32A566k96M42M121
$$ -9160 -7226 -9787 -16424 -17816 -15800 -13838 -10226 -2700 -3474 -5713 -3034 -432 1566 1270 1712 5833
34610E833L848j378j762P80o67k809A405b09n353q442o986m326M052P845J913
$$ 5833 9681 8303 6541 7321 6654 3845 1405 -209 -5562 -14004 -20990 -25316 -21264 -13419 -11506
34595a1506r305r255M99P534J0871b570G55C4J300D84d81A505a278p907o983R45
$$ -11506 -20811 -30066 -29567 -22033 -11162 -2570 755 34 1334 484 -481 1505 -1278 -9185 -16168 -15223
34579a5223e442E180P311K595O25q03j063j560m596F85g716p116l097K307L682
$$ -15223 -5442 5180 12491 15086 15711 14908 13845 12285 7689 685 -7716 -14832 -17929 -15622 -11940
34564a1940J667K104J31j396j648j08k25J306K336J513a645G448O642j655k184
$$ -11940 -10273 -8169 -8038 -9434 -11082 -11190 -11415 -10109 -7773 -6260 -1645 7448 14090 12435 10251
34549A0251j174k958k57B674c172n257k649l060p350o300l45M926a1163A199P323
$$ 10251 9077 6119 5862 2674 -3172 -8429 -11078 -14138 -21488 -27788 -28133 -23207 -11163 1199 8522
34534H522J982C784f505o352j316M198L599b925j292j1366q287k862m260j632
$$ 8522 10504 3784 -6505 -12857 -14173 -9975 -6376 -2925 -4217 -15583 -23870 -26732 -30992 -32624
34520c2624M684R239M756L239M482F33O938L839M309J589j781m972C326a846k918
$$ -32624 -27940 -18701 -13945 -10706 -6224 633 7571 11410 15719 17308 15527 10555 3326 -1846 -4764
34505d764m40k95n820n930Q25N154e023J462n964m703P47M787L815A439R471O065
$$ -4764 -5204 -5499 -11319 -17249 -16424 -11270 -5023 -3561 -9525 -14228 -13481 -8694 -4879 1439 10910 16975
34489A6975k007n885D337C19d100m991n580o409r29L868N340O060f57D551A898
$$ 16975 14968 9083 4337 319 -4100 -9091 -14671 -21080 -22009 -18141 -12801 -6741 -657 4551 1898
34473b841J158P77l713l585J047J580M73Q92k574mm53n232k371L9k975M631e006
$$ -2841 -1683 -906 -4619 -8204 -7157 -5577 -5104 -4212 -6786 -6790 -7243 -12475 -14846 -14807 -17782 -13151 -5006
34455h364r405k273K362N374e762D28R589R257L705k038n61J200j844p519A107
$$ -8364 -17769 -20042 -17680 -12306 -5762 428 10017 19274 22979 20941 20380 21580 19736 12217 1107
34439h163l079d857G268L810C382d590o673m592J380M446N10k458K405L754R23
$$ -8163 -11242 -4857 7268 11078 3382 -4590 -11263 -15855 -14475 -10029 -9519 -11977 -9572 -5818 -4895
34424d895k086n966j281J585m297l284k638l627m561q871o951k278L767J1485
$$ -4895 -6981 -12947 -14228 -12643 -16940 -20224 -22862 -26489 -31050 -39921 -46872 -49150 -45383 -33898
34410c3898J2858h677C539Q542K728P73k894m897j643r45M52n97j352j284e578
$$ -33898 -21040 -8677 3539 12081 14809 15582 12688 7791 6148 5203 5655 5058 3706 2422 -5578
34394a7643n957N104O445k362l718k039J008O637e504J745l949q675r405k55N110
$$ -17643 -23600 -18496 -12051 -14413 -18131 -20170 -19162 -12525 -5504 -3759 -7708 -16383 -25788 -26043 -20933
34379b0933N152M312k404o395P50M129M150N058a142B85K218Q81a388q764j888
$$ -20933 -15781 -11469 -13873 -20268 -19518 -15389 -11239 -6181 -1142 285 2503 3384 -1388 -10152 -12040
34364a2040K139n62J652K459r67l345M49J076k534l381M125Q95k574L722b302
$$ -12040 -9901 -10463 -8811 -6352 -7319 -10664 -10215 -9139 -11673 -15054 -10929 -10034 -12608 -8886 -2302
34348F69M14a092l109F56O408j296j214N508K659n880j337J177k467I3c973m271
$$ 669 1083 -1092 -4201 656 7064 5768 4554 10062 12721 6841 5504 6681 4214 93 -3973 -8244
34332h244K750D749J965E7f171k72c036O92j637J513B522Q7F4a716n88A075K422
$$ -8244 -5494 4749 6714 57 -6171 -6443 -3036 -2344 -3981 -2468 2522 2609 64 -1716 -2304 1075 3497
34315C497a216q850o050p34J340j710o097l048J836m471o307L052Q275P122N052
$$ 3497 -1216 -10066 -16116 -16850 -15510 -17220 -23317 -26365 -24529 -29000 -35307 -32255 -23980 -16858 -11806
34300a1806L036j04l309J121N316a201F526O808O020O684Q984P669J264j491m59
$$ -11806 -8770 -8874 -12183 -11062 -5746 -1201 6526 13334 19354 26038 35022 42691 43955 42464 42005
34285D2005m109q429q642p120n179j383j001A185h31C478J648k117j127J861P085
$$ 42005 37896 29467 20825 13705 8526 7143 6142 1185 -831 3478 5126 3009 1882 3743 10828
34270A0828O620k752C197a2490r224l435K623a0842G48O94c362j106D669J6118
$$ 10828 17448 14696 3197 -12490 -21714 -25149 -22526 -10842 748 1442 -3362 -4468 4669 20787
34256B0787P223p735p144m152a355r336k722K971K320K769a148j476m845r21K100
$$ 20787 28010 20275 13131 8979 -1355 -10691 -13413 -10442 -8122 -5353 -1148 -2624 -7469 -8390 -6290
34241f290M56J373A02P545O272L993L3L25l617F026d713j0418k914L748K187k25
$$ -6290 -5834 -4461 102 7647 13919 17912 17945 18270 14653 6026 -4713 -15131 -18045 -14297 -12110 -12335
34225a2335J614d589c83k748r92l61d87E513P781L263K466K287m374H273B543
$$ -12335 -10721 -4589 -383 -3131 -4123 -4484 -487 5513 13294 16557 19023 21310 16936 8273 2543
34209a764q498m322L882Q02k243l59M1K834J130l875p16K782N009D2J30b365l31
$$ -1764 -10262 -14584 -10702 -9900 -12143 -12502 -12461 -9627 -8497 -12372 -13088 -10306 -5297 42 172 -2365 -2696
34192b696A901L850k262b881m702b923D059j353r4N917N842q9n158C154b897o414
$$ -2696 1901 5751 3489 -2881 -7583 -2923 4059 2706 2612 8529 14371 14282 9124 3154 -2897 -9311
34176i311m483j218k371K92N455K165L142h74C222L334j096K274K149J518M051
$$ -9311 -13794 -15012 -17383 -17091 -11636 -9471 -6329 -874 3222 6556 5460 7734 9883 11401 15452
34161A5452j833n125I77g847m423K351M343g29E257j350e884j019a906Q5b82E713
$$ 15452 13619 8494 977 -7847 -12270 -9919 -5576 -729 5257 3907 -5884 -6903 -1906 -1821 -282 5713
34144A0718j416B175h368j0018q525k740r83l492n064P817J0708q51j075L419
$$ 10718 9302 2175 -8368 -18386 -26911 -29651 -30634 -34126 -39190 -31373 -20665 -21516 -22591 -19172
34130a9172J270K207K991J098J314k70p63L888c3C271B04c392O97j115j080J92
$$ -19172 -17902 -15695 -12704 -11606 -10292 -10562 -11325 -7437 -33 3271 204 -3392 -2695 -3810 -4890 -4698
34114d698R54J292G71J0938J0514N865J544p216j1171D70h540n718J61J021J349
$$ -4698 -3744 -2452 771 11709 22223 28088 29632 22416 11245 470 -8540 -14258 -14097 -13076 -11727
34099a1727N330C813J2501Q419J010n162l367k907l639I69f713b279C539K804
$$ -11727 -6397 3813 16314 24733 25743 20581 17214 14307 10668 969 -6713 -2279 3539 6343
34085F343j10F27a222h3n859l673n46Q39K013l314r627m205p7p096k548P876a2679
$$ 6343 6233 627 -1222 -83 -5942 -9615 -10161 -9322 -7309 -10623 -20250 -24455 -24532 -31628 -34176 -26300 -12679
34067B410Q552k498G05a0341j1792m772n23K75L501P722O613p4l812l687p584
$$ 2410 10962 8464 705 -10341 -22133 -26905 -27428 -27153 -23652 -15930 -9317 -9391 -13203 -16890 -24474
34052b4474l241K745L935L654M182j33l552n694l432M676M523N620d782l753o362
$$ -24474 -27715 -24970 -21035 -17381 -13199 -13332 -16884 -22578 -26010 -21334 -16811 -11191 -4782 -8535 -14897
34037a4897K554N381K978a352q01J058A873J614e62p197l426P05L790b84D817
$$ -14897 -12343 -6962 -3984 -1352 -2153 -1095 1873 3487 -562 -7759 -11185 -10480 -6690 -284 4817
34021F188J678L142J729J009k182B592e385m252k058j624J701N533b911j685p44
$$ 6188 7866 11008 12737 13746 11564 2592 -5385 -9637 -11695 -13319 -11618 -6085 -2911 -4596 -5340
34006e340p30n804k071d561F183L578J426r27K418j907B324c540J035D237k056
$$ -5340 -6070 -11874 -13945 -4561 6183 9761 11187 10260 12678 10771 2324 -3540 -2505 4237 2181
33991B181f910o433m70N160K072J788A140M753A821d550l951m039J32K127c805
$$ 2181 -6910 -13343 -13813 -8653 -6581 -4793 1140 5893 1821 -4550 -8501 -12540 -12408 -10281 -3805
33975E609M036B394h060o717j638K487J934M249A643N353c61p951k541j619o69
$$ 5609 9645 2394 -8060 -14777 -16415 -13928 -11994 -7745 1643 6996 -361 -8312 -10853 -12472 -13141
33960a3141k086n47Q4K602M732c540B859J360j910R13j604d228j2137q307M878
$$ -13141 -15227 -15774 -15690 -13088 -8356 -3540 2859 4219 2309 3222 1618 -4228 -16365 -24672 -19794
33945a9794R051L726o21J75k378o883k821K547P030c477H12a008m146n048o360
$$ -19794 -10743 -7017 -7638 -7463 -9841 -16724 -19545 -16998 -9968 -3477 812 -1008 -5154 -10202 -16562
33930a6562R41O324a865A048j4b042j402j248k749k945K103a147C609J47i09m518
$$ -16562 -15621 -9297 -1865 1048 1034 -2042 -3444 -4692 -7441 -10386 -8283 -1147 3609 3756 -909 -5427
33914e427l018K71n1m30J136p28J30O52l422n214o108j606J088j558L581N739
$$ -5427 -8445 -8174 -8225 -8655 -7519 -8247 -8117 -7465 -10887 -16101 -22209 -23815 -22727 -24285 -20704 -14965
33898a4965L739j960l898K454K964K635j541o045l332l250l691L453K690k733
$$ -14965 -11226 -13186 -17084 -14630 -11666 -9031 -10572 -16617 -19949 -23199 -26890 -23437 -20747 -23480
33884b3480o349j873J0305g790B109R338K351o649d05m461j223M77K754B178a803
$$ -23480 -29829 -31702 -21397 -7790 2109 11447 13798 7149 -405 -4866 -6089 -5612 -2858 2178 -1803
33868a2433n127k731l110m074n390L132P601K219o07K180L969J939O52J904L599
$$ -12433 -17560 -20291 -23401 -27475 -32865 -29733 -22132 -19913 -20520 -18340 -14371 -12432 -11780 -9876 -6277
33853f277K197j798l616R46c607B869N376j776e065j2286l687L665K690k644k312
$$ -6277 -4080 -5878 -9494 -8548 -3607 2869 8245 6469 -5065 -17351 -21038 -17373 -14683 -17327 -19639
33838a9639k712k331M206Q638e112A277N206M324N749J589n50N81J246m57m535
$$ -19639 -22351 -24682 -20476 -11838 -5112 1277 6483 10807 16556 18145 17595 18176 19422 18965 14430
33823A4430F325k260p06F30N177O867K31K453O775J159l889o218m461C331e14
$$ 14430 6325 4065 3359 630 5807 12674 12905 15358 22133 23292 19403 13185 8724 3331 -514
33807B444Q86f90k792j347k428j381j441l20j263l374l974n94j083j322j692o33
$$ 2444 3330 -690 -3482 -4829 -7257 -8638 -10079 -10399 -11662 -15036 -19010 -19604 -20687 -22009 -23701 -24334
33791b4334M726i669a890E998R021O383K1o514E967e032m016J267l855p526L08
$$ -24334 -19608 -9669 -1890 5998 15019 21402 21423 14909 5967 -5032 -9048 -7781 -11636 -19162 -18854
33776a8854L964M701c871p90q847o442M051d569E863N841j38r85k655j317L971
$$ -18854 -14890 -10189 -3871 -4661 -13508 -19950 -15899 -4569 5863 11704 11566 10581 7926 6609 10580
33761A0580N712J769j458m868j518n10k339k102A871o24N604J1366O637k688o028
$$ 10580 16292 18061 16603 11735 10217 9707 7368 5266 1871 1247 6851 18217 24854 22166 16138
33746A6138l077j161l352F48g749l307L289K099j901c086E365N718J024m197C805
$$ 16138 13061 11900 8548 648 -7749 -11056 -7767 -5668 -7569 -3086 5365 11083 12107 7910 3805
33730D529M751O207K426K00k811k923j290M753P598N434j847r099q578k816j473
$$ 4529 9280 15487 17913 18113 15302 12379 11089 15842 23440 28874 27027 17928 9350 6534 5061
33715E061j238j199g11K04F538O314M044K565N243M754l638j0793p439L193O236
$$ 5061 3823 2624 -711 -507 6538 12852 16896 19461 24704 29458 25820 15027 7588 10781 17017
33700A7017K299j888M27O616Q622J844l185l101K570J087l001m341j356J536j055
$$ 17017 19316 17428 17855 24471 33093 34937 31752 28651 31221 32308 29307 24966 23610 25146 24091
33685B4091J939M167K713O902N848J592K735N911L120m883r755n437n418n135
$$ 24091 26030 30197 32910 39812 45660 47252 49987 55898 59018 54135 44380 38943 33525 28390
33671B8390k297K071J022m629p889G001a549o197l481L328J478H51J1247O367
$$ 28390 26093 28164 29186 24557 16668 7001 -1549 -7746 -11227 -7899 -6421 851 12098 18465
33657A8465J491n27l015l027k901q15M522O043R125M042m399m964J774M1J21L606
$$ 18465 19956 19429 16414 13387 10486 9671 14193 20236 29361 33403 29004 24040 25814 25855 25976 29582
33641B9582M841O34l252k948n505m736m379M72Q726Q809M929Q95l62j59m733q505
$$ 29582 34423 35057 31805 28857 23352 18616 14237 14709 23435 32244 37173 38068 37706 37547 32814 24309
33625B4309q243n711j271O813Q261M221j134l492j441N71M562R510P299Q32m523
$$ 24309 16066 10355 9084 15897 24158 28379 27245 23753 22312 22883 27445 36955 44254 45086 40563
33610D0563n739k504l122m826k669J746n35q95K915R1J668N872L358L503M678
$$ 40563 34824 32320 29198 24372 21703 23449 22914 22019 24934 25025 26693 32565 35923 39426 44104
33595D4104K360o277r596n371O40Pm340m227o371E086B222E18f56A834N405N912
$$ 44104 46464 40187 30591 25220 25860 25867 21527 17300 10929 5086 2222 518 -656 1834 7239 13151
33579A3151q54C747b700k057K3R34J306D685R203O909q59G496c015a78E518J104
$$ 13151 12297 3747 -2700 -4757 -4734 -3800 -2494 4685 13888 20797 19938 7496 -3015 -178 5518 6622
33563F622J516O12J968L138P62k738p11J896L351N130L917K212J73R26J790J301
$$ 6622 8138 8750 10718 13856 14618 11880 11169 13065 16416 21546 25463 27675 27848 28774 30564 31865
33547C1865k262n442l964l240J65N239O434M488k842j1012G505B393P08N154O226
$$ 31865 29603 24161 20197 16957 17122 22361 28795 33283 30441 19429 7505 2393 3101 8255 14481
33532A4481K0F560G68K236O098J0446M188n923G124B387K642J513B312G64O307
$$ 14481 14501 6560 768 3004 9102 19548 23736 17813 7124 2387 5029 6542 2312 764 7071
33517G071P806K381n253n887j637K527K337O544Q968J032o231G660h482j4627
$$ 7071 14877 17258 12005 6118 4481 7008 9345 15889 24857 25889 19658 7660 -8482 -23109
33503b3109r385m59O355Q082O456L663L754K132j741j631k429j275J588c012C391
$$ -23109 -32494 -32953 -26598 -18516 -12060 -8397 -4643 -2511 -4252 -5883 -8312 -9587 -7999 -3012 3391
33487A1049M952L291L183np64K002j107r467A683d579L94A821K900j077M637K522
$$ 11049 16001 19292 22475 22470 21706 23708 22601 13134 1683 -4579 -4185 1821 4721 3644 8281 10803
33471A0803j006k05L272J296L317N593M554p65l623K611K310p169E108i999p300
$$ 10803 9797 9592 12864 14160 17477 23070 27624 26859 23236 25847 28157 20988 5108 -9999 -17299
33456a7299m710r04O131O545d664C686P738N440j592G467j720M356R2C237f00
$$ -17299 -22009 -22913 -16782 -10237 -4664 3686 11424 16864 15272 7467 5747 10103 10195 3237 -600
33440A892J523O26H31c159J404O54L45o915p896j895k761k26m14k529j242J477
$$ 1892 3415 4041 831 -3159 -1755 -1101 -756 -7671 -15567 -17462 -20223 -20449 -20863 -23392 -24634 -23157
33424b3157P136P096c064B569M385J188l232A908K336J428A314c161j674K168
$$ -23157 -16021 -8925 -3064 2569 6954 8142 4910 1908 4244 5672 1314 -3161 -4835 -2667
33410b667B524L945O300j281D696j52O225J0807J0021L587j766J465K316k696
$$ -2667 2524 6469 12769 11488 4696 4544 10769 21576 31597 35184 33418 34883 37199 34503
33396C4503n519p72j051o736H972k958P748Q931P827P386M968m072j1050r194
$$ 34503 28984 28212 27161 20425 8972 6014 13762 22693 30520 37906 42874 38802 27752 18558
33382A8558k45P810P26p372o644o008k237M24m83j696m81J31K623M228J055O949
$$ 18558 18313 26123 26849 19477 12833 6825 4588 5012 4529 2833 2352 2483 5106 9334 10389 17338
33366A7338J0379K913o858p170k683l391C446k87J0123J0024O641m19r67r83k042
$$ 17338 27717 30630 23772 16602 13919 10528 3446 3159 13282 23306 29947 29528 28561 27578 25536
33351B5536k171P15M249K276j397R7J54j804k090o164o733J593N043K719M122
$$ 25536 23365 24080 28329 30605 29208 29305 29459 27655 25565 19401 12668 14261 19304 22023 26145
33336B6145P296J620n203m834k97M14m43M487Q643R00m999n223n41Q869R153M905
$$ 26145 33441 35061 29858 25024 24727 25141 24698 29185 37828 38728 33729 28506 27965 36834 45987 50892
33320E0892k678m665p79N599Q072Q440J180p214m778m579p372l806K083L587J731
$$ 50892 48214 43549 42770 48369 56441 64881 66061 58847 54069 49490 42118 38312 40395 43982 45713
33305D5713j019q36P49K027O275K719p108r150l047K157R46k115o297m099L32
$$ 45713 44694 43858 44607 46634 52909 55628 48520 39370 36323 38480 39426 37311 31014 26915 27247
33290B7247L797N404Q414M824p54K91N663R018N601l027n091l291m313k913R19
$$ 27247 31044 36448 44862 49686 48932 49223 54886 63904 69505 66478 61387 58096 53783 50870 51789
33275E1789j052o979l452K008O008Q751P302O011M237l120q351o876n515q375
$$ 51789 50737 43758 40306 42314 48322 57073 64375 70386 74623 71503 63152 56276 50761 42386
33261D2386o642k08J637K611k70n368r854r637l034K373M570J0855J2569P677
$$ 42386 35744 35536 37173 39784 39514 34146 24292 14655 11621 13994 18564 29419 41988 49665
33247D9665N842M244p74p950m550M010m401q432J927N648L149J140j246m295m446
$$ 49665 55507 59751 58977 51027 46477 50487 46086 37654 39581 45229 48378 49518 48272 43977 39531
33232C9531k832n34j892l788k357P95R73N509R528Q994L147l437j986j185L246
$$ 39531 36699 36165 34273 30485 28128 28923 29896 35405 44933 53927 57074 53637 51651 50466 53712
33217E3712L517l855l601o7P3K736J981K07O788N291J849M13M335O049j537m683
$$ 53712 57229 53374 49773 49706 49779 52515 54496 54703 61491 66782 68631 69044 73379 79428 77891 73208
33201G3208L42M389L060R89J495k51j957n976q503n452K135R082J1103P361M82
$$ 73208 73550 77939 80999 81988 83483 83232 81275 75299 66796 61344 63479 72561 83664 91025 91507
33186I1507K0P005Q280L223m743q154j1097j4278j2666n500m65L570Q336R104
$$ 91507 91527 98532 106812 110035 105292 97138 86041 71763 59097 53597 53132 56702 65038 74142
33172G4142R729Q400K510K492O450K598n270r623n631m6N336O626L579K79k524
$$ 74142 83871 92271 94781 97273 103723 106321 101051 91428 85797 85751 91087 97713 101292 101571 99047
33157I9047p220j0134m383J370O62m9j946j962p94N596N518Q70l488R64Q018L204
$$ 99047 91827 81693 77310 78680 79342 79293 77347 75385 74591 80187 85705 86575 83087 84051 92069 95273
33141I5273k253j667n51Q74M935P189Q984J0005K088k908l569m48M856m17r204
$$ 95273 93020 91353 90802 91676 96611 103800 112784 122789 124877 121969 118400 117952 122808 122391 113187
33126A13187o503l86p031j4935q903J430L924O687Q764K345k350N71q63m204m942
$$ 113187 106684 106298 99267 84332 75429 76859 80783 87470 96234 98579 96229 96800 95937 91733 86791
33111H6791K456R738P204Q7k607J138O325P714Q470N850j741m916M48N245K416
$$ 86791 89247 98985 106189 106276 103669 104807 111132 118846 127316 133166 131425 126509 126957 132202 134618
33096A34618l520j146L688M110J557j587o62N238P966N965K572n091n983M90J543
$$ 134618 131098 129952 133640 137750 139307 137720 137058 142296 150262 156227 158799 153708 147725 148215 149758
33081A49758M098N208O021L514j027n525j073K978k880m460L102O388K804M598
$$ 149758 153856 159064 165085 168599 167572 162047 160974 163952 161072 156612 159714 166102 168906 173504
33067A73504P531K802l585n287j569P02k651N9L060k081j0812j2347o601l410
$$ 173504 181035 183837 180252 174965 173396 174098 171447 171506 174566 172485 161673 149326 142725 139315
33053A39315l881k052M867J5147J6783J4013J5493J0141K362M243O89n422Q30
$$ 139315 135434 133382 138249 153396 170179 184192 199685 209826 212188 216431 217120 211698 212528
33040B12528M758M898L381K289N619J2557J0818K627k02J562k054q344o860q38
$$ 212528 217286 222184 225565 227854 233473 246030 256848 259475 259273 260835 258781 250437 243577 242739
33026B42739QJ962N978K658L049N236P768Q254N63n885n989M408P041M420L796
$$ 242739 242747 244709 250687 253345 256394 261630 269398 277652 278215 272330 266341 270749 277790 282210 286006
33011B86006N042K968q05k011l866n992o719J752J1060P937L39j357M985J0062
$$ 286006 291048 294016 293211 291200 287334 281342 274623 276375 287435 295372 295711 294354 299339 309401
32997C09401L329L190J2289J2426R884J0226N805K144J863N206O544M396k697
$$ 309401 312730 315920 328209 340635 350519 360745 366550 368694 370557 375763 382307 386703 384006
32984C84006n45N337M420M042P082O851L163L063O148J0228Q607K566K918M857
$$ 384006 383461 388798 393218 397260 404342 411193 414356 417419 423567 433795 442402 444968 447886 452743
32970D52743N735L127M62K99K130K465m125n256j013P93N073N456K743k21j138
$$ 452743 458478 461605 462067 462366 464496 466961 462836 457580 456567 457360 462433 467889 470632 470411 469273
32955D69273k344J687M354K133L042M559O154Q899Q799R307N704K720L391P809
$$ 469273 466929 468616 472970 475103 478145 482704 488858 497757 506556 515863 521567 524287 527678 535487
32941E35487J1594J2556P832K857P018J5332J8010J3959J4200J6973J6244Q323
$$ 535487 547081 559637 567469 570326 577344 592676 610686 624645 638845 655818 672062 680385
32929F80385L430P480J2161R881J1534K1200K5731K0577K1865K3637J6809J5275
$$ 680385 683815 691295 703456 713337 724871 746071 771802 792379 814244 837881 854690 869965
32917H69965J5073R485R847J1889P095K501N234J0205J1243N792N546R081J1696
$$ 869965 885038 894523 904370 916259 923354 925855 931089 941294 952537 958329 963875 972956 984652
32904I84652J5516J9908K2818J8826J0673N961Q196J1721J0524J2130J7806K2326
$$ 984652 1000168 1020076 1042894 1061720 1072393 1078354 1086550 1098271 1108795 1120925 1138731 1161057
32892A161057K3516J7089J1828J2833J6666J3932J0656J4568K3686K8760K6628
$$ 1161057 1184573 1201662 1213490 1226323 1242989 1256921 1267577 1282145 1305831 1334591 1361219
32881A361219K5201K8808L2107K3880K4137K9870K6052K8875L6520M6497N0748
$$ 1361219 1386420 1415228 1447335 1471215 1495352 1525222 1551274 1580149 1616669 1663166 1713914
32870A713914M2058L5211L1775K9239L5492M4643M4649M0238M0470M1287M2609
$$ 1713914 1755972 1791183 1822958 1852197 1887689 1932332 1976981 2017219 2057689 2098976 2141585
32859B141585M3037M7389M8523N2937N9083O4115O3707O0737O3456P4292Q3094
$$ 2141585 2184622 2232011 2280534 2333471 2392554 2456669 2520376 2581113 2644569 2718861 2801955
32848B801955Q6787Q9461Q8047Q6169Q8099R4876J00684J03401J08548J15267
$$ 2801955 2888742 2978203 3066250 3152419 3240518 3335394 3436078 3539479 3648027 3763294
32838C763294J21604J29029J31032J38422J47127J52040J62718J75131J81215
$$ 3763294 3884898 4013927 4144959 4283381 4430508 4582548 4745266 4920397 5101612
32829E101612J91616K04738K11741K21639K32719K37137K51008K66304K75373
$$ 5101612 5293228 5497966 5709707 5931346 6164065 6401202 6652210 6918514 7193887
32820G193887K86534K99249L18059L40283L64855L85767M00802M24213M56846
$$ 7193887 7480421 7779670 8097729 8438012 8802867 9188634 9589436 10013649 10470495
32811A0470495M88078N16393N44556N78678O13765O48543O89926P31684P76076
$$ 10470495 10958573 11474966 12019522 12598200 13211965 13860508 14550434 15282118 16058194
32802A6058194Q28793Q77282R35169J007009J084411J168789J260479J364518
$$ 16058194 16886987 17764269 18699438 19706447 20790858 21959647 23220126 24584644
32794B4584644J481932J613795J759624J915936K091363K289360K502652K742339
$$ 24584644 26066576 27680371 29439995 31355931 33447294 35736654 38239306 40981645
32786D0981645L013434L325538L691181M111797M599082N168522N845181O654877
$$ 40981645 43995079 47320617 51011798 55123595 59722677 64891199 70736380 77391257
32778G7391257P631828Q818074J0247152J1952966J3956788J6234415J8698892
$$ 77391257 85023085 93841159 104088311 116041277 129998065 146232480 164931372
32771A64931372K1218830K3613988K5699943K7305870K8280904K8480188K7763825
$$ 164931372 186150202 209764190 235464133 262770003 291050907 319531095 347294920
32764C47294920K5972360K2944375J8599081J3052035O681516l6558o791549j3482369
$$ 347294920 373267280 396211655 414810736 427862771 434544287 434507729 427716180 414233811
32756D14233811j9882387k5437740k9441842l1400725l1328389k9705841k7190627
$$ 414233811 394351424 368913684 339471842 308071117 276742728 247036887 219846260
32749B19846260k4327106k1450416j8726126j6229673j4002580j2070701j0428183
$$ 219846260 195519154 174068738 155342612 139112939 125110359 113039658 102611475
32742A02611475r046728p893244o926086o117893n437518m861260m364861l935165
$$ 102611475 93564747 85671503 78745417 72627524 67190006 62328746 57963885 54028720
32734E4028720l563043l240705k957525k708670k486356k287242k099491j930579
$$ 54028720 50465677 47224972 44267447 41558777 39072421 36785179 34685688 32755109
32726C2755109j792043j666945j549013j440737j340561j251202j172292j096624
$$ 32755109 30963066 29296121 27747108 26306371 24965810 23714608 22542316 21445692
32718B1445692j022093r56625q95482q41360p90482p41188o96022o50757o04065
$$ 21445692 20423599 19466974 18571492 17730132 16939650 16198462 15502440 14851683 14247618
32709A4247618n69423n38907n08991m84120m59790m36240m14142l89277l63679
$$ 14247618 13678195 13139288 12630297 12146177 11686387 11250147 10836005 10446728 10083049
32700A0083049l46641l33215l21736l08753k93096k75931k61443k48243k35392
$$ 10083049 9736408 9403193 9081457 8772704 8479608 8203677 7942234 7693991 7458599
32691G458599k21277k12259k02411j85794j73357j67058j63553j64078j57432
$$ 7458599 7237322 7025063 6822652 6636858 6463501 6296443 6132890 5968812 5811380
32682E811380j45764j42716j41113j31007j20245j14592j12768j09471j08571
$$ 5811380 5665616 5522900 5381787 5250780 5130535 5015943 4903175 4793704 4685133
32673D685133j07374r9021r1778q9855r0302r0486q4532p8674p7422q0531q1591
$$ 4685133 4577759 4478738 4386960 4297105 4206803 4116317 4031785 3953111 3875689 3795158 3713567
32662C713567p4301o9376o9838o9143o8534o9027p0836p2192p2028p0057o2532
$$ 3713567 3639266 3569890 3500052 3430909 3362375 3293348 3222512 3150320 3078292 3008235 2945703
32651B945703n6350n7090n6597n0342m5385m4027l9165m1482m7629m9363m4119
$$ 2945703 2889353 2832263 2775666 2725324 2679939 2635912 2596747 2555265 2507636 2458273 2414154
32640B414154l6555l4224l6748l8720m1373m1094l6515l6059l9246m1415l6631
$$ 2414154 2377599 2343375 2306627 2267907 2226534 2185440 2148925 2112866 2073620 2032205 1995574
32629A995574l2418l1625l3162l6220l3652k9646k5234j7890j9066k6917l2978
$$ 1995574 1963156 1931531 1898369 1862149 1828497 1798851 1773617 1755727 1736661 1709744 1676766
32618A676766l7951l9310k9688j9708k0981k2476k2249k4104k8624l5542l1138
$$ 1676766 1638815 1599505 1569817 1550109 1529128 1506652 1484403 1460299 1431675 1396133 1364995
32607A364995j9272j7210j8282j3971j2251j2746q376m537o549n990j465k35n555
$$ 1364995 1345723 1328513 1310231 1296260 1284009 1271263 1262887 1258350 1251801 1245811 1244346 1244111 1238556
32594A238556j1970j3715q635q648j1813p356r142j4997j6899j5435j5103j1634
$$ 1238556 1226586 1212871 1204236 1195588 1183775 1176419 1167277 1152280 1135381 1119946 1104843 1093209
32582A093209r337j3398j4937j4053j0840p625l713m015p981j4359j5431q449
$$ 1093209 1083872 1070474 1055537 1041484 1030644 1023019 1019306 1015291 1007310 992951 977520 969071
32570I69071r270j4643j0917n892o490j1021j7484j7355j3119j5784j7696j3262
$$ 969071 959801 945158 934241 928349 921859 910838 893354 875999 862880 847096 829400 816138
32558H16138j2244j6025j7256j2826n690q88m687r805r044j2927j0322n289j2283
$$ 816138 803894 787869 770613 757787 752097 751209 746522 736717 727673 714746 704424 699135 686852
32545F86852j8634j7543j1452r078q815o405J201N013N954J329p078n324m884
$$ 686852 668218 650675 639223 630145 621330 614925 616126 621139 627093 628422 621344 616020 611136
32532F11136j2761j2995p703q892p614n682j562r76o982j0256j0244o372j94J809
$$ 611136 598375 585380 577677 568785 561171 555489 553927 552951 545969 535713 525469 519097 518903 520712
32518E20712l37n48k960o110q186o544k352Q64k493l242m140l354n670m702o476
$$ 520712 520375 519827 516867 510757 502571 496027 493675 494539 492046 488804 484664 481310 475640 470938 464462
32503D64462n406l427n139q559n365J668K265J698m352r810p205o824m821n083
$$ 464462 459056 455629 450490 441931 436566 438234 440499 442197 437845 428035 420830 414006 409185 404102
32489D04102m686K162j358o805K959O403J917l709r144k251J697m903p933j926
$$ 404102 399416 401578 400220 393415 396374 402777 404694 400985 391841 389590 391287 386384 378451 376525
32475C76525J663J803l453j1383j2445p920k299l228m015l120k044o24J86l204
$$ 376525 378188 379991 376538 365155 352710 344790 342491 339263 335248 332128 330084 329460 329646 326442
32461C26442j813N830O319P43l913r076j2370r198l343j587o363p346m119k933
$$ 326442 324629 330459 336778 337521 333608 324532 312162 302964 299621 298034 291671 284325 280206 277273
32447B77273o771j0665l077J394K364L336k944p278k108K760K836l464p890k411
$$ 277273 270502 259837 256760 258154 260518 263854 260910 253632 251524 254284 257120 253656 245766 243355
32433B43355O25J278N423J381k472k843m680o996n411K819O585K749K133M575
$$ 243355 243980 245258 250681 252062 249590 246747 242067 235071 229660 232479 239064 241813 243946 248521
32419B48521N191L384J021k945k648l095J86L702R54j332j323k646n058q820p031
$$ 248521 253712 257096 258117 255172 252524 249429 249615 253317 254271 252939 251616 248970 243912 235092 228061
32404B28061k6J831L220l70m882r138o117po315j1908k988P545J0394N94j1973
$$ 228061 228035 229866 233086 232716 227834 218696 212579 212572 206257 194349 191361 198906 209300 209894 197921
32389A97921j0468m193k891j468k968k631k951m051m73J572J619R89J768O534
$$ 197921 187453 183260 180369 178901 175933 173302 170351 166300 165827 167399 169018 170007 171775 178309
32375A78309N742K781k6k822l810n363n957k633K238L30l345m810o278m633j474
$$ 178309 184051 186832 186806 183984 180174 174811 168854 166221 168459 168789 165444 160634 154356 149723 148249
32360A48249n513o300L1j781n967n432k872N851J0896P461p71k451R72o429r777
$$ 148249 142736 136436 136467 134686 128719 123287 120415 126266 137162 144623 143852 141401 142373 135944 126167
32345A26167m940M71L401K139j105k550n622n591m656p820m051L036L521J796
$$ 126167 121227 121698 125099 127238 126133 123583 117961 112370 107714 99894 95843 98879 102400 104196
32331A04196K517K694k561m10P397O723K047Q81l26L456L278j797m50K791N302
$$ 104196 106713 109407 106846 106436 113833 120556 122603 123484 123158 126614 129892 128095 127645 130436 135738
32316A35738N761K543j296K6M238P513Q894O965L446K151M774P531O918L811N27
$$ 135738 141499 144042 142746 142772 147010 154523 163417 170382 173828 175979 180753 188284 195202 199013 199540
32301A99540k395j40N668R355O654M042O950Q366M216P413J0324J2142J8982K7003
$$ 199540 197145 197005 202673 212028 218682 222724 229674 238040 242256 249669 259993 272135 291117 318120
32287C18120L4562M0213M3692N0752N8565O9950Q1719R2430R4803R6191J02306
$$ 318120 352682 392895 436587 487339 545904 615854 697573 790003 884806 980997 1083303
32276A083303J03173R8590Q7744P5112N5417L1330N207j8862m0857o6666r3617
$$ 1083303 1186476 1285066 1372810 1447922 1503339 1534669 1539876 1521014 1480157 1413491 1319874
32265A319874j12384j20563j23134j14236r6438p7206o8725n8881n3675m9129
$$ 1319874 1207490 1086927 963793 849557 753119 675913 607188 548307 494632 445503
32255D45503l7632l3010l0950k4770j8563j5285j1355j0860j2817j2318j3780
$$ 445503 407871 374861 343911 319141 300578 285293 273938 263078 250261 237943 224163
32244B24163j1306o581n015r051j0105j1308j1883q746l431L478O823j208j3669
$$ 224163 212857 206276 201261 192210 182105 170797 158914 150168 146737 150215 157038 155830 142161
32231A42161j0046l937n353n943l389R35J1353J6256P200j903j814R34J0268J7910
$$ 142161 132115 128178 122825 116882 113493 114428 125781 142037 149237 147334 145520 146454 156722 174632
32217A74632J0716K865n92N85P422J1288P872M736P205J0565J1931J3404J5509
$$ 174632 185348 188213 187621 188206 195628 206916 214788 219524 226729 237294 249225 262629 278138
32204B78138J5264J2213J6681K3920K3388J6452J3357J4346J3622J6091J9501
$$ 278138 293402 305615 322296 346216 369604 386056 399413 413759 427381 443472 462973
32193D62973K2830L5249M6221N1325N5470O3644P2231Q0421R6629J10971J10185
$$ 462973 485803 521052 567273 618598 674068 737712 809943 890364 986993 1097964 1208149
32182A208149R8432Q5959P3800N8833L9879J5888r752l2421o0862r6182j15202
$$ 1208149 1306581 1392540 1466340 1525173 1565052 1580940 1571188 1538767 1477905 1381723 1266521
32171A266521j21788j20832j08460r5730r0472q5690p6408o3079n1963m4328l7685
$$ 1266521 1144733 1023901 915441 819711 729239 643549 567141 504062 452099 407771 370086
32160C70086l0105j9994j6698j9251k2135k3992k2236j5539p182J649K78m967
$$ 370086 339981 319987 303289 284038 261903 237911 215675 200136 192954 194603 194881 189914
32148A89914p244l461m726r922o984k190j656o950j0702q213m345J262J739j893
$$ 189914 182670 179209 174483 164561 157577 155387 153731 146781 136079 127866 123521 124783 126522 124629
32134A24629J213N959O043j025m449j963j966r04j487k274k664N04N568P647N898
$$ 124629 125842 131801 137844 136819 132370 130407 128441 127537 126050 123776 121112 121616 127184 134831 140729
32119A40729O993J1329R661O353N457O568O092O571M061J428n54L467K025k027
$$ 140729 147722 159051 168712 175065 180522 187090 193182 199753 203814 205242 204688 208155 210180 208153
32105B08153m26m435p969p189l203n502j4643j3457o691o125p971o509q287j2749
$$ 208153 207727 203292 195323 188134 184931 179429 164786 151329 144638 138513 130542 124033 115746 102997
32091A02997j4807j2983m413J723K871N571N136L167M118J648l984p544j0364
$$ 102997 88190 75207 70794 72517 75388 80959 86095 89262 93380 95028 91044 83500 73136
32078G3136n728J225J209n218q166m143k621k50K366M183K492J522J833j048j283
$$ 73136 67408 68633 69842 64624 56458 52315 49694 49444 51810 55993 58485 60007 61840 60792 59509
32063E9509J001J092J878M027O755L485J581J348K563J955K076n83j5698j4939
$$ 59509 60510 61602 63480 67507 74262 77747 79328 80676 83239 85194 87270 86687 70989 56050
32049E6050k809l91k99j425o383j0965o992q0L451N024O406J691p47O83P17o55
$$ 56050 53241 52850 52551 51126 44743 33778 26786 26706 30157 35181 41587 43278 42531 43214 43931 43276
32033D3276K92l89K409L656j488n149n735J529N922K856k760k094K548N05m840
$$ 43276 43568 43179 45588 49244 47756 42607 36872 38401 44323 47179 44419 42325 44873 45378 40538
32018D0538j210K989M7M621M363q313j5699p926L088Q210M678J323K307K820k162
$$ 40538 39328 42317 42364 46985 51348 43035 27336 19410 22498 30708 35386 36709 39016 41836 39674
32003C9674n688L54N039O63q044r298J560J3890J6200J0478p12n952p058j0488
$$ 39674 33986 34340 39379 40042 31998 22700 24260 38150 54350 64828 64116 58164 51106 40618
31989D0618j1559o999m39K581L614K913L090o04m032o025n456o040j200L79k417
$$ 40618 29059 22060 21621 24202 27816 30729 33819 33215 29183 23158 17702 11662 10462 10841 8424
31974H424j924A771d109D99R115J209j246K034P611N432o043F827e91J72D823
$$ 8424 6500 1771 -4109 499 9614 10823 9577 11611 19222 24654 18611 6827 -591 -419 4823
31958E850m48M8k234K135Q152Q073P854P081L920L225K654m261r361n325R58O667
$$ 5850 5402 5450 3216 5351 13503 21576 29430 36511 40431 43656 46310 42049 32688 27363 28321 34988
31942C4988P139M323K733n505p966j201M69p234r365k449K141j477l458K29J74
$$ 34988 42127 46450 49183 43678 35712 34511 34980 27746 18381 15932 18073 16596 13138 13367 13541
31927A3541k521K676J0300P648n13l834k196l707k58M42j833p41l785m387m219
$$ 13541 11020 13696 23996 31644 31131 27297 25101 21394 21136 21578 19745 19004 15219 10832 6613
31912F613B635K170M864L113J865m14J944L900l345m484J880N023N496L452M085
$$ 6613 2635 4805 9669 12782 14647 14233 16177 20077 16732 12248 14128 19151 24647 28099 32184
31897C2184j858l341j727k947o213m247J346J563J515o19m951D023b465A717J2637
$$ 32184 30326 26985 25258 22311 16098 11851 13197 14760 16275 15656 10705 4023 -2465 1717 14354
31882A4354J1572R433M750k01l425j493p03K879J560p652j1479q938D128j637
$$ 14354 25926 35359 40109 39908 36483 34990 34287 37166 38726 31074 19595 10657 4128 2491
31868B491M267P309Q963P648N135J222k644k858J809j496j0755q191K846K786
$$ 2491 6758 14067 23030 30678 35813 37035 34391 31533 33342 31846 21091 12900 15746 18532
31854A8532k819J161P655M877J334k005k650K907N727M402k06J026n09q613j0624
$$ 18532 15713 16874 24529 29406 30740 28735 26085 28992 34719 39121 38915 39941 39432 30819 20195
31839B0195j910M500O818P738R279O994j847n983m244L554N540m34o599q533n834
$$ 20195 18285 22785 29603 37341 46620 53614 51767 45784 41540 45094 50634 50200 43601 35068 29234
31824B9234o131n913n788k812K430Q193Q784N231L833j357k100j688p7R36l340
$$ 29234 23103 17190 11402 8590 11020 19213 27997 33228 37061 35704 33604 31916 31839 32775 29435
31809B9435l865j693k299n72L232K997O08j314m76o020I271C82K99J1874J3884
$$ 29435 25570 23877 21578 21006 24238 27235 27843 26529 26053 20033 9271 382 681 12555 26439
31794B6439O649j086R25O90p483j2034C669a124B191P169N810Q007M283P54K882
$$ 26439 33088 32002 32927 33617 26134 14100 3669 -1124 2191 9360 15170 23177 27460 28214 31096
31779C1096J002k340o259p848l16O52K585R488R026J506n928n140j699l52L28
$$ 31096 32098 29758 23499 15651 15335 15987 18572 28060 37086 38592 32664 27524 25825 25473 25801
31764B5801J036l150n811k787j057l260n082A088h34C254Q313M879L621J776K015
$$ 25801 26837 23687 17876 15089 14032 10772 5690 1088 -834 3254 11567 16446 20067 21843 23858
31749B3858K605N306R084Q625M481m841j4085j7455F407L84L327J295j2J878R721
$$ 23858 26463 31769 40853 49478 53959 49118 35033 17578 6407 6791 10118 11413 11401 13279 23000
31734B3000N38j0128D829I8f291k004K403a464F541L457l304B511M225R108J0603
$$ 23000 23538 13410 4829 98 -6291 -8295 -5892 -1464 6541 9998 6694 2511 6736 15844 26447
31719B6447M930k840m643m674o703J643R548N017j549r581B967a2666r071J325
$$ 26447 31377 28537 23894 19220 12517 14160 23708 28725 27176 17595 2967 -12666 -21737 -20412
31705b0412i736d92G272K336D292e72j40j198h96D194J148J350j478a600o636
$$ -20412 -9736 -492 7272 9608 4292 -572 -712 -1910 -896 4194 5342 6692 5214 -1600 -8236
31690h236J420B553J1372N112N48l91j796l308F416B797J0195J1697l889p245
$$ -8236 -6816 2553 13925 19037 19585 19194 17398 14090 6416 2797 12992 24689 20800 13555
31676A3555L55j47M42J923j06m103n409a34p314o334l173M302e570K420m733J229
$$ 13555 13910 13763 14205 16128 16022 11919 6510 -134 -7448 -13782 -16955 -12653 -5570 -3150 -7883 -6654
31660f654E518J1105k080o832B100i30j031a44F096Q773O135K908N13N772J2711
$$ -6654 5518 16623 14543 7711 2100 -930 -1961 -144 6096 14869 21004 23912 24425 30197 42908
31645D2908J0109M333k896q297j1262j0907p767o618D656K288P263K172o94L081
$$ 42908 53017 57350 54454 46157 34895 23988 16221 9603 4656 6944 14207 16379 15685 18766
31631A8766J091n522G087l238L758O690O019N634J268l478o623o606B909b775
$$ 18766 19857 14335 7087 3849 7607 14297 20316 25950 27218 23740 17117 10511 2909 -2775
31616c16E322K263C748b826k503g27F833N126N958O053O169L33r064r055k524
$$ -316 5322 7585 3748 -2826 -5329 -727 6833 11959 17917 23970 30139 30472 21408 12353 9829
31601I829K983P820Q140K379l959p284q989D326r39K440O190L962l553n978B982
$$ 9829 12812 20632 28772 31151 27192 19908 10919 4326 3387 5827 12017 15979 12426 6448 2982
31585d762l263L840B168O851L915q96q7K400O117J923n695l097m042j488M161
$$ -4762 -8025 -4185 2168 9019 12934 12038 11951 14351 20468 22391 16696 13599 9557 8069 12230
31570A2230M644J21l292J250K347l32P511N317M25k483q483q112E166e163j0655
$$ 12230 16874 16995 13703 14953 17300 16968 24479 29796 30221 27738 19255 11143 5166 -5163 -15818
31555a5818l131N65n32j546P019a795E613N141M604m920n098L155M960O038M972
$$ -15818 -18949 -18384 -18916 -20462 -13443 -1795 5613 10754 15358 10438 5340 8495 13455 19493 24465
31540B4465k56l007L291P117N249K928K731j25M91k040n003m829n377m935j839
$$ 24465 24209 21202 24493 31610 36859 39787 42518 42393 42884 40844 35841 31012 25635 20700 18861
31525A8861L055K711k091n970l932k541l532B958l44K504o10M36O872O705N141
$$ 18861 21916 24627 22536 16566 12634 10093 6561 2958 2614 5118 4508 4944 11816 18521 23662
31510B3662N508L003L137M037J301j180n13j75j599j278j040k818m669k156J358
$$ 23662 29170 32173 35310 39347 40648 39468 38955 38780 37181 35903 34863 32045 27376 25220 26578
31495B6578L013j319j2526E221A248h4H32L476L434M422O283N089J787m042q369
$$ 26578 29591 28272 15746 5221 1248 -84 832 4308 7742 12164 18447 23536 25323 21281 12912
31480A2912E047A858K031J1100J3911Q175l025q564k524j806l610K065O220J705
$$ 12912 5047 1858 3889 14989 28900 37075 34050 25486 22962 21156 17546 19611 25831 27536
31466B7536l57O91j348m031m900k952k121j829k566J835m94A411f214o019J684
$$ 27536 27179 27870 26522 22491 17591 14639 12518 10689 8123 9958 9464 1411 -6214 -12233 -10549
31451a0549b051F593R201Q704L519J680n05l335n702l855J893K711P82j001j15
$$ -10549 -2051 6593 15794 24498 28017 29697 29192 25857 20155 16300 18193 20904 21686 20685 20570
31436B0570M34p25l939o113B298b274B48M095N388P555L062j497L240O280K747
$$ 20570 21004 20279 16340 10227 2298 -2274 248 4343 9731 17286 20348 18851 22091 28371 31118
31421C1118J300J066j313O23M202J299n119q960n676l645p223k771N768P900N808
$$ 31118 32418 33484 32171 32794 36996 38295 33176 24216 18540 14895 7672 4901 10669 18569 24377
31406B4377J309n399m86L460L865J45j375m10k4K29k441l160L976Q085K003Q4
$$ 24377 25686 20287 19801 23261 27126 27271 25896 25486 25462 25691 23250 20090 24066 32151 34154 34238
31390C4238L718M529J962l884m379j869k417n653k488p03L72P536N269m96M489
$$ 34238 37956 42485 44447 40563 36184 34315 31898 26245 23757 23054 23426 30962 36231 35735 40224
31375D0224M204k727j07j801j359l102r362o055M11J279Q24j868j447K803J706
$$ 40224 44428 41701 41594 39793 38434 35332 25970 19915 20326 21605 22429 20561 19114 21917 23623
31360B3623n700l171N393O744L212j713M516Q579M148L180k470r877o382J379
$$ 23623 17923 14752 20145 26889 30101 28388 32904 41483 45631 48811 46341 36464 30082 31461
31346C1461O042k55m372l213l25L753J683j187j095l900m484k433m025l110O73
$$ 31461 37503 37248 32876 29663 29338 33091 34774 33587 32492 28592 24108 21675 17650 14540 15213
31331A5213K032R005J2878M772J561J006r29O88K808M32K924O802R715P645L649
$$ 15213 17245 26250 39128 43900 45461 46467 45538 46226 49034 49466 52390 59192 68907 76552 80201
31316H0201O519P192N195K723m718l61J1209J0042R84j573K809K547P141J4768
$$ 80201 86720 93912 99107 101830 97112 96751 107960 118002 118986 117413 120222 122769 129910 144678
31302A44678J6727J1188N526R753J5611J6513J5937J8448K1925K3545K3409K9533
$$ 144678 161405 172593 178119 187872 203483 219996 235933 254381 276306 299851 323260 352793
31290C52793M3699N4066O4765P0024P3093Q1962R6811J02340R6973R5158R5749
$$ 352793 396492 450558 515323 585347 658440 740402 837213 939553 1036526 1131684 1227433
31279A227433R7909R9182R7978R2029Q3141O3899M1990K2996N946o112k3421m0646
$$ 1227433 1325342 1424524 1522502 1614531 1697672 1761571 1803561 1826557 1832503 1826391 1802970 1762324
31267A762324n7801p6885r3425j06878j12198j18146j19280j13177j08091r2012
$$ 1762324 1704523 1627638 1534213 1427335 1315137 1196991 1077711 964534 856443 764431
31257G64431p8249o2144m8817m5044m7138l9756l0581k9555k9474k7236k0302
$$ 764431 686182 624038 575221 530177 483039 443283 412702 383147 353673 326437 306135
31246C06135j7595j4624j1595j2415r403o535q138p432l133J211m032j4080j4128
$$ 306135 288540 273916 262321 249906 240503 233968 225830 218398 215265 216476 212444 198364 184236
31233A84236o606J177j479m899o705m679m193p646j455O077Q016L706J113j354
$$ 184236 177630 178807 177328 172429 165724 161045 156852 149206 147751 153828 161844 165550 166663 165309
31219A65309k129O363P582N186J4258J4352J839k055o3N700J1627J1048J4577
$$ 165309 163180 169543 177125 182311 196569 210921 212760 210705 210642 216342 227969 239017 253594
31206B53594J9748J9381K1432K3813K5410L0880L6193L9294M3781M9613O3298
$$ 253594 273342 292723 314155 337968 363378 394258 430451 469745 513526 563139 626437
31195F26437P9511Q5571Q5468Q5617R3175J04626J11774J12296J10126R9215Q3099
$$ 626437 705948 791519 876987 962604 1055779 1160405 1272179 1384475 1494601 1593816 1676915
31184A676915P8164P1462M8724K8321J7883N442j9379n1876p5586q9021r3523
$$ 1676915 1755079 1826541 1875265 1903586 1921469 1926911 1907532 1855656 1780070 1691049 1597526
31173A597526j02921j18065j28999j32534j20474r9558q7971p8904o9542n8862
$$ 1597526 1494605 1376540 1247541 1115007 994533 894975 807004 728100 658558 599696
31163E99696n4283n5923m9913l7282k8915k5265j8985j8078k1271j5501q430j6782
$$ 599696 545413 489490 439577 402295 373380 348115 329130 311052 289781 274280 265850 249068
31151B49068k0925j6070q669q612j1165p516o527n376j0640j7964j7538j5227
$$ 249068 228143 212073 203404 194792 183627 176111 169584 164208 153568 135604 118066 102839
31139A02839j2541n929j80J076L302J261l257o494m227N139P613m3n641n830q93
$$ 102839 90298 84369 84189 85265 88567 89828 86571 80077 75850 80989 88602 88559 82918 77088 76195
31124G6195L8m266p739p354l810l913o267n301l629k079k520l908j962J433Q880
$$ 76195 76233 71967 64228 56874 53064 49151 42884 37583 33954 31875 29355 25447 23485 24918 33798
31109C3798J1818Q70p304m859o439m585M219O635P296L044m106n024k061O14L89
$$ 33798 45616 46486 39182 34323 27884 23299 27518 34153 41449 44493 40387 35363 33302 33916 34305
31094C4305l752p130o586l291m589m159k03K695L291Q19l93j436m176J69N462
$$ 34305 30553 23423 16837 13546 8957 4798 4595 7290 10581 11400 11007 9571 5395 5564 11026
31079A1026L636m20k285J128K259j730o39J749J940k622F928B362K515N369M721
$$ 11026 14662 14242 11957 13085 15344 13614 12975 14724 16664 14042 6928 2362 4877 10246 14967
31064A4967P24J886p96j100O613J1319K934k516K255o038q876k905N321N821k849
$$ 14967 15691 17577 16781 15681 22294 33613 36547 34031 36286 30248 21372 18467 23788 29609 26760
31049B6760o478l709J736j726o186l148L39J990M079n68F451E29J80a975m436
$$ 26760 20282 16573 18309 16583 10397 7249 7588 9578 13657 13089 6451 529 709 -1975 -6411
31034f411k655r06K034c701D0a237k665J76l205r005n086J896K509K386K30m355
$$ -6411 -9066 -9972 -7938 -3701 40 -1237 -3902 -3726 -6931 -15936 -21022 -19126 -16617 -14231 -14001 -18356
31018a8356j158K175Q200A487O403M224j52j148P622J1611R61l629m05n284r043
$$ -18356 -19514 -17339 -9139 1487 7890 12114 11962 10814 18436 30047 31008 27379 26974 21690 12647
31003A2647C821e430n521L778C230P551q82j970L252N260j136n947D290r14L428
$$ 12647 3821 -5430 -10951 -7173 3230 10781 9899 7929 11181 16441 15305 9358 4290 3376 6804
30988F804M892K054m720l903B356C50J116J13e19h3B135k5q09B48a723K13q99
$$ 6804 11696 13750 9030 5127 2356 350 1466 1579 -519 -83 2135 2110 1301 248 -1723 -1510 -2409
30971b409N43B233J220b796k490F86N215L012K020K700K161O6M235L807l047n970
$$ -2409 -1866 2233 3453 -2796 -5286 686 5901 8913 10933 13633 15794 15860 20095 23902 20855 14885
30955A4885k782J800K023K136O43j056l63N709Q173j844o619l416k050l652k243
$$ 14885 12103 13903 15926 18062 18705 17649 17286 22995 31168 29324 22705 19289 17239 13587 11344
30940A1344L90Q86k33l972C908A875J171j025c920l192j040K631A111K175j560
$$ 11344 11734 12620 12387 8415 3908 1875 3046 2021 -3920 -7112 -8152 -5521 1111 3286 1726
30925A726J399N228K331j314q86L612R030N674p199q587r37M164N270k177n714
$$ 1726 3125 8353 10684 9370 8484 12096 21126 26800 19601 11014 10077 14241 19511 17334 11620
30910A1620l071J04p17j700L500K607O06K073R19M397Q427L701m029n157q540
$$ 11620 8549 8653 7936 6236 9736 12343 12949 15022 15941 20338 28765 32466 28437 23280 14740
30895A4740C933a159j47n796l776L547b443E77P50J117O741P500J717j144p679
$$ 14740 3933 -1159 -1306 -7102 -10878 -7331 -2443 577 1327 2444 9185 16685 18402 17258 9579
30880I579m309J969J389k238J11J170j363F08b688B98L446A234g474r594n011
$$ 9579 5270 7239 8628 6390 6501 7671 6308 608 -2688 298 3744 1234 -7474 -17068 -22079
30865b2079j319K628Q409d257b009j114j522K077C34R10c01p158j78a47E811n65
$$ -22079 -23398 -20770 -12361 -4257 -2009 -3123 -4645 -2568 334 1244 -301 -7459 -7637 -147 5811 5246
30849E246q44L258m67J526J982P02q20k586K44j206B446K93O964M660K089k793
$$ 5246 4402 7660 7193 8719 10701 11403 10583 7997 8241 7035 2446 2739 9703 14363 16452 13659
30833A3659l513k584k151A640a004B943R797O685j428j826N175N944R43K33j165
$$ 13659 10146 7562 5411 1640 -1004 2943 12740 19425 17997 16171 21346 27290 28233 28466 27301
30818B7301o448p095l523j493J720L369K347j906m887l819J817K586k828B399
$$ 27301 20853 13758 10235 8742 10462 13831 16178 14272 9385 5566 7383 9969 7141 2399
30803A906l40d128m417J787a257D110Q96k169K235N167L380j387k364L69J540
$$ 1906 1566 -4128 -8545 -6758 -1257 4110 5006 2837 5072 10239 13619 12232 9868 10237 11777
30788A1777k631j993J122j812c30l235A458K284L01M668M381K63J222k014C846
$$ 11777 9146 7153 8275 6463 -330 -3565 1458 3742 4043 8711 13092 13355 14577 12563 3846
30772b247l351j298L358D278P657K925O764P369N370J464l783j823q33m23p744
$$ -2247 -5598 -6896 -3538 4278 11935 14860 21624 28993 34363 35827 32044 30221 29388 28965 21221
30757B1221E481f677l512M889A590N762N839N753K605n540D266a1553j0567o853
$$ 21221 5481 -6677 -10189 -5300 1590 7352 13191 18944 21549 16009 4266 -11553 -22120 -28973
30743b8973l74O826L465L116d191A1651P354m704C866a194D129L906k222B07b586
$$ -28973 -29347 -22521 -19056 -15940 -4191 11651 19005 14301 3866 -1194 4129 8035 5813 207 -2586
30727D1M753L965K023J294M756J221n751j932K212L77j98J623K266M14l170l013
$$ 41 4794 8759 10782 12076 16832 18053 12302 10370 12582 12959 12761 14384 16650 17064 13894 10881
30711A0881r66N032M458j455k213j309k425J23R55k277k156R36J203K35P31K62
$$ 10881 9915 14947 19405 17950 15737 14428 12003 12126 13081 10804 8648 9584 10787 11022 11753 12015
30695A2015q1N24q88J353L922l229F318I42c632j678l856r48c234B920J869J459
$$ 12015 11934 12458 11570 12923 16845 13616 6318 942 -3632 -5310 -9166 -10114 -3234 2920 4789 6248
30679F248B393c605l511n417l750J861M364K221j50L398B120O52b95r48p18j032
$$ 6248 2393 -3605 -7116 -12533 -16283 -14422 -10058 -7837 -7987 -4589 2120 2772 -295 -1243 -1961 -2993
30663b993m191r091p401N15R337f788l274l068L555c257o78m876l013R40K963
$$ -2993 -7184 -16275 -23676 -23161 -13824 -6788 -10062 -13130 -9575 -3257 -3935 -8811 -11824 -10884 -7921
30648g921N76m260m908k09K129l59m782n268K995P845e631b135n48l883r173n366
$$ -7921 -7345 -11605 -16513 -16722 -14593 -14952 -19734 -25002 -22007 -14162 -5631 -2135 -2683 -6566 -15739 -21105
30632b1105J523O134e815l390q488K789c198D328J244K007Q884M941k735k292
$$ -21105 -19582 -13448 -5815 -9205 -17693 -14904 -3198 4328 5572 7579 16463 21404 18669 16377
30618A6377K299L757M677L722k448n561A0132a312k674k334P91g27B077M218L363
$$ 16377 18676 22433 27110 30832 28384 22823 10132 -1312 -3986 -6320 -5529 -727 2077 6295 9658
30603I658P3O027Q271K8o38O266L401j912m742l650o714B999i011n483R08M908
$$ 9658 9731 15758 24029 24057 23419 29685 33086 31174 26432 22782 16068 2999 -9011 -14494 -13586 -8678
30587h678b807a104j577m214q474m971J749Q182c053h59A333Q6B86i22j274c57
$$ -8678 -2807 -1104 -2681 -6895 -15369 -20340 -18591 -10409 -3053 -859 1333 1419 286 -922 -2196 -357
30570D988O615J173K9L387j684o482b767p610M769h4m12A226L154A991C35J031
$$ 4988 11603 12776 12805 16192 14508 8026 -2767 -10377 -5608 -84 -496 1226 4380 1991 335 1366
30554A366k77a189l983l600j774k264k037J830l85p62o0L89J642n8j99L760L506
$$ 1366 1089 -1189 -5172 -8772 -10546 -12810 -14847 -13017 -13402 -14164 -14224 -13835 -12193 -12251 -12450 -8690 -5184
30537e184j451j101A07J0576J074B139g529J315a084m22N02F681P98G8c43C756
$$ -5184 -6635 -7736 107 10683 11757 2139 -7529 -6214 -1084 -1506 -1004 6681 7479 78 -343 3756
30520F867M087J108k523l867a640m196q60J583K087B880M433k540c095q229j841
$$ 6867 10954 12062 9539 5672 -1640 -5836 -6696 -5113 -3026 2880 7313 4773 -3095 -11324 -13165
30505a3165M240K518j577k158l21j382l943N49Q83K302K499k280o224o748m402
$$ -13165 -8925 -6407 -7984 -10142 -10463 -11845 -15788 -15239 -14356 -12054 -9555 -11835 -18059 -24807 -29209
30490b9209k32N853J0509c822b76j011l591k919l113j756l297m690K52p89m051
$$ -29209 -29441 -23588 -13079 -3822 -276 -1287 -4878 -7797 -10910 -12666 -15963 -20653 -20401 -21190 -25241
30475b5241l156J171O792M804L852c475B38a55p89C7K193O597J3035Q854K175
$$ -25241 -28397 -27226 -20434 -15630 -11778 -3475 238 -155 -944 37 2230 8827 21862 30716 32891
30460C2891k844j773J07k138m453p086j946M160N277N102k568j1405g81j3416
$$ 32891 30047 28274 28381 26243 21790 14704 12758 16918 22195 27297 24729 13324 -781 -14197
30446a4197l206Q466a661D205N410L20C951a790c37F21a024J82A802L554Q016
$$ -14197 -17403 -8937 -1661 4205 9615 9935 3951 -1790 -337 621 -1024 -842 1802 5356 13372
30431A3372Q156O603K324l76m266r186p204n22M472P973O555q56n562r736c597
$$ 13372 21528 28131 30455 30079 25813 16627 9423 8901 13373 21346 27901 27045 21483 11747 -3597
30415a9246o266M668N453J53k378m301J493f114B568a335p421k477M308K035K69
$$ -19246 -25512 -20844 -15391 -15238 -17616 -21917 -20424 -6114 2568 -1335 -8756 -11233 -6925 -4890 -4621
30400d621J677D95K420L05b168p688P5L535m291l761M794f21D307J713K5J730
$$ -4621 -2944 495 2915 3220 -2168 -9856 -9781 -6246 -10537 -14298 -9504 -621 4307 6020 6045 7775
30384G775M370O752O821o65o446m726k56M829N80H092b889a137E699B725c886
$$ 7775 12145 18897 25718 25053 18607 13881 13625 18454 19034 8092 -2889 -1137 5699 2725 -3886
30368h78H899J0878O000j538l415K294J815J602l33q889p913k690j859k201C9
$$ -878 8899 19777 25777 24239 20824 23118 24933 26535 26202 17313 9400 6710 4851 2650 39
30352A644N162M844j684l129Q80N20l789H73h438j3143j269N235N152O159J091
$$ 1644 6806 11650 9966 6837 7717 8237 4448 873 -8438 -21581 -22850 -17615 -12463 -6304 -5213
30337e213n244m640k079r85L036d899C02N721Q874K334j173n751D248A741K984
$$ -5213 -10457 -15097 -17176 -18161 -15125 -4899 302 6023 14897 17231 16058 10307 4248 1741 4725
30322D725P165K17m347l257o80K592J453J329K716N73J757K403N96j579L361L254
$$ 4725 11890 12107 7760 4503 3823 6415 7868 9197 11913 12486 14243 16646 17242 15663 19024 22278
30306B2278L47k643q161A980c212N90B200J2610R158j083n236l781M11K424l568
$$ 22278 22625 19982 11821 1980 -3212 -2622 2200 14810 23968 22885 17649 13868 14279 16703 13135
30291A3135E309a692k118g2C650j672d793n841l69c648D750N875M988K825j770
$$ 13135 5309 -1692 -3810 -72 3650 1978 -4793 -10634 -11003 -3648 4750 10625 15613 18438 16668
30276A6668o691C633a307n337l157M081C980J735J84O441O205j805o412j37j438
$$ 16668 9977 3633 -1307 -6644 -9801 -5720 3980 5715 5899 12340 18545 16740 10328 10191 8753
30261H753A8a1267k158f392h40E02M025L316K745P00R77P52m285I91e31G8J653
$$ 8753 18 -11267 -13425 -6392 -840 502 4527 7843 10588 11288 12265 13017 8732 991 -531 78 1731
30244A731F0a1282p538K87K283O610c197C932J1252O394M235M659k401o935Q28
$$ 1731 60 -11282 -18820 -18533 -16250 -9640 -3197 3932 15184 21578 25813 30472 28071 21136 21964
30229B1964O39r151D053b665o599j235K116K987H77Q178O027M665M580O394o42
$$ 21964 22603 13452 4053 -2665 -9264 -10499 -8383 -5396 877 9055 15082 19747 24327 30721 30079
30214C0079p770p954E173a905k775k382J2N85J151b239B104L478m32e30p865j894
$$ 30079 22309 14355 5173 -1905 -4680 -7062 -7050 -6465 -5314 -2239 2104 5582 5150 -530 -8395 -10289
30198a0289M655b557n94q23r11k199J149a210B180J754j38R52p34C5d794m490
$$ -10289 -5634 -2557 -3151 -3974 -4885 -7084 -5935 -1210 2180 3934 3796 4748 4014 35 -4794 -9284
30182i284N75nk173l541l138K175L155L840L000j32K713C779M488M9j185J468
$$ -9284 -8709 -8714 -10887 -14428 -17566 -15391 -12236 -8396 -5396 -5528 -2815 3779 8267 8316 7131 8599
30166H599k771a810p058n452J515d854F39K010b492r735r348q709m980J615O467
$$ 8599 5828 -1810 -8868 -14320 -12805 -4854 639 2649 -2492 -12227 -21575 -30284 -35264 -33649 -27182
30151b7182J1317f204b971q75m100J997b708j368p2A030M321H43d522m388n495
$$ -27182 -15865 -6204 -2971 -3846 -7946 -5949 -2708 -4076 -4148 1030 5351 843 -4522 -8910 -14405
30136a4405N82N736A22J973a907k384k268m325k878L593E81O799J040j729j936
$$ -14405 -13823 -8087 122 2095 -1907 -4291 -6559 -10884 -13762 -10169 581 7380 8420 6691 4755
30121D755m58A477a414j102j779q105o077O344b542B351M11A159a921j334o59
$$ 4755 4297 1477 -1414 -2516 -4295 -12400 -18477 -12133 -2542 2351 2762 1159 -1921 -3255 -3914
30106c914m925m761j690J958N905A946M467Q07k87k025j723b30o352l681J450
$$ -3914 -8839 -13600 -15290 -13332 -7427 1946 6413 7220 6933 4908 3185 -230 -6582 -10263 -8813
30091h813J461l718r34L189l61p97N68M106a127L42j805k770i94G198L623J10
$$ -8813 -7352 -11070 -12004 -8815 -9176 -9973 -9405 -5299 -1127 -785 -2590 -5360 -994 7198 10821 10931
30075A0931C963e086k638m296p384m089L280P719L623n34L639b164k625a437F832
$$ 10931 3963 -5086 -7724 -12020 -19404 -23493 -20213 -12494 -8871 -9405 -5766 -2164 -4789 -1437 6832
30059A0567m880C58i49j131j527q67m109K012B304M984J261L59B859g899q495
$$ 10567 5687 358 -949 -2080 -3607 -4474 -8583 -6571 2304 7288 8549 8908 2859 -7899 -16394
30044a6394M43g378a938l63l372m77a342G139R294K696k748J429l077o772l824
$$ -16394 -15951 -7378 -1938 -2301 -5673 -6150 -1342 7139 16433 19129 16381 17810 14733 7961 4137
30029D137j495J468j833c875m616l398j424M163c196a90C397M6h05e0B318H60
$$ 4137 2642 4110 2277 -3875 -8491 -11889 -13313 -9150 -3196 -190 3397 3443 -805 -50 2318 860
30012e032j636B141J0300O126M543M936J832l860j1330B833b916J003k799r032
$$ -5032 -6668 2141 12441 18567 23110 28046 29878 26018 14688 2833 -2916 -1913 -4712 -13744
29998a3744n420m688K920Q322K893k010N66N509a031l37L79B71j6b842l010k09
$$ -13744 -19164 -23852 -20932 -12610 -9717 -11727 -11161 -5652 -1031 -1368 -989 271 255 -2842 -5852 -6061
29982f061j408j80K395i53B737J007A872j20q28d860q404p95M213c099D395L268
$$ -6061 -7469 -7649 -5254 -953 2737 3744 1872 1752 924 -4860 -13264 -14059 -9846 -3099 4395 7663
29966G663C727c368l087j317M07a935B205L525M284l689b457l501p39J006O28
$$ 7663 3727 -3368 -6455 -7772 -7365 -1935 2205 5730 10014 6325 -2457 -5958 -6697 -5691 -5063
29951e063Q79k922o848n439J814N315K151L474b044c61r16D22O337M356E520d679
$$ -5063 -4184 -7106 -13954 -19393 -17579 -12264 -10113 -6639 -2044 -361 -1277 422 6759 11115 5520 -4679
29934a2666p415k247O628M512J879L187J987J007K54F75N124j5B427e1C756K980
$$ -12666 -20081 -22328 -15700 -11188 -9309 -6122 -4135 -3128 -2874 675 5799 5784 2427 -51 3756 6736
29918F736j904p55M554N031K743j31o734D532q01J051K435M632P91n192A807G71
$$ 6736 4832 4077 8631 13662 16405 16274 9540 4532 3731 4782 7217 11849 12640 7448 1807 771
29901E583R997M383l225m457l137J374P87m885b916m556K864a055D906A444e663
$$ 5583 15580 19963 16738 12281 9144 10518 11305 6420 -2916 -7472 -4608 -1055 4906 1444 -5663
29885c974A735J564k23K463K22R16J57B379i667j2211K480R489b62E566r69A678
$$ -3974 1735 3299 3076 5539 5761 6677 6834 2379 -9667 -21878 -19398 -9909 -262 5566 4597 1678
29868A441k98c099q184q054m774k189K513P725N492N056A409O490M897K758Q77
$$ 1441 1143 -3099 -11283 -19337 -24111 -26300 -23787 -16062 -10570 -5514 1409 7899 12796 15554 16431
29853A6431L25M348L529k266r407b13r967n622l710M309M567K423j396l693o008
$$ 16431 16756 21104 24633 22367 12960 -213 -10180 -15802 -19512 -15203 -10636 -8213 -9609 -13302 -19310
29838a9310o375j245O261M405k32J130K944K092d663D815O369L567L380M951J857
$$ -19310 -25685 -26930 -20669 -16264 -16496 -15366 -12422 -10330 -4663 4815 11184 14751 18131 23082 24939
29823B4939k348n362p793l659P70K73J008J292k963i56n132k414n997N38N761
$$ 24939 22591 17229 9436 5777 6547 6820 7828 9120 6157 -956 -6088 -8502 -14499 -13961 -8200
29808h200K356M96Q74a662d13B69M356N755J150B604f722k381r59p25l596m540
$$ -8200 -5844 -5348 -4474 -1662 -413 269 4625 10380 11530 2604 -6722 -9103 -10062 -10787 -14383 -18923
29792a8923j443J945L829O587a967E4a193l243Q95J733j017k371l850m218J810
$$ -18923 -20366 -18421 -14592 -8005 -1967 54 -1193 -4436 -3541 -1808 -2825 -5196 -9046 -13264 -11454
29777a1454K957n68q51o32n780n385K611P844M897k095m514r27k012m445j925
$$ -11454 -8497 -9065 -9916 -10548 -16328 -21713 -19102 -11258 -6361 -8456 -12970 -13897 -15909 -20354 -22279
29762b2279L706N364M031R77J114J509j728m110J00c784F11K944M225K595J64
$$ -22279 -18573 -13209 -9178 -8201 -7087 -5578 -7306 -11416 -11316 -3784 611 3555 7780 10375 10539
29747A0539k771n62N908L681n02m308m844o78M522R537Q739J539o199q834o235
$$ 10539 7768 7206 13114 16795 16293 11985 7141 6463 10985 20522 29261 30800 24601 15767 9532
29732I532l484k310A496f774o895M282d298j597n754p431n249Q70M597J627J536
$$ 9532 6048 3738 1496 -6774 -13669 -9387 -4298 -5895 -11649 -19080 -24329 -23459 -18862 -17235 -15699
29717a5699k153k995L328f845A686M398M505j367C677f09A750N878N247R764O026
$$ -15699 -17852 -20847 -17519 -6845 1686 6084 10589 9222 3677 -609 1750 7628 12875 22639 28665
29702B8665m060o422p440l618j093j480L116N847N568J827J15M35j809j500N842
$$ 28665 24605 18183 10743 7125 6032 4552 7668 13515 19083 20910 21025 21460 19651 18151 23993
29687B3993J0471O547M082P3l768p488r236q409o166l553K9P25C295d580q07E000
$$ 23993 34464 41011 45093 45166 41398 33910 24674 16265 10099 6546 6575 7300 3295 -4580 -5387 5000
29670A6198K971k250k601o864D57d41o71j605m058n647p219l730L188P094f020
$$ 16198 19169 16919 14318 7454 457 -441 -1112 -2717 -6775 -12422 -19641 -23371 -20183 -13089 -6020
29654A281M305C26e860b360D402M10k07O655P906M71o160m894m246g94k391m19
$$ 1281 5586 326 -5860 -2360 4402 4812 4605 11260 19166 19637 13477 8583 4337 -794 -3185 -3604
29638c604k098l476M9M353A714M332L860M132j228o150A243m15L972K767j18J003
$$ -3604 -5702 -9178 -9129 -4776 1714 6046 9906 14038 12810 6660 1243 828 4800 7567 7449 8452
29622H452L734M678j712n875j626K206O839N433o31n891m111J877k586d05o648
$$ 8452 12186 16864 15152 9277 7651 9857 16696 22129 21498 15607 11496 13373 10787 -405 -7053
29607g053c78A4743Q113j672o382F580o55K470B509e044q03a567C494O450N237
$$ -7053 -378 14743 22856 21184 14802 6580 5925 8395 2509 -5044 -5847 -1567 3494 9944 15181
29592A5181M743L530K972L468M978l556j1186r177n388F67e149l224K06O90K020
$$ 15181 19924 23454 26426 29894 34872 31316 20130 10953 5565 667 -5149 -8373 -8167 -7477 -5457
29577e457l398q453l347J0049A997O144O0q58K28j866A344b790j951j900Q91a138
$$ -5457 -8855 -17308 -20655 -10606 1997 8141 8201 7343 7571 5705 1344 -2790 -4741 -6641 -5750 -1138
29560B898K327qK480j834b051l018a088H4i149r247k568K960K280l056l687J283
$$ 2898 5225 5217 7697 5863 -2051 -5069 -1088 84 -9149 -18396 -20964 -18004 -15724 -18780 -22467 -21184
29544b1184O872e065A967N165L93j431J514M42I25a2291j1617o211L149M852K327
$$ -21184 -14312 -5065 1967 7132 7525 6094 7608 8050 925 -12291 -23908 -30119 -26970 -22118 -19791
29529a9791M904f165e85m630o405k95j030k725K814e822b085i04D892N183L792
$$ -19791 -14887 -6165 -585 -5215 -11620 -11915 -12945 -15670 -12856 -5822 -2085 -904 4892 10075 13867
29514A3867K571P43j370j25q46k042K364L773p33J472J057k859k248M984Q683
$$ 13867 16438 17181 15811 15686 14840 12798 15162 18935 18202 19674 20731 17872 15624 20608 29291
29499B9291K531m699l111r08l85K225j254j626J550k79m808p325k968M487N677
$$ 29291 31822 27123 24012 23104 22719 24944 23690 22064 23614 23335 18527 11202 8234 12721 18398
29484A8398k247l129J875O205R841J0470J833j1276j2932o178N67J341k221M083
$$ 18398 16151 13022 14897 21102 30943 41413 43246 31970 19038 12860 13427 14768 12547 16630
29470A6630P636P725J960p98J582r05q508j1721E228K84J0216J1439O008J768
$$ 16630 24266 31991 33951 33153 34735 33830 25322 13601 5228 5512 15728 27167 33175 34943
29456C4943K66l502n483l505n000G231b204j969a102A428p05d478n192K970d77
$$ 34943 35209 31707 26224 22719 17719 7231 -2204 -4173 -1102 1428 723 -4478 -9670 -6700 -477
29440E392R337N180n846B654f347k498M217B354O016K295J75M391M809J921j823
$$ 5392 14729 19909 14063 2654 -6347 -8845 -4628 2354 8370 10665 10840 15231 20040 21961 20138
29425B0138m951j429O7l302l632B122a478B732P058L424J306K474M712J932J163
$$ 20138 15187 13758 13825 10523 6891 2122 -1478 2732 9790 13214 14520 16994 21706 23638 24801
29410B4801n73j088k646q408B614j302J965L592L409n049a776m167k244k820l78
$$ 24801 24228 23140 20494 12086 2614 1312 3277 6869 10278 5229 -1776 -5943 -8187 -11007 -11385
29395a1385d959G093R708P21F627e959N68g19J33j697k548j129N1J311B233N556
$$ -11385 -4959 7093 16801 17522 6627 -5959 -5391 -719 -586 -2283 -4831 -5960 -5909 -4598 2233 7789
29379G789k5k839j145M170Q313Q747P483Q4m816m256q37K00J864L913J579j553
$$ 7789 7764 4925 3780 7950 16263 25010 32493 32577 27761 23505 22668 22868 24732 28645 30224 28671
29363B8671J916K611j977o537j1371C214F50J541P474M537J342O44j0m914B320
$$ 28671 30587 33198 31221 24684 13313 3214 650 2191 9665 14202 15544 16188 16178 11264 2320
29347b150B698J1892R152L255j504q93j312k868k862K411R42n534D918f435j0522
$$ -2150 2698 14590 23742 26997 25493 24600 23288 20420 17558 19969 20911 15377 4918 -6435 -16957
29332a6957l379N550e514C862J0280J2528P291k591k079Q163P212n484q128q056
$$ -16957 -20336 -14786 -5514 3862 14142 26670 33961 31370 29291 37454 44666 39182 31054 22998
29318B2998n294j147j469j72N9M61N94Q25P12Q56N302j31o503k505j587E631q94
$$ 22998 17704 16557 15088 14916 14975 15436 16030 16855 17567 18423 23725 23594 17091 14586 12999 5631 4737
29301D737P753N745J210K222J686J022J661p263F502c908p698k149O335B610O621
$$ 4737 12490 18235 19445 21667 23353 24375 26036 18773 6502 -3908 -11606 -13755 -7420 2610 9231
29286I231L226j277k996J061M178R57j871j687M231Q967N464k544q356m552K467
$$ 9231 12457 11180 8184 9245 13423 14380 12509 10822 15053 24020 29484 26940 18584 14032 16499
29271A6499L724M836M280Q93l561o120p533j950R186J1830N301N641M291k335
$$ 16499 20223 25059 29339 30232 26671 20551 13018 11068 20254 32084 37385 43026 47317 44982
29257D4982M9K191L752P3m965j804N208N057n653p106j638j995n10K796K482j39
$$ 44982 45031 47222 50974 51047 46082 44278 49486 54543 48890 41784 40146 38151 37641 40437 42919 42780
29241D2780K499L89p612p641k167J660L407J221n434q577o62Q678J3752J2094
$$ 42780 45279 45668 38056 30415 28248 29908 33315 34536 29102 20525 19863 28541 42293 54387
29227E4387K826k730m384q569p153K842N480J141n073o641l395J539l211o162
$$ 54387 57213 54483 50099 41530 34377 37219 42699 43840 38767 32126 28731 30270 27059 20897
29213B0897m222N40P662Q386M515m20l263r29N652P109P97p236p578m970p538
$$ 20897 16675 17215 24877 33263 37778 37358 34095 33166 38818 45927 46724 39488 31910 26940 19402
29198A9402n239J719O076P761O172J0387Q158J18l699o034q373r490j650K633
$$ 19402 14163 15882 21958 29719 35891 46278 54436 54554 50855 44821 36448 26958 25308 27941
29184B7941N213J814n958p791p261n694k924Q78Q13J593O563N325M134K308L300
$$ 27941 33154 34968 29010 21219 13958 8264 5340 6218 7031 8624 15187 20512 24646 26954 30254
29169C0254K478o61L881M157j887j718m4N113O066P08l004m006L17M111M298K41
$$ 30254 32732 32071 35952 40109 38222 36504 36460 41573 47639 48347 45343 41337 41654 45765 50063 50304
29153E0304M15L013n18j775j268j181l366o056p898r399k027O039P298M404L223
$$ 50304 50719 53732 53214 51439 50171 48990 45624 39568 31670 22271 20244 26283 33581 37985 41208
29138D1208N82L3j765k101k841n155m048K190Q758N855L866M33l155l199j392
$$ 41208 41790 41823 40058 37957 35116 29961 25913 28103 36861 42716 46582 47015 43860 40661 39269
29123C9269l379j837K149J553n72J558N06K721R595P194O773O173J07k053P18
$$ 39269 35890 34053 36202 37755 37183 38741 39247 41968 51563 58757 65530 71703 71810 69757 70475
29108G0475j735l141j505Q85j557m712m204l088k14M108M039K261J531O257J3513
$$ 70475 68740 65599 64094 64979 63422 58710 54506 51418 51204 55312 59351 61612 63143 69400 82913
29093H2913J7046J1561m761j0553m629l800L6P205M638J007m018k489J472L644
$$ 82913 99959 111520 106759 96206 91577 87777 87813 95018 99656 100663 96645 94156 95628 99272
29079I9272K297m034o043M98J1051J3143N285j529l798L936P940L649m00n855
$$ 99272 101569 97535 91492 91990 103041 116184 121469 119940 116142 120078 128018 131667 131267 125412
29065A25412m050K031O693N296J834K754L268P83k354l542q391j2856n508L502
$$ 125412 121362 123393 130086 135382 137216 139970 143238 144021 141667 138125 129734 116878 111370 114872
29051A14872P355P143Q504M343M009L080K28l161l211j600m042n329r72O503R859
$$ 114872 122227 129370 137874 142217 146226 149306 149534 146373 143162 141562 137520 132191 131219 137722 147581
29036A47581R690J5030J2597J744rl661l757K033N007M744O003N216M489P323
$$ 147581 157271 172301 184898 186642 186633 182972 179215 181248 186255 190999 197002 202218 206707 214030
29022B14030Q473P124J185K022R790P956Q5N01L663M073J291M159R071N261J004
$$ 214030 222503 229627 230812 232834 242624 250580 250665 251166 254829 258902 260193 264352 273423 278684 279688
29007B79688L511P325J2445J7149J3777J7085K0144K3027K8377L0978K9040K3838
$$ 279688 283199 290524 302969 320118 333895 350980 371124 394151 422528 453506 482546 506384
28995E06384K3580K6503K8067L2569L3775L0107L4241L6333K8122J7367M340J883
$$ 506384 529964 556467 584534 617103 650878 680985 715226 751559 779681 797048 801388 803271
28983H03271N0o247j2337j1454p127j3487j7882j6215j0898k055J768J703L543
$$ 803271 803321 797074 784737 773283 766156 752669 734787 718572 707674 705619 707387 709090 712633
28970G12633P993J5376K2907K7550K9821K6670K4398K3714K1521J6963J3201R357
$$ 712633 720626 736002 758909 786459 816280 842950 867348 891062 912583 929546 942747 952104
28958I52104K127j799n789j5238k5430k7413k8561l5064l8951k9861j9872j7919
$$ 952104 954231 952432 946643 931405 905975 878562 850001 814937 775986 746125 726253 708334
28946G08334j8031j9140j7576j1332r933j1648m794o46r04j508j374p400j2345
$$ 708334 690303 671163 653587 642255 632322 620674 615880 615234 614330 612822 611448 604048 591703
28933E91703p456j583o12n215n001p343r657r592o985o29O496L204l422o248r512
$$ 591703 584247 582664 582052 576837 571836 564493 554836 545244 538259 537630 544126 547330 543908 537660 528148
28918E28148n151P263J2903J1868P156O034O752P490P983N058J879L513M606k942
$$ 528148 522997 530260 543163 555031 562187 568221 574973 582463 590446 595504 597383 600896 605502 602560
28904F02560j0049q404n116k645k662k557M34L435K261O90q905j5427j8469k2610
$$ 602560 592511 584107 578991 576346 573684 571127 571561 574996 577257 577947 569042 553615 535146 512536
28890E12536k2842j5132p10R424M120p385q659j1335r991q687q055m126L515O127
$$ 512536 489694 474562 473852 483276 487396 480011 471352 460017 450026 441339 433284 429158 432673 438800
28876D38800L683Q213J4967J2271R804O877M466O293O300M485P332O756N28K447
$$ 438800 442483 450696 465663 477934 487738 494615 499081 505374 511674 516159 523491 530247 530775 533222
28862E33222K802M160M604P193J5100J6832J9923K6987L4613L6336M1702M6589
$$ 533222 536024 540184 544788 551981 567081 583913 603836 630823 665436 701772 743474 790063
28850G90063M9938N6233O1425N1934M5205M5769M2594L9071L6161L1816K1816
$$ 790063 840001 896234 957659 1009593 1054798 1100567 1143161 1182232 1218393 1250209 1272025
28839A272025R976j482j1996j5342j2908j8492k5369k4447k1962j4304O3Q079
$$ 1272025 1282001 1280519 1268523 1253181 1240273 1221781 1196412 1171965 1150003 1135699 1135762 1143841
28827A143841J6783K6209L1416L1638L3577L4473L2010L0892L0419K0508J0301
$$ 1143841 1160624 1186833 1218249 1249887 1283464 1317937 1349947 1380839 1411258 1431766 1442067
28816A442067M638O235J287j0145k0587k3436j6797j1731r002q941n739l10J1495
$$ 1442067 1446705 1452940 1454227 1444082 1423495 1400059 1383262 1371531 1362529 1353588 1347849 1347539 1359034
28803A359034K3871L2133M3310N4113O2797P5481Q3141Q1420Q8765R2271Q8049
$$ 1359034 1382905 1415038 1458348 1512461 1575258 1650739 1733880 1815300 1904065 1996336 2084385
28792B084385P9219O8019N6613M0316K7764J4488m839k5083l7983n1142n7987
$$ 2084385 2163604 2231623 2288236 2328552 2356316 2370804 2365965 2340882 2302899 2251757 2193770
28781B193770o0616o8508q2269r4469r6313q7200q1605q6272q5025p3849o3253
$$ 2193770 2133154 2064646 1982377 1887908 1791595 1704395 1622790 1536518 1451493 1377644 1314391
28770A314391n3036m3578l2869j7068k552J3068K5338K8407L2496M7967N7558
$$ 1314391 1261355 1217777 1184908 1167840 1165288 1178356 1203694 1232101 1264597 1312564 1370122
28759A370122O3434P0805P3605P3706P5337P3686P0536O3615N5695M3882K9233
$$ 1370122 1433556 1504361 1577966 1651672 1727009 1800695 1871231 1934846 1990541 2034423 2063656
28748B063656Q781j681k584j7451m1892n4012n8011p3780q9832r3942q7369q7882
$$ 2063656 2072437 2070756 2068172 2050721 2008829 1954817 1896806 1823026 1733194 1639252 1551883 1464001
28736A464001r9034j03243r9369q8559p9014p8401p5066o5845n6928n4668n3431
$$ 1464001 1364967 1261724 1162355 1073796 994782 916381 841315 775470 718542 663874 610443
28725F10443m7084m0100l2348k8785k6872k1403k4672k4660j3105k623p95K276
$$ 610443 563359 523259 490911 462126 435254 413851 389179 364519 351414 348791 347996 350272
28713C50272j481n482q959j5643j7125p395j261p587r862m648n462p73L247n416
$$ 350272 348791 343309 334350 318707 301582 294187 292926 285339 275477 270829 265367 264594 267841 262425
28699B62425n208k448n849k942N398P431K765l728m835R55P267J6238J6292O249
$$ 262425 257217 254769 248920 245978 251376 258807 261572 257844 253009 253964 261231 277469 293761 300010
28685C00010m519j0748r853k878L970o550j8398j6733j4817j3926r393l544K20
$$ 300010 295491 284743 274890 272012 275982 269432 251034 234301 219484 205558 196165 192621 192841
28672A92841M962J987n849m362M389J1199O401K543K398O36p16L085N954J1416
$$ 192841 197803 199790 193941 189579 193968 205167 211568 214111 216509 217145 216429 219514 225468 236884
28658B36884J4491J1252M944k962m272m024o858r401j1692j3063j5948j6243j0722
$$ 236884 251375 262627 267571 264609 260337 256313 249455 240054 228362 215299 199351 183108 172386
28645A72386o782m396K86q79m920p175n288k872m87o7J328P301O472J834L692
$$ 172386 165604 161208 161494 160615 155695 148520 143232 140360 139873 139806 141134 148435 154907 156741 160433
28630A60433L966L738K476J98j363p010o060j038L834O654O138N054N122J1223
$$ 160433 164399 168137 170613 170811 169448 162438 156378 155340 159174 165828 171966 177020 182142 193365
28616A93365Q180K014J448k210j726m81j637L70O859J2188J0361N811M294K376
$$ 193365 201545 203559 205007 202797 201071 200590 198953 199323 206182 218370 228731 234542 238836 241212
28602B41212K645N421L246J534J569O88P142N575k473o70J313j954l83l544j355
$$ 241212 243857 249278 252524 254058 255627 256315 263457 269032 266559 265889 267202 265248 264865 261321 259966
28587B59966J1851J6751J0866Q93m284j223J017N21Q49K579M970L786L383N574
$$ 259966 271817 288568 299434 300327 296043 294820 295837 296358 297207 299786 304756 308542 311925 317499
28573C17499K139K497N559O903O095Q513J4371J8628J6577J2833J0500N253M527
$$ 317499 319638 322135 327694 334597 340692 349205 363576 382204 398781 411614 422114 427367 431894
28560D31894J4264K5890K8204K3313K0747K1480K5131L0329L7900L4966K9971
$$ 431894 446158 472048 500252 523565 544312 565792 590923 621252 659152 694118 724089
28549G24089L4363M0934M2475M0443L3603K6372J9319J5385J2819Q202j261j3427
$$ 724089 758452 799386 841861 882304 915907 942279 961598 976983 989802 998004 996743 983316
28537I83316k4087l1853l0366k9321k6380k2056k2610k1860j4622o115J296O561
$$ 983316 959229 927376 897010 867689 841309 819253 796643 774783 760161 754046 755342 761903
28525G61903P081P676N580J2512K2035K1655J6576K2645K8894K2412J3313O034
$$ 761903 768984 776660 782240 794752 816787 838442 855018 877663 906557 928969 942282 948316
28513I48316L778O534K199m781j296N204M879L360j711q443n182N071J5247J5225
$$ 948316 952094 958628 960827 956046 954750 959954 964833 968193 966482 958039 952857 957928 973175 988400
28499I88400J6157K0806J7212J2344Q619P363P269j99m844p193j2273k5660k9618
$$ 988400 1004557 1025363 1042575 1054919 1063538 1070901 1078170 1077971 1073127 1065934 1053661 1028001 998383
28486I98383k4368k7393l2568l6678m0454l8638l6825l5088k8416j9527j4883
$$ 998383 974015 946622 914054 877376 836922 798284 761459 726371 697955 678428 663545
28475F63545j5943j4189j640k151j0699p562j06N348J2112J2555M738O998J2245
$$ 663545 647602 633413 631773 629622 618923 611361 611255 616603 628715 641270 646008 653006 665251
28462F65251J0357J7682K8343K9484L1546L1002K8893L3742M0473M3997M1483
$$ 665251 675608 693290 721633 751117 782663 813665 842558 876300 916773 960770 1002253
28451A002253M1509M4557M8200M9513L8809J9385J2900J5786R801Q1j508l995
$$ 1002253 1043762 1088319 1136519 1186032 1224841 1244226 1257126 1272912 1282713 1282794 1281286 1277291
28439A277291j3264k4167l1095l1830l7356l5434l4749l5125l3444l1360k8675
$$ 1277291 1264027 1239860 1208765 1176935 1139579 1104145 1069396 1034271 1000827 969467 940792
28428I40792k6917k5008k2802j9711j4772q410o867q613j2830j7873k1284j2510
$$ 940792 913875 888867 866065 846354 831582 823172 816305 807692 794862 776989 755705 743195
28416G43195j537N659P614N644N480O367l109o529m660p658j690M648Q491O493
$$ 743195 741658 747317 754931 760575 766055 772422 769313 762784 758124 750466 748776 753424 761915 768408
28402G68408k309m133l559n716q878r246o814N94N663O922J2099J0542K068o14
$$ 768408 766099 761966 758407 752691 743813 734567 727753 728347 734010 740932 753031 763573 765641 765027
28388G65027K473J330k746N50P046P905N184M027M929j08l096R90M054K939l87
$$ 765027 767500 768830 766084 766634 773680 781585 786769 790796 795725 795617 792521 793511 797565 800504 800117
28373H00117o27N714L849m34n13j241J456P017P139L065M262Q667R323J4107J4279
$$ 800117 799490 805204 809053 808619 808106 806865 808321 815338 822477 825542 829804 838471 847794 861901 876180
28358H76180J5190K3002L4376M1188M6321M0999L0016K8250L4711L9041L7747
$$ 876180 891370 914372 948748 989936 1036257 1077256 1107272 1135522 1170233 1209274 1247021
28347A247021L7066L9435L3916K6887K3464R030j898j859N15J31l35k055r261
$$ 1247021 1284087 1323522 1357438 1384325 1407789 1416819 1414921 1413062 1413577 1413708 1413373 1411318 1402057
28334A402057j2755j4448k1172l0580l3078k8341k4313k9221l0663k5107k3241
$$ 1402057 1389302 1374854 1353682 1323102 1290024 1261683 1237370 1208149 1177486 1152379 1129138
28323A129138k3594k6676k7202j9854j0879q436q835p785j724P834J1904J3267
$$ 1129138 1105544 1078868 1051666 1031812 1020933 1012497 1003662 995877 994153 1001987 1013891 1027158
28311A027158J0725J5417K2186J8104J6622J6858K2719K6448K6587K0002K3049
$$ 1027158 1037883 1053300 1075486 1093590 1110212 1127070 1149789 1176237 1202824 1222826 1245875
28300A245875K5294J4725J1207J6010K4148K9270K5196K2573K2934K5803L3446
$$ 1245875 1271169 1285894 1297101 1313111 1337259 1366529 1391725 1414298 1437232 1463035 1496481
28289A496481L2626K1025P567J51n396j3800k2791l1341l7233m7980o0934o9419
$$ 1496481 1529107 1550132 1557699 1557850 1552454 1538654 1515863 1484522 1447289 1399309 1338375 1268956
28277A268956o8337n8408n2981n3983m8199m1501m1750m3744l8034l3231l3361
$$ 1268956 1200619 1142211 1089230 1035247 987048 945547 903797 860053 822019 788788 755427
28266G55427l4141k7924j9693k0325k0332j4288j0975j2162j1689m202m362r603
$$ 755427 721286 693362 673669 653344 633012 618724 607749 595587 583898 579696 575334 565731
28254E65731n308M49N717K074J679O303P620N161Q703J0286J3245K1425K9123
$$ 565731 560423 560872 566589 568663 570342 576645 584265 589426 598129 608415 621660 643085 672208
28241F72208L8539N0680O2149O5806O9425P0399P1843P8082P5152O6829O0807
$$ 672208 710747 761427 823576 889382 958807 1029206 1101049 1179131 1254283 1321112 1381919
28230A381919M7641L5819K4402J4350n374l1291m5427n3026n6524n7344o3828
$$ 1381919 1429560 1465379 1489781 1504131 1498757 1467466 1422039 1369013 1312489 1255145 1191317
28219A191317o8850o6940o1969n3984m3824l5426l2012k8342k0027j8088j4717
$$ 1191317 1122467 1055527 993558 939574 895750 860324 828312 799970 779943 761855 747138
28208G47138r944j0206j2694j6040j6307j5180q529m046n700m480k117j974L033
$$ 747138 737194 726988 714294 698254 681947 666767 658238 654192 648492 644012 641895 639921 642954
28195F42954J0877J6008J0677P181J7225K2882J9853J2211r02j3706j4423j0125
$$ 642954 653831 669839 680516 687697 704922 727804 747657 759868 758966 745260 730837 720712
28183G20712r423r565p193q218q725l006O603J6925J9439J7292J6498J8769K1349
$$ 720712 711289 701724 694531 686313 677588 674582 681185 698110 717549 734841 751339 770108 791457
28170G91457J8981J2284R288R009R193L107o005j1070j1426l135R097J7918K2363
$$ 791457 810438 822722 832010 841019 850212 853319 847314 836244 824818 821683 830780 848698 871061
28157H71061K5962K7877L1129L6085L8931L9497M2538M2759M2594M0350K6169
$$ 871061 897023 924900 956029 992114 1031045 1070542 1113080 1155839 1198433 1238783 1264952
28146A264952N246r796j2482r876j6879k8188m3482n2787n1836n4544n9275n9365
$$ 1264952 1270198 1260402 1247920 1238044 1221165 1192977 1149495 1096708 1044872 990328 931053 871688
28134H71688o1553n6582m2600k8910j8418j4777j7330k5089k7784k2909j5905
$$ 871688 810135 753553 710953 682043 663625 648848 631518 606429 578645 555736 539831
28123E39831r457k864J845J463n01j699n135p717l905K535N660M185L185N023
$$ 539831 530374 527510 529355 530818 530317 528618 523483 515766 511861 514396 520056 524241 527426 532449
28109E32449P793J4600J3532J1661N758L262P005P609Q958N493P004J3133K1678
$$ 532449 540242 554842 568374 580035 585793 589055 596060 603669 612627 618120 625124 638257 659935
28096F59935K2401K0807L1102M4310M8868M5928M5911M4190M8793N4279N0205
$$ 659935 682336 703143 734245 778555 827423 873351 919262 963452 1012245 1066524 1116729
28085A116729M5356L9480L6554L5682L0065K2239J4532J3866R016m061p663j853
$$ 1116729 1162085 1201565 1238119 1273801 1303866 1326105 1340637 1354503 1363519 1359458 1351795 1349942
28073A349942K311N093M025m620n116O301J0964J6547K0335L1636M6792N5639
$$ 1349942 1352253 1357346 1361371 1356751 1351635 1357936 1368900 1385447 1405782 1437418 1484210 1539849
28061A539849N4000N1711N8220N8747M9975M3398M0989L4151J8228O674L02r925
$$ 1539849 1593849 1645560 1703780 1762527 1812502 1855900 1896889 1931040 1949268 1955942 1956244 1946319
28049A946319k0428k8919l1646k6394k3983k2064j8347j7506o288O567J1105N073
$$ 1946319 1925891 1896972 1865326 1838932 1814949 1792885 1774538 1757032 1750744 1757311 1768416 1773489
28037A773489k600k937n731j4543k1270k5730l1797m0973m5175m8876n2035n5736
$$ 1773489 1770889 1767952 1762221 1747678 1726408 1700678 1668881 1627908 1582733 1533857 1481822 1426086
28025A426086o3031o5785o7483p2786o4082n2166m3061l1143k6145k2873j5958
$$ 1426086 1363055 1297270 1229787 1157001 1092919 1040753 997692 966549 940404 917531 901573
28014I01573p678p454o638R00P287J3521K2667L1943M2620M8930N0307M9267N0914
$$ 901573 893895 886441 879803 880703 887990 901511 924178 956121 998741 1047671 1097978 1147245 1198159
28001A198159N9582P3171Q0794Q4737Q5237P8743P6355O8044M9088L5032K5969
$$ 1198159 1257741 1330912 1411706 1496443 1581680 1660423 1736778 1804822 1853910 1888942 1914911
27990A914911J7918O824q181k4618m0965n3975o7548p9180q7559r2756r7980j05139
$$ 1914911 1932829 1939653 1931472 1906854 1865889 1811914 1744366 1665186 1577627 1484871 1386891 1281752
27978A281752j06459r4823q2805p7449p2855o0338n2150n2833m7502l3632k7985
$$ 1281752 1175293 1080470 997665 920216 847361 787023 734873 682040 634538 600906 572921
27967E72921k6348k0863k0249k5210k8713k2224j5114j1814r246j1521j9699k1495
$$ 572921 546573 525710 505461 480251 451538 429314 414200 402386 393140 381619 361920 340425
27955C40425j3708j3914k1230j6387o458l148j131l153n502k064N44p030j2337
$$ 340425 326717 312803 291573 275186 268728 265580 264449 261296 255794 253730 254274 247244 234907
27942B34907o555M75K476J618L869O110M853K950O856O568P814J5410J3502Q239
$$ 234907 228352 228827 231303 232921 236790 242900 247753 250703 257559 264127 271941 287351 300853 309092
27928C09092M604J606K707K647L452R48K088Q750J4494J7490J7613J9025J5413
$$ 309092 313696 315302 318009 320656 324108 325056 327144 335894 350388 367878 385491 404516 419929
27915D19929J8476K5192K4419K1058J6636J4974J7228J9767K5651K6539K3342
$$ 419929 438405 463597 488016 509074 525710 540684 557912 577679 603330 629869 653211
27904F53211K0043J8568K4235L4001L8377L8713L9415M4692M7124M7613N2910
$$ 653211 673254 691822 716057 750058 788435 827148 866563 911255 958379 1005992 1058902
27893A058902N6562O0282N7605N3013N4165N4195N3653N6470N0378M4399M4662
$$ 1058902 1115464 1175746 1233351 1286364 1340529 1394724 1448377 1504847 1555225 1599624 1644286
27882A644286L7143K8700K1797J2083K981O950J1127L613o645j3011j6534j7855
$$ 1644286 1681429 1710129 1731926 1744009 1746990 1753940 1765067 1768680 1762035 1749024 1732490 1714635
27870A714635j4237q360q972r791r590j3645j8111j9257k1390k3063j9412j4922
$$ 1714635 1700398 1692038 1683066 1673275 1663685 1650040 1631929 1612672 1591282 1568219 1548807 1533885
27858A533885j8441k8062l0308k4125j9653k3448k9564l4240l8359m0527m3384
$$ 1533885 1515444 1487382 1457074 1432949 1413296 1389848 1360284 1326044 1287685 1247158 1203774
27847A203774m9154n0434m9477m8043l9157l6410l4448k5939j7655j1271j4258
$$ 1203774 1154620 1104186 1054709 1006666 967509 931099 896651 870712 853057 841786 827528
27836H27528j6837j7003j9988j7875j5324j4331j1145j2546j5071j3365j3858
$$ 827528 810691 793688 773700 755825 740501 726170 715025 702479 687408 674043 660185
27825F60185k2712k4173j8796j7952k0781k5102k6916k8553k6038j6875j0567
$$ 660185 637473 613300 594504 576552 555771 530669 503753 475200 449162 432287 421720
27814D21720n966M505N536K868K295Q345J2769R368R986P959R728J6215J5974
$$ 421720 415754 420259 425795 428663 430958 439303 452072 461440 471426 479385 489113 505328 521302
27801E21302J8291K1860K2803K1685K0222K1063K0220K0470K2034J9068J5800
$$ 521302 539593 561453 584256 605941 626163 647226 667446 687916 709950 729018 744818
27790G44818J8962J5853R301R24o314n616k074L121K34j0725r689n141n589q649
$$ 744818 763780 779633 788934 789858 783544 777928 775854 778975 779209 768484 758795 753654 748065 739416
27776G39416j6395k1488k4235k0068j3968j8503j8505j6581r335n650r609m272
$$ 739416 723021 701533 677298 657230 643262 624759 606254 589673 580338 574688 565079 560807
27764E60807j914q076q699m872l527k558l048m139m91K148M22k897J43L976K576
$$ 560807 558893 550817 542118 537246 533719 531161 528113 523974 523483 525631 526053 523156 523299 527275 529851
27749E29851K487M162P544J2453Q625K759j53n43k138q617j2084p001m062p845
$$ 529851 532338 536500 544044 556497 565122 567881 567728 567185 565047 556430 544346 537345 533283 525438
27735E25438j0091r985o978p270j4371j4579j0617j3771j6014j6474j5337j3750
$$ 525438 515347 505362 498384 491114 476743 462164 451547 437776 421762 405288 389951 376201
27723C76201j2574j4265j7154j9654j9346j7914j4652j2223j1314o162k067o15
$$ 376201 363627 349362 332208 312554 293208 275294 260642 248419 237105 230943 228876 228261
27711B28261N98J105J86k357m329m639p155p170M50P667N691l850r454o913K872
$$ 228261 228859 229964 230150 227793 223464 218825 211670 204500 204950 212617 218308 214458 205004 198091 200963
27696B00963R171N590k317j716O242Q221O908R711M515m674J621K927l61M371
$$ 200963 210134 215724 213407 211691 217933 226154 233062 242773 247288 242614 244235 247162 246801 251172
27682B51172P281J1121J4770J4557J0319J0435J3681J6566J3963N970K894J886
$$ 251172 258453 269574 284344 298901 309220 319655 333336 349902 363865 369835 372729 374615
27670C74615j64L380Q968P314L31J166K937m614o685l725Q59M811L374J188K442
$$ 374615 374451 377831 386799 394113 394444 395610 398547 393933 387248 383523 384382 389193 392567 393755 396197
27655C96197P049R610O596Q15l39Q218P111M423J2387K0298K0789J7932J1655
$$ 396197 403246 412856 419452 420267 419928 428146 435257 439680 452067 472365 493154 511086 522741
27642E22741J4296K4550K7533K6794L3245L4129K8240K1598J7953K2101K9576
$$ 522741 537037 561587 589120 615914 649159 683288 711528 733126 751079 773180 802756
27631H02756K9517K5489K2503J6904J2055Q720J0483J8655K1398K1030K0985J4451
$$ 802756 832273 857762 880265 897169 909224 917944 928427 947082 968480 989510 1010495 1024946
27619A024946J7662K6348K0740J2325L644q343j9602k3305k1198k3761j5606K898
$$ 1024946 1042608 1068956 1089696 1102021 1105665 1097322 1077720 1054415 1033217 1009456 993850 996748
27607I96748Q813R353J4669K2687K2089K0913K6316L8056M3021L9045L3484K8838
$$ 996748 1005561 1014914 1029583 1052270 1074359 1095272 1121588 1159644 1202665 1241710 1275194 1304032
27595A304032K4317J5090P091J202o04P066J2632R054N377K409M880R706K3728
$$ 1304032 1328349 1343439 1350530 1351732 1351128 1358194 1370826 1379880 1385257 1387666 1392546 1402252 1425980
27582A425980L2949L4385L1186K8875K4284J7388P469J343o398j8981l1248m3586
$$ 1425980 1458929 1493314 1524500 1553375 1577659 1595047 1602516 1603859 1597461 1578480 1547232 1503646
27570A503646n3627n6385m9614n0933n7015n9010n0410l9001l4577l4981l6795
$$ 1503646 1450019 1393634 1344020 1293087 1236072 1177062 1126652 1087651 1053074 1018093 981298
27559I81298l6284l4221l4912l0798k5229k1713k1256k0238j3970p598k830M49
$$ 981298 945014 910793 875881 845083 819854 798141 776885 756647 742677 735079 732249 732698
27547G32698k571k972M784R276M644K648K945N623J719m472J79Q355J1990J3706
$$ 732698 730127 727155 731939 741215 745859 748507 751452 757075 758794 754322 754501 762856 774846 788552
27533G88552J3799J3940J2796J7219L0536M2687M6416M8175N6858P3016Q6267
$$ 788552 802351 816291 829087 846306 876842 919529 965945 1014120 1070978 1143994 1230261
27522A230261Q8530Q2873Q3005Q9295Q8691P8651O6503N4233M2265L7277L7410
$$ 1230261 1318791 1401664 1484669 1573964 1662655 1741306 1807809 1862042 1904307 1941584 1978994
27511A978994L4820K7533K5121K3977K2669L0832M5880N9145O3360O2685O6818
$$ 1978994 2013814 2041347 2066468 2090445 2113114 2143946 2189826 2248971 2312331 2375016 2441834
27500B441834O7074O4226O2618O3192N6874N1275N1513N1616N2835N5647M9502
$$ 2441834 2508908 2573134 2635752 2698944 2755818 2807093 2858606 2910222 2963057 3018704 3068206
27489C068206M2112L7198J9656M817p302k2364l4384m9678n9163p0739p7994p5476
$$ 3068206 3110318 3147516 3167172 3171989 3164687 3142323 3107939 3058261 2999098 2928359 2850365 2774889
27477B774889p3594p0597o6449o0311n1457m1373k4323j6013j4391l292J3214
$$ 2774889 2701295 2630698 2564249 2503938 2452481 2411108 2386785 2370772 2356381 2353089 2366303
27466B366303K6094K4463K2480J7361L018j0091j8496l0118m8106o0712q0776
$$ 2366303 2392397 2416860 2439340 2456701 2459719 2449628 2431132 2401014 2352908 2292196 2211420
27455B211420j04804j14056j13569j13806j12774j05786r1256q0623p4435o6190
$$ 2211420 2106616 1992560 1878991 1765185 1652411 1546625 1455369 1374746 1300311 1234121
27445A234121n9052m8796m3231l7862k8736k2378k3718k4075j6011p191n006l318
$$ 1234121 1175069 1126273 1083042 1045180 1016444 994066 970348 946273 930262 923071 918065 914747
27433I14747r60l147o560k648J485j374k298M722K0635L2887L5713L2883K9342
$$ 914747 913787 910640 904080 901432 902917 901543 899245 903967 924602 957489 993202 1026085 1055427
27420A055427L2281M2755N3459N6766N4478N3065N5009N4470N0732M4917L5625
$$ 1055427 1087708 1130463 1183922 1240688 1295166 1348231 1403240 1457710 1508442 1553359 1588984
27409A588984K9981K1757J2310N249j0565k5182l1106l9193m9389n3619n8856
$$ 1588984 1618965 1640722 1653032 1658281 1647716 1622534 1591428 1552235 1502846 1449227 1390371
27398A390371o8061o8473o5220o5927o1915n0982l9277l3374k8476j9883p981
$$ 1390371 1322310 1253837 1188617 1122690 1060775 1009793 970516 937142 908666 888783 880802
27387H80802l074p270q127m689J244P122Q685N493o60m421o116j1522r232o835
$$ 880802 877728 870458 862331 857642 858886 866008 874693 880186 879526 875105 868989 857467 848235 841400
27373H41400j2763k0030j9866k0170k4746k3681k3907j8519r336j2859k2324k0241
$$ 841400 828637 808607 788741 768571 743825 720144 696237 677718 668382 655523 633199 612958
27361F12958r379l741m946q284n886K777O191R66n11l252n791m416k016K368N592
$$ 612958 603579 599838 594892 586608 580722 583499 589690 590656 590145 586893 581102 576686 574670 577038 582630
27346E82630O056L478J002L334Q145J1091J3838J0741N488O140R493J5382J7093
$$ 582630 588686 592164 593166 596500 604645 615736 629574 640315 645803 651943 661436 676818 693911
27333F93911J8099K1785K2615J8738J3588J0103J1948J2166J0608J1937J0794
$$ 693911 712010 733795 756410 775148 788736 798839 810787 822953 833561 845498 856292
27322H56292J0536J5300J3753J1161J3842J8727J9350J5911J7503J7793J1788
$$ 856292 866828 882128 895881 907042 920884 939611 958961 974872 992375 1010168 1021956
27311A021956k062p636j965J986n582k0131j8778q141n394j3138k3268k9224l4214
$$ 1021956 1019894 1012258 1010293 1012279 1006697 986566 967788 959647 954253 941115 917847 888623 854409
27298H54409l5624k6408j8140j7606j5645r559n584j0758j1972j0251p111j309
$$ 854409 818785 792377 774237 756631 740986 731427 725843 715085 703113 692862 685751 684442
27286F84442j45L813O889M458O549J1378J2263J2159J1881N809O023J8367J3055
$$ 684442 684297 688110 694999 699457 706006 717384 729647 741806 753687 759496 765519 783886 796941
27273G96941L232N131K889k983q049j0298j2138j4117j4104j2898j6316j8546
$$ 796941 800173 805304 808193 805210 797161 786863 774725 760608 746504 733606 717290 698744
27261F98744j7045j2813n939j860P38J194N682P908P759J1022J7314K1703K4099
$$ 698744 681699 668886 662947 661087 661825 663019 668701 676609 684368 695390 712704 734407 758506
27248G58506K0673K2103K2140J6415J5115J6644J6876J8420J8923J7610K1348
$$ 758506 779179 801282 823422 839837 854952 871596 888472 906892 925815 943425 964773
27237I64773K3631K2865K6999J8192N110J208m901j0305j7461k4630l8533m9672
$$ 964773 988404 1011269 1038268 1056460 1061570 1062778 1057877 1047572 1030111 1005481 966948 917276
27225I17276m7680m0313l8788l7208l2171k7380j8088j0480j0713j2413j4265
$$ 917276 869596 829283 790495 753287 721116 693736 675648 665168 654455 642042 627777
27214F27777j6666j1787j069N109O135J948p481j4581j2037k427L582O141J0529
$$ 627777 611111 599324 598255 603364 609499 611447 603966 589385 577348 574921 578503 584644 595173
27201E95173J2781J2011Q685J3055K3017K6082K6677L2432L1692L3074L5034K2798
$$ 595173 607954 619965 628650 641705 664722 690804 717481 749913 781605 814679 849713 872511
27189H72511J8448K5319K2571O903p991j9655k9207l7029m4070m6677m8402n8506
$$ 872511 890959 916278 938849 945752 937761 918106 888899 851870 807800 761123 712721 654215
27177F54215o3874n7515l9297k3687k1101j9519r433K104J749j502K730N812Q604
$$ 654215 590341 532826 493529 469842 448741 429222 419789 421893 423642 422140 424870 430682 439286
27164D39286J0593J0151J1628N299j01J399O151M162k403o954o889n551n754q579
$$ 439286 449879 460030 471658 476957 476856 478255 484406 488568 486165 479211 472322 466771 461017 452438
27150D52438j0415q446q566j0290r959l565J564N287J1056J0098K885l978k406
$$ 452438 442023 433577 425011 414721 404762 401197 402761 408048 419104 429202 432087 428109 425703
27137D25703j467j711j955M154J3851K0663K1445K2502L0032L0696L3031L7806
$$ 425703 424236 422525 420570 424724 438575 459238 480683 503185 533217 563913 596944 634750
27125F34750L6990L6027M4495N6545O5516O4649O0068N2681M6635M1955K8022
$$ 634750 671740 707767 752262 808807 874323 938972 999040 1051721 1098356 1140311 1168333
27114A168333J6548Q99k4067m0705m7132n3365o3358o7635o2101n7778n3120m0938
$$ 1168333 1184881 1185780 1161713 1121008 1073876 1020511 957153 889518 827417 769639 716519 675581
27102F75581l7857l9355l4521k9369k5260j9630j0151m7K840O203J1575J6800
$$ 675581 637724 598369 563848 534479 509219 489589 479438 479391 482231 488434 500009 516809
27090E16809K7890L7731M2211M8677M9027M8398O2506P5664P2488P0088P3677
$$ 516809 544699 582430 624641 673318 722345 770743 833249 908913 981401 1051489 1125166
27079A125166P2232O5539M9678L1847J7668J327j4928k9135m3500n5750o5341
$$ 1125166 1197398 1262937 1312615 1344462 1362130 1363457 1348529 1319394 1275894 1220144 1154803
27068A154803p2238p7137q2880q5477q1144p3992n7549m6376m4649l7210l5800
$$ 1154803 1082565 1005428 922548 837071 755927 681935 624386 578010 533361 496151 460351
27057D60351l2538l3264l5419k2850j0510q626n847o97j24k169l32N957N808j612
$$ 460351 427813 394549 359130 336280 325770 317144 311297 310600 310476 308307 307975 313932 319740 318128
27043C18128m344J370P201J0227P508Q928R979O840J3684J9867K1104K6861K9642
$$ 318128 313784 315154 322355 332582 340090 349018 358997 365837 379521 399388 420492 447353 476995
27030D76995K4929J9058K0456K7644K9145K2600J3671Q345J0210J0584M810n593
$$ 476995 501924 520982 541438 569082 598227 620827 634498 642843 653053 663637 668447 662854
27018F62854j9224k6750k8379k8702l0434k7042j6058r195j4080j5479r167j439
$$ 662854 643630 616880 588501 559799 529365 502323 486265 477070 462990 447511 438344 436905
27006D36905J2395K4000K8936K7238K5502L1849L8016M4049N0002M6968M5731
$$ 436905 449300 473300 502236 529474 554976 586825 624841 668890 718892 765860 811591
26995H11591M7136N3320N3586M3074L5102K7707J2852L310j05L88o447j8837l0639
$$ 811591 858727 912047 965633 1008707 1043809 1071516 1084368 1087678 1087573 1087961 1081514 1062677 1032038
26982A032038m3534n1936n1272m6988m9297n3993m7805l9553l2540k2077j2644
$$ 1032038 988504 936568 885296 838308 789011 735018 687213 647660 615120 593043 580399
26971E80399m702M160R173J0860J4231J7423K1150K9529L2088K1127P928j15q149
$$ 580399 575697 579857 589030 599890 614121 631544 652694 682223 714311 735438 743366 743251 735102
26958G35102j5323k3048k3836k0232k5823l4776l7199m0987m2726l8097l3458
$$ 735102 719779 696731 672895 652663 626840 592064 554865 513878 471152 433055 399597
26947C99597k6603j5407j5357j7188j1083o492j3497j9007j3861q019j368l574
$$ 399597 372994 357587 342230 325042 313959 307467 293970 274963 261102 253083 251715 248141
26935B48141j0236q908j914O820J0646J2309J2777J3064J7682J3887J2796J7100
$$ 248141 237905 228997 227083 233903 244549 256858 269635 282699 300381 314268 327064 344164
26923C44164J6117J4020J6080J6629K6194L9502M3413M2163M4899N3424O0604
$$ 344164 360281 374301 390381 407010 433204 472706 516119 558282 603181 656605 717209
26912G17209O3450O4855O1434O3383O2152N2226M3674L4192K0562M655j2663k7603
$$ 717209 780659 845514 906948 970331 1032483 1084709 1128383 1162575 1183137 1187792 1175129 1147526
26900A147526l7386m3800m9935n5921o2648o2283n3781m8294n3137n4955m3036
$$ 1147526 1110140 1066340 1016405 960484 897836 835553 781772 733478 680341 625386 582350
26889E82350l0783k0968j5562j1709j0762n113J1876J8258J4924J2630J6329K8272
$$ 582350 551567 530599 515037 503328 492566 487453 499329 517587 532511 545141 561470 589742
26877E89742L7634L8080L1567K7933K9092K8482K4734J5997R265O720J055j0168
$$ 589742 627376 665456 697023 724956 754048 782530 807264 823261 832526 839246 840301 830133
26865H30133k7617l8838l1971k4921k4103j9746k1285k8989k4566j2578K647J1675
$$ 830133 802516 763678 731707 706786 682683 662937 641652 612663 588097 575519 578166 589841
26853E89841J2430J7487K0132K3224K5709K7146L6082M8992N5553O2949P4463
$$ 589841 602271 619758 639890 663114 688823 715969 752051 801043 856596 919545 994008
26842I94008Q9253J04061J13894J26511J47144J71084J87902J94697K04530K16993
$$ 994008 1083261 1187322 1301216 1427727 1574871 1745955 1933857 2128554 2333084 2550077
26832B550077K19693K10935J92826J71798J50618J23504Q9365M2848o73l2113
$$ 2550077 2769770 2980705 3173531 3345329 3495947 3619451 3708816 3751664 3750991 3718878
26822C718878o5319r8531j28225j46747j52485j49908j50466j53043j45055j27282
$$ 3718878 3653559 3555028 3426803 3280056 3127571 2977663 2827197 2674154 2529099 2401817
26812B401817j19075j19905j15268j11850j16289j16383j08338r6971q7892q1976
$$ 2401817 2282742 2162837 2047569 1935719 1819430 1703047 1594709 1497738 1409846 1327870
26802A327870p6298o8650n5496m4466m2607m6794m6438l8106l3473k9400k1016
$$ 1327870 1251572 1182922 1127426 1082960 1040353 993559 947121 909015 875542 846142 825126
26791H25126j6830j4824p719N57L261j258q597o021O007J9368K5151J7463J5387
$$ 825126 808296 793472 785753 786310 789571 788313 779716 773695 779702 799070 824221 841684 857071
26778H57071K6384L4234L4281L5464M2946N6499O6044O6281O9753Q1094R5636
$$ 857071 883455 917689 951970 987434 1030380 1086879 1152923 1219204 1288957 1370051 1465687
26767A465687J10495J27801J47555J64952J86919K12455K41178K74419L06545
$$ 1465687 1576182 1703983 1851538 2016490 2203409 2415864 2657042 2931461 3238006
26758C238006L36941L56262L70809L82382L84770L69268L45846L11685K68772
$$ 3238006 3574947 3931209 4302018 4684400 5069170 5438438 5784284 6095969 6364741
26749F364741K26686J76999J18572O2000J2659k9761o3363r3568j18128j32282
$$ 6364741 6591427 6768426 6886998 6948998 6961657 6931896 6868533 6774965 6656837 6524555
26739F524555j30285j29658j42952j66207j90566k16843k48267k76694k99032
$$ 6524555 6394270 6264612 6121660 5955453 5764887 5548044 5299777 5023083 4724051
26730D724051l13878l16330l13583k99146k74891k52952k31698k10724j88731
$$ 4724051 4410173 4093843 3780260 3481114 3206223 2953271 2721573 2510849 2322118
26721B322118j69910j44995j17051j02150r4351q8586p6500o6401o0504n1304
$$ 2322118 2152208 2007213 1890162 1788012 1693661 1605075 1528575 1462174 1401670 1350366
26711A350366m3555l4603k6256k1918k1596j9804j8842r577l13K394L405J739
$$ 1350366 1306811 1272208 1245952 1224034 1202438 1182634 1163792 1154215 1153902 1156296 1159701 1161440
$$ [...]
##END NTUPLES=NMR SPECTRUM
##END=
