##TITLE=XTC-1731a_1
##JCAMPDX= 6.0         $$ Bruker NMR JCAMP-DX V2.0
##DATA TYPE= NMR SPECTRUM
##DATA CLASS= NTUPLES
##ORIGIN= BRUKER
##OWNER= patiny
$$ 1.79 TOPSPIN		Version 3.0
$$ 2012-05-20 19:39:00.055 +0200  patiny@icmbsg005
$$ Compression mode = diff/dup
##.OBSERVE FREQUENCY= 400.13188181139
##.OBSERVE NUCLEUS= ^1H
##.ACQUISITION MODE= SIMULTANEOUS (DQD)
##.ACQUISITION SCHEME= undefined
##.AVERAGES= 16
##.DIGITISER RES= 23
##SPECTROMETER/DATA SYSTEM= spect
##.PULSE SEQUENCE= zgpr
##.SOLVENT NAME= D2O
##.SHIFT REFERENCE= INTERNAL, D2O, 1, 11.69961
##AUDIT TRAIL= $$ (NUMBER, WHEN, WHO, WHERE, PROCESS, VERSION, WHAT)
$$ ##TITLE= Audit trail, TOPSPIN		Version 3.0
$$ ##JCAMPDX= 5.01
$$ ##ORIGIN= Bruker BioSpin GmbH
$$ ##OWNER= patiny
$$ $$ /opt/data/patiny/nmr/XTC-1731a_1/11/pdata/1/auditp.txt
$$ ##AUDIT TRAIL=  $$ (NUMBER, WHEN, WHO, WHERE, PROCESS, VERSION, WHAT)
(   1,<2012-05-20 19:38:58.613 +0200>,<patiny>,<icmbsg005>,<go>,<TOPSPIN 3.0>,
      <created by zg
	started at 2012-05-20 19:37:12.699 +0200,
	POWCHK enabled, PULCHK disabled,
       configuration hash MD5:
       77 C7 B7 C4 10 F4 BA 30 64 2E BB 52 82 F2 DA 41
       data hash MD5: 32K
       FE DA 44 CC 3B E9 61 6E 7B 59 66 7E B3 A3 0F 2E>)
(   2,<2012-05-20 19:38:59.033 +0200>,<patiny>,<icmbsg005>,<audit>,<TOPSPIN 3.0>,
      <user comment:
       ICON-NMR User ID: patiny
       data hash MD5: 32K
       FE DA 44 CC 3B E9 61 6E 7B 59 66 7E B3 A3 0F 2E>)
(   3,<2012-05-20 19:38:59.587 +0200>,<patiny>,<icmbsg005>,<proc1d>,<TOPSPIN 3.0>,
      <Start of raw data processing
       ef LB = 0 FT_mod = 6 PKNL = 1 SI = 16K 
       data hash MD5: 16K
       B1 30 DF 59 9C 38 CF B0 CC 54 A1 50 91 48 D8 BD>)
(   4,<2012-05-20 19:38:59.687 +0200>,<patiny>,<icmbsg005>,<proc1d>,<TOPSPIN 3.0>,
      <apk 
       data hash MD5: 16K
       BE 35 B6 C4 72 15 4D 3A A6 EC 3A 47 D8 0B E9 11>)
(   5,<2012-05-20 19:38:59.701 +0200>,<patiny>,<icmbsg005>,<proc1d>,<TOPSPIN 3.0>,
      <abs ABSG = 5 
       data hash MD5: 16K
       37 92 5D 4D 27 16 D1 B5 40 B2 FB 79 3D 60 EC DA>)
$$ ##END=
$$ 
$$ $$ hash MD5
$$ $$ 0F 55 7A 7A 68 C1 83 4E A1 99 94 47 4D 11 67 2A
##$RELAX= 
##$RELAX= 
##$RELAX= 
##$RELAX= 
##$RELAX= 
##$RELAX= 
##$RELAX= 
##$RELAX= 
##$RELAX= 
##$RELAX= 
##$RELAX= 
##$RELAX= 
##$RELAX= 
$$ Bruker specific parameters
$$ --------------------------
##$DATPATH= </opt/data/patiny/nmr>
##$EXPNO= 11
##$NAME= <XTC-1731a_1>
##$PROCNO= 1
##$ACQT0= -9.16730304209974
##$AMP= (0..31)
100 100 100 100 100 100 100 100 100 100 100 100 100 100 100 100 100 100
100 100 100 100 100 100 100 100 100 100 100 100 100 100
##$ANAVPT= -1
##$AQSEQ= 0
##$AQ_mod= 3
##$AUNM= <au_zgglp>
##$AUTOPOS= <48 >
##$BF1= 400.13
##$BF2= 400.13
##$BF3= 400.13
##$BF4= 400.13
##$BF5= 400.13
##$BF6= 400.13
##$BF7= 400.13
##$BF8= 400.13
##$BYTORDA= 0
##$CAGPARS= (0..11)
0 0 0 0 0 0 0 0 0 0 0 0
##$CFDGTYP= 0
##$CFRGTYP= 9
##$CHEMSTR= <none>
##$CNST= (0..63)
1 1 1 1 1 1 1 1 1 1 1 1 1 1 1 1 1 1 1 1 1 1 1 1 1 1 1 1 1 1 1 1 1 1 1 1
$$ [...]
##$TE2= 0
##$TE3= 0
##$TE4= 0
##$TEG= 300
##$TE_PIDX= 1
##$TE_STAB= (0..8)
2 2 0 0 0 0 0 0 0
##$TL= (0..7)
120 120 120 120 120 120 120 120
##$TP= (0..7)
150 150 150 150 150 150 150 150
##$TPNAME0= <>
##$TPNAME1= <>
##$TPNAME2= <>
##$TPNAME3= <>
##$TPNAME4= <>
##$TPNAME5= <>
##$TPNAME6= <>
##$TPNAME7= <>
##$TPOAL= (0..7)
0.5 0.5 0.5 0.5 0.5 0.5 0.5 0.5
##$TPOFFS= (0..7)
0 0 0 0 0 0 0 0
##$TUNHIN= 0
##$TUNHOUT= 0
##$TUNXOUT= 0
##$USERA1= <>
##$USERA2= <>
##$USERA3= <>
##$USERA4= <>
##$USERA5= <>
##$V9= 5
##$VALIST= <>
##$VCLIST= <>
##$VD= 0
##$VDLIST= <>
##$VPLIST= <>
##$VTLIST= <>
##$WBST= 1024
##$WBSW= 4
##$XGAIN= (0..3)
0 0 0 0
##$XL= 0
##$YL= 0
##$YMAX_a= 5154370
##$YMIN_a= -4418707
##$ZGOPTNS= <>
##$ZL1= 120
##$ZL2= 120
##$ZL3= 120
##$ZL4= 120
##$ABSF1= 11.69961
##$ABSF2= -2.293603
##$ABSG= 5
##$ABSL= 3
##$ALPHA= 0
##$AQORDER= 0
##$ASSFAC= 0
##$ASSFACI= 0
##$ASSFACX= 0
##$ASSWID= 0
##$AUNMP= <save_auto_nonLDAP.pm>
##$AXLEFT= 0
##$AXNAME= <>
##$AXNUC= <1H>
##$AXRIGHT= 0
##$AXTYPE= 0
##$AXUNIT= <>
##$AZFE= 0.1
##$AZFW= 0.1
##$BCFW= 0
##$BC_mod= 0
##$BYTORDP= 0
##$COROFFS= 0
##$CY= 15
##$DATMOD= 1
##$DC= 0
##$DFILT= <>
##$DTYPP= 0
##$ERETIC= no
##$F1P= 0
##$F2P= 0
##$FCOR= 0.5
##$FTSIZE= 16384
##$FT_mod= 6
##$GAMMA= 0
##$GB= 0
##$INTBC= 1
##$INTSCL= 1
##$ISEN= 128
##$LB= 0
##$LEV0= 0
##$LPBIN= 0
##$MAXI= 10000
##$MC2= 0
##$MEAN= 0
##$ME_mod= 0
##$MI= 0
##$NCOEF= 0
##$NC_proc= -5
##$NLEV= 6
##$NOISF1= 0
##$NOISF2= 0
##$NSP= 0
##$NTH_PI= 0
##$NZP= 0
##$OFFSET= 11.69961
##$PC= 1
##$PHC0= 85.56598
##$PHC1= 4.866469
##$PH_mod= 1
##$PKNL= yes
##$PPARMOD= 0
##$PPDIAG= 0
##$PPIPTYP= 0
##$PPMPNUM= 2147483647
##$PPRESOL= 1
##$PSCAL= 0
##$PSIGN= 0
##$PYNMP= <proc.py>
##$REVERSE= no
##$SF= 400.13
##$SI= 16384
##$SIGF1= 0
##$SIGF2= 0
##$SINO= 0
##$SIOLD= 16384
##$SPECTYP= <>
##$SREGLST= <1H.CDCl3>
##$SSB= 0
##$STSI= 16384
##$STSR= 0
##$SW_p= 5599.10414333707
##$SYMM= 0
##$S_DEV= 0
##$TDeff= 32768
##$TDoff= 0
##$TI= <>
##$TILT= no
##$TM1= 0
##$TM2= 0
##$TOPLEV= 0
##$USERP1= <>
##$USERP2= <>
##$USERP3= <>
##$USERP4= <>
##$USERP5= <>
##$WDW= 1
##$XDIM= 16384
##$YMAX_p= 473195033
##$YMIN_p= -237038
##$CURPLOT= <Cups-PDF>
##$CURPRIN= <$Cups-PDF>
##$DFORMAT= <normdp>
##$LAYOUT= <+/1D_X+nopp.xwp>
##$LFORMAT= <normlp>
##$PFORMAT= <normpl>
$$ End of Bruker specific parameters
$$ ---------------------------------
##NTUPLES= NMR SPECTRUM
##VAR_NAME=  FREQUENCY,     SPECTRUM/REAL,   SPECTRUM/IMAG
##SYMBOL=    X,             R,               I
##VAR_TYPE=  INDEPENDENT,   DEPENDENT,       DEPENDENT
##VAR_FORM=  AFFN,          ASDF,            ASDF
##VAR_DIM=   16384,         16384,           16384
##UNITS=     HZ,            ARBITRARY UNITS, ARBITRARY UNITS
##FACTOR=    0.3417421962486, 1,             1
##FIRST=     5598.76240114082, -1083,        -77160
##LAST=      0,             31175,           -144306
##MIN=       0,             -237038,         0
##MAX=       5598.76240114082, 473195033,    0
$$ Real data points
##PAGE= N=1
##DATA TABLE= (X++(R..R)), XYDATA
$$ [...]
11352d5320m1133j4944E3479A9829J5792a21432a0041p9067c9409o533k4728E6610
$$ -45320 -86453 -101397 53479 19829 35621 -121432 -10041 -89108 -39409 -45942 -70670 56610
11339a6541l78F2654A9052b1575c824q502D2824H542P48d3585c214k2554F9065
$$ -16541 -16919 62654 19052 -21575 -3824 -12326 42824 8542 9290 -43585 -3214 -25768 69065
11325f9331G8058B3687J24458E157P8911k6419L5826C2535r62O0192C7209K7736
$$ -69331 78058 23687 148145 5157 84068 57649 93475 32535 31573 91765 37209 64945
11313F4945c3230G1475J01222H3531i7397A9419b0395F8601j5213e197p3591D0959
$$ 64945 -33230 71475 172697 83531 -97397 19419 -20395 68601 53388 -5197 -78788 40959
11300h0888C1168M1607E324J60296P3315L5290m1126L164p1020j5111C0787J45305
$$ -80888 31168 72775 5324 165620 238935 274225 233099 236263 165243 150132 30787 176092
11288A76092D9539N7359l5331b4984j7199A8093i368o1250K6876A18956m16k1150
$$ 176092 49539 106898 71567 -24984 -42183 18093 -9368 -70618 -43742 118956 118540 97390
11276I7390N198B9076L00239j38024j7738k5266j2071E8235e693A8319Q9432a2459
$$ 97390 102588 29076 329315 191291 173553 148287 136216 58235 -5693 18319 107751 -12459
11263A49839B2342b165C4070H024a7214B2210L4919b5736E202g5021j5534L2705
$$ 149839 22342 -2165 34070 8024 -17214 22210 57129 -25736 5202 -75021 -90555 -57850
11251e7850h839D9881a235k1541B0516c2451i01D6822R4183k1197j0686c6488
$$ -57850 -8839 49881 -1235 -22776 20516 -32451 -901 46822 141005 119808 109122 -36488
11238F4772b2193A4636Q7117g481A0479b78B9979K2513J7396h0371L4884H2465
$$ 64772 -22193 14636 101753 -7481 10479 -278 29979 52492 69888 -80371 -45487 82465
11225b975A3758O3494M348G212J77447H7167R1462G3098K951a6874F5755g9686
$$ -2975 13758 77252 81600 7212 184659 87167 178629 73098 76049 -16874 65755 -79686
11212I3742a6396B8860g2451H6317L0700J424A5779a418D0218A9210K0901l100
$$ 93742 -16396 28860 -72451 86317 117017 118441 15779 -1418 40218 19210 40111 37011
11200C7011c5142m5595b4489I2725N1233B4605P5314D9782J06790p2242R1760
$$ 37011 -35142 -80737 -24489 92725 143958 24605 99919 49782 156572 84330 176090
11189A76090J25773j08394p358N124m7117R1567M5017n9298P0035H1973L7361
$$ 176090 301863 193469 186111 191235 144118 235685 280702 221404 291439 81973 119334
11178A19334B0841L1334J45358i2734I540k659L2590b0883A45118J6580L6586
$$ 119334 20841 52175 197533 -92734 9540 6881 39471 -20883 145118 161698 198284
11167A98284r1348c9707A58725o6695O2507J4355N2202m5989m5895E8103k0165
$$ 198284 106936 -39707 158725 92030 154537 168892 221094 175105 129210 58103 37938
11156C7938L8973b8364H9191f746o7425a1174j5894H4484a2702I6375A4098Q7255
$$ 37938 76911 -28364 89191 -6746 -74171 -11174 -27068 84484 -12702 96375 14098 101353
11144A01353C3010B078e8430a1228C3440A1274K7856A2572J2686d1583C4702G148
$$ 101353 33010 2078 -58430 -11228 33440 11274 39130 12572 25258 -41583 34702 7148
11131a44840c4539G3161C2840P8356l1409f8442n919F095J0119f606G0034L6401
$$ -144840 -34539 73161 32840 111196 79787 -68442 -74361 6095 16214 -6606 70034 106435
11119A06435f9262r4736B780J3987N4478i7965J9553b4684A16522g7443a4470
$$ 106435 -69262 -163998 2780 16767 71245 -97965 -78412 -24684 116522 -77443 -14470
11107E5164d5213D7058N515j0617j4037d1482f189A39527b3191A5559n090a9947
$$ 55164 -45213 47058 52573 41956 27919 -41482 -6189 139527 -23191 15559 10469 -19947
11094e60E881P0036D46f0023D1834b3937G3388b6952o70K807D0280a17240H604
$$ -560 5881 75917 446 -60023 41834 -23937 73388 -26952 -27622 -24815 40280 -117240 8604
11080b3472A66391a1864A4420L6842A0659L807L6681p826E743M0898b9109m8437
$$ -23472 166391 -11864 14420 51262 10659 14466 51147 43321 5743 46641 -29109 -77546
11068g7546I8123e3140a1169A23085a431r330B5243L8109f5926m974k183J9941
$$ -77546 98123 -53140 -11169 123085 -1431 -10761 25243 63352 -65926 -70900 -73083 -53142
11056e3142f709j0004A15809B4638h6165G703K0878c3114l3805J7232J5825A15480
$$ -53142 -6709 -16713 115809 24638 -86165 7703 28581 -33114 -66919 -49687 -33862 115480
11043e9023I7912j5372a01995c4526r9781E3279j7265a7099A06489C1605A1640
$$ -59023 97912 82540 -101995 -34526 -134307 53279 36014 -17099 106489 31605 11640
11031G8112M4847F0715Q266M6893A9122g0447k2277d1726H5535d7295B7771f3755
$$ 78112 122959 60715 68981 115874 19122 -70447 -92724 -41726 85535 -47295 27771 -63755
11018f4854K8790m4510H3164j6970h754n7278a3008d109j45553E0235c2982a4592
$$ -64854 -36064 -80574 83164 66194 -8754 -66032 -13008 -4109 -149662 50235 -32982 -14592
11005B4933c9454m5041C2336a28895F2701a6081n9119K7893a1249l3835q562a9058
$$ 24933 -39454 -84495 32336 -128895 62701 -16081 -75200 -47307 -11249 -45084 -53646 -19058
10992d6469G1105p427b2778p257l814G0987A1872a04439a7436E9944k9063J02632
$$ -46469 71105 63678 -22778 -30035 -33849 70987 11872 -104439 -17436 59944 30881 133513
10980A33513B8555J0783N8465a22778O577A3363g563m9147D3911j482g656o6844
$$ 133513 28555 39338 97803 -122778 -116201 13363 -7563 -56710 43911 42429 -7656 -74500
10968g4500A07126j3385q811G215h9572j0881C2750F432J3056O9321c2688C729
$$ -74500 107126 93741 84930 7215 -89572 -100453 32750 6432 19488 88809 -32688 3729
10955b0301B2589b8703F3083d8075H3561h0437D8393o372d5870l9126d0796C3060
$$ -20301 22589 -28703 63083 -48075 83561 -80437 48393 42021 -45870 -84996 -40796 33060
10942D1784d6438B9941A2465b8480d477I391O1799c752n3472m0321L8537b1247
$$ 41784 -46438 29941 12465 -28480 -4477 9391 71190 -3752 -57224 -97545 -59008 -21247
10929f6563D2024A6464O4171a03199A48372A6815J38636c1375F8735B9237J90804
$$ -66563 42024 16464 80635 -103199 148372 16815 155451 -31375 68735 29237 220041
10918B20041j0032P8421n3292p200K4367F3890B1446M7091H662P6786Q524a216
$$ 220041 210009 288430 235138 227938 252305 63890 21446 68537 8662 85448 93972 -1216
10905F9810i7521D9949h0350H9668D4389L1314q884O0818K0418F3103L58752j25743
$$ 69810 -97521 49949 -80350 89668 44389 75703 66819 127637 148055 63103 421855 296112
10893B96112J27130r8135o1033B5346N7165j2511P2479B3710c1998m3871D1357
$$ 296112 423242 325107 264074 25346 82511 70000 142479 23710 -31998 -75869 41357
10881g3138c6271n501J2501A4557d1139H0795a45034C6784e7757N117K443j5395
$$ -73138 -36271 -41772 -29271 14557 -41139 80795 -145034 36784 -57757 -52640 -50197 -65592
10869f5592J3875J1461J8828F2951f211j7754F1434J3240e7789D4790N7469a1766
$$ -65592 -51717 -40256 -21428 62951 -6211 -23965 61434 74674 -57789 44790 102259 -11766
10856D185K04961J04011R1389J37338r7919m0882m0758j5350J20519j47473A39040
$$ 4185 209146 313157 404546 541884 443965 403083 362325 346975 467494 320021 139040
10844B84382A11724n1187R7945d585H0459r992a5373A34882E4236B4133P6455
$$ 284382 111724 60537 158482 -4585 80459 70467 -15373 134882 54236 24133 100588
10833A00588B169L8831j997A8296e1161j9028A2774d0220a1789E2849a5202F1710
$$ 100588 2169 41000 39003 18296 -51161 -70189 12774 -40220 -11789 52849 -15202 61710
10820a7006E611e0348A02387C455c456q1276b3195n4774k6508j1340C8244f4418
$$ -17006 5611 -50348 102387 3455 -3456 -84732 -23195 -77969 -104477 -115817 38244 -64418
10807b4915E9234a4862A30800c4906D3936a01884A13548a0579D848N5145k1785
$$ -24915 59234 -14862 130800 -34906 43936 -101884 113548 -10579 4848 59993 38208
10796C8208J32900m8084J6229O0809r094k6684J0168k9946Q8634n2567B9782K0629
$$ 38208 171108 123024 139253 200062 190968 164284 174452 144506 233140 180573 29782 50411
10784E0411j0118A5138q0c9836A3923J13325a761k9847A31426P1104l1060n2158
$$ 50411 40293 15138 15058 -39836 13923 127248 -1761 -31608 131426 202530 171470 119312
10772A19312N9108P7615j19K8798p9084J19078q3507n0736p5016E7459M3628L4313
$$ 119312 178420 256035 255916 284714 205630 324708 241201 190465 115449 57459 101087 135400
10760A35400b039A08209F404M9311k3068d8887A89178B1630hm3876F3272b3746
$$ 135400 -2039 108209 6404 55715 32647 -48887 189178 21630 -8 -43884 63272 -23746
10747D7296M0628R225a04874A19917n3979k1202A8546i4991C5656a992A4724b5646
$$ 47296 87924 97149 -104874 119917 65938 44736 18546 -94991 35656 -1992 14724 -25646
10734a7749A8729Q9390D9690K1684J6747o404l5079O9848Q573q940B9102P4992
$$ -17749 18729 108119 49690 71374 88121 81717 46638 116486 125059 116119 29102 104094
10722A04094j6129A6058C975M9256H221O884N7473e5969j1826G7795l7111O6190
$$ 104094 87965 16058 3975 53231 8221 15105 72578 -55969 -67795 77795 40684 106874
10710A06874j1546I364J47467m0891O0763k6376K7037L6757l4670k6730O8246
$$ 106874 95328 9364 156831 115940 176703 150327 177364 214121 179451 152721 220967
10699B20967j0223j5574J85339l24L8653Q8110J2298K93519J06773L63098K74647
$$ 220967 210744 195170 380509 380185 418838 506948 519246 812765 919538 1282636 1557283
10688A557283K14059O4409L90864K30932N67568Q22060J751063M033257Q341260
$$ 1557283 1771342 1835751 2226615 2457547 3025115 3847175 5598238 9631495 17972755
10679A7972755J3322281J2203780J973967j2031408j5252770q482075l562996
$$ 17972755 31295036 43498816 45472783 33441375 18188605 9706530 6143534
10672F143534j463277r31657m78574k87756q3450K37992J79530K27582k5478j12702
$$ 6143534 4680257 3748600 3270026 2982270 2898820 3136812 3316342 3543924 3518446 3405744
10662C405744N33900P98994J047377K047095M895097J0536879J8755136K0658018
$$ 3405744 3939644 4738638 5786015 7833110 12728207 23265086 42020222 62678240
10654F2678240Q796522j4413775k3757166j6394327o875205l161730j625719j034070
$$ 62678240 71474762 57060987 33303821 16909494 10034289 6872559 5246840 4212770
10646D212770r22073l87728l08004k71689l75397m10147k95342n7668q2499N402
$$ 4212770 3290697 2902969 2594965 2323276 1947879 1537732 1242390 1184722 1102223 1107625
10636A107625p5016J50141J47409n5179L00790J50728L04556L83259L56032P49745
$$ 1107625 1032609 1182750 1330159 1274980 1575770 1726498 2031054 2414313 2770345 3520090
10626C520090O03988N14068J150870J969797K854387N878452J0790306J4650199
$$ 3520090 4124078 4638146 5789016 7758813 10613200 16491652 27281958 41932157
10618D1932157J2639849M729796m239481l659160N173024Q227389P67931j3531214
$$ 41932157 54572006 59301802 55062321 51403161 56576185 64803574 65571505 52040291
10610E2040291j8442314j3947921p588028l564181j882333j397836j124532o62171
$$ 52040291 33597977 19650056 12062028 8497847 6615514 5217678 4093146 3430975
10602C430975o65872o46734l96584k21750j38004k97011L2274k69827N6824j55735
$$ 3430975 2765103 2118369 1721785 1500035 1362031 1065020 1097294 827467 884291 728556
10592G28556O6519j33528j7712O2365k92588J69904o9141Q4395o9290l1523N0873
$$ 728556 795075 661547 643835 706200 413612 583516 514375 598770 529480 497957 548830
10581E48830K3533K8382k5213K00157K11568J03631J7383K07152J46106K70218
$$ 548830 572363 600745 575532 775689 987257 1090888 1108271 1315423 1461529 1731747
10571A731747K51251K49237M32506M99996O85098J086465J935979L762604P178090
$$ 1731747 1982998 2232235 2664741 3164737 3849835 4936300 6872279 10634883 17812973
10562A7812973J0777279J0657207M579022k049652o300304q81622K645579J352198
$$ 17812973 28590252 39247459 43826481 41776829 35476525 34594903 37240482 38592680
10554C8592680m053766j0496244q746929n927819k826653j386008p42240m09650
$$ 38592680 34538914 24042670 15295741 9367922 6541269 5155261 4413021 4003371
10546D003371j62119N4707O3855M00546R76401J884995M076839O793332P538214
$$ 4003371 3841252 3895959 3959814 4360360 5336761 7221756 11298595 18091927 25630141
10537B5630141M834277O0737m563691j486779J323576K188771j819860o696226
$$ 25630141 30464418 30525155 25961464 24474685 25798261 27987032 26167172 19470946
10529A9470946o821481n475585k642288j363956n94740n31824l10293l31358j22632
$$ 19470946 12649465 7173880 4531592 3167636 2572896 2041072 1730779 1399421 1276789
10520A276789j15203j85753j53445j41627P183k66179Q9878j20102k2562r9285
$$ 1276789 1161586 975833 822388 680761 687944 421765 511643 391541 368979 269694
10510B69694k883l7243o952j2111K8578A01376k9218J58047J5901I8054L7045
$$ 269694 266811 229568 222616 210505 239083 101376 72158 230205 246106 98054 135099
10499A35099a1059l7722G7841J39442p6956n6169j8382mk5629c0193I9386i927
$$ 135099 -11059 -48781 77841 217283 140327 84158 65776 65772 40143 -30193 99386 -9927
10486f944E9126L1899b1046r5471D8359A6813E433J13545n5800a6739f944F3332
$$ -6944 59126 91025 -21046 -116517 48359 16813 5433 118978 63178 -16739 -6944 63332
10473e6612A590O2863d688m3992a9849E9403m593a1687j22996e348k3773A5288
$$ -56612 1590 64453 -4688 -48680 -19849 59403 54810 -11687 -134683 -5348 -29121 15288
10460C1648K2932M2120b6312A00408Q828D8857d7759g815m5370A6134b5096q254
$$ 31648 54580 96700 -26312 100408 109236 48857 -47759 -7815 -53185 16134 -25096 -33350
10448c3350F9572e1076E0301b0726H9292c270n1731F7480a1258H8676l9984a3793
$$ -33350 69572 -51076 50301 -20726 89292 -3270 -55001 67480 -11258 88676 48692 -13793
10435a07611A13895L0781J24151J30320K5828L1909B15555r2595l6615J40762
$$ -107611 113895 144676 268827 399147 424975 456884 215555 122960 86345 227107
10425B27107a0025G7826K5804A5052J2113E104a19663E4008a2687j55052b2445
$$ 227107 -10025 77826 103630 15052 27165 5104 -119663 54008 -12687 -167739 -22445
10413I448a4586I1488l4474J48994O4074n5311R0592k2159I8873m7346d7674L011
$$ 9448 -14586 91488 57014 206008 270082 214771 305363 283204 98873 51527 -47674 -44663
10401d4663r9968D4764f170j02932a5830B3348f556A25293a31771i650I1580e124
$$ -44663 -144631 44764 -6170 -109102 -15830 23348 -6556 125293 -131771 -9650 91580 -5124
10388e0628H9518B8080K05517a0920A02161A0966J5772J26702j8688F6618K68623
$$ -50628 89518 28080 233597 -10920 102161 10966 26738 153440 134752 66618 335241
10377C35241R0648j21892L3735J7758L0600l3276k320F6287R0125R2970H6407
$$ 335241 425889 303997 337732 355490 386090 352814 350494 66287 156412 249382 86407
10365i0249C4958j6588O1462B9735J0194J7913c8663l8882D0811e7996k3444B3536
$$ -90249 34958 18370 79832 29735 39929 57842 -38663 -77545 40811 -57996 -81440 23536
10352f1869C4172i494G3507A0534h6568o343E1060b2314L132o6182J0502I348
$$ -61869 34172 -9494 73507 10534 -86568 -92911 51060 -22314 -19182 -85364 -74862 9348
10339B5347f8112B0350l222M6570d0270B9260M6519b5312A52149f8825A01329
$$ 25347 -68112 20350 17128 63698 -40270 29260 75779 -25312 152149 -68825 101329
10327b5785C5811K09006F7112O6679A5635R4367J49836l7841k4116O2175G5595
$$ -25785 35811 244817 67112 133791 15635 110002 259838 221997 197881 260056 75595
10315A1823b7970M245H5802C2238g0143A21911B6849i0534A8567O6792B9293N0156
$$ 11823 -27970 -23725 85802 32238 -70143 121911 26849 -90534 18567 85359 29293 79449
10303G9449J16676K2280A08989M6995J21j8239K4739O3176I2595o787Q1494A0329
$$ 79449 196125 218405 108989 155984 156105 137866 162605 225781 92595 85808 167302 10329
10290C3246c8826h357j1583a989j45262a4675A8048i0104e720D2334A7969K1941
$$ 33246 -38826 -8357 -19940 -1989 -147251 -14675 18048 -90104 -5720 42334 17969 39910
10278C9910e4001j04C8290D847P7463a5740l7709g803F910M8179a68957D8738
$$ 39910 -54001 -54105 38290 4847 82310 -15740 -53449 -7803 6910 55089 -168957 48738
10265A9732h4559b6219A4114a0364n3103l2124I748f3063j6916A4511c8751c668
$$ 19732 -84559 -26219 14114 -10364 -63467 -95591 9748 -63063 -79979 14511 -38751 -3668
10252B3406J9416b9154k1130q9405f8886H7364f7152H9806j2363C6505g1783c0042
$$ 23406 42822 -29154 -50284 -139689 -68886 87364 -67152 89806 77443 36505 -71783 -30042
10239A21304g0790E9814a15638J544B8663n089a44637M6116I167J17956b1684
$$ 121304 -70790 59814 -115638 -114094 28663 23574 -144637 -98521 9167 127123 -21684
10227b179o339D2451A4309d674j16392A8922a23821G1251a6480M07D2771c4673
$$ -2179 -8518 42451 14309 -4674 -121066 18922 -123821 71251 -16480 -16073 42771 -34673
10214d2237A3877D812A88K0812n141n655a41826I1878j2763F932L876b5284e170
$$ -42237 13877 4812 188 21000 15859 10204 -141826 91878 79115 6932 10808 -25284 -5170
10200b6259C8541b2094h415G4941e9581E0878c9204B2668i4707E3792e428A1725
$$ -26259 38541 -22094 -8415 74941 -59581 50878 -39204 22668 -94707 53792 -5428 11725
10187a33369O1787b7368j9807a4693n6737M565J2882M640J8656A9081N7747f3331
$$ -133369 -71582 -27368 -47175 -14693 -71430 -66865 -53983 -49343 -30687 19081 76828 -63331
10174B6112e2123p6033A6698b9245A25523a03597L4608a1687C8903e4768a5244
$$ 26112 -52123 -128156 16698 -29245 125523 -103597 -68989 -11687 38903 -54768 -15244
10162a09950e3781p034J285B3165b3205D844A888J7556J0290P87g2481a6321k821
$$ -109950 -53781 -60815 -59530 23165 -23205 4844 1888 19444 29734 30521 -72481 -16321 -19142
10149a9142l3056B0383g8139a1897j26150F2342B4394a57410c0456A7180a1281
$$ -19142 -52198 20383 -78139 -11897 -138047 62342 24394 -157410 -30456 17180 -11281
10137a5249D2554h7824A9289a59284E3404f427k2228F636O344a5135G2176i0756
$$ -15249 42554 -87824 19289 -159284 53404 -6427 -28655 6636 12980 -15135 72176 -90756
10124d6701D5936e7040o6k4083A702e0532D0254b3581A3620J6652H792c3292l4936
$$ -46701 45936 -57040 -57106 -81189 1702 -50532 40254 -23581 13620 30272 8792 -33292 -68228
10111f8228B563J8222a02237B9315g5433E3651k0807G780b766E9143K1915a9170
$$ -68228 2563 20785 -102237 29315 -75433 53651 32844 7780 -2766 59143 81058 -19170
10098E9391a5564k9253a526j16981A3479a34147b5340p6769F8601d3613J1584
$$ 59391 -15564 -44817 -1526 -118507 13479 -134147 -25340 -102109 68601 -43613 -32029
10087c2029C0130c9399R023j2113h678A0550g4620B4586G886e7345K2339D6887
$$ -32029 30130 -39399 -30376 -42489 -8678 10550 -74620 24586 7886 -57345 -35006 46887
10074f7612a1171k6625B6359q624d1994b20l2130J3397D8193d6518k0581b9300
$$ -67612 -11171 -37796 26359 17735 -41994 -220 -32350 -18953 48193 -46518 -67099 -29300
10061E1630E21P837a0017q2007B7544a16915H4119a32092m7138c8524A1585c7226
$$ 51630 521 8358 -10017 -92024 27544 -116915 84119 -132092 -179230 -38524 11585 -37226
10048A16723i157m1301P902k9911h143A07708D4416a30992M1672p7890I0883c8059
$$ 116723 -9157 -50458 -42556 -72467 -8143 107708 44416 -130992 -89320 -167210 90883 -38059
10035A23251B7464d4683F1126b2319l3307a4522o4562c273C5753R456g9709F1070
$$ 123251 27464 -44683 61126 -22319 -55626 -14522 -79084 -3273 35753 45209 -79709 61070
10022a00577e788B7325L8212B3582d6621B6539d2554p3872g488r767A21673C0726
$$ -100577 -5788 27325 65537 23582 -46621 26539 -42554 -116426 -7488 -17255 121673 30726
10009A6205a32906a8763E4136M8265a18088B8821a72231a868p3673C6198J3146
$$ 16205 -132906 -18763 54136 102401 -118088 28821 -172231 -1868 -75541 36198 49344
9998D9344k4245M806e0842a3372E7250d3242p0420E9761f0382j3849J2761J0243
$$ 49344 25099 29905 -50842 -13372 57250 -43242 -113662 59761 -60382 -74231 -61470 -51227
9986e1227A9586L4619h2976F4530k2451g050A43637o5661b7676j44594K4834D7881
$$ -51227 19586 54205 -82976 64530 42079 -7050 143637 77976 -27676 -172270 -147436 47881
9973a5430N32o4550L7191m4146F9925d8388K3589A35014l2311a328p3182a3936
$$ -15430 -14898 -79448 -42257 -86403 69925 -48388 -24799 135014 102703 -1328 -74510 -13936
9960c6792m2428b4927E9295g4727A4456i5689b1327j1499B0794L8758g3387b6652
$$ -36792 -79220 -24927 59295 -74727 14456 -95689 -21327 -32826 20794 59552 -73387 -26652
9947d7814m2380A8843e5939l7639E381P7551e494F3564B1141g5592E2879a789
$$ -47814 -90194 18843 -55939 -93578 5381 82932 -5494 63564 21141 -75592 52879 -1789
9934h3397B7990e6182J9332C7133a3245A206i314n6725b020j77973h0483C7037
$$ -83397 27990 -56182 -36850 37133 -13245 1206 -9314 -66039 -2020 -179993 -80483 37037
9921a0781I1140g5288b8975e336m4010f949j4665Q295F2209J4798p479A3322K1359
$$ -10781 91140 -75288 -28975 -5336 -49346 -6949 -21614 -13319 62209 77007 69528 13322 34681
9908C4681e3063K1947p6135A2388K160e2112G204i3353K0940F4671R225B688a21128
$$ 34681 -53063 -31116 -107251 12388 14548 -52112 7204 -93353 -72413 64671 73896 2688 -121128
9894h7599B715e6709l5807c2647A2006c299F1318A6372G519O0114h8113a2994
$$ -87599 2715 -56709 -92516 -32647 12006 -3299 61318 16372 7519 67633 -88113 -12994
9881H3864K6953A5850g3216J8669e060q252j5706B6506a7837p2611K4266J9561
$$ 83864 110817 15850 -73216 -54547 -5060 -13312 -29018 26506 -17837 -90448 -66182 -46621
9869d6621A6470P0769l3707r413M699A628h0012a0474j4674B1260E559f5216b8254
$$ -46621 16470 87239 53532 44119 48818 1628 -80012 -10474 -25148 21260 5559 -65216 -28254
9855B04349b2255n1044J5011D8800l813R1290Q376b7233A22179K9478J97575J90194
$$ 204349 -22255 -73299 -58288 48800 44987 136277 144653 -27233 122179 151657 349232 539426
9843E39426L83039L83468L23681l01563F06543k63423Q592A67140E3738O9120
$$ 539426 922465 1305933 1629614 1328051 606543 343120 351712 167140 53738 122858
9833A22858E6383j2706b7463J1883A04613C6828a00956c703E7201d6231j1241
$$ 122858 56383 43677 -27463 -15580 104613 36828 -100956 -3703 57201 -46231 -57472
9822e7472A7545J26806C2673e5308k1673m2085N1574A08716k1072a1867n449o7733
$$ -57472 17545 144351 32673 -55308 -76981 -119066 -67492 108716 87644 -11867 -17316 -85049
9810h5049C7703e4844E6732d4925J2578o7275K0856j01671h5199l0878M7005A6501
$$ -85049 37703 -54844 56732 -44925 -32347 -99622 -78766 -180437 -85199 -116077 -69072 16501
9797a00184F459M6784D6d750B85a3023l302A19954E414K6807F813Q0211a41321
$$ -100184 6459 53243 46 -4750 285 -13023 -16325 119954 5414 32221 6813 87024 -141321
9783i016o3610K1449H844a19341E977N5593a2069p8022A1220P742d21C1377M0327
$$ -9016 -72626 -51177 8844 -119341 5977 61570 -12069 -90091 11220 18962 -421 31377 71704
9770G1704A8479O4644c7720o8824F2365h2982F3045a60159M2524k313e4449H5756
$$ 71704 18479 83123 -37720 -106544 62365 -82982 63045 -160159 -117635 -119948 -54449 85756
9757d8899A21109i62m6956b2944k6920G8584l2736K1590e5600J6907A6016R064
$$ -48899 121109 -962 -47918 -22944 -49864 78584 45848 67438 -55600 -38693 16016 25080
9745B5080b1119B9327e5556k6238K0988c133A2756m206J3337J04747D4194J5592
$$ 25080 -21119 29327 -55556 -81794 -60806 -3133 12756 8550 21887 126634 44194 59786
9733E9786K4492a1648l636q6864B3756d4011C7589g9276b3233k9743H7143j4796
$$ 59786 84278 -11648 -15284 -102148 23756 -44011 37589 -79276 -23233 -52976 87143 72347
9721G2347a0665p691I9647j4396A3156g3647a4366l7619m8307d3291A1371R0062
$$ 72347 -10665 -18356 99647 85251 13156 -73647 -14366 -51985 -100292 -43291 11371 101433
9709A01433m5549f8663D0980c9012G9564i478A30737E9120j0168a20864D7394
$$ 101433 55884 -68663 40980 -39012 79564 -9478 130737 59120 48952 -120864 47394
9697E4626A8597P787b0097R162o2940n9076d372n911A04828d3692q027A66668
$$ 54626 18597 26384 -20097 -10935 -73875 -132951 -4372 -10283 104828 -43692 -51719 166668
9684f4820C2067C953O4765B4166K6304a09615d3508E5943D039f3728F004G78Q3642
$$ -64820 32067 3953 68718 24166 50470 -109615 -43508 55943 4039 -63728 6004 778 84420
9671H4420k6730j5853b3911J547I2615E783b7647A8877O6541l5158P5886e8061
$$ 84420 57690 41837 -23911 -22364 92615 5783 -27647 18877 85418 50260 126146 -58061
9658A07109k5723j9748k7702j5285M890o805d286A08069e1154D2228Q1786A4182
$$ 107109 81386 61638 33936 18651 23541 16736 -4286 108069 -51154 42228 124014 14182
9645H048J40922k5521n9208K3647Q14b0017E8809N4093j9766L5312m5222O7521
$$ 8048 148970 123449 64241 87888 88702 -20017 58809 112902 93136 128448 83226 150747
9633A50747p3634J47318l3439H5073P3029J724L0032N2095P7833P2027j37682
$$ 150747 77113 224431 190992 85073 158102 159826 189858 241953 319786 391813 254131
9622B54131J85061o6656J29518j03477J56930q7644L5747j6559l2407K15912K2409
$$ 254131 439192 372536 502054 398577 555507 467863 503610 487051 454644 670556 692965
9611F92965J03946J20614J24638K37168K00253K29344L57592L46310N26461M45935
$$ 692965 796911 917525 1042163 1279331 1479584 1708928 2066520 2412830 2939291 3385226
9601C385226P02216J023484J076651J299998J869614K144119L278195M502702
$$ 3385226 4087442 5110926 6187577 7487575 9357189 11501308 14779503 19282205
9593A9282205P655066J2770296K6156290N7009578Q6285815R1424743m576928
$$ 19282205 26937271 39707567 65863857 122873435 209159250 300583993 296007065
9586B96007065j18673344q6440447l6491457j8539309j1607386o414911m397652
$$ 296007065 177333721 90893274 54401817 35862508 24255122 17840211 13442559
9579A3442559l057462k188444j816765j103406q10537q49016n45093n36762j47506
$$ 13442559 10385097 8196653 6379888 5276482 4465945 3616929 3071836 2535074 2387568
9570B387568l03207j39744k71623j8947k47320O1278j01415o9412j08652j50588
$$ 2387568 2084361 1944617 1672994 1654047 1406727 1468005 1366590 1297178 1188526 1037938
9560A037938p9283j94112j86962P9750o4654j28530J20280j35367p2280J26281
$$ 1037938 958655 764543 577581 657331 592677 464147 584427 449060 376780 503061
9550E03061m8972l5241m5514M0578j55691R2465p9507J35345j04436k7486j06567
$$ 503061 454089 418848 373334 413912 258221 350686 271179 406524 302088 274602 168035
9539A68035K2986R534L5026m3599J54184q7373r9207k1463Q3207A00422k9762
$$ 168035 191021 200555 235581 191982 346166 258793 159586 138123 221330 100422 70660
9528G0660L2690J621k0930P7809D7744e882A14254n3197R1969F4866M6686e3624
$$ 70660 103350 104971 84041 161850 47744 -5882 114254 61057 153026 64866 111552 -53624
9515g6144l6066C3580Q9914A2543J01784j0773C9700a0867H7114a0299B1179P8331
$$ -76144 -112210 33580 123494 12543 114327 103554 39700 -10867 87114 -10299 21179 99510
9503I9510k484Q6015H4862k2593a0333G2683f5145B22332e7400F4186H934b2550
$$ 99510 97026 183041 84862 62269 -10333 72683 -65145 222332 -57400 64186 8934 -22550
9490h2160C7299A6353D522g307j7707q1287g44I8084B5842c3622r96l2323D4746
$$ -82160 37299 16353 4522 -7307 -25014 -106301 -744 98084 25842 -33622 -34618 -66941 44746
9476a6012E1423k4221e0595q1879c1792q1132A7561J63892g707m3201D3266g9983
$$ -16012 51423 27202 -50595 -132474 -31792 -112924 17561 181453 -7707 -50908 43266 -79983
9463F5485b2220N02n0399F9771d215A1635M9887d6762B1821a52083N5737A6640
$$ 65485 -22220 -21718 -72117 69771 -4215 11635 61522 -46762 21821 -152083 -96346 16640
9450b2132B9552P254f7818G6207a01962K2692L8728C7511j5725a4701C9820e427
$$ -22132 29552 36806 -67818 76207 -101962 -79270 -40542 37511 21786 -14701 39820 -5427
9437H2490a6920F3598d2570K0715E8259a40876p9360a0260E2878g3980m1106b6008
$$ 82490 -16920 63598 -42570 -21855 58259 -140876 -220236 -10260 52878 -73980 -115086 -26008
9424b6719j20341c7673d287B392e9027j2366j2054J1481B2812b7143l4606K6085
$$ -26719 -147060 -37673 -4287 2392 -59027 -71393 -83447 -71966 22812 -27143 -61749 -35664
9412c5664C9452c9516Q350q782a6196j17942B2358b2704B2466h8144F74a21204
$$ -35664 39452 -39516 -31166 -39948 -16196 -134138 22358 -22704 22466 -88144 674 -121204
9399e2874A4723i5204h234l9931I6308A1885b1274p7465c5184J7159n0058B4982
$$ -52874 14723 -95204 -8234 -48165 96308 11885 -21274 -98739 -35184 -18025 -68083 24982
9386i1577C018g9711a5884o7328G1996a2416n5G6565a23451Q326J1855H4012B2060
$$ -91577 3018 -79711 -15884 -83212 71996 -12416 -12471 76565 -123451 -115125 -103270 84012 22060
9372A6639J9630j3561b4000D7980a32122H723a01172n437j3210b4483j5471a9346
$$ 16639 36269 22708 -24000 47980 -132122 8723 -101172 -106609 -119819 -24483 -39954 -19346
9359D9001f3270b3356B7951A3067d1799k0768l0432c3053r902k1845E3821A009
$$ 49001 -63270 -23356 27951 13067 -41799 -62567 -92999 -33053 -42955 -64800 53821 1009
9346d7839A9581b6385C4496a29198D5959f2976C7843a0847M632E6948J17173j1376
$$ -47839 19581 -26385 34496 -129198 45959 -62976 37843 -10847 -6215 56948 174121 162745
9334A62745o6245m0327J45176M0507K97782M16075N50513l072l08043E52731B44933
$$ 162745 96500 56173 201349 241856 539638 955713 1506226 1503154 1195111 552731 244933
9322B26434q4115k8766l3406N147J2900A7803m21a2697H1638b3190o2920L9999
$$ 226434 142319 113553 80147 85294 98194 17803 17382 -12697 81638 -23190 -86110 -46111
9310d6111K1988l6235q914l0276A4088a6891l6621p8485A7894a7562M770H7236
$$ -46111 -24123 -60358 -69272 -99548 14088 -16891 -53512 -131997 17894 -17562 -12792 87236
9297f9900D2366e3314j9179J5787D4212N662D280Q6557C3531g0368l551l3800
$$ -69900 42366 -53314 -72493 -56706 44212 49874 4280 90837 33531 -70368 -73919 -107719
9285a07719a3557n0290B0560a02265G4332A1178J9747a07490b9617o3864A04837
$$ -107719 -13557 -63847 20560 -102265 74332 11178 30925 -107490 -29617 -93481 104837
9273g7684e057q7422C6807d7091F1006A3668L9063P0919c6571J296p0287C2251
$$ -77684 -5057 -92479 36807 -47091 61006 13668 52731 123650 -36571 -35275 -105562 32251
9260a27748A2563K3491a389k7655D8631B1006C345r72a63287K5415f8839h858
$$ -127748 12563 36054 -1389 -29044 48631 21006 3345 2373 -163287 -137872 -68839 -8858
9247a84164b6148k6894G3061a30904D8018a6770j09550G3735L6549g4205J6657
$$ -184164 -26148 -53042 73061 -130904 48018 -16770 -126320 73735 110284 -74205 -57548
9236e7548J9863k1495o0984a114F0719c9900m885k7440D6985i9421n107M1233
$$ -57548 -37685 -59180 -120164 -1114 60719 -39900 -44785 -72225 46985 -99421 -104528 -63295
9224f3295B9793L1921k6352e7480b3547A4817a79814F8060a19432E961e8597j7780
$$ -63295 29793 61714 35362 -57480 -23547 14817 -179814 68060 -119432 5961 -58597 -76377
9212g6377n0855d2811n6004b0453B0344L7684b6109I3914a33933c2384a3100l7570
$$ -76377 -127232 -42811 -98815 -20453 20344 58028 -26109 93914 -133933 -32384 -13100 -50670
9200e0670F380c9636o9190L1505m8190A1250J1054d4003o1952B3288b9569a3886
$$ -50670 6380 -39636 -108826 -77321 -125511 11250 22304 -44003 -105955 23288 -29569 -13886
9187e854A08813I565c8523K335a1081l6443K1501C7623a35558a4199G1963p616
$$ -5854 108813 9565 -38523 -36188 -11081 -47524 -26023 37623 -135558 -14199 71963 64347
9175F4347A9453a25714b5278n7239K6572A26333b04564A10161C4538O3950h3540
$$ 64347 19453 -125714 -25278 -82517 -55945 126333 -204564 110161 34538 98488 -83540
9163a9135l9463I7083c37q0756r058J2504b1563n7282a9404P433k123B4263q784
$$ -19135 -58598 97083 -337 -81093 -90151 -77647 -21563 -78845 -19404 -11971 -14094 24263 15479
9150A5479e4738B022N2796O7939E2505M3843L5427d4000J2997A51522h9768A01948
$$ 15479 -54738 2022 54818 122757 52505 96348 131775 -44000 -31003 151522 -89768 101948
9137a47503O4042b1529F2496g7221B4156j1277e782j9702d580l8660m7483a6988
$$ -147503 -83461 -21529 62496 -77221 24156 12879 -5782 -25484 -4580 -43240 -90723 -16988
9124h9806b0938o6388k6994c8484O829E3236d8659B9945i4652C5248M4765a3268
$$ -89806 -20938 -87326 -114320 -38484 -31655 53236 -48659 29945 -94652 35248 80013 -13268
9111h3452E7714j1134N6412D818a6546A8049b1393A4409o489g3011c4677C3066
$$ -83452 57714 46580 102992 4818 -16546 18049 -21393 14409 7920 -73011 -34677 33066
9098a00918C6531B502M8673O0583d2154m6314m6004d5867f35n1783K2439k2845
$$ -100918 36531 2502 51175 111758 -42154 -88468 -134472 -45867 -635 -52418 -29979 -52824
9086e2824A4939b6632k9394J1250l2207A16141d7602A7541K0941e4703K1053n522
$$ -52824 14939 -26632 -56026 -44776 -76983 116141 -47602 17541 38482 -54703 -33650 -39172
9074c9172F083a58409P2271a3045D5821a42895F2826b9890M790k781i18k8091
$$ -39172 6083 -158409 -86138 -13045 45821 -142895 62826 -29890 -25100 -27881 -918 -29009
9062b9009g114E787L7594b20520e9617b980p921q9502d1514k4155b6913k3203
$$ -29009 -7114 5787 43381 -220520 -59617 -2980 -10901 -100403 -41514 -65669 -26913 -50116
9050e0116H5009i0849M0345B1823r606L553g1568A02033g8064b7039B6392a28230
$$ -50116 85009 -90849 -50504 21823 12217 15770 -71568 102033 -78064 -27039 26392 -128230
9037d5792j1384F8200P6878b3521N28C5499J1243a09581e4084B3346M4728B4005
$$ -45792 -57176 68200 145078 -23521 -22993 35499 46742 -109581 -54084 23346 68074 24005
9024a449G2297c9830A1767a4999j32964A8988a26077N2922E5472h3662c0277N986
$$ -1449 72297 -39830 11767 -14999 -147963 18988 -126077 -73155 55472 -83662 -30277 -24291
9012b4291j5235D4189K9103A0492d8544k0234C1266E012l10K747a12568D4020
$$ -24291 -39526 44189 73292 10492 -48544 -68778 31266 5012 4702 7449 -112568 44020
8999a11440d8508j08376E4456d324F3864g6347l289B056a29068N4690a6118b846
$$ -111440 -48508 -156884 54456 -4324 63864 -76347 -79636 2056 -129068 -74378 -16118 -2846
8986a432A3010e6372C3215b583E4132b9458m9100F016g8070E9897h567C5741K0054
$$ -1432 13010 -56372 33215 -2583 54132 -29458 -78558 6016 -78070 59897 -8567 35741 55795
8973E5795f6168F6784b2115j5495I5196A3748d7253E0165e1400C414J16177C0865
$$ 55795 -66168 66784 -22115 -37610 95196 13748 -47253 50165 -51400 3414 119591 30865
8960C1335b6658B1869Q9912B3630P6287M1411D1676k0305L2922M5667K1024b8792
$$ 31335 -26658 21869 111781 23630 99917 141328 41676 21371 54293 99960 120984 -28792
8947A29927l6797J57307C3758J39745G8135L6304k2903N0244O3248J02578j49768
$$ 129927 93130 250437 33758 173503 78135 114439 91536 141780 205028 307606 157838
8936A57838L0461N9758Q4715J40026P4998J10031Q474J28829O7431Q5744Q1445
$$ 157838 188299 248057 332772 472798 547796 657827 666301 795130 862561 948305 1029750
8925A029750O4714M0697J73268K12764J57765J43465K90943J83936k302n7280
$$ 1029750 1094464 1135161 1308429 1521193 1678958 1822423 2113366 2297302 2295000 2237720
8915B237720k954J8129L4011l1006J16994j30783Q6047J24397L6013p0925k93163
$$ 2237720 2234766 2252895 2286906 2255900 2372894 2242111 2328158 2452555 2488568 2417643 2124480
8904B124480q7488k07752j36593j70275o4704r8677p6047q4395j45276l9779r7737
$$ 2124480 2036992 1829240 1692647 1522372 1457668 1358991 1282944 1198549 1053273 1013494 915757
8893I15757p6584k29019k02362J41454j14574p9079j65800J08931j6028I8752
$$ 915757 839173 610154 407792 549246 434672 355593 189793 298724 282696 98752
8882A99817j4312k4134O0356l4026J3964F0669K01116r0148j3781m6251L5181
$$ 199817 185505 161371 221727 187701 201665 60669 261785 171637 157856 111605 146786
8871A46786J75356A59044n3289J0129L2304p017P9999p3258B4421Q9365k5864
$$ 146786 322142 159044 105755 115884 148188 141171 221170 147912 24421 113786 87922
8860H7922J08640n7166k9809d5630E9615M5643h817I0353m786o628i0096A82556
$$ 87922 196562 139396 109587 -45630 59615 105258 -8817 90353 85567 78939 -90096 182556
8847E8764a1293A49816M3743m0765P3659o3734j5217n8854Q8005e4162A05202
$$ 58764 -11293 149816 193559 152794 226453 162719 147502 88648 176653 -54162 105202
8835A17885D1797J55186m2701o2763N7924E6637J3661R783N7392j3830C9294O9958
$$ 117885 41797 196983 154282 91519 149443 56637 70298 80081 137473 123643 39294 109252
8823A09252Q2955B7823M3564J3671l8911K52A603J42588A8627K22072E4840d9407
$$ 109252 192207 27823 71387 85058 46147 46399 1603 144191 18627 240699 54840 -49407
8810a2426C5371J12070E3686d9834a8905j4231k3175A31094n7881d0174B6184
$$ -12426 35371 147441 53686 -49834 -18905 -33136 -56311 131094 73213 -40174 26184
8798c2295J3341l3632C218g0542O783A05717d5647n390a3761D7406j6231c1758
$$ -32295 -18954 -52586 3218 -70542 -63759 105717 -45647 -51037 -13761 47406 31175 -31758
8785h3089E5871k6459P3716h2426n3515M2047c1387k9195a2107c892A53326A8840
$$ -83089 55871 29412 103128 -82426 -135941 -93894 -31387 -60582 -12107 -3892 153326 18840
8772g8321b2637N615p83m0952A93423G0378f8694G673K5848i1472c0510l5834
$$ -78321 -22637 -17022 -17805 -58757 193423 70378 -68694 7673 33521 -91472 -30510 -66344
8760f6344A6941L0606A0738a27406F260b0376G7999A2591g0476b6063k9311I709
$$ -66344 16941 47547 10738 -127406 6260 -20376 77999 12591 -70476 -26063 -55374 9709
8747e5385H9074a7844C6835K0759A4143f1718a0500H8974d8413C9986c4704Q856
$$ -55385 89074 -17844 36835 57594 14143 -61718 -10500 88974 -48413 39986 -34704 -25848
8735b5848F4726C0777M4798l0887g1724L3678A27412m389L4617J3602J33448L4396
$$ -25848 64726 30777 75575 44688 -71724 -38046 127412 123023 157640 171242 304690 339086
8723C39086l0341K50891R1514L88744P21520R73730P88653N06100k81857p95617
$$ 339086 308745 559636 651150 1039894 1761414 2735144 3523797 4029897 3748040 2952423
8713B952423r90111o80959k55171K3276K81798L82188R05159Q94019O31777k52855
$$ 2952423 1962312 1281353 1026182 1049458 1331256 1713444 2618603 3512622 4144399 3891544
8703C891544r30501j229150p36298m05176k58720J35002j45810r8598F1857j1712
$$ 3891544 2961043 1731893 995595 590419 331699 466701 320891 222293 61857 50145
8693E0145M8886j6306o624k3452k4999d9903A6580g125m0367B3144a5324k0386
$$ 50145 99031 82725 76101 52649 27650 -49903 16580 -7125 -47492 23144 -15324 -35710
8681c5710h168A4981b3291m3450B2894a14206a0987j5171m7274d29k3806C4736
$$ -35710 -8168 14981 -23291 -66741 22894 -114206 -10987 -26158 -73432 -429 -24235 34736
8668f0634a9868N158k1884K876C5452g23D4065e3000A4832f5879J8160D8753a1626
$$ -60634 -19868 -14710 -36594 -33718 35452 -723 44065 -53000 14832 -65879 -47719 48753 -11626
8654a18577A24259c9691E9167h7863K6946k2762K4832D359b5763k3472F0844a03891
$$ -118577 124259 -39691 59167 -87863 -60917 -83679 -58847 4359 -25763 -49235 60844 -103891
8641I9323j811G46P471f9131b811m4694k385e805n8606C3526r843c3608j8487
$$ 99323 97512 746 8217 -69131 -2811 -47505 -49890 -5805 -64411 33526 23683 -33608 -52095
8628e2095d896k1290B1384h3810a3068o47A01272A0638P1693a23506c7554J7701
$$ -52095 -4896 -26186 21384 -83810 -13068 -13715 101272 10638 82331 -123506 -37554 -19853
8616a9853I27a02711f557p864j33073A9908L0058e8450A2243d4073J1933o1835
$$ -19853 927 -102711 -6557 -14421 -147494 19908 49966 -58450 12243 -44073 -32140 -93975
8604i3975L9628m4365d4163l994A00584B2735h086q8119F756c3828E8209d7125
$$ -93975 -54347 -98712 -44163 -48157 100584 22735 -8086 -96205 6756 -33828 58209 -47125
8591e4507k4389l0941d8326m1009A25908n7440A8432f3988j47349A8813h307D7864
$$ -54507 -78896 -109837 -48326 -89335 125908 68468 18432 -63988 -211337 18813 -8307 47864
8578d7539J8065o9044M1071b2762a0360n8F4189c8562r5158A9734g8997N038k0515
$$ -47539 -29474 -98518 -57447 -22762 -10360 -10418 64189 -38562 -133720 19734 -78997 -73959 -94474
8565i4474M5468J9803a530q7443L4742C6541h076k1808h214j37999O0472a5387
$$ -94474 -49006 -29203 -1530 -88973 -54231 36541 -8076 -29884 -8214 -146213 -85741 -15387
8552b2415k2705a3614F6512b3180D8224a77670O1868n4377G462b2236E3403e431
$$ -22415 -45120 -13614 66512 -23180 48224 -177670 -115802 -170179 7462 -22236 53403 -5431
8539I9299D2840c8037J7137k416B3667a60478I875K4216a24330K8322E0618M1638
$$ 99299 42840 -38037 -20900 -23316 23667 -160478 9875 34091 -124330 -96008 50618 92256
8527I2256k6488b3883n5507D9496f1683A1755g0104K4621A6677O071M7356B431
$$ 92256 65768 -23883 -79390 49496 -61683 11755 -70104 -45483 16677 22748 70104 2431
8514C6793b32400D1612b6679q7789M6365l600I962P3135K4349B925L7509g4343
$$ 36793 -232400 41612 -26679 -114468 -68103 -71703 9962 83097 107446 2925 40434 -74343
8501D1377g6105E6907c6563n3820n1239E591M1772a2635m7768J5768A8608f0517
$$ 41377 -76105 56907 -36563 -90383 -141622 5591 47363 -12635 -60403 -44635 18608 -60517
8488H5924B3688J8441d2822j03651b0606q0251a1965q6207c834H535f2935k5204
$$ 85924 23688 42129 -42822 -146473 -20606 -100857 -11965 -98172 -3834 8535 -62935 -88139
8476h8139c149j5624k9959B6929I012O8915l0618a6130n6585a1077A4784O5649
$$ -88139 -3149 -18773 -48732 26929 9012 77927 47309 -16130 -72715 -11077 14784 80433
8464H0433A5845a71397F1344A6793a36515e5609A9473e0971c828l7717G7718e2158
$$ 80433 15845 -171397 61344 16793 -136515 -55609 19473 -50971 -3828 -41545 77718 -52158
8451H951c647F6254B3815g5497J7522l0438L2695A1926d7119g425m0687a1445
$$ 8951 -3647 66254 23815 -75497 -57975 -88413 -55718 11926 -47119 -7425 -48112 -11445
8438D0565c0109E4905i9801d5731l3357b0981r8337e4729B1220L0267f0856E4160
$$ 40565 -30109 54905 -99801 -45731 -79088 -20981 -119318 -54729 21220 51487 -60856 54160
8425A31624b5206L560n4612F5849O0057E236M65p22K3689m654g7472E3648c6113
$$ 131624 -25206 -21646 -76258 65849 125906 5236 5701 4979 28668 24014 -77472 53648 -36113
8411a9169M292A28545F2797a09881A6965d9002k9125N044k9237P096M6362B2491
$$ -19169 -14877 128545 62797 -109881 16965 -49002 -78127 -73083 -102320 -95224 -48862 22491
8398a6560q7643c7434o3158a0800B571R0889c8031j1823l5487l9407A847e2346
$$ -16560 -104203 -37434 -100592 -10800 2571 93460 -38031 -49854 -85341 -124748 1847 -52346
8385c6691j4810l8232c9217p1966C2643c1402B2574b0339m2341K1365A971c1722
$$ -36691 -51501 -89733 -39217 -111183 32643 -31402 22574 -20339 -62680 -41315 1971 -31722
8372a66683a4905j0824e347r0285B9507b0967l3728Q532m2755c6643a7867f566
$$ -166683 -14905 -25729 -5347 -95632 29507 -20967 -54695 -46163 -88918 -36643 -17867 -6566
8359c2064A2859g1443K280j578K1636j5543A13644i6716E7242d6843j33523K1595
$$ -32064 12859 -71443 -69163 -70741 -49105 -64648 113644 -96716 57242 -46843 -180366 -158771
8347a58771J6728i612o884O282m9127B8708e0965m2711j4072D0505G308d1422
$$ -158771 -142043 -9612 -16496 -10214 -59341 28708 -50965 -93676 -107748 40505 7308 -41422
8334B4100a08841D5054A6284a57841e662A42789F942f7298p7971C6859a29217
$$ 24100 -108841 45054 16284 -157841 -5662 142789 6942 -67298 -145269 36859 -129217
8322d8173K116C0669c1688D2357c1800k0228J7455l5347q0474O8749C1671d1589
$$ -48173 -46057 30669 -31688 42357 -31800 -52028 -34573 -69920 -150394 -81645 31671 -41589
8309D324h0894K5679k7217l2184c1916o4618k1372F1102a44246E7352c1458C3931
$$ 4324 -80894 -55215 -82432 -114616 -31916 -96534 -117906 61102 -144246 57352 -31458 33931
8296f9722j41964c4199k9916p0365B89b8799q9295E2339H722a09600d391B5988
$$ -69722 -211686 -34199 -64115 -134480 289 -28799 -118094 52339 8722 -109600 -4391 25988
8283c1634m7375C987g7034b5362o8957A712i3889j8705B4617I211c2902l7223
$$ -31634 -79009 3987 -77034 -25362 -94319 1712 -93889 -112594 24617 9211 -32902 -70125
8271g0125C6432e798F0077i7561B3125J6878A8362b6470l5829R997l9910b1684
$$ -70125 36432 -5798 60077 -97561 23125 40003 18362 -26470 -62299 -52302 -92212 -21684
8258G3514P066f1649a7560n8991K8353a9401l8966A43052o3670c337l5784k4832
$$ 73514 80580 -61649 -17560 -76551 -48198 -19401 -58367 143052 79382 -3337 -39121 -63953
8246f3953E4398j1043A7044a4999F6839j0899M1959A3494M2760J1245h1725I1293
$$ -63953 54398 43355 17044 -14999 66839 55940 97899 13494 56254 67499 -81725 91293
8233B39013A06571J4519K4811D7845l962G676J23257k1063D209J30287j6680i9832
$$ 239013 106571 121090 145901 47845 43883 7676 130933 109870 4209 134496 117816 -99832
8220B26210I4288m4814O5242N2553D7181a4507G7772d0309B7252c1599B933K6156
$$ 226210 94288 49474 114716 167269 47181 -14507 77772 -40309 27252 -31599 2933 29089
8208B9089k293K2547M371a0094D4395M78c3782L62J3849n6736K1527K0029p2903
$$ 29089 26796 49343 53714 -10094 44395 44873 -33782 -33420 -19571 -76307 -54780 -34751 -107654
8195a07654L7948L4457A62509p2340L38384J09615B16850E6305J1280A5958c1514
$$ -107654 -69706 -35249 162509 90169 428553 538168 216850 56305 67585 15958 -31514
8183a61554A24335e4611D2349i1494d697D9366M735a22083D2609i6456C5669d5501
$$ -161554 124335 -54611 42349 -91494 -4697 49366 54101 -122083 42609 -96456 35669 -45501
8170b2521A09462c1138I8830A3624a0685F7826J25147C5231f9792G0738b2888
$$ -22521 109462 -31138 98830 13624 -10685 67826 192973 35231 -69792 70738 -22888
8158A11295m6088O6401C3064i210k600G9919N2071O1974m8055k6988J8224k6892
$$ 111295 65207 131608 33064 -9210 -11810 79919 131990 193964 145909 118921 137145 110253
8146A10253A8233J72118o6931R1176j5151j0932q0328k0908M4306J8509K640J5140
$$ 110253 18233 190351 123420 214596 199445 188513 108185 87277 131583 150092 152732 167872
8134A67872O329M266h465A33385C8231Q9806f053F5065J08243H1312R8852F5461
$$ 167872 174201 178467 -8465 133385 38231 128037 -6053 65065 173308 81312 180164 65461
8121D6528J16219n1724D1252j2155D457P79M3764a658A1858R5189k990k1167J16674
$$ 46528 162747 111023 41252 29097 4457 5236 49000 -1658 11858 107047 104057 82890 199564
8108A99564C2519j4931N4225M7485E1745O6376n6286N2121B9646K6337k2654o777
$$ 199564 32519 17588 71813 119298 51745 118121 61835 113956 29646 55983 33329 26552
8096B6552p613L5703L356b1629D8657m455b7982A47681i5201e635I2884b8610
$$ 26552 18939 54642 57998 -21629 48657 44202 -27982 147681 -95201 -5635 92884 -28610
8083b502j4631l423k1527A39248A8964J33765n3288K13956m1309R468O5141K07848
$$ -2502 -17133 -20556 -42083 139248 18964 152729 99441 313397 272088 281556 346697 554545
8071E54545Q2053O54832J104231R98996q4846j099625j098820m40415j43484k35770
$$ 554545 636598 1291430 2395661 3394657 3309811 2210186 1111366 670951 527467 291697
8061B91697P173M462j33980O870k824J37443q6903o5900J73023J26964P7357J41609
$$ 291697 298870 303332 169352 176222 173398 310841 223938 158038 331061 458025 535382 676991
8049F76991J19513R2625M40411R14505J106785M39634r42090j261037p38186k73700
$$ 676991 796504 889129 1329540 2244045 3350830 3790464 2848374 1587337 849151 575451
8039E75451B49479M2078M8902A44502M3286M9810p8368R427o410j2442J38720
$$ 575451 249479 291557 340459 144502 187788 237598 159230 168657 162247 149805 288525
8028B88525M0091R9113K1879j11221j56507n0044o1246B1308C795K5131N9466
$$ 288525 328616 427729 449608 338387 181880 131836 70590 21308 3795 28926 88392
8017H8392P049C3120F394c3491i91D7750d5802D7560d5174C7439D575R199h4826
$$ 88392 95441 33120 6394 -33491 -991 47750 -45802 47560 -45174 37439 4575 13774 -84826
8003A29588c770A061L0161d4871a7325B2398a873B1861a43040K6365N2268K1558
$$ 129588 -3770 1061 31222 -44871 -17325 22398 -1873 21861 -143040 -116675 -64407 -42849
7991d2849k0662C3406b4856p7334E6326a7555k0536l3442b2240C0792M2510c6109
$$ -42849 -63511 33406 -24856 -102190 56326 -17555 -38091 -71533 -22240 30792 73302 -36109
7978a07549A3692e3892n3672j4418N2504j9960a353n4115J0418j09873c6404C5557
$$ -107549 13692 -53892 -107564 -121982 -69478 -89438 -1353 -55468 -45050 -154923 -36404 35557
7965a2911E584i2863E5734k7781c7281G5086a25131C913c2164J1784A0855d7453
$$ -12911 5584 -92863 55734 27953 -37281 75086 -125131 3913 -32164 -20380 10855 -47453
7952C2557D026a7934A05003g449C2466a32930p1903c2783n1715L4003j6512E1259
$$ 32557 4026 -17934 105003 -7449 32466 -132930 -204833 -32783 -84498 -50495 -67007 51259
7939c3734l1143D4383A4348a19763A1648M422e4678q2767B1004f5768i127m1730
$$ -33734 -64877 44383 14348 -119763 11648 16070 -54678 -137445 21004 -65768 -9127 -50857
7927e0857A1419M0512f035I2809a12180B1675d8459E6702i2583c6231r0753A2050
$$ -50857 11419 51931 -6035 92809 -112180 21675 -48459 56702 -92583 -36231 -126984 12050
7914h8083C4292O2071a39055E9045B6043I123d979C3925f991m3759a6447j12379
$$ -88083 34292 96363 -139055 59045 26043 9123 -4979 33925 -6991 -50750 -16447 -128826
7902a28826B1232a15184k7035A5184b2249j02424I146c5657l093m7053H913f2451
$$ -128826 21232 -115184 -142219 15184 -22249 -124673 9146 -35657 -38750 -85803 8913 -62451
7889D0354a36611d0894E9425a06995D8403a3381D2518f2066H331g0243b2498m9141
$$ 40354 -136611 -40894 59425 -106995 48403 -13381 42518 -62066 8331 -70243 -22498 -71639
7877g1639D8661d8687B5965A1658a19040k6845B9517a861A04180k7348a067D9649
$$ -71639 48661 -48687 25965 11658 -119040 -145885 29517 -1861 104180 76832 -1067 49649
7864e9177B5106a19697B8877c1340o9509D2729M2654e17A2687g1330D5077A5863
$$ -59177 25106 -119697 28877 -31340 -100849 42729 85383 -517 12687 -71330 45077 15863
7851H0191i2650H8322a3025G4062d5512a9205l7009A9737c3458D4762M5817c6261
$$ 80191 -92650 88322 -13025 74062 -45512 -19205 -56214 19737 -33458 44762 90579 -36261
7838B6887J46162F7569A0242P7721K6170J24924m9997o486J11019K6474J0996
$$ 26887 173049 67569 10242 87963 114133 239057 189060 182574 293593 320067 331063
7827C31063K25312L0173J61557L04213M41265P81248J208444J968803K148191
$$ 331063 556375 586548 748105 1052318 1493583 2274831 3483275 5452078 7600269
7818G600269J087062m30356j939010k405784j493837r12846l21259j64680l10896
$$ 7600269 8687331 8256975 6317965 3912181 2418344 1505498 1184239 1019559 708663
7809G08663l2845j51766J01538r235Q8522J3928M7708K21716K53403L93357R54555
$$ 708663 675818 524052 625590 616355 704877 718805 766513 988229 1241632 1634989 2589544
7798B589544J493310K240954J958150Q49511q17035k266832k469499j425493p37869
$$ 2589544 4082854 6323808 8281958 9131469 8314434 6047602 3578103 2152610 1414741
7789A414741l78180k55231r1888k90962M334j15933J03863j83948H8496J12443
$$ 1414741 1036561 781330 689442 398480 402814 286881 390744 206796 88496 200939
7779B00939o8895m4520k8257J7794a2933B13410H2689P8017j6367D0255P9683
$$ 200939 132044 87524 59267 77061 -12933 213410 82689 160706 144339 40255 119938
7768A19938A4200R9493m5169J0910d3354E2028A9746b5315o2349B2904d2502c0
$$ 119938 14200 113693 68524 79434 -43354 52028 19746 -25315 -87664 22904 -42502 -30
7755h0631I4Q793b8827A2178j482a15251a2279l4275r618C0686b7010b33k270
$$ -80631 94 8887 -28827 12178 10696 -115251 -12279 -46554 -56172 30686 -27010 -233 -2503
7742b503G3450b9225J4172B6379p867d1981m4641K4719j2973c368C930R503P6073
$$ -2503 73450 -29225 -15053 26379 18512 -41981 -86622 -61903 -74876 -3368 3930 13433 89506
7729H9506b1534p374k9005A04901c4669a5007m0264E6676i5752M6974k3664b0297
$$ 89506 -21534 -28908 -57913 104901 -34669 -15007 -55271 56676 -95752 -48778 -72442 -20297
7716d7684J9250H0914k1957O7426d9835j2986a5565k8811j0670b2322A26492e0936
$$ -47684 -28434 80914 58957 126383 -49835 -62821 -15565 -44376 -55046 -22322 126492 -50936
7703A6115M3234k5022A6498b5j72433F8674e2611p5160f934j4471r3469A4983
$$ 16115 59349 34327 16498 -25 -172458 68674 -52611 -127771 -6934 -21405 -114874 14983
7690d3462g80A5294c1087m8978B0503K2146a16457d5869b1045D2430B0875d259
$$ -43462 -780 15294 -31087 -80065 20503 42649 -116457 -45869 -21045 42430 20875 -4259
7677b5687D8424L7114a06328A9544J5252c201k6563B2351R38M7150e3257m0522
$$ -25687 48424 85538 -106328 19544 34796 -3201 -29764 22351 23289 70439 -53257 -93779
7665i3779E9864a8284I473e4694a2143r8671H9431B9230a04172A0715e4182G0386
$$ -93779 59864 -18284 9473 -54694 -12143 -110814 89431 29230 -104172 10715 -54182 70386
7652e3336b0237F6651i8899b2284r2317B1839h943j6057E1625O402j3398A776
$$ -53336 -20237 66651 -98899 -22284 -114601 21839 -8943 -25000 51625 58027 44629 1776
7639b5949m4200B8645c8553B7031g8078A42037B8645b5931D4960K2995a9335D1567
$$ -25949 -70149 28645 -38553 27031 -78078 142037 28645 -25931 44960 67955 -19335 41567
7626A8840d2137j1689m3000M2653J7109j8881l1317G5773f0519E2193k3475J5812
$$ 18840 -42137 -53826 -96826 -54173 -37064 -55945 -87262 75773 -60519 52193 28718 44530
7614D4530d6237A4363l030i3047D8805A2443c478q4744K6272J4606o1048F873
$$ 44530 -46237 14363 11333 -93047 48805 12443 -3478 -88222 -61950 -47344 -108392 6873
7601a7152A6280q043P2438P7862C5231a43767G0014j0932A5849b793k4374I9228
$$ -17152 16280 8237 80675 158537 35231 -143767 70014 59082 15849 -2793 -27167 99228
7588f7866B9656j3694o062g216m0428k2718A4573f9551I3085B9970N6169B5234
$$ -67866 29656 15962 9900 -7216 -47644 -70362 14573 -69551 93085 29970 86139 25234
7575D708K6655G514c9588B1940d2368C6605K5081a3922p8559l4265A4513c2220
$$ 4708 31363 7514 -39588 21940 -42368 36605 61686 -13922 -92481 -126746 14513 -32220
7562F8170e4436n0679n7611D1116M3123F55M4015E942d5116A12259h360o144D6780
$$ 68170 -54436 -105115 -162726 41116 84239 655 44670 5942 -45116 112259 -8360 -14504 46780
7548A1196l944P7131c551F0517a4361q9282A03338g305B1666a03202b4971J0238
$$ 11196 7252 84383 -3551 60517 -14361 -103643 103338 -7305 21666 -103202 -24971 -14733
7536a4733E078J8450B807P272a36946d9425K3783n0078e681C6213a04100D230
$$ -14733 5078 23528 2807 10079 -136946 -49425 -25642 -75720 -5681 36213 -104100 4230
7523c3157L613j2467B8669b02945e0305b1589G7555e407j12213c7165o0686D7652
$$ -33157 -29544 -42011 28669 -202945 -50305 -21589 77555 -5407 -117620 -37165 -97851 47652
7510e4535n6779B7136H46P5493C0924a5178j5277Q701G9109f4877E1684b2931
$$ -54535 -111314 27136 846 76339 30924 -15178 -30455 -21754 79109 -64877 51684 -22931
7497D479J7710R192a8843l8075O705A12566E1820b0830B1969h4389n7559A54603
$$ 4479 22189 31381 -18843 -56918 -50213 112566 51820 -20830 21969 -84389 -141948 154603
7484D0750a870D615K0740h0467L7147B5502A0531h6804E0188c0031j9588j756
$$ 40750 -1870 4615 25355 -80467 -43320 25502 10531 -86804 50188 -30031 -49619 -51375
7472e1375A259R0815l2432a35814C2304f6971A07415h107A27913R7063b4556B1241
$$ -51375 1259 92074 59642 -135814 32304 -66971 107415 -8107 127913 224976 -24556 21241
7459D5280a0919A4055b2315C4477d0825o279G0017a7338F3847p779N9078f2923
$$ 45280 -10919 14055 -22315 34477 -40825 -47104 70017 -17338 63847 56068 115146 -62923
7446f3136E4128i292L934F8870f5406E824c3725E8628J0415P7197e0404B9503
$$ -63136 54128 -9292 -5358 68870 -65406 5824 -33725 58628 69043 146240 -50404 29503
7433A07151B2571p69h8023A05329c4144m4648c1732R130A9799i7963d6634I2934
$$ 107151 22571 21802 -88023 105329 -34144 -78792 -31732 -22602 19799 -97963 -46634 92934
7420C2605A1796N4215h1778A051P6191B9293M0010O2016m9213C8340e99F0165
$$ 32605 11796 66011 -81778 1051 77242 29293 69303 131319 82106 38340 -599 60165
7407f8420o0532D6148A8588b3550C3120J05955F6618c1805F534J06037E5994k4558
$$ -68420 -128952 46148 18588 -23550 33120 139075 66618 -31805 6534 112571 55994 31436
7395C1436J25059h781c589n0557F6980f213A60160m6411e6971G9454C7033a2725
$$ 31436 156495 -8781 -3589 -54146 66980 -6213 160160 113749 -56971 79454 37033 -12725
7382G2978b500k8063H276A222h8521B6755j772L4909B5135N1617B8571f6170I6687
$$ 72978 -2500 -30563 8276 1222 -88521 26755 24983 59892 25135 76752 28571 -66170 96687
7368E7069f2296D3524P4466B7135d0421A02648J5870B4683J10809D958J06172
$$ 57069 -62296 43524 117990 27135 -40421 102648 118518 24683 135492 4958 111130
7357A11130n4931A115b6408b087B70762f1767I2685a1613C2170G905R5625J3767
$$ 111130 56199 1115 -26408 -2087 270762 -61767 92685 -11613 32170 7905 103530 117297
7345A17297k1659j283j8224C2794R1707o0406l904J13261m5957L0522D4589J02497
$$ 117297 95638 94355 76131 32794 124501 64095 60191 173452 127495 158017 44589 147086
7333A47086K6498j2489E7544k159K5592L2734l3861a9300A25307D2822R8785D9649
$$ 147086 173584 161095 57544 55385 80977 113711 79850 -19300 125307 42822 141607 49649
7320A96042o3861e491B07137p5504m9897L3642G483K11013o9025J55748A29216
$$ 196042 132181 -5491 207137 131633 81736 115378 7483 218496 149471 305219 129216
7308B00081p0797j8534J34577F2750J23433F3683K9384P9962o430O822q2074j7111
$$ 200081 129284 110750 245327 62750 186183 63683 93067 173029 166599 173421 91347 74236
7296G4236l245K0893P3563P548G9509B5128J12307C2260Q4204J301J5354E060
$$ 74236 70991 91884 165447 172995 79509 25128 137435 32260 116464 117765 133119 5060
7283B30255N1324p3627J284J24449A52545J32490M4746l5428j42227K00949r1301
$$ 230255 281579 207952 209236 333685 152545 285035 329781 294353 152126 353075 261774
7272B61774P7886P5322l1163m9203J89928J43452P594o6279J24461j25890K09457
$$ 261774 339660 414982 383819 334616 524544 667996 675590 609311 733772 607882 817339
7261H17339r3098J23682j7555O4808r2187K16869K25571j65089L49510J35523
$$ 817339 724241 847923 830368 895176 802989 1019858 1245429 1080340 1429850 1565373
7251A565373K2860L53669O02973N71395P50556J56916j81951n96128J1945M22613
$$ 1565373 1588233 1941902 2544875 3116270 3866826 4023742 3841791 3245663 3257608 3680221
7241C680221O97031N43523p7543q78085p08162j92148p5413p2677j09447r0838
$$ 3680221 4377252 4920775 4843232 3965147 3256985 3064837 2989424 2916747 2807300 2716462
7231B716462j86796l4180J83525J16400J26423o217k9880l07674j98636j25544
$$ 2716462 2529666 2495486 2679011 2795411 2921834 2915617 2885737 2578063 2379427 2253883
7221B253883j39493j33344K01869J19152O8596K71150K410L79711O22135J195186
$$ 2253883 2114390 1981046 2182915 2302067 2370663 2641813 2644223 3023934 3646069 4841255
7211D841255J301157N82688l60338o64844r9094M68222R45563L63168l26972q22240
$$ 4841255 6142412 6725100 6364762 5699918 5600824 6069046 7014609 7377777 7050805 6228565
7201F228565J38122J080976J966799K018215O45086m14526j740657k170715j830222
$$ 6228565 6366687 7447663 9414462 11432677 12077763 11663237 9922580 7751865 5921643
7192E921643p08059J79786J265498J864745J667187N90844p29755j647159k529096
$$ 5921643 5213584 5393370 6658868 8523613 10190800 10781644 10051889 8404730 5875634
7183E875634j910837j251884m69752m40210m34041j2309j56145m4321j55472J04569
$$ 5875634 3964797 2712913 2243161 1802951 1368910 1356601 1200456 1156135 1000663 1105232
7173A105232Q9891J56350j8168k44713k69990J98735M6010j02958L27494q9990
$$ 1105232 1195123 1351473 1333305 1088592 818602 1017337 1063347 960389 1287883 1197893
7163A197893j54787o7739k63195m0305l7210P2535N0424K5120r6678O71J01948
$$ 1197893 1043106 975367 712172 671867 634657 707192 757616 782736 686058 686729 788677
7152G88677O4062K87444p6119J24663J13151l9771j7477K70790q5553J63903J27839
$$ 788677 852739 1140183 1064064 1188727 1301878 1262107 1244630 1515420 1429867 1593770 1721609
7141A721609K15113K55425M38346P81022Q54314N79744J96604n96412m38307m53499
$$ 1721609 1936722 2192147 2630493 3411515 4265829 4845573 5042177 4445765 4007458 3553959
7131C553959J18866N22430O66239k8422l1757j72774Q5707P02869l0629l16513
$$ 3553959 3672825 4195255 4861494 4833072 4801315 4628541 4714248 5417117 5386488 5069975
7121E069975q66449o77399o51670m945j18331J50373L87704O27299J033982R34051
$$ 5069975 4203526 3526127 2874457 2869512 2751181 2901554 3289258 3916557 4950539 5884590
7111E884590O40712k48184n62827q22770o40800k63619k27067k0283j24053L5094
$$ 5884590 6525302 6277118 5714291 4891521 4250721 3987102 3760035 3739752 3615699 3650793
7101C650793j56055m5647K19521j69965j9078J90264J79470K40264l7626l0840
$$ 3650793 3494738 3449091 3668612 3498647 3479569 3669833 3849303 4089567 4051941 4021101
7091D021101m6023K50926N78264R42934P38147M34254j26167k08183j07694m76634
$$ 4021101 3975078 4226004 4804268 5747202 6485349 6919603 6793436 6585253 6477559 6000925
7081F000925p53824l58240q3176J88453L51259N29406N40052M47018N71740M98216
$$ 6000925 5247101 4888861 4805685 4994138 5345397 5874803 6414855 6861873 7433613 7931829
7071G931829j60857j116296j435540j079597o67918m26269k06554j84887j71498
$$ 7931829 7770972 6654676 5219136 4139539 3471621 3045352 2838798 2653911 2482413
7062B482413K29252L34502R04107J462107J572212Q46853r51014j793863j066860
$$ 2482413 2711665 3046167 3950274 5412381 6984593 7831446 6880432 5086569 4019709
7053D019709m37751o2003l09380l18916K72636K32030L21753k49403j76542J17663
$$ 4019709 3581958 3519955 3210575 2891659 3164295 3396325 3718078 3468675 3292133 3409796
7043C409796M37582L15710r1371q3348O71379J084014P93058j59837j044769j280257
$$ 3409796 3847378 4163088 4071717 3988369 4659748 5743762 6536820 6376983 5332214 4051957
7033D051957r06068m58280j84003p4235O5572J11312Q3824Q0241K32580M15537
$$ 4051957 3145889 2687609 2503606 2429371 2494943 2606255 2690079 2770320 3002900 3418437
7023C418437Q35736J037351R86740N98009O5799k89427j72738P52743J368875
$$ 3418437 4254173 5291524 6278264 6876273 6942072 6652645 6479907 7232650 8601525
7014H601525J400084K13393p93792o49977j67926L35797m50342j109161j409919
$$ 8601525 10001609 10215002 9421210 8771233 8603307 8939104 8488762 7379601 5969682
7005E969682j388283m92117j95474N27670J136335J610513J795690J206550k03657
$$ 5969682 4581399 4089282 3893808 4421478 5557813 7168326 8964016 10170566 9966909
6996I966909j638440k177366k020533j137881n63160n66581k44286k19426p3588
$$ 9966909 8328469 6151103 4130570 2992689 2429529 1862948 1618662 1399236 1325648
6987A325648o3162l63734J88160p4R9650J35710K40146K03506N00061K55695N21190
$$ 1325648 1262486 898752 1086912 1086838 1186488 1322198 1562344 1765850 2265911 2521606 3042796
6976C042796L69391O94260J021937J229722J332591J014982L98330k8116l28120
$$ 3042796 3412187 4106447 5128384 6358106 7690697 8705679 9104009 9075893 8747773
6967H747773l12585m82357l33859n50404n46383j115220q68356n46540l31031
$$ 8747773 8435188 7952831 7618972 7068568 6522185 5406965 4538609 3992069 3661038
6958C661038p6475l90428m57368l52106l41367j58974K69340K78988K75108O15410
$$ 3661038 3584563 3194135 2736767 2384661 2043294 1884320 2153660 2432648 2707756 3323166
6948C323166J55252O32020r3390k05963l12002m51908k15021j75799n1028o8976
$$ 3323166 3478418 4110438 4017048 3811085 3499083 3047175 2832154 2656355 2605327 2536351
6938B536351J12870k9427J79387j8548l77267J4500l24385m59066m76646j38613
$$ 2536351 2649221 2619794 2799181 2780633 2403366 2417866 2093481 1634415 1157769 1019156
6928A019156p6426J9734q304O2967m4747Q6580J5616K36048J63827K54746M1137
$$ 1019156 942730 962464 954160 1017127 972380 1058960 1074576 1310624 1474451 1729197 1770334
6917A770334J01514j9112n7059K248J16708L56566K10492M77181Q52031N41221
$$ 1770334 1871848 1852736 1795677 1797925 1914633 2271199 2481691 2958872 3810903 4352124
6907D352124K05154K81855P73588K04177p10436l60987O28259Q55559O05185q1179
$$ 4352124 4557278 4839133 5612721 5816898 5106462 4745475 5373734 6229293 6834478 6753299
6897F753299j31462M90998J139845L21184q91931j505333j004535r31735m58734
$$ 6753299 6621837 7112835 8252680 8573864 7681933 6176600 5172065 4240330 3781596
6888C781596k65026k48688P0083J48868J83219K59424P40601J503588K113443
$$ 3781596 3516570 3267882 3337965 3486833 3670052 3929476 4670077 6173665 8287108
6879H287108J361650M40022K25149J448145J597061J386968J129814R49234o97158
$$ 8287108 9648758 10088780 10313929 11762074 13359135 14746103 15875917 16825151 16127993
6870A6127993k267835j490178q86452O9178R97881O1829k412783k853211j492484
$$ 16127993 13860158 12369980 11483528 11552706 12550587 12612416 10199633 7346422 5853938
6861E853938r86816m75285j78973q5902J86163M33028J051416J300629J254951
$$ 5853938 4867122 4391837 4212864 4126962 4313125 4746153 5797569 7098198 8353149
6852H353149L66557m39250j447518j597889q54768k24896M0669j7644P8646m74064
$$ 8353149 8719706 8280456 6832938 5235049 4380281 4155385 4196054 4178410 4257056 3782992
6842C782992n22537l27239j79587r972l9935M8478K4823K86873M34893M45965
$$ 3782992 3260455 2933216 2753629 2743657 2703722 2752200 2777023 3063896 3498789 3944754
6832C944754J90721K82978L89705L74725K02637k14606m11737p90672l37127j02569
$$ 3944754 4135475 4418453 4808158 5182883 5385520 5170914 4759177 3968505 3631378 3528809
6822C528809j97381K17179J60541K12729J9964k67396m43413l0892J19420K98186
$$ 3528809 3331428 3548607 3709148 3921877 3941841 3674445 3231032 3200140 3319560 3617746
6812C617746M79042M72295K75086N72676J44223n14720j204000n32288l41151
$$ 3617746 4096788 4569083 4844169 5416845 5561068 5046348 3842348 3310060 2968909
6803B968909p7091j49291Q6485K89675M49619R84966M75504n07375j230095q81507
$$ 2968909 2891818 2742527 2829012 3118687 3568306 4553272 5028776 4521401 3291306 2409799
6793B409799m32017O0549K91591K9013m9361L3663l20470p3516p7277K93156J84371
$$ 2409799 1977782 2038331 2329922 2358935 2309574 2343237 2022767 1949251 1871974 2165130 2349501
6782B349501L07633Q39184J526271R88551l08749j691115j191582o38702j66149
$$ 2349501 2657134 3496318 5022589 6011140 5702391 4011276 2819694 2180992 2014843
6773B014843K89574P19568J007151J598680R00864l61262j574318k025310p60807
$$ 2014843 2304417 3023985 4031136 5629816 6530680 6169418 4595100 2569790 1808983
6764A808983k40388k50962P9974p3457J36782J83089L77251N50561M01546j42726
$$ 1808983 1568595 1317633 1397607 1324150 1460932 1644021 2021272 2571833 2973379 2830653
6754B830653l78470m70270j93370M48908O33352R38148O58009M49082l71156j201804
$$ 2830653 2452183 1981913 1788543 2237451 2870803 3808951 4466960 4916042 4544886 3343082
6744C343082r15858l21621L46239M65183J31837m29354q66214m57678k63013k14520
$$ 3343082 2427224 2105603 2451842 2917025 3048862 2619508 1753294 1295616 1032603 818083
6734H18083q1333J93611m8734K08383M21964M00220R22038J193495Q37767K5928
$$ 818083 736750 930361 881627 1090010 1511974 1912194 2834232 4027727 4865494 4891422
6724D891422p74095j115436q23571r0153K57855M11591M61747K97368o47765o50736
$$ 4891422 4117327 3001891 2178320 2088167 2346022 2757613 3219360 3516728 2868963 2218227
6714B218227k45492P116K88211P00173R73058J887009L161156L935550K935062
$$ 2218227 1972735 1979851 2268062 2968235 3941293 5828302 8989458 12925008 15860070
6705A5860070O10k811826k693448k107265j866042j685572q09113o20084j98002
$$ 15860070 15860680 13048854 10355406 8248141 6382099 4696527 3887414 3267330 3069328
6696C069328j23167J04524L09220O20888Q75225J500303K436962M708133O633963
$$ 3069328 2946161 3050685 3359905 3980793 4856018 6356321 8793283 13501416 20135379
6687B0135379O465360L062494j274051k406150k722481m876819n734726l961224
$$ 20135379 26600739 29663233 28389182 25983032 23260551 18383732 12649006 8687782
6679H687782k012041j252657o45746m62051L6749M7580N94557R42223J662444
$$ 8687782 6675741 5423084 4777338 4315287 4352036 4399616 4994173 5936396 7598840
6670G598840K926897M582588N621833M613855K739750K116038L71585m480658
$$ 7598840 10525737 15108325 20730158 25344013 28083763 30199801 30571386 26090728
6662B6090728q225035o577039l405591j852697j316041p42957n28389j96209Q9643
$$ 26090728 17865693 11288654 7883063 6030366 4714325 3971368 3442979 3246770 3336413
6653C336413N6281L80423P39205J408873J916416K349210K831118L207982J981424
$$ 3336413 3392694 3773117 4512322 5921195 7837611 10186821 13017939 16225921 18207345
6644A8207345j023895m414758m729100k885781j430519q07800o46213m69380j96900
$$ 18207345 17183450 12768692 8039592 5153811 3723292 2915492 2269279 1799899 1602999
6635A602999j24308j73586J6100l326J41642K93431L13344P83364R14204Q47648
$$ 1602999 1478691 1305105 1321205 1317879 1459521 1752952 2066296 2849660 3763864 4611512
6625D611512K09895p56714j318921q92645m40129k81553j79310j57620j50961
$$ 4611512 4821407 4064693 2745772 1853127 1412998 1131445 952135 794515 643554
6616F43554k9712j42843m3980j02008m2002O6348n5681Q3871j02759Q9608j42224
$$ 643554 613842 470999 427019 325011 283009 349357 293676 377547 274788 364396 222172
6605B22172J49799J40042L1250o8295K56547K53634m7471J11581n1266p2276k68500
$$ 222172 371971 512013 543263 474968 731515 985149 937678 1049259 997993 925717 657217
6594F57217r7769n3811R337o9688q4856j22628l4558m6331G0731J41328J7085
$$ 657217 559448 505637 514974 445286 360430 237802 203244 156913 70731 212059 229144
6583B29144p8925k7805M0432J5145m1077J3505K13182A69848J59815k279Q8045
$$ 229144 150219 122414 162846 177991 136914 150419 363601 169848 329663 327384 415429
6572D15429J1132K9164J39063j98406r2688l8570J02060A72622P3811H6131J48024
$$ 415429 426561 455725 594788 396382 303694 265124 367184 172622 246433 86131 234155
6561B34155n5585k6573n0317B1861J72106D1711J16772m3077M2293l6006l4420
$$ 234155 178570 151997 101680 21861 193967 41711 158483 115406 157699 121693 87273
6550H7273J7627l1563Q8190M7613O8608p2862q1607k7259L1355h611A9722K8511
$$ 87273 104900 73337 161527 209140 277748 204886 123279 96020 127375 -8611 19722 48233
6538D8233a9905B4356e5503A067K7782a264I3076B3499Q1221B30O4154M1206k6049
$$ 48233 -19905 24356 -55503 1067 28849 -1264 93076 23499 104720 230 64384 105590 79541
6525G9541l4889i7851A31710B8902L4986a0556E9134j2427a7826E2112Q57K8954
$$ 79541 44652 -97851 131710 28902 63888 -10556 59134 46707 -17826 52112 52969 81923
6513H1923l9096J03779e9913c223m5890K3826D0069N6156l483B2204J08988l6086
$$ 81923 42827 146606 -59913 -3223 -49113 -25287 40069 96225 92742 22204 131192 95106
6501I5106C5133J17079O5139p8230n9493h7898A05927K7289n9216j5855K0465
$$ 95106 35133 152212 217351 139121 79628 -87898 105927 133216 74000 58145 78610
6490G8610Q2147N8460L802p1152J48653j27703k5104L8420B0881J65337p2837
$$ 78610 160757 219217 223019 151867 300520 172817 147713 186133 20881 186218 113381
6479A13381P5501l572Q1989A18162M3022K36979O9995R3197N42703N48691P49541
$$ 113381 188882 185310 267299 118162 161184 398163 468158 561355 1104058 1652749 2402290
6468B402290L39636j93885n68615n81863j98333j4545l216n8124k43057l30537
$$ 2402290 2741926 2548041 1979426 1397563 1199230 1184685 1181469 1123345 880288 549751
6458E49751r6386m9039J57941r4054K5917Q6795Q0104K93107L20667M46909L19669
$$ 549751 453365 404326 562267 468213 494130 580925 661029 954136 1274803 1721712 2041381
6447B041381K01449O52188N53274L22031m5805o2341l08323o22942n59220o44670
$$ 2041381 2242830 2895018 3448292 3770323 3724518 3662177 3353854 2730912 2171692 1527022
6437A527022k99246k66730k50086r6401j72870n0521K05526j7042M0289J71648
$$ 1527022 1227776 961046 710960 614559 441689 391168 596694 579652 619941 791589
6427G91589K49016K02487J26457n2056M6991m6649J62100K52439M52247K37158
$$ 791589 1040605 1243092 1369549 1317493 1364484 1317835 1479935 1732374 2184621 2421779
6417B421779j87950o99045p03927D12089n7063j41453A04783J29696m7632a614
$$ 2421779 2233829 1534784 830857 412089 355026 213573 104783 234479 186847 -1614
6406B99639q8420j7856p7515J09321k7681K31576m4072Q0125k8760r8398A27298
$$ 299639 211219 193363 115848 225169 197488 429064 384992 465117 436357 337959 127298
6394E4032J11252G9113j5542B1255a14689H2919l3475N1586C571O0668k8836J03393
$$ 54032 165284 79113 63571 21255 -114689 82919 49444 101030 3571 64239 35403 138796
6382A38796F4363m020c646D7746A7982c6704O472I7533A6375G175B847a6901G5000
$$ 138796 64363 60343 -3646 47746 17982 -36704 -30232 97533 16375 7175 2847 -16901 75000
6368A21944E2640c210H485b7727j7240I8891A3344Q3627g6533G771O991a8104
$$ 121944 52640 -3210 8485 -27727 -44967 98891 13344 96971 -76533 7771 14762 -18104
6355C7271j0324R4965b2360k7018G6540a1689l5954d601D1231m483E560K041f2305
$$ 37271 26947 121912 -22360 -49378 76540 -11689 -47643 -4601 41231 36748 5560 7601 -62305
6341f8332J1299A11137D6446K545L184G016l040O0939g7083b3510D9973L3199
$$ -68332 -57033 111137 46446 48991 52175 7016 3976 64915 -77083 -23510 49973 83172
6329H3172c7285r380b2596p252j6833C8041c6516F6049Q9054D3489a4582A465
$$ 83172 -37285 -46665 -22596 -29848 -46681 38041 -36516 66049 155103 43489 -14582 1465
6316d279n3625a489B032M3418a38193H7060m0809O3778l2001P2925C7202e2674
$$ -4279 -57904 -1489 2032 45450 -138193 87060 46251 110029 78028 150953 37202 -52674
6303e3166D7660K9792l6227c517C3063c8084A64890q0254J03419C7674P47J57140
$$ -53166 47660 77452 41225 -3517 33063 -38084 164890 84636 188055 37674 38421 195561
6291A95561n8453n4306h2318B2719K5491b5711r2502c2063r815A3764c162E7819
$$ 195561 137108 82802 -82318 22719 48210 -25711 -118213 -32063 -41878 13764 -3162 57819
6278D4762J28653e2964A16767E7942J1592L5648m1215d6662F5583R916b37038
$$ 44762 173415 -52964 116767 57942 69534 105182 63967 -46662 65583 75499 -237038
6266c3677A9795F34c3147D5483a0146o6922A38657D489R8541L8200k818n5201
$$ -33677 19795 634 -33147 45483 -10146 -77068 138657 4489 103030 141230 138412 83211
6254H3211M6308n6933L5127D3082b1444A44439b3119D2768L8249A3436d3599F0313
$$ 83211 129519 72586 107713 43082 -21444 144439 -23119 42768 81017 13436 -43599 60313
6241A24051m5668c7393j6502B42610c5942E2707J43885D0818N8875O8767l5274
$$ 124051 78383 -37393 -53895 242610 -35942 52707 196592 40818 99693 168460 133186
6230A33186D2J41249C0004J20181P5484l9134H1485Q9946E5705B4504e9437K8418
$$ 133186 42 141291 30004 150185 225669 186535 81485 171431 55705 24504 -59437 -31019
6218c1019B1456d544I4253l5545L5007K273q008a3309C2424b4805H1981j4718
$$ -31019 21456 -4544 94253 58708 93715 95988 87980 -13309 32424 -24805 81981 67263
6206F7263B9459a8466I0333H927a2671A11136g09F5329a34671e7094q060A5993
$$ 67263 29459 -18466 90333 8927 -12671 111136 -709 65329 -134671 -57094 -65154 15993
6193d86p6594A9034m290f3822a4762k2062B72656n9981c4325G2892E409R314K4758
$$ -486 -77080 19034 14744 -63822 -14762 -36824 272656 212675 -34325 72892 5409 14723 39481
6180C9481p011J8198f0766A73686E3604N532M6781B2305N3562p168M737N4257
$$ 39481 32470 50668 -60766 173686 53604 59136 105917 22305 75867 68699 73436 127693
6168A27693K867R7487A08838D2257m189Q048k517a0078I9449j0099C8179o022
$$ 127693 130560 228047 108838 42257 38068 46116 43599 -10078 99449 89350 38179 32157
6156C2157e9337a9555H5724i5239J6338E6934J7622K936c938I995L1645J72368
$$ 32157 -59337 -19555 85724 -95239 -78901 56934 74556 77492 -3938 9995 41640 214008
6144B14008m6390J8218L2485J26005n3323j35111J2424B3743J77328k7814q0202
$$ 214008 167618 185836 218321 344326 291003 155892 168316 23743 201071 173257 93055
6133I3055L5876J01052q8J8131M5793J3305k4950L6259N8995J14814J30096K43817
$$ 93055 128931 229983 229895 248026 293819 307124 282174 318433 377428 492242 622338 866155
6121H66155J03093M93322M66093L57589L79755M80083J217437K232895M042533
$$ 866155 969248 1462570 1928663 2286252 2666007 3146090 4363527 6596422 10638955
6112A0638955N365443N276243J920763k069602m906687n522836l807159k121892
$$ 10638955 16004398 21280641 23201404 21131802 16225115 10702279 6895120 4773228
6104D773228j088812k99567j88696p469r7305P2953K08860L07522P22859J814470
$$ 4773228 3684416 3384849 3196153 3188684 3091379 3164332 3373192 3680714 4403573 6218043
6094F218043L448265M918711M870210K545209j404414m380196n299931l916043
$$ 6218043 9666308 14585019 19455229 22000438 20596024 16215828 10915897 6999854
6086F999854k109423j218001l04284k64273k34773l963J55901O2867O00654M59083
$$ 6999854 4890431 3672430 3368146 3103873 2869100 2865137 3021038 3083905 3684559 4143642
6076D143642N15861R67743J874553L654023O013317Q504199Q439882M258603k350830
$$ 4143642 4659503 5627246 7501799 11155822 17169139 25673338 34113220 38371823 36020993
6067C6020993p592904q784446p042239l850107k016281q74522n84314j29330J03669
$$ 36020993 28428089 19643643 12601404 8751297 6735016 5860494 5276180 5146850 5250519
6058E250519J5482L04117M77631J297501K796790N135442P836110Q333002M725635
$$ 5250519 5266001 5570118 6047749 7345250 10142040 15277482 23113592 31446594 36172229
6049C6172229j164246o973626q568216p245946m262865k351391j079389p57520
$$ 36172229 35007983 28034357 19466141 12220195 7957330 5605939 4526550 3769030
6041C769030n75902o17696m35996l39683k79773l88550j57850q5761j10972j10827
$$ 3769030 3193128 2575432 2139436 1799753 1519980 1131430 973580 887819 776847 666020
6031F66020j09169j53391J8942n5128M2316P3771k0316j44608O7229j04455n9214
$$ 666020 556851 403460 422402 367274 409590 483361 463045 318437 385666 281211 221997
6020B21997R8556j56776L1221l0212K12009l4068p8826L2752q2879o5633j9237
$$ 221997 320553 163777 194998 164786 376795 342727 263901 296653 213774 148141 128904
6009A28904R7912A10065n468l69k2737I837P9122N93L00j9091L5279L4880K7815
$$ 128904 226816 110065 104597 104228 81491 9837 88959 89552 89852 70761 106040 140920 168735
5996A68735o6846O8062Q3633I8504M9834l2917j8906J2764l3850O2272n1285R9077
$$ 168735 101889 169951 253584 98504 148338 115421 96515 109279 75429 137701 86416 185493
5984A85493K8368r603j872J1028K59J0247G8109J36540J25746j1470N1736M0608
$$ 185493 213861 204258 202386 213414 213673 223920 78109 214649 340395 328925 380661 421269
5972D21269J62842k744P7390O1222K17882K26476J79282M30155M76965N49904
$$ 421269 584111 581367 658757 719979 937861 1164337 1343619 1773774 2250739 2800643
5962B800643O93155P43449J198229K006061L887616P108845J0136325R746722
$$ 2800643 3493798 4237247 5435476 7441537 11329153 18437998 28574323 38321045
5954C8321045L830133m587571r803617r871708o597287l346475j700917j009003
$$ 38321045 42151178 37563607 27759990 17888282 11290995 7944520 6243603 5234600
5946E234600o58450m64065m44425k34058J6314P0853M42603N43517O21846J299444
$$ 5234600 4576150 4112085 3667660 3433602 3449916 3520769 3963372 4506889 5128735 6428179
5936F428179K292999M746180P483433R086809O690335K80531o451784r280218
$$ 6428179 8721178 13467358 20950791 30037600 36727935 37008466 30556682 21276464
5928B1276464p776811m585676k200286j170472o98436m58573j90558M885j44364
$$ 21276464 13499653 8913977 6713691 5543219 4844783 4386210 4195652 4200537 4056173
5919D056173K14283R12643J745164L464632N379039N463802L042905j663928n391216
$$ 4056173 4270456 5183099 6928263 10392895 15771934 21235736 24278641 22614713 17223497
5910A7223497n908987m162602k202811j138218m16836n69218j10735l17150j10578
$$ 17223497 11314510 7151908 4949097 3810879 3394043 2824825 2714090 2396940 2286362
5901B286362j03179O476K57059K39323M48652M95971J162778K515806M151419
$$ 2286362 2183183 2189659 2446718 2686041 3134693 3630664 4793442 7309248 11460667
5892A1460667N583873M591942R47342l394246n680710n157084l093801j470508
$$ 11460667 17044540 21636482 22583824 19189578 13508868 8351784 5257983 3787475
5884C787475q39586n46645l09697j76461n17700j21732k30199k14293j18620j38136
$$ 3787475 2947889 2401244 2091547 1915086 1397386 1275654 1045455 831162 712542 574406
5874E74406j37847j4342P7044k13276J7714l4534j5633K079J4801J03034n6828
$$ 574406 436559 422217 499261 285985 303699 269165 253532 255611 270412 373446 316618
5863C16618l1447k8610L5215J6058j4176k7971q1525J8128e7277B51538j21867
$$ 316618 285171 256561 291776 307834 293658 265687 184162 202290 -57277 251538 129671
5852A29671E4980J05045m7469L5977J6065N386L8203B9829J26464j8088B7806
$$ 129671 54980 160025 112556 148533 164598 169984 208187 29829 156293 138205 27806
5840A49103m2612l1485b1140D9150J1590M2049a2503A36893E2704j5556L8332
$$ 149103 106491 75006 -21140 49150 60740 102789 -12503 136893 52704 37148 75480
5829G5480h8478A78018i709F772J08162k8010i215C6879J46599E0453N1191L5203
$$ 75480 -88478 178018 -9709 6772 114934 86924 -9215 36879 183478 50453 101644 136847
5817A36847f6785H1654J17723k5465F6718j5772J8379M6081K4409n7727k5445
$$ 136847 -66785 81654 199377 173912 66718 50946 69325 115406 139815 82088 56643
5806E6643N471a1476H7342a6067G2778a3012G8088J3819N4398k8883m496m0729
$$ 56643 62114 -11476 87342 -16067 72778 -13012 78088 91907 146305 117422 112926 72197
5794G2197J30611p5605L1233O0106m7741k1824C4817J62875J41514J27516j8969
$$ 72197 202808 127203 158436 218542 170801 148977 34817 197692 339206 466722 447753
5783D47753O3640O6917K1167M8731L3493J37196j047j8240M1170j18483K2848
$$ 447753 511393 578310 599477 648208 681701 818897 817850 799610 840780 722297 745145
5772G45145J89529J57032J07061L89286L10618K75039P01910Q34162J150586J003598
$$ 745145 934674 1091706 1198767 1588053 1898671 2173710 2875620 3709782 4860368 5863966
5762E863966P98697M71003O53973J477397J922041K550522L333785M712981O396127
$$ 5863966 6662663 7133666 7787639 9265036 11187077 13737599 17071384 21784365 28180492
5753B8180492R276658J4692671L2418076Q2112188J36830320J46583416K3101212
$$ 28180492 37457150 52149821 84567897 166680085 303510405 450093821 473195033
5746D73195033j51029160A58969426p2951032k9555133j5095004j0374285p559464
$$ 473195033 322165873 158969426 86018394 56463261 41368257 30993972 23434508
5739B3434508n367290l783504k979502k022722j634851j188994q03455p17026
$$ 23434508 18067218 14283714 11304212 9281490 7646639 6457645 5654190 4937164
5731D937164o21527k78885n34992l23186k37849j05715j33354k47702q5627j72144
$$ 4937164 4315637 4036752 3501760 3178574 2940725 2835010 2701656 2453954 2368327 2196183
5721B196183k03758k71187k00495j03503j62324q7334j8287r3759J72870k13354
$$ 2196183 1992425 1721238 1520743 1417240 1254916 1167582 1149295 1055536 1228406 1015052
5711A015052j19323K680n6413L1518J16715j13396r9910n8756J3478p0405M9718
$$ 1015052 895729 898409 841996 873514 990229 876833 776923 718167 731645 661240 710958
5700G10958o8417O115M5546j27489r2809p2589R5673m0737R923q0126k0069J27627
$$ 710958 642541 648656 694202 566713 473904 401315 496988 456251 466174 386048 365979 493606
5688D93606o8745j26994j0249P069q2910J94338j67390Q3461j57428J24623m6091
$$ 493606 424861 297867 287618 294687 211777 406115 238725 322186 164758 289381 243290
5677B43290j5463K5523L600N1112F1609R3450O0260j7107G1197O1982J10792j8521
$$ 243290 227827 253350 256950 308062 61609 155059 215319 198212 71197 133179 243971 225450
5665B25450O438D9807J95609m8392I0879O2573j7553J16647D7156J52581m6097
$$ 225450 231888 49807 245416 197024 90879 153452 135899 252546 47156 199737 153640
5654A53640F5052J26029p4755A2482L2016K05246I2794J7493J06761I7637D0695
$$ 153640 65052 191081 116326 12482 44498 249744 92794 110287 217048 97637 40695
5642A17970m3668J39087A0659Q2368a4534A88296p322A3307Q6566A3088J56178
$$ 117970 74302 213389 10659 93027 -14534 188296 180974 13307 99873 13088 169266
5631A69266k4178e167B51039D4488J06510J1141l9154K1669D3352K3188j6638
$$ 169266 145088 -5167 251039 44488 150998 162139 122985 144654 43352 66540 49902
5620D9902k4253J17462F3058N2511E5299A9760J13330D8747J5175j1103j479O1088
$$ 49902 25649 143111 63058 115569 55299 19760 133090 48747 63922 52819 51340 112428
5608A12428a4141D7198k0980O5922m1199J15356K662C6336e2156B7762a4969A34316
$$ 112428 -14141 47198 26218 92140 50941 166297 168959 36336 -52156 27762 -14969 134316
5595F1344a03244A00663f5411a6311l4394C7880A0007l727Q6253m4159b9520H2592
$$ 61344 -103244 100663 -65411 -16311 -50705 37880 10007 6280 92533 48374 -29520 82592
5582I8236F063d4599A9793R0945l515M7034G0524A3381N3452g7642J6304A61199
$$ 98236 6063 -44599 19793 110738 107223 154257 70524 13381 66833 -77642 -61338 161199
5569F6121A8463P1991B530L7705g6422E746J24764n5461A3132O5327k9036R8179
$$ 66121 18463 90454 2530 40235 -76422 5746 130510 75049 13132 78459 49423 147602
5557A47602J7660p2106N952a6751m2417E7878K2923l1588N4423M2531h642H8747
$$ 147602 165262 93156 99108 -16751 -59168 57878 80801 49213 103636 146167 -8642 88747
5544C1859J16238M4880K3619O4624l2953J42522K74168O83927P75655L99517m83673
$$ 31859 148097 192977 216596 281220 248267 390789 664957 1348884 2124539 2524056 2040383
5533B040383q06263o07841k21070j03943j27783l9898k4952l785K8632K3463G2773
$$ 2040383 1234120 626279 405209 301266 173483 133585 108633 104848 133480 156943 72773
5521b5279F5634h978F938M5221L5377k8143k8036M2946d638j9681A39373f2819
$$ -25279 65634 -8978 6938 52159 87536 59393 31357 74303 -4638 -24319 139373 -62819
5508a9789P095A12853f2142K6345p790A7044R8500k2354A8631a6278P823G4778
$$ -19789 -12694 112853 -62142 -35797 -43587 17044 115544 93190 18631 -16278 -8455 74778
5495B7221b8510D8979L5073B7135M251a9303l8417j4724A16592f9976G5020b4568
$$ 27221 -28510 48979 84052 27135 31386 -19303 -57720 -72444 116592 -69976 75020 -24568
5482d5572J6193D5477C603a9768m298A27442C5792q904J362f544J237G700J400
$$ -45572 -29379 45477 3603 -19768 -24066 127442 35792 26888 28250 -6544 -5307 7700 9100
5469I100b9266j6168A07354G561J15563a2086N898D1236Q799P805f907C6343M5888
$$ 9100 -29266 -45434 107354 7561 123124 -12086 -6188 41236 50035 57840 -6907 36343 82231
5456H2231j4666B8297c1006C3458a1185l6451m7066M4766A0413c602B1550a2024
$$ 82231 67565 28297 -31006 33458 -11185 -47636 -94702 -49936 10413 -3602 21550 -12024
5443D4045b3270m608D02d5847D5642b6593A23020c4848E6574g3879J0754a1812
$$ 44045 -23270 -27878 402 -45847 45642 -26593 123020 -34848 56574 -73879 -63125 -11812
5430G6646a21569Q500A0275f9633a8026A11158d9593J2223B0075d7439C5114d9845
$$ 76646 -121569 -113069 10275 -69633 -18026 111158 -49593 -37370 20075 -47439 35114 -49845
5417d6826E6247A4367b2102A24394k0360n0004J4703b4645H7465D1574i247n54
$$ -46826 56247 14367 -22102 124394 104034 54030 68733 -24645 87465 41574 -9247 -9801
5405i801A8282M2455N8472g0563I142e2562A6906J57058H688Q9853k4731A786
$$ -9801 18282 60737 119209 -70563 9142 -52562 16906 173964 8688 98541 73810 1786
5392d8345A2906J5562e4900A12818E4140i8380K6157D4046i6304c3342p2488D3937
$$ -48345 12906 28468 -54900 112818 54140 -98380 -72223 44046 -96304 -33342 -105830 43937
5379e3385g217B2778f5092q2493B0737N2145r985d7251A12603C4878c2554B870
$$ -53385 -7217 22778 -65092 -147585 20737 72882 62897 -47251 112603 34878 -32554 2870
5366c133I350b2676G6156j6256A5486c1511h251j5151p1448E2439e762r828A17101
$$ -3133 9350 -22676 76156 59900 15486 -31511 -8251 -23402 -94850 52439 -5762 -15590 117101
5352F4874d8729F7181d7213A09008a4306j321q063r0403B5843P4221m4295J2124
$$ 64874 -48729 67181 -47213 109008 -14306 -15627 -23690 -114093 25843 100064 55769 67893
5340F7893d7531E7171e7919E5613P893O7800C5087b8770I373K6396i3565C9445
$$ 67893 -47531 57171 -57919 55613 63506 131306 35087 -28770 9373 35769 -93565 39445
5327b01978f2806m8663A17114C6241h8183B8227n045h1668c8944G7830e4086M199
$$ -201978 -62806 -111469 117114 36241 -88183 28227 23182 -81668 -38944 77830 -54086 -49887
5315d9887B3750A502h526p8253l6322b1675I2953m4067Q404i222E86M3180k1674
$$ -49887 23750 1502 -8526 -86779 -123101 -21675 92953 48886 57290 -9222 586 43766 22092
5302B2092d074j9273n775O415E0340d1961o3214D6958d5440G74d0071C4039b7397
$$ 22092 -4074 -23347 -29122 -22707 50340 -41961 -105175 46958 -45440 774 -40071 34039 -27397
5288a1656B0439b2891C4649b0414E7492N4457c5287J3432j0516E0711j3521B027
$$ -11656 20439 -22891 34649 -20414 57492 111949 -35287 -21855 -32371 50711 37190 2027
5275A91930g2570D8815J5458k0109J5144f3293F9866F770e7881B0742l052K6010
$$ 191930 -72570 48815 64273 44164 59308 -63293 69866 6770 -57881 20742 17690 43700
5263D3700H507d607n4842A56766a34962E9543J7960A7303M088c950l3107C375
$$ 43700 8507 -4607 -59449 156766 -134962 59543 77503 17303 21391 -3950 -37057 3375
5250C5951M073J2327J4003D535a5600l0519H9185A9342L9162F639J3453M4223
$$ 35951 40024 52351 66354 4535 -15600 -46119 89185 19342 58504 6639 20092 64315
5238F4315j948h241C122J23456a6760F3628j442A3373K1272K0499L4092D0975
$$ 64315 62367 -8241 3122 126578 -16760 63628 62186 13373 34645 55144 89236 40975
5225C9229d4857A4777N692e5519b1331F4467b9050E1294l222J14080D1940L5220
$$ 39229 -44857 14777 20469 -55519 -21331 64467 -29050 51294 48072 162152 41940 77160
5213G7160C7472a1118D4805i7186F6170d4988I130f929A21405c9344A30991B2047
$$ 77160 37472 -11118 44805 -97186 66170 -44988 9130 -6929 121405 -39344 130991 22047
5200A1292J04750L0298e181I3117a4364F9592j7755b2606j4592k768J4633D5822
$$ 11292 116042 146340 -5181 93117 -14364 69592 51837 -22606 -37198 -39966 -25333 45822
5187i0112C2940b230B4532h6718c4239a5580H5762c3587j0245A50757o9045C1438
$$ -90112 32940 -2230 24532 -86718 -34239 -15580 85762 -33587 -43832 150757 81712 31438
5174A20342b9923D7551j2844Q9696f7010L2434A13844G907Q4402p201k1583a0051
$$ 120342 -29923 47551 34707 124403 -67010 -34576 113844 7907 92309 85108 63525 -10051
5161C7988K2572d763I4952a75394E527O12L156M1164I819P353J25861F5223a14706
$$ 37988 60560 -4763 94952 -175394 5527 6139 9295 50459 9819 17172 143033 65223 -114706
5147i7197M0739A0143M6915q341K8508h6239P501F319a10616b8653G4516M476
$$ -97197 -56458 10143 57058 48717 77225 -86239 -78738 6319 -110616 -28653 74516 78992
5135G8992b1819q0924D1347a56057a3518j4508J538j8056I8499D7438g2929b8423
$$ 78992 -21819 -102743 41347 -156057 -13518 -28026 -26488 -44544 98499 47438 -72929 -28423
5122a05908M71D6904q532M5964H470M997K1792b5718D5505h541A5688N1833m329
$$ -105908 -105437 46904 38372 84336 8470 13467 35259 -25718 45505 -8541 15688 67521 63192
5109F3192J2925d6570a6557n5686G4600k3177a05181F0830k3451H37M7833a3468
$$ 63192 76117 -46570 -16557 -72243 74600 51423 -105181 60830 37379 837 48670 -13468
5096A5324o4a9446n0001G1556B8335J4804l341j1827K3605e0043B8875Q363N3060
$$ 15324 15260 -19446 -69447 71556 28335 43139 39798 27971 51576 -50043 28875 37238 90298
5083I0298C7501N3289A3490c9877j01515f9745L467I951O3407a4296j4776i453
$$ 90298 37501 90790 13490 -39877 -141392 -69745 -66278 9951 73358 -14296 -29072 -9453
5070f7839K7217N706A6106J0154D291a4630o3508K9054I5084m2736a0223k3400
$$ -67839 -40622 -34916 16106 26260 4291 -14630 -78138 -49084 95084 52348 -10223 -33623
5058c3623a0618G0671O9737e6602A2896O4761g403r8682a4198O392F692K0197
$$ -33623 -10618 70671 140408 -56602 12896 77657 -7403 -106085 -14198 -7806 6692 26889
5046B6889J4673P0664m8080O289e7639E446K7969J32157a71644D7060j3902K249
$$ 26889 41562 112226 64146 70435 -57639 5446 33415 165572 -171644 47060 33158 35407
5034C5407M1346i9348B4836j0043b4614B0183Q2064D6694a18201B1909a8292k2355
$$ 35407 76753 -99348 24836 14793 -24614 20183 102247 46694 -118201 21909 -18292 -40647
5022d0647E1736q35k489d9981a9594l7261E818g4826j2307B7328b5215j3000e265
$$ -40647 51736 50901 48412 -49981 -19594 -56855 5818 -74826 -87133 27328 -25215 -38215 -5265
5008A175L9582d5431C1925b3073C0262L2302g9376A70132b9288A02939h7228A8399
$$ 1175 40757 -45431 31925 -23073 30262 62564 -79376 170132 -29288 102939 -87228 18399
4995d8764F7745a60399C3505A0211L8088J3764p24f9164F5909J02348B3726N3794
$$ -48764 67745 -160399 33505 10211 48299 62063 61339 -69164 65909 168257 23726 77520
4983G7520l6740E433O0139C0270g8232I9347B7645b0431j6716C098K6879a0670
$$ 77520 40780 5433 65572 30270 -78232 99347 27645 -20431 -37147 3098 29977 -10670
4970c0949a5373B9443A35L8984J4605J6197K6218M0415d648A00160j4152l7579
$$ -30949 -15373 29443 135 39119 53724 69921 96139 136554 -4648 100160 86008 48429
4958D8429c4092A48622E4182Q861A7478Q245N207Q0850J2572Q49m3455b0925B2056
$$ 48429 -34092 148622 54182 63043 17478 25723 30930 111780 124352 125201 81746 -20925 22056
4944c1181A8383J5655H112f9243j9163K3614A9131L3070b7334m6927f699D0163
$$ -31181 18383 34038 8112 -69243 -88406 -64792 19131 52201 -27334 -74261 -6699 40163
4931I2795n559B7102O3230c3753A5169J11223m7242b9991j51552C3843N2156A9939
$$ 92795 87236 27102 90332 -33753 15169 126392 79150 -29991 -181543 33843 85999 19939
4918d4943B4717O4028e5622J4325D0909d0563J1809L9A1375K24613a15070D8529
$$ -44943 24717 88745 -55622 -41297 40909 -40563 -28754 -28715 11375 235988 -115070 48529
4905F2319J2131F616h7511c7912j5552j399n002n734D2065c4860E2934J0592h480
$$ 62319 74450 6616 -87511 -37912 -53464 -54863 -59865 -65599 42065 -34860 52934 63526 -8480
4891a01728A0848a00477h450A1155i719D0007J33883f4882J6778D9474g4447A05295
$$ -101728 10848 -100477 -8450 11155 -9719 40007 173890 -64882 -48104 49474 -74447 105295
4878D7074Q9390a16259a3829f902k7298A01034k198g087A07327h66A3024a05048
$$ 47074 136464 -116259 -13829 -6902 -34200 101034 98836 -7087 107327 -866 13024 -105048
4865a1600F2904B1952M9522k5886L260d3313G1876C4268e6452a1322j4050l8876
$$ -11600 62904 21952 71474 45588 48848 -43313 71876 34268 -56452 -11322 -25372 -64248
4853f4248p323A2769e7692A890N3617c7198a8297j0097J1466p393e717G5854a34407
$$ -64248 -71571 12769 -57692 1890 55507 -37198 -18297 -28394 -16928 -24321 -5717 75854 -134407
4839D9908G325c5113F407J03662a0131A07249k4754B59L13080J84171L18074J42997
$$ 49908 7325 -35113 6407 110069 -10131 107249 82495 259 313339 497510 815584 958581
4827I58581k51295A47453l6341m0185P7176l4490i826A16323h5598A41276J9800
$$ 958581 707286 147453 111112 70927 148103 113613 -9826 116323 -85598 141276 161076
4816A61076F4181a6415b334F5572a32033A624O492L5005a419r7375j6746A0352
$$ 161076 64181 -16415 -2334 65572 -132033 1624 8116 43121 -1419 -98794 -115540 10352
4803G8077e179k7652D6317A8819M0758k5045d7812K3797N709C8409A0043g6986
$$ 78077 -5179 -32831 46317 18819 59577 34532 -47812 -24015 -18306 38409 10043 -76986
4790B1142h4883k6688A44047f7247E0017c2705a1380G4550a00491a7338D8741
$$ 21142 -84883 -111571 144047 -67247 50017 -32705 -11380 74550 -100491 -17338 48741
4778F1055c2938l5045B9200a3460k7353F8130a8528P749j16981d4608G9709B034
$$ 61055 -32938 -67983 29200 -13460 -40813 68130 -18528 -10779 -127760 -44608 79709 2034
4765a20630e0695B2422c2980j6845M94a5506o170M949q509k02a2151C3768J25507
$$ -120630 -50695 22422 -32980 -49825 -49331 -15506 -21676 -16727 -25236 -25438 -12151 33768 159275
4752A59275g4316a4596k3862I0688c9038E621a05060H5272Q6554b11719F0292
$$ 159275 -74316 -14596 -38458 90688 -39038 5621 -105060 85272 171826 -211719 60292
4740D7363a18137k127c1025m2830g020E4865j7711b0776o4083G9848R003D08a03379
$$ 47363 -118137 -120264 -31025 -73855 -7020 54865 37154 -20776 -84859 79848 88851 408 -103379
4726d6092E6529g782j07667R084d7808k0810c2266j19035H4476b6910C8490L2323
$$ -46092 56529 -7782 -115449 -106365 -47808 -68618 -32266 -151301 84476 -26910 38490 70813
4714G0813b639j9993B5947g0863F6519g9809k5853c8431h2n1110o755k3954b8448
$$ 70813 -2639 -22632 25947 -70863 66519 -79809 -105662 -38431 -82 -51192 -57947 -81901 -28448
4700E7182a1441B1807J8548J3256B2207R46L4039h0980l8196b6380O935j73729
$$ 57182 -11441 21807 40355 53611 22207 23153 57192 -80980 -119176 -26380 -19445 -193174
4688a93174E0069d1553I8230f2901h178r015E1620d2239b0632H2032e4996a6283
$$ -193174 50069 -41553 98230 -62901 -8178 -17193 51620 -42239 -20632 82032 -54996 -16283
4675f0348F9712M8060A2559g2691F7140g778r1745d3471a2864E4240a30692A1646
$$ -60348 69712 117772 12559 -72691 67140 -7778 -99523 -43471 -12864 54240 -130692 11646
4662f3857a842A8002q625c1159C2614d6093D8827O953h1666B3948b6254E2087
$$ -63857 -1842 18002 9377 -31159 32614 -46093 48827 55780 -81666 23948 -26254 52087
4649a45554I5765B7492j788g7796l6748e3224m0995K8996a8261k0036p973J1715
$$ -145554 95765 27492 25704 -77796 -114544 -53224 -94219 -65223 -18261 -38297 -46270 -34555
4637c4555A05352B7269a30337A04897B3028e2898C2795a14691N0292o6746b9839
$$ -34555 105352 27269 -130337 104897 23028 -52898 32795 -114691 -64399 -131145 -29839
4625C5148a641C1530N3793A3257a15309b7848B0463h932B2469a9567m290j4404
$$ 35148 -1641 31530 85323 13257 -115309 -27848 20463 -8932 22469 -19567 -23857 -38261
4613c8261j0659H1609d8402A29738D4324a11361d5856d742A34476F7001g2891
$$ -38261 -48920 81609 -48402 129738 44324 -111361 -45856 -4742 134476 67001 -72891
4601a8633I825f0056A4160b2828r628q1794c2051C0709i7225D2190R329B834R137
$$ -18633 9825 -60056 14160 -22828 -32456 -114250 -32051 30709 -97225 42190 51519 2834 11971
4588A1971f562o0714E6092b6247r7263O0472D6345f5004n350B9683d0473B1226
$$ 11971 -6562 -67276 56092 -26247 -123510 -63038 46345 -65004 -70354 29683 -40473 21226
4575b6559k6502d017F9656a61511L9761a9575j1143H262O4380A8853c419j00788
$$ -26559 -53061 -4017 69656 -161511 -121750 -19575 -30718 8262 72642 18853 -3419 -104207
4563a04207A37878a01861G2833C113d3949l4185D8387c6846E5213e5599B8165
$$ -104207 137878 -101861 72833 3113 -43949 -78134 48387 -36846 55213 -55599 28165
4551a8473o46N915A4479M8274f0127B5314b5829p0272I4984a1045D2611I408J02053
$$ -18473 -19119 -13204 14479 62753 -60127 25314 -25829 -96101 94984 -11045 42611 9408 111461
4538A11461C077a15386C6427a53370d4669A0165f5766C1609h3406d0775k1685
$$ 111461 3077 -115386 36427 -153370 -44669 10165 -65766 31609 -83406 -40775 -62460
4527f2460B5233f5798D0941o60N0344h7095B1111f2367D1793e9906K3178o2691
$$ -62460 25233 -65798 40941 40281 90625 -87095 21111 -62367 41793 -59906 -36728 -99419
4515i9419F5607i8223a6842j046G0281b6436n8371h551A55937G5267B7594K3118
$$ -99419 65607 -98223 -16842 -17888 70281 -26436 -84807 -8551 155937 75267 27594 50712
4503E0712O676h1627c533D5590k0776b3445n32A7167K6645f1395q6256I9155d2895
$$ 50712 57388 -81627 -3533 45590 24814 -23445 -23977 17167 43812 -61395 -147651 99155 -42895
4489D1030A6319g5702C2024d3957n5323K2720I281L108h3778I6326C3944d1086
$$ 41030 16319 -75702 32024 -43957 -99280 -76560 9281 12389 -83778 96326 33944 -41086
4476a7884k2399l8157b6687A02104f4201A6097O0900a9391E0251d2105k0285A1639
$$ -17884 -40283 -78440 -26687 102104 -64201 16097 76997 -19391 50251 -42105 -62390 11639
4463b7045m254a1603j08810E9440F054i2255d5609K2263k6446J7172D5334b0190
$$ -27045 -31299 -11603 -120413 59440 6054 -92255 -45609 -23346 -49792 -32620 45334 -20190
4450a04988d090E8266c876o8372J2934G6828M747c7195n087H7712f2440k6900
$$ -104988 -4090 58266 -3876 -72248 -59314 76828 81575 -37195 -42282 87712 -62440 -89340
4438h9340A07949b0859A09510l8208g0538A7324a3707l1406G7642j526b1053j8082
$$ -89340 107949 -20859 109510 71302 -70538 17324 -13707 -45113 77642 76116 -21053 -39135
4426c9135p7270l5720H930e8686K7993j03035L894B5222j0668a9447k0268l6846
$$ -39135 -116405 -152125 8930 -58686 -30693 -133728 -129834 25222 14554 -19447 -39715 -76561
4414g6561a5483n5942n2811c27k415n7368A37412C6089d2575l0270r9748C4315
$$ -76561 -15483 -71425 -124236 -327 -2742 -60110 137412 36089 -42575 -72845 -172593 34315
4401i1250A4910K0793a8455D7209g9587b0846E3575f3917E9667a12493G9403d2829
$$ -91250 14910 35703 -18455 47209 -79587 -20846 53575 -63917 59667 -112493 79403 -42829
4388d7420a1857E7924e2711k8232L8317J7108o4711c0390D6911I626d611n8035
$$ -47420 -11857 57924 -52711 -80943 -42626 -25518 -90229 -30390 46911 9626 -4611 -62646
4376f2646k2880J5345L0158B3124h5736n7214a4129p061L263j30183e6114r18
$$ -62646 -85526 -70181 -40023 23124 -85736 -142950 -14129 -21190 -17927 -148110 -56114 -57032
4364e7032A2676d4018b0189a033m3706A8467J1694a2457j74377C713a92723G0250
$$ -57032 12676 -44018 -20189 -1033 -44739 18467 30161 -12457 -186834 3713 -192723 70250
4351c6719j6623p2186A05121k7772e2523A22285c9916H439N7573k4730a26782
$$ -36719 -53342 -125528 105121 77349 -52523 122285 -39916 8439 66012 41282 -126782
4339b9006m5920F1895a49734f6918F480L82f4788k9643J4373L990j1580j6228
$$ -29006 -74926 61895 -149734 -66918 6480 6862 -64788 -94431 -80058 -76068 -87648 -103876
4327a03876P584d3892n2548J4058L4614B0254c1713F4886b3036k0756A1462c6574
$$ -103876 -96292 -43892 -96440 -82382 -47768 20254 -31713 64886 -23036 -43792 11462 -36574
4314g1987b0066j947l0661o3168e009j3204O795l2123a7602m4203j1271A0468
$$ -71987 -20066 -22013 -52674 -115842 -5009 -18213 -11418 -43541 -17602 -61805 -73076 10468
4301f4108B9719n7R140c8851D0627f2825B0153E204B157Q6838C1392A4727J240
$$ -64108 29719 29662 38802 -38851 40627 -62825 20153 5204 2157 88995 31392 14727 15967
4288A5967b50B8138J70025K12267R9924K13159K69816N0957k67575l59698j08417
$$ 15967 -250 28138 198163 410430 510354 723513 993329 1044286 776711 417013 308596
4277C08596F2502R9631o6795j8126r546J3002M6592K456M4981l0703O8122M5928
$$ 308596 62502 162133 95338 77212 67666 80668 127260 129716 174697 143994 212116 258044
4265B58044O1270L62139L60606l0186k36838l04067j03789j30980l1330I5058
$$ 258044 319314 681453 1042059 1011873 775035 470968 367179 236199 204869 95058
4254G9972B4351K9131G679c1491J4245B4601J894e9758a158A0840J9318d088p8099
$$ 79972 24351 53482 7679 -31491 -17246 24601 26495 -59758 -1158 10840 30158 -4088 -82187
4241h2187A08494b8203l1642H7903a25370D4857g3330E5617A3348g4882g429A2868
$$ -82187 108494 -28203 -59845 87903 -125370 44857 -73330 55617 13348 -74882 -7429 12868
4228A9965b3075E2866g099j2119m0576B1056a00781c4906k0907I429J08767f1014
$$ 19965 -23075 52866 -7099 -19218 -59794 21056 -100781 -34906 -55813 9429 118196 -61014
4215b6295j3220m082o1357F8707P27a18881C1641J1958f2068L192h918L828p0483
$$ -26295 -39515 -43597 -104954 68707 69434 -118881 31641 43599 -62068 -58876 -8918 -5090 -75573
4202g5573A152M6427A8193O0393f1205J9649a7743b654C0224j4210Q5443j5236
$$ -75573 1152 47579 18193 78586 -61205 -41556 -17743 -2654 30224 16014 101457 86221
4190H6221L652b8411R479E4016e5003H9521j6701l3641b4238l6072A13306A7248
$$ 86221 89873 -28411 -18932 54016 -55003 89521 72820 39179 -24238 -60310 113306 17248
4177g021o0544a1864C4643a9836A18176h0036A47613J151E8959d040I1664l6053
$$ -7021 -67565 -11864 34643 -19836 118176 -80036 147613 148764 58959 -4040 91664 55611
4165E5611A6044c41l04E1964j732M6163a117A04963J29627m8410q0322k8407J6998
$$ 55611 16044 -341 -645 51964 50232 96395 -1117 104963 234590 186180 105858 77451 94449
4152I4449J20527K4492L2678n9927j05051M3916C7459b2281A85743k9904N6833
$$ 94449 214976 239468 272146 212219 107168 151084 37459 -22281 185743 155839 212672
4141B12672J3306N3539o2382L2027J838j8175N6897K9238K58615j48953J56477
$$ 212672 225978 279517 217135 249162 251000 232825 289722 318960 577575 428622 585099
4130E85099O3505o7802j1665K01762j08171K4768o0924N0566J5497J1027L40706
$$ 585099 648604 580802 569137 770899 662728 687496 626572 677138 692635 703662 1044368
4119A044368K4802Q3565K90015J58442L61638J46744M28477M87200N22842P15508
$$ 1044368 1069170 1152735 1442750 1601192 1962830 2109574 2538051 3025251 3548093 4263601
4109D263601Q23687R51719J336587J696456K433498L103640L823616N085547P992503
$$ 4263601 5087288 6039007 7375594 9072050 11505548 14609188 18432804 23518351 31510854
4100C1510854J5401909L2803415N4345668O1032625K3461677m0278196o9483449
$$ 31510854 46912763 79716178 134061846 195094471 218556148 178277952 108794503
4093A08794503m3885383k1326809j0303804n833173l737350k498838j590537p2498
$$ 108794503 64909120 43582311 33278507 27445334 23707984 21209146 19618609 19546111
4085A9546111J246120K262917L747275N811719J1405576K4685765M6049555O0462286
$$ 19546111 20792231 23055148 26802423 32614142 44019718 68705483 114755038 175217324
4077A75217324L9827922j8991295o8077774n4537169k7631941j3417152p602437
$$ 175217324 215045246 196053951 127976177 73439008 45807067 32389915 24787478
4070B4787478m990036m045801l464628k623055j803815j417427r86381o00182
$$ 24787478 19797442 15751641 12287013 9663958 7860143 6442716 5456335 4856153
4062D856153p80957l16991l64184m59953j25020k92264m4252m6151l41301P4937
$$ 4856153 4075196 3758205 3394021 2934068 2809048 2516784 2472532 2426381 2085080 2160017
4052B160017k29573k08702j7440p5885l47268p7842k3762j36671J01035j52619
$$ 2160017 1930444 1721742 1704302 1628417 1281149 1203307 1179545 1042874 1143909 991290
4042I91290r4303O5350n3701m9415M118N1560l3552j37432l1783Q4530k41427
$$ 991290 896987 962337 908636 859221 863339 914899 881347 743915 712132 796662 555235
4031E55235J05182q5533k39499J64529M9461j40194K4139j70750K66365j40062
$$ 555235 660417 574884 335385 499914 549375 409181 433320 262570 528935 388873
4021C88873N8797N1549l2895j39460R6815m7020L8748j0301l3700r5082k6904
$$ 388873 447670 499219 466324 326864 423679 376659 415407 405106 371406 276324 249420
4010B49420o0753J35414j39337M7540J59622j33480j7621K645R8804j42246L6781
$$ 249420 188667 324081 184744 232284 391906 258426 240805 243450 342254 200008 236789
3999B36789O7653r4931L4260k9825A06776K9582J30387n1650m0417o8557J20923
$$ 236789 304442 209511 243771 213946 106776 136358 266745 215095 174678 106121 227044
3988B27044n9869P301M6454j8939H5643P7037G0888N1294n5179R6922q0731Q4084
$$ 227044 167175 174476 220930 201991 85643 162680 70888 122182 67003 163925 83194 167278
3976A67278l4021J1464M9178H1659k274P1480k6217J55117A20486C1717J11444
$$ 167278 133257 144721 193899 81659 79385 150865 124648 279765 120486 31717 143161
3965A43161j9730k8140J40754q5263l9128L9167o3675M0765n438n1745K0864J2811
$$ 143161 123431 95291 236045 150782 111654 150821 87146 127911 122473 70728 91592 104403
3953A04403Q9359O989C6852D957J31548j4853N0416m9981O737l3536C2348G791
$$ 104403 193762 200751 36852 4957 136505 121652 172068 122087 128824 95288 32348 7791
3940c3171B08591H7104K7784A6334N4410a8899E3454i824F8768K9627O3818J21398
$$ -33171 208591 87104 114888 16334 70744 -18899 53454 -9824 68768 98395 162213 283611
3928B83611A33525E1249A1203a16014I4901A737J38986B6967Q428J5510N4045
$$ 283611 133525 51249 11203 -116014 94901 1737 140723 26967 35395 50905 104950
3917A04950A4002N5433J10962j5556M680R9011q2142J80154J40987K90163K70210
$$ 104950 14002 69435 180397 164841 169521 268532 186390 366544 507531 797694 1067904
3906A067904K09438l93239l72275j20359j03900o4332n2292k1587M234P7175G8021
$$ 1067904 1277342 884103 511828 391469 287569 223237 170945 149358 153592 230767 78021
3894A82827Q4015H9853L18829j63679Q5609M94727K27857O2076j93905j90539
$$ 182827 266842 89853 408682 245003 330612 825339 1053196 1115272 921367 730828
3884G30828l37255j3640j47001o4853r041K8152M4696G4819e561A17873l9225
$$ 730828 393573 379933 232932 168079 159038 187190 231886 74819 -5561 117873 78648
3873G8648a03863b3465A11830B6345M8117O721f9969b1457I306L4364L8644k6148
$$ 78648 -103863 -23465 111830 26345 74462 81183 -69969 -21457 9306 43670 82314 56166
3861E6166j6869O666Q2580c8748D9712j2680j4944L0075M0839a3334A1491K857
$$ 56166 39297 45963 128543 -38748 49712 37032 22088 52163 93002 -13334 11491 14348
3849A4348b049C8360K6232K6220r505R8879E5049L8533A6323a1299D7372J492
$$ 14348 -2049 38360 64592 90812 81307 180186 55049 93582 16323 -11299 47372 48864
3837D8864f304A07372I290a8401A3368e1634A05192K3157i6801J3370B6792g2093
$$ 48864 -6304 107372 9290 -18401 13368 -51634 105192 128349 -96801 -83431 26792 -72093
3824H0844j7984J7009k3230N108E156O263c9940G582a15838A03014e4044K663
$$ 80844 62860 79869 56639 61747 5156 11419 -39940 7582 -115838 103014 -54044 -51381
3812e1381E019K5415K9807K1096m0154O3521I009a1127A9402a04103b4415h753
$$ -51381 5019 30434 60241 81337 41183 104704 9009 -11127 19402 -104103 -24415 -8753
3799E9258h6305H2860C6141f8667J8745a342o0502B2059M1240e9478B6002H681
$$ 59258 -86305 82860 36141 -68667 -49922 -1342 -61844 22059 63299 -59478 26002 8681
3786c376A06251A6201M4615P3419c2401d093G1742M8411B3070J62441h5855E4099
$$ -3376 106251 16201 60816 134235 -32401 -4093 71742 120153 23070 185511 -85855 54099
3773G0916f1484A23862N825c792G1215J0904A9715Q1132l4112B6667f0800H7722
$$ 70916 -61484 123862 129687 -3792 71215 82119 19715 100847 66735 26667 -60800 87722
3760d2275k2109J0704K3924m5474c1380k9814B2184c7463A57707b5080D9447N7386
$$ -42275 -64384 -53680 -29756 -75230 -31380 -61194 22184 -37463 157707 -25080 49447 106833
3748A06833D2774j3790g9961p3895G6871J1069c1667I1099a01981M7845A04186
$$ 106833 42774 28984 -79961 -153856 76871 87940 -31667 91099 -101981 -54136 104186
3736d1710C164J8636J0340M4058i863A19234c9825k8013b4687G0488J5963k3815
$$ -41710 3164 21800 32140 76198 -9863 119234 -39825 -67838 -24687 70488 86451 62636
3724F2636M9881C1022j333j0971g1437A9151Q0438m2169d0659A74658G0165a997
$$ 62636 112517 31022 29689 18718 -71437 19151 99589 57420 -40659 174658 70165 -1997
3711H5100d416B9382J0846a21368A42090g943C6950c6368F6531d8866D7442j8577
$$ 85100 -4416 29382 40228 -121368 142090 -7943 36950 -36368 66531 -48866 47442 28865
3699B8865j0091K6675Q1597B4844L0857A5082i7215g49k4032B5787L4855Q2661
$$ 28865 18774 45449 127046 24844 55701 15082 -97215 -749 -24781 25787 60642 143303
3687A43303a0975E8303K5100C4374D450J05088c6758G1890a7179A17784a5326
$$ 143303 -10975 58303 83403 34374 4450 109538 -36758 71890 -17179 117784 -15326
3675B6527j3231g999H5740O3955A4813L8822b7294A18383O209j5946L560J5349
$$ 26527 13296 -7999 85740 149695 14813 53635 -27294 118383 124592 108646 112206 127555
3663A27555E8277I681M2788N5311D0181j4909L4574J3564J4177n307B4630R7764
$$ 127555 58277 9681 52469 107780 40181 25272 59846 73410 87587 82280 24630 122394
3651A22394n9877P277L9803C7801p968O4106g656p0071G9506K7590e406B1363
$$ 122394 62517 69794 109597 37801 29833 93939 -7656 -77727 79506 107096 -5406 21363
3638A07210C0622J23737n3788r213K2010L3590H213M6870a2793A47383B6089N5462
$$ 107210 30622 154359 100571 91358 113368 146958 8213 55083 -12793 147383 26089 81551
3626H1551D0708J33237n5820m4183H745a5449l5684I3087B2030J4225a2876m3967
$$ 81551 40708 173945 118125 73942 8745 -15449 -51133 93087 22030 36255 -12876 -56843
3614e6843C9324R3860P3923q2679C5482P9198i1724Q44J9018C1654Q5023j3785
$$ -56843 39324 133184 207107 124428 35482 114680 -91724 -90880 -71862 31654 116677 102892
3602A02892k5464R934H160a7090A35723F4062A6777M597P7480i228C6985O525
$$ 102892 77428 87362 8160 -17090 135723 64062 16777 21374 98854 -9228 36985 43510
3590D3510B1418J18947I936J02188b1208A0883N4569A8578k474J8976M4112b3845
$$ 43510 21418 140365 9936 112124 -21208 10883 65452 18578 16104 35080 79192 -23845
3577e208C2149J08659m2516C1786a621B7618d1818B2026a2869d800k0194E0030
$$ -5208 32149 140808 98292 31786 -1621 27618 -41818 22026 -12869 -4800 -24994 50030
3564E3444Q7822N8315r7613N7907a8689m3738b8615b156C4863i5200o580c6128
$$ 53444 141266 199581 101968 159875 -18689 -62427 -28615 -2156 34863 -95200 -101780 -36128
3551C1958c8922E9491a4875m9847A22301B675O1240d8264C4075a20662b8818c058
$$ 31958 -38922 59491 -14875 -64722 122301 2675 63915 -48264 34075 -120662 -28818 -3058
3538h533B1423i7981C2449a335D3201j9263g599j19058C5721K6855h566D4130
$$ -8533 21423 -97981 32449 -1335 43201 23938 -7599 -126657 35721 62576 -8566 44130
3525D7666B23L6441j7139K9954i9904b1409l824r8547E1125O3775E5023q264J0745
$$ 47666 223 36664 19525 49479 -99904 -21409 -25233 -123780 51125 114900 55023 46759 57504
3512E7504N3372C3003d0371m7163c6438D0646e2672K2238J2306L369j06531D6473
$$ 57504 110876 33003 -40371 -87534 -36438 40646 -52672 -30434 -18128 -14759 -121290 46473
3499d5792H0153a12749B6908a28874E2752a5330o816F1671d7809l4965D3361J8347
$$ -45792 80153 -112749 26908 -128874 52752 -15330 -22146 61671 -47809 -82774 43361 61708
3487F1708j0954f7155B160g8401b6484r201m2315J4430D9959f0237m4569A6437
$$ 61708 50754 -67155 2160 -78401 -26484 -35685 -78000 -63570 49959 -60237 -104806 16437
3474h5012K5205K6536G6359k8759a02807B7120e739A04090D8845O902e3824J4035
$$ -85012 -59807 -33271 76359 47600 -102807 27120 -5739 104090 48845 55747 -53824 -39789
3462c9789n694C4876a5332o2255b4368o948A04002E1706A8338Q6766C929P2588
$$ -39789 -45483 34876 -15332 -77587 -24368 -31316 104002 51706 18338 105104 3929 76517
3450G6517a43998D569a17695b5828a0357E5527a17532B4011a4923p6042c9058
$$ 76517 -143998 4569 -117695 -25828 -10357 55527 -117532 24011 -14923 -90965 -39058
3438a5052E7346d3003C8578G039d3069J4076O895m0511p4494c7026a4501C4693
$$ -15052 57346 -43003 38578 7039 -43069 -28993 -22098 -62609 -137103 -37026 -14501 34693
3425c1701G5318i2769E5590J4073c9671E4790b0998G5039M6603C7509d5019A3691
$$ -31701 75318 -92769 55590 69663 -39671 54790 -20998 75039 121642 37509 -45019 13691
3412E6965g2495p0894H7165a47355L0123L1684A9267a03843B9461N1717C1052
$$ 56965 -72495 -143389 87165 -147355 -117232 -85548 19267 -103843 29461 81178 31052
3400a16906E7450K4151f2728K0246l8621G1534B8018f7890K0609C5665a61416
$$ -116906 57450 81601 -62728 -42482 -81103 71534 28018 -67890 -47281 35665 -161416
3388I4286a3183I242f0451L120a0159A3148d7069A1810P7145k0435I505g1520
$$ 94286 -13183 9242 -60451 -57331 -10159 13148 -47069 11810 88955 68520 9505 -71520
3375i1265c3357A8335L3557I910N044h1760I9193P168h5361B0975P0916k2217
$$ -91265 -33357 18335 51892 9910 14954 -81760 99193 106361 -85361 20975 91891 69674
3363F9674g662B5113N6478E927M5158a6643j6255B7418a5856A3531f1298l9413
$$ 69674 -7662 25113 81591 5927 51085 -16643 -32898 27418 -15856 13531 -61298 -100711
3351a00711d0948k9113b2536o8602E5185R455e3272B7776O857K5815a26149H055
$$ -100711 -40948 -70061 -22536 -91138 55185 64640 -53272 27776 34633 60448 -126149 8055
3338A7970a63581b1121i1C7100a08478A3179c2060J2811B4626b01753f0747D014
$$ 17970 -163581 -21121 -91 37100 -108478 13179 -32060 -19249 24626 -201753 -60747 4014
3325B2525D501a8969l0811a9468Q086l0105A34405b26486f2014l1593d0897H0890
$$ 22525 4501 -18969 -49780 -19468 -11382 -41487 134405 -226486 -62014 -93607 -40897 80890
3312I1553b3509j17876C2893e4630l9495C7816c0824H7257k4581b2300j2738n800
$$ 91553 -23509 -141385 32893 -54630 -94125 37816 -30824 87257 62676 -22300 -35038 -40838
3300d0838D940d657m7891G6790b2072l6532A1725a03301R519D1615g2520G4588
$$ -40838 4940 -4657 -52548 76790 -22072 -58604 11725 -103301 -93782 41615 -72520 74588
3287C3958f1550j24302C2023J2366a3951c127p8608g88j13963c6008k2918A1945
$$ 33958 -61550 -185852 32023 44389 -13951 -3127 -81735 -788 -114751 -36008 -58926 11945
3274a15766k0807A29219a09565o9321g5377B5964e3903A16803m7210j272f1519
$$ -115766 -136573 129219 -109565 -178886 -75377 25964 -53903 116803 69593 68321 -61519
3262A00496B1194N1969L67a8947C1854J00122B4911h6468H9463j4480l1087f4322
$$ 100496 21194 73163 73530 -18947 31854 131976 24911 -86468 89463 74983 43896 -64322
3249b1820G3537A321P551d6659A962e5996C0005c3070o3463j7377M608a9046D9662
$$ -21820 73537 1321 8872 -46659 1962 -55996 30005 -33070 -96533 -113910 -109302 -19046 49662
3235i4700c3112a5586j1869r682g075n5378J8709k692a6481a335G8718e0960l7796
$$ -94700 -33112 -15586 -27455 -37137 -7075 -62453 -43744 -46436 -16481 -1335 78718 -50960 -88756
3222h8756c3293G1605e4878J6511A49896A0990E458a4849h43C8993a4365A752
$$ -88756 -33293 71605 -54878 -38367 149896 10990 5458 -14849 -843 38993 -14365 1752
3209F2130c288j1336l2005E651O5915k7605e8919B1731J12561a36524E2507c0699
$$ 62130 -3288 -14624 -46629 5651 71566 43961 -58919 21731 134292 -136524 52507 -30699
3196E0628A8509J7896d067k8632G4692A4921c5788E8445M5646D49Q9096j2006
$$ 50628 18509 36405 -4067 -32699 74692 14921 -35788 58445 104091 449 89545 77539
3184G7539I543c0419m6269n0882C6171e6977Q533M293K1905H974d193F8815c5853
$$ 77539 9543 -30419 -76688 -127570 36171 -56977 -48444 -44151 -22246 8974 -4193 68815 -35853
3170G7336A1153J2997q821c2621l2723D9846a7578m8197I9900a26596d5530J8452
$$ 77336 11153 24150 15329 -32621 -65344 49846 -17578 -65775 99900 -126596 -45530 -27078
3158b7078G897b4417o2361b6490l3951m2829K149e902E3139d1242I0119h5311
$$ -27078 7897 -24417 -86778 -26490 -60441 -103270 -101121 -5902 53139 -41242 90119 -85311
3145B2893g5047B1377b8033D9087g1699a3608f699G4682j2537e1614l2344j6926
$$ 22893 -75047 21377 -28033 49087 -71699 -13608 -6699 74682 62145 -51614 -83958 -100884
3133a00884A1392h6678q5686B7556d2088J9625n5360J611E6611f4881H818d495
$$ -100884 11392 -86678 -172364 27556 -42088 -22463 -77823 -76212 56611 -64881 8818 -4495
3120A1114J52367b0115C4084L3166g7049F5827c3716J2310j0974D4378b2553j5048
$$ 11114 163481 -20115 34084 67250 -77049 65827 -33716 -21406 -32380 44378 -22553 -37601
3108c7601n3573A208a14764M9361A79858E4452j5220O2023a1566b678G547f1251
$$ -37601 -91174 1208 -114764 -65403 179858 54452 39232 101255 -11566 -2678 7547 -61251
3095d5242J6700C2590g2506E0663e3481C3992f0202F2569A0026P160o002J7175
$$ -45242 -28542 32590 -72506 50663 -53481 33992 -60202 62569 10026 17186 11184 28359
3083B8359c4747F4457h2794I739d3832n3481B5408A644f2034A2669f0569p614
$$ 28359 -34747 64457 -82794 9739 -43832 -97313 25408 1644 -62034 12669 -60569 -68183
3071f8183J2717C1627G799e6329m4095D2498a5064n4554F4488a25386E4898g1926
$$ -68183 -55466 31627 7799 -56329 -100424 42498 -15064 -69618 64488 -125386 54898 -71926
3058F7060a3877K640J508B0706c2210p9132E2906k1985o103e0194H972N1402k0495
$$ 67060 -13877 -11237 -9729 20706 -32210 -111342 52906 30921 24818 -50194 8972 60374 39879
3045C9879a2967l6013G7924i809b561n1129d921l5716m3482A52692A5953J5264
$$ 39879 -12967 -48980 77924 -9809 -2561 -53690 -4921 -40637 -84119 152692 15953 31217
3033C1217f7840F7995a78521E6809R308g7416E055P0997j3278j6282L65j8142
$$ 31217 -67840 67995 -178521 56809 66117 -77416 5055 76052 62774 46492 46857 28715
3021B8715A743M5796R085e530E264K6302O042j6434J9184A5816J12403C6595c790
$$ 28715 1743 47539 56624 -5530 5264 31566 37608 21174 40358 15816 128219 36595 -3790
3007f7976L1747E1297A5430J13957a13111p495a2410l55j09682C1651b247k7279
$$ -67976 -36229 51297 15430 129387 -113111 -120606 -12410 -12765 -122447 31651 -2247 -29526
2995b9526e111l4502G3086O9012b7008A06379D9796e6582d14F6557i933F5052
$$ -29526 -5111 -39613 73086 142098 -27008 106379 49796 -56582 -414 66557 -9933 65052
2982A04213i7605H108a47609O4259q9806A05257a5329G5280l4028a35334f3838
$$ 104213 -97605 8108 -147609 -83350 -173156 105257 -15329 75280 41252 -135334 -63838
2970E5226g7466D4980b0660n3199c0916J4980n9100d347A0656M1161G925d9455
$$ 55226 -77466 44980 -20660 -73859 -30916 -15936 -75036 -4347 10656 51817 7925 -49455
2957d7810n59i720j5123H1097a55880P7248E6507h7465b2879k2565I4409b6558
$$ -47810 -48369 -9720 -24843 81097 -155880 -78632 56507 -87465 -22879 -45444 94409 -26558
2944A08122e3438B1428l252B222a21277d5844I884c0816k780B423f2010R367K4343
$$ 108122 -53438 21428 18176 2222 -121277 -45844 9884 -30816 -33596 2423 -62010 -52643 -28300
2931b8300B8847P62a0537A3361a06400h078C3145j744b7630J2604K643C7568a19175
$$ -28300 28847 29609 -10537 13361 -106400 -8078 33145 31401 -27630 -15026 -12383 37568 -119175
2917g4797H0307l0220B4L7082p460a8463j8352r0709K4284K8570D425i4049a6609
$$ -74797 80307 50087 24 37106 29646 -18463 -36815 -127524 -103240 -74670 4425 -94049 -16609
2903a5761J532j2041H0523B8801d7774E4108g5890D2284c3337k784I7053j7067
$$ -15761 -14229 -26270 80523 28801 -47774 54108 -75890 42284 -33337 -36121 97053 79986
2891G9986B1351E015e4207A15051C7073J4553j8666f6792j4095a4429m639A7176
$$ 79986 21351 5015 -54207 115051 37073 51626 32960 -66792 -80887 -14429 -19068 17176
2878b5638k8544H8743a14080F1158O9535b4154B032g3377J8607F8931k4312b0395
$$ -25638 -54182 88743 -114080 61158 130693 -24154 2032 -73377 -54770 68931 44619 -20395
2865g0211b6885n604B2755p572k055f8900K0652A4996h4338A15836m9309A6118
$$ -70211 -26885 -32489 22755 15183 13128 -68900 -48248 14996 -84338 115836 66527 16118
2852b7576f67A50747n0631D0557b0935A7423H339M404a17677L4252r323L1178
$$ -27576 -667 150747 100116 40557 -20935 17423 8339 12743 -117677 -83425 -92748 -61570
2840f1570C6844h9761d4232D3270b5241j6112B4082d1664r560m343A37425A3763
$$ -61570 36844 -89761 -44232 43270 -25241 -41353 24082 -41664 -51224 -55567 137425 13763
2827c5140D808L9236a13681c8576k4547P419m4145A25984o1123d8518a4527l061
$$ -35140 4808 44044 -113681 -38576 -63123 -55704 -99849 125984 64861 -48518 -14527 -17588
2815a7588E3114d3309j0067q865J3874C0457a32815c3973J625A8639K4358b7217
$$ -17588 53114 -43309 -53376 -62241 -48367 30457 -132815 -33973 -32348 18639 42997 -27217
2802F5848l170G803a7333I2983a1730H435e234j33023b7428p5826b4599B8282
$$ 65848 62678 7803 -17333 92983 -11730 8435 -5234 -138257 -27428 -103254 -24599 28282
2789e1301a5866c638B4586f9028a3152q4574B25776c9531l9251L1281A24552m7916
$$ -51301 -15866 -3638 24586 -69028 -13152 -97726 225776 -39531 -78782 -47501 124552 76636
2777G6636a59507D5370d5094H7175k7527N4594A0777i600I0371D382e1401b4708
$$ 76636 -159507 45370 -45094 87175 59648 114242 10777 -9600 90371 4382 -51401 -24708
2764A4117J3259F831c379D7186A495h7333a9368m5406K364a7665C2262a44316
$$ 14117 27376 6831 -3379 47186 1495 -87333 -19368 -64774 -62410 -17665 32262 -144316
2751C6289p620a2748A43273C2433a06511A07569D2547d1778j3282a4245j10500
$$ 36289 28669 -12748 143273 32433 -106511 107569 42547 -41778 -55060 -14245 -124745
2740a24745C9909h3576J7907C3713a93111a5849A40343g7252J5902j9689F8386
$$ -124745 39909 -83576 -65669 33713 -193111 -15849 140343 -77252 -61350 -81039 68386
2728A5613d4191E2844a26576M0573I2068a952r998I134i402o0515H8616b9253
$$ 15613 -44191 52844 -126576 -86003 92068 -1952 -11950 9134 -9402 -69917 88616 -29253
2715d3943m0265A14286i5858K0016A12260B4174N0579e721A0853K0750k984c8752
$$ -43943 -84208 114286 -95858 -75842 112260 24174 74753 -5721 10853 31603 28619 -38752
2702C0583f0542N280b1865n558j6888D1644a4179l8943i067j42158O2585b0957
$$ 30583 -60542 -55262 -21865 -27423 -44311 41644 -14179 -53122 -9067 -151225 -88640 -20957
2689c2723C5763a4007D0781a9029j5012C9666g9012J9519D9387b9921j22783D463
$$ -32723 35763 -14007 40781 -19029 -34041 39666 -79012 -59493 49387 -29921 -152704 4463
2676c217A0369a8186n7117K4171b746n4181C4847f837m3599k2779c6140C1583
$$ -3217 10369 -18186 -75303 -51132 -2746 -56927 34847 -6837 -50436 -73215 -36140 31583
2663C4907i3331J5534A02692b2946C537a5431M752a444a62k8809j8083D8606q748
$$ 34907 -93331 -77797 102692 -22946 3537 -15431 -10679 -1444 -162 -28971 -47054 48606 39858
2650C9858d4045l1115H4821C0815J1874L2282l1297a68641M5186D842L9603h9216
$$ 39858 -44045 -75160 84821 30815 42689 74971 43674 -168641 -123455 4842 44445 -89216
2637A1712l582L605K3816a15443c1328B4844a18601c3167H9237e4873P528J5390
$$ 11712 8130 11735 35551 -115443 -31328 24844 -118601 -33167 89237 -54873 -47345 -31955
2625c1955k2595C8995d2586i014A810c4510H9480j0411c1815I1483a00059a5256
$$ -31955 -54550 38995 -42586 -9014 1810 -34510 89480 79069 -31815 91483 -100059 -15256
2612B4995a5532C6333a4200l2233j13908g3328B8102e1476b1907k7969m3321A04049
$$ 24995 -15532 36333 -14200 -46433 -160341 -73328 28102 -51476 -21907 -49876 -93197 104049
2599F714c0929D1553f0392l5581D1348a81486B9340g9927B0819b7416m1194H273
$$ 6714 -30929 41553 -60392 -95973 41348 -181486 29340 -79927 20819 -27416 -68610 8273
2586A9715G314h6079K3702l5627m946l1601M7804J6752A088O7848K6649B465L6217
$$ 19715 7314 -86079 -62377 -98004 -102950 -134551 -86747 -69995 1088 68936 95585 2465 38682
2573C8682i9770N882A10193f0644i129I0642l9829H398e1105C1550c6178a6404
$$ 38682 -99770 -93888 110193 -60644 -9129 90642 50813 8398 -51105 31550 -36178 -16404
2560e8543m452l9513b7191B8210a46916F8268j94C948i4141M4284A3370c5298
$$ -58543 -62995 -102508 -27191 28210 -146916 68268 68074 3948 -94141 -49857 13370 -35298
2547c6949a73B7681a57437A8515a25537D5867i7451M3355i006o6503m85C0575
$$ -36949 -173 27681 -157437 18515 -125537 45867 -97451 -54096 -9006 -75509 -75994 30575
2534e9547k8562A64540b4688e029k1514C6771b797l3073C4304b5896a0117l5591
$$ -59547 -88109 164540 -24688 -5029 -26543 36771 -2797 -35870 34304 -25896 -10117 -45708
2522d5708C604h2669a147l35G9164C2655e1986A9088M4821a8740r0563A4481d6173
$$ -45708 3604 -82669 -1147 -1482 79164 32655 -51986 19088 63909 -18740 -109303 14481 -46173
2508b5105F1144c3408D6960d2039p0945D1694Q478a016l6753a275H3073i5981
$$ -25105 61144 -33408 46960 -42039 -112984 41694 50172 -1016 -37769 -1275 83073 -95981
2495g5511E8978k8925M2441j2529D79h9987M2281k1839A5944b8826j7841j6136
$$ -75511 58978 30053 72494 59965 479 -89987 -47706 -69545 15944 -28826 -46667 -62803
2483f2803E2061c3097q0322h937A35782i8766I919Q8397d822A2992C114O9117
$$ -62803 52061 -33097 -113419 -8937 135782 -98766 9919 98316 -4822 12992 3114 72231
2471G2231A4800J8935d2481H6536C896g6923h976C0686d2385b499I9194a5815
$$ 72231 14800 33735 -42481 86536 3896 -76923 -8976 30686 -42385 -2499 99194 -15815
2458g2924l8970j174d3654a3705n6797C1278j0950d3823F0378e1124b1430B855
$$ -72924 -111894 -113068 -43654 -13705 -70502 31278 20328 -43823 60378 -51124 -21430 2855
2445D2697g0239j7550A08551b9789j3621b702n2415K3488E4547B820f5744K4453
$$ 42697 -70239 -87789 108551 -29789 -43410 -2702 -55117 -31629 54547 2820 -65744 -41291
2433d1291C0960O5786D7549K7415a4479D1011j3221a4398D652f3270q8488b0903
$$ -41291 30960 96746 47549 74964 -14479 41011 27790 -14398 4652 -63270 -151758 -20903
2420E9784k6942A0833m971O6020a27415n841e3239A3830J6597i1955C8095e0443
$$ 59784 32842 10833 5862 71882 -127415 -133256 -53239 13830 30427 -91955 38095 -50443
2407D3148i6196K7827I9759D4688h0044n881L3307F4324M1606E0273a5338o1307
$$ 43148 -96196 -68369 99759 44688 -80044 -85925 -52618 64324 105930 50273 -15338 -76645
2395g6645A0742M8869f8559a645q9533F8691B884d2056B6205e3515b5787r3623
$$ -76645 10742 59611 -68559 -1645 -91178 68691 2884 -42056 26205 -53515 -25787 -119410
2383a19410H3089a2605Mj9535A1224K4654J8356b4550g839A84562c9560p4542
$$ -119410 83089 -12605 -12601 -32136 11224 35878 54234 -24550 -7839 184562 -39560 -114102
2371a14102b6708r6829L0500J9568C0943c7355k7286I1871D0163J6858a30026
$$ -114102 -26708 -123537 -93037 -73469 30943 -37355 -64641 91871 40163 57021 -130026
2359a7268I2657a08805a5629E335J3014N8528A6679J25897F2637b9623j0519A10544
$$ -17268 92657 -108805 -15629 5335 18349 76877 16679 142576 62637 -29623 -40142 110544
2346a35756d6580k677C8846A1027f6496H0197c3828k9543j899K2398L271q1711
$$ -135756 -46580 -49257 38846 11027 -66496 80197 -33828 -63371 -65270 -42872 -39601 -121312
2334a21312i139D7397e638G4816d0344J8253A44012h7460B2637J923F962a6030
$$ -121312 -9139 47397 -5638 74816 -40344 -22091 144012 -87460 22637 24560 6962 -16030
2321e2613a2530F5038B7697P6540i5430C2791E259a9620C5978P2157b4239A6032
$$ -52613 -12530 65038 27697 104237 -95430 32791 5259 -19620 35978 108135 -24239 16032
2308H9873f1411J1444j3502R186B9202M3467C1512b9241j0187j21786D8874d6438
$$ 89873 -61411 -49967 -63469 -54283 29202 72669 31512 -29241 -39428 -161214 48874 -46438
2295d3420G6560a46628g099a017A23393d0757m0117b4540E4827k1048d8541j12536
$$ -43420 76560 -146628 -7099 -1017 123393 -40757 -80874 -24540 54827 33779 -48541 -161077
2283a61077K0990c9194m7524A415J2364L9688a872H5277A1153e7471c763q5128
$$ -161077 -140087 -39194 -86718 1415 13779 53467 -1872 85277 11153 -57471 -3763 -88891
2271h8891m034L5081C8943i877j49781E6144C569O0086A4570c1716B6788c6136
$$ -88891 -92925 -57844 38943 -9877 -159658 56144 3569 63655 14570 -31716 26788 -36136
2258c8970j9720B2665K7837O047a42340o305c229H792d0756r708E1499c4921D6534
$$ -38970 -58690 22665 50502 56549 -142340 -148645 -3229 8792 -40756 -50464 51499 -34921 46534
2244A4348K8758e5910b5002j07821A2838d4672q458j8066H2213c8916k9694C6735
$$ 14348 43106 -55910 -25002 -132823 12838 -44672 -53130 -71196 82213 -38916 -68610 36735
2231B7609b8653D0181B88J32318A9915K2703a697n6618a4601A5523b2410J0970
$$ 27609 -28653 40181 288 132606 19915 42618 -1697 -58315 -14601 15523 -22410 -11440
2219a1440C4459a21090A31966b7076n6557H860J24169a7499B9939d7251J1930
$$ -11440 34459 -121090 131966 -27076 -83633 8860 133029 -17499 29939 -47251 -35321
2208c5321k317k0014C8703i797D4397d8461D6907h8241a206l7706B5782c2490
$$ -35321 -37638 -57652 38703 -9797 44397 -48461 46907 -88241 -1206 -38912 25782 -32490
2195a0653O25k811j17025L1492J8744A00573a9056c844q6239i693p6785j7199
$$ -10653 -10028 -12839 -129864 -98372 -79628 100573 -19056 -3844 -90083 -9693 -86478 -103677
2183a03677E383j579b7770D6300d8160B9090A0318e4588i887D4052e7166G102
$$ -103677 5383 3804 -27770 46300 -48160 29090 10318 -54588 -9887 44052 -57166 7102
2170A7417f0079C8750b1671a001F5012C0053h993D9010E410c0381B2027e2345
$$ 17417 -60079 38750 -21671 -1001 65012 30053 -8993 49010 5410 -30381 22027 -52345
2157a58920A622b0441e202D4548B788L833i4954M4416C0938g597o143q6922b7565
$$ -158920 1622 -20441 -5202 44548 2788 6621 -94954 -50538 30938 -7597 -13740 -100662 -27565
2143B4305a23172K1146d723m1159l4822E5071c0670C8309a01139I649b777l4982
$$ 24305 -123172 -102026 -4723 -45882 -80704 55071 -30670 38309 -101139 9649 -2777 -37759
2131c7759j2470j7241C765N3150A9757N9811a08062F76c8434O234B8532b8691
$$ -37759 -50229 -67470 3765 56915 19757 79568 -108062 676 -38434 -32200 28532 -28691
2118i7768a3549C6649j756f1271B9483d4508B5929M2070A4780L3736j0234f1228
$$ -97768 -13549 36649 34893 -61271 29483 -44508 25929 67999 14780 48516 38282 -61228
2105E9063k7686e81q0000C2722a08352a6032C1330a10606A1869J384R5902A6034
$$ 59063 31377 -581 -80581 32722 -108352 -16032 31330 -110606 11869 13253 109155 16034
2092a06820a4935D4456c7108r8465F2866j0663p520b6348a2603j03085D2854b8869
$$ -106820 -14935 44456 -37108 -135573 62866 52203 44683 -26348 -12603 -115688 42854 -28869
2079A7186a31014a3518j6541E708f5489A03807a29808E553L9422E51e5301O196
$$ 17186 -131014 -13518 -30059 5708 -65489 103807 -129808 5553 44975 551 -55301 -49105
2067d9105a835E222J0780g5052c1656a2131j5728a3242n7527A01837D5140j6142
$$ -49105 -1835 5222 16002 -75052 -31656 -12131 -27859 -13242 -70769 101837 45140 28998
2055B8998i60r3158H0719a6098o4361E7863f7880k7609c917D3351d1611k0688
$$ 28998 -960 -94118 80719 -16098 -80459 57863 -67880 -95489 -3917 43351 -41611 -62299
2043f2299J8653C9733a1186r0908F6065a18273a0334D0571K3754l0236F432K6957
$$ -62299 -43646 39733 -11186 -102094 66065 -118273 -10334 40571 64325 34089 6432 33389
2031C3389e5418p1803N8165J4209D350c2952p5352B8662d2260I787M9507e3624
$$ 33389 -55418 -127221 -69056 -54847 4350 -32952 -108304 28662 -42260 9787 59294 -53624
2018A0954d252r176j0083l3488N969h790k1356j10612e082C7188b5603a0401j15798
$$ 10954 -4252 -13428 -23511 -56999 -51030 -8790 -30146 -140758 -5082 37188 -25603 -10401 -126199
2005a26199H6525g9525b0563H8059f2352J5099l2081E2812j2157a8310o375A9103
$$ -126199 86525 -79525 -20563 88059 -62352 -47253 -79334 52812 40655 -18310 -24685 19103
1992A4321e0023k338F832O0590f4084G371K837L6017J1186j829c0760o0123A19237
$$ 14321 -50023 -52361 6832 67422 -64084 7371 10208 46225 57411 55582 -30760 -90883 119237
1978d0742H0973a69l5763G2103b2939n0408c6165m421I2836g0839G7348e5839
$$ -40742 80973 -169 -35932 72103 -22939 -73347 -36165 -40586 92836 -70839 77348 -55839
1965F3389b6221A11656c1169C2644c346q0082I7168i016m6350q1111d5008j3487
$$ 63389 -26221 111656 -31169 32644 -3346 -83428 97168 -9016 -55366 -136477 -45008 -58495
1953e8495E6084J0327g47l0669m9504F1206A7198a2505C0995b9779E1947R0490
$$ -58495 56084 66411 -747 -31416 -80920 61206 17198 -12505 30995 -29779 51947 142437
1941A42437a4307G8371k3072J5016K2312i1392d4488H905a9575n5435m4185F106
$$ 142437 -14307 78371 55299 70315 92627 -91392 -44488 8905 -19575 -75010 -119195 6106
1928A14075d2778n2859E081i2356b7388A6727d4682J4500M236A24974d2453H4289
$$ 114075 -42778 -95637 5081 -92356 -27388 16727 -44682 -30182 -25946 124974 -42453 84289
1915d2311m913E1723c1909o5675L2112A0594J7510c6714m9331b7830r6370a370
$$ -42311 -47224 51723 -31909 -97584 -65472 10594 28104 -36714 -86045 -27830 -124200 -1370
1902F1446b3900J542D4911B0641a47363f0294q0372J8389N2560A74784b6601E5925
$$ 61446 -23900 -22358 44911 20641 -147363 -60294 -140666 -122277 -69717 174784 -26601 55925
1889a27942K2595J8881K6894l8255A3180d4439H0682h7555a9337b413I6048B0897
$$ -127942 -105347 -86466 -59572 -97827 13180 -44439 80682 -87555 -19337 -2413 96048 20897
1876E1597L1216c1787n6187a7296m7428G8890b8157H631a631I0045g4320r3661
$$ 51597 82813 -31787 -87974 -17296 -64724 78890 -28157 8631 -1631 90045 -74320 -167981
1864a67981A12191m4226a10633B2318G141J1600g2233A1733J31613f4104K3449
$$ -167981 112191 67965 -110633 22318 7141 18741 -72233 11733 143346 -64104 -40655
1853d0655q2712N4358m9007B4875a1885A34713f3347D0922Q2150d2426d463j46642
$$ -40655 -123367 -69009 -118016 24875 -11885 134713 -63347 40922 123072 -42426 -4463 -151105
1841a51105F168a85627A296d9611E0027j1294d6508B4392K7763M3416A5467j23
$$ -151105 6168 -185627 1296 -49611 50027 38733 -46508 24392 52155 95571 15467 15344
1829A5344h2898k4833A00430a68153I2496F590P6553l094b8966m9579K1289p0484
$$ 15344 -82898 -107731 100430 -168153 92496 6590 83143 80049 -28966 -78545 -57256 -127740
1817a27740K7650B8687a13018C0974R05c610C6548b0413J871J250p4077J88j5165
$$ -127740 -100090 28687 -113018 30974 31879 -3610 36548 -20413 -18542 -17292 -91369 -91181 -106346
1804a06346b5230j7268A5055K2856K3163B615e0766g174p5996c5326l8647g733
$$ -106346 -25230 -42498 15055 37911 61074 2615 -50766 -7174 -83170 -35326 -73973 -7733
1791A00765b9977G3825G589a9347j47809b6622j9915D572c5876k7775D0838c5156
$$ 100765 -29977 73825 7589 -19347 -167156 -26622 -46537 4572 -35876 -63651 40838 -35156
1778D1020J2914c7230K829B0224e0507p1189A039a26972M9201K262I945M8986
$$ 41020 53934 -37230 -34401 20224 -50507 -121696 1039 -126972 -77771 -75509 9945 58931
1766E8931M9189a2984p2887H2893e4867g351B8104a5171F61e5278I0591m1671
$$ 58931 108120 -12984 -85871 82893 -54867 -7351 28104 -15171 661 -55278 90591 48920
1754D8920j3777f2576n382k5525C9578b8729J1679B144h9104c1663p097C3142
$$ 48920 35143 -62576 -67958 -93483 39578 -28729 -17050 2144 -89104 -31663 -38760 33142
1741a26023i008F7961i0517D0207a6611p8357C7132e6908A37294E4830h3576I1528
$$ -126023 -9008 67961 -90517 40207 -16611 -94968 37132 -56908 137294 54830 -83576 91528
1728c5058I188O9838O404C015K7200b5113I871b952E7921n814R589a2364A166
$$ -35058 9188 79026 85430 3015 30215 -25113 9871 -2952 57921 52107 61696 -12364 1166
1714C4584L8454e2165l8169D9960B4737a17758A23455e8326A5261L2238a31686
$$ 34584 73038 -52165 -90334 49960 24737 -117758 123455 -58326 15261 47499 -131686
1702a0931j926I6776j9003l6866b4183I2935b4723k5802M114A7971J5079i0107
$$ -10931 -12857 96776 77773 40907 -24183 92935 -24723 -50525 -46411 17971 33050 -90107
1689a5921m0301B1941K1422e016H890a01466c7886m0165A604R4891H457J28648
$$ -15921 -56222 21941 43363 -5016 8890 -101466 -37886 -78051 1604 96495 8457 137105
1677A37105a02170G8362h1569c4673m5248b4011n404A1839f2903I0516a24717
$$ 137105 -102170 78362 -81569 -34673 -79921 -24011 -29415 11839 -62903 90516 -124717
1665A01945a51670c2503l3383J9346m8605C8346r667i234C5419J1868b4961q206
$$ 101945 -151670 -32503 -65886 -46540 -95145 38346 28679 -9234 35419 47287 -24961 -33167
1653c3167k1895A1247J41948A3292K662M467R6703b2744F5325a8430n7554B640
$$ -33167 -55062 11247 153195 13292 15954 20421 117124 -22744 65325 -18430 -75984 2640
1640a54622c816l1188l1096c2668o082I4744f7925I500g1572A7180J6767j2128
$$ -154622 -3816 -35004 -66100 -32668 -38750 94744 -67925 9500 -71572 17180 33947 21819
1628B1819r45b8882k7966a2088k8679H1051e477B2248J8808e1128B7792K9007
$$ 21819 20874 -28882 -56848 -12088 -40767 81051 -5477 22248 41056 -51128 27792 56799
1616E6799L7537a00778H898g4761l9200a8214D4194L8496a16331B944N0615H252
$$ 56799 94336 -100778 8898 -74761 -113961 -18214 44194 82690 -116331 2944 53559 8252
1603f850r9547H6850A2451d6880C4407j6054d5078d004m855j06230K7146I2436
$$ -6850 -106397 86850 12451 -46880 34407 18353 -45078 -4004 -8859 -115089 -87943 92436
1590A09896f2802B3678j0935b1146f544D1764A5853J0744a5403j3291A12574B4953
$$ 109896 -62802 23678 12743 -21146 -6544 41764 15853 26597 -15403 -28694 112574 24953
1577A9155a3601p8973c4954j1084J7636G444a2660E9625g6859A920a77370f8597
$$ 19155 -13601 -92574 -34954 -46038 -28402 7444 -12660 59625 -76859 1920 -177370 -68597
1564A3385O5952g9586c5029H5471a6675j40H160P434O5151j6466K5628a2400k1548
$$ 13385 79337 -79586 -35029 85471 -16675 -16815 8160 15594 80745 64279 89907 -12400 -33948
1551c3948F7412B6415j1403h410j5188D2848j8641c4961k0929b5661m2475j10774
$$ -33948 67412 26415 15012 -8410 -23598 42848 24207 -34961 -55890 -25661 -68136 -178910
1539a78910E7443a33713e4012J7636a0179G9363j43a31865c9761E2336B6158i8918
$$ -178910 57443 -133713 -54012 -36376 -10179 79363 79220 -131865 -39761 52336 26158 -98918
1526d6770E3676n896b6319R930p0251i715j16073a5085A4071a1146j15655I1904
$$ -46770 53676 47780 -26319 -16389 -86640 -9715 -125788 -15085 14071 -11146 -126801 91904
1513b1238E372J41797d2885J1959D1994A7744Q3505G104i0597c9162r353I038
$$ -21238 5372 147169 -42885 -30926 41994 17744 101249 7104 -90597 -39162 -48515 9038
1500f3797D2116c449o6968A5520h8858C006f3128k0977e367D9201c3166I8864
$$ -63797 42116 -3449 -70417 15520 -88858 3006 -63128 -84105 -5367 49201 -33166 98864
1487a2781a930I5334a26058i453p8598A75d5235Q448A25847B3726M1547a9462
$$ -12781 -1930 95334 -126058 -9453 -88051 175 -45235 -36787 125847 23726 65273 -19462
1474g7017b4852I952N2743A5292J8735f6845A4215f1565D4689i0738g57A83520
$$ -77017 -24852 9952 62695 15292 34027 -66845 14215 -61565 44689 -90738 -757 183520
1461f5789K1481r387a1073j60659N860P7721k2628F2786f7960C3995j6846L8008
$$ -65789 -44308 -53695 -11073 -171732 -165872 -88151 -110779 62786 -67960 33995 17149 55157
1449E5157a8514m0795b0550p4730D602i5731C2920f3349A30633E0900h190E2877
$$ 55157 -18514 -59309 -20550 -95280 4602 -95731 32920 -63349 130633 50900 -8190 52877
1436E948R3401c0276n9856B1009K6121j1595g7041E0262a04695C7827m145j0425
$$ 5948 99349 -30276 -90132 21009 47130 35535 -77041 50262 -104695 37827 33682 23257
1424B3257G312L7510F224A974a53675D621G5h1034c2004F2037f3317b8514J0872
$$ 23257 7312 44822 6224 1974 -153675 4621 75 -81034 -32004 62037 -63317 -28514 -17642
1411a7642n7228A4783J31019D2076A9914L4275I397e4953a7723q164m812E0583
$$ -17642 -74870 14783 145802 42076 19914 54189 9397 -54953 -17723 -25887 -30699 50583
1398a05770E3150A5205N0824M8468m5558C3861h0478b7708A71242F7318e1783
$$ -105770 53150 15205 66029 114497 68939 33861 -80478 -27708 171242 67318 -51783
1386g3857H9727p626a28636G8415f398C5847j3525K8479a10428M6808m3150C412
$$ -73857 89727 82101 -128636 78415 -6398 35847 22322 50801 -110428 -63620 -106770 3412
1373f5641K7687C5922N4539D4573J7115k4771M4226c491m9361P06H6391P3999
$$ -65641 -37954 35922 90461 44573 61688 36917 81143 -3491 -52852 -52146 86391 160390
1361A60390E4973a7501E783d5623j1921e59E1421a60448P6924j9877c5576M595
$$ 160390 54973 -17501 5783 -45623 -57544 -559 51421 -160448 -83524 -103401 -35576 -30981
1349c0981m6126C3816g5483A05928B309d1491H873M2163M0519C5732J1480B2236
$$ -30981 -77107 33816 -75483 105928 2309 -41491 8873 51036 91555 35732 47212 22236
1336E1383a965A8396a09623m4779c0827k7668j006E1516J3538B6641e8886K4611
$$ 51383 -1965 18396 -109623 -154402 -30827 -58495 -59501 51516 65054 26641 -58886 -34275
1324c4275F1053a02032L7036A4079a2602K905o1378J0331K1967a1496J620o9874
$$ -34275 61053 -102032 -64996 14079 -12602 -9697 -71075 -60744 -38777 -11496 -9876 -79750
1312g9750A557K0048m83h7855J0410A41879d7667I2908a59422N0686A3386a16190
$$ -79750 1557 21605 21122 -87855 -77445 141879 -47667 92908 -159422 -108736 13386 -116190
1299h9671l1803a8435p2767c7515H644a03728b8109D8141i586D3459j0066d953
$$ -89671 -121474 -18435 -91202 -37515 8644 -103728 -28109 48141 -9586 43459 33393 -4953
1286g0523O00A1740b2437l7295b5014k2244q762E4101b3971B2455a784A25174
$$ -70523 -69923 11740 -22437 -59732 -25014 -47258 -56020 54101 -23971 22455 -1784 125174
1273a3581A9732d0786G6237l3419A9700f6156j26322c0803m4262B6203p279M8855
$$ -13581 19732 -40786 76237 42818 19700 -66156 -192478 -30803 -75065 26203 18924 67779
1261F7779e5434H165N9965b1158A0654R6339C5832e7554A11103C8143g755n7596
$$ 67779 -55434 8165 68130 -21158 10654 106993 35832 -57554 111103 38143 -7755 -65351
1249f5351B9953M1586B9211K3663b6146r6121A086d1631d280j39428F0209b5163
$$ -65351 29953 71539 29211 52874 -26146 -122267 1086 -41631 -4280 -143708 60209 -25163
1236b2887o9366b9007m6028C1410d7717A74463a7359o9098K2068G3631M7758b2986
$$ -22887 -92253 -29007 -75035 31410 -47717 174463 -17359 -86457 -64389 73631 121389 -22986
1223H7006C5146A0729N1809O054E27M5485c9973n9056H9098a01334d1067A1680
$$ 87006 35146 10729 62538 68592 527 46012 -39973 -99029 89098 -101334 -41067 11680
1210D8714J19981p8382g9289G788e6015H5881a5050j42457d0680A30812a19882
$$ 48714 168695 90313 -79289 7788 -56015 85881 -15050 -157507 -40680 130812 -119882
1198A5971F858N2218b207G8259e2804C1623a6737G1964A3244c717H56a17598B0335
$$ 15971 6858 59076 -2207 78259 -52804 31623 -16737 71964 13244 -3717 856 -117598 20335
1184A20853a9120i559j2763A4657K4791J9097e1015P947a8824o0655A13341E5281
$$ 120853 -19120 -9559 -22322 14657 39448 58545 -51015 -43068 -18824 -79479 113341 55281
1171e7582A9474a2886c28C9715I435i263j94076I2791l540a1819l7403r3537P0875
$$ -57582 19474 -12886 -328 39715 9435 -9263 -203339 92791 89251 -11819 -49222 -142759 -71884
1158g1884a3252m896j2693a0898A600R716i8274b50I204R8904A9427J0235h4004
$$ -71884 -13252 -18148 -30841 -10898 1600 11316 -98274 -250 9204 108108 19427 29662 -84004
1144f330D9348h2410Q113J8057j1865q062D1017a04633c5886j320a5466H2082
$$ -6330 49348 -82410 -74297 -56240 -68105 -76167 41017 -104633 -35886 -37206 -15466 82082
1131C2837A341h7825a7555G192Q607b7030A7960K580J10923h2226f007j1050j2208
$$ 32837 1341 -87825 -17555 7192 15799 -27030 17960 20540 131463 -82226 -6007 -17057 -29265
1118b9265b320k9256J0800A827b4318F6693l1656f219A55493i6360b0287F562
$$ -29265 -2320 -31576 -20776 1827 -24318 66693 35037 -6219 155493 -96360 -20287 6562
1105a5930l7423B0516a01375B1638h4637A07211i553m4731m0032n6363a5561k0054
$$ -15930 -53353 20516 -101375 21638 -84637 107211 -9553 -54284 -94316 -150679 -15561 -35615
1093c5615E5182g0562E2325f2401G6766k9460h0949d0267A23138a30026H3504
$$ -35615 55182 -70562 52325 -62401 76766 47306 -80949 -40267 123138 -130026 83504
1081A8766L8926a9251L124m0819O284A6458N6690g6883E5453e6278B2727h2910
$$ 18766 57692 -19251 -16127 -56946 -50662 16458 73148 -76883 55453 -56278 22727 -82910
1068B2107j0049b4064j9009m3464b2153m9652J7509A0780M96Q9173A5361M6859
$$ 22107 12058 -24064 -43073 -86537 -22153 -71805 -54296 10780 11276 100449 15361 62220
1056F2220c6954k8999b9712e805A65634e8594A3813R8771C966O4981A5254J6297
$$ 62220 -36954 -65953 -29712 -5805 165634 -58594 13813 112584 3966 68947 15254 31551
1044C1551a09473G619a3078q3358K8154A8760J1085g3079E1327J2250k884P7868
$$ 31551 -109473 7619 -13078 -96436 -68282 18760 29845 -73079 51327 63577 60693 138561
1032A38561B9728K0681k0118n912J9757k0813M1531d5565C9414c7273H8289a4827
$$ 138561 29728 50409 30291 24379 44136 23323 64854 -45565 39414 -37273 88289 -14827
1019a0603A49298c0407p1562I6348b946F9724j822c2215m7964K0282j10599e9808
$$ -10603 149298 -30407 -101969 96348 -2946 69724 67902 -32215 -80179 -59897 -170496 -59808
1006A1365a30511A4402J7913Q259j1440A2899a03608I56K3798J6385P4802a27584
$$ 11365 -130511 14402 32315 40574 29134 12899 -103608 956 24754 41139 115941 -127584
993A40557A9669a047H829M0575A3715a5136l7653b2465O826A97186b7008B5799
$$ 140557 19669 -1047 8829 49404 13715 -15136 -52789 -22465 -15639 197186 -27008 25799
980a4050j60881e7344a9963F1221O9270n5429C5418J12880e544m3349l7120E6525
$$ -14050 -174931 -57344 -19963 61221 130491 75062 35418 148298 -5544 -48893 -86013 56525
967E5398c435j49268d6449C0760c5569F4313d6342p8502I9337g1273r7013B5415
$$ 55398 -3435 -152703 -46449 30760 -35569 64313 -46342 -124844 99337 -71273 -168286 25415
954D1108h1103C4358a35138e9827b6049A0409g2917O241H0017M4608D808a09207
$$ 41108 -81103 34358 -135138 -59827 -26049 10409 -72917 -66676 80017 124625 4808 -109207
941a745A0499h7710A19254b3796F0920a0743j7997l9350a9165B7854a8776B3212
$$ -1745 10499 -87710 119254 -23796 60920 -10743 -28740 -68090 -19165 27854 -18776 23212
928f6680B8597D349b1119h493H7875C3831b7151J3328A988K0844M5269d7434l5668
$$ -66680 28597 4349 -21119 -8493 87875 33831 -27151 -13823 1988 22832 68101 -47434 -83102
915h3102E0513L4554O171a4167G2448k377l0964b6256A2278d7084E4541Q0730
$$ -83102 50513 85067 91238 -14167 72448 70071 39107 -26256 12278 -47084 54541 135271
903A35271j6907A0979a3194j49722F7532e9804C5824J4953a79456A2309J411e5015
$$ 135271 118364 10979 -13194 -162916 67532 -59804 35824 50777 -179456 12309 13720 -55015
890A9855M2684f6176i675I7621A7607a84721B311b2004d361I7171b7503J2067
$$ 19855 62539 -66176 -9675 97621 17607 -184721 2311 -22004 -4361 97171 -27503 -15436
878a5436B1261P5414c2955F8017c2701D8053B1706l617e5821b7553m5721R81I057
$$ -15436 21261 96675 -32955 68017 -32701 48053 21706 18089 -55821 -27553 -73274 -72293 9057
864f6930D9084c219B0453a8328C8554M6323a00108A03057n0233k1165J1646j2151
$$ -66930 49084 -3219 20453 -18328 38554 84877 -100108 103057 52824 31659 43305 31154
852C1154i7526a8701n1680J0303B7008j0949N6306C4551A2113b899C0061h1556
$$ 31154 -97526 -18701 -70381 -60078 27008 16059 72365 34551 12113 -2899 30061 -81556
839G5143B3424C703d7598G8797A9633L6753L4971b5147e955C0168c6561j4532
$$ 75143 23424 3703 -47598 78797 19633 56386 91357 -25147 -5955 30168 -36561 -51093
827e1093p8664D9032j4021d0613n7655A41762G355J4011J22985g1614A02140e4872
$$ -51093 -129757 49032 35011 -40613 -98268 141762 7355 21366 144351 -71614 102140 -54872
814e1236D591J0162O3508E516J801Q0680a2963m3032J8439A87488g9476L0774
$$ -51236 4591 14753 78261 5516 7317 87997 -12963 -55995 -37556 187488 -79476 -48702
802d8702a2671j898D1145A5602a3227l5222F334N7402h4451J8038C2684N0929
$$ -48702 -12671 -14569 41145 15602 -13227 -48449 6334 63736 -84451 -66413 32684 83613
790H3613b5547J337p7171a920q2165b304l4900E3675c9825G1768l5603I208f0674
$$ 83613 -25547 -24210 -101381 -1920 -84085 -2304 -37204 53675 -39825 71768 36165 9208 -60674
776C4898j707L8799j2724a11883e891E1934p27B3351N1084A0512H51a073E0799
$$ 34898 33191 71990 59266 -111883 -5891 51934 51207 23351 74435 10512 851 -1073 50799
762A07267B1069r946i806G8035c2960B8263M5963a0091k9790F148b5442F3194
$$ 107267 21069 11123 -9806 78035 -32960 28263 74226 -10091 -39881 6148 -25442 63194
749f9948K4902b0377q5072C3510O7819D7836b0629k5681b2149n2885a4316H923
$$ -69948 -45046 -20377 -105449 33510 101329 47836 -20629 -46310 -22149 -75034 -14316 8923
736F3289j1066b1199A04494A9700a03249J9428b0402i805l9849n8940a6334o9374
$$ 63289 52223 -21199 104494 19700 -103249 -83821 -20402 -9805 -49654 -108594 -16334 -85708
724h5708D7362a119I8618D1285f6318A33129h8506a6738n6899J3455B6693K9398
$$ -85708 47362 -1119 98618 41285 -66318 133129 -88506 -16738 -73637 -60182 26693 56091
712E6091O8400B0380c5378B7659L3695B688i8526B6271d3461H2806b9096J1372
$$ 56091 124491 20380 -35378 27659 61354 2688 -98526 26271 -43461 82806 -29096 -17724
700a7724B5286a61306c5342p881C2246O4849C0156Q4687e1255f464G2671a6144
$$ -17724 25286 -161306 -35342 -43223 32246 97095 30156 114843 -51255 -6464 72671 -16144
687B4574J344d979n5821A2541Q6589a4046A31143A9568M6002F061J37239D4651
$$ 24574 25918 -4979 -60800 12541 99130 -14046 131143 19568 65570 6061 143300 44651
674c7692E006d064I73K9502J9732d2705G0529a6825F8685b8261A73354A9994J173
$$ -37692 5006 -4064 973 30475 50207 -42705 70529 -16825 68685 -28261 173354 19994 21167
661B1167K9349b2354B6635L9748a4081m9480f954D9555B2061K421J2219C539J2628
$$ 21167 50516 -22354 26635 66383 -14081 -63561 -6954 49555 22061 24482 36701 3539 16167
648A6167a1599j19362B6902c7520n3207M2226H8737e8046C7104i1389m6487E307
$$ 16167 -11599 -130961 26902 -37520 -90727 -48501 88737 -58046 37104 -91389 -137876 5307
635D332K7731e0907E1974B4489J3440e2070D9480h4621B6722K9568k6426o658
$$ 4332 32063 -50907 51974 24489 37929 -52070 49480 -84621 26722 56290 29864 23206
623B3206h557o2563C2145Q7976m4935C4375J50846d5848I3238j0703G354O567
$$ 23206 -8557 -71120 32145 120121 75186 34375 185221 -45848 93238 82535 7354 13921
611A3921J30514G439M4376a8433G6909K018d7363H860e6710L590A9449f2306K5892
$$ 13921 144435 7439 51815 -18433 76909 78927 -47363 8860 -56710 -53120 19449 -62306 -36414
598c6414A8400J9658d2332a4676A8551a21417a9914G4153b5182J1767B2949B336
$$ -36414 18400 38058 -42332 -14676 18551 -121417 -19914 74153 -25182 -13415 22949 2336
585f0889j2547H9308a7443r35C3473K2224e8362i401D6158j5647a1487A8283b1190
$$ -60889 -73436 89308 -17443 -18378 33473 55697 -58362 -9401 46158 30511 -11487 18283 -21190
571H5105l5052e4767k626E5097e7985r7005D4199B1027R3567D3065L0472G191
$$ 85105 50053 -54767 -57393 55097 -57985 -154990 44199 21027 114594 43065 73537 7191
558A0554g2390C8226L0525f7395F169Q1286a81421Q5654A01234k7794j6961g9305
$$ 10554 -72390 38226 68751 -67395 6169 87455 -181421 -95767 101234 73440 56479 -79305
545A33953D9904j01e8536a8734j3995F3843d7721G1861k5665Q5691j3489B4929
$$ 133953 49904 49803 -58536 -18734 -32729 63843 -47721 71861 46196 131887 118398 24929
532d5072D8022a4157H3465j7336K6322o714i0358a2132A29814D6795h2341B6445
$$ -45072 48022 -14157 83465 66129 92451 85737 -90358 -12132 129814 46795 -82341 26445
519a36426e3292C768b45A34432E8556I31K3729R5466D4425r842c5690R954E0357
$$ -136426 -53292 3768 -245 134432 58556 931 24660 120126 44425 34583 -35690 -25736 50357
505g3914E6065L2347d9710A22345B1594K2454R144C190c8267B5523c4175n0906
$$ -73914 56065 88412 -49710 122345 21594 44048 53192 3190 -38267 25523 -34175 -85081
493h5081G2282e5998I738A536K4645N3073a9482l7237o0794A10498B699c145A09142
$$ -85081 72282 -55998 9738 1536 26181 79254 -19482 -56719 -117513 110498 2699 -3145 109142
479a18024A06915a21377I9688m9210P831a38027b2340I127K6448K8374d0241j8911
$$ -118024 106915 -121377 99688 50478 58309 -138027 -22340 9127 35575 63949 -40241 -59152
467e9152H636R6563i2311c5569B7643b8740L960A1185a08367c0532H3164e7824
$$ -59152 8636 105199 -92311 -35569 27643 -28740 -24780 11185 -108367 -30532 83164 -57824
454F899N0679j9955d9577E4023a439o4059F1695L2070h7395N349j7979e363H4711
$$ 6899 57578 37623 -49577 54023 -1439 -65498 61695 93765 -87395 -82046 -100025 -5363 84711
440e0315b2840B3744b7766p6260L715a3824E8540d8221A16468A1588a05858c3037
$$ -50315 -22840 23744 -27766 -104026 -100311 -13824 58540 -48221 116468 11588 -105858 -33037
427b1173A03185c3875A5201J9479A5892J3326R7767B3854N888R5762e5875K4416
$$ -21173 103185 -33875 15201 34680 15892 29218 126985 23854 29742 125504 -55875 -31459
415c1459o9605b0493F8557j6907G147a0163B3487c8816E2268c5042E888K1701
$$ -31459 -101064 -20493 68557 51650 7147 -10163 23487 -38816 52268 -35042 5888 27589
403B7589d860p275K822o8058A5136L3031A7512a2122A00376m1609a50255P246
$$ 27589 -4860 -12135 -9313 -77371 15136 48167 17512 -12122 100376 58767 -150255 -143009
391a43009i892B3689J3879J8889r807b1829B1656J1976a1617E5698r37k4447J79036
$$ -143009 -9892 23689 37568 56457 46650 -21829 21656 33632 -11617 55698 54761 30314 209350
378B09350A5162J8935M302d4955A34239C559J48651a7204A2018J0602e7581G2137
$$ 209350 15162 34097 38399 -44955 134239 3559 152210 -17204 12018 22620 -57581 72137
365a1208l4724o900A8541N297J6417i1803E6025B349N0845j8426N995A4527f385
$$ -11208 -45932 -52832 18541 23838 40255 -91803 56025 2349 53194 34768 40763 14527 -6385
351I240a1457d675E8950e7773B0896o707M5739b7674H889B282J9522i9855b6814
$$ 9240 -11457 -4675 58950 -57773 20896 14189 59928 -27674 8889 2282 21804 -99855 -26814
337D2682N71a8859E8513m993A8010J49899A6274N3101A0421K4506r725K2841O1863
$$ 42682 43253 -18859 58513 53520 18010 167909 16274 69375 10421 34927 25202 48043 109906
324A09906K2423F664a4350A7197d8463l6512H5654O8330i1624E2625A5739Q7780
$$ 109906 132329 6664 -14350 17197 -48463 -84975 85654 153984 -91624 52625 15739 103519
312A03519d6563H0403l2453N691L8338c7387D1828A6933J1619R627c7999F3594
$$ 103519 -46563 80403 47950 53641 91979 -37387 41828 16933 28552 38179 -37999 63594
299B2262e6394a1418n4975K6750l5459D6771a1914c250A1165E119M5013f565j39920
$$ 22262 -56394 -11418 -66393 -39643 -75102 46771 -11914 -3250 11165 5119 50132 -6565 -146485
286a46485J8168F2978B6604b7387A13987a00394C7327M5670g9691a2121A04397
$$ -146485 -128317 62978 26604 -27387 113987 -100394 37327 82997 -79691 -12121 104397
274F7681k7259L7897b800k0261F441N3114G587P5224C1350i7546A02223C3893
$$ 67681 40422 78319 -2800 -23061 6441 59555 7587 82811 31350 -97546 102223 33893
261i313a416k4495F7411h013m3908k1223e632b667j9499j835l3517C0681g121
$$ -9313 -1416 -25911 67411 -8013 -51921 -73144 -5632 -2667 -22166 -24001 -57518 30681 -7121
247F2931f433A34170A0466P8684e0873E7821e3956a1691G8278B4764P7608R23
$$ 62931 -6433 134170 10466 89150 -50873 57821 -53956 -11691 78278 24764 102372 103295
235A03295M4055F1307h5059B3670p235J0897b5907B6838c3568l061C0293M5428
$$ 103295 147350 61307 -85059 23670 16435 27332 -25907 26838 -33568 -36629 30293 75721
223G5721k3614a4391B5639a56072b3079I0317A7552Q993a28747C4006j1002A0861
$$ 75721 52107 -14391 25639 -156072 -23079 90317 17552 26545 -128747 34006 23004 10861
210A04628g1306b5590C9264h3790A16866E7810O0994A9297d394A14555A5938N0993
$$ 104628 -71306 -25590 39264 -83790 116866 57810 118804 19297 -4394 114555 15938 66931
198F6931d8274j0598F9874j901f9069B6403b8984E2257f4418L451H3643O930C3730
$$ 66931 -48274 -58872 69874 67973 -69069 26403 -28984 52257 -64418 -60967 83643 90573 33730
184B6287f5250Q778B2901K0878b8496C7424M364a08348A156i4210I5003g711F7099
$$ 26287 -65250 -56472 22901 43779 -28496 37424 41788 -108348 1156 -94210 95003 -7711 67099
170b9059j25542e9099f894k4409R285f487q103I5616a5365p1845K6482A8656n957
$$ -29059 -154601 -59099 -6894 -31303 -22018 -6487 -14590 95616 -15365 -87210 -60728 18656 12699
157A2699L5170L9895L9303c5832G6819C3224P2111D8257Q5947b1577D9315L8010
$$ 12699 47869 87764 127067 -35832 76819 33224 105335 48257 134204 -21577 49315 87325
145H7325l5993a82o5394A1064e145A02553A854P4992c6816D8521L4363d4374j00260
$$ 87325 51332 -182 -65576 11064 -5145 102553 1854 76846 -36816 48521 82884 -44374 -144634
132a44634C1543a0802E8494R194E427a677A6956J06285h456n5615B311e5873J7590
$$ -144634 31543 -10802 58494 67688 5427 -1677 16956 123241 -8456 -64071 2311 -55873 -38283
119c8283A3866D974a22763B5524j402c2583D2952R7734c2869o4830G0735I95d8083
$$ -38283 13866 4974 -122763 25524 24122 -32583 42952 140686 -32869 -97699 70735 995 -48083
105d7987A0898D693b5836I5541a0687n0785m4046c673C5782d4289F7084e2022
$$ -47987 10898 4693 -25836 95541 -10687 -61472 -105518 -3673 35782 -44289 67084 -52022
92F8478H789f5450C4685M3122a19852N3822k9550f763j4944I3479B5150D899L8611
$$ 68478 8789 -65450 34685 77807 -119852 -66030 -95580 -6763 -21707 93479 25150 4899 43510
79D3510f392j6616D4383P412C668f9104o0563E8033f8624r764g244o4797J5150
$$ 43510 -6392 -23008 44383 51795 3668 -69104 -129667 58033 -68624 -78388 -7244 -72041 -56891
66e6891G4035d0514P576n5633a1209j7479A37983B4654K143O940A4188K686M29
$$ -56891 74035 -40514 -32938 -88571 -11209 -28688 137983 24654 26797 33737 14188 16874 17303
53A7303c6557a2157I0695d0677L265l5932a4789O559F0073b0554D56N1679e1994
$$ 17303 -36557 -12157 90695 -40677 -37412 -73344 -14789 -8230 60073 -20554 456 52135 -51994
39b7357A8435a8559e444A06706a4334l7933J2669j8193b278n0662a3789a124j9005
$$ -27357 18435 -18559 -5444 106706 -14334 -52267 -39598 -57791 -2278 -52940 -13789 -1124 -20129
26b0129k0894B7148e0417E95a835n1286B2535a9039e696m6476a7635l2361k6159
$$ -20129 -41023 27148 -50417 595 -1835 -53121 22535 -19039 -5696 -52172 -17635 -49996 -76155
13g6155B1500K6153e4174K1371J5308I854a6816K74m0979J3890k953p2256C1175
$$ -76155 21500 47653 -54174 -32803 -17495 9854 -16816 -16542 -57521 -43631 -46584 -118840 31175
$$ Imaginary data points
##PAGE= N=2
##DATA TABLE= (X++(I..I)), XYDATA
16383g7160A5764a42110J7919K1741J2056k0077d8235j5460b8981k3170C756a8507
$$ -77160 15764 -142110 -124191 -102450 -90394 -110471 -48235 -63695 -28981 -52151 3756 -18507
16370d2061J5159j922C1248A1783g097a412j2488E2656i57p6937e201D9848b3783
$$ -42061 -26902 -28824 31248 11783 -7097 -1412 -13900 52656 -957 -77894 -5201 49848 -23783
16356b6350C2453J860j1236g4412F1619K6267a4997E8255H029J05484j1054m5290
$$ -26350 32453 34313 23077 -74412 61619 87886 -14997 58255 8029 113513 102459 57169
16344E7169O2896n6628j0276J06622M6738j3947H0827L3208K3985M5123q8977
$$ 57169 120065 63437 53161 159783 206521 192574 80827 114035 138020 183143 94166
16333I4166M156A7743J31706Q686L5912K846E3418J27672J10181j08510n2525
$$ 94166 98322 17743 149449 158135 194047 196893 53418 181090 291271 182761 130236
16322A30236J2814L7192j2331P9635r0804L6012j1437O8585J5907j02052J16793
$$ 130236 143050 180242 167911 247546 156742 192754 181317 249902 265809 163757 280550
16311B80550M3564n0067m9996Q3064m1160j1368L8866J0692O645j10744P5429
$$ 280550 324114 274047 224051 307115 265955 254587 293453 304145 310790 200046 275475
16300B75475O61L2043j37276N8103J25924j00725L8133J8361q9202O4411L3032
$$ 275475 276136 308179 170903 229006 354930 254205 292338 310699 221497 285908 318940
16289C18940K302R8738j3886r8518L2272q574J8260j4080o7284J02692l7568K816
$$ 318940 321242 419980 406094 307576 339848 331274 349534 335454 268170 370862 333294 336110
16277C36110r4153J11743r967J25849j20688M7247P0214l5655p0917O2378L6603
$$ 336110 241957 353700 343733 469582 348894 396141 466355 430700 359783 422161 458764
16266D58764n5091j05080Q8967J46328m2871j7474j54095O7907j39N1771P0463
$$ 458764 403673 298593 387560 533888 491017 473543 319448 387355 387216 438987 509450
16255E09450j17588l1682R6627O799M4550n9713K9868P0363j78044J26513m2828
$$ 509450 391862 360180 456807 463606 508156 448443 478311 548674 370630 497143 454315
16244D54315N2723o0371k2486J29655j85906J65997p2781O4151k0168m9012J2511
$$ 454315 507038 446667 424181 553836 367930 533927 461146 525297 505129 456117 468628
16233D68628j8417J12338j41070R9851j19938J7118J05418j4256J07751j12783
$$ 468628 450211 562549 421479 521330 401392 418510 523928 509672 617423 504640
16223E04640L1834p422M4862j20150O2842r8135L6270O5933l5386P8988r011q2396
$$ 504640 536474 529052 573914 453764 516606 418471 454741 520674 485288 564276 555265 472869
16211D72869J22497j1871n7797J0636p0208J21291m2451J1126j19269J84300j45834
$$ 472869 595366 583495 525698 536334 466126 587417 544966 556092 436823 621123 475289
16200D75289Q201M3657O6169j5365j08908P979K6681K07219j54988M9743K442
$$ 475289 483490 527147 593316 577951 469043 477022 503703 710922 555934 605677 608119
16189F08119j9319l4744J40973j73905N0484q49M9435l528K2912m0384L5129j02772
$$ 608119 588800 554056 695029 521124 571608 570759 620194 616666 639578 599194 634323 531551
16177E31551J7671k7876O0585l085m6067k038L4228O3408j35659O6912L3621q8072
$$ 531551 549222 521346 581931 578846 532779 530741 564969 628377 492718 559630 593251 505179
16165E05179J21187J31414j25407K5616j32275m6651J39732M1376j28217M2612
$$ 505179 626366 757780 632373 657989 525714 479063 618795 660171 531954 574566
16155E74566j02459M9300J80563m2229l8677O9186k8052j22670N8250O1403j00011
$$ 574566 472107 521407 701970 659741 621064 690250 662198 539528 597778 659181 559170
16144E59170Q2995q5352Q9922j06173J79851j41579K2727q6844J37176l5544m9479
$$ 559170 642165 556813 646735 540562 720413 578834 601561 514717 651893 616349 566870
16133E66870Q3243j9601J41015j04696j13481M5918n4383R2218j3691m9825j0055
$$ 566870 650113 630512 771527 666831 553350 599268 544885 637103 623412 573587 563532
16122E63532M4064l922n1992J88772j03566o3539L924Q4210m8605m8781M0523
$$ 563532 607596 603674 551682 740454 636888 573349 577273 661483 612878 564097 604620
$$ [...]
##END NTUPLES=NMR SPECTRUM
##END=
