##TITLE=XTC-1706e_1
##JCAMPDX= 6.0         $$ Bruker NMR JCAMP-DX V2.0
##DATA TYPE= nD NMR SPECTRUM
##DATA CLASS= NTUPLES
##NUM DIM= 2
##ORIGIN= BRUKER
##OWNER= patiny
$$ 1.79 TOPSPIN		Version 3.0
$$ 2012-05-20 14:32:04.947 +0200  patiny@icmbsg005
$$ Compression mode = diff/dup
##.OBSERVE FREQUENCY= 400.13188181139
##.OBSERVE NUCLEUS= ^1H
##.ACQUISITION MODE= SIMULTANEOUS (DQD)
##.ACQUISITION SCHEME= Echo-Antiecho
##.AVERAGES= 2
##.DIGITISER RES= 23
##SPECTROMETER/DATA SYSTEM= spect
##.PULSE SEQUENCE= hsqcetgpsisp2.2
##.SOLVENT NAME= D2O
##.SHIFT REFERENCE= INTERNAL, D2O, 1, 11.697
##AUDIT TRAIL= $$ (NUMBER, WHEN, WHO, WHERE, PROCESS, VERSION, WHAT)
$$ ##TITLE= Audit trail, TOPSPIN		Version 3.0
$$ ##JCAMPDX= 5.01
$$ ##ORIGIN= Bruker BioSpin GmbH
$$ ##OWNER= patiny
$$ $$ /opt/data/patiny/nmr/XTC-1706e_1/13/pdata/1/auditp.txt
$$ ##AUDIT TRAIL=  $$ (NUMBER, WHEN, WHO, WHERE, PROCESS, VERSION, WHAT)
(   1,<2012-05-20 14:32:03.897 +0200>,<patiny>,<icmbsg005>,<go>,<TOPSPIN 3.0>,
      <created by zg
	started at 2012-05-20 14:13:22.695 +0200,
	POWCHK enabled, PULCHK disabled,
       configuration hash MD5:
       77 C7 B7 C4 10 F4 BA 30 64 2E BB 52 82 F2 DA 41
       data hash MD5: 1K * 256
       BE 39 CD 21 17 15 C6 6E CF FD DD 37 7D 55 25 C3>)
(   2,<2012-05-20 14:32:03.998 +0200>,<patiny>,<icmbsg005>,<audit>,<TOPSPIN 3.0>,
      <user comment:
       ICON-NMR User ID: patiny
       data hash MD5: 1K * 256
       BE 39 CD 21 17 15 C6 6E CF FD DD 37 7D 55 25 C3>)
(   3,<2012-05-20 14:32:04.765 +0200>,<patiny>,<icmbsg005>,<proc2d>,<TOPSPIN 3.0>,
      <Start of raw data processing
       xfb same F2: SI = 1K WDW = 4 SSB = 2 FT_mod = 6 PKNL = 1 PHC0 = 0 PHC1 = 0 F1: SI = 1K ME_mod = 2 NCOEF = 32 WDW = 4 SSB = 2 FT_mod = 6
       data hash MD5: 1K * 1K
       00 3E CC 61 41 8B 0D 94 61 6E E7 01 29 3B 11 0F>)
(   4,<2012-05-20 14:32:04.849 +0200>,<patiny>,<icmbsg005>,<proc2d>,<TOPSPIN 3.0>,
      <abs2 F2: ABSG = 5 ABSF1 = 11.697 ABSF2 = -2.290992
       data hash MD5: 1K * 1K
       A8 27 2E 40 4E 1B E4 79 28 BC D3 3D DB 55 99 16>)
(   5,<2012-05-20 14:32:04.938 +0200>,<patiny>,<icmbsg005>,<proc2d>,<TOPSPIN 3.0>,
      <abs1 F1: ABSG = 5 ABSF1 = 179.9984 ABSF2 = -40.017
       data hash MD5: 1K * 1K
       C3 6B 59 A0 90 AA 0E 2A F9 B5 44 5B 38 68 80 FB>)
$$ ##END=
$$ 
$$ $$ hash MD5
$$ $$ 18 D1 80 8B 4E 56 7D 52 BC 3C 74 BE AD EB B0 A7
##$RELAX= 
##$RELAX= 
##$RELAX= 
##$RELAX= 
##$RELAX= 
##$RELAX= 
##$RELAX= 
##$RELAX= 
##$RELAX= 
##$RELAX= 
##$RELAX= 
$$ Bruker specific parameters
$$ --------------------------
##$DATPATH= </opt/data/patiny/nmr>
##$EXPNO= 13
##$NAME= <XTC-1706e_1>
##$PROCNO= 1
##$ACQT0= 0
##$AMP= (0..31)
100 100 100 100 100 100 100 100 100 100 100 100 100 100 100 100 100 100
100 100 100 100 100 100 100 100 100 100 100 100 100 100
##$ANAVPT= -1
##$AQSEQ= 0
##$AQ_mod= 3
##$AUNM= <au_zg>
##$AUTOPOS= <43 >
##$BF1= 400.13
##$BF2= 100.612769
##$BF3= 400.13
##$BF4= 400.13
##$BF5= 400.13
##$BF6= 400.13
##$BF7= 400.13
##$BF8= 400.13
$$ [...]
##$REVERSE= no
##$SF= 400.13
##$SI= 1024
##$SIGF1= 11.697
##$SIGF2= -2.290992
##$SINO= 0
##$SIOLD= 1024
##$SPECTYP= <>
##$SREGLST= <13C.H2O+D2O>
##$SSB= 2
##$STSI= 1024
##$STSR= 0
##$SW_p= 5597.01492537312
##$SYMM= 0
##$S_DEV= 848479
##$TDeff= 1024
##$TDoff= 0
##$TI= <>
##$TILT= no
##$TM1= 0
##$TM2= 0
##$TOPLEV= 100
##$USERP1= <>
##$USERP2= <>
##$USERP3= <>
##$USERP4= <>
##$USERP5= <>
##$WDW= 4
##$XDIM= 1024
##$YMAX_p= 92224003
##$YMIN_p= -471598097
##$CURPLOT= <Cups-PDF>
##$CURPRIN= <$Cups-PDF>
##$DFORMAT= <normdp>
##$LAYOUT= <+/2D_inv.xwp>
##$LFORMAT= <normlp>
##$PFORMAT= <normpl>
$$ Bruker specific parameters for F1
$$ ---------------------------------
##$ACQT0= 0
##$BF1= 100.612769
##$FnMODE= 6
##$NUC1= <13C>
##$O1= 7041.95747781
##$SFO1= 100.619810957478
##$SW= 220
##$SW_h= 22136.3584106452
##$TD= 256
##$ABSF1= 179.9984
##$ABSF2= -40.017
##$ABSG= 5
##$ABSL= 0
##$ALPHA= 0
##$AQORDER= 0
##$ASSFAC= 0
##$ASSFACI= 0
##$ASSFACX= 0
##$ASSWID= 0
##$AUNMP= <>
##$AXLEFT= 0
##$AXNAME= <F1>
##$AXNUC= <13C>
##$AXRIGHT= 0
##$AXTYPE= 0
##$AXUNIT= <>
##$AZFE= 0.1
##$AZFW= 0.5
##$BCFW= 0
##$BC_mod= 0
##$BYTORDP= 0
##$COROFFS= 0
##$CY= -3
##$DATMOD= 1
##$DC= 0
##$DFILT= <>
##$DTYPP= 0
##$ERETIC= no
##$F1P= 0
##$F2P= 0
##$FCOR= 0.5
##$FTSIZE= 1024
##$FT_mod= 6
##$GAMMA= 0
##$GB= 0
##$INTBC= 1
##$INTSCL= 1
##$ISEN= 128
##$LB= 0
##$LEV0= 0
##$LPBIN= 512
##$MAXI= 10000
##$MC2= 5
##$MEAN= 0
##$ME_mod= 2
##$MI= 1
##$NCOEF= 32
##$NC_proc= -10
##$NLEV= 6
##$NOISF1= 0
##$NOISF2= 0
##$NSP= 0
##$NTH_PI= 0
##$NZP= 0
##$OFFSET= 179.9984
##$PC= 4
##$PHC0= 0
##$PHC1= 0
##$PH_mod= 0
##$PKNL= no
##$PPARMOD= 1
##$PPDIAG= 0
##$PPIPTYP= 0
##$PPMPNUM= 100
##$PPRESOL= 1
##$PSCAL= 1
##$PSIGN= 0
##$PYNMP= <>
##$REVERSE= no
##$SF= 100.612769
##$SI= 1024
##$SIGF1= 179.9984
##$SIGF2= -40.017
##$SINO= 0
##$SIOLD= 1024
##$SPECTYP= <>
##$SREGLST= <>
##$SSB= 2
##$STSI= 1024
##$STSR= 0
##$SW_p= 22136.3584106452
##$SYMM= 0
##$S_DEV= 848479
##$TDeff= 512
##$TDoff= 0
##$TI= <>
##$TILT= no
##$TM1= 0
##$TM2= 0
##$TOPLEV= 0
##$USERP1= <>
##$USERP2= <>
##$USERP3= <>
##$USERP4= <>
##$USERP5= <>
##$WDW= 4
##$XDIM= 128
##$YMAX_p= 92224003
##$YMIN_p= -471598097
$$ End of Bruker specific parameters
$$ ---------------------------------
##NTUPLES= nD NMR SPECTRUM
##VAR_NAME=  FREQUENCY1,    FREQUENCY2,      SPECTRUM
##SYMBOL=    F1,            F2,              Y
##.NUCLEUS=  13C,           1H
##VAR_TYPE=  INDEPENDENT,   INDEPENDENT,     DEPENDENT
##VAR_FORM=  AFFN,          AFFN,            ASDF
##VAR_DIM=   1024,          1024,            1024
##UNITS=     HZ,            HZ,              ARBITRARY UNITS
##FACTOR=    21.6175375103957, 5.46583488805969, 1
##FIRST=     18110.137220953, 5591.54909048506, -453541
##LAST=      -4004.60365218182, 0,           -132646
##MIN=       -4004.60365218182, 0,           -471598097
##MAX=       18110.137220953, 5591.54909048506, 92224003
##PAGE= F1=18110.13722095
##FIRST=     18110.137220953, 5591.54909048506, -453541
##DATA TABLE= (F2++(Y..Y)), PROFILE
$$ [...]
##PAGE= F1=3431.829251394
##FIRST=     18110.137220953, 5591.54909048506, -1287533
##DATA TABLE= (F2++(Y..Y)), PROFILE
307b90338l59600A48740M20352f58583j280858p6981N16251e47905a06422k48005
$$ -290338 -649938 148740 569092 -658583 -1939441 -2016422 -1500171 -547905 -106422 -354427
297c54427l0806H5709Q3797p2155O13590j44214c45138g9374D25313b94049j003530
$$ -354427 -385233 85709 169506 97351 710941 566727 -345138 -79374 425313 -294049 -1297579
286a297579P1205A93958O63213A40571b11450D49710M36338l67369b23443m56781
$$ -1297579 -1226374 193958 857171 140571 -211450 449710 886048 518679 -223443 -680224
276f80224o2995a94535E13199A27629a348767l94275c56023I95949M9983l89798
$$ -680224 -743219 -194535 513199 127629 -1348767 -1743042 -356023 995949 1045932 656134
266F56134M0212L4825k43476F8323c98625k0134A32964L53143b63486n60315c93646
$$ 656134 696346 731171 487695 68323 -398625 -418759 132964 486107 -263486 -823801 -393646
254I0329L44745A82088C1629a76715l71667a12405D08794L69389L514j13275K55834
$$ 90329 435074 182088 31629 -176715 -548382 -112405 408794 778183 781697 668422 924256
243I24256l30768a11235o80065j85617c34359E3081c65933l76023j15545o55865
$$ 924256 593488 -111235 -791300 -976917 -334359 53081 -365933 -741956 -857501 -1513366
233a513366k07738J58423J43052N90779I9723J68900c2901o89139l96195b02301
$$ -1513366 -1721104 -1562681 -1419629 -828850 99723 268623 -32901 -722040 -1118235 -202301
222C95671N6036r5013f45879j286120n90885l45191N27122h80602L59134p09011
$$ 395671 451707 356694 -645879 -1931999 -2522884 -2868075 -2340953 -880602 -521468 -1230479
212a230479J00218d00212m48594l89662M95192K80362J78046A065133N41064C27294
$$ -1230479 -1130261 -400212 -848806 -1238468 -743276 -462914 -284868 1065133 1606197 327294
201c20030B30963L23467M51119M81936J540l15072D47968A68578K06510d10983
$$ -320030 230963 554430 1005549 1487485 1489025 1173953 447968 168578 375088 -410983
190a286295J46164N62129K76073A76144O41498j00303B36972a15771C06111J119439
$$ -1286295 -1140131 -578002 -301929 176144 817642 717339 236972 -115771 306111 1425550
180A425550l85997b04746j09090N0914o89953d00901A432133L26743C75524c36348
$$ 1425550 1039553 -204746 -313836 -262922 -952875 -400901 1432133 1758876 375524 -336348
169B54065L28295B46742f83930j525550r43794J314740h0314D63566o0976K94390
$$ 254065 582360 246742 -683930 -2209480 -3153274 -1838534 -80314 463566 402590 696980
159F96980K47651A90572i51740k31841M5044P470Q3851Q2517d51811a4766j7970
$$ 696980 944631 190572 -951740 -1183581 -1138537 -1131067 -1047216 -964699 -451811 -14766 -32736
148c2736B05931J20520d42049l58260L63960a83744r5414L2073A56913M51627
$$ -32736 205931 326451 -442049 -800309 -436349 -183744 -279158 -247085 156913 608540
138F08540l8328J04646K68005k26830c5604l12360n57914m17988J25291L5125
$$ 608540 570212 674858 942863 716033 -35604 -347964 -905878 -1323866 -1198575 -1163450
128a163450p47997J47517f41183a02716n93961l15153d72866C10659R71099R7670
$$ -1163450 -1911447 -1763930 -641183 -102716 -696677 -1011830 -472866 310659 1281758 1379428
118A379428D05393a49992l46982m5502c5809G66777j69231h2122I8508A8479g88877
$$ 1379428 405393 -149992 -496974 -542476 -35809 766777 597546 -82122 98508 18479 -788877
106a332677K39105A3400R29320O70567N50337n10532f0900n62984C66855P71056
$$ -1332677 -1093572 13400 942720 1613287 2163624 1653092 -60900 -623884 366855 1137911
96A137911J34067A43977a128202J4163d28927c7233B64689J40372A20730d71921
$$ 1137911 1271978 143977 -1128202 -1114039 -428927 -37233 264689 405061 120730 -471921
85a86007I09641Q6967I1043a85746D15713Q32349L86331J27416l9752l01330o61342
$$ -186007 909641 996608 91043 -185746 415713 1248062 1634393 1761809 1722057 1420727 759385
74G59385l04185j33990b04115K7044C27754L3551P10290N69138o82897m56351
$$ 759385 455200 321210 -204115 -177071 327754 361305 1071595 1640733 957836 501485
64E01485L66654J78487j21909a53836p96398a66969H65558B58641c34298o8962
$$ 501485 868139 1046626 924717 -153836 -950234 -166969 865558 258641 -334298 -403260
54d03260j42076o82481j2194A79178J156020D44716b79013C87510K83419b33014
$$ -403260 -545336 -1227817 -1240011 179178 1335198 444716 -279013 387510 670929 -233014
43h27568l31j42881J53055B9664P41545B74956i28962m00765j39340l85262O22975
$$ -827568 -827899 -970780 -817725 29664 771209 274956 -928962 -1329727 -1469067 -1854329 -1231354
32a231354C49801J07058f5874l92215k07192a51937j50848r44324L68847I07133
$$ -1231354 349801 456859 -65874 -458089 -665281 -151937 -302785 -1247109 -878262 907133
21A141265b74276j224532l16132e03563A155494j71610D8464J72669Q59143J87546
$$ 1141265 -274276 -1498808 -1814940 -503563 1155494 983884 48464 221133 1080276 1267822
11A267822m45614A28327c22932j15760j56367J01294b6169C16794J39778O0177
$$ 1267822 822208 128327 -322932 -438692 -595059 -493765 -26169 316794 456572 516749
1E16749H8297
$$ 516749 88297
##PAGE= F1=3410.211713884
##FIRST=     18110.137220953, 5591.54909048506, -445477
##DATA TABLE= (F2++(Y..Y)), PROFILE
1023d45477K13618b6753k12327d2140E01446L18357j99549J63883C91685f84868
$$ -445477 -231859 -26753 -239080 -42140 501446 819803 620254 784137 391685 -684868
1012a238570d40610E98330j94090j89594M48848J60435j86389L02432J02711j0710
$$ -1238570 -440610 598330 404240 214646 663494 823929 637540 939972 1042683 1031973
1002A031973O61549K07848H80793c27697l24104f093F37514Q02K96878l75188
$$ 1031973 1693522 1901370 880793 -327697 -651801 -6093 637514 638316 935194 560006
992E60006a038710l09115e58383k35154k38647k20853l65202L07247c79341A58552
$$ 560006 -1038710 -1347825 -558383 -793537 -1032184 -1253037 -1618239 -1310992 -379341 158552
981B45362a93837h2157G58635M24925m70447g87135j603204K71775f11078H457
$$ 245362 -193837 -82157 758635 1183560 713113 -787135 -2390339 -2118564 -611078 8457
970h55593p35861L02561K26341k24316O8204e91293A36334n5790p904K52160J44856
$$ -855593 -1591454 -1288893 -1062552 -1286868 -1218664 -591293 136334 80544 72640 324800 469656
959D69656J70359J44234k11094B7947c17319r3076m29764n36891O0628f23653
$$ 469656 640015 784249 573155 27947 -317319 -410395 -840159 -1377050 -1316422 -623653
948e65713j28082a06260F71465L56126k47028A48318c96712K3995B86637A02550
$$ -565713 -693795 -106260 671465 1027591 780563 148318 -396712 -372717 286637 102550
937a139919k82163b61134h721j214533Q7082a76027l52744k01689A12108O01421
$$ -1139919 -1422082 -261134 -8721 -1223254 -1136172 -176027 -528771 -730460 112108 713529
927G13529M77826P18790j4330A98628a030983c23306B25533b24782A15481J170128
$$ 713529 1191355 1910145 1895815 198628 -1030983 -323306 225533 -224782 115481 1285609
917A285609M09054o29873E30510j21183K81719M01696D79129e72471o1587h4169
$$ 1285609 1694663 1064790 530510 409327 691046 1092742 479129 -572471 -634058 -84169
906D26523B10879c81795J70466h0419m38301j15679k2757p27266R5826e00306
$$ 426523 210879 -381795 -211329 -80419 -518720 -634399 -657156 -1384422 -1288596 -500306
895b41793B66169O65837M2525A13244g58048j40370r4422l36950L42228A08515
$$ -241793 266169 932006 974531 113244 -758048 -898418 -992840 -1329790 -987562 108515
884H06140l21647A67736K07672J62805K16843M53435m02859D7775f9194E37058
$$ 806140 484493 167736 375408 538213 755056 1208491 805632 47775 -69194 537058
873H73599M21064o2979B56502c77785J06025J23320L6253j89132c589A669520
$$ 873599 1294663 1231684 256502 -377785 -271760 -148440 -112187 -301319 -3589 1669520
862B534650j212000g2065j54054k63680j011090o43937N04530N41286L14638P388
$$ 2534650 1322650 -72065 -226119 -489799 -1500889 -2144826 -1640296 -1099010 -784372 -776984
852g76984l73061p65767N66514A22401N67200A46465J26870J29450f58115q81155
$$ -776984 -1150045 -1915812 -1349298 122401 689601 146465 273335 402785 -658115 -1539270
842a539270g60897a33516q4921D2428P90253L81680E31926e95168m21765L29939
$$ -1539270 -760897 -133516 -218437 42428 832681 1214361 531926 -595168 -1016933 -686994
832f86994C33052P62563M6957m196k95419b8331j074754q99957J74879g03208
$$ -686994 333052 1095615 1142572 1138376 842957 -28331 -1103085 -2003042 -1828163 -703208
821D91953M25980C75608E430M45199P09786J043461P09917n57851j147995C52178
$$ 491953 917933 375608 5430 450629 1160415 2203876 2913793 2355942 1207947 352178
810b88448k39896A73778L46161e10619m82140E1641O40723C22144b07894h023
$$ -288448 -528344 173778 519939 -510619 -992759 51641 692364 322144 -207894 -8023
799D42788K17125i5461r07252M66131I64520O43556j15357m78071m81432O22519
$$ 442788 659913 -95461 -1002713 -536582 964520 1608076 1492719 1014648 533216 1155735
789A155735M13711l47324L1436k96262B92101O46915O57616l75171l01683j01365
$$ 1155735 1569446 1222122 1253558 957296 292101 939016 1596632 1221461 919778 818413
779H18413l38784c35944j039183k18203c67203B42057e76405r8735A78996K65066
$$ 818413 479629 -335944 -1375127 -1593330 -367203 242057 -576405 -675140 178996 444062
769D44062K46567R5444g419o21099D2099O21760J04461C26848J75523L64266R1733
$$ 444062 690629 786073 -7419 -628518 42099 663859 768320 326848 502371 866637 958370
758I58370B10332c56218C53709K87652M3469J596982J002752j081533D07315a05655
$$ 958370 210332 -356218 353709 641361 684830 2281812 3284564 2203031 407315 -105655
747C55333c80637j366699J11066c80946C80927O6355b01742m21514b22512C03520
$$ 355333 -380637 -1747336 -1636270 -380946 380927 447282 -201742 -623256 -222512 303520
736D41322d03907q26050c95048A232534R19183k61298I32874c01039q08940J11198
$$ 441322 -403907 -1229957 -395048 1232534 2151717 1890419 932874 -301039 -1109979 -998781
726i98781L42827l7980p24724n52973M77679g03446B0097J29372a47130C27706
$$ -998781 -655954 -693934 -1418658 -1971631 -1493952 -703446 20097 149469 -147130 327706
715A061231j03356l99684F8635h2860C5990J68082M8827Q13754j895A93449k8941
$$ 1061231 957875 558191 68635 -82860 35990 204072 252899 1066653 1064758 193449 164508
704A64508K97942f12507j010690g61461E94597k89076b72826H05670Q24537H4795
$$ 164508 462450 -612507 -1623197 -761461 594597 305521 -272826 805670 1630207 84795
693a405066J49601M20087l77176j78202f54742G02541L48775d4763j512540Q0619
$$ -1405066 -1255465 -835378 -1212554 -1390756 -654742 702541 1051316 -44763 -1557303 -1476684
683a476684f6033D73580I4357d00021O0693m06907k36995d58735G33647O76788
$$ -1476684 -66033 473580 94357 -400021 -339328 -746235 -983230 -458735 733647 1410435
673A410435k98933C98260b44603p09942k68309M27898K21771j49227b20176A175840
$$ 1410435 1111502 398260 -244603 -954545 -1222854 -794956 -573185 -722412 -220176 1175840
662A616906p93685h4632n22391j36706e410A259885k689B45986a80703A99831
$$ 1616906 823221 -84632 -607023 -743729 -5410 1259885 1257196 245986 -180703 199831
651C53547e71779k43982B91355Q18204r9763j0264C62289i95534k5849C33821
$$ 353547 -571779 -815761 291355 1109559 1009796 999532 362289 -995534 -1021383 333821
640E60500c33695p36150M40930A33816N47915A22385d82482D09036N87019m87659
$$ 560500 -333695 -1069845 -628915 133816 681731 122385 -482482 409036 996055 508396
630E08396B09169M04171L91703L50338j14728D38926b78003K2962l72137n32142
$$ 508396 209169 613340 1005043 1355381 1240653 438926 -278003 -255041 -627178 -1159320
620a159320K31836E3135L56239e20285j153484j90402l6667L77262P40869a46441
$$ -1159320 -927484 53135 409374 -520285 -1673769 -1864171 -1900838 -1523576 -782707 -146441
609c223F7497K54402a65709m24722j39900k81994J51022K73565R7735K16250H24292
$$ -3223 67497 321899 -165709 -590431 -730331 -1012325 -861303 -587738 -490003 -273753 824292
597A720297j67529j77951p8761a94936j097391f02162C66610k4863G9797b13983
$$ 1720297 1552768 1374817 1296056 -194936 -1292327 -602162 366610 341747 79797 -213983
586b94336G58369J086036q16657a35815q0393h684I2282M22470Q48999M16823
$$ -294336 758369 1844405 1027748 -135815 -216208 -8684 92282 514752 1363751 1780574
576A780574H78629e68931o01176M11182g0534D69685K77505Q86729M48087k25285
$$ 1780574 878629 -568931 -1170107 -758925 -70534 469685 747190 1633919 2082006 1856721
566A856721j69196E08794f30582k47943c24542g9090l83558j209143j257002L29240
$$ 1856721 1687525 508794 -630582 -878525 -324542 -79090 -462648 -1671791 -2928793 -2599553
556b599553J091777r0931j093777j57817a239316B98955O76819k16967b9899j64327
$$ -2599553 -1507776 -1598707 -2692484 -2850301 -1239316 298955 975774 758807 -29899 -194226
546a94226D78210K85838l00597k09025b63351j023878L50534E13297l0948a842572
$$ -194226 478210 764048 463451 254426 -263351 -1287229 -936695 513297 482349 -1842572
535c231171J103336i75648M01720I7483N31840b65737m02328L12680p3844p38460
$$ -3231171 -2127835 -975648 -573928 97483 629323 -265737 -668065 -355385 -429229 -1167689
525a167689j1164H9578J14867i68374L8091G60369L94024c24502j286960l88672
$$ -1167689 -1178853 89578 204445 -968374 -930283 760369 1154393 -324502 -1611462 -2000134
515b000134K54706J19222M93477c83242l84270j006689P22358d23497o19298q41432
$$ -2000134 -1745428 -1626206 -1132729 -383242 -767512 -1774201 -1051843 -423497 -1042795 -1884227
505a884227L10572d93374E39894k60269e84356n77459k62677m17902J12743K16086
$$ -1884227 -1573655 -493374 539894 279625 -584356 -1161815 -1424492 -1842394 -1729651 -1513565
495a513565K16208c76955m8625j550740p04175N22181m99770J46416Q01817M60647
$$ -1513565 -1297357 -376955 -425580 -1976320 -2680495 -2158314 -2658084 -2511668 -1709851 -1249204
485a249204M16399l2963j206880l09843K73572l64074J05548O80651j000993j413670
$$ -1249204 -832805 -865768 -2072648 -2382491 -2108919 -2472993 -2367445 -1686794 -2687787 -4101457
475d101457L06546J096991K85704j131261n99247M53835J127538P05450n42885
$$ -4101457 -3794911 -2697920 -2412216 -3543477 -4142724 -3688889 -2561351 -1855901 -2398786
466b398786M71840P44807L09791p25129j940834p73227L53027m57850r15245k63512
$$ -2398786 -1926946 -1182139 -872348 -1597477 -3538311 -4311538 -3958511 -4416361 -5331606 -5595118
456e595118q66886q07757j593930k584822K51416k445050k386746j0275797o1470578
$$ -5595118 -6462004 -7269761 -8863691 -11448513 -11197097 -13642147 -16028893 -26304690 -87775268
447h7775268n6771781N7446543H584657K3307105j3874860l820886l169542j769338
$$ -87775268 -144547049 -87100506 8584657 31891762 18016902 14196016 11026474 9257136
439I257136L76956n29601k017313n30460O08874k48883O745n76749j264901j413808
$$ 9257136 9634092 9104491 7087178 6556718 7165592 6916709 6923454 6346705 5081804 3667996
429C667996r93543k77491P4552P78762O31000M04824J83535l24990o78974m22214
$$ 3667996 2674453 2396962 2471514 3250276 3881276 4286100 4469635 4144645 3465671 3043457
419C043457M66464M61640j16212L34757j25450P58382M60909B520828h026k16135
$$ 3043457 3509921 3971561 3855349 4190106 4064656 4823038 5283947 2520828 -8026 -224161
409b24161A49569M30780J021425O08180K67761M7659k28780L67081k02303A183904
$$ -224161 149569 580349 1601774 2209954 2477715 2525374 2296594 2663675 2461372 1183904
398G43014J70381B82024F4164J281624Q97115o78461n70443R66746M62847n11922
$$ 743014 913395 282024 64164 1345788 2242903 1564442 993999 1960745 2423592 1911670
388A911670n01103q4248K68620K66950n41217E97459P5692Q3474j03673r4568
$$ 1911670 1410567 1326319 1594939 1861889 1320672 597459 673151 756625 652952 558384
378E58384P96284N58682n23507o35028N0422b19103j123841J29005d18197C51150
$$ 558384 1354668 1913350 1389843 754815 805237 -219103 -1342944 -1213939 -418197 351150
367A360407P67987K91990p10619C90130H7198R45890Q35976l63799l30902k49407
$$ 1360407 2128394 2420384 1709765 390130 87198 1033088 1869064 1505265 1174363 924956
357I24956D35062A10140b6448C80771J203006Q27814p19828D63921f11701j24732
$$ 924956 435062 110140 -26448 380771 1583777 2411591 1691763 463921 -611701 -736433
347g36433L55882q5188m5402a8233F06771k80369R7659K82105L43368C5592a045723
$$ -736433 -380551 -465739 -511141 -18233 606771 326402 424061 706166 1049534 35592 -1045723
335f67737F35867O23875l86803D24797A92646O0499d6549l71789R3507p7042a75032
$$ -667737 635867 1259742 872939 424797 192646 253145 -46549 -418338 -324831 -401873 -175032
323D16094K39790K03962M78235K86025O4175j31170r1446p5060l98279I7830g00094
$$ 416094 655884 859846 1338081 1624106 1688281 1557111 1465665 1390605 992326 97830 -700094
311e92864G24366R99431H47089c43269k43470B74418L96527b72382q86157N760
$$ -592864 724366 1723797 847089 -343269 -586739 274418 670945 -272382 -1158539 -1152779
301a152779L07951a85253E0583a29042a8050F46528J21427A84559K16869M4496
$$ -1152779 -844828 -185253 50583 -129042 -18050 646528 767955 184559 401428 445924
291D45924h6685E95K24843c50944o03638J5932C51899J144917m24572F3596K77922
$$ 445924 -86685 595 225438 -350944 -954582 -938650 351899 1496816 1072244 63596 341518
280C41518M63247l96750d35749m95904j11034d87082C73703h1272j466507N11
$$ 341518 804765 408015 -435749 -931653 -1042687 -487082 373703 -81272 -1547779 -1547268
270a547268A32375J063986k64850C80669l2106L1386P4684A79060c61256J17633
$$ -1547268 132375 1196361 931511 380669 348563 379949 454633 179060 -361256 -243623
260b43623D64434J40772b72207n40574L94914A09807M13678k25609m0711M8356
$$ -243623 464434 605206 -272207 -812781 -417867 109807 523485 297876 257165 305521
250C05521A21056L01712K18780J5826n7797K2422J91169l02673a10186o66599
$$ 305521 121056 422768 641548 657374 599577 621999 813168 510495 -110186 -776785
240g76785m59061K28043M64989j40206j14550J29462l72024k98184p302Q0124
$$ -776785 -1235846 -1007803 -542814 -683020 -797570 -668108 -1040132 -1338316 -1345618 -1265494
230a265494L31458g5823B02386a26454n79350l69421c75363B15819L70300K26605
$$ -1265494 -934036 -75823 202386 -126454 -705804 -1075225 -375363 215819 586119 812724
220H12724h675j272558p36029o90163K59268a054056d37455o01701j56965d99246
$$ 812724 -8675 -1281233 -2017262 -2707425 -2448157 -1054056 -437455 -1039156 -1196121 -499246
209f62886o9513a33587L9263K0727A157852L53208A47374d84296g1267A21328
$$ -662886 -732399 -133587 -94324 -73597 1157852 1511060 147374 -484296 -71267 121328
198E83467L43935r9533j08901B40706f1062A37238e23608j038687o940N67385
$$ 583467 927402 827869 718968 240706 -61062 137238 -523608 -1562295 -1569235 -1001850
188a001850J46994b89587E46635k9421D4572b99078I4599J157396J86944D84989
$$ -1001850 -854856 -289587 546635 517214 44572 -299078 94599 1251995 1438939 484989
177C426e79401n61534A18690K277210L14026I44428C6849O58354J26357c3398
$$ 3426 -579401 -1140935 118690 2395900 2709926 944428 36849 695203 821560 -33398
166a226408j466637p50768J451423b66409F7427a95689C9724J92377c50666r30681
$$ -1226408 -2693045 -3443813 -1992390 -266409 67427 -195689 39724 232101 -350666 -1281347
156a281347j0265K90203J15102o1542l5031L21827R3174j41936L32692e1445l29421
$$ -1281347 -1291612 -1001409 -886307 -947849 -982880 -661053 -567879 -709815 -377123 -51445 -380866
145c80866a70257B78431A205e51257J10773A25196L46838m9656O29565M07009
$$ -380866 -170257 278431 1205 -551257 -440484 125196 472034 422378 1051943 1458952
135A458952k06348F16044c2401q49366l03424k31617l70278n07368O69113e32757
$$ 1458952 1252604 616044 -32401 -881767 -1185191 -1416808 -1787086 -2294454 -1625341 -532757
124c74083q07008m52598M53612b89707H61494K00298A0349c26096J24866o1950
$$ -374083 -1181091 -1633689 -1180077 -289707 861494 1061792 10349 -326096 -201230 -263180
114b63180R676B63790p1342a41176B63579j27173g80332o13378N1897c02282G11078
$$ -263180 -253504 263790 192448 -141176 263579 136406 -780332 -1393710 -1341813 -302282 711078
102A270035M79541j58474I4234f43780h0351C94084L4682e23873p50018f16345
$$ 1270035 1749576 1591102 94234 -643780 -80351 394084 428766 -523873 -1273891 -616345
91C07354J2435j47638k7639b95251p64932L43861E71405J18917b42972j91162
$$ 307354 319789 172151 144512 -295251 -1060183 -716322 571405 690322 -242972 -434134
81d34134C84965Q40017P7009j13313J04731k5495o23773A90919D5091e00789J77827
$$ -434134 384965 1224982 1301991 1188678 1293409 1267914 644141 190919 45091 -500789 -322962
70c22962C39770A23748K28765Q13406j09027E02667j2482R9734J43875a09069
$$ -322962 339770 123748 352513 1165919 1056892 502667 490185 589919 733794 -109069
59e82862C91053Q54380A91502g81517l75976k08568n3055L15153A06713P47239
$$ -582862 391053 1245433 191502 -781517 -1157493 -1366061 -1419116 -1103963 106713 853952
49H53952a12611p67869B3934P59548A53128f97366P2900L12154I5514O76676L11217
$$ 853952 -112611 -880480 23934 783482 153128 -697366 -624466 -312312 95514 772190 1083407
38A083407C8746a412896q7424M00336k21125K69611C60091J53076B29888N8602
$$ 1083407 38746 -1412896 -1500320 -1099984 -1321109 -1051498 360091 513167 229888 288490
28B88490a24291d5152k24815p88529K81633H00327L6151f05536o26343M7035A79998
$$ 288490 -124291 -45152 -269967 -1058496 -776863 800327 836478 -605536 -1231879 -1184844 179998
16A707102n7903G05296l14959M10881L59803k04889C94158G6643B7168a65854
$$ 1707102 1649199 705296 390337 801218 1161021 956132 394158 76643 27168 -165854
5b57168d6352C35836M30678J29908m19460
$$ -257168 -46352 335836 766514 896422 476962
0D76962
$$ 476962
##PAGE= F1=3388.594176373
##FIRST=     18110.137220953, 5591.54909048506, 79502
##DATA TABLE= (F2++(Y..Y)), PROFILE
1023G9502J62087h347m03498c0980F49006K14653j36540K19573m03563e45121
$$ 79502 241589 -8347 -411845 -30980 649006 863659 727119 946692 543129 -545121
1012a353149N77346C02515j19901G7803O31312K88597l27159J23501M5699q4184
$$ -1353149 -775803 302515 182614 77803 709115 997712 670553 794054 839753 755569
1002G55569P66724N35932r14621a15561l94688A54977O79292j07487J7967C57643
$$ 755569 1522293 2058225 1143604 -115561 -510249 154977 834269 726782 744749 357643
991a223702l58989O65923m71777p3188J82502j60810N26616C75849M07805B08021
$$ -1223702 -1582691 -916768 -1388545 -1461733 -1279231 -1440041 -913425 375849 783654 208021
980h52534J58263F11203O42341n07161f33374j318603K01735e90006A73082c88620
$$ -852534 -694271 611203 1253544 746383 -633374 -1951977 -1750242 -590006 173082 -388620
969a286365k830n3449o04785L4376i47245I2113N2857F7529L41545J84193P927
$$ -1286365 -1289195 -1342644 -1947429 -1913053 -947245 92113 144970 67529 409074 593267 601194
958F01194p6809B19299d05649n43573r2639O8509j02868N0424L84162m5443L22320
$$ 601194 524385 219299 -405649 -949222 -1041861 -973352 -1076220 -1025796 -641634 -687077 -364757
947c64757B47848N31531R7910k23670B3802f37996J74971A97154b46149j126466
$$ -364757 247848 779379 877289 653619 23802 -637996 -463025 197154 -246149 -1372615
937a372615J6473d04525K6412q28571L92444A43941b06285k62622C37760P02317
$$ -1372615 -1356142 -404525 -378113 -1206684 -814240 143941 -206285 -468907 337760 1040077
927A040077L98285N37835l20623b09586r49865A6347O00912a35101L5985A019778
$$ 1040077 1438362 1976197 1655574 -209586 -1159451 16347 617259 -135101 -99116 1019778
916A702009n39327D94300j49346N59013N32635o94530d98186j74777a30551D71115
$$ 1702009 1162682 494300 344954 903967 1436602 742072 -498186 -672963 -130551 471115
905C24276c6174A89160B4524d46652O4470p1137r96149L4073c77339A7017L07802
$$ 324276 -36174 189160 24524 -446652 -382182 -453319 -1449468 -1415395 -377339 17017 324819
894C24819K92795j13881b83463o34162j00557j94984m81911M92163B74853R65694
$$ 324819 617614 503733 -283463 -917625 -1018182 -1213166 -1695077 -1202914 274853 1240547
884A240547m88697A1432Q5890K19739J22001L95262j71624A93770F5675M46824
$$ 1240547 751850 11432 97322 317061 439062 834324 662700 193770 65675 512499
874E12499K65893K70199K9412E12617c3743l32334n6576a87575n1573J9599A000192
$$ 512499 778392 1048591 1078003 512617 -33743 -366077 -422653 -187575 -239148 -219549 1000192
862A726553n24099D30955o8238a71205j598518j039157O70882R88242e00175N4372
$$ 1726553 1202454 430955 362717 -171205 -1769723 -2808880 -2137998 -1149756 -500175 -445803
852d45803m68102o60265N40137F9975M66268k01684L83117J2851d35437p24125
$$ -445803 -913905 -1574170 -1034033 69975 536243 334559 717676 730527 -435437 -1159562
842a159562b72454E36231k4481n9431N53341K18168n62624a82260p27994L2262
$$ -1159562 -272454 536231 511750 452319 1005660 1223828 661204 -182260 -910254 -877992
832h77992B57023O37874l20204N5524Q1836A99049e64856r92315j74150g29096
$$ -877992 257023 894897 574693 630217 712053 199049 -564856 -1557171 -1731321 -729096
821C78091K34637A52380b8405D95670O84946P79644P49149J4539r08982F87861
$$ 378091 612728 152380 -28405 495670 1180616 1960260 2709409 2723948 1814966 687861
810f1289k75374D49699L39947d78968m67978A82598M56916a4241l17773C60702
$$ -61289 -336663 449699 789646 -478968 -946946 182598 639514 -14241 -332014 360702
799H76836K08760m11674e00646L0069I71307M26450K39466m85298D94831O26274
$$ 876836 1085596 673922 -500646 -470577 971307 1397757 1637223 1151925 494831 1121105
789A121105N88360l91014q5916R9014n43479L16915L96932l34728j10482K0655
$$ 1121105 1709465 1318451 1232535 1331549 788070 1104985 1501917 1167189 1056707 1077362
779A077362l36291A16045g97810n16059O34061C0586e96108J5129A36931P5110
$$ 1077362 741071 116045 -797810 -1313869 -679808 30586 -596108 -580979 136931 212041
769B12041j092h1007l08744Q5964B03511B8403c04605O3991F24895N88314k08671
$$ 212041 210949 -81007 -389751 -303787 203511 28403 -304605 -240614 624895 1213209 1004538
758A004538B62159e4875D57030k6515K70681J576950R29837j119861D38234j23625
$$ 1004538 262159 -54875 457030 430515 701196 2278146 3207983 2088122 438234 314609
748C14609N90273a17597j518827j6603b28545F42708k56242d06459j35892A10478
$$ 314609 904882 -117597 -1636424 -1653027 -228545 642708 386466 -406459 -542351 110478
737C94019J8575b84424p90821d41124A012482Q11898k79006G68855g5842m95748
$$ 394019 412594 -284424 -1075245 -441124 1012482 1824380 1545374 768855 -75842 -571590
727e71590P4997L5986m4116o46470q57734J34222O40782e56803K01805O7076D50138
$$ -571590 -496593 -460607 -504723 -1151193 -2008927 -1874705 -1233923 -556803 -354998 -287922 450138
715H73999l73440B49681A10524J76047J67244A95959G4004O52020j01826d01403
$$ 873999 500559 249681 110524 286571 453815 195959 74004 726024 624198 -401403
704d13299A85256e43807q13763e04826G98622k87903c68722D58080J017314B56363
$$ -413299 185256 -543807 -1357570 -504826 798622 510719 -368722 458080 1475394 256363
693a113398J94976b40557p5185n12491K23765D24977K98368d01612j545146K74212
$$ -1113398 -918422 -240557 -315742 -828233 -604468 424977 723345 -401612 -1946758 -1672546
683a672546h0228E11178B48174r9362K5614d10965k22416b11889H67234O29163
$$ -1672546 -80228 511178 248174 148812 174426 -410965 -633381 -211889 867234 1496397
673A496397n45572e0860n39081n05684k70814N35275d04209j44107i8614A193912
$$ 1496397 950825 -50860 -589941 -1095625 -1366439 -831164 -404209 -548316 -98614 1193912
662A140952H2591g13561n74999O8562A36903J485726r1123D07027a18250D84456
$$ 1140952 82591 -713561 -1288560 -1219998 136903 1622629 1531506 407027 -118250 484456
651A101466C35595d30117a06147G03116N82553K04212D98249a124656m8659A47490
$$ 1101466 335595 -430117 -106147 703116 1285669 1489881 498249 -1124656 -1173315 147490
640C5990i07125l67638N86877a50126A73083b83794m13721b6654B90915H9749
$$ 35990 -907125 -1274763 -687886 -150126 173083 -283794 -697515 -26654 290915 89749
629A28694M02003J82928L66420K3173D70667h8940j93211o67122m66802N44660
$$ 128694 530697 713625 1080045 1103218 470667 -88940 -282151 -949273 -1416075 -871415
619h71415d33479j61039k85982l48867l18792l68465N15376O85649J52129J83359
$$ -871415 -433479 -594518 -880500 -1229367 -1548159 -1916624 -1401248 -715599 -563470 -380111
609c80111c6984D19032g2267n97929j82076l32482j609K29928Q2482k0020a1599
$$ -380111 -36984 419032 -72267 -670196 -852272 -1184754 -1186363 -956435 -873953 -893973 -11599
597A090786J12222k35388l73205a060783j053867P88834a02268A74907g1246n27222
$$ 1090786 1203008 967620 594415 -1060783 -2114650 -1325816 -102268 174907 -71246 -598468
587e98468O1102E80663J095320p70439a85764j26117B1050Q1363Q4771O74322
$$ -598468 -537366 580663 1675983 905544 -185764 -311881 21050 102413 187184 861506
577H61506O94106o63410e74492q50686K91715L93201J39998b88837G27611M84593
$$ 861506 1555612 892202 -574492 -1425178 -1133463 -740262 -600264 -288837 727611 1212204
567A212204r2414r0831B07745d47102j20711a53329A63320a45672j637237j950950
$$ 1212204 1119790 1028959 207745 -447102 -567813 -153329 163320 -145672 -1782909 -3733859
557c733859J11224J389331l617j372950m98809J670361c97214G41905J88244C32595
$$ -3733859 -3622635 -2233304 -2236921 -3609871 -4108680 -2438319 -397214 741905 930149 332595
546b70574J11068P2531j32214j70162m28809n87672M65792A6455d43089k060021
$$ -270574 -159506 -86975 -219189 -389351 -818160 -1405832 -940040 16455 -443089 -2503110
536b503110j084316J138124O50926k41009P33571e46892n84940k20574L75975
$$ -2503110 -3587426 -2449302 -1798376 -2039385 -1305814 -546892 -1131832 -1352406 -976431
527i76431l47216j023000K22892f22085J51278j040687Q1200e9595A13843a357977
$$ -976431 -1323647 -2346647 -2123755 -622085 -470807 -1511494 -1430294 -59595 113843 -1357977
516b524556k90013K52388L1600M57731Q97367j83315j138010O98678P98096q65531
$$ -2524556 -2814569 -2562181 -2530581 -2072850 -1175483 -1358798 -2496808 -1798130 -1000034 -1865565
506a865565j201364L17336a195182A18845d45741j537483o15153J40253L827K63578
$$ -1865565 -3066929 -2749593 -1195182 118845 -445741 -1983224 -2598377 -2458124 -2454297 -2190719
496b190719L5949j17174O77955j59649j551939m84570O29083l27671J69981P08310
$$ -2190719 -2154770 -2271944 -1593989 -1753638 -3305577 -3790147 -3161064 -3488735 -3318754 -2610444
486b610444M52153L11740o07317j438685o254O08582l90491l52098J04923q46160
$$ -2610444 -2158291 -1846551 -2453868 -3892553 -3898807 -3290225 -3680716 -4032814 -3927891 -4774051
476d774051o33995L06494M64384L46997m81837p33213l02823J59215j22827p70778
$$ -4774051 -5408046 -5101552 -4637168 -4290171 -4772008 -5505221 -5808044 -5648829 -5771656 -6542434
466f542434K47390R59601P19336p42967k631964j361515K81071l97769n80869
$$ -6542434 -6295044 -5335443 -4616107 -5359074 -7991038 -9352553 -9071482 -9469251 -10050120
457a0050120m89321k912820l164098l105145m196369K46694n152552n164597k4828918
$$ -10050120 -10539441 -13452261 -16616359 -19721504 -23917873 -23671179 -28823731 -33988328 -58817246
448e8817246j39798913j26909283J29625832A5636280N1529139l0286096q188156
$$ -58817246 -198616159 -325525442 -195899610 15636280 67165419 36879323 28691167
441B8691167o998037m107227q18219k005241k098126r90259k27734r75336l41077
$$ 28691167 21693130 17585903 16767684 14762443 12664317 11674058 11446324 10470988 10129911
432A0129911o25774j726945j985184j386841m15094L2365J029478J224033M25310
$$ 10129911 9504137 7777192 5792008 4405167 3990073 4022438 5051916 6275949 6701259
423F701259o09387p60575n61461k66192M03007L47939L28262N72185k82292L52027
$$ 6701259 6091872 5331297 4769836 4503644 4906651 5254590 5582852 6155037 5872745 6224772
413F224772K93006k935176H05079k4988Q36390K87326M43176M40474N15661K51472
$$ 6224772 6517778 3582602 805079 780091 1616481 1903807 2346983 2787457 3303118 3554590
403C554590l92658O85424O4557j764139j057019O116C87398d0748A406432J398307
$$ 3554590 3161932 3847356 3911913 2147774 1090755 1096871 387398 -40748 1406432 2804739
393B804739n01228q71840O21350N79456l11960o89039m90697J01858O97025J24541
$$ 2804739 2303511 1431671 2053021 2632477 2320517 1631478 1140781 1242639 1939664 2064205
383B064205l72225P0089J4874k93797m73212O98633P10421l30328n00835j54080
$$ 2064205 1691980 1762069 1776943 1483146 1009934 1708567 2418988 2088660 1587825 1433745
373A433745E0536a146327K42266F7745J112407J009578O55271O7148q94705D73325
$$ 1433745 50536 -1146327 -904061 67745 1180152 2189730 2845001 2912149 2017444 473325
362C5696J045617P66892n88219k39636J28508l45079l29700m6039P21992J681286
$$ 35696 1081313 1848205 1259986 1020350 1148858 803779 474079 428040 1150032 2831318
352B831318Q83752j262282H18157a78286j64664J41767l3127d6069E48871L45257
$$ 2831318 3715070 2452788 818157 -178286 -342950 -201183 -234310 -46069 548871 894128
342H94128k47033K65668J01656p9594a33154j059132N35959A044442O14757o10794
$$ 894128 647095 912763 1014419 934825 -133154 -1192286 -656327 1044442 1659199 1048405
332A048405l08103j5896J36449j97601I6055b87738l25849a69593G40944L08329
$$ 1048405 740302 724406 860855 663254 96055 -287738 -613587 -169593 740944 1049273
322A049273j44604K62172O12154N03774J19407m70325o77368l79866k40388a16854
$$ 1049273 904669 1166841 1778995 2282769 2402176 1931851 1254483 874617 634229 -116854
311h74669h9820A330746n10466d03684j54856B20069L01539h7447m34072N0747
$$ -874669 -89820 1330746 820280 -403684 -558540 220069 521608 -87447 -521519 -470772
301d70772N4536h7965C9186O4927L80035P64618Q1797B51180A05992K49119A69305
$$ -470772 -416236 -87965 39186 104113 484148 1248766 1330563 251180 105992 355111 169305
289D9676p293b51188k65608j72117C20839J578769k02054A54268M4663M82938
$$ 49676 42383 -251188 -516796 -688913 320839 1899608 1697554 154268 198931 681869
279F81869C10020e15183n93312k72197N56455A56595a55480j267333J48232C86617
$$ 681869 310020 -515183 -1108495 -1380692 -824237 156595 -155480 -1422813 -1274581 386617
268A242687l91645D8294a14523G7439L55739A46999d21771b00907D02830o6797
$$ 1242687 851042 48294 -114523 77439 433178 146999 -421771 -200907 402830 336033
258C36033d22633m92903K77004h1976D01575j09516J51996K92925O6163K29020
$$ 336033 -422633 -915536 -638532 -81976 401575 292059 444055 736980 803143 1032163
248A032163j70166C15769A51686K52114J0220D1437b95855m15753n95307j18506
$$ 1032163 861997 315769 151686 403800 414020 41437 -295855 -711608 -1306915 -1425421
238a425421L68384P7422Q0409L03500p9348l15879j20456N7955N6803b02827B99463
$$ -1425421 -1057037 -979615 -899206 -595706 -675054 -990933 -1111389 -1053434 -996631 -202827 299463
226g4644n43813l15533M05476g1740E96449N98655m89477c97789q56494r16270
$$ -74644 -618457 -933990 -528514 -71740 596449 1195104 705627 -397789 -1254283 -2170553
216b170553n0106R68740e39815l36839k98689N11231J59164a24138E06818k46408
$$ -2170553 -2220659 -1251919 -539815 -876654 -1175343 -664112 -504948 -124138 506818 260410
206B60410B2637R56368K03619e9703n03823b22150O017A17834J32114F0920O1038
$$ 260410 22637 979005 1182624 -59703 -563526 -222150 -216133 117834 249948 60920 121958
195A21958h1396k50378M6481n10416p75967J96699M67671q8385d91048C10481
$$ 121958 -81396 -331774 -285293 -795709 -1571676 -1374977 -907306 -995691 -491048 310481
184B59952a08422k71203a33713H59650O89899n43014B07481h73624l57630E09770
$$ 259952 -108422 -379625 -133713 859650 1549549 1006535 207481 -873624 -1231254 509770
173B838266K67816A310637C65810O25461j09411d73802j242264j037399l95677
$$ 2838266 3106082 1310637 365810 991271 881860 -473802 -1716066 -2753465 -3149142
164c149142J272944d23125a45257k96918M9524k00100p41575l52757N95715M69293
$$ -3149142 -1876198 -423125 -145257 -442175 -392651 -592751 -1334326 -1687083 -1091368 -622075
154f22075k0887j88116n0441J23887j98124k11752M06501b81133J11457D33353
$$ -622075 -642962 -831078 -881519 -757632 -955756 -1167508 -761007 -281133 -169676 433353
143H78139B55190e54425J31426A51052K29844M7196R95391L10583k55617l67061
$$ 878139 255190 -554425 -422999 151052 380896 428092 1423483 1734066 1478449 1111388
133A111388B52921f52008p8684m30685p37390l62182R24464c18976q2211p97714
$$ 1111388 252921 -652008 -730692 -1161377 -1898767 -2260949 -1336485 -318976 -401187 -1198901
123a198901l89817L40405e61236E25681K20503b42470j9745C66964j34668c39937
$$ -1198901 -1588718 -1248313 -561236 525681 746184 -242470 -262215 366964 232296 -339937
112a72370P3524j9447C15483I1001g69163n22138q5212d70357D70618M41548M65090
$$ -172370 -98846 -118293 315483 91001 -769163 -1291301 -1376513 -470357 470618 912166 1377256
101A377256J40523C31278e26234J09501J89652L0604o01303j56922A44513J001573
$$ 1377256 1517779 331278 -526234 -416733 -227081 -196477 -797780 -954702 144513 1146086
91A146086m53508A6328b44460m22647o18872M54194D09834J01531b92539j16600
$$ 1146086 692578 16328 -244460 -667107 -1285979 -831785 409834 511365 -292539 -409139
81d09139D85253O87494l18756l95618K49977K40821m24227A14911F085d88640
$$ -409139 485253 1172747 853991 458373 708350 949171 524944 114911 6085 -488640
70b20678D20559g5172k56593E78328N06700m14393k90176n7713K21663i0546j23856
$$ -220678 420559 -75172 -331765 578328 1085028 670635 380459 322746 544409 -90546 -214402
59b14402H19905N45750d065j181384n59662k24527N71750M97323f2868G8525g65973
$$ -214402 819905 1365655 -4065 -1185449 -1745111 -1969638 -1397888 -900565 -62868 78525 -765973
47a358702b10276H73338l30037d34596M6174B36006N55078N11540K1271a1258
$$ -1358702 -210276 873338 543301 -434596 -388422 236006 791084 1302624 1323895 -11258
36a586588J07572f95380r0106n8787B45706J16240o6593N95353l78687A23958
$$ -1586588 -1479016 -695380 -785486 -844273 245706 361946 295353 890706 512019 123958
25a35717l97682K11388G87226j67564d90268J6774a56291I39059J142918n3946
$$ -135717 -533399 -322011 787226 619662 -490268 -473494 -156291 939059 2081977 2028031
15B028031j009298B52837O0161M84468n6911k30331J05715o7916A35090i8794
$$ 2028031 1018733 252837 312998 797466 740555 510224 615939 548023 135090 -98794
4i5020B19840N59941J49109l99957
$$ -95020 219840 779781 928890 528933
0E28933
$$ 528933
##PAGE= F1=3366.976638863
##FIRST=     18110.137220953, 5591.54909048506, 164665
##DATA TABLE= (F2++(Y..Y)), PROFILE
1023A64665J63098a10614k57999B06155O18361p763j44858J92028l69136c72501
$$ 164665 327763 -110614 -368613 206155 824516 816753 671895 863923 494787 -372501
1012a200124K71065C1181b732j37119E96565N78100l16823k06917j67173j36333
$$ -1200124 -929059 31181 -2732 -139851 596565 1174665 857842 650925 483752 347419
1002C47419Q08078P03285p69068h7379l22479B68043O87063j67780k38282A51412
$$ 347419 1155497 1858782 1089714 -87379 -409858 268043 955106 787326 549044 151412
991a145022l33130L31083p48040J52701O96607M1893M77809H61240L38329H7908
$$ -1145022 -1478152 -1147069 -1895109 -1742408 -1045801 -1003908 -526099 861240 1199569 87908
980a457863J89348C54356P36874m61468c55511p24633O2960d60590B04641c5052
$$ -1457863 -1268515 354356 1091230 629762 -355511 -1080144 -1017184 -460590 204641 -35052
969i01550l53820m07636r22199J32398a043400B06249J82315j87431J51894J3315
$$ -901550 -1255370 -1663006 -2585205 -2452807 -1043400 206249 388564 201133 353027 366342
959C66342o2499A27962b23693p08943q30610j35563O47214M01089J84624J43987
$$ 366342 303843 127962 -223693 -932636 -1763246 -1898809 -1251595 -850506 -665882 -521895
949e21895p4698C2912N15521J72742j53044k44333a41860n88234L02133B6743
$$ -521895 -596593 32912 548433 721175 568131 323798 -141860 -730094 -427961 26743
938f07585r44889O9980O13094K00273m5439b01004D39069F9012c11356B38324
$$ -607585 -1552474 -1482494 -869400 -669127 -714566 -201004 439069 69012 -311356 238324
927A002969M06468M48970m06828b47016o48425C83310L88833c11955j81994E74349
$$ 1002969 1409437 1858407 1451579 -247016 -895441 383310 772143 -311955 -493949 574349
916A456477n14513A75681q2631Q16687O57432o48956b81426k68024i6585E11591
$$ 1456477 941964 175681 93050 909737 1567169 918213 -281426 -549450 -96585 511591
905C88939A00194K24311d626l47228h3952q5698r63227M3631a89301A13511M4654
$$ 388939 100194 324505 -4626 -351854 -83952 -169650 -1132877 -1089246 -189301 113511 158165
894A58165n1608d7524o06872m77157j13237r6629l26821O60354E02357J029934
$$ 158165 106557 -47524 -654396 -1131553 -1244790 -1341419 -1668240 -1007886 502357 1532291
884A532291m12882I1548a84772A0369J14686L34307P0070j50692q2603K69126
$$ 1532291 1119409 91548 -184772 10369 125055 459362 529432 378740 296137 565263
874E65263R7572j0708M8522j03675B01968e31196k54132c74930a67926j07598
$$ 565263 662835 652127 700649 596974 201968 -531196 -785328 -374930 -167926 -275524
864b75524C64140N07607K33628k6243j9258B66624a747041j300003O18236J168046
$$ -275524 364140 871747 1105375 1079132 1059874 266624 -1747041 -3047044 -2428808 -1260762
854a260762b80686c5648m78087n93382M73640I5280L61778K5771M73380j8282
$$ -1260762 -280686 -35648 -513735 -1107117 -633477 95280 457058 482829 956209 937927
844I37927g7433n98163F2421R36010M5796k32024L10780p5220n06720A62908f72339
$$ 937927 -77433 -675596 62421 998431 1044227 812203 1122983 1047763 541043 162908 -672339
832a014726E507M26772c2937A71877K14978A37704g0688p58848o13715N93096
$$ -1014726 5507 432279 -32937 171877 386855 137704 -70688 -829536 -1443251 -850155
822h50155F5023J38929d075F9420M80206M04928M32796R47075O97493p56974A046373
$$ -850155 65023 203952 -4075 69420 549626 954554 1387350 2334425 3031918 2274944 1046373
810C40016I5269O96059J64506d73969n73579d5410B44800d05967N4952F65995
$$ 340016 95269 791328 955834 -473969 -1047548 -45410 244800 -405967 -351015 665995
799A121533J93591p2431a7483l62108G52566L60221M43429n65488C51307O59569
$$ 1121533 1315124 1242693 -17483 -379591 752566 1112787 1556216 990728 351307 1010876
789A010876O35968n50746k53652N42595k29526k4763j1121l49522o504J79632
$$ 1010876 1646844 1096098 842446 1385041 1155515 1130752 1119631 770109 763605 943237
779I43237j76202k39790i6306p25030N0188a59398l07738J23340I5615d0662k69472
$$ 943237 767035 527245 -96306 -821336 -771148 -159398 -467136 -343796 95615 -40662 -310134
768c10134n86628J43494A1005L83655e08619q22603M93021F82438Q67995n48031
$$ -310134 -896762 -753268 11005 394660 -508619 -1331222 -838201 682438 1550433 1002402
758A002402A90984l2756M92091r8021L23598J211453P76733r95809E75646J55517
$$ 1002402 190984 158228 650319 552298 875896 2087349 2864082 1868273 575646 731163
748G31163M97196A1937a412339q8257h7058H34035A80864g68493K07147C59636
$$ 731163 1228359 11937 -1412339 -1500596 -87058 834035 180864 -768493 -561346 359636
737D46953o0608c9589o18980b61447F99853N84275j54330n31520A28825a67446
$$ 446953 386345 -39589 -658569 -261447 699853 1284128 1129798 598278 128825 -167446
726b66254j96558J83656k96336r15381m03064K21868M84163L89011c79200C86078
$$ -266254 -462812 -279156 -575492 -1490873 -1893937 -1672069 -1187906 -798895 -379200 386078
715E41955k58461j28544L5611M75229L33800D93401A84497J88958e7046j069728
$$ 541955 283494 154950 190561 665790 999590 493401 184497 373455 -57046 -1126774
705a126774Q5058a20490l25244o10978a74254I78800l16671c83439A38588J104028
$$ -1126774 -1041716 -120490 -445734 -1056712 -174254 978800 662129 -383439 138588 1242616
695A242616E50494e48529b10144G29012J32609h9854m66221b2773B26250f24458
$$ 1242616 550494 -548529 -210144 729012 861621 -89854 -556075 -22773 226250 -624458
684a779967N28402B03739N05138j21736K70332m2955B46796B3061J10320P63875
$$ -1779967 -1251565 203739 708877 587141 857473 814518 246796 23061 133381 897256
674H97256M97892o71861c52332n12094m59451l28318P46751a77205o0386G7282
$$ 897256 1395148 723287 -352332 -864426 -1323877 -1652195 -905444 -177205 -237591 77282
663A136146m03199c71857o06421n44435J42397C05312J575194j02734F08831A15909
$$ 1136146 732947 -371857 -978278 -1522713 -1380316 305312 1880506 1777772 608831 115909
652I12288Q95261n99600A18958c48997C40917J161727L19165E85825a056107n9383
$$ 912288 1807549 1207949 118958 -348997 340917 1502644 1821809 585825 -1056107 -1115490
642a115490e572m37756r46148J99263d87255J35948p6287l27557j42566M28644
$$ -1115490 -5572 -443328 -1389476 -1190213 -487255 -351307 -427594 -755151 -897717 -469073
632d69073J18022J56365B92855L89380o3970J98915j9838C69777F4750a40647
$$ -469073 -351051 -194686 292855 682235 618265 817180 797342 369777 64750 -140647
621g34481l53123M69965k29902n63718L44806L75641m51945m80116O13937L90367
$$ -734481 -1087604 -617639 -847541 -1411259 -1066453 -690812 -1142757 -1622873 -1008936 -618569
611f18569l72662K61702G8212N60216A33875e31599k31361m51320k24628J46211
$$ -618569 -991231 -729529 78212 638428 133875 -531599 -762960 -1214280 -1438908 -1292697
601a292697J59958j59050O15067D99905M38348k79165a37853j420544n77908P49643
$$ -1292697 -1132739 -1291789 -676722 499905 938253 659088 -137853 -1558397 -2136305 -1386662
591a386662c64311b934k39026n61290J79757C43296J055842m36652G9795b67679
$$ -1386662 -364311 -2934 -241960 -803250 -623493 343296 1399138 962486 79795 -267679
580B0006K8275a92124C22972R09778l81072d36882r20517R5229k07m06687L93059
$$ 20006 48281 -192124 322972 1232750 851678 -436882 -1357399 -1262170 -1262377 -1669064 -1276005
569a276005a04609C61960p1724j00833a08313j3427D5040K54759L45374j98227
$$ -1276005 -104609 361960 290236 189403 -108313 -121740 45040 299799 645173 446946
559D46946a392659k373051k47740J463511K54246j459701p07532J403230a008678
$$ 446946 -1392659 -3765710 -4013450 -2549939 -2295693 -3755394 -4462926 -3059696 -1008678
549C83088O58123j83605a9570n24390k56340M3709j2791l56612p8453O00834b60978
$$ 383088 1041211 857606 -19570 -543960 -800300 -756591 -769382 -1125994 -1204447 -603613 -260978
537a112256j466407n60249Q52959O1655m47979Q72111N82495k75388j00230L64921
$$ -1112256 -2578663 -3138912 -2285953 -2224298 -2672277 -1800166 -1217671 -1493059 -1593289 -1228368
527a228368n67038j043596M96991h56430O1021r64559J23173e95735k13040j437726
$$ -1228368 -1795406 -2839002 -2342011 -856430 -795409 -1759968 -1636795 -595735 -808775 -2246501
517b246501r06257k9337K56847o605L61527Q56602p259j101674O26510Q16120
$$ -2246501 -3152758 -3182095 -2925248 -2931853 -2570326 -1713724 -1720983 -2822657 -2196147 -1380027
507a380027q83661j360355J90567J706010c23393p91551k077569n45362O04248
$$ -1380027 -2263688 -3624043 -3433476 -1727466 -323393 -1114944 -3192513 -3737875 -3133627
498c133627M38023K52153j24186l27095L66325j56472j067917j34839M30612k14252
$$ -3133627 -2695604 -2443451 -2567637 -2894732 -2528407 -2684879 -3752796 -3887635 -3457023 -3671275
488c671275K00357M93565L80056K30084r68252j670151J80672Q47480l14323o09430
$$ -3671275 -3470918 -2977353 -2597297 -2367213 -3335465 -5005616 -4824944 -3977464 -4291787 -4901217
478d901217o86270o54289J83602L33398j03020L42246J79466j009958j096230
$$ -4901217 -5587487 -6241776 -6058174 -5724776 -5827796 -5485550 -5306084 -6316042 -7412272
469g412272m96752p60782q22684j14590R31974J150901o90788k948541j370264
$$ -7412272 -7909024 -8669806 -9492490 -9607080 -8675106 -7524205 -8214993 -11163534 -12533798
460a2533798O575p77475q28161j029073m100676n161448l540476m624405q71328
$$ -12533798 -12527223 -13304698 -14132859 -15161932 -19262608 -24424056 -27964532 -32588937 -33460265
451c3460265q795015p480505l4657379j98481433j82089684J82331940B0168158
$$ -33460265 -42255280 -49735785 -84393164 -282874597 -464964281 -282632341 20168158
443H9962790m0945406r843887q635689n954248l141712l775151j131707j077554
$$ 89962790 49017384 39173497 30537808 24583560 21441848 17666697 16534990 15457436
435A5457436j256004j703007m35594m29124k057030k323527j465643m32321o260
$$ 15457436 14201432 12498425 12062831 11633707 9576677 7253150 5787507 5355186 5348926
426E348926J130019J555536J52547j348536r29915k54180M4493L41054K24308
$$ 5348926 6478945 8034481 8187028 6838492 5908577 5654397 5698890 6039944 6264252
417F264252O49138M83873l60795L36175K01258l110221A434062K17241J178094
$$ 6264252 6913390 7397263 7036468 7372643 7573901 4463680 1434062 1651303 2829397
408B829397J44415j60651K29884O89583L02815m04118J072132L01987k147411
$$ 2829397 2973812 2813161 3043045 3732628 4035443 3631325 4703457 5005444 2858033
399B858033A172222j33318C79924a14428A351606J685394k71666r81524L31206
$$ 2858033 1172222 1038904 379924 -114428 1351606 3037000 2765334 1783810 2115016
390B115016N77702k81179q97461G36662m0399J000905P83364O3657J38681J8532
$$ 2115016 2692718 2411539 1514078 736662 696263 1697168 2480532 2544189 2682870 2701402
380B701402o16773q03879N66943Q18320q6936j04853k44943E97312f49412J68794
$$ 2701402 2084629 1280750 1847693 2666013 2579077 2474224 2229281 597312 -649412 -480618
370d80618D80843J400892R46578N29301k04941j117410D28947A31906J325931
$$ -480618 480843 1881735 2828313 3357614 3152673 2035263 428947 131906 1457837
361A457837P72126r13409l70865M27392j50336k57647P9154R26716J751864N61351
$$ 1457837 2229963 1316554 945689 1373081 1222745 965098 1044252 1970968 3722832 4284183
351D284183j470615A168467C28613A30736n6656L5372M92897N60528j17828k48413
$$ 4284183 2813568 1168467 328613 130736 74080 109452 602349 1162877 1045049 796636
341G96636M54942k2233m26679a70296r16455d54929A429913M66998p27325q7510
$$ 796636 1251578 1229345 802666 -170296 -1086751 -454929 1429913 1896911 1169586 1082076
331A082076J13509j21868m7344m07673a49613o44298c06302H88928K98775n62083
$$ 1082076 1195585 1073717 1026373 618700 -149613 -793911 -306302 888928 1187703 625620
321F25620O3472Q42863P81873M97588n21901A136675m16725L24157D80787a032776
$$ 625620 689092 1531955 2313828 2811416 2289515 1136675 719950 1044107 480787 -1032776
310h74846H44508O2215b03307j57111A60937J49111A2166f4568I29i7312M4962
$$ -874846 844508 906723 -203307 -360418 160937 310048 12166 -64568 929 -97312 -52350
299e2350B9839M11594P28821P07720o1391D87894A53161L33275q4182A06473C8736
$$ -52350 29839 441433 1170254 1877974 1816583 487894 153161 486436 402254 106473 38736
287A15990a0954m79658A98313J818427j19645A71974L7545M90862l43035c49238
$$ 115990 -10954 -490612 198313 2016740 1897095 171974 209519 700381 357346 -349238
276a020305m98515N01967c2479k7382r16078N4221D24684Q05638k83466f9679
$$ -1020305 -1518820 -1016853 -32479 -59861 -975939 -921718 424684 1230322 946856 -69679
265c82545C4406M58526B6849e02027b14830G1547a12499m20422m21697J27361
$$ -382545 34406 492932 26849 -502027 -214830 71547 -112499 -532921 -954618 -827257
255h27257b69835B09715k1190L56378M97149K92140K21127n43803a15421k88863
$$ -827257 -269835 209715 188525 544903 1042052 1334192 1555319 1011516 -115421 -404284
245d04284H2023a31751n52934M6019N8336n12732l70735Q7042K45988J71795L75767
$$ -404284 82023 -131751 -684685 -638666 -580330 -1093062 -1463797 -1376755 -1130767 -958972 -583205
234e83205J85654k59522j67664Q0810j99248b57546E00574A03727d50621k38665
$$ -583205 -397551 -657073 -824737 -743927 -943175 -257546 500574 103727 -450621 -689286
224f89286O3825K03694D50621Q96444j13693D04263e10742r21201l17760L06915
$$ -689286 -625461 -421767 450621 1347065 1233372 404263 -510742 -1431943 -1749703 -1442788
214a442788O14061j6197l37042J93252M35381C04142N93145D36785b8274E90211
$$ -1442788 -828727 -844924 -1181966 -988714 -553333 304142 897287 436785 -28274 590211
203G08154b49671l29655b37834j10680a71071n2255k86319Q4168k8834j77882
$$ 708154 -249671 -579326 -237834 -348514 -171071 -223326 -509645 -425477 -454311 -632193
193f32193k06010l86386j27146f71198K83848l23082L03883A30618a2155k16307
$$ -632193 -838203 -1224589 -1351735 -671198 -387350 -710432 -406549 130618 -12155 -228462
183b28462j70727J4823B28784Q45401o1519A56067a094781q8518F98884J933640
$$ -228462 -399189 -384366 228784 1074185 1012666 156067 -1094781 -1183299 698884 2632524
173B632524J57538A344296E39588M38087l48689i85202j009906l19100L1939Q00065
$$ 2632524 2790062 1344296 539588 977675 628986 -985202 -1995108 -2314208 -2282269 -1482204
163a482204e10173a70866j79223k05388p71447j098228L99444g06542b11170l38664
$$ -1482204 -510173 -170866 -350089 -555477 -1326924 -2425152 -2025708 -706542 -211170 -549834
153e49834k48057K8501K221l07840k69441L36587d32759D1463O96167L50533D03059
$$ -549834 -797891 -769390 -767169 -1075009 -1344450 -1007863 -432759 41463 737630 1088163 403059
141c94998J14316A87923J31377J18723Q78988L2113j99576n006B96609c71284
$$ -394998 -280682 187923 319300 438023 1317011 1349124 1149548 1144542 296609 -371284
130a89971m15788r16414l51008Q12013a56509r0876n90953j96419K26853K67515
$$ -189971 -605759 -1522173 -1873181 -1061168 -156509 -247385 -838338 -1034757 -807904 -540389
120e40389B73240J56905d03121a27245H81654k40604d21204j02796b60563e9177
$$ -540389 273240 430145 -403121 -127245 881654 641050 -421204 -524000 -260563 -59177
109B12543a96597o92854k67562q7917d86288B15139L08505N09593K98731D31822
$$ 212543 -196597 -889451 -1157013 -1244930 -486288 215139 523644 1033237 1331968 431822
98d59403k39997l7875R6324j72772L35092G40205Q95337G96777c21961m75984
$$ -459403 -699400 -737275 -640951 -813723 -478631 740205 1635542 796777 -321961 -797945
88g97945k02142k03782N55051C28733O6206a25389m5195E94210L89565B98449
$$ -797945 -1000087 -1203869 -648818 328733 394939 -125389 -170584 594210 983775 298449
77c18050F2605M56950j37703A64386n1930b98684i5148C52720b99352n54472e5712
$$ -318050 62605 519555 381852 164386 112456 -298684 -95148 352720 -299352 -853824 -55712
65H91934l7487l24277k02298J06526h1295A2505R24132K05553c43624j175677
$$ 891934 854447 530170 327872 434398 -81295 12505 936637 1142190 -343624 -1519301
55a519301n72493j76872R36245N22157M04885m59121o46255k41244d09887H21014
$$ -1519301 -2091794 -2268666 -1332421 -810264 -405379 -864500 -1510755 -1751999 -409887 821014
44G81646a65688j16731D43896N74795L99515k3573A12234a430917J62235c21553
$$ 781646 -165688 -282419 443896 1018691 1418206 1394633 112234 -1430917 -1268682 -321553
33c65767l19582A0336N0210R6496R84390j48213B92448G4981O4203J50900N43803
$$ -365767 -685349 10336 60546 157042 1141432 993219 292448 74981 139184 290084 833887
22H33887k67547G9588M86429L90932N74154O42742j65614H98434a32306o7219
$$ 833887 566340 79588 566017 956949 1531103 2173845 2008231 898434 -132306 -199525
12a99525C17638o2392J49023O81826r3973B97068B233a19621C9700M95548J05878
$$ -199525 317638 255246 404269 1086095 992122 297068 2233 -119621 39700 535248 641126
1F41126B74238
$$ 641126 274238
##PAGE= F1=3345.359101353
##FIRST=     18110.137220953, 5591.54909048506, -142192
##DATA TABLE= (F2++(Y..Y)), PROFILE
1023a42192F5587b13032A0094P24755K80672k97274k21340O1798B49548a98038
$$ -142192 65587 -213032 10094 734849 1015521 718247 496907 558705 249548 -198038
1012g55897j9362e8768b3782l09612C52350R15816j84107E36596A20889d8980
$$ -755897 -775259 -58768 -23782 -333394 352350 1268166 1084059 536596 120889 -48980
1001G06287O90229o25868b42564j27619C43945O92053j89543D10074A6g97646
$$ 706287 1396516 770648 -242564 -370183 343945 1035998 846455 410074 16 -797646
990a005674j14989r88533L62592f15658J61999K19374A001011L91874F3288a749270
$$ -1005674 -1120663 -2109196 -1746604 -615658 -453659 -234285 1001011 1392885 63288 -1749270
979a612804E2496O65396l19468B6219L041g1167j19888A91483K9217d47385o36664
$$ -1612804 52496 717892 398424 26219 29260 -71167 -191055 191483 220700 -447385 -1084049
968a084049p27648j051446L30170g50878E56002K42484l15716k33936h1016j01407
$$ -1084049 -1811697 -2863143 -2532973 -750878 556002 798486 482770 248834 -81016 -182423
958a82423j14939k70069p69967j117172j77150J096441g27541c47032M3987k4529
$$ -182423 -297362 -567431 -1337398 -2454570 -2631720 -1535279 -727541 -347032 -303045 -327574
948c27574C60557M24033j48286B56265g8157j57954k81133b14394P3291o82505
$$ -327574 360557 784590 636304 256265 -78157 -236111 -517244 -214394 -141103 -823608
938h23608p45796j56007K11545O83216I767M18551J47974B02422b70173b9380
$$ -823608 -1569404 -1725411 -1513866 -830650 9767 428318 576292 202422 -270173 -29380
927G81948M66495L60909l36266A8656c29106F77353k3264f59753k84666C4458
$$ 781948 1248443 1609352 1273086 18656 -329106 677353 654089 -659753 -944419 34458
916I75193D67230b83499P4278G46190P31540n14235F547b87764A5656N48617j18755
$$ 975193 467230 -283499 -209221 746190 1477730 963495 6547 -287764 15656 564273 445518
905D45518F451J45723h3729n9119B54261A19261e57794J31712H559K4812a33947
$$ 445518 6451 152174 -83729 -142848 254261 119261 -557794 -426082 8559 33371 -133947
893d14409j18274l89949m43680j28627K22944J31008c95829G08508Q44840j15380
$$ -414409 -532683 -922632 -1366312 -1494939 -1271995 -1140987 -395829 708508 1553348 1437968
883A437968C47188d08445J11900h8269A54016J76126J33305J01781J88500j32669
$$ 1437968 347188 -408445 -296545 -88269 154016 330142 463447 565228 753728 621059
873F21059B38570n7951K64909B17809g88465m45762N20793a96092l1105i0256
$$ 621059 238570 180619 445528 217809 -788465 -1234227 -713434 -196092 -227197 -90256
862B25350Q37031O44923R808F90043a507477j357008M32467J070699a93765B48472
$$ 225350 1062381 1707304 1717112 690043 -1507477 -2864485 -2432018 -1361319 -193765 248472
851a64078n30625b75366A78707K61956P4134L72973M6960C11282a91825B34636
$$ -164078 -694703 -275366 178707 440663 514797 887770 934730 311282 -191825 234636
840A138830J7503k32161J79536l74403B12601J38145c18486o86664c43319J45503
$$ 1138830 1156333 924172 1103708 729305 212601 350746 -318486 -1005150 -343319 -197816
830a97816m20174b65531a24684q5737A88456a06426r71430L8645c42599a65971
$$ -197816 -617990 -265531 -124684 -210421 188456 -106426 -1077856 -1039211 -342599 -165971
819f8743B32523L49814r562Q7172J166063J255217o57043j103770n36768j77954
$$ -68743 232523 582337 572775 659947 1826010 3081227 2424184 1320414 783646 605692
809F05692M17670j70054f20996p05779e70397J72852l91877c31599G58257L62532
$$ 605692 1023362 853308 -620996 -1326775 -570397 -397545 -789422 -331599 758257 1120789
799A120789K21473O8021B13766c56331D14582M96500L16954E65113A31819P07625
$$ 1120789 1342262 1410283 213766 -356331 414582 911082 1228036 565113 131819 839444
789H39444N85663G07254C24561Q35603J10805k96971m33865A20320n2002K16258
$$ 839444 1425107 707254 324561 1160164 1270969 973998 540133 120320 68318 284576
779B84576P3811L17751j51331b30497l29093b39093L4863a4723G9514b44462m59736
$$ 284576 358387 676138 524807 -230497 -559590 -239093 -204230 -14723 79514 -244462 -704198
768g04198o60709M02902B35470L16377h14285j176397O82861F54951J086883q54850
$$ -704198 -1364907 -962005 235470 551847 -814285 -1990682 -1307821 654951 1741834 886984
758H86984a2133B16410O13574P6490J40819O19847O05947o65805G69887J86057
$$ 886984 -12133 216410 829984 906474 1047293 1667140 2273087 1607282 769887 955944
748I55944K06933g5948j157893p2347b5755H65562a65882j070942N04795C38971
$$ 955944 1162877 -75948 -1233841 -1306188 -25755 865562 -165882 -1236824 -732029 338971
737C69087m217j00636a20483e132B70605L78138J50513k66557k42893B2752c64274
$$ 369087 364870 264234 -120483 -5132 270605 648743 799256 532699 289806 22752 -364274
725g33298b01098A13972e68197j008979l78208K09217O31000d36494A34258J0665
$$ -733298 -201098 113972 -568197 -1577176 -1955384 -1746167 -1115167 -436494 134258 144923
715A44923J58079m1608M531O58791N16309n41383C64466b7286q63563r98969K51803
$$ 144923 303002 261394 265925 924716 1441025 899642 364466 -27286 -890849 -1889818 -1638015
704a638015d41874P6148m06593A24510R32433l82613c97971a43406I44809j56564
$$ -1638015 -441874 -365726 -772319 124510 1056943 674330 -397971 -143406 944809 788245
694G88245D2761N57325J105473J60544E68071e13392P1646b06404l28157m37001
$$ 788245 42761 600086 1705559 1866103 568071 -513392 -441746 -206404 -534561 -971562
684i71562b96995F85209K78441q398M41512p3440l61324k53095k89894L71890
$$ -971562 -296995 685209 963650 955252 1396764 1323324 962000 708905 419011 790901
674G90901L01477C58746f04611m52849m92625m30931R48765B0619J33067J62407
$$ 790901 1092378 358746 -604611 -1057460 -1550085 -1981016 -1032251 20619 153686 316093
664C16093P02750D68477d70451m36378m34245J54856D46568J452874m8526G39434
$$ 316093 1018843 468477 -470451 -906829 -1341074 -1186218 446568 1899442 1850916 739434
653C50291Q66598R21432m11842F39222d07549G3213J489526L52819F21802h04225
$$ 350291 1216889 2138321 1726479 639222 -407549 73213 1562739 1915558 621802 -804225
642g81416F7047f19258r45365O87540a53126l21778n36241k34386J23081K67160
$$ -781416 67047 -619258 -1564623 -877083 -153126 -474904 -1011145 -1245531 -1122450 -855290
632h55290O1054c24487E90037M08277k15707l8769k15254A85741q8949j09i7988
$$ -855290 -794236 -324487 590037 998314 782607 743838 528584 185741 96792 96683 -97988
620b88546J7926q79486p76463P70096b76904m75613l73213e00715m833o71162
$$ -288546 -270620 -1150106 -1926569 -1156473 -276904 -752517 -1125730 -500715 -505548 -1176710
610a176710L64192C95763M76233C72092a89789k87983o26407m74663L6013L31359
$$ -1176710 -812518 395763 871996 372092 -189789 -477772 -1104179 -1578842 -1542829 -1211470
600a211470j11566L79885I5482O78373k65745f45133q77302J13296O13110c08099
$$ -1211470 -1323036 -943151 95482 773855 508110 -645133 -1522435 -1409139 -796029 -308099
589a18426k24372l73377J45576B6181R60427Q9231E01556a04854C5124a306n06502
$$ -118426 -342798 -716175 -570599 26181 986608 1075839 501556 -104854 35124 -1306 -507808
578e07808a31974H67749r2832b19956q45900j12915l67958r25338M60569f99672
$$ -507808 -131974 867749 774917 -219956 -1065856 -1178771 -1546729 -2472067 -2011498 -699672
567b93918j65290j37618K08189A74719M74147J43852L55240o4261f72532k376656
$$ -293918 -459208 -596826 -388637 174719 648866 792718 1147958 1083697 -672532 -3049188
557c049188n51989J232175N35297j207193o56277Q96603a290534f072I70444L08062
$$ -3049188 -3601177 -2369002 -1833705 -3040898 -3697175 -2800572 -1290534 -6072 970444 1278506
547A278506D17749f00719n27759K10371J39568l63174L64571i884k02594j118933
$$ 1278506 417749 -600719 -1128478 -918107 -778539 -1141713 -777142 -9884 -212478 -1331411
537a331411p73433P0255L64618m71465k19564R64925J99115j06121m5230L36064
$$ -1331411 -2104844 -2034589 -1669971 -2141436 -2361000 -1396075 -1196960 -1303081 -1348311 -1012247
527a012247o56377q14440P70239d24748j63995j015534Q8216g48340o35252j397237
$$ -1012247 -1668624 -2483064 -1712825 -424748 -588743 -1604277 -1516061 -748340 -1383592 -2780829
517b780829n77675K92572K78769N008K63042P23582J02610r37729N29348O80190
$$ -2780829 -3358504 -3065932 -2787163 -2782155 -2519113 -1795531 -1692921 -2630650 -2101302 -1421112
507a421112o64182j219239K1912J420678f34356r32189k341033m15938J067255
$$ -1421112 -2085294 -3304533 -3282621 -1861943 -634356 -1566545 -3907578 -4323516 -3256261
498c256261P96794M9419k63511l44653R1069j0485k56798J12765J1283j66361
$$ -3256261 -2459467 -2410048 -2673559 -3018212 -2927143 -2937628 -3194426 -3081661 -3070378 -3236739
488c236739K43353K90486L67251J73636j105695j845927K42870Q75418j54059
$$ -3236739 -2993386 -2702900 -2335649 -2162013 -3267708 -5113635 -4870765 -3995347 -4149406
479d149406m43201j248734n67847P15168L56960m97036K76983O03249j277134
$$ -4149406 -4592607 -5841341 -6409188 -5694020 -5337060 -5834096 -5557113 -4953864 -6230998
470f230998j610660n43571o81199o63943m54717M83551J201267m33442k437934
$$ -6230998 -7841658 -8385229 -9066428 -9730371 -10185088 -9701537 -8500270 -8933712 -11371646
461a1371646p40629l36300j435447j531299j293543l428475n294701k548201l747128
$$ -11371646 -12112275 -12448575 -13884022 -15415321 -16708864 -20137339 -25432040 -27980241 -31727369
452c1727369k291383j1259643p925308l3001710j99247216j86145468J82105030
$$ -31727369 -34018752 -45278395 -53203703 -86205413 -285452629 -471598097 -289493067
445b89493067B0874933O6850037l9604241q366441p437130n945814m826038m695211
$$ -289493067 20874933 87724970 48120729 39754288 32317158 26371344 21545306 16850095
437A6850095r912p43377j737951j911781k29102k81904k177253k202370j134642
$$ 16850095 16840183 16096806 14358855 12447074 12217972 11936068 9758815 7556445 6421803
428F421803l22762l8226J055673J488188k82688j718650q15471P3065L77772K96790
$$ 6421803 6099041 6060815 7116488 8604676 8321988 6603338 5787867 5860932 6238704 6535494
418F535494Q2604O39831J78338l85577M13213M5929k985600A596652N04347J282467
$$ 6535494 6618098 7257929 7436267 7050690 7463903 7509832 4524232 1596652 2100999 3383466
408C383466M6504o23551j0743P23718J96833j80914J488529M67586k354045I50497
$$ 3383466 3429970 2806419 2795676 3519394 3716227 3535313 5023842 5491428 3137383 950497
397G05809B10028a53462A212644J664769m6576q43063J85575M40101m31385j084420
$$ 705809 210028 -153462 1212644 2877413 2830837 1987774 2173349 2613450 2182065 1097645
387A097645A88904E0901J127868J254437M09485K15178N1821r63887r84830M39212
$$ 1097645 188904 50901 1178769 2433206 2842691 3057869 3109690 2145803 1160973 1600185
377A600185Q19566J54389M74461j49794A175316i7775k0174F79881J505823Q40464
$$ 1600185 2419751 2574140 3048601 2898807 1175316 -97775 -117949 679881 2185704 3026168
367C026168L97595m07297j280587B21786O9760J638433O39913A258086m58036
$$ 3026168 3423763 3016466 1735879 221786 291546 1929979 2569892 1258086 800050
358H00050P15314N6985j41714K01387R32154J325296m2874j264391j245739F41519
$$ 800050 1515364 1572349 1430635 1632022 2564176 3889472 3846598 2582207 1336468 641519
347D04570j47764J29174P46886L46458n93065k57982O49624m1126n39349g0315
$$ 404570 256806 385980 1132866 1479324 886259 628277 1277901 1236775 697426 -70315
336h15090a70749A678076K63042p43942R4907J17317o00875m014O337e7165q93676
$$ -815090 -170749 1678076 1941118 1197176 1292083 1409400 808525 804511 810848 -57165 -950841
325i50841L33707G10238K36752I2178C1799Q49350Q58799R03443k86942I68048
$$ -950841 -617134 710238 946990 92178 31799 881149 1739948 2643391 2356449 968048
314D89717O68177k38336a002510m24647C43209O66089A75367g7348E5915k4554
$$ 489717 1157894 919558 -1002510 -1427157 343209 1009298 175367 -77348 55915 31361
304C1361b4619G1873Q2854p4159e4502b175G39938J032563M87039k69245H11950
$$ 31361 -24619 71873 154727 80568 -54502 -2175 739938 1772501 2259540 1990295 811950
292E30665J99138l25201B1213J26907M71427k20706d61203f4376A672415j25282
$$ 530665 729803 404602 21213 148120 619547 398841 -461203 -64376 1672415 1547133
282A547133A04657K41946M80667l52367e9469o51762p02920L76231a94694E3637
$$ 1547133 104657 346603 827270 474903 -59469 -711231 -1414151 -1037920 -194694 53637
271d58202j71530B31520R02130N461G1692c40357B17035K85245b49588m04378
$$ -458202 -629732 231520 1133650 1139111 71692 -340357 217035 502280 -249588 -653966
261f53966L18454j20458j39479N7939l31085l277c67103a8131n2448D11900O41345
$$ -653966 -335512 -455970 -595449 -537510 -868595 -871872 -367103 -18131 -70579 411900 1053245
250A053245M59917K76301q18559e56360l72148b90374l96365q03401L80616d71839
$$ 1053245 1513162 1789463 970904 -556360 -928508 -290374 -686739 -1490140 -1109524 -471839
239f72462n02503k98625L48731J64801L64002a85806j50080j88004J14067m12708
$$ -672462 -1174965 -1473590 -1124859 -960058 -596056 -185806 -335886 -523890 -409823 -822531
229h22531c31711E90881B33455b82807j28399k75905j17030A13703R98007J85349
$$ -822531 -331711 590881 233455 -282807 -411206 -687111 -804141 113703 1111710 1297059
219A297059n04241f0741p14123n02510l71204L81466K68550k97755j65641N64240
$$ 1297059 792818 -60741 -774864 -1277374 -1648578 -1267112 -998562 -1296317 -1461958 -897718
209h97718C16722N27094C35150b08891A07737R2043d00357j86912b07415o4166
$$ -897718 316722 843816 335150 -208891 107737 199780 -400357 -587269 -207415 -271581
199b71581R4873j46511l84542o0923j9282j40297m70524l02024P03338B21937
$$ -271581 -176708 -323219 -707761 -768684 -787966 -928263 -1398787 -1700811 -997473 221937
188C13978a34525K1894B5379b22167r1469r4948k32142Q0002b135D08735a44658
$$ 313978 -134525 -112631 25379 -222167 -313636 -408584 -640726 -560724 -2135 408735 -144658
176a172626K06937G19495J236372Q142q65126E39367R9045G0193a425270n11339
$$ -1172626 -965689 719495 1955867 1964009 1098883 539367 638412 70193 -1425270 -1936609
166a936609N22482L94472J38513L97460d4200l976m48001j265963j381978J046289
$$ -1936609 -1414127 -1019655 -881142 -483682 -44200 -48176 -496177 -1762140 -3144118 -2097829
156b097829b60738H7860f07906k23556J51876J391j98684l59068O7221e34489
$$ -2097829 -260738 87860 -607906 -831462 -679586 -678195 -876879 -1235947 -1168726 -534489
145A99536N18070J91059D19976a38753f8622B32537P2494O3746K73578k84047
$$ 199536 717606 908665 419976 -138753 -68622 232537 305031 368777 642355 358308
135C58308J68L16962G0536a34006B84423E0163g82146m46575L72960i6170D9531
$$ 358308 358476 675438 70536 -134006 284423 50163 -782146 -1228721 -855761 -96170 49531
123b13913m93i1933j91504A33265K5144e02826f0760A103237k92138d78044k04192
$$ -213913 -214406 -91933 -283437 133265 158409 -502826 -60760 1103237 811099 -478044 -682236
112f82236b41089D8509k076f11183m90222R5625P9850b84470C9653J47812O04739
$$ -682236 -241089 48509 46433 -611183 -1101405 -1005780 -925930 -284470 39653 187465 792204
101G92204K98264C30188e23608l98836j85214J86678K36296f7675I37249O30074
$$ 792204 1090468 330188 -523608 -922444 -1107658 -920980 -684684 -67675 937249 1567323
91A567323E51465g98287n85901J84009L30904b80938C07589L5995j44386L9138
$$ 1567323 551465 -798287 -1384188 -1200179 -869275 -280938 307589 343584 199198 238336
81B38336M46984K3530b11996p13178d38264A90207J35844O460j2506a3471k8990
$$ 238336 685320 708850 -211996 -925174 -438264 190207 326051 332511 320005 -13471 -42461
70d2461A00797e01380n69966M98916E11165M78627p3405k46402j21198C0373P2687
$$ -42461 100797 -501380 -1071346 -572430 511165 989792 916387 669985 548787 30373 103060
59A03060O59015n0354f85999r88323m21748p4749R14166M12307J1342q64406m94005
$$ 103060 762075 711721 -685999 -1674322 -2096070 -2170819 -1256653 -844346 -833004 -1697410 -2191415
48b191415J52879f14520F20055K08809C7517c46160B85791N07051L45660J74292
$$ -2191415 -2038536 -614520 620055 828864 37517 -346160 285791 792842 1138502 1312794
38A312794D02629i52347R5471D4496a2435n02639b22754R70a7571A043409J41464
$$ 1312794 402629 -952347 -856876 44496 -12435 -515074 -222754 -221784 -17571 1043409 1184873
27A184873D65494r1222M20280P2761M5309j93315K47281O69620K35948k9445J61100
$$ 1184873 465494 374272 794552 867313 912622 719307 966588 1636208 1872156 1842711 2003811
16B003811l72936D42871e66226M8241i2650k09663A25469J207724m0374D05771
$$ 2003811 1630875 442871 -566226 -517985 -92650 -302313 125469 1333193 1292819 405771
5A28684c7435n3643A57685Q152a28419
$$ 128684 -37435 -91078 157685 165837 -128419
##PAGE= F1=3323.741563842
##FIRST=     18110.137220953, 5591.54909048506, -704893
##DATA TABLE= (F2++(Y..Y)), PROFILE
1023g04893K49067J56103E85824P70960k79442E14717B01845F7070a85233O2214
$$ -704893 -455826 -299723 585824 1356784 1077342 514717 201845 67070 -185233 -123019
1013a23019n7579j75445E4548K2297e12648d7448A125963J2130C92537a84296
$$ -123019 -180598 -356043 54548 76845 -512648 -47448 1125963 1138093 392537 -184296
1002c98539A99410N63302B64878e60672J17618C41231P17144j77778C25105h9140
$$ -398539 199410 762712 264878 -560672 -443054 341231 1058375 880597 325105 -89140
991c25133j6606n30456j134302M95450a76290C293a07390H08141N57206B06725
$$ -325133 -341739 -872195 -2006497 -1511047 -176290 3293 -107390 808141 1365347 206725
980a633226k4800b72377A64501F3820L12478O38032k12687A40826L4792J96552
$$ -1633226 -1658026 -272377 164501 63820 376298 1014330 801643 140826 175618 372170
970C72170a2394p32893q97150r44646N42766a32508A063085J71118m33155A48823
$$ 372170 -12394 -745287 -1642437 -2587083 -2044317 -132508 1063085 1234203 801048 148823
959e79010j69727P3561m3653p68814j296843j93162J255427g34222b09246Q7609
$$ -579010 -748737 -675176 -718829 -1487643 -2784486 -2977648 -1722221 -734222 -209246 -121637
949a21637e5506D78241M35214k89458C9366d33845a88046A7055J06701b65410
$$ -121637 -55506 478241 913455 623997 39366 -433845 -188046 17055 123756 -265410
938h26591n82339n79521j42455h77538F31201J79574l13167A64192b99927K8056
$$ -826591 -1408930 -1988451 -2130906 -877538 631201 810775 497608 164192 -299927 -271871
928b71871E44655N17779K29903j94057D48584p6930M56685C28895i89717k89695
$$ -271871 544655 1062434 1292337 1098280 448584 371654 828339 328895 -989717 -1279412
918a279412d90194C31319a16295n41745K88942E24314O94850l74220B36483D9509
$$ -1279412 -490194 331319 -116295 -658040 -369098 524314 1219164 844944 236483 49509
907A91101M34927j04323b19584J2171f1157B73183L28383k85164E6225K86996
$$ 191101 626028 521705 -219584 -207413 -61157 273183 601566 316402 56225 343221
897C43221j50611a33172k47807l58221o7220k27215n39288j05008P14470a81804
$$ 343221 192610 -133172 -380979 -739200 -806420 -1033635 -1572923 -1677931 -963461 -181804
886D99099L31587M27511K83838F49235e18064J761a40330c7154G709L52356M67868
$$ 499099 830686 1258197 1542035 649235 -518064 -516303 -140330 -37154 7709 360065 827933
875H27933K69049l83955f1379k72928A13630B1085a095573o11110N38392c81261
$$ 827933 1096982 713027 -61379 -334307 113630 21085 -1095573 -1706683 -1168291 -381261
864a60431r9853b8273A093342J057781L1117I61904a186380j195235K48834P76251
$$ -160431 -260284 -28273 1093342 2151123 2182240 961904 -1186380 -2381615 -2132781 -1356530
854a356530b29560C00595A608d52870f2882B72160J76605m5691J33566J76478
$$ -1356530 -229560 300595 1608 -452870 -62882 272160 448765 403074 536640 713118
844G13118q7667B27387R4698O50969j57400j14159K14124C67350a80385C68935
$$ 713118 625451 227387 322085 973054 815654 701495 915619 367350 -180385 368935
833G2449h29114J60565j40044k83233L92773n2041n267A07172K35337g52441m71090
$$ 72449 -829114 -668549 -808593 -1091826 -699053 -751094 -756361 107172 342509 -752441 -1223531
822a223531N34183c38160a8019C75976K01458B07240A5649J222319J515200m97073
$$ -1223531 -689348 -338160 -18019 375976 577434 207240 15649 1237968 2753168 2256095
812B256095p94995l19767j23186n116D13728i64590p11849N08790J00975q439
$$ 2256095 1461100 1141333 1018147 1013031 413728 -964590 -1676439 -1167649 -1066674 -1075113
802a075113c43095E74058L23152K94450o6241F9134d59078I5180O87505j00132
$$ -1075113 -343095 574058 897210 1191660 1125419 69134 -459078 95180 782685 682553
792F82553G228h5857F57680M90475C69755e9553G88328L14489m54996i8911n08639
$$ 682553 7228 -85857 657680 1148155 369755 -59553 788328 1102817 647821 -98911 -607550
781f07550k17937L4432L02143D59989M47614C31697h2093l7387A28459J68978
$$ -607550 -825487 -791055 -488912 459989 907603 331697 -82093 -119480 128459 297437
771B97437I2906c31785m76273n17478L96723C15987K92491h33774j267663N84182
$$ 297437 92906 -331785 -808058 -1325536 -928813 315987 608478 -833774 -2101437 -1517255
761a517255E68578J145169F38222c01977A00653P51250L57622j73556J6826M73387
$$ -1517255 568578 1713747 638222 -301977 100653 851903 1209525 1035969 1052795 1526182
751A526182j50896m22308p5710j76137c47882q25497o693h5167G00499e70938
$$ 1526182 1375286 952978 877268 701131 -347882 -1173379 -1180072 -85167 700499 -570938
740a667272O57026a1002A09459K20370K12932j47802j82668b01045G3230N66323
$$ -1667272 -1010246 -11002 109459 329829 542761 394959 212291 -201045 73230 639553
730F39553j8644k28134A1517f84453n28224c79931F91316k48505a103465j016431
$$ 639553 620909 392775 11517 -684453 -1212677 -379931 691316 442811 -1103465 -2119896
720b119896j0556Q91315d48021K17299j5957D25704M8752j65808O66386N94824
$$ -2119896 -2130452 -1239137 -448021 -230722 -246679 425704 474456 308648 975034 1569858
710A569858m09816C78841e28832j212293q10000M39786g53200c29075j95927C12512
$$ 1569858 1160042 378841 -528832 -1741125 -2551125 -2111339 -753200 -329075 -525002 312512
699I81060m85207e02087R7923E87939K09246l58547P83766J085256Q587I30035
$$ 981060 495853 -502087 -404164 587939 797185 438638 1222404 2307660 2316247 930035
688d65859j81216L01023d0377C21670N80187K82208m6865M7634L71166q491r2644
$$ -465859 -647075 -346052 -40377 321670 901857 1184065 1137200 1184834 1556000 1547509 1454865
677A454865l04096E36285K4363O6969a38899p30804k73489n04580n45766J016750
$$ 1454865 1150769 536285 560648 627617 -138899 -869703 -1143192 -1647772 -2193538 -1176788
667a176788A21095M10505L9715K71190C30591c03460l62743k91928J90815D80356
$$ -1176788 121095 531600 571315 842505 330591 -303460 -666203 -958131 -767316 480356
656A591697M7074F93233l19169P55958P56043j71399p70221c33862a09629A380466
$$ 1591697 1638771 693233 374064 1130022 1886065 1714666 944445 -333862 -109629 1380466
645A712147E56809d86689b21732D34878d20741r39462d77022A52166e40103r09300
$$ 1712147 556809 -486689 -221732 434878 -420741 -1360203 -477022 152166 -540103 -1449403
635a449403k19383K94145K24731J17501c90542G97476M81088j76660j54691m39180
$$ -1449403 -1668786 -1374641 -1149910 -1032409 -390542 797476 1278564 1101904 947213 508033
625E08033G195d9949B84203L34759l2226A662a348930q46065Q99540a77257l25032
$$ 508033 7195 -49949 284203 618962 586736 1662 -1348930 -2194995 -1295455 -177257 -502289
614e02289j36792i4504l24601n94173N01483G95830J85732m69294B08118a27132
$$ -502289 -639081 -94504 -419105 -1013278 -511795 795830 981562 512268 208118 -127132
603i40918p06996p8690N69718J46457K25261a08176F19270j84435h32264k59182
$$ -940918 -1647914 -1726604 -1156886 -1010429 -785168 -108176 619270 434835 -832264 -1091446
593a091446c57828A12092A2160a38896j80141o1090j02798Q2739D22514O41465
$$ -1091446 -357828 112092 12160 -138896 -319037 -380127 -482925 -400186 422514 1063979
583A063979k29356H3419j913A054f86587K28319D86742J70881d0021p09624k61620
$$ 1063979 834623 83419 81506 1054 -686587 -458268 486742 657623 -40021 -749645 -1011265
572a011265o35214j249319M77162a021901L50039k85445j40878M90320B62002
$$ -1011265 -1646479 -2895798 -2418636 -1021901 -671862 -957307 -1098185 -607865 262002
562H98652J21123L83025Q0065E8870a926627o44346P51464O47588o38011l41981
$$ 898652 1019775 1402800 1482865 58870 -1926627 -2570973 -1819509 -1171921 -1809932 -2151913
552b151913L52225O34177c63614F13143P03092n54669d20323n68187L47131J43158
$$ -2151913 -1799688 -1165511 -363614 613143 1316235 761566 -420323 -988510 -641379 -498221
542d98221m62256c31793F13086H9968a133986k32066O11203j11002q19991J79541
$$ -498221 -960477 -331793 613086 89968 -1133986 -1366052 -754849 -865851 -1685842 -1506301
532a506301e72385m7253j14958m5095L34248n88474m88392e53271E20992I4429
$$ -1506301 -572385 -619638 -734596 -779691 -445443 -1033917 -1522309 -553271 520992 94429
521a084547j05194N50639q97596j344797l01486N41477L38331M0383J89941O20052
$$ -1084547 -1189741 -639102 -1536698 -2881495 -3182981 -2641504 -2303173 -2262790 -2072849 -1452797
511a452797J80070p21057M07342M54252l14319q34816r2235P94380g68525r80018
$$ -1452797 -1272727 -1993784 -1586442 -1132190 -1446509 -2281325 -2373560 -1579180 -768525 -1748543
501a748543k241533k71884J441409J005149k83698l82734j86521n9287K24498
$$ -1748543 -3990076 -4261960 -2820551 -1815402 -2099100 -2481834 -2668355 -2727642 -2503144
492b503144N15535Q8235m28667j42288L17664K30118N03925J25849j130887j884813
$$ -2503144 -1987609 -1899374 -2328041 -2470329 -2152665 -1922547 -1418622 -1292773 -2423660 -4308473
482d308473K16234O62779M5541J22649j258424o81489Q21728L61164o97780J89218
$$ -4308473 -4092239 -3429460 -3383919 -3261270 -4519694 -5201183 -4379455 -4018291 -4716071 -4526853
472d526853O59037j342623j612639m2854J10926m63619o97633k38476P32490J01283
$$ -4526853 -3867816 -5210439 -6823078 -6865932 -6755006 -7218625 -7916258 -8154734 -7422244 -7320961
462g320961j080743P4450n55230j809687k051276q99566j417609l297540j128028
$$ -7320961 -8401704 -8327254 -8882484 -10692171 -12743447 -13643013 -15060622 -18358162 -19486190
453a9486190k515752k651894j0482332o161458k1697173j43641727j36854799
$$ -19486190 -22001942 -24653836 -35136168 -41297626 -62994799 -206636526 -343491325
446c43491325J31810127A8103335M6339045k8299740n460489m959544m206599
$$ -343491325 -211681198 18103335 64442380 36142640 30682151 25722607 21516008
439B1516008m278224m064314K67485k31786j219109j424926N7752m34093k069588
$$ 21516008 17237784 13173470 13440955 13209169 11990060 10565134 10622886 10188793 8119205
430H119205j562373m59982j36915o8023Q38825J062737o51406j584211n34499
$$ 8119205 6556832 6096850 5959935 5891912 6730737 7793474 7142068 5557857 5023358
421E023358K56563O06656K78609q7727K20766j74329l89463M66316j45657k569731
$$ 5023358 5279921 5886577 6165186 6077459 6298225 6123896 5734433 6200749 6055092 3485361
411C485361A156716Q05270J190501K7356q43964k96618N79104K1816K41627J840920
$$ 3485361 1156716 1961986 3152487 3179843 2335879 2039261 2618365 2640181 2881808 4722728
401D722728N10464k350577D91484A55594a27083m4921A017289J332107J31774
$$ 4722728 5233192 2882615 491484 155594 -127083 -172004 1017289 2349396 2481170
392B481170m74910K10414J92855o93662E15532c88099j84870E12269J415615N42567
$$ 2481170 2006260 2216674 2409529 1715867 515532 -388099 -572969 512269 1927884 2470451
382B470451K32011M2244j207835E48160L23331O92437L83093J101445J24310A515922
$$ 2470451 2702462 2744706 1536871 548160 871491 1563928 1947021 3048466 3172776 1515922
371B51564C7624N61682J373546O96817K40688m68647A156147a37354C96654J870072
$$ 251564 37624 599306 1972852 2669669 2910357 2441710 1156147 -137354 396654 2266726
361B266726M00836A015291m88592Q80341K56190J6043K93937P15037N19060o76839
$$ 2266726 2667562 1015291 526699 1407040 1663230 1679273 1973210 2688247 3207307 2530468
351B530468p41009n71058o05767C00237j08441K57816Q56052n616C96932A62594
$$ 2530468 1789459 1218401 612634 300237 191796 449612 1305664 1300048 396932 162594
340A000901L0558l89515A10239e10802F7893J646580R9519p13670J56618O8936
$$ 1000901 1031459 641944 110239 -510802 67893 1714473 1813992 1100322 1256940 1325876
330A325876C23409A52170L64342a27620r66393M8622A85772J65716e04440o0029
$$ 1325876 323409 152170 516512 -127620 -1094013 -1045391 185772 351488 -504440 -564469
320e64469C4861P50140J209072Q6963G34835B03964P39804J64778g55386q43727
$$ -564469 34861 785001 1994073 2081036 734835 203964 943768 1108546 -755386 -1599113
310a599113g3107I97504m22904A98797g5103j76597R4504f4784F8898J02708b2865
$$ -1599113 -73107 997504 574600 198797 -75103 -251700 -157196 -64784 68898 171606 -22865
298b1494I19983J141164J48184m54551o36099r766j63618A02210b48941C28696
$$ -21494 919983 2061147 2209331 1754780 1118681 1108915 945297 102210 -248941 328696
287A156330m77280e62232J51334I15422r8431C5498N55877M40606m08944B71950
$$ 1156330 679050 -562232 -410898 915422 816991 35498 591375 1031981 623037 271950
276b27795q01928K14518b16056A30687e3942l73659c8786A019672L52349D70435
$$ -227795 -1029723 -815205 -216056 130687 -53942 -427601 -38786 1019672 1372021 470435
265F4791M72331j75318f55732j90659L18112m68033Q5581c40503k23031q4460
$$ 64791 537122 361804 -655732 -846391 -528279 -996312 -910731 -340503 -563534 -647994
255f47994b77749Q8987k19069E6602P08948N97542L76444G77583h46770l53211
$$ -647994 -277749 -188762 -407831 56602 765550 1363092 1739536 777583 -846770 -1199981
245a199981e34231m69134j035493N27181c78425a11044m90770o53914L46103R7944
$$ -1199981 -534231 -1003365 -2038858 -1511677 -378425 -111044 -601814 -1255728 -909625 -811681
235h11681L20720A04816k9325a71124f7672n71286K07792D61196B11219a22847
$$ -811681 -490961 104816 75491 -171124 -67672 -638958 -431166 461196 211219 -122847
224i2003n48078m27349b94342E43708L30138j64169G9594c32420o13836q47608
$$ -92003 -640081 -1067430 -294342 543708 873846 709677 79594 -332420 -946256 -1793864
214a793864J39515M71793k02854m36925M80884b5005D42952G3135c54671J19193
$$ -1793864 -1654349 -1182556 -1385410 -1822335 -1341451 -25005 442952 73135 -354671 -235478
204b35478R9881k69702j24344a21579B5767J24065c521m45827k90550j56837j78576
$$ -235478 -135597 -405299 -529643 -121579 25767 149832 -3521 -449348 -739898 -896735 -1075311
193a075311o58427k27723e29120A027837k5165m13126k58424H5086b09836o1756
$$ -1075311 -1733738 -1961461 -529120 1027837 1002672 589546 331122 85086 -209836 -271592
183b71592r6506m24333m72398j9577e12910L6554m95219M71694G52431M90508
$$ -271592 -368098 -792431 -1264829 -1284406 -512910 -476356 -971575 -499881 752431 1242939
173A242939j25356k86636l25472A92343e45099j028766J43450a45131D19934a26399
$$ 1242939 1117583 830947 505475 192343 -545099 -1573865 -1430415 -145131 419934 -126399
162b48370B41825J02231b65122j443763j334645J351396B26009Q1249f35648j39836
$$ -248370 241825 344056 -265122 -1708885 -3043530 -1692134 226009 307258 -635648 -775484
152g75484K53897J15282O4243n00035l51689e06438D05540K20729M622j69637
$$ -775484 -521587 -406305 -342062 -842097 -1193786 -506438 405540 626269 630891 461254
142D61254k22107k180J15299N8608j29314b43021n01717K52492a3830k12255A03477
$$ 461254 239147 236967 352266 410874 281560 -243021 -744738 -492246 -13830 -226085 103477
130F99508j7184A58805d17731k29560e1864E01079R5769Q7421J6189A74107k467
$$ 699508 682324 158805 -417731 -647291 -51864 501079 596848 684269 700458 174107 171640
119A71640C0401e08155h5012A005770j93251c54237j35908B8054K32472g139q81397
$$ 171640 30401 -508155 -85012 1005770 812519 -354237 -490145 28054 260526 -7139 -888536
108h88536l20348M61369c60743B23289I8430m4140P27375J79005A21471f67627
$$ -888536 -1208884 -747515 -360743 223289 98430 54290 781665 960670 121471 -667627
97a019292k50663K59652d56476B18737N61123K78286A00876a228735n35647O29846
$$ -1019292 -1269955 -1010303 -456476 218737 779860 1058146 100876 -1228735 -1764382 -1134536
87a134536c45776A79289K05665J7717K17476J37707M0929k93650d68961o86172
$$ -1134536 -345776 179289 384954 402671 620147 757854 798783 505133 -468961 -1155133
77a155133N65981B00046L16165J20663k7424k90170c5542j78342l65719l33706
$$ -1155133 -589152 200046 516211 636874 609450 319280 -35542 -213884 -579603 -913309
67i13309J11846A07941R69241L86303j47702l36432C43677A51501L08303j37921
$$ -913309 -801463 107941 1077182 1463485 1315783 979351 343677 151501 459804 321883
57C21883h44299p15198j58588O3278N68287J94177k91464r91639m36965M32077
$$ 321883 -844299 -1559497 -1718085 -1654807 -1086520 -892343 -1183807 -2175446 -2612411 -2180334
47b180334h31189C10306L88468A23464e29774a08304C18991L28726N05413l46297
$$ -2180334 -831189 310306 698774 123464 -529774 -108304 318991 647717 1153130 806833
37H06833b44917n3724D12550m7046b50385q3049j4174g7083G27379L34337m22982
$$ 806833 -244917 -298641 412550 365504 -250385 -333434 -347608 -77083 727379 1061716 638734
26F38734Q7436N59368n3372k93508L7842Q76856O04918q6268n33424k25976o26264
$$ 638734 726170 1285538 1232166 938658 976500 1853356 2458274 2372006 1838582 1612606 986342
15I86342a81172o86051L20222K07687m32012b53266A243053J33125E02660k08481
$$ 986342 -181172 -867223 -547001 -339314 -771326 -253266 1243053 1376178 502660 294179
5B94179A40023a50058j31038j16913j49653
$$ 294179 140023 -150058 -281096 -398009 -547662
0e47662
$$ -547662
##PAGE= F1=3302.124026332
##FIRST=     18110.137220953, 5591.54909048506, -1279137
##DATA TABLE= (F2++(Y..Y)), PROFILE
1023a279137K35547c66997A118863O66762q85334A89829a59077l24069k25713
$$ -1279137 -1043590 -366997 1118863 1785625 900291 189829 -159077 -483146 -708859
1014g08859a88192C37579j26244J08605j28223g02670J34139F85470K08741A93063
$$ -708859 -188192 337579 211335 319940 191717 -702670 -568531 685470 894211 193063
1003c82720l04815c27767A08476b60998o56791L16122B66083P69792j33215C09614
$$ -382720 -687535 -327767 108476 -260998 -917789 -601667 266083 1035875 902660 309614
992h7578A08959J56858e23143j144107N36405A24780J33254a02933D38321P48488
$$ -87578 108959 265817 -523143 -1667250 -1130845 124780 258034 -102933 438321 1186809
982A186809E09186a138017k60244e64555J05338J43334E64762J004582k09586
$$ 1186809 509186 -1138017 -1398261 -564555 -459217 -315883 564762 1569344 1359758
973A359758D42478A96373K55115j13530b53287q36257o49612O68116F41360R33189
$$ 1359758 442478 196373 451488 337958 -253287 -1089544 -1739156 -1071040 641360 1574549
963A574549l0445n14179A04345i26000k95754L02016K80283o71893j307239k01270
$$ 1574549 1544104 1029925 104345 -926000 -1221754 -919738 -639455 -1311348 -2618587 -2819857
953b819857J087611h32416b96670g6504G3337L14723N62220j99689b1960o12070
$$ -2819857 -1732246 -832416 -296670 -76504 73337 388060 950280 750591 -21960 -634030
943f34030D5421P29831k73617c03029l04447m91936j038599l41845h22804I35653
$$ -634030 45421 775252 501635 -303029 -607476 -1099412 -2138011 -2479856 -822804 935653
932H77379C00379D8053b73279k0086D37583N04337P5576m7000k3155J26511k09140
$$ 877379 300379 48053 -273279 -293365 437583 941920 1017496 970496 947341 1073852 864712
921H64712b2338j046927k41142M60081c08283k79182j11448a92451D18860N03528
$$ 864712 -22338 -1069265 -1310407 -850326 -308283 -587465 -698913 -192451 418860 922388
911I22388l19947k82420Q8058L2384K84089o1333c73371j22223B32254P28700
$$ 922388 602441 320021 408079 440463 724552 663219 -373371 -495594 232254 960954
901I60954j7681C80847J41821M82806D14003a82525j80134l13425o2674j95092
$$ 960954 943273 380847 522668 1005474 414003 -182525 -362659 -676084 -738758 -933850
891i33850p28689l5950d34457I95173M78381n83705j41006O25082m59779d32069
$$ -933850 -1662539 -1698489 -434457 995173 1473554 889849 748843 1373925 914146 -432069
880e43087G052g0794l22456A12354R77617M92911o05763a17206n18890b03030
$$ -543087 7052 -70794 -393250 112354 1089971 1582882 977119 -117206 -636096 -203030
869b23884j091257p36522M63570f38549g3036K1208B10430J030554J103140L2285
$$ -223884 -1315141 -2051663 -1588093 -638549 -73036 -51828 210430 1240984 2344124 2376409
859B376409A032464h75863q58734J81151M15382b73400A92048A7052c59291C723
$$ 2376409 1032464 -875863 -1734597 -1553446 -1138064 -273400 192048 17052 -359291 3723
848C58108J18800B14276F6556L15365M44171k43098j41839K14801B14077J6299
$$ 358108 476908 214276 66556 381921 826092 582994 441155 655956 214077 230376
838B30376L84422A06883d26536C05036J07594e20684l06255l37268j66078K56683
$$ 230376 614798 106883 -426536 305036 412630 -520684 -826939 -1164207 -1330285 -1073602
828a073602k67830K1687b50660D13955e11801p68015M72336a93541A83342K85071
$$ -1073602 -1341432 -1319745 -250660 413955 -511801 -1279816 -807480 -193541 183342 468413
818D68413J07000G6167b92844F92309J440336j88229m28640j48985j18485m85106
$$ 468413 575413 76167 -292844 692309 2132645 1944416 1515776 1366791 1248306 763200
808G63200b55884j128195m73778L41212N3787L29906c77711A99159L59054L76082
$$ 763200 -255884 -1384079 -1857857 -1516645 -1462858 -1132952 -377711 199159 558213 934295
798I34295l87245c74036k78795g9745F31737E1440d70324a77074E66520M07890
$$ 934295 547050 -374036 -652831 -79745 631737 51440 -470324 -177074 566520 974410
788I74410C09023a02998D67287K89067B56933f21326n65074m06008l26151L99255
$$ 974410 309023 -102998 467287 756354 256933 -621326 -1186400 -1592408 -1918559 -1519304
778a519304b4733A031683k24179k42584B67523K04405M8585A70576b25125k90391
$$ -1519304 -24733 1031683 807504 564920 267523 471928 520513 170576 -225125 -515516
768e15516k66884J69797B84116K75760e74461j077864K86654E23024J000623C37109
$$ -515516 -782400 -612603 284116 559876 -574461 -1652325 -1365671 523024 1523647 337109
757e58611a21889F36033N45293m00096l69002M14707M36065j62529E43225C2239
$$ -558611 -121889 636033 1181326 781230 412228 826935 1263000 1100471 543225 32239
746f33611n19287J9940b32109D03410h66845r74975O07956e50830b70742B87866
$$ -633611 -1152898 -1132958 -232109 403410 -866845 -1841820 -1233864 -550830 -270742 287866
735G63225O8323D06261e20495K54932F65632J70020l80719h7732r00783p14042
$$ 763225 831548 406261 -520495 -265563 665632 835652 454933 -87732 -988515 -1702557
725a702557g55199A031200K20699f75535j547667l1351a095127c48661j96052
$$ -1702557 -755199 1031200 1251899 -675535 -2223202 -2254553 -1095127 -348661 -544713
716e44713J548E01464J80563l36838M94877M89066k04577A60265a083001j318049
$$ -544713 -543165 501464 682027 345189 840066 1329132 1124555 160265 -1083001 -2401050
706b401050n12354N70929i74726b88457J3809D06504L88865A83083f94467P6362
$$ -2401050 -2913404 -2342475 -974726 -288457 -274648 406504 795369 183083 -694467 -618105
696f18105B17124L11334K7275R41717Q46841k38804I46911c53006j59569c8656
$$ -618105 217124 528458 555733 1497450 2344291 2105487 946911 -353006 -512575 -38656
685H51327R36965K23988m55628l86113N3375J57210J40219O6617l57813E03101
$$ 851327 1788292 2012280 1556652 1170539 1223914 1381124 1521343 1587960 1230147 503101
674C01998A28074f32087m35811L4648m32693o34023Q82632A51706O92947k8769
$$ 301998 128074 -632087 -1067898 -1033250 -1465943 -2099966 -1217334 151706 844653 815884
664H15884j49874B94924a4955m16165j84927K99892C84884O28291J58594D76872
$$ 815884 666010 294924 -14955 -431120 -616047 -316155 384884 1013175 1171769 476872
653A01482M67833N57264J36369k80233a75940k0343I94508K74345C79327b26081
$$ 101482 569315 1126579 1262948 982715 -175940 -196283 994508 1268853 379327 -226081
642D28829O00172F0471h41699a00074C54405e14008j078557k79781L18374K62097
$$ 428829 1029001 60471 -841699 -100074 354405 -514008 -1592565 -1872346 -1553972 -1291875
632a291875J81103d89014G34708N94781O2556J5105n35158c2049k90047C22484
$$ -1291875 -1110772 -489014 734708 1329489 1392045 1407150 871992 -32049 -322096 322484
621A073401M3172I3658a427717q88163P72674d07599k7938J05477G6618c63542
$$ 1073401 1116573 93658 -1427717 -2315880 -1543206 -407599 -435537 -330060 76618 -363542
610e44873A34458J015165k38603m26249J1338A51492h02449q95904j81390Q31936
$$ -544873 134458 1149623 911020 484771 496109 151492 -802449 -1698353 -1879743 -1047807
600a047807d89249J59158a55201D04904p0963g52007J68249D83101M09614D43321
$$ -1047807 -489249 -330091 -155201 404904 333941 -752007 -583758 483101 892715 443321
589d3647r3084G4588d39433m44164b05575H46215Q1594B30206m7809p7320f75412
$$ -43647 -136731 74588 -439433 -883597 -205575 846215 927809 230206 182397 105077 -675412
577f43876A34945L89320C7013e60319l07690p98575j310590M57837a105352L64854
$$ -643876 134945 524265 37013 -560319 -868009 -1666584 -2977174 -2519337 -1105352 -740498
567g40498l04662j01469M15957G2513N63745J83038M49211K14102E20474h59656
$$ -740498 -1045160 -1146629 -730672 72513 636258 819296 1268507 1482609 520474 -859656
556a361934K19176M80641J1174J18078J4241j89038Q1499a932H66794r3189a62381
$$ -1361934 -1142758 -662117 -650943 -532865 -518624 -707662 -626163 -1932 866794 773605 -162381
544d49623a4495q0651o23823e9288A021994D78406g00886r335A52986b28498r19075
$$ -449623 -14495 -95146 -718969 -59288 1021994 478406 -700886 -710221 152986 -228498 -1147573
533a147573M19578G6326P7263f4583q0922B29254a74136k76519E48941J000170
$$ -1147573 -727995 76326 153589 -64583 -145505 229254 -174136 -450655 548941 1549111
523A549111n44152c44329m84649L41253q67952j251394j71904O27970M39150O6006
$$ 1549111 1004959 -344329 -828978 -487725 -1355677 -2607071 -2778975 -2151005 -1711855 -1645849
513a645849J35768O26657K95170n40846K35783K36382r712m12899r7832J28310
$$ -1645849 -1510081 -883424 -588254 -1129100 -893317 -656935 -666647 -1079546 -1177378 -1049068
503a049068K83021r35371j792378j19679J633718i71876o21507m62865N7538n1864
$$ -1049068 -766047 -1701418 -3493796 -3613475 -1979757 -971876 -1593383 -2056248 -1998710 -2050574
493b050574M21914g66640k10503o82983q1743M36908L66653a69128N7813j169147
$$ -2050574 -1628660 -766640 -977143 -1660126 -1741869 -1304961 -938308 -169128 -111315 -1280462
483a280462j713110J42398K79545K35781Q14718p82375r20907O42546L53525p49240
$$ -1280462 -2993572 -2851174 -2571629 -2335848 -1521130 -2303505 -3224412 -2581866 -2228341 -2977581
473b977581J17238M06047j097698j131940N89204J025524m07385q85576q73995
$$ -2977581 -2860343 -2454296 -3551994 -4683934 -4094730 -3069206 -3476591 -4362167 -5236162
464e236162O4239Q04789N31818N06378n73839j455270j750832j09756K65334o67076
$$ -5236162 -5171923 -4367134 -3835316 -3328938 -3902777 -5358047 -7108879 -7218635 -6953301 -7620377
454g620377n48792j710626j443882o627809l359319r178382p0711293o7981664
$$ -7620377 -8169169 -9879795 -11323677 -17951486 -21310805 -30489187 -101200480 -169182144
446a69182144O6787327A3294700K2509939j4962801l110400l103442k134806j703608
$$ -169182144 -102394817 13294700 35804639 20841838 17731438 14627996 12493190 10789582
438A0789582k242241m96661J22987P2802n84332R3545q90052j776061n73847L40556
$$ 10789582 8547341 8050680 8173667 8246469 7662137 7755682 6865630 5089569 4515722 4856278
428D856278L9329r2890N66329M77510p54369j036427k63985K18783O64775K93644
$$ 4856278 4895607 4802717 5369046 5846556 5092187 4055760 3791775 4010558 4675333 4968977
418D968977k84471m81671m27693k88981Q15379j22398A813339A81397J071353
$$ 4968977 4684506 4202835 3775142 3486161 4301540 4179142 1813339 181397 1252750
409A252750J064212Q3967q29203o30135K74528r5386P27819K121413N28960k216734
$$ 1252750 2316962 2400929 1571726 941591 1216119 1120733 1848552 3969965 4498925 2282191
399B282191h8241m81939q3209b50916G42351P80205K45182L4308L56758j03218
$$ 2282191 -88241 -570180 -653389 -250916 742351 1522556 1767738 1802046 2158804 2055586
389B055586r43342i3485q26641j85989a75416A066633M30902J58807o5920C36630
$$ 2055586 1112244 -93485 -920126 -1106115 -175416 1066633 1497535 1656342 1590422 336630
378e25783J88438A30502O27318J643473M91718A409715A97559a20723B14007J036763
$$ -525783 -337345 130502 757820 2401293 2893011 1409715 197559 -120723 214007 1250770
368A250770N08639L2785l91089C30350f34427C08524J988520K95068H07549A34744
$$ 1250770 1759409 1792194 1401105 330350 -634427 308524 2297044 2592112 807549 134744
357H67281M12559K08655L49428L37706l63628G67266j24973J40861B14096b49437
$$ 867281 1279840 1488495 1837923 2175629 1812001 767266 642293 783154 214096 -249437
346b44799A78964P96427l68040c27102j38925E36725J19924j07725A94038c76490
$$ -244799 178964 975391 607351 -327102 -466027 536725 656649 548924 194038 -376490
335H0876J361861M3095o99055Q7353J08211d0147n29972b27045k33486q38202
$$ 80876 1442737 1485832 786777 874130 982341 -40147 -570119 -227045 -460531 -1298733
325a298733k44664f27477J24934n14397Q1428J76504b59941A047808M24011C97184
$$ -1298733 -1543397 -627477 -502543 -1016940 -935512 -759008 -259941 1047808 1471819 397184
314a58088D21086N48750d07901j018356c81628G04080K2735B99284b62256k73012
$$ -158088 421086 969836 -407901 -1426257 -381628 704080 726815 299284 -262256 -535268
304e35268J46375k412a75550A57664A4454f1838H83286R63896k35591n31849J14789
$$ -535268 -388893 -391305 -175550 157664 14454 -61838 883286 1847182 1611591 1079742 1194531
293A194531L71769o63625e37980k05877D44013J095175G65814g72405n2912h0810
$$ 1194531 1566300 902675 -537980 -743857 444013 1539188 765814 -772405 -825317 -80810
282c5539j54G93861L55175m79129j71977k42928e00985R4612f5512I8272m4401
$$ -35539 -35693 793861 1149036 669907 497930 255002 -500985 -406373 -65512 98272 53871
271E3871c75669Q5090H62653O22307n64089k93138R3092a08910j121143R9297
$$ 53871 -375669 -290579 862653 1484960 920871 627733 720825 -108910 -1230053 -1130756
261a130756K91472o40876M37370c1440r6356j12903a01567k47864m49861L00705
$$ -1130756 -839284 -1480160 -1042790 -31440 -127796 -240699 -101567 -349431 -799292 -498587
251d98587A90160P53838M80580D27508i92417k11777N92040l96487j143059M14484
$$ -498587 190160 943998 1424578 427508 -992417 -1204194 -612154 -1008641 -2151700 -1737216
241a737216c79869C73424C9291h16903K14332K3220b73167D69533N1205A27970
$$ -1737216 -379869 373424 39291 -816903 -602571 -579351 -273167 469533 520738 127970
230A32115e40970j11175a2663j13979J8743A33973e53939o51101M59730b95122
$$ 132115 -540970 -652145 -12663 -126642 -107899 133973 -553939 -1205040 -745310 -295122
219B8579J76181e7530j75596o90275j002417J9629N97293o4162n12375K06701
$$ 28579 204760 -57530 -233126 -923401 -1925818 -1906189 -1308896 -1373058 -1885433 -1678732
209a678732e78571a76114j11522j58591M3838J09763l9294j37056g5725C49153
$$ -1678732 -578571 -176114 -287636 -446227 -402389 -292626 -331920 -468976 -75725 349153
198E69187j26444B1260d37103l59912l02241p21497j17317a16353A422508l6348
$$ 569187 442743 21260 -437103 -797015 -1099256 -1820753 -1938070 -116353 1422508 1386160
188A386160k50932m63601A99516c6735j54890k04255n12655q79376n74774R29404
$$ 1386160 1135228 671627 199516 -36735 -191625 -395880 -908535 -1787911 -2362685 -1433281
178a433281O86233J59574F4528P36674p4342j94128R9289j95666b29715q11365
$$ -1433281 -747048 -587474 64528 801202 726860 532732 632021 436355 -229715 -1041080
168a041080m04364f68442A124687M89837E35208G1276M28468M1939a15602j188287
$$ -1041080 -1445444 -668442 1124687 1614524 535208 71276 499744 541683 -115602 -1303889
158a303889q59502i27276E99652k05541f01352n8007K86124g4744B75348d01501
$$ -1303889 -2163391 -927276 599652 394111 -601352 -659359 -373235 -74744 275348 -401501
147a183907d33747F13835m052j68196R1820M9884j08162o1432Q2645A25592i85041
$$ -1183907 -433747 613835 609783 441587 533407 583291 475129 413697 496342 125592 -985041
135a549791M27995M45631J84774B69295O85286R1400j22083B60426e19378g9665
$$ -1549791 -1121796 -676165 -491391 269295 954581 1045981 923898 260426 -519378 -79665
124I18064M25001M1373j15057E96111B36815e6904m90259K34572E64821R9117
$$ 918064 1343065 1384438 1269381 596111 236815 -56904 -547163 -312591 564821 663938
114F63938g0330K8125C78838M1382C376i56893k18515d69714B71943N96114C10687
$$ 663938 -70330 -42205 378838 420220 3376 -956893 -1175408 -469714 271943 868057 310687
102E8789Q41226P336b09562p37312j50150k46823K93605c06385B76766O9245n9892
$$ 58789 900015 907351 -209562 -946874 -1097024 -1343847 -1050242 -306385 276766 346011 286119
91B86119d58378j108154l26505i00328A00018L78456m8575Q379M53832K22405
$$ 286119 -458378 -1566532 -1893037 -900328 100018 478474 429899 438278 892110 1114515
81A114515l06942C61118d96847n88982d59556E12154L75683K9964j23146k95223
$$ 1114515 807573 361118 -496847 -1085829 -459556 512154 887837 917801 794655 499432
71D99432a44347m17110m6027K7147k23974b72022I94798Q93213P2946m26650G19586
$$ 499432 -144347 -561457 -607484 -580337 -804311 -272022 994798 1888011 1960957 1534307 719586
59A23094k5870l7594h28624m74747J45647K25052J08298j08071n06590q95515
$$ 123094 97224 59630 -828624 -1303371 -1157724 -932672 -824374 -932445 -1439035 -2334550
49b334550m39876M98960J114223a83902C04075d7243p93747K00350b34160I7024
$$ -2334550 -2774426 -2275466 -1161243 -183902 304075 -47243 -840990 -640640 -234160 97024
38H99695K29400D26197A80865M62293O4513D3886c64531o470e9760B84241L41791
$$ 899695 1129095 426197 180865 643158 707671 43886 -364531 -371001 -59760 284241 626032
27F26032P6682K61825M75965k36607m73173L22696J244302M46332m33352q24559
$$ 626032 702714 964539 1440504 1203897 730724 1053420 2297722 2744054 2310702 1486143
17A486143n14750A20584h59781j37309c87211q9408o42039M20007G58088L90044
$$ 1486143 971393 120584 -859781 -997090 -387211 -476619 -1118658 -698651 758088 1148132
7A148132E24341j18248j19366b30012n65139k27733Q3830
$$ 1148132 524341 406093 286727 -230012 -795151 -1022884 -939054
0i39054
$$ -939054
##PAGE= F1=3280.506488821
##FIRST=     18110.137220953, 5591.54909048506, -1463597
##DATA TABLE= (F2++(Y..Y)), PROFILE
1023a463597J41323b56479A540669M04664F23672f6397k86925m35592k49295b34369
$$ -1463597 -1322274 -256479 1540669 1945333 623672 -66397 -353322 -788914 -1038209 -234369
1012G82762J00435j48015C14187h09655j97724A18364L52909E5205c62452m60243
$$ 782762 883197 735182 314187 -809655 -1007379 118364 471273 55205 -362452 -822695
1002h22695R4986c20719k14262n24246L83121B37540Q31038o0620D46173H6691
$$ -822695 -727709 -320719 -534981 -1059227 -676106 237540 1068578 1007958 446173 86691
991D30588K06901a92680r90336N16636B80162Q3147g0648A36099Q40127p8742
$$ 430588 637489 -192680 -1183016 -666380 280162 363309 -70648 136099 976226 897484
981H97484c78947m96225J36532k53762L43719E25372J044126p9163F33904B63343
$$ 897484 -378947 -875172 -738640 -992402 -648683 525372 1569498 1490335 633904 263343
970E01849P6817k70835b36686k86438A07712J221900N64268k98191n49130A06467
$$ 501849 578666 307831 -236686 -523124 107712 1329612 1893880 1595689 1046559 106467
959a013122m62366M69726c86137m75595j168497k48109O86219N97201L99729b34401
$$ -1013122 -1475488 -1005762 -386137 -861732 -2030229 -2278338 -1592119 -994918 -595189 -234401
948b9221A69015P37041M4065I231f96201C70109J118200p34491c04165P790m79105
$$ -29221 169015 906056 950121 9231 -696201 370109 1488309 753818 -304165 -296375 -775480
937g75480j360458l39695g58947H24273j43874I0905g9566p1181O6992D36930
$$ -775480 -2135938 -2475633 -758947 824273 680399 90905 -79566 -150747 -83755 436930
926H38482m4419P3379M98782K29426G72752c04750n55441j84147J1996J76452
$$ 838482 794063 867442 1366224 1595650 772752 -304750 -860191 -1044338 -1032342 -855890
916h55890k430c82058B81284J70922J61281B08376q9618M88066L6577J28433K087
$$ -855890 -858320 -382058 281284 452206 613487 208376 118758 606824 643401 771834 773921
905G73921c94319j98336G32572J007979o10695A98845M14748O87410F17664c6274
$$ 773921 -394319 -592655 732572 1740551 1129856 198845 613593 1301003 617664 -36274
894d6120k22808j49354l24322r47016M3089G7306J866482K23767H21650H8946
$$ -46120 -268928 -418282 -742604 -1689620 -1646531 77306 1943788 2167555 821650 88946
883H72502J17568b29051k15000A99608g6390q11389b83067A226490P68393p42465
$$ 872502 990070 -229051 -444051 199608 -76390 -887779 -283067 1226490 1994883 1252418
873A252418A854f93696K80930j6602j000035q18421L30397i22069a3897D30898
$$ 1252418 1854 -693696 -412766 -429368 -1429403 -2247824 -1917427 -922069 -13897 430898
862G61440O22822P87101j8341G97391g43575m35572K62817J13045c26242c7309
$$ 761440 1384262 2171363 2153022 797391 -743575 -1179147 -916330 -803285 -326242 -37309
851a14749l31088a42523B94458J03162h4460l75365d6387G79188m4616k40349
$$ -114749 -445837 -142523 294458 397620 -84460 -459825 -46387 779188 734572 494223
841D94223B37263d96553N1633A50776h6635m23100A26512L45545c19588n60400
$$ 494223 237263 -496553 -444920 150776 -86635 -509735 126512 472057 -319588 -879988
831h79988l67582j41924n2749m38215K6907h38407D3369d82695p64939M98592
$$ -879988 -1247570 -1389494 -1442243 -1880458 -1853551 -838407 43369 -482695 -1247634 -749042
821g49042A22200K70400p236J11490A89226b48252B10987J131767K45914j55916
$$ -749042 122200 392600 385364 496854 189226 -248252 210987 1342754 1588668 1432752
811A432752q5723j68304B60902a053774p22922O962K71624J7126M91510d90092
$$ 1432752 1347029 1178725 260902 -1053774 -1776696 -1769734 -1498110 -1480984 -989474 -490092
800c13885I6737M26716a67503q44775M6655b00642B49077f06734j95279a71683
$$ -313885 96737 523453 -167503 -1012278 -965623 -200642 249077 -606734 -802013 -171683
789E26624L80742l87254A33250J10129M7063a76539q28760n50119n04488o96984
$$ 526624 907366 520112 133250 243379 290442 -176539 -1005299 -1555418 -2059906 -2756890
779b756890L10400f56613H78288K05671N5704l56753j20147j32857B45860C210
$$ -2756890 -2446490 -656613 878288 1083959 1139663 782910 662763 529906 245860 3210
768C2016h101j47840A22951K26474b19835o83683l6936E25629O85834B2514g47549
$$ 32016 -8101 -155941 122951 349425 -219835 -903518 -940454 525629 1211463 22514 -747549
756d39349A05526N08508B69491a14588C29301R09445j12354C2027f45801j65341
$$ -439349 105526 614034 269491 -114588 329301 1238746 1126392 32027 -645801 -811142
746h11142k85181q0838d81213H731i75490o90665L73948J98413L88374A83721
$$ -811142 -1096323 -1177161 -481213 8731 -975490 -1666155 -1292207 -1093794 -705420 183721
735H65935K73120n27594e53590K25484G34640K49942D15515b16583r02127r14206
$$ 865935 1139055 611461 -553590 -328106 734640 984582 415515 -216583 -1118710 -2032916
725b032916Q38890A076424N71291d79857j863456K10911g06761a31562n59680
$$ -2032916 -1194026 1076424 1647715 -479857 -2343313 -2132402 -706761 -131562 -691242
716f91242k9654C79049L50365l61076K07650K00158j0998b06554j363448j130533
$$ -691242 -720896 379049 729414 368338 575988 776146 765148 -206554 -1570002 -2700535
706b700535j45036N71604a049302a99851d902D52060J24797a59784p53052J53797
$$ -2700535 -2845571 -2273967 -1049302 -199851 -4902 452060 576857 -159784 -912836 -759039
696g59039a31918D5036L76640R85021M50956m50449o88803a24664e3090F83398
$$ -759039 -131918 45036 421676 1406697 1857653 1407204 718401 -124664 -53090 683398
685A987320J073634k93750j043876o30011N0457l2374K83284j870l91722D23704
$$ 1987320 3060954 2767204 1723328 1093317 1143774 1111400 1394684 1392814 1001092 423704
674A38189b48276o64916j04795L90775k83894o67979N74008B17667Q84193l2227
$$ 138189 -248276 -913192 -1017987 -627212 -911106 -1579085 -1005077 217667 1101860 1069633
664A069633m58879k37876r0440b91829j57480B0627K09630J40046K66093B32322
$$ 1069633 610754 372878 282438 -291829 -449309 20627 230257 370303 636396 232322
653c44294P4770B30208M81236J69609G7887a08961F06822J90204A82929e5855
$$ -344294 -269524 230208 711444 881053 77887 -108961 606822 797026 182929 -55855
642A022609O81303F77835a41463B59851K80107b80010j009465l65418K06278K89058
$$ 1022609 1703912 677835 -141463 259851 539958 -280010 -1289475 -1654893 -1448615 -1159557
632a159557J37690M17976D12988P01405M15207N02718l86651B43382e07751B76360
$$ -1159557 -1021867 -603891 412988 1114393 1529600 2032318 1645667 243382 -507751 276360
621A162782j4561H4073a268008r75583N13524g13212L01357a54502A08194b18139
$$ 1162782 1148221 84073 -1268008 -2243591 -1730067 -713212 -411855 -154502 108194 -218139
610A50954Q64040M40324o55497l91958K53636k91760f22807j033970k67644h48501
$$ 150954 1014994 1455318 799821 407863 661499 369739 -622807 -1656777 -1924421 -848501
599A59084J59970H165K47659N983d56921b07681H45720M73640m01606B74072K9049
$$ 159084 319054 8165 255824 261807 -456921 -207681 845720 1319360 917754 274072 303121
588C03121L09430c27254q38868N73532F26696L04548D59594K6995j8579c26999
$$ 303121 612551 -327254 -1166122 -592590 626696 931244 459594 486589 468010 -326999
577e60788H468N51311A66558c87520k53630r01742j176192M53476h71305c73217
$$ -560788 8468 559779 166558 -387520 -641150 -1542892 -2719084 -2265608 -871305 -373217
566e09701o4452k970a66623A31928K92762N40954L10127n22054d9741k38367j31402
$$ -509701 -574153 -577123 -166623 131928 424690 965644 1275771 753717 -49741 -288108 -419510
555d19510Q9493I8998N60253L8344G3615e66783M2418B43134L17156B04274K73421
$$ -419510 -330017 98998 659251 697595 73615 -566783 -524365 243134 560290 204274 477695
544D77695M66866D55972c42174A36357J116377k89151f1409j23528E41929A57628
$$ 477695 944561 455972 -342174 136357 1252734 963583 -61409 -184937 541929 157628
533f29645b91913C78307N28481k67014j24540M46094j91035l25624P87616J102552
$$ -629645 -291913 378307 906788 639774 515234 961328 770293 444669 1232285 2334837
523B334837l33792F28479c55284Q3770n71591j078436j90820N54204N51504N9813
$$ 2334837 2001045 628479 -355284 -271514 -843105 -1921541 -2112361 -1558157 -1006653 -946840
513i46840P9985a21942C71193i4630r14G412R1500i7960N866k24211j76077q10130
$$ -946840 -866855 -121942 371193 -94630 -95544 7412 98912 -97960 -92094 -316305 -492382 -1302512
501a302512j107739O7028g60837B9056h01898m60659K75558P8036M51248A50654
$$ -1302512 -2410251 -2343223 -760837 29056 -801898 -1262557 -986999 -908963 -457715 150654
490d78022o51680M7724d96239A43686J016742o0668a37513j304577M7646j43933
$$ -478022 -1129702 -1081978 -496239 143686 1160428 1099760 -137513 -1442090 -1394444 -1538377
480a538377L79559A31092i3189j070189M67169c46585p13237P3190N0617n99858
$$ -1538377 -1158818 131092 -93189 -1163378 -696209 -346585 -1059822 -986632 -936015 -1535873
470a535873m63054Q47193B19045b51138j079822j176626k85197a369477B11938
$$ -1535873 -1998927 -1151734 219045 -251138 -1330960 -2507586 -2792783 -1369477 211938
460E90481I6136d55036o10344M48217a87049D29535e32272j105440M71818k186676
$$ 590481 96136 -455036 -1065380 -617163 -187049 429535 -532272 -1637712 -1165894 -3352570
450c352570j262029k369414k0644342j8251152K2055306H258996P186942o152628
$$ -3352570 -4614599 -6984013 -27628355 -45879507 -23824201 8258996 15445938 9293310
442I293310j911851k268224r06254J019911l26230j539394J99280J347445Q628
$$ 9293310 7381459 5113235 4206981 5226892 4900662 3361268 3560548 4907993 4916621
433D916621k86397j394869j359870M21910R81278J27330r2687L53038j3218n38553
$$ 4916621 4630224 3235355 1875485 2297395 3278673 3406003 3313316 3666354 3653136 3114583
423C114583l31843j36168J342N71549L44939m78743j195445n50711p4033J426036
$$ 3114583 2782740 2646572 2647914 3219463 3564402 3085659 1890214 1339503 1265470 2691506
413B691506J86173D59274f40649F18219R86029J57328p05105H3675b0802o4664
$$ 2691506 2877679 459274 -640649 618219 1604248 1761576 1056471 83675 -20802 -85466
403h5466A029076K408114P18005B055936c50121p66596N9517a95408F38738J76922
$$ -85466 1029076 3437190 4155195 2055936 -350121 -1116717 -1057200 -195408 638738 815660
393H15660K98787N51340N26372l67022G74391c11049p52664j64394d89268C20036
$$ 815660 1114447 1665787 2192159 1825137 774391 -311049 -1063713 -1228107 -489268 320036
382D66045L3291B25116h55937o91165j2640K18625d17426A589865Q13674A117935
$$ 466045 499336 225116 -855937 -1547102 -1559742 -1341117 -417426 1589865 2403539 1117935
371H499b75691a14752D72382K74706k29347k41755c67134n50347B59002J932013
$$ 8499 -275691 -114752 472382 747088 517741 275986 -367134 -917481 259002 2191015
361B191015L09030H11801h1429C11353M52643L49275L56274q2989D14330e46426
$$ 2191015 2500045 811801 -81429 311353 763996 1113271 1469545 1386556 414330 -546426
350b00910D42793a19193p11511R2182a29236D92026h6460o77040M8794C97465
$$ -200910 442793 -119193 -830704 -738522 -129236 492026 -86460 -763500 -714706 397465
339E27014P7781k99188b53619E1864J069828J01670D96452m6344L54308B59989
$$ 527014 604795 305607 -253619 51864 1121692 1223362 496452 450108 804416 259989
328f83943j71233J19233n78654m24485M82886J29218O8237L35546k57091J53832
$$ -683943 -855176 -735943 -1314597 -1739082 -1256196 -1126978 -1058741 -723195 -980286 -826454
318h26454C33311O04410B50864c05262g101H14523A74492g51224b86571C86262
$$ -826454 333311 937721 250864 -305262 -7101 814523 174492 -751224 -286571 386262
307G24617l34559b32451k97941J00800q2660b26727B82158p89A26440P64095N41392
$$ 724617 390058 -232451 -530392 -429592 -512252 -226727 282158 281369 126440 890535 1431927
296A431927n94268C59824P86033P19648G25875a159143J5680F44871J234640H83200
$$ 1431927 837659 359824 1145857 1865505 725875 -1159143 -1143463 644871 1879511 883200
285g86739k07138K48549K83462A34185R26117K13320m98069J7542L6757B42649
$$ -786739 -993877 -745328 -461866 134185 1060302 1273622 775553 793095 829852 242649
274C44264J56845B20164H9094b18131N080H71424P23266j73498j34565n34381
$$ 344264 501109 220164 89094 -218131 -213051 871424 1594690 1421192 1286627 752246
264G52246g46443r65005M31744K47799n99551Q00494D68023N2703j03718j74498
$$ 752246 -746443 -1711448 -1279704 -1031905 -1631456 -830962 468023 520726 417008 242510
254B42510c32225o21489O8025c01390F34678N32870A89760h39922R594c40463
$$ 242510 -332225 -953714 -885689 -301390 634678 1167548 189760 -839922 -830328 -340463
243e22429j051761P2390b93456H09598p4101a19049j4335j5850B10410Q41114
$$ -522429 -1574190 -1501800 -293456 809598 735497 -119049 -133384 -149234 210410 1051524
233A051524N0959D76595j94996d42802l79257K32208j5448a37842C42120c16808
$$ 1051524 1102483 476595 281599 -442802 -822059 -589851 -605299 -137842 342120 -316808
222a061901N4960k9901K46196b88507a34770j19697p61788q58205R0755O73627
$$ -1061901 -1006941 -1036842 -790646 -288507 -134770 -254467 -1016255 -1874460 -1783705 -1110078
212a110078J09975l57596j38954O13055K65696J38340J55318N9202R9381O9417
$$ -1110078 -1000103 -1357699 -1496653 -883598 -617902 -479562 -324244 -265042 -165661 -96244
202i6244j70620F9641O15811K80919j30606k83599A17077d11868m83241o68272
$$ -96244 -266864 69641 685452 966371 835765 552166 117077 -411868 -895109 -1563381
192a563381M9714B65439J185014J6119o3229n55048C85317o8692b6174m05435
$$ -1563381 -1513667 265439 1450453 1466572 1403343 848295 385317 316625 -26174 -431609
182d31609m83125j005952q12409Q48258g62010c8487F81188K83264l52802j81555
$$ -431609 -914734 -1920686 -2733095 -1884837 -762010 -38487 681188 964452 611650 430095
172D30095K27284j93433c67696p46514J14318B02231J948148K17880A033484D57135
$$ 430095 657379 463946 -367696 -1114210 -999892 202231 2150379 2368259 1033484 457135
161F97905k04336a10358n60698q4834E5824Q34514m03872c82878n0941a94333
$$ 697905 493569 -110358 -671056 -755890 55824 890338 486466 -382878 -433819 -194333
150B97756N25023b8693j067200b82493H83989k1540k89113J57167J32069k48559
$$ 297756 822779 -28693 -1095893 -282493 883989 862449 573336 730503 862572 614013
140F14013k14855J31790A4823a197215n00409M49929K85632M41922D44107O53002
$$ 614013 399158 530948 14823 -1197215 -1697624 -1247695 -962063 -520141 444107 1097109
130A097109J6733K11857F60347d36578a05389A234763P03224o8848k90186o94685
$$ 1097109 1113842 1325699 660347 -436578 -105389 1234763 1937987 1869139 1578953 884268
120H84268B76337a03379m93139n1478F518N42266j40025J86279J31506k56123
$$ 884268 276337 -103379 -596518 -647996 6518 548784 408759 595038 726544 470421
110D70421F8722g32285j75283a73142H48955O62285F23728A84513R03722j58966
$$ 470421 68722 -732285 -907568 -173142 848955 1511240 623728 184513 1088235 929269
100I29269e48780p05677J12708j97069K88041b46097B11239f9776k94996n23941
$$ 929269 -548780 -1254457 -1141749 -1338818 -1050777 -246097 211239 -69776 -364772 -888713
90h88713p91391j9071e56393C28826J96187j04600N551M92080K38776m68780C20130
$$ -888713 -1680104 -1699175 -556393 328826 525013 420413 425964 918044 1156820 688040 320130
78c20428m95575a29259A052521L41055k67361l09695l50278c05170n00187K22725
$$ -320428 -816003 -129259 1052521 1393576 1126215 816520 466242 -305170 -805357 -582632
68e82632b28593l88944J15682G66179J261628L38928l42576r70132H5864a60246
$$ -582632 -228593 -617537 -501855 766179 2027807 2366735 2024159 1054027 85864 -160246
57C8006f17439l58804M18957a49831k27746m59451o69169p26562m34637L64096
$$ 38006 -617439 -976243 -557286 -149831 -377577 -837028 -1506197 -2232759 -2667396 -2303300
47b303300P68614P41441b79425j29505p12039M8429M71777b46893F69157O56087
$$ -2303300 -1534686 -793245 -279425 -408930 -1120969 -1072540 -600763 -246893 669157 1325244
37A325244l83265m51649K25613K96086C72029b88539k668D1048g0010A16389N82535
$$ 1325244 941979 490330 715943 1012029 372029 -288539 -291207 41048 -70010 116389 698924
26F98924L73210K52105m53034C14583N20844J302953L62316o40228q98189B14507
$$ 698924 1072134 1324239 871205 314583 835427 2138380 2500696 1860468 962279 214507
15g53914o02039M92636f7093l77925p71238K04721A15241O28222k04892k0076
$$ -753914 -1355953 -863317 -67093 -445018 -1216256 -1011535 115241 743463 538571 518495
5E18495r0310b78654r63820k83008L86431
$$ 518495 428185 -278654 -1242474 -1525482 -1139051
0a139051
$$ -1139051
##PAGE= F1=3258.888951311
##FIRST=     18110.137220953, 5591.54909048506, -1407793
##DATA TABLE= (F2++(Y..Y)), PROFILE
1023a407793j0481b28676A493490M7815A12280c92991j29477m26553l18043d06251
$$ -1407793 -1418274 -228676 1493490 1541305 112280 -392991 -522468 -949021 -1267064 -406251
1012H91577L91646l40890A62821a023445m00031e78835a61456J0909j69362o54856
$$ 891577 1283223 942333 162821 -1023445 -1423476 -578835 -161456 -150547 -319909 -974765
1002i74765j20068N17671l928m10058K91502A70055Q67967L5604m69615B91693
$$ -974765 -1094833 -577162 -581090 -991148 -699646 170055 1038022 1073626 604011 291693
991D53997O8387a43233o53467b98616B36830P4893A65c2522G03039M29362C53958
$$ 453997 522384 -143233 -796700 -298616 236830 311723 165 -32522 703039 1132401 353958
979b94798n35210n59020M49741A95971Q26998J36059n54202B90694K13387J82086
$$ -294798 -830008 -1389028 -939287 195971 1022969 1159028 604826 290694 504081 686167
969F86167Q8693j08113J5476M21841N89321J65276n30902n41552I7839h56930
$$ 686167 774860 666747 682223 1104064 1693385 1858661 1327759 786207 97839 -856930
958a466076N20979d0651k12267r64499l63871K20717K07446J80062M46276K53609
$$ -1466076 -945097 -40651 -252918 -1217417 -1581288 -1360571 -1153125 -973063 -526787 -273178
948b73178D892Q64497K80436H3629f41379F92897J237690H12912b66763B6395
$$ -273178 4892 869389 1149825 83629 -641379 692897 1930587 812912 -266763 26395
937d79266j426129j71892f70430D81753J0498G9001e9956A52009J93830K00617
$$ -479266 -1905395 -2077287 -670430 481753 492251 79001 -59956 152009 345839 546456
927E46456K32257p0623J71185Q31356K25213F83938c56565Q292j41143m60780
$$ 546456 778713 708090 879275 1710631 1935844 683938 -356565 -348273 -489416 -950196
917i50196j62340L24084B85496P11981l00021k62525a78989p9838F35571J87144
$$ -950196 -1112536 -788452 285496 997477 697456 434931 -178989 -258827 635571 822715
907H22715J8105N6719a67524j76549A390075J086658A187407a07357D08475Q78858
$$ 822715 840820 897539 -167524 -344073 1390075 2476733 1187407 -107357 408475 1287333
897A287333l66075m36825J85992j72649A59123d22237j116624P6925D98312J963908
$$ 1287333 921258 484433 670425 497776 159123 -422237 -1538861 -1461936 498312 2462220
887B462220L6672G88592d14796C08784O98236A75478a27923D61697G741a230838
$$ 2462220 2498892 788592 -414796 308784 1007020 175478 -127923 461697 7741 -1230838
876e73439A328661R74677p48235C75071c51126R0773n4106r18089q62580J98315
$$ -573439 1328661 2303338 1555103 375071 -351126 -260353 -314459 -1232548 -2095128 -1896813
866a896813i27542B47656R79110L27715M3831K29430j43320D66704f40121k9251
$$ -1896813 -927542 247656 1226766 1554481 1598312 1827742 1684422 466704 -640121 -669372
856f69372b38608n8532J10583i1238l1687l57255J87843B01091J40851b83937
$$ -669372 -238608 -297140 -186557 -91238 -122925 -480180 -292337 201091 341942 -283937
845g79381c32898F29636J27038k29374c8684r19612o9356b87726h4084k14015
$$ -779381 -332898 629636 756674 527300 -38684 -958296 -1027652 -287726 -84084 -298099
835b98099C028K94587b45237n03754k07432k18142m57481n36382L6674P97572
$$ -298099 3028 297615 -245237 -748991 -956423 -1174565 -1632046 -2168428 -2131754 -1334182
825a334182d74239m7138m83047d47525E68691P5656B64906K12704J60335B33638
$$ -1334182 -474239 -521377 -1004424 -447525 568691 644347 264906 477610 637945 233638
814C3888P59347O53106q0437j30973k41063b19719j398597j92957N84845K60386
$$ 33888 793235 1446341 1365904 1234931 993868 -219719 -1618316 -1811273 -1226428 -966042
804i66042n741M36170M9107j97511c15739A16892f55250q31275K88035b49932
$$ -966042 -971783 -535613 -486506 -684017 -315739 116892 -655250 -1486525 -1198490 -249932
793b70049p81966K23552A2049O11066M20776k3718m03751B49998e9109m12092
$$ -270049 -1052015 -828463 12049 623115 1043891 1020173 616422 249998 -59109 -471201
783d71201o61170m56604m49657q72823O6572a113889F51174N87986L27662k34717
$$ -471201 -1132371 -1588975 -2038632 -2911455 -2844883 -1113889 651174 1239160 1566822 1332105
773A332105o18334l02386k4979k4523L36794R0136C73467b9480I2203M9171g1560
$$ 1332105 713771 411385 386406 361883 698677 788813 373467 -29480 92203 141374 -71560
761c04127F55830K90681a51466o07141L3135J31381K66234K2309j5342B30532
$$ -304127 655830 946511 -151466 -758607 -725472 -594091 -327857 -305548 -320890 230532
750A308899k55428d44385o30622L39800j19411l45605M34628c75609m56848k79281
$$ 1308899 1053471 -444385 -1075007 -735207 -854618 -1200223 -765595 -375609 -832457 -1111738
740a111738L8127l08781L45959C7651Q47376M82005m45736b24150P3740F97990
$$ -1111738 -1073611 -1382392 -1036433 37651 885027 1367032 921296 -224150 -150410 697990
729H79592B26227c45343o76350j049997N79754H99279P18420e41058j915867O40258
$$ 879592 226227 -345343 -1021693 -2071690 -1491936 899279 1617699 -541058 -2456925 -1816667
719a816667a69458A63134f26649j67502a61E00952j59893q9715F0932J29627e43699
$$ -1816667 -169458 163134 -626649 -794151 -161 500952 341059 251344 60932 190559 -543699
707a836224p34182K10709M09021R63402g9003B23650K27530r3633d65396o41076
$$ -1836224 -2570406 -2359697 -1950676 -987274 -79003 223650 451180 357547 -465396 -1106472
697a106472K44281L69891o8267G8541R09766L5066E10991j48714A44831L56328
$$ -1106472 -862191 -492300 -560567 78541 988307 1023373 510991 362277 144831 501159
687E01159J009272J498707P60321q19613j375204o84664R0448p6042K94917l01821
$$ 501159 1510431 3009138 3769459 2949846 1574642 889978 980426 904384 1199301 897480
677H97480l92433k23106A8256e23883m33593K52249d3307j29091o46580J96270
$$ 897480 505047 281941 18256 -523883 -957476 -705227 -43307 -172398 -818978 -622708
667f22708B61444R14227L2297n81478k04211o1987d21377k07683C922f0310k18562
$$ -622708 261444 1175671 1207968 626490 422279 360292 -421377 -629060 3922 -60310 -278872
656b78872G0106e6135q48163l04667e35631B44900L82408B32699G724K35452Q3150
$$ -278872 70106 -56135 -904298 -1208965 -535631 244900 627308 232699 7724 243176 326326
645C26326a16042n6262A183391Q51241j003097C14962R3673J91951f803p71025
$$ 326326 -116042 -172304 1183391 2034632 1031535 314962 408635 600586 -6803 -777828
635g77828m07732K2745K11900o7598R0612b90809D38194P28388J162365K6444
$$ -777828 -1185560 -1162815 -950915 -1018513 -927901 -290809 438194 1166582 2328947 2355391
625B355391F04336f89540a4351G07189j92038a76057r06994j066753K47308Q27391
$$ 2355391 604336 -689540 -14351 707189 515151 -176057 -1083051 -2149804 -1902496 -1075105
615a075105N10620b82139a31190p2154F03531R72820j68709D89718A08047L14398
$$ -1075105 -564485 -282139 -131190 -203344 603531 1576351 1407642 489718 108047 422445
605D22445j82582f64702j118828l45198h65270D90243J88905F1206a5259k5441
$$ 422445 239863 -664702 -1783530 -2128728 -865270 490243 679148 61206 -15259 -40700
595d0700l89881J2769C61606O35251j674D51012J48926K04267d05961r97109N44155
$$ -40700 -430581 -417812 361606 996857 995183 451012 599938 804205 -405961 -1403070 -858915
584h58915B83675M13065j96903J63429P6352h216n41336a68642D78975I6710d71030
$$ -858915 283675 696740 499837 663266 739618 -8216 -549552 -168642 478975 96710 -471030
572f18332r93501j009152M96834g36458C527J94862r2676e02407j30452n302b39599
$$ -618332 -1611833 -2620985 -2124151 -736458 3527 198389 105713 -502407 -632859 -638161 -239599
560C73822L39176k30835C7702j8800a67329l26116c3830H24458L71775n93533
$$ 373822 712998 482163 37702 18902 -167329 -493445 -33830 824458 1196233 602700
550F02700e32691n39536M64956a15017B30181R45573M50399F95594b53526h4078
$$ 602700 -532691 -1072227 -607271 -115017 230181 1175754 1626153 695594 -253526 -84078
539I32359J24755B55683b02047E3917a58544n10387L1384c5762I82954j54536
$$ 932359 1057114 255683 -202047 53917 -158544 -668931 -637547 -35762 982954 828418
529H28418j40941N20428n4218E16837L25714J263473K64089j127613b12937k50336
$$ 828418 687477 1207905 1153687 516837 842551 2106024 2370113 1242500 -212937 -463273
519d63273j90860q04841k63345M00165O17497J5698J0207B22104P45366D53876
$$ -463273 -654133 -1458974 -1722319 -1322154 -704657 -688959 -678752 222104 967470 453876
508A85268N6799p9490a53614C1202d8961m28626o32371l62402L04060A16878L97574
$$ 185268 242067 162577 -153614 31202 -48961 -477587 -1109958 -1472360 -1168300 116878 514452
497E14452c22480l32851b65589b4180B43896q9594h13529l90269K13719b86396
$$ 514452 -322480 -655331 -265589 -24180 243896 154302 -813529 -1203798 -990079 -286396
486F08490J046309k47652B01581e06008n7219m90472M50456G58963K1983a73326
$$ 608490 1654799 1407147 201581 -506008 -563227 -1053699 -603243 758963 780946 -173326
475C15151L44616B1142M0083a28852o2603K6726C30257R46073m21504d08118j205850
$$ 315151 659767 21142 61225 -128852 -191455 -164729 330257 1276330 854826 -408118 -1613968
464a613968p4235C9320J661635M240m83714J90678O73091M68393n41552p9040
$$ -1613968 -1688203 39320 1700955 1705195 1221481 1412159 2085250 2553643 2012091 1933051
454A933051E41992p7323J781262K98152p22421C50027c750705r45493A539419
$$ 1933051 541992 464669 2245931 2544083 1821662 350027 -3750705 -4696198 1539419
444C557948J918608k702685j210291B932d73401A638504P31005D92574J73053
$$ 3557948 5476556 2773871 1563580 2932 -473401 1638504 2369509 492574 665627
435F65627J829750k6433r29051h6594q78987A04925J232788R6778l5615K95482
$$ 665627 2495377 2468944 1539893 -86594 -965581 104925 1337713 1434491 1398876 1694358
425A694358k27024j29946K20967j76138k61797M17056M17189o32011c46309o29246
$$ 1694358 1467334 1337388 1558355 1382217 1120420 1537476 1954665 1322654 -346309 -975555
415i75555L9889F42181N05973h20903l83280A21657Q97441J51002E23514g22951
$$ -975555 -935666 642181 1148154 -820903 -1204183 121657 1019098 1170100 523514 -722951
404a157954J05259B39253K687618J080687A951613f39470j148862J00429e06208
$$ -1157954 -1052695 239253 2926871 4007558 1951613 -639470 -1788332 -1687903 -506208
394B28469f8380B40875R33373O20706n21966C33818e16473p15768j43234N66576
$$ 228469 -68380 240875 1174248 1794954 1272988 333818 -516473 -1232241 -1375475 -808899
384h08899K58158j74015o8336n23759p54293n49265l01289K9529J275959E48284
$$ -808899 -550741 -724756 -793092 -1316851 -2071144 -2620409 -2921698 -2892169 -1616210 548284
373A515190C78502e77256j29126K6384J29184J7600n01420j13208q9199r4909
$$ 1515190 378502 -577256 -706382 -679998 -550814 -533214 -1034634 -1147842 -1237041 -1331950
363a331950a36471A502947K06922B78035e03830J76282B275L43317L02491B18779
$$ -1331950 -136471 1502947 1709869 278035 -503830 -327548 2275 345592 648083 218779
352h76323m45440N33553D63e71996j027819P8319g50024c25467n27646k18108
$$ -876323 -1321763 -788210 463 -571996 -1599815 -1521496 -750024 -325467 -853113 -1071221
342a071221L25923C86901j3580l3227b6039n17699J39306D04264K25998a29216
$$ -1071221 -745298 386901 373321 340094 -26039 -543738 -404432 404264 630262 -129216
331b59700E62231K70482d00395r80859J93655l11349m22913Q8250J60662O75358
$$ -259700 562231 832713 -400395 -1381254 -1187599 -1498948 -1921861 -1833611 -1672949 -997591
321i97591c63542n36001k32863c18347B95208a7641n56156L3512D06543J07291
$$ -997591 -363542 -899543 -1132406 -318347 295208 -17641 -573797 -540285 406543 513834
311E13834a09111o7915m316A98996r2086c20505k53965l1145r5784K88257A66720
$$ 513834 -109111 -177026 -181342 198996 106910 -320505 -574470 -605615 -701399 -413142 166720
299C83883j91295M78054N4940a52735l63298F01256R16870I0300a924035K71603
$$ 383883 192588 670642 725582 -152735 -516033 601256 1518126 90300 -1924035 -1652432
289a652432E48236J221088F82709h97126k70624M6440N07769A96933P80739K2079
$$ -1652432 548236 1769324 682709 -897126 -1167750 -1121310 -613541 196933 977672 999751
279I99751l96893K44637K43181l63345K82876R3420B64310a22516p2583P9864
$$ 999751 602858 847495 1090676 727331 1010207 1103627 264310 -122516 -195099 -115235
269a15235G00511O42055J43609j6510B20082a749226n39829P59310K05369l88051
$$ -115235 700511 1342566 1486175 1469665 220082 -1749226 -2289055 -1529745 -1324376 -1712427
259a712427f73369G13907K29197p1072C52367d50045o17138j01877M25813C33741
$$ -1712427 -673369 713907 943104 872032 352367 -450045 -1067183 -1169060 -743247 333741
248H21277a25942o17971K22535g8355E8523g04509l74454c46118H62745K04252
$$ 821277 -125942 -743913 -521378 -78355 58523 -704509 -1078963 -346118 862745 1066997
238A066997C80970A40044L610M84042Q77565l2455E88063A28584f05193n14314
$$ 1066997 380970 140044 143654 627696 1505261 1472806 588063 128584 -605193 -1119507
228a119507j89073l796d45402B51200b20726p13126l27794m10703K14099f75986
$$ -1119507 -1308580 -1312376 -445402 251200 -220726 -933852 -1261646 -1672349 -1458250 -675986
217a98756k44858q16271n49468L20965P26827L05028k9989l79507J2048j0175
$$ -198756 -443614 -1259885 -1809353 -1488388 -761561 -456533 -486522 -866029 -853981 -864156
207h64156K53946b16176a06344c9342E0920i6280A78015N97960K07298k00118
$$ -864156 -610210 -216176 -106344 -39342 50920 -96280 178015 775975 983273 783155
197G83155m3309j78402c0118o60461n47078K42030C94572O68966N2786M1483n32496
$$ 783155 739846 561444 -30118 -690579 -1237657 -995627 394572 1063538 1116324 1157807 625311
186F25311k33171J64398I048f30799l52333q00599o26103N71880f69707C76243
$$ 625311 392140 556538 9048 -630799 -983132 -1783731 -2409834 -1837954 -669707 376243
175A065276r944l75419j05525J60927k65401b77267n31181L25669H11476J759288
$$ 1065276 1055332 679913 574388 735315 469914 -277267 -808448 -482779 811476 2570764
165B570764j15467A179889m82436k6805A09763c75997a48211E50231L14674J36876
$$ 2570764 2455297 1179889 697453 670648 109763 -375997 -148211 550231 864905 1001781
155A001781m37511i6669j67592a15134E39826N15102F9736a037138a86690A077948
$$ 1001781 564270 -96669 -264261 -115134 539826 1054928 69736 -1037138 -186690 1077948
144A268882l18879k203j0781m09598A94537J96577e5051q23741l68078L34070
$$ 1268882 950003 947800 937019 527421 194537 391114 -55051 -878792 -1246870 -912800
134i12800J19072c10708E90187M74851j95771L70271n90992d49189a38754A351186
$$ -912800 -793728 -310708 590187 1065038 869267 1239538 648546 -449189 -138754 1351186
123B284871j29236n01832p22613A89659a65573m89961l40691d66698E58680M25785
$$ 2284871 2155635 1653803 931190 189659 -165573 -655534 -996225 -466698 558680 984465
113I84465K64313k95035C33548H0716c07314j38850H3071J117678P42414H89437
$$ 984465 1248778 953743 333548 80716 -307314 -446164 83071 1200749 1943163 889437
102C34229Q81230k89775h23748o55929L40980j32444K54345b55832A48055b15484
$$ 334229 1215459 925684 -823748 -1479677 -1138697 -1271141 -1016796 -255832 148055 -215484
91f00625m29188m86876K90117b11767B69391L9446L2687J5844L28804J32759l92950
$$ -600625 -1029813 -1516689 -1226572 -211767 269391 308837 341524 357368 686172 818931 425981
80D25981p0133f0785m60090B52043J393952K67616o76096n74362B16936d59210
$$ 425981 355848 -60785 -520875 252043 1645995 1913611 1237515 663153 216936 -459210
69h64839L37843A424c32045j89007D56305J349998N47856j15869j009735I0232
$$ -864839 -526996 1424 -332045 -521052 456305 1806303 2354159 2238290 1228555 90232
58b07359B60609b54934l94786e0287E54841B59050e39492q09788o43174l87048
$$ -207359 260609 -254934 -649720 -50287 554841 259050 -539492 -1349280 -1992454 -2379502
48b379502J31898M02869M34531M89723J15163m14743j5131N91257b39133E41855
$$ -2379502 -2247604 -1844735 -1410204 -920481 -805318 -1220061 -1235192 -643935 -239133 541855
37A391494j50134E82346L5017N82439n37490a45249k7330A53916b23172k0342
$$ 1391494 1241360 582346 617363 1199802 662312 -145249 -172579 153916 -223172 -243514
27b43514F55943L83159j305C84123b25616C00046J108081M29362o00790C97868
$$ -243514 655943 1039102 1037797 384123 -225616 300046 1408127 1837489 1236699 397868
16e69686r29473p7819e44406B82647b76460p97421l5766d68549B59201K44972
$$ -569686 -1499159 -1576978 -544406 282647 -276460 -1073881 -1109647 -468549 259201 504173
6E04173Q7950q5878c41290j251386k61745O93608
$$ 504173 592123 506245 -341290 -1592676 -1854421 -1160813
0a160813
$$ -1160813
##PAGE= F1=3237.271413801
##FIRST=     18110.137220953, 5591.54909048506, -978369
##DATA TABLE= (F2++(Y..Y)), PROFILE
1023i78369j82208a26035A191921k99421c01452k27168N7521l17012m18362d93591
$$ -978369 -1160577 -126035 1191921 892500 -301452 -528620 -471099 -788111 -1206473 -493591
1012H40652N90450m87266a45381j047597l85028N17141L79528b73485O3346q36386
$$ 840652 1431102 943836 -145381 -1192978 -1578006 -1060865 -681337 -273485 -210139 -1046525
1002a046525k34440e59206K59407k88928P0968A75898Q31892J35360l27531k86615
$$ -1046525 -1280965 -559206 -299799 -588727 -517759 175898 1007790 1143150 815619 529004
992E29004B55404D269c68934j57185h77A45408R5701o2471C891M07747P00041
$$ 529004 255404 4269 -368934 -526119 -877 145408 241109 178638 3891 411638 1111679
981A111679k30661B06063h25538p53370M40751c22299A61651L49728j59007j27837
$$ 1111679 881018 206063 -825538 -1578908 -1138157 -322299 161651 511379 352372 224535
971B24535K39070K41380L31255L14163J61176Q9321m226j75909o48547B57065
$$ 224535 463605 704985 1036240 1350403 1511579 1600900 1596674 1420765 772218 257065
960b5599n98997o69923M65988B64107M6167d89352n39647j60536j32587k9483
$$ -25599 -624596 -1294519 -828531 264107 310274 -489352 -1028999 -1189535 -1322122 -1351605
950a351605M44203L27785f1320H07099L45981C4661f33499G86135J042812E36634
$$ -1351605 -907402 -579617 -61320 807099 1153080 34661 -633499 786135 1828947 536634
939c35957A61456c53059j222487N4127f71457B6345L71132j84885A8112M30373
$$ -335957 161456 -353059 -1575546 -1521419 -671457 26345 397477 212592 18112 448485
929D48485K45451j71797M8900J9862K63035R37619J33302D93396c39150A19788
$$ 448485 693936 522139 571039 590901 853936 1791555 1924857 493396 -339150 119788
918G075h17801l69687e86061I10851O34199o63925B27790f43297k34803B75444
$$ 7075 -817801 -1187488 -586061 910851 1545050 881125 227790 -643297 -878100 275444
907G39079l61O3301B0410c9880A768254R37854H88613f45542a70509H75462K53804
$$ 739079 738718 802019 20410 -39880 1768254 2706108 888613 -645542 -170509 875462 1129266
896A129266J1809L31249k25056o06545b37492j170578K3112E09544J732476K360
$$ 1129266 1141075 1472324 1247268 640723 -237492 -1408070 -1384958 509544 2242020 2244380
886B244380F48426g88351b87465H34328l25061A43118L76153e6212j436666O57842
$$ 2244380 648426 -788351 -287465 834328 509267 143118 519271 -56212 -1492878 -835036
876h35036A184673J016913o10578G13212A18259m7500a7930q88766q80647J27875
$$ -835036 1184673 2201586 1591008 713212 118259 70759 -17930 -906696 -1787343 -1659468
866a659468g25543E94881J371490J81675n29261l82514l28609a5628o48959K72635
$$ -1659468 -725543 594881 1966371 2148046 1618785 1236271 907662 -15628 -664587 -391952
856c91952A67497F9291c0528k1662m4773m72337J8660g9558A54468e04123n09597
$$ -391952 167497 69291 -30528 -52190 -96963 -569300 -550640 -79558 154468 -504123 -1013720
845a013720M23286B55495J67077j70256c08919r32011l32864P55033a12496M0236
$$ -1013720 -590434 255495 422572 252316 -308919 -1240930 -1573794 -818761 -112496 -72260
835g2260j68580l1733k78510j64389R4049l39986q31106n65520P0245N50883O52955
$$ -72260 -240840 -272573 -551083 -715472 -621423 -961409 -1792515 -2358035 -2287790 -1736907 -1083952
824a083952L43526l5683a88629G87618j05966a260C63027P42554k77122H2569
$$ -1083952 -740426 -776109 -188629 787618 681652 -1260 363027 1105581 828459 82569
813E48968Q32712k03103k22802k84077f47362j237926L84376d67416b18710N896
$$ 548968 1381680 1178577 955775 671698 -647362 -1885288 -1500912 -467416 -218710 -212814
803b12814A7981d06368n00753J43177c49562n33002q31278L37452d41149m70195
$$ -212814 17981 -406368 -907121 -763944 -349562 -882564 -1713842 -1376390 -441149 -911344
793i11344m08706O04493A73549M95636N09690L17574m64150C28756c03817l77522
$$ -911344 -1320050 -715557 173549 669185 1178875 1496449 1032299 328756 -303817 -681339
783f81339m61225l04918k50708p27020k16710a310636C85977Q09288M63530m6649
$$ -681339 -1142564 -1447482 -1698190 -2425210 -2641920 -1310636 385977 1195265 1658795 1612146
773A612146E29463A42095L44753J77224M91756J43547n41171a83216k2836C21391
$$ 1612146 529463 142095 486848 664072 1155828 1299375 758204 -183216 -206052 321391
762E31142k37936N06767o8877a93505m57965l27002l51118k8744N36883b13857
$$ 531142 293206 799973 731096 -193505 -651470 -978472 -1329590 -1358334 -821451 -213857
751D97252Q49087n10946g85689m07084d49158K0313p23581O8736L53596J95396
$$ 497252 1346339 835393 -785689 -1192773 -449158 -428845 -1152426 -1083690 -730094 -534698
741e34698J82091k75347o72709J38530a32845H52651O98415k06545C67661A13679
$$ -534698 -352607 -627954 -1300663 -1162133 -132845 852651 1551066 1344521 367661 113679
730D33695k0104a51108l60898k78845r97283L11310F48938O71329g03659j715515
$$ 433695 413591 -151108 -512006 -790851 -1788134 -1476824 648938 1320267 -703659 -2419174
720b419174J063776C96986R1511c56268l93607K30673C9917K40184b293n49782
$$ -2419174 -1355398 396986 488497 -356268 -749875 -519202 39917 280101 -2293 -552075
710e52075K32500k76472j070148k95083M54587J23680O50845A33195L02167O1773
$$ -552075 -319575 -596047 -1666195 -1961278 -1506691 -1383011 -732166 133195 435362 497135
700D97135k34556e65201n26268K57419Q0741k57189b43225E11105k32653i4605
$$ 497135 262579 -565201 -1091469 -834050 -753309 -1010498 -243225 511105 278452 -94605
689A81973L30185N42948J184281J502894K06917j228584A278251n02898K13405
$$ 181973 512158 1055106 2239387 3742281 3949198 2720614 1278251 775353 988758
680I88758K7462R6719C99777D9396K09698G0313e46592n7317A7714P42598m9765
$$ 988758 1016220 1112939 399777 49396 259094 70313 -546592 -603909 17714 760312 710547
669G10547A24041H938M48596P83511J71089m93461k95080k30545e77211k86672
$$ 710547 124041 8938 457534 1241045 1412134 918673 623593 393048 -577211 -863883
659h63883a47578o9930l62745a88406h5341j041457n41225f35476C02864K68935
$$ -863883 -147578 -217508 -580253 -188406 -85341 -1126798 -1668023 -635476 302864 571799
649E71799r6218j11069r0430k9254a71731j09144A058494J041983q72474E88245
$$ 571799 475581 364512 274082 244828 -171731 -280875 1058494 2100477 1228003 588245
638F07700K49676l46574A4236c35352j35303m776l85321k55192K05400b93635
$$ 607700 857376 510802 14236 -335352 -470655 -475431 -860752 -1115944 -910544 -293635
627E64414J734130O23264A198416e11764a57064B28900a76741r7438l28088j027626
$$ 564414 2298544 2921808 1198416 -511764 -157064 228900 -176741 -274179 -602267 -1629893
617a629893N6226N96083d82997K11750Q7667g236I61721R23354n54431C99647
$$ -1629893 -1573667 -977584 -482997 -271247 -183580 -7236 961721 1885075 1330644 399647
606A5199J64502n6996e73737j125106m12047g45669G56655K15183C27802E5370
$$ 15199 179701 122705 -573737 -1698843 -2110890 -745669 756655 971838 327802 55370
595a37381l09743l55357c94434D35193N53232k47366K18048o284b58888q84463
$$ -137381 -447124 -802481 -394434 435193 988425 741059 959107 952823 -258888 -1143351
585a143351e42089C72970M18448j7868K55893J72348E52959b55482c107F72705
$$ -1143351 -542089 372970 791418 773550 1029443 1201791 552959 -255482 -3107 672705
574B95027b76237m9273j084618r60110N66368c77582F39742N56838k07830a62122
$$ 295027 -276237 -325510 -1410128 -2370238 -1803870 -377582 639742 1196580 988750 -162122
563g37766j64996d40753A82602K94096j38725a2652C2539H364e16282K46553G11928
$$ -737766 -902762 -440753 182602 476698 337973 -12652 32539 8364 -516282 -269729 711928
551A469300l13299a21107q82399J03146L64718C69384J506627M17079A071972
$$ 1469300 1156001 -121107 -1003506 -900360 -535642 369384 1876011 2293090 1071972
541I699a34917F74987N44084n28953a38399l66423l3099j85088k34072c67015
$$ 9699 -134917 674987 1219071 690118 -138399 -504822 -537921 -723009 -957081 -367015
530H64931J09663q9495N74750n8302C35387D5542J294973J106679n95210A25749
$$ 864931 974594 885099 1459849 1401547 335387 45542 1340515 2447194 1851984 125749
519e13230M2173m45046k50513K75673c03499n5478n9410E78151R55688o30998
$$ -513230 -471057 -916103 -1166616 -890943 -303499 -358977 -418387 578151 1533839 902841
509I02841D37924K8265e947o88136b91466A53005b93063m36891K79363A13407
$$ 902841 437924 466189 -5947 -694083 -291466 153005 -293063 -729954 -450591 113407
498I27888m9049B26751o8495L94735L39713l2582B7858a071665n7984L28335i9192
$$ 927888 878839 226751 158256 552991 892704 860122 27858 -1071665 -1129649 -801314 -99192
486H62793P39951m84221B32815l3643C9099f70724b39790H65161j06542A68247
$$ 862793 1602744 1118523 232815 199172 39099 -670724 -239790 865161 758619 168247
475H32404L06245n50111m78k24026K56312J41647k53749J92170o7463g11947j190547
$$ 832404 1138649 588538 588060 364034 620346 761993 508244 700414 632951 -711947 -1902494
464a902494M53943B19742J071342j79449E05502J78774J255341K49810H98102
$$ -1902494 -1448551 219742 1291084 1111635 505502 684276 1939617 2189427 898102
454g08174j010296d14127A530982L82724G52171a555065n416372l021406d433862
$$ -708174 -1718470 -414127 1530982 1913706 752171 -1555065 -6971437 -9992843 -4433862
444B93599J347839c3880l94813l70212q6498E01601P13813D3635L02792J323813
$$ 293599 1641438 -33880 -428693 -798905 -885403 501601 1215414 43635 346427 1670240
434A670240n74490c74204j434068m05788a038968e345j2913H2666M23557j32211
$$ 1670240 1095750 -374204 -1808272 -2214060 -1038968 -5345 -18258 82666 506223 374012
424C74012K50308L96394l14878B97378L19951M77557C67054a408054p35468m5104
$$ 374012 624320 1020714 705836 297378 617329 1094886 367054 -1408054 -2143522 -2188626
414b188626a056838c14679r20784N06349D95794P81979r436E12100h39877n96977
$$ -2188626 -1056838 -314679 -1235463 -729114 495794 1277773 1268337 512100 -839877 -1436854
404a436854L17986A43917K842961J395345k036953d10247j487410L195f28771
$$ -1436854 -1118868 143917 2986878 4382223 2345270 -410247 -1897657 -1894462 -628771
394E3964d71971a79018H99744N85213n31052C32186b02264o91117j19727M42538
$$ 53964 -471971 -179018 899744 1484957 953905 332186 -202264 -893381 -1013108 -570570
384e70570k58653m03888r5278p20702l98504m66816o39685m2863J623664A81277
$$ -570570 -829223 -1233111 -1328389 -2049091 -2447595 -2914411 -3554096 -3596959 -1973295 181277
373A096741C2587g39621N6307j32065k62265k13808o93899p8106M43143L39408
$$ 1096741 32587 -739621 -683314 -815379 -1077644 -1291452 -1985351 -2063457 -1620314 -1280906
363a280906b19698A049181J95653B35588c53719j9048R7284d1338A71891d41643
$$ -1280906 -219698 1049181 1244834 235588 -353719 -372767 -275483 -41338 171891 -441643
352a193006K81968M53180A21315d95197j326067m2940Q50464K74836k44955K95237
$$ -1193006 -911038 -457858 121315 -495197 -1821264 -1864204 -1013740 -738904 -983859 -688622
342f88622b4070A015968l23210B00381b95167l88694m2831a61014A72518e37584
$$ -688622 -24070 1015968 692758 200381 -295167 -683861 -726692 -161014 172518 -537584
331f00901G77131J048486E52506a127827q3072j51301k55623j31785J68180e19625
$$ -600901 777131 1825617 552506 -1127827 -1210899 -1362200 -1617823 -1749608 -1581428 -519625
320C62418b10908n96280L84887A02925D9192e38738j18537C03111O43273k63534
$$ 362418 -210908 -807188 -422301 102925 49192 -538738 -657275 303111 946384 682850
310F82850B00716d56280J44919h2697m6058j66149k31692q7145J98971A57904
$$ 682850 200716 -456280 -311361 -82697 -128755 -294904 -526596 -613741 -414770 157904
299F46588j55583J89257k64535f49243l33913A4473R09077e24471j809533N30190
$$ 646588 491005 680262 415727 -649243 -983156 14473 923550 -524471 -2334004 -1803814
289a803814E00361J042998D90275g76064k00188J54012b19886D21535M20601j94325
$$ -1803814 500361 1543359 490275 -776064 -976252 -822240 -219886 421535 842136 647811
279F47811j46398N11024L04674j69176O03347J28826E74891a05281C8157J46804
$$ 647811 501413 1012437 1317111 1147935 1751282 1880108 574891 -105281 38157 184961
269A84961L85231M38245L07581r917e33106k080552N6620J025356J82544j16976
$$ 184961 570192 1008437 1316018 1306101 -533106 -2613658 -2557038 -1531682 -1349138 -1466114
259a466114d28076H30724M23757k2177D06633d74294l97246r3024K60107C48468
$$ -1466114 -428076 830724 1254481 1232304 406633 -474294 -871540 -964564 -704457 348468
248F72532b45741l25963b42668B47337M88018C54582d12810J16062G49123L88180
$$ 672532 -245741 -571704 -242668 247337 735355 354582 -412810 -296748 749123 1137303
238A137303m54670C35013O9842O35499Q40880j58673F42211h6351p18218m91872
$$ 1137303 682633 335013 404855 1040354 1881234 1722561 642211 -86351 -804569 -1296441
228a296441m85532q4801g98995B9768a67330o09371n90153n42102L07728f40021
$$ -1296441 -1781973 -1866774 -798995 29768 -167330 -776701 -1366854 -1908956 -1601228 -640021
217e6368m45030q06781k53080N78123b28071B53487L34658B13278b84060m37979
$$ -56368 -501398 -1308179 -1561259 -983136 -228071 253487 588145 213278 -284060 -722039
207g22039J62833i0641D5450K0455Q2777j4983K49799L41503n0478l33195K40256
$$ -722039 -559206 -90641 45450 65905 148682 133699 383498 725001 674523 341328 581584
196E81584K30566B71455d98671m22849L72084C03898K11862J4556K237A00815
$$ 581584 812150 271455 -498671 -921520 -549436 303898 515760 530316 532553 100815
185B13367L83159h4590q26307j64849l32479j62241J98407e50738E31273O05483
$$ 213367 596526 -84590 -910897 -1075746 -1408225 -1570466 -1372059 -550738 531273 1136756
175A136756j13815k57198j5480J9576l27029a6791k21689e3451I81425J323815
$$ 1136756 1022941 765743 750263 769839 442810 -16791 -238480 -53451 981425 2305240
165B305240l59200r65879k64201k90761d67991l47810H3639J176480l0691k90549
$$ 2305240 1946040 980161 715960 425199 -467991 -815801 83639 1260119 1229428 938879
155I38879k94496A47777b66883O7801E74155L28584a65630r20378b61109A043556
$$ 938879 644383 147777 -266883 -199082 574155 902739 -165630 -1086008 -261109 1043556
144A586898k27320k99383l19938A70301b36822B8067a21311j84228k15319J60629
$$ 1586898 1359578 1060195 740257 170301 -236822 28067 -121311 -305539 -520858 -360229
134c60229L8490A973O01780J59694C60293L39942B07396f13112b15624A216887
$$ -360229 -321739 1973 603753 763447 360293 700235 207396 -613112 -215624 1216887
123B318947p3341p10224F73123a10529k04752m25983n62731N29636F42655Q07213
$$ 2318947 2245606 1535382 673123 -110529 -315281 -741264 -1303995 -774359 642655 1449868
113A449868K41468p50656f4627o6429F2315B2340J61785R64641P74636H84952
$$ 1449868 1691336 940680 -64627 -131056 62315 22340 184125 1148766 1923402 884952
102C30098P60130l86647a067707n23197M65167r2182J99344c70865A03251e9916
$$ 330098 1090228 703581 -1067707 -1590904 -1125737 -1217919 -1018575 -370865 103251 -59916
91d16044n15772k60479N04851e2027p4168m4976A17467N1156K9155H3914d3431
$$ -416044 -931816 -1192295 -687444 -52027 -126195 -171171 117467 168623 197778 83914 -43431
79C09237C5028d55621D51909J566582K01447j049209B94131b68845l86762j69834
$$ 309237 35028 -455621 451909 2018491 2219938 1170729 294131 -268845 -655607 -825441
69h25441K70688c7421r5390k92505H3201J111467O11757J64958q65172I6393i1889
$$ -825441 -554753 -37421 -132811 -425316 83201 1194668 1806425 1971383 1106211 96393 -91889
57E73797A21539d12020B29856P96632j01079a10214r21972p21949l22332o0228
$$ 573797 121539 -412020 229856 1026488 925409 -110214 -1032186 -1754135 -2076467 -2136695
47b136695J20743J01020M56675M09656j8398k6438c93729H6315M53477Q28765
$$ -2136695 -2015952 -1914932 -1458257 -1048601 -1066999 -1093437 -393729 86315 539792 1368557
37A368557k2349D94843j05806Q11551l56618C5853d4505B46577a24945j41482
$$ 1368557 1346208 494843 389037 1200588 843970 35853 -44505 246577 -124945 -266427
27b66427F63520K97223j95250a1056o39164c17749D55530N95024l18036a1827
$$ -266427 663520 960743 765493 -11056 -650220 -317749 455530 1050554 732518 -11827
16a175995p24637M91432e8732F84652A34314e97882k25733J71271b3917E65392
$$ -1175995 -1900632 -1409200 -58732 684652 134314 -597882 -823615 -652344 -23917 565392
5G92289r7929b30946j369533j58609h29454
$$ 792289 694360 -230946 -1600479 -1759088 -829454
##PAGE= F1=3215.65387629
##FIRST=     18110.137220953, 5591.54909048506, -335845
##DATA TABLE= (F2++(Y..Y)), PROFILE
1023c35845l34031D1535P75779B97182d35733N1849J88550j64800n17463d25742
$$ -335845 -669876 41535 817314 297182 -435733 -383884 -195334 -360134 -877597 -425742
1012G65962N94493o11159d90483p29921j29100K66475K31615b37732c6998r33743
$$ 765962 1360455 749296 -490483 -1220404 -1349504 -1083029 -851414 -237732 -36998 -970741
1002i70741k37252b88192B61091A28427f2875C25890O90522K20343j38643l04694
$$ -970741 -1207993 -288192 261091 128427 -62875 325890 1016412 1236755 1098112 793418
992G93418f08o46968m7387b72708C42059j44432Q8214K07896k36359o8200P10167
$$ 793418 -608 -647576 -694963 -272708 342059 197627 285841 493737 257378 189178 899345
981H99345K74286n80988f63213q00764L46991L56033J39678a37166E1726J02277
$$ 899345 1173631 592643 -663213 -1463977 -1116986 -760953 -621275 -137166 51726 154003
971A54003L47682L11130L78037N62439J26876k77610m12166l72456A98703b95510
$$ 154003 501685 812815 1190852 1753291 1880167 1602557 1190391 817935 198703 -295510
960a93687j83104n94905L83123E90811K21640H2904f33973l85480l23379j47628
$$ -193687 -376791 -971696 -588573 590811 812451 82904 -633973 -1019453 -1342832 -1490460
950a490460L60593M40858I9449P30290J73798f1362n34381F96029N92539G4777
$$ -1490460 -1129867 -689009 99449 829739 1003537 -61362 -595743 696029 1288568 74777
939d23548A96156b56647q36632K23697K61670b09926E79304l4117B18267N09595
$$ -423548 196156 -256647 -1093279 -869582 -607912 -209926 579304 545187 218267 727862
929G27862J47269C58797q6843K10000L65990Q35973o355C12119b47359D10311
$$ 727862 875131 358797 271954 481954 847944 1683917 1677562 312119 -247359 410311
918C28493f31831l87898b78906A326160M54405q25822F4550a011402m82485c40098
$$ 328493 -631831 -1019729 -278906 1326160 1780565 954743 64550 -1011402 -1493887 -340098
907D53874R4565k297H5742J04546J519037O11272C34939a217029L71697C40037
$$ 453874 548439 546142 85742 190288 1709325 2320597 334939 -1217029 -845332 340037
896A301606N62385L78914l94035q96646a46342j066102j15252B02405J315598
$$ 1301606 1863991 2242905 1848870 952224 -146342 -1212444 -1327696 202405 1518003
887A518003J24602E20797h59466K24062F24356J27576C67703O3347a83725j333860
$$ 1518003 1642605 520797 -859466 -635404 624356 751932 367703 431050 -183725 -1517585
877a517585N93606H92053Q69936l64581m10650l54637q9152p3227d31933q81215
$$ -1517585 -923979 892053 1761989 1397408 986758 632121 542969 469742 -431933 -1313148
867a313148J52498b37102A075092J422713r2833r45282E96260G5881d37936j90322
$$ -1313148 -1160650 -237102 1075092 2497805 2404972 1459690 596260 75881 -437936 -628258
857f28258b05355C21229o1252q8116k1619D3900f12744j80173L81655d1478n94840
$$ -628258 -205355 321229 259977 171861 150242 43900 -612744 -792917 -411262 -41478 -636318
846f36318m62141L73785a75475j530j16514k29571p88058o57255O57332a62662
$$ -636318 -1098459 -724674 -175475 -177005 -293519 -523090 -1311148 -1968403 -1311071 -162662
835H1994e61620m92362q1124L08260d01943m27329j049436n40649J35615L80799
$$ 81994 -561620 -1053982 -1135106 -826846 -401943 -829272 -1878708 -2419357 -2283742 -1902943
825a902943L59115N24851M13405d5562F98480k03133b99620A91926J220840o6331
$$ -1902943 -1543828 -1018977 -605572 -45562 698480 495347 -299620 191926 1412766 1346435
815A346435C82811K95557O56204m22889k70943k59569h53967q73228h44891C09933
$$ 1346435 382811 678368 1334572 911683 640740 381171 -853967 -1727195 -844891 309933
804E02062O9351R864a57797p36463k75550L98185l9886p75082J85283O43522o81414
$$ 502062 571413 581277 -157797 -894260 -1169810 -771625 -811511 -1586593 -1401310 -757788 -1439202
793a439202N6962e61463B24054L60933O01718N47157n20727C94695d07004l82650
$$ -1439202 -1382240 -561463 224054 584987 1186705 1733862 1213135 394695 -407004 -789654
783g89654l02789j34880J6168k95498l97659P18656A72859P98868M23461P2540
$$ -789654 -1092443 -1227323 -1211155 -1506653 -1904312 -1185656 172859 971727 1395188 1467728
773A467728A60728b00281E04159K89684M25932J89364n17026c20643j61079B69439
$$ 1467728 160728 -200281 504159 793843 1219775 1409139 892113 -320643 -481722 269439
762G56651j06229J83942l01399a46117l57975o86109p24596k08003R28567E9916
$$ 756651 650422 834364 532965 -146117 -504092 -1190201 -1914797 -2122800 -1194233 59916
751I33939K84324D46334i74751j12959a14182F1022a038192m14267L59003b80092
$$ 933939 1218263 446334 -974751 -1087710 -114182 61022 -1038192 -1452459 -1093456 -280092
740C09918a50349p79860j54461c26004G57680Q94357Q8604q09477B07776a44554
$$ 309918 -150349 -930209 -1084670 -326004 757680 1652037 1740641 931164 207776 -144554
729d16675l54194r0049J75877o64134J57559C66478N01445h44529j336116i31049
$$ -416675 -770869 -860918 -685041 -1349175 -1191616 366478 867923 -844529 -2180645 -931049
718G34108p9874h4880o27800l96680M71379G2097b26486p62065L28567K69212
$$ 734108 654234 -84880 -712680 -1109360 -637981 72097 -226486 -988551 -659984 -390772
708c90772p37859J6478M98246j87903L61024B79377J78483p056A71466e48949
$$ -390772 -1128631 -1112153 -613907 -801810 -440786 279377 457860 450804 171466 -548949
697i33721J33672k08073k70189e44958B1410b16000p5919A64843N96840N57342
$$ -933721 -800049 -1008122 -1278311 -544958 21410 -216000 -291919 164843 761683 1319025
687A319025J172884J378677k80965j482233G85403j19609M12981J49993k92711
$$ 1319025 2491909 3870586 3589621 2107388 785403 665794 1078775 1228768 936057
678I36057a24715k67903A85526G4773e31237a29924H25867O06019r4020n20563
$$ 936057 -124715 -392618 185526 74773 -531237 -129924 825867 1431886 1337866 817303
668H17303k70285L7650N57539L77809k36803m64131B93869h02521l44163d65574
$$ 817303 547018 584668 1142207 1520016 1283213 819082 293869 -802521 -1146684 -465574
657c47312k97951b67776C78a012532n57928a68466G16767j22939N793J30956j77875
$$ -347312 -645263 -267776 378 -1012532 -1570460 -168466 716767 593828 599621 730577 552702
646E52702j20727f0598l67844E65566J173958o57357D54543K35429M49562j66378
$$ 552702 431975 -60598 -428442 565566 1739524 1082167 454543 689972 1139534 973156
636I73156l26990j85382j90801d8807o87786n01449j61258L35610c35451A630762
$$ 973156 646166 460784 269983 -48807 -736593 -1238042 -1399300 -1063690 -335451 1630762
625B868882j243253a99105m6862P0405n53265c11817a07214p60202l2388L24712
$$ 2868882 1625629 -199105 -245967 -175562 -728827 -311817 -107214 -867416 -899804 -575092
615e75092K46908J08012N7421A23726Q49588O89914n98134C64362h172j42531
$$ -575092 -328184 -220172 -162751 123726 973314 1663228 1065094 364362 -8172 -150703
605a50703J1715m11708j009607m51960f62494G51989K20886m00958k68359a59748
$$ -150703 -138988 -550696 -1560303 -2012263 -662494 751989 972875 571917 303558 -159748
594g13937o47243Q1148b92099G33728P6118J93126j68933a14325n52300E0372
$$ -713937 -1361180 -1280032 -292099 733728 809846 1002972 834039 -114325 -666625 50372
583G13947L53130k4522K05486K25013n10949B8458J81509O34499l10571D8948
$$ 713947 1067077 1042555 1248041 1473054 962105 28458 209967 844466 533895 48948
572D2477a108472j078191N80461a28545A081834P67916l72970G5227f43404q2542
$$ 42477 -1108472 -2186663 -1606202 -128545 1081834 1849750 1476780 75227 -643404 -725946
562g25946b67024B86873J96349k12558a63194o1420i0480l65361J37240F67044
$$ -725946 -267024 286873 483222 270664 -163194 -224614 -90480 -455841 -318601 667044
$$ [...]
##END NTUPLES=nD NMR SPECTRUM
##END=
