##TITLE=Analysis number 329744
Compound Code cc 03622
Book Reference 508/132
Project Code adrs
Chemist Name antons
##JCAMPDX= 6.0         $$ Bruker NMR JCAMP-DX V2.0
##DATA TYPE= NMR SPECTRUM
##DATA CLASS= NTUPLES
##ORIGIN= Bruker BioSpin GmbH
##OWNER= nmr
$$ XWIN-NMR		Version 3.5
$$ Wed Sep 26 10:17:37 2007 GMT Daylight Time (UT+1h)  MAYBRIDGE\nmr@NMR_250MHZ
##.OBSERVE FREQUENCY= 250.131544655141
##.OBSERVE NUCLEUS= ^1H
##.ACQUISITION MODE= SIMULTANEOUS (DQD)
##.ACQUISITION SCHEME= undefined
##.AVERAGES= 16
##.DIGITISER RES= 18
##SPECTROMETER/DATA SYSTEM= dpx250
##.PULSE SEQUENCE= zg30
##.SOLVENT NAME= CDCl3
##.SHIFT REFERENCE= (INTERNAL, CDCl3, 0, 16.4283)
##AUDIT TRAIL= $$ (NUMBER, WHEN, WHO, WHERE, WHAT)
$$ ##TITLE= Audit trail, XWIN-NMR		Version 3.5
$$ ##JCAMPDX= 5.01
$$ ##ORIGIN= Bruker BioSpin GmbH
$$ ##OWNER= nmr
$$ C:\u/data/dgb/nmr/ADRS/2380/pdata/1/auditp.txt
$$ ##AUDIT TRAIL=  $$ (NUMBER, WHEN, WHO, WHERE, WHAT)
(   1,<2007-09-26 10:17:09.00 +100>,<MAYBRIDGE\nmr>,<NMR_250MHZ>,
      <created by zg, POWCHK disabled, PULCHK disabled
       configuration hash MD5:
       76 6E 9A 78 1E 09 19 81 EC 84 63 8F B0 6A 59 2D
       data hash MD5: 64K
       2A F6 6C 57 A6 A8 4C F2 6F E7 4F F2 75 50 91 9C>)
(   2,<2007-09-26 10:17:24.34 +100>,<MAYBRIDGE\nmr>,<NMR_250MHZ>,
      <Start of raw data processing
       ef LB = 0.3 FT_mod = 6 PKNL = 1 SI = 32K 
       data hash MD5: 32K
       D2 9A B4 E7 AE 60 AC BF C2 8E C1 F3 56 04 EF 50>)
(   3,<2007-09-26 10:17:25.90 +100>,<MAYBRIDGE\nmr>,<NMR_250MHZ>,
      <apk 
       data hash MD5: 32K
       30 26 8E DF F5 3D 5D 7B E6 AC F5 C4 26 81 89 ED>)
(   4,<2007-09-26 10:17:26.59 +100>,<MAYBRIDGE\nmr>,<NMR_250MHZ>,
      <abs ABSG = 5 
       data hash MD5: 32K
       0F 02 5A C8 5F 30 B7 E0 AF 1C C2 78 7E A0 F2 66>)
$$ ##END=
$$ 
$$ hash MD5
$$ 9D B0 03 E3 BB 0B 8A EE 35 02 70 60 B8 AA A9 D7
##$RELAX= 
##$RELAX= 
##$RELAX= 
##$RELAX= 
##$RELAX= 
##$RELAX= 
##$RELAX= 
$$ Bruker specific parameters
$$ --------------------------
##$DU= <C:\u>
##$EXPNO= 2380
##$NAME= <ADRS>
##$PROCNO= 1
##$TYPE= <nmr>
##$USER= <dgb>
##$AMP= (0..31)
100 100 100 100 100 100 100 100 100 100 100 100 100 100 100 100 100 100 
100 100 100 100 100 100 100 100 100 100 100 100 100 100 
##$AQSEQ= 0
##$AQ_mod= 3
##$AUNM= <au_zg>
##$AUTOPOS= <40 >
##$BF1= 250.13
##$BF2= 250.13
##$BF3= 250.13
##$BF4= 250.13
##$BF5= 500.13
##$BF6= 500.13
##$BF7= 500.13
##$BF8= 500.13
##$BYTORDA= 1
##$CFDGTYP= 0
##$CFRGTYP= 5
##$CHEMSTR= <none>
##$CNST= (0..31)
1 1 145 1 1 1 1 1 1 1 1 1 1 1 1 1 1 1 1 1 1 1 1 1 1 1 1 1 1 1 1 1 
##$CPDPRG= <>
##$CPDPRG1= <>
##$CPDPRG2= <>
##$CPDPRG3= <>
##$CPDPRG4= <mlev>
##$CPDPRG5= <mlev>
##$CPDPRG6= <mlev>
##$CPDPRG7= <mlev>
##$CPDPRG8= <mlev>
##$CPDPRGB= <>
##$CPDPRGT= <>
##$D= (0..31)
0 1 0 0 0 0 0 0 0 0.06 0 0 0 0 0 0 0.0002 0 0 0 0 0 0 0 0 0 0 0 0 0 0 
0 
##$DATE= 1190798228
##$DBL= (0..7)
120 120 120 120 120 120 120 120 
##$DBP= (0..7)
150 150 150 150 150 150 150 150 
##$DBP07= 0
##$DBPNAM0= <>
##$DBPNAM1= <>
$$ [...]
##$SUBNAM7= <"">
##$SUBNAM8= <"">
##$SUBNAM9= <"">
##$SW= 20.6930455092707
##$SWIBOX= (0..15)
0 0 3 0 0 0 0 0 0 0 0 0 0 0 0 0 
##$SW_h= 5175.983436853
##$TD= 65536
##$TD0= 1
##$TE= 296.16
##$TE2= 300
##$TE3= 300
##$TEG= 300
##$TL= (0..7)
0 120 120 120 120 120 120 120 
##$TP= (0..7)
150 150 150 150 150 150 150 150 
##$TP07= 0
##$TPNAME0= <>
##$TPNAME1= <>
##$TPNAME2= <>
##$TPNAME3= <>
##$TPNAME4= <>
##$TPNAME5= <>
##$TPNAME6= <>
##$TPNAME7= <>
##$TPOAL= (0..7)
0.5 0.5 0.5 0.5 0.5 0.5 0.5 0.5 
##$TPOFFS= (0..7)
0 0 0 0 0 0 0 0 
##$TUNHIN= 0
##$TUNHOUT= 0
##$TUNXOUT= 0
##$USERA1= <user>
##$USERA2= <user>
##$USERA3= <user>
##$USERA4= <user>
##$USERA5= <user>
##$V9= 5
##$VALIST= <valist>
##$VCLIST= <CCCCCCCCCCCCCCC>
##$VD= 0
##$VDLIST= <DDDDDDDDDDDDDDD>
##$VPLIST= <PPPPPPPPPPPPPPP>
##$VTLIST= <TTTTTTTTTTTTTTT>
##$WBST= 1024
##$WBSW= 4
##$XGAIN= (0..3)
0 0 0 0 
##$XL= 0
##$YL= 0
##$YMAX_a= 618954
##$YMIN_a= -633704
##$ZGOPTNS= <>
##$ZL1= 120
##$ZL2= 120
##$ZL3= 120
##$ZL4= 120
##$ABSF1= 16.42829
##$ABSF2= -4.264881
##$ABSG= 5
##$ABSL= 3
##$ALPHA= 0
##$AQORDER= 0
##$ASSFAC= 0
##$ASSFACI= 0
##$ASSFACX= 0
##$ASSWID= 0
##$AUNMP= <proc_1d>
##$AZFE= 0.1
##$AZFW= 0.1
##$BCFW= 0
##$BC_mod= 0
##$BYTORDP= 0
##$COROFFS= 0
##$CY= 12.5
##$DATMOD= 1
##$DC= 0
##$DFILT= <>
##$DTYPP= 0
##$F1P= 14.0000005364418
##$F2P= -0.99999901652339
##$FCOR= 0.5
##$FTSIZE= 32768
##$FT_mod= 6
##$GAMMA= 0
##$GB= 0
##$INTBC= 1
##$INTSCL= 1
##$ISEN= 128
##$LB= 0.3
##$LEV0= 0
##$LPBIN= 0
##$MAXI= 10000
##$MC2= 0
##$MEAN= 0
##$ME_mod= 0
##$MI= 0
##$NCOEF= 0
##$NC_proc= -2
##$NLEV= 6
##$NOISF1= 0
##$NOISF2= 0
##$NSP= 0
##$NTH_PI= 0
##$NZP= 0
##$OFFSET= 16.42829
##$PC= 1
##$PHC0= 154.7935
##$PHC1= 4.953332
##$PH_mod= 1
##$PKNL= yes
##$PPARMOD= 0
##$PSCAL= 4
##$PSIGN= 0
##$REVERSE= no
##$SF= 250.130023437439
##$SI= 32768
##$SIGF1= 0
##$SIGF2= 0
##$SINO= 400
##$SIOLD= 32768
##$SREGLST= <1H.CDCl3>
##$SSB= 0
##$STSI= 32768
##$STSR= 0
##$SW_p= 5175.98343685301
##$SYMM= 0
##$S_DEV= 0
##$TDeff= 65536
##$TDoff= 0
##$TI= <Analysis number 999999
Compound Code 99
Book Reference 9
Project Code 9>
##$TILT= no
##$TM1= 0
##$TM2= 0
##$TOPLEV= 0
##$USERP1= <user>
##$USERP2= <user>
##$USERP3= <user>
##$USERP4= <user>
##$USERP5= <user>
##$WDW= 1
##$XDIM= 32768
##$YMAX_p= 452756796
##$YMIN_p= -119152
$$ End of Bruker specific parameters
$$ ---------------------------------
##NTUPLES= NMR SPECTRUM
##VAR_NAME=  FREQUENCY,     SPECTRUM/REAL,   SPECTRUM/IMAG
##SYMBOL=    X,             R,               I
##VAR_TYPE=  INDEPENDENT,   DEPENDENT,       DEPENDENT
##VAR_FORM=  AFFN,          ASDF,            ASDF
##VAR_DIM=   32768,         32768,           32768
##UNITS=     HZ,            ARBITRARY UNITS, ARBITRARY UNITS
##FACTOR=    0.157963299565203, 1,           1
##FIRST=     4109.20841602382, 0,            0
##LAST=      -1066.77502082919, 0,           0
##MIN=       -1066.77502082919, -119152,     0
##MAX=       4109.20841602382, 452756796,    0
$$ Real data points
##PAGE= N=1
##DATA TABLE= (X++(R..R)), XYDATA
$$ [...]
19389i517N756l852K611O174J169r91m002L569L390l201M788K530n600K588Q06
$$ -9517 -3761 -7613 -5002 1172 2341 1350 -2652 917 4307 1106 5894 8424 2824 5412 6218
19374F218j94q425M305M855j026M541m21l449k596J610l741j090O472j557n877
$$ 6218 6024 -2401 1904 6759 5733 10274 9853 6404 3808 5418 1677 587 7059 5502 -375
19359c75K262Q731L673K977r782J191n21J618k728k013l842l555k78L412m415
$$ -375 1887 10618 14291 17268 7486 8677 8156 9774 7046 5033 1191 -2364 -2642 770 -3645
19344c645l699k670L988R224L030O96Q948K534j1579m872L148k009j366O322N487
$$ -3645 -7344 -10014 -6026 3198 6228 6924 15872 18406 6827 1955 5103 3094 1728 8050 13537
19329A3537k169p965l207l846n646L84K204m474Q79N768O341j257p61L56r352
$$ 13537 11368 3403 196 -3650 -9296 -8912 -6708 -11182 -10303 -4535 1806 549 -212 144 -9208
19314i208m508K342q43K276M432N271N290J419o111k466o35N073l10o6n221J806
$$ -9208 -13716 -11374 -12217 -9941 -5509 -238 5052 6471 360 -2106 -2741 2332 2022 1956 -3265 -1459
19298a459Q099j760k319J652M319j1656m461N888P621m390J953L819k955r622
$$ -1459 6640 4880 2561 4213 8532 -3124 -7585 -1697 5924 1534 3487 7306 4351 -5271
19284e271l837M354N016r11j898k40K358J1323M72o99K1K693r148q011l890M970
$$ -5271 -9108 -4754 262 -649 -2547 -2787 -429 10894 11366 10667 10688 13381 4233 -3778 -7668 -2698
19268b698P19L438j80j905n296j15J639l057R98O174Q019Q96L390q846m591r04
$$ -2698 -1979 1459 1279 -626 -5922 -6037 -4398 -7455 -6457 -283 7736 8632 12022 3176 -1415 -2319
19252b319N25m301r93l869O243R202K552P356l753r502r087K411O725O181L908
$$ -2319 -1794 -6095 -7088 -10957 -4714 4488 7040 14396 10643 1141 -7946 -5535 1190 7371 11279
19237A1279m53l153j64n737n58L300L91l35j160l795J607p01J673O999Q53q032
$$ 11279 10826 7673 7509 1772 1214 4514 4905 4570 3410 -385 1222 521 2194 9193 10046 2014
19221B014j87K480M53K743j669O83K838m409n740J688J64o060K431N176q81Q980
$$ 2014 1827 4307 4760 7503 5834 6517 9355 4946 -794 894 1058 -5002 -2571 2605 1724 10704
19205A0704m78Q55k725n218N279J380m697l984j815J898L855o0J921J382k132
$$ 10704 10226 11081 8356 3138 8417 9797 5100 1116 -699 1199 5054 4994 6915 8297 6165
19190F165o508k101k220M067O580K167l849Q76K337j149J0603L964k206n721k636
$$ 6165 -343 -2444 -4664 -597 5983 8150 4301 5177 7514 6365 16968 20932 18726 13005 10369
19175A0369k694j385R596k468P29O19j032M659k43p482p148N635P451O571J501
$$ 10369 7675 6290 15886 13418 14147 14766 13734 18393 18150 10668 3520 9155 16606 23177 24678
19160B4678k33N506K008L806l98J9m1N575R353J2040P616J3283K0310K7908N3982
$$ 24678 24445 29951 31959 35765 35367 35386 35345 40920 50273 62313 69929 83212 103522 131430 185412
19145A85412N9645M8327L6682K0404j7655l5244k3081p726P674J9847L0563K1611
$$ 185412 245057 293384 330066 350470 332815 297571 274490 266764 274438 294285 324848 346459
19133C46459r373l7264n1640n4083n1939m4071k5654k1598j4145j2261n478j077
$$ 346459 337086 299822 248182 194099 142160 98089 72435 50837 36692 24431 18953 17876
19121A7876N008K449l394j941m00r56n877n48l630j981M028j840J260j695q941
$$ 17876 22884 25333 21939 19998 19598 18642 12765 12217 8587 6606 10634 8794 10054 8359 -582
19106e82K58O406N842M148K198K199k938k991m690k042J859m358k580M71j34k889
$$ -582 -324 6082 11924 16072 18270 20469 17531 14540 9850 7808 9667 5309 2729 3200 3066 177
19090A77N40K866n536M193N826K369k019j617l573m997n482K7K507N328J762q64
$$ 177 717 3583 -1953 2240 8066 10435 8416 6799 3226 -1771 -7253 -7226 -4719 609 2371 1507
19074A507r98j006N293P0n470m14j651K450L114L812K575P771k029p747j718M843
$$ 1507 509 -497 4796 4866 -604 -1018 -2669 -219 2895 6707 9282 17053 15024 7277 5559 10402
19058A0402N921J688m518r24r89p897j508q83L374M809M08k011O62K559k013o729
$$ 10402 16323 18011 13493 12569 11580 3683 2175 1292 4666 9475 9883 7872 8534 11093 9080 2351
19042B351r650k102J180O21l812m977M908M629k957M768J0062R478L059J907K435
$$ 2351 -7299 -9401 -8221 -7600 -11412 -16389 -11481 -6852 -9809 -5041 5021 14499 17558 19465 21900
19027B1900m363m420M408n627n681L109J310K639R06J392o917n865M707P223j8
$$ 21900 17537 13117 17525 11898 6217 9326 10636 13275 14181 15573 8656 2791 7498 14721 14703
19012A4703N47L802K649k7J598O152Q364P492P489R265J3521J2152J5909K2710
$$ 14703 15250 19052 21701 21674 23272 29424 37788 45280 52769 62034 75555 87707 103616 126326
18998A26326K4633K2201K9697K5603J5219J4069R082J541k162L886O148K09L867
$$ 126326 150959 173160 202857 228460 243679 257748 266830 268371 266209 270095 276243 276452 280319
18985B80319n031j4287j2406j7100k8916k6035k9677l3367j9982j2491j5344p482
$$ 280319 275288 261001 248595 231495 202579 176544 146867 113500 93518 81027 65683 58201
18973E8201j117n945l749n493q809r428l641k392J43J44l51q944J691N063J0685
$$ 58201 57084 51139 47390 41897 33088 23660 20019 17627 17770 17914 17563 8619 10310 15373 26058
18958B6058Q690j1529o320k208r49O259r17n246m97j316M205K223k447k403o211
$$ 26058 34748 23219 16899 14691 13742 20001 19084 13838 13341 12025 16230 18453 16006 13603 7392
18943G392j597P47K919k498J204N078K717n843o23q293j156j081O03M80J160K415
$$ 7392 5795 6542 9461 6963 8167 13245 15962 10119 9496 1203 47 -1034 -431 49 1209 3624
18927C624j858Q261O486n289p731J286N765k97l919j647K289m439q000n284M418
$$ 3624 1766 10027 16513 11224 3493 4779 10544 10247 6328 4681 6970 2531 -5469 -10753 -6335
18912f335J0214K749k730k031l895m92K004J357Q89L540K64L053M945J864J751
$$ -6335 3879 6628 3898 1867 -2028 -2520 -516 841 1730 5270 5534 8587 13532 15396 17147
18897A7147j730j881m532n826q476n438k370O042O238J492P90M47L042k394J94
$$ 17147 15417 13536 9004 3178 -5298 -10736 -13106 -7064 -826 666 1456 1903 4945 2551 2745
18882B745L524N611P167o615m180K104j582L612l996m532K559K538k753k714m394
$$ 2745 6269 11880 19047 12432 8252 10356 8774 12386 8390 3858 6417 8955 6202 3488 -906
18867i06M526K036o924k158p597l943K510K357O008N405l17P76O012l649m235
$$ -906 3620 5656 -1268 -3426 -11023 -14966 -12456 -10099 -4091 1314 997 1773 7785 4136 -99
18852i9Q81J003M711k919j38N004M359l745l911n350K872L580M099n405j0471
$$ -99 782 1785 6496 3577 3439 8443 12802 9057 5146 -204 2668 6248 10347 4942 -5529
18837e529Q68P263J196n399p374k187J1388L829J002o00r19J110j942J642J18
$$ -5529 -4661 2602 3798 -1601 -8975 -11162 226 4055 5057 4457 3538 4648 2706 4348 4466
18822D466k886K481l129p766l667K868j515l03L047n604Q250O759K096l335K578
$$ 4466 1580 4061 932 -6834 -10501 -7633 -9148 -9451 -6404 -12008 -3758 3001 5097 1762 4340
18807D340j828M751j558J673L209L634j853o629p2L09P880J0785N050K212n93
$$ 4340 2512 7263 5705 7378 10587 14221 12368 5739 5667 5976 13856 24641 29691 31903 31310
18792C1310M722M646k235m167J048J037K420N611K887R885J6j2304j0942r254
$$ 31310 36032 40678 38443 34276 35324 36361 38781 44392 47279 57164 57180 44876 33934 24680
18778B4680R52j763m013j486N154O431Q160J0836O210J4794J2265n602j1756j8476
$$ 24680 25632 23869 19856 18370 23524 29955 38115 48951 55161 69955 82220 76618 64862 46386
18764D6386j2330J104l58p940k988K921k120j344m31N30k247l516j843j22l182
$$ 46386 34056 35160 34802 26862 23874 26795 24675 23331 22900 23430 21183 17667 15824 15702 12520
18749A2520j355j227M65j817J069J1009M339r90l575o76J125J708J884k163m842
$$ 12520 11165 9938 10403 8586 9655 20664 25003 24013 20438 19762 20887 22595 24479 22316 17474
18734A7474N055J182M115j33m770p488L650O66K616K872K083l706K770Q204J637
$$ 17474 22529 23711 27826 27693 22923 15435 19085 19751 22367 25239 27322 23616 26386 34590 36227
18719C6227l912J615k240M507O565L277N46J898m045Q4M074N349Q86n270m167
$$ 36227 32315 33930 31690 36197 42762 46039 46585 48483 44438 44522 48596 53945 54831 49561 45394
18704D5394O815M66J720M250K568r495r618m224K085J67R45N530K145j288l698
$$ 45394 52209 52675 54395 58645 61213 51718 42100 37876 39961 40128 41073 46603 48748 47460 43762
18689D3762o755q042J37K098N673O178j674m000M956J21m392o389n353L360Q819
$$ 43762 37007 28965 29102 31200 36873 43051 41377 37377 42333 42454 38062 31673 26320 29680 38499
18674C8499n401l042p158j0251m765m467J435j698o215L480k020J0597J2178Q564
$$ 38499 33098 30056 22898 12647 7882 3415 4850 3152 -3063 417 -1603 8994 21172 29736
18660B9736O701m897r798k406l206M451J2550J0326R085J5511P533M72j273j59
$$ 29736 36437 31540 21742 19336 16130 20581 33131 43457 52542 68053 75586 76058 74785 74626
18646G4626k2k958m637j47j17P50O064J339n454k901J73O131R830Q839L227l72
$$ 74626 74604 71646 67009 66862 66745 67495 73559 74898 69444 66543 66716 72847 82677 91516 94743 94371
18630I4371J075O562P826J6095J2739J4066J2721J7018J6571l367m501m851j5
$$ 94371 95446 102008 109834 125929 138668 152734 165455 182473 199044 195677 191176 186325 186310
18617A86310k395K431J4313K6269J0171j4002j6237j3077m786l409j0831j7066
$$ 186310 183915 186346 200659 226928 237099 223097 206860 193783 188997 185588 174757 157691
18605A57691Q17M329M28J737L001L507J4637J2823L403N159N933L638K640J3247
$$ 157691 158508 162837 163265 165002 168003 171510 186147 198970 202373 207532 213465 217103 219743 232990
18591B32990J8313R725J5864J4313J1680K2494J5025J1218J0912J2449J8279J8510
$$ 232990 251303 261028 276892 291205 302885 325379 340404 351622 362534 374983 393262 411772
18579D11772K6267K2638J7261J0888K7039L1852M0638M3011M0319N0044O0938
$$ 411772 438039 460677 477938 488826 515865 547717 588355 631366 671685 721729 782667
18568G82667O9975R2272J20393J52685J75268J98820J96489J62165J29601R8428
$$ 782667 852642 944914 1065307 1217992 1393260 1592080 1788569 1950734 2080335 2178763
18558B178763R8344J61269K46781L39707M31530M96558N21807N38312N53895O19330
$$ 2178763 2277107 2438376 2685157 3024864 3456394 3952952 4474759 5013071 5566966 6186296
18548F186296P43432R42011J267118J725197K407466L454045N062632P226398
$$ 6186296 6929728 7871739 9138857 10864054 13271520 16725565 21788197 29014595
18540B9014595R395363J0555231R066758N021307K95006m361129n848065m299900
$$ 29014595 38409958 48965189 58031947 63053254 63348260 58987131 53139066 48839166
18532D8839166l62658L975082O685403N754500J704520l515588q838793j1125168
$$ 48839166 48476508 52451590 59136993 64891493 66596013 63080425 54241632 43116464
18524D3116464j0869030q758478o243373m212139k819323j948297j406812j035077
$$ 43116464 32247434 23488956 17245583 13033444 10214121 8265824 6859012 5823935
18516E823935p76909n82349m42228l46624l08778k84919k74916k66513k35502
$$ 5823935 5047026 4464677 4022449 3675825 3367047 3082128 2807212 2540699 2305197
18507B305197j83269j27574q1752n1041n8746r3752j25666j44302j40998j42214
$$ 2305197 2121928 1994354 1912602 1861561 1802815 1709063 1583397 1439095 1298097 1155883
18497A155883j24788r6406p6012o7046n8716m6733m1816l7240l2528j8193j9645
$$ 1155883 1031095 934689 858677 791631 732915 686182 644366 607126 574598 556405 536760
18486E36760k7839j6800j6280k1426k1911j3653p666q800j6641j6585q487r193
$$ 536760 508921 492121 475841 454415 432504 418851 411185 402385 385744 369159 360672 351479
18474C51479m815r542j0268o349j0817j4544j4567q946l959j0208j1518j102k161
$$ 351479 346664 337122 326854 320505 309688 295144 280577 271631 267672 257464 245946 244844 242683
18461B42683K276l564l376q038l633K114j6L43K104P067M650O381L630J728O170
$$ 242683 244959 241395 238019 229981 226348 228462 228446 228789 230893 237960 242610 248991 252621 254349 260519
18446B60519M738J038K463L279N348P798J5496J6383K5175K5555J7679J2812M680
$$ 260519 265257 266295 268758 272037 277385 285183 300679 317062 342237 367792 385471 398283 402963
18433D02963o487j1120j4316j3358k1489j3442q628r247l450m35j055N18l33J3697
$$ 402963 396476 385356 371040 357682 336193 322751 314123 304876 301426 300991 299936 300454 300121 313818
18419C13818O580O612J4470M751J873O607k435P64J1602J6836J3500J2461r28
$$ 313818 320398 327010 341480 346231 348104 354711 352276 353040 364642 381478 394978 407439 406511
18406D06511q910n029q31N326J3589R575j443J044k631k453j92K889J1298R826
$$ 406511 397601 392572 391741 397067 410656 420231 418788 419832 417201 414748 414556 417445 428743 438569
18392D38569J0588R809J3892J9973J9829J7287J8651K5062J5947J5633K3171L3412
$$ 438569 449157 458966 472858 492831 512660 529947 548598 573660 589607 605240 628411 661823
18380F61823M2910M2406M2022M7436N7716O7251P8624Q1371Q5775Q9345Q0421
$$ 661823 704733 747139 789161 836597 894313 961564 1040188 1121559 1207334 1296679 1377100
18369A377100O6492O7529P1767Q4269R1729J17778J36692J41687J37024J35978
$$ 1377100 1443592 1511121 1582888 1667157 1758886 1876664 2013356 2155043 2292067 2428045
18359B428045J48094J61828J93305K30673K89783L56835M22164M97009N80725
$$ 2428045 2576139 2737967 2931272 3161945 3451728 3808563 4230727 4727736 5308461
18350E308461O70600P73949R01892J060188J281449J577201J982973K526950L233076
$$ 5308461 5979061 6753010 7654902 8715090 9996539 11573740 13556713 16083663 19316739
18341A9316739M079215M919607N559932N774571N276492M041677K459785Q33578
$$ 19316739 23395954 28315561 33875493 39650064 44926556 48968233 51428018 52261596
18333E2261596n10922j140461j037915m85345R4907J81439m52529j577484l001950
$$ 52261596 51750674 50610213 49572298 49086953 49181860 49363299 48910770 47333286 44331336
18324D4331336m367816n253867n496519n159138m454774l614494k831826k186336
$$ 44331336 39963520 34709653 29213134 24053996 19599222 15984728 13152902 10966566
18316A0966566j694001j331434j067506q68723p12766n90631m89917m13483l45118
$$ 10966566 9272565 7941131 6873625 6004902 5292136 4701505 4211588 3798105 3452987
18307C452987k90270k42417k02966j77849j44918j23108r0158q2758q4522r1509
$$ 3452987 3162717 2920300 2717334 2539485 2394567 2271459 2181301 2098543 2014021 1922512
18297A922512r8175r3739q8708p1486o7478o7489o8218n8065p4139q1770p5704
$$ 1922512 1824337 1730598 1641890 1570404 1502926 1435437 1367219 1309154 1235015 1153245 1077541
18286A077541o8586o1034n8700n1852n5955m3864l6792l3965k5003j9286j8950
$$ 1077541 1008955 947921 889221 837369 781414 737550 700758 666793 641790 622504 603554
18275F03554j6797k7726k4374k3162k4297j9484j6004j2484j1556j4477j1505
$$ 603554 586757 559031 534657 511495 487198 467714 451710 439226 427670 413193 401688
18264D01688j2302j0282m747o725j1262j5565o735j7351q911p572j1774o014j344
$$ 401688 389386 379104 374357 367632 356370 340805 334070 316719 307808 300236 288462 282448 281104
18251B81104j146K240n302q820j4737q914m088j0269p321q28M444Q090n009j1570
$$ 281104 279958 282198 276896 268076 253339 244425 240337 230068 222747 221919 226363 234453 229444 217874
18237B17874m770q512M91n262l926n232n013m10q132M244N339j367q817n432k799
$$ 217874 213104 204592 205083 199821 195895 190663 185650 185240 177108 181352 186691 185324 176507 171075 168276
18222A68276n035n420k623l345m619l814p305l338M652j421o457r80K190K276
$$ 168276 163241 157821 155198 151853 147234 143420 136115 132777 137429 136008 129551 128571 130761 133037
18208A33037J3925R125M74p461j473n12J250M59N926M869L242J018l227r255j0137
$$ 133037 146962 156087 156561 149100 147627 147115 148365 148824 154750 159619 162861 163879 160652 151397 141260
18193A41260j0308n959L052k056n030m916o089o45j1046j392L66p366k448P4n36
$$ 141260 130952 124993 128045 125989 120959 116043 109954 109309 98263 96871 97237 89871 87423 87497 86961
18178H6961q79K480M811q83j367q713p964m377n780l605Q216O72l98p25r074Q40
$$ 86961 86082 88562 93373 92490 91123 82410 74446 70069 64289 60684 68900 69572 69174 68449 59375 60215
18162F0215N910J0153q57k874k674J037L068l865o047j789M941M268k416O90L58
$$ 60215 66125 76278 75421 72547 69873 70910 73978 70113 64066 62277 67218 71486 69070 69760 70118
18147G0118N386K621n245R07L500J2147L732J663j093J0194J3865J4519N367K036
$$ 70118 75504 78125 72880 73787 77287 89434 93166 94829 93736 103930 117795 132314 137681 139717
18133A39717R376J5257J0565J1628J3922J5975J7108M0418N4784N7567O2148O4621
$$ 139717 149093 164350 174915 186543 200465 216440 233548 273966 328750 386317 448465 513086
18121E13086P0115Q2550Q9828J04863J40305J81830K53593L88789O41015J110072
$$ 513086 583201 665751 755579 860442 1000747 1182577 1436170 1824959 2465974 3576046
18111C576046J965206L134907K931960l83944k578654k923052k209008j229890
$$ 3576046 5541252 8676159 11608119 11224175 8645521 5722469 3513461 2283571
18103B283571o62365l95056k58985j80269j31371j01532q6226o9927o0986l9762
$$ 2283571 1621206 1226150 967165 786896 655525 553993 467767 397840 336854 297092
18093B97092k8609k7437k2325j8005j4292j1346j0966j2327o586r934j1199m864
$$ 297092 268483 241046 218721 200716 186424 175078 164112 151785 145199 135265 124066 119202
18081A19202k594l08j724M500j370q590j3778p137L136Q01Q5R10o106n486j0680
$$ 119202 116608 116300 114576 119076 117706 109116 95338 88201 91337 92138 92223 93133 87027 81541 70861
18066G0861n873j033L15k699M37L537K690K266m199j0058j574K943O43M846R9
$$ 70861 64988 63955 64270 61571 62008 65545 68235 70501 66302 56244 54670 57613 58256 63102 63201
18051F3201L98n391m236R89O507k83l74p799j629l253P300J25j1220o854k910
$$ 63201 63599 58208 53972 54961 61468 61185 60811 53012 51383 48130 55430 55555 44335 37481 34571
18036C4571k926Q55L937m11L880N544K900j717m353o981j37R419j110k642m20
$$ 34571 31645 32500 36437 36026 39906 45450 48350 46633 42280 35299 35162 44581 43471 40829 40409
18021D0409m871j258k473j488l594j927K70K43M925J473L60J585m684k81K281
$$ 40409 35538 34280 31807 30319 26725 24798 25068 25311 30236 31709 32069 33654 28970 28689 30970
18006C0970l419P036J386q802k742O106l077j536J914J757j345o626m427j730
$$ 30970 27551 34587 35973 27171 24429 30535 27458 25922 27836 29593 28248 21622 17195 15465
17992A5465j08m85L539J422q875m642M638O977M164J216N501L956R60K90o059
$$ 15465 15357 14872 18411 19833 10958 6316 10954 17931 22095 23311 28812 32768 33728 34018 27959
17977B7959k766m807L231O26j385R605N816p600q439J083P84l611j999r95j979
$$ 27959 25193 20386 23617 24243 22858 32463 38279 30679 22240 23323 24107 20496 18497 17502 15523
17962A5523K519Q520j521K640k538m494N562L433n217q159j868m106N326Q519
$$ 15523 18042 26562 25041 27681 25143 20649 26211 29644 24427 16268 14400 10294 15620 24139
17948B4139L786k793M497M79Q82m00K161J09J940o63k50J1701O155M111o90N584
$$ 24139 27925 25132 29629 30108 30990 30590 32751 32860 34800 34137 33887 45588 51743 55854 55164 60748
17932F0748N272K3310K4418L1080M4423M6407N1647M4502K7973o040k4430l3729
$$ 60748 66020 89330 113748 144828 189251 235658 287305 331807 359780 353740 329310 295581
17920B95581k1105n07K4031K0965K4850M413k0120m1688n1266m7858l8851k9773
$$ 295581 274476 273969 298000 318965 343815 348228 328108 286420 235154 187296 148445 118672
17908A18672k2222j5450j2748r244r964j0400l671p09o44N33L115K017l235j634
$$ 118672 96450 81000 68252 59008 49044 38644 34973 34264 33620 34153 37268 39285 36050 34416
17894C4416J365Q4O33j070p096o875m331j293l184k26M225K723L206M267m00q391
$$ 34416 35781 35865 36498 35428 28332 21457 17126 15833 12649 12423 16648 19371 22577 26844 26444 18053
17878A8053n884l573L653k615M261J728j678j353k023j085j458l636N873O209
$$ 18053 12169 8596 12249 9634 13895 15623 13945 12592 10569 9484 8026 4390 10263 16472
17864A6472O643L918o235j0840l044P713K332o379j210j749P583J611k08o147
$$ 16472 23115 27033 20798 9958 6914 14627 16959 10580 9370 7621 15204 16815 16607 10460
17850A0460n147l012J08L142J083M177n14o740N08M689k413L440N854m859n777
$$ 10460 5313 2301 2409 5551 6634 10811 10297 3557 4065 8754 6341 9781 15635 10776 4999
17835D999n915m49M557j82K300r79P188L641K80n701k286R84k850J515P925J229
$$ 4999 -916 -1365 3192 3010 5310 4331 11519 15160 15440 9739 7453 8437 5587 7102 15027 16256
17819A6256k562j311j043P02N852L638o503j058l426j227j894J356m191j146K262
$$ 16256 13694 12383 11340 12042 17894 21532 15029 13971 10545 9318 7424 8780 4589 3443 5705
17804E705N626L094l920J625r66J564k142l173q030N939R030m105N74L194n305
$$ 5705 11331 14425 10505 12130 11164 12728 10586 7413 -617 5322 14352 10247 10821 14015 8710
17789H710K607n544p952m794j725M558O157o55j096N808j516n262O782M903l001
$$ 8710 11317 5773 -2179 -6973 -8698 -4140 2017 1362 266 6074 4558 -704 6078 10981 7980
17774G980m400o019K676K126M393N543K387l480o098p51N899K158J073m113l364
$$ 7980 3580 -2439 237 2363 6756 12299 14686 11206 5108 4357 10256 12414 13487 9374 6010
17759F010n507M02N59J802l018P50n574O443Q784J329n77Q293q74m961k343p205
$$ 6010 503 905 1464 3266 248 998 -4576 1867 10651 11980 11403 19696 18822 13861 11518 4313
17743D313p156J033J0153O161K570m3k509o719L22j183J642M850p99J093l648
$$ 4313 -2843 -1810 8343 14504 17074 17031 14522 7803 8125 6942 8584 13434 12635 13728 10080
17728A0080l70o13k4K440K255L298L98n490k776M021M892L607m348O80p803q981
$$ 10080 9710 9097 9073 11513 13768 17066 17464 11974 9198 13219 18111 21718 17370 18050 10247 1266
17712A266m273K831J788J012N961N294M385M98j880m227N625j282p380l633L715
$$ 1266 -3007 -176 1612 2624 8585 13879 18264 18762 16882 12655 18280 16998 9618 5985 9700
17697I700Q889L360k693K47N658P202L767L682J040k532K87n406L65l811j417
$$ 9700 18589 21949 19256 19503 25161 32363 36130 39812 40852 38320 38607 33201 33566 29755 28338
17682B8338J837J6368J4171J2172N652J1624J9637K8911K3008K1206K9070L0876
$$ 28338 30175 46543 60714 72886 78538 90162 109799 138710 161718 182924 211994 242870
17670B42870J8578J3745J4017j277r805m928q079j804K972Q57p910j1444k3011
$$ 242870 261448 275193 289210 287933 278128 273200 265121 263317 266289 267146 259236 247792 224781
17657B24781k6405k6653l0675k2621j7862j3678j3690j2479n751p395k710k440
$$ 224781 198376 171723 141048 118427 100565 86887 73197 60718 54967 47572 44862 42422
17645D2422l838n420K437m689J765o835r861m469R38J673O493O23l812j690J734
$$ 42422 38584 33164 35601 30912 32677 25842 15981 11512 12450 14123 20616 21239 17427 15737 17471
17630A7471l458k078l246M76k151j555K84p133j009r34j658J605k580M826N874
$$ 17471 14013 11935 8689 9165 7014 5459 5743 -1390 -2399 -3333 -4991 -3386 -5966 -1140 4734
17615D734L622m769j162K598j20J713n4mj931L839l631m395l914j295q63n54n473
$$ 4734 8356 3587 2425 5023 4903 6616 6562 6558 4627 8466 4835 440 -3474 -4769 -5632 -6186 -11659
17598a1659k022N563Q297M882P96l669K579J343L442K474l930K037j543l401o92
$$ -11659 -13681 -8118 179 5061 5857 2188 4767 6110 9552 12026 8096 10133 8590 5189 4497
17583D497M586n770o106m125J57K252J530m576O030R84L394m722q215M58K04K805
$$ 4497 9083 3313 -2793 -6918 -6761 -4509 -2979 -7555 -1525 -541 2853 -1869 -10084 -9626 -9422 -6617
17567f617L501L319L472R6m715J009Q44K309n11n484P175L818k186k334r58j700
$$ -6617 -3116 203 3675 3771 -944 65 909 3218 2707 -2777 4398 8216 6030 3696 2738 1038
17551A038l804j11J900K760M267L897j1433k497J1144j275l012M53j96J719J637
$$ 1038 -2766 -2877 -977 1783 6050 9947 -1486 -3983 7161 5886 2874 3327 3131 4850 6487
17536F487r41J498J129J134K371Q77k394L24n141k008q30k102K470J929L662N16
$$ 6487 5546 7044 8173 9307 11678 12555 10161 10485 5344 3336 2506 404 2874 4803 8465 8981
17520H981n266l082j676J148n868K652O145k612N18l614J399m7L460j683J999
$$ 8981 3715 633 -1043 105 -5763 -3111 3034 422 940 -2674 -1275 -1322 2138 455 2454
17505B454j823m297k059L081P323N501r74K661l864q475j792l569O06J287K240
$$ 2454 631 -3666 -5725 -2644 4679 10180 9206 11867 8003 -472 -2264 -5833 -5227 -3940 -1700
17490a700N836P85k336K605Nl459k777N486K339K440j861j0576p535l338R681
$$ -1700 4136 4921 2585 5190 5195 1736 -1041 4445 6784 9224 7363 -3213 -10748 -14086 -4405
17475d405J0365N886k2k424J012M18j256k757j031K459p568k279M884n845m915
$$ -4405 5960 11846 11824 9400 10412 10830 9574 6817 5786 8245 677 -1602 3282 -2563 -7478
17460g478J180J1138J287m838m210o29n339m533o04R083J1216P464l591o202q6
$$ -7478 -6298 4840 6127 1289 -2921 -3550 -8889 -13422 -14026 -4943 6273 13737 10146 3944 3858
17445C858L540Q721J1026J6104J6331m389j6419j6455p290J233o298j823O38M237
$$ 3858 7398 16119 27145 43249 59580 55191 38772 22317 15027 16260 9962 8139 8777 13014
17431A3014r4M504k467q39o577K091P68k411n051n790M114M022l308l343j7k357
$$ 13014 12920 17424 14957 14118 7541 9632 10400 7989 2938 -2852 1262 5284 1976 -1367 -1384 -3741
17415c741j493M228j080k547O13L043M72p61K32l146L260n93k635o803M408R675
$$ -3741 -5234 -1006 -2086 -4633 -4020 -977 -505 -1266 -1034 -4180 -920 -1513 -4148 -10951 -6543 3132
17399C132Q751N511L72m183k990n812K560L285o569l460M95l175K075o838R211
$$ 3132 11883 17394 17766 13583 10593 4781 7341 10626 4057 597 1092 -2083 -8 -6846 2365
17384B365K71l535O151L314n011l592M326n486k623j640p661L930J864L678J804
$$ 2365 2636 -899 5252 8566 3555 -37 4289 -1197 -3820 -5460 -13121 -9191 -7327 -3649 -1845
17369a845j826j525Q32j112o36O581L058K96m495p280R80R99k82O825K027m474
$$ -1845 -3671 -5196 -4364 -5476 -6112 469 3527 3823 -672 -7952 -6972 -5973 -6255 570 2597 -1877
17353a877l478j588M289P050J871l458j427O61J119O562j037k105J906l991o755
$$ -1877 -5355 -6943 -2654 4396 6267 2809 1382 2043 3162 9724 8687 6582 8488 4497 -2258
17338b258J562L042n467m662P488M729L723K29Q75k412l332J685K855J658k875
$$ -2258 -696 2346 -3121 -7783 -295 4434 8157 8386 9261 6849 3517 5202 8057 9715 6840
17323F840p20o11n833M113R71J379N789n766j986K687p18o282m409m199P084M626
$$ 6840 6120 5509 -324 3789 4760 6139 11928 6162 4176 6863 6145 -137 -4546 -8745 -1661 2965
17307B965l674n669k341m99J313r92K878K153k891k035l504j052J859M234M465
$$ 2965 -709 -6378 -8719 -9218 -7905 -8897 -6019 -3866 -6757 -8792 -12296 -13348 -11489 -7255 -2790
17292b790k562k268k771N541P043K01j0M08n445L169N836J987l152m578l781L492
$$ -2790 -5352 -7620 -10391 -4850 2193 2394 2384 2792 -2653 516 6352 8339 5187 609 -3172 320
17276C20k43K028l456m681J603P733M158n15m842j589K508J252K502j242j561
$$ 320 77 2105 -1351 -6032 -4429 3304 7462 6947 2105 516 3024 4276 6778 5536 3975
17261C975J4O246K805N50N57k137o099p581l879L238l078j640Q243L800O820q388
$$ 3975 3989 10235 13040 13590 14147 12010 5911 -1670 -5549 -2311 -5389 -7029 1214 5014 11834 3446
17245C446k383k265L833Om886q471k905O714J0700K251K107k932k398q87l28n374
$$ 3446 1063 -1202 2631 2637 -2249 -10720 -13625 -6911 3789 6040 8147 5215 2817 1930 1602 -3772
17229c772k151L321j578k586Q726j756O11J68N167O521m177k600n416l209L137
$$ -3772 -5923 -2602 -4180 -6766 1960 204 815 983 6150 12671 8494 5894 478 -2731 406
17214D06Q95j221j021k210j140O54m819K053M495r15L330l16J753m917j080l87
$$ 406 1301 80 -941 -3151 -4291 -3637 -8456 -6403 -1908 -2823 507 191 1944 -2973 -4053 -4440
17198d440l24k416j176J233N074O615l275j253O887Q95p324k433K664L485l873
$$ -4440 -4764 -7180 -8356 -7123 -2049 4566 1291 38 6925 7820 496 -1937 727 4212 339
17183C39p229j408j509j42P063K501M92o10N421M517k422j07l376n877J700N549
$$ 339 -6890 -8298 -9807 -9949 -2886 -385 107 -503 4918 9435 7013 6906 3530 -2347 -647 4902
17167D902O23l292m628j551M821p61m940j216K970l42j252r2m87r10N34q537m704
$$ 4902 5525 2233 -2395 -3946 875 114 -4826 -6042 -3072 -3414 -4666 -4758 -5245 -6155 -5621 -14158 -18862
17150a8862j33M037O081L620j422l626K856L914n978l021O507j027q05l396K010
$$ -18862 -18995 -14958 -8877 -5257 -6679 -10305 -7449 -3535 -9513 -12534 -6027 -7054 -7859 -11255 -9245
17135i245M295m035m873M740P843L351j896n364j798l459J293n321L879J1677
$$ -9245 -4950 -8985 -13858 -9118 -1275 2076 180 -5184 -6982 -10441 -9148 -14469 -10590 1087
17121A087O122q842p993o09J139n08j424l534L871O187N700L784o075K330l263
$$ 1087 7209 -1633 -9626 -10235 -9096 -9604 -11028 -14562 -10691 -4504 1196 4980 -1095 1235 -2028
17106b028l078K116K355j531q03J271j462N019M517n179J25j573l505K860J842
$$ -2028 -5106 -2990 -635 -2166 -2969 -1698 -3160 1859 6376 1197 1322 -251 -3756 -896 946
17091I46k195Q376L582N266l050m440r55N33j094o113p73j630m048K56L651o018
$$ 946 -1249 7127 10709 15975 12925 8485 7530 8063 6969 856 83 -1547 -5595 -5339 -1688 -7706
17075g706j535L209M84O748O994K90l203o051j878K631K61m389j372K400K229
$$ -7706 -9241 -6032 -5548 1200 8194 8484 5281 -770 -2648 -17 244 -4145 -5517 -3117 -888
17060h88O427O127n023o63n942N837K816k423l821n118L80M445L045J187K670
$$ -888 5539 11666 6643 5980 38 5875 8691 6268 2447 -2671 -2291 2154 5199 6386 9056
17045I056r71L8m956O003m99q699o568k564l664j111J474K450M336L984L93l854
$$ 9056 8085 8123 3167 9170 8671 -28 -6596 -9160 -12824 -13935 -12461 -10011 -5675 -1691 -1298 -5152
17029e152r76O501k404o208J187P297M334k336l126K363L945K096N522k762l720
$$ -5152 -6128 373 -2031 -8239 -7052 245 4579 2243 -883 1480 5425 7521 13043 10281 6561
17014F561o348j845J025L233J87K252N401l190m958l376m237m269l695L532J128
$$ 6561 213 -1632 -607 2626 2813 5065 10466 7276 2318 -1058 -5295 -9564 -13259 -9727 -8599
16999h599K628P902J40m154P62o66M899J033o103l106K752k194P49R85n99n96
$$ -8599 -5971 1931 2071 -2083 -1321 -1987 2912 3945 -2158 -5264 -2512 -4706 -3957 -2972 -3571 -4167
16983d167M381O776K65o486j671j912l10M975N927m03m453p867N106R570n371
$$ -4167 214 6990 7255 769 -902 -2814 -3124 1851 7778 7375 2922 -4945 161 9731 4360
16968D360n214M49J393P67j42K631J946o503L022J722j302l12l35l420N187K597
$$ 4360 -854 -405 988 1755 1613 4244 6190 -313 2709 4431 3129 2817 2482 -938 4249 6846
16952F846J070k949m554j083J47K277n285J58N006L387k854n813l379K68M808
$$ 6846 7916 4967 413 -670 -523 1754 -3531 -3373 1633 5020 2166 -3647 -7026 -6758 -1950
16937a950J505J763L517J773j748K368O5l182o67r436n13j857M335l036k045M520
$$ -1950 -445 1318 4835 6608 4860 7228 7293 4111 3444 -5992 -6505 -8362 -4027 -7063 -9108 -4588
16921d588L794J610K914M502p255J884j941l859R08J892l400K757O487K922n820
$$ -4588 -794 816 3730 8232 977 2861 920 -2939 -2031 -139 -3539 -782 5705 8627 2807
16906B807j957k048p072m118J424J418R19J025j75j026J672m25l65l610L09R86
$$ 2807 850 -1198 -8270 -12388 -10964 -9546 -8627 -7602 -7777 -8803 -7131 -7556 -7921 -11531 -11222 -10236
16890a0236J242L702P302l911n594J39j376L675K330M135l436m100m878l542L994
$$ -10236 -8994 -5292 2010 -1901 -7495 -7356 -8732 -5057 -2727 1408 -2028 -6128 -11006 -14548 -10554
16875a0554L209k245K34K148K560N710J174m861J45j586P560N234k464l298n182
$$ -10554 -7345 -9590 -9356 -7208 -4648 1062 2236 -2625 -2480 -4066 3494 8728 6264 2966 -2216
16860b216m543L387J652M879J45m052N118O51k025n05K291j124Ko404n312J362
$$ -2216 -6759 -3372 -1720 3159 3304 -748 4370 5021 2996 2491 4782 3658 3660 -2744 -8056 -6694
16844f694J648j415p241K934J233L19J336q51Q279R59j978N199p98n615q58N109
$$ -6694 -5046 -6461 -13702 -10768 -9535 -9216 -7880 -8731 -452 507 -1471 3728 2930 -2685 -3543 1566
16828A566K766n541k798l256l639k427nK521P55j463M803j116J186P434K858n529
$$ 1566 4332 -1209 -4007 -7263 -10902 -13329 -13334 -10813 -10058 -11521 -6718 -7834 -6648 786 3644 -1885
16812a885k452M412k866N476K223P76L18j148J043N94k726l944r11K28q004L276
$$ -1885 -4337 75 -2791 2685 4908 5684 6002 4854 5897 6491 3765 -179 -1090 -862 -8866 -5590
16796e590q3K969N714q51r766j088m799M186J838L020o514J429N428P086M385
$$ -5590 -5673 -2704 3010 2159 -7607 -8695 -13494 -9308 -7470 -4450 -10964 -9535 -4107 2979 7364
16781G364l156k908Q03m758r510L485K449n394N623R973K819k949p726r99M820
$$ 7364 4208 1300 2103 -2655 -12165 -8680 -6231 -11625 -6002 3971 6790 3841 -3885 -4884 -64
16766f4K282k898O70P489M265N007j475j0797o921P014L494q315j0773k27R53
$$ -64 2218 -680 -10 7479 11744 16751 15276 4479 -2442 4572 8066 -249 -11022 -11249 -10296
16751a0296K057n617L39o10J917L634L070m596l511m063K311O821N217O652m227
$$ -10296 -8239 -13856 -13517 -14127 -12210 -8576 -5506 -10102 -13613 -17676 -15365 -8544 -3327 3325 -902
16736i02n233j083k311J541q93m515k574O194Q095N41J872L632l857l090j602
$$ -902 -6135 -7218 -9529 -7988 -8881 -13396 -15970 -9776 -1681 -1140 732 4364 507 -2583 -4185
16721d185k758m949j70N972K939k846R037N44o618J357J439Q527L905l468j196
$$ -4185 -6943 -11892 -12062 -6090 -3151 -5997 3040 3584 -3034 -1677 -238 8289 12194 8726 7530
16706G530k483m560o917p044k677k833L606N683N488P343Q960K092n20K196j0593
$$ 7530 5047 487 -6430 -13474 -16151 -18984 -15378 -9695 -4207 3136 12096 14188 13668 15864 5271
16691E271o595j528k043n152j311P556J2116l043l102J327m548o095n088J021
$$ 5271 -1324 -2852 -4895 -10047 -11358 -3802 8314 5271 2169 3496 -1052 -7147 -12235 -11214
16677a1214K341m47R327j768k154l41n353m81q75J722L619P395J973l878K398
$$ -11214 -8873 -9320 7 -1761 -3915 -4256 -9609 -10090 -10965 -9243 -5624 1771 3744 -134 2264
16662B264K37n604N443j610n644o28L456j975n40k194j110j824N62K605K190j779
$$ 2264 2501 -3103 2340 730 -4914 -5542 -2086 -4061 -4601 -6795 -7905 -9729 -9167 -6562 -4372 -6151
16646f151l945k681p73P335l84K559L363N590j879p98L15J30Q91M334k983q260
$$ -6151 -10096 -12777 -13550 -6215 -6599 -4040 -677 4913 3034 2236 2551 2681 3572 7906 4923 -3337
16630c337j251n247N969J0379Q07l626m138R552J268m300k612M8l780n445p774
$$ -3337 -4588 -9835 -3866 6513 7320 3694 -444 9108 10376 6076 3464 3512 -268 -5713 -13487
16615a3487m685L471M846O336M79O798k264j670j104l540L201L601K80j123n804
$$ -13487 -18172 -14701 -9855 -3519 -3040 3758 1494 -176 -1280 -4820 -1619 1982 2262 1139 -4665
16600d665O49l620L904J665k201j739j584M290P107l128j0708o658M688O253K095
$$ -4665 -4016 -7636 -3732 -2067 -4268 -6007 -7591 -3301 3806 678 -10030 -16688 -12000 -5747 -3652
16585c652j043J505m74p078p981P310O471j456j547P364J786p291q48J018o937
$$ -3652 -4695 -3190 -3664 -10742 -18723 -11413 -4942 -6398 -7945 -581 1205 -6086 -6934 -5916 -12853
16570a2853K167Q556j613N84J335l450n461j834M739P664J662R115p284j410j528
$$ -12853 -10686 -2130 -3743 -3159 -1824 -5274 -10735 -12569 -7830 -166 1496 10611 3327 1917 389
16555C89l169p15M93r52j70J863o388o189L333R065P79p316k114K167M483j681
$$ 389 -2780 -3495 -3002 -3954 -4124 -2261 -8649 -14838 -11505 -2440 -1661 -8977 -11091 -8924 -4441 -6122
16539f122N372P157L798N838k866p260j886Q4k925j778m056J709N662J376r863
$$ -6122 -750 6407 10205 16043 13177 5917 4031 4115 1190 -588 -4644 -2935 2727 4103 -5760
16524e760o552K989O407j347L464k570l451k393L011N778Q93L647K048o327l707
$$ -5760 -12312 -9323 -2916 -4263 -799 -3369 -6820 -9213 -6202 -424 469 4116 6164 -163 -3870
16509c870L909m253o697n247m159L901J352L842L592q43K834K801K199j47L849
$$ -3870 39 -4214 -10911 -16158 -20317 -16416 -15064 -11222 -7630 -8473 -5639 -2838 -639 -786 3063
16494C063J295J396k391j543K204N26n402r673K453o33j55n899L917J056k291
$$ 3063 4358 5754 3363 1820 4024 4550 -852 -10525 -8072 -8705 -8860 -14759 -10842 -9786 -12077
16479a2077K591k370N121J802j810l245o57J921J626M649L615M004J428n97k530
$$ -12077 -9486 -11856 -6735 -4933 -6743 -9988 -10645 -8724 -7098 -2449 1166 5170 6598 6001 3471
16464C471j607l822l545m291K702o97K761r11k471K159J600l410N1Q278R376m734
$$ 3471 1864 -1958 -5503 -9794 -7092 -7789 -5028 -5939 -8410 -6251 -4651 -8061 -8010 268 9644 4910
16448D910o515m414j89L100J884R90o553j997N549l867J961k272n467J199M476
$$ 4910 -1605 -6019 -6208 -3108 -1224 -234 -6787 -8784 -3235 -7102 -5141 -7413 -12880 -11681 -7205
16433g205Q225m950m537k799k042l704M097M299l578p338L078J1806O481k494
$$ -7205 1020 -3930 -8467 -11266 -13308 -17012 -12915 -8616 -12194 -19532 -16454 -4648 1833 -661
16419f61l902k375J337M264m28M566J705l078p386k335J593N035P22K74n479M92
$$ -661 -4563 -6938 -5601 -1337 -1765 2801 4506 1428 -5958 -8293 -6700 -1665 -943 -669 -6148 -5656
16403e656N767N040O629j1650m493m218l066M864K070L551N003K220r03l923j0689
$$ -5656 111 5151 11780 130 -4363 -8581 -11647 -6783 -4713 -1162 3841 6061 5158 1235 -9454
16388i454j330q088K536J0123j672K879o8L034K36j203j439l929l928O166O8J904
$$ -9454 -10784 -18872 -16336 -6213 -7885 -5006 -5074 -2040 -1804 -3007 -4446 -8375 -12303 -6137 -6069 -4165
16372d165O03M324k381k281m576M515N827J255K164L074R447N312p011j0172r107
$$ -4165 -3562 762 -1619 -3900 -8476 -3961 1866 3121 5285 8359 17806 23118 16107 5935 -3172
16357c172o177k860N028K372K505R525Q802k098m424j122p051j343j068m189K99
$$ -3172 -9349 -12209 -7181 -4809 -2304 7221 16023 13925 9501 8379 1328 -15 -1083 -5272 -4973
16342d973j097j188l199k893L642R89j825L642L80N607j849m79l158P336L570
$$ -4973 -6070 -7258 -10457 -13350 -9708 -8719 -10544 -6902 -6522 -915 -2764 -3243 -6401 935 4505
16327D505p496l154L77l668l028j39K775K636N289P9o419K287N648l538K01l808
$$ 4505 -2991 -6145 -5768 -9436 -12464 -12603 -9828 -7192 -1903 -1824 -8243 -5956 -308 -3846 -3645 -7453
16311g453N3M235m172k622K214M017L828l17j15l71Q56N9O42p649m758l369N834
$$ -7453 -7400 -3165 -7337 -9959 -7745 -3728 100 -217 -332 -703 153 212 854 -6795 -11553 -14922 -9088
16294i088N719j157L80J835m291L30K452k405Q49n202L187L307l411l477K143
$$ -9088 -3369 -4526 -4146 -2311 -6602 -6272 -3820 -6225 -5376 -10578 -7391 -4084 -7495 -10972 -8829
16279h829j866n164M180N318l381j302J417K458K005N378M67K5l080k909j471
$$ -8829 -10695 -15859 -11679 -6361 -9742 -11044 -9627 -7169 -5164 214 681 706 -2374 -5283 -6754
16264f754k450N040O482m871l037Q788N719K332k279l522l105J202o17J816l314
$$ -6754 -9204 -4164 2318 -2553 -5590 3198 8917 11249 8970 5448 2343 3545 2928 4744 1430
16249A430k463N817O246k134j0986p011L089m39j51M02K984K459j797n363j654
$$ 1430 -1033 4784 11030 8896 -2090 -9101 -6012 -6451 -6602 -6200 -3216 -757 -2554 -7917 -9571
16234i571q70J962j889K065M792m132m891L010K708j414K9r77Q54Q09J701p58
$$ -9571 -10441 -8479 -10368 -8303 -3511 -7643 -12534 -9524 -6816 -8230 -8201 -9178 -8324 -7515 -5814 -6572
16218f572k875N046K390K572r78m827L061m642q93K458M304k835m505Q2J454j273
$$ -6572 -9447 -4401 -2011 561 -417 -5244 -2183 -6825 -7718 -5260 -956 -3791 -8296 -8214 -6760 -8033
16202h033k74J132Q35M397Q316J167l592n309n607m625j433J254M068J0075Q182
$$ -8033 -8307 -7175 -6340 -1943 6373 7540 3948 -1361 -6968 -11593 -13026 -11772 -7704 2371 10553
16187A0553l224j122o889q054R79M17K140j632J304K490n264J150r12K334O17
$$ 10553 7329 6207 -682 -8736 -7757 -7340 -5200 -6832 -5528 -3038 -8302 -7152 -8064 -5730 -5113
16172e113j533j994q80J79L290l074l753N77L831O330k068J413J044l654l925
$$ -5113 -6646 -8640 -9520 -9341 -6051 -9125 -12878 -12301 -8470 -2140 -4208 -2795 -1751 -5405 -9330
16157i330m61O159M082J644o459m220O775m962m745J062j987L93Q45j08k398j505
$$ -9330 -9791 -3632 450 2094 -4365 -8585 -1810 -6772 -11517 -10455 -12442 -12049 -11204 -11312 -13710 -15215
16141a5215L473k582N835N691o422m054K744K271L142l900n129J2109O2J930j789
$$ -15215 -11742 -14324 -8489 -2798 -9220 -13274 -10530 -8259 -5117 -9017 -14146 -2037 -1975 -45 -1834
16126a834J667O390J164k225n986q087L232N008o378k494M466O638K747n05o366
$$ -1834 -167 6223 7387 5162 -824 -8911 -5679 -671 -7049 -9543 -5077 1561 4308 3803 -2563
16111b563J509n85L55L075O772O314m634n499k019l484m701l575k933J395N369
$$ -2563 -1054 -1639 -1284 1791 8563 14877 10243 4744 2725 -759 -5460 -9035 -11968 -10573 -5204
16096e204N641N042j116m109J546J109l642J071L714O723p480l192K264l229K08
$$ -5204 437 5479 4363 254 1800 2909 -733 338 4052 10775 3295 103 2367 -862 -654
16081f54l856o181L69j096K21M544J804J730K573k800J952M733J291p882n572
$$ -654 -4510 -10691 -10322 -11418 -11197 -6653 -4849 -3119 -546 -3346 -1394 3339 4630 -3252 -8824
16066h824j899n342O524Q471l343n061q737J511L427L082K085O726j369N994k278
$$ -8824 -10723 -16065 -9541 -1070 -4413 -9474 -18211 -16700 -13273 -10191 -8106 -1380 -2749 3245 967
16051I67m181L483k588p30m115p72K270o4q38J398J556K560l730l22k929L318
$$ 967 -3214 269 -2319 -3049 -7164 -7936 -5666 -5730 -6568 -5170 -3614 -1054 -4784 -5106 -8035 -4717
16035d717O21m258O079P729J477n558p115J103N045K055j0684J439K533j290m378
$$ -4717 -4096 -8354 -2275 5454 6931 1373 -5742 -4639 406 2461 -8223 -6784 -4251 -5541 -9919
16020i919N857J126PM071l164m598O690k54n552k592N624N306J965J665K32j399
$$ -9919 -4062 -2936 -2929 1142 -2022 -6620 70 -184 -5736 -8328 -2704 2602 4567 6232 6464 5065
16004E065k616p62m578j406p393j43N064K182l279J542o085O630K507o576n336
$$ 5065 2449 1687 -2891 -4297 -11690 -11833 -6769 -4587 -7866 -6324 -12409 -5779 -3272 -9848 -15184
15989a5184K399j81K481j00n82m180m892L516K208L131J522k690K763J2544k086
$$ -15184 -12785 -12966 -10485 -10585 -11167 -15347 -20239 -16723 -14515 -11384 -9862 -12552 -9789 2755 669
15974F69o758M043K974L455m645p296m143L283K673n377L346K273J208Q107n769
$$ 669 -6089 -2046 928 4383 -262 -7558 -11701 -8418 -5745 -11122 -7776 -5503 -4295 3812 -1957
15959a957l834L444P918M545r784m43m08J23l35o494J985N306O27j746N400J921
$$ -1957 -5791 -2347 5571 10116 332 -111 -519 -396 -731 -7225 -5240 66 693 -1053 4347 6268
15943F268k904r359k266J081N294J572L520l515Q41R36M457j0386l507L303L604
$$ 6268 3364 -5995 -8261 -7180 -1886 -314 3206 -309 532 1468 5925 -4461 -7968 -4665 -1061
15928a061J39m578j205j308M77j901m276K992M784q95J328M969M489j755k296
$$ -1061 -922 -5500 -6705 -8013 -7536 -9437 -13713 -10721 -5937 -6832 -5504 -535 3954 2199 -97
15913i7m683Q131k716p078M611P712j988k529p577k990L461M378k257p488J076
$$ -97 -4780 3351 635 -6443 -1832 5880 3892 1363 -6214 -9204 -5743 -1365 -3622 -11110 -10034
15898a0034l33l424m229L725N538K741O17M99j929k134L060L434J051J416L700
$$ -10034 -10367 -13791 -18020 -14295 -8757 -6016 -5399 -4900 -6829 -8963 -5903 -2469 -1418 -2 3698
15883C698n548j371n929j572O184J0137k90J292n110k911l779j221p754M92O908
$$ 3698 -1850 -3221 -9150 -10722 -4538 5599 5309 6601 1491 -1420 -5199 -6420 -14174 -13682 -6774
15868f774q47m624j917L015P714l71L655P804O62p19n108j294m138r726N447N286
$$ -6774 -7621 -12245 -14162 -11147 -3433 -3804 -149 7655 8317 7598 2490 1196 -2942 -12668 -7221 -1935
15852a935j650m590J08R83k538j057j149j078J532K703K229m902j595l209J622
$$ -1935 -3585 -8175 -8067 -7084 -9622 -10679 -11828 -12906 -11374 -8671 -6442 -11344 -12939 -16148 -14526
15837a4526O888N043M116Q781J598k127q972j098n025o533k719M46K48N124J228
$$ -14526 -7638 -2595 1521 10302 11900 9773 801 -297 -5322 -11855 -14574 -14128 -13880 -8756 -7528
15822g528j596j354J742L108j458l493K697K652q47m489p57M476J894j377m085
$$ -7528 -9124 -10478 -8736 -5628 -7086 -10579 -7882 -5230 -6077 -10566 -11323 -6847 -4953 -6330 -10415
15807a0415R37J894k118k210O404P90l60Q841m124r945j039J1427O186l025p47
$$ -10415 -9478 -7584 -9702 -11912 -5508 -4718 -5078 3763 -361 -10306 -11345 82 6268 3243 2496
15792B496j914k658J805M18k078J319l806r08L894M43k542K131L522r001J932
$$ 2496 582 -2076 -271 147 -1931 -612 -4418 -5326 -1432 -989 -3531 -1400 2122 -6879 -4947
15777d947k145l784M710K997k324J962j133k234k628J295O144l349p316R084J1035
$$ -4947 -7092 -10876 -6166 -3169 -5493 -3531 -4664 -6898 -9526 -8231 -2087 -5436 -12752 -3668 7367
15762G367l945o421N089l247l56m610O7J439K721M827o322m56O954Q2L673K418
$$ 7367 3422 -2999 2090 -1157 -1513 -6123 -6056 -4617 -1896 2931 -3391 -3847 3107 3189 6862 9280
15746I280j784p337J437J889k451k398r689k033N292j614K099N0L241R368j725
$$ 9280 7496 159 1596 3485 1034 -1364 -11053 -13086 -7794 -9408 -7309 -7259 -4018 5350 3625
15731C625l545K561m234J498j266o928J221N785k01n860M077k098M700N056m829
$$ 3625 80 2641 -1593 -95 -1361 -8289 -7068 -1283 -1484 -7344 -3267 -5365 -665 4391 -438
15716d38m716o46l74K20l880j714N679R165m276l496K834p58n394P44j062j837
$$ -438 -5154 -5800 -6174 -5954 -9834 -11548 -5869 3296 -980 -4476 -1642 -2400 -7794 -7050 -8112 -9949
15700i949k15j736O037O901M005L607k844n321l745K739J1643L649n993m544J051
$$ -9949 -10164 -11900 -5863 1038 5043 8650 5806 485 -3260 -521 11122 14771 8778 4234 5285
15685E285j004j0169K71L369l856n275O33r83K962J84n40j483l963j488N213M487
$$ 5285 4281 -5888 -5617 -2248 -6104 -11379 -10746 -11729 -8767 -8583 -9123 -10606 -14569 -16057 -10844 -6357
15669f357O656m60m272J785L919N653p367p316j733q113J365O321Q31K016J2L231
$$ -6357 299 -161 -4433 -2648 1271 6924 -443 -7759 -9492 -17605 -16240 -9919 -9088 -7072 -7060 -3829
15653c829N266R435L109j050p178kn971j329M3k333L658P581J09q285k8L707j39
$$ -3829 1437 10872 13981 12931 5753 5751 -220 -1549 -1506 -3839 -181 7400 7509 -776 -804 2903 2764
15636B764K690l595o988r58l193P432J0845l120q110j0071M157K417L52K032K731
$$ 2764 5454 1859 -5129 -6087 -9280 -1848 8997 5877 -2233 -12304 -8147 -5730 -5378 -3346 -615
15621f15K552j544k12n517J119K80L02L885K50J881j411m260r121K802N347n634
$$ -615 1937 393 181 -5336 -4217 -3937 -3635 250 500 2381 970 -3290 -12411 -9609 -4262 -9896
15605i896J534O289J325j959M211M98m216l56O020R03o289n052j654n69O724n018
$$ -9896 -8362 -2073 -748 -2707 1504 2002 -2214 -2570 3450 4353 -1936 -6988 -8642 -9211 -2487 -7505
15589g505O04K345M474j44O893m050l368j476q061M62m24K743L93k640j121k137
$$ -7505 -6901 -4556 -82 -226 6667 2617 -751 -2227 -10288 -9826 -10250 -7507 -7114 -9754 -10875 -13012
15573a3012K886L630k107R57n10l899l617K692P799l42L575M226J593p96k484
$$ -13012 -10126 -6496 -8603 -7646 -8156 -12055 -15672 -12980 -5181 -5523 -1948 2278 3871 3075 591
15558E91m977K92K250J712K524N602K053o870j0049N77k244l530J645L784J074
$$ 591 -4386 -4094 -1844 -132 2392 7994 10047 3177 -6872 -6295 -8539 -12069 -10424 -6640 -5566
15543e566r36J08J26J096l126K992k066n781M186O904Q91j538m298j883q75k674
$$ -5566 -6502 -6394 -6268 -5172 -8298 -5306 -7372 -13153 -8967 -2063 -1172 -2710 -7008 -8891 -9766 -12440
15527a2440M347J187K600J0774m248J067N024L155k769o277k413Q68l381p428
$$ -12440 -8093 -6906 -4306 6468 2220 3287 8311 11466 8697 2420 7 875 -2506 -9934
15513i934P59R346K830j301N269J339j389q23j0948p500P147O924M49p517p402
$$ -9934 -9175 171 3001 1700 6969 8308 6919 6096 -4852 -12352 -5205 1719 2168 -5349 -12751
15498a2751q02O268M952K880P022J727j0563j2834L749P257l527m499J094K155
$$ -12751 -13553 -7285 -2333 547 7569 9296 -1267 -14101 -10352 -3095 -6622 -11121 -10027 -7872
15484g872J496P788j2k345n15J674p769k844L321j656n381J891M383l33k782K711
$$ -7872 -6376 1412 1400 -945 -1460 214 -7555 -10399 -7078 -8734 -14115 -12224 -7841 -8174 -10956 -8245
15468h245K3m602K078Q940n166l093N279O14J742M222q53L548M875l431q767j462
$$ -8245 -8222 -12824 -10746 -1806 -6972 -10065 -4786 -4172 -2430 1792 939 4487 9362 5931 -2836 -4298
15452d298n943j611m731K660K923J52Q24M849N920l174r71J451M98o45K211k073
$$ -4298 -10241 -11852 -16583 -13923 -11000 -10848 -10024 -5175 745 -2429 -3400 -1949 -1451 -2096 115 -1958
15436a958r908M615Q966K273m524r04j908p552m762R65N211j885P627P438Q107
$$ -1958 -11866 -7251 1715 3988 -536 -1440 -3348 -10900 -15662 -14697 -9486 -11371 -3744 3694 11801
15421A1801o74j245l670k280j041l521p691m017N339j435J836L614N52J625k419
$$ 11801 11127 9882 6212 3932 2891 -630 -8321 -12338 -6999 -8434 -6598 -2984 -2432 -807 -3226
15406c226j564j887k024K336J908o128n326j488N569Q109K176o17L02m255j0266
$$ -3226 -4790 -6677 -8701 -6365 -4457 -10585 -15911 -17399 -11830 -3721 -1545 -2162 -1860 -6115 -16381
15391a6381L772J1059M967K531K238K898m381j0034l93K268j52l70mn308J095
$$ -16381 -12609 -1550 3417 5948 8186 11084 6703 -3331 -3724 -1456 -1608 -1978 -1982 -7290 -6195
15376f195K608K246l430J040J330k784j418J70Q42n024J397M628K266n852K899
$$ -6195 -3587 -1341 -4771 -3731 -2401 -5185 -6603 -6433 -5591 -10615 -9218 -4590 -2324 -8176 -5277
15361e277K596M082J067o667o034m53J308k093N349K877Q26o48j93Q38j609n798
$$ -5277 -2681 1401 2468 -4199 -10233 -10686 -9378 -11471 -6122 -3245 -2419 -3067 -3260 -2422 -4031 -9829
15345i829L418P174k290m368K749N108J2k373J587q529l479R366l786n949l567
$$ -9829 -6411 763 -1527 -5895 -3146 1962 1974 -399 1188 -7341 -10820 -1454 -5240 -11189 -14756
15330a4756J291J2884J078j1623K818j944J973J574P06N709L060J81l972q754
$$ -14756 -13465 -581 497 -11126 -8308 -10252 -8279 -6705 -5999 -290 2770 2951 -1021 -9775
15316i775k158M510M262j021k75O982L537l905j015p278k436M479M369K576o92
$$ -9775 -11933 -7423 -3161 -4182 -4457 2525 6062 2157 1142 -6136 -8572 -4093 276 2852 2160
15301B160m592M940O590N303p497r571j29J083j978k198j314N397M34k062N991
$$ 2160 -2432 2508 9098 14401 6904 -2667 -2796 -1713 -3691 -5889 -7203 -1806 -1372 -3434 2557
15286B557K830p857l514J680j266J865L14l567k420M303k357L417P0k500L594
$$ 2557 5387 -2470 -5984 -4304 -5570 -3705 -3391 -6958 -9378 -5075 -7432 -4015 -3945 -6445 -2851
15271b851Q12R76l062p206k896N261j218k219L486j406n470O69J2587M984L207
$$ -2851 -2039 -1063 -4125 -11331 -14227 -8966 -10184 -12403 -8917 -10323 -15793 -15124 -2537 2447 5654
15256E654j114k616o086n809K917K81o208M764Q230L93l916o888L448K856R032
$$ 5654 4540 1924 -4162 -9971 -7054 -6773 -12981 -8217 13 406 -3510 -10398 -6950 -4094 4938
15241D938o527m600J312l299M76m921M272N575k733m417r99M160M802L63j961
$$ 4938 -1589 -6189 -4877 -8176 -7700 -12621 -8349 -2774 -5507 -9924 -10923 -6763 -1961 -1598 -3559
15226c559k01j2055k48R422L799j283M206J974k709r302K420J258m518L771N624
$$ -3559 -3760 -15815 -16063 -6641 -2842 -4125 81 2055 -654 -9956 -7536 -6278 -10796 -7025 -1401
15211a401M609j684P07N357j006m849j135j750j271L25K340M305o23k110Q296
$$ -1401 3208 1524 2231 7588 6582 1733 598 -1152 -2423 -2098 242 4547 3924 1814 10110
15196A0110p86l964K633n96q864k881l735n36K324j337K898K795L688K142m192
$$ 10110 9324 5360 7993 7397 -1467 -4348 -8083 -8619 -6295 -7632 -4734 -1939 1749 3891 -301
15181c01j821j260k369L099j353k9L280k477K797J514o970n383j470j520k587
$$ -301 -2122 -3382 -5751 -2652 -4005 -4034 -754 -3231 -434 1080 -5890 -11273 -12743 -14263 -16850
15166a6850K267N510L636R270k103m558p21m951L80L00M432m161j660O682O426
$$ -16850 -14583 -9073 -5437 3833 1730 -2828 -3549 -8500 -8120 -7820 -3388 -7549 -9209 -2527 3899
15151C899m653r956K770j654o523J034O725Q199J664m473L710N271k132L807q10
$$ 3899 -754 -10710 -7940 -9594 -16117 -15083 -8358 -159 1505 -2968 742 6013 3881 7688 6878
15136F878l066n967j378k181k84N756K412n596r073R98L86l882N324j367o545
$$ 6878 3812 -2155 -3533 -5714 -5998 -242 2170 -3426 -12499 -11501 -11115 -14997 -9673 -11040 -17585
15121a7585J382O270m9L469j286o51M134l458J137J1365J0536l063l931j1027
$$ -17585 -16203 -9933 -9982 -6513 -7799 -8450 -4316 -7774 -6637 4728 15264 12201 8270 -2757
15107b757p7M94l79N103l064r573J249N653m631m207O549m202k899M427M320N093
$$ -2757 -2834 -2340 -2719 2384 -680 -10253 -9004 -3351 -7982 -12189 -5640 -9842 -12741 -8314 -3994 1099
15091A099N341j794Q04l503J824o445k09J378l651N121k190m195N009o327m564
$$ 1099 6440 4646 5450 1947 3771 -2674 -2883 -1505 -5156 -35 -2225 -6420 -1411 -7738 -12302
15076a2302K394M208J670K068J862O724k316k526M96m57n51p072R0L915L756N822
$$ -12302 -9908 -5700 -4030 -1962 -100 6624 4308 1782 2278 1821 1270 -5802 -5712 -1797 1959 7781
15060G781J975K594q079j324l048m237J282K062K571l705k489N692k760L27M0
$$ 7781 9756 12350 4271 2947 -101 -4338 -3056 -994 1577 -2128 -4617 1075 -1685 -1358 -1318
15045a318n462J485M971M380K910J182K730O42L029o483r576O531O901J303m767
$$ -1318 -6780 -5295 -324 4056 6966 8148 10878 11520 14549 8066 -1510 5021 11922 13225 8458
15030H458K336j129J409K846o920j024m171J179J404l149k398R90m375J558J157
$$ 8458 10794 9665 11074 13920 7000 5976 1805 2984 4388 1239 -1159 -169 -4544 -2986 -1829
15015a829l348J307j49K843l313n206j054P212Q036N115k663j200k69N360l876
$$ -1829 -5177 -3870 -4019 -1176 -4489 -9695 -10749 -3537 4499 9614 6951 5751 5482 10842 6966
15000F966o892Q27L91K499k556j179P42j704k877o667j951L563M948K913J254
$$ 6966 74 901 1292 3791 1235 56 798 -906 -3783 -10450 -12401 -8838 -3890 -977 277
14985B77l470l799m470M241K978Q353J197l699L197m387j946J849m409K670n81
$$ 277 -3193 -6992 -11462 -7221 -4243 4110 5307 1608 4805 418 -1528 321 -4088 -1418 -1999
14970a999l625k022K446N008K224k276m662k920N572M081J674j18l410J127o062
$$ -1999 -5624 -7646 -5200 -192 2032 -244 -4906 -7826 -2254 1827 3501 3383 -27 1100 -4962
14955d962j31P31m113lo62m73J0105M978J852k772j109l00P274N355l157J894
$$ -4962 -5093 -4362 -8475 -8478 -9140 -9613 492 5470 7322 4550 3441 3141 10415 15770 12613 14507
14939A4507o181l354O49L410Q505J3237J4326M430J7795L6862N0777R1147J25733
$$ 14507 8326 4972 5621 9031 17536 30773 45099 49529 67324 104186 154963 246110 371843
14926C71843P9899n8033j07233j10481p0557l8253j9843j2156p209p098j1841
$$ 371843 451742 393709 286476 175995 105438 67185 47342 35186 27977 20879 9038
14915I038j0064L181J705k41l132l530o327N599K005J379O9l8K676O955L504q374
$$ 9038 -1026 2155 3860 3619 487 -3043 -9370 -3771 -1766 -387 -318 -356 2320 9275 12779 4405
14899D405K908j925p460j845O272N5q600O11O50L262N344q535o163M374R044Q773
$$ 4405 7313 5388 -2072 -3917 2355 2410 -6190 -5579 -4929 -1667 3677 -4858 -11021 -6647 2397 11170
14883A1170j558k976m742r041j023N654j808O759M223n951n494J235P592K068
$$ 11170 9612 6636 1894 -7147 -8170 -2516 -4324 2435 6658 707 -4787 -3552 4040 6108
14869F108m665l547J639n430k22L391M314j022j774k284n118J474J006K530l266
$$ 6108 1443 -2104 -465 -5895 -6117 -2726 1588 566 -1208 -3492 -8610 -7136 -6130 -3600 -6866
14854f866K417R782j052K98m537j944k344j051L182k585J52P516L241r945m233
$$ -6866 -4449 5333 4281 4579 42 -1902 -4246 -5297 -2115 -4700 -4548 2968 6209 -3736 -7969
14839g969J512q67K177l291K29O792o047p838J506J192k087N000N780L719J681
$$ -7969 -6457 -7324 -5147 -8438 -8209 -1417 -7464 -15302 -13796 -12604 -14691 -9691 -3911 -192 1489
14824A489l767o375n42J180J140m644l760L868M810M381J21k358n217l704k183
$$ 1489 -2278 -8653 -9195 -8015 -6875 -11519 -15279 -11411 -6601 -2220 -2099 -4457 -9674 -13378 -15561
14809a5561Q91N491P243K371o057m02O727r0l727m673J006M477r57J465R06l386
$$ -15561 -14670 -9179 -1936 435 -5622 -6024 703 613 -3114 -7787 -6781 -2304 -3261 -1796 -890 -4276
14793d276n719K229K86J0427P71m580k052m100K592j787O118L201k017j044j073
$$ -4276 -9995 -7766 -7480 2947 3718 -862 -2914 -7014 -4422 -6209 -91 3110 1093 49 -1024
14778a024k398L183l689q514O455N216J393Q31L316K866K377J875l908n091l75
$$ -1024 -3422 -239 -3928 -12442 -5987 -771 622 1453 4769 7635 10012 11887 7979 2888 2513
14763B513K407Q38k440p518k480L097m482l474J558M396K24l132L672M315J577
$$ 2513 4920 5758 3318 -4200 -6680 -3583 -8065 -11539 -9981 -5585 -5361 -8493 -4821 -506 1071
14748A071K581J988k222m141j709j80M743j60k392n362n254l280l376O116N081
$$ 1071 3652 5640 3418 -723 -2432 -2612 2131 1971 -421 -5783 -11037 -14317 -17693 -11577 -6496
14733f496K345L982L328m221o383p619L136P970J938Q641N583N977l618o330l027
$$ -6496 -4151 -169 3159 -1062 -7445 -15064 -11928 -3958 -2020 6621 12204 18181 14563 8233 5206
14718E206j02l451k541k364J584l453q15K803L17R35m887N309J992J419j624J762
$$ 5206 5104 1653 -888 -3252 -1668 -5121 -5936 -3133 -2816 -1881 -6768 -1459 533 1952 328 2090
14702B090k458m883O563p1m678J58R26L261n440o477P420O635K090o355m886m436
$$ 2090 -368 -5251 1312 1241 -3437 -3279 -2353 908 -4532 -11009 -3589 3046 5136 -1219 -6105 -10541
14686a0541J373j628J57Q13M209K246O404L561Q78R73O166P302l163j4961o599
$$ -10541 -9168 -10796 -10639 -9826 -5617 -3371 3033 6594 7472 8445 14611 21913 18750 3789 -2810
14671b810n735O75l035M919J2092o72k306j0395k556N092K168j283K2N518j227
$$ -2810 -8545 -7870 -10905 -5986 6106 5434 3128 -7267 -9823 -4731 -2563 -3846 -3824 1694 467
14656D67p231l895J641L808N474q516o422j576N417K344l138M624N059L184m836
$$ 467 -6764 -10659 -9018 -5210 264 -8252 -14674 -16250 -10833 -8489 -11627 -7003 -1944 1240 -3596
14641c596K700k347J393j150M09k153K062m404J073k263k677N398N496J109P99
$$ -3596 -896 -3243 -1850 -3000 -2591 -4744 -2682 -7086 -6013 -8276 -10953 -5555 -59 1050 1849
14626A849j166q468k384K203m94J147m13j798J2992P106n430O71m499m816M46
$$ 1849 683 -7785 -10169 -7966 -8460 -7313 -7726 -9524 3468 10574 5144 5815 1316 -3500 -3054
14611c054m404j434L454J859J521n442l613L511M012P736K313n017n874m12K304
$$ -3054 -7458 -8892 -5438 -3579 -2058 -7500 -11113 -7602 -3590 4146 6459 1442 -4432 -4844 -2540
14596b540J558N457M663m514m583K246m370l436O197k22J386Q9p679k89p339J660
$$ -2540 -982 4475 9138 4624 41 2287 -2083 -5519 678 456 1842 1931 -5748 -6037 -13376 -11716
14580a1716Q308L5l596k318m324m068Q57K730j488Q021M353l022L055L753j186
$$ -11716 -3408 -3373 -6969 -9287 -13611 -17679 -16822 -14092 -15580 -7559 -3206 -6228 -3173 580 -606
14565f06O497K417l757j108j704l514J625J801m409p036l490l085K872K966K936
$$ -606 5891 8308 4551 3443 1739 -1775 -150 1651 -2758 -9794 -13284 -16369 -13497 -10531 -7595
14550g595P443q13j116l001L996P209j770O14l322n354l649m124K265M849N155
$$ -7595 -152 -965 -2081 -5082 -1086 6123 4353 4967 1645 -3709 -7358 -11482 -9217 -4368 787
14535G87k007m049K459L079Q2K669l738k408l51K479j294N707p67m461o986k050
$$ 787 -1220 -5269 -2810 269 351 3020 -718 -3126 -3477 -998 -2292 3415 2648 -1813 -8799 -10849
14519a0849j571N341J3172O093q765o782o39k672O444O725l924q86J678k533m663
$$ -10849 -12420 -7079 6093 12186 3421 -3361 -4000 -6672 -228 6497 2573 1687 3365 832 -3831
14504c831K854Q684M935o813o484l488M810K759J025m288l348m19j015l974K642
$$ -3831 -977 7707 12642 5829 -655 -4143 667 3426 4451 163 -3185 -3604 -4619 -8593 -5951
14489e951J148N918O259J555K322j287j1094p7j715k225J0912N802o248m328l359
$$ -5951 -4803 1115 7374 8929 11251 9964 -1130 -1207 -2922 -5147 5765 11567 5319 991 -2368
14474b368l264j944K450N940N380n819l958m432k238N34Q697K604L61j535j737
$$ -2368 -5632 -7576 -5126 814 6194 375 -3583 -8015 -10253 -9719 -1022 1582 1943 408 -1329
14459a329k365J570J166j97k38j155M252r30R87N20j587k613O401k676r20j224
$$ -1329 -3694 -2124 -958 -1155 -1393 -2548 1704 774 1761 2281 694 -1919 4482 1806 886 -338
14443c38n632n175j971N035k100L830o05m581L539M275K223J96R04j368R21L037
$$ -338 -5970 -11145 -13116 -8081 -10181 -6351 -6956 -11537 -7998 -3723 -1500 -1304 -400 -1768 -847 2190
14427B190J95N656O354J779o136n310q06J569N457l190O98l353N45J42K909k077
$$ 2190 2385 8041 14395 16174 10038 4728 3922 5491 10948 7758 8456 5103 5648 5790 8699 6622
14411F622p054J314L694l163J265j312k517M102L652J199O625n553j0589J973
$$ 6622 -432 882 4576 1413 2678 1366 -1151 2951 6603 7802 14427 8874 -1715 258
14397B58l01j709k891K704k641K20P34P8K368J357M186L191m257K456J626m619
$$ 258 -43 -1752 -4643 -1939 -4580 -4360 -3626 -3548 -1180 177 4363 7554 3297 5753 7379 2760
14381B760n01j020j684p71Q01j581L27L683J118k257l933l149J351J058J12L189
$$ 2760 2259 1239 -445 -1216 -415 -1996 -1669 2014 3132 875 -3058 -6207 -4856 -3798 -3686 -497
14365d97m89P25J067o021J194L169K405k035k959K02n202N240P562L926K789M66
$$ -497 -986 -261 806 -5215 -4021 -852 1553 -482 -3441 -3239 -8441 -3201 4361 8287 11076 11542
14349A1542n780r130j961N569J003Q072k145o472l911K165O309n874k829M818
$$ 11542 5762 -3368 -5329 240 1243 9315 7170 698 -3213 -1048 5261 -613 -3442 1376
14335A376M884J449m735l224j605J266l434N247M853q27n386K034L700j489M356
$$ 1376 6260 7709 2974 -250 -1855 -589 -4023 1224 6077 5250 -136 1898 5598 4109 8465
14320H465L087p006K33L574j455N039k819j734J585m153l727m464K153j055r15
$$ 8465 11552 4546 4779 8353 6898 11937 9118 7384 8969 4816 1089 -3375 -1222 -2277 -3192
14305c192L269O4K117j599k393l001L269O564n349p280N037J0359P274m328n936
$$ -3192 77 141 2258 659 -1734 -4735 -1466 5098 -251 -7531 -2494 7865 15139 10811 4875
14290D875m389k070k19k462P86O2J396R19l255m768L308M170O209K298j868J847
$$ 4875 486 -1584 -1803 -4265 -3479 -3417 -2021 -1102 -4357 -9125 -5817 -1647 4562 6860 4992 6839
14274F839k271n549l28K469J891m570j029k797L141J742M087J940n249K57K191
$$ 6839 4568 -981 -1309 1160 3051 -1519 -2548 -5345 -2204 -462 3625 5565 316 573 2764
14259B764m58j028P40j981k645k07K677J156l431J601j220L169M273k009n38L882
$$ 2764 2306 1278 2018 37 -2608 -2815 -138 1018 -2413 -812 -2032 1137 5410 3401 2863 6745
14243F745o144K87j185L044L68K95o654o23k180q33j48j395K534P226k811m950
$$ 6745 601 888 -297 2747 3115 3410 -3244 -3867 -6047 -6880 -7028 -8423 -5889 1337 -1474 -6424
14227f424m401k219P81k050l926P742N105l595K932O239j399k876J508L929J142
$$ -6424 -10825 -13044 -12263 -14313 -18239 -10497 -5392 -8987 -6055 184 -1215 -4091 -2583 1346 2488
14212B488l663o333L953P00k723l750J529O540N007j387j797J321l862L906J660
$$ 2488 -1175 -7508 -3555 -2855 -5578 -9328 -7799 -1259 3748 2361 564 1885 -1977 1929 3589
14197C589Q243Q97k234n892J460l867r27j472J210o894m361K93P650P578J354
$$ 3589 11832 12729 10495 4603 6063 2196 1269 -203 1007 -5887 -10248 -9955 -2305 5273 6627
14182F627j712J286M231N33l343n383K60m10N828j380o171l186r75Q279P586k056
$$ 6627 4915 6201 10432 10965 7622 2239 2499 2089 7917 6537 366 -2820 -3795 4484 12070 10014
14166A0014m457P40K631k023m709N592M553n516p783n450K855O45Q35J606L865
$$ 10014 5557 6297 8928 6905 2196 7788 12341 6825 -958 -6408 -3553 -2908 -2073 -467 3398
14151C398j579m163O63N940k008J545l050J980M389l10J276k698l619n27K524
$$ 3398 1819 -2344 -1681 4259 2251 3796 746 2726 7115 6805 8081 5383 1764 1237 3761
14136C761q6P181l382o263O020K369j811l190J471p01j201j193j684m27O424L435
$$ 3761 3675 10856 7474 1211 7231 9600 7789 4599 6070 5369 4168 2975 1291 864 7288 10723
14120A0723K057j801l36j902n46j545m505l014m872l674O58J555Q666k36o62j039
$$ 10723 12780 10979 10643 8741 8195 6650 2145 -869 -5741 -9415 -8757 -7202 1464 1228 566 -473
14104d73J542J0301L974l322n797J683N632m623o804m550j947p46K729L37k674
$$ -473 1069 11370 15344 12022 6225 7908 13540 8917 2113 -2437 -4384 -5130 -2401 -2064 -4738
14089d738K303R69l010l23O438K766J044J962l958p020l045K965O04o18M099k820
$$ -4738 -2435 -1466 -4476 -4799 1639 4405 5449 7411 3453 -3567 -6612 -3647 -3043 -3661 438 -2382
14073b382J388o31l434K022O337l773r139K36J1370J324k646J17M627r51k633
$$ -2382 -994 -1625 -5059 -3037 3300 -473 -9612 -9376 1994 3318 672 789 5416 4465 1832
14058A832k216j533q171j66L182M339L685Q91K862K917j905o195P09N1l213M321
$$ 1832 -384 -1917 -10088 -10254 -7072 -2733 952 1843 4705 7622 5717 -478 231 282 -2931 1390
14042A390L255k196J313M54l067l71r524k186J1675R87j1349K212L57R29M622
$$ 1390 4645 2449 3762 4216 1149 778 -8746 -10932 743 1730 -9619 -7407 -7050 -6121 -1499
14027a499j148l39k945L92O81M12O209j018J531p483J089J1293L625L790n187
$$ -1499 -2647 -2986 -5931 -5539 -4858 -4446 1763 745 2276 -5207 -4118 7175 10800 14590 9403
14012I403J770l948p881K612Q92K543K619r206k491N726J0918j740l10Q540q63
$$ 9403 11173 7225 -656 1956 2848 5391 8010 -1196 -3687 2039 12957 11217 10907 19447 18584
13997A8584l501l69m592O88j873O305o671q514m94K480M793l519r88M228K471
$$ 18584 15083 14714 10122 10810 8937 15242 8571 57 -437 2043 6836 3317 2329 6557 9028
13982I028l030l224P32L448j762m569q45J477J416m755L802J59r37L994M364J101
$$ 9028 5998 2774 3506 6954 5192 623 -222 1255 2671 -2084 1718 1877 940 4934 9298 10399
13966A0399O155N39o929n676l049r84k85N66k705k03n87N96N24p343q620N735
$$ 10399 16554 17093 10164 4488 1439 455 170 736 -1969 -2172 -2759 -2163 -1639 -8982 -17602 -11867
13950a1867Q464L898l230k81j613N692O170j951m186l054q955k818R522L367p618
$$ -11867 -3403 495 -2735 -3016 -4629 1063 7233 5282 1096 -1958 -10913 -13731 -4209 -842 -8460
13935h460k885J580O743L607J42J733J371K63k211K747j761m27n49k648J080m694
$$ -8460 -11345 -9765 -3022 585 727 2460 3831 4094 1883 4630 2869 2442 1893 -755 325 -4369
13919d369L75K500j658J54j796N099j767j67l695K43j184L633N711J510K124K488
$$ -4369 -3994 -1494 -3152 -2998 -4794 305 -1462 -1629 -5324 -5081 -6265 -2632 3079 4589 6713 9201
13903I201O799Q50n057J401M484k382n940j431l959j05Q21J5m635m897m491k2
$$ 9201 16000 16850 11793 13194 17678 15296 9356 7925 3966 3861 4682 4697 62 -4835 -9326 -9348
13887i348N707O093R6k238k49J066q225M620Q75q616k808J0283N74k298M663L554
$$ -9348 -3641 2452 2548 310 61 1127 -7098 -2478 -1603 -10219 -13027 -2744 -2170 -4468 195 3749
13871C749k329k794o015l044J331M499R438J195K510k205L206k825k839M1J825
$$ 3749 1420 -1374 -7389 -10433 -9102 -4603 4835 6030 8540 6335 9541 6716 3877 3918 5743
13856E743K10p581k896M482O408J960p72j329m808L707o72m205K123J098K165
$$ 5743 5953 -1628 -4524 -42 6366 8326 7554 6225 1417 5124 4452 247 2370 3468 5633
13841E633L48N703N021L518L937l703j410n253m922o98p84j486o204l85N925Q553
$$ 5633 5981 11684 16705 20223 24160 20457 19047 13794 8872 8174 7390 5904 -300 -685 5240 13793
13825A3793m861o393j827J900J324J282K890K914o89O09j136l466l945J728Q39
$$ 13793 8932 2539 712 2612 3936 5218 8108 11022 10333 10942 9806 6340 2395 4123 4962
13810D962L85p71n192l844K85M569M65NK79J527j129J339m426M23Q69l567L548
$$ 4962 5347 4576 -616 -4460 -4175 394 859 864 1143 2670 1541 2880 -1546 -1123 -254 -3821 -273
13793b73L474K023N054j449o010k087m056q16K037N95j974M158K848o61Q401L676
$$ -273 3201 5224 10278 8829 2819 732 -3324 -4140 -2103 -1508 -3482 676 3524 2863 11264 14940
13777A4940K467j088k958l6p336o561j903M164j527l96O108J071K25q33l097k379
$$ 14940 17407 16319 13361 13325 5989 -572 -2475 1689 162 -234 5874 6945 7170 6337 3240 861
13761H61J813O06l674R18l904k845J631L610j047J874N27k196n26J583j000j213
$$ 861 2674 3280 -394 524 -3380 -6225 -4594 -984 -2031 -157 370 -1826 -2352 -769 -1769 -2982
13745b982k672M284Q57J711L841L058lK231N13n514k061k645K73J909k227J606
$$ -2982 -5654 -1370 -513 1198 5039 8097 8094 10325 10838 5324 3263 618 891 2800 573 2179
13729B179j415k91L096K917M618J274J771l326o299k389L17M363R06k878O371
$$ 2179 764 473 3569 6486 11104 12378 14149 10823 4524 2135 2452 6815 7721 4843 11214
13714A1214J610k484m838l161o062q74O21L509R449m018n76k242M755R053O20
$$ 11214 12824 10340 5502 2341 -3721 -4595 -3974 -465 8984 4966 4390 2148 6903 15956 16576
13699A6576r021k432L364N108O100q680m948P293R602J798q57j510l956n447m951
$$ 16576 7555 5123 8487 13595 19695 11015 6067 13360 22962 24760 23903 22393 18437 12990 8039
13684H039L044Q98r413n811J763K885L840L549J761k385m180K226M685L108j441
$$ 8039 11083 11981 2568 -3243 -1480 1405 5245 8794 10555 8170 3990 6216 10901 14009 12568
13669A2568j5j294m59L102j71m799J106j570j295J200p531M209O363M113j531
$$ 12568 12553 11259 10800 13902 13731 8932 10038 8468 7173 8373 842 5051 11414 15527 13996
13654A3996K395p63q380j372M897q96l541j795J406j71m727k063M19L907n79R184
$$ 13996 16391 15628 7248 5876 10773 9877 6336 4541 5947 5776 1049 -1014 -595 3312 2733 11917
13638A1917K192m840k026K169l301k757K167J051l372N444N903r199j552M504
$$ 11917 14109 9269 7243 9412 6111 3354 5521 6572 3200 8644 14547 5348 3796 8300
13624H300l313K757M953N334k811l63k644O840M17m595J03j457l868l876k300
$$ 8300 4987 7744 12697 18031 15220 14857 12213 19053 19470 14875 14978 13521 9653 5777 3477
13609C477j74n350M197n439k146J219p82l424L08N192J2191L62J698k575M775
$$ 3477 3303 -2047 2150 -3289 -5435 -4216 -4998 -8422 -8114 -2922 9269 9631 11329 8754 13529
13594A3529N503o02m599K665j506l049k751j809J160o50J335J634J1M589J529
$$ 13529 19032 18430 13831 16496 14990 11941 9190 7381 8541 7891 9226 10860 10871 15460 16989
13579A6989n634P32K212L6N347n43m997n727q011M471k321L48N016j263K654M372
$$ 16989 11355 12087 14299 14335 19682 19139 14142 8415 404 4875 2554 2902 7918 6655 9309 13681
13563A3681J211n645j598O009J846n815j667O982Q153K780J733r487m066o846
$$ 13681 14892 9247 7649 13658 15504 9689 8022 15004 23157 25937 27670 18183 14117 7271
13549G271l21L226q80k86l805M575j089n687j1379R42L613R827N524P79O31o770
$$ 7271 6950 10176 9296 9010 5205 9780 8691 3004 -8375 -7433 -3820 6007 11531 12310 12941 6171
13533F171K21M020N22p46K981j078k995J013j0452n245P477M970r29M599J012
$$ 6171 6392 10412 10934 10188 13169 12091 9096 10109 -343 -5588 1889 6859 5930 10529 11541
13518A1541K362j784n959K552M852k303l819k098j83k478K510k131k891K328L112
$$ 11541 13903 12119 6160 8712 13564 11261 7442 5344 5161 2683 5193 3062 171 2499 5611
13503E611M663m127n014J903M079M42l986j850R202Q089k729m810l794p869J44
$$ 5611 10274 6147 1133 3036 7115 7557 3571 1721 10923 19012 16283 11473 7679 -190 -46
13488d6J217O904m688j037O057j518J424K160N413M434Q57p133o769k449K389
$$ -46 1171 8075 3387 2350 8407 6889 8313 10473 15886 20320 21177 14044 7275 4826 7215
13473G215m51K693J124L234l57L196n750L31R662j193r152k642l983J906l197
$$ 7215 6764 9457 10581 13815 13458 16654 10904 11235 20897 19704 10552 7910 3927 5833 2636
13458B636n290l940Q45O343Q206Q57l420M361L17L108R458M843o483j831J521
$$ 2636 -2654 -6594 -5749 594 8800 9657 6237 10598 10915 14023 23481 28324 21841 20010 21531
13443B1531p14m133L877P11o03j235L182m385j883k132j828L00o447n661K114
$$ 21531 20817 16684 20561 21272 20669 19434 22616 18231 16348 14216 12388 12688 6241 580 2694
13428B694R020Q066P042l589r99p93K113j891l78K493L577K142n862m331N3l225
$$ 2694 11714 19780 26822 23233 22234 21441 23554 21663 21285 23778 27355 29497 23635 19304 19357 16132
13412A6132L031o27k965P27j871j862k438m958O2J044J690Q13K008n732l208J006
$$ 16132 19163 18536 15571 16298 14427 12565 10127 5169 5231 6275 7965 8778 10786 5054 1846 2852
13396B852J084K424J62N011Q911K899j68Q88q19o746M04O003p0l460q253N372
$$ 2852 3936 6360 6522 11533 20444 23343 23175 24063 23244 16498 16902 22905 22835 19375 11122 16494
13380A6494K2l593j789J702K34K170L784l922m969k951K758M994k702J005o174
$$ 16494 16516 12923 11134 12836 13070 15240 19024 15102 10133 7182 9940 14934 12232 13237 7063
13365G063q194P8R629Q197M095k560n702m54k342M23N371J910k066J10K388r16
$$ 7063 -1131 -1053 8576 16773 20868 18308 12606 12152 9810 10233 15604 17514 15448 15558 17946 17030
13349A7030N746m909n052J550P909L948J82L601j409j3022r370l85Q218P324j912
$$ 17030 22776 17867 12815 14365 22274 26222 26404 30005 28596 15574 6204 5819 14037 21361 19449
13334A9449l306J29J196J251M96N523j91K713k374k967K592L608N970M215n344
$$ 19449 16143 16272 17468 18719 19215 24738 24547 27260 24886 21919 24511 28119 34089 38304 32960
13319C2960j417M170m228j6250o684j616M430R89m334J24K154O900N885k74k677
$$ 32960 31543 35713 31485 15235 8551 6935 11365 12354 8020 8144 10298 17198 23083 22809 20132
13304B0132k93m850k082J012P84K541K320J452k751O827J339j511q57k149j27
$$ 20132 19839 14989 12907 13919 14703 17244 19564 21016 18265 25092 26431 24920 24063 21914 21787
13289B1787P36J983q968n107l646P676M486L150O355J0410J559o187j149j137
$$ 21787 22523 24506 15538 10431 6785 14461 18947 22097 28452 38862 40421 34234 33085 31948
13275C1948n466p307p307l213o647P034j213r237J591P342j93J729L138K812N15
$$ 31948 26482 19175 11868 8655 2008 9042 7829 -1408 183 7525 7332 9061 12199 15011 15526
13260A5526l919o969k373Q69n338l745J2904Q070N974P745K394l316q407j554
$$ 15526 11607 4638 2265 3134 -2204 -5949 6955 15025 20999 28744 31138 27822 19415 17861
13246A7861M306n607p370M558P356L494n606N849L614o559p858k527K904M149
$$ 17861 22167 16560 9190 13748 21104 24598 18992 24841 28455 21896 14038 11511 14415 18564
13232A8564L366J297l9j600o639k310j349n307n30M420P334P68p6O181L151P485
$$ 18564 21930 23227 23188 21588 14949 12639 11290 5983 5453 9873 17207 17975 17899 24080 27231 34716
13216C4716K531J140r29l679m810m697R27J242j837n802J650M541J957N375J558
$$ 34716 37247 38387 37458 33779 28969 24272 25199 26441 24604 18802 20452 24993 26950 32325 33883
13201C3883k746K196l535n858n539J763j013n89j02O105Q367n9K373O271l896
$$ 33883 31137 33333 29798 23940 18401 20164 19151 18562 18460 24565 32932 32873 35246 41517 37621
13186C7621p989n854j413N178K030K793O906o068N1L747n694r166r706k2604j5979
$$ 37621 29632 23778 22365 27543 29573 32366 39272 33204 33255 37002 31308 22142 12436 -10168 -26147
13171b6147K5906L4630J4574O602K312n563L784o96l956m278J288N95J612P282
$$ -26147 -241 34389 48963 55565 57877 52314 56098 55402 51446 47168 48456 49051 50663 57945
13157E7945J929N00Q651J0467O276j575M511n342p568j347J761M948j162K559
$$ 57945 59874 60374 69025 79492 85768 84193 88704 83362 75794 74447 76208 81156 79994 82553
13143H2553N076J4778R171J4952K5964K5900K1209L0950L8091M3296N3298Q0754
$$ 82553 87629 102407 111578 126530 152494 178394 199603 230553 268644 311940 365238 445992
13131D45992J20794K02269L36913N10594O22632L12614k73874n55095n56327l83457
$$ 445992 566786 769055 1105968 1616562 2239194 2551808 2277934 1722839 1166512 783055
13121G83055k34587j50700r7858n9041m4161k3215r589j485j3142k0601j2372
$$ 783055 548468 397768 299910 240869 196708 173493 163904 162419 149277 128676 116304
13110A16304j5214j7272l082o133n362p434n232R78J726l980m174l850j533p716
$$ 116304 101090 83818 80736 74603 69241 61807 56575 57553 59279 55299 51125 47275 45742 38026
13096C8026j1316J68N905N884m354k316L346N787r68j525r69K395J924n260q918
$$ 38026 26710 26878 32783 38667 34313 31997 35343 41130 40162 38637 37668 40063 41987 36727 27809
13081B7809L945J0195j629l398p653j2591k25j883l363J0154O747J0723Q643j905
$$ 27809 31754 41949 40320 36922 29269 16678 16453 14570 11207 21361 28108 38831 47474 45569
13067D5569l937k700j1214j1129K348O028L125N91K382Q692J0592N495q53l765
$$ 45569 41632 38932 27718 16589 18937 24965 28090 28681 31063 39755 50347 55842 54989 51224
13053E1224N71L346R87k867m968j062q237j1960j3258q114N844l32P380M807K67
$$ 51224 51795 55141 56128 53261 48293 47231 38994 27034 13776 5662 11506 11174 18554 23361 23628
13038B3628K674M693N129J119k820o930P0R404J543n93J127N217k138j463j370
$$ 23628 26302 30995 36124 37243 34423 27493 27563 36967 38510 37917 39044 44261 42123 40660 39290
13023C9290l454k108L815l259j736K572K365L184m47k218L091K868J467J0750
$$ 39290 35836 33728 37543 34284 32548 35120 37485 40669 40222 38004 41095 43963 45430 56180
13009E6180J1745J2043Q743l038j76k942q122j0313j1653N427L100o919j269N458
$$ 56180 67925 79968 88711 85673 85497 82555 74433 64120 52467 57894 60994 54075 52806 58264
12995E8264N999R201J223n4J918m048p846j1051j0151q154o468j3635m882Q780
$$ 58264 64263 73464 74687 74633 76551 72503 64657 53606 43455 35301 28833 15198 10316 19096
12981A9096K1725P629o98Q006J8131K1392Q885p30q536j7280k4967k2066k4085
$$ 19096 40821 48450 47752 55758 73889 95281 104166 103436 94900 77620 52653 30587 6502
12968F502j5097k0434P53J6981P913J4843K2040K0034J5045J389j522M775O922
$$ 6502 -8595 -29029 -28276 -11295 -3382 11461 33501 53535 68580 69969 68447 73222 80144
12955H0144M846m153j368P176P468J6778K1736K5435J1185J596j7471k1197k1947
$$ 80144 84990 80837 79469 86645 94113 110891 132627 158062 169247 170843 153372 132175 110228
12942A10228j7689j3675j0499o202n452o81O177K545M776J6688J7816J0420L338
$$ 110228 92539 78864 68365 62163 56711 56030 62207 64752 69528 86216 104032 114452 117790
12929A17790o118j2323L631Q074M267J4105K2685L4594P5087J01671O9329j7102
$$ 117790 111672 99349 102980 111054 115321 129426 152111 186705 261792 363463 432792 415690
12917D15690q5265p0496k1737R013K0270K7868L2532L9831P0681J02475J59685
$$ 415690 330425 259929 238192 247205 267475 295343 327875 367706 438387 540862 700547
12906G00547K42380L17189L32570K88689J69931l8138j97240l24982l52340l01212
$$ 700547 942927 1260116 1592686 1881375 2051306 2013168 1815928 1490946 1138606 837394
12896H37394k19340j37470p8735m5169l5545l0342k5891j9405k2010k0334k6036
$$ 837394 618054 480584 401849 356680 321135 290793 264902 245497 223487 203153 177117
12885A77117l1521k2590o195k82k748l683n245j2611L444M668K43R526J7188J0137
$$ 177117 145596 123006 116811 116529 113781 110098 104853 92242 95686 100354 100597 110123 127311 137448
12871A37448J6554N514M001l828j9360k7501k8149j0189M382J2122R008M138Q447
$$ 137448 154002 159516 163517 159689 140329 112828 84679 74490 78872 90994 100002 104140 112587
12858A12587J1727J2300J4953R184J724J4234L4224K9588K518j3540j8619k72
$$ 112587 124314 136614 151567 160751 162475 176709 210933 240521 243039 229499 210880 210608
12846B10608K13j9021j8899j2712L199P188Q205Q652P090P116m762m962K49J28
$$ 210608 210821 191800 172901 160189 163388 170576 178781 187433 194523 201639 196877 191915 192164 192292
12832A92292N025r52o375L636m056k0176k1508j751J0298M228J1727L0731L6040
$$ 192292 197317 196365 189990 193626 189570 169394 147886 146135 156433 160661 172388 203119 239159
12819B39159J5458p044l3408n3593m0112k4465j8973Q005J6691J9005J6229j366
$$ 239159 254617 247573 214165 160572 120460 95995 77022 85027 101718 120723 136952 135586
12807A35586R12L512P92m423n940q829j5430k0140j0021k0177k6491l3386m0346
$$ 135586 136498 140010 140802 136379 130439 121610 106180 86040 76019 55842 29351 -4035 -44381
12794d4381m7657k7114L1187Q0831J48883J51919L6469L971N985p17k32j0226
$$ -44381 -92038 -119152 -87965 -7134 141749 293668 330137 334108 340093 339376 339144 328918
12782C28918k0338j8925k4510j3831M072J5116O979j690P057K0754L2494K8976
$$ 328918 308580 289655 265145 251314 255386 270502 277481 275791 282848 303602 336096 365072
12770C65072J2554j5391l2252k2491j1995O5P211J6659K5494L1473K4788K0441
$$ 365072 377626 362235 329983 307492 295497 295562 302773 319432 344926 376399 401187 421628
12758D21628K0517K3477L8223M4736M7312P1963J18641K01570K82546J78683q1762
$$ 421628 442145 465622 503845 548581 595893 667856 786497 988067 1270613 1449296 1367534
12747A367534k13628k29451j62534r5127n6268k8020Q745L4335L7388K5633J4285
$$ 1367534 1153906 924455 761921 666794 610526 582506 591251 625586 662974 688607 702892
12736G02892l058j2529j0474j0372o732O476J7717K9423N0006P3853Q9271J03716
$$ 702892 699834 687305 676831 666459 659727 666203 683920 713343 763349 837202 926473 1030189
12724A030189J42278K06515K61723J93553m0746j46457j27654n5882N459L4312
$$ 1030189 1172467 1378982 1640705 1834258 1793512 1647055 1519401 1463519 1468978 1503290
12714A503290L0642l677k2491j0276J0202K6826M2083N4304P0160Q6596R8332
$$ 1503290 1533932 1530255 1507764 1497488 1507690 1534516 1576599 1630903 1701063 1787659 1885991
12703A885991J08690J13864J11107J21553J41488J53396J70621J84884K37479
$$ 1885991 1994681 2108545 2219652 2341205 2482693 2636089 2806710 2991594 3229073
12694C229073L36205M22657M54120M67211M80198M99206N34245O04117P44700
$$ 3229073 3565278 3987935 4442055 4909266 5389464 5888670 6422915 7027032 7771732
12685G771732R11115J123428J426816J836663K326819K897519L480154L950288
$$ 7771732 8682847 9806275 11233091 13069754 15396573 18294092 21774246 25724534
12677B5724534M125468L839194L981861M942962O645701R220837J3115922J9708267
$$ 25724534 29850002 33689196 37671057 42614019 49259720 58480557 71596479 91304746
12669I1304746L1091844N0450068Q0547440J11094566Q8268132j3415162q3304706
$$ 91304746 122396590 172846658 253394098 364488664 452756796 439341634 356036928
12662C56036928j02887472q6227820n4294681l1902294j9664865j2957142r009074
$$ 356036928 253149456 166921636 112626955 80724661 61059796 48102654 39093580
12655C9093580o494415m746931l531610k997366l003590k813765k401071j838259
$$ 39093580 32599165 27852234 24320624 21323258 18319668 15505903 13104832 11266573
12647A1266573j382178j122606r64841q17607o70723n74101m48117l54783l07591
$$ 11266573 9884395 8761789 7796948 6979341 6308618 5734517 5286400 4931617 4624026
12638D624026k49122j67408j55194k11857k73618k83249k61111k21432j77556
$$ 4624026 4374904 4207496 4052302 3840445 3566827 3283578 3022467 2801035 2623479
12629B623479j55593j46168j29283j19172j17943j11162j00121r6915q4642o8702
$$ 2623479 2467886 2321718 2192435 2073263 1955320 1844158 1744037 1647122 1562480 1493778
12619A493778n6994n1514n2427m5845l6302m5020l2466l2543l7903l7833n3171
$$ 1493778 1436784 1385270 1332843 1286998 1250696 1205676 1173210 1140667 1102764 1064931 1011760
12608A011760o0053m1952k5334j1950N161K379j3113k0150k1851k6741l8525n6617
$$ 1011760 951707 909755 884421 872471 877632 880011 866898 846748 824897 798156 759631 703014
12596G03014o4593o2752o1036o2069n8503l9128j3561J4744L8657N7905M6271
$$ 703014 638421 575669 514633 452564 394061 354933 341372 356116 394773 452678 498949
12585D98949M7208L8711K5499J7367j4276j0875k012j2352k1717k2611j6658j0155
$$ 498949 546157 584868 610367 627734 613458 602583 600571 588219 566502 543891 527233 517078
12573E17078o728M330J964m358J322K4692K5628J6858M604M83n588k3622l0063
$$ 517078 510350 514680 516644 512286 513608 538300 563928 580786 585390 585873 580285 556663 526600
12560E26600j9164J802J8226K0180J1368R595j299J996Q595P612o627j9610j5449
$$ 526600 507436 509238 527464 547644 559012 568607 567308 569304 577899 585511 578884 559274 543825
12547E43825j2186m692k65n394n29K563P995M5777J09605J61540R6007J0001m411
$$ 543825 531639 526947 526682 521288 520759 523322 531317 577094 686699 848239 944246 954247 949836
12534I49836q126k4146k6466l3207l7841k7181k7599k5328j4910j1869N819J9703
$$ 949836 941710 917564 891098 857891 820050 792869 765270 739942 725032 713163 718982 738685
12522G38685L1548L6548L0168M3973M7567M4597K6738R496j271O947J3407K0373
$$ 738685 770233 806781 836949 880922 928489 973086 999824 1009320 1008049 1014996 1028403 1048776
12510A048776L8163N9377P8345P3587O5198N9219N5818N4158O1210P1676Q8066
$$ 1048776 1086939 1146316 1224661 1298248 1363446 1422665 1478483 1532641 1593851 1665527 1753593
12499A753593R9313R5009J09304J19453J32943J38892J62073K02811K46629L21400
$$ 1753593 1852906 1947915 2057219 2176672 2309615 2448507 2610580 2813391 3060020 3381420
12489C381420L69027M15695M45800M74400N08651N56208O18735P40631Q94191
$$ 3381420 3750447 4166142 4611942 5086342 5594993 6151201 6769936 7510567 8404758
12480H404758J087680J367706J746989K177504K625470L093664L597117M102581
$$ 8404758 9492438 10860144 12607133 14784637 17410107 20503771 24100888 28203469
12472B8203469M550337N052466N754455O990443R316107J3437024K0571015L2306658
$$ 28203469 32753806 37806272 43560727 50551170 59867277 73304301 93875316 126181974
12464A26181974M8551268O0924805N6953415M4271355J5823041j8665559m1826040
$$ 126181974 174733242 235658047 292611462 336882817 352705858 334040299 292214259
12457B92214259o0636204o0899109m9318297l4416445k1710860j3764436r304897
$$ 292214259 231578055 170678946 121360649 86944204 65233344 51468908 42164011
12450D2164011o774573n371125m541983l936172l385209k818563k250506j780827
$$ 42164011 35389438 30018313 25476330 21540158 18154949 15336386 13085880 11305053
12442A1305053j424859j156354r76860q40509p36638o31889n41517m54367l59071
$$ 11305053 9880194 8723840 7746980 6906471 6169833 5537944 4996427 4542060 4182989
12433D182989k76563k20413j93041j80357j80871j64046j50728j52058j47808
$$ 4182989 3906426 3686013 3492972 3312615 3131744 2967698 2816970 2664912 2517104
12424B517104j38590j20136j12692r9819r7436q6272p5675p2904o4858n4015m7266
$$ 2517104 2378514 2258378 2145686 2045867 1948431 1862159 1786484 1713580 1648722 1594707 1547441
12413A547441n0513n1942l0630j3740j0336O882K7479K4829l5710r3761j11792
$$ 1547441 1496928 1444986 1414356 1400616 1390280 1397162 1424641 1449470 1413760 1319999 1208207
12402A208207r4965o9006m9811l4943k5718k2032j6489j6945k6696l5924l6144
$$ 1208207 1113242 1044236 994425 959482 933764 911732 895243 878298 851602 815678 779534
12391G79534l8273m6962m0334k3595j7581j1498K62k815j00M62j1755j8338k4060
$$ 779534 741261 694299 653965 630370 612789 601291 601553 598738 598638 599100 587345 569007 544947
12378E44947k4366j3868j3101j7130j4093r742q602k783j5419j9994m295J1123
$$ 544947 520581 506713 493612 476482 462389 452647 444045 441262 425843 405849 401554 412677
12366D12677J6789J2683O011j095R51o991j6239k0040k3493k5585l3024j7881
$$ 412677 429466 442149 448160 447065 448016 441025 424786 404746 381253 355668 322644 304763
12354C04763L636N333M31R411M357K836J453q9k836j8243k0056k2360j8611k2049
$$ 304763 308399 313732 314163 323574 327931 330767 332220 332131 329295 311052 290996 268636 250025 227976
12340B27976j7225j6263q347J7321M4106O9375Q1681O5922K8638J2714l646l5170
$$ 227976 210751 194488 186141 203462 247568 316943 398624 464546 493184 505898 502252 467082
12328D67082m1162m2480k9206l3147k4438k2759k1602q919p287r861p893n528
$$ 467082 425920 383440 354234 321087 296649 273890 252288 243369 236082 226221 218328 212800
12316B12800M325J0764P185J1130O360p830j6029k6492l3341l8440j7408k072
$$ 212800 217125 227889 235074 246204 252564 244734 228705 202213 168872 130432 113024 110952
12304A10952N953J5438J4337N115l01n393q256r671j5976k0674j4265m103J770
$$ 110952 116905 132343 146680 151795 151494 146101 137845 128174 112198 91524 77259 73156 74926
12291G4926k616L517O354l152Q67L785M568l941m951q516J008l479l564j1160
$$ 74926 72310 75827 82181 79029 79896 83681 88249 84308 79357 70841 71849 68370 64806 53646
12277E3646k372k194N007J3213O537R522J1486J4225J3399L866M797M783J1854
$$ 53646 51274 49080 54087 67300 73837 83359 94845 109070 122469 126335 131132 135915 147769
12264A47769L901q432R12J79j526q93k883j66o114q103o367j285q264l682J143
$$ 147769 151670 143238 144150 144329 142803 141910 139027 138861 132747 124644 118277 116992 108728 105046 106189
12249A06189k136q56K037K919L748L072L919l266m179j653n617j2988p781m272
$$ 106189 104053 103197 105234 108153 111901 114973 118892 115626 111447 109794 104177 91189 83408 79136
12235G9136L920J0442p54L150O995M53m611L527J268N43K496o437n995k720M591
$$ 79136 83056 93498 92744 95894 102889 103342 98731 102258 103526 104069 106565 100128 94133 91413 96004
12220I6004M204J5393J2630O210J4115J9694J7187K0570K2943K3773J8609L5722
$$ 96004 100208 115601 128231 134441 148556 168250 185437 206007 228950 252723 271332 307054
12208C07054L3441J5522J6646J6900J7250K2012M0260Q2760J42485K31544L67907
$$ 307054 340495 356017 372663 389563 406813 428825 469085 551845 694330 925874 1293781
12197A293781N53352N87021J33055l84622n64585n10249l37443j94300j16718
$$ 1293781 1847133 2434154 2567209 2182587 1618002 1107753 770310 576010 459292
12188D59292p5480n1520l5337k6435k0120k4031k7676j9560j7281q928q901q842
$$ 459292 383812 332292 296955 270520 250400 226369 198693 179133 161852 152924 144023 135181
12176A35181m706j2673j4745j4239J188M282m992j1043j834J489Q804L420L900
$$ 135181 130475 117802 103057 88818 90006 94288 89296 78253 76419 77908 86712 90132 94032
12163I4032Q961J5247J1477J3562O783q229j4929j2913j7745j8542j9180j6680
$$ 94032 102993 118240 129717 143279 150062 141833 126904 113991 96246 77704 58524 41844
12151D1844j1338K369Q13R716J1696R137p38J754P347J751M814r6O121l487j1043
$$ 41844 30506 32875 33688 43404 55100 64237 63499 65253 72600 74351 79165 79069 85190 81703 70660
12136G0660n126m473k813J076l144K556L50N9m508K96M364n59j249q513p187j729
$$ 70660 65534 61061 58248 59324 56180 58736 59086 59145 54637 54933 59297 58738 57489 48976 41789 40060
12120D0060K533M962l221j76Q79K790m768n865j912m803L411J145Q962N967O81
$$ 40060 42593 47555 44334 44158 45037 47827 43059 37194 35282 30479 33890 35035 43997 49964 50645
12105E0645k087n722M09k125k142O20m029J014Q687M508p36m324k934L089O564
$$ 50645 48558 42836 43245 41120 38978 39598 35569 36583 45270 49778 49042 44718 41784 44873 51437
12090E1437l585m842J643L927M254N317p28ml520L9K3j079r818q812K838k173
$$ 51437 47852 43010 44653 48580 52834 58151 57423 57419 53899 53938 53961 52882 43064 34252 37090 34917
12074C4917m976K352N115j294J325J207N45N3K071J5696Q861o229q800k819k971
$$ 34917 29941 32293 37408 36114 37439 38646 39191 39244 41315 57011 65872 59643 50843 48024 45053
12059D5053k253l163L609k570l972r99n881j693L545K69R580J1316P362N811L448
$$ 45053 42800 39637 43246 40676 36704 35705 29824 28131 31676 31945 41525 52841 60203 66014 69462
12044F9462L40k783J028J2072q9j434L568J0294N512O674Q020k382l701N507L808
$$ 69462 69802 67019 68047 80119 80030 78596 82164 92458 97970 104644 112664 110282 106581 112088 115896
12029A15896O840O685P484J4767K0988K1814J8914K7937L1563L5890O0230P8508
$$ 115896 122736 129421 136905 151672 172660 194474 213388 241325 272888 308778 369008 447516
12017D47516J14812J87810K79711L27173K95100K03501J8266j42032k68367l38519
$$ 447516 562328 750138 1029849 1357022 1652122 1855623 1873889 1731857 1463490 1124971
12007A124971k97923k34515j55744r7914o3057m7288l4978l5692k2806j8227r265
$$ 1124971 827048 592533 436789 338875 275818 228530 193552 157860 135054 116827 107562
11996A07562o390o686j4351j2609q210P26L333o098L233J783o105m192J20n707
$$ 107562 101172 94486 80135 67526 59316 60042 63375 57277 60510 62293 56188 51996 52116 46409
11982D6409m871r403m074M244j518K556q08P9K23p103m935n312M466P101m806
$$ 46409 41538 32135 28061 32305 30787 33343 32535 32614 32837 25734 20799 15487 19953 27054 22248
11967B2248n219k465j697R18O118L174O066K320m295j866N317P468j93N098j398
$$ 22248 17029 14564 12867 13785 19903 23077 29143 31463 27168 25302 30619 38087 37894 42992 41594
11952D1594k60k535n916Pm642n440k568N903j077r89R96l138L262M213k958n961
$$ 41594 41334 38799 32883 32890 28248 22808 20240 26143 25066 24077 25073 21935 25197 29410 26452 20491
11936B0491L837J922J672m712m706J731k18o479p205J945O548n306j0773l057
$$ 20491 24328 26250 27922 23210 18504 20235 20017 13538 6333 8278 14826 9520 -1253 -4310
11922d310K625R777O165L440j457K392l405K299j459J654K602n79l882l36J463
$$ -4310 -1685 8092 14257 17697 16240 18632 15227 17526 16067 17721 20323 19744 15862 15526 16989
11907A6989n581L947j504j426l920m709N898N202k240r25N232k320m551j41m33
$$ 16989 11408 15355 13851 12425 8505 3796 9694 14896 12656 11731 16963 14643 10092 9951 9518
11892I518K842K061N97k68j2m502n288k722M744N216M786N514O578K24n518p625
$$ 9518 12360 14421 15018 14750 14738 10236 4948 2226 6970 12186 16972 22486 29064 29288 23770 16145
11876A6145j031m138l619j761M922P267M31l245J979K068k355l634J407o243J091
$$ 16145 15114 10976 7357 5596 10518 17785 18216 14971 16950 19018 16663 13029 14436 8193 9284
11861I284R47M68N076M033K447l757k779K649N050j608k126k776m701R91O792
$$ 9284 10231 10699 15775 19808 22255 18498 15719 18368 23418 21810 19684 16908 12207 13198 19990
11846A9990K446M023k549r57m889l851n788J03K513k823l163k325L099Q292j978
$$ 19990 22436 26459 23910 22953 18064 14213 8425 8528 11041 8218 5055 2730 5829 14121 12143
11831A2143l697j127j157l5l406k900K404P942Q881n24p447o842r002N31O48J1732
$$ 12143 8446 7319 6162 6127 2721 -179 2225 10167 19048 18524 11077 4235 -4767 -4236 -3588 8144
11815H144P263p716K900J680k629J714J839J175m015o593k579M859M683q58k006
$$ 8144 15407 7691 10591 12271 9642 11356 13195 14370 10355 3762 1183 6042 10725 9867 7861
11800G861m686K945J958J781L312L656K36j506p446n934L545j301m635m886k821
$$ 7861 3175 6120 8078 9859 13171 16827 17063 15557 8111 2177 5722 4421 -214 -5100 -7921
11785g921O64J819O878L020M082r08Q56O453j968o582k159O31M487r0j081l37
$$ -7921 -7257 -5438 1440 4460 8542 7634 8490 14943 12975 6393 4234 4865 9352 9262 8181 7844
11769G844N357K318K414Q170J099L01q34k336p711o624J215K33K812J322M29k552
$$ 7844 13201 15519 17933 26103 27202 27503 26669 24333 16622 9998 11213 11446 14258 15580 16009 13457
11753A3457L430j416n456K54p332j222M04k971k469n0R15L026J1774O394m710
$$ 13457 16887 15471 10015 10269 2937 1715 2119 -852 -3321 -3371 -2456 570 12344 18738 14028
11738A4028o194j0067l234j377M439L606k107Q326L580L598j889q158K045P998
$$ 14028 7834 -2233 -5467 -6844 -2405 1201 -906 7420 11000 14598 12709 4551 6596 14594
11724A4594N463o626l070q128p423k38N915P758P411K664j3043o435l383l046
$$ 14594 20057 13431 10361 2233 -5190 -5428 487 8245 15656 18320 5277 -1158 -4541 -7587
11710g587K610M352M361n523r277k152O786N724r47J236N169R605L882l494j059
$$ -7587 -4977 -625 3736 -1787 -11064 -13216 -6430 -706 -1653 -417 4752 14357 18239 14745 13686
11695A3686J706Q77j457J829l385n421r791j5488L28N990P779O019j172J804l724
$$ 13686 15392 16269 14812 16641 13256 7835 -1956 -17444 -17116 -11126 -3347 2672 1500 3304 -420
11680d20n52J476j528M146J458q85l310J700J167L147J439J672R25J831l46l887
$$ -420 -972 504 -1024 3122 4580 3695 385 2085 3252 6399 7838 9510 10435 12266 11920 8033
11664H033j724n642j306O418Q106R49n467K141l252n156J262O90O817L794m377
$$ 8033 6309 667 -639 5779 13885 14834 9367 11508 8256 3100 4362 5052 11869 15663 11286
11649A1286o911p814m638N668J84q300P639K607J244K496P537N292n884q635p1
$$ 11286 4375 -3439 -8077 -2409 -2225 -10525 -2886 -279 965 3461 10998 16290 10406 1771 1700
11634A700K953J413j193K452O51l981n376m246N67Q045L355r32P612J671P26N392
$$ 1700 4653 6066 4873 7325 7976 3995 -1381 -5627 -5060 2985 6340 5408 13020 14691 15417 20809
11618B0809n418j1631k204j844l520k680J447J947K264J457J15P639J854n916
$$ 20809 15391 3760 1556 -288 -3808 -6488 -5041 -3094 -830 627 742 8381 10235 4319
11604D319j549M645l132K307q25l813M670L555l488k734R3J824L961L135L20n99
$$ 4319 2770 7415 4283 6590 5765 1952 6622 10177 6689 3955 4048 5872 9833 12968 13288 12689
11588A2689K123o206n671P399o690n966N450J518L564M077k355m246k082m590
$$ 12689 14812 8606 2935 10334 3644 -2322 3128 4646 8210 12287 9932 5686 3604 -986
11574i86m134o875P121L721Q659J910l995q40J747j070n092n37K989J439j48K325
$$ -986 -5120 -11995 -4874 -1153 7506 9416 5421 4581 6328 5258 166 -371 2618 4057 3909 6234
11558F234j711O97P379J423j76j493k951o721o895j82J0904P252j455k863O94
$$ 6234 4523 5220 12599 14022 13846 12353 9402 2681 -4214 -4396 6508 13760 12305 9442 10136
11543A0136m635l366q14K829K953j526k138l941L258R911Q65k774K820l316J144
$$ 10136 5501 2135 1321 4150 7103 5577 3439 -502 2756 12667 13532 10758 13578 10262 11406
11528A1406k080K559K13k769j521m742J344j071J360J246J81l739N164p58o399
$$ 11406 9326 11885 12098 9329 7808 3066 4410 3339 4699 5945 6126 2387 7551 6793 394
11513C94K174m956k488m01q41j077J0594M351n768l257k019M249J749k585k704
$$ 394 2568 -2388 -4876 -5277 -6118 -7195 3399 7750 1982 -1275 -3294 955 2704 119 -2585
11498b585j940p74J641K208J891M394K986m062q15M075l245K558l907M09k637
$$ -2585 -4525 -5299 -3658 -1450 441 4835 7821 3759 2944 7019 3774 6332 2425 2834 197
11483A97l292k827J12lN006M885L979k512J22L158n367m349m731L406O477P854
$$ 197 -3095 -5922 -5810 -5813 -807 4078 8057 5545 5667 8825 3458 -891 -5622 -2216 4261 12115
11467A2115p671m300J520O562l516m763n920K65K504P616N268k53n306l050N428
$$ 12115 4444 144 1664 8226 4710 -53 -5973 -5708 -3204 4412 9680 9427 4121 1071 6499
11452F499M152m79l360j0258j0060K100M159q51l467J03J0669O373l159Q84j08
$$ 6499 10651 10172 6812 -3446 -13506 -11406 -7247 -8098 -11565 -11462 -793 5580 2421 3305 3197
11437C197M91o27L727k061J792P57J312M323j970q431n583j728J0663Q029o031
$$ 3197 3688 3061 6788 4727 6519 7276 8588 12911 10941 2510 -3073 -4801 5862 13891 7860
11422G860n478J615n495L701Q57m296m47N809j795l107j700L413k165r760r61
$$ 7860 2382 3997 -1498 2203 3060 -1236 -1683 4126 2331 -776 -2476 937 -1228 -10988 -11949
11407a1949P925J082k257R443P44J357r58L50L085l320j031k286k198k197n24
$$ -11949 -4024 -2942 -5199 4244 4988 6345 5387 5737 8822 5502 4471 2185 -13 -2210 -2734
11392b734L762O12K290m165N10L740k177j825L567L38Q96K593j768l605j400p67
$$ -2734 1028 1640 3930 -235 275 4015 1838 13 3580 3918 4814 7407 5639 2034 634 -133
11376a33J98R540L201m76l168n030k787M234P14p556n164r80k115J036j196J1269
$$ -133 65 9605 12806 12330 9162 4132 1345 5579 6293 -1263 -6427 -7407 -9522 -8486 -9682 1587
11360A587L552j047N45k421q29M372N114o414m467K528j871j406L9k569K351k07
$$ 1587 5139 4092 4637 2216 1387 5759 10873 4459 -8 2520 649 -757 -718 -3287 -936 -1143
11344a143J872J653K789k73J650Q44k280j980m740q24O304l99r94K771K635j936
$$ -1143 729 2382 5171 4898 6548 7392 5112 3132 -1608 -2432 3872 3473 2479 5250 7885 5949
11328E949r73l357K245P48N664J643j270L398L314j439j295J200j542m572o158
$$ 5949 4976 1619 3864 4612 10276 11919 10649 14047 17361 15922 14627 15827 14285 9713 3555
11313C555p571n855N491J5270J1590k811q435m96n209p635Q67j670O7j643m36
$$ 3555 -4016 -9871 -4380 10890 22480 19669 11234 10738 5529 -2106 -1239 -2909 -2842 -4485 -4921
11298d921p90l000K741N802q8k751P003Q168j06m093N75j945k95n274j004K149
$$ -4921 -5711 -8711 -5970 -168 -256 -3007 3996 12164 12058 7965 8540 6595 6300 1026 22 2171
11282B171Q233k23n520L98J535L39j247m426m36m057Q50P756p741L32J10j414
$$ 2171 10404 10181 4661 5059 6594 6933 5686 1260 824 -3233 -2383 5373 -2368 -2036 -1926 -3340
11266c340L318k667J457N627M613J810M489P138J066o189o625o515q725m697J0026
$$ -3340 -22 -2689 -1232 4395 9008 10818 15307 22445 23511 17322 10697 4182 -4543 -9240 786
11251G86P285K235o027J317m62M34m558k00j76k755K270K325k090n687l471M585
$$ 786 8071 10306 4279 5596 5134 5568 1010 810 634 -2121 149 2474 384 -5303 -8774 -4189
11235d189J505N296K062o990q112R377K494k266k596l785J721j382L89L771N978
$$ -4189 -2684 2612 4674 -2316 -10428 -1051 1443 -823 -3419 -7204 -5483 -6865 -6476 -2705 3273
11220C273Q910L309M593p300r246J989R29K167N410l064J308P54m175n117J096
$$ 3273 12183 15492 20085 12785 3539 5528 6457 8624 14034 10970 12278 13032 8857 3740 4836
11205D836J279o944J617K541L352l89K3O73k783j12k740N287P493M776o209R97
$$ 4836 6115 -829 788 3329 6681 6292 6315 6988 4205 4093 1353 6640 14133 18909 12700 13697
11189A3697R2o838J463L842o325k745k396N480r5r131m440j651j416k075N24L489
$$ 13697 13789 6951 8414 12256 5931 3186 790 6270 6175 -2956 -7396 -9047 -10463 -12538 -12014 -8525
11173h525L477l271P48J629L067O287K070l347J097l203o440J050J080Q030K453
$$ -8525 -5048 -8319 -7571 -5942 -2875 3412 5482 2135 3232 29 -6411 -5361 -4281 3749 6202
11158F202n873k669j406P873k136p86L762J822l183m252m121M456Q133R60j31
$$ 6202 329 -2340 -3746 4127 1991 1205 4967 6789 3606 -646 -4767 -311 7822 8782 8651
11143H651l158J648M866l147l360l881J089k933L802M248j359m308k515l203J148
$$ 8651 5493 7141 12007 8860 5500 1619 2708 -225 3577 7825 6466 2158 -357 -3560 -2412
11128b412M023N056J5l714r047o279k100N251j537L023M239q35M31J045J545r
$$ -2412 1611 6667 6682 2968 -6079 -12358 -14458 -9207 -10744 -7721 -3482 -4317 -3886 -2841 -1296 -1305
11112a305n677o0J727J37L868L651J597m269k740k619L915L469l034m419l038
$$ -1305 -6982 -7042 -5315 -5178 -1310 2341 3938 -331 -3071 -5690 -1775 1694 -1340 -5759 -8797
11097h797K411l289J277J631M17J0917M966o367m766n811J45J447M276N513n77
$$ -8797 -6386 -9675 -8398 -6767 -6350 4567 9533 3166 -1600 -7411 -7266 -5819 -1543 3970 3393
11082C393q914o02P018J251o834l868j571l44N94M007J0249k56O36L024n704q088
$$ 3393 -5521 -6123 895 2146 -4688 -8556 -10127 -10471 -9877 -5870 4379 4123 4759 7783 2079 -6009
11066f009L308o31Q04M334L044K517l883J716j914K100J285m603j014j129j342
$$ -6009 -2701 -3332 -2528 1806 4850 7367 3484 5200 3286 5386 6671 2068 1054 -75 -1417
11051a417M561K78j886j170K094O39k826n726J626J851N297m352n84M323J0508
$$ -1417 3144 3422 1536 366 2460 3099 273 -5453 -3827 -1976 3321 -1031 -1615 2708 13216
11036A3216M65k484O26j969o198j828J676j620n812M15L909N861o12l643p256
$$ 13216 13681 11197 11823 9854 3656 1828 3504 1884 -3928 -3513 396 6257 5645 2002 -5254
11021e254p519J647J869M0N803j717L07L617K24k283n870L285P706L205n315L789
$$ -5254 -12773 -11126 -9257 -9217 -3414 -5131 -4824 -1207 -983 -3266 -9136 -5851 1855 5060 -255 3534
11005C534J165K587J532l315m615L546l992m421p941r516K597L521O44K601J633
$$ 3534 4699 7286 8818 5503 888 4434 442 -3979 -11920 -21436 -18839 -15318 -14674 -12073 -10440
10990a0440L354J1017O800R70L981j469l996j239N96j651q164r689Q89J341L66
$$ -10440 -7086 3931 10731 11701 15682 14213 10217 8978 9574 7923 -241 -9930 -9041 -7700 -7334
10975g334K748j071n789l881N87J2605J0005N443n208m601J372k605N929O46J166
$$ -7334 -4586 -5657 -11446 -15327 -14740 -2135 7870 13313 8105 3504 4876 2271 8200 8846 10012
10960A0012K569m379k595J06M602q25K414M47p419j184j806k08n088M859M124
$$ 10012 12581 8202 5607 5713 10315 9490 11904 12351 4932 3748 1942 1734 -3354 1505 5629
10945E629n161k80k168j201N050N631k231l687k072K796J787j0417K632L38J3
$$ 5629 468 188 -1980 -3181 1869 7500 5269 1582 -490 2306 4093 -6324 -3692 -3354 -3341
10930c341N645O845J096M85p55p475k702Q459K039l456n396k754n878M149N859
$$ -3341 2304 9149 10245 10730 9975 2500 -202 8257 10296 6840 1444 -1310 -7188 -3039 2820
10915B820O931L379j998k242M473P14o922o323K629K32l090l937k753j126m929
$$ 2820 9751 13130 11132 8890 13363 14077 7155 832 3461 3693 603 -3334 -6087 -7213 -12142
10900a2142Q752k64L273M579J285m873j755N573Q44k304Q5k262M673Q249J078
$$ -12142 -3390 -3654 -381 4198 5483 610 -1145 4428 5272 2968 3053 791 5464 13713 14791
10885A4791n548r423m830L014M038M535l6k599K409j495j2112p275L268J181L04
$$ 14791 9243 -180 -5010 -1996 2042 6577 6541 3942 6351 4856 -7256 -14531 -11263 -10082 -9778
10870i778N521M561K244j087K767q147m336j600M304O88L262k885J23k444J794
$$ -9778 -4257 304 2548 1461 4228 -3919 -8255 -9855 -5551 -4863 -1601 -4486 -4363 -6807 -5013
10855e013N34j970J149M368K616r27J081j593j382L991j098Q81j844O46m374j722
$$ -5013 -4479 -6449 -5300 -932 1684 757 1838 245 -1137 2854 1756 2637 793 1439 -2935 -4657
10839d657k780L119J704K899J442K121l84L875l700p011k546q087P205J2009J320
$$ -4657 -7437 -4318 -2614 285 1727 3848 3464 7339 3639 -3372 -5918 -14005 -6800 5209 6529
10824F529k806k786p338r901j893j299J46N283N373R470L889m441r60J087m48
$$ 6529 3723 937 -6401 -16302 -18195 -19494 -19348 -14065 -8692 778 4667 226 -734 353 -95
10809i5K501P218k252l320j0498j105L060L34J146Q7Q941J465o542m023o33k16
$$ -95 2406 9624 7372 4052 -6446 -7551 -4491 -4157 -3011 -2924 6017 7482 940 -3083 -3716 -3932
10793c932k569k055k213j815M272n48N447O945J542K066M083O009j568p549p271
$$ -3932 -6501 -8556 -10769 -12584 -8312 -8860 -3413 3532 5074 7140 11223 17232 15664 8115 844
10778H44J816J547K498o436N021J197k508k450j73k539j195k312k344K43j733
$$ 844 2660 4207 6705 269 5290 6487 3979 1529 1356 -1183 -2378 -4690 -7034 -6791 -8524
10763h524o06J349Q95L757N517R37O868j191j270l318L662J2380L874o215q952
$$ -8524 -9130 -7781 -6886 -3129 2388 3325 10193 9002 7732 4414 8076 20456 24330 18115 9163
10748I163r140n717J322L691p40q83n055l276L333P021J618O24j916M149L293
$$ 9163 23 -5694 -4372 -681 -1421 -2304 -7359 -10635 -7302 -281 1337 1961 45 4194 7487
10733G487J13p606L614k306P86J1153m308j269j297j472L207L62l939N11n453
$$ 7487 7600 -6 3608 1302 2088 13241 8933 7664 6367 4895 8102 8464 4525 5036 -417
10718d17j752L107l792M347N638k419q00J131L003O70j441l607N382R16p567p037
$$ -417 -2169 938 -2854 1493 7131 4712 3912 5043 8046 8716 7275 3668 9050 9966 2399 -4638
10702d638k440J82Q638M354p621j583P442L348M38n433p471k922j963M140N922
$$ -4638 -7078 -6896 1742 6096 -1525 -3108 4334 7682 8120 2687 -4784 -7706 -9669 -5529 393
10687C93l36M285k897L391l07m601q060j788L167J490M078k129j240M999j805
$$ 393 57 4342 1445 4836 4529 -72 -8132 -9920 -6753 -5263 -1185 -3314 -4554 445 -1360
10672a360l403M144l410k508n17M77P082L381o93j1018l482N66L933O484M53J478
$$ -1360 -4763 -619 -4029 -6537 -7054 -6577 505 3886 3193 -7825 -11307 -10741 -6808 -324 129 1607
10656A607K849M86L307O407n992q275m351P877l547l528n272L798M975M652N209
$$ 1607 4456 4942 8249 14656 8664 389 -3962 3915 368 -3160 -8432 -4634 341 4993 10202
10641A0202k85p033l355k751k360L967M314N876k628j559J42r41l187Q8p3P58
$$ 10202 9917 2884 -471 -3222 -5582 -1615 2699 8575 5947 4388 4530 3589 402 490 417 1175
10625A175M003R99N69O674K475k332j831L706o457j0377m1M913L801j665l614
$$ 1175 5178 6177 6746 13420 15895 13563 11732 15438 8981 -1396 -1437 3476 7277 5612 1998
10610A998o207r064m732Q143O851L328p83L560j345m439N027k212q40K680N177
$$ 1998 -4209 -13273 -18005 -9862 -3011 317 -466 3094 1749 -2690 2337 125 -715 1965 7142
10595G142k44o266m559k187L553O212N958M560k834l353m305q591L150J780n10
$$ 7142 6898 632 -3927 -6114 -2561 3651 9609 14169 11335 7982 3677 -4914 -1764 16 -494
10580d94N453N038m283n952R54L421r19M258J679R54j777l803J238m036r01k48
$$ -494 4959 9997 5714 -238 716 4137 3218 7476 9155 10109 8332 4529 5767 1731 830 582
10564E82M958k905j1311N055N79l838L221N128J295O350m148k125Q29K042L552
$$ 582 5540 2635 -8676 -3621 -3042 -6880 -3659 1469 2764 9114 4966 2841 3670 5712 9264
10549I264l367j611k6K010p20p678j0244o985N436P080N158L216N883O600l8l502
$$ 9264 5897 4286 4260 6270 5550 -2128 -12372 -19357 -13921 -6841 -1683 1533 7416 14016 13978 10476
10533A0476l736j897n902k823R22M25J463K330L068O583J388q245m11O095P83
$$ 10476 6740 4843 -1059 -3882 -2960 -2535 -1072 1258 4326 10909 12297 4052 3641 9736 10519
10518A0519n528j257l690j102L394O000Q090r517l643j024M880K036J785k359
$$ 10519 4991 3734 44 -1058 2336 8336 16426 6909 3266 2242 7122 9158 10943 8584
10504H584l304p986p319K81N647J215K452J331j116k031J593M17l477O473L517
$$ 8584 5280 -2706 -10025 -9744 -4097 -2882 -430 901 -215 -2246 -653 -236 -3713 2760 6277
10489F277n954q594M555M658l906k096R665K092L538j72j150m930o688P271Q187
$$ 6277 323 -8271 -3716 942 -2964 -5060 4605 6697 10235 10063 8913 3983 -2705 4566 12753
10474A2753J886p975n439J219n12M464r57J188K273l951m183j241L528L890M368
$$ 12753 14639 6664 1225 2444 1932 6396 5439 6627 8900 4949 766 -475 3053 6943 11311
10459A1311l520l180k49j726o757j165N524N180J645n380j811j626K509L818j072
$$ 11311 7791 4611 4362 2636 -4121 -5286 238 5418 7063 1683 -128 -1754 755 4573 3501
10444C501m632P38L494O804o062n250Q575J798p42m193l151n870l480L787P109
$$ 3501 -1131 -393 3101 9905 3843 -1407 7168 8966 8224 4031 880 -4990 -8470 -4683 2426
10429B426L264n735r72P11P460N589M8j609N218k483n352r971m119l268R140j033
$$ 2426 5690 -45 -1017 -306 7154 12743 12791 11182 16400 13917 8565 -1406 -5525 -8793 347 -686
10413f86o786K800J438J500K258J999Q30m378K837M149K942P27l85J763P32k271
$$ -686 -7472 -4672 -3234 -1734 524 2523 3353 -1025 1812 5961 8903 9630 9245 11008 11740 9469
10397I469q86k481q53L637j829J48k841M1K151M49l808L47L841l576m389l74N407
$$ 9469 8583 6102 5249 8886 7057 7205 4364 4405 6556 7005 3197 3544 7385 3809 -580 -954 4453
10380D453k141J112R976O181p132p787J794M927p069l367Q64j236L00M832R71
$$ 4453 2312 3424 13400 19581 12449 4662 6456 11383 4314 947 1811 575 875 5707 6678
10365F678m165l107P158J0840L052l775p652k69P610R61m561j998p74n011r930
$$ 6678 2513 -594 6564 17404 20456 16681 9029 8760 16370 17331 12770 10772 9998 4987 -4943
10350d943k968M596l252J337M810M487J678j168M630J48l427n957N121M516j166
$$ -4943 -7911 -3315 -6567 -5230 -420 4067 5745 4577 9207 9355 5928 -29 5092 9608 8442
10335H442l786K32K427J637J795j838k225l916K776m522j190M758j02n208M45
$$ 8442 4656 4888 7315 8952 10747 8909 6684 2768 5544 1022 -168 4590 4488 -720 -275
10320b75O344q73n020K85M007K3J651J086m413M688n68o194p6O915O985N334l580
$$ -275 6069 5196 176 461 4468 4491 6142 7228 2815 7503 6935 741 665 7580 14565 19899 16319
10303A6319n054m863k75O274P96k487n849k481K648L204q179k837q08k211L456
$$ 16319 11265 6402 6127 12401 13197 10710 4861 2380 5028 8232 53 -2784 -3592 -5803 -2347
10288b347L584M617k191m713J775O921J317j694l556k494P118j156J628k377n173
$$ -2347 1237 5854 3663 -1050 725 7646 8963 7269 3713 1219 8337 7181 8809 6432 1259
10273A259J2982R041K342j3558n267j900n209J379O033j762j257l346Q33N68l204
$$ 1259 14241 23282 25624 12066 6799 4899 -310 1069 7102 5340 4083 737 1570 2138 -1066
10258a066L876P715o539L531J04L9j652M356M204o420L710K520m606m418M338
$$ -1066 2810 10525 3986 7517 7621 7660 6008 10364 14568 8148 11858 14378 9772 5354 9692
10243I692m573L73L210K143L379J754K132k409n728j342L763N406l137k171k3
$$ 9692 5119 5492 8702 10845 14224 15978 18110 15701 9973 8631 12394 17800 14663 12492 12469
10228A2469n068j230K501Q28k961K434j490k825K427J0033k56m036N01O610p73
$$ 12469 7401 6171 8672 9500 6539 8973 7483 4658 7085 17118 16862 12826 13327 19937 19164
10213A9164j617j304l0L816k110K755J202O57M527p920q677m046R445Q809l185
$$ 19164 17547 16243 16213 20029 17919 20674 21876 22533 27060 19140 10463 6417 15862 24671 21486
10198B1486J179j979q04P601K323K30n28l798K920M778K949q07p238k121K056
$$ 21486 22665 20686 19882 27483 29806 30036 29508 25710 28630 33408 36357 35550 28312 26191 28247
10183B8247K524j081m92k187l07M359L254k049J386L948r89R94L669Q503L853
$$ 28247 30771 29690 29198 27011 26704 31063 34317 32268 33654 37602 36613 37607 41276 49779 53632
10168E3632j350o617q02K956j584N033R928M630l451J488J172N231L779M028J1298
$$ 53632 52282 45665 44863 47819 46235 51268 61196 65826 62375 63863 65035 70266 74045 78073 89371
10153H9371K548L640P843N802P326O960J0286J3502J5890J5071K1086J3518J7753
$$ 89371 91919 95559 103402 109204 116530 123490 133776 147278 163168 178239 199325 212843 230596
10140B30596K1203K5620L8550M2074L7546M6061N2571O3554O8105Q0697R6960
$$ 230596 251799 277419 315969 358043 395589 441650 494221 557775 625880 706577 803537
10129H03537J23689J38183J58449J86131K15094K33890K33377J96749J20824O954
$$ 803537 927226 1065409 1223858 1409989 1625083 1858973 2092350 2289099 2409923 2416877
10119B416877r7267j81160k33737k42078k33294k09727j80712j46097j18691j08208
$$ 2416877 2319610 2138450 1904713 1662635 1429341 1219614 1038902 892805 774114 665906
10109F65906q9210o7698n5682m9912m7476l6905k6660k1916k6668l4038j5535
$$ 665906 576696 508998 453316 403404 355928 319023 292363 270447 243779 209741 194206
10098A94206j1703j3755p640k2515j0102K584q145j0078n593j1024j1357l882
$$ 194206 182503 168748 161108 138593 128491 131075 122930 112852 107259 96235 84878 80996
10086H0996k132M723J203n840m520r151k97N44J527k081j722k752q551l008m596
$$ 80996 78864 83587 84790 78950 74430 65279 64982 65526 67053 64972 63250 60498 51947 48939 44343
10071D4343k664l61j75n290l852m850N536O927m108l244k57j752m739K902o62
$$ 44343 41679 41318 41143 35853 32001 27151 32687 39614 35506 32262 32005 30253 25514 28416 27754
10056B7754l919m075L162L997o067q7n931l293j517M279J680M050J447l114n121
$$ 27754 23835 19760 22922 26919 20852 20765 14834 11541 10024 14303 15983 20033 21480 18366 13245
10041A3245L014N258j24n677k469K34J763o05o85p504O819M699j168N51k95m975
$$ 13245 16259 21517 21393 15716 13247 13481 15244 14639 13954 6450 13269 17968 16800 17351 17056 12081
10025A2081k021Q632J64j635J086m775p32J055j735k306K97P86m507L314Q855
$$ 12081 10060 18692 18856 17221 18307 13532 12800 13855 12120 9814 10111 10897 6390 9704 18559
10010A8559n494j759J681l14k449K104L141K299M754q984o380K972J513J07l964
$$ 18559 13065 11306 12987 12673 10224 12328 15469 17768 22522 13538 7158 10130 11643 11750 7786
9995G786K274K8l777o29L87k913j159Q750J844Q43K694n210o596J685L897M806
$$ 7786 10060 10088 6311 5682 6069 3156 1997 10747 12591 13434 16128 10918 4322 6007 9904 14710
9979A4710l879K135l605j1004j698J257J201l46P713J516j948m54q67l43l934
$$ 14710 10831 12966 9361 -1643 -3341 -2084 -883 -1229 6484 8000 6052 5598 4731 4388 454
9964D54m087Q37M983N452j489m499j378O057N520L876K052l354o284L640K874
$$ 454 -3633 -2796 2187 7639 6150 1651 273 6330 11850 15726 17778 14424 8140 11780 14654
9949A4654j125n317k031q827k851P989N200q77l35L044K287j951L976M531J085
$$ 14654 13529 8212 6181 -2646 -5497 2492 7692 6815 6480 9524 11811 9860 13836 18367 19452
9934A9452l172r70m784J42M050k404j2948K482K138P52k829j266p95l183Q461
$$ 19452 16280 15310 10526 10668 14718 12314 -634 1848 3986 4738 1909 643 -152 -3335 5126
9919E126N923L711K742j983o304q495O902N686K569N829p35r359m053P3k06o450
$$ 5126 11049 14760 17502 15519 9215 720 7622 13308 15877 21706 20971 11612 7559 7632 7426 976
9903I76r19K852J040P153P017J280k154q919n333p55o524m618l449k99p57J171
$$ 976 57 2909 3949 11102 18119 19399 17245 8326 2993 2238 -4286 -8904 -12353 -12652 -13409 -12238
9887a2238L576J888M260N660R72j542l709j855m064K687N753l296o885q95N734
$$ -12238 -8662 -6774 -2514 3146 4118 2576 -1133 -2988 -7052 -4365 1388 -1908 -8793 -9688 -3954
9872c954M425J790L764J481n44l856j0194m971Q814J813n68J648l319k50J12l732
$$ -3954 471 2261 6025 7506 6962 3106 -7088 -12059 -3245 -1432 -2000 -352 -3671 -3921 -3809 -7541
9856g541Q96J735L493K829j563L460L994q30m768J949J378k661o62P222m21l076
$$ -7541 -6645 -4910 -1417 1412 -151 3309 7303 6473 1705 3654 5032 2371 1709 8931 8510 5434
9840E434N72L530J194K737j187r641n790J999N269J463k420N970J656k415p10
$$ 5434 6006 9536 10730 13467 12280 2639 -3151 -1152 4117 5580 3160 9130 10786 8371 7661
9825G661l198j714J044K194O310J520n650p93q63J460J893k373r679k590N211
$$ 7661 4463 2749 3793 5987 12297 13817 8167 7374 6511 7971 9864 7491 -2188 -4778 433
9810D33N030k67j697Q23N152j74m20M781q57m28K460l496q043j11l16M019m342
$$ 433 5463 5196 3499 4322 9474 9300 8880 13661 12804 12376 14836 11340 3297 3186 2870 6889 2547
9793B547j602j367n148L072K463k760K393K606k113J342p698r61O532j749N74
$$ 2547 945 -422 -5570 -2498 -35 -2795 -402 2204 91 1433 -6265 -7226 -694 -2443 -1869
9778a869N447N043M97K214j082k997m215K908N929J563m423o436q62J801N208
$$ -1869 3578 8621 9118 11332 10250 7253 3038 5946 11875 13438 9015 2579 1717 3518 8726
9763H726Q884Q128J882j0290m247m995J857k959p348l845L79m28K016L513N793
$$ 8726 17610 25738 27620 17330 13083 8088 9945 6986 -362 -4207 -3828 -4256 -2240 1273 7066
9748G066K536N442k262l860p83k956q106p670L387N83R238q05P18J875r40J054
$$ 7066 9602 15044 12782 8922 8139 5183 -2923 -10593 -7206 -6623 2615 1810 2528 4403 3463 4517
9732D517k061J088M59P230N066l603j300o76n031o414q197R77L359N810M05J553
$$ 4517 2456 3544 4003 11233 16299 12696 11396 10720 5689 -725 -8922 -7945 -4586 1224 1629 3182
9716C182O551J344k112o597P1P843N077k571p418k416l769O131R12m612L66N114
$$ 3182 9733 11077 8965 2368 2439 10282 15359 12788 5370 2954 -815 5316 6228 1616 1982 7096
9700G096l52l19l808J651l174j132j088L117o11j691l834M05L538K391l13K198
$$ 7096 6744 6425 2617 4268 1094 -38 -1126 1991 1380 -311 -4145 -3740 -202 2189 1876 4074
9684D074m690J930O007k68M178J173l458l801m07J146K428k672q51k42M885J157
$$ 4074 -616 1314 7321 7053 11231 12404 8946 5145 4738 5884 8312 5640 4789 4547 9432 10589
9668A0589o190L004Q307j179k297q161l335r72J304j722n423J536K528j878P287
$$ 10589 4399 7403 15710 14531 12234 4073 738 -234 1070 -652 -6075 -4539 -2011 -3889 3398
9653C398M091l098L264J872N569l599o687k615m766j444K729N68J372M826J884
$$ 3398 7489 4391 7655 9527 15096 11497 4810 2195 -2571 -4015 -1286 -718 654 5480 7364
9638G364L400l065k504j60m632l170O818R292Q29j004m018l108p25P28J507n892
$$ 7364 10764 7699 5195 5035 403 -2767 4051 13343 14172 13168 9150 6042 5317 6045 7552 1660
9622A660Q34j064k516N060q345k25J1262J085K848j248l50q049K04K309P40J171
$$ 1660 2494 1430 -1086 3974 -4371 -4596 6666 7751 10599 9351 9001 952 1156 3465 4205 5376
9606E376M827R53n678r57L834K857o717n339k088m891L203L090P789M100p603
$$ 5376 10203 11156 5478 4521 8355 11212 4495 -844 -2932 -7823 -4620 -1530 6259 10359 2756
9591B756n51L900m275N18J185J78O81m194L295O510M56r18j640M595L351j926
$$ 2756 2205 6105 1830 2348 3533 3711 4392 198 3493 10003 10459 9541 7901 12496 15847 13921
9575A3921o744k620N83P040O89J019L78l816q454p574k838M91p13O302L087P42
$$ 13921 7177 4557 5140 12180 12869 13888 14266 10450 1996 -5578 -8416 -7925 -8638 -2336 751 1493
9559A493n62j696N093M317l520m256K794l747l364M580L400J45j932m78R14M074
$$ 1493 931 -765 4328 8645 5125 869 3663 -84 -3448 1132 4532 4677 2745 2267 3181 7255
9543G255M005j596n014N079k763r830J630L951M419l792j298l674K346J456j380
$$ 7255 11260 9664 4650 9729 6966 -2864 -1234 2717 7136 3344 2046 -1628 718 2174 794
9528G94K918r18k102j579J493O225M011K132N23o162k632k77n57p28L62k096l621
$$ 794 3712 2794 692 -887 606 6831 10842 12974 13497 7335 4703 4426 3869 3141 3503 1407 -2214
9511b214L21k141K275N06M299K210j999J947O476k179p254o121j280J699J396
$$ -2214 -1893 -4034 -1759 -1253 3046 5256 3257 5204 11680 9501 2247 -3874 -5154 -3455 -2059
9496b059j589K237J875k567L412M777K036o105r124qQ895k340J106K080O2k79
$$ -2059 -3648 -1411 464 -2103 1309 6086 8122 2017 -7107 -7115 1780 -560 546 2626 2688 2409
9480B409L661M626m38K571l520n977m9P86q06j241p56k683n042L49R452L520J45
$$ 2409 6070 10696 10258 12829 9309 3332 3283 4069 3263 2022 1266 -1417 -6459 -6110 3342 6862 7007
9463G007k532l101K742L685N214k154l408K841pn123M46M6OM149M524q810j973
$$ 7007 4475 1374 4116 7801 13015 10861 7453 10294 10287 5164 5610 5656 5662 9811 14335 5525 3552
9446C552J026j288n906M99O984o098j903m281j765N635J2197K560K759j128o175
$$ 3552 4578 3290 -2616 -2117 4867 -1231 -3134 -7415 -9180 -3545 8652 11212 13971 12843 6668
9431F668m487P03j891j401K1K598O739P06R3p33n892L559J014R95N52p719m120
$$ 6668 2181 2884 993 -408 -387 2211 8950 9656 9749 9016 3124 6683 7697 8692 9244 1525 -2595
9414b595N168K538k713k469m764l299O14P212L234L214j71k404K65J83J386k529
$$ -2595 2573 5111 2398 -71 -4835 -8134 -7520 -308 2926 6140 5969 3565 3830 4013 5399 2870
9398B870r577K862N272j409J509k652O48p94j402M530R684j090q153n07O344o35
$$ 2870 -6707 -3845 1427 18 1527 -1125 -477 -1271 -2673 1857 11541 10451 2298 1791 8135 7500
9382G500m371l090r43l910m939M524O247l934k488P468M894j831l902Q006M40
$$ 7500 3129 39 -904 -4814 -9753 -5229 1018 -2916 -5404 2064 6958 5127 1225 9231 9671
9367I671M456L158k680k064n131j699J377n54Q68k533m340O97N739L901m083l42
$$ 9671 14127 17285 14605 12541 7410 5711 7088 6534 7402 4869 529 1226 6965 10866 6783 6441
9351F441J147K03l600M753J1699m55p16l927n654l063J731J0871L898l813m118
$$ 6441 7588 7791 4191 8944 20643 20188 19472 15545 9891 6828 8559 19430 23328 19515 15397
9336A5397k55J118m225o156Q07k078K521k441l391J493J78K608j218Q18l934j234
$$ 15397 15142 16260 12035 5879 6686 4608 7129 4688 1297 2790 2968 5576 4358 5176 1242 8
9320HK447k50k809M370J499o043P658M658L024K906k799o218l387K063k860K111
$$ 8 2455 2205 -604 3766 5265 -778 6880 11538 14562 17468 14669 8451 5064 7127 4267 6378
9304F378o700r339K905M038N186J0512N123p761l096P500L770o002q927o8J52
$$ 6378 -322 -9661 -6756 -2718 2468 12980 18103 10342 7246 14746 18516 12514 3587 3519 3671
9289C671L097J046o148p953L176R722N399n375j3708l608P063O919J985l612o594
$$ 3671 6768 7814 1666 -6287 -3111 6611 12010 6635 -7073 -10681 -3618 3301 5286 1674 -4920
9274d920L538N298M943k574n037L266J283m78k012q808J861J1435M323m118K652
$$ -4920 -1382 3916 8859 6285 1248 4514 5797 5319 3307 -5501 -3640 7795 12118 8000 10652
9259A0652M045m205k442L191o187L897J223O59m62m884q5M911K740j070M965L215
$$ 10652 14697 10492 8050 11241 5054 8951 10174 10833 10371 5487 5402 10313 13053 11983 16948 20163
9243B0163l693o037j408m81q59R65l714k952k120M82o38m622p11K073O3m580N285
$$ 20163 16470 10433 9025 8544 7685 8650 4936 1984 -136 346 -292 -4914 -5625 -3552 -3489 -8069 -2784
9226b784K828m371L301L393J783l911m394m042J1146M853K362J358j383j542j071
$$ -2784 44 -4327 -1026 2367 4150 239 -4155 -8197 2949 7802 10164 11522 10139 8597 7526
9211G526r48N610k46m423j1290k627J1627O707L083M52q083r61L479M970k97p525
$$ 7526 6578 12188 11942 7519 -3771 -6398 5229 11936 15019 15471 7388 6427 9906 14876 14579 7054
9195G054J727J2249J955q654j973M619l255l267j643l026M277m111p378j642O587
$$ 7054 8781 21030 22985 14331 12358 16977 13722 10455 8812 5786 10063 5952 -1426 -3068 3519
9180C519L057q049m358K710M253J1519P648K20o134k015k583m927l246j122L871
$$ 3519 6576 -1473 -5831 -3121 1132 12651 20299 20519 14385 12370 9787 4860 1614 492 4363
9165D363P19j902m266M86J987P145o956L484K589r032j350J1189J265K435N197
$$ 4363 5082 3180 -1086 -600 1387 8532 1576 5060 7649 -1383 -2733 8456 9721 12156 17353
9150A7353L936L114l740q079K55j0j806m508k537M444p05J905k08k136M63j225
$$ 17353 21289 24403 20663 12584 12839 12829 11023 6515 3978 8422 7717 9622 9414 7278 7741 6516
9134F516J000N220N685J780l726p01k998M431M691l144m528K058l621k065L123
$$ 6516 7516 12736 18421 20201 16475 15774 12776 17207 21898 18754 14226 16284 12663 10598 13721
9119A3721K268L268l947k648l618M204J2080l373j318P80q49o668m068K514O51
$$ 13721 15989 19257 15310 12662 9044 13248 25328 21955 20637 21417 20568 13900 9832 12346 12997
9104A2997j227K148O01m642l454m20J489O237K65m064L048O70k89K397p77M16
$$ 12997 11770 13918 14519 9877 6423 6003 7492 13729 13994 9930 12978 13648 13359 15756 14979 15395
9088A5395m84k732r97r89r35M218P853k07l998O37l835J350K544k20M909L770
$$ 15395 14911 12179 11182 10193 9258 13476 21329 21122 17124 17761 13926 15276 17820 17600 22509 26279
9072B6279M054n277N12J640L78K542o309L193k359l080k395M272l43N86n246l589
$$ 26279 30333 25056 25568 27208 27586 30128 23819 27012 24653 21573 19178 23450 23107 23693 18447 14858
9056A4858k636n318m385j439J2040N714K901N255j559l468M46n633l180l125N24
$$ 14858 12222 6904 2519 1080 13120 18834 21735 26990 25431 21963 22409 16776 13596 10471 10995
9041A0995Q878j483k528P110L008n052k568k254k361M763j540J977o18O3l816
$$ 10995 19873 18390 15862 22972 25980 20928 18360 16106 13745 18508 16968 18945 18327 18390 14574
9026A4574j68K838N068K624M507o7j108j654q694J855L701P396K885k537m970
$$ 14574 14406 17244 22312 24936 29443 29376 28268 26614 17920 19775 23476 30872 33757 31220 26250
9011B6250p475n134q79N0m094J984M817K319P24j458R205k899o731N897j525j052
$$ 26250 18775 13641 12762 12812 8718 10702 15519 17838 18562 17104 26309 23410 16679 22576 21051 19999
8995A9999j470L879O14p275j136m130k643J884R269K460m223l075P154R046L29
$$ 19999 18529 22408 23022 15747 14611 10481 7838 9722 18991 21451 17228 14153 21307 30353 30682
8980C0682o268j148o815K346o16r49k872m329l609M585N551j630l617J484N111
$$ 30682 24414 23266 16451 18797 18181 17232 14360 10031 6422 11007 16558 14928 11311 12795 17906
8965A7906k88k782M783p30o635N715J563m789j712J443m977n523K560J871L409
$$ 17906 17618 14836 19619 18889 12254 17969 19532 14743 13031 14474 9497 3974 6534 8405 11814
8950A1814N799M960j639r01n506P56M103k142L081K997N042K337K446j359p45
$$ 11814 17613 22573 20934 20033 14527 15283 19386 17244 20325 23322 28364 30701 33147 31788 31043
8935C1043J1116J7377J9662K4161K7910K5850j446k4211l2187k7959j3940q426
$$ 31043 42159 59536 79198 103359 131269 157119 155673 131462 99275 71316 57376 48950
8923D8950l835n687m978K581K093o962j0176k811l307K125J38j165P400J995n50
$$ 48950 45115 39428 34450 37031 39124 32162 21986 19175 15868 17993 18131 16966 24366 26361 25811
8908B5811j71m24J50M33m752q033M506N149R791l22O815M762l126n463N466K862
$$ 25811 25640 25216 25366 25799 21047 13014 17520 22669 32460 32138 38953 43715 40589 35126 40592 43454
8892D3454n801Q385J3299N646J1391J3513L6215O3840P4876M0472j6732n9098
$$ 43454 37653 46038 59337 64983 76374 89887 126102 189942 264818 305290 288558 229460
8880B29460o1559m2858l1503k4314j8207k376k759k476n156j1161k796O077j044
$$ 229460 167901 125043 93540 69226 51019 48643 45884 43408 38252 27091 24295 30372 29328
8867B9328q390l216l651j830N381L788q24k235j407n1J554n20J844o147k031N187
$$ 29328 20938 17722 14071 12241 17622 21410 20586 18351 16944 16893 18447 17927 19771 13624 11593 16780
8851A6780l887L939j313l294Q593P607N374k58M334M741K700Q661K2193K2865
$$ 16780 12893 16832 15519 12225 20818 28425 33799 33541 37875 42616 45316 53977 76170 99035
8837I9035L1827J2619j1393l0389l3096k4348j5048o762k261M613P73m202l717
$$ 99035 130862 143481 132088 101699 68603 44255 29207 22445 20184 24797 25570 21368 17651
8824A7651l847m871m536j526M393R44j215P74j851L188P70K380M39j052k411K054
$$ 17651 13804 8933 4397 2871 7264 8208 6993 7767 5916 9104 9874 12254 12693 11641 9230 11284
8808A1284n090j264k418l938M123M624J859k514k946o50o705L00j852k825J589
$$ 11284 6194 4930 2512 -1426 2697 7321 9180 6666 3720 3070 -3635 -3335 -5187 -8012 -6423
8793f423L527N460L423k625L522L14M70m311R522P493n995j1257o2K215j911N338
$$ -6423 -2896 2564 5987 3362 6884 7198 7668 3357 12879 20372 14377 3120 3058 5273 3362 8700
8777H700N343j742l567n815N660L071n549r52J103q792m129Q30L91L274K03k92
$$ 8700 14043 12301 8734 2919 8579 11650 6101 5149 6252 -2540 -6669 -5839 -5448 -2174 -1971 -2263
8761b263j834K897j895L44Q093K872k228p8j054L59j947l213l568P88J2596j8
$$ -2263 -4097 -1200 -3095 -2751 5342 8214 5986 5908 4854 5213 3266 53 -3515 -2727 9869 9851
8745I851j524k222j778O041L798j495l284j303r4k153k351m274o263N080N547
$$ 9851 8327 6105 4327 10368 14166 12671 9387 8084 7990 5837 3486 -788 -7051 -1971 3576
8730C576M547p164n191K969J937K241O639m751k539L187l250q319l699L799M583
$$ 3576 8123 959 -4232 -1263 674 2915 9554 4803 2264 5451 2201 -6118 -9817 -6018 -1435
8715a435K709J035J024P67O73p3K569o68M5K310Q955l880p141j429M494N225J137
$$ -1435 1274 2309 3333 4100 4773 4700 7269 6601 6646 8956 17911 14031 6890 5461 9955 15180 16317
8698A6317k147r62J971J348o258l007m175m806M733k022k143j075J071P007j43
$$ 16317 14170 13208 15179 16527 10269 7262 3087 -1719 3014 992 -1151 -2226 -1155 5852 5709
8683E709l329J306K993L342l67L945J823j986o733j590p115q372P497R725j666
$$ 5709 2380 3686 6679 10021 9654 13599 15422 13436 6703 5113 -2002 -10374 -2877 6848 5182
8668E182l384m360J847o83p6k651N393Q959n628p704k416J576K789N656j575q315
$$ 5182 1798 -2562 -715 -1398 -1474 -4125 1268 10227 4599 -3105 -5521 -3945 -1156 4500 2925 -5390
8652e390K077O442J273p179j025P80N258o53K545K249m065m243j555m37J963N47
$$ -5390 -3313 3129 4402 -2777 -3802 -3022 2236 1583 4128 6377 2312 -1931 -3486 -3923 -1960 -1413
8636a413q86L178m198k806P883N177l669k276R499L769n790l591O405k06l867
$$ -1413 -2299 879 -3319 -6125 1758 6935 3266 990 10489 14258 8468 4877 11282 11076 7209
8621G209o468N820k137N36Q93l785j591l51P28q93m20K069j119l131p208J328
$$ 7209 741 6561 4424 4960 5853 2068 477 126 854 -39 -459 1610 491 -2640 -9848 -8520
8605h520J514M074P106O044j839J449L664k980m932N243j217Q65k335J400K717
$$ -8520 -7006 -2932 4174 10218 8379 9828 13492 10512 5580 10823 9606 10471 8136 9536 12253
8590A2253K113J062l836l26J771m305j024L557m87q383p038M793N422l17L494
$$ 12253 14366 15428 11592 11266 13037 8732 7708 11265 10778 2395 -4643 150 5572 5255 8749
8575H749N645K672p045o972M637j196m52L026l608l706l991R86L378J783j681
$$ 8749 14394 17066 10021 3049 7686 6490 6038 9064 5456 1750 -2241 -1255 2123 3906 2225
8560B225J425p34q51O844M248l002k070j029K587L05o024J0941M982m412j0835
$$ 2225 3650 2916 2065 8909 13157 10155 8085 7056 9643 9948 3924 14865 19847 15435 4600
8545D600M007K30n794j286J950J50M273m913l942l590k199j379M656R657m24k432
$$ 4600 8607 8837 3043 1757 3707 3857 8130 3217 -725 -4315 -6514 -7893 -3237 6420 5996 3564
8529C564p02O765R380m322n406n33L694J259K452Q677N765L105q4l925r07P77
$$ 3564 2862 9627 19007 14685 9279 8746 12440 13699 16151 24828 30593 33698 33614 29689 28782 29559
8513B9559L18l607J705J3533J0048n454r685o73l815p589o660J792o60r308k7
$$ 29559 29877 26270 27975 41508 51556 46102 36417 35744 31929 24340 17680 19472 18812 9504 9477
8498I477K400j802J494j437O841L588k138m784k233J004J095q792m144J779j1
$$ 9477 11877 10075 11569 10132 16973 20561 18423 13639 11406 12410 13505 4713 569 2348 2337
8483B337N233n546q198j688Q093j071m618K732N23L512K46J554k69K168n181n3
$$ 2337 7570 2024 -6174 -7862 231 -840 -5458 -2726 -2203 1309 1555 3109 2840 5008 -173 -226
8467b26N24n54N015J311j16j501P627J678n645m728m839J594j775n290k910N074
$$ -226 298 -256 4759 6070 5954 4453 12080 13758 8113 3385 -1454 140 -1635 -6925 -9835 -4761
8451d761j116O357M251M646L146k171k440J247M880j424L11n776m694j359l90
$$ -4761 -5877 480 4731 9377 12523 10352 7912 9159 14039 12615 12926 7150 2456 1097 707
8436G07l350m99k408l583L974J801J180O897P836J944M999j082j2890l159K063
$$ 707 -2643 -3142 -5550 -9133 -5159 -3358 -2178 4719 12555 14499 19498 18416 5526 2367 4430
8421D430N546J158l603M802o419J775K56j671m80l157m437k798n288j688J0423
$$ 4430 9976 11134 7531 12333 5914 7689 7945 6274 5794 2637 -1800 -4598 -9886 -11574 -1151
8406a151M213K34n049k474l239j255K940M805j50m755l033l942J16J652J222Q118
$$ -1151 3062 3296 -1753 -4227 -7466 -8721 -5781 -976 -1126 -5881 -8914 -12856 -12740 -11088 -9866 -1748
8390a748M188L404k824Q03m66n905p246M031M595J523l465J0912P111j255o697
$$ -1748 2440 5844 3020 3823 3357 -2548 -9794 -5763 -1168 355 -3110 7802 14913 13658 6961
8375F961n021m102k84j347K870k974k148N086l4k036J493N827K263k306r593R30
$$ 6961 1940 -2162 -2446 -3793 -923 -3897 -6045 -959 -993 -3029 -1536 4291 6554 4248 -5345 -4415
8359d415J0136O059L468k869l844m707K010P755J710K192k855j247J545K861q911
$$ -4415 5721 11780 15248 12379 8535 3828 5838 13593 15303 17495 14640 13393 14938 17799 8888
8344H888o360n021j605P834Q487j589q404r265J635N837P492L559k953j637J031
$$ 8888 2528 -2493 -4098 3736 12223 10634 2230 -7035 -5400 437 7929 11488 8535 6898 7929
8329G929R90j984m070r722m758J978R198j084m021r89K509l14Q341O72l462N14
$$ 7929 8919 6935 2865 -6857 -11615 -9637 -439 -1523 -5544 -6533 -4024 -4338 4003 4675 1213 1727
8313A727K92k973P154J1937k863q862m13l025j154J419k243K343L802K247q75
$$ 1727 2019 -954 6200 18137 15274 6412 5999 2974 1820 3239 996 3339 7141 9388 8513
8298H513N415O606r378n660Q02R60K21o054o474j050m928J916O209p97N822m381
$$ 8513 13928 20534 11156 5496 6298 7258 7479 1425 -5049 -6099 -11027 -9111 -2902 -3699 2123 -2258
8282b258m722M390j955J993J176J144M697L817q71n427M587P200j72l58M734n846
$$ -2258 -6980 -2590 -4545 -2552 -1376 -232 4465 8282 7411 1984 6571 13771 13599 13241 17975 12129
8266A2129o209r84R30m960j773O875r81O63j70q114K212Q201j364l757o04K592
$$ 12129 5920 4936 5866 906 -867 6008 5027 5690 5520 -2594 -382 7819 6455 2698 2094 4686
8250D686j932p59N70M27k619n374k804l887Q220N235O32L09k74N698n275o357
$$ 4686 2754 1995 2565 2992 373 -5001 -7805 -11692 -3472 1763 2395 2704 2430 8128 2853 -3504
8234c504J208p612p338M15K444M158L067K479r14O377q31j891q18k83L467O361
$$ -3504 -2296 -9908 -17246 -16831 -14387 -10229 -7162 -4683 -5597 780 -51 -1942 -2760 -3043 424 6785
8218F785k079o553Q28J803k815q98N749N506N12q40k010p012q958l732Q78N92
$$ 6785 4706 -1847 -1019 784 -2031 -2929 2820 8326 8838 7998 5988 -1024 -9982 -13714 -12836 -12244
8202a2244M307L790K504M186l537p0j607k782O291k694K394L646L363n74J084
$$ -12244 -7937 -4147 -1643 2543 -994 -1064 -2671 -5453 838 -1856 538 4184 7547 6973 8057
8187H057o821j724r00l630j24M786J360J428K564K42l587o141J638j129P233L853
$$ 8057 1236 -488 -1388 -5018 -5142 -356 1004 2432 4996 5238 1651 -4490 -2852 -3981 3252 7105
8171G105m315m824L746n926k054J931L882J282j359p702L264k540L263j284j083
$$ 7105 2790 -2034 1712 -4214 -6268 -4337 -455 827 -532 -8234 -4970 -7510 -4247 -5531 -6614
8156f614r249K117O205q2j635L196N882M273N238J013j522J347p8j894j330k111
$$ -6614 -15863 -13746 -7541 -7623 -9258 -6062 -180 4093 9331 10344 8822 10169 10091 8197 6867 4756
8140D756R56r73l900M749O788l215J829Q54L274L754p916j1904r97j472K138O409
$$ 4756 5712 4739 839 5588 12376 9161 10990 11844 15118 18872 10956 -948 -1945 -3417 -1279 5130
8124E130K519q178n804N184J541L846J104J939J1013j385n734m467n248m244r95
$$ 5130 7649 -529 -6333 -1149 392 4238 5342 7281 18294 16909 11175 6708 1460 -2784 -3779
8109c779k080L277n69k711k219L687M80l399O797j975J089M091K131J454K940
$$ -3779 -5859 -2582 -3151 -5862 -8081 -4394 -3914 -7313 -516 -2491 -1402 2689 4820 6274 9214
8094I214N184o084j608j031m054m994n047k770N476O015k886J354P032P413k726
$$ 9214 14398 8314 6706 5675 1621 -3373 -8420 -11190 -5714 301 -2585 -1231 5801 13214 10488
8079A0488l483k648l438J93l987k124j177L23J840k332M394l75K088M523n215
$$ 10488 7005 4357 919 1112 -2875 -4999 -6176 -5853 -4013 -6345 -1951 -2326 -238 4285 -930
8064i30o173q497J419M573J803J334L263N477o140n284k348N279L185j464k155
$$ -930 -7103 -15600 -14181 -9608 -7805 -6471 -3208 2269 -3871 -9155 -11503 -6224 -3039 -4503 -6658
8049f658q71l557k321k96J312M092r24j593N022R654J693p030P71J802k081L007
$$ -6658 -7529 -11086 -13407 -13703 -12391 -8299 -9223 -10816 -5794 3860 5553 -1477 -706 1096 -985 2022
8033B022m105K594j896N98L31J978q72l754j165L864R40M308M4L641m05n367o525
$$ 2022 -2083 511 -1385 -787 -456 1522 650 -3104 -4269 -405 535 4843 4887 8528 8123 2756 -3769
8016c769j39K122k35m279P35J956p196j975N096M522k172o0j742q09J704O36M377
$$ -3769 -3908 -1786 -2021 -6300 -5565 -3609 -10805 -12780 -7684 -3162 -5334 -5394 -7136 -7945 -6241 -5605 -1228
7999a228K017j906m82N416L437n737j026M944j335J23m273m5N73N199Q84N865
$$ -1228 789 -1117 -1599 3817 7254 1517 491 5435 4100 4223 -50 -95 478 5677 6561 12426
7983A2426o02q426p049N35J273M290M793M554m69l229l578k106K746j557J04n31
$$ 12426 11824 3398 -3651 -3116 -1843 2447 7240 11794 11325 8096 4518 2412 5158 3601 3705 3174
7967C174l237n46K123M181L562J259l952n164k695N128L461j814j741j946p49
$$ 3174 -63 -609 1514 5695 9257 10516 6564 1400 -1295 3833 7294 5480 3739 1793 1044
7952A044r295J891N060p144k245K099L757O29k853M085R107k671j0985o4O224
$$ 1044 -8251 -6360 -1300 -8444 -10689 -8590 -4833 -4204 -7057 -2972 6135 3464 -7521 -7585 -1361
7937a361K363j375M987J977K48n786j448M015N034l505j0664j071J2176l643n989
$$ -1361 1002 -373 4614 6591 6839 1053 -395 3620 8654 5149 -5515 -6586 5590 1947 -4042
7922d042l779K359K43o240k083M164L101N408J997j652J673j53p56K327P3j329
$$ -4042 -7821 -5462 -5219 -11459 -13542 -9378 -6277 -869 1128 -524 1149 996 240 2567 2640 1311
7906A311l349P521R406j381o895K773L075j849j923n436o876k306N13P01j036
$$ 1311 -2038 5483 14889 13508 6613 9386 12461 10612 8689 3253 -3623 -5929 -5416 -4715 -5751
7891e751K121L805L862M476q83k035M47q17k60j630l016J288L184q329p423L690
$$ -5751 -3630 175 4037 8513 7630 5595 6042 5225 4965 3335 319 1607 4791 -3538 -10961 -7271
7875g271J315l199J722L845n145N33M026L899J704L509K233k183n695m772J562
$$ -7271 -5956 -9155 -7433 -3588 -8733 -8200 -4174 -275 1429 4938 7171 4988 -707 -5479 -3917
7860c917O318j469r195j357P282J503R12j680J950J515O421K83p05k994r115L613
$$ -3917 2401 932 -8263 -9620 -2338 -835 77 -1603 347 1862 8283 8566 7861 4867 -4248 -635
7844f35J0546M098J185l755k151k401n674K77N066L996L829j99n455n642l43O14
$$ -635 9911 14009 15194 11439 9288 6887 1213 1490 6556 10552 14381 14182 8727 3085 2742 3356
7828C356L668k016k227l642l772N899L951l654o880J913K636k462K338O49j088
$$ 3356 7024 5008 2781 -861 -4633 1266 5217 1563 -5317 -3404 -768 -3230 -892 -243 -1331
7813a331Q99n596n191k253k564L122Q880n372L526o81q798j854j032N781L264
$$ -1331 -432 -6028 -11219 -13472 -16036 -12914 -4034 -9406 -5880 -6561 -15359 -17213 -18245 -12464 -9200
7798i200O064k95j110j565m395P897j37j745K211m977P84j878N00R083K349j188
$$ -9200 -3136 -3431 -4541 -6106 -10501 -2604 -2741 -4486 -2275 -7252 -6468 -8346 -7846 1237 3586 2398
7782B398n377j6l349n886j736K112J3127j087p686p543J935N976M82J828N897
$$ 2398 -2979 -2995 -6344 -12230 -13966 -11854 1273 186 -7500 -15043 -13108 -7132 -6650 -4822 1075
7767A075J233j908M158n72q64n384j787l261l934m020K150J6L180M478J477J56
$$ 1075 2308 400 4558 3986 3122 -2262 -4049 -7310 -11244 -15264 -13114 -13098 -9918 -5440 -3963 -3807
7751c807o298O5J0326L785m866l656m041p639k674K042J0964L679l398p169j880
$$ -3807 -10105 -10040 286 4071 -795 -4451 -8492 -16131 -18805 -16763 -5799 -2120 -5518 -12687 -14567
7736a4567P947L084K47M806m452n680q04M921j004N58J4j288L722q68k724m756
$$ -14567 -6620 -3536 -3289 1517 -2935 -8615 -9419 -4498 -5502 -4944 -4930 -6218 -2496 -3364 -6088 -10844
7720a0844J203M371K666N67L518N5o09M866J051j0945r579n298K467O767p96k947
$$ -10844 -9641 -5270 -2604 -2037 1481 1536 927 5793 6844 -4101 -13680 -18978 -16511 -9744 -10540 -13487
7704a3487M40P201L300M571O470J844j4458r705j861M344Q419L012k837j944n974
$$ -13487 -13047 -5846 -2546 2025 8495 10339 -4119 -13824 -15685 -11341 -2922 90 -2747 -4691 -10665
7689a0665K316l162M468J4174j179q179m714j930L181N380q153k205n216K260
$$ -10665 -8349 -11511 -7043 7131 5952 -2227 -6941 -8871 -5690 -310 -8463 -10668 -15884 -13624
7675a3624O983K513J188J810n381j527M379M253o96l11l932p410P866M097m846
$$ -13624 -6641 -4128 -2940 -1130 -6511 -8038 -3659 594 -102 -413 -4345 -11755 -3889 208 -4638
7660d638J488M846N447n958q829r0m23K903J0737P02k242o103K640K242K92j688
$$ -4638 -3150 1696 7143 1185 -7644 -7734 -8157 -5254 5483 6185 3943 -2160 480 2722 3014 1326
7644A326l030j291J846O321n041q86K344l27l186K978n031o022n16n178O007L293
$$ 1326 -1704 -2995 -1149 5172 131 -755 1589 1262 -1924 1054 -3977 -9999 -10515 -15693 -9686 -6393
7628f393j610K946O071J138r70n888k341k723J783q288M327P558k516j732J264
$$ -6393 -8003 -5057 1014 2152 1182 -4706 -7047 -9770 -7987 -16275 -11948 -4390 -6906 -8638 -7374
7613g374M345k270o105k692l153j341L658j209j254N883M218P716J085o053L237
$$ -7374 -3029 -5299 -11404 -14096 -17249 -18590 -14932 -16141 -17395 -11512 -7294 422 1507 -4546 -1309
7598a309n099r621j0O361O589j057L915n038m467K622k659K759L92m301K043J889
$$ -1309 -6408 -16029 -16039 -9678 -3089 -4146 -231 -5269 -9736 -7114 -9773 -7014 -6622 -10923 -8880 -6991
7582f991l436k833L072N14J0492M598k946o323p751O77J658m099L127K893K462
$$ -6991 -10427 -13260 -10188 -9674 818 5416 2470 -3853 -11604 -10927 -9269 -13368 -10241 -7348 -4886
7567d886k860L608O421n039p522j147q21P729L232j143o847k343M751j329k632
$$ -4886 -7746 -4138 2283 -2756 -10278 -11425 -12246 -4517 -1285 -2428 -9275 -11618 -6867 -8196 -10828
7552a0828L37k44k507J797K616O56L886L61r64j708m942l20o97K658M215K98l645
$$ -10828 -10491 -10735 -13242 -11445 -8829 -8173 -4287 -3926 -4890 -6598 -11540 -11860 -12557 -9899 -5684 -5386 -9031
7535i031n868K733j019J417M709M298n289l871m183j558K827K438K925P32O768
$$ -9031 -14899 -12166 -13185 -11768 -7059 -2761 -8050 -11921 -16104 -17662 -14835 -12397 -9472 -8740 -1972
7520a972L509j833K239M742J954r351l57l317n622m455K694R701k532L84M710
$$ -1972 1537 -296 1943 6685 8639 -712 -1069 -4386 -10008 -14463 -11769 -2068 -4600 -4216 494
7505D94l652j493k661K416P364j389J154K910K43J010K45l358n034n927o319k440
$$ 494 -3158 -4651 -7312 -4896 2468 1079 2233 5143 5386 6396 6641 3283 -1751 -7678 -13997 -16437
7489a6437Q361J4464k901j0202l527J067j487j132R953N464o659k366J688K071
$$ -16437 -8076 6388 3487 -6715 -10242 -9175 -10662 -11794 -1841 3623 -3036 -5402 -3714 -1643
7475a643N685j957o271l526N257j469j448J850N703L070r68l460J200M970n812
$$ -1643 4042 2085 -4186 -7712 -2455 -3924 -5372 -3522 2181 5251 4283 823 2023 6993 1181
7460A181k859J0861P41n156j145M318L650J898J232j550n505l126l589O61j108
$$ 1181 -1678 9183 9924 4768 3623 7941 11591 13489 14721 13171 7666 4540 951 1612 504
7445E04n44l346P68m692O674J420K804j540j887R28l204l461l827j841m096p17
$$ 504 -40 -3386 -2618 -7310 -636 784 3588 2048 161 1089 -2115 -5576 -9403 -11244 -15340 -16057
7429a6057k393m115K465Q733q51M652J53o892L279J098J056n21q07K962M061M054
$$ -16057 -18450 -22565 -20100 -11367 -12218 -7566 -7413 -14305 -11026 -9928 -8872 -9393 -10200 -7238 -3177 877
7413H77J478K411j876o891R03J694k392N46M382m909m300J294M239L500m70n052
$$ 877 2355 4766 2890 -4001 -3098 -1404 -3796 -3250 1132 -3777 -8077 -6783 -2544 956 486 -4566
7397d566J859k660l847o457k405N128L28j819M030K401J299j308M399K088M707
$$ -4566 -2707 -5367 -9214 -15671 -18076 -12948 -12620 -14439 -10409 -8008 -6709 -8017 -3618 -1530 3177
7382C177J761j304j331o561L26m530N378P398L297r2l522K529K972j523o736p675
$$ 3177 4938 3634 2303 -4258 -3932 -8462 -3084 4314 7611 7519 3997 6526 9498 7975 1239 -6436
7366f436O99M065k335j375k803N19J798j445l266N671l585O31J407n284p41J0080
$$ -6436 -5737 -1672 -4007 -5382 -8185 -7666 -5868 -7313 -10579 -4908 -8493 -7862 -6455 -11739 -12480 -2400
7350b400M107J600N374j587J658Q3l033q368k050J435M516M41o69N24n453o185
$$ -2400 1707 3307 8681 7094 8752 8835 5802 -2566 -4616 -3181 1335 1776 1107 1631 -3822 -10007
7334a0007n49K968N605M11j548L817J358l827l403J242k738k885r24j107N987
$$ -10007 -10556 -7588 -1983 -1572 -3120 697 2055 -1772 -5175 -3933 -6671 -9556 -10480 -11587 -5600
7319e600k30K51O787j299j024J872l549j641M739m784l354j143k57j419J081L788
$$ -5600 -5830 -5579 1208 -91 -1115 757 -2792 -4433 306 -4478 -7832 -8975 -9232 -10651 -9570 -5782
7303e782J976m169l854kO739L305l256J519K696k713n649k226L978K620K697p06
$$ -5782 -3806 -7975 -11829 -11831 -5092 -1787 -5043 -3524 -828 -3541 -9190 -11416 -7438 -4818 -2121 -2827
7287b827q57K167k958N389q21J790L004m848J683l895l998L673l649k582p814
$$ -2827 -3684 -1517 -4475 914 93 1883 4887 39 1722 -2173 -6171 -2498 -6147 -8729 -16543
7272a6543l76N055K976N842O520j648K41J860j715q79k70K554k155k755q78M004
$$ -16543 -16919 -11864 -8888 -3046 3474 1826 2067 3927 2212 1333 1063 3617 1462 -1293 -2171 1833
7256A833L086J481j718j781j896m369j595L475N985N9K99k450o770n277K724P776
$$ 1833 4919 6400 4682 2901 1005 -3364 -4959 -1484 4501 4560 4859 2409 -4361 -9638 -6914 862
7240H62N711R0k408L665n528k353N75M17l423L18k366J694M601J516p36K138k896
$$ 862 6573 6663 4255 7920 2392 39 614 1031 -2392 -2074 -4440 -2746 1855 3371 2635 4773 1877
7223A877l325o866j224m930P25j215N106Q491J589j937q51J746L708L75m432k352
$$ 1877 -1448 -8314 -9538 -14468 -13743 -14958 -9852 -1361 228 -1709 -2560 -814 2894 3269 -1163 -3515
7207c515m85j961L693k226k149J395J650q27J46k061n118m402M596M868j746J36
$$ -3515 -4000 -5961 -2268 -4494 -6643 -5248 -3598 -4425 -4279 -6340 -11458 -15860 -11264 -6396 -8142 -8006
7191h006K432L952P959L976k55k196J74o794m522n06J902O909l100j753n215L525
$$ -8006 -5574 -1622 6337 10313 10058 7862 8036 1242 -3280 -3786 -1884 5025 1925 172 -5043 -1518
7175a518k455q88L018M981J208m642L617k508n99R964m631m247K225M015n755
$$ -1518 -3973 -4861 -1843 3138 4346 -296 3321 813 214 10178 5547 1300 3525 7540 1785
7160A785m525n552J083J498P29M225j892j402N259R34M265O992l950l483l743
$$ 1785 -2740 -8292 -7209 -5711 -4982 -757 -2649 -4051 1208 2142 6407 13399 9449 5966 2223
7145B223lk836m354R017M252K238k633j0045l360J660L349k744j42j636L698l72
$$ 2223 2220 -616 -4970 4047 8299 10537 7904 -2141 -5501 -3841 -492 -3236 -3378 -5014 -1316 -1688
7129a688m606O710M916l447j30M0n260J42j110l345O013L725K054l288m806J0707
$$ -1688 -6294 416 5332 1885 1755 1795 -3465 -3323 -4433 -7778 -1765 1960 4014 726 -4080 6627
7113F627Q871n336o197l991k666k665J327j988m756O83p13m31R034M14K201l558
$$ 6627 15498 10162 3965 -26 -2692 -5357 -4030 -6018 -10774 -10091 -10804 -11235 -2201 -1787 414 -3144
7097c144m075k905P742M802p430m544k486J408M55M42M005J246q70m173p132K658
$$ -3144 -7219 -10124 -2382 2420 -5010 -9554 -12040 -10632 -10177 -9735 -5730 -4484 -5354 -9527 -16659 -14001
7081a4001M336P440o27j839j225M04Q99R01K313m299l421O13J352J072n543j104
$$ -14001 -9665 -2225 -2852 -4691 -5916 -5512 -4613 -3712 -1399 -5698 -9119 -8506 -7154 -6082 -11625 -12729
7065a2729J0444j106l627l491k11K724J3356k357K003j308p935P348M617l762
$$ -12729 -2285 -3391 -7018 -10509 -10720 -7996 5360 3003 5006 3698 -4237 3111 7728 3966
7051C966k108K600q20J410J585M904p91l162n941k37P33l93l10m81m650j271o68
$$ 3966 1858 4458 3638 5048 6633 11537 10746 7584 1643 1406 2139 1746 1436 955 -3695 -4966 -5634
7034e634n359J652M03K639L47n369K102O125K433j776j434L191l177n369J859
$$ -5634 -10993 -9341 -8938 -6299 -5952 -11321 -9219 -3094 -661 -2437 -3871 -680 -3857 -9226 -7367
7019g367O42R71J569p90l6J006R33l273j25j804k262N023L276n637o322J850O208
$$ -7367 -6725 -5754 -4185 -4975 -5011 -4005 -3072 -6345 -6470 -8274 -10536 -5513 -2237 -7874 -14196 -12346 -6138
7002f138O785N553k981o080o722k149Q489J21K950L269p146m550p70L080N280
$$ -6138 647 6200 3219 -2861 -9583 -11732 -3243 -3122 -172 3097 -4049 -8599 -9369 -6289 -1009
6987a009k516l368N766O402L182L720L51m433p793p278n989K642j463k477N676
$$ -1009 -3525 -6893 -1127 5275 8457 12177 12528 8095 302 -6976 -12965 -10323 -11786 -14263 -8587
6972h587l043M44M229J1223K6j1394J934K964M452p58m860p161k469J27j232M574
$$ -8587 -11630 -11186 -6957 4266 4292 -7102 -5168 -2204 2248 1490 -3370 -10531 -13000 -12873 -14105 -9531
6956i531P690L061J050K240l104j872q271k834j448m499J947J3494K344n431j974
$$ -9531 -1841 1220 2270 4510 1406 -466 -8737 -11571 -13019 -17518 -15571 -2077 267 -5164 -7138
6941g138k527L97Q410R23J542P594O551n320j5533q323N396P995L215r54q734
$$ -7138 -9665 -9268 -858 65 1607 9201 15752 10432 -5101 -13424 -8028 -33 3182 2228 -6506
6926f506k029O685K878j62m704K055L62o839j299M745J851m031m818j386N303
$$ -6506 -8535 -1850 1028 866 -3838 -1783 -1421 -8260 -9559 -4814 -2963 -6994 -11812 -13198 -7895
6911g895R673J16n80P935k334j999n018k987J821M489m61n748j899J300j816K253
$$ -7895 1778 1894 1314 9249 6915 4916 -102 -3089 -1268 3221 2760 -2988 -4887 -3587 -5403 -3150
6895c150J093k818k082p30k613K071K066k393J014m315l174N186j596l00P028
$$ -3150 -2057 -4875 -6957 -7687 -10300 -8229 -6163 -8556 -7542 -11857 -15031 -9845 -11441 -11741 -4713
6880d713k907j820J594j162o58R37M470K761n75K395N66R0k297p270k279M652
$$ -4713 -7620 -9440 -7846 -9008 -9666 -8729 -4259 -1498 -2073 322 888 978 -1319 -8589 -10868 -6216
6864f216N164K546j869r89r133k486L112j871K422P050j204k90n09l163m972J751
$$ -6216 -1052 1494 -375 -1364 -10497 -12983 -9871 -11742 -9320 -2270 -3474 -3764 -4273 -7436 -12408 -10657
6848a0657N63m86p96J754P429M809n026o638O053J398P6n07J997Q83l527m165
$$ -10657 -10094 -10580 -11376 -9622 -2193 2616 -2410 -9048 -2995 -1597 -1521 -2028 -31 852 -2675 -6840
6832f840j240K309K618K798k276M48J050k320J557j567j603j189l054n870M442
$$ -6840 -8080 -5771 -3153 -355 -2631 -2183 -1133 -3453 -1896 -3463 -5066 -6255 -9309 -15179 -10737
6817a0737P326j195l504L118M836R15n093N098Q258O248J200q880m382l43k667
$$ -10737 -3411 -4606 -8110 -4992 -156 759 -4334 764 9022 15270 16470 7590 3208 2865 198
6802A98O878k869J661R609k786m876o8N546q59k240K959K468q695j3497p739j056
$$ 198 7076 4207 5868 15477 12691 7815 7747 13293 12434 10194 13153 15621 6926 -6571 -14310 -15366
6786a5366O514J0155K432q20m599j876K570M588j034l510j521K9M824K528J200
$$ -15366 -8852 1303 3735 2915 -1684 -3560 -990 3598 2564 -946 -2467 -2438 2386 4914 6114
6771F114N07P876N335m323n184N976O824L098J0046Q715J1309P803K0381J1763
$$ 6114 6621 14497 19832 15509 10325 16301 23125 26223 36269 44984 56293 64096 84477 96240
6757I6240L5838O1280R1144R1416q13p4630r0786o8362l7394j6437n010M395K1810
$$ 96240 132078 193358 284502 375918 375105 300475 209689 141327 103933 87496 82486 86881 108691
6744A08691L9439M6083J7943k4783k7235J484K0066J8746j5072l3138l3670k9718
$$ 108691 148130 194213 212156 187373 160138 161622 181688 200434 185362 152224 118554 88836
6732H8836j7171j5835r571j0703m363K696n427n539p771j562K227l104k152j116
$$ 88836 71665 55830 46259 35556 31193 33889 28462 22923 15152 13590 15817 12713 10561 9445
6718I445J365o655o835o22J993j016l238j017M953L603Q676n52P73O25j290n60
$$ 9445 10810 4155 -2680 -3302 -1309 -2325 -5563 -6580 -1627 1976 10652 10100 10873 11498 10208 9648
6702I648k482J549K883l107r01J725K225p30j638L481N482R423M771Q415J3856
$$ 9648 7166 8715 11598 8491 7590 9315 11540 10810 9172 12653 18135 27558 32329 40744 54600
6687E4600R692J9224K2711K1848R155R4q597j4974j9153j2727j5399k91O031R521
$$ 54600 64292 83516 106227 128075 137230 137324 128727 113753 94600 81873 66474 66183 72214 81735
6673H1735J1347K0875K0902L529j3187k0017k1895j6976j3911j0L79J753l414
$$ 81735 93082 113957 134859 138388 125201 105184 83289 66313 52402 52392 52771 54524 51110
6660E1110q690k168J080L214n946j726k80k734k955N204P158L542Q64O089M493
$$ 51110 42420 40252 41332 44546 38600 36874 36594 33860 30905 36109 43267 46809 47673 53762 58255
6645E8255J0791J2576J0057K3415M9120N3007N2013M7389J2204l2559o1136o3215
$$ 58255 69046 81622 91679 115094 164214 217221 269234 316623 328827 296268 235132 171917
6633A71917n3942m1594k6513o864j737m946j0542q914O7l699m512p626m364l876
$$ 171917 117975 76381 49868 43004 41267 36321 25779 16865 16932 13233 8721 1095 -3269 -7145
6619g145P605J0538K229r547l970N144M148n097p948j181L332k47K885n170l051
$$ -7145 460 10998 13227 3680 -290 4854 9002 3905 -4043 -5224 -1892 -2139 746 -4424 -7475
6604g475J584N694J088m625o987K429R750K960l919l153m529N67k96k862K538
$$ -7475 -5891 -197 891 -3734 -10721 -8292 1458 4418 499 -2654 -7183 -6616 -6912 -9774 -7236
6589g236Q864N930k846k983K900l515r23J985L501k626m825p616K053N031K742
$$ -7236 1628 7558 4712 1729 4629 1114 191 2176 5677 3051 -1774 -9390 -7337 -2306 436
6574D36j740o677k10J783j103L354M109J184N847m82K925n618m301j586n339K612
$$ 436 -1304 -7981 -8191 -6408 -7511 -4157 -48 1136 6983 6501 9426 3808 -493 -2079 -7418 -4806
6558d806M391K481K449K862o418Q70k082K515N139L297q681J518P325J940M11
$$ -4806 -415 2066 4515 7377 959 1829 -253 2262 7401 10698 2017 3535 10860 12800 13211
6543A3211o346p719n099l5Q008K046o900n285R1J784j70M44J463m934m723O090
$$ 13211 6865 -854 -5953 -5988 2020 4066 -2834 -8119 -8028 -6244 -6414 -5970 -4507 -9441 -14164 -8074
6527h074M356K350l473l724R26R510O804M584k280m455o368L77k283k713l13j499
$$ -8074 -3718 -1368 -4841 -8565 -7639 1871 8675 13259 10979 6524 156 533 -1750 -4463 -4776 -6275
6511f275j212Q441P89l557P597n650q546M50J48P13j563P03j621K189O02m142
$$ -6275 -7487 954 1743 -1814 5783 133 -8413 -7963 -7815 -7102 -8665 -7962 -9583 -7394 -6792 -10934
6495a0934o933O149N549K738O380l035p387k142J527J876L030N13M59l1k912n28
$$ -10934 -17867 -11718 -6169 -3431 2949 -86 -7473 -9615 -8088 -6212 -3182 -2669 -2210 -2241 -5153 -5681
6479e681J920j152k542j802J39J587J224K020P50k124N012O216n467m032M361
$$ -5681 -3761 -4913 -7455 -9257 -9118 -7531 -6307 -4287 -3537 -5661 -649 5567 100 -3932 429
6464D29k547J841m075l59k266M528j732n586J283K545M322j461j327J48J177n390
$$ 429 -2118 -277 -4352 -4711 -6977 -2449 -4181 -9767 -8484 -5939 -1617 -3078 -4405 -4257 -3080 -8470
6448h470k146j183P074k607J792L702J992m396m256m39j772N165N677j327r116
$$ -8470 -10616 -11799 -4725 -7332 -5540 -1838 154 -4242 -8498 -8937 -10709 -5544 133 -1194 -10310
6433a0310N519P724q96l00J391O48j889J541m618l038q92k31l033K042n194k176
$$ -10310 -4791 2933 2037 1737 3128 3776 1887 3428 -1190 -4228 -5120 -5351 -8384 -6342 -11536 -13712
6417a3712r71K553N048K591J536k95J250k552q77Q360Q93l479n615J287o65n288
$$ -13712 -14683 -12130 -7082 -4491 -2955 -3250 -2000 -4552 -5429 2931 3824 345 -5270 -3983 -4648 -9936
6401i936n88J515L215R39k433O722L966j128m76p376J254Q849j492m335J714n775
$$ -9936 -10524 -9009 -5794 -4855 -7288 -566 3400 2272 1796 -5580 -4326 4523 3031 -1304 410 -5365
6385e365n352m52M143P306q6j00L638K832p290l611J694L321q94J713n647p181
$$ -5365 -10717 -11169 -7026 280 194 94 3732 6564 -726 -4337 -2643 678 -216 1497 -4150 -11331
6369a1331j127M047L72k728n93P842K742j04n943q831k607M429O544L237L883
$$ -11331 -12458 -8411 -8039 -10767 -11360 -3518 -776 -880 -6823 -15654 -18261 -13832 -7288 -4051 -168
6354a68j148J206L682M938K297j477q680m458O79q91j661J152M471n801l780n09
$$ -168 -1316 -110 3572 8510 10807 9330 650 -3808 -3129 -4020 -5681 -4529 -58 -5859 -9639 -10148
6338a0148L344q44m499m65q93k913j645N493O614m58M942L74n231l582L051l49
$$ -10148 -6804 -7648 -12147 -12612 -13505 -16418 -18063 -12570 -5956 -6414 -1472 -1098 -6329 -9911 -6860 -7209
6322g209l11P573j009n113q167j417R335O842m90l568k68P42N16K281o740m665
$$ -7209 -7520 53 -956 -6069 -14236 -15653 -6318 524 34 -3534 -3802 -3060 -2544 -263 -7003 -11668
6306a1668O91J996K879j035M104M474k501r657q13j293K003J719O199J991n215
$$ -11668 -10977 -8981 -6102 -7137 -3033 1441 -1060 -10717 -11530 -12823 -10820 -9101 -2902 -911 -6126
6291f126K616j4l19L467l728J673l088k720K981M97m130K203M076M43L750J601
$$ -6126 -3510 -3524 -3843 -376 -4104 -2431 -5519 -8239 -5258 -4761 -8891 -6688 -2612 -2169 1581 3182
6275C182k311L325q11l394L886p031m340M39N567J047l483J380M079Q397K286
$$ 3182 871 4196 3385 -9 3877 -3154 -7494 -7055 -1488 -441 -3924 -2544 1535 9932 12218
6260A2218m257p046j249O034Q97o241L32K88O439l511p808l37k696k991L173J976
$$ 12218 7961 915 -334 5700 6597 356 688 976 7415 3904 -3904 -4241 -6937 -9928 -6755 -4779
6244d779r265l388K638L893N832L71K493J842m639K19K734J018p87n22K44m348
$$ -4779 -14044 -17432 -14794 -10901 -5069 -4698 -2205 -363 -5002 -4783 -2049 -1031 -1818 -2340 -2096 -6444
6228f444J431K826J100o672l806M788J0290M702J817p516k175J441P408p191q918
$$ -6444 -5013 -2187 -1087 -7759 -11565 -6777 3513 8215 10032 2516 341 1782 9190 1999 -6919
6213f919m887J913Q968K743p040Q56m546j753k331k843m026M404K879k038l739
$$ -6919 -11806 -9893 -925 1818 -5222 -4366 -8912 -10665 -12996 -15839 -19865 -15461 -12582 -14620 -18359
6198a8359O783n191p666R29P970M743N458K975m06J933q61k697O033j027l406
$$ -18359 -11576 -16767 -24433 -23504 -15534 -10791 -5333 -2358 -2764 -831 -1692 -4389 1644 617 -2789
6183b789K382l078K2n14l53Q44M224J545o40n756m496k658M250O610m007L921
$$ -2789 -407 -3485 -3463 -3977 -4330 -3486 738 2283 1643 -4113 -8609 -11267 -7017 -407 -4414 -493
6167d93K216k502r32m977M772O694l385k555J456J266O173n193q990l039Q70M340
$$ -493 1723 -779 -1711 -6688 -1916 4778 1393 -1162 294 1560 7733 2540 -6450 -9489 -8619 -4279
6151d279k797n412N178%J186P956L57k306k220k097l210N793M630j175n298k248
$$ -4279 -7076 -12488 -7310 -7310 -6124 1832 2189 -117 -2337 -4434 -7644 -1851 2779 1604 -3694 -5942
6135e942M845k459j0377K799r13r06k559P159L892N305r425l236M958K620m217
$$ -5942 -1097 -3556 -13933 -11134 -12047 -12953 -15512 -8353 -4461 844 -8581 -11817 -6859 -4239 -8456
6120h456p859K843N204M555k599m639k005N081l572J276J041P785J2216l900p243
$$ -8456 -16315 -13472 -8268 -3713 -6312 -10951 -12956 -7875 -11447 -10171 -9130 -1345 10871 6971 -272
6105b72l976r122j90J0866J716L214m713o345m024J513L197M386P625k199l756
$$ -272 -4248 -13370 -13560 -2694 -978 2236 -2477 -8822 -12846 -11333 -8136 -3750 3875 1676 -2080
6090b080k947q438J828L835K866R10m478l015l857k966L166R605L640J381N317
$$ -2080 -5027 -13465 -11637 -7802 -4936 -4026 -8504 -11519 -15376 -18342 -15176 -5571 -1931 -550 4767
6075D767o168L356N55k703n554j361j931K407P838j458n481q003N478P857n934
$$ 4767 -1401 1955 2510 -193 -5747 -7108 -9039 -6632 1206 -252 -5733 -13736 -8258 -401 -6335
6060f335j0894L56O955R871k50l842K019O114l488p072L184M100J638K06O831
$$ -6335 -17229 -16873 -9918 -47 -297 -4139 -2120 3994 506 -6566 -3382 718 2356 2562 9393
6045I393p6o246l758l989q989O64M121Q589J356K100L609m065q341L446O801J446
$$ 9393 9317 3071 -687 -4676 -13665 -13001 -8880 -291 1065 3165 6774 2709 -5632 -2186 4615 6061
6029F061j917l553m736n39k74k618M979M801N371K010n197q473o418N142J372
$$ 6061 4144 591 -4145 -4684 -4958 -7576 -2597 2204 7575 9585 4388 -4085 -10503 -5361 -3989
6014c989r21P13l914J596M227O804M858l740J68j140n504r034j068M51L080K426
$$ -3989 -4910 -4197 -8111 -6515 -2288 4516 9374 5634 5802 4662 -842 -9876 -10944 -10493 -7413 -4987
5998d987R106K534n244p196l097J222n070o495r57R820O016L10n10l580J924l331
$$ -4987 4119 6653 1409 -5787 -8884 -7662 -12732 -19227 -20184 -10364 -4348 -4038 -4548 -8128 -6204 -9535
5982i535o153M135N28k081O547L386j592k479j956M759R546O91m306j0507j1966
$$ -9535 -15688 -11553 -11025 -13106 -6559 -3173 -4765 -7244 -9200 -4441 5105 5796 1490 -9017 -20983
5967b0983J764Q294O594K587J218L623l259n572k005l881O093R890j875p836k0
$$ -20983 -19219 -10925 -4331 -1744 -526 3097 -162 -5734 -7739 -11620 -5527 4363 2488 -5348 -5368
5952e368M945M957n82o552l313m477L764K992r07l337l045n92L292M049O160k863
$$ -5368 -423 4534 3952 -2600 -5913 -10390 -6626 -3634 -4541 -7878 -10923 -11515 -8223 -4174 1986 -877
5936h77k954m855j696k69K210K346j29k590L809p19N51J248m333m247R47L264
$$ -877 -3831 -8686 -10382 -10651 -8441 -6095 -6224 -8814 -5005 -5724 -5173 -3925 -8258 -12505 -11558 -8294
5920h294K393L052M411J065k54K021k18m602j0920k558k867J310M165J961M1K478
$$ -8294 -5901 -2849 1562 2627 2373 4394 4176 -426 -11346 -13904 -16771 -15461 -11296 -9335 -9294 -6816
5904f816K177j919J091O060Q19l929q20J83M316L452j456j055j696j38m00n154
$$ -6816 -4639 -6558 -5467 593 1412 -2517 -3337 -3154 1162 4614 3158 2103 407 269 -131 -5285
5888e285J361n370k032O69Q078J207k581o437j266J332L847M63r9k452p57J621
$$ -5285 -3924 -9294 -11326 -10657 -2579 -1372 -3953 -10390 -11656 -10324 -6477 -6014 -6113 -8565 -9322 -7701
5872g701J0378M004k170M441q56j0657m743l879J387K699K157J577Q47J695K148
$$ -7701 2677 6681 4511 8952 8096 -2561 -7304 -11183 -9796 -7097 -4940 -3363 -2516 -821 1327
5857A327j057o826k972M296M281j902l251N662j92r903J623K797Q075O129m552
$$ 1327 270 -6556 -9528 -5232 -951 -2853 -6104 -442 -634 -10537 -8914 -6117 1958 8087 3535
5842C535k847Q86o62J110Q70o72J22p704m43k653K213J567L623L576k707K271
$$ 3535 688 1574 912 2022 2892 2220 2342 -5362 -5805 -8458 -6245 -4678 -1055 2521 -186 2085
5826B085J186k960l935o989Q801O104r002r45L725j873k994N989j573p525k214
$$ 2085 3271 311 -3624 -10613 -1812 4292 -4710 -5655 -1930 -3803 -6797 -808 -2381 -9906 -12120
5811a2120M302K282L929O87K300J854j072l045j339O97m984l087n357l533J2713
$$ -12120 -7818 -5536 -1607 -920 1380 3234 2162 -883 -2222 -1525 -6509 -9596 -14953 -18486 -5773
5796e773L518j023n731K809M223O4l297J1446k624p410j967O021l261l903p083
$$ -5773 -2255 -3278 -9009 -6200 -1977 -1913 -5210 6236 3612 -3798 -5765 256 -3005 -6908 -13991
5781a3991O451k27m186l339J249M892J307k498k870n288O676K951K731k001Q88
$$ -13991 -7540 -7767 -11953 -15292 -14043 -9151 -7844 -10342 -13212 -18500 -11824 -8873 -6142 -8143 -7255
5766g255k083n22L760j258j146N989j155l079j498n25L546l540N395l160M10O846
$$ -7255 -9338 -9860 -6100 -7358 -8504 -2515 -3670 -6749 -8247 -8772 -5226 -8766 -3371 -6531 -6121 725
5750G25K256j0162j3178L674J0081k84J514k377k404O561P209l799p802m441L402
$$ 725 2981 -7181 -20359 -16685 -6604 -6888 -5374 -7751 -10155 -3594 3615 -184 -7986 -12427 -9025
$$ [...]
##END NTUPLES=NMR SPECTRUM
##END=
