##TITLE=XTC-1731a_2
##JCAMPDX= 6.0         $$ Bruker NMR JCAMP-DX V2.0
##DATA TYPE= nD NMR SPECTRUM
##DATA CLASS= NTUPLES
##NUM DIM= 2
##ORIGIN= BRUKER
##OWNER= patiny
$$ 1.79 TOPSPIN		Version 3.0
$$ 2012-05-20 21:08:57.320 +0200  patiny@icmbsg005
$$ Compression mode = diff/dup
##.OBSERVE FREQUENCY= 400.131578657915
##.OBSERVE NUCLEUS= ^1H
##.ACQUISITION MODE= SIMULTANEOUS (DQD)
##.ACQUISITION SCHEME= NOT PHASE SENSITIVE
##.AVERAGES= 2
##.DIGITISER RES= 23
##SPECTROMETER/DATA SYSTEM= spect
##.PULSE SEQUENCE= cosygpppqf
##.SOLVENT NAME= D2O
##.SHIFT REFERENCE= INTERNAL, D2O, 1, 7.286523
##AUDIT TRAIL= $$ (NUMBER, WHEN, WHO, WHERE, PROCESS, VERSION, WHAT)
$$ ##TITLE= Audit trail, TOPSPIN		Version 3.0
$$ ##JCAMPDX= 5.01
$$ ##ORIGIN= Bruker BioSpin GmbH
$$ ##OWNER= patiny
$$ $$ /opt/data/patiny/nmr/XTC-1731a_2/12/pdata/1/auditp.txt
$$ ##AUDIT TRAIL=  $$ (NUMBER, WHEN, WHO, WHERE, PROCESS, VERSION, WHAT)
(   1,<2012-05-20 21:08:56.288 +0200>,<patiny>,<icmbsg005>,<go>,<TOPSPIN 3.0>,
      <created by zg
	started at 2012-05-20 20:49:08.850 +0200,
	POWCHK enabled, PULCHK disabled,
       configuration hash MD5:
       77 C7 B7 C4 10 F4 BA 30 64 2E BB 52 82 F2 DA 41
       data hash MD5: 2K * 256
       D7 50 7B BB 4C BD 3A 9F 75 3C DF 15 4B C3 7E 15>)
(   2,<2012-05-20 21:08:56.354 +0200>,<patiny>,<icmbsg005>,<audit>,<TOPSPIN 3.0>,
      <user comment:
       ICON-NMR User ID: patiny
       data hash MD5: 2K * 256
       D7 50 7B BB 4C BD 3A 9F 75 3C DF 15 4B C3 7E 15>)
(   3,<2012-05-20 21:08:57.065 +0200>,<patiny>,<icmbsg005>,<proc2d>,<TOPSPIN 3.0>,
      <Start of raw data processing
       xfb same F2: SI = 1K WDW = 4 SSB = 0 FT_mod = 6 PKNL = 1 F1: SI = 1K ME_mod = 2 NCOEF = 32 WDW = 4 SSB = 0 FT_mod = 6 PH_mod = 2
       data hash MD5: 1K * 1K
       29 8D D0 34 75 06 56 A5 33 29 E2 81 B8 E8 66 05>)
(   4,<2012-05-20 21:08:57.179 +0200>,<patiny>,<icmbsg005>,<proc2d>,<TOPSPIN 3.0>,
      <abs2 F2: ABSG = 5 ABSF1 = 7.286523 ABSF2 = 0.6042026
       data hash MD5: 1K * 1K
       8B B0 86 46 13 D5 C4 E6 18 F5 97 7D F6 64 FB 74>)
(   5,<2012-05-20 21:08:57.272 +0200>,<patiny>,<icmbsg005>,<proc2d>,<TOPSPIN 3.0>,
      <abs1 F1: ABSG = 5 ABSF1 = 7.286523 ABSF2 = 0.6042026
       data hash MD5: 1K * 1K
       77 09 2F 0B FA 5A FA E0 91 5F 90 55 43 47 27 6F>)
(   6,<2012-05-20 21:08:57.309 +0200>,<patiny>,<icmbsg005>,<proc2d>,<TOPSPIN 3.0>,
      <sym
       data hash MD5: 1K * 1K
       CC 51 0B 81 E8 EA CD 3F 43 CA 6B 04 D2 4F 16 82>)
$$ ##END=
$$ 
$$ $$ hash MD5
$$ $$ CE 74 54 E8 EC 1A 6A A1 18 1A 15 A1 B9 12 23 90
##$RELAX= 
##$RELAX= 
##$RELAX= 
##$RELAX= 
##$RELAX= 
##$RELAX= 
##$RELAX= 
##$RELAX= 
##$RELAX= 
$$ Bruker specific parameters
$$ --------------------------
##$DATPATH= </opt/data/patiny/nmr>
##$EXPNO= 12
##$NAME= <XTC-1731a_2>
##$PROCNO= 1
##$ACQT0= 1000000
##$AMP= (0..31)
100 100 100 100 100 100 100 100 100 100 100 100 100 100 100 100 100 100
100 100 100 100 100 100 100 100 100 100 100 100 100 100
##$ANAVPT= -1
##$AQSEQ= 0
##$AQ_mod= 3
$$ [...]
##$PYNMP= <proc.py>
##$REVERSE= no
##$SF= 400.13
##$SI= 1024
##$SIGF1= 7.286523
##$SIGF2= 0.6042026
##$SINO= 0
##$SIOLD= 1024
##$SPECTYP= <>
##$SREGLST= <1H.MeOD>
##$SSB= 0
##$STSI= 1024
##$STSR= 0
##$SW_p= 2673.79679144385
##$SYMM= 1
##$S_DEV= 6958
##$TDeff= 2048
##$TDoff= 0
##$TI= <>
##$TILT= no
##$TM1= 0
##$TM2= 0
##$TOPLEV= 100
##$USERP1= <>
##$USERP2= <>
##$USERP3= <>
##$USERP4= <>
##$USERP5= <>
##$WDW= 4
##$XDIM= 1024
##$YMAX_p= 478179159
##$YMIN_p= 0
##$CURPLOT= <Cups-PDF>
##$CURPRIN= <$Cups-PDF>
##$DFORMAT= <normdp>
##$LAYOUT= <+/2D_hom.xwp>
##$LFORMAT= <normlp>
##$PFORMAT= <normpl>
$$ Bruker specific parameters for F1
$$ ---------------------------------
##$ACQT0= 0
##$BF1= 400.13
##$FnMODE= 1
##$NUC1= <1H>
##$O1= 1578.65791482723
##$SFO1= 400.131578657915
##$SW= 6.68229386046474
##$SW_h= 2673.79679144385
##$TD= 256
##$ABSF1= 7.286523
##$ABSF2= 0.6042026
##$ABSG= 5
##$ABSL= 0
##$ALPHA= 0
##$AQORDER= 0
##$ASSFAC= 0
##$ASSFACI= 0
##$ASSFACX= 0
##$ASSWID= 0
##$AUNMP= <>
##$AXLEFT= 0
##$AXNAME= <F1>
##$AXNUC= <1H>
##$AXRIGHT= 0
##$AXTYPE= 0
##$AXUNIT= <>
##$AZFE= 0.1
##$AZFW= 0.5
##$BCFW= 0
##$BC_mod= 0
##$BYTORDP= 0
##$COROFFS= 0
##$CY= 15
##$DATMOD= 1
##$DC= 0
##$DFILT= <>
##$DTYPP= 0
##$ERETIC= no
##$F1P= 0
##$F2P= 0
##$FCOR= 0.5
##$FTSIZE= 1024
##$FT_mod= 6
##$GAMMA= 0
##$GB= 0
##$INTBC= 1
##$INTSCL= 1
##$ISEN= 128
##$LB= 0
##$LEV0= 0
##$LPBIN= 512
##$MAXI= 10000
##$MC2= 0
##$MEAN= 0
##$ME_mod= 2
##$MI= 0
##$NCOEF= 32
##$NC_proc= -5
##$NLEV= 6
##$NOISF1= 0
##$NOISF2= 0
##$NSP= 0
##$NTH_PI= 0
##$NZP= 0
##$OFFSET= 7.286523
##$PC= 4
##$PHC0= 0
##$PHC1= 0
##$PH_mod= 2
##$PKNL= no
##$PPARMOD= 1
##$PPDIAG= 0
##$PPIPTYP= 0
##$PPMPNUM= 2147483647
##$PPRESOL= 1
##$PSCAL= 1
##$PSIGN= 0
##$PYNMP= <proc.py>
##$REVERSE= no
##$SF= 400.13
##$SI= 1024
##$SIGF1= 7.286523
##$SIGF2= 0.6042026
##$SINO= 0
##$SIOLD= 1024
##$SPECTYP= <>
##$SREGLST= <>
##$SSB= 0
##$STSI= 1024
##$STSR= 0
##$SW_p= 2673.79679144385
##$SYMM= 1
##$S_DEV= 6958
##$TDeff= 512
##$TDoff= 0
##$TI= <>
##$TILT= no
##$TM1= 0
##$TM2= 0
##$TOPLEV= 0
##$USERP1= <>
##$USERP2= <>
##$USERP3= <>
##$USERP4= <>
##$USERP5= <>
##$WDW= 4
##$XDIM= 128
##$YMAX_p= 478179159
##$YMIN_p= 0
$$ End of Bruker specific parameters
$$ ---------------------------------
##NTUPLES= nD NMR SPECTRUM
##VAR_NAME=  FREQUENCY1,    FREQUENCY2,      SPECTRUM
##SYMBOL=    F1,            F2,              Y
##.NUCLEUS=  1H,            1H
##VAR_TYPE=  INDEPENDENT,   INDEPENDENT,     DEPENDENT
##VAR_FORM=  AFFN,          AFFN,            ASDF
##VAR_DIM=   1024,          1024,            1024
##UNITS=     HZ,            HZ,              ARBITRARY UNITS
##FACTOR=    2.61112967914438, 2.61112967914438, 1
##FIRST=     2915.55639409065, 2671.18566176471, -48
##LAST=      244.370732325947, 0,            -1660
##MIN=       244.370732325947, 0,            0
##MAX=       2915.55639409065, 2671.18566176471, 478179159
##PAGE= F1=2915.556394091
##FIRST=     2915.55639409065, 2671.18566176471, -48
##DATA TABLE= (F2++(Y..Y)), PROFILE
$$ [...]
##PAGE= F1=1064.265451577
##FIRST=     2915.55639409065, 2671.18566176471, 5533
##DATA TABLE= (F2++(Y..Y)), PROFILE
122A006g373a961H90N90d170k296j933R07K607J248o737N186A313a635r749J674
$$ 1006 -7373 -1961 890 1480 -4170 -6466 -8399 -7492 -4885 -3637 -10374 -5188 1313 -1635 -11384 -9710
106i710l156d196a493l453k390J895K288J523n232r83b457j293J783h62l99k031
$$ -9710 -12866 -4196 -1493 -4946 -7336 -5441 -3153 -1630 -6862 -7845 -2457 -3750 -1967 -862 -1261 -3292
90c292k019j633l97M1k49n24o80q09n75j46J80J185K051J312J605j498b016o525
$$ -3292 -5311 -6944 -7341 -7300 -7549 -8073 -8753 -9562 -10137 -10283 -10103 -8918 -6867 -5555 -3950 -5448 -2016 -8541
72h541d058R44j428K105a198D305e47G280C168e317A984f31p825J385l382k14
$$ -8541 -4058 -3114 -4542 -2437 -1198 4305 -547 7280 3168 -5317 1984 -631 -8456 -7071 -10453 -10667
56a0667J822J007j631l708J182c727D401L889k652i53C175n99c115q181M67N258
$$ -10667 -8845 -7838 -9469 -13177 -11995 -3727 4401 8290 5638 -953 3175 2576 -3115 -11296 -10829 -5571
40e571G36d382C327K850E02c893q215B743K257h253J533k201c468C567O507l666
$$ -5571 736 -4382 3327 6177 502 -3893 -12108 2743 5000 -8253 -6720 -8921 -3468 3567 10074 6408
24F408B276a331o052b580l63G82M763j016a640d6p366C191a3k391A616C01f048
$$ 6408 2276 -1331 -7383 -2580 -2943 782 5545 4529 -1640 -46 -7412 3191 -13 -2404 1616 301 -6048
6a3235j259P063a839A207b683A088
$$ -13235 -14494 -7431 -1839 1207 -2683 1088
##PAGE= F1=1061.654321898
##FIRST=     2915.55639409065, 2671.18566176471, 3640
##DATA TABLE= (F2++(Y..Y)), PROFILE
1023C640b85n422J403J100O74l198j013J067b824i62j685B199m84f70k774j724
$$ 3640 -285 -5707 -4304 -3204 -2530 -5728 -6741 -5674 -2824 -962 -2647 2199 1715 -670 -3444 -5168
1007e168k96q23K889A896L545b070j67H128k234A199c194n860M074b446A866d660
$$ -5168 -5464 -6287 -3398 1896 5441 -2070 -2237 8128 5894 1199 -3194 -9054 -4980 -2446 1866 -4660
990e639k655a885o811L568A242g521l24k01b622p00G92c070C680d051k347b603
$$ -5639 -8294 -1885 -8696 -5128 1242 -7521 -7845 -8046 -2622 -3322 792 -3070 3680 -4051 -6398 -2603
973d032n67J429J494g50K84r347M074J097a583m17Q13D44J637B43r2J022b994
$$ -4032 -4599 -3170 -1676 -750 -466 -9813 -5739 -4642 -1583 -2000 -1187 444 2081 243 151 1173 -2994
955e533m682B37i503j669M537J126K04P99j589m622k983M198K475m78k784J072
$$ -5533 -10215 237 -9503 -11172 -6635 -5509 -5305 -4506 -6095 -10717 -13700 -9502 -7027 -7505 -10289 -9217
939i217b751r186e444K199A2774I46e989d20o30k575n497K872N18k6j037k154
$$ -9217 -2751 -11937 -5444 -3245 12774 946 -5989 -420 -1050 -3625 -9122 -6250 -5732 -5758 -6795 -8949
923h949k08K735L88k129k154Q02K867J398k35K81K254E34K246a0k843o753k304
$$ -8949 -9157 -6422 -6034 -8163 -10317 -9515 -6648 -5250 -5485 -5204 -2950 534 2780 -10 -2853 -9606 -11910
906a1910J369c41E97a214k529j220A281f075k223A4906J984o169L164C687P558
$$ -11910 -10541 -341 597 -1214 -3743 -4963 1281 -6075 -8298 14906 16890 10721 13885 3687 11245
891A1245J218j552L712m911d274D693G21a921m299b905l459k794K893b048l47
$$ 11245 12463 10911 14623 9712 -4274 4693 721 -1921 -6220 -2905 -6364 -9158 -6265 -2048 -2395
876b395C030j378h71l943m791j189M107b413r053M747a738j087k68J433A104a0523
$$ -2395 3030 1652 -871 -4814 -9605 -10794 -6687 -2413 -11466 -6719 -1738 -2825 -3093 -1660 1104 -10523
859D133a1290B153d038m194F66g89m447a252k830J728a017C38d49p04j374k283
$$ 4133 -11290 2153 -4038 -8232 666 -789 -5236 -1252 -4082 -2354 -1017 338 -449 -1153 -2527 -4810
843d810k949j649M087F96a0454E372M228l438A113f065n591j121M494K428L33
$$ -4810 -7759 -9408 -5321 696 -10454 5372 9600 6162 1113 -6065 -11656 -12777 -8283 -5855 -5522
828e522m947L850b603A524K344M841N54D226h655m179C02b045j732j2502g279
$$ -5522 -10469 -6619 -2603 1524 3868 8709 9263 4226 -8655 -12834 302 -2045 -3777 -16279 -7279
812e724p765k476k116N768A544A47d308j938p90K402a301k395p99r681A253c374
$$ -5724 -13489 -15965 -18081 -12313 1544 147 -4308 -6246 -7036 -4634 -1301 -3696 -4495 -14176 1253 -3374
795h603j349L737a776n481j069L202G541C59M777B069a292p912K850r37N39J964
$$ -8603 -9952 -6215 -1776 -7257 -8326 -5124 7541 359 5136 2069 -1292 -9204 -6354 -7291 -6752 -4788
779d788r12b659i57C426j51g956b964l018J658a302l054m667l064K858d381a731
$$ -4788 -5700 -2659 -957 3426 3275 -7956 -2964 -5982 -4324 -1302 -4356 -9023 -12087 -9229 -4381 -1731
762g65p564f9j705O78j90l44F038J200a0244A603a184j190l071l654n02J446K18
$$ -765 -8329 -69 -1774 -1096 -1286 -1630 6038 7238 -10244 1603 -1184 -2374 -5445 -9099 -9601 -8155 -7937
745g937j515k423O39K994K263J218J709f25m028J173B876A34a4060J844e505A606
$$ -7937 -9452 -11875 -11236 -8242 -5979 -4761 -3052 -625 -4653 -3480 2876 134 -14060 -12216 -5505 1606
728B030c748B410P98R93A859f864L36A66N177J902J339h46j089d51o626k605n89
$$ 2030 -3748 2410 3208 4201 1859 -6864 -6528 166 5343 7245 8584 -846 -1935 -451 -7077 -9682 -10271
711a0271e044r6k357l472l378K018J634K207L799a119k517m292c679B634d338
$$ -10271 -5044 -5140 -7497 -10969 -14347 -12329 -10695 -8488 -4689 -1119 -3636 -7928 -3679 2634 -4338
695a3180f231A97N098A728i173a502p150P93O29C584I67b337i31D630J218K037
$$ -13180 -6231 197 5295 1728 -9173 -1502 -8652 -7859 -7230 3584 967 -2337 -931 4630 5848 7885
679G885O59C694i650k961f226D36a553l120j512k07J92J132J516J375k325a489
$$ 7885 8544 3694 -9650 -12611 -6226 436 -1553 -4673 -6185 -6392 -6200 -5068 -3552 -2177 -4502 -1489
662a266p588J634k899j483K42J007K671b457C998L470b717E829N964L117J769
$$ -1266 -8854 -7220 -10119 -11602 -11360 -10353 -7682 -2457 3998 7468 -2717 5829 11793 14910 16679
647A6679B850e633K088i5p945P73R65L15K208l300H74M38c058l907C252C63J871
$$ 16679 2850 -5633 -3545 -95 -8040 -7267 -6302 -5987 -3779 -7079 874 1312 -3058 -6965 3252 363 2234
630B234a0274j0686A805O66a3453I16h784K555N45j895k153j843R98K875L174
$$ 2234 -10274 -20960 1805 2471 -13453 916 -8784 -6229 -5684 -7579 -9732 -11575 -10577 -7702 -4528
615d528J281p47k522l850j200J099J615J950K232C63L500J706m30j894A418h667
$$ -4528 -3247 -3994 -6516 -10366 -11566 -10467 -8852 -6902 -4670 363 3863 5569 5139 3245 1418 -8667
598D54K309Q54j243a373p115k699L044L961a418o98L15B148R19d317J048e23j512
$$ 454 2763 3617 2374 -1373 -8488 -11187 -8143 -4182 -1418 -2116 -1801 2148 3067 -4317 -3269 -523 -2035
581b035G234L25e611A06J433p52d0q443I36J41J045P95a0290M997i14l321l081
$$ -2035 7234 7559 -5611 106 1539 787 -40 -8483 936 1077 2122 2917 -10290 -5293 -914 -4235 -7316
564g316j839O30K380K670L19r736M446c737B44h636A1412j54h57l139n390j137
$$ -7316 -9155 -8525 -6145 -3475 -3156 -12892 -8446 -3737 244 -8636 11412 11258 -857 -3996 -9386 -10523
548a0523k402L477K146L58m90j329m133M227J79K17J220k875b336Q24K00l913
$$ -10523 -12925 -9448 -7302 -6944 -7434 -8763 -12896 -8669 -8490 -8273 -7053 -9928 -2336 -1512 -1312 -5225
532e225o46k065j067J72Q51J076j041r22h62o355j497D63R544K313f038A963b057
$$ -5225 -5871 -7936 -9003 -8831 -7980 -6904 -7945 -8867 -862 -7217 -8714 463 10007 12320 -6038 1963 -2057
514F957j413a412r96m404m211j863J425J326l52J578J053K421k109J683l82F526
$$ 6957 5544 -1412 -2408 -6812 -11023 -12886 -11461 -10135 -10487 -8909 -7856 -5435 -7544 -5861 -6243 6526
497C617e855l483d263J223n428j355O68m120N786a988F57e825l179c822j936k75
$$ 3617 -5855 -9338 -4263 -3040 -8468 -9823 -9155 -13275 -7489 -1988 657 -5825 -9004 -3822 -5758 -6033
481f033J802i81j1380h75H146Q08q59j961c865l55A24a2031a014B357A3c000R72
$$ -6033 -4231 -981 -12361 -875 8146 8954 8095 6134 -3865 -4220 124 -12031 -1014 2357 13 -3000 -2028
464b028G21J701n18f86k366j663l596k696Q12d563c98p483k327d206j200b389
$$ -2028 721 2422 1904 -686 -3052 -4715 -8311 -11007 -10195 -4563 -398 -7881 -10208 -4206 -5406 -2389
447i634M283F069B702a1860N584k788l721N061l763J489E429M966j757k906A890
$$ -9634 -5351 6069 2702 -11860 -6276 -9064 -12785 -7724 -11487 -9998 5429 10395 8638 5732 1890
431c032n387l058K221J961P15p07j630k371m04L826b724k117C178J0728l600A109
$$ -3032 -8419 -11477 -9256 -7295 -6580 -7287 -8917 -11288 -11692 -7866 -2724 -4841 3178 13906 10306 1109
414a916p140B633b943I54L165k039d18l590l809k388j047n58j958K416M578k544
$$ -1916 -9056 2633 -2943 954 4119 2080 -418 -4008 -7817 -10205 -11252 -11810 -13768 -11352 -6774 -9318
398i318l27j473b057l809A879k30Q6L14a0328M206I14e16k045p999b422q97j668
$$ -9318 -9645 -11118 -2057 -5866 1879 1649 1735 2049 -10328 -6122 914 -516 -2561 -10560 -2422 -3319 -4987
381d987m212L74j03J838J092p76k786m61o83L731LK144a01E099o47a096m744k28
$$ -4987 -9199 -8825 -8928 -7090 -5998 -6774 -9560 -10021 -10704 -6973 -6970 -4826 -101 5099 4452 -1096 -5840 -6068
363f068o76m70A519M954h823b832F979k267A032c099j077a580A543L73i81n383
$$ -6068 -6744 -7214 1519 6473 -8823 -2832 6979 4712 1032 -3099 -4176 -1580 1543 1916 -981 -6364
347f364m324b528G359a305p247a05l176o906M495j196F007J1404P353p828Q501
$$ -6364 -10688 -2528 7359 -1305 -8552 -105 -3281 -10187 -5692 -6888 6007 17411 24764 16936 25437
332B5437k419o222q120A480g77C051M297K714R29a573c8F474H07f98B849L4408
$$ 25437 23018 16796 8676 1480 -777 3051 7348 10062 10991 -1573 -38 6474 807 -698 2849 37257
316C7257K4412n950M5733K1732K554k1694J66278K53851J40425k53692A01057
$$ 37257 61669 55719 101452 123184 125738 104044 270322 524173 664598 410906 101057
304G1800C469K517K743B197d81n5l246m191c798a687h31c10K3J39q298C508P865
$$ 71800 3469 5986 8729 2197 -481 -536 -3782 -7973 -3798 -1687 -831 -310 -287 -148 -8446 3508 11373
287A1373K368E109K137f467F937A992b086l971n571J285J100L929K099M38l07
$$ 11373 13741 5109 7246 -6467 6937 1992 -2086 -6057 -11628 -10343 -9243 -5314 -3215 -2777 -3084
272c084j208o163j44d357m101R61J4j819k181j726K215N317C81f99p099J767b958
$$ -3084 -4292 -10455 -10599 -4357 -8458 -7497 -7483 -9302 -11483 -13209 -10994 -5677 381 -699 -7798 -6031 -2958
254b951l807k497p65C62b750o833Q16c763F01M123M233A909C21g682K623F987
$$ -2951 -6758 -9255 -10020 362 -2750 -9583 -8767 -3763 601 4724 8957 1909 321 -7682 -5059 6987
237I7f078l532M37M218A686g481O34A3024k474h035a864B203L074h22G89d49j11
$$ 97 -6078 -9610 -9173 -4955 1686 -7481 -6847 13024 10550 -8035 -1864 2203 5277 -822 789 -449 -560
220e60n81k413m121k180K880L408a291d1n435F4b325j0518c856n606D328d26k697
$$ -560 -1141 -3554 -7675 -9855 -6975 -3567 -1291 -41 -5476 64 -2325 -12843 -3856 -9462 4328 -426 -3123
203c123O40o444l292K326R54N0K196o859a316A2203D612i176j629e29H95J692
$$ -3123 -2483 -8927 -12219 -9893 -8939 -8889 -6693 -13552 -1316 12203 4612 -9176 -10805 -529 895 2587
187B587j269a417l348K081a101g6p002K265b261n789n872M959c724a69I89B16
$$ 2587 1318 -1417 -4765 -2684 -1101 -76 -7078 -4813 -2261 -8050 -13922 -8963 -3724 -169 989 216
170b451m701l553L508b375k355j756o109e907J993m858l861L434d157f60F75C01
$$ -2451 -7152 -10705 -7197 -2375 -4730 -6486 -12595 -5907 -3914 -8772 -12633 -9199 -4157 -660 675 301
153f306b815K93I13N379O270j761e172A0022j249j152a602r008o42M691K801a776
$$ -6306 -2815 -2522 913 6292 12562 10801 -5172 10022 8773 7621 -1602 -10610 -11252 -6561 -3760 -1776
136b567Q16B19e62k382B499c69m474B452p6j050a594o949l392J36L150L835a521
$$ -2567 -1751 219 -562 -2944 2499 -369 -4843 2452 2376 1326 -1594 -8543 -11935 -11799 -8649 -4814 -1521
118F87e135k83a52j286j455j249j961k859A838J246f772m896M62b544A385f27
$$ 687 -5135 -5418 -152 -1438 -2893 -4142 -6103 -8962 1838 3084 -6772 -11668 -11206 -2544 1385 -627
101h758o50Q52c001q33m168L263o131l729O432o733l257L048K155j349O101O27
$$ -8758 -9408 -8556 -3001 -3834 -8002 -4739 -10870 -14599 -8167 -14900 -18157 -15109 -12954 -14303 -8202 -7575
85g575m150k313M621K334b834L03k000m159m687L169j77c770j0071N936O87c541
$$ -7575 -11725 -14038 -9417 -7083 -2834 -2531 -4531 -8690 -13377 -10208 -10385 -3770 -13841 -7905 -7218 -3541
68c106e0G454d20I171D251f394r87L399m146p9b82A536Q53b866o463L552n998
$$ -3106 -50 7454 -420 9171 4251 -6394 -7381 -3982 -8128 -8207 -282 1536 2389 -2866 -9329 -5777 -11775
51a1775A835N362P843l208H25A48e004j964a868B642d606A116b733E463P960D228
$$ -11775 1835 7197 15040 11832 825 148 -5004 -6968 -1868 2642 -4606 1116 -2733 5463 13423 4228
34c711p029o71n443M375M295J113a837C07L56e85l528o114k038c988C214K078
$$ -3711 -10740 -11411 -16854 -12479 -8184 -7071 -1837 307 663 -585 -4113 -10227 -12265 -3988 3214 5292
18E292L066l261b104q561M695C381a281j895C356j270o90c750n571K901a84r9
$$ 5292 8358 5097 -2104 -10665 -5970 3381 -1281 -3176 3356 2086 1396 -3750 -9321 -6420 -184 -283
2b83k885A452
$$ -283 -3168 1452
##PAGE= F1=1059.043192219
##FIRST=     2915.55639409065, 2671.18566176471, 3127
##DATA TABLE= (F2++(Y..Y)), PROFILE
1023C127I27e501J154n095j245K212L974d80B620c619a773C255c54m969m078k166
$$ 3127 927 -5501 -4347 -9442 -10687 -8475 -4501 -480 2620 -3619 -1773 3255 -354 -5323 -9401 -11567
1007a1567j664l369m406O940c697Q78n665I627J348D542a989r469d956b433F870
$$ -11567 -13231 -16600 -21006 -14066 -3697 -2819 -8484 9627 10975 4542 -1989 -11458 -4956 -2433 6870
991B032a1969L270j492M14K407l274o049L378O275K036k097A755a81B928h442
$$ 2032 -11969 -8699 -10191 -9777 -7370 -10644 -16693 -13315 -7040 -5004 -7101 1755 -181 2928 -8442
975a2351o578Q606c116B794c320B242k4i882d483n71b228A831Q09p00J789F91
$$ -12351 -18929 -10323 -3116 2794 -3320 2242 2218 -9882 -4483 -5054 -2228 1831 2640 1940 3729 691
958a30l005o654o913M454d035k826m566N344l899B278O967B008h095o569N435
$$ -130 -3135 -9789 -16702 -12248 -4035 -6861 -11427 -6083 -9982 2278 9245 2008 -8095 -14664 -9229
943i229c755k092a778a05k484p773d823k92E485c657k383i67l263g96m033E029
$$ -9229 -3755 -5847 -1778 -105 -2589 -10362 -4823 -5115 5485 -3657 -6040 -967 -4230 -796 -4829 5029
926D48a636G39b742B368J613d019n976k515L795a46D497B081a804E277L528B100
$$ 448 -1636 739 -2742 2368 3981 -4019 -9995 -12510 -8715 -146 4497 2081 -1804 5277 8805 2100
909c831I79f408k083k88c77l08l459m716j183d716R08n309I010J410p05j294l854
$$ -3831 979 -6408 -8491 -8779 -377 -685 -4144 -8860 -10043 -4716 -3808 -9117 9010 10420 9715 8421 4567
892D567j024A132g02j888k871m275m463l337L045K56N6L616J857b076P37c64A759
$$ 4567 3543 1132 -702 -2590 -5461 -9736 -14199 -17536 -14491 -14235 -14179 -10563 -8706 -2076 -1339 -364 1759
874a40l223m461n210k849K864L474j615K142M468K041a190R0j722p673J838j793
$$ -140 -3363 -7824 -13034 -15883 -13019 -9545 -11160 -9018 -4550 -2509 -1190 -1100 -2822 -10495 -8657 -10450
858a0450J8J040J674L266d04k850j82a449l20l479E06c945l406k180l89J241K033
$$ -10450 -10432 -9392 -7718 -4452 -404 -3254 -3436 -1449 -1769 -5248 506 -3945 -7351 -9531 -9920 -8679 -6646
841f646L284F49e978F212K636I78c241a89n614O68B66O763A323e592b266A022
$$ -6646 -3362 649 -5978 6212 8848 978 -3241 -189 -5803 -5135 266 7029 1323 -5592 -2266 1022
824B58d533F267J1756p716i971m104N42N456a548j8105b239C101b4479j650O242
$$ 258 -4533 6267 18023 10307 -9971 -14075 -13533 -8077 -1548 -19653 -2239 3101 -24479 -26129 -19887
809a9887Q776A6226n813a651p67j382a073k035j568O59p021B18d707n418o9J899
$$ -19887 -11111 16226 10413 -1651 -2418 -3800 -1073 -3108 -4676 -4017 -11038 218 -4707 -10125 -10194 -8295
793h295K216J767k504l57J460l503l239K173M315m968L958b514j480j577j987
$$ -8295 -6079 -4312 -6816 -7173 -5713 -9216 -12455 -10282 -5967 -10935 -6977 -2514 -3994 -5571 -7558
778g558j909k363k339J088L876K571j198P98K606l629m979m843L236L411K602
$$ -7558 -9467 -11830 -14169 -13081 -9205 -6634 -7832 -7034 -4428 -8057 -13036 -17879 -14643 -11232 -8630
763h630K316o629a294C46Q71J373c504F052J489f932G0J147c670j735m53K272
$$ -8630 -6314 -12943 -1294 346 1217 2590 -3504 6052 7541 -6932 70 1217 -3670 -5405 -5858 -3586
747c586P90l137m250l799N930p33a771A367C85o8c826k3o52l245k639L38b367
$$ -3586 -2796 -5933 -10183 -13982 -8052 -8785 -1771 1367 385 317 -3826 -3849 -4501 -7746 -10385 -10047 -2367
729D390r20b412D623K278L085l020d003k942A280M544o87j383A08c425o504o090
$$ 4390 3470 -2412 4623 6901 9986 6966 -4003 -6945 1280 5824 5137 3754 108 -3425 -9929 -16019
713a6019O597L274K296o68j859k191n043M170l14r82o63N97J295P28K215i07A736
$$ -16019 -9422 -6148 -3852 -4520 -6379 -8570 -13613 -9443 -9757 -10739 -11402 -10805 -9510 -8782 -6567 -907 1736
695D970O37J0624k533d084n551a211j1905a232l372N16J678l945c046o589k945
$$ 4970 5607 16231 13698 -4084 -9635 -1211 -13116 -1232 -4604 -4088 -2410 -6355 -3046 -9635 -12580
680a2580d476D180K265e582k648K353J406M24o106j394O72J62K408c931d35l785
$$ -12580 -4476 4180 6445 -5582 -8230 -5877 -4471 -4047 -10153 -11547 -10875 -10713 -8305 -3931 -435 -4220
664d220A493a646m737n791M277o821N882m052K683a175E519A121b883B081P828
$$ -4220 1493 -1646 -6383 -12174 -7897 -14718 -8836 -12888 -10205 -1175 5519 1121 -2883 2081 9909
649I909J722O74I71e133p68a529p659q46j547J30J578L591b333G73B74c768B927
$$ 9909 11631 12305 971 -5133 -5901 -1529 -9188 -10034 -11581 -11451 -9873 -6282 -2333 773 274 -3768 2927
631a733h7j1240k3531a1031K485p581P212m124M636J941O22j37K401e47m196A450
$$ -1733 -87 -11327 -34858 -11031 -8546 -16127 -8915 -13039 -8403 -6462 -5840 -5977 -3576 -547 -4743 1450
614A382J682j426i240J103H73J4501l227c038A126N889j88l15j152k262f289L021
$$ 1382 3064 1638 -9240 -8137 873 15374 12147 -3038 1126 7015 6827 6512 5360 3098 -6289 -3268
598c268N28B205L012k196h318d138J168j150j798P05K94l24m89Q27J402a33j679
$$ -3268 -2740 2205 5217 3021 -8318 -4138 -2970 -4120 -5918 -5213 -4919 -5243 -5732 -4905 -3503 -133 -1812
581a812I95K207i946F41Q762D687c37o784k796M571D090A220i698M017C35a570
$$ -1812 995 3202 -9946 641 9403 4687 -337 -7121 -9917 -5346 4090 1220 -9698 -5681 335 -1570
564f861P99J690B725J602c650l899e11l202m80n957A0464m474f858p17J381i72
$$ -6861 -6062 -4372 2725 4327 -3650 -7549 -511 -3713 -4193 -10150 10464 5990 -6858 -7575 -6194 -972
547A622O962j211a0153B859c74r891c666j490k267j431N21b194g6o06m516J468
$$ 1622 8584 7373 -10153 2859 -374 -10265 -3666 -5156 -7423 -8854 -8333 -2194 -76 -682 -5198 -3730
531c730O99j590j092j314j922j754o61k48j63j120M2L389c747K18Q14l113F717
$$ -3730 -3031 -4621 -5713 -7027 -8949 -10703 -11364 -11612 -11775 -12895 -12853 -9464 -3747 -3529 -2715 -5828 6717
513H363D02c17F425k71a0603K63J27M785o976J249N480m168K065J8a556j035n083
$$ 8363 402 -317 6425 6154 -10603 -10340 -10213 -5428 -12404 -11155 -5675 -9843 -7778 -7760 -1556 -2591 -7674
496g674l474L908j12k626j952n34R96J152J822J520J541k870h80B956M188L612
$$ -7674 -11148 -7240 -7352 -9978 -11930 -12464 -11468 -10316 -8494 -6974 -5433 -8303 -880 2956 7144 10756
480A0756D633a3121b157E313m23d670r498e273J918b3q617a456f79D768p63j158
$$ 10756 4633 -13121 -2157 5313 4890 -4670 -14168 -5273 -3355 -23 -8640 -1456 -679 4768 4005 2847
464B847l09A244a982n133m760k87K839J572O15j87o59p63n85n97q47q93K07J391
$$ 2847 2538 1244 -1982 -7115 -11875 -12162 -9323 -7751 -7136 -7323 -7982 -8745 -9330 -9927 -10774 -11667 -11460 -10069
446a0069K173J926o680c453j604o599K191j285N271D03Q43k79D15M33J445K005
$$ -10069 -7896 -5970 -12650 -3453 -5057 -11656 -9465 -10750 -5479 403 1246 967 415 848 2293 4298
430D298J562K45n27j150j248j36L98J264j233c697n23m674l805J045L732K264
$$ 4298 5860 6105 5578 4428 3180 3044 3442 4706 3473 -3697 -4220 -8894 -12699 -11654 -7922 -5658
414e658q54l59l564k285M785c247g96p84l094l203j202M60P07j053rK492k136
$$ -5658 -6512 -6871 -10435 -12720 -7935 -3247 -796 -1580 -4674 -7877 -9079 -8619 -7912 -8965 -8974 -6482 -8618
397h618L092A639P68K950j390L878C477a1378d963l35o8J671J90k937m464k077
$$ -8618 -5526 1639 2407 5357 3967 7845 3477 -11378 -4963 -5298 -5366 -3695 -3505 -6442 -10906 -12983
381a2983K412J982j95J809b994A603c828n047Q88b913n327M89h85C923J118b704
$$ -12983 -10571 -8589 -8784 -6975 -2994 1603 -3828 -8875 -7987 -2913 -8240 -7751 -885 3923 5041 -2704
364a411j965n009R58B068M503g213c308B360M45C21e589o818O067F55M109K484
$$ -1411 -3376 -8385 -7427 2068 6571 -7213 -3308 2360 2805 321 -5589 -12407 -6340 655 4764 7248
348G248L390M536B947L227c639o24D71b904n937b66C135Q2N653R174H915k274
$$ 7248 10638 15174 2947 6174 -3639 -4263 471 -2904 -8841 -266 3135 3217 8870 18044 8915 6641
332F641K8107n200q696I979a129o206K194L41j197b700A720N265B67N767A902
$$ 6641 34748 29548 20852 9979 -1129 -7335 -5141 -4800 -5997 -2700 1720 6985 267 6034 1902
316A8304L6730P248O0902J37465k7700K2269M6045L76139J68542r1490B61149
$$ 18304 55034 62282 123184 260649 232949 255218 301263 677402 845944 754454 261149
304A83452D5895n375c799H282m05A754f889k094R70J179j68k947j98e015k808
$$ 183452 45895 40520 -3799 8282 7877 1754 -6889 -8983 -8013 -6834 -7002 -9949 -10147 -5015 -7823
289g823C427K118j046B213a93o849L050k138k252k996k432N888K848K095I688
$$ -7823 3427 5545 4499 2213 -193 -7042 -3992 -6130 -8382 -11378 -13810 -7922 -5074 -2979 9688
273A1088E230f538q98J290j25k594Q36J671j828j886K801b781Q27C71J155g679
$$ 11088 5230 -6538 -7436 -6146 -6271 -8865 -8029 -6358 -8186 -10072 -7271 -2781 -1954 371 1526 -7679
256a0785K189c411l66n041P12b404C18K72b881H14m2L795L97B335b145n544r34
$$ -10785 -8596 -3411 -3777 -8818 -8106 -2404 318 590 -2881 814 772 4567 4964 2335 -2145 -7689 -8623
239h623p09K633Q64r71n048d950b050n770a811c82q06q132b180g59b40E99j70
$$ -8623 -9332 -6699 -5835 -6806 -11854 -4950 -2050 -7820 -1811 -382 -1188 -9320 -2180 -759 -240 599 429
222D29a306m028n540K510c324g24o10k245J607E308i408a517k198n944c194q444
$$ 429 -1306 -5334 -10874 -8364 -3324 -724 -1334 -3579 -1972 5308 -9408 -1517 -3715 -9659 -3194 -11638
206a1638C353b701k932e48q288J397M07N47o77J576o752c543A2975n585a0883
$$ -11638 3353 -2701 -5633 -548 -8836 -7439 -7032 -6485 -7162 -5586 -12338 -3543 12975 7390 -10883
190a3295e647j898k23k37m01Q44L176K043j991r101N816D377a83n821l841d025
$$ -13295 -5647 -7545 -7768 -8005 -8406 -7562 -4386 -2343 -4334 -13435 -7619 4377 -183 -6004 -9845 -4025
173C264O25K875L371D807c183o472c685J239l894k785a824r04n684k675L182j922
$$ 3264 3889 6764 10135 4807 -3183 -9655 -3685 -2446 -6340 -9125 -1824 -2728 -8412 -11087 -7905 -9827
157i827K375L102K067l838K552k246J67b408A992L324d192F039B414c248o333
$$ -9827 -7452 -4350 -2283 -6121 -3569 -5815 -5648 -2408 1992 5316 -4192 6039 2414 -3248 -9581
142i581m042N685c626a727p98k485k101L30j943B49P196k240m08J037A939q43
$$ -9581 -13623 -7938 -3626 -1727 -2525 -5010 -7111 -6781 -8724 249 7445 5205 4797 5834 1939 1096
126A096c809p378c995b43o282f38F5J321e837J425D008j005G18b134k507q626
$$ 1096 -3809 -11187 -3995 -243 -6525 -638 65 1386 -5837 -4412 4008 3003 718 -2134 -4641 -13267
110a3267b108A948b320n531j74a040B030a660o793a980F83d72H66h761a255n572
$$ -13267 -2108 1948 -2320 -7851 -8025 -1040 2030 -1660 -8453 -1980 683 -472 866 -8761 -1255 -6827
94f827n415k665r553g215g56n840K421k450l379K202c876a919n334L094l983k382
$$ -6827 -12242 -14907 -24460 -7215 -756 -6596 -4175 -6625 -10004 -7802 -3876 -1919 -7253 -4159 -8142 -10524
78a0524e232Q83H837f189J696n209a042c26k410j868J23a362N30H606j984h230
$$ -10524 -5232 -4349 8837 -6189 -4493 -9702 -1042 -326 -2736 -4604 -4481 -1362 -832 8606 6622 -8230
61D831k247d803q383N08e363H0d182k290J319l681E881R24B359c071l619J960
$$ 4831 2584 -4803 -13186 -12678 -5363 80 -4182 -6472 -5153 -8834 5881 6805 2359 -3071 -6690 -4730
45d730d65B338P00q95e611d01j035IL28e88l218l698m799J527J004K227L229a257
$$ -4730 -465 2338 3038 2143 -5611 -401 -1436 9 337 -588 -3806 -7504 -12303 -10776 -9772 -7545 -4316 -1257
26E803L652C047f148l617a714j474k389R7J72j119k816k798J272M296K905m58
$$ 5803 9455 3047 -6148 -9765 -1714 -3188 -5577 -5480 -5308 -6427 -9243 -12041 -10769 -6473 -3568 -4026
10d026f68k019m715o556q27e649b816j104q83I31
$$ -4026 -668 -2687 -7402 -13958 -14785 -5649 -2816 -3920 -4803 931
##PAGE= F1=1056.43206254
##FIRST=     2915.55639409065, 2671.18566176471, -12347
##DATA TABLE= (F2++(Y..Y)), PROFILE
1023a2347J860J988K201J272Q28Q62i42o70B324e385H65L389N011B077c569B999
$$ -12347 -10487 -8499 -6298 -5026 -4198 -3336 -942 -1612 2324 -5385 865 4254 9265 2077 -3569 2999
1006g110a867o50j2250j913f291l122I899K316n307i91r814L212J706o285l649
$$ -7110 -1867 -2517 -14767 -16680 -6291 -9413 9899 12215 6908 -991 -10805 -7593 -5887 -12172 -15821
991a5821M98J253o53l622m550K233Q287c749m520c934o596B387r71e2r447j430
$$ -15821 -15323 -14070 -14723 -18345 -22895 -20662 -12375 -3749 -8269 -3934 -10530 2387 1416 -52 -9499 -10929
975a0929j0784O976d508A010e924C065j119i463a986j507k268k71K605F8K378
$$ -10929 -21713 -14737 -4508 1010 -5924 3065 1946 -9463 -1986 -3493 -5761 -6032 -3427 68 2446
960B446B86b577l398n96l991m63d935k185q87B26i864D469Q208j193A215e317
$$ 2446 286 -2577 -5975 -6571 -10562 -11025 -4935 -7120 -8007 226 -9864 4469 12677 11484 1215 -5317
943e296K614m769E320L53d051l266K457j528K549q917j14c366l650C777GO183
$$ -5296 -2682 -7451 5320 5673 -4051 -7317 -4860 -6388 -3839 -12756 -12870 -3366 -7016 3777 7 6190
927F190B336a161l245j5664N838A08a644l391m645K368a517B571d388o263R51
$$ 6190 2336 -1161 -4406 -20070 -14232 108 -1644 -5035 -9680 -7312 -1517 2571 -4388 -10651 -9700
912i700L422J291m123K879b786r074e223C094C14i96A662a2834d930a427j935
$$ -9700 -6278 -4987 -9110 -6231 -2786 -11860 -5223 3094 314 -996 1662 -12834 -4930 -1427 -3362
897c362A1630J0413H280P721E000d829o803j985P31J272K39K177J055k325J112
$$ -3362 11630 22043 8280 16001 5000 -4829 -11632 -13617 -12886 -11614 -11375 -9198 -8143 -10468 -9356
882i356r28l83J38q60j850l068l749k970K45L10j698J189O238L216N145j937E52
$$ -9356 -10284 -10667 -10529 -11389 -13239 -16307 -20056 -23026 -22781 -22471 -24169 -22980 -16742 -13526 -8381 -10318 552
864B878R266M004G046a0538c347m785C26g609J147K955A187a709m792d42l90l555
$$ 2878 12144 16148 7046 -10538 -3347 -8132 326 -7609 -6462 -3507 1187 -1709 -6501 -442 -832 -4387
848d387gn066m845l735r04J854K644L041K605K044J166N73k631p19l429J54Q95
$$ -4387 -7 -5073 -9918 -13653 -14557 -12703 -10059 -7018 -4413 -2369 -1203 -630 -3261 -3980 -7409 -7255 -6360
831f360J711E444k621a230A26L502E21a3175b002A9947m090e930r067f840B789
$$ -6360 -4649 5444 2823 -1230 126 3628 521 -13175 -2002 19947 15857 -5930 -14997 -6840 2789
815A354a5716D684Q301c9928n167K1421f126A739c740j650P40R79J62n25j234
$$ 1354 -15716 4684 12985 -39928 -45095 -23674 -6126 1739 -3740 -5390 -4650 -3671 -3509 -4034 -5268
800e268p47m465o334p451O468O823e318a867J24m394j159k716n235m22N330M859
$$ -5268 -6015 -10480 -16814 -24265 -17797 -10974 -5318 -1867 -1743 -6137 -7296 -10012 -15247 -15669 -10339 -5480
784e480n024J158K969l704l190j756J769N193g87j908o116l42J79K092I185m546
$$ -5480 -10504 -9346 -6377 -10081 -13271 -15027 -13258 -8065 -787 -2695 -8811 -9153 -8974 -6882 9185 4639
768D639i5m522l362k419o83J775j860g51A441Q77L677e692B526M158c810a453
$$ 4639 -95 -4617 -7979 -10398 -11081 -9306 -11166 -751 1441 2318 5995 -5692 2526 6684 -3810 -1453
751C703c647Nj330k904l090j989M85K193K064J70J433j613j027K967K521n69I383
$$ 3703 -3647 -3642 -4972 -7876 -10966 -12955 -12470 -10277 -8213 -8043 -6610 -8223 -9250 -6283 -3762 -4331 9383
733C324g197K151D22L178q03a505E190j265K188N507B48f712a350l386m314l59
$$ 3324 -7197 -5046 422 3600 2797 -1505 5190 3925 6113 11620 248 -6712 -1350 -4736 -9050 -9409
717i409c225K98c70m865k236b868p841l523K726N054m397M492B773K858b598l978
$$ -9409 -3225 -2927 -370 -5235 -7471 -2868 -10709 -14232 -11506 -6452 -10849 -6357 2773 5631 -2598 -6576
701f576k16l618l031J293e965d90A521f92l732k036m137M875o923K230K300K010
$$ -6576 -6792 -10410 -13441 -12148 -5965 -490 1521 -692 -4424 -6460 -10597 -5722 -12645 -10415 -8115 -6105
685f105k952o72M748j873J171eE926L277a756j036j552l927a258l549k204q96
$$ -6105 -9057 -9729 -4981 -6854 -5683 -5 5926 9203 -1756 -2792 -4344 -8271 -1258 -4807 -7011 -7907
669g907k57P68J045O70K24p11k353m005l646m98J366N59j365l225K831O851b341
$$ -7907 -8164 -7396 -6351 -5681 -5457 -6168 -8521 -12526 -16172 -16670 -15304 -14745 -16110 -19335 -16504 -9653 -2341
651f90o65E736J352l88A617c563m777E29a0341M660j175j420a029o835r107N794
$$ -690 -1355 5736 7088 6700 1617 -3563 -8340 529 -10341 -5681 -6856 -8276 -1029 -7864 -16971 -11177
635a1177B069b03C253c370l23r850l3602J7650g703j0947h346r238O745L015B930
$$ -11177 2069 -203 3253 -3370 -3693 -13543 -47145 -29495 -7703 -18650 -8346 -17584 -10839 -7824 2930
619c201A1691M258c872A432P29J870A071d106l076B42J5312l949e58l10A174P470
$$ -3201 11691 15949 -3872 1432 2161 4031 1071 -4106 -7182 242 15554 11605 -558 -868 1174 8644
603H644j333N436m872e276k186m564f006D25K376g816N32K30l506O41L447K920
$$ 8644 7311 12747 7875 -5276 -7462 -12026 -6006 425 2801 -7816 -7284 -7054 -10560 -9919 -6472 -3552
587c552J228j539k329L69f88l15k915J443j1209A036R860n017f11m188k132L153
$$ -3552 -2324 -3863 -6192 -5823 -688 -1003 -3918 -2475 -13684 1036 10896 5879 -611 -4799 -6931 -3778
571c778j0065J116M550c629o42l176l724k372K2J693K493J294j231m752o481i726
$$ -3778 -13843 -12727 -8177 -3629 -4271 -7447 -11171 -13543 -13521 -11828 -9335 -8041 -9272 -14024 -20505 -9726
554i073F374d03q190J41b090B912G90P248B195a0078L113K279k068a707g59j700
$$ -9073 6374 -403 -8593 -8452 -2090 2912 790 8038 2195 -10078 -6965 -4686 -6754 -1707 -759 -2459
538b459l624j0064l658Q020M274J28k431m606m763N27M262K697J61j541M26O040
$$ -2459 -6083 -16147 -19805 -11785 -7511 -7383 -9814 -14420 -19183 -18656 -14394 -11697 -11536 -13077 -12651 -6611
522f611l984b571F090B294d765n904J999a428D215j659m18J1653n936g092l338
$$ -6611 -10595 -2571 6090 2294 -4765 -10669 -8670 -1428 4215 2556 2138 13791 7855 -7092 -10430
507a0430J270G75e271K51N33o675J901J350j328R63j676M69K86L155a245n238
$$ -10430 -9160 775 -5271 -5020 -4487 -11162 -9261 -7911 -9239 -8276 -9952 -9483 -9197 -6042 -1245 -6483
491f483k296M16p776k849J238M159f430B406Q143N775j701E103a1372B214e344
$$ -6483 -8779 -8363 -16139 -18988 -17750 -13591 -6430 2406 10549 16324 14623 5103 -11372 2214 -5344
475C529g010m851e585K614J328k627a603k202B180J287A255a126l490n117o655
$$ 3529 -7010 -11861 -5585 -2971 -1643 -4270 -1603 -3805 2180 3467 1255 -1126 -4616 -9733 -16388
460a6388m402N521M789L773b919f1I24e11l670n068m408j073J671J466L81k90
$$ -16388 -20790 -15269 -10480 -6707 -2919 -61 924 -511 -4181 -9249 -13657 -14730 -13059 -11593 -11212 -11502
444a1502j262M447R24l298j270p50M037b483B162Q85b51o084n642J800d845K222
$$ -11502 -12764 -8317 -7393 -10691 -11961 -12711 -8674 -2483 2162 3047 -251 -6335 -11977 -10177 -4845 -2623
428b623j648m472j888d304C953O794k305d485J627q54I859q89m457B144a799I56
$$ -2623 -4271 -8743 -10631 -4304 3953 10747 8442 -4485 -2858 -3712 9859 8970 4513 2144 -1799 956
411G80d099o163k916L853L365J84k867n489n260k034K962O30j516r35L194N974
$$ 780 -4099 -10262 -13178 -9325 -5960 -5776 -8643 -14132 -19392 -21426 -18464 -17834 -19350 -20285 -17091 -11117
395a1117d902A010K037p30c151q941n466h556a527l465b294m533J317b375o340
$$ -11117 -4902 1010 3047 2317 -3151 -12092 -17558 -8556 -1527 -4992 -2294 -6827 -5510 -2375 -8715
380h715B294c534q753J124b329K15o466L176b356K61A608R25J403A024h046b408
$$ -8715 2294 -3534 -12287 -11163 -2329 -2114 -8580 -5404 -2356 -2095 1608 2533 3936 1024 -8046 -2408
363E151a0108K777B789M388e085j1584K586L821j020k767L355c036D398N258L716
$$ 5151 -10108 -7331 2789 7177 -5085 -16669 -14083 -10262 -11282 -14049 -10694 -3036 4398 9656 13372
348A3372L872L623c577B473f733B2K68b870o838n790L550M521K609K54J402A469
$$ 13372 17244 20867 -3577 2473 -6733 22 290 -2870 -9708 -15498 -11948 -7427 -4818 -4564 -3162 1469
331H276O392K16k195O025n508E727b197k126k940B915c786m452A0624m812K3941
$$ 8276 14668 14884 12689 18714 13206 5727 -2197 -4323 -7263 2915 -3786 -8238 10624 5812 29753
316B9753O7833k3051N1203J07211L19947Q81364J035227N32273l69232j216601
$$ 29753 97586 74535 125738 232949 552896 1434260 2469487 3001760 2632528 1415927
306A415927C10687j43550o2018l1548C96a8819C762P070K833C074R220n107e076
$$ 1415927 310687 167137 105119 73571 396 -18819 3762 10832 13665 3074 12294 7187 -5076
292e107C394a873n104C909J4440o843H04g034q018L089e741i92B55i509K388k769
$$ -5107 3394 -1873 -6977 3909 18349 11506 804 -7034 -15052 -11963 -5741 -992 255 -9509 -7121 -9890
276i890L258a896g61k653p341o185g009K109m409J61L918K39m392J551A086O12
$$ -9890 -6632 -1896 -761 -3414 -10755 -16940 -7009 -4900 -9309 -9148 -5230 -4991 -9383 -7832 1086 1698
260A698a384p464o355g075m352M996b274n316J379K481B324c936a597p99k005
$$ 1698 -1384 -8848 -15203 -7075 -11427 -6431 -2274 -7590 -6211 -3730 2324 -3936 -1597 -2396 -4401
245d401A391R238C570d613l213k757F38e839o655m878K058L578L383N07e79A989
$$ -4401 1391 10629 3570 -4613 -7826 -10583 638 -5839 -12494 -17372 -15314 -11736 -8353 -7846 -579 1989
228A792h501J41k68B54P847N532m237f138n840j124i57A849M184A965a142B337
$$ 1792 -8501 -8360 -8628 254 8101 13633 9396 -6138 -11978 -13102 -957 1849 6033 1965 -1142 2337
211a1394b913j722j328b478q869B333b087o316b312j866o403L749L165k010b732
$$ -11394 -2913 -4635 -5963 -2478 -11347 2333 -2087 -8403 -2312 -4178 -10581 -6832 -3667 -5677 -2732
195a0716M316G617Ga2370j33K884K436J188k50o44j183k508k848j073R05J778
$$ -10716 -6400 7617 7 -12370 -12503 -9619 -7183 -5995 -6245 -6889 -8072 -10580 -13428 -14501 -13596 -11818
179a1818P02m53j155n34K143M269b851a51E5c357n814n450K479N092M23K342J383
$$ -11818 -11116 -11569 -12724 -13258 -11115 -6846 -2851 -151 55 -3357 -9171 -14621 -12142 -7050 -6627 -4285 -2902
162b902O9q533P73c656I47J985i16m180l792l321k236n22P24J690J593J389N0
$$ -2902 -2833 -11366 -10593 -3656 947 2932 -916 -5096 -8888 -12209 -14445 -14967 -14243 -12553 -10960 -9571 -9521
145i521j504k537r6M687J158E433N767p65C257D09i168M183B453c172n613k290
$$ -9521 -11025 -13562 -13658 -8971 -7813 5433 11200 10435 3257 409 -9168 -4985 2453 -3172 -8785 -11075
129a1075K935L320a999m951n630e040G95e095C0N512k284f504L021l333n252n253
$$ -11075 -8140 -4820 -1999 -6950 -12580 -5040 795 -5095 30 5542 3258 -6504 -3483 -6816 -12068 -17321
113a7321J220L029J106r83l834K266O868J129f97B285H41a320n90B451g43p465
$$ -17321 -16101 -13072 -11966 -12949 -16783 -14517 -7649 -6520 -697 2285 841 -1320 -1910 2451 -743 -8208
97h208o202j897M95J230k316L179K334L615L364a664b61n460b171l267m763n398
$$ -8208 -14410 -16307 -15812 -14582 -16898 -13719 -11385 -7770 -4406 -1664 -261 -5721 -2171 -5438 -10201 -15599
81a5599K78O937g10l702K090A0491c25o923K30f07F38b138m498a597G255c84A5251
$$ -15599 -15321 -8384 -710 -4412 -2322 10491 -325 -7248 -7018 -607 638 -2138 -6636 -1597 7255 -384 15251
63H927i087C320J980A382e241j180C60L92d066a385k565k071a926l810o042j537
$$ 8927 -9087 3320 5300 1382 -5241 -6421 360 752 -4066 -1385 -3950 -6021 -1926 -5736 -11778 -13315
47a3315d775C758P927M681L01B767h231e61k577m377j280l88j491l668J593d767
$$ -13315 -4775 3758 11685 16366 16667 2767 -8231 -561 -3138 -7515 -8795 -9183 -10674 -14342 -12749 -4767
30h138J444a734e67A375O920B681g440L85B554J105A476a800j097Q13e78E55q2
$$ -8138 -6694 -1734 -567 1375 8295 2681 -7440 -7055 2554 3659 1476 -1800 -2897 -2084 -578 555 473
13D73g75n794Q56j562L66L28m21k540l624K741L089J183D06
$$ 473 -775 -6569 -5713 -7275 -6909 -6581 -7002 -9542 -13166 -10425 -7336 -6153 406
##PAGE= F1=1053.820932861
##FIRST=     2915.55639409065, 2671.18566176471, -400
##DATA TABLE= (F2++(Y..Y)), PROFILE
1023d00M7o942L340P85C5a962k212J117A381e450B601Q69Q390c696M49I25h564
$$ -400 -353 -7295 -3955 -3170 35 -1962 -4174 -3057 1381 -5450 2601 3470 11860 -3696 -3247 925 -8564
1005b30I161a0579a291D157g683A1356P182H280A82g460o070k121N644c619a061
$$ -230 9161 -10579 -1291 4157 -7683 11356 18538 8280 182 -7460 -13530 -15651 -10007 -3619 -1061
989c105j091q273r29b910m165C192g082a389q040A796g04k438l403n547l31O000
$$ -3105 -4196 -12469 -13398 -2910 -7075 3192 -7082 -1389 -9429 1796 -704 -3142 -6545 -12092 -12423 -6423
973f423a019j649n657B261d17o602D33a310k895l813j634k644k104K22K530K892
$$ -6423 -1019 -2668 -8325 2261 -417 -7019 433 -1310 -4205 -8018 -9652 -12296 -14400 -14178 -11648 -8756
957h756L019K634e12k777p105J806C653f770E871a571p091n049K90L986d064j817
$$ -8756 -5737 -3103 -512 -3289 -10394 -8588 3653 -6770 5871 -1571 -8662 -13711 -13421 -9435 -4064 -5881
941e881I27J41e364J085j018k512E657a0955L430q694R00P110b211A436J546f96
$$ -5881 927 1068 -5364 -4279 -5297 -7809 5657 -10955 -7525 -16219 -15319 -8209 -2211 1436 2982 -696
924B507H26b139l242k598j701j329k310l643j925L641L314J457l73o08K278c237
$$ 2507 826 -2139 -5381 -7979 -9680 -11009 -13319 -16962 -18887 -15246 -11932 -10475 -10848 -11456 -9178 -3237
907d601o492a613D379b057k19A36h995L300F76K077M214N547o053A2g969j270
$$ -4601 -11093 -1613 4379 -2057 -2276 136 -8995 -5695 676 2753 6967 12514 6461 12 -7969 -9239
891i239c169C004L782J173a4874F228b223j0177N96F039A656h225g76n417k841
$$ -9239 -3169 3004 6786 7959 -14874 6228 -2223 -12400 -11804 6039 1656 -8225 -776 -6193 -9034
876i034N70J150o57l253l249M771d29r426L612n372A147K420N060J522B915a0411
$$ -9034 -8464 -7314 -7971 -11224 -14473 -9702 -429 -9855 -6243 -11615 1147 3567 8627 10149 2915 -10411
859g763m47a416r107L404k04n24J535l565a481L98j579l274m916n436l705L948
$$ -7763 -8210 -1416 -10523 -7119 -7323 -7847 -6312 -9877 -1481 -1083 -2662 -5936 -10852 -16288 -19993 -16045
843a6045K563k27j910o83L695M647c747j057a709m33l909o507o916N907d643A436
$$ -16045 -13482 -13709 -15619 -16302 -12607 -7960 -3747 -4804 -1709 -2142 -6051 -12558 -19474 -13567 -4643 1436
826A673L194H84i197j512A3652N548a725j4234M622E03K476g790A1836R377c0274
$$ 1673 4867 884 -9197 -10709 13652 19200 -1725 -15959 -11337 503 2979 -7790 11836 21213 -30274
810f8816b7535i931b459B936J592B140H80c17n005j701b855l496p496l030O798
$$ -68816 -27535 -9931 -2459 2936 4528 2140 880 -317 -5322 -7023 -2855 -6351 -13847 -16877 -10079
795a0079M23H88f14J95p048J705j462l819k677m53P94J600J92L951K458K239n53
$$ -10079 -9656 888 -614 -419 -7467 -5762 -7224 -11043 -13720 -14173 -13379 -11779 -11587 -7636 -5178 -2939 -3492
778c492J446d90k935l403m116N16P60c529G308B438b957n710m914m067k038N7
$$ -3492 -2046 -490 -3425 -6828 -10944 -10428 -9668 -3529 7308 2438 -2957 -8667 -13581 -17648 -19686 -19629
762a9629K652M965e768I5M777h749c41D282a861m61D526b893p270L399a866k327
$$ -19629 -16977 -12012 -5768 95 4872 -8749 -341 4282 -1861 -2322 4526 -2893 -10163 -6764 -1866 -4193
746d193l994n905n841Q673e265B016D07P6j73e155k44F485C241e749b627e33l742
$$ -4193 -8187 -14092 -19933 -11260 -5265 2016 407 483 310 -5155 -5399 6485 3241 -5749 -2627 -533 -4275
729d275P11J612E10A56b644m672m233o31N46l160k918d711b69k178A366a846m882
$$ -4275 -3564 -1952 510 156 -2644 -7316 -11549 -12180 -11634 -14794 -17712 -4711 -269 -2447 1366 -1846 -6728
712f728B031Q011a213j714I717e985J411A0062L028b36m796J067N01A76i755q214
$$ -6728 2031 10042 -1213 -2927 9717 -5985 -4574 10062 13090 -236 -5032 -3965 -3464 176 -9755 -17969
696a7969Q825a499B774j242d856p512a846r927D582K39f802o899K254M668J867
$$ -17969 -9144 -1499 2774 1532 -4856 -12368 -1846 -11773 4582 4821 -6802 -13701 -11447 -6779 -4912
681d912J013M6C984O558c6B079b434q194Q91n915O43N999K716K051l360b047m345
$$ -4912 -3899 -3853 3984 10542 -36 2079 -2434 -10628 -9737 -15652 -15009 -9010 -6294 -4243 -7603 -2047 -6392
664f392G89O017B293b064k07l054k593k821j938M63K335K558J359m04O60a946
$$ -6392 789 6806 2293 -2064 -2271 -5325 -7918 -10739 -12677 -12214 -9879 -7321 -5962 -6366 -5706 -1946
647A916J850f74j0162a399j0406d874l235j497D545N691f273B306i388m482a916
$$ 1916 3766 -674 -10836 -1399 -11805 -4874 -8109 -9606 4545 10236 -6273 2306 -9388 -13870 -1916
631e212k007r336k6137J3055e648j5538d036r258L563M51I33c805F658L391a357
$$ -5212 -7219 -16555 -42692 -29637 -5648 -21186 -4036 -13294 -9731 -9280 933 -3805 6658 10049 -1357
615a881f14B467c458k656l125b558q6k453k642j401J202K411K551a038b90o252
$$ -1881 -614 2467 -3458 -6114 -9239 -2558 -2644 -5097 -7739 -9140 -7938 -5527 -2976 -1038 -290 -6542
599f542R56o397o748J34N068K991n79k74k327j060J259K310K757J619M7k973n833
$$ -6542 -5586 -11983 -18731 -18597 -13529 -10538 -11117 -11391 -13718 -14778 -13519 -11209 -8452 -6833 -6786 -9759 -15592
582a5592l187O150N972o181c383l83c50J57k574o072M11a063o534k147j625K373
$$ -15592 -18779 -12629 -6657 -12838 -3383 -3766 -350 -193 -2767 -8839 -8428 -1063 -7597 -9744 -11369 -8996
566h996P92k753r0p60j503l344l530N219M762K694k44m27E48k57e600m41A722
$$ -8996 -8204 -10957 -11047 -11807 -13310 -16654 -20184 -14965 -10203 -7509 -7753 -8180 548 291 -5600 -6041 1722
548G065A441J2095C878i125o370b934m90l791K716m048K11j3144h407A765c213
$$ 7065 1441 13536 3878 -9125 -15495 -2934 -3424 -7215 -4499 -8547 -8336 -21480 -8407 1765 -3213
532c291A711J090c326o715j031e534l874c548j145k226n283N210A902Q540i1q477
$$ -3291 1711 2801 -3326 -10041 -11072 -5534 -9408 -3548 -4693 -6919 -12202 -6992 1902 10442 -91 -8568
516h568q793g073C420O25l96R747l824a552k471l445E641j294j270C09a2005K084
$$ -8568 -17361 -7073 3420 4045 3649 13396 9572 -1552 -4023 -7468 5641 4347 3077 309 -12005 -9921
500i921q90j292J085K736K161j630L05d23o086J55K058o779m127M71N250d153
$$ -9921 -10811 -12103 -11018 -8282 -6121 -7751 -7446 -423 -6509 -6354 -4296 -11075 -15202 -14731 -9481 -4153
483C795N264L031P64D542i516E383d324p435L707A348d387L82n84D2a464m680
$$ 3795 9059 12090 12854 4542 -9516 5383 -4324 -11759 -8052 1348 -4387 -4005 -4589 42 -1464 -6144
467f144a867l371r05n63j331j678q84N75R7r08l31K761L079R12k127m680o090
$$ -6144 -1867 -5238 -6143 -6706 -8037 -9715 -10599 -10024 -9927 -10835 -11166 -8405 -5326 -4414 -6541 -11221 -17311
450a7311l952L167J952J206J626K129j225M861q80l340m014K322f608BL584j217
$$ -17311 -21263 -18096 -16144 -14938 -13312 -11183 -12408 -7547 -8427 -11767 -15781 -13459 -6608 2 3586 2369
434B369c680q588q00c602C420J280E29g775n333c681G686R249H366d204J106l972
$$ 2369 -3680 -12268 -13068 -3602 3420 4700 529 -7775 -13108 -3681 7686 16935 8366 -4204 -3098 -7070
418g070D857N283j978C519j212k88Q662q29L885o301A442b498r24B367n28h059
$$ -7070 4857 10140 8162 3519 2307 2019 10681 9852 13737 7436 1442 -2498 -3422 2367 1839 -8059
401e866o110L47e403m063A729J1461k478m809B220L529B37a0342o853N678M718
$$ -5866 -11976 -11629 -5403 -9466 1729 13190 10712 5903 2220 5749 237 -10342 -17195 -11517 -6799
386f799l2P53j331r10j113k809l986J229N536L669m93m947n374f114A101l16L021
$$ -6799 -6831 -6078 -7409 -8319 -9432 -12241 -16227 -14998 -9462 -5793 -6286 -11233 -16607 -6114 1101 785 3806
369C806A253c221m069j160E332M053a1995N958B638J2203A543e171k799L695M89
$$ 3806 1253 -3221 -7290 -8450 5332 9385 -11995 -6037 2638 14841 1543 -5171 -7970 -4275 -3786
354c786m269o200m648P869M517J952J276p67j30J476k539B084h31k660B65e10
$$ -3786 -8055 -14255 -18903 -11034 -6517 -4565 -3289 -4056 -4186 -2710 -5249 2084 -831 -3491 265 -510
337e872n388j403j266j314M337e090F210O33J1945J966j010r392l659l008a1689
$$ -5872 -11260 -12663 -13929 -15243 -10906 -5090 6210 6843 18788 20754 19744 10352 6693 3685 -11689
321D361R11F15J3826K528K0909J09287j5494k7627J51174J179042N055165N438814
$$ 4361 5272 615 14441 16969 37878 147165 131671 104044 255218 1434260 6489425 11928239
309A1928239L596649o39521m532367H30755B28962I8396N9266G8500j4242k2472
$$ 11928239 15524888 14885367 10353000 830755 228962 98396 157662 78500 64258 41786
299D1786K9072k2800A9188j164l420C492K4479c4j197m915D811L39d406n259k462
$$ 41786 70858 48058 19188 18024 14604 3492 27971 -34 -1231 -6146 4811 5150 -4406 -9665 -12127
284a2127a035D849K50e0q11r757q269Q665c741P5l752l729M849B467J804c152
$$ -12127 -1035 4849 5099 -50 -861 -10618 -18887 -10222 -3741 -3666 -7418 -11147 -6298 2467 4271 -3152
267i810j271N437K034o114L415C944K668l249c117m868c094j217o362a608l957
$$ -9810 -11081 -5644 -3610 -9724 -6309 3944 6612 3363 -3117 -7985 -3094 -4311 -10673 -1608 -5565
252e565L14b184J002q246h95n740J814j311H276C647f911m15n560c692j182r663
$$ -5565 -5251 -2184 -1182 -9428 -895 -6635 -4821 -6132 8276 3647 -6911 -7326 -12886 -3692 -4874 -14537
236a4537o57N696L302j373n43J968l732n835Q05f614m292b5H385l050a672r740
$$ -14537 -15194 -9498 -6196 -7569 -8112 -6144 -9876 -15711 -14906 -6614 -10906 -25 8385 5335 -1672 -11412
220a1412n540Q232c688J105k638n062m355K923L654c241j547P61Q43n662C326
$$ -11412 -16952 -8720 -3688 -2583 -5221 -10283 -14638 -11715 -8061 -3241 -4788 -4027 -3184 -8846 3326
204A056h654J736b825A093d482a698k266a050r178K683j71J717p604J472M323
$$ 1056 -8654 -6918 -2825 1093 -4482 -1698 -3964 -1050 -10228 -7545 -7716 -5999 -13603 -12131 -7808
189g808J577J554k576q36K88l36q96n961L107k197l224j129L457K789J955J823
$$ -7808 -6231 -4677 -7253 -8089 -7801 -8137 -9033 -14994 -11887 -14084 -17308 -18437 -14980 -12191 -10236 -8413
173h413J564J394R5p98J872H09N164j400g554b47F356b582r241K447c206D930
$$ -8413 -6849 -5455 -5360 -6158 -4286 809 5973 4573 -7554 -247 6356 -2582 -11823 -9376 -3206 4930
156C238c303o704o372j846M467K997J831J928J818j462L126p40J54a414j291p712
$$ 3238 -3303 -10007 -16379 -18225 -13758 -10761 -8930 -7002 -5184 -6646 -3520 -4260 -4106 -1414 -2705 -10417
140a0417G759M38j242A803c191K30C871M870M94j832B930c697p396R75q90P80
$$ -10417 7759 8197 6955 1803 -3191 -2961 3871 8741 9235 7403 2930 -3697 -11093 -10118 -11008 -10228
124a0228c838E09c451i5G169A908g647c038B775m11a611k039j351j285j474k424
$$ -10228 -3838 509 -3451 -95 7169 1908 -7647 -3038 2775 2364 -1611 -3650 -5001 -6286 -7760 -10184
108a0184k671k338p37J844M302d246A829c067C013P939j516g420b002H260N387
$$ -10184 -12855 -15193 -15930 -14086 -9784 -4246 1829 -3067 3013 10952 9436 -7420 -2002 8260 13647
93A3647c01H619l844f489j1487P040c812l738L169o699r045O556e312B929b892
$$ 13647 -301 8619 4775 -6489 -17976 -10936 -3812 -7550 -4381 -11080 -20125 -13569 -5312 2929 -2892
77h763d58A1128D022d767k815a966G41b425o994d193D735A252J5347q011h695
$$ -8763 -458 11128 4022 -4767 -7582 -1966 741 -2425 -9419 -4193 4735 1252 16599 8588 -8695
61h673b797D869a821o244a162k401l257o893n579J573L806K989J167p2r47J162
$$ -8673 -2797 4869 -1821 -8065 -1162 -3563 -6820 -13713 -19292 -17719 -13913 -10924 -9757 -9829 -10776 -9614
45i614M762A406N946A743a2216a818b54o771B276c516m165J584k226A345f215
$$ -9614 -4852 1406 7352 1743 -12216 -1818 -254 -7025 2276 -3516 -7681 -6097 -8323 1345 -6215
29e835d59A89c591F447a330n947k057K429a679C915R34N201L111G08B72J909c956
$$ -5835 -459 189 -3591 6447 -1330 -7277 -9334 -6905 -1679 3915 4849 10050 13161 708 272 2181 -3956
11a0665q232J791g752a660j841a65n925r059k260Q659b906
$$ -10665 -18897 -17106 -7752 -1660 -3501 -165 -6090 -15149 -17409 -8750 -2906
##PAGE= F1=1051.209803181
##FIRST=     2915.55639409065, 2671.18566176471, -2105
##DATA TABLE= (F2++(Y..Y)), PROFILE
1023b105m878r138p063L064N173M77l516l535K301M085k9n297o241P433h057a519
$$ -2105 -6983 -16121 -23184 -20120 -14947 -14470 -17986 -21521 -19220 -15135 -15164 -20461 -26702 -19269 -8057 -1519
1006i731j209r737O313b57C375g706A0792D323a2043j7748O766h540A279O545
$$ -9731 -10940 -20677 -14364 -257 3375 -7706 10792 4323 -12043 -29791 -23025 -8540 1279 7824
992G824Q51m252f215m835r820p469L460J0272c401k606H59g236C216P8e114a907
$$ 7824 8675 4423 -6215 -11050 -20870 -28339 -24879 -14607 -3401 -6007 859 -7236 3216 3294 -5114 -1907
975a102r421a771j522k804l544A88c276o9B216F39e03j0730L637a763F179b829
$$ -1102 -10523 -1771 -3293 -6097 -9641 188 -3276 -3345 2216 639 -503 -11233 -7596 -1763 6179 -2829
958a1743e052B453R044B672e192j0072K578r699Q58h261A616M265j959b007o614
$$ -11743 -5052 2453 11497 2672 -5192 -15264 -12686 -22385 -21527 -8261 1616 5881 3922 -2007 -8621
943h621j530d683J112a326n305a873m140m640A258a0944A3422k508i068A3013
$$ -8621 -10151 -4683 -3571 -1326 -6631 -1873 -6013 -10653 1258 -10944 13422 10914 -9068 13013
928H275j998k321e49D485a2085j0376R499a35F814b784k435K183o06a090j3829
$$ 8275 6277 3956 -549 4485 -12085 -22461 -12962 -135 6814 -2784 -5219 -3036 -3642 -1090 -14919
913a4919L171C45i208g11j64r235j8293J3432B210g280b785A772c956k472j1233
$$ -14919 -11748 345 -9208 -711 -875 -10110 -28403 -14971 2210 -7280 -2785 1772 -3956 -6428 -17661
898a7661q15f512G419k485R227E012P272a473j1405K590G26a2654D175f296m881
$$ -17661 -18476 -6512 7419 4934 14161 5012 12284 -1473 -12878 -10288 726 -12654 4175 -6296 -11177
883a1177k205B819j021g746k935m635L971N387Q12m478n921J933d320C631e275
$$ -11177 -13382 2819 1798 -7746 -10681 -15316 -11345 -5958 -5146 -9624 -15545 -13612 -4320 3631 -5275
867d320q505M465K714A999K35b461n844l209K937c146r685J64k301j909k343j473
$$ -4320 -12825 -8360 -5646 1999 2234 -2461 -8305 -11514 -8577 -3146 -12831 -12667 -14968 -16877 -19220 -20693
851b0693q30k05k04M67J534K356R69j263l275k363M639P091N779K911M51j831
$$ -20693 -21523 -21728 -21932 -21465 -19931 -17575 -16606 -17869 -21144 -23507 -18868 -11777 -5998 -3087 -2636 -4467
835d467l507m050O30c787j0066d706A545J258j61K148A000b977j0944A4430N533
$$ -4467 -7974 -12024 -11394 -3787 -13853 -4706 1545 2803 2642 4790 1000 -2977 -13921 14430 19963
820A9963A486a5355O16a974C730A849J6977q147h703m3895K4269i823l260m728
$$ 19963 1486 -15355 -14739 -1974 3730 1849 18826 10679 -8703 -52598 -28329 -9823 -13083 -17811
806a7811m518k453p85R70M485O519N278K345j75j044M21l758b037J35C22i215
$$ -17811 -22329 -24782 -25567 -24597 -20112 -13593 -8315 -5970 -6145 -7189 -6768 -10526 -2037 -1902 322 -9215
789b569o81E6i008I22J602e798o991A0127J845b236k192J763c17m583l176n786
$$ -2569 -3250 56 -9008 922 2524 -5798 -12789 10127 11972 -2236 -4428 -2665 -317 -4900 -8076 -13862
773a3862K511K052o283q305p243L764N730N154L322J233p63j115O01M828a51I644
$$ -13862 -11351 -9299 -15582 -23887 -31130 -27366 -21636 -16482 -13160 -11927 -12690 -13805 -13204 -8376 -151 9644
756a1657A242O52f01o75E379g464j8137N605d786F287d326C047N23b300r490m686
$$ -11657 1242 1894 -601 -1276 5379 -7464 -25601 -19996 -4786 6287 -4326 3047 3570 -2300 -11790 -16476
740a6476O491D04H1f725N40B381p8f004K999h21m146N79k207M1I91c626A1181
$$ -16476 -9985 404 81 -6725 -6185 2381 2303 -6004 -3005 -821 -4967 -4388 -6595 -6554 991 -3626 11181
722G529e865n217j4186O212f043b069i1E331k010d048G089c883p314e20A2500
$$ 7529 -5865 -11082 -25268 -19056 -6043 -2069 -91 5331 3321 -4048 7089 -3883 -11197 -520 12500
706a590j016A6545N5C281a658j375J124F283B512a718l350k667k729j830j62j337
$$ -1590 -2606 16545 16600 3281 -1658 -3033 -1909 6283 2512 -1718 -5068 -7735 -10464 -12294 -12456 -13793
690a3793e850o372A169n49c836p572r112n181N436N855L141J811J911J574P21
$$ -13793 -5850 -12222 1169 620 -3836 -11408 -20520 -25701 -20265 -14410 -11269 -9458 -7547 -5973 -5252
675e252o62m613K460j105Q83o05j039p9J85o96j678k255j158L587b783A904f22
$$ -5252 -5914 -10527 -8067 -9172 -8289 -8894 -9933 -10012 -9827 -10523 -12201 -14456 -15614 -12027 -2783 1904 -622
657A9543o582E207g266C858O442B524a2907J608b342A54L803n93a1003d159m784
$$ 19543 12961 5207 -7266 3858 10300 2524 -12907 -11299 -2342 154 3957 3364 -11003 -4159 -8943
642h943c151n760j438B484b429n018k676L155A857J377g116j354r412j1498a4657
$$ -8943 -3151 -8911 -10349 2484 -2429 -7447 -10123 -6968 1857 3234 -7116 -8470 -17882 -29380 -14657
626a2531r975K592o79jK003N258f152A217N550A156c265J18P82k104a549j2109
$$ -12531 -22506 -19914 -20593 -20594 -18591 -13333 -6152 1217 6767 1156 -3265 -3147 -2365 -4469 -1549 -13658
610a3658H4g89p675n532p02N80k765m193K281P710J398c051R64k75j84j677o736
$$ -13658 84 -789 -8464 -13996 -14698 -14118 -16883 -21076 -18795 -11085 -9687 -3051 -2087 -2362 -2546 -4223 -10959
593a0959m156r605l605R535i155d122r70p760j2030l038J2737d886J742k700l414
$$ -10959 -15115 -24720 -28325 -18790 -9155 -4122 -5092 -12852 -24882 -27920 -15183 -4886 -3144 -5844 -9258
578i258d88F261j126A268a114n069n900N455p475j6541P600g871j444d058q236
$$ -9258 -488 6261 5135 1268 -1114 -6183 -12083 -6628 -14103 -30644 -23044 -7871 -9315 -4058 -12294
563a2294M803j2905l394R458O660L18n304r367q201O592J0056b460n25D555O337
$$ -12294 -7491 -20396 -23790 -14332 -7672 -7354 -12658 -22025 -30226 -23634 -13578 -2460 -2985 4555 10892
548A0892D420R907E133a7282m625f370h54o950k216j9685Q671a0005A668J81d066
$$ 10892 4420 14327 5133 -17282 -21907 -6370 -854 -7804 -10020 -29705 -21034 -10005 1668 1849 -4066
532a420D305m62J813K56a0719j3666P079c474j641m256j760K476B94P963B21g040
$$ -1420 4305 3843 5656 5912 -10719 -24385 -17306 -3474 -5115 -9371 -11131 -8655 294 8257 221 -7040
515b1677P792A937K413r27P892m610i500p156g498H039K842k657C370h297p141
$$ -21677 -13885 1937 4350 3423 11315 6705 -9500 -16656 -7498 8039 10881 8224 3370 -8297 -15438
500a5438j3692J0946a385l011M65O09k851a802o110c513o803J347L621a184G312
$$ -15438 -29130 -18184 -1385 -4396 -3931 -3322 -6173 -1802 -7912 -3513 -10316 -8969 -5348 -1184 7312
484a942E212P043l454Q19E81e621H53a2887m984P201b869N94m165k329q708p165
$$ -1942 5212 12255 8801 9620 581 -5621 853 -12887 -17871 -10670 -2869 -2275 -6440 -8769 -17477 -24642
468b4642R84O996O497M131J643j09k350o284r098k408a1661c725b30E292K802
$$ -24642 -23658 -16662 -10165 -6034 -4391 -4500 -6850 -13134 -22232 -24640 -11661 -3725 -230 5292 8094
453H094j816E83e617q487r258Q76J0116c954j24p945M517l297l371l244K034f729
$$ 8094 6278 583 -5617 -14104 -23362 -22486 -12370 -3954 -4078 -12023 -7506 -10803 -14174 -17418 -15384 -6729
436C350M267p55b267j3144j1631J323N743J604J5J556M375N605c037J472k115
$$ 3350 7617 6862 -2267 -15411 -27042 -25719 -19976 -18372 -18357 -16801 -12426 -6821 -3037 -1565 -3680
421c680m254k670P16c232B396N597l133j80j745Q879j57J0839J993D590i332R06
$$ -3680 -7934 -10604 -9888 -3232 2396 7993 4860 4680 2935 11814 11657 22496 24489 4590 -9332 -8426
405h426L513J668m698b791j0230q09O412m424A978J3242n174m308A051J353F00
$$ -8426 -4913 -3245 -7943 -2791 -13021 -13830 -7418 -11842 1978 15220 10046 5738 1051 2404 600
389h904q817K72h694j10I356Q295H646g302K592D594k19B078L931K269A738f239
$$ -8904 -17721 -17449 -8694 -8804 9356 17651 8646 -7302 -4710 4594 4375 2078 6009 8278 1738 -6239
372d337a198C900K365f74r259M032k020G103M372i804c536H54a2785j725i66A2331
$$ -4337 -1198 3900 6265 -674 -9933 -5901 -7921 7103 11475 -9804 -3536 854 -12785 -14510 -966 12331
355a3501B3767m152o982b761j7256r016a0356F079J2833A174h591e76D145b670
$$ -13501 23767 19615 12633 -2761 -20017 -29033 -10356 6079 18912 1174 -8591 -576 4145 -2670
340d698C023Q4h621P07k978a935d50A7011O266J887A250J7964K292K9774E603
$$ -4698 3023 3107 -8621 -7914 -10892 -1935 -450 17011 23277 25164 1250 19214 21506 51280 5603
324a5788B874c264F848k18C261J5239J1930K4717J48337M7306J9532L0941K168224
$$ -15788 2874 -3264 6848 6630 3261 18500 30430 55147 203484 250790 270322 301263 2469487
311B469487R458752L0153554K2337584O622174j3816356C701509A646340D87349
$$ 2469487 11928239 42081793 64419377 71041551 57225195 3701509 1646340 487349
302C50976Q278j00434G9532J5138k1058l4225j5625l229A863K5778c827g17n244
$$ 350976 359254 258820 79532 94670 73612 39387 23762 20533 1863 27641 -3827 -717 -5961
289e961F654O66N345c195Q44F590N74j820d521D48e369j638D071g000n243o3l610
$$ -5961 6654 7320 12665 -3195 -2351 6590 7164 5344 -4521 448 -5369 -7007 4071 -7000 -12243 -12306 -15916
272a5916p996m716L898M224k141L9j242R028f665J206E371L163j262c962j007
$$ -15916 -23912 -28628 -24730 -20506 -22647 -22608 -23850 -14822 -6665 -5459 5371 8534 7272 -3962 -4969
257d969q239L145O99a45k464k996L99Q37p522b05j0459b2j2225b207B553g914
$$ -4969 -13208 -10063 -9364 -145 -2609 -5605 -5206 -4369 -11891 -205 -10664 -22 -12247 -2207 2553 -7914
240e743n247M244b83D573k175a6602m088P793M191q14m396m885K013M915K895
$$ -5743 -10990 -6746 -283 4573 2398 -16602 -20690 -12897 -8706 -9520 -13916 -18801 -16788 -11873 -8978
225h978j132m680n997k491P55n56k518j051M870N771L624K026R40l93q52j942
$$ -8978 -10110 -14790 -20787 -23278 -22523 -23079 -25597 -26648 -21778 -16007 -12383 -10357 -9417 -9810 -10662 -12604
209a2604k611j844R64L696M359K828n003a135A342b339B13g77n269r512r669m233
$$ -12604 -15215 -17059 -16095 -12399 -8040 -5212 -10215 -1135 1342 -2339 213 -777 -6046 -15558 -25227 -29460
193b9460P527P646J745M194J740k010c711A957a716l601o036l645R58M648M086
$$ -29460 -21933 -14287 -12542 -8348 -6608 -8618 -3711 1957 -1716 -5317 -11353 -14998 -14040 -9392 -5306
178e306J589j710m077m703k879J174M530M762K241r27m750q039n595R414c12A1522
$$ -5306 -3717 -5427 -9504 -14207 -17086 -15912 -11382 -6620 -4379 -5306 -10056 -18095 -23690 -14276 -312 11522
161H91g677k69a523H779J601e036j3566j73h556a29m21F196l85q42i061c58A986
$$ 891 -7677 -7946 -1523 8779 10380 -5036 -18602 -18775 -8556 -129 -550 6196 5811 4969 -9061 -358 1986
143a491E904h989M282A1807m20k727A99g572K258m734l624l392l306k641n20J163
$$ -1491 5904 -8989 -4707 11807 11387 8660 199 -7572 -5314 -10048 -13672 -17064 -20370 -23011 -23531 -22368
127b2368M886N574e352E70J974e34C74O119A222g647a451A493L830a5095j3872
$$ -22368 -17482 -11908 -5352 570 2544 -534 374 6493 1222 -7647 -1451 1493 5323 -15095 -28967
112b8967a1726b496o043b458K23o034J254K356A070N786J284c587J155B138J2093
$$ -28967 -11726 -2496 -8539 -2458 -2235 -8269 -7015 -4659 1070 6856 8140 -3587 -2432 2138 14231
97A4231d738j637D322J1838l595P160K2951A9342n209M216A797i410h79j980j8562
$$ 14231 -4738 -6375 4322 16160 12565 19725 42676 19342 14133 18349 1797 -9410 -879 -2859 -21421
82b1421f665C430K260c338q604A444J0249m143g76q540c301A560b157q240M428
$$ -21421 -6665 3430 5690 -3338 -11942 1444 11693 7550 -776 -9316 -3301 1560 -2157 -10397 -5969
67e969C825N49J1899b014j3449j57O221d493b007m826a731n488j75B846f6B743
$$ -5969 3825 4374 16273 -2014 -15463 -15620 -9399 -4493 -2007 -6833 -1731 -7219 -7394 2846 -66 2743
50I080B90J1015l598e178j5467j5087J4960g463G05a0964b009Ca1821F601B873
$$ 9080 290 11305 7707 -5178 -20645 -35732 -20772 -7463 705 -10964 -2009 3 -11821 6601 2873
34c874m185n20E01c644o96E09a1029j5894p960J2252Q656f056E239J291l23L03
$$ -3874 -8059 -8579 501 -3644 -4340 509 -11029 -26923 -34883 -22631 -13975 -6056 5239 6530 6207 6510
18F510O627K016C55c311j7736j730h757J732C998j733b330L12k419j070o712m478
$$ 6510 13137 15153 355 -3311 -21047 -22777 -8757 -7025 3998 2265 -2330 -2018 -4437 -5507 -12219 -16697
2a6697L049M657
$$ -16697 -13648 -8991
0h991
$$ -8991
##PAGE= F1=1048.598673502
##FIRST=     2915.55639409065, 2671.18566176471, -28708
##DATA TABLE= (F2++(Y..Y)), PROFILE
1023b8708J1774P981M293b152m116j4378k0451j8050j598R721R069J0223J5138
$$ -28708 -16934 -8953 -4660 -2152 -6268 -20646 -41097 -59147 -60745 -51024 -41955 -31732 -16594
1010a6594b112H417B966h976N59j8320j4182j0158o386M339J9291g775H864C552
$$ -16594 -2112 8417 2966 -8976 -8417 -26737 -40919 -51077 -57463 -53124 -33833 -7775 8864 3552
995b729j132C956P924K44b0108l0982k1583n629J4887b9217a355D051e774B140
$$ -2729 -3861 3956 11880 12124 -20108 -51090 -72673 -78302 -63415 -29217 -1355 4051 -5774 2140
980e715C278R36f088D3a097o415a587m447k169j340b671k040E83K447p27Q30b402
$$ -5715 3278 4214 -6088 43 -1097 -7512 -1587 -6034 -8203 -9543 -2671 -4711 583 3030 2303 3133 -2402
962g187Q58k1467m3445K9798F32J0746j362B919e549j1888j3167o782a6171A758
$$ -7187 -6329 -27796 -71241 -41443 632 11378 10016 2919 -5549 -17437 -30604 -37386 -16171 1758
947F101c636j8671j4027O140i113C246g302a572n564f91o698m891M933k527A6875
$$ 6101 -3636 -22307 -36334 -30194 -9113 3246 -7302 -1572 -7136 -691 -7389 -12280 -7347 -9874 16875
931A6876g659A4872m018E110B313a864I829O279c6627k1399a3987A1792G54c760
$$ 16876 -7659 14872 10854 5110 2313 -1864 9829 16108 -36627 -58026 -13987 11792 754 -3760
916a361n395P12p440K174e567j322E462A690a0902g54E421c7878a3834E119R88
$$ -1361 -6756 -6044 -13484 -11310 -5567 -6889 5462 1690 -10902 -754 5421 -37878 -13834 5119 6107
901F107A110N56e774j2337d224A6445C706Q315C775J0095f930k4324h281A6846
$$ 6107 1110 1666 -5774 -18111 -4224 16445 3706 12021 3775 13870 -6930 -31254 -8281 16846
886i392D762c801n599J534a911k2194k0494j7144j0359l227k895J211J3090J5758
$$ -9392 4762 -3801 -9400 -7866 -1911 -24105 -44599 -61743 -72102 -75329 -78224 -77013 -63923 -48165
872d8165J2357N124l686r689p528M517J0158P598R44m803p851p300n173l869n087
$$ -48165 -35808 -30684 -34370 -44059 -51587 -47070 -36912 -29314 -28370 -33173 -41024 -48324 -53497 -57366 -62453
857f2453p830p528M115J1513J1110R254O127M461M867O898P457N806J436l390
$$ -62453 -70283 -77811 -73696 -62183 -51073 -41819 -35692 -31231 -26364 -19466 -12009 -6203 -4767 -8157
843h157p442j0515j0865q178r77O182P830K655o951j8984k4102L1019f940m003
$$ -8157 -15599 -26114 -36979 -45157 -46134 -39952 -32122 -29467 -36418 -55402 -79504 -48485 -6940 -10943
829a0943h98C240m56M69D43J222h301A0362P243B850a4117r02d272C809P156J3559
$$ -10943 -898 3240 2784 3253 443 1665 -8301 10362 17605 2850 -14117 -15019 -4272 3809 10965 24524
813B4524L188A2645b2895k389n991k9172j4092J5634J0500k11r893j0701R185
$$ 24524 27712 12645 -22895 -25284 -31275 -60447 -74539 -58905 -48405 -48616 -58509 -69210 -60025
800f0025J9992J7811i184g68l764o051d938K429F67i963I54d741n733j0616j1070
$$ -60025 -40033 -22222 -9184 -768 -4532 -10583 -4938 -2509 667 -9963 954 -4741 -10474 -21090 -32160
785c2160q118R74Q985J0572O044k22m167o05P133d184j770p309J768j8296k1116
$$ -32160 -40278 -39304 -30319 -19747 -13703 -13925 -18092 -18697 -11564 -4184 -5954 -13263 -11495 -29791 -50907
770e0907j1694M210O946K581j578m951n690k815M788J2870J9296c880A2281a0909
$$ -50907 -62601 -58391 -51445 -48864 -50442 -55393 -61083 -63898 -59110 -46240 -26944 -3880 12281 -10909
755F878H17C0J064L251c1497l6219c2707I853O427d504D988q59J265B690J497
$$ 6878 817 30 1094 4345 -31497 -67716 -32707 9853 16280 -4504 4988 4129 5394 2690 4187
740D187f72A905I02f721K99b061F03h303K011J592o637K445c037D58M735d214
$$ 4187 -672 1905 902 -6721 -6422 -2061 603 -8303 -6292 -4700 -11337 -8892 -3037 458 5193 -4214
723A3230l742e130j9777l7913a5851M519d068C541O923k504d43A2883M09c295
$$ 13230 9488 -5130 -24907 -62820 -15851 -11332 -4068 3541 10464 7960 -443 12883 13292 -3295
708G203R383E41h57B1063k360F823A148b815h69F777j812g633j8111j2555K639
$$ 7203 16586 541 -857 21063 18703 6823 1148 -2815 -869 6777 4965 -7633 -25744 -38299 -35660
693c5660J3222J0004j975j6570k4304L109a5180A777f030k906K357K037l1357
$$ -35660 -22438 -12434 -14409 -30979 -55283 -52174 -15180 1777 -6030 -8936 -6579 -4542 -35899
680c5899k8525K5470A179b326I932C734h118k012k684o558j6322N730J1299L546
$$ -35899 -64424 -38954 1179 -2326 9932 3734 -8118 -10130 -12814 -19372 -35694 -29964 -18665 -15119
666a5119l381N267M065G547J104L623n716A399J8660H974i28o047l1727k6098
$$ -15119 -18500 -13233 -9168 7547 8651 12274 6558 1399 20059 8974 -928 -6975 -38702 -64800
652f4800j219N175J6868a3776A079P065o36i113M416p92a217p741k041m0896m1576
$$ -64800 -66019 -60844 -43976 -13776 1079 8144 7508 -9113 -4697 -5489 -1217 -8958 -10999 -51895 -93471
637i3471L7569a6870A8948C654l60i427K496j0417k17j9706r297m549J155J3243
$$ -93471 -55902 -16870 18948 3654 3294 -9427 -6931 -17348 -17565 -37271 -46568 -51117 -49962 -36719
623c6719J7845h843M378l616j261d435E28b659j0896j5521q36a0583j476B038
$$ -36719 -18874 -8843 -4465 -8081 -9342 -4435 528 -2659 -13555 -29076 -29912 -10583 -12059 2038
608g370l6846k8008K1636J6603p937k2514J9317C393a0533c81H854J353a791n059
$$ -7370 -44216 -72224 -50588 -33985 -41922 -64436 -45119 3393 -10533 -381 8854 10207 -1791 -6850
594f850o660f147j6241k080J0545E881g35F167A533i630j0126n4458J0356a0778
$$ -6850 -13510 -6147 -22388 -24468 -13923 5881 -735 6167 1533 -9630 -19756 -74214 -63858 -10778
579b181m336b528D612j525j91C67b123l134j3944l9895k6162L3042b4435a2206
$$ -2181 -6517 -2528 4612 3087 2896 367 -2123 -5257 -19201 -59096 -85258 -52216 -24435 -12206
564a7174j6643j2000J1003a3190c147D204a820q263q772j5224l0770j4653a8409
$$ -17174 -33817 -45817 -34814 -13190 -3147 4204 -1820 -10083 -18855 -34079 -64849 -79502 -18409
550i36F230P863n025M347B808a8498m6759K3876a1133c638m148r134N856p02f00
$$ -936 6230 14093 9068 13415 2808 -18498 -65257 -41381 -11133 -3638 -7786 -16920 -11064 -11766 -600
534A98d163E79N895k324M76J287b4228k213e528J178m097l382M257b143D156L519
$$ 198 -4163 579 6474 4150 4626 5913 -24228 -26441 -5528 -4350 -8447 -11829 -7572 -2143 4156 7675
518G675B07a2364k7556a9920A1819C732A293O321a528m0484J205i240G821N217
$$ 7675 207 -12364 -39920 -19920 11819 3732 1293 7614 -1528 -42012 -40807 -9240 7821 13038
504A3038l523C700a6826m1937k7140c6771b662j176O10I40c178o24l347l618j9990
$$ 13038 9515 3700 -16826 -58763 -85903 -36771 -2662 -3838 -3228 940 -3178 -3802 -7149 -10767 -30757
489c0757k288K849J435L387N346J543m136n683J464J0209e976a949n296j1886
$$ -30757 -33045 -30196 -28761 -25374 -20028 -18485 -22621 -28304 -26840 -16631 -5976 -1949 -7245 -19131
475a9131j4740j4064j1952j0071p403m57J4270K3210a4010C78a021m373E372k70
$$ -19131 -33871 -47935 -59887 -69958 -77361 -77818 -63548 -40338 -14010 378 -1021 -5394 5372 5102
461E102k476b7575n532B68c901J922D904K649q95A580c468k627p934k3903Q494
$$ 5102 2626 -27575 -33107 268 -3901 -1979 4904 7553 6658 1580 -3468 -6095 -14029 -37932 -29438
446b9438a2999L544r747j5429m153J2321i951k79b868C718c89j260D32L099K309
$$ -29438 -12999 -9455 -19202 -34631 -38784 -26463 -9951 -10230 -2868 3718 -389 -1649 432 3531 5840
431E840J119L085O399P247N509M183K730A3789j7B922b193m530m122P25D686Q886
$$ 5840 6959 10044 16443 23690 29199 33382 36112 13789 13772 2922 -2193 -6723 -10845 -10120 4686 13572
415A3572E929i157j0057o79R111B430Q828a305r124j778k878j2044j2153j4536
$$ 13572 5929 -9157 -19214 -19893 -10782 2430 11258 -1305 -10429 -12207 -15085 -27129 -39282 -53818
401e3818j3566o262K166O128P558R823P899J508l748q403j3582o781O936J9129
$$ -53818 -67384 -73646 -71480 -65352 -57794 -47971 -40072 -38564 -42312 -50715 -64297 -71078 -64142 -45013
387d5013K0674h729H194P295D896f940b966D112K20A162L26L594A039f551k7371
$$ -45013 -24339 -8729 8194 15489 4896 -6940 -2966 4112 4332 1162 1488 5082 1039 -6551 -33922
372c3922k2072h511I424a416j9642l0588b4656F592L310g584f42k2632l9174a7033
$$ -33922 -55994 -8511 9424 -1416 -21058 -51646 -24656 6592 9902 -7584 -642 -23274 -62448 -17033
357A8956G623A314L5671K0194j2777F657b6524m2128J4461a5685B0169D827a1026
$$ 18956 7623 1314 36985 57179 44402 6657 -26524 -68652 -54191 -15685 20169 4827 -11026
343B679j88e265j292C458p04a1084k4474M617a0317l2935j9818b4655A3930f840
$$ 2679 2491 -5265 -6557 3458 2754 -11084 -35558 -30941 -10317 -43252 -63070 -24655 13930 -6840
328g0208F479K3302j0625j35q919C956N354q74j787J4263J9137L4959J52261J44971
$$ -70208 6479 29781 19156 19021 10102 3956 9310 8436 6649 20912 40049 75008 227269 372240
314C72240J51933J53229K324358J2523128M8894489K42404565M2034061j72282584
$$ 372240 524173 677402 3001760 15524888 64419377 306823942 348858003 176575419
306A76575419G311564C573513A179900E82757m9705j30130A41346l8396j4623
$$ 176575419 7311564 3573513 1179900 582757 533052 402922 141346 102950 88327
297H8327l0275B7355n025A753K1527g879a501n784H436e991j8396a708m242F508
$$ 88327 58052 27355 22330 1753 23280 -7879 -1501 -7285 8436 -5991 -24387 -1708 -5950 6508
282b008B641i105l0003J2365P756k1365l479O001j7237J928a4306a057j1102j877
$$ -2008 2641 -9105 -39108 -26743 -18987 -40352 -43831 -37830 -55067 -53139 -14306 -1057 -12159 -14036
268a4036l7577k9074J6211b0323a995m414G716j114A097h839K436m1678j7670
$$ -14036 -51613 -80687 -64476 -20323 -1995 -6409 7716 6602 1097 -8839 -6403 -48081 -65751
255f5751h614A167a70q576c099m3838K2517e47j3466C429g334l5849O356h326
$$ -65751 -8614 1167 -170 -8746 -3099 -46937 -24420 -547 -14013 3429 -7334 -43183 -36827 -8326
240d917l997K29c09A889J770e461q568m13O78K531J508k276K351K21m090q277
$$ -4917 -8914 -8685 -309 1889 3659 -5461 -14029 -14442 -13764 -11233 -9725 -12001 -9650 -9429 -13519 -21796
224b1796j5528j7884j2868p871o609k228Q391R859O090K6k096r39K758R529J6138
$$ -21796 -37324 -55208 -68076 -75947 -82556 -84784 -76393 -66534 -60444 -60418 -62514 -63453 -60695 -51166 -35028
209c5028a4657e385A675Q860j487b642r177e731a015r74A075Q67J302a0337f00
$$ -35028 -14657 -5385 1675 10535 9048 -2642 -11819 -5731 -1015 -1989 1075 1942 3244 -10337 -600
193D842b277j0738j312N568R76l691L132A965a091j01k281j3203j4509a1388d47
$$ 4842 -2277 -13015 -14327 -8759 -7783 -11474 -8342 1965 -1091 -1192 -3473 -16676 -31185 -11388 -447
177G923l719a470k8111j0750R795O646p025j9481j2545K0459a2865H313i976C504
$$ 7923 4204 -1470 -29581 -40331 -30536 -23890 -30915 -50396 -62941 -42482 -12865 8313 -9976 3504
162A2981E023c857m025b61A0392J246P742j501F328b439A9b31F508h569j5376
$$ 12981 5023 -3857 -7882 -261 10392 11638 19380 17879 6328 -2439 19 -231 6508 -8569 -23945
147b3945j0942m082L955J0563i983j361A453J6057l59E564g64q976r486j7680
$$ -23945 -34887 -38969 -35014 -24451 -9983 -11344 1453 17510 17151 5564 -764 -9740 -19226 -36906
133c6906j3705q915k654L186K367p609k0895K2548a6411E189q37A778H2L925C
$$ -36906 -50611 -59526 -62180 -58994 -56627 -64236 -85131 -62583 -16411 5189 4352 1778 82 4007 3
117g686K268m0681m1021L0704b1501B188D03a1417j5736l7783J3778e759k221
$$ -7686 -5418 -46099 -87120 -56416 -21501 2188 403 -11417 -27153 -64936 -51158 -5759 -7980
104g980I3R170J726d336n1016K715C274c295n270I29J4691K919M933J6127J4151
$$ -7980 93 9263 10989 -4336 -55352 -52637 3274 -3295 -8565 929 15620 18539 23472 39599 53750
89E3750j5502A4406b218q769C99b773k7718j943B753L123c521r513A016R237j881
$$ 53750 38248 14406 -2218 -10987 399 -2773 -30491 -32434 2753 5876 -3521 -13034 1016 10253 8372
74H372a4334j6711f404B170b467o555J142C167K658N568f0072o792a9432A30P711
$$ 8372 -14334 -31045 -6404 2170 -2467 -9022 -7880 3167 5825 11393 -60072 -66864 -19432 130 7841
59G841l422c870a695p597l586k6980k2210Q586K1435J2340k901j6954k5610q380
$$ 7841 4419 -3870 -1695 -9292 -12878 -39858 -62068 -53482 -32047 -19707 -22608 -39562 -65172 -73552
45g3552K7186a6027F734a044o960b283f17n048A41b73k1988l4651J4615i268a546
$$ -73552 -46366 -16027 6734 -1044 -8004 -2283 -617 -5665 141 -273 -22261 -56912 -42297 -9268 -1546
29c134k697k5270p276J8301I24a452j347C792K331o32J970Q648l546b049m701
$$ -3134 -5831 -31101 -38377 -20076 924 -1452 -2799 3792 6123 5491 7461 16109 12563 -2049 -6750
14f750k5810J3762d264j855q082n3013p264b4681i161L332j6267l0893j3110J5211
$$ -6750 -32560 -18798 -4264 -6119 -14201 -67214 -74478 -24681 -9161 -5829 -22096 -52989 -66099 -50888
0e0888
$$ -50888
##PAGE= F1=1045.987543823
##FIRST=     2915.55639409065, 2671.18566176471, -39194
##DATA TABLE= (F2++(Y..Y)), PROFILE
1023c9194R789P013J0897b595g7j4548k6280k1891M058J9674J5837J1409L676
$$ -39194 -29405 -22392 -11495 -2595 -77 -14625 -40905 -62796 -58738 -39064 -23227 -11818 -8142
1010h142G581N252E015f576A151h953m0635m3400j7668M6538a2426A8269H558
$$ -8142 7581 12833 5015 -6576 1151 -8953 -49588 -92988 -110656 -64118 -12426 18269 8558
996E549b264g13E585M679i840n1400m3525j2281L986J6106d3547I78K127f839
$$ 5549 -2264 -713 5585 10264 -9840 -61240 -104765 -117046 -113060 -96954 -43547 978 3105 -6839
981B089e237B296K031f844a56k225j6578k0527O997P088m399r015N219f431B765
$$ 2089 -5237 2296 4327 -6844 -156 -2381 -18959 -39486 -32489 -25401 -29800 -38815 -33596 -6431 2765
965D201R17J043A437a4056l9993r593b9140D886L892C374n47d358l0957l1213
$$ 4201 5118 6161 1437 -14056 -54049 -63642 -29140 4886 8778 3374 2827 -4358 -35315 -66528
951f6528J7436a7977a711l046j7710j8516K149a5459A231M909i959a600l061i99
$$ -66528 -49092 -17977 -1711 -4757 -22467 -40983 -38834 -15459 1231 6140 -9959 -1600 -4661 -999
936i371M408q663M660A7486M128d524A3515k332B532a596l356A1837J1267a7512
$$ -9371 -4963 -13626 -8966 17486 21614 -4524 13515 11183 2532 -1596 -4952 11837 23104 -17512
921h1409Q057b1849C003a943I39h632l674j5021a2520J161b649H068l787a1485
$$ -81409 -73352 -21849 3003 -1943 939 -8632 -12306 -27327 -12520 -11359 -2649 8068 4281 -11485
906B413M385A547f079A5166l995E119k01j337Q764g974A2404B593O719A546P546
$$ 2413 6798 1547 -6079 15166 11171 5119 4918 3581 12345 -7974 12404 2593 9312 1546 9092
891I092d0159l2477a8156A3286f718F853a526m909L054k639n103k4344j9921j5156
$$ 9092 -40159 -72636 -18156 13286 -6718 6853 -1526 -6435 -3381 -6020 -11123 -35467 -55388 -70544
877g0544r632O67J1967J6296J3311N025m756j1042o271Q297J6352J1480J872p750
$$ -70544 -80176 -79509 -67542 -51246 -37935 -32910 -37666 -48708 -54979 -46682 -30330 -18850 -16978 -24728
863b4728j1331p348o29K13n431j4067k1967k4766J6574K3421J9392J5579J1818
$$ -24728 -36059 -43407 -44036 -43823 -49254 -63321 -85288 -110054 -93480 -70059 -50667 -35088 -23270
850b3270R733d777C372b004H030M42C49a2998j9285k3968k4660q673J4323J3195
$$ -23270 -13537 -4777 3372 -2004 8030 8472 349 -12998 -32283 -56251 -80911 -89584 -75261 -62066
836f2066J193j3525k7455R504M3208f985l068b496C480j640E72f76D317c534D967
$$ -62066 -60873 -74398 -101853 -92349 -49141 -6985 -10053 -2496 3480 1840 572 -676 4317 -3534 4967
820A2170B129a2936K68O153C259J3898J0353l140N065C980a9093k5172n7775K0096
$$ 12170 2129 -12936 -12668 -6515 3259 17157 27510 24370 29435 3980 -19093 -44265 -102040 -81944
806h1944L4765J4859n395k1374k2719Q601K8763a9753d310A745e255l280q624
$$ -81944 -47179 -32320 -37715 -59089 -81808 -73207 -44444 -19753 -4310 1745 -5255 -8535 -17159
793a7159r313m704R80L363J374l531r369j3781j5842j0804J451J0001R116M747
$$ -17159 -26472 -31176 -30196 -26833 -25459 -28990 -38359 -52140 -67982 -78786 -77335 -67334 -58218 -53471
779e3471J563M165R329J0759N430m647j4146j8889j3578m4N917L60p062j0897
$$ -53471 -51908 -47743 -38414 -27655 -22225 -26872 -41018 -59907 -73485 -73529 -67612 -67252 -74314 -85211
765h5211j0334l801M516J1129J7525K4690a1551A1135e549A2891A283A2L604j499
$$ -85211 -95545 -99346 -94830 -83701 -66176 -41486 -11551 11135 -5549 12891 1283 12 3616 2117
751B117c7238k6671a7603A2039M593d451F964h58l3529J3837C949D57M740j540
$$ 2117 -37238 -63909 -17603 12039 16632 -4451 6964 -858 -34387 -20550 3949 457 5197 3657
737C657d129l3200a0871a875j0530P13J800j319q0b934h36G588b298A0184p17
$$ 3657 -4129 -37329 -10871 -1875 -12405 -11692 -9892 -11211 -11291 -2934 -836 7588 -2298 10184 9467
722I467d683C474d7374J9227a2787e590G209Q187m495B916J5166m669f177F789
$$ 9467 -4683 3474 -47374 -28147 -12787 -5590 7209 15396 10901 2916 18082 13413 -6177 6789
707A5881g67A116K2094l881I357B356c327a024E805A505a7259j8372n312J5151
$$ 15881 -767 1116 23210 19329 9357 2356 -3327 -1024 5805 1505 -17259 -35631 -40943 -25792
693b5792b544B173a2248r384m3656n041a2458B550e007l542K668O46k2897o4472
$$ -25792 -2544 2173 -12248 -21632 -65288 -70329 -12458 2550 -5007 -8549 -5881 -5235 -28132 -92604
679i2604L2717E587d288A1894n280d284m524K099j3316p09i064M57M020n590b268
$$ -92604 -59887 5587 -4288 11894 6614 -4284 -8808 -6709 -20025 -20734 -9064 -8607 -4587 -10177 -2268
663a4072F467L918P797o742I04J6653D312e905M95n7008m5087n369M557L1190
$$ -14072 6467 10385 18182 11440 904 17557 4312 -5905 -5410 -62418 -107505 -112874 -108317 -77127
649g7127b9450B569O250K112g404a050j387e35q775j450l4172l5238M651L5317
$$ -77127 -29450 2569 8819 10931 -7404 -1050 -2437 -535 -9310 -10760 -44932 -80170 -75519 -40202
635d0202a056B426P98a2880c868j2025f414j1341j2184j6948j8411L642K6513
$$ -40202 -1056 2426 3224 -12880 -3868 -15893 -6414 -17755 -29939 -46887 -65298 -61656 -35143
622c5143a1380c434o193j3859r665l671n878j6355j9039J2207b7844f366B632
$$ -35143 -11380 -3434 -9627 -23486 -33151 -36822 -42700 -59055 -78094 -65887 -27844 -6366 2632
608a8541m8090j4396c8349a3461j1265l5014J2748I509e262C539M491K81d336
$$ -18541 -66631 -81027 -38349 -13461 -24726 -59740 -46992 9509 -5262 3539 8030 8311 -4336
594e569m858e13B621i545D514M894e4A497d92j0077G015d3581m0512b4611G99
$$ -5569 -10427 -513 2621 -9545 4514 9408 -54 1497 -492 -10569 7015 -43581 -84093 -24611 799
578d891k74D63j48L474A893o83e504m7331m8289J5819M0003b1306O96k3682m2809
$$ -4891 -5165 463 315 3789 1893 1210 -5504 -52835 -101124 -85305 -45302 -21306 -20610 -44292 -87101
563h7101k0229N2359a2351D35J2503L68D086a3716k570n0667l4302a2410f4G117
$$ -87101 -107330 -54971 -12351 435 12938 13306 4086 -13716 -16286 -66953 -101255 -12410 -64 7117
548A6721k546l353d370B567e6495J9832A783b03G44a585C501a0813c804j773j9517
$$ 16721 14175 10822 -4370 2567 -56495 -36663 1783 -203 744 -1585 3501 -10813 -3804 -5577 -25094
533b5094a56H247C966A381g51C46R248d374j136o423j231c312E512M437r02E09
$$ -25094 -156 8247 3966 1381 -751 346 9594 -4374 -5510 -11933 -13164 -3312 5512 9949 9047 509
516e6647m136a2384A1551C295b217C064b6050m9385P375b3328E852N448l850a6185
$$ -56647 -60783 -12384 11551 3295 -2217 3064 -26050 -75435 -68060 -23328 5852 11300 7450 -16185
501e9211m8473K8560b3864c343q93K84C472e73k869L29l2781l0857n41L552p815
$$ -59211 -107684 -79124 -23864 -3343 -4236 -3952 3472 -573 -3442 -3113 -35894 -66751 -67292 -63740 -71555
486g1555j4579j2337m819O558K0191K8430a9308B913J1822k563d191j0588k1929
$$ -71555 -86134 -98471 -103290 -96732 -76541 -48111 -19308 2913 14735 12172 -4191 -14779 -36708
473c6708k1908j7117p322M207J6697K5986e721a991j938k931D951B60b68n309
$$ -36708 -58616 -75733 -83055 -78848 -62151 -36165 -5721 -1991 -3929 -6860 4951 260 -268 -5577
459e577K616R65k706R73D393J687A071a492k655m633p270l0776O810a9011Q732
$$ -5577 -2961 -1996 -4702 -3729 4393 6080 1071 -1492 -4147 -8780 -16050 -46826 -40016 -19011 -10279
444a0279q870k2876j3332K0177e836n580e234q348k8072M214d676B7813K2827
$$ -10279 -19149 -42025 -55357 -35180 -5836 -11416 -5234 -13582 -41654 -37440 -4676 27813 50640
431E0640J3287Q213M082k989k1182k923j2386A0102n72B896a266q258K0n99d01
$$ 50640 63927 72140 76222 73233 52051 49128 36742 10102 9530 2896 -1266 -9524 -9504 -10103 -401
415a169j6987j6421n397Q954J5503b547D02a0213j8374j7784j4378j2020r778
$$ -1169 -18156 -34577 -39974 -31020 -15517 -2547 402 -10213 -28587 -46371 -60749 -72769 -82547
402h2547r439n801r53O65R36q37l352n436M999K1743J9004J6270J3509N533L743
$$ -82547 -91986 -97787 -98740 -98075 -97139 -97976 -101328 -106764 -101765 -80022 -61018 -44748 -31239 -25706 -21963
387b1963L899J5L665g161G36a355c03C754ka489l689a10j426o303l7770l1415
$$ -21963 -18064 -18049 -14384 -7161 736 -1355 -303 3754 3752 -1489 -5178 -110 -1536 -7839 -45609 -77024
371g7024a235A3568D69c690n3643J6727D005Q68c946C138h744p1656c4278A8716
$$ -77024 -1235 13568 469 -3690 -57333 -40606 4005 4873 -3946 3138 -8744 -80400 -34278 18716
356b466A2375K9505K3840j0992E978c0365m6091p956L7714a1997F958f409D211
$$ -2466 12375 41880 65720 54728 5978 -30365 -76456 -84412 -46698 -11997 6958 -6409 4211
342d68l4986j1124B602l44a1670k8171l213J8641l3024A3170c9013j9847K9037
$$ -468 -35454 -46578 2602 2258 -11670 -39841 -43054 -24413 -57437 13170 -39013 -58860 -29823
329b9823D047h4900L7417B5394A2338O355I265K105j644P47J0058K2480M6869
$$ -29823 4047 -84900 -47483 25394 12338 18693 9265 11370 9726 10473 20531 43011 89880
316H9880J08141K22436K44141J81346J786584J2252839N6156184K77816452J29321156
$$ 89880 198021 420457 664598 845944 2632528 14885367 71041551 348858003 478179159
307D78179159B07693717I554074m612847A759782F97946j40748r5297A30105l6205
$$ 478179159 207693717 9554074 4941227 1759782 697946 557198 461901 130105 93900
298I3900A7064N3647c862B0349b824A6085h223b173n301A0359d9039b770n3393
$$ 93900 17064 70711 -3862 20349 -2824 16085 -8223 -2173 -7474 10359 -49039 -2770 -56163
285e6163h252k9311j3239R84K0780k5890c559p891l1616a3568m115m3665J0048
$$ -56163 -8252 -37563 -50802 -49818 -29038 -54928 -3559 -11450 -43066 -13568 -17683 -61348 -51300
272e1300H595j619b151k692k4384o5309O536b4567C254g132A0369E110e407o900
$$ -51300 8595 6976 -2151 -4843 -29227 -94536 -88000 -24567 3254 -7132 10369 5110 -5407 -12307
258a2307L979l7630n3662b9791B132K41a3352b234o3567R535i50j1137D690d028
$$ -12307 -8328 -45958 -99620 -29791 2132 2373 -13352 -2234 -65801 -56266 -950 -12087 4690 -4028
243b7687n8751g556L209k705l535b283L96A968i024M88b491J85k206O5k550j2301
$$ -27687 -86438 -7556 -4347 -7052 -10587 -2283 -1887 1968 -9024 -8536 -2491 -2306 -4512 -4447 -6997 -19298
227a9298j5469j2655n438q356r118r478j1537o202j692J42L513Q018R795J0620
$$ -19298 -34767 -47422 -52860 -61216 -70334 -79812 -91349 -97551 -99243 -99101 -95588 -87570 -77775 -67155
213f7155J2991J2855J2657a2025J854c158F491P571k132a222j0040H69L901b683
$$ -67155 -54164 -41309 -28652 -12025 -10171 -3158 6491 14062 11930 -1222 -11262 869 4770 -2683
198B276J911j283a0168H0N776e029p149k579N836m11l27l571i33k045I8J2e903
$$ 2276 4187 2904 -10168 80 5856 -5029 -12178 -14757 -8921 -9332 -9659 -13230 -933 -2978 98 110 -5903
180d532l534g92B850J138M651b4642p081J5267g820n796k4147j7556K2116H216
$$ -4532 -8066 -792 2850 3988 8639 -24642 -31723 -16456 -7820 -13616 -37763 -55319 -33203 8216
165F358a2495A828R773k715c46p569H64R483K43P469k262D038f458a336f21C157
$$ 6358 -12495 1828 11601 8886 -346 -7915 864 10347 10590 18059 15797 4038 -6458 -1336 -621 3157
148b2490k8543k2161j2706n15J1688K0737K4869c683A7314n723A590G37g423k6958
$$ -22490 -51033 -73194 -85900 -86415 -74727 -53990 -29121 -3683 17314 11591 1590 737 -7423 -34381
134c4381k2957j4496j1279j3175q494P384O176O916K5410a1531I696l921j960
$$ -34381 -57338 -71834 -83113 -96288 -104782 -97398 -91222 -84306 -58896 -11531 9696 5775 3815
121C815b27D03i16o028m4151n4902K0537c5236F630j311k089a2300j6630o4196
$$ 3815 -227 403 -916 -6944 -51095 -105997 -85460 -35236 6630 5319 3230 -12300 -28930 -93126
107i3126K0206b837p656d17A2295J645a5068p5778K3938H217c079m170a50A3333
$$ -93126 -72920 -2837 -10493 -417 12295 13940 -15068 -90846 -66908 8217 -3079 -7249 -150 13333
92A8459K625O560J1659j7461E619g516j65B386g05q991n60A319L570d378r304
$$ 18459 21084 27644 39303 21842 5619 -7516 -7681 2386 -705 -9696 -10256 1319 4889 -4378 -13682
77a3682a546r440j6369l0243l2717M0195C308b802k908l692A261L841J585e7271
$$ -13682 -1546 -10986 -27355 -57598 -90315 -50120 3308 -2802 -5710 -9402 1261 5102 6687 -57271
62i9249M9545a8699g789K645e49M4p784j0173l0868k8650L13J7527O486j2820
$$ -99249 -49704 -18699 -7789 -5144 -549 -505 -8289 -18462 -49330 -77980 -77667 -60140 -53654 -66474
48f6474k9827j6677M3641b6187I722l483a976l287b307N48Q34m807K043l9503
$$ -66474 -96301 -112978 -69337 -26187 9722 6239 -1976 -5263 -2307 -1759 -925 -5732 -3689 -43192
34d3192m9258K7712a3590C04a750D64i045j7026M828f679I06d311B79M668q86
$$ -43192 -92450 -64738 -13590 304 -1750 464 -9045 -26071 -21243 -6679 906 -4311 279 4947 4061
19D061K870J0679G465e265j388l1045r44a0415K784l4125n2155K3555a6366d388
$$ 4061 6931 17610 7465 -5265 -6653 -37698 -38642 -10415 -7631 -41756 -93911 -70356 -16366 -4388
4f524k9244m0833o98K8092
$$ -6524 -35768 -76601 -77299 -49207
0d9207
$$ -49207
##PAGE= F1=1043.376414144
##FIRST=     2915.55639409065, 2671.18566176471, 300
##DATA TABLE= (F2++(Y..Y)), PROFILE
1023C00j38f45l422p361o316o978p710l239O141Q744N141M821A214J3248q02E300
$$ 300 162 -645 -4067 -11428 -17744 -24722 -32432 -35671 -29530 -20786 -15645 -10824 1214 14462 13660 5300
1006e013a11A1294a3463l0174k2189K6376a0096A4266o844r58c469f30D497K251
$$ -5013 -111 11294 -13463 -43637 -65826 -39450 -10096 14266 7422 6464 -3469 -630 4497 6748
992F748b808k4322j5235r85Q61l58J3073A88R1i795D79f170d48B583g235b711
$$ 6748 -2808 -27130 -42365 -43350 -42489 -42847 -29774 188 279 -9795 479 -6170 -448 2583 -7235 -2711
975e361j5013k1084j2338j293L359P501J2354J4802d200D458O20j335d028j0485
$$ -5361 -20374 -41458 -53796 -55089 -51730 -44229 -31875 -17073 -4200 4458 5078 3743 -4028 -14513
961a4513r782k698O552J0199b266j867l773j3967j4971j485J3340J1073K603n522
$$ -14513 -24295 -26993 -20441 -10242 -2266 -4133 -7906 -21873 -36844 -38329 -24989 -13916 -11313 -16835
947a6835r792n246P787i923a641E787a0854b965b2k315p555B050e334l499A4919
$$ -16835 -26627 -31873 -24086 -9923 -1641 5787 -10854 -2965 -22 -2337 -9892 2050 -5334 -8833 14919
931B3883g28H510L1a552m013o65A1995Q849I374b3536k8754J5486a2857f62B359
$$ 23883 -728 8510 8541 -1552 -5565 -6230 11995 20844 9374 -23536 -52290 -36804 -12857 -662 2359
915g504j528n255k1196f815a06E897j263a1979B785K767c320A644K1963q506G262
$$ -7504 -9032 -14287 -35483 -6815 -106 5897 4634 -11979 2785 5552 -3320 1644 23607 15101 7262
899f242l952I14f540I178A636L996a227A913c7131K848F914K687d488G812c368
$$ -6242 -10194 914 -6540 9178 1636 5632 -1227 1913 -37131 -34283 6914 9601 -4488 7812 -3368
883b550J085m081K01Q93r169m114J042M751N951n671b277O85o246p899m747J629
$$ -2550 -1465 -5546 -5345 -4452 -13621 -17735 -16693 -11942 -5991 -11662 -2277 -1592 -7838 -15737 -20484 -18855
867a8855N539L101j566o548p136j557N132N555J296m861j0632j3520j4729J0790
$$ -18855 -13316 -10215 -11781 -18329 -25465 -27022 -21890 -16335 -15039 -19900 -30532 -44052 -58781 -47991
853d7991J3363J2764a0617g01G509j716c601G259J631a44j1966j5309j7343j2064
$$ -47991 -34628 -21864 -10617 -701 7509 5793 -3601 7259 8890 -144 -12110 -27419 -44762 -56826
839e6826J4094J0552L465m603q982K545J9183A88O423c430e66C85aj845L74E203
$$ -56826 -42732 -32180 -28715 -33318 -42300 -39755 -20572 188 6611 -3430 -566 385 -1 -1846 -1472 5203
822f24n59E062C97a1936K298J016B457J6918P616r857K3235j4498h260q667j4004
$$ -624 -1183 5062 397 -11936 -9638 -8622 2457 19375 26991 17134 40369 25871 -8260 -16927 -30931
807c0931k2193J7650R192k337r139k242J2122J3742e424K525l562r344j3144j4900
$$ -30931 -53124 -35474 -26282 -28619 -37758 -40000 -27878 -14136 -5424 -2899 -6461 -15805 -28949 -43849
793d3849p975J1298J3107Q966L619j301m839o012o003m741m305l801l795l340
$$ -43849 -51824 -40526 -27419 -18453 -14834 -16135 -20974 -26986 -32989 -37730 -42035 -45836 -49631 -52971
779e2971k666L04K848K389q43m673r05R655J0660P025J979l557o249n343m648
$$ -52971 -55637 -55333 -52485 -50096 -50939 -55612 -56517 -46862 -36202 -29177 -27198 -30755 -37004 -42347 -46995
764d6995m931o6J1223J5694h283D528L091G23J6049B114d47E584d54o212n950
$$ -46995 -51926 -51992 -40769 -25075 -8283 4528 7619 723 16772 2114 -447 5584 -454 -6666 -12616
749a2616e589A4595R15c484H441a6577k7911J2059d465A741P496r91c65k7344
$$ -12616 -5589 14595 15510 -3484 8441 -16577 -44488 -32429 -4465 1741 9237 8246 -365 -27709
735b7709k1893d473p385L256l084e094m351b944R10G865a316F145J381d494B579
$$ -27709 -49602 -4473 -11858 -8602 -11686 -5094 -9445 -2944 -2034 7865 -1316 6145 7526 -4494 2579
719b653p267j878N868I964Q997p124E288J6110q502h340E717P329d468D207J9358
$$ -2653 -9920 -11798 -5930 9964 18961 11837 5288 21398 12896 -8340 5717 13046 -4468 4207 23565
704B3565m954q404B275c677J058k824r624r812n081O028a1764i82A588i226r882
$$ 23565 18611 10207 2275 -3677 -2619 -5443 -15067 -24879 -29960 -23932 -11764 -982 1588 -9226 -19108
689a9108j8807K435a2314c82n878k904L544j5170l2368J0821h514A705d288A2109
$$ -19108 -37915 -35480 -12314 -382 -6260 -9164 -5620 -20790 -53158 -42337 -8514 1705 -4288 12109
674H003c7j681j0422j9347J4083f274m263d982n401D39i098D609N340J1478n522
$$ 8003 -37 -1718 -12140 -31487 -17404 -6274 -10537 -4982 -10383 439 -9098 4609 9949 21427 15905
659A5905d11A2498E27c795L39k2828j5618k559N042J4492d370C515N047M909f053
$$ 15905 -411 12498 527 -3795 -3456 -26284 -41902 -44461 -39419 -24927 -4370 3515 8562 13471 -6053
643C988c60j602q966n70K994q327r930n329J0044b786B436a7524D14a1955H61
$$ 3988 -360 -1962 -10928 -11498 -8504 -16831 -26761 -32090 -22046 -2786 2436 -17524 414 -11955 861
627f655m864j3496q213j3811N477J7156a0284M798K305k265q475j0121o915N780
$$ -6655 -11519 -25015 -33228 -47039 -41562 -24406 -10284 -5486 -3181 -5446 -13921 -24042 -30957 -25177
613b5177h919J813a985E96b2086l1984J6331a2601e152j4936l0589K1644I793
$$ -25177 -8919 -7106 -1985 596 -22086 -54070 -37739 -12601 -5152 -20088 -50677 -29033 9793
599F72O765j759j4f040K449m422D231m48g251l509q504N897c746J427q189G464
$$ 672 7437 5678 5664 -6040 -3591 -8013 4231 3783 -7251 -10760 -19264 -13367 -3746 -2319 -10508 7464
582b262j8213f129A582d596l272c771J090C499n1k65a3982k8989j7694K6990a1753
$$ -2262 -20475 -6129 1582 -4596 -7868 -3771 -2681 3499 3448 3183 -13982 -42971 -60665 -33675 -11753
566g531Q50n54j5027j1162L638J3616c103F082M181m222i046r329l0327J576b707
$$ -7531 -6681 -7235 -22262 -33424 -29786 -16170 -3103 6082 10263 6041 -9046 -18375 -48702 -47126 -2707
550a17G586J1129j63G341a1366F220g690L040B288o25K649j756M865i035J835
$$ -117 7586 18715 18552 7341 -11366 6220 -7690 -4650 2288 1663 4312 2556 7421 -9035 -7200
535g200J155l853a838I573C250c333n545B932O186c952k260n275P9A188J0263
$$ -7200 -6045 -9898 -1838 9573 3250 -3333 -8878 2932 9118 -3952 -6212 -11487 -11408 1188 11451
520A1451K748n896c1776q328c989J121A1042D009f612d77k7366l3356K5588a2564
$$ 11451 14199 8303 -31776 -40104 -3989 -2868 11042 4009 -6612 -477 -27843 -61199 -35611 -12564
505B972J91i690k3580k3661K0439g638c489L91k025j073C299H57e56j1803l3931
$$ 2972 3163 -9690 -33270 -56931 -36492 -7638 -3489 -3098 -5123 -6196 3299 857 -556 -12359 -46290
490d6290j7057J7469O762k772p591o838Q41R904J3605J4473d857E358N752J013
$$ -46290 -63347 -45878 -39116 -41888 -49479 -56317 -55476 -45572 -31967 -17494 -4857 5358 11110 12123
476A2123c033c64r33k072m640j955R07M513p282a342k929j902O48F219b928p552
$$ 12123 -3033 -364 -1297 -3369 -8009 -9964 -9057 -4544 -11826 -1342 -4271 -6173 -5525 6219 -2928 -10480
460a0480M096b836j943j129R94D199O06d018J852l142o470k3093k0674P42J6115
$$ -10480 -6384 -2836 -4779 -5908 -4914 4199 4805 -4018 -2166 -5308 -11778 -34871 -55545 -54803 -38688
445c8688R924J468p995p502R191a6613N568L049j4700k1364J436a8976A959J4458
$$ -38688 -28764 -27296 -35291 -42793 -33602 -16613 -11045 -7996 -22696 -44060 -42624 -18976 1959 16417
431A6417Q861N612K566j904p590A1536c700j5223j1243o484o72L981N459M372
$$ 16417 25278 30890 33456 31552 23962 11536 -3700 -18923 -30166 -36650 -37322 -33341 -27882 -23510
417b3510L47o45n15K487Q092e405C684L366H90g715j4675j0475m145l000l427
$$ -23510 -23163 -23808 -24323 -21836 -13744 -5405 3684 7050 890 -7715 -22390 -32865 -37010 -40010 -43437
402d3437l072l11Q18o90l068n586k682P912J4840J4245J0363R95P68C78b771n275
$$ -43437 -46509 -46820 -46002 -46692 -49760 -55346 -58028 -50116 -35276 -21031 -10668 -9673 -8905 378 -2771 -8046
386h046q821q339m864q64Q080b125C382q71d420l551K966j13m453j943j8858G552
$$ -8046 -16867 -25206 -30070 -30934 -22854 -2125 3382 2511 -4420 -7971 -5005 -5118 -9571 -11514 -30372 7552
369A7650C792K07f069j1852d46k399A458O270i680j842j7866d235J84A7359K0747
$$ 17650 3792 3999 -6069 -17921 -446 -2845 1458 7728 -9680 -11522 -29388 -4235 -4051 17359 38106
354C8106p598r892b776j6812k0648k6357J3924J8712a3830K437c609P28j8329
$$ 38106 30508 20616 -2776 -19588 -40236 -66593 -52669 -33957 -13830 -11393 -3609 -2881 -21210
341b1210j3644a4948A831a0177Q8B282f73m523A4356P675F509J1094p546L40j084
$$ -21210 -34854 -14948 1831 -10177 -10089 2282 -673 -5196 14356 22031 6509 17603 10057 10397 9313
326I313J0687G501J7051A2180k0k117L920K903K1603N5232L4015K36123M7067
$$ 9313 20000 7501 24552 12180 12160 10043 13963 16866 38469 93701 127716 363839 410906
313D10906L43548O61473Q937073M6872195J19350224L1118298l0718145H937377
$$ 410906 754454 1415927 10353000 57225195 176575419 207693717 176975572 8937377
304D873935A846233F10848k06636p596I7013k0935l3451L1480f2513A5612c6058
$$ 4873935 1846233 610848 404212 396616 97013 76078 42627 74107 -62513 15612 -36058
292H443d256m2096d317A2229A679L022a6280l0944r903K1672j7499K0044M699
$$ 8443 -4256 -46352 -4317 12229 1679 4701 -16280 -47224 -57127 -35455 -52954 -32910 -28211
279b8211C28a1837b28I410B774b0989K638G724l749f415j418j597k9221j0602
$$ -28211 328 -11837 -228 9410 2774 -20989 -18351 7724 3975 -6415 -7833 -9430 -38651 -49253
265d9253b3256B88f405A2935E006i999L050l399j7953j2693a3031A872L290a0562
$$ -49253 -23256 288 -6405 12935 5006 -9999 -6949 -10348 -28301 -40994 -13031 1872 5162 -10562
250e767l1171N421h90r054C756a774j1610k2259e722K073j501q191e498J098A232
$$ -5767 -36938 -31517 -890 -9944 3756 -1774 -13384 -35643 -5722 -3649 -5150 -13341 -5498 -4400 1232
234i894a660I76L32L445b212m428j4845k1761k1799K0188J6446J0117K093m083
$$ -9894 -1660 976 1308 4753 -2212 -6640 -21485 -43246 -65045 -44857 -28411 -18294 -16201 -20284
220b0284n388n150m056l18M461P597Q581e919H71K238h084J483A104Q677P034
$$ -20284 -25672 -30822 -34878 -35196 -30735 -23138 -14557 -5919 871 3109 -8084 -6601 1104 9781 16815
205A6815k235e11r272B757M869c613D489J283B219h595g31F131f334m148l249
$$ 16815 14580 -511 -9783 2757 7626 -3613 4489 5772 2219 -8595 -731 6131 -6334 -10482 -13731
190a3731M801j735m974j0265k205J844L290Q299E61d394j208A385A75N404j260
$$ -13731 -8930 -10665 -15639 -25904 -28109 -26265 -22975 -14676 561 -4394 -5602 1385 175 5579 4319
175D319h517k256L869l835J13j5891k0405M047a6773B254a4007i51G927L986B808
$$ 4319 -8517 -10773 -6904 -10739 -10626 -26517 -46922 -42875 -16773 2254 -14007 -951 7927 11913 2808
159g002l779j3662N500a389A3633F80g227a326n6j424j5509j7118j6248j3629
$$ -7002 -10781 -24443 -18943 -1389 13633 680 -7227 -1326 -1382 -2806 -18315 -35433 -51681 -65310
145f5310N640N092N84j387O535J4558J5138h525L557k617m000r30L018J732k748
$$ -65310 -59670 -54578 -53994 -55381 -48846 -34288 -19150 -8525 -4968 -7585 -11585 -12515 -9497 -7765 -10513
130a0513o913p427m325J750P806c477A3772F850j200b64l514a235j7430k9993
$$ -10513 -17426 -24853 -29178 -27428 -19622 -3477 13772 6850 5650 -264 -3778 -1235 -18665 -48658
116d8658n280b4338D274N387l055q91a2254B757c2276L696A611i555b3A6149J304
$$ -48658 -53938 -24338 4274 9661 6606 5715 -12254 2757 -32276 -28580 1611 -9555 -23 16149 17453
101A7453d160l4166J1088D047c932j755F5J0235L421P96l706O394B273e503m346
$$ 17453 -4160 -38326 -27238 4047 -3932 -5687 65 10300 13721 14517 10811 17205 2273 -5503 -9849
86i849b531C915A724i505m21b34C150f448n171j6842r735N102k050j3314L933
$$ -9849 -2531 3915 1724 -9505 -9926 -234 3150 -6448 -11619 -28461 -38196 -33094 -35144 -48458 -44525
71d4525i734c090J420o255b761C589H71b5893l4126P992Q960J373N684J1649R531
$$ -44525 -9734 -3090 -1670 -7925 -2761 3589 871 -25893 -60019 -52027 -43067 -41694 -36010 -24361 -14830
56a4830J656m188k160O470c003A738c862j6312k1213m593K2071d90A8437G850
$$ -14830 -13174 -17362 -19522 -13052 -3003 1738 -3862 -20174 -41387 -45980 -23909 -490 18437 7850
41b33k155M52j564A569f288k07j5444k5544m798b5765b762b23a9o43n634k838
$$ -233 -2388 -1936 -3500 1569 -6288 -6495 -21939 -47483 -52281 -25765 -2762 -223 -19 -662 -6296 -9134
25i134q924l974P536d094C413A223L528J2874C817b258j24j0006k3677m66J645
$$ -9134 -18058 -22032 -14496 -4094 3413 1223 4751 17625 3817 -2258 -2382 -12388 -36065 -36531 -34886
10c4886j3169p791b3989A965P47e277r244j5316J3652C216
$$ -34886 -48055 -55846 -23989 1965 2712 -5277 -14521 -29837 -16185 3216
##PAGE= F1=1040.765284465
##FIRST=     2915.55639409065, 2671.18566176471, 431
##DATA TABLE= (F2++(Y..Y)), PROFILE
1023D31M20a277r07k499H548C973a940k676N72R08k642J080H851K417k8D793c523
$$ 431 851 -1277 -2184 -4683 8548 3973 -1940 -4616 -4044 -3136 -5778 -4698 8851 11268 11240 4793 -3523
1005a338l58h29k126D96h91l344g37C410L223d555b249A626J159e29n418k513
$$ -1338 -1696 -829 -2955 496 -891 -4235 -737 3410 6633 -4555 -2249 1626 2785 -529 -5947 -8460
989h460K047L108J624n85k328l641m932l081q42J233J207J599J700J330J271M97
$$ -8460 -6413 -3305 -1681 -2266 -4594 -8235 -13167 -16248 -17090 -15857 -14650 -13051 -11351 -10021 -8750 -8253
973h253l25m50k39j755M685C54J120N340j951P60B297b706r120k696l332K131
$$ -8253 -8578 -9028 -9267 -11022 -6337 354 1474 6814 4863 5623 2297 -2706 -11826 -14522 -17854 -15723
957a5723K369L167M452i08n059F611h078p454f915q174l006M548K778Q92k23j454
$$ -15723 -13354 -10187 -5735 -908 -5967 6611 -8078 -15532 -6915 -15089 -18095 -13547 -10769 -9877 -10100 -11554
941a1554l877m049i238b817m768G020E11i467A0006P383A766f309C617e497K135
$$ -11554 -15431 -19480 -9238 -2817 -7585 7020 511 -9467 10006 17389 1766 -6309 3617 -5497 -3362
926c362J494A0137N905o509e098F52d286l655l060j632J381K390J992q22l845
$$ -3362 -1868 10137 16042 9533 -5098 652 -4286 -7941 -11001 -12633 -11252 -8862 -6870 -7692 -11537
911a1537j955e310B796h716A447J321a0187H816J1044k652G875l476f87B571i470
$$ -11537 -13492 -5310 2796 -8716 1447 2768 -10187 8816 19860 17208 7875 4399 -687 2571 -9470
895b0880P316O292J126j778J519B910N757k742b519F333i412A055b536p09m205
$$ -20880 -13564 -7272 -6146 -7924 -6405 2910 8667 5925 -2519 6333 -9412 1055 -2536 -3245 -7450
880g450L607d91j3m295A098g497J335c88C15Q673M838d85o189b007j2146K606
$$ -7450 -3843 -491 -504 -4799 1098 -7497 -6162 -388 315 8988 13826 -485 -6674 -2007 -14153 -11547
864a1547k792J567K260J182L22Q89L586f79E38L173o92A424h575J906a695A460
$$ -11547 -14339 -12772 -10512 -9330 -9008 -8119 -4533 -679 538 3711 3019 1424 -8575 -6669 -1695 1460
847I66d621D254a6n358n331n243k513K639M223L247j617K754k667m101k902m86
$$ 966 -4621 4254 -16 -5374 -10705 -15948 -18461 -15822 -11599 -8352 -9969 -7215 -9882 -13983 -16885 -17371
831a7371J520K666M619b469l6j66R33D520E97f003a133J98j0158M099n878N624
$$ -17371 -15851 -13185 -8566 -2469 -2505 -2671 -1738 4520 597 -6003 -1133 -935 -11093 -6994 -12872 -7248
815g248B422J1152o468K6646M719A0594d769H122O15a830p275k448N66J997j404
$$ -7248 2422 13574 7106 33752 38471 10594 -4769 8122 8737 -1830 -9105 -11553 -10987 -8990 -10394
800a0394M689k384n336o032M354e847g16H23c59q515f66j0327B520f612g91C403
$$ -10394 -5705 -8089 -13425 -19457 -15103 -5847 -716 823 -359 -8874 -666 -10993 2520 -6612 -791 3403
783F793K19M514l276d212m598J588C631K0g423f17l035l114j570j045P05J491
$$ 6793 7012 11526 8250 -4212 -8810 -7222 3631 3651 -7423 -617 -3652 -6766 -8336 -9381 -8676 -7185
767g185N47m649d989J29K293l645m936K651H63L597J842L53A595a509j741l288
$$ -7185 -6638 -11287 -4989 -4860 -2567 -6212 -11148 -8497 863 4460 6302 6655 1595 -1509 -3250 -6538
751f538k573k719k351k788k621j158N005g232A824M205B4J945J0459P34B648f718
$$ -6538 -9111 -11830 -14181 -16969 -19590 -20748 -15743 -7232 1824 6029 24 1969 12428 13162 2648 -6718
734h758L79j2195P705N550a092q015c723J009a218j300A705K390d457B27f953
$$ -8758 -8379 -20574 -12869 -7319 -1092 -9107 -3723 -2714 -1218 -2518 1705 4095 -4457 227 -6953
718a1041j165d731E765j183B198d22k731k880l553m270l712J869N254L736J509
$$ -11041 -12206 -4731 5765 4582 2198 -422 -3153 -6033 -9586 -13856 -17568 -15699 -10445 -6709 -5200
703e200M91K086n00k459C089e737K227A137Lg42m767b059o991n466l439k461K300
$$ -5200 -4709 -2623 -3123 -5582 3089 -5737 -3510 1137 1140 -742 -5509 -2059 -9050 -14516 -17955 -20416 -18116
686a8116P306K814k469M090J654r91C116R198a977j23l829Q3K798a120M96B99
$$ -18116 -10810 -7996 -10465 -6375 -4721 -5712 3116 12314 -1977 -2100 -5929 -5846 -3048 -1120 -624 299
669B347d261q000N825l115j748p869P38P503d543b04B3J755a186k257l114r77
$$ 2347 -4261 -12261 -6436 -9551 -11299 -19168 -18430 -10927 -4543 -204 23 1778 -1186 -3443 -6557 -7534
653g534J370l124a589C22R53J71a24l448n793n625K744e350q506J010b861j504
$$ -7534 -6164 -9288 -1589 322 1275 1446 -124 -3572 -9365 -14990 -12246 -5350 -13856 -12846 -2861 -4365
637d365p334b677A2224a435D21a3291E905e558C173e287n511j0970Q221L095k600
$$ -4365 -11699 -2677 12224 -1435 421 -13291 5905 -5558 3173 -5287 -10798 -21768 -13547 -10452 -13052
622a3052p600N844d577j63E536M44A701H32K8M177c969B61c971j867b736m792
$$ -13052 -20652 -14808 -4577 -4740 5536 5980 1701 832 860 5037 -3969 261 -3971 -5838 -2736 -7528
606g528k586m068m414h382E114M995m114M489A916N51f903c246l681c256P77j275
$$ -7528 -10114 -14182 -18596 -8382 5114 10109 5995 10484 1916 2467 -6903 -3246 -6927 -3256 -2479 -3754
590c754O74G476a149p678d119n079R32m051j009J294L155L236l828J748K454B002
$$ -3754 -3080 7476 -1149 -8827 -4119 -9198 -8266 -12317 -13326 -12032 -8877 -5641 -9469 -7721 -5267 2002
573D924j063K469K385f879K281m16j978J149B389b049l522o793J825D04P230k59
$$ 4924 3861 6330 8715 -6879 -4598 -5014 -6992 -5843 2389 -2049 -5571 -12364 -10539 404 7634 7375
557G375Q14c832m769J33r871o2P205b982D614M208m242h376B498J576c713B466
$$ 7375 8189 -3832 -8601 -8468 -18339 -18401 -11196 -2982 4614 8822 4580 -8376 2498 4074 -3713 2466
540B208M179k436M508h024j614k88c597E339N143A909h176j420A136N190d431
$$ 2208 6387 3951 8459 -8024 -9638 -9926 -3597 5339 10482 1909 -8176 -9596 1136 6326 -4431
524e937K2j404E249R083J283k554B746c175J225k749A0068l894a1018E42k5d289
$$ -5937 -5915 -7319 5249 14332 15615 13061 2746 -3175 -1950 -4699 10068 6174 -11018 542 517 -4289
507b910p404d789p115m734e891G182c248j298K069Q64m377l873A44J047J321J850
$$ -2910 -10314 -4789 -11904 -16638 -5891 7182 -3248 -4546 -2477 -1613 -5990 -9863 144 1191 2512 4362
491D362b771j0555r648N903O022K972j99l280l948j849K248L358L657c930b22
$$ 4362 -2771 -13326 -22974 -17071 -11049 -8077 -8276 -11556 -15504 -17353 -15105 -11747 -8090 -3930 -222
475b543e41b19A964b873e35G080j169a4061c216k880j363n537L94c993m150a086
$$ -2543 -541 -219 1964 -2873 -535 7080 5911 -14061 -3216 -6096 -7459 -12996 -12602 -3993 -8143 -1086
458d770j914p65J747D203a279j5368L417d683o696B890Q13f024K639J152r679
$$ -4770 -6684 -7449 -5702 4203 -1279 -16647 -13230 -4683 -11379 2890 3703 -6024 -3385 -2233 -11912
443a1912o61k999J080M91l88j191l02r8j181k208k083j384L430N277O220h79E343
$$ -11912 -12573 -15572 -14492 -14001 -14389 -15580 -15882 -15980 -17161 -19369 -21452 -22836 -19406 -14129 -7909 -879 5343
425H892K98e50B899h72k591q301L692m278o916M27P014e438b553r850c298F58
$$ 8892 9190 -550 2899 -872 -3463 -11764 -8072 -12350 -19266 -18839 -11825 -5438 -2553 -12403 -3298 658
408f227M48b720j899j867l063l907n410m365M498K638L77r20k06N44J783N40n55
$$ -6227 -5779 -2720 -4619 -6486 -9549 -13456 -18866 -23231 -18733 -16095 -15718 -16638 -16844 -16300 -14517 -13977 -14532
391a4532q57q93q27j364j931L3L109L051K433J627J859K992i92l258A85d019l412
$$ -14532 -15389 -16282 -17109 -18473 -20404 -20371 -17262 -14211 -11778 -10151 -8292 -5300 -992 -4250 185 -4019 -7431
374g431k940K105k64A2904P226F919J578K189f373j43m882G506M633f815i7F408
$$ -7431 -10371 -8266 -8530 12904 20130 6919 8497 10686 -6373 -6516 -11398 7506 12139 -6815 -97 6408
357E507C31N269K138J18j781l033C25b154j120p17k632k750k907k794j926j775
$$ 5507 331 5600 7738 7856 6075 3042 325 -2154 -3274 -3991 -6623 -9373 -12280 -15074 -17000 -18775
341a8775r30R51P016M160l686A3372M39f124I822J1362l851p873A50a987C130
$$ -18775 -19705 -18754 -11738 -7578 -11264 13372 13811 -6124 9822 21184 17333 9460 150 -1987 3130
325F256k366J0130j893j649p50O041n423J7027P463J1139M9915N167J60092M9538
$$ 6256 3890 14020 12127 10478 9728 15769 10346 27373 34836 45975 95890 101057 261149 310687
311C10687N20068K870754L610055K242510o16697k993255B549857D64268B02254
$$ 310687 830755 3701509 7311564 9554074 8937377 5944122 2549857 464268 202254
301A67477l3329m7282k6335j7470A321K624N003C411e957c5j806G73J2603G79
$$ 167477 134148 86866 60531 43061 1321 3945 8948 3411 -5957 -35 -1841 773 13376 779
286a848h31j0260m460K277f522m131A44J743a2227D638K005j241B353a041m260
$$ -1848 -831 -11091 -15551 -13274 -6522 -10653 144 1887 -12227 4638 6643 5402 2353 -1041 -5301
271e301k344m33k59l627n939p059O942P056N179I3K802i105E26a0424H84M735
$$ -5301 -7645 -8078 -8337 -11964 -17903 -24962 -18020 -10964 -5785 93 2895 -9105 526 -10424 884 5619
255E619A600a188F995d737k365l84k563M981l704A17e85k598o769d051N34l28
$$ 5619 1600 -1188 6995 -4737 -7102 -7486 -10049 -5068 -8772 117 -585 -3183 -9952 -4051 -3517 -3845
239c845q140K801J955p547o749N95L766K835J813K78j317k381j477L497N947a552
$$ -3845 -11985 -9184 -7229 -14776 -21525 -20930 -17164 -14329 -12516 -12238 -13555 -15936 -17413 -13916 -7969 -1552
222B810e184k498c127p01n230b051D420A030a329r93G84M734a488a39D353N504
$$ 2810 -5184 -7682 -3127 -3828 -9058 -2051 4420 1030 -1329 -2322 784 5518 -1488 -139 4353 9857
206I857P280q90e17p878D516N098e101B610b448l329j259Q88J822l080j826l905
$$ 9857 17137 16247 -517 -8395 4516 9614 -5101 2610 -2448 -5777 -7036 -6148 -4326 -7406 -9232 -13137
190a3137M312j774M769l199k928e722D524l70j547c514m49B905c72H358A975a0152
$$ -13137 -8825 -10599 -5830 -9029 -11957 -5722 4524 4154 2607 -3514 -3963 2905 -372 8358 1975 -10152
173a6851P806K07F338k262J775e53l67l472o546d631n633n005k123Q94L799M891
$$ -16851 -9045 -8838 6338 4076 5851 -553 -920 -4392 -10938 -4631 -10264 -15269 -17392 -16498 -12699 -7808
157g808c566a167L57k861k617m837m707m378l260L091O768L431a918G75e192j183
$$ -7808 -3566 -1167 -810 -3671 -6288 -11125 -15832 -20210 -23470 -20379 -13611 -10180 -1918 775 -5192 -6375
141f375E266a590n792m23c745H70b841n43A1013Q51B034Q2d330k295l875j836
$$ -6375 5266 -1590 -7382 -7805 -3745 870 -2841 -3384 11013 11864 2034 2116 -4330 -6625 -10500 -12336
125a2336Q13J434j5k082m291n556L76N297M832M308K638B791J486J782qa2844
$$ -12336 -11523 -10089 -10104 -12186 -16477 -22033 -21657 -16360 -11528 -7220 -4582 2791 4277 6059 6051 -12844
108C422j474a732E581g209e1D583d264r453p482g755b144m429j6a233E683j046
$$ 3422 1948 -1732 5581 -7209 -51 4583 -4264 -13717 -21199 -7755 -2144 -6573 -6589 -1233 5683 4637
92D637N17e708k854n412K029e213A299J636j33a0094o52a955A010i118r477R050
$$ 4637 5154 -5708 -8562 -13974 -11945 -5213 1299 2935 2802 -10094 -10746 -1955 1010 -9118 -18595 -9545
76i545c961l75C258N219l127c630l420a543j023q74D643i27k471n218m452l64
$$ -9545 -3961 -4336 3258 8477 5350 -3630 -7050 -1543 -2566 -3440 4643 -927 -3398 -8616 -13068 -13432
60a3432O578D55L660A374g229q509R36c656E159N496m502b327o51l807q993e965
$$ -13432 -6854 455 4115 1374 -7229 -15738 -14802 -3656 5159 10655 6153 -2327 -2978 -6785 -15778 -5965
43F060L676C260c96o445r638K484L679j202k849J806M011O75k572j431e416p42
$$ 6060 9736 3260 -396 -6841 -16479 -13995 -10316 -11518 -14367 -12561 -8550 -7875 -10447 -11878 -5416 -6158
27f158b146H244C082f353j1186M304e481J431C205O314q07k143A816a724A0221
$$ -6158 -2146 8244 3082 -6353 -17539 -13235 -5481 -4050 3205 9519 8712 6569 1816 -1724 10221
11D097j380M020B738a085k795m812o461j045f963K867B999
$$ 4097 2717 6737 2738 -1085 -3880 -8692 -15153 -16198 -6963 -4096 2999
##PAGE= F1=1038.154154786
##FIRST=     2915.55639409065, 2671.18566176471, 689
##DATA TABLE= (F2++(Y..Y)), PROFILE
1023F89P90a681n165k632K282K405O68j526k148j832r60L80O55O31m99k070l588
$$ 689 1479 -1681 -6846 -9478 -7196 -4791 -4123 -5649 -7797 -9629 -10589 -10209 -9554 -8923 -9422 -11492 -15080
1006a5080m278j115M849N954d220a299o031j641r062M155f114R87K022J213E357
$$ -15080 -19358 -20473 -15624 -9670 -4220 -1299 -7330 -8971 -18033 -13878 -6114 -5127 -3105 -1892 5357
990I150B777e735n134O72K714J752j830l754d358l287K239K441N4l728j624L618
$$ 9150 2777 -5735 -10869 -10197 -7483 -5731 -7561 -11315 -4358 -7645 -5406 -2965 -2911 -6639 -8263 -4645
974d645j614K055G38P73g903l9C598k04O780m764O987j509E085h727b694o396
$$ -4645 -6259 -4204 738 1511 -7903 -7942 3598 3394 10174 5410 12397 10888 5085 -8727 -2694 -9090
958i090n559P03P01b299I93d325H886a016j2982M082m031N135l186K937a99l570
$$ -9090 -14649 -13946 -13245 -2299 993 -4325 8886 -1016 -13998 -9916 -13947 -8812 -11998 -9061 -199 -3769
942c769M69o983L750k007j5558i446F791C256a0731C987a285j1258N013a856m439
$$ -3769 -3300 -10283 -6533 -8540 -24098 -9446 6791 3256 -10731 3987 -1285 -12543 -7530 -1856 -6295
927f295B229J596L084m80B697e527B441J515c529a405B159b425g13A617a723a5
$$ -6295 2229 3825 6909 6429 2697 -5527 2441 3956 -3529 -1405 2159 -2425 -713 1617 -1723 -15
910C654f445A484b495A465M97a2622A6062J939L31H646B643b063D419b451A668
$$ 3654 -6445 1484 -2495 1465 1962 -12622 16062 18001 18332 8646 2643 -2063 4419 -2451 1668
894h06k215j372l879K856l804m783n044m298M068P351c680j317b030l508K451
$$ -806 -3021 -4393 -8272 -5416 -9220 -14003 -19047 -23345 -19277 -11926 -3680 -4997 -2030 -5538 -3087
879c087D288a453r095L169J754g87B940a483C878M592c685m676I10a0419b487
$$ -3087 4288 -1453 -10548 -7379 -5625 -787 2940 -1483 3878 8470 -3685 -8361 910 -10419 -2487
863a1499m996N847b287C783d645E757c187A190L030L858j447e650l529K055K501
$$ -11499 -16495 -10648 -2287 3783 -4645 5757 -3187 1190 4220 8078 6631 -5650 -9179 -7124 -4623
848d623J737q82F02J562p60g812J114b773m799J987J720j1813A555j34d476j643
$$ -4623 -2886 -3768 602 2164 1404 -7812 -6698 -2773 -7572 -5585 -3865 -15678 1555 1421 -4476 -6119
832f119j393b147E505J500o45d295a388pC247A234e480b722g16q531j438n716
$$ -6119 -7512 -2147 5505 7005 6360 -4295 -1388 -1395 3247 1234 -5480 -2722 -716 -9247 -10685 -16401
816a6401M013N474a870r47F217K132l64l518a286p216o507K173N246K799N08n466
$$ -16401 -12388 -6914 -1870 -2817 6217 8349 7985 4467 -1286 -8502 -15009 -12836 -7590 -4791 -4283 -9749
800i749d734L04L74p35l957j551k445j030K010N329K933q172A783c800B67M170
$$ -9749 -4734 -4430 -4056 -4791 -8748 -10299 -12744 -13774 -11764 -6435 -3502 -11674 1783 -3800 267 4437
784D437L993K244N138m176a915o082N86E181b587q606p105J454M652K709M71k199
$$ 4437 8430 10674 15812 11636 -1915 -7997 -7411 5181 -2587 -11193 -18298 -16844 -12192 -9483 -9012 -11211
768a1211L06j120M94J405J985J761J333n768o73J614m143m694j279M088M491M827
$$ -11211 -10905 -12025 -11531 -10126 -8141 -6380 -5047 -10815 -11488 -9874 -14017 -18711 -19990 -15902 -11411 -6584
752f584K215p63D696N662K581k845C30P968f59I371m469b600A414J2918L084D436
$$ -6584 -4369 -5132 4696 10358 12939 10094 330 8298 -659 9371 4902 -2600 1414 14332 17416 4436
735g750K565J826l372q985l030K918L360L382K765J578M9j226j630p82J55k652
$$ -7750 -5185 -3359 -6731 -15716 -18746 -15828 -12468 -9086 -6321 -4743 -4694 -5920 -7550 -8332 -8177 -10829
719a0829m59P90j415m456j218Q370b03G512K615h708B743R868B158d025p989M094
$$ -10829 -11288 -10498 -11913 -16369 -17587 -9217 -203 7512 10127 -8708 2743 12611 2158 -4025 -12014 -7920
703g920B187o62a627p225C284d755l779a130L43m920j384R5r130O85N555K385
$$ -7920 2187 1525 -1627 -8852 3284 -4755 -8534 -1130 -787 -5707 -7091 -6996 -16126 -15441 -9886 -7501
687g501j101m073n299k98N384M003L085J800J236r35c45A849K472N83M644j865
$$ -7501 -8602 -12675 -17974 -18272 -12888 -8885 -5800 -4000 -2764 -3699 -345 1849 4321 4904 9548 7683
671G683k915nc027p858L508p676l401P879b532c1F512R39B510M20i85n388p564
$$ 7683 4768 4763 -3027 -10885 -7377 -15053 -18454 -10575 -2532 -31 6512 7451 2510 2930 -985 -6373 -13937
654a3937p074M920N928L792J608p49j795k365j969j706n20J085R97j284m382L599
$$ -13937 -21011 -16091 -10163 -6371 -4763 -5512 -7307 -9672 -11641 -13347 -13867 -12782 -11785 -13069 -17451 -13852
638a3852A59K378R322J1860c280O53k141A1546E06b00j4855r23l068L333H96a107
$$ -13852 159 2537 11859 23719 -3280 -2627 -4768 11546 506 -200 -15055 -15978 -19046 -15713 896 -1107
621e111l230c917j813A304K952j951M70O2I99b708l632l692l099k25m08L26J925
$$ -5111 -8341 -3917 -5730 1304 4256 2305 2775 2837 999 -2708 -6340 -10032 -13131 -13356 -13764 -13438 -11513
604a1513K457J992Q77l40j594l241l773k044K66J959M270d042C672a97q676I68
$$ -11513 -9056 -7064 -6187 -6527 -8121 -11362 -15135 -17179 -16913 -14954 -10684 -4042 3672 -197 -8873 968
587b858j0375O592j6E889B583i74k829j415l109r94k308M452a008E631k186J073
$$ -2858 -13233 -6641 -6657 5889 2583 -974 -3803 -5218 -8327 -9321 -11629 -7177 -1008 5631 3445 4518
571D518K543h746D587h72m704j265B818a087j814C131C86b300B018K639M666D40
$$ 4518 7061 -8746 4587 -872 -5576 -6841 2818 -1087 -2901 3131 386 -2300 2018 4657 9323 440
554i966A3330k522c060M73F966J1984J875C029c910C659B4c604A727l99M833A970
$$ -9966 13330 10808 -3060 -2587 6966 18950 20825 3029 -3910 3659 24 -3604 1727 1328 6161 1970
537c658j1181M743JM646F217M055g62j0284c903B137ao724P44a239k425j234o734
$$ -3658 -14839 -10096 -10095 -5449 6217 10272 -762 -11046 -3903 2137 -1 -6725 -5981 -1239 -3664 -4898 -11632
520a1632O86c058B847d172b084n951G769N16a0536B928a545k236l10l908b307
$$ -11632 -10946 -3058 2847 -4172 -2084 -8035 7769 8285 -10536 2928 -1545 -3781 -4091 -7999 -2307
504a591p501A514J267c943k44a945H8g514o245f176I5L155P71e278j0267n300
$$ -1591 -9092 1514 2781 -3943 -4187 -1945 88 -7514 -13759 -6176 95 3250 4021 -5278 -15545 -20845
488b0845R277d182F90K196a2303M373L505m678k221L372a260E034c933a401A23
$$ -20845 -11568 -4182 690 2886 -12303 -7930 -4425 -9103 -11324 -7952 -1260 5034 -3933 -1401 123
472C255c817j06l007j025m656L934n53j764k230J643e150m318c398l233l9l535
$$ 3255 -3817 -3923 -6930 -7955 -12611 -8677 -9230 -10994 -13224 -11581 -5150 -9468 -3398 -6631 -6670 -10205
456a0205K553b85p656l561L820b581r073D33K338c247R24k88j0678a816f12q076
$$ -10205 -7652 -285 -7941 -11502 -7682 -2581 -11654 433 2771 -3247 -2323 -2611 -13289 -1816 -612 -8688
440h688l101L584j324I36b205k783k408j494O42c891B619N874M103Q06BL362f392
$$ -8688 -11789 -8205 -9529 936 -2205 -4988 -7396 -8890 -8248 -3891 2619 8493 12596 13402 2 3364 -6392
422a2286l294J419K016J214J354p06K134Q26k326K934o06m130M018j816M030k22
$$ -12286 -15580 -14161 -12145 -10931 -9577 -10283 -8149 -7323 -9649 -6715 -7321 -11451 -7433 -9249 -5219 -5441
406e441j942k653j775J874L020K172k24k784l591J762a472H806L358h169R53b836
$$ -5441 -7383 -10036 -11811 -9937 -6917 -4745 -4969 -7753 -11344 -9582 -1472 8806 12164 -8169 -7216 -2836
389d601a324K47A241c79m741J011b65p654p693l861L701L861K332J138P00q77
$$ -4601 -1324 -1077 1241 -379 -5120 -4109 -265 -7919 -15612 -19473 -15772 -11911 -9579 -8441 -7741 -8618
373h618J713l657A1894P657H425K768Q5g281o469N986A2003K714d524b080B876
$$ -8618 -6905 -10562 11894 19551 8425 11193 11278 -7281 -13750 -7764 12003 14717 -4524 -2080 2876
357g69j6217g754D196N643q47B702b786A998O566J2920K718A427Q91e35j060B32
$$ -769 -16986 -7754 4196 9839 8992 2702 -2786 1998 8564 21484 24202 1427 2318 -535 -1595 232
340b518K32I8e370k220K243a151o346a370j298K84j539l729q060J702c44E19J8540
$$ -2518 -2286 98 -5370 -7590 -5347 -1151 -7497 -1370 -2668 -2384 -3923 -7652 -15712 -14010 -344 519 19059
323A9059H915l092r4a0495M324H555J2417c691E0621K1179J11652j6315O1825
$$ 19059 8915 5823 5729 -10495 -6171 8555 20972 -3691 50621 71800 183452 167137 228962
310B28962J417378J927173J367714o7292k324078q91510D49137B17992C2831K2483
$$ 228962 1646340 3573513 4941227 4873935 2549857 1658347 449137 217992 32831 55314
300E5314A8818o78a102p817K358a139q869r541J909O525K88J137J64o02e005m167
$$ 55314 18818 18140 -1102 -8919 -6561 -1139 -10008 -19549 -17640 -11115 -10827 -9690 -9526 -10128 -5005 -9172
284i172a730k913j868m96a258o482l011K453K849J517o87k643m257l840k821j863
$$ -9172 -1730 -4643 -6511 -7007 -1258 -7740 -10751 -8298 -5449 -3932 -4619 -7262 -11519 -15359 -18180 -20043
268b0043m77K950N277f080g05o168E914j8e302A200f031a690H604E33g436G003
$$ -20043 -20520 -17570 -12293 -6080 -705 -6873 5914 5896 -5302 1200 -6031 -1690 8604 533 -7436 7003
251a82q113l855M995a748o973L655j590j3084Q222c154r10R81l377l454c210C62
$$ -182 -8295 -12150 -7155 -1748 -8721 -5066 -6656 -19740 -11518 -3154 -4064 -3083 -6460 -9914 -3210 362
234B34Q474l523b330l797c024Q00b60n632n973k715N346d259m960K289b66j484
$$ 234 8708 5185 -2330 -6127 -3024 -2224 -260 -5892 -11865 -14580 -9234 -4259 -9219 -6930 -266 -1750
218a750r179A477n91b283n400o831l571Q416a533D957M29J414Q039K309a36o601
$$ -1750 -10929 1477 886 -2283 -7683 -14514 -18085 -9669 -1533 4957 5386 6800 14839 17148 -136 -6737
202f737E975M393f588F951l314h09n416k519k314j371o95J081L972J09N47r5J78
$$ -6737 5975 10368 -6588 6951 3637 -809 -6225 -8744 -11058 -12429 -13124 -12043 -8071 -7962 -7415 -7510 -7332
185g332G47M80b310ck053j985B702E01P395d918j1361c220n495c579F662k335
$$ -7332 747 1227 -2310 -3 -2056 -4041 2702 501 7896 -4918 -16279 -3220 -8715 -3579 6662 4327
169D327j063d521O30o894N010l92j014m806M645K475a922k138m705n708m017K453
$$ 4327 3264 -4521 -3891 -10785 -5775 -6167 -7181 -11987 -7342 -4867 -1922 -4060 -8765 -14473 -18490 -16037
153a6037L798L727L901A102N536M241e544j064O74K239l5o259O44n864j758K412
$$ -16037 -12239 -8512 -4611 1102 6638 10879 -5544 -6608 -5934 -3695 -3730 -9989 -9345 -15209 -16967 -14555
137a4555J506J087J795n35M869J345k7j762l713n785P42O352b890c31k173n427
$$ -14555 -13049 -11962 -10167 -10702 -5833 -4488 -4515 -6277 -9990 -15775 -15033 -8681 -2890 -331 -2504 -7931
121g931l110k821c431N22A421o41e209J090J748C680M59a1433A3630F642B54Q413
$$ -7931 -11041 -13862 -3431 -2909 1421 780 -5209 -4119 -2371 3680 4139 -11433 13630 6642 254 8667
105H667e501g35A0686Q41B171a767j0356L199j117Q76c751k461q010l844L021
$$ 8667 -5501 -735 10686 11527 2171 -1767 -12123 -8924 -10041 -9165 -3751 -6212 -14222 -18066 -15045
90a5045j2115N948J0071d453E24f75C099i031p63b330m148k201L833a854m791
$$ -15045 -27160 -21212 -11141 -4453 524 -675 3099 -9031 -9794 -2330 -6478 -8679 -4846 -1854 -6645
75f645l102B302I77d854m880L88M052a510B38b75k427l669m703n593K608f698
$$ -6645 -9747 2302 977 -4854 -9734 -9346 -5294 -1510 238 -275 -2702 -6371 -11074 -16667 -14059 -6698
58d66C453D17i720c31n005J549k030j450j883m161n693i432j765B830Q615p01
$$ -466 3453 417 -9720 -331 -5336 -3787 -5817 -7267 -9150 -13311 -19004 -9432 -11197 2830 11445 10744
42A0744m628a20k375n927d023l59k416K323m590j0284O531K071j872L019J554
$$ 10744 6116 -120 -2495 -8422 -4023 -4382 -6798 -4475 -9065 -19349 -12818 -10747 -12619 -9600 -8046
27h046A374B51c026e91o312J286a253n602G394Q149J787k924C882b000A1279C578
$$ -8046 1374 251 -3026 -591 -6903 -5617 -1253 -6855 7394 15543 17330 14406 3882 -2000 11279 3578
10B816M61F68c21H13a568l578j225b859Q26A467
$$ 2816 3277 668 -321 813 -1568 -5146 -6371 -2859 -2033 1467
##PAGE= F1=1035.543025107
##FIRST=     2915.55639409065, 2671.18566176471, 2460
##DATA TABLE= (F2++(Y..Y)), PROFILE
1023B460o25c509o259Q91b619A126m03d157p247o171L319N429L170J374k32q56
$$ 2460 1835 -3509 -9768 -8877 -2619 1126 723 -4157 -11404 -17575 -14256 -8827 -5657 -4283 -4515 -5371
1007e371J68L93h15D14c68j035M81p100a087n922j0238N590M579j061J645F172
$$ -5371 -5203 -4810 -815 414 -368 -1403 -922 -8022 -1087 -7009 -17247 -11657 -7078 -8139 -6494 6172
990A6661m408C74M968a650p546n714L580L053a982n991K619N4b14m715Q78D310
$$ 16661 12253 374 5342 -1650 -9196 -14910 -11330 -8277 -1982 -7973 -5354 -5300 -214 -4929 -4051 4310
973d838f28G939r76d985l281C156M651K048l167L229J0492G046c399C742K871
$$ -4838 -628 7939 6963 -4985 -8266 3156 7807 9855 6688 9917 20409 7046 -3399 3742 6613
958F613l136e348p111d420B454b707A985A72i712a061D12a2664K22K754h08Q5
$$ 6613 3477 -5348 -12459 -4420 2454 -2707 1985 172 -9712 -1061 412 -12664 -12442 -9688 -808 -723
942g23r400O0K546L592o760p066N78N191q46N73l977J772N377L408J438C306q36
$$ -723 -10123 -10063 -7517 -3925 -10685 -17751 -17173 -11982 -12828 -12255 -16232 -14460 -9083 -5675 -4237 3306 2470
925B470j202B46d15k468D56K63h233c381a564c42H3J432a139B955M112g017B992
$$ 2470 1268 246 -415 -2883 456 719 -8233 -3381 -1564 -342 83 1515 -1139 2955 7067 -7017 2992
907G3a313R0l634a505n65j040j046r71m47n60L0J107K012m074J722J050e70m894
$$ 73 -1313 -1223 -4857 -1505 -2070 -3110 -4156 -5127 -5574 -6134 -6104 -4997 -2985 -7059 -5337 -4287 -570 -5464
889e464m129M64L392b134k4F684g157c224R60q46H407C396h210r122M69M656L203
$$ -5464 -9593 -9129 -5737 -2134 -2158 6684 -7157 -3224 -2264 -3110 8407 3396 -8210 -17332 -16863 -12207 -9004
872i004J555Q76J213k909r3C258f114F221k492a0580P17q907L911e329A877g569
$$ -9004 -7449 -6573 -5360 -8269 -8362 3258 -6114 6221 3729 -10580 -9863 -18770 -14859 -5329 1877 -7569
855C95L451Qj779c007q706j628L388M958m638k722J485L682J05J759b412k923
$$ 395 3846 3854 2075 -3007 -11713 -13341 -9953 -4995 -9633 -12355 -10870 -7188 -7083 -5324 -2412 -5335
839e335m23Q25n106c972P53K55a367B243N833l53J192k901e878d95j904A82m4
$$ -5335 -5758 -4933 -10039 -3972 -3219 -2964 -1367 2243 8076 7723 8915 6014 -5878 -495 -2399 182 138
822A38b825J058N01n998B962f805B185b412k716k653L368a954A54M28c56j791
$$ 138 -2825 -1767 -1266 -7264 2962 -6805 2185 -2412 -5128 -7781 -4413 -1954 154 582 -356 -2147
806b147j351N53d7F70a838q155J642M02c762C78i408B842N98j381c84k700j855
$$ -2147 -3498 -2945 -47 670 -1838 -9993 -8351 -7949 -3762 378 -9408 2842 3440 2059 -384 -3084 -4939
789d939n501a27j497C143J524M290L388J636o463A145g414k73A0097D260a1351
$$ -4939 -10440 -127 -1624 3143 4667 8957 12345 13981 7518 1145 -7414 -7687 10097 4260 -11351
773a2163l521J932K505J390k192M012J71k283R24k666l555l253j041M013M162
$$ -12163 -15684 -13752 -11247 -9857 -12049 -8037 -7866 -10149 -9225 -11891 -15446 -18699 -19740 -15727 -11565
758a1565M744a959B966d577l67C557f354j327F373J336q57j360A989M682c206
$$ -11565 -6821 -1959 2966 -4577 -4944 3557 -6354 -7681 6373 7709 6852 5492 1989 6671 -3206
742G822C149d995b5A3968N237C916i931a975E49O244C170a599n859o853l660P769
$$ 7822 3149 -4995 -25 13968 19205 3916 -9931 -1975 549 6793 3170 -1599 -7458 -14311 -17971 -10202
726a0202b981k562K683K41o35k1j1172L259l507k784K930N167d093C8K008J45
$$ -10202 -2981 -5543 -2860 -2619 -3254 -3275 -14447 -11188 -14695 -17479 -14549 -9382 -4093 38 2046 2191
710B191h693b091m505n848n965N606e940d17A069e43j0622C316c59p857a398f54
$$ 2191 -8693 -2091 -6596 -12444 -18409 -12803 -5940 -417 1069 -543 -11165 3316 -359 -8216 -1398 -654
693c807i58k410k976n362n650L638O365b419r70n051j898M789o319o398O914d506
$$ -3807 -958 -3368 -6344 -11706 -17356 -13718 -7353 -2419 -3389 -8440 -10338 -5549 -11868 -18266 -11352 -4506
676c49F24a474l819k736R82b621A999b639n281L329m500b581a72l490l859I677
$$ -349 624 -1474 -5293 -8029 -7047 -2621 1999 -2639 -7920 -4591 -9091 -2581 -172 -3662 -7521 9677
659H111l775A513g95j822k92J207B71L75J112D55b117k537k475k149k637k938
$$ 8111 4336 1513 -795 -2617 -2909 -1702 271 646 1758 455 -2117 -4654 -7129 -9278 -11915 -14853
643a4853l048K960M656j25B611Q585C520N940J0284d469K36D093O802A814d332
$$ -14853 -17901 -14941 -10285 -10410 2611 11196 3520 9460 19744 -4469 -4233 4093 10895 1814 -4332
627b728C704a7153J886A6823J309d640n019c156k153Q02b208j040j185j740k545
$$ -2728 3704 -17153 -15267 16823 18132 -4640 -9659 -3156 -5309 -4507 -2208 -3248 -4433 -6173 -8718
612h718k707p32J557K322J844j856c836G77f769P22F147k503b3m624l615l02m3
$$ -8718 -11425 -12157 -10600 -8278 -6434 -8290 -3836 777 -6769 -6047 6147 3644 -23 -4647 -8262 -8564 -8607
595h607J68k689k907K605N296o76p77c537o630Q48c144B126b2j798j468p773l29
$$ -8607 -8439 -11128 -14035 -11430 -6134 -6810 -7587 -3537 -10167 -9319 -3144 2126 -22 -1820 -3288 -11061 -11390
578a1390L013m889O137K870F133k264G11J477a1051B691a0418l644N475e82J25
$$ -11390 -8377 -13266 -7129 -4259 6133 3869 711 2188 -11051 2691 -10418 -14062 -8587 -582 -457
563d57q39k955J14l477c424B850O660C619a2469A2572j215a773l041E413J0762
$$ -457 -1296 -4251 -4137 -7614 -3424 2850 9510 3619 -12469 12572 11357 -1773 -4814 5413 16175
548A6175J117B605a495ko742L836A083D79M373a629B103a0073R81K366r5F939
$$ 16175 17292 2605 -1495 -1497 -8239 -4403 1083 479 4852 -1629 2103 -10073 -9092 -6726 -6821 6939
531I817c420o187a658m15p253o27L357e07n85j982o107p800O340b791j996a144
$$ 9817 -3420 -9607 -1658 -2073 -9326 -9953 -6596 -507 -1092 -3074 -9181 -16981 -10641 -2791 -4787 -1144
514a0928A102c256l953j483Om43k207l229O57M518j163a941a70n442Q95a427B339
$$ -10928 1102 -3256 -7209 -8692 -8686 -9129 -11336 -14565 -13908 -9390 -10553 -1941 -170 -5612 -4717 -1427 2339
496i008m00k393a012B182A074J783N838B929b229l586J20b649m959K97g79k352
$$ -9008 -9408 -11801 -1012 2182 1074 2857 8695 2929 -2229 -5815 -5695 -2649 -7608 -7311 -779 -3131
480c131B547h18m342m694j256K346K552J287m46j180j091L6l377K045p11j851
$$ -3131 2547 -818 -5160 -9854 -11110 -8764 -6212 -4925 -5371 -6551 -7642 -7606 -10983 -8938 -9649 -11500
464a1500j702Q8J359O10N54O52O26k347J810O96J76K50k4r06k044k540p11J923
$$ -11500 -13202 -13114 -11755 -11145 -10591 -9939 -9313 -11660 -9850 -9154 -8978 -8728 -8752 -9658 -11702 -14242 -14953 -13030
446a3030K710K015n980b511L79p466m671P052j314H395L998L496o110C896G08
$$ -13030 -10320 -8305 -14285 -2511 -2132 -9598 -14269 -7217 -8531 8395 12393 15889 9779 3896 708
430B436M335L366J463j427a3712a863q656j505N064l45J204b894K41m181m770
$$ 2436 6771 10137 11600 10173 -13712 -1863 -10519 -12024 -6960 -7305 -6101 -2894 -2653 -6834 -11604
415a1604l083Q41M839K599k080l884M345b607m248B018c645o199l04M673g96A498
$$ -11604 -14687 -13846 -9007 -6408 -8488 -12372 -8027 -2607 -6855 2018 -3645 -9844 -10148 -5475 -796 1498
398C35a4182N676L483D925O705i715K553a205J59k767k664q158k32K732R19J776
$$ 335 -14182 -8506 -5023 4925 11630 -9715 -7162 -1205 -1046 -3813 -6477 -14635 -14867 -12135 -11216 -9440
382i440L292b284m363R76A328C46a607k897k510O3m824I548P391q118L606j008
$$ -9440 -6148 -2284 -6647 -5671 1328 346 -1607 -4504 -7014 -6951 -11775 9548 16939 8821 12427 11419
366A1419f458n251g02A4298J154c709k21d55E948I72J333K830L37k474b210l489
$$ 11419 -6458 -11709 -702 14298 15452 -3709 -3930 -455 5948 972 2305 5135 5472 2998 -2210 -5699
350e699K656A431K465A542d431o794K351h15D703i65k802e66k989A469j4J356
$$ -5699 -3043 1431 3896 1542 -4431 -11225 -8874 -815 4703 -965 -3767 -566 -3555 1469 1455 2811
334B811g866A300L495r84A782e96l380k103j209o83k171k041e505A774P717b890
$$ 2811 -7866 1300 4795 3811 1782 -596 -3976 -6079 -7288 -7971 -10142 -12183 -5505 1774 9491 -2890
317I3K6510G245P258C469M2426N9224o723L88953O92551N79882Q6451D64268j5131
$$ 93 26603 7245 14503 3469 45895 105119 98396 487349 1179900 1759782 1846233 464268 449137
304D49137B12381r1523m0579C3543o755Q241B03J7842B875e224J112j306K396
$$ 449137 212381 120858 80279 33543 26788 35029 203 18045 2875 -5224 -4112 -5418 -3022
291c022J291k071m256j122Q47q12L521B844b065o168K757n845l086PJ381j15k67
$$ -3022 -1731 -3802 -8058 -9180 -8333 -9145 -5624 2844 -2065 -8233 -5476 -11321 -14407 -14400 -13019 -13134 -13401
274a3401k0J423K520L428K116a036d96o549p12p571K262K991C876J253c025F101
$$ -13401 -13421 -11998 -9478 -6050 -3934 -1036 -496 -7045 -7757 -15328 -13066 -10075 3876 5129 -3025 6101
257a406m931D450g88j4063D654B076h879K973f85k294o388L577o330a898p975
$$ -1406 -6337 4450 -788 -14851 4654 2076 -8879 -5906 -685 -2979 -9367 -5790 -12120 -1898 -9873
242i873c496j915K529Q73q921b968g60C751A322i379J262D666O995c402C251i508
$$ -9873 -3496 -5411 -2882 -2009 -10930 -2968 -760 3751 1322 -9379 -8117 4666 11661 -3402 3251 -9508
225A828f443j990L538l677M068J98n036l875L563M197J876n716K586m281k617
$$ 1828 -6443 -8433 -4895 -8572 -4504 -4306 -9342 -13217 -9654 -5457 -3581 -9297 -6711 -10992 -13609
210a3609M209c848I86L29N013L60E5e076D135l80h240B494B62a991n306k652c633
$$ -13609 -9400 -3848 986 1315 6328 6688 55 -5076 4135 3755 -8240 2494 262 -1991 -7297 -9949 -3633
192f570k867J488J207N08n575L253c763J99j088j409L8J745k756e4j042l974m858
$$ -6570 -9437 -7949 -6742 -6234 -11809 -8556 -3763 -3564 -4652 -6061 -6023 -4278 -7034 -54 -1096 -5070 -9928
175i928J663a233p442E18L988B169n91g883J940m70a607p729l952e208C257d717
$$ -9928 -8265 -1233 -8675 518 4506 2169 1578 -7883 -5943 -6413 -1607 -9336 -13288 -5208 3257 -4717
158h18A971J1603j871D485f089C764c222k430A947R648j284d570b208j407n643
$$ -818 1971 13574 11703 4485 -6089 3764 -3222 -5652 1947 11595 10311 -4570 -2208 -3615 -9258
143i258K833j0357K296K664l58j579J773L173J746l525j851j825O045c252o39
$$ -9258 -6425 -16782 -14486 -11822 -12180 -13759 -11986 -8813 -7067 -10592 -12443 -14268 -8223 -3252 -3891
128c891k864q043L334a410E092j859A2g476k667M650J746A261c328l326m521R99
$$ -3891 -6755 -14798 -11464 -1410 5092 3233 12 -7476 -10143 -5493 -3747 1261 -3328 -6654 -11175 -10176
112a0176a134b90r969A2333c71B524P347e638K581A5224p63C135j40d057r533
$$ -10176 -1134 -290 -10259 12333 -371 2524 9871 -5638 -3057 15224 14461 3135 2995 -4057 -13590
97a3590j3L219k372k287o133J0257J223j919J353K478c239A202f493B760f295
$$ -13590 -13603 -10384 -12756 -15043 -21176 -10919 -9696 -11615 -10262 -7784 -3239 1202 -6493 2760 -6295
81g799b013n564m006O00K154J115K35k199m035n420L704O056c959D91K855R73
$$ -7799 -2013 -7577 -11583 -10983 -8829 -7714 -7479 -9678 -13713 -19133 -15429 -9373 -3959 491 3346 4319
65D319j023E67c674n661o554K090f899i87k31r886c96k398A819b232l768j762
$$ 4319 3296 567 -3674 -9335 -15889 -13799 -6899 -987 -1218 -11104 -396 -2794 1819 -2232 -6000 -7762
49g762J635K638k342j424K727E306M708l524b203j385n012K22j05M171h84j023
$$ -7762 -6127 -3489 -5831 -7255 -4528 5306 10014 6490 -2203 -3588 -8600 -8378 -8483 -4312 -884 -1907
33a907C579R14a620C45c476n58D354j724G0e893j525K100J093a751A4008E540
$$ -1907 3579 4493 -1620 345 -3476 -4034 4354 2630 70 -5893 -7418 -5318 -4225 -1751 14008 5540
16C650L531l049a969A950e184n516r39J908J477Q90j156l322n599J996g097d73
$$ 3650 7181 4132 -1969 1950 -5184 -10700 -11639 -9731 -8254 -7364 -8520 -11842 -17441 -15445 -7097 -473
##PAGE= F1=1032.931895427
##FIRST=     2915.55639409065, 2671.18566176471, 2108
##DATA TABLE= (F2++(Y..Y)), PROFILE
1023B108C29d103n209j52d249d30D22b321m023r05l07a49B913A356b921n139j709
$$ 2108 329 -4103 -9312 -9464 -4249 -430 422 -2321 -6344 -7249 -7556 -149 2913 1356 -2921 -8060 -9769
1006i769M070c92D1K710M228l231h869b191l110j72n364L068k822L11D900P225
$$ -9769 -5699 -392 41 2751 6979 3748 -8869 -2191 -5301 -5473 -10837 -7769 -10591 -10280 4900 12125
990A2125m516C593A153I7a453n566p310P044M93k499M476k578I57b103A375K09
$$ 12125 7609 3593 1153 97 -1453 -7019 -14329 -7285 -6792 -9291 -4815 -7393 957 -2103 1375 1584
974A584b346L41O86A175d158l222C253P200l838A413b850B043O611A708M540j406
$$ 1584 -2346 -2005 -1319 1175 -4158 -7380 3253 10453 6615 1413 -2850 2043 8654 1708 6248 4842
958D842A465e512m849J849A918b006G030C475d684C585J293a3394L569j963d214
$$ 4842 1465 -5512 -10361 -8512 1918 -2006 7030 3475 -4684 3585 4878 -13394 -9825 -11788 -4214
942A621e234n434J400B416r1A035B49a864j2646M777K279J326K155o99J977C49
$$ 1621 -5234 -10668 -9268 2416 2325 1035 249 -1864 -14510 -9733 -7454 -6128 -3973 -4672 -2695 349
925e74j960n30k674R30O89J274j0748f071b462p92j137o99j326j827j546q16k71
$$ -574 -2534 -3064 -5738 -4808 -4119 -2845 -13593 -6071 -2462 -3254 -4391 -5090 -6416 -8243 -9789 -10605 -10876
908a0876j94j293j52K308K435J672O9j442k734j578K269L450a359l5r818L609
$$ -10876 -11070 -12363 -12515 -10207 -7772 -6100 -6031 -7473 -10207 -11785 -9516 -6066 -1359 -1394 -11212 -7603
892g603c437l956k380j95Q6p24Q67M004h15m608j022E4d294E202A932a871l045
$$ -7603 -3437 -7393 -9773 -9968 -9882 -10606 -9739 -5735 -815 -5423 -6445 54 -4294 5202 1932 -1871 -4916
875d916M53b25D538f071O50j923m352j02L554c326A3474K964c044j844o748p63
$$ -4916 -4463 -225 4538 -6071 -5421 -7344 -11696 -11798 -8244 -3326 13474 16438 -3044 -4888 -11636 -12399
859a2399B777P519g479a216B485M342A069a933p558m838K71d973b54o904m648
$$ -12399 2777 10296 -7479 -1216 2485 6827 1069 -1933 -9491 -14329 -14058 -4973 -254 -7158 -11806
844a1806K614K534J669A56d188o061a044l769J280B684a637ql064K91h40B886
$$ -11806 -9192 -6658 -4989 156 -4188 -10249 -1044 -4813 -3533 2684 -1637 -1645 -4709 -4418 -840 2886
827D017g041i99m205J75K049J443J47k504j458D800f077F221J1614q099h52B5270
$$ 4017 -7041 -999 -5204 -5029 -2980 -1537 -1390 -3894 -5352 4800 -6077 6221 17835 9736 -852 25270
810B2870m344n977n876A826a918j999j50O78K26o923d509a018C20J79g129E074
$$ 22870 18526 12549 6673 1826 -1918 -3917 -4067 -3389 -3163 -10086 -4509 -1018 320 499 -7129 5074
793F117A752h97C46b038n700a092a39A293b82l521l705K084D69M345f969p35H947
$$ 6117 1752 -897 346 -2038 -7738 -1092 -139 1293 -282 -3803 -7508 -5424 469 4814 -6969 -7704 8947
775E158h680Q51m920n17J128o79j918J270K980J105K667n36j630j068m966O570
$$ 5158 -8680 -7829 -12749 -13266 -12138 -12817 -14735 -13465 -10485 -9380 -6713 -7249 -8879 -9947 -14913 -8343
759h343K905a769B033P69i359K365e10q053j626E59b010k830k291j369P02J558
$$ -8343 -5438 -1769 2033 2802 -9359 -6994 -510 -8563 -10189 559 -2010 -4840 -7131 -8500 -7798 -6240
743f240a938H67e580a005F071J07A504a1869B92M255Q87R25a311d21l968k257
$$ -6240 -1938 867 -5580 -1005 6071 6178 1504 -11869 292 4547 5434 6359 -1311 -421 -4389 -6646
727f646K89f66l065a342l249K227n36j0587f051J721K75k206M39P40F67L248M88
$$ -6646 -6357 -666 -3731 -1342 -4591 -2364 -2900 -13487 -6051 -4330 -4055 -6261 -5822 -5082 667 3915 4403
710D403h534B747j300F27r5j62c548k623b967j810n463M003J715m22a448l92j866
$$ 4403 -8534 2747 1447 627 532 370 -3548 -6171 -2967 -4777 -10240 -6237 -4522 -4944 -1448 -1840 -3706
693c706j839j302p47n25p45p03O24K135L203j273m275H6b433j0144d937B10M799
$$ -3706 -5545 -6847 -7594 -8119 -8864 -9567 -8943 -6808 -3605 -4878 -9153 86 -2433 -12577 -4937 210 5009
676E009K284b199H95b658n084J029g89j548k561a657o763d28m217P33k462A509
$$ 5009 7293 -2199 895 -2658 -7742 -6713 -789 -2337 -4898 -1657 -8420 -428 -4645 -3912 -6374 1509
659B437Q52J486G34K710k01K295B586h98l399j123J284J581m56k356l500p03K938
$$ 2437 3289 4775 734 3444 3243 5538 2586 -898 -4297 -5420 -4136 -2555 -3011 -5367 -8867 -9570 -6632
642f632K082J81k362b751A409J559M480K655d294a061I735K441B805J4949Q68
$$ -6632 -4550 -4369 -6731 -2751 1409 2968 7448 10103 -4294 -1061 9735 12176 2805 17754 18622
627A8622J3a4953M605A1967K155f337l690a714k92o197F97L862j96J332L709l896
$$ 18622 18635 -14953 -10348 11967 14122 -6337 -10027 -1714 -2006 -8203 697 4559 4363 5695 9404 5508
611E508d216L71A357c283o26b17A700f652j363C990A684a262m093k363J829l542
$$ 5508 -4216 -3845 1357 -3283 -3909 -217 1700 -6652 -8015 3990 1684 -1262 -5355 -7718 -5889 -9431
595i431r03j248e4o188p319K895O1b959n014l282c741r43n71P82J118n926k787
$$ -9431 -10334 -11582 -54 -6242 -13561 -10666 -10605 -2959 -7973 -11255 -3741 -4684 -5255 -4473 -3355 -9281 -12068
578a2068M218l256e276p43F768p03c265j198n142J531n523J651K184J547J997
$$ -12068 -7850 -11106 -5276 -6019 6768 6065 -3265 -4463 -9605 -8074 -13597 -11946 -9762 -8215 -6218
563f218K403J223o359r50K577J010b385A425a3165E501l00a069n786A299l28L2
$$ -6218 -3815 -2592 -8951 -9901 -7324 -6314 -2385 1425 -13165 5501 5201 -1069 -6855 1299 971 1003
547A003N9h13G02a736d26I28I0L174d874A38h883L08M142j583G504R22e080l575
$$ 1003 1062 -813 702 -1736 -426 928 90 3264 -4874 138 -8883 -8575 -4433 -6016 7504 8426 -5080 -8655
529h655m06m642K981k063M533K041j259k272m11K068K679K476r24h51q210b452
$$ -8655 -9061 -13703 -10722 -12785 -8252 -6211 -7470 -9742 -10153 -8085 -5406 -2930 -3854 -851 -9061 -2452
512d176j873r53k31J79M85J590K041l250l40A0757K482f650k58a097D554i795
$$ -4176 -6049 -7002 -7233 -7054 -6569 -4979 -2938 -6188 -6528 10757 13239 -6650 -6908 -1097 4554 -9795
495d878l800b285E1c793B03J2968l025d52j1447N657b750J38I9K278B78P839a965
$$ -4878 -8678 -2285 51 -3793 203 13171 10146 -452 -11899 -6242 -2750 -2612 99 2377 278 8117 -1965
477G797k794i366b959i81G052d655O55l036L499o918J27J792L742m808c708k680
$$ 7797 5003 -9366 -2959 -981 7052 -4655 -4000 -7036 -3537 -10455 -10328 -8536 -4794 -9602 -3708 -6388
461f388l106J557J276b676o658j660L480q71L938A153M635g797c013F473F89c341
$$ -6388 -9494 -7937 -6661 -2676 -9334 -10994 -7514 -8385 -4447 1153 5788 -7797 -3013 6473 689 -3341
444f291o850c590j727j713l970M378K06I560j047l126G80d007l508O01K216M13
$$ -6291 -13141 -3590 -5317 -7030 -11000 -6622 -6416 9560 8513 5387 780 -4007 -7515 -6914 -4698 -4285
428d285j125k532k871J655l843a866C62a1347e200b262G888b534o770a535o504
$$ -4285 -5410 -7942 -10813 -9158 -13001 -1866 362 -11347 -5200 -2262 7888 -2534 -9304 -1535 -8039
413h039b31k464k306k662k055K204k922d388j259l412l135O70K693J200q38k270
$$ -8039 -231 -2695 -5001 -7663 -9718 -7514 -10436 -4388 -5647 -9059 -12194 -11524 -8831 -7631 -8469 -10739
397a0739k846J422M711a319r604L376a822A107f227A4029o51c904p47m816I328
$$ -10739 -13585 -12163 -7452 -1319 -10923 -7547 -1822 1107 -6227 14029 13378 -3904 -4651 -9467 9328
381F213A156a0332c292B852R85j602a769n383k795j511i43A556Q96m97A31e369
$$ 6213 1156 -10332 -3292 2852 3837 2235 -1769 -7152 -9947 -11458 -943 1556 2452 1955 131 -5369
364g619J476p82j62R42l46c145G36J258L07A125a036j875k017j491p42Q40L037
$$ -7619 -6143 -6925 -7087 -6145 -6491 -3145 736 1994 2301 1125 -1036 -2911 -4928 -6419 -7161 -6321 -3284
347c284E19b413h07m767D782M833h1n078a090k442q858d750a04q268a042l828
$$ -3284 519 -2413 -807 -5574 4782 9615 -81 -5159 -1090 -3532 -12390 -4750 -104 -8372 -1042 -4870
331d870k408l4J417O09J87J112J553B95a601K95B400L81e082N66p087c771F93
$$ -4870 -7278 -7312 -5895 -5286 -5099 -3987 -2434 295 -1601 -1306 2400 2781 -5082 -4516 -11603 -3771 693
313E986L4534L3051Q4091J93314K31781J15189q7098B02254J5738r7134K3830
$$ 5986 40520 73571 157662 350976 582757 697946 610848 202254 217992 120858 144688
302A44688n4235l3824j2248j0968C259J1362e242n505H32e03k124j425r47n32
$$ 144688 90453 56629 44381 33413 3259 14621 -5242 -10747 832 -503 -2627 -4052 -4999 -5531
288e531o01R5j646b861J419m18m059K61j73J352l345a194A54o4a1662e773F77
$$ -5531 -6132 -6037 -7683 -2861 -1442 -1860 -5919 -5658 -5831 -4479 -7824 -1194 154 90 -11662 -5773 677
270b71k970B836K183d591G47K044b023p674M345a173k032D273k030a1577h02J03
$$ -271 -3241 2836 5019 -4591 747 2791 -2023 -9697 -5352 -1173 -3205 4273 2243 -11577 -802 -699
254f99n542B70c43r437L114K421J21n201J591K130c79o189J765k343b830F68g287
$$ -699 -6241 270 -343 -9780 -6666 -4245 -4124 -9325 -7734 -5604 -379 -6568 -4803 -7146 -2830 668 -7287
236c332O29M8k292l569J244a097D198e273C668h270C984A406c01j744k350J211
$$ -3332 -2703 -2655 -4947 -8516 -7272 -1097 4198 -5273 3668 -8270 3984 1406 -301 -2045 -4395 -3184
220c184a528j135B7O941K005j134a2404A358c306m707k062M093a872j559C072
$$ -3184 -1528 -2663 27 6968 8973 7839 -12404 1358 -3306 -8013 -10075 -5982 -1872 -3431 3072
204C264g43j868j190k548k850K050P68k41l137K07k014q3J324L265L267j752o229
$$ 3264 -743 -2611 -3801 -6349 -9199 -7149 -6381 -6622 -9759 -9552 -11566 -11649 -10325 -7060 -3793 -5545 -11774
187a1774J705D94P44d186n242J049K572o002e080J577A242N483M133J806e259
$$ -11774 -10069 494 1238 -4186 -9428 -8379 -5807 -11809 -5080 -3503 1242 6725 10858 12664 -5259
171C587j395a13B145h160P31a590j875n40L45K96f51l460b006D77J1655K479b04
$$ 3587 2192 -113 2145 -8160 -7429 -1590 -3465 -4005 -3660 -3364 -651 -4111 -2006 477 12132 14611 -204
153b110A0101G73d606a562G522J191c010B466K37h108E27a2094K736K10K506k348
$$ -2110 10101 773 -4606 -1562 7522 8713 -3010 2466 2703 -8108 527 -12094 -9358 -9148 -6642 -8990
137h990A786b279J44m566b595i88p112d028J050j749n070c660M91e65A155h89
$$ -8990 1786 -2279 -2135 -6701 -2595 -988 -8100 -4028 -2978 -4727 -9797 -3660 -3169 -565 1155 -889
120i694J954J477J320B892j220f824n521N99N422K208n254B316i619h54j02n070
$$ -9694 -7740 -6263 -4943 2892 1672 -6824 -12345 -11746 -6324 -4116 -9370 2316 -9619 -854 -956 -6026
104f026Q47C691P07k37o78c599p882k080O019K707N5j6562a0408K513N51k74j523
$$ -6026 -5179 3691 4398 4161 3483 -3599 -11481 -13561 -7542 -4835 -4780 -21342 -10408 -7895 -7344 -7618 -9141
87i141j738K803J186B256a792k159B24O138j242B120J38g95k185O03Q9P4m82m544
$$ -9141 -10879 -8076 -6890 2256 -1792 -3951 224 6362 5120 2120 2258 -795 -2980 -2377 -2288 -2214 -2696 -7240
69g240L094Q56a249A170K054o36c269l471l247M774k695j306c119n461b85p70
$$ -7240 -4146 -3290 -1249 1170 3224 2588 -3269 -6740 -9987 -5213 -7908 -9214 -3119 -8580 -285 -1055
53a055r69D987A668c04B84L078b047jq074G47L359a324o869J77c011m21l026d73
$$ -1055 -2024 4987 1668 -304 284 3362 -2047 -2048 -10122 747 4106 -1324 -8193 -8016 -3011 -3432 -6458 -473
34B881m22P375l288a649A936h78a44l17m902j742m144L809K258r19D468R56G74
$$ 2881 2459 9834 6546 -1649 1936 -878 -144 -461 -5363 -7105 -11249 -7440 -5182 -6101 4468 5424 774
16c240k677j229k20N70N40m47j162j069j168k90pJ621L488a198A385B90
$$ -3240 -5917 -7146 -7366 -6796 -6256 -6703 -7865 -8934 -10102 -10392 -10399 -8778 -5290 -1198 1385 290
##PAGE= F1=1030.320765748
##FIRST=     2915.55639409065, 2671.18566176471, -1145
##DATA TABLE= (F2++(Y..Y)), PROFILE
1023a145j530k445l133J50c292A219K989m85E25f11p556g49B447J291p01d291
$$ -1145 -2675 -5120 -8253 -8103 -3292 1219 4208 3723 525 -611 -8167 -749 2447 3738 3037 -4291
1006e151O65a211K73B168K687A811a0563a352q601d435n541K615J745Q65A785
$$ -5151 -4486 -1211 -938 2168 4855 1811 -10563 -1352 -9953 -4435 -9976 -7361 -5616 -4751 1785
990F63b600l009r72J570J546l505m415e007J76n546d580m027G56M35a221l725
$$ 663 -2600 -5609 -6581 -5011 -3465 -6970 -11385 -5007 -4831 -10377 -4580 -8607 756 1191 -1221 -4946
974d946m370J125b159D341e065L4D404J3946A513M758H20a753p239n12M294b579
$$ -4946 -9316 -8191 -2159 4341 -5065 -5031 4404 18350 1513 6271 820 -1753 -8992 -9504 -5210 -2579
957b098k851k689n832d732m79L84R97J91m56M22o544L267p471O388b125k191o306
$$ -2098 -4949 -7638 -13470 -4732 -5211 -4827 -3830 -3639 -4095 -3673 -10217 -6950 -14421 -8033 -2125 -4316 -10622
940a0622j103e665K643i8B033e260n817j272c013j252K33J663r7b51m9m140h12
$$ -10622 -11725 -5665 -3022 -98 2033 -5260 -11077 -12349 -3013 -4265 -4032 -2369 -2466 -251 -300 -4440 -812
922i804b250j098j844m328K748K778E14e563K271a533E906R33A338N698J504J745
$$ -9804 -2250 -3348 -5192 -9520 -6772 -3994 514 -5563 -3292 -1533 5906 6839 1338 7036 8540 10285
906A0285J695m186J612m378e79n021k375J919b654o373C643d037r236K907a827
$$ 10285 11980 7794 9406 5028 -579 -5600 -7975 -6056 -2654 -9027 3643 -4037 -13273 -10366 -1827
890F181o35k509h89m138j655J153J296K78m278c717j768K623L02L2J72a036B000
$$ 6181 5546 3037 -889 -5027 -6682 -5529 -4233 -3955 -8233 -3717 -5485 -2862 -2560 -2528 -2356 -1036 2000
872E651g989a99j596m308J205J71j0304e254D783j165a175l534h39E561M220b595
$$ 5651 -7989 -199 -1795 -6103 -4898 -4727 -15031 -5254 4783 3618 -1175 -4709 -839 5561 9781 -2595
855b671E64b399q771a504k948k877n477d193A084i488O7l226O163J013b626j205
$$ -2671 564 -2399 -11170 -1504 -4452 -7329 -12806 -4193 1084 -9488 -9421 -12647 -6484 -5471 -2626 -3831
839c831n623c811h10k908h29j637f14m826L8K085D3J161g641b750o273k753M792
$$ -3831 -9454 -3811 -810 -3718 -829 -2466 -614 -5440 -5402 -3317 43 1204 -7641 -2750 -9023 -11776 -6984
822f984b376J11o449c636D390f256H103O750m102r35R595j494k640l719l968C185
$$ -6984 -2376 -2265 -8714 -3636 4390 -6256 8103 14853 10751 9816 19411 17917 15277 11558 7590 3185
805b295n256K19K459O39m699d202i20m189k804L005A594L745f43j409I603C508
$$ -2295 -7551 -7332 -4873 -4234 -8933 -4202 -920 -5109 -7913 -4908 1594 5339 -643 -2052 9603 3508
788d420J061m973M034i8A382f73m121m935j388L149L94c705j31l272A45M330e206
$$ -4420 -3359 -8332 -4298 -98 1382 -673 -4794 -9729 -11117 -7968 -7574 -3705 -3836 -7108 145 4475 -5206
770D481K515a1795a075k280o855f67p68m205j75o362O040j717k982Q43L209j073
$$ 4481 6996 -11795 -1075 -3355 -10210 -667 -1435 -5640 -5815 -12177 -6137 -7854 -10836 -9993 -6784 -7857
754g857J624j33l831k628a101A157N36f376E57b88r316b180j643j434j510j169
$$ -7857 -6233 -6366 -10197 -12825 -1101 1157 1693 -6376 557 -288 -9604 -2180 -3823 -5257 -6767 -7936
738g936j561k625N6M603b420B133K802b790g06A03c624k971R58a637G71f014a794
$$ -7936 -9497 -12122 -12066 -7463 -2420 2133 4935 -2790 -706 103 -3624 -6595 -5637 -1637 771 -6014 -1794
720c495p436a481n25a58m049m698l679N112J817N00k674K037o63r50j667k675
$$ -3495 -10931 -1481 -2006 -158 -4207 -8905 -12584 -7472 -5655 -5155 -7829 -5792 -6455 -7405 -9072 -11747
704a1747J031L175L332a708n222b809C2b932J415B919M51j24a119C010r07E95
$$ -11747 -10716 -7541 -4209 -1708 -6930 -2809 32 -2932 -1517 2919 3370 3246 -1119 3010 2103 595
687h48l62N14C41a072n340a900k877r723e234b176R66j933m553k897N077B20d191
$$ -848 -1210 -696 341 -1072 -6412 -1900 -4777 -14500 -5234 -2176 -1210 -3143 -7696 -10593 -5516 220 -4191
669a185o86j163c0p510A425a679k895l543k193r71J143K190J674o28k008j528
$$ -1185 -1871 -3034 -30 -7540 1425 -1679 -4574 -8117 -10310 -11281 -10138 -7948 -6274 -6902 -8910 -10438
653a0438J945L570a901iIh90j058M31b06H92f149a475k990q62J701a012E66Q14
$$ -10438 -8493 -4923 -1901 -9 9 -890 -1948 -1517 -206 892 -6149 -1475 -4465 -5327 -3626 -1012 566 1380
635A380J20c263C816M043N538c025H641J2054k947a1889d645D342O35i356L38
$$ 1380 1500 -3263 3816 7859 13397 -3025 8641 20695 17748 -11889 -4645 4342 4977 -9356 -9018
620i018d342j068l63r30n24k87J117K693a09n878g61F416a904A173a509n524n393
$$ -9018 -4342 -5410 -5773 -6703 -7227 -7514 -6397 -3704 -109 -5987 -761 6416 -1904 1173 -1509 -7033 -12426
603a2426M145b25D385j09J655c069l254m560J378k1L779b521m017J444K463e36
$$ -12426 -8281 -225 4385 4276 5931 -3069 -6323 -10883 -9505 -9526 -5747 -2521 -6538 -5094 -2631 -536
586g263m604a362m096l301r10N67K562l402J325k43c178k463F912K69f160n737
$$ -7263 -11867 -1362 -5458 -8759 -9669 -9102 -6540 -9942 -8617 -8860 -3178 -5641 6912 7181 -6160 -11897
570a1897N096K371n058o24O50M35R50b750D21h230J935O54D70B19b080p712M629
$$ -11897 -6801 -4430 -9488 -10112 -9462 -9027 -8077 -2750 421 -8230 -6295 -5641 470 219 -2080 -9792 -5163
553e163m637K534q87d51F450O72a66j118C640b57A528F33e36A229f203A576e919
$$ -5163 -9800 -7266 -8153 -451 6450 7122 -166 -1284 3640 -257 1528 633 -536 1229 -6203 1576 -5919
535i315c992p48F730Q56e986k954j12i15o343n320J811a713q63b48l475l21l94
$$ -9315 -3992 -4740 6730 7586 -5986 -8940 -9052 -915 -7258 -12578 -10767 -1713 -2576 -248 -3723 -4044 -4438
518d438J749J001A122f820i83E869F82J482a124m184n969M626a666o268c910A0847
$$ -4438 -2689 -1688 1122 -6820 -983 5869 682 2164 -1124 -5308 -11277 -6651 -1666 -7934 -3910 10847
501A2309d735n595a129E915g351b126k161m12a606o580L869J016n329j325L583
$$ 12309 -4735 -10330 -1129 5915 -7351 -2126 -4287 -4699 -1606 -8186 -4317 -3301 -8630 -9955 -6372
486f372K445l594g84A285J308o55J817e937A0554C544h705d230Q83G228b562l747
$$ -6372 -3927 -7521 -784 1285 2593 1938 3755 -5937 10554 3544 -8705 -4230 -3347 7228 -2562 -6309
470f309k181K854n472L149L179h47n009j495b920k131j481O06e56o151l206M560
$$ -6309 -8490 -5636 -11108 -7959 -4780 -847 -5856 -7351 -2920 -5051 -6532 -5926 -556 -6707 -9913 -5353
454e353a417C661N752k310f426K217E287H01e456l199k916N256l278p37j103M420
$$ -5353 -1417 3661 9413 7103 -6426 -4209 5287 801 -5456 -8655 -11571 -6315 -9593 -10330 -11433 -7013
438g013L008b23A551O61K51O12L00p48B57c097q72a162B483e660q375C001f91
$$ -7013 -4005 -223 1551 2212 2463 3075 3375 2627 257 -3097 -3969 -1162 2483 -5660 -14035 3001 -691
420a3308O113q47J118J999j296I70c196B227r90b9j759k708j968n759d147M85
$$ -13308 -7195 -8042 -6924 -4925 -6221 970 -3196 2227 1237 -29 -1788 -4496 -6464 -12223 -4147 -3662
404c662k278l498k557J2d709j46k701l367L644e18D390a1294L968K904A496h164
$$ -3662 -5940 -9438 -11995 -11983 -4709 -4855 -7556 -10923 -7279 -518 4390 -11294 -7326 -4422 1496 -8164
387A1038q24f364K298p762A0419l823A544g524l038J529L278J945P55l167o376
$$ 11038 10214 -6364 -4066 -11828 10419 6596 1544 -7524 -10562 -9033 -5755 -3810 -3055 -6222 -12598
372a2598K843e86D9aj056k425k747j626K505a779C03f497j460L376k372L18c226
$$ -12598 -9755 -586 49 -1 -1057 -3482 -6229 -7855 -5350 -1779 303 -6497 -7957 -4581 -6953 -6635 -3226
354c08A637J358m87C30c173l110r85r9J572K093j844F000L037B20f660a692Q24
$$ -308 1637 2995 2508 330 -3173 -6283 -7268 -7367 -5795 -3702 -5546 6000 9037 220 -6660 -1692 -868
337h68D963J489g63q371B117e623m570c661a771m351j830c09n230k032L525d43
$$ -868 4963 6452 -763 -9134 2117 -5623 -10193 -3661 -1771 -6122 -7952 -309 -5539 -7571 -4046 -443
320A804q84e300J422B212O266B925N804c799C96P8104K80754J73798K4146j52986
$$ 1804 920 -5300 -3878 2212 8478 2925 8729 -3799 396 78500 359254 533052 557198 404212
306D04212A67477C2831M7448J0174j1730k5852k307j3127D783Q531g665k321D49
$$ 404212 167477 32831 80279 90453 78723 52871 50564 37437 4783 13314 -7665 -9986 449
292A47b322Q93p07p03j159N02n1e17B168p78b188A142a949k772k691L167R35k80
$$ 147 -2322 -1429 -2136 -2839 -3998 -3496 -3547 -517 2168 1390 -2188 1142 -1949 -4721 -7412 -4245 -3310 -3590
274c590l873J228J98b978n82C329K732b531C903O156q16d361d97C6e133A449o79
$$ -3590 -7463 -6235 -6037 -2978 -3560 3329 6061 -2531 3903 10059 9243 -4361 -497 36 -5133 1449 770
257G70a4955e866A146E26d322r97n222c877a532k387l825K581j862j098p91J89
$$ 770 -14955 -5866 1146 526 -4322 -5319 -10541 -3877 -1532 -3919 -7744 -5163 -7025 -8123 -8914 -8725
241h725L56c110H71g903L566p97C007e43j109G09J993m68e459b28l068B795n93
$$ -8725 -8369 -3110 871 -7903 -4337 -5134 3007 -543 -1652 709 2702 2234 -5459 -228 -3296 2795 2202
224B202a361o290j25f77E157e469C408M679l11l117a0130b600l917j239L133a009
$$ 2202 -1361 -7651 -7776 -677 5157 -5469 3408 8087 7776 4659 -10130 -2600 -6517 -7756 -4623 -1009
207c622J52B952j357c365o7k204M95l582c113j66J326j0859a425N08l549n786
$$ -3622 -3470 2952 1595 -3365 -3432 -5636 -5141 -8723 -3113 -3279 -1953 -12812 -1425 -917 -4466 -10252
191a0252i34r93l963o36l016L435J141N51l958l62J504m057M45J947K786K397
$$ -10252 -934 -1927 -5890 -6526 -9542 -6107 -4966 -4415 -8373 -8735 -7231 -11288 -10843 -8896 -6110 -3713
175c713J678P49l14m87m59r92r61r55l416Q32n61P44J274P55J191J244J463e43
$$ -3713 -2035 -1286 -1600 -2087 -2546 -3538 -4499 -5454 -8870 -8038 -8599 -7855 -6581 -5826 -4635 -3391 -1928 -543
156A170J429c806C170O804k287a449l090C260L605a41F704J755b928C205e519
$$ 1170 2599 -3806 3170 9974 7687 -1449 -4539 3260 6865 -141 6704 8459 -2928 3205 -5519
140g728k979N042m185c896k730j934J438k443J606n186L36K928K960o753d830
$$ -7728 -10707 -5665 -9850 -3896 -6626 -8560 -7122 -9565 -7959 -13145 -12809 -9881 -6921 -13674 -4830
124e795l05K825K11j0327O279J759m94D881r18e291m501L443l862e007m064c801
$$ -5795 -6100 -3275 -3064 -13391 -7112 -5353 -5847 4881 3963 -5291 -9792 -6349 -10211 -5007 -9071 -3801
107a2031b320m29l853K30R50q9R69J356p16n359l173d204g24K11j1186L595a302
$$ -12031 -2320 -2749 -6602 -6372 -5422 -5511 -4542 -3186 -3902 -9261 -12434 -4204 -724 -513 -11699 -8104 -1302
89B1b612k846J00b487l450L82A68Q04J487O583j772A974N000A975b677C332K70
$$ 21 -2612 -5458 -5358 -2487 -5937 -5555 168 972 2459 9042 7270 1974 6974 1975 -2677 3332 3602
72C602j43j238f601L211l015j898N50K522b205j615k706m827M884k901M00b619
$$ 3602 3459 2221 -6601 -3390 -6405 -8303 -7753 -5231 -2205 -3820 -6526 -11353 -6469 -9370 -8970 -2619
55e754f81j132m488C639k23L88j101f4m977n916K87M505K614O50l299a571G82
$$ -5754 -681 -1813 -6301 3639 3416 3804 2703 -64 -5041 -10957 -10670 -6165 -3551 -2901 -6200 -1571 782
37C545D78K228K138K434R581p376a002C41L29M63C20a741k263q145M558K373k773
$$ 3545 478 2706 4844 7278 16859 9483 -1002 341 670 1133 320 -1741 -4004 -12149 -7591 -5218 -7991
20g991C829L946L178K242Q45C754A012N499C56i527L706j098j699k849j804M876
$$ -7991 3829 7775 10953 13195 14040 3754 1012 6511 356 -9527 -5821 -6919 -8618 -11467 -13271 -8395
4h395c965a523P39q72
$$ -8395 -3965 -1523 -784 -1656
0a656
$$ -1656
##PAGE= F1=1027.709636069
##FIRST=     2915.55639409065, 2671.18566176471, -5045
##DATA TABLE= (F2++(Y..Y)), PROFILE
1023e045a260c27F77b159j118J370f03n10k398l508r62c103H6J249C91f541j052
$$ -5045 -1260 -327 677 -2159 -3277 -1907 -603 -1113 -3511 -7019 -7981 -3103 86 1335 391 -6541 -7593
1006g593b895e07k191b59B568a050r626d922l460A109f499j296b519A85b027D470
$$ -7593 -2895 -507 -2698 -259 2568 -1050 -10676 -4922 -8382 1109 -6499 -7795 -2519 185 -2027 4470
989C407j017A134I1e511k361k214K714j93j055L045m085a186D220M825C367b983
$$ 3407 2390 1134 91 -5511 -7872 -10086 -7372 -7565 -8620 -5575 -9660 -1186 4220 9045 3367 -2983
972h604j803J611L03j07P86L97Lk54K23J484J355M32L40k89j749k432j21n483
$$ -8604 -10407 -8796 -8493 -8600 -7814 -7417 -7414 -7668 -7445 -5961 -4606 -4174 -3834 -4123 -5872 -8304 -8425 -13908
954a3908f063J838Bb5j024j387k346k894O04q810g798b832J312p958n411d064
$$ -13908 -6063 -4225 2 -25 -1049 -2436 -4782 -7676 -7072 -15882 -7798 -2832 -1520 -9478 -14889 -4064
937g242j717M440n749L190l5A119N965C531a77l954l938l239L649L419p208i98
$$ -7242 -8959 -4519 -10268 -7078 -7113 1119 7084 3531 -177 -4131 -8069 -11308 -7659 -4240 -11448 -998
920D630c533j912M62j202B55i417L974a971A711a078L44A067K527J992J165r74
$$ 4630 -3533 -5445 -4983 -6185 255 -9417 -5443 -1971 1711 -1078 -734 1067 3594 5586 6751 5777
904E777B391b780n324J663b686c69A4g642E86f790l241j09c606D074k11m95j154
$$ 5777 2391 -2780 -8104 -6441 -2686 -369 14 -7642 586 -6790 -10031 -10140 -3606 4074 3863 3368 2214
887B214A42a852j387r76p38m15Q3k10p07k36J59K46J22M87J100m605e52A447A45
$$ 2214 142 -1852 -3239 -4215 -4953 -5368 -5285 -5495 -6202 -6438 -6279 -6033 -5911 -5424 -4324 -8929 -552 1447 145
867c221A150a909k461j508Q54J914e98B470L539m59A363c808a601A327c242o22
$$ -3221 1150 -1909 -4370 -5878 -5024 -3110 -598 2470 6009 5550 1363 -3808 -1601 1327 -3242 -3864
851c864B39f05r254c761A477i543K123k657L902n98n1L031l52k709A767B88f380
$$ -3864 239 -605 -9859 -3761 1477 -9543 -7420 -10077 -6175 -6773 -6824 -3793 -4145 -6854 1767 288 -6380
833e028b242q084G84O822r05A78g833L043m520J129N47L380j941n664e859K755
$$ -5028 -2242 -10326 784 7606 6701 178 -7833 -4790 -9310 -8181 -7634 -4254 -6195 -11859 -5859 -3104
817c104k462a924j214j437j403n34R9K48l22l93o78j634j892J83m19o12J918K442
$$ -3104 -5566 -1924 -3138 -4575 -5978 -6512 -6413 -6165 -6487 -6880 -7558 -9192 -11084 -10901 -11320 -11932 -10014 -7572
799g572J567O31n996N008J285a965j575j12B609B94c769m703k244L379K213N87
$$ -7572 -6005 -5374 -11370 -6362 -5077 -1965 -3540 -3652 2609 294 -3769 -8472 -10716 -7337 -5124 -4537
783d537j179j286j008p62j534p42J856L564j108A87J950c964a08C059a2496b088
$$ -4537 -5716 -7002 -8010 -8772 -10306 -11048 -9192 -5628 -6736 187 2137 -3964 -108 3059 -12496 -2088
766b066r875d045j872b498l258N14B358O999K325B646e641a300m4j0430L044l869
$$ -2066 -11941 -4045 -5917 -2498 -5756 -5242 2358 9357 11682 2646 -5641 -1300 -1344 -11774 -8730 -12599
750a2599b728A3535n522i088E386j337h783K081k851M117a912E65J384e854l14
$$ -12599 -2728 13535 8013 -9088 5386 4049 -8783 -6702 -9553 -5436 -1912 565 1949 -5854 -6168
735f168A96N105P7B263d845d98l723m446l583L094L891K522m285L385k832l318
$$ -6168 196 5301 5378 2263 -4845 -498 -4221 -8667 -12250 -9156 -5265 -2743 -7028 -3643 -6475 -9793
719i793O71K861K264J773p839L80K253n950O603Q97h82A5664q11B80e03l891J704
$$ -9793 -9122 -6261 -3997 -2224 -10063 -9683 -7430 -13380 -6777 -5880 -882 15664 14853 280 -503 -4394 -2690
702b690k362b328J011q385A120b241R41C846P87O70d39E277j524a831Q65B279
$$ -2690 -5052 -2328 -1317 -9702 1120 -2241 -1300 3846 4633 5303 -439 5277 3753 -1831 -966 2279
685E924J193B935d042a22m121o319r96k02l99J136L594j353B448M934A537c95
$$ 5924 7117 2935 -4042 -122 -4243 -10562 -11558 -11760 -12159 -11023 -7429 -8782 2448 7382 1537 -395
668A79b298a09o191e33n225b515D755M293r60b415B169f83n263K912J500b94j20
$$ 179 -2298 -109 -6300 -533 -5758 -2515 4755 9048 8088 -2415 2169 -683 -5946 -3034 -1534 -294 -414
651d14j807k428j367J863a230A156L73h0p549J326R4K870a418M75j706l96O83
$$ -414 -2221 -4649 -6016 -4153 -1230 1156 1529 -80 -7629 -6303 -6209 -3339 -1418 -943 -2649 -3045 -2362
634b362a164a32F88L277a0814d175A659l20g589A272c523A362a1376N183C005
$$ -2362 -1164 -132 688 3965 -10814 -4175 1659 1339 -7589 1272 -3523 1362 -11376 -6193 3005
618D063o77J179K504C327a849o436j063K351EQ736i63F076r95e32p133R42F66
$$ 4063 3386 4565 7069 3327 -1849 -8285 -9348 -6997 5 8741 -963 6076 5081 -532 -7665 -6723 666
600E397a455C507a705m574o049M365j06m718K056K925K249J483j33l078l188K809
$$ 5397 -1455 3507 -1705 -6279 -12328 -7963 -8069 -12787 -10731 -7806 -5557 -4074 -4207 -7285 -10473 -7664
584g664R94n652O88d663j553j451k126L563i96k855B236F06g129l386d086L82
$$ -7664 -6670 -12322 -11634 -4663 -6216 -7667 -9793 -6230 -996 -3851 2236 606 -7129 -10515 -4086 -3704
568c704j980j002q61l934b844a50B281b873j344l44f89n90m012k508k837k155
$$ -3704 -5684 -6686 -7547 -11481 -2844 -150 2281 -2873 -4217 -4561 -689 -1279 -5291 -7799 -10636 -12791
552a2791N401K89K465B3J235a487d58C269A485J635C00g91K09l906b94m998m793
$$ -12791 -7390 -7101 -4636 23 1258 -1487 -458 3269 1485 3120 300 -791 -582 -4488 -294 -5292 -10085
535a0085J868Q94R28K753k718k104l455b711B80h509j500j438M227L375m934i39
$$ -10085 -8217 -7323 -6395 -3642 -6360 -8464 -11919 -2711 280 -8509 -10009 -11447 -7220 -3845 -8779 -939
518a376k04M25A72d781L4C062j358R54C89c617m667J973A132e666a775I367J791
$$ -1376 -1580 -1155 172 -4781 -4747 3062 1704 2658 389 -3617 -8284 -6311 1132 -5666 -1775 9367 11158
501A1158g88p157e55F738b157b32j529o216J278J083m130K798k424J070L506a789
$$ 11158 -788 -7945 -555 6738 -2157 -232 -1761 -7977 -6699 -5616 -9746 -6948 -9372 -8302 -4796 -1789
484a1994E69O15R74K73q62f575H067k962d197o87j329l739k535K063M523J449
$$ -11994 569 1184 2158 2431 1569 -6575 8067 5105 -4197 -4884 -6213 -9952 -12487 -10424 -5901 -4452
468d452o733b968a355C122a303r356M368b866m333K432b74l925l569c605A294
$$ -4452 -11185 -2968 -1355 3122 -1303 -10659 -6291 -2866 -7199 -4767 -274 -4199 -7768 -3605 1294
452A145M48J051e120N3B348i01o380k116m13O75k254c542l635l16K716b354M93
$$ 1145 1593 2644 -5120 -5067 2348 -901 -7281 -9397 -9810 -9135 -11389 -3542 -7177 -7493 -4777 -2354 -1861
435a861j279r64J367h57J61k870n604j075K522A137c579o600a399n156l814K039
$$ -1861 -3140 -4104 -2737 -857 -696 -3566 -9170 -10245 -7723 1137 -3579 -10179 -1399 -6555 -10369 -8330
419h330c784J043l48J188A090C64N309Q11j857J097k182b743n821a382d36J95
$$ -8330 -3784 -2741 -3089 -1901 1090 364 5673 6484 4627 5724 3542 -2743 -8564 -1382 -436 -241
403b41o337b343j0076L091l229K388K758K382N92n91m841j627l79J885J152J306
$$ -241 -6578 -2343 -12419 -9328 -12557 -10169 -7411 -5029 -4437 -5028 -9869 -11496 -11875 -9990 -8838 -7532
387g532J541j989c686r089b69j026j032j855j436j671o28J851b531m275o377N471
$$ -7532 -5991 -7980 -3686 -12775 -269 -1295 -2327 -4182 -5618 -7289 -7917 -6066 -2531 -6806 -13183 -7712
371g712A943L2a681m690n016J680L309a966D095J492g913K177J423B337d92m100
$$ -7712 1943 1975 -1681 -6371 -11387 -9707 -6398 -1966 4095 5587 -7913 -5736 -4313 2337 -492 -4592
355d592l037l68J477L59j200k727k647K013K264K053J921K93a809j406j826l069
$$ -4592 -7629 -7997 -6520 -6161 -7361 -10088 -12735 -10722 -8458 -6405 -4484 -4191 -1809 -3215 -5041 -8110
339h110j56L108a089B75e574m496B565A175n6P41a0101M988m976I28b724n55h86
$$ -8110 -8266 -5158 -1089 275 -5574 -10070 2565 1175 1119 1860 -10101 -5113 -10089 928 -2724 -3279 -886
321E613K051d065o10o43A690b868o05B197O085a8819F4258J94562J44102N8979
$$ 5613 7664 -4065 -4675 -5318 1690 -2868 -3473 2197 8282 -18819 64258 258820 402922 461901
307D61901o5285A34148E5314k1771K3086l758r590j5162j3830C051a605l657q14
$$ 461901 396616 134148 55314 33543 56629 52871 43281 28119 14289 3051 -1605 -5262 -6076
$$ [...]
##END NTUPLES=nD NMR SPECTRUM
##END=
