##TITLE=XTC-1693_2
##JCAMPDX= 6.0         $$ Bruker NMR JCAMP-DX V2.0
##DATA TYPE= nD NMR SPECTRUM
##DATA CLASS= NTUPLES
##NUM DIM= 2
##ORIGIN= BRUKER
##OWNER= patiny
$$ 1.79 TOPSPIN		Version 3.0
$$ 2012-05-20 11:53:37.750 +0200  patiny@icmbsg005
$$ Compression mode = diff/dup
##.OBSERVE FREQUENCY= 400.131585362325
##.OBSERVE NUCLEUS= ^1H
##.ACQUISITION MODE= SIMULTANEOUS (DQD)
##.ACQUISITION SCHEME= NOT PHASE SENSITIVE
##.AVERAGES= 2
##.DIGITISER RES= 23
##SPECTROMETER/DATA SYSTEM= spect
##.PULSE SEQUENCE= cosygpppqf
##.SOLVENT NAME= D2O
##.SHIFT REFERENCE= INTERNAL, D2O, 1, 7.267922
##AUDIT TRAIL= $$ (NUMBER, WHEN, WHO, WHERE, PROCESS, VERSION, WHAT)
$$ ##TITLE= Audit trail, TOPSPIN		Version 3.0
$$ ##JCAMPDX= 5.01
$$ ##ORIGIN= Bruker BioSpin GmbH
$$ ##OWNER= patiny
$$ $$ /opt/data/patiny/nmr/XTC-1693_2/12/pdata/1/auditp.txt
$$ ##AUDIT TRAIL=  $$ (NUMBER, WHEN, WHO, WHERE, PROCESS, VERSION, WHAT)
(   1,<2012-05-20 11:53:36.619 +0200>,<patiny>,<icmbsg005>,<go>,<TOPSPIN 3.0>,
      <created by zg
	started at 2012-05-20 11:33:48.931 +0200,
	POWCHK enabled, PULCHK disabled,
       configuration hash MD5:
       77 C7 B7 C4 10 F4 BA 30 64 2E BB 52 82 F2 DA 41
       data hash MD5: 2K * 256
       3C 91 68 89 45 47 23 28 C0 E9 8C 0A F7 2E 62 30>)
(   2,<2012-05-20 11:53:36.684 +0200>,<patiny>,<icmbsg005>,<audit>,<TOPSPIN 3.0>,
      <user comment:
       ICON-NMR User ID: patiny
       data hash MD5: 2K * 256
       3C 91 68 89 45 47 23 28 C0 E9 8C 0A F7 2E 62 30>)
(   3,<2012-05-20 11:53:37.495 +0200>,<patiny>,<icmbsg005>,<proc2d>,<TOPSPIN 3.0>,
      <Start of raw data processing
       xfb same F2: SI = 1K WDW = 4 SSB = 0 FT_mod = 6 PKNL = 1 F1: SI = 1K ME_mod = 2 NCOEF = 32 WDW = 4 SSB = 0 FT_mod = 6 PH_mod = 2
       data hash MD5: 1K * 1K
       EB F9 AE 8D D5 EC 07 89 D4 FF 04 77 AB 0A 5F 6A>)
(   4,<2012-05-20 11:53:37.602 +0200>,<patiny>,<icmbsg005>,<proc2d>,<TOPSPIN 3.0>,
      <abs2 F2: ABSG = 5 ABSF1 = 7.267922 ABSF2 = 0.6563141
       data hash MD5: 1K * 1K
       08 75 8D 72 37 6A 68 BE 56 44 74 B9 DD 80 14 95>)
(   5,<2012-05-20 11:53:37.700 +0200>,<patiny>,<icmbsg005>,<proc2d>,<TOPSPIN 3.0>,
      <abs1 F1: ABSG = 5 ABSF1 = 7.267922 ABSF2 = 0.6563141
       data hash MD5: 1K * 1K
       18 AD B0 30 0F 50 EE 46 53 88 44 37 DF 52 C7 05>)
(   6,<2012-05-20 11:53:37.740 +0200>,<patiny>,<icmbsg005>,<proc2d>,<TOPSPIN 3.0>,
      <sym
       data hash MD5: 1K * 1K
       E9 CB AA 8A 60 5E 2E F2 61 98 82 9A 7A A9 2A 40>)
$$ ##END=
$$ 
$$ $$ hash MD5
$$ $$ 53 30 53 A6 B9 02 FF 91 F5 C4 D0 C6 17 32 02 AD
##$RELAX= 
##$RELAX= 
##$RELAX= 
##$RELAX= 
##$RELAX= 
##$RELAX= 
##$RELAX= 
##$RELAX= 
##$RELAX= 
$$ Bruker specific parameters
$$ --------------------------
##$DATPATH= </opt/data/patiny/nmr>
##$EXPNO= 12
##$NAME= <XTC-1693_2>
##$PROCNO= 1
##$ACQT0= 1000000
##$AMP= (0..31)
100 100 100 100 100 100 100 100 100 100 100 100 100 100 100 100 100 100
100 100 100 100 100 100 100 100 100 100 100 100 100 100
##$ANAVPT= -1
##$AQSEQ= 0
##$AQ_mod= 3
$$ [...]
##$PYNMP= <proc.py>
##$REVERSE= no
##$SF= 400.13
##$SI= 1024
##$SIGF1= 7.267922
##$SIGF2= 0.6563141
##$SINO= 0
##$SIOLD= 1024
##$SPECTYP= <>
##$SREGLST= <1H.MeOD>
##$SSB= 0
##$STSI= 1024
##$STSR= 0
##$SW_p= 2645.50264550265
##$SYMM= 1
##$S_DEV= 7337
##$TDeff= 2048
##$TDoff= 0
##$TI= <>
##$TILT= no
##$TM1= 0
##$TM2= 0
##$TOPLEV= 100
##$USERP1= <>
##$USERP2= <>
##$USERP3= <>
##$USERP4= <>
##$USERP5= <>
##$WDW= 4
##$XDIM= 1024
##$YMAX_p= 453595667
##$YMIN_p= 0
##$CURPLOT= <Cups-PDF>
##$CURPRIN= <$Cups-PDF>
##$DFORMAT= <normdp>
##$LAYOUT= <+/2D_hom.xwp>
##$LFORMAT= <normlp>
##$PFORMAT= <normpl>
$$ Bruker specific parameters for F1
$$ ---------------------------------
##$ACQT0= 0
##$BF1= 400.13
##$FnMODE= 1
##$NUC1= <1H>
##$O1= 1585.3623245729
##$SFO1= 400.131585362325
##$SW= 6.61158164534076
##$SW_h= 2645.50264550265
##$TD= 256
##$ABSF1= 7.267922
##$ABSF2= 0.6563141
##$ABSG= 5
##$ABSL= 0
##$ALPHA= 0
##$AQORDER= 0
##$ASSFAC= 0
##$ASSFACI= 0
##$ASSFACX= 0
##$ASSWID= 0
##$AUNMP= <>
##$AXLEFT= 0
##$AXNAME= <F1>
##$AXNUC= <1H>
##$AXRIGHT= 0
##$AXTYPE= 0
##$AXUNIT= <>
##$AZFE= 0.1
##$AZFW= 0.5
##$BCFW= 0
##$BC_mod= 0
##$BYTORDP= 0
##$COROFFS= 0
##$CY= 15
##$DATMOD= 1
##$DC= 0
##$DFILT= <>
##$DTYPP= 0
##$ERETIC= no
##$F1P= 0
##$F2P= 0
##$FCOR= 0.5
##$FTSIZE= 1024
##$FT_mod= 6
##$GAMMA= 0
##$GB= 0
##$INTBC= 1
##$INTSCL= 1
##$ISEN= 128
##$LB= 0
##$LEV0= 0
##$LPBIN= 512
##$MAXI= 10000
##$MC2= 0
##$MEAN= 0
##$ME_mod= 2
##$MI= 0
##$NCOEF= 32
##$NC_proc= -5
##$NLEV= 6
##$NOISF1= 0
##$NOISF2= 0
##$NSP= 0
##$NTH_PI= 0
##$NZP= 0
##$OFFSET= 7.267922
##$PC= 4
##$PHC0= 0
##$PHC1= 0
##$PH_mod= 2
##$PKNL= no
##$PPARMOD= 1
##$PPDIAG= 0
##$PPIPTYP= 0
##$PPMPNUM= 2147483647
##$PPRESOL= 1
##$PSCAL= 1
##$PSIGN= 0
##$PYNMP= <proc.py>
##$REVERSE= no
##$SF= 400.13
##$SI= 1024
##$SIGF1= 7.267922
##$SIGF2= 0.6563141
##$SINO= 0
##$SIOLD= 1024
##$SPECTYP= <>
##$SREGLST= <>
##$SSB= 0
##$STSI= 1024
##$STSR= 0
##$SW_p= 2645.50264550265
##$SYMM= 1
##$S_DEV= 7337
##$TDeff= 512
##$TDoff= 0
##$TI= <>
##$TILT= no
##$TM1= 0
##$TM2= 0
##$TOPLEV= 0
##$USERP1= <>
##$USERP2= <>
##$USERP3= <>
##$USERP4= <>
##$USERP5= <>
##$WDW= 4
##$XDIM= 128
##$YMAX_p= 453595667
##$YMIN_p= 0
$$ End of Bruker specific parameters
$$ ---------------------------------
##NTUPLES= nD NMR SPECTRUM
##VAR_NAME=  FREQUENCY1,    FREQUENCY2,      SPECTRUM
##SYMBOL=    F1,            F2,              Y
##.NUCLEUS=  1H,            1H
##VAR_TYPE=  INDEPENDENT,   INDEPENDENT,     DEPENDENT
##VAR_FORM=  AFFN,          AFFN,            ASDF
##VAR_DIM=   1024,          1024,            1024
##UNITS=     HZ,            HZ,              ARBITRARY UNITS
##FACTOR=    2.58349867724868, 2.58349867724868, 1
##FIRST=     2908.11359968662, 2642.9191468254, 59863
##LAST=      265.194452861221, 0,            8055
##MIN=       265.194452861221, 0,            0
##MAX=       2908.11359968662, 2642.9191468254, 453595667
##PAGE= F1=2908.113599687
##FIRST=     2908.11359968662, 2642.9191468254, 59863
##DATA TABLE= (F2++(Y..Y)), PROFILE
$$ [...]
##PAGE= F1=1066.079042808
##FIRST=     2908.11359968662, 2642.9191468254, -2769
##DATA TABLE= (F2++(Y..Y)), PROFILE
155b251p601K696a219I145j825l455a785m12k810k215L353b21q604J547l227j365
139a1870P95J111Q80j984K090mJ314q50b002F79d862A581a313m482m664k735L414
122i780K825Q50j157K145J549E51L368A298g389n499h50j673j482n80N30a923
105A502L536A870L220M6G71e436p574N513A45L616K389R44d681l850L763l562
89h330J622J084J217m636k4497a0063M122K94K254O03J241d69j158k121j570J098
73d220a326q13A577M84f51l460E392C0a0344L258O05m8N80J869r126a641C827
55b445p095B436j208i458C514N990c02k259J94Q66C943j112i874b915j032f08
38b389o411i70I4J40b190p929M488B863K100i43A802e749j893k289K216j94K682
$$ y = [-2251, -9852, -7156, -1219, 9145, 7320, 3865, -1785, -2197, -5007, -7222, -3869, -221, -8825, -7278, -10505, -11870, -11075, -9964, -9084, -11068, -8978, -8982, -7668, -8518, -2002, 679, -4862, 1581, -1313, -5795, -10459, -13194, -9780, -6955, -6105, -7262, -5117, -3568, 551, 3919, 1298, -7389, -12888, -850, -2523, -4005, -4585, -4055, -1923, 1502, 5038, 1870, 5090, 5136, 771, -5436, -13010, -7497, 145, 3761, 6150, 7094, -4681, -8531, -4768, -8330, -6708, -5624, -4407, -9043, -33540, -10063, -5941, -5647, -3393, -2790, -1549, -469, -1627, -3748, -5318, -4220, -1326, -2139, 1577, 2061, -651, -4111, 5392, 30, -10344, -7086, -6481, -6529, -5949, -4080, -13206, -1641, 3827, -2445, -9540, 2436, 1228, -9458, 3514, 9504, -302, -2561, -2367, -1501, 3943, 2831, -9874, -2915, -3947, -608, -2389, -8800, -970, 94, 234, -2190, -10119, -5631, 2863, 4963, -943, 1802, -5749, -7642, -9931, -7715, -7909, -5227]
21e227k275k780J403j880n7K820L057a515k065D958K722J335e08C938B29g058
4f273a279a24C749M483
0H232
$$ y = [-5227, -7502, -10282, -8879, -10759, -10816, -7996, -4939, -1515, -3580, 4958, 7680, 9015, -508, 3938, 229, -7058, -6273, -1279, -124, 3749, 8232]
##PAGE= F1=1063.495544131
##FIRST=     2908.11359968662, 2642.9191468254, 1777
##DATA TABLE= (F2++(Y..Y)), PROFILE
1023A777a252B019a141l523l690J994K587l741L282k983k395M37L572a700A509
1007H53e828J435a127B888F71L318a1895D22c645l734K440B04a4527O563D052
991C006c904r89R56j255j599k361p37J124l207N346K38k053m317h04D599N540
975A0139j833C937a893o255n340M702L631b172B72K286e683K4K119k320o251b057
958D570M839a305j4906L82L556N642D415O399L294k625a0352a817n868m476e980
942h16B125d417n616c455J587p844c741Q52f19b03j3879a038H48d697m6a531k749
925d280m956l660N985b524n930n9n871O670b595B193c196l595O23a545b86n507
909e793D69c231D780B1i373j609J196J699I120J401B114f798c024G544j784j050
$$ y = [1777, -1252, 2019, -1141, -4664, -8354, -6360, -3773, -7514, -4232, -7215, -9610, -9173, -5601, -1700, 1509, 853, -5828, -4393, -1127, 2888, 671, 3989, -11895, 422, -3645, -7379, -4939, 204, -14527, -7964, 4052, 3006, -3904, -4893, -3937, -5192, -6791, -9152, -9889, -8765, -11972, -6626, -6388, -8441, -12758, -804, 4599, 10139, 8306, 3937, -1893, -8148, -13488, -8786, -5155, -2172, 272, 2558, -5683, -5659, -3540, -5860, -12111, -2057, 4570, 9409, -1305, -16211, -15829, -12273, -6631, 4415, 10814, 14108, 11483, -10352, -1817, -7685, -12161, -5980, -816, 2125, -4417, -10033, -3455, -1868, -9712, -3741, -2889, -619, -203, -14082, -1038, 848, -4697, -4743, -1531, -4280, -9236, -12896, -6911, -2524, -8454, -8513, -14384, -7714, -2595, 2193, -3196, -6791, -6168, -1545, -286, -5793, 469, -3231, 4780, 21, -9373, -10982, -9786, -8087, 9120, 10521, 2114, -6798, -3024, 7544, 5760, 4710]
893D710n76A71b812A503A24f82m96l14j3K32L78j396j378R50m2Q44d97F48K59
874I07c3j0483Ca091m074l060c450h78k185m038q80M34K539b094k657g52j874
857b626l61A088d123C364H86c275D932d435l995g82C293g068j777L417a873n87
841b460L50i87b57n72j202k613l216l042p84J070L33m80j248j647K234L143L171
824e110a456M2B857j38e730j55e06m85k51q40p36L9l5641p952f06B36a3369J681
806a1688L523E609d79p988p38c899A794c509m363M35a035B024D62a227p44M94
790a477o625L56o39Q24J784o137J432c047C555K511K41M53a415A525a645j891
774c536M08m819a904q607k956d99J17D10K72C3a190k059n396K006j469q40N81
$$ y = [4710, 4134, 171, -2812, 1503, 124, -682, -1178, -1492, -1505, -1273, -895, -2291, -3669, -2719, -2761, -1917, -497, 648, 907, -33, -10516, 3, -1091, -5165, -8225, -3450, -878, -3063, -7101, -7981, -7547, -5008, -2094, -4751, -752, -2626, -2987, 1088, -4123, 3364, 886, -3275, 4932, -4435, -8430, -782, 3293, -7068, -8845, -5428, -1873, -2460, -2110, -987, -257, -829, -2031, -4644, -7860, -10902, -11686, -10616, -10283, -10763, -12011, -13658, -11424, -8281, -5110, -1456, -1414, 2857, 2719, -5730, -5885, -506, -991, -1242, -2082, -2818, -2779, -38420, -46372, -606, 236, -13369, -11688, -8165, 5609, -479, -8467, -9205, -3899, 1794, -3509, -7872, -7437, -1035, 2024, 462, -1227, -1971, -1477, -8102, -7746, -8385, -7561, -5777, -11914, -10482, -3047, 3555, 6066, 6307, 6760, -1415, 1525, -1645, -3536, -3128, -7947, -1904, -10511, -13467, -499, -382, 410, 682, 33, -1190, -3249, -8645, -6639, -8108, -8948, -8367]
757h367J765K071m507J225a030q201L918K170A338i89m968k813j046L135K799
742c882J568j199l406j642j77c585r40H273k631C20d81o404K976l033D610j411
726C199G69a981k778n76J523J85O48k524l209K477i58C338j437c639H094N880
710A3974j107d231a157E643c357I881b27o346A308c261o878j965N772K827a133
694G05O93l30L145O81h479a567A421M84c963k518p16c315J619j0663a836e90k009
677b599j848j458n6R73J631j354p21M63j302L089N02g97A749a29E084b627o223
660h850M027l724J456c366q038J159K820K028a927k314k593m90O39J131j703k75
644g532b585j210k570n899L790L643O30B092e142j911C395a1764A30d746m459
$$ y = [-8367, -6602, -4531, -9038, -7813, -1030, -9231, -5313, -3143, 1338, -989, -5957, -8770, -9816, -6681, -3882, -2314, -3513, -6919, -8561, -8738, -3585, -4525, 8273, 5642, 320, -481, -6885, -3909, -6942, 4610, 3199, 769, -1981, -4759, -5335, -3812, -3627, -2979, -5503, -8712, -6235, -958, 3338, 1901, -3639, 8094, 13974, 12867, -4231, -1157, 5643, -3357, 9881, -227, -6573, 1308, -3261, -10139, -12104, -6332, -3505, -1133, 705, 1398, 1068, 4213, 4894, -8479, -1567, 1421, 1905, -3963, -6481, -7197, -3315, -1696, -12359, -1836, -590, -2599, -4447, -5905, -5961, -4988, -3357, -4711, -5432, -4969, -6271, -3182, -2680, -797, 1749, -129, 5084, -2627, -8850, -4823, -8547, -7091, -3366, -11404, -10245, -7425, -5397, -1927, -4241, -6834, -7324, -6685, -5554, -7257, -7532, -2585, -3795, -6365, -12264, -8474, -4831, -4201, 2092, -5142, -7053, 3395, -11764, 130, -4746, -9205]
629i205K712j5020q5292J3405a063A062K490M72e42o753a665A489L29b381n077
614g458n562N385K812L02k372O09g17j768j646L4A483J926b614n189j191K674
598f320k888j684P89L779L089D548j102Q726J587D006J674O030k236f883k666
583i549a210k329k594K852A924P094R14C567c260A066a329k858p420j720f264
567f721m110B132L665j691d726m747d244m272j573d631B192K622A457a572o26
552b198G8L383J368l03B015f120K981m107k013J396j062a892j0047M675O35L303
536c326J382j695l418k184K982b377f0A195h136c258k722K286a843r98j525k100
520f466j269q52O98K489k193L541J412n665A817K707L064e228h65A344h166L143
$$ y = [-9205, -6493, -21513, -106805, -93400, -1063, 1062, 3552, 4024, -542, -7295, -1665, 1489, 1818, -2381, -7458, -13020, -7635, -4823, -4521, -6893, -6284, -717, -2485, -4131, -4097, 1483, 3409, -2614, -7803, -8994, -6320, -9208, -10892, -10103, -6324, -3235, 4548, 3446, 12172, 13759, 4006, 5680, 11710, 9474, -6883, -9549, -1210, -3539, -6133, -3281, 1924, 9018, 9932, 3567, -3260, 1066, -1329, -4187, -11607, -13327, -6264, -6721, -10831, 2132, 5797, 4106, -4726, -9473, -4244, -8516, -10089, -4631, 2192, 4814, 1457, -1572, -2198, 78, 3461, 4829, 4526, 2015, -6120, -3139, -7246, -9259, -7863, -8925, -1892, -11939, -7264, -6629, -3326, -1944, -3639, -7057, -9241, -6259, -2377, -60, 1195, -8136, -3258, -5980, -3694, -1843, -2841, -4366, -6466, -7735, -8587, -7889, -5400, -7593, -4052, -2640, -8305, 1817, 4524, 7588, -5228, -865, 1344, -8166, -5023]
504e023p54P66N36n25q80P74J996o91p292N275r8m670j431d874B315N258K119
487I692g121K231b346o725m503L086K537J46k50J446c001A068R60c740G683m1
471G642j011r80A721A36a0826b314j004n460J532n77l791c594C854C15b248j793
455d041j228j908l114m107r91K436J599J40j300j870P96L259M150J66b18B331
438C990L06j168F56p7a373m865Q22j428n33L34P03O49P0o02P39K407A328M556
420E884K148d771A3197l757l485L519l954b213G742J187f301L49Q33O24K101k837
404e231l712L077h73E436I02d273k464K17o423b188C494f849C02a557M08A030
387A05N257Q63f377H65L49P51k16p44a060k117j976n66k15q42n084J80l17J62
$$ y = [-5023, -5777, -5011, -4475, -5000, -5880, -5106, -3110, -3801, -11093, -5818, -5916, -10586, -12017, -4874, 2315, 7573, 9692, -7121, -4890, -2346, -9071, -13574, -10488, -7951, -7805, -8055, -6609, -3001, 1068, 2028, -3740, 7683, 7642, 6631, 5651, 1721, 136, -10826, -2314, -3318, -8778, -7246, -7823, -11614, -3594, 3854, 315, -2248, -4041, -5269, -7177, -10291, -14398, -15389, -12953, -11354, -11214, -12514, -14384, -13588, -10329, -6179, -6013, -218, 2331, 3990, 4296, 3128, 656, 579, -1373, -6238, -5416, -6844, -7377, -7043, -6340, -5691, -5621, -6223, -5484, -3077, 1328, 5884, 8032, -4771, 13197, 9440, 5955, 9474, 5520, -2213, 7742, 8929, -6301, -5952, -5119, -4495, -2394, -5231, -8943, -5866, -873, 5436, 902, -4273, -6737, -6520, -12943, -2188, 3494, -6849, 302, -1557, -1149, 1030, 105, 5362, 6225, -6377, 865, 1214, 1965, 1749, 1005, -1060, -3177, -5153, -5719, -5934, -6776, -11860, -11680, -11997, -11835]
369a1835K015M28K897E8a070k668m234j556M164g10B442r75I1a711m563J406A0115
351A2698j439m991A5b745c53C344J145A825b551j815q95D549L656f728O73a145
334f855b810j511B667d26p857A4691j654j734m91K48o3j361j991k333j520A459
317b264n531o890b253A3543J7308j2010K5927K8928A6985J726p060M3478Q8148
304A43277O8943K2151l0160F8884c984o559E986B137a710A0042A447d171P0g9
289b33C622A642f178K316a396J92E690o22e626k438c198Q06l732m81K747m926
273h784b254o755H688J697D056c269K25p556K149k533a730o195A848c896o240
258a0136l226K901M730a511B245L272j21J957j634a620k673F13b83j254k320k040
$$ y = [-11835, -9820, -9392, -6495, 58, -1070, -3738, -7972, -9528, -5364, -710, 2442, 1467, 91, -1711, -6274, -4868, 10115, 12698, 11259, 6268, 15, -2745, -353, 3344, 4489, 1825, -2551, -4366, -5261, 4549, 8205, -6728, -6055, -1145, -6855, -2810, -4321, 2667, -426, -8283, 14691, 13037, 11303, 10812, 11060, 10997, 9636, 7645, 5312, 3792, 1459, -2264, -7795, -14685, -2253, 13543, 30851, 18841, 44768, 73696, 16985, 18711, 11651, 55129, 143277, 212220, 234371, 204211, 68884, -3984, -10543, 5986, 2137, -1710, 10042, 1447, -4171, -4101, -79, -233, 3622, 1642, -6178, -3862, -1396, -1204, 5690, 5068, -5626, -8064, -3198, -2392, -6124, -6605, -3858, -8784, -2254, -9009, 8688, 10385, 4056, -3269, -3044, -10600, -8451, -10984, -1730, -7925, 1848, -3896, -10136, -13362, -10461, -5731, -1511, 2245, 5517, 5396, 7353, 5719, -1620, -4293, 613, -283, -1537, -3857, -5897]
242e897m283L086O41L26j50J87J77j074l354l491N890B59P032B497g515j506M58
225h563b855C924A203h424N79e05G620a1081B155c741o205J56J241j091K758m872
209a1754M984C01g8k206k931j876O39l466b566rk863j777k540j060K273k700c92
191D030L083J204C783J071a01j738A441f085c004k834b203l769k629Q89K130n752
175a1334K042c399l827l3c50k183q185L881k618a431n11o901c354j343j501o74
159f872K23N86M74N98n201j552d249h39H46J483c659k12k486j842A555L953e348
141B193J734A83c013j460P17m273c886O74m80o825d709j765k981k701N112a629
124B842h583E118e295N44j947J313M44E749K802C197e623p728C995h1l498l877
$$ y = [-5897, -10180, -7094, -6453, -6127, -6277, -6090, -5913, -6987, -10341, -13832, -7942, 259, 7291, 2497, -7515, -9021, -8563, -2855, 3924, 1203, -8424, -7845, -505, 7620, -11081, 2155, -3741, -9946, -9790, -8549, -9640, -6882, -11754, -6770, 301, -78, -2284, -5215, -7091, -6452, -9918, -2566, -2575, -5438, -7215, -9755, -10815, -8542, -11242, -392, 4030, 7113, 8317, 3783, 4854, -101, -1839, 1441, -6085, -3004, -5838, -2203, -5972, -8601, -7712, -5582, -11334, -9292, -3399, -7226, -7259, -350, -2533, -10718, -6837, -9455, -1431, -1942, -8843, -3354, -4697, -6198, -6872, -6649, -6063, -5589, -4991, -10192, -11744, -4249, -839, 846, 2329, -3659, -3871, -6357, -8199, 1555, 5508, -5348, 2193, 3927, 183, -3013, -4473, -3756, -8029, -3886, -3212, -3692, -10517, -4709, -6474, -9455, -12156, -7044, -1629, 2842, -8583, 5118, -5295, -4751, -6698, -5385, -4941, 5749, 8551, 3197, -5623, -13351, 3995, -81, -3579, -7456]
108g456n38J548J507J03q94k052l501k037N888m277k00c530c47C019L409d271
91g210J083J928J215a364b94k00k5293a2217d979J585l341l011L421n008M812
76f521a977A107b738i76k052j746l179k941O41K504K338l826K015P33N89k04P64
59e340k007c492a177j240p753B704j49e9B529n44c917k736A312E09O360B657i254
41d753m517C477j092c782l674J215L035k940l388K800C499J658k41J646h612a929
24h160K554j054L190p813K644L508Q9k030a113p22k971j727e25F432L687d609
7C453M10d710m618a125G67J635P370
0I772
$$ y = [-7456, -7994, -6446, -4939, -4836, -5730, -7782, -11283, -13320, -7432, -11709, -11909, -3530, -347, 3019, 6428, -4271, -7210, -6127, -4199, -2984, -1364, -294, -494, -25787, -12217, -4979, -3394, -6735, -9746, -6325, -11333, -6521, -1977, 1107, -2738, -976, -3028, -4774, -7953, -10894, -10253, -7749, -5411, -9237, -7222, -6489, -5900, -6104, -5340, -7347, -3492, -1177, -2417, -10170, 2704, 2555, -59, 2529, 1985, -3917, -6653, 1312, 509, 6869, 2657, -9254, -4753, -9270, 3477, 2385, -3782, -7456, -6241, -3206, -6146, -9534, -6734, 3499, 5157, 4916, 6562, -8612, -1929, -8160, -5606, -6660, -3470, -11283, -8639, -5131, -5042, -7072, -1113, -1835, -4806, -6533, -525, 6432, 10119, -4609, 3453, 3863, -4710, -9328, -1125, 767, 2402, 9772]
##PAGE= F1=1060.912045454
##FIRST=     2908.11359968662, 2642.9191468254, 402
##DATA TABLE= (F2++(Y..Y)), PROFILE
1023D02c858J410K14j007d37p70l80n061n2o91K820k726K85C227p87a718k632
1006d350j853j318P4R75K096l285I66L549L206K726a438j2554N409E4R50d052
989h174j471J537K271J582l029b448p623K998k166K227j761A958N380L2d73q129
973h602L633m128E317Q888P41j919m705C400f120K235J339l000n041k169K987
958i769L090J998j2483k485N355e871r25J97J460J077l350j421m381R3j72L571
942i722K565O09l546j63k833R56M144c600E90J029a0021C361A557e283a872C380
925a909q470j285d629b23r623K575l399O82c264B601f80n013a117H522k49f179
908b706n17A175i301r62K544r48L920A0765l174b653r044M929G515l318A690b60
$$ y = [402, -3858, -2448, -2234, -3241, -437, -1207, -1587, -6648, -6700, -7391, -4571, -7297, -7012, 3227, 2440, -1718, -4350, -6203, -7521, -7447, -6472, -4376, -7661, 966, 4515, 7721, 10447, -1438, -13992, -8583, 54, 1004, -4052, -8174, -9645, -8108, -5837, -4255, -7284, -2448, -10071, -7073, -9239, -7012, -8773, 1958, 7338, 7370, -473, -8602, -4969, -9097, 5317, 14205, 14946, 13027, 8322, 3400, -6120, -3885, -2546, -5546, -10587, -12756, -9769, -6679, -4681, -17164, -19649, -14294, -5871, -6796, -6599, -5139, -4062, -7412, -8833, -13214, -13121, -13293, -9722, -7157, -6548, -10094, -10257, -13090, -12134, -7990, -3600, 590, 1619, -10021, 3361, 1557, -5283, -1872, 3380, -1909, -10379, -11664, -4629, -223, -9846, -7271, -10670, -9988, -3264, 2601, -680, -5693, -1117, 8522, 8273, -6179, -2706, -3223, 1175, -9301, -10263, -7719, -8667, -4747, 10765, 7591, -2653, -11697, -6768, 7515, 4197, 1690, -260]
891b053j844j929k480k768m55M534a651C216O16g178K18F603M748J971j170j944
875A0208m734j647h218c948k200n99o69J592O2m250j74L8k749k022J766J405K674
858i074L920K236C560f597H475C271c033C352c19o057b746a044l168q938M669
843h481G243K93C009O94a03m603j766K797C05K250g816c83l907j628K263b26j0241
826a0467F67K435j500c719A380a293o587K431q36j075k39l63j30O03l2615l3690
810g3794a5189b917j909q648N235D584a134q122l603c032D487A370e778K457E89
794D852j249J635M351a550q307K369M3k734K790n107J334b476E515L320m351R90
778E474B217d094o828M182c116q799d187m717k156d627B139J538L727l045f37
$$ y = [-2053, -3897, -5826, -8306, -11074, -11529, -6995, -1651, 3216, 3832, -7178, -6960, 6603, 11351, 13322, 12152, 10208, 5474, 3827, -8218, -3948, -6148, -6747, -7416, -5824, -5762, -10012, -10186, -10148, -12897, -14919, -13153, -11748, -9074, -5154, -2918, 3560, -6597, 8475, 3271, -3033, 3352, -319, -6376, -2746, -1044, -4212, -13150, -8481, 7243, 7536, 3009, 3703, -103, -4706, -6472, -3675, 305, 2555, -7816, -383, -4290, -5918, -3655, -226, -10467, 667, 3102, 1602, -3719, 1380, -1293, -7880, -5449, -6285, -7360, -7599, -7962, -8092, -7489, -40104, -73794, -15189, -2917, -4826, -13474, -8239, 4584, -1134, -9256, -12859, -3032, 4487, 1370, -5778, -3321, 589, 4852, 3603, 5238, 9589, -1550, -9857, -7488, -7445, -10179, -7389, -12496, -11162, -2476, 5515, 8835, 4484, 5474, 2217, -4094, -10922, -6740, -3116, -11915, -4187, -8904, -11060, -4627, 2139, 3677, 7404, 4359, -637]
762d393m227b728C374L519c718a50m25q696L574J41n356K040o3L607i91l467B954
744A870F14f070C129K911A292l65g686J411q302f905A70e63K60n429a764n912
728g676a8A486J914O65b067C11J31g798H04M010H01d050j240a993A213b674C303
710C506N98d679A157P945A782P014b278p308a97C86i690J337A575Q63h78A094
693C61J177C60a537o055J545k040r65N55J160J053Q24O92p196c912K72o05k056
676f301l656l554L424L748K331O55o33n75l026c131a388c03B92d53k013l074l779
659i319l100J463K500m466K356m5l198NK370J346J167J165J431q97R13K600j404
642e113k134n400M600J369O33m48j315o347K546M80K403K965K862A21b4689q2448
$$ y = [-4393, -8620, -2728, 3374, 6893, -3718, -150, -575, -9271, -5697, -5556, -10912, -8872, -8935, -5328, -991, -4458, 2954, 1870, 614, -6070, 3129, 6040, 1292, 927, -7686, -6275, -14577, -6905, 170, -563, -303, -5732, -1764, -7676, -18, 1486, 3400, 4065, -2067, 311, 442, -7798, 804, 4814, 801, -4050, -5290, -1993, 1213, -2674, 3303, 3506, 4104, -4679, 1157, 9102, 1782, 8796, -2278, -9586, -197, 386, -9690, -8353, 1575, 2438, -878, 1094, 361, 1538, 360, -1537, -7592, -6047, -8087, -9052, -8497, -7337, -6284, -5460, -4768, -11964, -3912, -3640, -4245, -6301, -9957, -13511, -10087, -6339, -4008, -3353, -3986, -4561, -7587, -3131, -1388, -303, 292, -453, -2466, -5540, -9319, -12419, -10956, -8456, -12922, -10566, -10611, -13809, -13804, -11434, -10088, -8921, -7756, -6325, -7222, -6309, -3709, -5113, -7247, -12647, -8047, -6678, -6045, -6493, -7808, -14155, -11609, -11129, -8726, -5761, -2899, 121, -24689, -107137]
626a07137L2356E115M06k514c88l537k237PJ249J101k817k367k374e646K062j626
610e210J177l353m105j659N003c199B778K351d720o941N374A535a728k119j75
595d022m862E84L256j25L806m64C307P13j505I94a0599n34F76a720m172M28g17
577C448o92L51c052D728N399d521l470k844L006o646Q43A502M559B261d565m041
561h606J222n189N406G33M020O861n173c697l892n541f439f52A982C05d736b06
544d875p39l682J880b172o372l468e817G5e209F40b630m085L143g32A280H2f891
526i06n598k142A6a237k094k408m24k979R78K323j608L070L99j740H735M91r14
509H312g709C130L53f437m0g73H1d979p234K283b138A024a830m670q2c149m806
$$ y = [-107137, -74781, 5115, 5521, 3007, -388, -3925, -6162, -6155, -4906, -3805, -6622, -8989, -11363, -5646, -3584, -5210, -4033, -7386, -11491, -13150, -8147, -3199, 2778, 5129, -4720, -11661, -6287, 1535, -1728, -3847, -4022, -8884, 584, 3840, 3715, 7521, 7057, 3307, 4020, 2515, 994, -10599, -11133, 676, -1720, -5892, -5464, -717, 3448, 2756, 3107, -3052, 4728, 10127, -4521, -7991, -10835, -7829, -14475, -13632, 1502, 6061, 2261, -4565, -8606, -7384, -12573, -7167, 733, 4753, 11614, 6441, -3697, -7589, -13130, -6439, -652, 1982, 305, -4736, -206, -4875, -5614, -9296, -7416, -2172, -8544, -12012, -5817, 75, -5209, 640, -2630, -6715, -3572, -732, 1280, 82, -6891, -906, -6504, -8646, 16, -1237, -3331, -5739, -6163, -9142, -8164, -5841, -7449, -4379, -3980, -5720, 8735, 9226, 8312, -7709, 3130, 3483, -6437, -6477, -773, 81, -4979, -12213, -9930, -2138, 1024, -1830, -6500, -6582, -3149, -7955]
492g955Q91J649C93N053L058b660l725r94L570m783c478B7c612G948Q99d11E556
474E132d340L81m415l130k220l48N116b032m907q91k963f23j527j2013b624l017
458e641j745J101J326K99J6K204P65A47J489A60J48b907m215m701k440K380K468
441i415K365L440A14L299K322d14E78b346j675J217C343j450o73E64f46k320l794
424f760l328L00M031b115I02d361E418L242C334L031k443b807D123M599d344k99
408d643K290n46m192n139J791M949b173J066k307m230l353L465m671b256C927
392f871e29B836b121A29N463j556c87n516n511j374M602c948a495M94p0n236k439
375h746J853k019r10b10j0049L136m084b547l163C09N000B604J064j742k21o1
$$ y = [-7955, -7064, -5415, 393, 5446, 8504, -2660, -6385, -7379, -3809, -8592, -3478, 27, -3612, 7948, 8847, -411, 5556, 5132, -4340, -3959, -8374, -11504, -13724, -14072, -8956, -2032, -6939, -7830, -10793, -623, -2150, -14163, -2624, -5641, -7386, -6285, -4959, -4660, -4644, -2440, -1675, 147, 1636, 160, 308, -2907, -7122, -11823, -14263, -11883, -9415, -7050, -3610, 114, 3413, 5735, -414, 578, -2346, -4021, -2804, 3343, 1893, 1220, 564, -646, -2966, -6760, -10088, -9788, -5757, -2115, 902, -4361, 5418, 8660, 3334, 6365, 3922, -2807, 4123, 8722, -4344, -4643, -2353, -2899, -7091, -12230, -10439, -5490, -2173, -1107, -3414, -7644, -10997, -7532, -12203, -2256, 3927, -6871, -529, 2836, -2121, 129, 5592, 4036, -387, -5903, -11414, -12788, -8186, -3948, -1495, -1001, -1071, -6307, -8746, -6893, -8912, -9822, -210, -10259, -7123, -11207, -2547, -5710, 309, 5309, 2604, 3668, 1926, 1705, 1644]
359A644p16a639k916M38o51Q0A0124J820j157l365C046a387m587k273k32M7k00
342h632r53j147J160L243R7b490i91k447c77l569l398j814N11Q83Q36Q51J817
325d260a922a4E04m8K27K063J875P45J64j129j688j216J059L686N706N037M793
308B1778K4814O9179J14296J11049M0215n7098j16024G7960k5854F236B060J720
296C780d361a338l630l887m373L177b409D974O520c868m320d1j482B823r87c478
279d677J289h70B143m46C98g128L509k286B91a554j870j695j963m387j038k129
263a4636K076K616J480N58j085j424j135L76P21J305K326K122K131f65n73l465
247d703E394L84k631b225R5n440J3O43K744i6C813Q06N379B025g70E138j818j029
$$ y = [1644, 928, -1639, -4555, -4117, -4768, -4688, 10124, 11944, 10787, 7422, 3046, -1387, -5974, -8247, -8479, -8432, -8632, -9585, -10732, -9572, -6329, -6232, -2490, -991, -3438, -377, -3946, -7344, -9158, -8647, -7764, -6928, -6077, -4260, -1922, -14, 504, 456, 683, 2746, 4621, 5366, 5530, 4401, 2713, 1497, 2556, 6242, 11948, 16985, 21778, 46592, 115771, 230067, 341116, 381331, 324233, 208209, 77960, 52106, 6236, 2060, 3780, -4361, -1338, -4968, -8855, -13228, -10051, -2409, 4974, 11494, -3868, -8188, -41, -1523, 2823, 1836, -3478, -4677, -3388, -870, 2143, 1697, 398, -7128, -3619, -5905, 291, -1554, -3424, -5119, -7082, -11469, -12507, -14636, -12560, -9944, -8464, -7906, -8991, -10415, -11550, -11174, -10453, -9148, -6822, -4700, -2569, -665, -1238, -4703, 5394, 5778, 3147, -2225, -2130, -7570, -7557, -6914, -4170, -96, 3813, 4619, 9998, 2025, -770, 5138, 3320, 2291]
229B291d647l651J852l726c205k727l647m243j26L710J683k472k238l359M095
214a2529M544L210J003J55m665K440p09j96P64J360k158b568m416A946j74c521
197d086l352K420h99j1709D20M493P859m369l622A881d145j950o043k051J699
182a2490k27k23N139Ha589f25r542L428d35m675q98b623n148l055M867o641L461
165i139K781o690O058p29J27O27P11R18O57j55j205m161J431b07C700J384f061
147f534m84j045F218L337b236B414O671k521A774e848n447k488Q70L930c353p473
131a0826D865q52e864G298N938L135l215e833f51n434l493K249J039J62k178L721
115d585D91c848n176H02a644n70k015A74J502n36K209j059a0502H39C79Q14g849
$$ y = [2291, -4647, -8298, -6446, -10172, -3205, -5932, -9579, -13822, -13948, -10238, -8555, -11027, -13265, -16624, -12529, -7985, -4775, -3772, -3617, -8282, -5842, -6551, -6747, -5983, -4623, -6781, -2568, -6984, 1946, 1772, -3521, -4086, -7438, -5018, -899, -12608, 420, 4913, 12772, 8403, 4781, 1881, -4145, -6095, -12138, -14189, -12490, -12717, -12940, -7801, 8, -1589, -625, -10167, -6739, -435, -5110, -6008, -2623, -7771, -10826, -5959, -12600, -9139, -6358, -13048, -6990, -7719, -7592, -6965, -6254, -5336, -4679, -4834, -6039, -10200, -8769, -207, 3700, 5084, -6061, -6534, -7018, -8063, 6218, 9555, -2236, 2414, 9085, 6564, 1774, -5848, -11295, -13783, -12913, -8983, -3353, -10826, 4865, 4013, -5864, 7298, 13236, 16371, 13156, -5833, -651, -6085, -9578, -7329, -6290, -6128, -8306, -4585, 491, -3848, -9024, 802, -1644, -2214, -4229, 174, 1676, 1140, 3349, 2290, -10502, 839, 379, 1193, -7849]
97h621a320p33P14D284d390j573q61K532p746b141D049K213a5961p30d055d51
80d988p500E5d102p352N014b74l562a676m170j32o77K101a46E711J095d257J670
63b587P11n12B342o94c320n570m946L662j803h69B867K094k439A108e193m593
47i786E02P93N386C141h682L463p040C53c71B513l78d957k221j903K29P41E5L880
29C935l15a271r311Q23n43R45O75J16p70q43J349L802k746i59o56j297j453k401
11f766b585A584h996B577h09m452l426L849f83I10K404
0C314
$$ y = [-8621, -1320, -2053, -1339, 4284, -4390, -5963, -6824, -4292, -12038, -2141, 4049, 6262, -15961, -16691, -4055, -451, -4988, -12488, 55, -4102, -11454, -6440, -274, -3836, -1676, -5846, -5978, -6655, -4554, -146, 5711, 6806, -4257, -2587, -1876, -2388, 2342, 1648, -3320, -8890, -13836, -10174, -11977, -869, 2867, 4961, 2522, 1108, -5193, -9786, 502, 1295, 6681, 3141, -8682, -5219, -12259, 353, -371, 2513, 2135, -4957, -7178, -9081, -8852, -8111, 55, 3935, 3620, -1271, -10582, -9759, -10302, -9357, -8682, -8566, -9336, -10179, -8830, -5028, -7774, -959, -1615, -2912, -4365, -6766, -2585, 1584, -8996, 2577, -809, -5261, -8687, -4838, -683, 910, 3314]
##PAGE= F1=1058.328546777
##FIRST=     2908.11359968662, 2642.9191468254, 8372
##DATA TABLE= (F2++(Y..Y)), PROFILE
1023H372b539k398J956j826a835j454g40l791E409B082R98c916m359f01j971l440
1007f012k119l666k757J45K285K365N67n73j624k320j532q2J050J747J834P29
991i963o19k064k546l45L343L825L417a523p300K109J068L66j87B865M352J350
975H567K378n117g5o476C047J0979n062C583a063k730j690l70M69b522a97q476
959h673B355N919B059a6374k226J939A621J7726L46j770m435a482l880r345j122
944a5829a802o27O50m833k675M126B832f738G634k80j384B913e390a26m038n921
928a0085o827o99P653c725a73d8l152o385p139m99M195K652N80l69M95K149K913
911d608J581k434m77j597k529k586j584K31J934K549K168K282Q1r273L555B770
$$ y = [8372, -2539, -4937, -2981, -4807, -1835, -3289, -740, -4531, 5409, 2082, 3080, -3916, -8275, -601, -2572, -6012, -8131, -11797, -14554, -14409, -12124, -9759, -9192, -9765, -11389, -13709, -15241, -15323, -14273, -12526, -10692, -9963, -10582, -12646, -15192, -15537, -12194, -8369, -4952, -1523, -8823, -6714, -5646, -5280, -5467, 2865, 7217, 8567, 10945, 5828, -75, -6551, 3047, 14026, 8964, 3583, -1063, -3793, -5483, -5853, -5384, -2522, -197, -8673, 2355, 8274, 2059, -16374, -18600, -16661, 1621, 19347, 19693, 17923, 13488, -1482, -5362, -14707, -15829, -1802, -2429, -1779, -6612, -9287, -5161, 2832, -6738, 7634, 7354, 5970, 2913, -5390, -126, -4164, -10085, -16912, -17611, -9958, -3725, -173, -48, -3200, -9585, -16724, -17223, -13028, -10376, -9796, -10165, -9670, -7521, -4608, -3027, -5461, -5938, -7535, -10064, -12650, -14234, -14003, -12069, -9520, -7352, -5070, -4989, -14262, -10707, 2770]
894C312O02M53o15c513j339J857l839j715K143b762b65E88a1720M076E122O864
878A1986K538j771l660l017k183e722m64R69n676l702K227L989l441k636C495
862D388p44c275p944e487K96i59C668g631E392J36b406I81d183m382j619J719
846h465M059k597L122B967j141a496l897j863K948B322G47P098J989e172K101
831c071r492k961O097M351o918N488n078n061r71L423K249K199M103G97O950J059
815H806B784j175b49m4727l1280b5375A302a573p619J107A959b659o881l317a933
799F633L07D38L94b422p300N71c442B499b294j0799N202K410l763J543l488J867
783i322c837A101N993j513k627J694a502o616c803j815m829e077k399k063K145
$$ y = [3312, 3914, 4367, 3752, -3513, -4852, -2995, -6834, -8549, -6406, -2762, -265, 588, -11720, -7644, 5122, 11986, 14524, 12753, 9093, 6076, 3893, -5722, -6186, -5217, -10893, -14595, -12368, -8379, -11820, -14456, 3495, 4388, 3644, -3275, -11219, -5487, -5191, -959, 3668, -7631, 5392, 5528, -2406, 981, -4183, -8565, -10184, -8465, -4406, -7003, -3881, 2967, 1826, -1496, -5393, -7256, -4308, 2322, 747, 7845, 9834, -5172, -3071, -12563, -15524, -9427, -5076, -11994, -6506, -11584, -16645, -17616, -14193, -11944, -9745, -5642, 797, 7747, 8806, 2784, 1609, -249, -44976, -76256, -25375, 1302, -1573, -9192, -8085, 1959, -2659, -9540, -12857, -1933, 6633, 6940, 438, 832, -2422, -9722, -9151, -3442, 2499, -2294, -13093, -7891, -5481, -9244, -7701, -11189, -9322, -3837, 1101, 7094, 5581, 2954, 4648, -1502, -8118, -3803, -5618, -10447, -5077, -7476, -9539, -7394]
768g394D39L276K456j409N939I6i676M271l314n33n10j453j699j246m41p06k024
751a7331j037M736N062d242J829H10R20N65i295C66b425l067j893r2J044Q78J181
734d374J521Q21M81k242m105r93b016G704J154l691d47D231K043e799K50O90k66
717e125k332l195m63K122J048j700l434m63N184c337a11A281P46a573n431a878
700A036f796K070a726j236l004K899h39B369K699A462f601j480F15a145m474L62
684e257k990B956a634q890c25A2647A659K200J210d460b198J39p99k429k468L00
668g455m81L369k48k745m696o512O746d484A036i774C419A607a2853K198K906
653g749A701o78i062b653o453l28c567j648L02C176b186p336l941d155A534J357
$$ y = [-7394, 439, 3715, 6171, 4762, 10701, 96, -9676, -5405, -8719, -9252, -9762, -11215, -12914, -14160, -14601, -15307, -17331, -18368, -13632, -8570, -4242, -2413, 810, 1730, 2295, -9295, 366, -2425, -5492, -7385, -7477, -6433, -5555, -4374, -2853, -2032, -1551, -3793, -7898, -8891, -2016, 7704, 8858, 5167, -447, 4231, 6274, -5799, -5549, -4859, -5125, -7457, -10652, -11115, -8993, -7945, -9645, -13079, -13542, -8358, -3337, -111, 1281, 2027, -1573, -7004, -1878, 1036, -6796, -4726, -1726, -2962, -5966, -3067, -839, 2369, 5068, 1462, -6601, -8081, 615, -1145, -5619, -5257, -8247, 2956, -1634, -10524, -325, 12647, 1659, 3859, 5069, -4460, -2198, -2059, -2858, -5287, -7755, -7455, -7936, -4567, -4815, -7560, -12256, -18768, -12022, -4484, 1036, -9774, 3419, 1607, -12853, -10655, -7749, 1701, 1023, -9062, -2653, -9106, -9434, -3567, -5215, -4913, 3176, -2186, -9522, -13463, -4155, 1534, 2891]
637B891M739J028h836c591l426n966J089c063A282c3512p0485N1619G484L731
623A1215K041n127f294b549o282j319p251O568M380k368K986M37j51a910o319
608h229I73e070A278d126h67q901j579j285c565D793k09B083a830j0479e729k070
592g799l148m297j043N000M806L062j51p997o15n562J184O837K051c597E532N242
576A0774B251b883F612J327d782R20o024J105l224J878C15M500A024a491m435
561e926l072K280b842D403J199N762D962c623c93o211m068b668A776a255l075
546d330n921J435b161n761J106J728a611p376p843M5N209K909J842J28c072a094
529E41a130n580D10f817m650p31K436D56c782a576n308J383k004N77J939m39J137
$$ y = [2891, 7630, 8658, -8836, -3591, -7017, -12983, -11894, -3063, 1282, -33512, -103997, -52378, 7484, 11215, 13256, 8129, -6294, -2549, -8831, -10150, -17401, -10833, -6453, -8821, -5835, -5398, -5549, -1910, -8229, 973, -5070, 1278, -4126, -867, -9768, -11347, -12632, -3565, 4793, 4584, 2083, -1830, -12309, -5729, -7799, -10947, -15244, -16287, -11287, -6481, -3419, -3570, -11567, -12182, -17744, -16560, -9723, -7672, -3597, 5532, 10774, 2251, -2883, 6612, 7939, -4782, -3862, -9886, -8781, -12005, -10127, 315, 4815, 1024, -1491, -5926, -8998, -6718, -2842, 4403, 5602, 11364, 4962, -3623, -393, -6604, -10672, -2668, 1776, -1255, -4330, -10251, -8816, -2161, -7922, -6816, -5088, -1611, -8987, -16830, -16785, -11576, -8667, -6825, -6697, -3072, -1094, 541, -1130, -6710, 410, -6817, -11467, -12198, -9762, 456, -3782, -1576, -6884, -5501, -7505, -6928, -4989, -5428, -4291]
512d291B1259R369D166a0399E858E99i340l339M505K208j921j763c246l00N55
497b991f97k940l722K776k021m687p337O684e453g54A069g425j523c739k920b593
480a74n095G014J154A358P421P32e981a391l222P7R83k84k400m298m327N47K952
463a1363J925l15k258k750j983j057r85j601J592M886f937H76N89f52j400G055
446A545h869b961B259c629o260j354e410B090O206k634A058L940b375D58a49p800
430g949n014L375c373A025J596m59M77J661J966r04B274c847F714M255e21B214
413B472d17A315N877b484j427g1l033A841b734p076o743M216b579j62J158C454
396b427q985c095B552c727j822B55f551a564A0550Q622q142a424B646c871j47
$$ y = [-4291, 21259, 30628, 4166, -10399, 5858, 599, -9340, -12679, -8174, -5966, -7887, -9650, -3246, -3546, -2991, -697, -3637, -7359, -4583, -6604, -11291, -18628, -11944, -5453, -754, 1069, -7425, -8948, -3739, -6659, -2593, -174, -5269, 7014, 8168, 1358, 8779, 9511, -5981, -1391, -4613, -4536, -3553, -3837, -6237, -10535, -14862, -14315, -11363, -9438, -9753, -12011, -14761, -16744, -17801, -18786, -20387, -18795, -13909, -6937, 876, 1465, -652, -2052, 7055, 1545, -8869, -2961, 2259, -3629, -9889, -11243, -5410, 2090, 8296, 5662, 1058, 4998, -2375, 458, -149, -7949, -12963, -9588, -3373, 1025, 2621, 2162, 2639, 4300, 6266, 5362, 2274, -3847, 6714, 10969, -521, 2214, 2472, -417, 1315, 7192, -2484, -3911, -71, -3104, 1841, -2734, -9810, -16553, -12337, -2579, -2741, -1583, 3454, -2427, -11412, -3095, 2552, -3727, -5549, 255, -6551, -1564, 10550, 19172, 11030, -1424, 2646, -3871, -4018]
381d018b62B154j68L590h070n089e848m482M274J34k685M25j160L259j262A341
364E556J194R170p521K072D003A388h699j0896K781Q010L696A26Q70c72l005m247
348g624n759q413J739Q401d362F65J387i01n168p470p851K578P255d978A267e269
331a521j271D166a87n564m943l438j973J146M525d193A902N961M231K274n8C853
314E347A660a690p952q847A8711K7881Q7549R7732J22829O5755n6958j50364H6478
300G1562k0435A0599f211C245n17J0553l861D378g599j616m195J158M267K350
286e635p008d672N44K99l35j599k149k120n23O51Q95J651J008R85Q56a583H505
268g27K00B606g365m275j947l295k225m11K152L076L393K655K293P15k19l1l96
$$ y = [-4018, -262, 2154, 1986, 5576, -8070, -13159, -5848, -10330, -6056, -5922, -8607, -8182, -9342, -6083, -7345, 1341, 5556, 6750, 15920, 8399, 10471, 4003, 1388, -8699, -19595, -16814, -8804, -5108, 126, 996, -372, -3377, -7624, -13383, -21796, -20057, -11656, -4362, 665, 2052, -901, -6069, -13539, -21390, -18812, -11557, -4978, 1267, -5269, -1521, -2792, 4166, -187, -5751, -10694, -14132, -16105, -14959, -10434, -4193, 1902, 7863, 12094, 14368, 14310, 3853, 5347, 1660, -1690, -9642, -18489, 18711, 46592, 134141, 231873, 354702, 420457, 363499, 213135, 86478, 71562, 51127, 10599, -6211, 3245, 2728, 13281, 9420, 4378, -7599, -9215, -13410, -12252, -7985, -5635, -12643, -4672, -4128, -3829, -4164, -5763, -7912, -10032, -10555, -9904, -9009, -7358, -6350, -5365, -4509, -1583, 8505, -727, -527, 2606, -7365, -11640, -13587, -16882, -19107, -19518, -17366, -14290, -10897, -8242, -5949, -5234, -5453, -5484, -5880]
251e880j15P1N88M20K053K40p48j298l19r41k720a628q16n498a709B540J1032
234A3572b408C742O247k608A938a0076J666k244P03M479A198N348e738Q80a507
218A863e050H867B78a0694c251B027Q73b712l046O48j4M99R00P57k562a529l086
201d615C034J218a126k060k887L59b776r507b041D48O671o25j242c396J96j79
185c379r23q247A097f582i7C730M038g272b722l978b052D438a816m037j498l706
169a1057q08b191l034A315b014q117C637j142d577J680m338l188R4L784a921m648
153f569n651b586H791m063h996m45K252O96I006K324a03B892K147O8E36K130Q54
136C520b265o912F398j644i114D930D36e651E092M974C732a771m374l334j483
$$ y = [-5880, -5995, -5924, -5336, -4916, -2863, -2623, -3371, -4669, -4988, -5929, -8649, -1628, -2444, -7942, -1709, 2540, 13572, -2408, 3742, 9989, 7381, 1938, -10076, -8410, -10654, -9951, -5472, 1198, 6546, -5738, -4858, -1507, 1863, -5050, 8867, 278, -10694, -3251, 2027, 2900, -2712, -5758, -5110, -5124, -4625, -3725, -2968, -5530, -1529, -4615, 3034, 4252, -1126, -3186, -6073, -5714, -2776, -12283, -2041, 448, 7119, 6494, 5252, -3396, -3200, -3379, -4302, -12549, 1097, -6582, -97, 3730, 7768, -7272, -2722, -6700, -2052, 4438, -1816, -5853, -7351, -11057, -11865, -2191, -5225, 1315, -2014, -10131, 3637, 2495, -4577, -2897, -7235, -10423, -10329, -6545, -1921, -6569, -12220, -2586, 8791, 4728, -8996, -9441, -7189, -6493, 9006, 11330, -103, 2892, 5039, 5107, 536, 2666, 3520, -2265, -9177, 6398, 4754, -9114, 4930, 436, -5651, 5092, 10066, 3732, -1771, -6145, -9479, -10962]
121a0962j193N19K089L248K262J43k398m837n686n76M456M345R43K147q55k059
105h414l324k679m61J115J308J177J411K680L403J759l530B051d957m11k28k939
89h535l497L79J427J288K222r769a553A227g7p611h36l085l730k514q29P98K386
72g810k428j241d998C155P15M995p96g48n26k454j128k073l723l382j104m81j944
55a7563l415N424P655a395B286L79b975q971n084L038e342A465f604a841m436
40f277a560j915D483N55D9f440k257K555l292c895C883J1047l891a1504C792c971
23i749j064M52j049j096L230L685j854J296j266k48I58O796r90e91j0344c240
6c726R19F00O339B27n4J1157
$$ y = [-10962, -12155, -11636, -9547, -6299, -4037, -3894, -6292, -11129, -16815, -17391, -12935, -8590, -7647, -5500, -6355, -8414, -11738, -14417, -14878, -13763, -12455, -11278, -9867, -7187, -3784, -2025, -5555, 2051, -4957, -5368, -5596, -8535, -12032, -11653, -10226, -8938, -6716, -16485, -1553, 1227, -77, -7688, -836, -3921, -7651, -10165, -10994, -10196, -7810, -10238, -11479, -4998, 3155, 3870, 8865, 8069, -748, -1274, -3728, -4856, -6929, -10652, -14034, -15138, -15619, -17563, -20978, -15554, -7899, -1395, 2286, 2665, -2975, -11946, -17030, -13992, -5342, 1465, -6604, -1841, -6277, -1560, -3475, 4483, 5038, 49, -6440, -8697, -6142, -9434, -3895, 3883, 14930, 11039, -11504, 3792, -3971, -9749, -10813, -10361, -11410, -12506, -9276, -5591, -7445, -6149, -7415, -7663, 958, 7754, 6764, -591, -10935, -3240, -3726, -2807, 600, 6939, 227, 173, 11330]
0A1330
$$ y = [11330]
##PAGE= F1=1055.745048099
##FIRST=     2908.11359968662, 2642.9191468254, 9186
##DATA TABLE= (F2++(Y..Y)), PROFILE
1023I186I37d687P8K84l85k52B899b152I734C013L545B17g586L236p831d292j528
1006e820j670o347m782J987L898Q83j736k813J31M083L985l039e474Q33J255J86
990c200m345K10o869o772N777e587b068n283L117a41m172M99A795L610O37j110
974D932i27k35k045b32q330q145n390Q96M035M352M926b374C856K64f442A054
957A0196A073a1757k937k593C478J8870J699n399o856B908F53h965n551J079M435
942i002M434j207j967K141a34n79A0259D777g1m01j102E397a041p971b663E941
925A0921K555J199j169C708e850j833j0499l268P130M617J016k267l195K70L701
910a0178M113k136c261R37k179l734m836m616j576L393N829c256o653M66a319
$$ y = [9186, 937, -4687, -4609, -4325, -4710, -4962, 2899, -2152, 9734, 3013, 6558, 217, -7586, -4350, -12181, -4292, -5820, -7490, -13837, -18619, -16632, -12734, -11851, -13587, -16400, -16269, -12186, -8201, -11240, -5474, -4641, -3386, -3200, -7545, -7335, -14204, -20976, -15199, -5587, -2068, -7351, -4234, -141, -4313, -3814, 1795, 5405, 6042, 4932, -927, -1162, -3207, -232, -8562, -16707, -22097, -21201, -17166, -12814, -7888, -2374, 3856, 4120, -6442, 1054, 10196, 1073, -11757, -14694, -17287, 3478, 22348, 24047, 18648, 11792, 2908, 653, -8965, -14516, -13437, -9002, -4568, -5775, -7742, -5601, -134, -713, 10259, 4777, -71, -472, -1574, 5397, -1041, -9012, -2663, 5941, 10921, 13476, 14675, 13506, 3708, -5850, -7683, -18182, -21450, -14320, -9703, -8687, -10954, -14149, -13879, -10178, -6065, -8201, -3261, -2324, -4503, -8237, -13073, -17689, -19265, -15872, -10043, -3256, -9909, -9443, -1319]
894B188R42Q28K536a52m043G161K621L454E985k165J748c338n532L577C428J23
878C551q62b45n004n865l190J467K478P76j389m10L360m044d262o723I539P65
862A0304D612f485m591e143k504A113M492e938e05m771k413K99J01k455m177k562
846a6483N139d438A220K891j71F64c579m032L574F84P86K550A050c733k168K509
830c392a224j945B640a0040G84c191j764m47j191k286j447L120A02Q084L743D063
813F11f522n1304j7489b9721b945D742e383k801K88n012L170j035a344G631k76
798G355a043q828k761M191L522O78r00j936n727J462j609J633M090l422L435c70
781B055R424k353C88M280d461p380c314m690K840J019j782o570c982B800M83M49
$$ y = [2188, 3130, 3958, 6494, -152, -4195, 7161, 9782, 13236, 5985, 3820, 5568, -3338, -8870, -5293, 3428, 3551, 2689, -245, -5249, -11114, -14304, -12837, -10359, -9583, -10972, -11382, -8022, -12066, -4262, -10985, 9539, 10304, 4612, -6485, -11076, -5143, -7647, 1113, 5605, -5938, -505, -5276, -7689, -7390, -7289, -9744, -13921, -16483, -11344, -4438, 1220, 4111, 3940, 664, -3579, -7611, -4037, 684, 1470, 4020, 1050, -3733, -5901, -3392, -1224, -3169, 2640, -10040, 784, -3191, -4955, -5402, -6593, -8879, -10326, -7206, 102, 8186, 11929, 4063, 611, -6522, -57826, -75315, -29721, -2945, 4742, -5383, -8184, -7896, -12908, -9738, -10773, -1344, 7631, 7355, -1043, -9871, -12632, -8441, -4919, -4241, -5141, -7077, -12804, -11342, -12951, -11318, -7228, -10650, -7215, -370, 2055, 11479, 9126, 388, 4668, -4461, -11841, -3314, -8004, -5164, -4145, -5927, -12497, -3982, 2800, 3283, 3732]
765C732J15P317D44a1899J483a150m250L23J198l27l732m569n889L324O093k207
749a1186a461L56j563l686n470o402J407h251a385p550B182c44m23D871J090a819
732d529A690p90M29h820B616K314K991j775A367N766L067b9j860B338C66h997
715e797J761l516l976l800k252K7J272J859J856J095o5j995k580q7K721J498j178
698a3157l854L739M140J525b213B321m32a424l478o583E22K84d665a722r041D971
681F89i662e25A1734A5a945r081M756a695A195b622j546a090l934K353a020F204
664h31r854o870d898C408L33g390I149D038h581o243k936M289K779J655c871B733
647c082D038b849j160C037K035g94j3706H514K337B786J2424p59b103k473J550
$$ y = [3732, 3847, 11164, 444, -11899, -10416, -1150, -5400, -5077, -3879, -4206, -7938, -12507, -18396, -15072, -8979, -11186, -1461, -1105, -2668, -6354, -11824, -18226, -16819, -8251, -1385, -8935, 2182, -344, -767, 4871, 5961, -1819, -4529, 1690, 900, 1329, -8820, 2616, 4930, 7921, 6146, 1367, 7133, 10200, -29, -1889, 2338, 366, -8997, -5797, -4036, -7552, -11528, -15328, -17580, -17553, -16281, -14422, -12566, -11471, -11536, -13531, -16111, -16198, -13477, -11979, -13157, -17011, -13272, -9132, -7607, -2213, 2321, 1889, -1424, -4902, -11485, 522, 806, -4665, -1722, -10763, 4971, 689, -9662, -525, 11734, 15, -1945, -11026, -6270, -1695, 1195, -2622, -4168, -1090, -5024, -2671, -1020, 6204, -831, -10685, -17555, -4898, 3408, 3741, -7390, 9149, 4038, -8581, -14824, -17760, -13471, -10692, -9037, -3871, 2733, -3082, 4038, -2849, -4009, 3037, 5072, -794, -14500, 8514, 10851, 2786, 15210, 14451, -2103, -4576, -3026]
632c026A437K465J17A508d6777m7037c2943f488P96b076A063e408C66h807J29
617h678K929n431c410k801L20o595o434Q023J124b007j447a12o884e20I65c91
600a0467L325n008n002J635L785J482J586q51k140k817k911j191J167K458K599
585a2350L712j599H42K459a462q556L180C427O538A160b386A342i82k701m603
570h286l508J971k609d028a008B558j017R55c804k996n98j421a308D326L670B465
553b571O01j858q687K37L871J055j550l584l787N95L053L373J322K387l48j354
537g245k141l260m043m224M068O139e235a025Fg707a576p073r269h678d97b34
520f569n23c023J005l758r680e749n42J768B3164O959I69a2298F731f667j1493
$$ y = [-3026, 1437, 3902, 4019, 1508, -46777, -93814, -32943, -6488, -5692, -2076, 1063, -5408, 366, -8807, -8678, -5749, -11180, -3410, -6211, -5891, -12486, -18920, -10897, -9773, -2007, -3454, -112, -6996, -520, 965, -391, -10467, -7142, -12150, -17152, -15517, -11732, -10250, -8664, -9515, -11655, -14472, -17383, -18574, -17407, -14949, -12350, -8638, -10237, 842, 3301, -1462, -10018, -6838, 3427, 9965, 1160, -2386, 1342, -982, -3683, -8286, -11794, -9823, -12432, -4028, -1008, 2558, 1541, 2496, -3804, -6800, -7398, -8819, -1308, 4326, 7996, 2465, -2571, -1970, -3828, -12515, -12278, -8407, -7352, -8902, -12486, -16273, -15678, -12625, -9252, -7930, -5543, -5891, -7245, -9386, -12646, -16689, -20913, -16845, -10706, -5235, -1025, 6, -7707, -1576, -8649, -17918, -8678, -497, -234, -6569, -7092, -3023, -2018, -5776, -15456, -5749, -6291, -4523, 23164, 30123, 969, -12298, 6731, -6667, -18160]
505a8160h294b433F15N209A487c039k520k397a389j125n311J897p56m590Q25d707
488A501M152p59f305K562j775k910Q35L231m269E87N090j734N797o50h170C321
471e50l918l766l397l302k432K180M032L322J928j86j844j638k3Q81P33o1M93
454g548J980m231B240G22b884a045E749d888k171i66I5h594q406f269H358L097
438A1455J333C140K159O814I11N277a493q148m965k388K500O433i12E340N739
423A1079M154K005l350E154c329F774K254e413b504A940J663H95L766a0486m179
408a4665a600k902B443e348L20j756l371a226k719a224B479b574p708m535B432
392A291a1700c198o260c803A4392J0126A1544D635e467m076A680R358e13A307
$$ y = [-18160, -8294, -2433, 615, 5824, 1487, -3039, -5559, -7956, -1389, -2514, -7825, -5928, -6684, -11274, -10449, -4707, 1501, 5653, 4894, -6305, -3743, -5518, -8428, -7593, -4362, -8631, 587, 5677, 3943, 9740, 9090, -8170, 3321, -550, -4468, -8234, -11631, -14933, -17365, -15185, -11153, -7831, -5903, -6089, -7933, -9571, -9594, -8713, -7980, -8041, -7548, -5568, -9799, 2240, 722, -2884, -1045, 5749, -4888, -7059, -966, 95, -8594, -17000, -6269, 8358, 11455, 12788, 3140, 5299, 12113, 911, 6188, -1493, -9641, -14606, -16994, -14494, -8061, -912, 5340, 11079, 15233, 17238, 13888, 5154, -3329, 6774, 9028, -5413, -2504, 1940, 3603, 895, 4661, -10486, -14665, -1600, -4502, 2443, -5348, -5028, -6784, -10155, -1226, -3945, -1224, 2479, -2574, -10282, -14817, 2432, 1291, -11700, -3198, -9458, -3803, 14392, 24518, 11544, 4635, -5467, -9543, 1680, 11038, -513, 1307]
377H089i231k201J152K856o37q24j247M21J728K541m056c70B554M436M518m984
361F524M444n137C37b216p213j0588M341f129C396P026M722K000j270m687A840
345a0150j2112P556c810C546G88M465A119d812l608R88h79A504f187A100d813
329A201J980i89k913O24A090L109O825Q362J223L835E405M851k43j644a0586B618
312g943J196D4895A1651J04120J16102L230517J616687J437385j060538k281779
302C174145A038945A66205q638o7564B0627J5133p092C977m72a0750L783l061
290a0028b763E22g4o951n024n903m75O287N248e26C406b82A188b574m925k822
274a0321j396M44L568L315A558c573C658N580b679o584g35p534K736j590q59j244
$$ y = [8089, -9231, -11432, -10280, -7424, -8061, -8885, -10132, -9711, -7983, -5442, -9498, -370, 2554, 6990, 11508, 6524, 10968, 5831, 337, -2216, -9429, -20017, -15676, -6129, 3396, 10422, 15144, 17144, 15874, 11187, 1840, -10150, -22262, -14706, -3810, 3546, 788, 5253, 1119, -4812, -8420, -7432, -879, 1504, -6187, 1100, -4813, 1201, 3181, -989, -3902, -3278, 1090, 4199, 11024, 19386, 20609, 24444, 5405, 10256, 10013, 8369, -10586, 2618, -7943, -6747, 44895, 11651, 115771, 231873, 3462390, 5079077, 6516462, 5455924, 3174145, 1038945, 166205, 157567, 90003, 20627, 35760, 28668, 3977, 3505, -10750, -6967, -10028, -2763, 522, -74, -7025, -12049, -17952, -18427, -12140, -6892, -526, 3406, -282, 1188, -2574, -7499, -10321, -11717, -11273, -7705, -4390, 1558, -3573, 3658, 9238, -2679, -9263, -735, -8269, -5533, -7123, -7982, -9226]
258i226l12J651J849K33A674K513O68n71j964b259k232J797p67k32j14l633K067
241e373l134c337A811c111n550E62J0006f007E677b933r035J188O15B697Q52f693
224f080J065D107e190M85C851L340G95R893B478h085K4m361K29L870L452j69J732
207c308k297k158l161k023K23K255K375J234l54j374j322j231m40K07p66j145
191a3285R62f031B683f715A772D43g592J603o2j148d4G745j21a3367d629P95A597
173a090P8l776l904K951o675b612q76e1m940r63j798p384m129L576O261c828D06
155C179h96k710m428J068K365r691R6M437K920c154B348a161j884N26A70L819
139C989a553E805n23d03r975I653N71f846D383b766N73B729I81a837j239J68q802
$$ y = [-9226, -9538, -7887, -6038, -5805, 1674, 4187, 4855, 4284, 2320, -2259, -4491, -2694, -3461, -3693, -3807, -7440, -5373, -8507, -3337, 1811, -3111, -8661, 562, 10568, -6007, 5677, -2933, -11968, -10780, -10165, 2697, 3549, -6693, -6080, -5015, 4107, -5190, -4705, 3851, 7191, 795, 10688, 2478, -8085, -8061, -12422, -12193, -8323, -4871, -5040, -3308, -5605, -7763, -10924, -12947, -12724, -10469, -8094, -6860, -7214, -8588, -9910, -11141, -11581, -11374, -12140, -13285, -12323, -6031, 2683, -6715, 1772, 443, -7592, -5989, -6051, -7199, -44, 7745, 7624, -13367, -4629, -3834, 1597, -1090, -1012, -4788, -8692, -5741, -12416, -2612, -3488, -51, -4991, -5954, -7752, -15136, -19265, -15689, -9428, -3828, 406, 3179, -896, -3606, -8034, -6966, -4601, -14292, -14196, -9759, -6839, -3154, 2348, -1161, -3045, -2519, 170, 3989, -1553, 5805, 5282, -403, -10378, 9653, 10224, -6846, 4383, -2766, -2193, 2729, 981, -1837, -3076, -2908, -11710]
122a1710b109o193k150l00d679J636k94p81k072l645l870k650L53K352L187L142
106g321L073J385c20n341H43F7C3b478A119L141b612m979A205e559L51J925j420
89d703A836R10j29J11q19h007J892o045n735n112J436M694L305K426n1m103o765
72b2065Q521j315i67H075K87M99C513g230p549j104L035N241a799B981b221e58
55B448g879L118J743K96f28B078b84j3549f595o508R98d355J815D128f06M2k814
38c378C456j94b960p645N130b619m556J088D625J1132n048a1746d112p501o301
23a7914k743L373O082d543B021a1255e400o019M479n272C145O998B478f470q066
8a4536m774J527N964d629B547a87D43J1135
$$ y = [-11710, -2109, -8302, -10452, -10752, -4679, -3043, -3337, -4118, -6190, -9835, -13705, -16355, -16002, -13650, -10463, -7321, -4248, -2863, -320, -5661, 843, 67, 33, -2478, 1119, 4260, -2612, -7591, 1205, -5559, -5208, -3283, -4703, 1836, 2746, 2617, 2728, 1909, -8007, -6115, -12160, -17895, -23007, -21571, -16877, -13572, -11146, -11197, -15300, -22065, -13544, -14859, -967, 8075, 8362, 8861, 3513, -7230, -14779, -15883, -12848, -7607, -1799, 2981, -2221, -558, 2448, -7879, -4761, -3018, -2722, -628, 2078, -284, -13833, -6595, -13103, -12105, -4355, -2540, 4128, -606, -564, -3378, 3456, 3262, -2960, -10605, -5475, -2619, -7175, -6087, 4625, 15757, 10709, -11746, -4112, -11613, -17914, -20657, -17284, -11202, -4543, 2021, -11255, -5400, -11419, -6940, -12212, 3145, 10143, 2478, -6470, -14536, -19310, -17783, -11819, -4629, 2547, -187, 443, 11578]
0A1578
$$ y = [11578]
##PAGE= F1=1053.161549422
##FIRST=     2908.11359968662, 2642.9191468254, 3221
##DATA TABLE= (F2++(Y..Y)), PROFILE
1023C221m19c387l483b053m943K758F127e65C969A417L700e07n002n098L343J620
1007e644n12O45q45p03r5J013Q12J037Q49L08M13j248o161b840j886l996n805
990a4527p161n414P898Q861a902q5p39j867a026C436d927J016g49m848m753J617
974h733m20c727J860n18j077p59K47J116c01o146m93K840D283K703b858H97O867
957G764a879n151k805l019B504Q388j619H44a2253j1970O312Q945c793h90I64
941A074d446m208q221n586K470L239J551L053d931I83O374c930o558M344C192
925A0368M144L758J095D365c912k603n164j1253O52Q414O637n24I17B76c510J506
909b004n792c089D614i01o993q345k899N31p98j154K016N688N741c436l63n80
$$ y = [3221, 2802, -3387, -6870, -2053, -6996, -4238, 6127, -565, 3969, 1417, 5117, -507, -5509, -10607, -7264, -5644, -6156, -5511, -6356, -7059, -7154, -6141, -5329, -4292, -3443, -3135, -2722, -3970, -10131, -2840, -4726, -8722, -14527, -21688, -27102, -19204, -10343, -1902, -1987, -2726, -4593, -1026, 3436, -4927, -3911, -749, -5597, -10350, -8733, -9153, -3727, -1867, -2385, -3462, -4221, -3974, -2858, -301, -6447, -6940, -4100, 4283, 6986, -2858, 897, 7764, -1879, -7030, -9835, -12854, 2504, 10892, 9273, 844, -12253, -24223, -17911, -8966, -3793, -890, 964, 1074, -4446, -8654, -16875, -22461, -19991, -16752, -15201, -12148, -4931, 983, 7357, -3930, -10488, -6144, 3192, 10368, 14512, 18270, 19365, 4365, -3912, -6515, -11679, -22932, -22280, -13866, -7229, -7753, 917, 276, -3510, -2004, -7796, -3089, 4614, -901, -7894, -16239, -19138, -18607, -19405, -20559, -18543, -12855, -7114, -3436, -3799, -4379]
893d379l737l715L25e722B968R188K547F260k622j83g039K268J795J377C067K420
877E487N04B93b105p073q363o513M284N426K846M08k502K339Q50K374b881D175
860g563j007a534p396B374K234b915k238J23e55G076L228b518g36m701b554i8
843a2990j0560L727N791L089P51m20R32K533b236D896c408j15H688a806k971C40
826f562B241c993j647r99l813o841q507K534O441M125J458k098m381j957m5688
811f5366k090b4185f344B55b136n012J992j171l224N58b058c79B297L254J392
796F943A907K767J863k109i46n675m154l145k489j436L363M872c803A611m55J1306
780A2462m28eB532Q212j528f561k825a31k221k295k0795h578I03J772A063J655
$$ y = [-4379, -8116, -11831, -11506, -5722, 2968, 12156, 14703, 6260, 3638, 3455, -7039, -4771, -2976, -1599, 3067, 5487, 5991, 293, -2105, -9178, -17541, -24054, -19770, -14344, -11498, -11090, -13592, -11253, -10403, -8029, -2881, 4175, -7563, -8570, -1534, -8930, 2374, 4608, -2915, -5153, -5030, -555, 7076, 10304, -2518, -736, -5437, -2554, -98, -12990, -23550, -19823, -14032, -10943, -10192, -10612, -9680, -7147, -2236, 4896, -3408, -3523, 8688, -1806, -4777, 340, -6562, 2241, -3993, -5640, -6639, -10452, -17293, -25800, -23266, -16825, -12700, -11242, -13340, -17721, -19678, -65366, -67456, -24185, -6344, 255, -2136, -7148, -5156, -6327, -9551, -8993, -2058, -379, 2297, 5551, 6943, 1907, 4674, 6537, 4428, -946, -6621, -10775, -13920, -16409, -17845, -14482, -9610, -3803, 1611, 1156, 12462, 12034, -5, 2532, 10744, 9216, -6561, -9386, -131, -2352, -4647, -25442, -8578, 903, 2675, 1063, 2718]
764B718a152q158n114k252L37K132K883K848K734k193L003o388M095J778p951
749a3398f57k562h40B3589l570r210a3058J796N590j253A0353C815A103O815k521
734E397f455q48G60R60k52a0225F419A128h364l823J685b229A1210n272b711C183
717b273r898a642F041a771n148R00J307m83j723k372k939j724K275M520c069j571
701d640L90o083q022l749O196M466P75j987p18M302c939J907r727J258j0712J577
685a9636h484m070A962B12i169L665b181q31F350O023c871a929D169c201l895
670g096c538j567B168i429A5801p029a629j0129k385j0753O107M267O15K292c893
654f056a396G920p85d788F515k660b639C428a431k289f43n407P67q520H13Q23
$$ y = [2718, -1152, -9310, -14424, -16676, -16339, -14207, -11324, -8476, -5742, -7935, -4932, -11320, -7225, -5447, -13398, -657, -3219, -840, 23589, 20019, 10809, -13058, -11262, -5672, -6925, 10353, 3815, 1103, 7918, 5397, -6455, -7303, 760, 1720, 1468, -10225, 6419, 1128, -8364, -12187, -10502, -2229, 11210, 5938, -2711, 3183, -2273, -12171, -1642, 6041, -1771, -6919, -6019, -4712, -5195, -6918, -9290, -12229, -13953, -11678, -7158, -3069, -4640, -4250, -10333, -18355, -22104, -15908, -11442, -10667, -12654, -13372, -9070, -3939, -2032, -11759, -10501, -21213, -19636, -8484, -12554, 1962, 212, -9169, -5504, -2181, -3012, 6350, 12373, -3871, -1929, 4169, -3201, -7096, -3538, -5105, 2168, -9429, 15801, 8772, -1629, -11758, -14143, -24896, -18789, -14522, -13907, -11615, -3893, -6056, -1396, 7920, 7135, -4788, 6515, 3855, -2639, 3428, -1431, -3720, -643, -6050, -5283, -13803, 813, 1636]
638A636o01L089L587C555b975D70J4198l739A604J943f1990j9560b0630C897a186
622d784Q01a754B444d235l789L523p204b424j525j1173o445R326e350n894N592
607e652o779q213J999i162b34C856h938a508H020N778k635e029k240b29k342O18
591a953k441A389c039i37A7787B266h0o952B643J404a478q489k20L893k705k301
575a1300J817d264F44O98E18f968k895O78O69J102J592a358E386a970l01C087
558D563K180A435P04h077n446M086b481d25k607C429c114E168j487a553k566j0674
542a4793p804K153L573K54k185k958j29K721K705J633P94j045k560l078l536M886
526a9369O771O072a549m749c107n096j005b549m771n095m244k826o08J775L308
$$ y = [1636, 1035, 4124, 7711, 3555, -2975, 470, 14668, 10929, 1604, 3547, -61990, -81550, -20630, 3897, -1186, -4784, -3983, -1754, 2444, -4235, -8024, -4501, -11705, -2424, -3949, -15122, -21567, -12241, -5350, -11244, -5652, -12431, -20644, -18645, -9162, -234, 3856, -8938, -1508, 8020, 13798, 11163, -5029, -7269, -229, -2571, -1953, -4394, 1389, -3039, -937, 17787, 2266, -80, -7032, 2643, 4047, -1478, -9967, -10187, -6294, -8999, -11300, -9483, -4264, 644, 1342, 518, -6968, -9863, -9185, -8516, -7414, -5822, -1358, 5386, -1970, -2271, 3087, 4563, 6743, 1435, 2139, -8077, -13523, -9437, -2481, -425, -3032, 3429, -3114, 5168, 3681, -1553, -4119, -14793, -22597, -20444, -16871, -16617, -18802, -21760, -21889, -19168, -16463, -14830, -14036, -15081, -17641, -20719, -24255, -19369, -12598, -6526, -1549, -6298, -3107, -8203, -9208, -2549, -7320, -12415, -16659, -19485, -20093, -18318, -15010]
511a5010L644J776l186K560O66L7M713o83j76i22j258H45f906l399b375L27n713
494g761Q35L146m171p874l610O074O331c016j210K99m598o170m219L491M206K077
478i140k05n56Q50J961k660L292k613l559k987j701j354q83M28J32l111J878h224
460d017j380C192Q894B613e66F60O117a1186a066D02b622B213J228G86K729j559
444A956L399d749n721D50@D553L103l637N925O311D749P747j150L2687l974q910
428C1149j1295q700j833K789K692j242n358b648j4216P152F692j797i828K754
414g074B268M608A986n82a254k437h39n331c001p015K192L34k236l413m491m38
398a8068L753N525J629L533C885K525i273L257k301K264A2700a990j5153n417
$$ y = [-15010, -11366, -9590, -12776, -10216, -9550, -9513, -4800, -5483, -5659, -922, -2180, 845, -6906, -10305, -2375, -2048, -7761, -6926, -3780, -7951, -15825, -19435, -13361, -7030, -3016, -4226, -3927, -8525, -14695, -18914, -15423, -11217, -9140, -9345, -9901, -9051, -7090, -9750, -6458, -9071, -12630, -15617, -17318, -18672, -19555, -19127, -18995, -22106, -20228, -8224, -4017, -5397, 3192, 12086, 2613, -566, 660, 6777, -11186, -1066, 402, -2622, 2213, 3441, 786, 3515, 1956, 5355, -4749, -10470, 450, 0, 4553, 7656, 4019, 9944, 16255, 4749, 12496, 11346, 44033, 40059, 31149, 19854, 11154, 9321, 12110, 14802, 13560, 8202, -2648, -16864, -9712, 6692, 4895, -9828, -7074, 2268, 6876, 1986, 1404, -1254, -3691, -839, -6170, -3001, -10016, -7824, -7490, -9726, -13139, -17630, -18068, -14315, -8790, -7161, -3628, 3885, 6410, -9273, -6016, -8317, -6053, 12700, -1990, -17143, -22560]
384b2560a0607a748C696N11b359o56k322l620J532m774b818C879b214a33j339
369a472j559q752j3078J1673b04I750L539D711P137m014a72l283k202p940o791
354b0388N560c216G564P725O068M276J65F364J6607p856D995d347n793Q17M394
339d929b460l065j239b302d9D30d051H03f130a133p137n377O697b029j2544L104
323a1469A5714L3711A9131J3554a346A5099J3379p740K0307c170A03657l2350
311G1307N3520E5129J74938J24635M724375O162038P238786M495732j312684o580476
301A5082473C093828A193624D40952k16745k4279G1551l0830e96B9308a226r157
290a0383b240j7048n244i170K294n866f115C868a491j810k075q040l003K561k017
$$ y = [-22560, -10607, -1748, 3696, 4207, -2359, -3015, -5337, -8957, -7425, -12199, -2818, 3879, -2214, -133, -1472, -3031, -11783, -24861, -13188, -204, 9750, 13289, 4711, 11848, 7834, -172, -3455, -5657, -13597, -20388, -14828, -3216, 7564, 15289, 21357, 25633, 25798, 6364, 22971, 15115, 4995, -4347, -10140, -9323, -4929, -2460, -5525, -6764, -2302, -49, 430, -4051, 803, -6130, -1133, -8270, -13647, -6950, -2029, -14573, -11469, 15714, 49425, 19131, 32685, -1346, 15099, 28478, 20738, 41045, -3170, 103657, 71307, 124827, 55129, 230067, 354702, 5079077, 11241115, 18479901, 22975633, 21662949, 15082473, 3093828, 1193624, 440952, 224207, 199928, 71551, 40721, -596, 29308, -1226, -10383, -2240, -19288, -24532, -9170, -6876, -12742, -6115, 3868, -1491, -3301, -5376, -13416, -16419, -13858, -15875]
275a5875j968M33J704M565d211A585e244D360j287a028n709j243m142l155Q68
260a4409N781C99R86d49o164j942e45E743a598m174P19J687n19C650P567j078
244A0139f8p784J806r71Q51E497P21a3579b501d93o378A559N19K479A649g315
227A1946j463d013o79G606A850e212b327A1843m487A544e229q417o859M019f627
211b19m395J758l270J664o785d182n568j6527i144i5C287J422j706M057j124b376
194A413h031J344K817J343p065p556o537M67L662L462M129M360L102J370k685
179e818o278o031L341f107E38K310a4o129n821m64Q15j1n626m685Q481b697I931
161I049e043D443b564l083a261A752a870N58k312p188j541M059m458M635m932
$$ y = [-15875, -17843, -17410, -15706, -11141, -4211, 1585, -5244, 4360, 3073, -1028, -6737, -7980, -12122, -15277, -14409, -8628, 399, 1385, -449, -6613, -8555, -545, 5743, -1598, -5772, -5053, -3366, -3885, 3650, 11217, 10139, -68, -7852, -6046, -7017, -6166, 5497, 6218, -13579, -2501, -493, -6871, 1559, 2078, 4557, 1649, -7315, 11946, 10483, -4013, -4692, 7606, 1850, -5212, -2327, 11843, 7356, 1544, -5229, -13646, -20505, -16486, -6627, -219, -4614, -2856, -6126, -4462, -11247, -4182, -9750, -26277, -9144, -95, 3287, 4709, 3003, 7060, 5936, -2376, 1413, -8031, -6687, -3870, -2527, -9592, -17148, -23685, -23218, -19556, -16094, -11965, -7605, -4503, -3133, -5818, -12096, -18127, -14786, -6107, 538, 2848, -14, -6143, -11964, -12428, -11613, -11624, -17250, -21935, -13454, -2697, 9931, 9049, -5043, 4443, -2564, -5647, -1261, 1752, -1870, -1312, -3624, -10812, -12353, -8294, -12752, -8117, -13049]
146a3049p011l614M10K99O361e380F487b918A749k39b796j2060Q28d802l40I32
129b407l109Q04F06O198M762m820a3835a356n536m900l277j622J821K757K786
114i327K148Q06j94p49O82c183n083J952K601l953b930j059C550A581c79k248
98b627B298R22e313j076A750f352P27a493p510B731M338a059c20A2488B177J058
82C235b958p92g14B582J907b588p07j523n496n398m498k408j81J017K800L469
66a5513K921O42l784p983L372f232K987E216B265M74J947e641b090D253n16C29
49b901j006r717d116l186p00c123A813Q178C434j352g06b95o677k046r344m800
33b3162M919J996l003n476M036P358J373c483a61B439R279M987B317K825j404
$$ y = [-13049, -20060, -23674, -23264, -22965, -16604, -5380, 6487, -2918, 1749, 1510, -2796, -14856, -14028, -4802, -5142, 932, -2407, -5516, -4712, 606, 6804, 11566, 6746, -13835, -1356, -6892, -11792, -15069, -16691, -14870, -12113, -9327, -7179, -6373, -6567, -7316, -6634, -3183, -8266, -6314, -3713, -7666, -2930, -3989, 3550, 1581, -379, -2627, 2298, 3220, -5313, -6389, 1750, -6352, -5625, -1493, -9003, 2731, 7069, -1059, -320, 12488, 2177, 3235, -2958, -3750, -714, 2582, 4489, -2588, -3295, -4818, -10314, -15712, -20210, -22618, -22799, -21782, -18982, -15513, -12592, -11950, -15734, -23717, -20345, -6232, -3245, 5216, 2265, 2739, 4686, -5641, -2090, 4253, 3737, 329, -2901, -3907, -13624, -4116, -7302, -8002, -3123, 1813, 9991, 3434, 2082, -706, -295, -6972, -9018, -18362, -23162, -18243, -16247, -19250, -24726, -20690, -13332, -11959, -3483, -161, 2439, 11718, 16705, 2317, 5142, 3738]
18C738e751K827p911a571m991D967G29d393m430l363k346J08L187L900L026J724
2b587h45A549
$$ y = [3738, -5751, -2924, -10835, -1571, -6562, 4967, 729, -4393, -8823, -12186, -14532, -14424, -11237, -7337, -4311, -2587, -845, 1549]
##PAGE= F1=1050.578050745
##FIRST=     2908.11359968662, 2642.9191468254, -10589
##DATA TABLE= (F2++(Y..Y)), PROFILE
1023a0589j6143j0799j988L450K777n37n071p514K206J0364J0724P464K831k709
1009a5534p877j1980j4106j227J1973Q701M990K613J640N553c147F419j000d146
994i478E011K077H34a0853d129r005i3k975I334c068J156O97A185K957g305K021
978e284m602k5969J1828g182k284K123F57b562J104o240m004A387L401h699Q92
963g807j63B734N220A28J657L926f183j5059r730J920N301J247q42N731c719B641
946F079A819g92a68A1741H68a0991j3772j6150j6474Q551J9672a3153d119K007
932b112l629o333q268j1541j3701K317a7967A0376K3104l715D155c091k072m1933
918d7096M839G56J2848a7q614F85e269j611e90j4756j3242K335R896M517o274
$$ y = [-10589, -26732, -37531, -39519, -36069, -33292, -33829, -38900, -46414, -44208, -33844, -23120, -15656, -12825, -15534, -23411, -35391, -49497, -50724, -38751, -30050, -25060, -22447, -20807, -15254, -3147, 6419, 5419, -4146, -9478, 5011, 7088, 834, -10853, -4129, -13134, -93, -3068, 9334, -3068, -1912, -1215, 1185, 4142, -7305, -5284, -9886, -35855, -24027, -7182, -9466, -7343, 657, -2562, -1458, -7698, -11702, 1387, 4788, -8699, -7807, -7970, 2734, 7954, 128, 1785, 5711, -6183, -21242, -30972, -29052, -23751, -22504, -23346, -17615, -3719, 2641, 6079, 1819, -792, -168, 11741, 868, -10991, -24763, -40913, -57387, -48836, -29164, -13153, -4119, -2112, -5741, -12074, -20342, -31883, -45584, -43267, -17967, 10376, 33480, 29765, 4155, -3091, -5163, -47096, -42257, 756, 13604, -17, -8631, 685, -5269, -6880, -590, -15346, -28588, -26253, -16357, -11840, -18114]
903a8114j6575k3305N380K5181e458j440K840i35o828l08A264P96f843m618j752
888a3213l137q633j4845j4563J1318b0765b440m91a190q98n660j0237k404M163
874a6226L803j186n290m828J102P070O201o287n102k4008j3134a0736D534h458
859e863B479g910B065P815e85A524b3457k0597J6966a2739d398B194b795k897
845e692C242O789J920L70k182d863l596k6896j78g095A7069L481d070n33H103
829a816m946a736k893k3523j9599o338Q648Q971L691l532j0289j0797P531J8101
815c1765J5333Q188q89l8178j599O949p08K339j596L668a8457g112k385J936a495
799F037L052k765a0892k1148a0078G72M781P218A519f51A49c963J901j703l168
$$ y = [-18114, -34689, -57994, -52614, -27433, -5458, -6898, -4058, -935, -7763, -8071, 1264, 2060, -6843, -11461, -13213, -16350, -24983, -39828, -54391, -43073, -20765, -2440, -2931, -1190, -2088, -7748, -17985, -20389, -16226, -12423, -13609, -18899, -23727, -22625, -15555, -9354, -15641, -20743, -44751, -57885, -10736, 4534, -8458, -5863, 2479, -7910, 2065, 9880, -585, 1524, -23457, -44054, -27088, -12739, -4398, 2194, -2795, -5692, 3242, 10031, 11951, 12321, 10139, -4863, -8459, -35355, -35533, -7095, 17069, 20550, -4070, -4603, 8103, -1816, -6762, -1736, -4629, -28152, -47751, -54089, -45441, -36470, -32779, -36311, -46600, -57397, -49866, -31765, -16432, -8244, -9133, -47311, -48910, -41961, -42669, -40330, -41926, -38258, -18457, -7112, -9497, -7561, -1495, 6037, 9089, 6324, -10892, -32040, -10078, 772, 5553, 12771, 1519, -651, 149, -3963, -2062, -3765, -6933]
784f933I06L830A187J1184a2144j1479a212E707k358h830p97C033a583r03k908
769e394m341k0358l0964R429J1983L447l713n375J238J1745J5445d332a468k640
755d108m694J048p307b914c15j0175d946k923b489D778L552k599a0699j4887j1643
740c7229P653J1336K761o525r781O01J3710h093a701a50F97h197F238j480b240
724a5386k0637m176b812I984c420B944e163k539E804P733n352A488c3447L003
710c0444b343B428J489P141C850a0118j8216o170L673O642P545P732k289c481
695i223j0888j3881j3529o140N811J0418J0847J0142g486c167D70a2644k75r446
681b2365m50J0254a125p146a052j3352j6724j1233M420J3594g140r87b532C877
$$ y = [-6933, 906, 4736, 1187, 12371, -12144, -23623, -1212, 5707, 3349, -8830, -9627, 3033, -1583, -2486, -5394, -9735, -30093, -61057, -51628, -39645, -36198, -39911, -45286, -44048, -32303, -16858, -4332, -1468, -4108, -8802, -7754, -15061, -2914, -315, -10490, -4946, -7869, -2489, 4778, 8330, 5731, -10699, -25586, -37229, -29576, -18240, -15479, -22004, -31785, -31184, -17474, -8093, -1701, -150, 697, -8197, 6238, 4758, -2240, -15386, -36023, -40199, -2812, 9984, -3420, 2944, -5163, -7702, 5804, 13537, 8185, 1488, -33447, -30444, -2343, 2428, 3917, 11058, 3850, -10118, -28334, -34504, -30831, -24189, -16644, -8912, -11201, -3481, -9223, -20111, -33992, -47521, -53661, -47850, -37432, -26585, -16443, -7486, -3167, 470, -12644, -12919, -22365, -22815, -12561, -1125, -8271, -1052, -14404, -31128, -42361, -37941, -24347, -7140, -8127, -2532, 3877]
666e791A0656E163c352r669L519d132C263b981A6298k353A994a3887k4144j4461
652e2492Q504J3691R997O471L756K857b875j982E7M180p05a3328b485h18j418
637b236A3518P108G772a481A811g774p620k149L208o0609L9a8544i16r968j5327
622b6211j3430Q51J2359J2561f623K742p371d214n826q007q677o949k011N459
608c0225J1513d280l722K430n357C159L325i185c780F632P745k110c650k381a018
592E560A857i068d027o49a847G491a915j3778j9456k1971m039J8669J5152J1026
578a6312g684A104L80C52P533b851B244m95f258l582c419F426g329k2928k4946
563e5203P318a9055A124L636J157m31b780j798h16a59n046E776E55d286F65d341
$$ y = [-5791, 10656, 5163, -3352, -13021, -9502, -4132, 3263, -2981, 16298, 13945, 1994, -13887, -38031, -52492, -43988, -30297, -20300, -13829, -10073, -7216, -2875, -4857, 57, 4237, 3532, -13328, -2485, -818, -2236, 13518, 20626, 7772, -1481, 1811, -7774, -15394, -17543, -14335, -74944, -74905, -18544, -916, -10884, -26211, -39641, -38790, -26431, -13870, -6623, -3881, -11252, -4214, -10040, -18047, -26724, -33673, -35684, -30225, -18712, -4280, -8002, -5572, -10929, 3159, 6484, -9185, -3780, 6632, 14377, 12267, -3650, -6031, -1018, 5560, 1857, -9068, -4027, -4676, -1847, 7491, -1915, -15693, -35149, -57120, -61159, -42490, -27338, -16312, -7684, 1104, 1484, 352, 7885, -2851, 2244, 1749, -6258, -9840, -3419, 6426, -7329, -30257, -55203, -47885, -19055, 1124, 4760, 5917, 5486, -2780, -4578, -816, -159, -5205, 5776, 555, -4286, 665, -4341]
546E113I24b807f18A021h807Lj22K021D709J2144q026a0559c939J958p401k2173
530c1555j4844J0084a6931c364j272D058M541d093N82n695J201A1h8L0q683J324
514g417R56m045k1875k5507j1360P374j179n065J718R590J3253J6301a2399N869
500f530K135r426j4779j3902l804N437N006j190r244o239K0984C94J7716m305
486A3805d108a054H870d257j4734k560k403j0762j6991M22J9138J1815l863j8717
472d2912q282a9761b365C705Q077n423d617k243F139J0282k939d795k239K081
458d953E842b230m598E046a7716g873K575a006k42E216A237Q686J752C553J082
443D635e109k916I128k948e040k1772k6267K0553A1306n404J1455O76O3181J403
$$ y = [5113, 924, -2807, -618, 1021, -8807, -8804, -8926, -6905, 4709, 16853, 8827, -10559, -3939, -1981, -9382, -31555, -46399, -36315, -16931, -3364, -4636, 4058, 8599, -4093, -3511, -9206, -8005, 11, -88, -58, -8741, -7417, -6461, -10506, -32381, -57888, -69248, -61874, -63053, -68118, -66400, -56810, -43557, -27256, -12399, -6530, -4395, -13821, -28600, -42502, -46306, -40869, -35863, -37053, -46297, -52536, -31552, 394, 18110, 13805, -4108, -1054, 8870, -4257, -18991, -21551, -23954, -34716, -51707, -51285, -32147, -20332, -24195, -42912, -51194, -19761, -2365, 3705, 11782, 6359, -4617, -6860, 6139, 16421, 13482, -4795, -7034, -4953, 5842, -2230, -6828, 5046, -17716, -7873, -5298, -1006, -1248, 5216, 1237, 9923, 11675, 3553, 4635, -5109, -8025, 9128, 6180, -5040, -26812, -53079, -32526, 11306, 5902, 17357, 18033, 81214, 82617]
429H2617R905J1320K025j2518k5727l1360E436b2013j6972a7456d687A596c71
415f788m68A845N160A727d293l162K928D149g320K492l996c184E511B610a8849
399e0536m631J2283N493j574L715J3817f298K676l312j3600j7307j2613J487J1996
385c6971J5587f640L78I999M642c330d08D722f081K654m213K323q911p862j0109
370c2199j3374j3832l636J9505b0115D136K556J011C337R520l815c24m403j498
356f225n185l78j132e651G333Q463J6291J9313k5555h5B8247j2098a3826k6551
342d0377l1880K073r094J3679K0821D063j696a566B84d4j2683k2215k9636D802
327B0244J2698Q37H28J8582M6680m923A6246N805G946j609d4481m901E1181A7702
$$ y = [82617, 92522, 103842, 105867, 93349, 67622, 36262, 5436, -22013, -38985, -17456, -4687, 1596, -371, -6788, -7256, 1845, 7005, 1727, -4293, -7455, -4527, 4149, -7320, -4828, -8824, -3184, 5511, 2610, -18849, -50536, -55167, -42884, -37391, -38965, -35250, -21433, -6298, -3622, -6934, -20534, -37841, -50454, -48967, -36971, -21384, -6640, -6262, 9999, 14641, -3330, -408, 4722, -6081, -3427, -7640, -5317, -14228, -22090, -32199, -45573, -59405, -63041, -43536, -20115, 4136, 6692, 7703, 3337, 12857, 9042, -324, -4727, -6225, -11410, -11788, -12920, -5651, 7333, 15796, 32087, 51400, 25845, -85, 28247, 16149, -13826, -40377, -72257, -70184, -79278, -65599, -44778, 4063, 2367, -1566, 284, -44, -12727, -34942, -64578, 4802, 20244, 32942, 33779, 828, 19410, 66090, 61167, 16246, 22051, 7946, 6337, -44481, -49382, 51181, 17702]
312A05234J794N2496j6247J97839P9341O096005J1963439J22668169N0131387
303A91279457m957287C7520047G337830B673483A009699m01522B79532A21209
294F6176B4781R951B811a728C0855b9343j2443h331F311d3467J3000A088b6803
280e1335M853J6606k8743l857J5851g607R52m042M662b903j074k739o896b211
265E227c490L18l7879r400K2711A5893O162E489c352f53n144d27A7289H544b7483
249f2132K484b7718f70A2399r27B851f015k042j5759l4358j6259K1402K2662a1549
234B865f279a34l558B453b536j577A4370j445b305o517H97d901k0791j8770j5761
219f0223p406K467J2536J5351J4642i966d162l054p741q370j094R175L48O843
$$ y = [105234, 107028, 159524, 143277, 341116, 420457, 6516462, 18479901, 141148070, 191279457, 186322170, 37520047, 7337830, 2673483, 1009699, 608177, 279532, 121209, 66176, 24781, 34732, 2811, -1728, 30855, -29343, -41786, -8331, 6311, -43467, -30467, 1088, -26803, -51335, -46482, -29876, -58619, -62476, -46625, -7607, -6655, -10697, -6035, -2903, -3977, -6716, -13612, -2211, 5227, -3490, -3172, -41051, -50451, -27740, 15893, 22055, 5489, -3352, -653, -5797, -427, 17289, 8544, -27483, -62132, -59648, -27718, -670, 12399, 11472, 2851, -6015, -8057, -23816, -58174, -74433, -53031, -30369, -11549, 2865, -6279, -134, -3692, 2453, -2536, -4113, 14370, 12925, -2305, -8822, 897, -4901, -25692, -44462, -60223, -67629, -65162, -52626, -37275, -22633, -9966, -4162, -7216, -14957, -23327, -24421, -15246, -14898, -8055]
205h055B644E55K491j044b958j7346k2830j6493J1958K3484c142k581k117c634
190A138a891B574b993O51K41l749j966G95f149H399P628D142C98J611B18N436
174E654Q063A720b2633k6373j3284Q641J3639J2897a1264e190d44A8522I082d620
159G428e52o249L030B735d344B83a7078P80C725A264a1111M334L330E509J979
144G488b342k7739N107h038E600c239j559KA783d3919o59a4139d571n73k0413
129b5557k1568j255J5966J2386L095l574k980M545Q146j373K76k443j1830j0094
115c6260m474J447M925O474O982Q245c829Q87l519J06r971k3134k5096k1779R884
100g6451K1345K6892E07d43r664b844C035g583J078h18j3276c409D602A20f937
$$ y = [-8055, 2644, 555, 3046, 2002, -2958, -20304, -43134, -59627, -47669, -24185, -3142, -5723, -7840, -3634, 1138, -1891, 2574, -2993, -2342, -2101, -5850, -7816, 795, -6149, 8399, 16027, 4142, 398, 2009, 218, 5654, 13717, 1720, -22633, -49006, -62290, -53649, -40010, -27113, -11264, -5190, -444, 18522, 9082, -4620, 7428, -552, -6801, -3771, 2735, -4344, 283, -17078, -16298, 3725, 1264, -11111, -6777, -3447, 5509, 7488, -2342, -30081, -24974, -8038, 5600, -3239, -4798, -4796, 1783, -43919, -44578, -14139, -4571, -5144, -25557, -47125, -48380, -32414, -20028, -16933, -20507, -23487, -18942, -10796, -12169, -11893, -14336, -26166, -36260, -40734, -39287, -34362, -27888, -20906, -12661, -3829, -2942, -6461, -6355, -16326, -39460, -64556, -86335, -76451, -55106, -28214, 507, -443, -10107, -2844, 3035, -7583, -6505, -818, -14094, -3409, 4602, 120, -6937]
84a637j7290o567J261N238N144M929a220l152m6D555a975j059p05k5262j0904
69c9905Q523J3865g791b069n54A718L079Id599l365C771J983K67o46d536A122
52a229j5621j0224L360R755L351p47j0701r937j072Q181J1755c477A538a672j3952
37a5624k1884j3783J3352a7439g925m055j0324m6i139B464a1639a0p033p630K034
22a2639d992A074J476b098a2j680n444A789c722D355R485m444c893L41B678a3194
5a4902O149d355k633r836j5535
0c2359
$$ y = [-1637, -18927, -25494, -24233, -18995, -13851, -8922, -1220, -4372, -4418, 4555, -1975, -3034, -3739, -29001, -39905, -31382, -17517, -7791, -2069, -2623, 1718, 4797, 9, -4599, -7964, 3771, 5754, 6021, 5375, -4536, 1122, -1229, -16850, -27074, -23714, -13959, -10608, -11355, -22056, -31993, -33065, -24884, -13129, -3477, 1538, -1672, -15624, -37508, -51291, -37939, -17439, -7925, -11980, -22304, -22350, -9139, 2464, -11639, -10, -7043, -14673, -12639, -4992, 1074, 2550, -2098, -12, -1692, -7136, 1789, -3722, 4355, 13840, 9396, -3893, -3552, 2678, -13194, -14902, -8753, -4355, -6988, -16824, -32359]
##PAGE= F1=1047.994552068
##FIRST=     2908.11359968662, 2642.9191468254, -2324
##DATA TABLE= (F2++(Y..Y)), PROFILE
1023b324k1505j5768m398j325j816l622p863j3412j6875j4314J507Q825N455J753
1009h5682K352O185P566M154j255o435q138l741M747J6889K8442D78N826c765
994h040G423k353e126l715b630j1888b12k110A0122d822H74J910jM80i441L782
978e659O00m803k675M437c322o729I99a621m464l0724k1732C15N899i926c114
962a2543A47P545B554P18K239h353j1240j0781R915g580b919o721l080A62n0L070
946C182r58D64a728q711l1526l0268k8223j8955K3897L2629c1149e899G963b273
931a441j6959j7865j2447L475b0023F946J7647J6239r790C883b147m8137o0553
918a10837b7102A109Q054a851o246b47p159j7864n2384p603c8823A590a715I022
$$ y = [-2324, -23829, -39597, -43995, -45320, -47136, -50758, -58621, -72033, -88908, -103222, -101715, -92890, -87435, -85682, -83330, -77145, -69579, -65425, -66680, -73115, -81253, -84994, -80247, -63358, -34916, 478, 6304, -3765, -8040, 7423, 5070, -5126, -8841, -2630, -14518, -212, -2322, 10122, -4822, 874, 2784, 2783, 3263, -9441, -5659, -5059, -9862, -12537, -8100, -3322, -10051, 999, -1621, -6085, -36809, -58541, 315, 6214, -9926, -3114, -12543, 147, 7692, 2554, 3272, 5511, -8353, -19593, -30374, -20459, -7580, -2919, -9640, -12720, 162, 112, 3182, 2224, 464, -1728, -10439, -41965, -72233, -100456, -119411, -95514, -62885, -31149, -5899, 7963, -2273, -1441, -18400, -36265, -48712, -45237, -20023, 6946, 24593, 40832, 31042, 3883, -2147, -50284, -110837, -27102, 1109, 9163, -1851, -8097, -247, -7406, -25270, -77654, -85257, -38823, 1590, -1715, 9022]
903a2663n2667m8256M3331b0425a386o044c403A218g043n319C9a0614j8455o627
889c5696K981J222j0403k1383r433L1795a0806a501k904J606j211k279J865j577
875f001l02B89d016J06k6443j7299K050J1014M211j1540k9471j7645b9804C754
860h094b920E838d983A470R875A565J823e1988m9697c4065G73b101k2335j308
846b5744h071C068P243j097J029l955g114J366a865q0811j7185b0708A9803c322
831e018H246A107h488b672j0099n1881l6565n954J3895J5310J2401M821o402j7849
817h4995k5820q861K6602K3122J1353k216j3770j9233j5269p542p665K1262M5991
804e7041f107k397L567i37D393N70j932M064e5671n8368b9062F933P430D725J091
$$ y = [-12663, -65330, -113586, -70255, -20425, -1386, -7430, -3403, 1218, -7043, -12362, 39, -10614, -29069, -35696, -32715, -31493, -41896, -63279, -72712, -40917, -10806, -1501, -4405, -2799, -4010, -6289, -4424, -6001, -6303, 289, -4016, -3910, -30353, -47652, -45602, -34588, -30377, -41917, -71388, -89033, -29804, 3754, -8094, -2920, 5838, -4983, 1470, 11345, 1565, 3388, -51988, -101685, -34065, 773, -2101, -24436, -25744, -8071, 3068, 10311, 9214, 10243, 6288, -7114, -5748, -1865, -82676, -99861, -20708, 19803, -3322, -5018, 8246, 1107, -8488, -2672, -12771, -64652, -101217, -107171, -93276, -77966, -65565, -60744, -67146, -84995, -110815, -119676, -93074, -69952, -58599, -60815, -74585, -93818, -109087, -116629, -124294, -103032, -57041, -6107, -8504, -4937, -937, 4393, 4963, 3031, 7095, -55671, -114039, -29062, 6933, 14363, 4725, 5816]
789E816J698c305a200B34a453j4648B606K57L506d3758n9697b0250I37i77q030
774i007J332E075a155Q4j452r179j5403p0309m990K9533J3143m373j1739J704
760g4136K7325a0607N198e41p44p205k250j0B710L365e087l805k516l7770j8556
745f7734J4443J4276j075j1562p481J0769K2506d307D670K422a390r338M286k2989
731b9431k8852k6701K02L0484b0438A591L604f831j7962P25A0362b674C400e813
716c651A1700P409n847c6350r0702f3107h90F620A628M735a406B670c5299k4645
702e9944n200J0428J8069a7694f331b195j0449k1656k8987l1530k7782J195K9061
689i2343L3484b5706B407b451D170a0778o182k5650j0563O752P571l800j4157
$$ y = [5816, 7514, -3305, -1200, 234, -1453, -16101, 2606, 2863, 6369, -43758, -103455, -20250, 937, -977, -9007, -7675, 5075, -1155, -1071, -2523, -11702, -27105, -97414, -102404, -72871, -59728, -64101, -75840, -74136, -46811, -10607, -5409, -541, -1285, -8490, -10740, -10750, 2710, 6075, -5087, -8892, -11408, -49178, -67734, -53291, -39015, -40090, -51652, -59133, -48364, -25858, -4307, 4670, 7092, -1390, -10728, -6442, -29431, -58283, -84984, -84782, -54298, -20438, 1591, 5195, -6831, -24793, -24068, 10362, -2674, 3400, -5813, -3651, 11700, 19109, 13262, -36350, -127052, -63107, -890, 6620, 1628, 6363, -1406, 2670, -35299, -59944, -65144, -54716, -36647, -17694, -6331, -2195, -12644, -34300, -63287, -94817, -122599, -121404, -92343, -58859, -25706, 2407, -2451, 4170, -10778, -16960, -42610, -53173, -46421, -38850, -42650, -56807]
676e6807j0297R922K1325a7889d869m203j01B999L05a620F436A701d145n2120
662e6265O209a533B93a460A7398p56F878H61a5681j6836J3554h9A1412E456c287
646A249d183j759i59A253F8a3036A321N49d813A0697J1872I947a7427l0514k5064
631g3005j4022l776L636Q172L346J3239k280j3289k2791k8153j6002K3495J9110
618a02320J3077P777N136L441K966L328M839Q199J3256J9348g27j362D76O87c821
602H420j53h622J586D691O488N12a106m006J872C988A862g507j954k518p766k183
586b1928n092j0706j3405n374P786J4219J1933O401M362b899C837A701N354g125
571b7942N377d918m341A052P969d161k1907m5605j4290L8363a96D408J754k190
$$ y = [-56807, -67104, -57182, -35857, -17889, -4869, -9072, -9173, 2999, 3304, -1620, 6436, 1701, -4145, -56265, -50056, -1533, 293, -1460, 17398, 16642, 6878, 861, -15681, -32517, -18963, -89, 11412, 5456, -3287, 1249, -4183, -5942, -959, 1253, 68, -13036, 1321, 1870, -4813, 10697, 22569, 9947, -17427, -47941, -73005, -87027, -90803, -87167, -78995, -75649, -62410, -64690, -77979, -100770, -128923, -144925, -121430, -102320, -89243, -81466, -76330, -72889, -69923, -66595, -61756, -53557, -40301, -20953, -727, -2089, 476, 1163, -3821, 8420, 8267, -8622, -7036, 4691, 11179, 11691, -1106, -5112, -3240, 3988, 1862, -7507, -9461, -11979, -19745, -21928, -27020, -37726, -51131, -56505, -48719, -34500, -22567, -16166, -11804, -2899, 3837, 1701, 7055, -7125, -27942, -22565, -4918, -9259, 1052, 9021, -4161, -26068, -71673, -85963, -47600, -196, 4408, 6162, 3972]
557C972e292l70B178I89e970E455B380d087a967k692C981b736J106j578A494g668
540i906j1046k3285R341b446A2164a1869e467A170d645m202k7088N41a6307b789
525b921C519a0439j1171K424h661J37a714K61B664a0645L489P73l040B950c9023
509g8686j8372q675n659N00R642J7367K3224K3127J6534N327o253j4909j9144
496e5977j9292j7718j4665j0508J398K5053M1521e805B1323m753e747P40j1880
483a6887k4601r373m273j5268l1811m0551J0449L1416Q270j6756K752d3650f628
469d299HP803B456a5874j5462F585R351m579f408K707q708g80p394m28l3896j6263
453e8761e533j094L127f0G176A183J4547n46C606k07e282j87A0384n00a5273m2139
$$ y = [3972, -5292, -5662, 2178, 989, -5970, 5455, 2380, -4087, -1967, -4659, 3981, -2736, -1630, -3208, 1494, -7668, -9906, -20952, -44237, -34896, -2446, 12164, -11869, -5467, 1170, -4645, -8847, -35935, -35394, -16307, -2789, -2921, 3519, -10439, -21610, -19186, -8661, -8524, -1714, -1453, 2664, -10645, -7156, -6383, -9423, 2950, -39023, -78686, -97058, -105733, -111392, -110892, -101250, -83883, -60659, -37532, -20998, -15671, -21924, -36833, -55977, -75269, -92987, -107652, -118160, -116762, -91709, -50188, -5805, 21323, 16570, -5747, -5007, -16887, -41488, -50861, -55134, -70402, -102213, -142764, -132315, -100899, -92629, -109385, -106633, -43650, -6628, -4299, 8, 7811, 2456, -15874, -31336, 6585, 15936, 11357, -6408, -3701, -12409, -780, -8174, -8602, -42498, -58761, -5533, -6627, -3500, -60, 7176, 1183, 15730, 15184, 3606, 3399, -5282, -5469, 10384, 9884, -15273, -57412]
437e7412m5537J0873c1600C797J6396K995N6486L3688K7591N3239n4174r46m6866
424I2206B9964i280j7455q278J5810f853a006j775P9m39E0L633e22l0360l0331
409f1213Q87b9478f683K159J289E994K874F95a7428n4252m4034k6449o908J4585
395a34486L8414M6605f896a474m949q45l4963m3407l6009R816N1701c949n545
382i494C734O168d107a847A40a844F47c883j5597k3508j1848k745o257j0245K255
367g1828K3338a7856I60J1R5J885J0706d24k2905q988q902J2815a630r887A4249
351D1217K1053j941j7490j9885g585A3879a8816n4268l4655k3279J9898l6255
339a47375n779P2933D030j357d224B540J499L469a9994j07440O0749b9699B3810
$$ y = [-57412, -102949, -92076, -31600, 3797, 20193, 23188, 79674, 113362, 140953, 194192, 140018, 139072, 92206, 29964, -9280, -26735, -35013, -19203, -6853, -1006, -2781, -2702, -3141, 50, 3683, -522, -30882, -61213, -60326, -29478, -6683, -4524, -3235, 5994, 8868, 695, -17428, -71680, -115714, -142163, -149071, -134486, -96072, -49467, -6896, -1474, -6423, -7268, -42231, -85638, -121647, -111831, -60130, -3949, -9494, 3734, 9902, -4107, -1847, 140, -1844, 647, -3883, -19480, -42988, -54836, -57581, -63838, -74083, -71828, -48490, -17856, 960, 971, 1066, 2951, 13657, -424, -23329, -32317, -41219, -28404, -1630, -11517, 14249, 41217, 62270, 60329, 42839, 22954, -7585, 13879, -18816, -73084, -107739, -131018, -111120, -147375, -153154, -80221, 4030, 2673, -4224, 2540, 4039, 7508, -19994, -127434, -66685, -29699, 23810]
325A7519c6112K756E6813J392d1604k7196B0221c457o1491m2617E7152k1966N8079
312I3265L5465L8377M5113J69111j7832N092425J7519709J68303824K62316210
303D53595667j16930565E3359591A0937957C783511A487027p18400C05916j46510
295A59406G0928B4042J1206B823N423J6272i619q7059i250I931a22739M7262B9602
281E59f8687K6988M438q0096Q877J3012i033J270k724L602b387o959j6384p5288
267a01018k4172K8389L4064j9954J0640c0802E113J7377l157H749b812E947i97
253A089J5987a2801l4179l1617j4217K8613c0210I845J995D880c850p247k0429
240c1526l4323j0812M976Q894J2447J9586h090Q54l88B144d355e4A5195k226b400
$$ y = [17519, -36112, -33356, 56813, 58205, -41604, -68800, 20221, -3457, -64948, -107565, 57152, 35186, 93265, 128730, 167107, 212220, 381331, 363499, 5455924, 22975633, 191279457, 453595667, 336665102, 53359591, 10937957, 3783511, 1487027, 768627, 305916, 159406, 70928, 24042, 35248, 2823, 8246, 24518, -9619, -96678, -9250, 9931, -122739, -75477, 29602, 559, -68687, -41699, -37261, -117357, -108480, -95468, -9033, -7763, -10487, -6885, -2387, -9346, -25730, -101018, -125190, -96801, -62737, -82691, -72051, -30802, 5113, 22490, 19333, 8749, -2812, 5947, -997, 1089, 17076, -12801, -46980, -78597, -92814, -64201, -30210, 9845, 11840, 4880, -3850, -11097, -31526, -65849, -76661, -71685, -62791, -50344, -30758, -8090, -7236, -7624, 2144, -4355, -54, 15195, 12969, -2400]
224a2822N951l7244n6161m2659N736L5374L2293K7239J4477j091j0606j9427k3995
211h2935j9618j6160L75K9136M2936a2275G96q1K624L7o24c11l4067l1979L100
196f3257b5559G841d137m093b728c79l554E03J484c4520j4128R857i056A4428
181h865G131L267B082L514K493l399J121P670d173m0872l8045q829K3170L1440
167c7309i273B577d551A003J6319G734c747I877A507e864K249F206g157A286b9028
151b0850D691B258i653L937a291H437k472f496l6796j45h839D278b440r704l89
136a2533d529r5185j6066N1879K1786j3706l3404j8311J8418K3814J0104J099
124e4101Q888a9780e835l767j404K024k2202m2671l4775j7833J458J4095J9442
$$ y = [-12822, -6871, -44115, -100276, -142935, -137199, -101825, -69532, -42293, -27816, -28907, -39513, -58940, -82935, -102553, -118713, -118338, -89202, -46266, -12275, 796, 715, 3339, 3376, 2752, -311, -34378, -66357, -63257, -25559, 7841, -4137, -8230, -2728, -379, -3933, 503, 1987, -34520, -48648, -38791, -9056, 14428, -8865, 7131, 10398, 2082, 5596, 8089, 4690, 5811, 13481, -4173, -45045, -83090, -91919, -68749, -37309, -9273, 2577, -4551, 1003, 17322, 7734, -3747, 9877, 1507, -5864, -3615, 6206, -7157, 1286, -29028, -20850, 4691, 2258, -9653, -5716, -1291, 8437, 5965, -6496, -43292, -43437, -8839, 4278, -2440, -12144, -12533, -4529, -99714, -115780, -63901, -42115, -55821, -89225, -107536, -89118, -65304, -55200, -54101, -45213, -19780, -5835, -9602, -11006, -8982, -31184, -73855, -108630, -126463, -125005, -110910, -91468]
111i1468K0149J9344J5957R003l117j8617l1773l0591r250P293O192J4797M0699
98e1382c118j772q573B537K881h498K199A1a4285f823C056K379a3783e881m8573
83e4454k9817N004K2769J6490K772l478Q408f31C094b307j202C15d153m6532k4163
68g4848Q908K3942a6149d722J861H94b656j017p525A930P081L07l207b287D114
52A6115d486j6468N078b566l654q445l3109l5675j3504K0169L4288a1679E675
38D439a4983l8581k9670R714L0988J9667M13r699k253Q460P317n318j9927k5374
24f9246j4559N404J4216R846K317j40O097J9567c713D411a578C211R916l738g40
8I4K841a875A627g274C053A084f242k5758
$$ y = [-91468, -71319, -51975, -36018, -27015, -30132, -48749, -80522, -111113, -120363, -113070, -106878, -92081, -51382, -3118, -4890, -13463, 2537, 5418, -8498, -6299, 11, -14285, -6823, 3056, 5435, -13783, -5881, -54454, -84271, -79267, -56498, -40008, -37236, -40714, -32306, -631, 3094, -2307, -3509, 315, -4153, -50685, -74848, -65940, -41998, -16149, -4722, -2861, 894, -2656, -3673, -11198, 1930, 9011, 9318, 6111, -2287, 4114, 16115, -4486, -20954, -15876, -2566, -6220, -14665, -47774, -83449, -96953, -76784, -42496, -11679, 5675, 4439, -14983, -53564, -83234, -73520, -42532, -22865, -22452, -32151, -34404, -25944, -18627, -23945, -43872, -69246, -83805, -78401, -64185, -54339, -52022, -52162, -46065, -26498, -3713, 4411, -1578, 3211, 13127, 9389, -740, 94, 2935, -1875, 1627, -7274, 3053, 1084, -6242, -32000]
0c2000
$$ y = [-32000]
##PAGE= F1=1045.41105339
##FIRST=     2908.11359968662, 2642.9191468254, -6341
##DATA TABLE= (F2++(Y..Y)), PROFILE
1023f341k1868n256N939N918J696k395n866q202r172j0384j0594j0873p105N965
1009g8538J5361J5715J1363M681j831o949q751n889l10R071J8601c714G551b818
994e271H489G38g543L683a373j1612e78l042I638f299D465K570l187A828i070
978c730j273n960J711K629A510a0643I68c96p605l4475J0508B185N358h175C624
962a1458b993F271k352h178j2161j1581p967O786a5417K816N931o68r773L426
948a3685c53r85E45L84c361j4023k7971k5721j4391R374J7047J6710J4312R893
934a8131L815j747n882o349l082L647J2689N303A279J8319J9196q192C634b9342
919f5978K8360h675b647F077a237n210b29q467m3682k9711K6756a9400A466b086
$$ y = [-6341, -28209, -33465, -27526, -21608, -19912, -22307, -28173, -36375, -45547, -55931, -66525, -77398, -84503, -78538, -63177, -47462, -36099, -31418, -33249, -40198, -48949, -54838, -55148, -46077, -27476, -3714, 7551, -2818, -5271, 8489, 738, -7543, -3860, -1373, -12985, -578, -3620, 9638, -6299, 4465, 7035, 3848, 1828, -9070, -3730, -5003, -10963, -9252, -6623, 1510, -10643, 968, -396, -8001, -42476, -31968, 2185, 7543, -8175, 3624, -11458, -2993, 6271, 3919, -8178, -20339, -31920, -39887, -33101, -15417, -12601, -6670, -7338, -17111, -13685, -353, -1338, 545, 929, -3361, -17384, -45355, -71076, -85467, -76093, -59046, -42336, -28024, -18131, -14316, -16063, -21945, -28294, -31376, -27729, -15040, -9737, 1279, 19598, 38794, 30602, 3634, -29342, -65978, -37618, -8675, -2647, 6077, -1237, -6447, -229, -8696, -52378, -82089, -55333, -19400, 1466, -2086]
904H662a7128l2089j0507K5078d686k312L08K762A692d323n816h00j1340j1023
890b3163j271O636O324m62n516P23d651n574b822l072b84B317p15e747j614l684
874a1045b942Q82j035k0002j5984l257O299N223l036j3437r952b8084C076f946
859a256F494b883B20J1443B582J871b1676n3027a3960A6050D490K756b3654O988
845a6666A955O938l598k17F39f971J929J874f76m8325j5435a4327a073m430G804
829E089i138d325k098l0947k6461p496M636R076J1256Q990K077o760j4954j8113
815g5119r146J1204J3530O486k724j0716j3738n907O513J2783K1445a4344O506
802g838b524e49A757a266j609D259a423o0889j715A61J5378G324L385L008a449
$$ y = [8662, -17128, -49217, -59724, -34646, -4686, -6998, -6690, -3928, 1692, -4323, -10139, -800, -12140, -23163, -24434, -17798, -11474, -11936, -17452, -16729, -4651, -10225, -2822, -5894, -284, 2317, 1602, -5747, -7361, -11045, -2942, -2060, -3095, -23097, -39081, -42338, -36039, -30816, -33852, -47289, -57241, -28084, 3076, -6946, -1256, 6494, -2883, 220, 11663, 2582, 4453, -21676, -74703, -13960, 16050, 4490, 7246, -23654, -16666, 1955, 8893, 5295, 5078, 639, -6971, -5042, -3168, -676, -49001, -64436, -14327, -1073, -5503, 7804, 5089, -9138, -4325, -6423, -37370, -63831, -71327, -66691, -57615, -46359, -37369, -35292, -42052, -57006, -75119, -84265, -73061, -59531, -53045, -55769, -66485, -80223, -86130, -79617, -66834, -45389, -14344, -7838, -2524, -549, 1757, -1266, -2875, 4259, -1423, -62312, -64027, 161, 15539, 7324, 10709, 13717, -1449]
786a859D513J7c2913l854a6740h095j8029l5631K8506c220o72m800L257D923b169
770a020j69j1254m0264l1874L8307K2433L252j1787j6635n253J6956a1843N027
757f816h23G09g634o721e658G362M066A49a1418J818k9746k2944J4463J9337P042
742b1448j938n30J0391a154k344E317j545f945J165h49j2456k1665k7487k5990
728h8447J2260L2315a7249b253a57n968n914L539a977C374e090K190A3348P177
714B0525A0080e2324n1384c4618B311P175a219C88e302J845k8935l5054j9493
701h6939N488J8221K0317J6089P136n273j7138k5712k8974q700K4669K4199K4359
688c2258h555C519b032D840i452j503k0472j0369O69J759l332l630O494J6993
$$ y = [-1859, 4513, 4530, -32913, -36767, -16740, -8095, -26124, -61755, -33249, -3220, -3892, -8692, -5435, 4923, -2169, -1020, -1189, -12443, -52707, -84581, -46274, -23841, -20589, -32376, -49011, -54264, -37308, -11843, -6816, -823, 709, -7634, -14355, -5658, 7362, 11428, 149, -11418, -9600, -39346, -62290, -47827, -28490, -21448, -23386, -23916, -13525, -1154, -3498, 5317, 3772, -6945, -5780, -849, -13305, -34970, -62457, -88447, -76187, -43872, -17249, -2253, -157, -6125, -12039, -8500, -1977, 3374, -5090, -2900, 13348, 20525, 10080, -52324, -103708, -34618, 2311, 9486, -1219, 388, -5302, -3457, -32392, -67446, -86939, -81451, -63230, -42913, -26824, -19688, -24961, -42099, -67811, -96785, -105485, -80816, -56617, -32258, -8555, 3519, -2032, 4840, -9452, -10955, -31427, -41796, -41127, -39368, -42700, -46330, -39836, -22843]
674b2843f667B341J979f773R73H150B49a302B502a958o328n4096K4379g429K843
659d586a060A6719J009p709b683l5647m359a5531i9A2115n496d270I25f225j393
644g618b724A23c448j0284a942A95f326F773J6543j0400a2374k7444k3662j5944
630g9424p715p28K567J778O25n898j1111j2198k95R064N804J521J62L727R681
615h2440J0857Q394M959M095Q095J4257a3291C704n5N861k646A476J1187m071
601H592f939k367A846N016K548F27d162b057D406D64d864k865r877k782J782P98
585a7808j739l353L18M987N060q81j0054j4931o038R785J0976l571k1613k2293
571g1155J8106h954K11D620M683e501m111k2463k721a3349B380n37K997B030e110
$$ y = [-22843, -6667, 2341, 4320, -6773, -5800, 8150, 249, -1302, 2502, -1958, -8286, -62382, -38003, -7429, -4586, -1060, 16719, 17728, 10019, -2683, -38330, -42689, -15531, -99, 12115, 6619, -4270, 925, -6225, -7618, -2724, 123, -3448, -13732, -1942, 195, -6326, 6773, 23316, 12916, -12374, -39818, -63480, -79424, -87139, -87867, -85300, -83522, -82897, -88795, -99906, -112104, -112399, -103335, -97531, -96010, -95848, -92121, -82440, -71583, -63189, -58230, -54135, -46040, -31783, -13291, 3704, 3649, 9510, 6864, 1476, 12663, 8592, -6939, -9306, 1846, 6862, 9410, 627, -4162, -2057, 4406, 464, -4864, -7729, -17606, -20388, -18606, -17808, -19547, -22900, -22582, -17595, -12535, -13416, -23470, -38401, -44439, -34654, -23678, -27249, -48862, -71155, -53049, -8954, -8743, 4620, 9303, -5501, -9612, -32075, -34796, -13349, 2380, 1843, 4840, 2030, -5110]
555a43E907A618f396D214j359c244l82j98B405f159I81c715G44d249o4m042k2750
538c1105j3891P741a0466j264d731D446i87j606A326f100K659C75e67C32a0042
522a8506K430g441j750d381a563E515a2023e339m48J568m816j1722m6970k3174
508i0901m950l214j633J0053K1121K6088a8717B01b906C76Q427B368e139r541
494a4680j1950j2834q481M618J7844d055A0898K627f659r154j6549p019j846o925
480d8152j9487l1237k2930K7663K3936M747j0564Q331a8713g846K900J935E177
466C009a5130k0298b616A4622o230g387H28e874K21p414e269l3362p551e204R70
451d234k618d6G539B289J4526l148B574j053e692K428A0134g548k3692k8660l0113
$$ y = [-143, 5907, 1618, -6396, 4214, 2855, -3244, -3626, -3824, 2405, -6159, 981, -3715, 744, -4249, -4313, -8355, -31105, -44996, -37255, -10466, -11730, -4731, 4446, -987, -2593, 1326, -6100, -3441, 375, -567, 332, -10042, -18506, -16076, -7441, -9191, -4381, -1563, 5515, -12023, -5339, -5787, -4219, -9035, -20757, -67727, -90901, -95851, -99065, -100698, -90645, -69524, -43436, -18717, 201, -2906, 376, 8803, 2368, -5139, -14680, -26630, -39464, -47945, -43327, -25483, -4055, 10898, 13525, -6659, -15813, -32362, -39381, -41227, -48152, -67639, -98876, -121806, -94143, -70207, -65460, -76024, -67693, -18713, -7846, -4946, -3011, 5177, 3009, -15130, -35428, -2616, 14622, 8392, -7387, 828, -5874, -5653, -13067, -5269, -38631, -46182, -5204, -4234, -6852, -46, 7539, 2289, 16815, 13667, 2574, 1521, -5692, -3264, 10134, -7548, -31240, -59900, -90013]
436i0013L515L8093a1963A1525J2045J4520K9109L6244K3800k126k9447m6589
424D9081I155c313C882N104d028k922A025g31k21a82k796Q49j256j7862l5266
409e6513r874K0425a8346d533A5J4546L577C501h505k9362l0542k5566q998J0010
395i2963K1501K5567a9077b701l607j480k1374l2350l8740l3324N1576b5194d671
381a913D606e460K634k004B624K035f69E110d528j4459p590j1350j6916o772J9772
366d1843i115L121J397J571D108q23c1837l0972J72J4703a4502c269p833A2839
351D1742K1417q534j8722j4925a0263m374o2769n506J8033K1506J6635l1559m1884
338a00181L8934C834r55g100F722J572K801B045f7065j7274L2662B7648j3132
$$ y = [-90013, -86498, -48405, -11963, 11525, 23570, 38090, 67199, 103443, 127243, 125117, 95670, 49081, 9155, -3313, 3882, 8986, -4028, -6950, 1025, -731, -952, -182, -2978, -2129, -3385, -21247, -56513, -66387, -45962, -18346, -4533, 15, 14561, 18138, 3501, -8505, -37867, -68409, -93975, -102973, -92963, -71462, -45895, -19077, -2701, -6308, -7788, -29162, -61512, -100252, -133576, -82000, -25194, -4671, -1913, 4606, -5460, -2826, -4830, 2624, 4659, -669, 5110, -4528, -18987, -26577, -37927, -54843, -61615, -41843, -9115, -5994, -4597, -3026, 4108, 3285, -31837, -62809, -62637, -47934, -14502, -3269, -11102, 12839, 41742, 63159, 54625, 35903, 20978, -10263, -14637, -77406, -82912, -64879, -43373, -26738, -58297, -100181, -61247, 3834, 2879, -7100, 6722, 8294, 11095, 2045, -67065, -84339, -51677, 27648, 14516]
325A4516e0520j5118E4046j293g4097j4440B8607i650p7770k4701E7303j3431
313D3872L0119N5429J2851R2100Q9862j11098K961010J8488804J64659221J50342932
303C36665102j771001E4721220A1545429C787546A551868G06357B65480r4986
295A70494F5807B0408J0452a188A9142n780d597k9868e656A1381i5588L7455C0007
281B048d6291b1217j7289m6637L6756k4899g942M67O68P44a007j331j4182n2696
267f9216m6921M809L4714J5474b1140A656J3233L554k174n216H31J1073C695m57
253C238e695k5841j4074j1829o105J7591K2252A339R576n059a953j0289l343k9732
239d5317j6854k053Q044J2458J4622J1821h394K711B551c716E436J0548m802d259
$$ y = [14516, -50520, -65638, 54046, 52753, -74097, -88537, 28607, -9650, -87420, -112121, 57303, 43872, 73991, 129420, 142271, 234371, 324233, 213135, 3174145, 21662949, 186322170, 336665102, 334894101, 54721220, 11545429, 3787546, 1551868, 706357, 265480, 170494, 65807, 20408, 30860, -1188, 19142, 13362, -4597, -34465, -5656, 11381, -95588, -58133, 30007, 2048, -46291, -21217, -38506, -85143, -48387, -73286, -7942, -7475, -6807, -6063, -1007, -2338, -16520, -69216, -116137, -111328, -76614, -61140, -21140, 1656, 14889, 18443, 16269, 11053, 831, 11904, 3695, 3238, -5695, -31536, -45610, -57439, -63544, -45953, -23701, 1339, 10915, 5856, -1953, -12242, -15585, -45317, -62171, -64224, -56180, -43722, -29100, -17279, -8394, -5683, 2551, -3716, 5436, 15984, 11182, -4259]
224a1330o202l2177k4953q786N193J2658J6533J7523R561l282j4100k4288k9958
211i3608k1485o35J1136K1808L5498a2431c255e08B639J293q27b071M53l0572
197c2190j0890J9698H927c331m606a514M07m085a421F192c4789j6827K0072F185
182A0662a0896C926K72D92P826N211k028l882N089c157l0600k4937j350J8821
168d1223a8637f032B23c898A603J2553E440b746A0980B593c740h85A0113h130
153A621b4103J1297F941l296h568L811c41I460m700h039k3663J212g092C120a368
137f971J929l2835q1430M7322b1970f257j2276k7434j5731Q254J1915L930N929
124c1670h960a678q110j893K129L131q449m8473l8403j8567o07O235J5923K0643
$$ y = [-11330, -17532, -49709, -74662, -83448, -78255, -65597, -49064, -31541, -21980, -25262, -39362, -63650, -93608, -115093, -115728, -104592, -82784, -47286, -12431, -3255, -508, 2639, 3932, 3105, -2071, -1618, -32190, -43080, -23382, 8927, -3331, -7937, -1514, -1107, -5192, -1421, 6192, -34789, -51616, -31544, 6185, 10662, -10896, 3926, 4198, 492, 8318, 13529, 11501, 7619, 12708, -3157, -33757, -58694, -60044, -41223, -18637, -6032, 223, -3898, 1603, 14156, 5440, -2746, 10980, 2593, -3740, -885, 10113, -8130, 1621, -24103, -12806, 6941, 3645, -8568, -4757, -341, 9460, 4760, -8039, -31702, -30490, -7092, 3120, -1368, -6971, -5042, -37877, -119307, -71985, -21970, -6257, -18533, -45967, -61698, -53444, -41529, -37599, -31670, -8960, -1678, -9788, -11681, -9552, -6421, -14870, -63343, -101746, -120313, -120920, -114685, -98762, -78119]
110g8119K1406J8457J1835L63j3955k5383k0739L623J2304M820Q129b6169h125
96h962K2G990j14i581M667A207i059N68I29R580b1652A3265b6201k9437J744K0328
80c3566J3249l878j7701j3060J8473A056c505j235A564a230j9688l1383j4858
67f7159R397K5674e757j760L321l132K992q188c21A1239L35m672A133M691N853
52A1677h596j4203J193R095M151j0127k6356l6185k9218J7051L5970b4886eE166
37a503r56j8697j0382L162Q101N238J369J239p23o780j6068k5302k8566j5063
23a04931J4385K2936J7550J0286O441Q685g787a067F232g1A452J0471k475B263
8C773n72E4L995i185c46H14c487j7573
$$ y = [-78119, -56713, -38256, -26421, -26058, -40013, -65396, -86135, -82512, -70208, -65388, -57259, -26169, -8125, -8962, -8940, 7990, 7876, -9581, -4914, 1207, -9059, -8491, 929, 10509, -21652, 13265, -26201, -55638, -53894, -33566, -20317, -24195, -41896, -54956, -36483, 1056, -3505, -4740, 1564, -1230, -20918, -52301, -67159, -57762, -32088, -5757, -7517, -4196, -7328, -4336, -12524, -321, 11239, 11574, 6902, 1133, 5824, 11677, -8596, -22799, -21606, -12511, -8360, -18487, -44843, -81028, -110246, -93195, -57225, -24886, -5, 5166, -1503, -2459, -21156, -31538, -28376, -20275, -15037, -13668, -12429, -13152, -19932, -36000, -61302, -89868, -104931, -90546, -67610, -50060, -39774, -33333, -24648, -7787, -1067, 6232, -71, 1452, 11923, 9448, 2263, 3773, 3201, 54, 4049, -9185, -346, 814, -3487, -21060]
0b1060
$$ y = [-21060]
##PAGE= F1=1042.827554713
##FIRST=     2908.11359968662, 2642.9191468254, -9924
##DATA TABLE= (F2++(Y..Y)), PROFILE
1023i924j0676J451e532G599A270d217C051J78D94g201L125L75m40A445R78J02
1007B525d039A820L18c979p436M597E264g21C061P528k683b667K68k620j3489
992a8508l196P581O351m289c992k685k684l490k135l53N73L53J02k57J88k49P49
975a3880K942M634l484B46O4c407p925d524D829K429d758I256f400M5C686a324
958i334l214L23J773K160k411k74n704j241l172J484K483K18J021L794e378A928
941G30h570c936l120p192r533o977M816M866L447K429K937L83N290m636c842a041
924d808q390j0352l947J1299d627J020l492Q20F468B077c988j194j0315r445k679
909b7621O530P944d760J429F548N888m684b799B928e764q210L43O668E28a575
$$ y = [-9924, -20600, -19149, -5532, 7599, 1270, -4217, 3051, 3229, 494, -7201, -4076, -3701, -4141, 1445, 2423, 2525, -4039, 1820, 2138, -3979, -11415, -6818, 5264, -721, 3061, 10589, 7906, -2667, -2399, -5019, -18508, -21704, -14123, -7772, -12061, -3992, -6677, -9361, -12851, -14986, -15339, -14766, -14413, -14311, -14568, -14380, -14629, -13880, -10938, -6304, -9788, 246, 310, -3407, -11332, -4524, 4829, 7258, -4758, 9256, -6400, -6355, 3686, -1324, -9334, -12548, -12225, -10452, -8292, -10703, -10977, -16681, -17922, -21094, -19610, -17127, -16909, -15888, -12094, -5378, 1928, 730, -8570, -3936, -7056, -14248, -23781, -30758, -25942, -21076, -17629, -15200, -12263, -11880, -6590, -11226, -3842, -1041, -4808, -13198, -23550, -27497, -16198, -4627, -3607, -7099, -6279, 6468, 2077, -3988, -5182, -15497, -24942, -27621, -21091, -13147, -4760, -3331, 6548, 12436, 7752, -2799, 2928, -5764, -13974, -13631, -6963, 528, -1575]
893f623h64A0943m499C104Q94K228d856n133R32J772k004L153b795F475N007J320
877A2802h68p177l189a348B199O15M078a142n570l236M393a461m471r5j3663r654
861b9344e475f98D305b290a066A1003B592J825g149L524A1387O123H736M68f848
845a5718d289G348A672b047r64j537j446K497B046O435M857D432g705o786m61
830a4952K147J380q3j113j357o68J357K527K595o413O592K200k098k865k463k609
814a5823k421m75j2497J3606i31C695h688F362O3J547e539j652e89b63r29o725
798g917q69b46l251o113b471D369O209j039J638l202A960c357C909A028a318C7
781D119M980L893D100d857j66R23l612b771C750c552a695o7j4957m434d645k877
$$ y = [-6623, -864, 10943, 6444, 3104, 3998, 6226, -4856, -9989, -9057, -7285, -9289, -6136, -2795, 6475, 11482, 12802, -868, -8045, -11234, -1348, 2199, 2814, 6892, -1142, -6712, -9948, -5555, -1461, -5932, -6027, -19690, -29344, -5475, -698, 4305, -2290, -1066, 11003, 2592, 4417, -7149, -3625, 11387, 17510, 8736, 9204, -6848, -15718, -4289, 7348, 1672, -2047, -3011, -4548, -5994, -3497, 2046, 8481, 13338, 4432, -7705, -14491, -14952, -12805, -11425, -11508, -12621, -13978, -14646, -13289, -10762, -8167, -14580, -7988, -5788, -7886, -10751, -13214, -15823, -18244, -18719, -31216, -17610, -931, 3695, -8688, 6362, 6425, 7972, -5539, -7191, -589, -263, -1192, -7917, -8786, -246, -3497, -9610, -2471, 4369, 10578, 9539, 11177, 7975, 1960, -3357, 3909, 1028, -1318, 37, 4119, 9099, 12992, 4100, -4857, -5023, -4100, -7712, -2771, 3750, -3552, -1695, -1762, -16719, -21153, -4645, -7522]
765g522Q83b255m825c208o22n833k593o64o97j607k130M08N184d122A854J539
749C393h931l174j1863K328h625B210e37j962p680M974l251k063l071m905k372
734b0867N880c727I28d791k00B751a199j0768L925a575E172R070L960H039a368
718I21b441k514a156o320j0276j3702K548i942E698N364c269j044a487p396a599
702f726J750l271b647m208o698o501n204j797M190Q272e409A314M436a1818A0980
686B546a115D928h301B251f163n619j381Q42P67R31K292L203b32C278L793c099
669b174A1917b113k16c41m531j047j3l300l421K423a201A1842E670d630j3918
654a8548j4532K393J5211a318I606j840e203A316e914l474d539A719d850r094
$$ y = [-7522, -6639, -2255, -7080, -3208, -3830, -9663, -12256, -12920, -13617, -15224, -17354, -16946, -11762, -4122, 1854, 3393, -8931, -12105, -23968, -21640, -8625, 2210, -537, -2499, -10179, -5205, -8456, -10519, -13590, -18495, -20867, -14987, -3727, 928, -4791, -4991, 2751, -1199, -11967, -8042, -1575, 5172, 14242, 18202, 8039, -1368, 921, -2441, -4955, -1156, -7476, -17752, -31454, -28906, -9942, 5698, 11062, -3269, -4313, -1487, -8883, -1599, -6726, -4976, -8247, -2647, -6855, -13553, -20054, -25258, -27055, -22865, -14593, -5409, 1314, 5750, -11818, 10980, 2546, -1115, 4928, -8301, 2251, -6163, -11782, -13163, -12321, -11554, -10623, -8331, -5128, -232, 3278, 7071, -3099, -2174, 11917, -2113, -2329, -341, -4872, -5919, -5932, -9232, -12653, -10230, -1201, 11842, 5670, -4630, -18548, -33080, -30687, -15476, -1318, 9606, 7766, -5203, 1316, -5914, -9388, -4539, 1719, -4850, -13944]
640a3944c445e93m808B304N835k098E33d890k962r202L97l044l3544m0170M5271
625d8144K1448N53J363J392R8j674k969l057L28N429N429K608j649n281m156L679
609b4603P793N918K074p23j850j293j141l167n218k135P102d740E656A798b153
593A652L863a777k626J90j420m270M263C051K12c558J440m585l609p832j1709
578b9853r056J5190J1052L101o127j4219n005a4902g89p724F869P55g318AK246
563B247d874m634O34L404K071m7m99B512N630A671f726A041L68b526m790k379
547i695q32k090l537j945J903O200b460D144L630O45j526j743a1915c542F543
531A591e762B137f23F11L588A931L635M826b520l923j0n81p3G87P105a0302b910
$$ y = [-13944, -3445, -593, -5401, 2304, 8139, 6041, 533, -4890, -7852, -17054, -16657, -19701, -53245, -93415, -48144, -26696, -26143, -24780, -23388, -23290, -24964, -27933, -30990, -30662, -25233, -19804, -17196, -18845, -24126, -28282, -24603, -16810, -10892, -8818, -9541, -11391, -12684, -13825, -16992, -22210, -24345, -17243, -4740, 5656, 1798, -2153, 1652, 5515, -1777, -4403, -4213, -5633, -9903, -5640, 3051, 3263, -3558, -2118, -6703, -10312, -18144, -29853, -38909, -23719, -12667, -9566, -15693, -29912, -34917, -14902, -789, -8513, 6869, 7624, -7318, 1, 2247, -4874, -9508, -8874, -5470, -3399, -3446, -3945, 2512, 8142, 1671, -6726, 1041, 1409, -2526, -7316, -9695, -10527, -12617, -16154, -18099, -16196, -9996, -2460, 4144, 7774, 8419, 6893, 5150, -11915, -3542, 6543, 1591, -5762, 2137, -623, 611, 4199, 1931, 5566, 10392, -2520, -6443, -6453, -7034, -7107, 787, 7892, -10302, -2910]
513d615C69i182j38j426p398m81j414o159j1110P826a2903B506Q295e085D776
497A7168m748A732e072l646G518A749c938J801I054l252d659q746k888K300K050
482a1943k339o811j0514n879J0793Q790M839J146J358j458K937J174L136q92C427
466D799a2769j3345a2004D737J66g903C271h71m535l348l121j3127j5372J9394
452b0980b893p682b300E161A810J0966n229F36a726m740b563r219j0514p554k179
437c2029r01j239L182P255O680L725J615K422c972B404M081m24A574f81D940J1938
421A6878J628a2367d017C289A387b499A13g604k164M796j2908j6485P134a2299
406d030l643L154p480k724N819L364d9k850n711l738q69N19q81k8K259K924K183
$$ y = [-4615, 369, -9182, -9320, -10746, -18144, -18625, -20039, -26198, -37308, -29482, -12903, 2506, 10801, -5085, 4776, 17168, 12420, 1732, -5072, -8718, 7518, 1749, -3938, -2137, 9054, 5802, -4659, -13405, -16293, -13993, -11943, -14282, -21093, -31607, -37486, -26693, -17903, -13064, -11918, -10560, -12018, -9081, -7907, -4771, -5663, 3427, 4799, -12769, -26114, -12004, 4737, 4903, -7903, 3271, -871, -5406, -8754, -11875, -25002, -40374, -20980, -2893, -10575, -2300, 5161, 1810, 12776, 7547, 636, -1726, -6466, -2563, -11782, -22296, -29850, -32029, -32930, -34169, -30987, -23732, -17052, -13327, -11712, -9290, -3972, 2404, 6485, 6061, 1574, -681, 4940, 16878, 18506, -12367, -4017, 3289, 1387, -2499, 113, -7604, -9768, -4972, -17880, -34365, -27231, -12299, -4030, -7673, -4519, -11999, -14723, -8904, -5540, -49, -2899, -8610, -12348, -13217, -12698, -13579, -13607, -11348, -8424, -6241]
389f241k34k249k642k919j081M535a280k675J789o373c627n294E329J488G55M329
373E084O189A120h257j0549p961P765d344J24r230e455K447E559P443c879j9985
358b3864n625a0933B200d790o314A2813K9310J2705r937j4671A4757f646k0532
345b7178n76g506C275d480K087j666A036M316B198k54a0413A0132J470k813k762
330F027g403j7131p00i205d107j6117l281i909l191j517c453C0071i027B5286
315B3728K6317p839K782O2874j2928J09277L998H6478R52467J4043528K2437574
304C7520047J5839544J361629j3993545H744027B689326B84153n253r9028k9769
295A50103C8648A4351P394h327D47a191H71K3300c152I828d253J674D564e827
$$ y = [-6241, -6475, -8724, -11366, -14285, -15366, -10831, -1280, -3955, -2166, -8539, -3627, -8921, 5329, 6817, 755, 5084, 11273, 1120, -8257, -18806, -26767, -19002, -4344, -4220, -13450, -5455, -3008, 5559, 13002, -3879, -23864, -29489, -10933, 2200, -4790, -11104, 12813, 42123, 54828, 44891, 30220, 14757, -6646, -27178, -27754, -7506, 3275, -4480, -2393, -4059, 1036, 5352, 2198, 1944, -10413, 10132, 11602, 8789, 6027, -7403, -24534, -25234, -9205, -4107, -20224, -23505, -9909, -13100, -14617, -3453, 30071, -9027, 25286, 23728, 50045, 42206, 44988, 107862, 94934, 204211, 208209, 86478, 1038945, 15082473, 37520047, 53359591, 54721220, 40727675, 8744027, 2689326, 284153, 278900, 179872, 150103, 38648, 14351, 21745, -8327, 447, -1191, 871, 24171, -3152, 9828, -4253, -2579, 4564, -5827]
280d984D495K251a08n412A149g058n618j325d606A029M946g724p67A634K238i07
263b411N91R01C838P22j321a606l982m374o257l392j877k118R99J362K984Q174
247a0087B82J0242l089k667a421q675d414j7484q505J3121f485m746d859o421
233a1280n77n693m249l171k203k240k576J237N159M675K997P3k422l924m802m542
217c3538r29J31m20o0O03J079M057P066Q155e606K775o361j26c575F96K198K16
200C110b445E386Q326D711K547P8c931m147a127o94m538c117i22m157B101K450
184D551J025q85a2101a396j49J35a4o64B637K893M08B550g88l845j178l897J297
167h411q41K283K927D65Q917B790b663I740A749b158A867B26f851j797K946p644
$$ y = [-4984, 4495, 6746, -108, -5520, 1149, -7058, -12676, -14001, -4606, 1029, 5975, -7724, -8491, 1634, 3872, -907, -2411, -1820, -919, 3838, 4560, 3239, -1606, -5588, -9962, -16219, -19611, -21488, -23606, -22607, -21245, -18261, -10087, 282, 10524, 7435, 4768, -1421, -10096, -4414, -21898, -30403, -17282, -6485, -11231, -4859, -11280, -11857, -17550, -21799, -24970, -27173, -29413, -31989, -30752, -25593, -20918, -17921, -17848, -20270, -24194, -28996, -33538, -34467, -34336, -34756, -34816, -34213, -33134, -29077, -22011, -13856, -5606, -2831, -9192, -9318, -3575, 696, 2894, 3110, -2445, 5386, 13712, 4711, 7258, 7336, -3931, -8078, -1127, -1821, -6359, -3117, -922, -5079, 2101, 4551, 5576, 4691, -12101, -1396, -1545, -1410, -14, -678, 2637, 5530, 5938, 2550, -788, -4633, -5811, -9708, -8411, -9252, -6969, -4042, 465, 9382, 2790, -2663, 9740, 1749, -2158, 1867, 226, -6851, -8648, -5702, -13346]
151a3346I178C790g923L873a352H807C508g809r676J819M603e311a128J95B181
135A632c91E203O278h042A1152l820m09a818p783d269F615N455D486a1461J299
120a0162J078M129B341a9184q885O924K939k772l726P19N074N492M494J902j926
105h949o626r343r681o59P103J0077d268q692K306e150A1712k604a1246c224B535
89b256m581c037A2422b8470d15r553l479L822b085C446c181l841q068j1894n029
74c2013M668L745J97k100k602k837k339k610k35Q367J3203M994k849e914n330
59a1244b773A1989L99m696k907J128o93b910J237k454a524A255J0217i66r855
44a0821j609j4110j1223J1450J2888b596H04R803J250k935B048g835j1095r716
$$ y = [-13346, 9178, 3790, -7923, -4050, -1352, 8807, 3508, -7809, -17485, -15666, -11063, -5311, -1128, -933, 2181, 1632, -391, 5203, 11481, -8042, 11152, 7332, 6923, -1818, -9601, -4269, 6615, 12070, 4486, -11461, -10162, -9084, -4955, 2341, -19184, -28069, -21145, -18206, -20978, -24704, -23985, -18911, -13419, -8925, -7023, -8949, -15575, -24918, -34599, -35258, -28155, -18078, -4268, -12960, -10654, -5150, 11712, 9108, -11246, -3224, 2535, -2256, -6837, -3037, 12422, -28470, -415, -9968, -13447, -9625, -2085, 3446, -3181, -7022, -15090, -26984, -32013, -27345, -23600, -23403, -25503, -28105, -30942, -33281, -35891, -36126, -27759, -14556, -9562, -12411, -5914, -11244, -2773, 11989, 12388, 7692, 4785, 5913, 5220, -2910, -1673, -4127, -1524, 1255, 11472, -966, -10821, -12430, -26540, -37763, -26313, -13425, -2596, 804, 10607, 11857, 8922, 2048, -7835, -18930, -28646]
30b8646j82P804Q527e863b112O41k649m917m733l34N199R05D159K354G03O678
14G381I85a99I977j618D168J756B329j49M68h670M188L5o494q923
0a9864
$$ y = [-28646, -28828, -21024, -12497, -5863, -2112, -1471, -4120, -9037, -13770, -14104, -8905, -8000, 4159, 6513, 703, 7381, 985, -199, 9977, 8359, 4168, 5924, 2329, 2180, 2648, -8670, -4482, -4447, -10941, -19864]
##PAGE= F1=1040.244056036
##FIRST=     2908.11359968662, 2642.9191468254, -8281
##DATA TABLE= (F2++(Y..Y)), PROFILE
1023h281g02k288m530j19g54m587b506C247c812j2593J247d295j415f56B124c474
1006i667K124A950a0577N113J858H184c138F19J0495l525c598a5E496e790i80
990G57b338r467A204h705C903i323H215L08G79h485j0764L895f568o32K212o175
974a1163o608J875L780k12m778r32P979D742J85a687A1819c160m589A414a2886
958b1926J0089L358L787q669d836J5j4902a906B113b322E392c834n36k152r84
943g506A687d264J442h04l622a853A758c450n562m351M80M116L963o245M474l997
927a0572n892l092L42n01l074O54O941N921K796j625m531l121L901e478a287B65
910B28J630J188J289j610e213B202Q910l344H4J1812b111r20B903f895R4c266
$$ y = [-8281, -702, -2990, -7520, -7639, -754, -5341, -2506, 3247, -3812, -16405, -15158, -4295, -5710, -656, 2124, -3474, -9667, -7543, 1950, -10577, -5464, -3606, 8184, -3138, 619, 11114, 7589, -3598, -15, 5496, -5790, -980, 757, -2338, -11805, 1204, -8705, 3903, -9323, 8215, 8523, 779, -8485, -19249, -15354, -6568, -7200, -4988, -11163, -17771, -15896, -12116, -12328, -17106, -18038, -10059, 4742, 4927, -1687, 11819, -3160, -7749, 1414, -12886, -21926, -11837, -8479, -4692, -13361, -4836, -4821, -19723, -1906, 2113, -2322, 5392, -3834, -4370, -6522, -7506, 1687, -4264, -2822, -804, -4426, -1853, 1758, -3450, -9012, -13363, -12883, -8767, -4804, -11049, -6575, -10572, -16464, -19556, -19214, -19715, -22789, -22135, -15194, -9273, -6477, -8102, -12633, -15754, -11853, -5478, -1287, 265, 228, 1858, 3046, 4335, 2725, -5213, 2202, 11112, 7768, 84, 11896, -2111, -3031, 2903, -6895, -6801, -3266]
893e407f06A967c379n935j771M213a060j527q344Q65J032j949D038R403J873k314
877A3000F093f428J73j452l015j115j106k507p81L818c712C605h209C383e722
861a7911K944a285N65l322J112H500F92J836R987O11k572D759c865r674r738K509
845b0768P898N608K636n085b647m34o635c819D086A175d005l170Q88M26K543j594
829d912l728m290k767L71K905P62K102K795q174O933c135l141k070m85m45m67
813i743p630k7488J6356D52K978f248F970M64j25g291m08g16j097r138r945j330
797b2226P574N135J218j367n225o521k326O540N038K696L93j437P33d276D582
781E470K533M256G32e437R43J399m165l196n596k277N257e423k050N94n48j129
$$ y = [-5407, -606, 1967, -3379, -9314, -11085, -6872, -1060, -2587, -10931, -10066, -9034, -10983, 4038, 13441, 15314, 13000, 6093, -6428, -6255, -7707, -10722, -11837, -12943, -15450, -16231, -12413, -3712, 3605, -8209, 3383, -5722, -17911, -14967, -1285, -720, -4042, -2930, 8500, 692, 2528, 12515, 13126, 10554, 4759, -3865, -13539, -23277, -20768, -12870, -7262, -4626, -9711, -2647, -3081, -9716, -3819, 4086, 1175, -4005, -7175, -6287, -5861, -3318, -4912, -8640, -12930, -15697, -15326, -12421, -11659, -9557, -6762, -14936, -8003, -3135, -6276, -8346, -8831, -9276, -9743, -17373, -44861, -28505, 452, 3430, -6248, 6970, 7434, 7309, -7291, -7699, -716, -1813, -10951, -20896, -22226, -14652, -9517, -8299, -9666, -14891, -21412, -23738, -17198, -12160, -9464, -9071, -10508, -9775, -4276, 4582, 5470, 8003, 12259, 732, -5437, -4494, -3095, -7260, -10456, -16052, -18329, -13072, -5423, -7473, -6879, -7427, -8556]
765h556j338d539o75K279A1057m898h938J721m62b371l112l660A573O311k836
750E048A136f872c166n333c64F703j06B584d047q587n433N156d552B028f200k274
734h474B122n75J588J21r73L242k70B199d187Q99D534N235N758A754b328C421
717B00i167I944O081n503l882D72f814C961K114d978p43A526d212j69f96E829
700e352K090m711F1J0100A741g465O07J898j09J500k99q306N791p07K52q6j359
683h283r12K412l01K191k412j200a188G99d211E90d10G070h22J37j096o680o702
666a5163n639J231P094e049O15k345k520b227A3835K221m614B089a002r099K761
651g340c026I965k006e803A758c954p714N483D474d142q775d665K038k010l210
$$ y = [-8556, -9894, -4539, -5214, -2935, 11057, 6159, -8938, -7217, -7679, -2371, -5483, -9143, 1573, 7884, 5048, 1136, -6872, -3166, -8499, -364, 6703, 6597, 2584, -4047, -12634, -18067, -12911, -4552, 2028, -6200, -8474, 2122, 1547, 3135, 3256, 2283, 5525, 5255, 2199, -4187, -3288, 4534, 9769, 15527, 1754, -2328, 3421, 200, -9167, 9944, 16025, 10522, 6640, 472, -6814, 3961, 6075, -4978, -5721, 1526, -4212, -4381, -696, 5829, -5352, -3262, -7973, 61, 10161, 1741, -7465, -6858, -4960, -5069, -3569, -3868, -12174, -6383, -7090, -6838, -6924, -8283, -9195, -6783, -7084, -4893, -7305, -8505, -1188, 799, -4211, 590, -410, 7070, -822, -685, -1781, -8461, -15163, -20802, -19571, -12477, -5049, -4434, -6779, -9299, -2227, 13835, 16056, 11442, 2089, -1002, -10101, -7340, -3026, 9965, 7959, -5803, 1758, -3954, -11668, -6185, 4474, -4142, -12917, -4665, -2627, -4637, -7847]
636g847m284l439J941L531L823j5276O322a408n1542m6467M3140a468K40k719
622c947m383n687m703K006N472L652N60l588o099K09P671K674b152C758J880K837
606H475L591j060E275K006@g755o027l528p70J661M120N644a72E850c391k783
590f174K840j438q335N808A733a01l411B299f607r488p174R811d453A443J809
575C252b680o88l101J195a426A236h854D771k105i076L236o452q295J990Q114
560a0483e051K343l44j50D66J339C71f296o880N1a985K57A809l85d258p724p367
543a9349g525C509P677r83j653F57M70i285j0608K15O876N799k20C0R97K158j429
526A756D03J156N460a530l851P4P57m424D793N208f370A04b388D273g82j0876
$$ y = [-7847, -12131, -15570, -13629, -10098, -6275, -21551, -15229, -1408, -52950, -99417, -56277, -1468, -1228, -3947, -8330, -14017, -18720, -16714, -11242, -7590, -7030, -10618, -16717, -16508, -8837, -6163, -2152, 3758, 5638, 8475, 12066, 11006, 5275, 7281, 0, -7755, -13782, -17310, -18080, -16419, -12299, -6655, -172, 5850, -3391, -6174, -3334, -4772, -13107, -7299, 1733, -101, -3512, 2299, -6607, -16095, -23269, -13458, -4453, 1443, 3252, -2680, -3368, -6469, -5274, -1426, 1236, -8854, 4771, 2666, -9076, -5840, -12292, -20587, -18597, -10483, -5051, -2708, -3052, -3202, 466, 1805, 371, -6296, -13176, -13125, -1985, -1728, 1809, 1424, -4258, -11982, -19349, -7525, 3509, 11186, 10203, 8550, 657, 1127, -9285, -19893, -19678, -12802, -7003, -7223, 30, 1027, 3185, 1756, 403, 1559, 7019, -1530, -5381, -5307, -4550, -8974, 4793, 10001, -6370, 104, -2388, 4273, -782, -11658]
510a1658G62P950A21b316A6294n242c292E06c828l509j22L79j424l230k81N956
494f059j654F855A439a256C790j598h529n247L234K982r26m864o760M541N749
479i820M326a462C516M591K352C696g920M32J57b725l370p269N713g10p345D564
462I131B745g298C964j826a080l478L08G759j013i026b079o559L367A315a2206
446a1288c494g63l458p84b294B246e091a938M36m516j957m91J265L459f11B837
429E536Q59j623A079c886n660m712l939j202K958M189L453J879L72j370k198k676
413a2792j587o7J856J405c984G36b391r133c787B509c379o682n196j236K973K596
397a0924J633k77n69q37K052J259k69P82G95O11J0808e712K506q703l349M439
$$ y = [-11658, 762, 8712, 121, -2316, 16294, 11052, -3292, 506, -3828, -7337, -7459, -7080, -8504, -11734, -12015, -6059, -7713, 6855, 1439, -1256, 3790, 2192, -8529, -13776, -10542, -7560, -8486, -13350, -20110, -15569, -9820, -5494, -1462, 3516, 8107, 10459, 3696, -7920, -7488, -7331, -2725, -6095, -13364, -7651, -710, -8055, 4564, 9131, 2745, -7298, 3964, 2138, -1080, -4558, -4250, 7759, 6746, -9026, -2079, -8638, -5271, 1315, -12206, -11288, -3494, -763, -4221, -5005, -2294, 2246, -5091, -1938, -1502, -6018, -7975, -8466, -7201, -3742, -611, 2837, 5536, 6395, 4772, 1079, -3886, -9546, -14258, -18197, -19399, -16441, -12252, -8799, -6920, -6548, -7918, -10116, -12792, -14379, -14446, -12590, -11185, -3984, 736, -2391, -11524, -3787, 2509, -3379, -10061, -15257, -16493, -13520, -10924, -9291, -9568, -10137, -10974, -8922, -7663, -7932, -7150, 795, 1406, 12214, -5712, -3206, -11909, -15258, -10819]
381a0819K754j884k13l087K873c411B050L210L943D480h486l680C474n40g178
365a0810N235K629k047j140l13J004K227k664l341i62k885o613C168J011K40j051
349C368A147h12j777O11G42J781N45d241R75n845n905m896k650R39j547J411N816
332a5943N291L449m558c52C60J842L27c270m450J286J487k840c265I261f542A3535
315A2860A743a1882B1114J8664D615O4269R076o398R4643K927623M244002L600127
303A0937957O07472k801402m306442A089879B23082m5041E444B238L3336I789
292C50c196j2405K107Q25e490J21K407B01d997B461a056m810j64d52C019f400
275A132d087N85i01o48D849R692e222n666i25F812o04g733j1219i006B710J945
$$ y = [-10819, -8065, -9949, -10162, -13249, -10376, -3411, 2050, 5260, 9203, 4480, -8486, -12166, 3474, 2934, -7178, -10810, -5575, -2946, -4993, -6133, -6446, -5442, -3215, -5879, -9220, -962, -3847, -10460, 3168, 4179, 4419, 3368, 1147, -812, -2589, -1978, 742, 2523, 3068, -4241, -3266, -9111, -15016, -19912, -22562, -21623, -23170, -21759, -15943, -10652, -7203, -11761, -352, 360, 2202, 2529, -3270, -7720, -6434, -4947, -7787, -3265, 9261, -6542, 13535, 12860, 1743, -11882, 21114, 39778, 4615, 68884, 77960, 71562, 166205, 3093828, 7337830, 10937957, 11545429, 8744027, 4437585, 1089879, 223082, 178041, 5444, 2238, 35574, 9789, 350, -3196, -15601, -13494, -12669, -5490, -5369, -2962, 201, -4997, 2461, -1056, -5866, -6030, -452, 3019, -6400, 1132, -4087, -3502, -901, -1549, 4849, 14541, -5222, -10888, -925, 6812, 6208, -7733, -18952, -9006, 2710, 4655]
259D655R51N272k001J0576q663k684L145g53o898C660d803j783I11L126m43J0
243C604c62o383E82f894o320O17N440L9K318k377F120D69J2a467A4743J828D053
225h963m662k945O079J498L321A6217O966G384g511a875j551p248r426M479g394
209b766M11k184l283k620j690N814A61J865J705f61D918e035j4394Q017D549d110
192g648d32o58m737l247j037B864J94b763R54g48j1554e461J537J296E891P75
176F666C137c644n296d420P77n996m34K433J175K946o303n858M655d370A03b869
159g6l760k986J034b521l93j013k895k478I100C214f041b329J43D002g211r044
143a6255J806g190a383B305a078B654N092j390c646q306K951O69E508L000l722
$$ y = [4655, 5606, 10878, 8877, 19453, 10790, 8106, 11251, -753, -7651, 3660, -4803, -6586, 911, 4037, 3594, 3604, -362, -6745, 582, -6894, -13214, -12597, -7157, -7118, -4800, -7177, 6120, 469, 481, -1467, 14743, 16571, 4053, -8963, -13625, -16570, -10491, -8993, -5672, 16217, 23183, 7384, -7511, -1875, -3426, -10674, -20100, -15621, -7394, -2766, -2355, -4539, -7822, -10442, -12132, -6318, 161, 2026, 3731, -661, 4918, -5035, -19429, -11412, 4549, -4110, -7648, -432, -1090, -5827, -9074, -10111, 2864, 3058, -2763, -1809, -748, -12302, -5461, -3924, -2628, 5891, 6666, 3137, -3644, -8940, -4420, -3643, -9639, -10073, -7640, -6465, -3519, -9822, -15680, -11025, -4370, 103, -2869, -76, -3836, -6822, -5788, -2521, -2914, -3927, -6822, -9300, 9100, 3214, -6041, -2329, -2186, 4002, -7211, -16255, -14449, -7190, -1383, 2305, -1078, 2654, 7746, 6356, -3646, -11952, -9001, -8332, 5508, 8508, 4786]
128D786c474J114n908a273n416p160n607K328N617M157c641F30K098c723o360
113a0083R19a318C867a841n448m818n981l613P091M644J247K256J326m181l889
98a3207k89K694K918J221j759m861o086J54Q723b174o468G817a8112i037A751
82h876Q35m47d34o625L08b884B341c50n569l155b775n007l572c851B080D09c614
64h870o25k335l595n017R345d863B054R36C4e203n412j991J049Q93Q99J578L182
47e005a976f74j0580k30J836p935J608g777L455B20h11k112j298k88j49l578f99
29c902o640c13C614p34a0I837R413m622n091I64f117l002K193A257O541A275a141
11G346j521j297D82a83B797ph999j92L426k355K171
$$ y = [4786, -3474, -2360, -8268, -1273, -6689, -13849, -19456, -17128, -11511, -7354, -3641, 630, 2728, -3723, -10083, -9164, -1318, 3867, -1841, -7289, -12107, -18088, -21701, -14610, -9966, -8719, -6463, -5137, -9318, -13207, -13496, -10802, -7884, -6663, -8422, -13283, -19369, -19215, -10492, -2174, -8642, 7817, -18112, -9037, 1751, -8876, -8041, -8488, -434, -7059, -6751, -2884, 2341, -350, -5919, -9074, -2775, -7782, -11354, -3851, 2080, 409, -3614, -8870, -9495, -11830, -15425, -20442, -11097, -4863, 2054, 2990, 34, -5203, -10615, -12606, -11557, -10664, -9765, -8187, -5005, -1976, -674, -11254, -11484, -9648, -17583, -15975, -7777, -4322, 220, -811, -2923, -4221, -4509, -4658, -8236, -699, -3902, -10542, -313, 3614, 2880, -10, 9837, 19250, 14628, 9537, 964, -6117, -9119, -6926, 1257, 7798, 1275, -1141, 7346, 5825, 4528, 482, -183, 2797, 2790, -8999, -9191, -5765, -8120, -5949]
0e949
$$ y = [-5949]
##PAGE= F1=1037.660557359
##FIRST=     2908.11359968662, 2642.9191468254, -6725
##DATA TABLE= (F2++(Y..Y)), PROFILE
1023f725D819b920o887L009A340f665j764A789g307m282c496B007d357a966P61
1008a205C91f443F95b234j1686A889a853I795d242a183k498r668j244f644C49
992a860A704a974m459n932n351m677n31J643m24K908Q424J071K920C974J500g039
975b853m009B29g791c409B449g077r056g418G595G53d78A0047c165k744A342f35
958a3337n107K592j43m725J892g659o839d102D040i526F158D4h848p828j102L197
942a4581J927L79J061L089K341J40m621q354j411h640A588b970p277L643k930
927i534K319p384n988l142P202f656A45Q185b187o029Q51I805q24E50L578N478
911I606m714A142J443L303k646f517c137H528j556l215J1760f743F702L6i654
$$ y = [-6725, 4819, -2920, -9807, -6798, 1340, -6665, -8429, 1789, -7307, -11589, -3496, 2007, -4357, -1966, -1205, 391, -6443, 695, -2234, -13920, 1889, -1853, 9795, -4242, -1183, -3681, -13349, -14593, -6644, 349, -1860, 1704, -1974, -6433, -12365, -17716, -22393, -22924, -21281, -21705, -18797, -10373, -9302, -6382, 3974, 5474, -7039, -2853, -6862, 229, -7791, -3409, 2449, -7077, -16133, -7418, 7595, 753, -478, 10047, -3165, -5909, 1342, -635, -13337, -18444, -15852, -15995, -20720, -18828, -7659, -14498, -4102, 4040, -9526, 6158, 44, -8848, -16676, -17778, -14581, -12654, -12275, -11214, -8125, -5784, -5644, -10265, -18619, -20030, -8640, 1588, -2970, -10247, -6604, -9534, -7215, -14599, -20587, -23729, -16527, -6656, 145, 8330, -2187, -8216, -7365, 9805, 8981, 550, 4128, 9606, 4892, 1142, 2585, 5888, 3242, -6517, -3137, 8528, 6972, 3757, 15517, -6743, 6702, 6738, -9654]
895h761o799j525Q19r69l046j848M418N846M747L060k306m573J826K215J581q87
879f202J464a565B462b077Q77C484b584p230k267e081i60o091F805Q371d845A780
862f533K25l3f57m798j718K254D537b483d86J4B24e99l603o475p032j532O176
845a3065N106L138J599m831E53c317r129c194D119a822l676B086O474f384C286
829F520g25p414o358k376M800J56K902L854q874N125c508o3G24a705l816j738
813g259j8802l7320J5645H98a52j433k518k977k778k868k285l77K392L845M411
798d740i35n405n919N186L172j357l323j138J797J397m25k536k777J066N077b35
781C640J868n84g22k044a020k65n303J927n133l719Q64K540d211l127j775N95
$$ y = [-8761, -15560, -17085, -16266, -17235, -20281, -22129, -17711, -11865, -7118, -4058, -6364, -10937, -9111, -6896, -5315, -6202, -4738, -1565, 2462, -2077, -1200, 3484, -2584, -9814, -12081, -5081, -960, -7051, 6805, 15176, -4845, 1780, -6533, -6308, -6341, -657, -5455, -7173, -4919, 4537, -2483, -486, -472, 224, -599, -4202, -10677, -17709, -19241, -13065, -7959, -4821, -3222, -8053, 553, -3317, -12446, -3194, 4119, -1822, -5498, 2086, 8560, -6384, 3286, 6520, -725, -8139, -14497, -16873, -12073, -11917, -9015, -5161, -14035, -8910, -3508, -3571, 724, -1705, -5521, -7259, -26061, -63381, -47736, 898, -152, -1585, -4103, -7080, -9858, -12726, -15011, -15388, -12996, -9151, -4740, -935, -6340, -12259, -7073, -3901, -5258, -8581, -9719, -7922, -6525, -6950, -9486, -12263, -11197, -6120, -235, 3640, 5508, 4924, -722, -2766, -1020, -1285, -6588, -4661, -9794, -13513, -12649, -10109, -4211, -7338, -9113, -8518]
765h518j861a985j352j206F127N340i224J998m264d885j62j938C065O840M977
750A4882p175f106e15n044r68B992a94m721m214m108m293n282O611P720k731b921
733E795A215K366a584n167j904K664h32B309B77O192j801O488b435j685C075n11
717B564h570A0491R517H718C848e97l564I088l449e536k525q760m172P398N945
702g650c379a567m425m793g28B04c039n460J409q57j290l382l308Q09M041M100
686f977K995J915o695h90l441M51J17m421j291M435J962N03G24d452C020b777
669i604m538N57M029d134l769O28a226B318A76d694J714A2648J128k684B305n40
653A765j9a597l018G631K5d835B930a369j0501N295G713b292q828N200b365j03
$$ y = [-8518, -10379, -1985, -3337, -4543, 6127, 11467, -9224, -7226, -11490, -4885, -5047, -6985, 3065, 9905, 14882, 7707, -6106, -515, -5559, -6527, 2992, -194, -4915, -9129, -13237, -17530, -22812, -16201, -8481, -11212, -2921, 5795, 1215, 3581, -1584, -6751, -8655, -5991, -832, 2309, 277, 6469, 4668, 11156, -2435, -4120, 3075, 2564, -8570, 10491, 20008, 8718, 3848, -597, -4161, 9088, 5639, -5536, -8061, -16821, -20993, -13595, -7650, -3379, -1567, -5992, -10785, -728, 204, -3039, -8499, -7090, -7947, -9237, -12619, -15927, -15118, -11077, -6977, -3982, -2067, -8762, -890, -4331, -3880, -3763, -8184, -9475, -5040, -3078, -2575, 724, -4452, 3020, -2777, -9604, -14142, -13585, -9556, -4134, -7903, -7275, -1226, 2318, 176, -4694, -2980, 12648, 13776, 11092, 2305, 1765, 1746, -1597, -4615, 7631, 7656, -4835, 2930, -1369, -11870, -6575, 7713, -2292, -11120, -5920, -2365, -2468]
637b468n590k541k758j307K344P71p060L222f726m4724m6692L8484a784A164B79
621f260n309o794J951O197M121J381k118m355k455N091m449F39P382O737K591
606A7349mq254l834R423A856d991a915l402j574K961l89q12j048j056L72j063
590g926K797J488n519L772a071j869O03b42l899j488J532a138A261J016k10f332
573b2j094j392j796o37m974M296o22m222J982j295j994j686k067l664l904L543
557a9548M656L838J735q70l222l053J481N870c500B72K063g45C168b833H30R646
541A0476Q509m554F311g308E927a747n377b971j0782q543Q100O640L124o56j562
526f650J678i48B932A413a226l437M63o789H060l97c799r448m175j78K651O188
$$ y = [-2468, -8058, -10599, -13357, -14664, -12320, -11549, -18609, -15387, -6726, -51450, -98142, -59658, -1784, 1164, 279, -6260, -11569, -18363, -16412, -10215, -6094, -4713, -6831, -11186, -13641, -8550, -12999, 639, 8021, 14758, 17349, 17345, 9091, 5257, 14680, 1856, -4991, -1915, -5317, -6891, -3930, -4319, -5131, -6179, -7235, -6863, -7926, -5129, -3641, -9160, -5388, -1071, -2940, -2337, -242, -4141, -5629, -4097, -1138, 1261, 2277, 2067, -6332, -22, -1116, -2508, -4304, -4941, -9915, -5619, -6241, -10463, -8481, -9776, -11770, -13456, -15523, -19187, -23091, -19548, -14892, -11054, -9319, -10189, -13411, -16464, -14983, -9113, -3500, 272, 2335, -745, 3168, -2833, 830, 10476, 18985, 14431, 6311, -7308, 5927, -1747, -7124, -2971, -13753, -22296, -14196, -7556, -4432, -5088, -6650, -4972, -948, 2932, 1413, -1226, -4663, -4200, -10989, 8060, 7663, -3799, -13247, -17422, -17600, -14949, -8761]
510h761b056D122a508e28A5866m025c70B136q31d837k970N90J102j010k780l699
494a3604j938K001K804R57k360n148n468J79K870J070j602k595M311Q292M851
479e380G770l263A215M993K981m005d875l278J609c93l043N96j743l53k864A141
462e4n87o738A406j10N13a980m087H358J465f250a881k253n368M536K241d51r05
445a356b59n769K892j037a925q175F448M7a433q43M59n505D786M159M199L703
429A6847K114p08l911o644b30n396j894l5k442n220p162L78O026L629P64k237
413a3819k868q51K733M948M417a829m67p978J951b522k000j779j187j727j559
398a0774k039k490l997l033J386O543f778j415r15A821b951A0281b396j625j239
$$ y = [-8761, -2056, 4122, -1508, -528, 15866, 11841, -370, 2136, 1305, -4837, -7807, -7217, -6115, -7125, -9905, -13604, -15542, -13541, -10737, -9780, -12140, -17288, -22756, -22577, -19707, -18637, -20239, -22834, -18523, -10231, -5380, 7770, 4507, 1215, 6208, 9189, 5184, -4875, -8153, -6544, -393, -3436, -2840, -4583, -4936, -7800, 1141, -54, -641, -7379, 1406, 1296, 1809, -1980, -6067, 8358, 9823, -6250, -1881, -4134, -9502, -4966, -2725, -451, -1356, -259, -6028, -3136, -4173, -1925, -10100, 6448, 6495, -1433, -2276, -1817, -7322, 4786, 8945, 13144, 16847, 18961, 18253, 14342, 7698, -230, -5626, -7520, -7555, -9997, -15217, -22379, -22001, -15975, -12346, -11582, -13819, -16687, -17538, -14805, -9857, -5440, -1829, -2296, -10274, -8323, -2522, -4522, -6301, -7488, -9215, -10774, -12813, -15303, -19300, -22333, -20947, -14404, -6778, -8193, -9108, 1821, -2951, 10281, -2396, -4021, -5260]
383e260l210p493o133j481M646O905e051A947q86K302Q948m329i003l778C612
367h09q761n01b824F0J857J307R96d075j557m27n940b805n86q136a63j679m67
350b309P60B75J791K78J014K070p13o28a342E714b257k13C881a730A252g491E222
332A792e727K358p306L051q93p7K121b282c45k363m206q783o855M511Q638B292
315A435M119j536a4469J556e147J163E2106r79J06440J036057J479859J110028
303C783511M035j098220A089879B99089F9585C410J0513c132H616a837j1167L708
291i296b448l835q832J475e487a46m185m004a996o634o090k893r70J904O611g30
274c511B568P448e4F902P138b434n870K321l053O43K872K258p93E98d816h66F995
$$ y = [-5260, -8470, -15963, -22096, -23577, -18931, -12026, -5051, 1947, 1061, 3363, 12311, 7982, -9003, -12781, 3612, -809, -9570, -10071, -2824, 60, 1917, 3224, 4220, -4075, -5632, -6059, -11999, -2805, -3391, -11527, -163, -1842, -2309, -1549, 275, 2066, 2344, 3358, 5428, 4715, 4087, -1342, 5714, -2257, -2470, 3881, -1730, 1252, -7491, 5222, 1792, -5727, -3369, -10675, -7624, -8517, -8594, -6473, -2282, -345, -2708, -6914, -15697, -22552, -18041, -9403, 2292, 1435, 5554, 4018, -14469, -12913, -5147, -3984, 52106, 51127, 157567, 1193624, 2673483, 3783511, 3787546, 2689326, 1089879, 299089, 69585, 3410, 13923, -3132, 8616, -1837, -13004, -9296, -2448, -6283, -15115, -13640, -5487, -146, -4331, -8335, -1996, -8630, -14720, -17613, -18583, -16679, -10068, -730, -3511, 2568, 10016, -54, 6902, 14040, -2434, -8304, -5983, -9036, -8393, -5521, -3263, -4056, 598, -4816, -866, 6995]
256I722K996L39j580j098e285n524e287j947J070C720J2586a452G51f68m506D41
239F441j720e48M9m938k56b642H053I47b018M60A5492n494B317c886p509J359
223a0036o7q19k70A7520L886F250a0517M663a869E762A125b313l540l479k634
208a1966Q74M765N88j990j804E29B07K673G61J322J925g312n062d565O7l542g72
190e01m183k721j2134P759d646l454k113M935n247M563J721o86m502k685m69J027
174a1556K217L204o9k904Q0d250j34C909j176c046m436j340Q07R21j17j863l428
157a2502m239l438p60L143N569e571A14J493c281a65j199q00l073j733k41a253
140A836J580a474B934b279o166l223K112M292j785c184k890l927m183k886j328
$$ y = [9722, 12718, 13057, 11477, 10379, -5285, -10809, -5287, -7234, -6164, 3720, 16306, -1452, 751, -668, -5174, 441, 6441, 4721, -548, -499, -5437, -5693, -2642, 8053, 947, -2018, -1558, 15492, 9998, 2317, -3886, -11395, -10036, -10103, -10922, -11192, 17520, 21406, 6250, -10517, -5854, -1869, 5762, 1125, -2313, -5853, -9332, -11966, -11092, -6327, -5739, -7729, -9533, 529, 207, 2880, 761, 2083, 4008, -7312, -12374, -4565, -4498, -8040, -772, -501, -4684, -7405, -19539, -11780, -4646, -8100, -10213, -5278, -10525, -5962, -4241, -4927, -9429, -12114, -12583, -11556, -9339, -6135, -6204, -9108, -9028, -4250, -4384, 3909, 2733, -3046, -7482, -8822, -8015, -7094, -7211, -9074, -12502, -16741, -20179, -20939, -17796, -12227, -5571, 114, 1607, -3281, -165, -1364, -2164, -5237, -6970, -7211, -1253, 1836, 3416, -1474, 2934, -2279, -8445, -11668, -9556, -5264, -7049, -3184, -6074, -10001, -14184, -17070, -18398]
125a8398L50J999K606K842J017L02k02M13J576L312l184o410K871c009C465j078
109B387f765k722b807p365q262k705L752J360P84M071d190j810r48a122A2422
93F684a3221N242p965O176G76a4456I798f437j659K506j5753K084N184f674J101
78e573b697j695J267m588n987o455K910N772M434K209J728o93j496n469J447q99
62a0212J971c884p09q2B937f05o358n612K561d063o152l503N871p02j334J768
46h115L719o507r4c097H56d821p725k000e627C767P580M266o993a697l300l350
30h347r073N945A596O131A180B48a477q743L472C567K623c589D509d638J926I966
13B730E53O273j548R42g267l09D230A147h057l399L035A788J4
$$ y = [-18398, -18048, -16049, -13443, -10601, -9584, -9282, -9484, -9071, -7495, -4183, -7367, -13777, -10906, -3009, 3465, 2387, -6765, -9487, -2807, -10172, -18434, -21139, -17387, -16027, -15243, -11172, -4190, -6000, -6948, -1122, 12422, 6684, -13221, -7979, -15944, -9768, 776, -14456, 9798, -6437, -8096, -5590, -21343, -19259, -14075, -6674, -5573, -2697, -4392, -3125, -7713, -13700, -20155, -17245, -11473, -7039, -4830, -3102, -3795, -5291, -10760, -9313, -10212, -8241, -3884, -4593, -4675, 2937, -605, -6963, -12575, -10014, -4063, -10215, -13718, -7847, -8549, -9883, -8115, -4396, -10903, -10997, -3097, 856, -4821, -12546, -14546, -5627, 3767, 11347, 15613, 8620, -1697, -4997, -8347, -17420, -11475, 1596, 7727, 1180, 248, -1477, -10220, -6748, 3567, 6190, -3589, 4509, -4638, -2712, 9966, 2730, 553, 6826, 5278, 6220, -7267, -7576, 4230, 1147, -8057, -11456, -8421, 1788, 1802]
0A802
$$ y = [1802]
##PAGE= F1=1035.077058681
##FIRST=     2908.11359968662, 2642.9191468254, -7634
##DATA TABLE= (F2++(Y..Y)), PROFILE
1023g634B884L662k258L099C422h697M347d90p050k377M061i24k55A647b4D577
1006e049a076n201m094K913c267a381l801K71m067K00L978f69B68Q8d89p131O44
989f976n536N497K438R58n629K633k330M066m347R01D467O06h725c661l276K538
973d399k660Q11j100n984p56N873b892p05a014B454f252j347q321L229e763p511
957a3274O315n85j716m041K426j063M440E760a0904D416L544l543c653p277c287
941a252O21j585l657m817l072J488J448j334l331k12N308J057L634m721M422j836
925g839p15j71o41l71J062K821K027m875K896C555N003B268K711N758n358f38
908A709o96m87f693r56E740k39J234N307i302A3920n747a0880M61b625l239J582
$$ y = [-7634, 2884, 6546, 4288, 7387, 3422, -8697, -4350, -490, -7540, -9917, -5856, -924, -1179, 1647, -24, 4577, -5049, -1076, -6277, -10371, -7458, -3267, -1381, -5182, -4911, -8978, -8778, -4800, -669, 268, 356, -489, -7620, -6976, -12512, -7015, -4577, -3619, -9248, -6615, -8945, -4879, -9226, -8325, 4467, 5073, -8725, -3661, -6937, -4399, -7059, -6248, -7348, -13332, -14088, -8215, -2892, -3597, -1014, 2454, -6252, -7599, -15920, -12691, -5763, -13274, -6959, -7544, -9260, -13301, -10875, -11938, -7498, 5760, -10904, 4416, 7960, 4417, -3653, -10930, -3287, -1252, -631, -2216, -5873, -10690, -13762, -12274, -10826, -12160, -15491, -15703, -10395, -9338, -5704, -10425, -6003, -7839, -8554, -8725, -9366, -9737, -8675, -5854, -3827, -8702, -5806, 3555, 8558, 2268, 4979, 10737, 5379, -638, 1709, 1013, 526, -6693, -7649, 5740, 5501, 6735, 12042, -9302, 13920, 8173, -10880, -10419, -2625, -5864, -4282]
892d282l832k808j350O81K309K259J430N88m229N98d171K050H41M167L871L174
876A2053C141K86P785m487A781a416L62n67J52G187k46@e35m517k614K91L143
859d232N7n777L340e5m982J289A2572k554m197B028c250m882m606l081K15K495
843a3109K078K130L268N90j79c40B121N657A605J10L050g009A429O14i92m687
827e679b807j003k518n559M339c300j0616L359d439q15A311d797m632m604l598
812a7631l9825j2552b540B869c220o581l277K461j20j77d654k21o499r89o461
797a8824M636K150N635J542K172H697j876k875E09a179r967A114N30D19a392j046
781b438i6D360A706R73N42f5o221B097a555m764k985k50o50Q69m15J805j220a509
$$ y = [-4282, -8114, -10922, -12272, -11591, -9282, -7023, -5593, -5005, -9234, -8636, -4171, -2121, 841, 5008, 8879, 12053, 3141, 3427, 11212, 6725, 1781, -1416, -1054, -1621, -1469, 7187, 6941, 0, -535, -5052, -7666, -7375, -4232, -4175, -9952, -6612, -55, -5037, -3748, 12572, 10018, 5821, 2028, -3250, -8132, -12738, -15819, -15604, -13109, -11031, -8901, -5633, -5043, -5222, -340, 2121, 7778, 1605, 1715, 4765, -7009, 1429, 2043, -992, -5679, -2807, -3810, -6328, -11887, -7548, -3300, -13916, -10557, -4439, -5254, 1311, -4797, -9429, -14033, -17631, -57456, -70008, -2540, 2869, -3220, -9801, -13078, -10617, -10737, -10914, -4654, -4875, -11374, -12363, -18824, -14188, -12038, -6403, -4861, -2689, 8697, 6821, 3946, 509, -1179, -11146, 1114, 1644, 419, -1392, -2438, -96, 4360, 1706, 2679, 3221, -65, -6286, 2097, -1555, -6319, -9304, -9554, -10204, -9335, -9750, -7945, -9165, -1509]
762c403n020b28D066b764n598m683N451K584j626B891M256M176n243g102b530
746e416k657r35k358j370K464L289j83k855K188k994p06L349d020a248c35j717
730b052m129n804m758N358d481B601O018a032A0187C1g284o528c150r81A3026
714B1459H768B953f55m39j009o130m992l287K512K373r6j134K334d101l073o707
698a3881c100A354c696l671K7K89n439B225K095d165m671j765b6A727a0629c761
681b271Q99k418n703J472k754K075a862j362n293n691L238c678C454N746J849
666A1049F32g869O90B268O914l556b265j584k058o367l167j141L374f198J913
651d285j998D317J645c675C926C04i867K741E326a609q192J557c692n062n293
$$ y = [-3403, -8423, -228, 4066, -2764, -8362, -13045, -7594, -5010, -6636, 2891, 7147, 11323, 6080, -7102, -2530, -5416, -8073, -9008, -11366, -12736, -10272, -6983, -7166, -10021, -7833, -10827, -11533, -8184, -4020, -1248, -335, -2052, -6181, -11985, -16743, -11385, -4481, 2601, 8619, -1032, 10187, 31, -7284, -13812, -3150, -4131, 13026, 21459, 8768, 2953, -655, -1094, -2103, -8233, -13225, -16512, -14000, -11627, -11723, -12857, -10523, -4101, -7174, -13881, -3100, 1354, -3696, -7367, -7340, -7051, -12490, 2225, 4320, -4165, -8836, -10601, -26, 1727, -10629, -3761, -2271, -1372, -3790, -9493, -8021, -10775, -8700, -1862, -3224, -8517, -14208, -10970, -3678, 3454, 9200, 11049, 632, -7869, -7179, 2268, 9182, 5626, -2265, -3849, -5907, -12274, -15441, -16582, -13208, -6198, -4285, -6283, 4317, 5962, -3675, 3926, 304, -9867, -7126, 5326, -1609, -9801, -8244, -3692, -8754, -14047]
636a4047k114J100J224K305M79m635m09B99d5983m4392L1460f479K941J702j046
621b882m230k287K218a905k18n054K30J065i5m927k473D568N558L890J818l171
605A2663D672k47M601c045m498I40e102m793d742O11m821k137J483K960M54j570
589g762c225j791J115j233P85a019D426I70J118j57b803l427k423j631j66J614
573h836K062J188k03N3m901M610n14n199N08K047r2j184k418j535N197M17c721
555A664l42a195l852l527k717o70J501K929L501a508e76l362A132L889N769O250
539A7040F520f970b028m318J431N12l521n879e819F29M307A690e067k950a761
523B903J510j570d332k053m844I983J878C030L76D24R52a365l002m47O81Q81J308
$$ y = [-14047, -16161, -15061, -13837, -11532, -11053, -15688, -16097, 299, -45983, -90375, -58915, -6479, -3538, -1836, -2882, -7112, -9399, -7181, -1905, -2123, -7177, -6947, -5882, -95, -5022, -7495, 4568, 10126, 14016, 15834, 12663, 4672, 4425, 9026, -3045, -7543, 940, -5102, -9895, -4742, -4131, -8952, -11089, -9606, -6646, -6192, -7762, -3225, -5016, -3901, -5134, -4349, -1019, 4426, 970, 2088, 1931, -2803, -6230, -8653, -10284, -10450, -8836, -6774, -5586, -5789, -5736, -10637, -6027, -6541, -11740, -11232, -9185, -9277, -10461, -12879, -14414, -9217, -8800, -3721, 1664, 1322, -1195, -5047, -8574, -11291, -11961, -10460, -7531, -4030, -1508, -576, -3938, 1132, 5021, 10790, 17040, 6520, -6970, -2028, -6346, -4915, -4403, -7924, -13803, -5819, 629, 4936, 1690, -5067, -8017, -1761, 2903, 4413, 2843, -4332, -6385, -11229, 9983, 11861, 3030, 3406, 424, 1376, -1365, -4367, -4814, -4133, -3252, -1944]
506a944J99n18k298l486m708r64N645c240b80a4j378k238j594L69J285J086p3
489b557p71n49K79P77N14o47k543n039m688f894C030n68g15C859K423p24a718
471f260K619B299l8f876j778J607j330m559K324J376N06L063b507J048l905p913
455a3277L460C71c33C66P2a1313Q30d678J67a026J57m843a466n596L6M72A7521
437A7348b85m588A349g862a534m49C97L915L639J852n65l090H84c816j982J332
421d466j409M86l031k642N31J019m88k971k518M158N455k340B762i28k207k841
405e976n77H691L512q7d716I09l85N032a694j0363e242k843m539M005O71r91B411
387f627C643A782g050j336p45l189j799J915J322l29o51N806d57I12R539N9e256
$$ y = [-1944, -1745, -2263, -4561, -8047, -12755, -13719, -8074, -3240, -280, -14, -1392, -3630, -5224, -4855, -3570, -2484, -2557, -3328, -3877, -3598, -2821, -2307, -2954, -5497, -10536, -15224, -6894, 3030, 2462, -715, 3859, 6282, 5558, -1718, -6260, -3641, 2299, 2261, -6876, -8654, -7047, -8377, -12936, -10612, -9236, -8730, -5667, -2507, -1459, -5364, -13277, -9817, 371, -333, 366, 438, -11313, -10483, -4678, -4511, -1026, -869, -5712, -1466, -7062, -7026, -6554, 17521, 17348, -285, -4873, 1349, -7862, -1534, -1983, 397, 4312, 7951, 9803, 9238, 6148, 884, -3816, -5798, -4466, -5875, -5389, -8420, -11062, -10531, -9512, -10000, -12971, -15489, -11331, -5876, -8216, 2762, -928, -3135, -5976, -6553, 8691, 12203, 12116, -4716, 909, 524, 5556, -1694, -12057, -5242, -8085, -12624, -8619, -7948, -8939, 2411, -6627, 3643, 1782, -7050, -8386, -9131, -12320, -14119, -12204, -10882, -11211, -11862, -6056, -457, 912, 10451, 10510, -5256]
369a0320B870a355o386K806n74l910j724J747J141O9l97K722m605b051p29r873
353a2653D001n11j062A163a55j583k759j657K42J929c31C049M941b418k711C44
336c750A077d804A5228l28g933C806a1618a277j367L64C32L840j351Q488k44l512
320G553B796c536l193g5l511C068d43n50j938r104J492F236M363P9404L50949
305D40952N68747M77328O4841B84153o1071F9585J1481A8157M644l428p500B972
292f075A1322E009a585o095l645M141K510l588k152n141M880e246b521j123l58
277d002k333b064j893E612Q072E40P107K098D70e666J131o797j766e468j87K374
261c281j406k662a104B978A257l36c99k421j572l161J259m031K359L495D943M873
$$ y = [-10320, 2870, -1355, -7741, -4935, -5509, -9419, -11143, -9396, -8255, -8186, -8583, -5861, -10466, -2051, -2780, -12653, 4001, 3490, 2428, 1163, -155, -1738, -4497, -6154, -5912, -3983, -331, 3049, 7990, -2418, -5129, 344, -3750, 1077, -4804, 15228, 14900, -7933, 3806, -11618, -1277, -2644, -2280, 332, 4172, 2821, 11309, 11065, 7553, 2796, -3536, -6729, -75, -3586, 3068, -443, -993, -2931, -12035, -10543, 6236, 10599, 90003, 440952, 1009699, 1487027, 1551868, 284153, 223082, 69585, 81066, 18157, 22801, 19373, 11873, 2972, -6075, 11322, 5009, -1585, -7680, -11325, -7184, -4674, -8262, -10414, -15555, -10675, -5246, -2521, -3644, -4002, -6335, -2064, -3957, 5612, 13684, 540, 7647, 9745, 470, -5666, -4535, -11332, -13098, -5468, -5655, -3281, -4687, -7349, -1104, 2978, 1257, 921, -399, -2820, -4392, -7553, -6294, -10325, -7966, -4471, 4943, 9816]
245I816d714b079Q36l285A89Q034P98K291m940d979p31A748F93c803m284N66c392
227e88K11l052m357n119N90j60K666G63M809l39h304k614A68J5501a408B537k37
210B300d24o384j537a524n288K880p947A994a654G36J434a253I082B152c640m116
194g756k082j317q87j821j302L412L317K488R32r21k051k589k305m24K062L464
178g780L699a616f95k65q42o283K705k793k860k581o82K51J3P40J905K524J633
161g230q23J112J31P04P50N73K30J70J152f7D011d17l2A621G78Q745A834c946
142h010B000J809Q01b524D88J0507K409n367h100j714M053a567R3n164L244A793
125e27l057o38a431c74m741l018L910Q3j976n27l237L751m952e422F67Qe197n495
$$ y = [9816, -4714, -2079, -1243, -4528, 189, 8223, 9021, 11312, 6372, -4979, -5710, 1748, 693, -3803, -8087, -7521, -3392, -588, -377, -3429, -7786, -12905, -12315, -12475, -9809, 763, 5572, 5233, -8304, -10918, 168, 15669, -1408, 2537, 2300, -424, -6808, -8345, -1524, -6812, -3932, -11879, 1994, -1654, 736, 2170, -1253, 9082, 2152, -3640, -7756, -9838, -11155, -12042, -13863, -15165, -11753, -8436, -5948, -5016, -5937, -7988, -10577, -12882, -13306, -11244, -7780, -4081, -1616, -695, -960, -1802, -8085, -5380, -8173, -11033, -13614, -14296, -14045, -14032, -13292, -11387, -8863, -7230, -8053, -6941, -6810, -6106, -5356, -4783, -4553, -4383, -3231, -67, 4011, -417, -449, 1621, 778, 9523, 1834, -3946, -8010, 2000, 3809, 4610, -2524, 488, 10995, 13404, 8037, -8100, -9814, -5761, -1567, -1474, -6638, -3394, 1793, -527, -3584, -4222, -1431, -374, -5115, -8133, -4223, -4140, -6116, -6643, -9880, -6129, -11081, -5422, 667, 675, -5197, -10692]
107a0692b203m294n199l79M032J940A613M564P41c703j937e82G234B256a1804
91b443C468L080k20i345D492k093j063h269j5453j850J1394M264a977j740j764
76e481j993l229k081L770j860N275J995j707A142j51f099l700k92L818c039k184
60e223k624k138j398j710k235m96L158L471l331p4M041l792d48F068B369a2206
43a2768d833B895g551J628j130l13j540b594D498K955B59a029A934c527r955f567
26e676b048f63A279b845o934n623N826L734K057i43D019N687B369I58M736o24
10E070m99G46b853D204b106n679n603K573E85K360
0B945
$$ y = [-10692, -2203, -6497, -11696, -12075, -8043, -6103, 1613, 6177, 6918, -3703, -5640, -582, 7234, 2256, -11804, -2443, 3468, 6548, 6328, -9345, 4492, 2399, 1336, -8269, -23722, -25572, -14178, -9914, -1977, -3717, -5481, -7474, -10703, -12784, -9014, -10874, -5599, -3604, -5311, 1142, 991, -6099, -9799, -10091, -6273, -3039, -5223, -7847, -9985, -11383, -13093, -15328, -15824, -12666, -9195, -12526, -12600, -8559, -12351, -448, 6068, 2369, -12206, -12768, -4833, 2895, -7551, -5923, -7053, -7366, -8906, -2594, 4498, 7453, 259, -1029, 1934, -3527, -13482, -6567, -5676, -2048, -663, 1279, -2845, -9779, -15402, -9576, -5842, -3785, -943, 4019, 9706, 2369, 958, 5694, 5070, 4571, 746, -2853, 4204, -2106, -7785, -13388, -10815, 585, 2945]
##PAGE= F1=1032.493560004
##FIRST=     2908.11359968662, 2642.9191468254, -7664
##DATA TABLE= (F2++(Y..Y)), PROFILE
1023g664A131L436m85M88k175h777G45a516j52j852k634a190B855L209B533M459
1007F992c230R77l047J215C613f920E846d967a284L52n116n698p10M503L342J395
991c216q978e108n111P97j631j164M20N27l66r11L20K380K630K496o793d111n18
974d629l632K781k933c985N35J017h46H43f205b210i08j0353b055F054j103G60
957a0449a250m242b251i52k299q853O69C05c300A543M95H41d446o650N425b520
940A496J892c457o028a896j471J400c88q977a511j425n386L869o479M615l946
925a0263n14M063b857h95j155l548m357j943L242M301b55C084J455M352C816b503
908D11P966C326g463l541e313K540B911M794g628A2586o146g574L33c265k65a487
$$ y = [-7664, 1131, 4567, 4082, 4570, 2395, -8777, 745, -1516, -1668, -3520, -6154, -1190, 2855, 6064, 2533, 6992, -3230, -2253, -5300, -4085, 3613, -6920, 5846, -4967, -1284, -932, -6048, -11746, -12456, -7953, -4611, -3216, -12194, -5108, -10219, -9422, -11053, -12217, -11797, -11270, -11636, -12547, -12227, -9847, -7217, -4721, -11514, -4111, -4629, -8261, -5480, -8413, -3985, -3450, -2433, -846, 843, -6205, -2210, -908, -11261, -2055, 6054, 4951, 760, -10449, -1250, -5492, -2251, -952, -3251, -12104, -11435, 305, -3300, 1543, 2038, 841, -4446, -11096, -5671, -2520, 1496, 3388, -3457, -9485, -1896, -3367, -1967, -388, -9365, -1511, -2936, -8322, -4453, -10932, -6317, -10263, -10777, -6714, -2857, -895, -2050, -5598, -9955, -11898, -8656, -4355, -255, 3084, 4539, 8891, 3816, -2503, 411, 8377, 3326, -7463, -11004, -5313, -2773, 2911, 7705, -7628, 12586, 6440, -7574, -7241, -3265, -3530, -1487]
891f448l469J181L758a408E32K50c417m443j46L241L30J233a490O25J1J73e0C93
872g28k556l185j544K077K422J197k11j972k763j992r37l16p28k06O39K545d041
854d434k391A4731J072E04P16P989J155j947h535M207D407A216a986k969k549
839g504J816J177J248o90k664m221l839L019L880K719J528j323K091a356p950
824i306rL057b290j2159J815e502o01A05c737o664k943K756l2535k4872i887A282
807D699Q04J622c135q940j642e976b294o774K250j753K486j516J430N76J267f13
790c883j442K55R54o039M165l802n175k307M660N165c196b87A667Q53A63f203
773H77b261l156o295d733J125r50m008J958k215a780l522p335b372j500j499m928
$$ y = [-6448, -9917, -8736, -4978, -1408, 532, 782, -3417, -7860, -8006, -4765, -4435, -3202, -1490, -865, -854, -681, -50, 393, -728, -3284, -6469, -8013, -5936, -3514, -2317, -2528, -4500, -7263, -9255, -10192, -10508, -11236, -11442, -10803, -8258, -4041, -4434, -6825, 14731, 15803, 504, 1220, 9209, 10364, 8417, -8535, -4328, 4407, 1216, -1986, -4955, -7504, -5688, -4511, -3263, -3953, -6617, -10838, -14677, -11658, -7778, -5059, -3531, -4854, -2763, -1356, -9306, -9315, -6258, -2290, -14449, -12634, -5502, -6103, 105, -3737, -10401, -13344, -10588, -43123, -67995, -9887, 1282, 4699, 5503, 7125, -3135, -12075, -13717, -5976, -2294, -9068, -6818, -8571, -6085, -7601, -6171, -5595, -4328, -613, -3883, -5325, -5070, -4116, -10155, -5990, -9792, -14967, -17274, -12614, -7449, -3196, -287, 1667, 2520, 163, -6203, 877, -2261, -5417, -11712, -4733, -3608, -4558, -8566, -6608, -8823, -1780, -5302, -12637, -2372, -3872, -5371, -10299]
757a0299K821c445o88l868A563K651m07A815h235L827n40j145j027c4F14L31c353
739g337n801N812a579l916A724J909q07J194k16a213o226o274p60M468M548b466
722e884K776k907l819a524A781b67A0222j705l669C41c924k278m58L38o12M37
706f497r21l57Q43K975EL927e345r031e836J003o43J01j958J167n349C7N160a088
687f628l132a576A70a1296K869d90F27c526m218c552l789l848b103M89p55h48
670i9j860D443Q102K323B027g192P03G820Q841o933a368k042F860j17M479D859
653G10c922j556l081j492c114P37E363A971g079p57B375a991o416k161d960m98
637e458o781r4p50J6f369M64p222l927d580l0358l8171K2988F30M323g82B479
$$ y = [-10299, -7478, -3445, -4133, -8001, 1563, 4214, 3807, 1815, -8235, -4408, -4948, -6093, -7120, -34, 614, 945, -3353, -7337, -13138, -7326, -1579, -5495, 1724, 3633, 2826, 4020, 3804, -1213, -7439, -13713, -14473, -10005, -5457, -2466, -5884, -3108, -6015, -9834, -1524, 1781, -267, 10222, 8517, 4848, 341, -3924, -6202, -6660, -6322, -6934, -6497, -7418, -7775, -6932, -3957, 5, 3932, -5345, -14376, -5836, -4833, -5476, -5375, -7333, -6166, -11515, 37, 5197, -1088, -6628, -9760, -1576, 170, -11296, -8427, -490, 627, -3526, -7744, -3552, -7341, -11189, -2103, -1614, -2369, -848, -99, -1959, 4443, 12545, 14868, 2027, -7192, -6489, 7820, 16661, 9728, -1368, -3410, 6860, 6743, 11222, 4859, 710, -3922, -5478, -8559, -10051, -3114, -2377, 5363, 1971, -7079, -7836, 2375, -1991, -8407, -10568, -4960, -5458, -12239, -12333, -13083, -13067, -6369, -5905, -13127, -17054, -4580, -34938, -73109, -50121, 630, 4953, -782, 2479]
620c192p27G243A954a284q322K30M267a39j673g00C78J827K103J306k04c77k827
603c204p532k875K923F79c824o757L624D290j510m73J926l60h85k885J564P38
587a468j755n594c857A69L601j478d229j0597M147a562C048h21r939m4k640e780
570I3a364o479a463R2j0350K248p42J679J295m91L522m665r7b960C315r20b39
552c830l061k557j860j985k223N85K223K634L689b812D43J945P73m18a610o896
536h506k026c586m032m716m426K928L263K926K098J699a875j090a16C244J12c602
519i334J484d83A89b5k494m546n464Q55e278k41C450c777M44H854J71C700J604
502E304B496c55l040k294p47N11J523J038m22b88I67O78P485k306J024M416E169
$$ y = [-3192, -3919, 7243, 1954, -1284, -9606, -9376, -5109, -139, -1812, -700, 378, 2205, 4308, 5614, 5410, -377, -3204, -10736, -13611, -10688, 679, -3824, -10581, -6957, 4290, 2780, 2307, 4233, 3873, -885, -3770, -2206, -1468, -3223, -8817, -3857, 169, 3770, 2292, -4229, -14826, -10679, -1562, 3048, -821, -10760, -10804, -13444, -5780, 93, -1364, -7843, -1463, -1371, -11721, -9473, -10215, -8536, -7241, -7732, -4210, -8875, -8972, -2960, 3315, 2395, -239, -3830, -6891, -9448, -11308, -13293, -15516, -14931, -12708, -10074, -6385, -2812, 443, 2388, 3161, 2743, -1610, -8506, -10532, -3586, -7618, -12334, -16760, -13832, -10569, -7643, -5545, -3846, -1875, -2965, -116, 3244, 3356, -3602, -9334, -7850, -483, 189, -25, -2519, -7065, -12529, -11674, -5278, -5519, 3450, -3777, -3333, 8854, 9025, 3700, 5304, 2496, -355, -3395, -5689, -6436, -5925, -4402, -3364, -3786, -288, 967, 1645, 9130, 6824, 7848, 12264, 5169]
484G886k371B548b477m865o751L752a736n59A369R39K896B333b709r738b240G923
467a818o228k656J522A35b902J204m771j761J73A293M94a0213b719j090j089l067
451g965l905j653L168K246r08k251L865K768i96r168n01a6B905l57l98d729e35
433i949M708j2K612B061N586N007L398R37k246m184C146A354a2383e53m88j880
417b921k810l520l200j655J207J655J891K651K126b147l290K060a275G37K572
402C309L243f499K947J633D914e290q07g94k96i8k879m519k309l702l47O78n9
385a3235Q26K985M201i55l567k672a677o93k741j815b097M74F275L764a392n417
369f809A296c703o28i23A0375n080A335e4o75m264n979e445q74J098J959j0344
$$ y = [7886, 5515, 2548, -2477, -7342, -14093, -10341, -1736, -2295, 1369, 2308, 5204, 2333, -2709, -12447, -2240, 7923, -1818, -8046, -10702, -9180, 135, -2902, -1698, -6469, -8230, -8057, 1293, 1787, -10213, -2719, -3809, -4898, -7965, -11870, -13523, -10355, -8109, -9017, -11268, -7403, -4635, -996, -10164, -10665, -16, 2905, 2548, 2150, -4729, -535, -9949, -5241, -5253, -2641, 2061, 7647, 12654, 16052, 16989, 14743, 10559, 3146, 1354, -12383, -553, -1041, -2921, -5731, -9251, -12451, -14106, -12899, -11244, -9353, -6702, -4576, -2147, -5437, -3377, -1275, 737, 3309, 6552, -6499, -3552, -1919, 4914, -5290, -6097, -794, -1090, -98, -2977, -7496, -9805, -13507, -13854, -13176, -13235, -12409, -9424, -5223, -955, -4522, -7194, -1677, -2370, -5111, -6926, -2097, -1623, 6275, 10039, -1392, -6809, 1296, -3703, -4331, -923, 10375, 5295, 1335, -54, -729, -4993, -10972, -5445, -6319, -5221, -3262, -13606]
353a3606A51K7a009j349n59p4j389j062O3J317a385A344J762b672m367K207K68
336d564A004c140C477J046c164a457j0863F882B156K414g391b990G698J379L38
321I415j609k877d380j244j066b711o20m370n005e565j0097E986B060f211B0627
305B24207L83970J60450o2270B78900j00859C410J4747k478P69p102I10b360q977
292a1337a70F290O28A153b605o127K375m166j249b101A00N39a149m992o698L790
276i049M224j502a075o10f95A010K205r59d293k875K893q36P55m253a261r156
260a0417a954j384p37p63q48k105j092K674l12J754m845K566L489j76p2j841j972
243g618l754K474b327E673N494N394E832e446J507E261M924a825n099J060a097
$$ y = [-13606, 151, 178, -1009, -2358, -2917, -2991, -4380, -5442, -5379, -4062, -1385, 1344, 3106, -2672, -7039, -4832, -4564, 1004, -3140, 3477, 4523, -3164, -1457, -12320, 6882, 2156, 4570, -7391, -2990, 7698, 9077, 9415, 7806, 4929, -4380, -5624, -6690, -2711, -3331, -7701, -12706, -5565, -15662, 5986, 2060, -6211, 20627, 224207, 608177, 768627, 706357, 278900, 178041, 3410, 18157, 15679, 16448, 9346, 910, -2360, -11337, -170, 6290, 6918, 1153, -2605, -8732, -6357, -10523, -11772, -2101, 100, 639, -1149, -6141, -12839, -9049, -4825, -6327, -1075, -1685, -695, 1010, 3215, 2256, -4293, -7168, -4275, -5111, -4356, -8609, -1261, -10417, -1954, -3338, -4075, -4838, -5686, -7791, -8883, -6209, -6521, -4767, -9612, -7046, -3557, -3733, -3805, -5646, -7618, -11372, -8898, -2327, 5673, 11167, 16561, 5832, -5446, -3939, 5261, 10185, -1825, -6924, -5864, -1097]
227e503j597j12L287p548J391j040K923A0340M2C693d972m601B527e85m892p62
211f239k138k283j959P84J389J802L970p989C017c553Q16C610a010A043c506J111
195b395E826b497m410b270N59p43j742J034a066D55K96k50d954J263a768j234
179c002m255K322A4211j223D424A344a1114b104F21a850o323l008b952E311p24
164D587e33D793c297r541f246L1A300O108j631A396g305D923H53e484L44a977
147c0o0j109j943k429m353A038L523J285c491K54I567N040o576i99j3176d601
130D095a882r948a788A079b018j921J193A30M23f769K213m40n631k171M182d126
113c61r584L093h64j397l502k867j60L1m222J23N85L567L515b372h62j267k249
$$ y = [-5503, -7100, -7212, -3925, -11473, -10082, -11122, -8199, 10340, 10382, 3693, -4972, -9573, 2527, -585, -5477, -6239, -8377, -10660, -12619, -11835, -10446, -8644, -4674, -12663, 3017, -3553, -2737, 3610, -1010, 1043, -3506, -2395, 5826, -2497, -6907, -2270, -1711, -2454, -4196, -3162, -1066, 455, 751, 501, -4954, -3691, -1768, -3002, -7257, -4935, 14211, 12988, 4424, 1344, -11114, -2104, 621, -1850, -8173, -11181, -2952, 5311, 4587, -533, 4793, -3297, -12838, -6246, -6215, 1300, 7408, 5777, 1396, -7305, 4923, 853, -5484, -5140, -1977, -30, -90, -1199, -3142, -5571, -9924, 1038, 4561, 5846, -3491, -3237, 9567, 14607, 8031, -999, -14175, -4601, 4095, -1882, -11830, -1788, 1079, -2018, -3939, -2746, 130, 553, -6769, -4556, -4996, -10627, -12798, -8616, -4126, -361, -9945, -6852, -864, -2261, -5763, -8630, -8790, -8759, -12981, -12858, -12273, -8706, -5191, -2372, -862, -2129, -4378]
96d378J244j810K08n334M705B77N611r38c570a608G84L4h602j1009k784h567L176
79e391m112J576c811p918d642q16j554n273D9c85m303G669k947f466J615m135
63h986M071D028l24j088c321m92l734j188N36k10q36l780L949R05l443d609a161
45A43a2519J436e264e28q771B337j141C16L267A752c23l368m666k972J712K143
29g474m815e293b614j464a162C252A329b045k300j384J96J769h61A851J459j150
13B160A044J884o62G76a208j465R25k435j478m873M91B168M512
0F680
$$ y = [-4378, -3134, -4944, -4736, -10070, -5365, 277, 5888, 4950, -3570, -1608, 784, 818, -8602, -19611, -22395, -8567, -5391, -9503, -7927, -3811, -11729, -4642, -5458, -7012, -12285, 49, -385, -4688, 7669, 4722, -6466, -4851, -8986, -4915, 4028, 3704, 2616, -3321, -3813, -7547, -8735, -8199, -8409, -9245, -13025, -9076, -8171, -11614, -4609, -1161, 143, -12519, -11083, -5264, -528, -9299, 2337, 1196, 316, 3583, 1752, -323, -3691, -8357, -11329, -9617, -7474, -12289, -5293, -2614, -4078, -1162, 3252, 1329, -2045, -4345, -5729, -5533, -3764, -861, 1851, 3310, 2160, 1044, 2928, 2266, 776, -1208, -2673, -1748, -4183, -5661, -10534, -10043, 2168, 6680]
##PAGE= F1=1029.910061327
##FIRST=     2908.11359968662, 2642.9191468254, -6657
##DATA TABLE= (F2++(Y..Y)), PROFILE
1023f657k031J285a624D600E73f995D172a274m540J801j761c68E043L772A371
1007C856c676l041k253b153b70n555A976d863a45A568C14a656l037l666k926K283
991i002J003c905l584K605i67C766b660I23c267B27b535k848k592m93m737M934
975h271o40l71M106l427c944B534A12K942K441g284c276J391n739b247F383j974
959D409E26e995a793j580o8q28k177q508R8e646R81n38k943l500n04K918J912
942g320K17j376j392R76J033Q18j471k503Q2m9c850g24o450L562o658M168E494
924F073R49R67N49a114A973c228k141j941c372d97A757O89J321g6m231a377C467
906A501i120k412e718b728H44J689d159B221o35b917d48n28j789l040l503O69
$$ y = [-6657, -8688, -7403, -1624, 4600, 573, -6995, 4172, -1274, -5814, -4013, -5774, -368, 5043, 8815, 1371, 3856, -3676, -6717, -8970, -2153, -270, -5825, 1976, -4863, -145, 1568, 314, -1656, -4693, -8359, -11285, -9002, -7999, -3905, -7489, -4884, -967, 3766, -2660, 923, -3267, 227, -2535, -5383, -7975, -8468, -13205, -8271, -8911, -9282, -5176, -8603, -3944, 2534, 112, 3054, 5495, -7284, -3276, -1885, -7624, -2247, 6383, 4409, 526, -5995, -1793, -3373, -3441, -4269, -6446, -14954, -14856, -5646, -4665, -5203, -8146, -11646, -12150, -9232, -7320, -7103, -8479, -9871, -8895, -7862, -7044, -8515, -11018, -10936, -10985, -3850, -724, -7174, -3612, -10270, -6102, 5494, 6073, 7022, 7989, 8538, -1114, 1973, -3228, -5369, -7310, -3372, -497, 1757, 2446, 3767, -76, -4307, -1377, 3467, 1501, -9120, -11532, -5718, -2728, 844, 2533, -4159, 2221, 1586, -2917, -448, -976, -2765, -5805, -9308, -8639]
890h639K854a227G92k47a507l531k786r28j945j979J548K327J405O18Nk89j3M24
872f651J535J382a866j53j597k186j955j991j835j154O33J745P79k79j205P82
856a0282L951a547p747E408N75d934a158D732J577q12i273K993G860j911B198
840i25q491D335B118h98m764l487M282A378g957b774o451J642R44J564J796q870
824a2149e650o07k630n578j9K816L140L024b689n873q25K847l0356j6779a0649
808b887D778J004p8g068p319O95d722a600l108J313j707k525k439k10K516K319
792e441a231A399J852m08C96h749j375m798O291b635A309a146B986h49n823o567
776a3239M241K601B384b546j925q122a447H775D16f060p51n844N531j364k434
$$ y = [-8639, -5785, -1227, 792, 545, -1507, -5038, -7824, -8752, -10697, -12676, -11128, -8801, -7396, -6778, -6773, -7062, -7075, -6651, -5116, -3734, -1866, -2019, -3616, -5802, -7757, -9748, -11583, -12737, -12104, -10359, -9580, -9859, -11064, -10282, -6331, -1547, -9294, 5408, 5983, -4934, -1158, 4732, 6309, 5497, -9273, -6280, 7860, 5949, 2198, -925, -9416, 4335, 2118, -898, -5662, -9149, -4867, 1378, -7957, -2774, -9225, -7583, -6639, -5075, -3279, -12149, -5650, -6257, -8887, -14465, -14484, -11668, -8528, -5504, -2689, -8562, -9387, -6540, -36896, -53675, -10649, -2887, 4778, 5782, 5704, -7068, -14387, -13692, -4722, -1600, -4708, -3395, -5102, -7627, -10066, -10276, -7760, -5441, -1231, 1399, 3251, 2843, 396, -8749, -10124, -14922, -8631, -2635, 1309, -1146, 2986, -849, -6672, -13239, -8998, -6397, 2384, -2546, -4471, -12593, -1447, 8775, 416, -6060, -6811, -12655, -7124, -8488, -10922]
761a0922G897M270l624a2765b722C295a742r437i14L5M00A01h184J059a279l450
745d729k798a139D751A212g161k093k249M461B685b428a111I28L239A559Q994
730A0553r83l016g469a158o73A81K046h747A395a976o940d240e91A720N559J40
714G419j441j817r23M99J129b353n597d54j47k319q88m11q5M28R99q925L276k026
696a0552M542J668k861J011k970c047j45i6j149n862K312a653o449l270E2K424
680B476b862j645E00b55p731L924h56F419G56f28j252E3J3778K216B747f736P91
663e945G055C60a925O63l17E941k617P064m026A826c828j376j525j721n968K669
647a1749e531C08d410m729D519c971l243n655O376J353m559o020J948Q87e595
$$ y = [-10922, 7897, 12167, 8543, -12765, -2722, 3295, -1742, -11179, -914, -879, -479, 101, -8184, -7125, -1279, -4729, -7527, -1139, 4751, 1212, -7161, -9254, -11503, -7042, 2685, -2428, -1111, 928, 4167, 1559, 10553, 9570, 6554, -7469, -1158, -1831, 181, 2227, -8747, 1395, -1976, -8916, -4240, -591, 1720, 7279, 7419, 5978, 4161, 3238, 3737, 4866, -2353, -7950, -454, -601, -2920, -3808, -4219, -4304, -3876, -2877, -11802, -8526, -10552, -6010, -4342, -7203, -6192, -9162, -3047, -3192, -96, -1245, -7107, -4795, -1653, -8102, -11372, 52, 2476, -2862, -4507, 500, -255, -7986, -4062, -856, 6419, 756, -628, -1880, 53, 13831, 16047, 2747, -6736, -5945, 7055, 360, -1925, -1262, -1579, 5941, 3324, 10388, 6362, 1826, -3828, -5204, -6729, -8450, -14418, -11749, -5531, 308, -4410, -9139, 4519, -3971, -7214, -12869, -6493, -5140, -9699, -15719, -13771, -12884, -5595]
631a209j0128n654A138b0298k6007J3187A7838L119e746H948A917g896c0k282
617b312j904p270l31J723k059j82J246R83L49m34q00n5Q78J686K145m268l210
600a3815d060j016m193m69R19J533c580A102M510l43p13A15O87c657q270Q62k582
583a3647rN93J051K550L326K502N82j768l994m128J672e391a79m901K248j348
567d180a466q132J594J557J11m906M900K508l399J828a303k254k428k751l098
552a1834k411l85K691L413L595a655a86r61k380k975j085O72R26m75j135n44m841
535a2984N666k53l307j985k831L893N444b026G36J515d172K026E166R24b830n507
519h337c701F066O96J424C045f11B156b169m282k02A208c255l458H794O33l714
$$ y = [-1209, -11337, -16991, 1138, -20298, -46305, -33118, 17838, 20957, -5746, 8948, 1917, -7896, -30, -2312, -4216, -11486, -11817, -10094, -12153, -12335, -11089, -10106, -9757, -10191, -10991, -11046, -10168, -8482, -6337, -10605, -13815, -4060, -5076, -9269, -9738, -8819, -7286, -3580, 1102, 5612, 5269, 4556, 115, 802, -3657, -11927, -11065, -13647, -13656, -13063, -12012, -9462, -6136, -3634, -3052, -4820, -8814, -12942, -11270, -5391, -179, -5080, -2832, -4180, -1466, -9598, -8004, -6447, -6336, -11242, -6342, -3834, -7233, -5405, -1303, -3557, -5985, -8736, -11834, -14245, -14630, -11939, -8526, -4931, -1655, -186, -1147, -3527, -6502, -7587, -6915, -5989, -6464, -7599, -8143, -12984, -7318, -7571, -10878, -12863, -15694, -11801, -6357, -2026, 736, 2251, -4172, -2146, 5166, 6090, -2830, -8337, -3701, 6066, 6762, 8186, 3045, -611, 2156, -2169, -6451, -6653, 1208, -3255, -6713, 8794, 9427, 5713]
503E713K190K870l917b638H64J144c180j758L85R64A485E57k6M922a33E382L698
486I080A899L053j113j010f545K924k872N57J13J476J628O20Q28e31A431L320
470D751K239M299l460C009e087m178J182n687d770n31p241l24a643E11a2495J990
454a0505H83P234R52l547f232l000l714N83J476M572K161J963j0391M36E840P69
$$ y = [5713, 7903, 10773, 6856, -2638, 864, 2008, -3180, -4938, -4553, -3589, 1485, 557, 531, 5453, -133, 5382, 9080, 1899, 4952, 3839, 2829, -6545, -3621, -6493, -5936, -5823, -4347, -2719, -2099, -1271, -531, 1431, 4751, 6990, 11289, 7829, 3009, -5087, -9265, -8083, -13770, -4770, -5301, -12542, -12866, -1643, 511, -12495, -10505, 883, 8117, 9069, 5522, -6232, -9232, -12946, -12363, -10887, -6315, -4154, -2191, -12582, -12146, 5840, 6609]
$$ [...]
##END NTUPLES=nD NMR SPECTRUM
##END=
