##TITLE=Analysis number 329024
Compound Code cc 05809
Project Code adrs
Chemist Name ugmt
##JCAMPDX= 6.0         $$ Bruker NMR JCAMP-DX V2.0
##DATA TYPE= NMR SPECTRUM
##DATA CLASS= NTUPLES
##ORIGIN= Bruker BioSpin GmbH
##OWNER= nmr
$$ XWIN-NMR		Version 3.5
$$ Wed Jul 25 12:16:31 2007 GMT Daylight Time (UT+1h)  MAYBRIDGE\nmr@NMR_250MHZ
##.OBSERVE FREQUENCY= 250.131544655141
##.OBSERVE NUCLEUS= ^1H
##.ACQUISITION MODE= SIMULTANEOUS (DQD)
##.ACQUISITION SCHEME= undefined
##.AVERAGES= 16
##.DIGITISER RES= 18
##SPECTROMETER/DATA SYSTEM= dpx250
##.PULSE SEQUENCE= zg30
##.SOLVENT NAME= CDCl3
##.SHIFT REFERENCE= (INTERNAL, CDCl3, 0, 16.522)
##AUDIT TRAIL= $$ (NUMBER, WHEN, WHO, WHERE, WHAT)
$$ ##TITLE= Audit trail, XWIN-NMR		Version 3.5
$$ ##JCAMPDX= 5.01
$$ ##ORIGIN= Bruker BioSpin GmbH
$$ ##OWNER= nmr
$$ C:\u/data/dgb/nmr/ADRS/1460/pdata/1/auditp.txt
$$ ##AUDIT TRAIL=  $$ (NUMBER, WHEN, WHO, WHERE, WHAT)
(   1,<2007-07-25 12:16:08.09 +100>,<MAYBRIDGE\nmr>,<NMR_250MHZ>,
      <created by zg, POWCHK disabled, PULCHK disabled
       configuration hash MD5:
       76 6E 9A 78 1E 09 19 81 EC 84 63 8F B0 6A 59 2D
       data hash MD5: 64K
       4D 38 39 C7 BC 9A A4 23 4E A5 C6 7D 30 CE 52 A7>)
(   2,<2007-07-25 12:16:21.99 +100>,<MAYBRIDGE\nmr>,<NMR_250MHZ>,
      <Start of raw data processing
       ef LB = 0.3 FT_mod = 6 PKNL = 1 SI = 32K 
       data hash MD5: 32K
       C3 8D 08 ED 12 AC 68 F8 7C C9 83 E9 E1 E7 90 9F>)
(   3,<2007-07-25 12:16:24.46 +100>,<MAYBRIDGE\nmr>,<NMR_250MHZ>,
      <apk 
       data hash MD5: 32K
       8F F7 B5 7C 83 77 2B 6E B0 33 B9 D2 34 9A 1A 04>)
(   4,<2007-07-25 12:16:25.26 +100>,<MAYBRIDGE\nmr>,<NMR_250MHZ>,
      <abs ABSG = 5 
       data hash MD5: 32K
       83 A5 33 85 AA 42 45 88 35 73 86 E9 2E 2A F6 5C>)
$$ ##END=
$$ 
$$ hash MD5
$$ 8F 16 F3 4A 3D B1 34 66 7D BF 02 17 3C E5 33 2C
##$RELAX= 
##$RELAX= 
##$RELAX= 
##$RELAX= 
##$RELAX= 
##$RELAX= 
##$RELAX= 
$$ Bruker specific parameters
$$ --------------------------
##$DU= <C:\u>
##$EXPNO= 1460
##$NAME= <ADRS>
##$PROCNO= 1
##$TYPE= <nmr>
##$USER= <dgb>
##$AMP= (0..31)
100 100 100 100 100 100 100 100 100 100 100 100 100 100 100 100 100 100 
100 100 100 100 100 100 100 100 100 100 100 100 100 100 
##$AQSEQ= 0
##$AQ_mod= 3
##$AUNM= <au_zg>
##$AUTOPOS= <22 >
##$BF1= 250.13
##$BF2= 250.13
##$BF3= 250.13
##$BF4= 250.13
##$BF5= 500.13
##$BF6= 500.13
##$BF7= 500.13
##$BF8= 500.13
##$BYTORDA= 1
##$CFDGTYP= 0
##$CFRGTYP= 5
##$CHEMSTR= <none>
##$CNST= (0..31)
1 1 145 1 1 1 1 1 1 1 1 1 1 1 1 1 1 1 1 1 1 1 1 1 1 1 1 1 1 1 1 1 
##$CPDPRG= <>
##$CPDPRG1= <>
##$CPDPRG2= <>
##$CPDPRG3= <>
##$CPDPRG4= <mlev>
##$CPDPRG5= <mlev>
##$CPDPRG6= <mlev>
##$CPDPRG7= <mlev>
##$CPDPRG8= <mlev>
##$CPDPRGB= <>
##$CPDPRGT= <>
##$D= (0..31)
0 1 0 0 0 0 0 0 0 0.06 0 0 0 0 0 0 0.0002 0 0 0 0 0 0 0 0 0 0 0 0 0 0 
0 
##$DATE= 1185362166
##$DBL= (0..7)
120 120 120 120 120 120 120 120 
##$DBP= (0..7)
150 150 150 150 150 150 150 150 
##$DBP07= 0
##$DBPNAM0= <>
##$DBPNAM1= <>
##$DBPNAM2= <>
##$DBPNAM3= <>
$$ [...]
##$SUBNAM7= <"">
##$SUBNAM8= <"">
##$SUBNAM9= <"">
##$SW= 20.6930455092707
##$SWIBOX= (0..15)
0 0 3 0 0 0 0 0 0 0 0 0 0 0 0 0 
##$SW_h= 5175.983436853
##$TD= 65536
##$TD0= 1
##$TE= 297.16
##$TE2= 300
##$TE3= 300
##$TEG= 300
##$TL= (0..7)
0 120 120 120 120 120 120 120 
##$TP= (0..7)
150 150 150 150 150 150 150 150 
##$TP07= 0
##$TPNAME0= <>
##$TPNAME1= <>
##$TPNAME2= <>
##$TPNAME3= <>
##$TPNAME4= <>
##$TPNAME5= <>
##$TPNAME6= <>
##$TPNAME7= <>
##$TPOAL= (0..7)
0.5 0.5 0.5 0.5 0.5 0.5 0.5 0.5 
##$TPOFFS= (0..7)
0 0 0 0 0 0 0 0 
##$TUNHIN= 0
##$TUNHOUT= 0
##$TUNXOUT= 0
##$USERA1= <user>
##$USERA2= <user>
##$USERA3= <user>
##$USERA4= <user>
##$USERA5= <user>
##$V9= 5
##$VALIST= <valist>
##$VCLIST= <CCCCCCCCCCCCCCC>
##$VD= 0
##$VDLIST= <DDDDDDDDDDDDDDD>
##$VPLIST= <PPPPPPPPPPPPPPP>
##$VTLIST= <TTTTTTTTTTTTTTT>
##$WBST= 1024
##$WBSW= 4
##$XGAIN= (0..3)
0 0 0 0 
##$XL= 0
##$YL= 0
##$YMAX_a= 480700
##$YMIN_a= -484747
##$ZGOPTNS= <>
##$ZL1= 120
##$ZL2= 120
##$ZL3= 120
##$ZL4= 120
##$ABSF1= 16.522
##$ABSF2= -4.171173
##$ABSG= 5
##$ABSL= 3
##$ALPHA= 0
##$AQORDER= 0
##$ASSFAC= 0
##$ASSFACI= 0
##$ASSFACX= 0
##$ASSWID= 0
##$AUNMP= <proc_1d>
##$AZFE= 0.1
##$AZFW= 0.1
##$BCFW= 0
##$BC_mod= 0
##$BYTORDP= 0
##$COROFFS= 0
##$CY= 12.5
##$DATMOD= 1
##$DC= 0
##$DFILT= <>
##$DTYPP= 0
##$F1P= 14.0000005364418
##$F2P= -0.99999901652339
##$FCOR= 0.5
##$FTSIZE= 32768
##$FT_mod= 6
##$GAMMA= 0
##$GB= 0
##$INTBC= 1
##$INTSCL= 1
##$ISEN= 128
##$LB= 0.3
##$LEV0= 0
##$LPBIN= 0
##$MAXI= 10000
##$MC2= 0
##$MEAN= 0
##$ME_mod= 0
##$MI= 0
##$NCOEF= 0
##$NC_proc= -3
##$NLEV= 6
##$NOISF1= 0
##$NOISF2= 0
##$NSP= 0
##$NTH_PI= 0
##$NZP= 0
##$OFFSET= 16.522
##$PC= 1
##$PHC0= 99.63471
##$PHC1= 94.0854
##$PH_mod= 1
##$PKNL= yes
##$PPARMOD= 0
##$PSCAL= 4
##$PSIGN= 0
##$REVERSE= no
##$SF= 250.13
##$SI= 32768
##$SIGF1= 0
##$SIGF2= 0
##$SINO= 400
##$SIOLD= 32768
##$SREGLST= <1H.CDCl3>
##$SSB= 0
##$STSI= 32768
##$STSR= 0
##$SW_p= 5175.98343685301
##$SYMM= 0
##$S_DEV= 0
##$TDeff= 65536
##$TDoff= 0
##$TI= <Analysis number 999999
Compound Code 99
Book Reference 9
Project Code 9>
##$TILT= no
##$TM1= 0
##$TM2= 0
##$TOPLEV= 0
##$USERP1= <user>
##$USERP2= <user>
##$USERP3= <user>
##$USERP4= <user>
##$USERP5= <user>
##$WDW= 1
##$XDIM= 32768
##$YMAX_p= 533739166
##$YMIN_p= -1312982
$$ End of Bruker specific parameters
$$ ---------------------------------
##NTUPLES= NMR SPECTRUM
##VAR_NAME=  FREQUENCY,     SPECTRUM/REAL,   SPECTRUM/IMAG
##SYMBOL=    X,             R,               I
##VAR_TYPE=  INDEPENDENT,   DEPENDENT,       DEPENDENT
##VAR_FORM=  AFFN,          ASDF,            ASDF
##VAR_DIM=   32768,         32768,           32768
##UNITS=     HZ,            ARBITRARY UNITS, ARBITRARY UNITS
##FACTOR=    0.157963299565203, 1,           1
##FIRST=     4132.6476996994, 0,             0
##LAST=      -1043.33573715361, 0,           0
##MIN=       -1043.33573715361, -1312982,    0
##MAX=       4132.6476996994, 533739166,     0
$$ Real data points
##PAGE= N=1
##DATA TABLE= (X++(R..R)), XYDATA
$$ [...]
16115E1700m202k727l83o30m770J437r00J898N00n17P63l877k679J121J9J410
16099C8163L099l081j897M149M151k716k060R61k78m110J412Q138j035k764J940
16084D4072J874o65R98m06k973N053j915n270l637M557M070o585j890M556L270
16069D5109j008K114K028J641q27l812o124q41M267K967j311k052r04j399R11
16054D0759N501j539j200J593m982K792J706J325j200K189j130L281j906j492
16040D5697l702k680l274n408o415l638J546R307R603N250J400j361N052q33M23
16025E0967L535k679o044k490j784N570K933k010k926o046J17L013j076j13J746
16010D2713l87l018j160l33J991M853J264K958M240M396l056j282j177o341r14
$$ plain form
16115 51700 47498 44771 44388 43758 38988 40425 39525 41423 41923 41406 42169 38292 35613 36734 36753 38163
16099 38163 41262 38181 36284 40433 44584 41868 39808 40769 40491 36381 37793 45931 44896 42132 44072
16084 44072 45946 45281 46279 45873 42900 47953 46038 40768 37131 41688 45758 39173 37283 41839 45109
16069 45109 44101 46215 48243 49884 49057 45245 39121 38280 42547 45514 44203 42151 41247 39848 40759
16054 40759 46260 44721 43521 45114 40132 42924 44630 45955 44755 46944 45814 49095 47189 45697
16040 45697 41995 39315 36041 30633 24218 20580 22126 31433 41036 46286 47686 46325 51377 50544 50967
16025 50967 54502 51823 45779 43289 41505 47075 50008 47998 45072 39026 39143 42156 41080 40967 42713
16010 42713 42326 39308 38148 37815 39806 44659 45923 48881 53121 57517 54461 53179 52002 45661 44747
15995D4747P60J251j002J706M94J52l068m026l75j51j19L706K240L042P081Q38
15979E7276p222k132m096O58O250L692j164M68j554k784N17l578K512K99j578
15964D7564j789k804N101k669l927N000L882n31j637J815M733j600p96J691m031
15949E0002j615L954J463J314m784n530j936K486k396l716J453P22j827J356L765
15934D4711J900K014K214k431M19j606k675l152o33P466O891n168m784o804J888
15919D0250J819K958L026J50j756P59O97l63M79R67J641L127L111K770J893j0138
15903E1390l23k205k521M910J947j492K754J081k948J559K838K287K052K616l794
15888F0151O03j78l778j20m20K154j055r81L497m408J067k305l120K775J510K48
$$ plain form
15995 44747 45507 46758 45756 47462 47956 48108 45040 41014 40639 40488 40369 44075 46315 49357 56438 57276
15979 57276 50054 47922 43826 44484 50734 54426 53262 53730 52176 49392 49909 46331 48843 49142 47564
15964 47564 45775 42971 48072 45403 41476 46476 50358 49827 48190 50005 54738 53138 52342 54033 50002
15949 50002 48387 52341 53804 55118 50334 44804 42868 45354 42958 39242 40695 41417 39590 40946 44711
15934 44711 46611 48625 50839 48408 48827 47221 44546 41394 40761 48227 55118 49950 45166 38362 40250
15919 40250 42069 45027 48053 48203 46447 47206 47903 47540 48019 48986 50627 53754 56865 59635 61528 51390
15903 51390 51067 48862 46341 51251 53198 51706 54460 55541 52593 54152 56990 59277 61329 63945 60151
15888 60151 60754 60576 56798 56678 56258 58412 57357 56376 59873 55465 56532 54227 51107 53882 55392 55640
15872E5640M79m614m982J062J50N46K940oj426J625N71J559J479j453j758K186
15856E3998L012L572J326K077n235o48K026J860j364o98j996j078j735l464K603
15841E4256O190P279J026m104j713K238r36j0493J520M411K075l087l507K5Q78
15826E6058l33n33N801o13j844L921M276j263k235q75J751k066j579L495j806
15811F2155j935k34M811n763j76M589M837K029N062L437P15m923k813j375q7J684
15795G2013K535L199k404P78p68j235l781Q06N41j627k86j710n993o305J486M489
15779F1738p99l279l272M627K868p15j256L275j177j295m372L025K709L075K105
15764F7257R12k02o59M062O048L661l303r10m966j526J418L412N087k102k322
$$ plain form
15872 55640 56119 51505 46523 47585 47735 48281 51221 51215 49789 51414 51985 53544 55023 53570 51812 53998
15856 53998 57010 60582 61908 63985 58750 58102 60128 61988 60624 59926 57930 56852 55117 51653 54256
15841 54256 60446 67725 68751 64647 62934 65172 64236 53743 55263 59674 61749 58662 55155 55180 56058
15826 56058 55725 55192 60993 60380 58536 62457 66733 65470 63235 62360 64111 62045 60466 63961 62155
15811 62155 60220 59986 64797 59034 58858 63447 68284 70313 75375 78812 79527 74604 71791 70416 70329 72013
15795 72013 74548 77747 75343 76121 75353 74118 70337 71143 71684 70057 69771 68061 62068 55763 57249 61738
15779 61738 60939 57660 54388 59015 61883 61168 59912 63187 62010 60715 56343 59368 62077 65152 67257
15764 67257 68169 67967 67308 71370 77418 81079 77776 76866 71900 70374 71792 75204 80291 78189 75867
15749G5867l52k756j258L51L18m156j347k657j226j220j789j494O790L717m29
15734F8359p086J461Q62l99J615j716J756K50m299l330J190M890j221K514M73
15719F5319J607J185j350j870m0M171N308o647q193K578P213J938k83J398M387
15704G6721k282k316N826j171mJ207n432q008n73J537Q91k108l844q2M693k551
15688F2504j64j28M81J836P52P93L340k259k158J077L91J964K484q37q52j321
15672F7903k465L959P71J354k019K539K868j081m334n928J34J873Q01L934r84
15657F9325N43M70J991k341p56j61J344l425L355M952J20m358m89J00J929K918
15641G5517M21j240p291k235L395P428l222l828M026J109N425j524p078j509l284
$$ plain form
15749 75867 75515 72759 71501 71852 72170 68014 66667 64010 62784 61564 59775 58281 65071 68788 68359
15734 68359 61273 62734 63596 63197 64812 63096 64852 65102 60803 57473 58663 63553 62332 64846 65319
15719 65319 66926 68111 66761 64891 64851 69022 74330 67683 59490 62068 69281 71219 70936 72334 76721
15704 76721 74439 72123 77949 76778 76774 77981 72549 64541 63968 65505 66396 64288 60444 60362 65055 62504
15688 62504 62340 62212 62693 64529 65281 66074 69414 67155 64997 66074 66465 68429 70913 70076 69224 67903
15672 67903 65438 69397 70168 71522 69503 72042 74910 73829 69495 63567 63701 65574 66375 70309 69325
15657 69325 69868 70338 72329 69988 69232 69071 70415 66990 70345 75297 75417 71059 70570 70670 72599 75517
15641 75517 75938 74698 67407 65172 68567 75995 72773 68945 72971 74080 79505 77981 70903 69394 66110
15626F6110l824J490R076O951j881n008j273K933L87m029J724M005R85K583J214
15611H1443k321m204O18K26L050j046p16K188Q00J513K442n617k930q70j422M963
15595G8117L755j532o67p443j000L780J575k893R19Q69J676M577P66k255j266
15580G8978k94n143l844k159J527J784M725P037M8l50j447l77K741M306K173l379
15564H6326j631j11l330K643J31n537k569k8M322N015j50P87K785K711n534j109
15548H4721L041m28k303n159K513J841N328k595j756o77k837L079L246k021L192
15533H9185J72j043l407J029K355l044j207j668r47P86L986j940l745M367K201
15518H7080K702L472M80N523P202J657j31M504M347k652l755p106k678p276m264
$$ plain form
15626 66110 62286 63776 72852 79803 77922 72914 71641 74574 74961 70932 72656 76661 77646 80229 81443
15611 81443 79122 74918 75536 75762 78812 77766 77050 79238 80038 81551 83993 78376 75446 74576 73154 78117
15595 78117 81872 80340 79673 72230 71230 75010 76585 73692 74611 75480 77156 81733 82499 80244 78978
15580 78978 78684 73541 69697 67538 69065 70849 75574 82611 82659 82309 80862 80485 83226 87532 89705 86326
15564 86326 84695 84584 81254 83897 84028 78491 75922 75894 80216 85231 85081 85868 88653 91364 85830 84721
15548 84721 87762 87334 85031 79872 82385 84226 89554 86959 85203 84526 81689 84768 88014 85993 89185
15533 89185 89357 88314 84907 85936 88291 85247 84040 82372 81425 82211 86197 84257 80512 84879 87080
15518 87080 89782 93254 93734 99257 106459 108116 107985 112489 116836 114184 110429 103323 100645 93369 89105
15503H9105k230j178L583O425R61n155o310M6N461K652N140L061m10m12l926k597
15487I4216l712j675N40k079k215O93L279K608j678J821N445L98n636J431J236
15472I4672o9l049J438L643q33o84j519J813j126J504L880j488k662m055M424
15457I5889J296n329j737J823M565P69L233K315l226o082o028O24P11J110M245
15442I4178L989J449J697Q88j405J957K303K346j335j763l883n410K007k241k39
15427I4538M86L362p98L9K084J083j742j840j020R29k927j719M049O734l058J50
15411A00350M363K777j533j462j350J585j334k554J621j57o29l30m85l741j968
15396I5153j844O411L681M64l051K357K548M955l086n453k28N271j816l232l85
$$ plain form
15503 89105 86875 85697 89280 95705 96666 91511 85201 85247 90708 93360 98500 101561 101151 100739 96813 94216
15487 94216 90504 88829 89369 87290 85075 85768 89047 91655 89977 91798 97243 97641 92005 93436 94672
15472 94672 94603 91554 92992 96635 95802 95118 93599 95412 94286 95790 99670 98182 95520 91465 95889
15457 95889 97185 91856 90119 91942 96507 97276 100509 102824 99598 93516 87488 88112 88823 89933 94178
15442 94178 98167 99616 101313 102201 100796 102753 105056 107402 106067 104304 100421 95011 97018 94777 94538
15427 94538 95024 98386 97588 97627 99711 100794 99052 97212 96192 97121 94194 92475 96524 103258 100200 100350
15411 100350 104713 107490 105957 104495 103145 104730 103396 100842 102463 102306 101677 101347 100862 97121 95153
15396 95153 93309 99720 103401 103865 100814 103171 105719 110674 107588 102135 101907 107178 105362 102130 101745
15381A01745o5l752J727K044J637P182J136J12K078k868m289k779K917l129k921
15366A00775J794K313L426K597O21k786n173M96O62K357J607L56k531J843J369
15351A09726M308J036k003J219P74k114j704K049j514K390K489P31l526k737M88
15336A11612p18K072j834M001M306K151k506j858J814L046P51m902L236K232k548
15321A20855j133L938Q45n583j682K040L660l509q829M80J26m107M262L167M285
15306A18815k189J897J040n40K529J099m333j569R58k3l417N82M225M42K240M916
15290A26672j599J966M558K583o825m720M116j1n178O71L46p565j523Q629M595
15275A26715J705j644m601q56M354L14M440K33r782K81L882M241L142P43l186
$$ plain form
15381 101745 101680 97928 99655 101699 103336 110518 111654 111766 113844 110976 106687 103908 106825 103696 100775
15366 100775 102569 104882 108308 110905 111526 108740 103567 104063 104725 107082 108689 109045 106514 108357 109726
15351 109726 114034 115070 113067 114286 115060 112946 111242 113291 111777 114167 116656 117387 113861 111124 111612
15336 111612 110894 112966 111132 115133 119439 121590 119084 117226 119040 122086 122837 117935 121171 123403 120855
15321 120855 119722 123660 124505 118922 117240 119280 122940 119431 110602 111082 111208 107101 111363 114530 118815
15306 118815 116626 118523 119563 119023 121552 122651 118318 116749 117707 117684 114267 114849 119074 119516 121756 126672
15290 126672 125073 127039 131597 134180 127355 122635 126751 126740 121562 122233 122579 115014 113491 122120 126715
15275 126715 128420 126776 122175 121319 125673 125987 130427 130660 120878 121159 125041 129282 132424 133167 129981
15260A29981k721L442L708m343j824j112O46J793j011M27j127k949j246L831K342
15245A29837o27m883K623K504m0Q19M449K637L077k976j581J230K146M09N364
15230A44988J544l352p596q61J047J027j828k161J098N798N13n32m068l96Q98
15215A36119r71l077M888P017Q37k93k751j073j060k090j773j033j524J256M148
15200A38620N3O366M311j18j137K927j378k034j270l27j066J258L485K160o90
15185A51160J923j571m705l444K271J781k165J234K642j082K779L662j324n136
15171A48025K259K383K721J805M516J911J417J377J501K256n112l544N084O386
15157A72985r0L027R7K895N181J5317J9067K5574J7414o234j4564n23J2087J3016
$$ plain form
15260 129981 127260 130702 134410 130067 128243 127131 127777 129570 128559 128986 127859 124910 123664 127495 129837
15245 129837 129210 124327 126950 129454 129414 130233 134682 137319 140396 137420 135839 137069 139215 139624 144988
15230 144988 146532 143180 135584 134723 135770 136797 134969 132808 133906 139704 140217 139685 135617 135221 136119
15215 136119 135148 132071 136959 143976 144813 144520 141769 140696 139636 137546 135773 134740 133216 134472 138620
15200 138620 138673 145039 149350 149232 148095 151022 149644 147610 146340 146013 144947 146205 149690 151850 151160
15185 151160 153083 151512 146807 143363 145634 147415 145250 146484 149126 148044 150823 154485 153161 148025
15171 148025 150284 152667 155388 157193 161709 163620 165037 166414 167915 170171 165059 161515 166599 172985
15157 172985 172895 175922 176019 178914 184095 199412 218479 244053 261467 255233 240669 240146 252233 265249
15143B65249J0910k413m564K696l240j0250p841P051J4715J3297j1581k8801k4041
15130B21187j1902j2745j4127p909l141k395j52j66j003m325l792m679Q18K587
15116A58256J595r43k87J33J520L237J264j362j809l941M480J988r62j943n46
15101A60680J337O440K281J307m73K433k247o8l12p388l398L035J869Q53j318
15086A65031M513k134J158N226r06K593M98o938j399J086L109K744l92P48k518
15071A72419n988J554J518J977k315m269M814N822j485l576j967L013L764L43
15057A75624K37j642j552J368L910l010o08k038N035M170L153m80Q64j980O24
15042A83675k11J200J91J014j40q01L427m3j182M26J668K599k787m289k693L432
$$ plain form
15143 265249 276159 273746 269182 271878 268638 258388 250547 257598 272313 285610 274029 245228 221187
15130 221187 209285 196540 182413 174504 171363 168968 168816 168650 167647 163322 159530 154851 155669 158256
15116 158256 159851 158908 158621 158754 160274 163511 164775 163413 161604 157663 162143 164131 163169 161226 160680
15101 160680 162017 168457 170738 172045 171572 174005 171758 171690 171378 163990 160592 163627 165496 166349 165031
15086 165031 169544 167410 168568 173794 172888 175481 175979 169041 167642 168728 171837 174581 174189 174937 172419
15071 172419 166431 167985 169503 171480 169165 164896 169710 175532 174047 170471 168504 171517 175281 175624
15057 175624 175861 174219 172667 174035 177945 174935 174327 172289 177324 181494 184647 184167 185031 183051 183675
15042 183675 183464 184664 184855 185869 185729 184928 188355 188312 187130 187556 189224 191823 189036 184747 182054 185486
15026A85486M503L50J515K012K186M37J190m89k900k188j680r62L571M12k969
15011A90474L518K414K916L273K816L483l421n648k213M741L914K176j678K203
14997B08968L494l704k353j238O528J843m366m986o103n865l016o383o181J215
14983A77853L735N459O211N029O904O940K659K12J035M792m293k128QK263M303
14968B20982M517L488J33L47L039N351k846n898J466J097j475o366l458N063K998
14953B28438j177N94j51j452j333J038K453P51q96o11m80o44J999j961k226K860
14937B27202J3l13J078l95N223M151n095j420M348L465J394l06L860l792K11L209
14921B42833R82J238k171J856J622k449l769N587K737N648M968n3N60l235k76
$$ plain form
15026 185486 189989 190339 191854 193866 196052 196489 197679 197190 194290 192102 190422 189460 193031 193443 190474
15011 190474 193992 196406 199322 202595 205411 208894 205473 199825 197612 202353 206267 208443 206765 208968
14997 208968 212462 208758 206405 205167 211695 213538 209172 204186 198083 192218 189202 182819 176638 177853
14983 177853 181588 187047 193258 198287 205191 212131 214790 215002 216037 220829 216536 214408 214416 216679 220982
14968 220982 225499 228987 229120 229467 232506 237857 235011 229113 230579 231676 230201 223835 220377 225440 228438
14953 228438 227261 227855 227704 226252 224919 225957 228410 229161 228265 227654 227174 226530 228529 226568 224342 227202
14937 227202 227215 226902 227980 227585 232808 236959 231864 230444 234792 238257 239651 239345 243205 239413 239624 242833
14921 242833 243815 245053 242882 244738 246360 243911 240142 245729 248466 254114 259082 259029 259589 256354 256078
14906B56078M868K013j339l344J594n06j417l759k592j211K883Q183J335l418
14892B59368j181o92k741J33j886M355Q165l886m632K063N738K569q48K7j051
14877B65501o13K365R553M253K092j621l650K379J454j321M321j06q02O319k678
14862B87446l116J14N755N211J178o466J360N32m740o38J097K054L267L157l703
14847B92508Q85O78L335k797k364J859J417O54M76M316L802j16k684N53K357J706
14831C06585J618j041K623L258O645o39L86L861J99k48P43n045o575j20L999M091
14815C20340J255O36J441K471M722j108N809N528k644N249O543P241Q056J1339
14801C76878J7807K2361K9987K2266N003j0069k3281k2252m762N841K0425K5034
$$ plain form
14906 256078 260946 262959 261620 258276 259870 259364 257947 254188 251596 250385 253268 261451 262786 259368
14892 259368 258187 257495 254754 254887 253001 257356 265521 261635 257003 259066 264804 267373 266525 266552 265501
14877 265501 264888 267253 276806 281059 283151 281530 277880 280259 281713 280392 284713 284607 283805 290124 287446
14862 287446 284330 284444 290199 295410 296588 290122 291482 292014 287274 286636 287733 289787 293054 296211 292508
14847 292508 293393 294071 297406 294609 292245 294104 295521 296175 296651 300967 304769 304653 301969 302522 304879 306585
14831 306585 308203 307162 309785 313043 319688 319049 319435 323296 323495 323247 323990 318945 312370 312250 316249 320340
14815 320340 321595 322231 323672 326143 330865 329757 335566 341094 338450 343699 350242 357483 365539 376878
14801 376878 394685 417046 447033 469299 474302 464233 440952 418700 413938 419779 440204 465238
14789D65238J4973J843q103k0361l3445l0747j9116j1258n316k483O971j79L398
14776C61415l229k763L696J0636M093J754l141n210j226P137M142k953k904K17
14762C71664N905k576L623K752K909L156M93J203p58m275J514K883l224K637N596
14747C93502P952J0157j829p10L47M074r42k70J011Q122L861L995L518k63L415
14732D35940L375J01L882M45K699L001O011P238K251M611K803M231O533J0398
14718D93519M804K7r35k298K617M859M338M133L933K636M212M597N316O976R781
14703E48515Q910L724O588R214N965L521N955J1940J3605J5308P998N478R950
14690F56671J8922J4161J6339J7393K0427K0177K6286L2734L1512L4830M5534
$$ plain form
14789 465238 480211 482054 473951 453590 420145 389398 370282 359024 353708 351225 358196 358017 361415
14776 361415 358186 355423 359119 369755 373848 375602 372461 367251 366025 373162 377304 374351 371447 371664
14762 371664 377569 374993 378616 381368 384277 387433 387926 389129 388371 384096 385610 388493 385269 387906 393502
14747 393502 401454 411611 409782 409072 409419 413493 412551 412281 413292 421414 425275 429270 432788 432525 435940
14732 435940 439315 439416 443298 443743 446442 449443 455454 462692 464943 469554 472357 476588 483121 493519
14718 493519 498323 498350 497415 495117 497734 502593 506931 511064 514997 517633 521845 526442 531758 538734 548515
14703 548515 557425 561149 567737 576951 582916 586437 592392 604332 617937 633245 641243 646721 656671
14690 656671 675593 689754 706093 723486 743913 764090 790376 823110 854622 889452 934986
14679I34986N4129O6631P9146Q5571R3454J12041J27917J63562K22617L23029
14669B263083M83761P02736R85564J280831J481091J476309J182664O16721j19577
14660A0353183q46490j382722j625493j577875j312576r71405o69504m29169k65584
14651A272365j61810j06988p4021o1946m9595m3422l9560l7209k6683k1377j0415
14640F39339k177M460M549O759R250J1775J2871J0256Q704Q678J4229J1802P788
14627G48283P150P203J2946J6173R772K475J743J088O767R530K038j512r82J739
14613H24413K78j244m833l232j025o828q164n645l790q784j3810o771k630n753
14599G52182q004q210r978n725o058j0691p852n306m251n372k890j557k764l938
$$ plain form
14679 934986 989115 1055746 1134892 1220463 1313917 1425958 1553875 1717437 1940054 2263083
14669 2263083 2746844 3449580 4435144 5715975 7197066 8673375 9856039 10472760 10353183
14660 10353183 9506693 8123971 6498478 4920603 3608027 2636622 1967118 1537949 1272365
14651 1272365 1110555 1003567 929546 867600 818005 774583 735023 697814 671131 649754 639339
14640 639339 637162 641622 646171 652930 662180 673955 686826 697082 705786 714464 728693 740495 748283
14627 748283 755433 762636 775582 791755 801527 804002 805745 806833 813600 823130 825168 823656 822674 824413
14613 824413 824691 823447 818614 815382 814357 807529 799365 793720 789930 781146 767336 760565 757935 752182
14599 752182 744178 735968 725990 720265 714207 703516 695664 690358 686107 680735 677845 676288 673524 669586
14585F69586p888n439l068n546o159m274n557m116m699n992n208o796r3p2j855
14570F02824q715j1578P41l433m07L313M250n59j603j183l05q62j697p864p196
14555E65726l365k144K109K985J879J211k406n059p50k508m888K260J097j589
14541E54558M57J187k27M904L157k970n493l31J166P68k635n392J453n49J64K981
14525E53198J808J094j884n56j673J084P730P266j402J590l348l081L390l902
14511E61314k151L884O224R52J033K66K17p349l289J577K235M337K539R26K011
14496E74726L409J248l430p30n40P13J594l053K406M150K510K546l811J434M219
14481E87391J024M429K978P64j104p022l640N222L802L675O392J166k235K564
$$ plain form
14585 669586 661698 656259 653191 647645 641486 637212 631655 627539 622840 616848 611640 604844 604751 604679 602824
14570 602824 594109 582531 583272 579839 579432 582745 586995 586436 584833 583650 583345 582483 580786 572922 565726
14555 565726 562361 560217 562326 565311 567190 568401 565995 560936 560186 557678 552790 555050 556147 554558
14541 554558 555015 556202 555975 560879 564036 561066 555573 555242 556408 557176 554541 549149 550602 550053 550217 553198
14525 553198 555006 556100 554216 553660 551987 553071 560801 568067 566665 568255 564907 561826 565216 561314
14511 561314 559163 563047 569271 570223 571256 571522 571739 564390 561101 562678 564913 569250 571789 572715 574726
14496 574726 578135 579383 575953 575223 574683 575396 576990 573937 576343 580493 583003 585549 581738 583172 587391
14481 587391 588415 592844 595822 596586 595482 588460 584820 590042 593844 597519 603911 605077 602842 605406
14467F05406J1597R306M446J1077J0981J1630M147K935P20o489o288m144k835
14454F52489j0331r488n238L53N756J051m62l73J906J873O226M30L853O562N822
14439F60429J981l108k470j914M606J0625N798K252r55J20J145M339N8J650P003
14424F91559J481N10L935M005N287M176M020K909N590O442P588L432M697M997
14410G50628O690J0135N939R932J1662Q173P926J6846J6612J7885K7004K9415
14398I18847L4917M5043O2171P0707P9657J07482J15402J18195J29339J15012
14388A796772Q0825M4941m998n1680r4811j18163j36812j29828j17483j01146
14378A167617q5313p3140m9746l0823k1408j8047j7710j5144p758l994p726q612
$$ plain form
14467 605406 617003 626309 630755 641832 652813 664443 668590 671525 672245 665756 659468 655324 652489
14454 652489 642158 632670 627432 627785 633541 634592 634130 633757 635663 637536 643762 644192 648045 654607 660429
14439 660429 662410 659302 656832 654918 659524 670149 675947 678199 677244 677364 678509 682848 682906 684556 691559
14424 691559 693040 693550 697485 701490 706777 710953 714973 717882 723472 729914 737502 740934 745631 750628
14410 750628 757318 767453 773392 783324 794986 803159 811085 827931 844543 862428 889432 918847
14398 918847 953764 998807 1060978 1131685 1211342 1318824 1434226 1552421 1681760 1796772
14388 1796772 1877597 1922538 1917540 1865860 1771049 1652886 1516074 1386246 1268763 1167617
14378 1167617 1082304 1009164 959418 928595 907187 889140 871430 856286 848528 844534 836808 828196
14366H28196n172m893j371j421M017L613K211m179k171O025M192o673k784K615
14352H22205K978N367R19k597N20L828M327K216K178J429K688O584N427L389P357
14337H68815P121K917K773K484J357R046O737k18L595M483k082k782o2L116M984
14322I12284L736L330R165N433M066O257O762L023j410k755K616P734M391J702
14308I66334k06N79Q210N702j26R27m42l52P294J1295R036P05N528K267P333P517
14292A031601N165J67k55q63r80j764J1337J1038Q565Q586O627J790L834L719
14278A088567M478J808L793M999P323P452R477P589L97J689K461O338P592L701
14264A157664L350J721K227P679O695Q027J244N123R461K450L815N304M266O206
$$ plain form
14366 828196 823024 818131 816760 815339 819356 822969 825180 821001 818830 824855 829047 822374 819590 822205
14352 822205 825183 830550 831469 828872 829392 833220 837547 839763 841941 843370 846058 852642 858069 861458 868815
14337 868815 875936 878853 881626 884110 885467 894513 901250 901032 904627 909110 907028 904246 904184 907300 912284
14322 912284 916020 919350 928515 933948 938014 944271 951033 954056 952646 949891 952507 960241 964632 966334
14308 966334 966128 966707 974917 980619 980493 981420 980978 980626 987920 999215 1008251 1008956 1014484 1016751 1024084 1031601
14292 1031601 1036766 1036933 1036678 1035815 1034835 1033071 1044408 1055446 1064011 1072597 1079224 1081014 1084848 1088567
14278 1088567 1093045 1094853 1098646 1103645 1110968 1118420 1127897 1135486 1135883 1137572 1140033 1146371 1153963 1157664
14264 1157664 1161014 1162735 1164962 1172641 1179336 1187363 1188607 1193730 1203191 1205641 1209456 1214760 1219026 1225232
14250A225232J2360R319J0570J4090N531M632N066Q268N151M324k058K052L453
14237A307990k126m790J747N385j040Q281J1279J0569L699L159P221P052l081
14224A355345J46N298Q364J6018J0504M333N014O417J412M230P015Q496P735O336
14210A446663J620O324J0919J3265J0136J0120R243Q344K074J0914J3650R726
14198A552998R671J1664J5336J5929K0694J9645K0065K7695K5489J8758K1807
14187A759751J9731J6138J1135R24p048j3412j2936j6217j2492r266j2011j2200
14175A712097r0R59J921K781K178M929J696K926P149L127N593R372J0104O158
14161A770900N904R365P423J0007J0789J2250R982J6401R204N387R717R910R391
$$ plain form
14250 1225232 1237592 1246911 1257481 1271571 1277102 1281734 1286800 1295068 1300219 1304543 1302485 1304537 1307990
14237 1307990 1305864 1301074 1302821 1308206 1307166 1315447 1326726 1337295 1340994 1344153 1351374 1358426 1355345
14224 1355345 1355491 1360789 1369153 1385171 1395675 1400008 1405022 1411439 1412851 1417081 1424096 1432592 1440327 1446663
14210 1446663 1448283 1454607 1465526 1478791 1488927 1499047 1508290 1516634 1518708 1529622 1543272 1552998
14198 1552998 1562669 1574333 1589669 1605598 1626292 1645937 1666002 1693697 1719186 1737944 1759751
14187 1759751 1779482 1795620 1806755 1807679 1800631 1787219 1774283 1758066 1745574 1736308 1724297 1712097
14175 1712097 1712007 1712966 1714887 1717668 1719846 1724775 1726471 1729397 1736546 1739673 1745266 1754638 1764742 1770900
14161 1770900 1776804 1786169 1793592 1803599 1814388 1826638 1836620 1853021 1862225 1867612 1877329 1887239 1896630
14148A896630O365N631R305P835O982J2308J3074R913J6201J3393N988R907Q154
14135B021686N050n863k014K004O633J1414J0089J2301K1471K0196K3534J9629
14123B146130K0738K4182K0603J8381J9369J8329J2104J6877J1838M436N097J1504
14111B329588N584L14L359N333R893R012P538R069P271O891P711P522Q776J3726
14097B431587J1824J2680R425Q742P622P119P488J4262L979O444J6634J9117J3879
14084B570802J7655K2392K5613K8941K7752K3550J9146K1027K8014L0785K6159
14073B841836K2453K8588L0045L3151L8656M6973M9938N0719N5218N3807M1119
14062C292503L2726J6166L028p118j8977k4232k8050k7254j8666j8664j2993O94
$$ plain form
14148 1896630 1902995 1908626 1917931 1925766 1932748 1945056 1958130 1968043 1984244 1997637 2003625 2013532 2021686
14135 2021686 2026736 2020873 2018859 2020863 2027496 2038910 2048999 2061300 2082771 2102967 2126501 2146130
14123 2146130 2166868 2191050 2211653 2230034 2249403 2267732 2279836 2296713 2308551 2312987 2318084 2329588
14111 2329588 2335172 2335486 2338845 2344178 2354071 2363083 2370621 2379690 2386961 2393852 2401563 2409085 2417861 2431587
14097 2431587 2443411 2456091 2465516 2474258 2481880 2488999 2496487 2510749 2514728 2521172 2537806 2556923 2570802
14084 2570802 2588457 2610849 2636462 2665403 2693155 2716705 2735851 2756878 2784892 2815677 2841836
14073 2841836 2864289 2892877 2922922 2956073 2994729 3041702 3091640 3142359 3197577 3251384 3292503
14062 3292503 3325229 3341395 3344423 3337305 3318328 3294096 3266046 3238792 3220126 3201462 3188469 3189163
14050C189163K164J429M858J0468J1765J7803J5813K2518K4070K0668K5029K2798
14038C368546J9984K6837K6344K5416K8131K5706K6304K2818K3332K5877K5017
14027C644312K3190K1374J9727K7728K8013K5285L2531K8680L0365L5532M0782
14016C957519M0805M4448L6197L6797M3282M6393M8192N0345M6336N2698N4499
14005D457511N3085N4454N1960N0865N1556M9928N0652O0007O6641O3004O5355
13994E075018O9744O6233P4965P5755O9441P5430P6243Q3302Q5738R4684R9742
13983E946295J02413J14894J20985J19200J27981J36581J44308J57253J67144
13974G137054J79300J96677K05304K11703K32482K60003K82747L06474L25032
$$ plain form
14050 3189163 3191327 3192756 3197614 3208082 3219847 3237650 3253463 3275981 3300051 3320719 3345748 3368546
14038 3368546 3388530 3415367 3441711 3467127 3495258 3520964 3547268 3570086 3593418 3619295 3644312
14027 3644312 3667502 3688876 3708603 3736331 3764344 3789629 3822160 3850840 3881205 3916737 3957519
14016 3957519 3998324 4042772 4078969 4115766 4159048 4205441 4253633 4303978 4350314 4403012 4457511
14005 4457511 4510596 4565050 4617010 4667875 4719431 4769359 4820011 4880018 4946659 5009663 5075018
13994 5075018 5144762 5210995 5285960 5361715 5431156 5506586 5582829 5666131 5751869 5846553 5946295
13983 5946295 6048708 6163602 6284587 6403787 6531768 6668349 6812657 6969910 7137054
13974 7137054 7316354 7513031 7718335 7930038 8162520 8422523 8705270 9011744 9336776
13965I336776L61083L96085M32623M75908N30782N96209O66125P49468Q45763
13956A4390822R60822J091554J253216J458316J711923K016762K383016K837381
13948B8103812L405362M141881N134101O456926Q257795J0612396J3520257J6812474
13940I6445004K0074683K2632966K3737268K2707599J9058551J3188026N811801
13933B23655898k708121j0979774j7663388k2528145k5014523k4887410k2821455
13926I7053082j9585836j5923879j2452964r527115p238465n544942m335561l454677
13918A8989643k798514k292774j890625j559595j293065j067227q79179p23324
13910F485340n99122n02684m30205l67154l16007k74086k38175k06688j88308
$$ plain form
13965 9336776 9697859 10093944 10526567 11002475 11533257 12129466 12795591 13545059 14390822
13956 14390822 15351644 16443198 17696414 19154730 20866653 22883415 25266431 28103812
13948 28103812 31509174 35651055 40785156 47242082 55499877 66112273 79632530 96445004
13940 96445004 116519687 139152653 162889921 185597520 204656071 217844097 223655898
13933 223655898 220947777 209968003 192304615 169776470 144761947 119874537 97053082
13926 97053082 77467246 61543367 49090403 39563288 32324823 26779881 22444320 18989643
13918 18989643 16191129 13898355 12007730 10448135 9155070 8087843 7208664 6485340
13910 6485340 5886218 5383534 4953329 4586175 4270168 3996082 3757907 3551219 3362911
13901C362911j62816j43936j25967j17143j05682r7246r0518p4654p3150o8007
13891B303792o2369o0623n4859m5202l7600l4710l1827l2268l3144l3322k7338
13880A850530k9228k4137k4729j4472j3192j7208j2467q717o281j4336r613r497
13868A666653r685p701j585o006m633p044j064J097N648M579J121j917j579m01
13854A637483j569K855M871k30l360L577k984q735p863P70J545j2905j1581j1580
13840A590294j3233j0478m219j653k756l971l127j789L638J782j702J755K642
13827A557183J968M469l706j0239o298n273o488q037p675n229n453n173j62J895
13813A501782q56N990J733L132L255l057o219j1681j8945j0400j2832k0649k0514
$$ plain form
13901 3362911 3200095 3056159 2930192 2813049 2707367 2610121 2519603 2444949 2371799 2303792
13891 2303792 2241423 2180800 2125941 2080739 2043139 2008429 1976602 1944334 1911190 1877868 1850530
13880 1850530 1821302 1797165 1772436 1757964 1744772 1727564 1715097 1706380 1700099 1685763 1676150 1666653
13868 1666653 1656968 1649267 1647682 1641676 1637043 1629999 1628935 1630032 1635680 1640259 1641380 1639463 1637884 1637483
13854 1637483 1635914 1638769 1643640 1643410 1640050 1643627 1640643 1631908 1624045 1624815 1626360 1613455 1601874 1590294
13840 1590294 1577061 1566583 1562364 1560711 1557955 1553984 1550857 1549068 1552706 1554488 1552786 1554541 1557183
13827 1557183 1559151 1563620 1559914 1549675 1543377 1538104 1531616 1523579 1515904 1510675 1505222 1500049 1499887 1501782
13813 1501782 1500926 1506916 1508649 1511781 1515036 1511979 1505760 1494079 1475134 1464734 1451902 1431253 1410739
13800A410739j5783j3888q324o387o954l453n675K820K206r44o021O89P238K517
13786A358780L304O086L989j923j700k411l801p724o730j0041n354j1683j0455
13773A310337j1014o263p375n861q769r383j3671m000p338r540l286n812r750
13760A208275j0708j0613j0689o411n783j123r484j1316p782q393p047r14J667
13747A119679N784L71R175L716J742O105N638Q568N614o2m140r724j1940l288
13733A137238q274j1963j6953j5425p376m412L076j53l354p266o174m648k824
13720A051492m353o78j38m214r588m652k915m795q612l150K120j839l524j402
13706A003752k511n45Q28l364p272p713o576l936m127r9m107n731j1022o805n066
$$ plain form
13800 1410739 1394956 1381068 1372744 1366357 1359403 1355950 1350275 1353095 1355301 1354357 1348336 1349025 1356263 1358780
13786 1358780 1362084 1368170 1372159 1370236 1368536 1366125 1362324 1354600 1347870 1337829 1332475 1320792 1310337
13773 1310337 1299323 1293060 1285685 1279824 1271055 1261672 1248001 1244001 1236663 1227123 1223837 1218025 1208275
13760 1208275 1197567 1186954 1176265 1169854 1164071 1162948 1153464 1142148 1134366 1125973 1118926 1118012 1119679
13747 1119679 1125463 1125834 1135009 1138725 1140467 1146572 1152210 1160778 1166392 1166330 1162190 1152466 1140526 1137238
13733 1137238 1128964 1117001 1100048 1084623 1077247 1072835 1075911 1075758 1072404 1065138 1058964 1054316 1051492
13720 1051492 1047139 1046461 1046323 1042109 1032521 1027869 1024954 1020159 1011547 1008397 1010517 1008678 1005154 1003752
13706 1003752 1001241 1000696 1001524 998160 990888 983175 976599 972663 968536 968437 964330 958599 947577 940772 935706
13691I35706k883o003n972l279m055o073L94o02l204L187O86k781n363o952j130
13676H91676k779q690p395q057k707p977n652n687n722m664m051K91k684p382
13662H18520j0192m089K501l245p089l353p01l70l806m425m936j093k077K201
13648G77846o09m878o502o555j999r686n851L698l904q649q898k810m052l183
13634G13968K707J370m454o447p715q299j2766p855k513j991k432o453R19m569
13620F53470K470J242P44J824J197m01j522R30k120M49k886r250k055l751m575
13605F35766m468k037k015p48K504j961p073p086L159n86l162j462j136j160m040
13590F04495p971l111k706n038l242m705O8L979J554j030j867J052n123n581k53
$$ plain form
13691 935706 932823 926820 920848 917569 913514 907441 907835 907233 904029 907216 907902 905121 899758 892806 891676
13676 891676 888897 880207 872812 864755 862048 854071 848419 842732 837010 832346 828295 828586 825902 818520
13662 818520 808328 804239 806740 803495 796406 793053 792352 791982 788176 783751 778815 777722 775645 777846
13648 777846 777237 772359 765857 759302 757303 747617 741766 745464 741560 732911 724013 721203 717151 713968
13634 713968 716675 718045 713591 707144 699429 691130 678364 670509 667996 666005 663573 657120 658039 653470
13620 653470 655940 657182 657926 659750 660947 660546 659024 659954 657834 658283 655397 646147 644092 640341 635766
13605 635766 631298 629261 627246 626498 629002 627041 619968 612882 616041 615455 612293 610831 609695 608535 604495
13590 604495 596524 593413 590707 585669 582427 577722 577790 581769 583323 582293 580426 581478 576355 570774 570521
13575E70521j526j404K03N2K545j708n016J101n792p000l664K885k402l511o730
13560E38554Q19n26o849l527k661K4J839p812q816NL825p20o767k641L800L948
13544E12495l001n360k42m313j805O42k381j276m444l121q724j0006m049L645
13530D68060M694M421j884p33j478J277k236n269l443m172l431k822l742k329
13516D46913n93Q24p76K937n54k687Q01M641M701j184l222l798J479j954l553
13501D43975N449L542P43K100j062j482K232M973J0616J1982O694P054J5587K1426
13487E33829K4677K8838L6885M9938N3291P1402Q6660J06030J18409J30753J22619
13476A363331J04623P4527L0084j2194o5660j05732j26287j42036j38839j21416
$$ plain form
13575 570521 568995 567591 567794 567846 570391 568683 563667 564768 558976 551976 548312 551197 548795 545284 538554
13560 538554 539373 538847 531998 528471 525810 525834 527673 519861 511045 511050 514875 514155 507388 504747 508547 512495
13544 512495 509494 504134 503892 499579 497774 498416 496035 494759 490315 487194 478470 468464 464415 468060
13530 468060 472754 477175 475291 474558 473080 474357 472121 466852 463409 459237 455806 452984 449242 446913
13516 446913 446320 447144 446368 449305 448751 446064 446865 451506 456207 455023 451801 448003 449482 447528 443975
13501 443975 449424 452966 453709 455809 454747 453265 455497 460470 471086 483068 489762 496816 512403 533829
13487 533829 558506 587344 624229 674167 727458 798860 885520 991550 1109959 1240712 1363331
13476 1363331 1467954 1542481 1572565 1560371 1494711 1388979 1262692 1120656 981817 860401
13466H60401j03482q3757o6444m7801l8089l0435k3745k4630j7403j1198o686
13455D06731k455n134j1077j1118o595l618l643K541m147r931r363j151n857m572
13441C30611Q6L66j496m77o88l272m344J357K909J699p864p185K469J690J205
13426C17066n96l088L194j135K081J27R224O897J942J277N350Q82J19Q831P606
13411C59777J769l107o605j0286j3058j4377r651j1090j2474q841l072j210l833
13398B63942k654k532L310K06m911l50K948n967m122K997m27N645M91L138L391
13383B65105n479k592Q74M895J3155M689j048l653K509M634Nk908n777q600m171
13368B61638p298l983j21n785q565p583o415j512K326L275N20m39L40l208K448
$$ plain form
13466 860401 756919 673162 606718 558917 520828 490393 466648 442018 424615 413417 406731
13455 406731 404276 399142 388065 376947 370352 366734 363091 365632 361485 351554 342191 341040 335183 330611
13441 330611 330697 331063 329567 329090 328402 325130 320786 322143 325052 326751 318887 311702 314171 315861 317066
13426 317066 316470 313382 316576 315441 317522 317649 326873 333770 335712 336989 342339 343221 343340 352171 359777
13411 359777 361546 358439 351834 341548 328490 314113 304462 293372 280898 272057 268985 267775 263942
13398 263942 261288 258756 262066 262272 257361 257011 259959 253992 249870 252867 252440 258085 258576 261714 265105
13383 265105 259626 257034 257908 262803 275958 280647 279599 275946 278455 283089 283094 280186 274409 265809 261638
13368 261638 254340 250357 250236 244451 235886 228303 221888 220376 222702 225977 226497 226058 226398 223190 225638
13353B25638K648M59L363k569l951j303j333r41j763L119j193K680k561j161m263
13338B16869J320J346l077M267L61n822k559L991l757p43m272k316J98L20l057
13323B03069j343M578j599k626k5M824K276k380n280k115j000K14o799n629O906
13308A93071m100j916L260n25M91j321K171L316l817n632K876K377n327n048l531
13293A76345j486R64L54o35J96N622K061l553m97m504j120J386l817K582J608
13278A75506k395n234o21l14P71l055j110M023l714m280m449j152R417k463q66
13263A60064J50J005J122o6J092K393N143m353m608m87l401m082j655K052R82
13248A55351p84L570J16m898K355M648N385J959p112p094l422n539l675j757O417
$$ plain form
13353 225638 228286 228745 232108 229539 225588 224285 222952 222011 220248 223367 222174 224854 222293 221132 216869
13338 216869 218189 219535 216458 220725 221086 215264 212705 216696 212939 212196 207924 205608 205806 206126 203069
13323 203069 201726 206304 204705 202079 202054 206878 209154 206774 201494 199379 198379 198593 191794 186165 193071
13308 193071 188971 187055 190315 189790 190281 188960 191131 194447 190630 184998 187874 190251 184924 179876 176345
13293 176345 174859 175823 176177 175542 175738 181360 183421 179868 179371 174867 173747 175133 171316 173898 175506
13278 175506 173111 167877 167256 166942 167713 164658 163548 167571 163857 159577 155128 153976 163393 160930 160064
13263 160064 160214 161219 162341 162275 163367 165760 170903 166550 161942 161455 158054 153972 152317 154369 155351
13248 155351 154567 158137 158253 153355 155710 160358 165743 167702 160590 153496 150074 144535 140860 139103 145520
13233A45520P502M523R58k722m069o781n420m768L339P82R21o16j623N548N189
13218A48283O46P37k722m823J943K034l971l423O65K699l029r91N863K96k128
13203A42079R52L11l932k912K030N842M430k003J665j301j580k916l161m645l24
13188A34535l012j376j289J40O169K743p20J27l983r12n584J347O285K435l89
13173A36516K903N060R543J992K050O355j82k17n679m995r563o584j680o94k347
13158A32478n838m995J800J350j93M592L687J271K338j886J440O227O029n145
13144A43155m190m072j266P1m965m048n122k333j772Q86L25m960m359K866K792
13129A13008Q59Q496M909p77K126P601R652O761N972J933k867k509r110m833j1787
$$ plain form
13233 145520 153022 157545 158503 155781 151712 144931 139511 134743 138082 138864 139785 139169 137546 143094 148283
13218 148283 148929 149666 146944 142121 144064 146098 142127 138704 139369 142068 139039 138048 143911 144207 142079
13203 142079 143031 143342 139410 136498 138528 144370 148800 146797 148462 147161 145581 142665 139504 134859 134535
13188 134535 131523 130147 128858 128998 135167 137910 137190 137317 133334 132422 126838 128185 134470 136905 136516
13173 136516 139419 144479 154022 156014 158064 164419 164237 164020 158341 153346 143783 137199 135519 134825 132478
13158 132478 126640 121645 123445 124795 124602 129194 132881 134152 136490 134604 136044 142271 148300 143155
13144 143155 138965 134893 133627 133698 128733 124685 119563 117230 115458 116344 116669 111709 107350 110216 113008
13129 113008 113867 122363 127272 126495 128621 136222 145874 152635 158607 160540 157673 155164 146054 141221 129434
13114A29434k836K513k124m718m303n670m014l852K256M275R58p511k939N800
13100A07269N930K807M675R564L316Q054O090P484K336o096q634q434l836j70
13086A30355N793q02J865J899O958J0951K825J182N366M119n86j78n48j978m794
13071A62427j0709r857k976K309O281M209l98L58m46m386o332n687n816M79N23
13056A29979o255J047L310J90n559l570J708L919n060j940k130l869K383k359
13042A11794l141j965m228k721K237M807K21k79K196M076K246J8n92M074P931
13027A26674L24k108J157P06j058n70K46j4L099K748P78M387K964Q027J829l293
13011A45896p219q133m208q141k397o38K65k596n652n002l292O015J8k799j506
$$ plain form
13114 129434 126598 129111 126987 122269 117966 112296 108282 104430 106686 110961 111919 104408 101469 107269
13100 107269 113199 116006 120681 130245 133561 141615 147705 155189 157525 151429 142795 134361 130525 130355
13086 130355 136148 135346 137211 139110 146068 157019 159844 161026 166392 170511 169925 169747 169199 167221 162427
13071 162427 151718 141861 138885 141194 147475 151684 151286 151644 151198 146812 140480 134793 128977 129456 129979
13056 129979 123724 124771 128081 128271 122712 119142 120850 124769 119709 117769 115639 111770 114153 111794
13042 111794 108653 106688 102460 99739 101976 106783 107004 106725 108921 112997 115243 115261 114669 118743 126674
13027 126674 126998 124890 126047 126753 125695 125125 125371 125357 128456 131204 131982 136369 139333 147360 149189 145896
13011 145896 138677 130544 126336 118195 115798 115160 115425 112829 107177 102175 98883 104898 104916 102117 100611
12996A00611K361L700j59J5O12M626M00k467M622O015P07j241L940J333k112J238
12980A24201j753n75J324q111r237m364Q211Q949J0109N561J511k09o818m088
12966A24711j196l092m455n823o626o833p837r66l051k041K309M999M301M033
12952I8433L292L645n000o398k203q193o716k708L572J615M682m78k344j315K526
12937H2410J06k814K592j649m640Q0L37k64L003J326k215L136M606L645j043q278
12921H0338m441J21K827K072Q076O850O304P262K364M4M901K450m589j2298r568
12906I2713k054n583n261m101n6r91J757M607k951k42p661r520j40n6P6K645p048
12889E6134p100n709q698q748K137P774m760P63O719O971J1623J3358J6185J2744
$$ plain form
12996 100611 102972 106672 106513 106528 107140 111766 112166 109699 114321 120336 121043 119802 123742 125075 122963 124201
12980 124201 122448 121873 123197 115086 105849 101485 109696 118645 128754 134315 135826 135617 128799 124711
12966 124711 123515 120423 115968 110145 103519 96686 88849 87883 84832 82791 85100 90099 94400 98433
12952 98433 101725 105370 100370 93972 91769 83576 76860 74152 77724 79339 84021 83543 81199 79884 82410
12937 82410 82516 79702 82294 80645 76005 76085 76422 76158 79161 80487 78272 81408 86014 89659 88616 80338
12921 80338 75897 76018 78845 80917 88993 95843 102147 109409 111773 111817 116718 119168 114579 102281 92713
12906 92713 90659 85076 79815 75714 75658 74667 76424 81031 78080 77838 70177 60657 60517 60461 60537 63182 56134
12889 56134 49034 43325 34627 25879 28016 35790 31030 31793 38512 45483 57106 70464 86649 99393
12875I9393L722J850J967j937n953k764l47p711j0962j0231n407j315m063l69
12861E5873L290M449n611m172n12P655N847o987m901j858J373N09k404q66j46
12846E1539j125K098J695J26N85l613o58O482J1035R274N620L026o566k368l835
12831G3315l158m653j1593o319J378J529m347j096K667J966l74l668N45K335J926
12816E0453R518O485Q211N325J804M695l159o342l258l159l337o791j318L954
12802F3081L719m340m615m86l257j793j73Q7L544K973l391o922l231M720L053
12787E2969K364l471K991N846q82j461P33L441J031J477p36k464m945j373m487
12772E1033l336K204M829j710m754j997K139k127J663r99k561Q64L188L318K319
$$ plain form
12875 99393 103115 104965 106932 104995 99042 96278 95931 88220 77258 67027 61620 60305 56242 55873
12861 55873 59163 63612 58001 53829 53317 60972 66819 59832 54931 53073 54446 54955 52551 51685 51539
12846 51539 50414 52512 54207 54333 54918 51305 50647 57129 68164 77438 83058 86084 79518 77150 73315
12831 73315 70157 65504 53911 47592 48970 50499 46152 45056 47723 49689 49315 45647 46192 48527 50453
12816 50453 59971 66456 74667 79992 81796 86491 83332 76990 73732 70573 67236 60445 59127 63081
12802 63081 66800 62460 57845 57359 54102 52309 52136 52223 55767 58740 55349 48427 45196 49916 52969
12787 52969 55333 51862 54853 60699 59817 58356 59089 62530 63561 65038 64302 61838 56893 55520 51033
12772 51033 47697 49901 54730 53020 48266 46269 48408 46281 47944 46945 44384 45248 48436 51754 54073
12757E4073j403j267L91j364M22J531L144k905m101P98M545J0350L481L720L244
12742G4659N942J2533J6685J3435M484r302j7086q763m041p148p171q736q261
12729E7230m525J261k31J495j283j626P68N076K421l791m750n89m262p118J963
12714D2039Q130J2731M706K901P69N58L64P003K929K942R329Q421K880j45l652
12699A01905q550r092q501j2781n819m791q62K494L585J243l859l738K217J87
12685E3638m641l92N58K550O45J899K78j310q79K73l204l269J814J854l604j37
12669D6073k5Q72J535N6m417l982J254L844Q287P23n42O82l500J234P433N94n998
12652E4123p64N165o015j706L98m318l087K573M809l045N54M288M396j321j1684
$$ plain form
12757 54073 52670 51403 51794 50430 50852 52383 55527 52622 48521 49319 53864 64214 67695 71415 74659
12742 74659 80601 93134 109819 123254 127738 118436 101350 92587 88546 81398 74227 65491 57230
12729 57230 52705 53966 53735 55230 53947 52321 53089 58165 60586 56795 52045 51456 47194 40076 42039
12714 42039 50169 62900 67606 70507 71276 71834 72198 79201 82130 85072 94401 102822 105702 105557 101905
12699 101905 93355 84263 75762 62981 57162 52371 51509 54003 57588 58831 54972 51234 53451 53638
12685 53638 48997 48605 49163 51713 52358 54257 54535 53225 52346 52619 49415 46146 47960 49814 46210 46073
12669 46073 46048 46920 48455 48511 44094 40112 41366 45210 53497 54220 53678 54360 50860 52094 59527 60121 54123
12652 54123 53359 58524 52509 50803 51201 46883 43796 46369 51178 48133 48687 52975 57371 56050 44366
12637D4366J394M273L168l81l226J03J793J310K535k55o5K667O994P632O179M111
12621H2598K444n641q019k824n466q86O71m17j422O483j32j030M568J406k014
12606G0319m927R4j111r29P66L232l00L084p34o337K242M29J005L427m42j904
12590F7914Q561J3867N426L329k42m160r675n427k552m492q19l015r66P998K788
12575G8535J485l400M895K503k346k812l089J58J950K122o235l665L217M294K480
12560H0092L007N839R195J1796J2293O183P131J711o505j3866j4661j0811m421
12547H6983m722p510k264M958O804M652K785Q505J3220O493L170p789j0863j1980
12533I2442l038K648q382K606P433R35k62k580q75K724O708L863N23K438p89l736
$$ plain form
12637 44366 45760 50033 53201 52820 49594 49697 51490 52800 55335 55080 55015 57682 64676 72308 78487 82598
12621 82598 85042 79401 71382 68558 63092 62206 62877 62460 61038 67521 67389 66359 70927 72333 70319
12606 70319 65392 65486 64375 63446 64212 67444 67144 70228 69494 63157 65399 65828 66833 70260 69818 67914
12590 67914 76475 90342 95768 99097 98855 94695 85020 79593 77041 72549 71730 68715 67749 75747 78535
12575 78535 80020 76620 81515 84018 81672 78860 75771 75929 77879 80001 73766 70101 73318 77612 80092
12560 80092 83099 88938 98133 109929 122222 128405 135536 137247 130742 116876 102215 91404 86983
12547 86983 82261 74751 72487 77445 84249 88901 91686 100191 113411 119904 123074 115285 104422 92442
12533 92442 89404 92052 83670 86276 93709 94644 94382 91802 90927 93651 100359 104222 104745 107183 106394 102658
12517A02658p677j3838n622j076j261J586J944m30M113N980L954P840P895O104
12503A12170l71J237N711M272M106k51M380J847o315j2722j0770m060l860l23
12489I5051l901n981J6J92m741o118r569m980K994O17L068K587N219j167R78P154
12473H1419L349K438M709N732J386J92M670L160L838l202o1N088M992M343L620
12458A25673k230j1291p966l772n329q359j190k338L49N033j698l335m184k746
12444G6617K728p37J970P383q21o120k007O40J88O493K530K714k082J587q24P47
12428I1006j711q49k260l574M6L535l22m33R67J815M782O371J1516P743P446J890
12412A27968j388p81j025K854N569J1891J9210K9940N1869P1334M6860k9047o5971
$$ plain form
12517 102658 94981 81143 75521 74445 73184 74770 76714 76284 80397 86377 90331 98171 106066 112170
12503 112170 111799 113036 118747 123019 127125 126874 131254 133101 126786 114064 103294 99234 95374 95051
12489 95051 91150 85169 85185 85377 80636 74518 64949 59969 62963 63580 66648 69235 74454 73287 74265 81419
12473 81419 84768 87206 91915 97647 99033 99225 103895 107055 110893 107691 107630 112718 117710 122053 125673
12458 125673 123443 112152 104186 100414 95085 86726 85536 83198 83547 88580 86882 83547 79363 76617
12444 76617 79345 78608 80578 87961 87140 81020 79013 79653 79841 86334 88864 91578 89496 91083 90259 91006
12428 91006 89295 88446 86186 82612 82658 86193 85871 85438 86405 88220 93002 99373 110889 118632 126078 127968
12412 127968 126580 125799 124774 127628 133197 145088 164298 194238 246107 317441 364301 335254 269283
12399B69283n9619m1290k3341j5071j4398q203l322l675o711m191k768N763O970
12386I9427N70l667q237p140L114K965K265N15j142J181J135J97J266O487N606
12371A04542J096N598R646O951J0378J5979K2298K6404L3848N2917Q2394J41605
12359E13656J93457J89197L3616j78359k26707j54890r5080n1514l5860k5043
12349A62473j4478m416o899n244j809o27k439m446o913N20n016k545l204k482
12335A02475O6j535k272L32R98l97K481O37M791P761J4857J6165K2209J2480N886
12320A86934Q157J9609L9152O7478J02893J71001K17374J36101q2674k26322j97796
12309D41907j27737p8448m4485k3115k2288j8816q732l241o271r973n236k659
$$ plain form
12399 269283 209664 168374 145033 129962 115564 107361 104039 100364 93653 89462 86694 92457 99427
12386 99427 99997 96330 88093 80953 84067 87032 89297 89812 88670 89851 90986 91183 92449 98936 104542
12371 104542 105638 111236 120882 127833 138211 154190 176488 202892 236740 289657 372051 513656
12359 513656 707113 896310 929926 751567 524860 369970 274890 223376 187516 162473
12349 162473 147995 143579 136680 131436 129627 129000 126561 122115 115202 115722 110706 108161 104957 102475
12335 102475 102541 101006 98734 99066 100064 99667 102148 102785 107576 115337 130194 146359 168568 181048 186934
12320 186934 195091 214700 253852 321330 424223 595224 812598 948699 866025 639703 441907
12309 441907 314170 235722 191237 168122 145834 127018 118286 115045 108774 98801 93565 90906
12297I0906K148M056k188K416o05m501n010m507k397j545L557j25N800M890j927
12282I0968K395O590N741P376J6893K3162J8149O329P741J4087K7705M6039O6722
12269C39897O2896K835o8280p9099m9646k9737j8816j0950q698l937l431L03K619
12256A35956M098p77q31N555N76m816n905N99j21j368k334O936J0842P723J9014
12241A75147K9343L3195K3036O403j9507k8916k8549k7176j5342j1875n670l422
12229A26667j785L847M093j03N608K267l623m486n323J09Q11P24L202l706p81
12214A27521l89o860j446L330J122L02J57k980J51R845J6364J9262K2494O288
12200A95161j1888k1925j8898j6048j8490j4313l525j45K972L259n589p712j4914
$$ plain form
12297 90906 93054 97110 94922 97338 96733 92232 87222 82715 80318 78773 82330 82205 88005 92895 90968
12282 90968 93363 99953 105694 113070 129963 153125 171274 177603 185344 199431 227136 273175 339897
12269 339897 402793 405628 337348 258249 208603 178866 160050 149100 140402 136465 133034 133337 135956
12256 135956 140054 139277 138446 144001 144577 139761 133856 134455 134334 132966 130632 137568 148410 156133 175147
12241 175147 204490 237685 260721 267124 247617 218701 190152 162976 147634 135759 130089 126667
12229 126667 124882 128729 132822 132719 138327 140594 136971 132485 127162 127271 128082 128806 132008 128302 127521
12214 127521 127132 120272 118826 122156 123278 123580 123737 120757 120908 130753 147117 166379 188873 195161
12200 195161 183273 161348 142450 126402 107912 93599 90074 89929 92901 96160 90571 82859 67945
12187F7945j0627k189L907J1147J2765J0489J144J94L29k847q130j0917p771p781
12173E7658o797n784Q017R223Q01m074l450J470M876P099Q835J0531J1337J8053
12159A17795L5006M3020M3556K6818j3665m1449m2767k7434j7829l983J998R45
12147A22011l330k813j0159j4396j3877j0845j816o403l594j220k043j015J057
12134E1557J301j573j408m731l014J248K011L229k611n634j087k22M710M579N350
12119E3705M913R153J4194K1563L2276L3615M3674M2892J1351k9346m4865l6432
12107A56693j8519m72J9864L1992L6466J3959j7863l9921m7672l0918j7488j5991
12095G0130j3014p093o597m769l658p53P49J005L382J240m845J175l143J965J0318
$$ plain form
12187 67945 57318 55129 59036 70183 82948 93437 94581 94775 95104 92257 84127 73210 65439 57658
12173 57658 50861 45077 53094 62317 63118 59044 55594 57064 61940 69039 77874 88405 99742 117795
12159 117795 152801 195821 239377 266195 252530 211081 168314 140880 123051 119068 121066 122011
12147 122011 118681 115868 105709 91313 77436 66591 64775 58372 54778 53558 51515 50500 51557
12134 51557 52858 51285 49877 45146 42132 43380 45391 48620 46009 40375 39288 39066 43776 48355 53705
12119 53705 58618 67771 81965 103528 135804 169419 213093 255985 267336 237990 193125 156693
12107 156693 138174 137702 157566 189558 226024 239983 222120 182199 134527 103609 86121 70130
12095 70130 57116 50023 43426 38657 34999 34246 34995 36000 39382 40622 35777 36952 33809 35774 46092
12080D6092O223k640m942p386J463j354J574Q355Q768Q189N393J0083K0057J5235
12066A15110N181j1788j1671n281O291J8911K8948L7216L5013J0936k5581m9869
12054A53416m2660k5129j3115j1663r378l696n238m990j863K338r5l967o594k095
12040B5271N930l713n39P248j3k51k193nL925L76m52R73j620j234L912L420l64
12023D0671M296j058l387K233L65K504P689M750R558J7625J1443n127j8894j8147
12009E4521r050r012q392Q4L875k062J469j751n198k194p00O902M730L624J976
11994C8822J9r098m002O968P160q797p787M628O542P59j861K123k995m445K972
11979C1008N027k637l921k683N81L513k293k362R36P071L410k006j860l905j811
$$ plain form
12080 46092 52315 49675 44733 37347 38810 37456 39030 47385 56153 64342 69735 79818 99875 115110
12066 115110 120291 108503 96832 91551 97842 116753 145701 182917 217930 228866 203285 153416
12054 153416 110756 85627 72512 60849 51471 47775 42537 37547 35684 38022 37927 33960 27366 25271
12040 25271 31201 27488 26949 34197 34184 33933 31740 31735 35660 36036 35584 36557 34937 33703 37615 41035 40671
12023 40671 44967 43909 40522 42755 43120 45624 53313 58063 67621 85246 96689 91562 72668 54521
12009 54521 45471 36459 28067 28151 32026 29964 31433 29682 24484 22290 21590 28492 33222 36846 38822
11994 38822 38841 29743 25741 32709 39869 31072 23285 27913 34455 35214 33353 35476 32481 28036 31008
11979 31008 36035 33398 29477 26794 27375 30888 28595 26233 27169 34240 37650 35644 33784 29879 28068
11964B8068l828M200L199J087o160m336K872K590O357L275J331k369k021J464
11950C5729O467M19p80m325k251J538K173k916K916n953l729M326K031k298k623
11935C0724k44m455j114M223N28l94N013j303j622q860j09J893j511l45M461P623
11919C4508l21p773m230k674j825J129K671N55R58P295M967J038j236J664J284
11904C8010J680p226m950K46K697l40L271L822k249l758l185K873r91k97L021
11889C2624L101m67l229K721K854K225m307l836L567J177j874l397J254l150j157
11874B8106J362N702L142N725j5p263k827l937P57O20K305m78l072j000K438o19
11858C0946j306j220K81J146o552j787M025j213k193M572J394o638o20P09Q895
$$ plain form
11964 28068 24240 28440 31639 32726 26566 22230 25102 27692 34049 37324 38655 36286 34265 35729
11950 35729 42196 42615 41835 37510 35259 36797 38970 36054 38970 33017 29288 33614 35645 33347 30724
11935 30724 30480 26025 24911 29134 29662 29268 34281 32978 31356 22496 22387 24280 22769 22424 26885 34508
11919 34508 34187 26414 22184 19510 17685 18814 21485 22040 22998 30293 35260 36298 35062 36726 38010
11904 38010 39690 32464 27514 27760 30457 30117 33388 37210 34961 31203 28018 30891 29900 29603 32624
11889 32624 35725 35258 32029 34750 37604 39829 35522 31686 35253 36430 34556 31159 32413 29263 28106
11874 28106 29468 35170 38312 44037 44022 36759 33932 29995 30752 31372 33677 33199 30127 29127 31565 30946
11858 30946 29640 28420 28701 29847 23295 21508 25533 24320 22127 26699 28093 21455 20835 21544 30439
11843C0439J734l988N54k641l946K283K764J730l300o463J907M399k069M10J009
11828B4822J668N232K408o59M07J887l424n489P44P242M086j709J172k815o751
11813B8821k257J746j866K128K576K959K797q1q18k918J502j898m344m742J999
11798B5604K316o645k058N362N699L238m142l668m81K258O841J241o94j481m530
11783B8860p00J605j704k89n256qO155K318L722j261k244J686L057L55J21M754
11767D1171K744k964m838k332r13O15m690K386L509r95J186L242L868j722r917
11752C0350l744l79l197N01P558J57l562M57J302N740Q08n065q83L146j895q85
11736C0409O9l309N27L35M226M768j125m304p070J904K002M331J646M034L888
$$ plain form
11843 30439 32173 28185 28739 26098 22152 24435 27199 28929 25629 19166 21073 25472 23403 23813 24822
11828 24822 26490 31722 34130 33471 33878 35765 32341 26852 27596 34838 38924 37215 38387 35572 28821
11813 28821 26564 28310 26444 28572 31148 34107 36904 36823 36005 33087 34589 32691 28347 23605 25604
11798 25604 27920 21275 19217 24579 30278 33516 29374 25706 25225 27483 34324 35565 34871 33390 28860
11783 28860 28160 29765 28061 27772 22516 22508 28663 30981 34703 33442 31198 32884 35941 36296 36417 41171
11767 41171 43915 40951 36113 33781 32868 33483 28793 31179 34688 33693 34879 38121 41989 40267 30350
11752 30350 26606 26227 23030 23531 31089 31246 27684 28141 29443 35183 35991 30926 30043 33189 31294 30409
11736 30409 30478 27169 27696 28031 32257 37025 35900 31596 24526 26430 28432 32763 34409 38443 42331
11721D2331J005k210j657K781K602k770K89j66j089r54J361k054l351J564J47
11706C7829l621n077P74N619M617L030m391l296j782k799o91j641k963N907k873
11691B8642P21k84k25P40N435N310L050M70m18m821o77p74j575J777J411j986
11675C6796J399O785N92L148l57l714K458M124K049l804j0136l44J0739P243J901
11660E8879M891o557j1898j7092j3306j1013J041L314O188J2697J7647J3450K000
11647F0241p251j0665r170q45M279O825N697j228q746K95N288O932j15r719l706
11632C8112j71J765P396L839r18n494K222L56m062k099j032k086L043L67j835
11617C9403J511K005K362J306M939r59j672L841p09q448m954o22N801K433j031
$$ plain form
11721 42331 43336 41126 39469 42250 44852 42082 42371 42205 41116 40162 41523 39469 36118 37682 37829
11706 37829 34208 29131 29905 35524 40141 43171 38780 35484 33702 30903 30212 28571 25608 31515 28642
11691 28642 29363 29079 28854 29594 35029 40339 43389 43859 43441 38620 37943 37169 35594 37371 38782 36796
11675 36796 38195 44980 45572 48720 48363 44649 47107 51231 53280 49476 39340 38996 49735 56978 58879
11660 58879 63770 57213 45315 28223 14917 3904 4945 8259 14447 27144 44791 58241 60241
11647 60241 52990 42325 33155 32310 36589 43414 49111 47883 39137 39432 44720 51652 51537 41818 38112
11632 38112 37941 39706 47102 50941 50023 44529 46751 47107 43045 40946 39914 37828 40871 41238 39403
11617 39403 40914 42919 45281 46587 51526 50567 48895 52736 52027 43579 38625 38003 43804 46237 45206
11602D5206j001m093J697O114J192n666L39K151K875J590N122J579j437o78M187
11587E9177m572m592o509m42N540L155k870k021k302L718J226l876j498J974L86
11572D6494q44n426M075J719k918p08l678m131K475M255k127K35Q20l886J09o83
11556C5781L483L904o009m364L60r84L565K083o344N48J246O106P063R249p23
11541E4964p528m199M742j232p131l736J090M023K595n522R99L734O04L371K203
11526D8977k772n151l29K169l80J287L352N55k777j389J588L165K731m306j838
11511D4882j44n897k006M955M476Q89l023O00J707p09j496J607N345k053k223
11496D6910O17K553l56n117j639P739J840j253k703l874q68L470j98J90l246o44
$$ plain form
11602 45206 44205 40112 41809 47923 49115 43449 43788 45939 48814 50404 55526 57105 55668 54990 59177
11587 59177 54605 50013 43504 43062 48602 51757 48887 46866 44564 48282 49508 45632 44134 46108 46494
11572 46494 45650 40224 44299 46018 43100 42392 38714 34583 37058 41313 39186 39421 40241 36355 36464 35781
11556 35781 39264 43168 37159 32795 33155 32171 35736 37819 31475 32023 33269 39375 46438 55687 54964
11541 54964 47436 43237 47979 46747 39616 35880 36970 40993 43588 38066 39065 42799 43403 46774 48977
11526 48977 46205 41054 40725 42894 42514 43801 47153 47708 44931 43542 45130 48295 51026 46720 44882
11511 44882 44738 38841 36835 41790 46266 47155 44132 44732 46439 45730 44234 45841 51186 49133 46910
11496 46910 47527 50080 49724 44607 42968 50707 52547 51294 48591 44717 43849 47319 47121 47311 44065 43421
11480D3421L932k2P74J955J99n554J085J634N098O658k730m633M687M720k88m500
11464E6436k329l242M59m593k991K177J490L05N29M934K384l3Q04o66k367j239
11448E2058M918k832m963J239L433k802j609L874L035L774l92m902k343J884J649
11433E6021k132M84R07N379m007j208j244L781J867k018L5p25k732j0188Q79L684
11417D8783P421Q475O559K64o70M263O755N12k832j2315j2182K528L637m251m299
11402E2648m807L201l34n011j746k290J155m697r6L238k324l141k00r96L071k362
11386C5309j149J537K900L647k451N20j958M63n41n049o451M65L767r2l340k935
11370B4642K544L590p41K45P67m275j981J53L138k68k555N670O354l058o800o585
$$ plain form
11480 43421 47353 47331 48105 50060 50259 44705 45790 47424 52522 59180 56450 51817 56504 61224 60936 56436
11464 56436 54107 50865 51324 46731 43740 45917 47407 47712 48241 53175 55559 55526 56330 55664 53297 52058
11448 52058 56976 54144 49181 50420 53853 51051 49442 53316 56351 60125 59733 54831 52488 54372 56021
11433 56021 53889 54373 55280 60659 56652 55444 54200 57981 59848 57830 57865 57140 54408 44220 45099 48783
11417 48783 56204 64679 71238 71502 70832 75095 81850 82362 79530 67215 55033 57561 61198 56947 52648
11402 52648 47841 51042 50708 45697 43951 41661 42816 38119 38023 41261 38937 35796 35596 34600 37671 35309
11386 35309 34160 35697 38597 42244 39793 40313 38355 38818 38277 33228 26777 27242 31009 30917 27577 24642
11370 24642 27186 30776 30035 30280 31047 26772 24791 24944 28082 27814 25259 30929 37283 34225 27425 20840
11354B0840k775K66K072N403P125K602r814o712L401M040m48j818k894k825l051
11339A5412K339o92n178O43R164K631q78l209o182o171K526N167o14oj06q47K779
11322A6778K929k97J811l921N13j305K77K337L473M248N37j830k793m016k200
11307A6541J138k040n390l413O443L575M413J120k623p76K898j036m663n016N83
11292A1754M728P40k625j554j129O81j728k581p28O540Q379l524l610k71L91o1
11276A5402m430l501k423k496L022N879L563K023m357k603o26J524J170K67k679
11261I735N70l626l937j888j511k696M604M306N937L36j597k411J516J262l919
11246F681n446n542J95j340q75l835Q32j200n040R13j908j969l166k389J322J215
$$ plain form
11354 20840 18065 18331 20403 25806 32931 35533 25719 19007 22408 26448 26000 24182 21288 18463 15412
11339 15412 17751 17059 11881 12524 21688 24319 23441 20232 14050 7879 10405 15572 14958 14952 14846 13999 16778
11322 16778 19707 19410 21221 17300 17813 16508 16785 19122 22595 26843 27380 25550 22757 18741 16541
11307 16541 17679 15639 10249 6836 13279 16854 21267 22387 19764 18988 21886 20850 16187 11171 11754
11292 11754 16482 17222 14597 13043 11914 12595 10867 8286 7558 14098 22477 18953 15343 15072 15463 15402
11276 15402 10972 7471 5048 2552 5574 11453 15016 17039 12682 10079 9453 10977 12147 12414 9735
11261 9735 10305 6679 2742 854 -657 -3353 1251 5557 11494 11830 10233 7822 9338 10600 6681
11246 6681 1235 -4307 -4112 -5452 -6327 -10162 -9330 -10530 -15570 -14657 -16565 -18534 -21700 -24089 -22767 -21552
11230b1552N732K210M378N438M74l322n404K099L567j672n400n121j227j855j418
11215b3073o240j417J517j626L519J043K013J66K077R51K711o844m728M558N52
11200b4821m96l56o35K963k054R81L520k34J20K028j387K49j63k445l398k497
11184b8625r83J420m608l335r66J076p93J119j867j710L549M858j820m585j790
11169c9060J401J512n521n631k002j38J507J604k711N49N23l495J158l367k359
11154e6030L868M930M003O22k218J105L667k164j308Q51K033n320q940j587J880
11139e4608J4630K757j4669k7961j8292O358K4416L9394L3855J9346J017j6097
11127A0146l6292m0524k9726j5650Q045J7908J4260J064q353n105N004J7291L690
$$ plain form
11230 -21552 -15820 -13610 -9232 -3794 -3320 -6642 -12046 -9947 -6380 -8052 -13452 -18573 -19800 -21655 -23073
11215 -23073 -29313 -30730 -29213 -30839 -27320 -26277 -24264 -24098 -22021 -21070 -18359 -25203 -29931 -25373 -24821
11200 -24821 -25317 -25673 -26308 -23345 -25399 -24418 -20898 -21132 -21012 -18984 -20371 -20122 -20285 -22730 -26128 -28625
11184 -28625 -29608 -28188 -32796 -36131 -37097 -36021 -36814 -35695 -37562 -39272 -35723 -30865 -32685 -37270 -39060
11169 -39060 -37659 -36147 -41668 -47299 -49301 -49439 -47932 -46328 -49039 -48490 -47967 -51462 -50304 -53671 -56030
11154 -56030 -52162 -47232 -43229 -42607 -44825 -43720 -40053 -42217 -43525 -42674 -40641 -45961 -54901 -56488 -54608
11139 -54608 -39978 -37221 -51890 -79851 -98143 -91785 -67369 -27975 5880 25226 26243 10146
11127 10146 -26146 -66670 -96396 -112046 -104001 -86093 -71833 -70769 -79122 -84227 -79223 -61932 -58242
11114e8242L7j222n261M290K521K878L40n104l130m907r640n620o321o51m269
11099i4301o057R24k993J422N868o63o224j0349j361N615L476J815m994K383P131
11084i8308j322J265O78j161m72l94O947r31p976m609l434j922k50J948M445j834
11068a07330n144l803k70m614l68j754N26k149K055O216Q061M633N761J8688K3930
11053e5562J7559L486j6269j6642j4933j2316j447J291Q9n790K501j182K82n370
11039a04303m263q47j901k587P893M282J65K365K507n064j181L896J0225J6032
11025g2781J4715J7327K2442L0444M3058O5121J01311J63867K55846L88021N28540
11014A557911O27708N60719K57887j75955n05053n99900n25230l86421k71084
$$ plain form
11114 -58242 -58205 -59427 -64688 -60398 -57877 -54999 -54659 -59763 -62893 -67800 -77440 -83060 -89381 -90032 -94301
11099 -94301 -100358 -99434 -102427 -101005 -95137 -95800 -102024 -112373 -113734 -108119 -104643 -102828 -107822 -105439 -98308
11084 -98308 -99630 -98365 -97687 -98848 -99320 -99714 -92767 -93698 -101674 -106283 -109717 -111639 -111889 -109941 -105496 -107330
11068 -107330 -112474 -116277 -116547 -121161 -121529 -123283 -122757 -124906 -122851 -116635 -108574 -103941 -98180 -79492 -55562
11053 -55562 -38003 -34517 -50786 -67428 -82361 -94677 -96124 -94833 -94744 -100534 -98033 -99215 -98933 -104303
11039 -104303 -108566 -109413 -111314 -113901 -106008 -101726 -101561 -99196 -96689 -101753 -102934 -99038 -88813 -72781
11025 -72781 -58066 -40739 -18297 12147 55205 120326 221637 385504 641350 1029371 1557911
11014 1557911 2185619 2746338 3004225 2828270 2323217 1723317 1198087 811666 540582
11005E40582j80876j23175q9300n5531l8184l1968k7001k2088j7385j6403j5438
10994g6767j1810j0636N2l065n42j125m869p083p408l281r309q513r536k671q597
10979a65160p142r22o69l241n566n660o802m167J04L519Q75L15m434l777Q49j468
10963b03346p272l308j648J211L249J350N19K121J843Q34m058N598N819n009j334
10948b03431m368p588n287k713j0901r76O53L429L099P95m632n691m148n37N14
10933b41782J84l137l015n923o78K208j68L093k020l846m205l513K43N207J2418
10918b44934J2912J2533J2590J2029J1602N832j1610j7574j7544j9216j4342j7013
10906b74735j6107o617K996J1554J7001J4114R815J467r84p501q182j3042j6419
$$ plain form
11005 540582 359706 236531 147231 91700 53516 21548 -5453 -27541 -44926 -61329 -76767
10994 -76767 -88577 -99213 -99161 -102226 -102768 -103893 -108762 -115845 -123253 -126534 -135843 -144356 -153892 -156563 -165160
10979 -165160 -172302 -173224 -173893 -177134 -182700 -188360 -195162 -199329 -199225 -195706 -194831 -194516 -198950 -202727 -201878 -203346
10963 -203346 -210618 -213926 -215574 -214363 -211114 -209764 -209245 -207124 -205281 -204447 -208505 -202907 -197088 -202097 -203431
10948 -203431 -207799 -215387 -220674 -223387 -234288 -235264 -234611 -231182 -228083 -227288 -231920 -237611 -241759 -242296 -241782
10933 -241782 -241598 -244735 -247750 -253673 -254351 -252143 -252311 -249218 -251238 -255084 -259289 -262802 -262559 -257352 -244934
10918 -244934 -232022 -219489 -206899 -194870 -183268 -177436 -189046 -206620 -224164 -243380 -257722 -274735
10906 -274735 -290842 -297459 -294463 -282909 -265908 -251794 -241979 -240512 -241496 -248997 -257179 -270221 -286640
10893b86640k625N011L013k132n868m030l119j142p931j0356n958k124M264J0180
10879c09457O385m618n798l391N332k14n44L857M201m03p234m983j255J172K354
10864c14596J1399J6170L1037N2464P0833P7686O3811K2744k4602n0220n6312
10853i9586n6042n0910m4315l2917k3098j1013j2224j9327j6520j2692o009N14
10841c84139p807r874j0359j1293o576r382l060J011M128n994l581R47p38M290
10827d42427R009N826J2015J0692M695M03k412p13J1841L0437N0082P2516P9846
10814a58190M8489L634m4329p2750o1194m4819k5416j8333k6274m0546n3859n3801
10802e47388m0311k1803j50J3793K1471K2985J8730J8252J7086K3316K5511K8966
$$ plain form
10893 -286640 -289265 -284254 -281241 -283373 -289241 -293271 -296390 -297532 -305463 -315819 -321777 -323901 -319637 -309457
10879 -309457 -303072 -307690 -313488 -316879 -311547 -311761 -312305 -308448 -304247 -304650 -311884 -316867 -318122 -316950 -314596
10864 -314596 -303197 -287027 -255990 -203526 -132693 -55007 8804 31548 6946 -43274 -99586
10853 -99586 -155628 -206538 -250853 -283770 -306868 -317881 -330105 -349432 -365952 -378644 -384653 -384139
10841 -384139 -391946 -401820 -412179 -423472 -430048 -439430 -442490 -441479 -437351 -443345 -446926 -445979 -446717 -442427
10827 -442427 -433418 -427592 -415577 -404885 -400190 -399787 -402199 -402912 -391071 -360634 -310552 -238036 -158190
10814 -158190 -109701 -106067 -150396 -223146 -284340 -329159 -354575 -372908 -399182 -439728 -493587 -547388
10802 -547388 -587699 -609502 -609652 -595859 -574388 -551403 -532673 -514421 -497335 -474019 -448508 -419542
10790d19542K8377J1895N551j479j5504j6546q775l021m659o734j0409j3602r792
10777d64240l047O16j422j2371r477j4648k4869k6415k4268j7301p036M909R880
10764e89689Q066R73r501j1324j4231M056L8298P6407Q5116O3434J2553l2643
10752c68485n9924n8309m3376k6278j5669j0561l299J92K888N112J0341P718J2238
10739e47412J9257L3357N3963P4093J04084J36038J47573J20556M3310n8205j42041
10728a5427j80899j68811j30750r0342n5595l1040k0316k1299j6262k6328l3921
10717g90990l4113k6686k1663j3929r948n977j629N556R070Q583j01K191Q703
10704h70933Q867Q894O196n973j6006k4934k2608k1428j5803j2354j5669j9045
$$ plain form
10790 -419542 -391165 -379270 -373719 -375198 -390702 -407248 -416023 -419044 -423703 -430437 -440846 -454448 -464240
10777 -464240 -467287 -466671 -468093 -480464 -489941 -504589 -529458 -555873 -580141 -597442 -604478 -599569 -589689
10764 -589689 -581623 -580650 -590151 -601475 -615706 -611650 -573352 -496945 -411829 -348395 -335842 -368485
10752 -368485 -428409 -486718 -530094 -556372 -572041 -582602 -585901 -585709 -582821 -577709 -567368 -559650 -547412
10739 -547412 -528155 -494798 -440835 -366742 -262658 -126620 20953 141509 184819 126614 -15427
10728 -15427 -196326 -365137 -495887 -586229 -641824 -672864 -693180 -714479 -730741 -757069 -790990
10717 -790990 -825103 -851789 -873452 -887381 -897329 -903306 -904935 -899379 -890309 -881726 -881827 -879636 -870933
10704 -870933 -862066 -853172 -846976 -852949 -868955 -893889 -916497 -937925 -953728 -966082 -981751 -1000796
10692a000796j8422j5529j2467q33J1652J8910J5812K721m620j0471l69J4968
10680i99444K2438K8776K4051J5259N411K274Q709J4424J9670J7775J2155J6937
10668h11565J4482J4059J3559J1307K8822M7257N5121M1295L2111J9706R988K4307
10656d99551O0481J14720J80061K61104L94742O16104J001147J665002K635437
10647F429247L677405M181439L369743J036031j766271l571904l818097l062323
10639F475270k068478j267701p45809m30026k24534r0616L1810J66776L40681
10630B187373N75827Q20000R87799R37328O13690J98466j6470N4223L10068O37589
10620G305893R95257J414812J924543K586560L469781M664493O377638Q968929
$$ plain form
10692 -1000796 -1019218 -1034747 -1047214 -1048047 -1036395 -1017485 -1001673 -998952 -1003572 -1014043 -1014412 -999444
10680 -999444 -977006 -948230 -924179 -908920 -903509 -901235 -892526 -878102 -858432 -840657 -828502 -811565
10668 -811565 -797083 -783024 -769465 -758158 -729336 -682079 -626958 -585663 -553552 -533846 -523858 -499551
10656 -499551 -439070 -324350 -144289 116815 511557 1127661 2128808 3793810 6429247
10647 6429247 10106652 14288091 17657834 18693865 16927594 13355690 9537593 6475270
10639 6475270 4406792 3139091 2393282 1963256 1738722 1648106 1679916 1846692 2187373
10630 2187373 2763200 3583200 4570999 5508327 6122017 6320483 6304013 6358236 6668304 7305893
10620 7305893 8301150 9715962 11640505 14227065 17696846 22361339 28738977 37707906
10612C7707906J3110049J9891111L0785896M7243034O8941909R0577682J00363787
10605D08621374Q5045547M0072245k0248112p0330678r2193590q7667791o9617865
10598A93681130m9949191l4397708k3718510j6799390j2350952r360530p202381
10591C9902468n591552m386136l492453k835422k343692j925541j529997j147993
10583A6649682p66884m34154k57750l74788p47985j103501j224166j132761r42283
10574I665410p45125n92042m90824m19440l69692l33390k97835k76549k59643
10565E880870k46330k31099k13106j95723j80629j74608j78101j66009j48008
10556D147257j24353j06045q4121p3033o7498o7438p1016o1554n4166o8885o2032
$$ plain form
10612 37707906 50817955 70709066 101494962 148737996 217679905 308257587 408621374
10605 408621374 493666921 533739166 513491054 443160376 350966786 263298995 193681130
10598 193681130 143731939 109334231 85615721 68816331 56465379 47104849 39902468
10591 39902468 34310916 29924780 26432327 23596905 21253213 19327672 17797675 16649682
10583 16649682 15882798 15448644 15190894 14816106 14068121 12964620 11740454 10607693 9665410
10574 9665410 8920285 8328243 7837419 7417979 7048287 6714897 6417062 6140513 5880870
10565 5880870 5634540 5403441 5190335 4994612 4813983 4639375 4461274 4295265 4147257
10556 4147257 4022904 3916859 3832738 3759705 3692207 3624769 3553753 3492199 3438033 3369148 3307116
10545C307116m5326o1962r9645j16262j23813j38056j29682j11668q8661p1136
10535B320905n8681n1333m5725n1117n0314l1639j5070p859j0820k0484l1774
10524A946089l8233l7443k7993j3908n580o268j6521l2942l5962m3987m1713l7451
10512A608088l3174l2317l6468m2219m2074l8158k4899j2427M96k862q802p943
10500A327241o538q164n584K52k923l667M60n702j1539p147Q526K6552O3960J32982
10486A508709K25089L32218M39563N05825M89345L37211M9720k46760m24139m84054
10476B732727m58173l79549k87026k10761j59026j17990r2045o4145m7615l7129
10466H79268k8857k4708j7762j4072j8063q730l918j546R73k54p999p271q374
$$ plain form
10545 3307116 3261790 3199828 3100183 2983921 2860108 2722052 2592370 2480702 2392041 2320905
10535 2320905 2262224 2210891 2165166 2114049 2063735 2032096 2017026 2009167 1998347 1977863 1946089
10524 1946089 1907856 1870413 1842420 1828512 1822932 1816664 1800143 1767201 1731239 1687252 1645539 1608088
10512 1608088 1574914 1542597 1506129 1463910 1421836 1383678 1358779 1346352 1346848 1343986 1335184 1327241
10500 1327241 1320703 1312539 1306955 1307207 1304284 1300617 1301077 1295375 1283836 1276689 1285215 1311767 1375727 1508709
10486 1508709 1733798 2066016 2505579 3011404 3500749 3837960 3887680 3640920 3216781 2732727
10476 2732727 2274554 1895005 1607979 1397218 1238192 1120202 1028157 964012 916397 879268
10466 879268 850411 825703 807941 793869 775806 767076 763158 761612 762585 762331 754332 747061 738687
10453G38687J646N775N803k507j4748l3612m7243l6478k0153l845M982O742J9514
10440F24563J5059k1243l3935l6015l0087k5231j8995j3488j3131j1344m413M04
10428D32144J612n335j1207j5800k4058l4119m1491l7655j9536n614J1516K0615
10416B71072K7989K9383J7931M918J772J4150J7542K5860K4317L471j3396k6296
10404C98713m0755n1454l9907k1766k534M916P65L162L181P588J0859P810J0363
10391B90941Q100L059L342j577j0366j3885j8538k0326k0717j5038n172j30l094
10378A96599J17L405j895r5j951n786J402k381j0394j5073j6458j2040j1095q882
10364A15473K966L525o110j7378j2389j1754m941K126N563J1444J0260P954M829
$$ plain form
10453 738687 740333 746108 751911 749404 734656 701044 653801 617323 597170 593325 598307 605049 624563
10440 624563 639622 618379 584444 548429 518342 493111 474116 460628 447497 436153 431740 432144
10428 432144 433756 428421 417214 401414 377356 343237 301746 264091 244555 238941 250457 271072
10416 271072 299061 328444 346375 351293 353065 367215 384757 410617 434934 438405 425009 398713
10404 398713 357958 306504 266597 244831 242297 247213 247978 251140 254321 261909 272768 280578 290941
10391 290941 299041 302100 305442 303865 293499 279614 261076 240750 220033 204995 199823 199693 196599
10378 196599 196716 200121 198226 198131 196180 190394 191796 189415 179021 163948 147490 135450 124355 115473
10364 115473 118439 121964 115854 98476 86087 74333 69392 71518 77081 88525 98785 106739 111568
10351A11568O878J030o940n411P9j323p823j2912j4882j3972j1286n935l967J3781
10337D8885L2978M7469N6860O1758N0627J8705j1031l3720n2461n8108n0360l5183
10325G6419k5822k7417k7864k8759l0304j2710j31K965Q00j4236j8059j5335j3683
10312a34136r686j1833j3291j696l634m400q590J343J1849N140M277p172j2712
10299a84541j6943k5380k0647j2106j4385j2400n154J53N214J0064O201K874L097
10286b63953J5405J8186J2526J4026Q154K155R31N85l702r282j0780k546J6727
10273b01568L3535N2957O7176P5451Q1832J07082J53612K20938L22768N23368
10263A437151Q75454J472226K327654L221542L708811L326074J726392o03682
$$ plain form
10351 111568 118446 119476 112536 107125 107204 105881 98058 85146 70264 56292 45006 39071 35104 48885
10337 48885 81863 129332 186192 247950 298577 317282 306251 272531 220070 161962 111602 76419
10325 76419 50597 23180 -4684 -33443 -63747 -76457 -76588 -73623 -72823 -87059 -105118 -120453 -134136
10312 -134136 -143822 -155655 -168946 -170642 -174276 -178676 -187266 -185923 -174074 -168934 -164657 -171829 -184541
10299 -184541 -201484 -226864 -247511 -259617 -274002 -286402 -291556 -291403 -286189 -276125 -269924 -267050 -263953
10286 -263953 -248548 -230362 -217836 -203810 -195656 -193501 -192570 -191985 -195687 -204969 -215749 -218295 -201568
10273 -201568 -168033 -115076 -47900 27551 109383 216465 370077 591015 913783 1437151
10263 1437151 2312605 3784831 6112485 9334027 13042838 16368912 18095304 17491622
10255A7491622k566287l408851l261327k543823j731555j113431p22110m90422
10247A653816l52162k60133j92581j50901j31438j08326r0867o7940n3820m9820
10237A95828m4816m9322n4856n6717m0582k7191j8738j4456j9283k2618k9411
10226a82162k9981k0080j0868o106m837j989k043n008m339m472O6Q172J8594K9688
10212b15365M5550P5150J03501J23485J31464J04411L7636m6348j11041j40341
10202A08102j39108j09854o7795j3099L9542R1106J68102K77076M35069N83119
10192A372260O18308M65069R8281l20569n73735o01823m91105l61152k51952j68425
10182b14843j16005p6914n6236m8064m0108l2561k4053k7705l2705m1086l5295
$$ plain form
10255 17491622 14925335 11516484 8255157 5711334 3979779 2866348 2144238 1653816
10247 1653816 1301654 1041521 848940 698039 566601 458275 367408 299468 245648 195828
10237 195828 151012 101690 46834 -9883 -50465 -77656 -96394 -110850 -130133 -152751 -182162
10226 -182162 -212143 -232223 -243091 -249197 -254034 -256023 -258066 -263074 -267413 -271885 -271819 -263647 -245053 -215365
10212 -215365 -169815 -94665 8836 132321 263785 368196 405832 359484 248443 108102
10202 108102 -31006 -140860 -208655 -221754 -182212 -91106 76996 354072 789141 1372260
10192 1372260 1990568 2455637 2553918 2233349 1659614 1057791 566686 205534 -46418 -214843
10182 -214843 -330848 -407762 -463998 -512062 -552170 -584731 -608784 -636489 -669194 -710280 -745575
10171g45575k6559l0167k4353k1419k1760k2440j2659p286o086q34J691L64n699
10158i22782o750l165Q5K0480K6202K0043J1768M299K301p615j1120k0775l0976
10145i18005m5243m3601m1052l1063j7529p20J4891K3927K5106K1458R915l609
10133a005525j5162k4142j6914l203k241r753k3964k3112k3138k7689l2517k7019
10121a234379j9839j9517k1148j4845l254J3703K3433M2385N5010P4282Q8891
10110a015278J05114J23925J46421J83196K54042L65391N24208P07431Q69718
10101B264168R71273R66725Q04077N89509N37683P27674J112712J610255K130365
10092A1714441K632712L222099M207251N960194Q851161J3541418K1047145L2579747
$$ plain form
10171 -745575 -772134 -802301 -826654 -848073 -869833 -892273 -904932 -912218 -918304 -919138 -917447 -917083 -922782
10158 -922782 -929532 -932697 -932612 -912132 -885930 -865887 -854119 -849820 -847519 -855134 -866254 -887029 -918005
10145 -918005 -963248 -1006849 -1047901 -1078964 -1096493 -1097213 -1082322 -1058395 -1033289 -1011831 -1001916 -1005525
10133 -1005525 -1020687 -1044829 -1061743 -1064946 -1067187 -1076940 -1100904 -1124016 -1147154 -1174843 -1207360 -1234379
10121 -1234379 -1254218 -1273735 -1294883 -1309728 -1312982 -1299279 -1275846 -1233461 -1178451 -1104169 -1015278
10110 -1015278 -910164 -786239 -639818 -456622 -202580 162811 687019 1394450 2264168
10101 2264168 3235441 4202166 5006243 5595752 6133435 6861109 7973821 9584076 11714441
10092 11714441 14347153 17569252 21776503 27736697 36587858 50129276 71176421 103756168
10084A03756168M8538510O6542566Q0434864Q3402134P0307513L6917806r434419
10077D80465142m9766514p1317877p5714174o7786624n3205089l8411039k6857963
10070I7405862j8854084j3514723r892945p404711n737976m712224m044830l454618
10062B9789751k860466k270818j727108j330027j148666j196020j332159j383907
10054A6540580j321313j182220j012059q58320p18233o12051n32047m52814l82825
10045I468698l34850l34932l46376l29612k79250k37248k50630k73680k78051
10036F804069k61094k32399k21327k10764j90758j73572j56146j37560j31794
10027E088655j37398j38010j39341j35679j24581j02836p8871o7229p1339q1007
$$ plain form
10084 103756168 152294678 218837244 299272108 382674242 452981755 489899561 480465142
10077 480465142 430698628 359380751 283666577 215879953 162674864 124263825 97405862
10070 97405862 78551778 65037055 55144110 47739399 42001423 37289199 33244369 29789751
10062 29789751 26929285 24658467 22931359 21601332 20452666 19256646 17924487 16540580
10054 16540580 15219267 14037047 13024988 12166668 11448435 10836384 10304337 9851523 9468698
10045 9468698 9133848 8798916 8452540 8122928 7843678 7606430 7355800 7082120 6804069
10036 6804069 6542975 6310576 6089249 5878485 5687727 5514155 5358009 5220449 5088655
10027 5088655 4951257 4813247 4673906 4538227 4413646 4310810 4231939 4164710 4093371 4012364
10017D012364q8684q7648q9763q8118p5182p0914o5897n0126n2866m5722m0098
10006C257346l5333l4692k8763k2666k8107m0700m9495n2230m5955l3047k5533
9995B860825k0830k1805k8361l2119m1655m5785m1314l9149l7705m3600m6655
9984B461847n0693m2060l7502k6717j9757j7178j4945j3229n590n385n648J646
9972B224789j817p646J177j1425k9836m0905m4369m6625m3370l5089k1083j2107
9960A931694j3976j4775p823q149K6J8937K6626J3069q674l2290n6348n9730n6402
9947A732185n2517m5525l3390k3711k2791j7015p987j140J2088J4184P821q239
9935A553963j6457j0770o626j864R81K900K251k253m669k915m439j9743l3151
$$ plain form
10017 4012364 3923680 3836032 3746269 3658151 3582969 3512055 3446158 3396032 3343166 3297444 3257346
10006 3257346 3222013 3187321 3158558 3135892 3107785 3067085 3017590 2965360 2919405 2886358 2860825
9995 2860825 2839995 2818190 2789829 2757710 2716055 2670270 2628956 2589807 2552102 2508502 2461847
9984 2461847 2411154 2369094 2331592 2304875 2285118 2267940 2252995 2239766 2234176 2228791 2223143 2224789
9972 2224789 2222972 2215326 2216503 2205078 2175242 2134337 2089968 2043343 1999973 1964884 1943801 1931694
9960 1931694 1917718 1902943 1895120 1886971 1886997 1905934 1932560 1945629 1936955 1904665 1848317 1788587 1732185
9947 1732185 1679668 1634143 1600753 1577042 1554251 1537236 1529249 1528109 1540197 1554381 1562202 1553963
9935 1553963 1537506 1526736 1520110 1518246 1519227 1522127 1524378 1522125 1517456 1514541 1510102 1490359 1457208
9922A457208k9132l8901k6708j3070l039J264J356m064j0217j0281j0477k3067
9910A290872l3027k9155k3429j4975p421q552r036r109q597j3543j7170j9638
9898A097220k6760k4453k9331k0567l857P822J8465K0147J7298J4106J1694Q731
9886A090515O734J5918K6162K0389L017j2184k4067l8057m3838l9303k1136o776
9874I77374k270N071P965J097j2211o046l835k394j653j3329j5513j3872r290
9861I11094l318J140j59J682K391Q735J0814J5384J6015J4348K0673J9010J4416
9848A032225R45j6861k8197k5651k1271k0205k1813k2673j6170j3112j4339j3010
9836H19868q926l582J398m229k557J021k485m410K213J0649M921k111n526j1574
$$ plain form
9922 1457208 1428076 1389175 1362467 1349397 1346358 1347622 1348978 1344914 1334697 1324416 1313939 1290872
9910 1290872 1257845 1228690 1205261 1190286 1182865 1174313 1165277 1156168 1147571 1134028 1116858 1097220
9898 1097220 1070460 1046007 1016676 996109 992252 1000074 1018539 1038686 1055984 1070090 1081784 1090515
9886 1090515 1097249 1113167 1139329 1159718 1162735 1150551 1126484 1088427 1044589 1005286 984150 977374
9874 977374 975104 980175 988140 989237 977026 970980 967145 964751 963098 949769 934256 920384 911094
9861 911094 907776 908916 908757 910439 912830 921565 932379 947763 963778 978126 998799 1017809 1032225
9848 1032225 1033170 1016309 988112 962461 941190 920985 899172 876499 860329 847217 832878 819868
9836 819868 810942 807360 808758 804529 801972 802993 800508 796098 798311 808960 813881 811770 806244 794670
9822G94670q897o353j1863j3363j9125r529O71J310n402l850M252J4064K1999
9809G58584M0176M9500K4108J5083J0690j6654m1331l9151j3724J219P925J3477
9797H09902K8671M3227P0617R2311J24172J97995L47348O00135J070201J978585
9787E363164L724785O381943P847843L480772m449169p099398n159416k977087
9779G113437j670523r58027n90783m34497m18148m27823l65630k66125j90440
9770A791441j50415j12950q8729p6336n6701k9771q874M982J3695p552m6961m2990
9758A188839l2172k3693m840K9799N6968K5295l9479m2302j2858j0739k5522m1997
9746A067299l1605j5261k796J0880K7332M1094M7815L0359O147k2895k5331J0382
$$ plain form
9822 794670 785773 779420 767557 754194 735069 725540 726211 727521 722119 718269 722521 736585 758584
9809 758584 798760 848260 872368 887451 898141 881487 840156 801005 787281 788500 796425 809902
9797 809902 838573 881800 952417 1044728 1168900 1366895 1714243 2314378 3384579 5363164
9787 5363164 9087949 15469892 23317735 26798507 22349338 15249940 10090524 7113437
9779 7113437 5442914 4484887 3894104 3459607 3041459 2613636 2248006 1981881 1791441
9770 1791441 1641026 1528076 1439347 1363011 1306310 1276539 1267665 1272647 1286342 1278790 1231829 1188839
9758 1188839 1156667 1132974 1128134 1157933 1214901 1240196 1200717 1158415 1145557 1134818 1109296 1067299
9746 1067299 1035694 1020433 1017637 1028517 1055849 1096943 1144758 1175117 1181264 1158369 1133038 1143420
9734A143420M3483L8654K1485J8769K7853K4852J5723l146k2376k9012l8805m6464
9722A194436n0899m6498m2162l8341l2891l0314k4385k2829k0951k0183k1742
9711H43241j4622j1884j3952o508l042r890j4094p444q275j1031n837o264p628
9698G22770r387l470n584n924L647K940M970J677o859j1334m08K419L389O150
9684G04996N594J1636K6545L7136N0890Q8050J46248K27861L27462M39256N17764
9673B583438N10706L45947L9161k63720m41814m70232m14304l25572k28231j60293
9663A175086j15844q0689o3846n4136l8211k4448k3429k3936j7957j2946j6326
9652G03318j7147o795o997k920l703p573j4360j0201n888q789q264r979j836L212
$$ plain form
9734 1143420 1186903 1225557 1247042 1265811 1293664 1318516 1334239 1331093 1308717 1279705 1240900 1194436
9722 1194436 1143537 1097039 1054877 1016536 983645 953331 928946 906117 885166 864983 843241
9711 843241 828619 816735 802783 796275 793233 783343 769249 761805 753530 742499 736662 730398 722770
9698 722770 713383 709913 704329 698405 702052 704992 709962 711639 704780 693446 693038 695457 698846 704996
9684 704996 710590 722226 748771 785907 836797 924847 1071095 1298956 1626418 2065674 2583438
9673 2583438 3094144 3440091 3479252 3215532 2773718 2303486 1889182 1563610 1335379 1175086
9663 1175086 1059242 978553 914707 860571 822360 797912 774483 750547 732590 719644 703318
9652 703318 686171 679376 672379 669459 665756 658183 643823 633622 627734 618945 610681 600702 598866 602078
9638F02078n238l239m837J335N514J1891P932j302k425K575K42k232m422k681
9624F05191K146P636J4846J7362P176L248m863j4254k3301k3243j7075j0475n811
9611E58583m196K430k933l109n156o835l966q231k209K34J936N30m077j088k963
9596E18950j2L709K835K022R57R76k566q33j12m29j554k485j095m197k314o195
9580E07657k578J124k232k636m889l429j141k041l408O73L405k629k507m903l023
9565D77443k729K099K691N72J173l911l345L027J3482J5146J6802Q711o066j5866
9551E09229j0232l353j848L478J726m487j4703j1830o333r58M592R75q636l832
9537D53788P24J850N101J615m36n81J754L864K344L193k251k839M38K851K595
$$ plain form
9638 602078 596840 593601 588764 590099 595613 607504 615436 614134 611709 614284 614526 612294 607872 605191
9624 605191 607337 614973 629819 647181 654357 657605 652742 638488 615187 591944 574869 564394 558583
9611 558583 554387 556817 553884 550775 545619 538784 534818 526587 524378 524612 526548 527078 523001 521913 518950
9596 518950 518938 522647 525482 527504 528461 529437 526871 526038 525926 525497 523943 521458 520363 516166 513852 507657
9580 507657 505079 506203 503971 501335 496446 493017 491876 489835 486427 487100 490505 487876 485369 480466 477443
9565 477443 474714 476813 479504 480076 481249 477338 473993 477020 490502 505648 522450 531161 525095 509229
9551 509229 498997 495644 493796 497274 499000 494513 479810 467980 461647 460689 465281 466256 457620 453788
9537 453788 454512 456362 461463 463078 462642 462061 463815 467679 470023 473216 470965 468126 468564 471415 474010
9522D74010p07j53N51n340m973J711M835n32J161L142O77m025l381J116K669L743
9506D74504L678O454Q235O229L246l965k24O072R602J4177J1081R637J0584J5339
9492E74649J6096J7467J8365J7497K4493K8780K6870L2609L5286L3030K5251J8311
9480H68704J7217J1987L605j0236j3829j4442j8022k3675k8600k7099k1516k3578
9468G20516k1927j9144j7923j8396k4022k2390j4930j1214p350j0827p390q677
9456E36326j1529j0173j0735q486o831o015n237m01l26n253m366j067p023m803
9442D54081m875m300n068K40k571o648p119l987k826k095o158n357J384L407j570
9427D06538o101n084o681n698l989K255O11O95L188J96M5K816R30P47j94k190
$$ plain form
9522 474010 473303 473150 473701 468361 463388 465099 469934 469402 470563 473705 474382 470357 466976 468092 470761 474504
9506 474504 478182 484636 492871 499100 502346 498381 498157 504229 513831 528008 539089 548726 559310 574649
9492 574649 590745 608212 626577 644074 668567 697347 724217 756826 792112 825142 850393 868704
9480 868704 885921 897908 901513 891277 877448 863006 844984 821309 792709 765610 744094 720516
9468 720516 698589 679445 661522 643126 619104 596714 581784 570570 563220 552393 545003 536326
9456 536326 524797 514624 503889 495403 488572 482557 477320 476919 476593 471340 466974 465907 458884 454081
9442 454081 449206 444906 439838 440078 437507 430859 423740 419753 416927 414832 408674 403317 404701 408108 406538
9427 406538 400437 395353 388672 382974 378985 381240 381851 382546 385734 385930 385975 388791 389721 390468 390274 388084
9411C88084j696n933q68l078l096m106l528n796l525k805j118k529K528L191L430
9396C59155M240l479m563j663j267j305k436K394P05m905J115o359n980K332M07
9381C38391k51O412N843j66M975P827J776J0265K4530L4685L2980M446l0011l6157
9367D05545k9977j6454n957n212j650j286k376m146m576K344j53k382q98j759
9353C31063l153J670L453k70N629M20q56K562J740J741j636m320r383m336l164
9338C21160M112P45k123J986M994J836k408n519j988J958L197K797K219M102L316
9323C40384Q27O68j574k024l387q81P22k46J954K493K321k266r92n55L162P357
9307C47963J0523J1530J100j1776j1544q608l360K673K579N236k264j2262p628
$$ plain form
9411 388084 386388 380455 379587 376509 373413 369307 365779 359983 356458 353653 352535 350006 352534 355725 359155
9396 359155 363395 359916 355353 353690 352423 351118 348682 351076 351781 346876 347991 341632 335652 337984 338391
9381 338391 338140 344552 350395 350229 355204 363031 364807 375072 399602 434287 467267 471713 441702 405545
9367 405545 375568 359114 353157 347945 346295 345009 342633 338487 333911 336255 336102 333720 332822 331063
9353 331063 327910 329580 333033 332763 338392 338812 337956 340518 342258 343999 342363 338043 328660 324324 321160
9338 321160 325272 326017 323894 325880 330874 332710 330302 324783 322795 324753 327950 330747 332966 337068 340384
9323 340384 341211 341879 340305 338281 334894 334013 334735 334489 336443 338936 341257 338991 337999 337444 340606 347963
9307 347963 358486 370016 371116 359340 347796 339188 335828 338501 341080 346316 344052 331790 324162
9294C24162m881n251m645q88L104l37m044L76m655j425J375m54j516N422K738
9279C09081k936o82l976P55P728N615j519O48J088k399P59N817J183J756O897
9264C29815J1837J1410l978m453n898n861n289j029m713m945n288n407q965j860
9250B95376j515m529q07K884M789M805k249j2799n816J722l289O037J220n52n778
9235B79499n016J924K156j120P04Q7p00j00P50l610Q74K289K04l171p316l405
9219B64049L290L322N74K742K747M709K463k249j481J652j648k798j998l836L678
9204B75216r90K71R07o85l04o81m017l61R04k567l921j506L883P641P795P848
9188B89433O250J784k326J170M222j026k471o390m563Qo10m206O2j002o060J418
$$ plain form
9294 324162 319281 314030 309385 308497 311601 311264 307220 307596 302941 301516 302891 302437 300921 306343 309081
9279 309081 306145 305463 301487 302242 309970 315585 314066 314714 315802 313403 314162 319979 321162 322918 329815
9264 329815 341652 353062 349084 344631 338733 332872 327583 326554 321841 316896 311608 306201 297236 295376
9250 295376 293861 289332 288525 291409 296198 301003 298754 285955 280139 281861 278572 284609 285829 285277 279499
9235 279499 274483 276407 278563 277443 278147 278234 277534 277434 278184 274574 275448 277737 277941 274770 267454 264049
9219 264049 267339 270661 271235 273977 276724 281433 283896 281647 280166 281818 280170 277372 275374 271538 275216
9204 275216 274226 274497 275404 274719 274415 273734 269717 269356 270260 267693 263772 262266 266149 273790 281585 289433
9188 289433 295683 297467 295141 296311 300533 299507 297036 290646 286083 286091 285481 281275 281337 280335 274275 275693
9172B75693j806n093l780J195j424k181l26l168k781J837k865K164O830P734P474
9157B79503M376J1575M592m102J765O175J8112K4308K2983J4609Q431j2859j3012
9144C66456j7074j6762m602j131N439J2135O062j417m251r089q360q597n414p808
9130C05587l415j0637m935m309J0770J0040Q330M270Q814Q973N901J1898J0633
9117C61920J8167K5463J9755J0999m722j4753j5836j2356r506n310m068k581N977
9104C73149J8386K2846K2057J5465L382r119j9630k7520k7635k7275j3778n096
9092C25232j575o405p523Q81J165j790j251L044O124M286O042P32N556P643K965
9077C45126j759m877m937j2315j2692o096r540m777K1L234K344M705R481J1755
$$ plain form
9172 275693 273887 268794 265014 266209 264785 262604 262278 259110 256329 258166 255301 257465 264295 272029 279503
9157 279503 283879 295454 300046 295944 297709 303884 321996 346304 369287 383896 392327 379468 366456
9144 366456 349382 332620 328018 326887 332326 344461 350523 349106 344855 335766 327406 318809 313395 305587
9130 305587 302172 291535 286600 282291 293061 303101 311431 315701 324515 333488 339389 351287 361920
9117 361920 380087 405550 425305 436304 431582 416829 400993 388637 379131 373821 369753 367172 373149
9104 373149 391535 414381 436438 451903 455285 446166 426536 399016 371381 344106 330328 325232
9092 325232 323657 317252 309729 310610 311775 309985 308734 311778 317902 322188 328230 328962 334518 342161 345126
9077 345126 343367 338490 333553 321238 308546 302450 292910 288133 288154 291388 293732 298437 307918 319673
9063C19673O131m173j0749j4312r049o259p099o314o115l528q511l229M09j383
9049B45492p98o259o752K51Q1l53O56P79M42K312p41m816J849N037j25m886q652
9032B23517j2221o977p5n717K41O541R871Q431P720K479M61J224L714M827J1403
9017B55439R815L904J719j396n255p592j0529m005o110m860l118m480l157o161
9003B14214R39J933j441L795k147m529K52J544l41J694k335k185N714M268P650
8988B29025N905p48m169M39k849o24L293m89n48K3O09L002M899Q779M321Q663
8972B59531O599N017K026J820m589p563j1193q353m518k869n958j2349q381p94
8958B08426n01J554L559k650o90l546j730j585K993m35K063K248Q444n9n801M581
$$ plain form
9063 319673 325804 321631 310882 296570 287521 281262 274163 267849 261734 258206 249695 246466 246875 245492
9049 245492 244694 238435 231683 231934 232015 231662 232318 233097 233539 235851 235110 230294 232143 237180 237055 232169 223517
9032 223517 211296 204319 204244 198527 198768 205309 215180 223611 231331 233810 234271 235495 239209 244036 255439
9017 255439 265254 269158 270877 269481 264226 256634 246105 242100 235990 231130 228012 223532 220375 214214
9003 214214 215153 217086 215645 219440 217293 212764 213016 214560 214219 215913 213578 211393 217107 221375 229025
8988 229025 234930 234182 230013 230452 227603 226979 230272 229783 229235 229258 229867 232869 237768 246547 250868 259531
8972 259531 266130 271147 273173 274993 270404 262841 251648 243295 238777 235908 229950 217601 209220 208426
8958 208426 207925 209479 213038 210388 209698 206152 204422 202837 205830 205395 207458 209706 218150 218091 212290 216871
8942B16871J256m945n83K889Q337j92m060m205k550n990P256J0984L405K139k415
8927B28197m677n589l832P26j126l838k579k14K311j760K964j096k297r83m412
8912B01795L489M171J666J017O221R04m923l382k355K79k108l3k618j420j974
8897B00729M877N333n98l211j363k796q93j594K677m105j026K518k864o844m50
8882A90390K401r79n563l925O921N878j962l097M180P169M792M916l316n246m238
8867A98321l617P18Q74n776L74j084J256L482J688k397P40n510l338K860m94O54
8851A88751J351J951K736J872k109J752J714o225j212J267J06k614l275j97o78
8836A85190J408N669j193l712k84J256m518k626j731J246J128K305K950M460L679
$$ plain form
8942 216871 218127 213182 212599 215488 223825 223633 219573 215368 212818 206828 214084 225068 228473 230612 228197
8927 228197 223520 217931 214099 214825 213699 209861 207282 207068 209379 207619 210583 209487 207190 206207 201795
8912 201795 205284 209455 211121 212138 218359 219263 214340 210958 208603 208882 206774 206741 204123 202703 200729
8897 200729 205606 210939 210341 207130 205767 202971 202078 200484 203161 199056 198030 200548 197684 190840 190390
8882 190390 192791 191812 186249 182324 189245 195123 193161 190064 194244 201413 206205 211121 207805 202559 198321
8867 198321 194704 195422 196296 190520 190894 189810 191066 194548 196236 193839 194579 189069 185731 188591 188097 188751
8851 188751 190102 192053 194789 196661 194552 196304 198018 191793 190581 191848 191954 189340 186065 185868 185190
8836 185190 186598 192267 191074 187362 187078 188334 183816 181190 179459 180705 181833 184138 187088 191548 195227
8821A95227L159l540K061k129k678k640L240N031l863p909N71M538l419j841m511
8806A81297l108O35J032M88l61M773P7q24j753k66J702J716L38N79j896J120Q16
8789A86365l50o07J172j670l250p83j491K962P144Q28j755l081J458L232j002
8774A89172j664N553N787m330p936q621j290L981N2o015m827N74J522K728P357
8759A82043j217n072n488j02J0942N762j743j133o525j483J172M018K546o147
8745A77573m424L234K919L644K565J562O50l524O80R04k723k454L711J963o33
8730A85647K559R450O928M222K565N026P640M501J1982K6274O5768J01622J09295
8717E43479L1918n8769q9370p5030m9509l0147j8223j4930q695n616o709j0166
$$ plain form
8821 195227 198386 194846 196907 194778 192100 189460 192700 197731 193868 185959 186530 191068 187649 185808 181297
8806 181297 178189 178824 179856 180344 179983 184756 184833 184009 182256 181990 183692 185408 185746 186325 184429 185549 186365
8789 186365 186015 185408 186580 184910 181660 180877 179386 182348 189492 190320 188565 185484 186942 190174 189172
8774 189172 187508 193061 198848 194518 186582 177961 176671 180652 180704 174689 169862 170436 171958 174686 182043
8759 182043 180826 175754 170266 170164 181106 186868 185125 183992 177467 175984 177156 181174 183720 177573
8745 177573 173149 176383 179302 182946 185511 187073 187723 184199 184879 185783 183060 180606 184317 186280 185647
8730 185647 188206 197656 204584 208806 211371 216397 224037 228538 240520 266794 332562 434184 543479
8717 543479 575397 516628 427258 352228 302719 272572 254349 239419 230724 225108 218399 208233
8705B08233r32K684j309j725r10J196L595N816N339Q289J9894L8085O4029J07974
8691D60258J36782J30827P2475K9143K1844m0292r9262j09638q3316n0741j8433
8680D49647J6679N1424Q4097O9944k9648r7235r2277o5309m1308l1113k4775j7012
8668B73114r430m851r618j909J115n524q739j596l997o516q762l912K647J271
8654B13293M206l400k422j387j51q8J296m52K956P539K687p314n615Q11k486l846
8638B05627K054O123j056l093k436j717N004L537l750m682j594K458M181P06L55
8623B11717J961l322K140p73j558l096o28M676k641k146N72l150M03k591R85K198
8607B04747O99M286q51K83K469M120P582L165O209M626K21l524p649m687J578
$$ plain form
8705 208233 207301 209985 208676 206951 206041 207237 210832 216648 221987 230276 250170 288255 352284 460258
8691 460258 597040 727867 800342 829485 851329 811037 711775 602137 518821 468080 449647
8680 449647 466326 517750 601847 671791 642143 544908 452631 387322 346014 314901 290126 273114
8668 273114 263684 258833 249215 247306 248421 242897 234158 232562 228565 222049 213287 209375 212022 213293
8654 213293 217499 214099 211677 210290 210139 210051 211347 210895 213851 221390 224077 216763 211148 211959 209473 205627
8638 205627 207681 213804 212748 209655 207219 205502 210506 214043 210293 205611 204017 206475 210656 211362 211717
8623 211717 213678 210356 212496 211723 210165 207069 206441 211117 208476 206330 206902 203752 204155 201564 202549 204747
8607 204747 205446 209732 208881 209164 211633 215753 223335 226500 232709 237335 237556 234032 226383 221696 223274
8592B23274J568J620K041J621r70j144n490n348P26O939L781M703j282J268J805
8577B35112L272Q600J6636k038n235m069o501J486k607n682n042o27j915l325
8563B28065J370L06M012P42K261O755O91k756k027o667p015L53J417L151K960
8548B33618M917K556K960q88K814J0410J3007J9738Q625m140j2575j6287j2593
8535B52162q758k862JN147N467L742J0728K5806K9226P845j4423j8656j4614j3789
8521B67022q113o211k070n495j578K568L088P557Q832N667p56j051J112M778J0668
8506B86018O924p43N650J266L128N622o944j8673j6293r903o485o157p537k642
8492B33231L961K460k127R056K1194K9665K2933R143p450j9732k2253n026J0232
$$ plain form
8592 223274 224842 226462 228503 230124 229154 228010 222520 217172 217898 224837 228618 233321 232039 233307 235112
8577 235112 238384 246984 263620 261582 256347 252278 245777 247263 244656 238974 233932 233305 231390 228065
8563 228065 229435 229741 233753 234495 236756 243511 244202 241446 239419 232752 225737 226090 227507 230658 233618
8548 233618 238535 241091 244051 243163 245977 256387 269394 289132 297757 293617 281042 264755 252162
8535 252162 243404 240542 240543 245690 251157 254899 265627 291433 320659 328504 314081 295425 280811 267022
8521 267022 258909 252698 250628 245133 243555 246123 249211 256768 265600 271267 270511 269460 270572 275350 286018
8506 286018 292942 292199 297849 299115 302243 307865 300921 282248 265955 256052 249567 243410 235873 233231
8492 233231 237192 239652 237525 246581 267775 297440 320373 329516 322066 302334 280081 275055 285287
8479B85287K7747N3659Q6979J47712K47571K96158J22464j25833j84477j56026
8469H01241j28670r7681n3285j7838P699J7864N583k8115m7364m3768k2828j0425
8457C82413q379k97J7229K0580J2420l044j8249k2659k2965k3287j6715j0534
8445C06513j0557p486K236L021J908O762J7126K0658J9116K7324N2427R9498J65601
8432G04147K99430N46190Q32332O41465j23923m40223l85124l46396k94585k09003
8422A224310j54223j42146j14201q8697n8956l4733r060Q779J3304R73k5782l6658
8410E82910l6279k7195k6266l0138k7313k0127j1875j1705j0288p421m144r765
8398C60394o37N134J4857J1580K6004M8147Q0950J28796J56946J16277N7353R7762
$$ plain form
8479 285287 313034 366693 453672 601384 848955 1145113 1267577 1141744 957267 801241
8469 801241 672571 574890 521605 503767 511466 529330 534913 506798 459434 415666 392838 382413
8457 382413 374034 373737 390966 411546 423966 420922 402673 380014 357049 333762 317047 306513
8445 306513 295956 288470 290706 293727 295635 302397 319523 340181 359297 386621 439048 538546 704147
8432 704147 1003577 1549767 2382099 3023564 2899641 2459418 2074294 1727898 1433313 1224310
8422 1224310 1070087 927941 813740 725043 666087 631354 622294 631073 644377 645350 619568 582910
8410 582910 546631 519436 493170 463032 435719 415592 403717 392012 381724 374303 370159 360394
8398 360394 359757 364891 379748 391328 417332 465479 546429 675225 832171 948448 1005801 1103563
8386A103563K32246L18369J72337j05262k53876k56929k10942j63691j10812p4232
8376F50771m2959l2995k6052k7887k6947k1648j9615j1676j3297j3588j4150j2123
8364C87834j2812j6100q832r271p915m887o035p331q691l994k538j341m066K473
8350B96494N947J358L57N072J1476J4995J4938R934J0189K1787L8194M2146J4729
8337D87616l2514m5419k9336k3452j5873j3556j2277q294l552j091k422l192m229
8324B92409j350J737j271j34L672l317m886m135j280L63P363j170m846K619O781
8309B92555L509L164P319N03o975j0110j2960r357O562J0617J9881L0402L4584
8296C69694K0903n409k4685k4680j8313m730k177l540p683j3194r006r857r355
$$ plain form
8386 1103563 1335809 1654178 1826515 1721253 1467377 1210448 999506 835815 725003 650771
8376 650771 607812 574817 548765 520878 493931 472283 452668 440992 427695 414107 399957 387834
8364 387834 375022 358922 350090 340819 332904 328017 321982 314651 305960 301966 299428 298087 294021 296494
8350 296494 302441 303799 304156 309228 320704 335699 350637 360571 370760 392547 430741 472887 487616
8337 487616 455102 409683 380347 356895 341022 327466 315189 306895 303343 302252 299830 296638 292409
8324 292409 291059 292796 291525 291391 295063 291746 286860 282725 281445 281808 289171 288001 283155 285774 292555
8309 292555 296064 299228 306547 307050 300075 289965 277005 267648 274210 284827 304708 335110 369694
8296 369694 390597 385188 360503 335823 317510 312780 310603 307063 299380 286186 277180 267323 257968
8283B57968q127l086m919n221J13k785k136q645K86L757J01k527m278J171Q542
8268B30214J0375J0441l870m87K202J392K18K277K838J0041K6524L0352J7972
8255C40489n974k7321l1538k2130j4866j6658q958n453l592k366n851N437N781
8242B07000l114n901n208M52m052n338j941l785l340J769j31k454O15k177M22
8227A72817m406k127J148K626k519j495j002J452P10l364o192j477J728J636L100
8212A62635K158q96J66J841j903m514l648n272j24N339J92n0J609o875Q79M510
8196A56047N35p60m410K816k333n361j511J371j765q07j531o18L487L874m121
8181A44913j049k435M090K042n13k308O55M134Q35Lm274j568m77p96O58j39M75
$$ plain form
8283 257968 249841 246755 241836 236615 236728 233943 231807 223162 223448 227205 227306 224779 220501 221672 230214
8268 230214 240589 251030 247160 246673 248875 250267 250485 252762 255600 265641 292165 322517 340489
8255 340489 334515 307194 275656 253526 238660 222002 213044 207591 203999 201633 195782 201219 207000
8242 207000 203886 197985 192777 193229 189177 183839 181898 178113 174773 176542 176411 173957 174572 172395 172817
8227 172817 168411 166284 167432 170058 167539 166044 165042 166494 167204 163840 157648 156171 157899 159535 162635
8212 162635 164793 163897 164063 165904 164001 159487 155839 150567 150443 155782 155974 155924 157533 150658 151537 156047
8196 156047 156582 155822 151412 154228 151895 146534 145023 146394 144629 143822 142291 141673 145160 149034 144913
8181 144913 143864 141429 145519 147561 147048 144740 145395 149529 150364 150367 146093 144525 144048 143252 143910 143771 144246
8164A44246J29m419p698p904K223P351M161K511Q43O04j046j265k95o88K0j909
8148A36864n115o161K747N312K346l8L755j996m664k679m25k04L616N168j78j523
8132A36825M45K64L35J216K678K709q87m127k061k336n19k742Q27J422P95m015
8116A30829J224N196K037k113j995k45k297J18L01N71M11o75r77n62j648l508
8100A26667P47j422K47K520N05m477M2J842J247Q11j120k61n476Q02P054O591
8084A36319l590J478K980J085M6l046j274n052j915j130J247j81k918Q91L142
8069A28082m734m013J137J320m958k729L542K896o33J358K521M38k118k55R013
8054A30867K699l94k039j96l296m458j379l176k390M888J10L091M225K833j995
$$ plain form
8164 144246 144375 139956 132258 124354 126577 133928 138089 140600 141443 142047 141001 139736 139441 138753 138773 136864
8148 136864 131749 125588 128335 133647 135993 135955 139710 137714 133050 130371 129946 129742 133358 138526 138348 136825
8132 136825 137270 137534 137869 139085 141763 144472 143585 139458 137397 135061 134542 131800 132627 134049 134844 130829
8116 130829 132053 137249 139286 137173 135178 134933 132636 132754 133055 133626 134037 133362 132385 131823 130175 126667
8100 126667 127414 125992 126239 128759 129264 124787 124829 126671 127918 128729 127609 127348 121872 122674 129728 136319
8084 136319 132729 134207 137187 138272 138318 135272 133998 128946 127031 125901 127148 126967 124049 124940 128082
8069 128082 123348 119335 120472 121792 116834 114105 117647 120543 119910 121268 123789 124227 122109 121854 130867
8054 130867 133566 133172 131133 130937 127641 123183 121804 118628 116238 121126 121236 124327 128552 131385 129390
8039A29390L351J859j043p034q51j997m8j341L368O136j634l088l215n329O21
8024A19145j328l89l359M575J357k276M96K469K127J33L256O696P596M761M545
8009A49804L617L65l858n248q477m715n13m903k100n251j87j77k029J4L959M736
7993A25037k693n014J922K257l292k817L486J0262K752p700p46k569l986p468
7979A09431j791L790L635q70L53N06M24k608n911P65q57N356R281R910J0944J1187
7963A53545J789m323m714j0202q681l211n752j230L202j504q724O59K036j755
7949A11135N234N687n5o649l201j334l408M773L311j988P52n88K31j691K293l483
7933A11019l08M07q829o471N540L951j749K903O11J245K88J003L937O023K751
$$ plain form
8039 129390 132741 134600 133557 126523 125672 123675 123627 122286 125654 131790 130156 127068 123853 118524 119145
8024 119145 117817 117428 114069 118644 120001 117725 118221 120690 122817 122950 126206 132902 140498 145259 149804
8009 149804 153421 153786 149928 144680 136203 131488 130975 126072 123972 118721 118534 118357 116328 116342 120301 125037
7993 125037 122344 117330 119252 121509 118217 115400 118886 129148 131900 124200 123454 120885 116899 109431
7979 109431 107640 111430 115065 114195 114548 115054 115478 112870 106959 107724 106867 112223 121504 131414 142358 153545
7963 153545 155334 151011 146297 136095 127414 124203 118451 117221 120423 118919 110195 110854 112890 111135
7949 111135 116369 122056 122001 115352 112151 110817 107409 112182 115493 113505 114257 113669 113900 112209 114502 111019
7933 111019 110711 111118 102289 95818 101358 105309 103560 106463 107074 108319 108607 109610 113547 119570 122321
7918A22321M383N456J077m940r72l900m786J798l254J669L04l278J070L287k655
7903A17580n421n295K267K238j616J788n27j477L08j004L45m084k400o64O3N648
7887A07749O442n799k205j643l957O04K245j492L222N709N601K648j679m453l62
7872A12630M661J087K312K942j335J678J531k615o443m665j934j557J274l91K333
7857A11508l70q22k594k284J886L510m451l203R5M087P16l396n822k52R90L072
7841A02670J813k799Q64M58l977k55M114K999J874n849k758j378o18j641K353
7826I7870K401P51k511R17n13N634N483K474p35j02l616m065n587k447K766n647
7810I3073o360J037K981K380L298n933j0389j467P01K49K61k244l098L050O934
$$ plain form
7918 122321 126704 132160 133237 128297 127325 123425 118639 120437 117183 118852 119156 115878 116948 120235 117580
7903 117580 112159 106864 109131 111369 109753 111541 111014 109537 109845 108841 109186 105102 102702 102038 102101 107749
7887 107749 114191 108392 106187 104544 100587 101191 103436 101944 105166 110875 116476 119124 117445 112992 112630
7872 112630 117291 118378 120690 123632 122297 123975 125506 122891 116448 111783 109849 108292 109566 109175 111508
7857 111508 111138 110316 107722 105438 107324 110834 106383 103180 103275 107362 108078 104682 98860 98608 99598 102670
7841 102670 104483 101684 102548 103006 99029 98774 102888 105887 107761 101912 99154 97776 97158 95517 97870
7826 97870 100271 101022 98511 99428 98915 104549 110032 112506 111771 111669 108053 103988 98401 95954 98720 93073
7810 93073 86713 87750 90731 93111 96409 90476 80087 78620 79321 79570 79831 77587 74489 77539 84473
7795H4473R477n5j869J493L68J592J84j170n65k750L548K093q84m874Q11N970
7779I7842j593o359m528M065J908L97j379m03o547n471k438R55M268j724l366
7764G5627j194N978N908J062j273n53N30k39j261j366j516N260k923R03j200k849
7748H0894m21n02l226J406J432k162Q41L244l763m857j672K011l138N703K793
7733G8583L932K457m021k037k16K748J126r39L295R16j424l917l3J57j803n63
7717G8261k340K400M345L340N277n527j060N26j722n859n433J590L489J82j89
7702G7280k503n595k398J658k64k03P179M386j854l189N85K296p11L22J058J605
7686G9652p242k269N408J986K082Q18N519K762o258q138J760J905o335l676M83
$$ plain form
7795 84473 93950 93895 92026 93519 93887 95479 95663 94493 93928 91178 94726 96819 95935 91061 91872 97842
7779 97842 96249 89890 85362 89427 91335 91732 90353 89950 83403 77932 75494 76449 80717 78993 75627
7764 75627 74433 80411 86319 87381 86108 85555 86085 85846 84585 83219 81703 86963 84040 84943 83743 80894
7748 80894 80473 79971 76745 78151 79583 77421 78262 81506 77743 72886 71214 73225 70087 75790 78583
7733 78583 82515 84972 80951 78914 78698 81446 82572 81633 84928 85844 84420 80503 80470 80627 78824 78261
7717 78261 75921 78321 82666 86006 91283 85756 84696 85222 83500 77641 72208 73798 77287 77469 77280
7702 77280 74777 69182 66784 68442 68178 67975 75154 79540 77686 74497 75082 77378 76667 76989 78047 79652
7686 79652 72410 70141 75549 77535 79617 80435 85954 88716 82458 74320 76080 77985 71650 67974 68457
7671F8457K98J872K79k534j113M976N376k77k554k385N2l141j120j430J907L650
7655G2313K180k555k084k975J105L202O23N28J591l246j656j31J307L814L363
7640G7379k756o054m266M035J776N333J33l986n129l04l050q80L315N50j420L107
7624F7783K660J515l3r24Q62J607K247l304l667k585q9N682l17k887q38K3L695
7607G1430j197K573k662J92M48K834O45n785m217L761P69M816L36L226N18m126
7591G3561j652K416k690l116M104J71n584O056N040k315l094O61L475l658l448
7576F9927j131O0N94j368n20M87P07k272J251N480R23J47K397m077n400M0m52
7559F6793j603K284L71m639K89j767M033k55l766K625r44j216k74Q62J955N53
$$ plain form
7671 68457 68755 70627 70906 68372 67259 72235 77611 77334 74780 72395 72447 69306 68186 66756 68663 72313
7655 72313 74493 71938 69854 66879 67984 71186 71809 72337 73928 70682 69026 68895 70202 74016 77379
7640 77379 74623 68569 64303 68338 70114 75447 75580 71594 66465 66161 63111 62231 65546 66096 64676 67783
7624 67783 70443 71958 71925 71001 71863 73470 75717 72413 68746 66161 66072 71754 71437 68550 67712 67735 71430
7607 71430 70233 72806 70144 70336 70784 73618 74263 68478 64261 68022 68791 73607 73943 77169 77687 73561
7591 73561 71909 74325 71635 68519 72623 72794 67210 73266 78306 75991 72897 73558 77033 73375 69927
7576 69927 68796 68856 69450 68082 67562 68049 68756 66484 67735 73215 74138 74285 76682 72605 67205 67245 66793
7559 66793 65190 67474 67845 63206 63495 61728 65761 65506 61740 64365 63421 62205 61931 62793 64748 65301
7543F5301J550M5K012r73k275l976O524K698j971m78k332j679N160J332K6m013
7527F6951L615n75k811l306j515N900J992J083k959j903r73l688r68K860L078
7512F6781k216j374k668j253K120K160L410J076m92j657l277K740K474q06k165
7497F4853l316j937N239L039k700k881L787j395mR05J01l604m015p08M65N176
7481F3005J933k804l774l146K9L48J686M793j382K64J133n752J980L005J911K954
7465F6183k168k096L069n928j94J085j205L238O748L425M325n182p573m149l768
7450E5810j789o87K528k62k072O238L863J72j724l872M605M005j091K132k646
7435F5210m780J182L644N991j011q144j972J25P60J3l261l450K653J914K769M63
$$ plain form
7543 65301 66851 66896 68908 67935 65660 61684 68208 70906 68935 68457 66125 64446 69606 70938 70964 66951
7527 66951 70566 69991 67180 63874 62359 68259 70251 71334 68375 66472 65499 61811 60843 63703 66781
7512 66781 64565 63191 60523 59270 61390 63550 66960 68036 67544 65887 62610 65350 67824 67018 64853
7497 64853 61537 59600 64839 67878 65178 62297 66084 64689 64685 65590 65691 62087 58072 57364 57829 63005
7481 63005 64938 62134 58360 55214 55243 55591 57277 62070 60688 60952 62085 56333 58313 61318 63229 66183
7465 66183 64015 61919 64988 59060 58866 59951 58746 61984 68732 72157 76482 71300 63727 59578 55810
7450 55810 54021 53334 55862 55600 53528 59766 63629 63801 62077 58205 62810 66815 65724 67856 65210
7435 65210 60430 61612 65256 71247 70236 62092 60120 60245 61005 61018 57757 54307 56960 58874 61643 62106
7419F2106j035m575O14K176L110m77o215k397Q58N906Q40m364L437L537j971K049
7403F3599L314o908l496j653k110Q764K115m202k702m019J517J702L027n126m758
7388D9064K430J859K158P3N850M171m304l052k968k710j635L984N589M188J080
7373F5777M186j820j50o181n054l368N133N3l512n664k338M631K458n352q72K41
7357D8168L906K479Q77n21j842j484L51r56M399K416j574K251P110j406l331n30
7341F0313j820l735N68j012k754L86K08j015j061O69J772L188O3L240J984m696
7325E6298n613J073p31K651J688j064M22K992O99N78J465M236j507j30o93m39
7309F1925m133l589m13k435p008o05P92p24J884O545j617j529j14o55J371N091
$$ plain form
7419 62106 61071 56496 57110 59286 62396 61919 55704 53307 54165 60071 60911 56547 59984 63521 61550 63599
7403 63599 66913 60005 56509 54856 52746 61510 63625 59423 56721 52702 54219 55921 58948 53822 49064
7388 49064 51494 53353 55511 55584 61434 65605 61301 58249 55281 52571 50936 54920 60509 64697 65777
7373 65777 69963 68143 67993 61812 56758 53390 58523 58576 55064 49400 47062 51693 54151 48799 47927 48168
7357 48168 52074 54553 55430 54909 53067 51583 51934 50978 55377 57793 56219 58470 65580 64174 60843 60313
7341 60313 58493 54758 55326 54314 51560 51946 52154 51139 50078 50747 52519 55707 55770 59010 60994 56298
7325 56298 50685 51758 51027 53678 55366 54302 54724 57716 58415 58993 60458 64694 63187 63057 62364 61925
7309 61925 57792 54203 53790 51355 44347 43742 44534 43810 45694 52239 50622 49093 48979 48324 49695 54786
7293E4786R22P95L114m151j797J616K782q03p27j313m203l603J299N24K352K707
7277E4300J833k522n233l195J260k02L530L11J039m289n679k072k102J442K320
7262D0741j237O127L651N66m003j896M32J446N364j182j391M778O156n89k479
7247E6484K027N319k009p087k835j747J243J757j260l538Q04r37Rk68K456j4L129
7230E3533k831n819k03J483L76J574k246L218n53j240O661M570j536j933m38n373
7214D9243l310K961o890n193P601J015K591k86j600K816m24L654O260l72n048
7199E3018j812J147L08m56k228O75P19l602k714L082l25k542M650M796l145n64
7183E1007J535M39l68k657m61L936M50k898m79q41J998j886l493q83k790J752
$$ plain form
7293 54786 55708 56503 59617 55466 53669 55285 58067 57264 56537 55224 51021 47418 48717 49241 51593 54300
7277 54300 56133 53611 48378 45183 46443 46241 49771 50082 51121 46832 41153 39081 36979 38421 40741
7262 40741 39504 45631 49282 49848 45845 43949 44381 45827 51191 50009 48618 53396 59552 58963 56484
7247 56484 58511 63830 61821 54734 51899 50152 51395 53152 51892 48354 49158 48221 48230 47962 50418 50404 53533
7230 53533 50702 44883 44680 46163 46539 48113 45867 49085 48532 47292 53953 58523 56987 55054 54616 49243
7214 49243 45933 48894 42004 36811 44412 45427 48018 47732 46132 48948 48524 52178 58438 58066 53018
7199 53018 51206 52353 52661 52205 49977 50652 51371 47769 45055 48137 47812 45270 49920 54716 51571 51007
7183 51007 52542 52981 52613 49956 49495 53431 53881 50983 50504 49663 51661 49775 46282 45399 42609 44361
7167D4361M455k911j359k736j987M234m70m846J123K591L799O22O23j298m12p21
7151D5068K975L996K294o216m411N05q12m032j448l595n31M542L349K184J555
7136D5423k494j280K58k068j574J608K335L296K416j799l193L364p27k600k105
7121D0860K259P20N330R56j071l39k977p816k011J047P577L177K728j769l297
7106D5374K559j646k433M56O541k434n203L687K337j987k063l52j80j623j603
7091D1430j694j722L708M480L759j307K336j29P13K34k805l29J795m036n25J939
7075D7847K113K426n22n663j681k043j551l08K64K689k535j433m81J921K441q92
7059D2592k240j865K877O680q64l073j43O46p68k970o09l55j093O33K829l392
$$ plain form
7167 44361 48816 45905 44546 41810 39823 44057 43587 38741 39864 42455 46254 46876 47499 46201 45789 45068
7151 45068 48043 52039 54333 48117 43706 44211 43399 39367 37919 34324 33793 38335 41684 43868 45423
7136 45423 42929 41649 41907 39839 38265 39873 42208 45504 47920 46121 42928 46292 45565 42965 40860
7121 40860 43119 43839 49169 50125 49054 48715 45738 37922 35911 36958 44535 47712 50440 48671 45374
7106 45374 47933 46287 43854 44310 50851 48417 43214 46901 49238 47251 45188 44836 44656 43033 41430
7091 41430 39736 38014 41722 46202 49961 48654 50990 50861 51574 51808 49003 48674 50469 46433 45908 47847
7075 47847 49960 52386 51864 46201 44520 42477 40926 40618 40882 43571 41036 39603 39122 41043 43484 42592
7059 42592 40352 38487 41364 48044 47180 44107 43964 44610 43842 40872 40263 39908 38815 39448 42277 38885
7043C8885k389K549L264K138K797j832m441K644O404J333k995J06l914j895j24
7028D2530J251K478m236J027L77j653J990j436k453R92J476q5K118r30Q68L9n925
7011C8428m15k737J499J799K860k407nN585J955L118o5k418o11r80o089R2K925
6994D2534n59L254l597n096L043K478J297k97M076r22j847k591k340j161N688
6979D3960l08O85L004k113j462k31j013j353j063k970j462j492n35J310N144L768
6963D3869N979J313k493k459q50l999j970j282k823J014L822j644O35lK85k044
6947C7350p277P15N217K33n96q45m846K494M321K567l72k0K444o988k4K751M838
6930D1962Q90k640N369j676l764m13j994J286L462n196l785j970o328P6L204L887
$$ plain form
7043 38885 36496 39045 42309 44447 47244 45412 40971 43615 50019 51352 48357 48463 44549 42654 42530
7028 42530 43781 46259 42023 43050 43427 41774 43764 42328 39875 40867 42343 42258 44376 43446 44314 44353 38428
7011 38428 38013 35276 36775 38574 41434 39027 39022 44607 46562 49680 49615 47197 46586 45606 39517 39609 42534
6994 42534 41975 45229 41632 36536 39579 42057 43354 43057 47133 46211 44364 41773 39433 38272 43960
6979 43960 43652 44337 47341 45228 43766 43535 42522 41169 40106 37136 35674 34182 33647 34957 40101 43869
6963 43869 49848 51161 48668 46209 45359 41360 39390 38108 35285 36299 40121 38477 39112 39109 39394 37350
6947 37350 30073 30788 36005 36238 35642 34797 29951 32445 36766 39333 38961 38941 41385 34397 34373 37124 41962
6930 41962 42852 40212 45581 43905 40141 39728 37734 39020 42482 37286 33501 31531 25203 25279 28483 32370
6914C2370M060L68m49p32L506q42l089J28J00k448k201P73L259J289j054N891
6898D0929J778M77L66m018n338k452J259j297n13Q32J239j95k495K569O555M874
6882D4570m487o131m34M326o283k425p53J124K291J773J3J829O198k293l715j898
6866C3705N9Q039J901K19J716j641n808j767K746o05o70o348J021L563l495l814
6850B8821L118O51o72J125k503k049J968L632K877o89j387k550n75N532L998l449
6834C7848j906K613j711J344J942N538L12n067k364J408J874K109l498k139K926
6819D1229L421j911k259J777k193l156r20l524p09k777m226m798M82L563q70M359
6803B7488j172k060M389P743K613k591q69J007R12m591j138k673N17K911j566
$$ plain form
6914 32370 36430 36798 36349 35617 39123 38281 35192 35320 35420 32972 30771 31544 34803 36092 35038 40929
6898 40929 42707 43184 43550 39532 34194 31742 33001 31704 31191 32023 33262 33067 30572 33141 39696 44570
6882 44570 40083 33952 33518 37844 31561 29136 28383 29507 31798 33571 33584 35413 41611 39318 35603 33705
6866 33705 33764 41803 43704 43923 45639 43998 38190 36423 39169 38564 37894 31546 32567 36130 32635 28821
6850 28821 31939 32590 31918 33043 30540 28491 30459 34091 36968 36279 34892 32342 31767 37299 41297 37848
6834 37848 35942 38555 36844 38188 40130 45668 45980 40913 38549 39957 41831 43940 40442 38303 41229
6819 41229 44650 42739 40480 42257 40064 36908 35988 32464 31755 28978 24752 19954 20436 23999 23129 27488
6803 27488 26316 24256 28645 36388 39001 36410 35541 36548 37460 32869 31731 29058 29575 32486 30920
6788C0920J172J827L756j430m894l724N55K01L076M301m52j061M820J87M31j514
6772C8171j468r99J68J283N37P756K361l19R532K2389J0320j3214j6719j0256
6758D9542l792O49j422l061P004J2149R358M916J096K348k661o818p968p781j1281
6743D2278l974m112j84O87N94j234o417j550L544M623m7l41K253O322J0601R167
6727F2210K2337K3103L756k1801j6071p442j1799l953J005m982r249l194J054
6714C4974K348K943L550q410o869l39N822K389K863l798m245j742M540L920O386
6699D4332m165o162n05M488J781m279j503P244L000l352N903J1059N338l616j0429
6684D9134r889r227j332O05R18k344m365L277M868J765R82L765j744m272K14q1
$$ plain form
6788 30920 32092 33919 37675 36245 31351 27627 28182 28383 31459 35760 35308 34247 39067 39254 39685 38171
6772 38171 36703 35704 35872 37155 37692 45448 47809 47490 57022 79411 89731 76517 59798 49542
6758 49542 45750 46399 44977 41916 48920 61069 70427 75343 76439 78787 76126 69308 61340 53559 42278
6743 42278 38304 34192 34008 34695 35289 34055 27638 26088 29632 34255 34208 33867 36120 42442 53043 62210
6727 62210 84547 107650 111406 89605 73534 66092 54293 50340 51345 46363 37114 33920 34974
6714 34974 37322 40265 43815 35405 28536 28197 34019 36408 39271 35473 31228 29486 34026 37946 44332
6699 44332 40167 34005 33500 37988 39769 35490 33987 41231 44231 40879 46782 57841 63179 59563 49134
6684 49134 39245 30018 28686 29291 30209 27865 23500 26777 31645 33410 34392 38157 36413 32141 32355 32274
6668C2274P41Q72l19j106o52K702J767L221l19n416j846k249j133k628p22J0229
6652C5416L088k60K33N68P79j994k856K0J281M616k825n439k5K163j401j426m357
6635B7581k104r71J721M540j984j494p78L854J246k205p07j637K038J892J070
6620C2062J058j11L956J282n872l208L302K402o78l065m447J29J20k473n030k532
6604A6895k447k378O997J780P574N597j905J074o12r53K20K416L983l268l739
6589C1234k764L083J751r22L8J14m614K474J007R54k126j637J846j354L00n42
6573B8842J72P10L774j378k368o472l95M629M60j729J771k008M06N069M421N522
6557D1426n087m448Q69k046K687n41N449L85p67n41m656j10j754N99M464K971
$$ plain form
6668 32274 33015 33887 33568 32462 31810 34512 36279 39500 39181 33765 31919 29670 28537 25909 25187 35416
6652 35416 38504 38244 38477 39045 39824 37830 34974 34994 36275 40891 38066 32627 32602 34765 33364 31938 27581
6635 27581 25477 24506 26227 30767 28783 27289 26511 30365 31611 29406 28699 27062 29100 30992 32062
6620 32062 33120 33009 36965 38247 32375 29167 32469 34871 34193 31128 26681 26810 26930 24457 19427 16895
6604 16895 14448 12070 19067 20847 28421 34018 32113 33187 32575 31622 31842 34258 38241 34973 31234
6589 31234 28470 31553 33304 32382 32420 32534 27920 30394 31401 32355 30229 28592 30438 29084 29384 28842
6573 28842 29014 29724 33498 32120 29752 23280 22885 27514 27974 26245 28016 26008 26414 31483 35904 41426
6557 41426 36339 31891 32760 30714 33401 32860 38309 38694 37927 37386 32730 32620 30866 31465 35929 38900
6541C8900m648m958j962J979j471j966O92M294J057k549k467n903K34K599L18
6526B4149L190O653M099n78o576m323K902Q18l544k792K692M97J696J671n20J151
6510C1185n122k087M420N205J665l444k06L536J365J465o090k273J652J824M418
6495C7513p60k434k291o89k681n355j349N629J468n11M49l415k291l699K722K053
6479B4359K935J88j128k511l671L389J749l522j807L42k54l784Q09L624m62r90
6463A9266R52k91l813J118Q905O208J022l393M92J165r64K73o380k918P31j185
6447B1188l561L461K198M578K572J03R74N8k125j327k509L145L359J716k314k820
6431B8696r2m749n192N188J41l686J803J078j050J86J982L78K687l860j141J330
$$ plain form
6541 38900 34252 29294 27332 29311 27840 25874 26566 30860 31917 29368 26901 20998 21232 23831 24149
6526 24149 27339 33992 38091 37513 30937 26614 29516 30334 26790 23998 26690 27187 28883 30554 30034 31185
6510 31185 26063 23976 28396 33601 35266 31822 31616 35152 36517 37982 31892 29619 31271 33095 37513
6495 37513 36753 34319 32028 31339 28658 23303 21954 27583 29051 28540 28989 25574 23283 19584 22306 24359
6479 24359 27294 27482 26354 23843 20172 23561 25310 21788 19981 20323 20069 16285 17094 20718 20256 19266
6463 19266 20218 19927 16114 17232 26137 32345 33367 29974 30466 31631 30667 30940 24560 21642 22373 21188
6447 21188 17627 21088 23286 27864 30436 30539 31513 31571 29446 28119 25610 28755 32114 33830 31516 28696
6431 28696 28604 23855 18663 23851 23992 20306 22109 23187 22137 22323 24305 24683 27370 23510 22369 23699
6415B3699K840j135j142J188J254k791k601L126l006j691O362L097Q82j806j918
6400B6358m005j305l078M278L867Q00l926P42k82K751k50o83l612K600k49n79
6384B3427P410J403l595k382l540j868J03M307o94N20J428L347K399P50J111n023
6368B9103p938L724O508M299k163l760k432j890J506N496J515n76o028m91j410
6353B5463l461L181j414m137K086o75N025M837r28k60j806q238k074L545j64L679
6337B4659K261N235L387L36m963l171J568r83k592J252J140j387q52k409m917
6322A8564K23O085M871J983k2m169k684K541k346l267k324J824J54k424l387K857
6306A8479J412L098N198Q22K949K709k005m525k521o12q517k339L779M954K048
$$ plain form
6415 23699 26539 25404 24262 25450 26704 23913 21312 24438 21432 19741 26103 29200 30082 28276 26358
6400 26358 22353 21048 17970 22248 26115 26915 22989 23731 23449 26200 25950 25267 21655 24255 24006 23427
6384 23427 30837 32240 28645 26263 22723 20855 20958 25265 24571 25091 26519 29866 32265 33015 34126 29103
6368 29103 21165 24889 31397 35696 33533 29773 27341 25451 26957 32453 33968 33392 27364 26873 25463
6353 25463 22002 25183 23769 19632 21718 21043 26068 30905 29977 29717 27911 19673 17599 21144 20980 24659
6337 24659 26920 32155 35542 35878 30915 27744 29312 28329 25737 26989 28129 26742 25890 23481 18564
6322 18564 18787 24872 29743 31726 31704 27535 24851 27392 25046 21779 19455 21279 21433 19009 15622 18479
6306 18479 19891 22989 28187 29009 31958 34667 32662 28137 25616 25004 16487 14148 17927 22881 24929
6291B4929J501m55M97J856j468l692m735o79K962K863N686L53l178j675K791O723
6275C4279j658m823k605j755O0k72R93M360o27l989k085L690p48k261q82m76L020
6258B4221n85j829m879L403L891j29J563j396j754j030K726K717R65q80J635L3
6242B8672M101j114j348k886j187M175J465k969j668k164M297k554l178k919L9
6227B0762R34j237j983l081r5j300J384M368M237j42k08K639k952l368l757j037
6211A5164O829P04n887l42M97J139K354J29j163J310J65J491P65M824L607K159
6195C3745K67j757o934k987R84K095k910j266O07L23K074L949J202p402n518j506
6179A4966P50l468j749M705N803n21L634J399j543k616m102L33J366J142j040
$$ plain form
6291 24929 26430 25975 26472 28328 26860 23168 18433 17754 20716 23579 29265 29618 26440 24765 27556 34279
6275 34279 32621 27798 25193 23438 23498 23226 24219 28579 27952 23963 21878 25568 24820 22559 21677 21201 24221
6258 24221 23636 21807 16928 20331 24222 24093 25656 24260 22506 21476 24202 26919 27884 27004 28639 28672
6242 28672 32773 31659 30311 27425 26238 30413 31878 28909 27241 25077 29374 26820 23642 20723 20762
6227 20762 21696 20459 18476 15395 15300 14000 15384 19752 23989 23847 23639 26278 23326 19958 16201 15164
6211 15164 21993 22697 16810 16468 16965 18104 20458 20587 19424 20734 20899 22390 23155 27979 31586 33745
6195 33745 34012 32255 25321 22334 23318 25413 22503 21237 21844 22167 24241 28190 29392 21990 16472 14966
6179 14966 15716 12248 10499 15204 21007 20486 24120 25519 23976 21360 17258 17591 18957 20099 19059
6164A9059K923N141l48o319k571l17M90M978J310L074p7O10J18J233k797O97K169
6147B9373n697o001J473N955l116j288l230j082P48M895J986K608n132m169j55
6132A7168P368K140L213l962k596P78l53l726K180l998j160K473j116K849M036
6117B5294l459n401k80N743M093J178R24j238l45r40m735k949l11l236R61k027
6101A3272J715J222j699j86L942l470o618m300L973J541k135n98r61R91L183L623
6085A3495M623k505n14l492l235m54J95K5M478M543K10J197L54j090J46J128l26
6068A8778m655l667Q38R52p12K097L679r22j702K933L564k542J46M993R14r58
6052B3736q21j137L198M737j738k538n99n65k381m281l431q58M040J762m463j454
$$ plain form
6164 19059 21982 27123 26775 20456 17885 17568 18058 23036 24346 27420 27343 27953 28071 29304 26507 27204 29373
6147 29373 23676 17675 19148 25103 21987 20699 17469 16387 17135 22030 24016 26624 21492 17323 17168
6132 17168 24536 26676 29889 25927 23331 24109 23756 20030 22210 18212 17052 19525 18409 21258 25294
6117 25294 21835 16434 16154 21897 25990 27168 28092 26854 26509 25569 20834 17885 17574 14338 15299 13272
6101 13272 14987 16209 14510 14324 18266 14796 8178 3878 7851 9392 7257 6659 5698 6689 9872 13495
6085 13495 18118 15613 15099 11607 8372 7918 8113 8138 12616 17159 17369 18566 18920 17830 17976 19104 18778
6068 18778 14123 10456 11294 12246 11534 13631 17310 16388 14686 17619 21183 18641 18787 23780 24694 23736
6052 23736 22915 21778 24976 29713 27975 25437 24838 24273 21892 17611 14180 13322 17362 19124 14661 13207
6036A3207O074O48j47n059q37l221Q64J084l706l53J922j738L547J647K183M744
6020B0859k323n815J157l33L512j359k539L147J277K239O99k222k620J823O76
6005A8178J141k291Q71N350K163j276K550l339n144K569K708k166k273n579m891
5990H571J418M769r43m593k7P28k036K926N665o88j79N022J017j891m252k129
5974A3378j719M137M714Q110K96n215l773l311L183M263j37k780j204j424J589
5959B0107l989J261M483K891J26l283L082j22m914l149R2J0319L398l091k807
5944B4404l460j569k510m421O74M389j231m384k816M293L743K164k137J409j585
5929A6963l771k133o78J645K155k760m578l627M277L089k270J09K818k608j616
$$ plain form
6036 13207 19281 19929 19782 14723 13886 10665 11529 12613 8907 8554 10476 8738 12285 13932 16115 20859
6020 20859 18536 12721 13878 13545 17057 15698 13159 16306 17583 19822 20521 18299 15679 17502 18178
6005 18178 19319 17028 17899 23249 25412 24136 26686 23347 18203 20772 23480 21314 19041 13462 8571
5990 8571 9989 14758 13815 9222 9195 9923 7887 10813 16478 15790 15611 20633 21650 19759 15507 13378
5974 13378 11659 15796 20510 28620 28916 23701 19928 16617 19800 24063 23926 21146 19942 18518 20107
5959 20107 16118 17379 21862 24753 24879 21596 24678 24556 19642 16493 16585 26904 30302 27211 24404
5944 24404 20944 19375 16865 12444 13118 17507 16276 11892 9076 13369 17112 19276 17139 18548 16963
5929 16963 13192 11059 10381 12026 14181 11421 6843 3216 7493 10582 8312 8421 11239 8631 7015
5914G015K404M650J147k255k889K591J071J847p272j384K605J860L679J276J927
5899A8272j718n330R94N017j121K264K517m98Q02l449o80J001m14m54K932J406
5883B1541l261m063M076K03N54J62k130J674L825j262q373k153n66m44k548O522
5867A3757N603J532J62K361O44j147n60L508J593L99p99l51J561n485M26K779
5851B5983J3j513m470R35k299L25J255n22p073k545M450j946k377N2K728L016
5835A6012k229j902j886l616J695j327K85N176L985m321L822K696m888l823J116
5820A0795J009K989P542K286m555l398l049o40k390M06l782l271J71M523J740
5805A0376L056K087l427k970N268K347L78J344J457k146J652J426o932J694K438
$$ plain form
5914 7015 9419 14069 15216 12961 10072 12663 13734 15581 8309 6925 9530 11390 15069 16345 18272
5899 18272 16554 11224 12218 17235 16114 18378 20895 20397 21199 17750 17070 18071 17657 17203 20135 21541
5883 21541 18280 14217 18293 18496 19050 19212 17082 18756 22581 21319 12946 10793 10227 9783 7235 13757
5867 13757 19360 20892 21054 23415 24059 22912 22352 25860 27453 27852 27053 26702 28263 22778 23204 25983
5851 25983 25996 24483 20013 20948 18649 18974 20229 19707 12634 10089 14539 12593 10216 10268 12996 16012
5835 16012 13783 11881 9995 6379 8074 6747 7032 12208 16193 11872 15694 18390 13502 9679 10795
5820 10795 11804 14793 22335 24621 20066 16668 13619 12979 10589 10995 7213 3942 4113 8636 10376
5805 10376 13432 15519 12092 9122 14390 16737 17115 18459 19916 17770 19422 20848 13916 15610 18048
5790A8048J043k694j750j781P41P27K496L422j213%k340k023n493j477M358L867
5774A5931N902J910l276j447q75M27k246k0l925J29m55k914R34j649J72M137N930
5757A8665M49J778l321m153r05L332n890j417K510r70l004J035L171m528K35P17
5741G704j41N12L055r03m473L132J260O028M823l752l903K57q493J732N210Q81
5725A2929K599j480J099j34M55j194n62j920j102j309K207M151L327j214m451
5710A3401J203j965m557j671N581L782n018l224L2L765M465j126J796J971n582
5695A2853m845j877L764m443M860L537p86m45k337K488L667L234J641N32k176
5680A9667l18J4j272P53J577J631l100l393m901j268J137q93k86j13J969L545
$$ plain form
5790 18048 19091 16397 14647 12866 13607 14334 16830 20252 19039 19039 16699 14676 9183 7706 12064 15931
5774 15931 21833 23743 20467 19020 18145 18572 16326 16306 12381 12510 12055 9141 10075 8426 8598 12735 18665
5757 18665 19114 20892 17571 13418 12513 15845 9955 8538 11048 10078 7074 8109 11280 6752 6987 7704
5741 7704 7563 8075 11130 10227 5754 8886 10146 16174 20997 17245 13342 13599 5106 6838 12048 12929
5725 12929 15528 14048 15147 15013 15468 14274 13712 11792 10690 9381 11588 15739 19066 17852 13401
5710 13401 14604 12639 8082 6411 11992 15774 10756 7532 7564 11329 15794 14668 16464 18435 12853
5695 12853 8008 6131 9895 5452 10312 13849 13063 12618 10281 12769 16436 19670 21311 21843 19667
5680 19667 19349 19363 18091 18844 20421 22052 18952 15559 10658 9390 10527 9634 9348 9235 11204 14749
5664A4749J302j370l361l497m06L480R12q10K233K961r96k984m080l969q99J380
5648D645N240L971r89L83J901R2l540M19L389k851q426P132J1067P87k751n38
5632A9931j167j030l656m938j055j970J833O29N74k403J16O91k378Q92K265j493
5616F841K801N298K072k510L759J882J346m477j200m401m805n12K831l536j923
5601C466O927N788K467L671n322l965k55K29j141K375K760N77k033R47r1k321
5585A4079P78j468j319k767K710L906M957l081j0384J283Q020K379l63k973M96
5570A6253K145J791k58o222m071L99M047L462l77k376k169O29R50j143P293J943
5554B2296o710n68J8m280l87K714l10j937K112J023j099k752j202k520k911o68
$$ plain form
5664 14749 16051 14681 11320 7823 7417 10897 11809 10999 13232 16193 15197 12213 8133 4164 3265 4645
5648 4645 9885 13856 12867 13250 15151 15243 11703 12122 15511 12660 4234 11366 22433 23220 20469 19931
5632 19931 18764 17734 14078 9140 8085 6115 7948 8577 9151 6748 6864 7555 5177 6069 8334 6841
5616 6841 9642 14940 17012 14502 18261 20143 21489 17012 15812 11411 6606 6094 8925 5389 3466
5601 3466 10393 16181 18648 22319 16997 13032 12777 13006 11865 14240 17000 17577 15544 16491 16400 14079
5585 14079 14857 13389 12070 9303 12013 15919 20876 17795 7411 8694 16714 19093 18730 15757 16253
5570 16253 18398 20189 19931 13709 9638 10037 14084 17546 17169 14793 12624 13253 14203 13060 20353 22296
5554 22296 15586 15018 15036 10756 10369 13083 12773 10836 12948 13971 12872 10120 8918 6398 3487 2819
5538B819J706N214O159J881m58L59m79n299k546K968j473p35j971J625l565J812
5522H017L090k196j018o28m12K470M832K985q92n894l456L65j210R9l30M609K371
5505A2802O80P27R70J273l686m441R2J162M77k386J669j99L401J06o099j079L668
5488I137N32k47L59K943j799j313l708k723L804O298J624M08j503m638n717M92
5472C949K304N86Q39J10P4P49O92m476j490L526k640j87Q347L126m142j789L46
5455I924L74J223J419J419k974n855o50j201K275K255O92O13K335L098j510j359
5439A2078k173J241k292o49K396N56j791J147r06J950N579k429m556o935K960
5424F176Jk813j354N793R56j500J221J233o29m473k32O02m746l451J082N742M09
$$ plain form
5538 2819 4525 9739 15898 17779 17321 17680 17201 11902 9356 12324 10851 10116 8145 9770 6205 8017
5522 8017 11107 8911 7893 7265 6853 9323 14155 17140 16248 10354 6898 7263 6053 6152 5822 10431 12802
5505 12802 13482 14209 15179 16452 12766 8325 8417 9579 10056 7670 9339 9140 12541 12647 6548 5469 9137
5488 9137 9669 9422 9781 12724 10925 9612 5904 3181 6985 13283 14907 15315 13812 9174 3457 3949
5472 3949 6253 6839 7678 7788 7862 8611 9303 4827 3337 6863 4223 4036 12383 15509 11367 9578 9924
5455 9924 10298 11521 12940 14359 11385 5530 4880 3679 5954 8209 8901 9514 11849 14947 13437 12078
5439 12078 9905 11146 8854 8205 10601 11157 9366 10513 9607 11557 17136 14707 10151 3216 6176
5424 6176 6177 3364 2010 7803 8759 7259 8480 9713 9084 4611 4379 4981 235 -3216 -2134 3608 4017
5407D017K008k435l349o32Q997l451l043J578L463k365k303j571K461N567L536
5392A2478j695m848j757M275J217J425J141k121j189j172m425n631Q901K532l032
5377F099K581L854j353k012k979J00L964j151o98r74q07M625J893J475Q96n239
5361A0274n506M256m57J68L013N65K808Q99j312o385r358L605K487L415J575K446
5345A2493m091k791M214L183m082J001O410l174o434m825j352K837K775j815j208
5330C141K44L282n05M282M644M828j306n129J78o210k853j386r35m737N106O332
5314H976R79l499j507l889J222M251m15m580K392Q73J670M983K41l927j552N504
5298A1722J497n73k903Q82j45k158J589lJ339K332j248k976l836J605N680K761
$$ plain form
5407 4017 6025 3590 241 -391 8606 5155 2112 3690 7153 4788 2485 914 3375 8942 12478
5392 12478 10783 5935 4178 8453 9670 11095 12236 10115 8926 7754 3329 -2302 6599 9131 6099
5377 6099 8680 12534 11181 9169 6190 6290 10254 9103 8405 7431 6624 11249 13142 14617 15513 10274
5361 10274 4768 9024 8567 8735 11748 12313 15121 16020 14708 8323 -1035 2570 5057 8472 10047 12493
5345 12493 8402 5611 9825 13008 8926 9927 16337 13163 6729 1904 552 3389 6164 4349 3141
5330 3141 3385 6667 6162 10444 15088 19916 18610 13481 13659 7449 4596 3210 2275 -2462 2644 8976
5314 8976 9955 6456 4949 1060 2282 6533 6118 1538 3930 4803 6473 11456 11697 7770 6218 11722
5298 11722 13219 12646 9743 10625 10480 8322 9911 9908 11247 13579 12331 9355 5519 7124 12804 15565
5282A5565l037o75Q31j153p3o645p046o49k94M075R58J864K346K425K292L20l430
5265G674L34K297L134M90n602j549l56p87m02K770M593k295o479J737J322k613
5249D268l574O057K153m719n877L978N370k640J227K818r02j38J129M424k060
5234A1514m407n494L343N741J057n764k614o52J296L440j805M05l02j735j50n95
5218C278L444r56K226K642M005O85p938r852m76N258K270J756n646m900O165K125
5202D086K253n27K93j295j918l52M547O50o8j642j840j064K466j67j17k562j079
5185A664J507K52K665r24O629M09l881m152r95K160N463k99j030k338K843L298
5169A3271m762l915m00J02L783j453M376M266l56k468l405p16P20K322K437j37
$$ plain form
5282 15565 12528 11853 12684 11531 11458 4813 -2233 -2882 -3176 899 1857 3721 6067 8492 10784 11104 7674
5265 7674 8008 10305 13439 13929 8327 6778 6422 5635 5233 8003 12596 10301 3822 5559 6881 4268
5249 4268 694 6751 8904 4185 -1692 2286 7656 5016 6243 9061 8159 8021 9150 13574 11514
5234 11514 7107 1613 4956 10697 11754 5990 3376 2724 4020 7460 5655 6060 5758 4023 3873 3278
5218 3278 6722 5766 7992 10634 14639 15324 7386 -2466 -2942 2316 4586 6342 696 -4204 1961 4086
5202 4086 6339 5812 6105 4810 2892 2540 7087 7737 7669 6027 4187 3123 5589 5422 5305 2743 1664
5185 1664 3171 3423 6088 5164 11793 12202 8321 4169 3174 5334 10797 10498 9468 7130 9973 13271
5169 13271 8509 4594 4194 4296 8079 6626 11002 15268 14912 12444 9039 8323 9043 11365 13802 13665
5153A3665l923o047q35J320k080J420L195j393n087K665k322k752M593o0p33p25
5137I01M236L89l337K291J644J733n517n697L985M738M836n476l788K645L678
5122G261j777J51o87l009l714J935L636K921k306J365J134m67O6j204l785M834
5106F354k061m303j742k423j671M460K89p29M941J728R9M55p4r21K751M030M215
5089A5398k225k32k639k62k725k072m455R98k486m275M873M418J163K306J008
5074H793j549j869j708j731L222M513j239L289k545n740J243J127N47j556L534
5059H331k743n40J353N31J889k621m75k129k024M26J429M73J811J883L712l597
5043G709j207j436l660l00K299J595l50k24L040l060k146o29m69n691m52N342
$$ plain form
5153 13665 9742 3695 2860 4180 2100 3520 6715 5322 235 2900 578 -2174 2419 2359 1626 901
5137 901 5137 5526 2189 4480 6124 7857 2340 -3357 628 5366 10202 4726 938 3583 7261
5122 7261 5484 5635 4948 1939 -1775 160 3796 6717 4411 5776 6910 6443 6509 5305 1520 6354
5106 6354 4293 -10 -1752 -4175 -5846 -1386 -1097 -1826 3115 4843 4942 5397 5323 4402 7153 11183 15398
5089 15398 13173 12941 10302 10040 7315 5243 788 1786 -700 -4975 -102 4316 5479 7785 8793
5074 8793 7244 5375 3667 1936 5158 9671 8432 11721 9176 3436 4679 5806 6353 4797 8331
5059 8331 5588 5048 6401 6932 8821 6200 5725 3596 1572 1998 3427 3900 5711 7594 11306 7709
5043 7709 6502 5066 1406 1106 3405 5000 4650 4426 7466 4406 2260 1631 1162 -4529 -4981 361
5027C61N152J927m191j268l331M566L20l110J582N16K719M72J410l091m915k689
5011c570N61L885K526K638j716J827M71j947L126j827k906M9L047K060j672l031
4995C521l287j416R57M310K174J761j592l268L78J420p92m186l038j686j32K840
4979b036l74k234J322k366K346L431K853q5L79n850j573K783P465L525j817J227
4963H996q088J96k94J936J075k749r57L805J255l139j139j878K561L126m690p793
4947g777J224P723N169l567P59K255J485k627R67J763j501p271o53M18l04J635
4931c02L755o34K041M719N1J840M51k103j584o180k852L515L604M461k382q626
4915b26M23L928J456r06j767M207p73n693m959O164P506l174j409j778r95J39
$$ plain form
5027 361 5513 7440 3249 1981 -1350 3216 3536 426 2008 2524 5243 5715 7125 4034 -881 -3570
5011 -3570 -3009 876 3402 6040 4324 6151 6622 4675 7801 5974 3068 3117 6164 8224 6552 3521
4995 3521 234 -1182 -225 4085 6259 8020 6428 3160 3538 4958 4166 -20 -3058 -4744 -4876 -2036
4979 -2036 -2410 -4644 -3322 -5688 -3342 89 2942 2857 3236 -2614 -4187 -1404 6061 9586 7769 8996
4963 8996 908 1104 810 2746 3821 1072 115 3920 5175 2036 897 -981 1580 4706 16 -7777
4947 -7777 -6553 1170 6339 2772 3531 5786 7271 4644 5611 7374 5873 -1398 -2051 -1633 -1937 -302
4931 -302 3453 2819 4860 9579 9630 11470 11921 9818 8234 2054 -798 2717 6321 10782 8400 -226
4915 -226 197 4125 5581 4675 2908 7115 6342 649 -4310 1854 9360 6186 4777 2999 2004 2143
4899B143k228O75K91O534n54k458L156j718k931p86k470k399K065O28L691k003
4883A636L806L317K67o86j311l442J871N878J46q659l18L816L201J403k360M96
4867I061m54l965J159K560R85Q29p01j806j578p53J367m76k970k26m56N22L511
4850F609M420J037k669p54o5J274R45j442m404m503k455L87K721k565l076P14
4834c826j361k776L520M646l37k662K704M289K063L929J92j182m206j994r82n32
4818A485M40q37J004j474Q89L39L342P90K19l452m435j083J632R61m27k788n92
4801c987M055k131K468J996K357J168J001l933l260k346k678l218K240K013m39
4786d694k36K75K042M739j722k757j903m024L639O544K109j510m385K886J792
$$ plain form
4899 2143 -85 590 881 7415 6861 4403 7559 5841 2910 2124 -346 -2745 -680 -52 3639 1636
4883 1636 5442 8759 9026 8340 7029 3587 5458 11336 11482 2823 2505 6321 9522 10925 8565 9061
4867 9061 8607 4642 5801 8361 9346 10175 9474 7668 6090 5337 6704 6228 3258 3032 2576 3098 6609
4850 6609 11029 12066 9397 8643 8578 9852 10797 9355 4951 448 -2007 -1620 1101 -1464 -4540 -3826
4834 -3826 -5187 -7963 -4443 203 -134 -2796 -92 4197 6260 10189 10381 9199 4993 2999 2017 1485
4818 1485 1925 1088 2092 618 1507 1846 5188 5978 6197 2745 -1690 -2773 -1141 -180 -607 -3395 -3987
4801 -3987 68 -2063 405 2401 4758 5926 6927 2994 -266 -2612 -5290 -8508 -6268 -4255 -4694
4786 -4694 -4930 -4655 -2613 2126 404 -2353 -4256 -8280 -4641 1903 4012 2502 -1883 1003 2795
4771B795r26k723L17J001J4L994K118L664j867J910j682k034k279P44M212m269
4755D989O78l202N1J081n745j572M378K695m296j708K355l378K272J908m808J282
4739c020K146O784M702j725k600P86N60l10n527k206K089M70N123j750r37M468
4723I053J008j586o172m304k696J758q39K605J001J048J39N164Jo634j607L262
4707A201L474k534n272l942J786L416j65j780J72o82N075J961m257J069O59J249
4691A430N153k45M742Q79m816p538K108J620n036k824R83K731K662K272k907n364
4675d150j249q33N239J533L013J785k139k132J346O15J738k784m22l898l013J378
4659c973o9L407P608L918j938p436n828K05j383r27J456P326m300m198k136Q657
$$ plain form
4771 2795 1869 -854 -537 464 478 4472 6590 10254 8387 10297 8615 6581 4302 5046 9258 4989
4755 4989 5667 2465 2516 3597 -2148 -3720 658 3353 -943 -2651 -296 -3674 -1402 506 -4302 -3020
4739 -3020 -874 5910 10612 8887 6287 7073 7633 7323 1796 -410 1679 2149 7272 5522 4585 9053
4723 9053 10061 8475 2303 -2001 -4697 -2939 -3778 -1173 -172 876 1015 6179 6180 -454 -2061 1201
4707 1201 4675 2141 -3131 -7073 -5287 -1871 -2036 -3816 -3644 -4326 749 2710 -1547 -478 181 1430
4691 1430 6583 6338 11080 11959 7143 -395 1713 3333 -1703 -4527 -3544 -813 1849 4121 1214 -4150
4675 -4150 -5399 -6232 -993 540 3553 5338 3199 1067 2413 3028 4766 1982 1560 -2338 -5351 -3973
4659 -3973 -4042 -635 6973 10891 8953 1517 -4311 -4106 -5489 -6416 -4960 2366 -1934 -6132 -8268 389
4643C89N126k70k020K895j887L40j112k432m928L279O625N076n939l355q31k509
4627a553R12K769N156l363K41J631P01j824m268j464l63J873R57l685j260J918
4611a622M803J00J658j441n950P96M526J953m270n644K246q13L30J296K853j89
4595F32l705j596J735M472K336j942j641J543K457m14m719j449L616K785J832
4580E942p82J295q88o44N45j545l130m826J163M664r2q93l57J89L471J399j839
4563C672l521J669O472j574k763J16j442j372j899J006p85k66j53J488k655o221
4547h228k278M102L411k238p69L400L866m417k938j252l865j570j663M329Q441
4532a669J572L955j907k236Q93j75l070r28O973l151m243k728M606j679n81L642
$$ plain form
4643 389 5515 5245 3225 6120 4233 4573 3461 1029 -3899 -620 6005 11081 5142 1787 956 -1553
4627 -1553 -641 2128 7284 3921 4162 5793 6494 4670 402 -1062 -1425 448 1405 -2280 -3540 -1622
4611 -1622 3181 3281 4939 3498 -2452 -1656 2870 4823 553 -5091 -2845 -3658 -3328 -2032 821 632
4595 632 -3073 -4669 -2934 1538 3874 1932 291 1834 4291 3877 -842 -2291 1325 4110 5942
4580 5942 5160 6455 5567 4923 5468 3923 793 -4033 -2870 1794 1702 809 452 641 4112 5511 3672
4563 3672 151 1820 8292 6718 3955 4071 2629 1257 -642 364 -421 -687 -840 648 -2007 -8228
4547 -8228 -10506 -6404 -2993 -5231 -6000 -2600 1266 -3151 -6089 -7341 -11206 -12776 -14439 -10110 -1669
4532 -1669 -97 3858 1951 -285 608 433 -2637 -3565 3408 257 -3986 -6714 -2108 -3787 -4368 -726
4516g26J451l225j534j148l25M527L360l119J025R63J099J072J709K21J854k696
4500D508j572q3L801M014k317r194l801m83k42J329K364M856K727J776l039n954
4484a310p555R19Q396L789L193k427P57k836m037k506l344L274k187lP5L790O002
4467C990K444k577l103j357J978J497n040k151M32J663L129o258o95N937L994
4452C883m520p724J792N828l058k412J598J373o02k900p75N060K656l899m692
4437h392K62K344J3J082L286J468m003j858N263N202k113J148N158j799M84l850
4421C695n649k048j078k201K763l239L396M487l4n928J300J947r7l433L89N251
4405d79M784j333j131k385O47J509N28k549j44m569P29N98O37r5p11O78J073k184
$$ plain form
4516 -726 725 -2500 -4034 -5182 -5507 -980 2380 -739 286 1249 2348 3420 5129 5350 7204 4508
4500 4508 2936 2853 6654 10668 8351 -843 -4644 -5127 -5369 -4040 -1676 3180 5907 7683 4644 -1310
4484 -1310 -8865 -7946 450 4239 7432 5005 5762 2926 -1111 -3617 -6961 -3687 -5874 -5877 -5802 -2012 3990
4467 3990 6434 3857 754 -603 1375 2872 -2168 -4319 -3887 -2224 905 -5353 -6048 -111 3883
4452 3883 -637 -8361 -6569 -741 -3799 -6211 -4613 -3240 -3842 -6742 -7517 -2457 199 -3700 -8392
4437 -8392 -8130 -5786 -5773 -4691 -1405 63 -3940 -5798 -535 4667 2554 3702 8860 7061 7545 3695
4421 3695 -1954 -4002 -5080 -7281 -4518 -7757 -4361 126 92 -5836 -4536 -2589 -2686 -6119 -5730 -479
4405 -479 4305 2972 1841 -544 103 1612 2140 -409 -553 -5122 -4393 -3795 -3158 -3253 -3964 -3286 -2213 -4397
4387d397j195K379Q32N693j199m985J309J50m193l64N368j044N26r47j178L15
4371b930J98p696k654O690L498N671j106L73j076l137k867q52K09J006m44J064
4355d053k109p8J115K027J145l63R56J039L719N744J06L31l893N77m271m649j413
4338d070j970K173o598m476J037K304K325J670l386L416N266O064j18K10j202
4323B645k415l192K2j936j523K178l80M239K881K699k314l762N244L967n345k220
4307G88k476l894j670P29N01K803P407J20l326l991l399j446M816J823j346K599
4291C8p53r76j285m367o73M425L405l346J615M247k683k077K78j265J845K440
4275H68m824n833L60j548k807N181J675M128K34j008o07k514M731j710L764N17
$$ plain form
4387 -4397 -5592 -3213 -2381 3312 2113 -2872 -1563 -1413 -5606 -5970 -602 -1646 -1120 -2067 -3245 -2930
4371 -2930 -2732 -10428 -13082 -6392 -2894 2777 1671 2044 968 -2169 -5036 -5888 -5679 -4673 -5117 -4053
4355 -4053 -6162 -6240 -5125 -3098 -1953 -2316 -1360 -321 3398 9142 9248 9579 5686 6263 1992 -2657 -4070
4338 -4070 -6040 -3867 -10465 -14941 -13904 -11600 -9275 -7605 -10991 -7575 -2309 3755 3637 3847 2645
4323 2645 230 -2962 -2940 -4876 -6399 -4221 -4601 -362 2519 5218 2904 -858 4386 8353 3008 788
4307 788 -1688 -5582 -7252 -6523 -6022 -3219 4188 4308 982 -3009 -6408 -7854 -3038 -1215 -2561 38
4291 38 -715 -1691 -2976 -7343 -8016 -3591 -186 -3532 -1917 2330 -353 -2430 -2152 -3417 -1572 868
4275 868 -3956 -9789 -9429 -10977 -13784 -8603 -6928 -2800 -2566 -3574 -4181 -6695 -1964 -3674 90 607
4259F07n532J540j222l982M843P100J771m575q101L764P481n06m587K379K624
4244C604k615k005M399K966m411n542j653K67K901k025m136K221q54K587Q18k587
4228f065J691K063M075j71P2j947M198K791m585j840j344L942Q2l733o10q69P69
4211a481k069K564K574L969m771m242P057k075q34L044j758k128j067J335j545
4196a427p63J118j326j519J30k956j187K526J338k57M210J186j130l18J743n128
4180c760m700J519J996L139k289L315L242K330j860o069l954j786K864J782P77
4165c454O351K877k93m10j628o62O36p274j504j886J302J551Q30k80K989N331
4149D476J480k355k020j682q67K28J695k911k634J963L914m408k224j576J631
$$ plain form
4259 607 -4925 -3385 -4607 -8589 -3746 3354 5125 550 -7551 -3787 3694 3188 -1399 980 3604
4244 3604 989 -1016 3383 6349 1938 -3604 -5257 -4990 -2089 -4114 -8250 -6029 -6883 -4296 -3478 -6065
4228 -6065 -4374 -2311 1764 1593 1665 -282 3916 6707 2122 282 -1062 2880 2962 -771 -1381 -2250 -1481
4211 -1481 -3550 -986 1588 5557 786 -3456 3601 1526 692 3736 1978 -150 -1217 118 -1427
4196 -1427 -2190 -1072 -2398 -3917 -3787 -6743 -7930 -5404 -4066 -4323 -113 1073 -57 -375 1368 -3760
4180 -3760 -8460 -6941 -4945 -1806 -4095 -780 2462 4792 2932 -3137 -7091 -8877 -6013 -4231 -3454
4165 -3454 2897 5774 5481 5071 3443 2781 3417 -3857 -5361 -7247 -5945 -4394 -3564 -3844 -855 4476
4149 4476 5956 3601 1581 -101 -968 -740 955 -1956 -4590 -2627 1287 -3121 -5345 -6921 -5290
4134e290N60J35k716k253J508L834J779k457m298J965M652n10J96K1j392n823
4118a0089K683M333L838k868k317k731L038K181J185j796n65L300k369p295J732
4103g740O049J698J324Q24j373l583j0j0O56Q23l5k100J391N060L066M42p056
4086e74j549j850K450k55R28K030J621O41M14o13J817j036l663n298l074L084
4070d927O67l407N50M419M161L374k937l627K619N38Q30L32K219k61l42j893j891
4053D24n337Q35O305l45l304o414j452J848J718l665J458R567R902k735m760j686
4037B359L110L61j651M124p46l557J144J096Q03q51l851k580j930k06J829O81
4021A35m86J374K262Q1J760j343l482J843O213j442m229l001J358p9l26K879M84
$$ plain form
4134 -5290 -4730 -4595 -7311 -9564 -8056 -4222 -2443 -4900 -9198 -7233 -2581 -3091 -2895 -2874 -4266 -10089
4118 -10089 -7406 -3073 765 -2103 -4420 -7151 -4113 -1932 -747 -2543 -3108 192 -2177 -9472 -7740
4103 -7740 -1691 7 1331 2155 782 -2801 -2811 -2821 -2165 -1342 -1377 -3477 -2086 2974 6040 6482 -574
4086 -574 -2123 -3973 -1523 -1778 -850 1180 2801 3442 3856 3243 5060 4024 361 -4937 -8011 -4927
4070 -4927 -4260 -7667 -7117 -2698 1463 4837 1900 -1727 892 1430 2260 2592 4811 4550 4208 2315 424
4053 424 -4913 -4078 2227 1882 -1422 -7836 -9288 -7440 -5722 -9387 -7929 1638 11540 8805 4045 2359
4037 2359 5469 5830 4179 8303 7557 4000 5144 6240 7043 6192 2341 -239 -2169 -2375 -546 135
4021 135 -351 1023 3285 3366 5126 3783 301 2144 8357 6915 2686 -315 1043 964 638 3517 4001
4004D001J800k954J716k032m170J128k844k263j866L724P985p556J016R20M308
3989B913q36J303l77k093M7m236j247J839L69k04J29k260N040K29m376P13M08
3972b639o00j465m874l73m116P25N581J825N187l07J210J890q92o838j897K496
3956e087n142o552k05R372L546O20kL465n03K724L433j366O68R42Q08n221r93
3939E07m17j921l303l673J294K347P40n45L996K418J78j780l144L702N533J290
3923G222n567l108j974O05N857l20J72j863n998l272J21K950L323K692l956J812
3907a304m312j295J469J537j52J168J005M548j511l06m459j130o66k31K979K972
3891C12k878m441J609K709J82m714J533m72k410l6q74L110l484r70N114K871k799
$$ plain form
4004 4001 5801 2847 4563 2531 -1639 -511 -3355 -5618 -7484 -3760 4225 -3331 -2315 -1395 2913
3989 2913 2077 3380 3003 910 957 -3279 -4526 -2687 -2318 -2522 -2393 -4653 387 616 -3760 -3047 -2639
3972 -2639 -3239 -4704 -9578 -9951 -14067 -13342 -7761 -5936 -749 -1056 154 2044 1152 -5686 -7583 -5087
3956 -5087 -10229 -16781 -16986 -7614 -4068 -3448 -3450 15 -488 2236 5669 4303 4971 5913 6721 1500 507
3939 507 90 -1831 -5134 -8807 -7513 -5166 -4426 -4971 -975 1443 1621 -159 -3303 399 5932 7222
3923 7222 1655 -1453 -3427 -2822 3035 2715 2887 1024 -4974 -8246 -8125 -5175 -1852 840 -3116 -1304
3907 -1304 -5616 -6911 -5442 -3905 -4057 -2889 -1884 2664 1153 847 -3612 -4742 -5408 -5639 -2660 312
3891 312 -2566 -7007 -5398 -2689 -2507 -7221 -5688 -6160 -8570 -8606 -9480 -6370 -9854 -10824 -5710 -2839 -5638
3874e638k64J812k979N13O700Q982l438n254J878Q86K131j858j143k640k920k933
3858f165L305k01k488N171n11k188R15J435K541k083K496j061k17o252k88j154
3842f745L003N791J949j368n094J800J105j384q2M166n674k820j793l180L006
3827g320L51k452N2L046J09R33l417j812M059P712l14p024p32M666J731p0j657
3810b139o191R51K754K121j364o894j845J038k23P565M406l606j207j651N298
3795i87J366l667L443K822l297o683L016L797J104o771j827O227K552k789j856
3780c550M480J668M65k518m545j50k721j756M396J512k097k770k470m76N008K309
3764c215N10M58K373l992L88l13m88o08k197j05p96K06M112K311N45L270K62j758
$$ plain form
3874 -5638 -5902 -4090 -7069 -6556 144 9126 5688 434 2312 3198 5329 3471 2328 -312 -3232 -6165
3858 -6165 -2860 -3061 -5549 -378 -889 -3077 -2162 -727 1814 -269 2227 1166 949 -5303 -5591 -6745
3842 -6745 -3742 2049 3998 2630 -2464 -664 441 -943 -1025 3141 -2533 -5353 -7146 -10326 -7320
3827 -7320 -6969 -9421 -9369 -6323 -6214 -5281 -8698 -10510 -6451 1261 947 -6077 -6809 -2143 -412 -482 -2139
3810 -2139 -8330 -7379 -4625 -2504 -3868 -10762 -12607 -11569 -11792 -4227 179 -3427 -4634 -6285 -987
3795 -987 379 -3288 155 2977 -320 -7003 -3987 -190 914 -5857 -7684 -1457 1095 -1694 -3550
3780 -3550 930 2598 3063 545 -4000 -4150 -6871 -8627 -4231 -2719 -4816 -7586 -10056 -10532 -5524 -3215
3764 -3215 -2705 -2247 126 -3866 -3478 -3791 -4279 -4887 -7084 -7189 -7985 -7779 -3667 -1356 -811 2459 2721 963
3746I63m594k15L66k976K375q31l910M057q14j050N311N016J492k093n590k321
3730d814R47j084j409m595j659L066L993m192n126J915L245M363M459N34k56l103
3714c716n764K86M084r94n965o17P38l93M271L429M644M966j582o062q59L085
3698d49l38l799J070K870l23m841k549L106M85l766k619K497L27p19K472k116
3682h692J071P11K195Q84j700j749O220l837j590N413o4k865J265M253j373l839
3666c697k425L868Q161j391m930M05r40m29K308L620R21m765k717L283M87l233
3650a474J757k62J295jj054o486k185j095l29J701N46l86m514j005K578J592k780
3633a2102k32l13K609m14J846L786j733j712k093m76M332N578k973j740L360j762
$$ plain form
3746 963 -3631 -3846 -3480 -6456 -4081 -4912 -8822 -4765 -5579 -6629 -1318 3698 5190 3097 -2493 -4814
3730 -4814 -3867 -4951 -6360 -10955 -12614 -9548 -5555 -9747 -14873 -12958 -9713 -5350 -891 -357 -613 -3716
3714 -3716 -9480 -9194 -5110 -6104 -12069 -12686 -11948 -12341 -8070 -4641 3 4969 3387 -2675 -3534 -449
3698 -449 -787 -4586 -3516 -646 -969 -5810 -8359 -5253 -4768 -8534 -11153 -8656 -8329 -9048 -6576 -8692
3682 -8692 -7621 -6910 -4715 -3831 -5531 -7280 -1060 -4897 -6487 -1074 -1138 -4003 -2738 1515 142 -3697
3666 -3697 -6122 -2254 5907 4516 -414 -9 -949 -1378 930 4550 5471 706 -2011 1272 1759 -1474
3650 -1474 283 21 1316 1315 261 -6225 -8410 -9505 -9834 -8133 -7587 -7973 -12487 -13492 -10914 -9322 -12102
3633 -12102 -12334 -12647 -10038 -10452 -8606 -4820 -6553 -8265 -10358 -10834 -6502 -924 -3897 -5637 -2277 -4039
3617d039o85M233j047n294k035j153J64N757J960m32k205J881l26m895J081J346
3601e689j365k127L64k144J864M013N40k031l003K281m57q80P570K188k635n090
3585f601J306K526j063r60j118J578J610n3j697Nl680k936K978J22J346q04J018
3568f423N352J915K086k914l621P02K584J69o465n211m256L546O768o45K262K488
3552a663R88k661k958J601L696k87J937m53o61j037J387j736j263j123j986j311
3536g530J41m653M022M735M101K749o69l078m662r97M725Q45n235k629L142K050
3520b943j353J494o69R44m606l141L769O367K833k929p60j766K21O15K220l527
3504c231l081j171k503L883q58l361k761J099J387L799M455K094L594l094k802
$$ plain form
3617 -4039 -4724 -491 -1538 -6832 -8867 -10020 -9856 -4099 -2139 -2571 -4776 -2895 -3221 -8116 -7035 -5689
3601 -5689 -7054 -9181 -8817 -10961 -9097 -5084 -4544 -6575 -9578 -7297 -7754 -8634 -1064 1124 -1511 -6601
3585 -6601 -5295 -2769 -3832 -4792 -5910 -4332 -2722 -2775 -4472 -4467 -8147 -11083 -8105 -7983 -6637 -7441 -6423
3568 -6423 -1071 844 2930 16 -3605 -2903 -319 -150 -6615 -11826 -16082 -12536 -5768 -6413 -4151 -1663
3552 -1663 -675 -3336 -6294 -4693 -997 -1284 653 200 -461 -1498 -111 -1847 -3110 -4233 -6219 -7530
3536 -7530 -7389 -12042 -8020 -3285 816 3565 2896 -182 -4844 -5841 -1116 -271 -5506 -8135 -4993 -2943
3520 -2943 -4296 -2802 -3471 -2527 -7133 -10274 -6505 -138 2695 -234 -994 -2760 -2539 -1924 296 -3231
3504 -3231 -6312 -7483 -9986 -6103 -6961 -10322 -13083 -11984 -10597 -6798 -2343 -249 3345 251 -2551
3489b551j894L434k241k342M170M414j656k876p82N528K80o278K4M758r24k298
3473a234M668O460o730q098k380O34L441M81j569l943J411M029r47L057J915j366
3457a71k375n707j534J392O99K074M402R14L335l574l844K477o44O721L271k764
$$ plain form
3489 -2551 -4445 -1011 -3252 -5594 -1424 2990 1334 -1542 -2324 3204 3484 -2794 -2770 1988 1064 -1234
3473 -1234 3434 9894 3164 -4934 -7314 -6680 -3239 -2758 -4327 -8270 -6859 -2830 -3777 -720 1195 -171
3457 -171 -2546 -8253 -9787 -8395 -7696 -5622 -1220 -306 3029 -545 -4389 -1912 -2556 4165 7436 4672
$$ [...]
##END NTUPLES=NMR SPECTRUM
##END=
