##TITLE=Analysis number 329291
Compound Code cc 09102
Book Reference 546/12/5
Project Code adrs
Chemist Name craigr
##JCAMPDX= 6.0         $$ Bruker NMR JCAMP-DX V2.0
##DATA TYPE= NMR SPECTRUM
##DATA CLASS= NTUPLES
##ORIGIN= Bruker BioSpin GmbH
##OWNER= nmr
$$ XWIN-NMR		Version 3.5
$$ Fri Aug 17 08:49:54 2007 GMT Daylight Time (UT+1h)  MAYBRIDGE\nmr@NMR_250MHZ
##.OBSERVE FREQUENCY= 250.131544655141
##.OBSERVE NUCLEUS= ^1H
##.ACQUISITION MODE= SIMULTANEOUS (DQD)
##.ACQUISITION SCHEME= undefined
##.AVERAGES= 16
##.DIGITISER RES= 18
##SPECTROMETER/DATA SYSTEM= dpx250
##.PULSE SEQUENCE= zg30
##.SOLVENT NAME= CDCl3
##.SHIFT REFERENCE= (INTERNAL, CDCl3, 0, 16.4526)
##AUDIT TRAIL= $$ (NUMBER, WHEN, WHO, WHERE, WHAT)
$$ ##TITLE= Audit trail, XWIN-NMR		Version 3.5
$$ ##JCAMPDX= 5.01
$$ ##ORIGIN= Bruker BioSpin GmbH
$$ ##OWNER= nmr
$$ C:\u/data/dgb/nmr/ADRS/750/pdata/1/auditp.txt
$$ ##AUDIT TRAIL=  $$ (NUMBER, WHEN, WHO, WHERE, WHAT)
(   1,<2007-08-17 08:48:38.83 +100>,<MAYBRIDGE\nmr>,<NMR_250MHZ>,
      <created by zg, POWCHK disabled, PULCHK disabled
       configuration hash MD5:
       76 6E 9A 78 1E 09 19 81 EC 84 63 8F B0 6A 59 2D
       data hash MD5: 64K
       45 23 D2 8E 02 FF 9B D4 7C 47 79 6D A1 76 C4 73>)
(   2,<2007-08-17 08:49:09.98 +100>,<MAYBRIDGE\nmr>,<NMR_250MHZ>,
      <Start of raw data processing
       ef LB = 0.3 FT_mod = 6 PKNL = 1 SI = 32K 
       data hash MD5: 32K
       83 04 6E EB AD D7 9D C5 91 8A 65 34 B6 D7 E7 CC>)
(   3,<2007-08-17 08:49:14.95 +100>,<MAYBRIDGE\nmr>,<NMR_250MHZ>,
      <apk 
       data hash MD5: 32K
       36 C9 A2 6B 44 A0 AD 9C BD A8 C8 10 B2 A0 49 F9>)
(   4,<2007-08-17 08:49:19.47 +100>,<MAYBRIDGE\nmr>,<NMR_250MHZ>,
      <abs ABSG = 5 
       data hash MD5: 32K
       7E DF 72 76 F2 9E D4 B3 DF 89 05 6D AE 62 90 EA>)
$$ ##END=
$$ 
$$ hash MD5
$$ F8 E0 88 31 96 A8 2D C2 B7 D2 F8 87 C0 DE 0B 5C
##$RELAX= 
##$RELAX= 
##$RELAX= 
##$RELAX= 
##$RELAX= 
##$RELAX= 
##$RELAX= 
$$ Bruker specific parameters
$$ --------------------------
##$DU= <C:\u>
##$EXPNO= 750
##$NAME= <ADRS>
##$PROCNO= 1
##$TYPE= <nmr>
##$USER= <dgb>
##$AMP= (0..31)
100 100 100 100 100 100 100 100 100 100 100 100 100 100 100 100 100 100 
100 100 100 100 100 100 100 100 100 100 100 100 100 100 
##$AQSEQ= 0
##$AQ_mod= 3
##$AUNM= <au_zg>
##$AUTOPOS= <2 >
##$BF1= 250.13
##$BF2= 250.13
##$BF3= 250.13
##$BF4= 250.13
##$BF5= 500.13
##$BF6= 500.13
##$BF7= 500.13
##$BF8= 500.13
##$BYTORDA= 1
##$CFDGTYP= 0
##$CFRGTYP= 5
##$CHEMSTR= <none>
##$CNST= (0..31)
1 1 145 1 1 1 1 1 1 1 1 1 1 1 1 1 1 1 1 1 1 1 1 1 1 1 1 1 1 1 1 1 
##$CPDPRG= <>
##$CPDPRG1= <>
##$CPDPRG2= <>
##$CPDPRG3= <>
##$CPDPRG4= <mlev>
##$CPDPRG5= <mlev>
##$CPDPRG6= <mlev>
##$CPDPRG7= <mlev>
##$CPDPRG8= <mlev>
##$CPDPRGB= <>
##$CPDPRGT= <>
##$D= (0..31)
0 1 0 0 0 0 0 0 0 0.06 0 0 0 0 0 0 0.0002 0 0 0 0 0 0 0 0 0 0 0 0 0 0 
0 
##$DATE= 1187336916
##$DBL= (0..7)
120 120 120 120 120 120 120 120 
##$DBP= (0..7)
150 150 150 150 150 150 150 150 
##$DBP07= 0
##$DBPNAM0= <>
##$DBPNAM1= <>
$$ [...]
##$SUBNAM7= <"">
##$SUBNAM8= <"">
##$SUBNAM9= <"">
##$SW= 20.6930455092707
##$SWIBOX= (0..15)
0 0 3 0 0 0 0 0 0 0 0 0 0 0 0 0 
##$SW_h= 5175.983436853
##$TD= 65536
##$TD0= 1
##$TE= 296.16
##$TE2= 300
##$TE3= 300
##$TEG= 300
##$TL= (0..7)
0 120 120 120 120 120 120 120 
##$TP= (0..7)
150 150 150 150 150 150 150 150 
##$TP07= 0
##$TPNAME0= <>
##$TPNAME1= <>
##$TPNAME2= <>
##$TPNAME3= <>
##$TPNAME4= <>
##$TPNAME5= <>
##$TPNAME6= <>
##$TPNAME7= <>
##$TPOAL= (0..7)
0.5 0.5 0.5 0.5 0.5 0.5 0.5 0.5 
##$TPOFFS= (0..7)
0 0 0 0 0 0 0 0 
##$TUNHIN= 0
##$TUNHOUT= 0
##$TUNXOUT= 0
##$USERA1= <user>
##$USERA2= <user>
##$USERA3= <user>
##$USERA4= <user>
##$USERA5= <user>
##$V9= 5
##$VALIST= <valist>
##$VCLIST= <CCCCCCCCCCCCCCC>
##$VD= 0
##$VDLIST= <DDDDDDDDDDDDDDD>
##$VPLIST= <PPPPPPPPPPPPPPP>
##$VTLIST= <TTTTTTTTTTTTTTT>
##$WBST= 1024
##$WBSW= 4
##$XGAIN= (0..3)
0 0 0 0 
##$XL= 0
##$YL= 0
##$YMAX_a= 267765
##$YMIN_a= -203647
##$ZGOPTNS= <>
##$ZL1= 120
##$ZL2= 120
##$ZL3= 120
##$ZL4= 120
##$ABSF1= 16.45263
##$ABSF2= -4.240543
##$ABSG= 5
##$ABSL= 3
##$ALPHA= 0
##$AQORDER= 0
##$ASSFAC= 0
##$ASSFACI= 0
##$ASSFACX= 0
##$ASSWID= 0
##$AUNMP= <proc_1d>
##$AZFE= 0.1
##$AZFW= 0.1
##$BCFW= 0
##$BC_mod= 0
##$BYTORDP= 0
##$COROFFS= 0
##$CY= 12.5
##$DATMOD= 1
##$DC= 0
##$DFILT= <>
##$DTYPP= 0
##$F1P= 14.0000005364418
##$F2P= -0.99999901652339
##$FCOR= 0.5
##$FTSIZE= 32768
##$FT_mod= 6
##$GAMMA= 0
##$GB= 0
##$INTBC= 1
##$INTSCL= 1
##$ISEN= 128
##$LB= 0.3
##$LEV0= 0
##$LPBIN= 0
##$MAXI= 10000
##$MC2= 0
##$MEAN= 0
##$ME_mod= 0
##$MI= 0
##$NCOEF= 0
##$NC_proc= -4
##$NLEV= 6
##$NOISF1= 0
##$NOISF2= 0
##$NSP= 0
##$NTH_PI= 0
##$NZP= 0
##$OFFSET= 16.45263
##$PC= 1
##$PHC0= -39.81494
##$PHC1= 15.55388
##$PH_mod= 1
##$PKNL= yes
##$PPARMOD= 0
##$PSCAL= 4
##$PSIGN= 0
##$REVERSE= no
##$SF= 250.130017349558
##$SI= 32768
##$SIGF1= 0
##$SIGF2= 0
##$SINO= 400
##$SIOLD= 32768
##$SREGLST= <1H.CDCl3>
##$SSB= 0
##$STSI= 32768
##$STSR= 0
##$SW_p= 5175.98343685301
##$SYMM= 0
##$S_DEV= 0
##$TDeff= 65536
##$TDoff= 0
##$TI= <Analysis number 999999
Compound Code 99
Book Reference 9
Project Code 9>
##$TILT= no
##$TM1= 0
##$TM2= 0
##$TOPLEV= 0
##$USERP1= <user>
##$USERP2= <user>
##$USERP3= <user>
##$USERP4= <user>
##$USERP5= <user>
##$WDW= 1
##$XDIM= 32768
##$YMAX_p= 326174727
##$YMIN_p= -467632
$$ End of Bruker specific parameters
$$ ---------------------------------
##NTUPLES= NMR SPECTRUM
##VAR_NAME=  FREQUENCY,     SPECTRUM/REAL,   SPECTRUM/IMAG
##SYMBOL=    X,             R,               I
##VAR_TYPE=  INDEPENDENT,   DEPENDENT,       DEPENDENT
##VAR_FORM=  AFFN,          ASDF,            ASDF
##VAR_DIM=   32768,         32768,           32768
##UNITS=     HZ,            ARBITRARY UNITS, ARBITRARY UNITS
##FACTOR=    0.157963299565203, 1,           1
##FIRST=     4115.29639956633, 0,            0
##LAST=      -1060.68703728668, 0,           0
##MIN=       -1060.68703728668, -467632,     0
##MAX=       4115.29639956633, 326174727,    0
$$ Real data points
##PAGE= N=1
##DATA TABLE= (X++(R..R)), XYDATA
$$ [...]
25244d1436J44697R6585j3293k0365L879j17997J07979J06108q646j13268p9917
25233F4326l6693K9780M5278l1233K2969l8741n4534p9772o674J09484M480p6058
25221d7388m1197J7211K4817J57755L0332p1305l6816o1850m6486K4999K1998
25210b7930j38661J2347J35196r592r646l3021k7255R7739j571j40353R4526J48187
25198I9966M2747J4477k2756q8000m3071J5622J5066o4109M8152M2036j12321
25187e2191K7387P1615p6886q7614J33207Q1742m5481k019l0361n5884j02342
25176a38827N8753L0761O1621O0019K4292j59047q9970J58164Q0354j12682J9481
25165g081j1743k4210k1613j26201q7490J22335O2682m1088J08206J73500r2401
$$ y = [-41436, 103261, 199846, 186553, 166188, 170067, 52070, 160049, 266157, 257511, 144243, 64326, 27633, 57413, 102691, 71458, 94427, 55686, 1152, -78620, -85294, 24190, 28670, -47388, -88585, -71374, -46557, 111198, 141530, 70225, 33409, -28441, -74927, -49928, -27930, -166591, -154244, -19048, -28640, -38286, -71307, -98562, -823, -2394, -142747, -48221, 99966, 142713, 157190, 134434, 46434, 3363, 18985, 34051, -30058, 18094, 60130, -52191, -24804, 46811, -30075, -117689, 15518, 97260, 51779, 49760, 19399, -36485, -138827, -80074, -49313, 12308, 72327, 96619, -62428, -152398, 5766, 86120, -26562, -7081, -18824, -43034, -64647, -190848, -278338, -156003, -93321, -134409, -26203, 147297, 54896]
25154E4896q8909m7201Q0545J45189J11186N3187p7326j26196l2156j9153j8463
25143C5599R8801O4995m1169K7034N315o2848o5848K750M525o8262o5753K7777
25131c7084R5988J7596J21613o8091k1984r3761o8408K3727J71780q1179J0431
25120G0628m6928L4711J2940N656o8301o8710j28975r6879N7651J16323M6884
25109f5000J5694n8322J01479K27471l3556p2802j22176K9073P1686r3794n5987
25098e6234O79j12595O2897R5260j0970j06686m1286N9146J8173J18713R3639
25087A20736j54488q7971N1534N7964M2402O0737j1332P1120l2648O4798j3147
25076A69705j29419j00258J03499L2801p569q319l7301m2325J0552o6184l4399
$$ y = [54896, -34013, -81214, -669, 144520, 255706, 308893, 231567, 105371, 73215, 54062, 35599, 134400, 199395, 158226, 185260, 190575, 127727, 61879, 64629, 69154, 892, -64861, -37084, 58904, 76500, 198113, 130022, 108038, 14277, -54131, -30404, 141376, 60197, 70628, 23700, 58411, 71351, 77007, 8706, -60004, -188979, -285858, -228207, -111884, -65000, -49306, -107628, -6149, 221322, 187766, 114964, -7212, 21861, 93547, -247, -56234, -55555, -168150, -105253, -9993, -20963, -127649, -168935, -109789, -91616, 27097, 120736, -33752, -121723, -70189, -12225, 30177, 90914, 79582, 150702, 118054, 182852, 169705, 40286, -59972, 43527, 76328, 68759, 60440, 23139, -19186, -8634, -74818, -109217]
25065a09217o5349p9032R7994N4383J26217N9336L4990Q8162n0421L3753P0670
25054B61486m5264k2840L0787j18444p6581P982N6234O380O038j574j16410k0654
25042c2860L4172p6917L8613J04765J19222n5009j44581o2644j4662R6505J33487
25031A40091l9058j0912r2508j24310Q15p6511m8470J37419J39844N131j5632
25020A5899j09559p0708l1750M8429Q37p9962Q4856J57936J34773L5943k02516
25009a5822k0611m5538N3258p0205N3094J22265O3730l7435K9390q5886n9733
24998a3493N4677P3928m5109o2732J6572P3533J07523m8443j22414o3835K5407
24987d386R6671r164p0182j21126j4499J54739J19200r6901n2441J0311J82394
$$ y = [-109217, -174566, -253598, -155604, -101221, 24996, 84332, 119322, 207484, 157063, 190816, 261486, 216222, 193382, 224169, 105725, 29144, 37126, 93360, 99740, 105778, 104204, -12206, -32860, 1312, -75605, -36992, 67773, 186995, 131986, -12595, -75239, -89901, 6604, 140091, 101033, 90121, -2387, -126697, -125882, -202393, -250863, -113444, 26400, 31531, 15899, -93660, -164368, -196118, -147689, -146852, -226814, -141958, 15978, 150751, 186694, -15822, -36433, -81971, -28713, -98918, -45824, 76441, 140171, 102736, 132126, 46240, -13493, 41184, 115112, 70003, 7271, 23843, 97376, 204899, 156456, 34042, -29793, -4386, 92285, 83121, 12939, -108187, -122686, 32053, 151253, 54352, 1911, 12222, 194616]
24976A94616p259r0369M6741m0110j6364n8930m199J54300J7236j98729j76718
24965a79785l3676R499J73672O7107O5705j1561n7149n3298j45462Q7308M5368
24954c2272j2588j1656R446L107q4301r8193M8000Q2643K6958k4449j01687N0032
24942a44960L9460o6412k7529K096J53789N8256j6013L3845j00094r0281Q582
24931a49261M9863L967J63229r4833j1060J84560K7981k9128l2768q8479k8339
24920d268L30L2307O469O3369k7930j6318l4781q8165o9027L5836L3782J3490
24908e4906k1206J46318j3559o6214l5375l1723K1500o4213M2968J68024n9992
24897C1622k5273m8814L2184J06123Q7284k6203k7097M4709P90Q523j11629j06903
$$ y = [194616, 187357, 96988, 143729, 103619, 87255, 28325, 24126, 178426, 195662, -3067, -179785, -213461, -203962, -30290, 36817, 102522, 90961, 33812, -19486, -164948, -77640, -32272, -44860, -56516, -47070, -43963, -128264, -226457, -178457, -95814, -68856, -93305, -194992, -144960, -105500, -171912, -199441, -197345, -43556, 14700, -1313, 32532, -67562, -157843, -149261, -99398, -95431, 67798, -27035, -38095, 146465, 174446, 145318, 112550, 24071, -4268, -3938, 28369, 34838, 98207, 70277, 53959, 19178, -68987, -138014, -102178, -68396, -54906, -76112, 70206, 56647, -9567, -44942, -76665, -55165, -119378, -76410, 91614, 31622, 6349, -42465, -10281, 95842, 183126, 156923, 129826, 174535, 175325, 183848, 72219, -34684]
24885c4684L1156L7656o0488O0988q0360j09807K6897L2170J5938m2826Q2113
24874d1247j67533o5123J36825M769k6433K9108R1829J06841m8944K4876L6055
24863H1023r7810r2488k7259J6775J31351k509m6251k1116k6522q889N7166O8069
24851C1540K5396O9342k1859r7998M2779M9472K8054M6020j06948m9284R3185
24840A09699l0851j06777K734M7710q095m0151p0656O5492J05092P3437p9751
24829F7883Q8860Q4194n5189r7297j81752k9637N1780N1744m0148M0074q8087
24818a07575O3761N4739N5412j03374l1781r7644p5965K3002L2866J04881J76413
24807I4735l2056j33519r9210Q8644K4046m5784O4560m8950O3262J05579n7202
$$ y = [-34684, -3528, 34128, -26360, 34628, -45732, -155539, -128642, -96472, -80534, -123360, -41247, -208780, -273903, -137078, -132309, -158742, -129634, -37805, 69036, 20092, 44968, 81023, -16787, -109275, -136534, -119759, 11592, 9083, -37168, -58284, -84806, -93695, -36529, 31540, 56936, 126278, 104419, 6421, 49200, 98672, 126726, 172746, 65798, 16514, 109699, 78848, -27929, -25195, 22515, 14420, -25731, -96387, -30895, 74197, 147634, 67883, 156743, 240937, 185748, 88451, -93301, -122938, -71158, -19414, -59562, -19488, -107575, -43814, 10925, 66337, -37037, -68818, -166462, -242427, -219425, -186559, -81678, 94735, 62679, -70840, -170050, -81406, -57360, -103144, -38584, -87534, -24272, 81307, 24105]
24796B4105j36418K9256J00739L4717M4723Q2464P3004q7194m4285j49551j61383
24785a89823N6248R2398M759k0551M7411j7638m1271J2875M3823o6177K326O1135
24773a4485r0354q8329k3211L1877K66668Q6333q1184j01964K0180j06957j7879
24762a19305J23918L7110P907j03971k2436P8813m1615Q275Q0493L1529O663N7295
24750A44676o9360M1069l0699r8866Q079K8116K2921O4934j7420j9851k4679r0771
24738d1851L1088O3810L8192n7918j43441K1915N6723K7965M7910n4581L724N1767
24726D5303P355N5744j43743j66513J3725J0034J10100O7096P800k06205j48048
24715c47352j4012J67305K6493J6712K0176O1563p145L4512j40539j1754R716
$$ y = [24105, -112313, -83057, 17682, 52399, 97122, 179586, 252590, 165396, 121111, -28440, -189823, -133575, -41177, -36418, -56969, -9558, -27196, -68467, -55592, -11769, -77946, -75620, -14485, -104839, -193168, -216379, -184502, 82166, 168499, 87315, -14649, 5531, -101426, -119305, 4613, 41723, 49630, -54341, -76777, 2036, -39579, -31304, 49189, 80718, 87381, 144676, 75316, 116385, 85686, -13180, -5101, 23015, 45936, 110870, 93450, 73599, 48920, -41851, -10763, 53047, 91239, 33321, -110120, -88205, -31482, -3517, 44393, -10188, -6464, 45303, 52658, 108402, -35341, -201854, -188129, -178095, -67995, -899, 6901, -199304, -347352, -361364, -194059, -167566, -150854, -130678, -69115, -76260, -41748, -182287, -194041, -184325]
24704a84325m2690j1571j10318J60219J65495l0125m9848k5443J24168j2334p8268
24693i5040l851P0089K2729p8211J4374L0434L9698L1921j1595k9471m305l1555
24681d4783Q2582m108l8690m5480o1575m7931j7604k6981l7225j3799J41574L6621
24669g7399J61570R3635O5053r8691o6496n4796j47371J9633N9120J2596n7615
24658i0761Q4350L6865n3680r7422p9140J9244R8571K9809J08810n6440l5597
24647c5391l8705O5456p7512Q4833K6543r6199j8472l768J02664M2595Q69q8024
24635c5111j30514k9313M401J38789J09170p5831n6599J66723M8828j519l9024
24624A00000O3191q0580j30909J0099l6184j783m7092r46l7267N0918L8375n4411
$$ y = [-184325, -227015, -238586, -348904, -188685, -23190, -53315, -103163, -128606, -4438, -16772, -95040, -98891, -28802, -6073, -84284, -69910, -39476, 222, 32143, 20548, -8923, -13228, -44783, 37799, 33691, -4999, -50479, -112054, -159985, -177589, -204570, -241795, -255594, -114020, -77399, 84171, 177806, 242859, 144168, 77672, 22876, -124495, -104862, -45742, -33146, -90761, -6411, 30454, -23226, -120648, -199788, -180544, -81973, -52164, 56646, 206, -35391, -74096, -8640, -86152, -1319, 25224, -70975, -89447, -93215, 9449, 52044, 52913, -35111, -165625, -194938, -190537, -51748, 57422, -18409, -75008, 91715, 140543, 139024, 100000, 163191, 82611, -48298, -38199, -74383, -76166, -123258, -124204, -161471, -110553, -72178, -126589]
24612a26589N4162K9163J6108l7950J27692K7992j24241R4533L9696n3386o6238
24601a9058o5360M9678j8417l7454l8397N3275p0493J39640R5007J10445j67396
24590C1470m0296R4073Q4037N821n0535o7562L9700K8680l4813r5998m0169L769
24578d1823q353M1124l9530m2116P3931O8490N4768M8276m7821O0552n4609r388
24566A03501o8917j15459q6539K1084K4977J2750M9367L5838Q281L4384N9916
24555G9183j04039o0048R0422m934j27434P7681J06826j5675p3181j26271j2J11858
24543d5624J30973Q0132l5164j11770r2938L5856P3354M8234n1143j2599P8288
24532I7599K2082K0924L1444l0944j33080q924J17074j6909j26104k3540R1541
$$ y = [-126589, -72427, -43264, -27156, -65106, 62586, 90578, -33663, 60870, 100566, 47180, -19058, -84418, -34740, -53157, -90611, -129008, -75733, -146226, -6586, 88421, 198866, 31470, -8826, 85247, 169284, 175105, 124570, 57008, 96708, 125388, 90575, -5423, -45592, -41823, -50176, -9052, -48582, -90698, -16767, 51723, 106491, 154767, 106946, 167498, 112889, 103501, 34584, -80875, -167414, -146330, -121353, -108603, -59236, -23398, -15117, 19267, 79183, -24856, -84904, 5518, 584, -126850, -49169, 57657, 41982, -31199, -157470, -157482, -45624, 85349, 165481, 130317, 18547, -74391, -38535, 34819, 83053, 31910, 19311, 97599, 119681, 140605, 172049, 141105, 8025, -899, 116175, 99266, -26838, -50378, 41163]
24521D1163L4374l2126P6182O9161L319j5793k8293j7721R1584j1302q5894J648
24509A26302j4930n217Q2340l9157j29996j06528m2963L0270l0820K4625L3248
24498g2826O3857M0943O4041P8860j17132j78532l5886J1991j26742J06941J00812
24487f3673j0344k2487k4566k1392J11394L786m3128M8757M2466L9126J21243
24476A81182l4723j80957L8573N8115P0619Q8739j3665p9564l2297j14589j43378
24465a61945o742P053M7206Q0362J77214o3236j60631j01997P9586J51081O4577
24454A12528q0334j06079M1058p1509o3822P2574J69641R7463m8907l0102N4066
24443A46577K1778k2368j32715j50953K5176L0798J77538R2186l7355j01902m7891
$$ y = [41163, 75537, 43411, 119593, 188754, 192073, 176280, 147987, 130266, 221850, 210548, 124654, 126302, 111372, 106155, 188495, 149338, 19342, -87186, -130149, -99879, -130699, -106074, -72826, -8969, 31974, 96015, 174875, 57743, -120789, -156675, -144684, -271426, -164485, -63673, -74017, -96504, -121070, -142462, -31068, -27282, -70410, -21653, 20813, 59939, 181182, 146459, -34498, 4075, 62190, 132809, 221548, 207883, 128319, 96022, -18567, -161945, -168687, -161634, -114428, -34066, 143148, 79912, -80719, -182716, -103130, 47951, 112528, 32194, -73885, -32827, -104336, -168158, -95584, 74057, 171520, 122613, 92511, 146577, 168355, 145987, 13272, -137681, -112505, -81707, 95831, 188017, 150662, 48760, 869]
24432H69K666M1989M5489j13394q8590J3348n1761R334L2557O9692p806j31820
24420a77427K1953L6225Q8874j72535j22260L3356P9932J22274Q3640l3732j1526
24409e1226R4402k8125q7977K9251l874J7618p0071j65960L5431K8457k6009r62
24397b29045M2218k2702r0786M1025J05273j0238N4092r238N438M9132Q9730J1772
24385C6671p1313J0817m1833J55432J26646q9720q0615L3138q737O4142L1492
24374A66120n815p6835J215r9828n8745J31424L8947l3840j4401J0743r0918m0851
24362g2784M591q3038j1990J73343J50058K8349n9271n2798j22412m7786m5693
24351a39431l5211Q4222j1155p8483N7915N7455O8293R0736J5482n9357o9864
$$ y = [869, 3535, 45524, 91013, -22381, -110971, -97623, -149384, -140050, -107493, -37801, -45607, -177427, -155474, -119249, -30375, -202910, -325170, -291814, -211882, -89608, -5968, -39700, -51226, 43176, 15051, -72926, -43675, -47549, -29931, -100002, -265962, -230531, -202074, -228083, -229045, -186827, -209529, -300315, -259290, -154017, -164255, -110163, -119401, -113963, -64831, 24899, 36671, -34642, -23825, -65658, 89774, 216420, 126700, 46085, 79223, 70486, 134628, 166120, 160305, 83470, 84685, -15143, -73888, 57536, 96483, 62643, 48242, 58985, -31933, -72784, -68193, -151231, -163221, 10122, 160180, 188529, 129258, 76460, -45952, -93738, -139431, -174642, -90420, -101575, -180058, -122143, -64688, 3605, 94341, 109823, 50466, -19398]
24340a9398j0797M5754J972Q299j02137l3119K9823L6520j76712L9190L8659R3352
24328d8594K17746J6757j47968q5069r2121O5915J13208j3576q6001R2014P1368
24317A03679n4225J0863N1487m3266K3513J17488l1884j22625j55801M5166Q2574
24306B6969L7575M2111N2657j63117j26150j5981K3653J2241R2804M3753L1149
24295E7664J6164M2560p7j0412M2156n934q419J21202k763j3258M784p3442l0778
24282A39447k8424J09557j6608p4011j35295J356j4236p3229j01432P3560L550
24271a15765j7781Q6268R4470j56945o7095R7559K7583O5440m5833N3547l8244
24260a6796M0408R2285O3902k7906l7652M5859l8207j07408l0275k5893q0239
$$ y = [-19398, -30195, 15559, 17531, 25830, -76307, -109426, -79603, -43083, -219795, -180605, -141946, -48594, 169152, 185909, 37941, -47128, -139249, -73334, 39874, 26298, -59703, 32311, 103679, 49454, 60317, 111804, 68538, 92051, 209539, 177655, 55030, -100771, -55605, 26969, 64544, 106655, 159312, -3805, -129955, -145936, -122283, -110042, -17238, 26515, 57664, 73828, 116388, 116311, 105899, 148055, 142121, 133702, 254904, 252141, 238883, 243667, 170225, 139447, 111023, 220580, 203972, 129961, -5334, -3978, -18214, -91443, -192875, -119315, -115765, -133546, -47278, 47192, -109753, -176848, -79289, -51706, 13734, -32099, 21448, -16796, 23612, 115897, 179799, 151893, 114241, 160100, 121893, 14485, -15790, -41683, -121922]
24249a21922Q4649J01102r0003j3689O0452L7871k832l6943j30385p0340R266
24238a72774k4802P0647J00705P0529q25k5373k8993J8100q5521q0824J2481J16816
24226b9834J07347l4957r1484p2333n6479N998P2614Q5777L6707J4274n8640m2705
24214f3715k822J5919M4487q9279J46799N3948p153p3302K9676L0531j49256M0460
24202b3707M8461m6616O7508K7826L6371N7509p6748N838L3248j9817j36489o5492
24190i2108j27035p804J43770Q4448K4140l1759j33216m3333o5550J7941J48950
24179h1556J24586M3120j8648O2229j73198j27024l5399O3991q970k8635P1147
24168a08357O6595P5400n9592l6694Q0157q9052L753K5467j5080J17087P1922
$$ y = [-121922, -37273, 63829, -26174, -39863, 20589, 58460, 55628, 18685, -111700, -182040, -172774, -197576, -126929, -26224, 44305, 43480, 18107, -10886, 7214, -78307, -159131, -146650, -29834, 77513, 42556, -48928, -121261, -177740, -171742, -99128, -13351, 23356, 37630, -21010, -63715, -66537, -50618, -6131, -95410, 51389, 105337, 98184, 24882, 54558, 85089, -64167, -23707, 24754, -21862, 45646, 73472, 109843, 167352, 90604, 96442, 129690, 109873, -26616, -92108, -219143, -226947, -83177, 1271, 25411, -6348, -139564, -182897, -248447, -230506, -81556, 43030, 86150, 67502, 129731, -43467, -170491, -205890, -141899, -150869, -179504, -108357, -41762, 33638, -25954, -62648, 17509, -71543, -67790, -42323, -57403, 59684, 131606]
24157A31606n9135k2741m166K1432o4624j01652q9750R5958N2561J27809j33282
24146d5984j15564n4004R936R3183O8224N0084J4435K0299p9831r6189J2092J47821
24134B4502J71240n3341o634n5305j20281j17O1867O4133k1752m4857j4159P686
24122A2982n8420K2283n4921R5504R1050p6533r5674P6317R1891M8192o345j6946
24110A29380p842n6639L2500K3288L5698j9549l6311R9657R3603r6907j86199
24099A0679q978J35494O7063J6245m8258o1105k8352N7607N3281j6205r6878r2507
24087a1914l095J635j7654M7218l7489L1511Q634p7734j69607K8743J21692L3360
24075d4700k1311J16188O4885J4132K8026J6940m7390J4032m7586j44187o1024
$$ y = [131606, 72471, 49730, 45564, 66996, 2372, -99280, -189030, -93072, -40511, 87298, -45984, -161548, -215552, -205616, -112433, -44209, 5875, 20310, 40609, -39222, -135411, -123319, 24502, 195742, 142401, 135767, 80462, -39819, -39936, 21931, 86064, 64312, 19455, 5296, 12982, -45438, -23155, -78076, 17428, 108478, 31945, -63729, 12588, 104479, 152671, 146326, 129380, 121538, 64899, 97399, 120687, 156385, 136836, 100525, 200182, 293785, 196878, 10679, 1701, 137195, 204258, 220503, 172245, 111140, 82788, 140395, 193676, 177471, 80593, -11914, -15009, -13374, -31028, 16190, -21299, 10212, 18846, -58888, -228495, -199752, -78060, -44700, -66011, 50177, 115062, 129194, 157220, 174160, 126770, 140802, 93216, -50971, -111995]
24064a11995K5986O8116J9055J01295L3156q1244k8609n4353J7574j07938N909
24053a13048L5283r6872o0859o4999J68666Q6295j8748k4697J22197P2409L069
24042A08696n081n2484k1305L2306P2864L9184J6382o4753k04855r2401N7563
24031a13884N3130p9832K3229M4341M8017j15313N6993K0846n652M3404K6229
24020A508K7375J18340o8527r2680n3345l0572K117N875J42255n8578q300j2238
24008b6770o1745r6310p3615L9646R2937n2457j4328j1455m4975P7970J80613
23997I511N1341l143R5272L4141l2734o9825m2193n8403J5941J4095J16156J16556
23985B46715o8387r8540M3643m422n3358j2650r607N3182p5915j5009M1614L7513
$$ y = [-111995, -86009, -17893, 1162, 102457, 135613, 54369, 25760, -28593, -11019, -118957, -113048, -77765, -174637, -235496, -300495, -131829, -45534, -64282, -88979, 33218, 105627, 108696, 103615, 51131, 29826, 62132, 134996, 174180, 190562, 125809, -79046, -171447, -113884, -60754, -140586, -117357, -73016, -24999, -140312, -83319, -62473, -68125, -24721, 1508, 28883, 147223, 78696, -13984, -67329, -97901, -95784, -89909, 52346, -6232, -14532, -26770, -88515, -184825, -258440, -218794, -125857, -178314, -192642, -204097, -249072, -171102, 9511, 60852, 57709, 152981, 187122, 154388, 84563, 42370, -16033, -92, 14003, 130159, 246715, 178328, 79788, 123431, 119009, 65651, 53001, 43394, 96576, 20661, 5652, 47266, 84779]
23973H4779k9039l4918n0162Q5026L8673p143o6182l8534p0412r5675N164J15877
23961f2546p0495P999J67615M834j06679J3966l2860J5040K06248k9447j30662
23950a6987J00445N7676j69444O2722K16238l6043l5044m6574n8349J2113k9682
23939E7071r5898r5868Q379N0357R2340Q7231R519k5684N567o920m811k9129l0527
23926B1627l7403j7312O1286J08422J4439k3723n8161m2745l3227J4122r5780
23915h8455J48660K4950q983n8319k3810n8080o9314K4830M4286O9565M6457j9538
23903C2249j4614q3588L1108O0916M0654N4101j6503P936L1510j4257n0842m0809
23891C7861Q2079J08765O4408j18629j80182L1206m2614K2279Q3329R5408m6574
$$ y = [84779, 55740, 20822, -29340, 55686, 94359, 87216, 21034, -17500, -87912, -183587, -178423, -62546, -133041, -125042, 42573, 47407, -59272, -45306, -78166, -63126, 143122, 113675, -16987, 83458, 141134, -28310, 34412, 250650, 214607, 179563, 132989, 74640, 86753, 57071, -38827, -134695, -126316, -75959, 16381, 103612, 113131, 87447, 93014, 86094, 81283, 52154, 21627, -15776, -33088, 28198, 136620, 151059, 127336, 69175, 26430, -6797, 7325, -88455, 60205, 85155, 76172, 17853, -5957, -64037, -133351, -108521, -64235, 5330, 51787, 32249, 17635, -65953, -34845, 26071, 66725, 120826, 104323, 112259, 143769, 129512, 78670, 37861, 119940, 228705, 293113, 174484, -5698, 25508, -17106, 5173, 88502, 183910, 137336]
23880A37336j09304N316O5789N2910R3888j24280k13277l3656M8419J32891k0755
23869C5277j5864o1615L7634J4095l2813l2852R5040j3156l7106J94139m6341
23858A36438p4014o1460M2286r7583q0835L6174l9047J9867K8470M8894O9966
23847B9156j08708M7030J13420R441r6561M3035O8224K3677j72755L2296J72098
23836A60353l5537m8983K294m724m6947J30637K053K1109O4241n1053j01187L454
23824I5710q3561N0986p3274Q1194P9157J0860j494p5051l5725J6399J68947j01919
23812A32229j73839J2202P6121J05634J09543L8561m3072j9276r4103m4479k77
23801I9244q1693l7003J36469k5075l3034K0358n2439k6590O4452q8091p1837
$$ y = [137336, 28032, 33348, 99137, 152047, 245935, 121655, -91622, -125278, -76859, 56032, 35277, 19413, -42202, -4568, 9527, -23286, -56138, 38902, 25746, -11360, 182779, 136438, 62424, 964, 43250, -54333, -135168, -98994, -138041, -118174, -89704, -40810, 29156, -79552, -32522, 80898, 90339, -6222, 36813, 105037, 128714, -44041, -11745, 160353, 124816, 75833, 78127, 73403, 26456, 157093, 159146, 180255, 244496, 193443, 92256, 95710, 12149, 63135, -10139, 71055, 150212, 161072, 159578, 84527, 48802, 65201, 234148, 132229, -41610, -29408, 46713, 152347, 261890, 300451, 257379, 238103, 144000, 99521, 99244, 17551, -19452, 117017, 91942, 58908, 79266, 26827, 237, 64689, -23402, -95239]
23790i5239l613l2627J02447J03739N5784N575L3826Q8592r4141j55000J04715
23779A14058K5514k5736J0630k0420N8121n2419J9737P121o1570m0944k8864q8223
23767h2995l3565k2195m2214m2412J31767K3005n9554l188m2750k0398L0656k9054
23755a92897J64990J61384l4468r510O5420J0904k3441L8034p0268l6398o2723
23744A1027P9856N5787j4506K0826J7538m104q7863o3871k4494J38016O1334L4546
23732B24092K4527j7295n6289N252m2938j05772q2349J4204N4641m728R7569Q1683
23720A92597k5523j34938p5909O4257k5021l5881l4328j15440R8325J04768R18
23709A3825r5227M5217P0473l1994n2228n6217k6129J45144J48288O3811q2774
$$ y = [-95239, -98852, -131479, -29032, 74707, 130491, 136066, 169892, 258484, 164343, 9343, 114058, 139572, 113836, 124466, 104046, 162167, 109748, 129485, 136606, 75036, 34092, 5228, -82995, -116560, -138755, -180969, -223381, -91614, -68609, -128163, -131351, -174101, -194499, -163843, -192897, -27907, 133477, 99009, 89499, 154919, 165823, 142382, 180416, 110148, 73750, 11027, 90883, 146670, 132164, 152990, 170528, 166424, 78561, 14690, -9804, 128212, 189546, 224092, 248619, 231324, 175035, 180287, 137349, 31577, -50772, -36568, 18073, 13345, 110914, 192597, 167074, 32136, -43773, 20484, -4537, -40418, -74746, -190186, -91861, 12907, 13825, -81402, -36185, 34288, 2294, -49934, -106151, -132280, 12864, 161152, 224963, 142189]
23698A42189p3539N4176p6499p3639o949m1085K964r754M3795N3491k5648q2668
23686i3166M570m3601P9232K0401K3605k9913m859N0124j06071L340L7859O8539
23674A0060p045o3545R544J07367l8042r7542l189O4884o2030j5902m2791m097
23662a42328L0313K9559l790J33127P3259J09577K3223O6190k89703j5325J14298
23651A28400j1401o6099M3457N1167o341p1015q646r4594m051L9542N7926J8874
23639G7219l8241L633l5368j10974K9734k0875L3440J22658k4928q1573n6083
23628a01358M2189N0728L6210L3452o3362m1033L5500L3226l898L9416n8927Q4409
23616H6552J9929O825p8500j05203k0178l582M0691P3489M294o1878J868M5646
$$ y = [142189, 68650, 122826, 46327, -27312, -34261, -75346, -72382, -82136, -38341, 15150, -10498, -93166, -88596, -132197, -52965, -32564, -8959, -38872, -43731, 6393, -99678, -96338, -58479, 10060, 3015, -60530, -50986, 56381, 18339, -79203, -82392, -17508, -79538, -95440, -138231, -142328, -112015, -82456, -86246, 46881, 120140, 229717, 252940, 319130, 29427, 14102, 128400, 116999, 50900, 94357, 145524, 139183, 68168, 59522, -35072, -39123, 419, 58345, 77219, 38978, 42611, 7243, -103731, -73997, -94872, -61432, 61226, 36298, -45275, -101358, -59169, -8441, 27769, 61221, -2141, -43174, -7674, 25552, 21654, 61070, 2143, 86552, 106481, 113306, 34806, -70397, -90575, -94157, -53466, 20023, 24317, -37561, -35693, 9953]
23604I953J8082n7145j1744J1097K6263k7388L1921m2393O5515P3229M0723j9914
23592A18199m3682k1967n1005k08391P7313J31076L3978j5544O591n1567J00959
23581G5960Q2541L4988j01010m205L737o7720J1168o4666J6820J3570J37644r489
23569A29338j4220L5447O1670n5122q2890M8520O7353M3057Q5272p1147n4385
23558A92893k5018J7895m154L1495j2033r2713M08N8734P2841k5710n9833J18048
23546B72853j08628n5201j59117k8185J2887M6638N800l026P2779J4694m3376
23535B8118m8548K6902m4602K3351p6665n7301m1612J13174J97634J10426p1616
23524A59261m7968q1624L434L5680o5278o7219N0877m7073M6889j03843m7731
$$ y = [9953, 28035, -29110, -40854, -29757, -3494, -30882, 1039, -41354, 24161, 97390, 138113, 118199, 74517, 52550, 1545, -206846, -129533, 1543, 35521, 19977, 26568, -24999, 75960, 158501, 193489, 92479, 88274, 92011, 24291, 35459, -29207, -12387, 1183, 138827, 129338, 115118, 150565, 212235, 157113, 74223, 122743, 190096, 233153, 318425, 247278, 192893, 167875, 185770, 181616, 213111, 201078, 108365, 108773, 167507, 240348, 214638, 154805, 272853, 164225, 109024, -50093, -78278, -65391, -18753, -12953, -15979, 56800, 71494, 28118, -20430, 6472, -38130, -14779, -91444, -148745, -190357, -77183, 120451, 230877, 159261, 111293, 29669, 33103, 68783, 3505, -63714, -12837, -59910, -13021, -116864, -164595]
23513a64595J1007r411P1487R1466m357J7128J7906k9047l1495k7919M2417L0400
23501A4987K6802q28L2114Q9296Q219o3534r4285J4704J41376j6112j8635R7495
23489B31599p4620j38222j04821M5212N6182K6916J13478J952j64377O041K27895
23478B27235p4406o0237o984n4294R579P610L067J16365J4584m3581l4160q9137
23466A5641N7236J04157r3476j30461q5334J88863J42405l0240q1194J29448K7630
23455B44675n9312m3059O92J10169L6413J5582j62959p3234O0643o0913r747N4016
23443A12966m2579k3216J92136J687k6128l0563j9030N2715r1949r7911l2425
23432d297n4584j0829J1648J3594J6126R7304l7879n8359l2750O4365R172Q7633
$$ y = [-164595, -153588, -162999, -91512, -46, -4403, 12725, 30631, 1584, -29911, -57830, -15413, 14987, 41789, 40961, 73075, 162371, 170590, 107056, 12771, 27475, 168851, 152739, 134104, 231599, 156979, 18757, -86064, -40852, 15330, 42246, 155724, 157676, -6701, -660, 227235, 152829, 92592, 85608, 31314, 40893, 48503, 51570, 167935, 182519, 138938, 104778, 15641, 72877, 177034, 83558, -46903, -132237, 56626, 199031, 168791, 87597, 217045, 244675, 185363, 142304, 142996, 253165, 289578, 305160, 142201, 68967, 129610, 68697, 58950, 112966, 70387, 47171, 239307, 240994, 214866, 184303, 165273, 217988, 126039, 28128, -4297, -58881, -69710, -58062, -44468, -28342, 68962, 31083, -27276, -60026, 4339, 13511, 101144]
23420A01144l1133j60020j33677J14137R4457O7292K6549k7352N1436K6023k7836
23409A01020M3935j2676P1918m4781r5097j24086q0052P4168N6784L533j06288
23398a11622M4667K5936n9554q1089J15652R3256M3981n1302l2096R816L8364
23387C6009o0794M9549J3180j4853P801m4839M9340O9921Q5776M9370m0592j68831
23375C1037L4048L3231j28319j07611M035M1257N3890N5616m4519j3246N448n65
23363c5698J9129J35522P5428K870l1783j06345p5329k1548j05233K6086R7038
23352a9863r1811J00858O4211j54285j8622Q0348M427K7287O547O0328M4199j5741
23340H7883K4119p67J7737n5909j29945O832N6749J3831j36443m4236j7204K7637
$$ y = [101144, 70011, -90009, -223686, -109549, -15092, 52200, 78749, 51397, 102833, 128856, 101020, 144955, 132279, 204197, 159416, 64319, -59767, -139819, -65651, -8867, -5334, -111622, -66955, -41019, -100573, -181662, -66010, 27246, 71227, 19925, -12171, -2355, 36009, -24785, 24764, 37944, 23091, 30892, -13947, 35393, 105314, 191090, 240460, 199868, 31037, 65085, 98316, -30003, -137614, -133579, -92322, -38432, 17184, -27335, -40581, -35133, -35698, -16569, 118953, 194381, 197251, 165468, 59123, -16206, -37754, -142987, -116901, -19863, -111674, -10816, 53395, -100890, -119512, -39164, -34737, -7450, -903, 59425, 103624, 87883, 112002, 111235, 128972, 73063, -56882, -50050, 6699, 20530, -115913, -160149, -177353, -149716]
23328a49716l8201k535q465Q1982R1335O7153j8476j19738M7582K12438l9192
23317A24167j20366J55418L0139n2275Q3111n149j0273p9818k3769M2218N1524
23306A94927l8159m2261L7948n7944j00079l2339R7423j8288j51545j06817O9714
23295a47420K15532J91889n7928j62790j31884m109P0416l3860o668K3423n0888
23284i4287J5988Q0725j7403O8128N5781m3231K0822J8366K3775j06686o6042
23273d4064k3458K9895R3948J52701o900j10491o3833J02474Q4279l9062M410
23262A79899j05679j03662J2619R477k6624p261o0035n0646J29063N0326N0785
23251G8262J30508j84724n0302J11164J77520j12595k47361P0970N2947o3178
$$ y = [-149716, -187917, -190452, -198917, -116935, -25600, 41553, 23077, -96661, -49079, 163359, 124167, 3801, 159219, 189358, 137083, 220194, 215045, 204772, 124954, 101185, 143403, 194927, 156768, 114507, 152455, 94511, -5568, -37907, 59516, 41228, -110317, -217134, -147420, 68112, 260001, 202073, 39283, -92601, -96710, -26294, -60154, -66822, -43399, -94287, -78299, 2426, -14977, 53151, 108932, 65701, 86523, 104889, 128664, 21978, -44064, -67522, -37627, 56321, 209022, 202122, 91631, 27798, 130272, 214551, 175489, 179899, 74220, -29442, -16823, -7346, -33970, -41231, -101266, -151912, -22849, 27477, 78262, 208770, 24046, -26256, 84908, 262428, 149833, -97528, -26558, 26389, -36789]
23241c6789j4947J06698q1981k21463P199J07355R6935l45j22353j57720J16819
23230b00592Q3022p4918R70P4569J04908K9977j01635l4106p6634J3179j0804
23219a92064N2158Q0698J6797l9652j5413L6183k9326m0046n1678N7906L1173
23208i3264R2344N4666O739o6925N9309J06760n0439j42834j5813k7104O9892
23197f669N2113l1192j0949Q3989L4263o14l3982j03366m1354J06371m1032l2543
23185b4965n3319L1836J04415q2493J21310l9897r117L4849J19915q4459j66593
23174d8518M2853J26442j17021r2656K5069k0899j3300j897N02k9497l5973P1428
23162i3467L6815J20328k4331m5603k5604P7687j25369P0165M8144m936J63673
$$ y = [-36789, -51736, 54962, -27019, -248482, -241283, -133928, -36993, -37338, -159691, -317411, -200592, -117570, -192488, -191518, -116949, -12041, 17936, -83699, -117805, -194439, -181260, -192064, -139906, -59208, -42411, -82063, -97476, -61293, -90619, -130665, -182343, -124437, -93264, -920, 53746, 60485, -6440, 52869, 159629, 109190, -33644, -49457, -76561, -6669, 45444, 14252, 3303, 87292, 121555, 120941, 86959, -16407, -57761, 48610, 7578, -24965, -78284, -46448, 57967, -24526, 96784, 56887, 47770, 82619, 202534, 118075, -48518, -5665, 120777, 3756, -88900, -63831, -84730, -98030, -99927, -99425, -128922, -164895, -93467, -56652, 63676, 39345, -6258, -31862, 45825, -79544, -9379, 38765, 33829, 197502]
23151A97502j6568j46881j27816J1784J2429n522J00115J9343N5175N2324m8820
23140A03065j994m0900k01280p9500L6626j2110N3707P5269J40789m290n3316
23129A6066K3371q5385j02156K7016N0125L5604o3576p6573j1904o1973m1127
23118b90512J34450L1849n3043k9108J55676Q2670L1033O839j4946K1473j63092
23107h6711k6394n2183n7802N4957K1419L8807j2202P9387J98529o1913j02003
23096f109j6890N567j07066q3963Q0178K1652j6490J48983J53138O1510m0699
23085A99811j21808m69p3457O5856K1087m1445k611j8694J9933k8739j06558O713
23073h0381K3570r1503J9291P018p1829Q4571L9077R8514J84897r7251j41034
$$ y = [197502, 180934, 34053, -93763, -81979, -69550, -75072, 25043, 44386, 99561, 151885, 103065, 101071, 60171, -141109, -220609, -183983, -196093, -142386, -67117, 73672, 69382, 16066, 39437, -45948, -148104, -121088, -70963, -35359, -98935, -175508, -187412, -249385, -290512, -156062, -124213, -177256, -206364, -50688, 31982, 63015, 69854, 54908, 76381, -86711, -113105, -165288, -223090, -168133, -146714, -107907, -120109, -40722, 157807, 95894, -6109, -22999, -17432, -124498, -208461, -128283, -106631, -123121, 25862, 179000, 240510, 199811, 78003, 77534, 4077, 69933, 91020, 49575, 46964, 28270, 48203, 19464, -87094, -80381, -56811, -148314, -129023, -122005, -193834, -109263, -70186, 28328, 213225, 115974, -25060]
23062b5060j63795m8612J50877N8277o1768J3902J69531n2959L24m7884n8556
23051f5723n73r2934k245O1635J35291J07816q3453l8487K6124r3006o4415n9454
23039a69424K8M3268N7934M8877k700J49217R609j11048n688J08501j16216M7226
23027E9584K8552m638j42424o1626p6422M3345k2355J9941P2791Q6668Q5974J3501
23015A02891N1817K0320o9195J423J8013N3390o4974p3994l946l791J1919l7858
23003F015m6900q0568j061J5952J6361p753O84j5182J644K4560N0426P3042P9954
22990A17174J8582o7197J5811l6920p6341r0681j5753j03231L8747R4060J5341
22979i0408l4635k785L6143M7805O6591P1984m2459r5266N083Q1492L7386p6955
$$ y = [-25060, -188855, -237467, -86590, -28313, -90081, -76179, 93352, 40393, 40717, -7167, -65723, -66296, -159230, -161475, -99840, 35451, 143267, 59814, 21327, 47451, -45555, -109970, -169424, -169396, -126128, -68194, -19317, -22017, 127200, 136809, 25761, 20073, 128574, 12358, 59584, 88136, 83498, -58926, -120552, -196974, -153629, -175984, -156043, -83252, 3416, 89390, 102891, 154708, 175028, 105833, 107256, 125269, 178659, 113685, 39691, 35745, 31954, 43873, 6015, -40885, -121453, -122514, -106562, -90201, -97954, -97270, -112452, -110808, -86248, -35822, 37220, 117174, 135756, 68559, 84370, 47450, -28891, -119572, -135325, -238556, -199809, -105749, -90408, -125043, -127828, -91685, -43880, 22711, 94695, 52236, -43030, -37947, 43545, 80931, 3976]
22967C976M8548N9267r7762n452O2287l5563j2060q8999O0129P3709p3644k8301
22955c3865P9515o7818P6515L6667J5278R8872R4490l2817j34973j67467r4789
22944a30392n1086N5967K2859L2072L7589P6228J27071l668j91970K2114k448
22933e664j06739P6371J02067r584j8289P7971L4516j28264j02632p092M988P4640
22921g711j03422K8587J37406J68580Q7170p4163o9443j01063j34423J8489Q2628
22910C2635l2509L975P7049p8217r814m4449m8997J98109M3005r712r5333P359
22898D3101M0332M7538r3709j65864j1598M8983J19087p058j15768n2027r964
22887a56947K5951J33314K27139P4023j18903j10155P858k4880L0350O6120j03820
$$ y = [3976, 52524, 111791, 14029, 8577, 70864, 35301, 23241, -65758, -5629, 68080, -5564, -33865, 45650, -22168, 54347, 91014, 106292, 205164, 299654, 266837, 131864, -35603, -130392, -181478, -125511, -102652, -70580, -32991, 43237, 170308, 166640, -25330, -3216, -5664, -112403, -36032, 66035, 56451, 38162, 116133, 150649, 22385, -80247, -87339, -82351, -7711, -111133, -82546, 54860, 223440, 310610, 236447, 167004, 65941, -68482, -49993, 32635, 126, 4101, 81150, 2933, -6881, -51330, -100327, 97782, 140787, 131075, 35742, 43101, 83433, 130971, 37262, -128602, -140200, -91217, 27870, 20812, -94956, -146983, -156947, -130996, 2318, 229457, 303480, 184577, 74422, 82280, 57400, 87750, 153870, 50050]
22876E0050N6871M4877m012k7720K4012M9159Q638q3211j00394n4656L3833J76356
22864A73803P403N2517M5592j6236n6405j14080p3261J29709O4873m5269k07044
22853c8398j11038R5263Q3668p9661J3763L2060R8922j22357j45421K033M7242
22842a23924P051j0442M9101L4343o3606N0014R5219q0815k5550Q2292R4135R7815
22830B05633k4765o9280L8157J4943J25885k8371j26644l5792m0733L6181n3335
22819D1879m1433R6716Q8484j6221k6107p1402q4039p5427K6272M5792P611J1387
22807C512J6493L8681N0394M1456l4464k5474j94363p7313P7454J9013O1468m0935
22795f4078M8065L2770l3575o4969q779r475O9972j7816K2478o9291r5392L5446
$$ y = [50050, 106921, 151798, 147786, 120066, 144078, 193237, 201875, 118664, 18270, -36386, -2553, 173803, 181206, 233723, 279315, 263079, 206674, 92594, 19333, 149042, 213915, 168646, -38398, -149436, -54173, 29495, -50166, -36403, -4343, 94579, -27778, -173199, -171166, -123924, -116873, -127315, -78214, -43871, -107477, -57463, 37756, -43059, -68609, 13683, 107818, 205633, 180868, 111588, 149745, 164688, 290573, 262202, 135558, 99766, 59033, 95214, 41879, 446, 97162, 185646, 169425, 143318, 71916, -12123, -87550, -61278, -15486, -7875, 3512, 20005, 58686, 109080, 150536, 116072, 90598, -103765, -181078, -103624, -84611, -23143, -64078, -16013, 16757, -16818, -81787, -90566, -100041, -30069, -47885, -25407, -94698, -190090, -154644]
22783a54644J7065M9413k0382M6406Q9198Q145J022O9265L9290j38740j89753
22772a83715j8376Q9450J00814Q051L1885r6711j52765M8852L0613J7412k7592
22761a52082M6355m1833J23896N061N8233Q3482j256j1121n3276j07193N0479
22750G45p0340p8021l9585K0989J51561j2929j60365m4837M2615J23853M9817
22739a6497m2550O825J19069j8670o8251K7080o394k2934j53268o4463P7171Q2309
22727h0573N8384n1939M6969J14181l4319j653o0509j42567M9160R7321R9699
22716I4154q849n2036P111l0335m4848O2469P9833m7273q7952j2012L8937j9098
22704a9899q0185M0843M3792l3133Q0303K26072O6347o5024j77274j45998n6388
$$ y = [-154644, -137579, -88166, -108548, -62142, 27056, 35201, 36223, 105488, 144778, 6038, -183715, -202091, -112641, -11827, -3776, 28109, -68602, -221367, -172515, -141902, -124490, -152082, -105727, -147560, -23664, -18603, 39630, 123112, 121856, 110735, 57459, -49734, 745, -69595, -147616, -187201, -166212, -14651, -27580, -187945, -232782, -190167, -66314, -16497, -59047, -52222, 66847, 48177, -20074, 7006, 612, -22322, -175590, -240053, -162882, -80573, -22189, -74128, -27159, 87022, 52703, 51050, -9459, -152026, -102866, -5545, 94154, 85305, 33269, 40380, 10045, -34803, 27666, 107499, 60226, -27726, -39738, -801, -19899, -100084, -59241, -15449, -48582, 31721, 257793, 324140, 259116, 81842, -64156, -120544]
22693a20544L0625l379Q1323m9741q730J3854Q2984p4607j8254J8749Q7579j5910
22681B3949j13836m0544k8184p3026L6369J14977J7833q3956J13183J22131K4662
22670A13558m6147r0437J07966j351j15762O4140N0445j3315K0790Q6978m2969
22659A33896j31338l8455p9394p3143M0525J25731j819M6424R172m8826j21015
22648a38242K969O1683l571l8906j4552J06874l4890M0754q5471o164J6670n2540
22636a45386J1691L6998j01569K0751K05755n5661q0796M6814j3024p6343L8781
22625a11989P7125P831k4025r8724m0178O7854K04887J50800l0370K6858j10397
22614A19672j16195n1783m3204K4404P7894n2750r70j1396m7562J7014j3844K2814
$$ y = [-120544, -89919, -93298, -11975, -61716, -70446, -56592, 26392, -48215, -66469, -47720, 39859, 23949, -89887, -130431, -158615, -231641, -195272, -80295, -62462, -146418, -33235, 88896, 113558, 67411, -23026, 84940, 83589, -32173, 31967, 82412, 69097, 89887, 176865, 133896, 2558, -35897, -115291, -188434, -147909, -22178, -23997, 22427, 31599, -17227, -138242, -135273, -73590, -77161, -116067, -130619, -23745, -58635, -17881, -103352, -109516, -92846, -145386, -133695, -96697, -198266, -177515, 28240, -27421, -108217, -61403, -74427, -150770, -111989, -34864, -27033, -51058, -149782, -189960, -122106, 82781, 233581, 203211, 230069, 119672, 3477, -48306, -91510, -67106, 10788, -41962, -42932, -54328, -101890, -84876, -98720, -75906]
22602g5906m3783N0036J19425r8799j01118K9941J37156L5211p7227K6167Q4115
22591H5218M3217j22991j87427l2319L8083R9063n5618j616K7632k5619n7022
22580a89399l352J05921k1778j09249L9243N6859R9750o3797r7083m7398K3174
22569b07109N0555R4641K17P8436R2099J01197l407n5857q9243P6723q5873j18819
22557f6440l8696J1731l1466K1437j367m2451n3420P1409q699j1941O8086l2939
22545a14756o348M429o9553O5348P9831l7834m7515L3811J2188P0033J69854o0127
22533I9361j38113m6044J45505M6137k8670n4029p8229K6109N842q4910P8629
22522b8412O0831M0614q759M8676N8844j2650j38913j7515N5645O3665q8985k1391
$$ y = [-75906, -119689, -69653, 49772, -49027, -150145, -120204, 16952, 52163, -25064, 1103, 85218, 128435, 5444, -181983, -214302, -176219, -77156, -132774, -134390, -106758, -132377, -189399, -192751, -86830, -108608, -217857, -178614, -121755, -22005, -85802, -182885, -230283, -207109, -156554, -61913, -61696, 16740, 108839, 210036, 206629, 150772, 61529, 138252, 52379, -66440, -105136, -93405, -124871, -103434, -104801, -147252, -200672, -129263, -137962, -149903, -81817, -114756, -121104, -116675, -186228, -120880, -41049, -78883, -126398, -92587, -80399, -10366, 159488, 99361, -38752, -84796, 60709, 106846, 78176, 24147, -54082, -27973, -22131, -107041, -28412, 32419, 73033, 64274, 112950, 171794, 159144, 20231, 2716, 58361, 122026, 33041, 11650]
22510A1650K6155p8621l7748J32965L6413o2153p7718K2566K620p2774k6089N478
22498a17256p5321J7324J16432Q1629m8081k2256K758p648j7673R879M4435J35756
22486A19978q3465j21573J02976P0857J310m0515n7785P897L3455O0846j05638
22475a1657N3125P4730M0302q2811m683q9563P3352j2212r4916R851P9148O1885
22463I6551Q8301r26m5665j4440k1437L2880L8038o4451n3477r102Q810L6792
22451I1874n231r7346l0511p855n3144o8558K7907J10874J2300k9657j1406M9469
22439a1284l2814n2970N1044m5395K2589J11889J8064r8528j60706o9267n1312
22428c18690P1030J44430J72320l2134j1149p1641l0949m138j12397o3359n031
$$ y = [11650, 37805, -40816, -78564, 54401, 90814, 28661, -49057, -26491, -23871, -96645, -122734, -117256, -192577, -175253, -58821, 22808, -25273, -47529, -44771, -52419, -70092, -60213, -15778, 119978, 36513, -85060, 17916, 88773, 90083, 49568, -8217, -320, 33135, 93981, -11657, 41468, 116198, 156500, 73689, 69006, -20557, 52795, 40583, -54333, -44482, 34666, 96551, 184852, 183926, 138261, 123821, 102384, 135264, 173302, 108851, 55374, 46272, 55082, 91874, 86643, -10703, -41214, -49069, -102213, -170771, -142864, -31990, -19690, -49347, -60753, -11284, -44098, -97068, -46024, -91419, -68830, 43059, 61123, -37405, -198111, -267378, -318690, -247660, -103230, 69090, 36956, 25807, -45834, -76783, -80921, -193318, -256677, -261708]
22417b61708j15803N4327K03836J14850N4627j22791P768m5013n664J55551l7437
22406B543L9023k8874j89464j46058L9020J47785J29146P0811Q1719k2821n2230
22395G0600l3848m340j18469j45774l334q489L7599J04788o2754j2127p4074P9417
22383a70805J04527Q7836K934P0018K5588q440L2624k10101q8022N4969L5591
22372f3281L1249j8077J0227n4879k8362J5911Q1084N2604k2937J3304r2479p8712
22360a54348M3375J12831L2238l5270l8974O9069J40105K7687j2384K866l4542
22349A52653j01285j0296o2362N4834J10563n9553J6086K5307L8017n3021n7069
22338E3874o7896o7548P7286l9187P5210J62481N1651j32570k04393l0124L6873
$$ y = [-261708, -377511, -323184, -119348, -4498, 50129, -72662, -64894, -109907, -115571, 39980, 2543, 41566, 12692, -176772, -322830, -283810, -136025, -6879, 63932, 145651, 122830, 70600, 36752, 32412, -86057, -231831, -235165, -243654, -206055, -101267, -164021, -176148, -250222, -170805, -66278, 21558, 24492, 94510, 120098, 111658, 144282, -65819, -153841, -98872, -63281, -32032, -50109, -39882, -94761, -123123, -107212, -26128, 26476, 3539, 16843, -75636, -154348, -110973, 1858, 34096, -1174, -40148, 28921, 169026, 196713, 184329, 187195, 152653, 51368, 41072, -21290, 33544, 144107, 84554, 100640, 125947, 163964, 110943, 53874, -14022, -81570, -4284, -43471, 31739, 194220, 245871, 113301, -91092, -121216, -84343]
22327h4343k6822l5554K8958K3729J6989N5138o7576j18836N4786P1661L7484
22316d4386j7547l4108j17982M0358L215q498N5959Q8700J67448J29175n9484
22305B02850r1187j43920P6401k0133l7522P4299n0581o6869O0082J2073m180
22294A1313k1415N6657K9544o152J1468p0157p3029n0781n4299q6068J09097J08085
22282c5737K9339J4296O4537J03597j14066k20330M1503J16005m0919j2983R7028
22271D2270P5381J1874M0747J16221p1373p6700j52084r2387r9967r5415p3815
22260c75248J02372J09994Q6747L7899P9102Q0514j5369Q2592l4725j72228L1410
22249A3060k1175l1361p1733K2668L7373j00319J508K1612j6433k6125O7708J00447
$$ y = [-84343, -111165, -146719, -117761, -94032, -77043, -21905, -89481, -208317, -153531, -81870, -44386, -61933, -96041, -214023, -173665, -170450, -178948, -122989, -34289, 133159, 262334, 202850, 111663, -32257, 44144, 24011, -13511, 60788, 10207, -56662, 3420, 15493, 11313, -10102, 46555, 76099, 69947, 81415, 11258, -61771, -112552, -166851, -252919, -143822, -35737, -6398, 7898, 72435, 176032, 61966, -158364, -116861, -856, -41775, -54758, 42270, 117651, 129525, 170272, 286493, 215120, 138420, -13664, -106051, -206018, -301433, -375248, -272876, -162882, -76135, -38236, 40866, 121380, 106011, 188603, 153878, -18350, 13060, -8115, -39476, -111209, -88541, -51168, -151487, -149979, -128367, -144800, -170925, -103217, -2770]
22237b770M4143j44335q9077L7242Q8l7983L2862M922R6119N4756o7812o4113
22225a35958R697O4679J74439l774p7964p4359L5749N0867p9246j38085O8915
22214a05040N5391K0662o7519k8020r4466r4877N0065P4049L0625M0808J04646
22203a3676J8681l9551p6408j364J28820J33584J4246j04451j40591l1967R587
22192a03090L6726K2522L436n9207J02731P0392J8412o5314j49239K7960R2349
22181b322r4798k2202K1919P9514J15048J8163j7366L046O5460n590j65707l3684
22169c8519J16451J40472j36849o8009N2599k1684n1253L0831K9043k2923L222
22158C3381o1632j1993j1858O0300J12236j3326O3675K630m0268o3226p0047l9260
$$ y = [-2770, 41373, -102962, -192039, -154797, -154709, -192692, -159830, -154908, -58789, -4033, -71845, -135958, -126261, -61582, 112857, 109083, 31119, -43240, -7491, 43376, -35870, -173955, -105040, -49649, -28987, -96506, -124526, -218992, -313869, -263804, -189755, -159130, -118322, -13676, 5005, -34546, -110954, -112318, 16502, 150086, 164332, 59881, -80710, -112677, -103090, -66364, -43842, -40406, -99613, 3118, 73510, 91922, 26608, -122631, -94671, -2322, -97120, -119322, -97403, -17889, 97159, 115322, 97956, 101002, 166462, 160872, -4835, -38519, 77932, 218404, 81555, 13546, 66145, 44461, -6792, 24039, 53082, 30159, 33381, -28251, -40244, -52102, 8198, 120434, 107108, 170783, 173413, 133145, 69919, -128, -39388]
22146c9388q8379q966O4413Q0378K0911l8907n468k0982j18529j4408M5157K5553
22134i8615J3931k0363o0740Q9462J38345k9954j31195m9837J7803M8761l3830
22123a16232K874J68693J460l5823l3030k4215J1083l944L3587o3080j38561N0776
22111a46412Q5638P2929L3909j02344o674J57027J4377k7359j11823j88503P1985
22100a47250Q8356l9900n9537K5068j2735K3376M6784k5864O6570j5704q196m0280
22088i9312l7034O5546l7424J03473m7266k9732J45216m914l8076L5125k5397
22077C0205O546m7388O9004M5630R0057j71034j73498M857O5759j20475l6621
22066b36958P5413J13206J16261l5261l3452o4229k0142R6311j2962J0900r985
$$ y = [-39388, -127767, -136733, -72320, 8058, 28969, -9938, -15406, -36388, -154917, -169325, -124168, -98615, -84684, -105047, -165787, -76325, 62020, 32066, -99129, -148966, -131163, -82402, -116232, -113358, 55335, 56795, 20972, -12058, -36273, -25190, -29134, 4453, -58627, -197188, -146412, -60774, 12155, 46064, -56280, -62954, 94073, 108450, 81091, -30732, -219235, -147250, -58894, -98794, -158331, -133263, -145998, -122622, -75838, -101702, -35132, -50836, -59032, -99312, -136346, -70800, -108224, -4751, -52017, -81749, 63467, 58553, 20477, 55602, 30205, 36751, -10637, 58367, 103997, 194054, 23020, -150478, -145621, -79862, -200337, -236958, -161545, -48339, 67922, 32661, -791, -65020, -85162, 11149, -1813, 9087, -898]
22055h98M3018K55j86446K6229P3341q7571j916J6484n093L0470m1496N4207o9214
22042a48630m8792J14779M3406j438J5248n9316p8167R515N5312J04680k622n2864
22030d8889P9345l4336O138J34o302n9280L3534o15j8556L3522Q3295p2488r2879
22017i7377p7478M2133J33729J01395J5952P3723n1328n2646P395n5206m8814
22006h522p071N3294N0325N7049j35070j51734l7206J1973m931R426L5368J72019
21994D4920J00763J6217m5538r2084j73060p1509P1300N5385N936K01820J45083
21983B59233j06794j09736J08478m672r6967m1620o3136r0983l8575J3600M3441
21972a27731l3998k7439Q6835N4058n9689M3331L1294q909p3052K94M7576m3033
$$ y = [-898, 42120, 42375, -144071, -117842, -44501, -132072, -133988, -117504, -122597, -92127, -133623, -79416, -148630, -197422, -82643, -39237, -40675, -25427, -84743, -162910, -153395, -98083, 6597, 3975, -48889, 30456, -3880, 2258, 2392, -3910, -63190, -29656, -30271, -48827, -15305, 67990, -4498, -97377, -174855, -132722, 1007, 102402, 118354, 192077, 140749, 88103, 95498, 40292, -8522, -15593, 37701, 88026, 145075, 10005, -141729, -178935, -166962, -171893, -162467, -127099, 44920, 145683, 161900, 116362, 24278, -148782, -220291, -148991, -93606, -87670, 114150, 259233, 152439, 42703, 151181, 146509, 49542, 7922, -55214, -146197, -184772, -171172, -127731, -161729, -189168, -102333, -48275, -107964, -64633, -33339, -42248, -115300, -115006, -67430, -110463]
21960a10463R4190J13615j236O0564j6810q8603n4283n3187p612L4082R9873q8489
21948a8359l6968m2011J19598N8664N2148N9143j29363l6767j80434N8836m062
21937i9575p241Q2797M3916J0669n4313j9516J16448l0558J5457R608j17425r1290
21925a41023M0641J19113j2056P9834n726l9982P4394k2530r0335n1672O6662
21914A7320J1246q9549K0250O5985K3085n42m7463r8407J4969O8426O1082p889
21902C8513Q1947j50698m5299n3597L2376J94981R0102n9740r0913R6043R2084
21891B25799j1712k3306j40120q3798j27915m520J09212m1171q6637M3472L1929
21880a08767L1000J0994J0877N687k8205R8538J37501l1439l2363L9626r9948
$$ y = [-110463, -16273, 97342, 96106, 156670, 139860, 51257, -3026, -56213, -63825, -29743, 70130, -18359, -55327, -97338, 22260, 80924, 133072, 192215, 62852, 26085, -154349, -95513, -99575, -106816, -24019, 19897, 30566, -23747, -43263, 73185, 42627, 58084, 67692, -49733, -141023, -100382, 18731, 6675, 86509, 80783, 40801, 115195, 92665, 2330, -49342, 17320, 28566, -60983, -40733, 25252, 48337, 47795, 332, -98075, -83106, -14680, 46402, 38513, 120460, -30238, -75537, -129134, -96758, 98223, 188325, 128585, 37672, 133715, 225799, 214087, 190781, 50661, -33137, -161052, -165572, -56360, -97531, -184168, -140696, -108767, -77767, -66773, -55896, -50209, -78414, 20124, 157625, 126186, 93823, 133449, 33501]
21869C3501M2977N2795j09990J2284k8746R1021k2669r3199j21458k4371M3382
21858a24473L6318M8175l5860L4009O3424j04510j5185l5491M8928M7909N8882
21847B2126R2633l2481m8150M7762m3872M7457L5282o8864l6541j50515K4296
21836a10867k9193o7043J26614J50451J2188r2536P9565J46880k4819j59107j29095
21825i6962P0261N4314q1187n4736M3305j02233j5445R7687J05265r779j5850
21814e360K4442j13475k3223R2014J18359R0501M4228M227j9964j19470j21050
21803b8771o8737k1835Q1416J18122M1429l842j16475p2256o0099j38049R6389
21792a72708J23449n2090j2321q0228J1151K23072R5256m3786L5596j4155m1447
$$ y = [33501, 76478, 129273, 19283, 31567, 2821, 93842, 71173, -22026, -143484, -167855, -124473, -88155, -39980, -75840, -41831, 21593, -82917, -98102, -133593, -84665, -36756, 22126, 114759, 82278, 34128, 81890, 38018, 85475, 120757, 51893, 15352, -135163, -110867, -140060, -207103, -80489, 69962, 82150, -10386, 69179, 216059, 191240, 32133, -96962, -26701, 27613, -53574, -108310, -65005, -167238, -182683, -84996, 20269, 10490, -5360, 19082, -94393, -117616, -25602, 92757, 183258, 227486, 231713, 211749, 92279, -28771, -97508, -119343, -37927, 80195, 121624, 117782, 1307, -70949, -131048, -269097, -172708, -49259, -101349, -113670, -193898, -182747, 40325, 135581, 91795, 127391, 113236, 71789]
21781G1789P7518J7427l0532M3803m4106k7478j21520L3963J10423N1772j07332
21770G5727O7166k2351n111q3100J5391O9112r8276o1623O3672j05616r9479J56651
21758b7837J70726P037j21286j01899j8858K2730Q1401l8723p0077O4200k7226
21747e9812k7382P3882J6950m6565m0118j69678J3590L9849M1500L9972q1137
21736a98949J1807J60293J36109o269O9544j3374n5473j05978J3096k3962n0854
21725f4010n2398M2368N4295j5892M698J36697O3757l7798p3967l6836q428N3066
21713F5552J5837k979M4088N9398p3871p910j00894j66883m2786M0628P8956J28549
21701C7685j388M3526Q1904l7427M5341J0082N2456p0693J7883q4895n992m7529
$$ y = [71789, 149307, 166734, 136202, 180005, 135899, 108421, -13099, 20864, 131287, 183059, 75727, 142893, 120542, 115431, 32331, 47722, 116834, 18558, -43065, 20607, -85009, -184488, -27837, 142889, 149926, 28640, -73259, -92117, -69387, 12014, -26709, -96786, -32586, -59812, -87194, -13312, 3638, -42927, -83045, -252723, -239133, -199284, -157784, -117812, -198949, -187142, -26849, 109260, 102991, 172535, 159161, 103688, -2290, 10806, -13156, -64010, -116408, -74040, -19745, -35637, -30939, 105758, 169515, 131717, 57750, 20914, 12486, 65552, 81389, 78410, 122498, 181896, 108025, 100115, -779, -167662, -210448, -169820, -90864, 37685, 36297, 79823, 161727, 124300, 169641, 179723, 232179, 161486, 179369, 94474, 88482, 40953]
21689D0953L7773J3615n1710j06422k042P689M6580J2375l8611P163j396p695
21677d1728M7130j0759k5278M7700K4091Q7006J2854j85729p4334Q6172J06714
21666G3839j5490j67362j4799n2082L1579R8764Q3318J05208o7652j6949J07787
21655A66161p7773L2893j09553l6805l7236k6234J40103J16901P6093l1626N309
21644B18233r5597q1276K3670K0414l2138J5248j78176Q966O662Q6265N1206J3060
21632E6537L0642J8520n3812j6733N6307o2269O6589L0364q6152l4371K0959k5337
21620A244j6797N3967O6617o6772r6650k0348O48q8872j34249O8734j3678p019
21608b53175J27883P230K4147L1693K2893O6627K0065p97j04024N589L4533k8192
$$ y = [40953, 78726, 92341, 40631, -65791, -67833, -60144, -13564, -1189, -39800, -32637, -34033, -41728, 5402, -5357, -30635, 17065, 41156, 128162, 141016, -44713, -119047, -32875, 73839, 58349, -109013, -123812, -175894, -144315, -45551, 37767, 142975, 75323, 58374, 166161, 88388, 121281, 11728, -25077, -62313, -88547, 51556, 168457, 244550, 212924, 218233, 122636, 41360, 65030, 85444, 53306, 68554, -109622, -100656, -93994, -7729, 43477, 56537, 87179, 105699, 51887, 35154, 91461, 29192, 95781, 126145, 39993, 5622, 26581, 1244, -15553, 38414, 105031, 38259, -58391, -78739, -78091, -166963, -301212, -232478, -246156, -253175, -125292, -118062, -93915, -62222, -39329, 27298, 47363, 46566, -57458, -51869, -17336, -45528]
21596d5528M8374J26648M00l1834J28364k9608j88592q9901j00793m6204O3348
21585a65326m1084N9521N518l915p1038Q8230Q6013J3525r7659M9157N2541M4444
21573A9927Q3216r3312m3015P0961p1267n579m9773n559N164j214n6501n8640
21561b05592n0693J63252J78920K0290j51407j26275j315K20972M3417l2214N4230
21550A13585j05931p5265Q3638n925m2108k3480j0820J4116R5297k2752O0211
21539H0566L3090o6487r5565M8711L2427m0239j3713o519l34J3257r568j28052
21527a52426j40292P83M8614O2093K0375j4388l6275M4976M6565n4286j0014n8155
21515b42430N7250N4496n8786p0134j9408O2633J07805J09526J34972q5890n2727
$$ y = [-45528, 2846, 129494, 129894, 98060, 226424, 196816, 8224, -81677, -182470, -228674, -165326, -206410, -146889, -141371, -145286, -216324, -128094, -42081, -28556, -126215, -77058, -24517, 19927, 103143, 9831, -33184, 37777, -33490, -39069, -88842, -94401, -89237, -90451, -146952, -205592, -256285, -93033, 85887, 106177, -45230, -171505, -172820, 48152, 91569, 59355, 113585, 7654, -67611, 16027, 10102, -32006, -55486, -66306, -52190, 43107, 20355, 80566, 113656, 47169, -48396, 315, 32742, -7497, -21210, -27729, -28063, -14806, -24374, -152426, -292718, -291935, -243321, -181228, -160853, -175241, -211516, -166540, -119975, -174261, -184275, -242430, -185180, -130684, -189470, -259604, -279012, -216379, -108574, 952, 135924, 50034, -2693]
21504b693j17301o5813O0006O5597j17874j00194J13659L4432K9092o9103J56412
21493a3780Q2945j5014k5357m8167J08284p6634j49784L7612K9486k1016L3368
21482e8057J17462m157M22N3659r4635O1279m1717r6419l7868J29724Q7731q790
21470A08634l8721j09150o9690N3127k611K7105l5763j02981j2939J8957n3231
21459b17263m2057N1390P9451N3508O0118O2155M5831n3656J6795M7534k4429
21448G9377o0426j24117l6738J27960L0976q4830O2657J5793r5202P878N3447
21437b3225m6441k8403Q6299J47331J12554k0340n8869k7917m0584p635n6642
21426C6128j6128J12978Q571m1454k9590J3927q7055o1209j19215N9328R195K1344
$$ y = [-2693, -119994, -185807, -125801, -60204, -178078, -278272, -164613, -130181, -101089, -170192, -13780, 69165, 54151, 28794, -19373, 88911, 12277, -137507, -99895, -70409, -91425, -58057, 59405, 55248, 55670, 109329, 14694, 75973, 34256, -62163, -100031, 29693, 117424, 108634, 69913, -39237, -108927, -55800, -58411, -31306, -67069, -170050, -182989, -164032, -217263, -259320, -207930, -128479, -74971, -14853, 47302, 93133, 39477, 56272, 103806, 79377, 18951, -105166, -141904, -13944, 17032, -67798, -5141, 10652, -84550, -76672, -23225, -69666, -98069, -11770, 135561, 248115, 227775, 168906, 140989, 100405, 92770, 36128, 20000, 132978, 141549, 100095, 70505, 84432, -2623, -63832, -183047, -123719, -114524, -93180]
21414i3180J5169K4092L1454l4871l6406J64719N1882l8272m0609K5748K0491
21403I0217l4312j48321j25975J24465k7558O5377P6444l3897P4428M5477r3215
21392A3130j51552N5142M230j16505k1497K4763O8382P7983O2319p6699p6010
21381a36314M1501P5347L0665J3607n8800L3219L0965P719j9973O4097O3975M1554
21369A87562q8419o1488m0927j5209k5492Q2105N8704K7646j9323p7852O4873
21358I2180o491j27850k2069k5899J04984j5929n0611K4839m41L3850N9215o9013
21346c235M507j03988o4642O0827l4475m2482J42936P2234n8724R613q4344k3124
21334a24897K9459N0141K0154j96193r0974R6120l2676n7632J09705K2956Q9579
$$ y = [-93180, -78011, -53919, -22465, -57336, -93742, 70977, 122859, 84587, 43978, 69726, 90217, 55905, -92416, -218391, -93926, -121484, -56107, 20337, -13560, 60868, 106345, 13130, -138422, -83280, -79050, -195555, -217052, -192289, -123907, -45924, 16395, -60304, -136314, -94813, -19466, 11199, 24806, -33994, -775, 30190, 37909, 17936, 82033, 146008, 187562, 99143, 37655, -3272, -18481, -43973, 38132, 96836, 124482, 105159, 27307, 92180, 85689, -42161, -64230, -90129, 14855, -1074, -51685, -26846, -27287, 6563, 65778, -3235, 1272, -102716, -167358, -106531, -141006, -183488, -40552, 31682, -27042, -17429, -101773, -124897, -95438, -45297, -25143, -221336, -312310, -216190, -248866, -306498, -196793, -173837, -84258]
21323h4258K47Q7735P0048P4193N7634m0931j3170n7677j90531K7706N3012M2132
21311B6140o8198J2794M1070N4303Q6569J19233m3307q7983l887k4326N13j2657
21299A00264P2098k7985j11258k8802q0617j09831J8661O364j9922J87856J39610
21288A46438o3859o3465N4674Q361j19603N6700M6185K9207p8327k17587j15773
21277c17049O6302J19955P7645O5741J46004K9828J881m6625L9931O4357j35723
21266A12247j26964O4861j20634q722N8002J1466K3830l250K1790N4449Q402m119
21254I1358m646p2321q2767p6419J26998K4766K2397Q9795J20498K0106J06662
21243C66427l0749n6186j04272P43M3438j16159j46582k3382o345N5061Q8581
$$ y = [-84258, -84011, 3724, 73772, 147965, 205599, 164668, 151498, 93821, -96710, -69004, -15992, 26140, -42058, -29264, 11806, 66109, 152678, 271911, 228604, 140621, 136734, 112408, 112921, 100264, 172362, 144377, 33119, 4317, -76300, -186131, -167470, -161106, -181028, 6828, 146438, 82579, 19114, 73788, 82149, -37454, 19246, 65431, 94638, 16311, -201276, -317049, -250747, -130792, -53147, 12594, 158598, 188426, 190307, 143682, 183613, 247970, 112247, -14717, 50144, -70490, -79212, -21210, -9744, 14086, 10836, 32626, 87075, 95477, 91358, 86712, 14391, -68376, -144795, -17797, 6969, 29366, 119161, 239659, 259765, 366427, 335678, 279492, 175220, 175963, 219401, 103242, -43340, -66722, -73067, -18006, 70575]
21232G0575R2194M7902j5474j17251j30829l1638P6812l8112M8966R0935L6058
21221A30138K7524j2701o6252n0386K2286n5375K4444R113P6496m5970j22736
21210f3419O0765j1031n7895O5039k0928N4509m3128O9342J18791j8547p2020
21199H1478o6107M2372J79074J34763l3552j7949l5256p9099k6859M6172o2348
21188A62689O9808O0071j42795n6100K9795p7189N5255k9433m4696P7539l8554
21177F6390j02633R075P1864J4057j84449Q247R4197J26380L4397j36292K3575
21166B4808L4773j33325Q8836J52949R7622j65656k05962J9119K6755l3324j1335
21155a04740J21431N5093n0847o2697l6706O438N8095K5236o1406J5470r362r7069
$$ y = [70575, 162769, 210671, 195197, 77946, -52883, -84521, -7709, -45821, 3145, 94080, 130138, 157662, 144961, 78709, 28323, 50609, -4766, 19678, 28791, 105287, 59317, -63419, -2654, -13685, -71580, -6541, -27469, 27040, -16088, 53254, 172045, 153498, 81478, 15371, 57743, 236817, 371580, 338028, 320079, 284823, 205724, 178865, 225037, 162689, 232497, 292568, 149773, 93673, 123468, 46279, 101534, 72101, 27405, 104944, 66390, -36243, -27168, 44696, 58753, -125696, -117449, -23252, 103128, 137525, 1233, 24808, 59581, -73744, 15092, 168041, 265663, 100007, -105955, -86836, -60081, -93405, -104740, 16691, 71784, 20937, -41760, -78466, -72028, -13933, 11303, -50103, -34633, -43995, -141064]
21143a41064M5640N1883P1P4530J9176l4667n5613j9499O5856J25499j1251q2150
21131C8411r8360O3592R2410M2926N3855n4004o8671m6855n8250R5259q982j2536
21119C8795L0250m2674j5415j03251K0704O3023m8405k1021L1937q7336K4189
21108a09204J38031N2917J05863L4245r8573J25125J3833p0937j02418M4766j6589
21097A17059j04315J0027N3378L5675K25p553p8615o5990L5680J9543q0953J3351
21085e2488J27783O1107n5504o9656o8378N9533n2685q2611n960N1839n1551J20183
21073a8388J04274j697j8148N3551p3828K4424N6513L4711o1442k6988L7305r6035
21061A4252N4154O5144j9503k41376r014O0016J00351J01972k4939j17891q2715
$$ y = [-141064, -95424, -43541, -43470, 31060, 50236, 15569, -40044, -59543, 6313, 131812, 120561, 38411, -59949, 3643, 96053, 138979, 192834, 138830, 70159, 23304, -34946, 60313, 51331, 38795, 69045, 26371, 10956, -92295, -71591, -8568, -56973, -77994, -46057, -133393, -109204, 28827, 81744, 187607, 221852, 123279, 248404, 262237, 191300, 88882, 133648, 117059, 12744, 22771, 76149, 111824, 112049, 104496, 25881, -40109, -4429, 15114, -65839, -52488, 75295, 136402, 80898, 11242, -57136, 2397, -50288, -132899, -138859, -87020, -138571, -18388, 85886, 84189, 66041, 119592, 45764, 70188, 126701, 161412, 99970, 72982, 110287, 14252, 68406, 133550, 114047, -127329, -136343, -76327, 24024, 125996, 101057, -16834, -99549]
21050i9549J2097Q6326J1470n0499m7393M8640N9793r004j30078j5667J59825
21039B5961K3850M9957L2674j49895p3026P4703q8357N4920P8830k2344l7046
21028b9773p3028j2819K0569P3152j4284o5675O978Q6072j8583j8123o6916r4893
21016b07323O3363J63851N0342M827M3987k6690m8882P5858p938n6833k3902j5563
21004A5097L937Q472j5550J00820k4404R8978J36710J0013j97625j47441N0164
20993C9171k381K9014n0967p2470L8347J03531j23134j66479J58481J21536Q3722
20982A58371N8701O5429n3891k04314k7065k9646l9599J31862O4251J51110k3009
20971B52200j78457p1306p7582J08710J81712p1919o7886K2193J3117j1233O6665
$$ y = [-99549, -87452, -1126, 10344, -40155, -87548, -38908, 20885, 11881, -118197, -133864, 25961, 49811, 99768, 132442, -17453, -90479, -15776, -104133, -49213, 29617, 7273, -29773, -102801, -115620, -95051, -21899, -36183, -101858, -94880, -8808, -27391, -45514, -112430, -207323, -143960, 19891, 70233, 75060, 119047, 92357, 43475, 119333, 111395, 54562, 30660, 15097, 19034, 27506, 11956, 112776, 88372, 187350, 324060, 334073, 136448, -10993, 39171, 36790, 65804, 14837, -57633, -19286, 84245, -38889, -205368, -46887, 74649, 158371, 217072, 282501, 228610, 24296, -2769, -32415, -72014, 59848, 124099, 275209, 252200, 73743, 2437, -75145, 33565, 215277, 143358, 75472, 97665, 110782, 99549, 166214]
20960A66214j9202q3966p6799j27392l024K8220n4943P8136J16498K8587j841
20949E0488m5820k5967q7561j3978O5274l004P351J7659K4132M745m04L5435n1258
20936b2908K9312l066K516k1471Q6071M0965j24498k9256J51487J2789M3863n2370
20924A13434o7497j8699N4435J003L3677O1641r8701o5704j13925P1477J22406
20913I3547M4722K6330R294k0652j10109n6209k2223o0414N5699K7834p3585p00
20901h6466L5937p8561k7898J5633L5403J3542m5365j37044J68902K12947q9622
20890A7408j48309l5297o02j8902L5709R6521M7250k3231L4177P4193P1322m0703
20878A09536q6349P420J51441P0851P9638J54088P3211J34978m3908k42030j48491
$$ y = [166214, 147012, 63046, -13753, -141145, -144169, -115949, -170892, -92756, 23742, 52329, 50488, 4668, -21299, -108860, -122838, -57564, -60568, -53217, -35558, -11426, -6681, -7085, 28350, -22908, 6404, 3338, 5854, -15617, 70454, 111419, -13079, -42335, 109152, 121941, 165804, 113434, 45937, 27238, 81673, 82676, 116353, 177994, 79293, 13589, -100336, -28859, 93547, 138269, 164599, 173893, 153241, 43132, -13077, -35300, -95714, -40015, -12181, -85766, -86466, -50529, -129090, -156988, -141355, -105952, -92410, -137775, -274819, -105917, 107030, 17408, -130901, -166198, -166800, -185702, -149993, -53472, -6222, -29453, 4724, 78917, 150239, 109536, 23187, 30607, 182048, 252899, 332537, 486625, 559836, 694814, 650906, 408876, 260385]
20867B60385m4427J9592P9871K16744K77369K1494k06038j64550m8308j22193
20857B89939j27318k2949Q0188O8278p4304p4364Q1879l251k6109Q1974k4155
20846B49808p742j2925k09206k5490J39492o0619o1328k8139j1506K1022Q4374
20835G7741P3394J0896q985Q0280Q9299n3101k5788L5485O8286J68801J59912
20824F76220J88953k0402k52732j41440j3914P3174K00386J91644n3357j79292
20814F69240j66683j37019j16532p2102M7596n0503L7555R1059m2265o0791m2516
20803A57039k3345m6506l0608R6914M6304o9515p702r3682L6965L001L8982l0276
20791G7571P3851Q9689N7668L2529m5935r4785o6313l2485O8979m8055j6381n7929
$$ y = [260385, 215958, 235550, 315421, 532165, 809534, 831028, 624990, 460440, 412132, 289939, 162621, 139672, 219860, 288138, 213834, 139470, 221349, 218098, 191989, 273963, 249808, 242066, 229141, 19935, -5555, 133937, 73318, 11990, -16149, -27655, -6633, 77741, 151135, 162031, 153046, 233326, 322625, 269524, 243736, 279221, 347507, 516308, 676220, 865173, 844771, 592039, 450599, 436685, 509859, 710245, 901889, 848532, 669240, 502557, 365538, 249006, 176904, 224500, 173997, 211552, 302611, 260346, 199555, 157039, 133694, 87188, 56580, 153494, 199798, 130283, 122581, 28899, 65864, 68865, 107847, 77571, 151422, 241111, 298779, 331308, 285373, 190588, 124275, 91790, 160769, 112714, 96333, 38404]
20779C8404o3271j01158o3452K5472L7805M3706j2882J9027p063L1307L4428J04380
20767H6703P650j26997o6998J13930K2658J41997J10582M3505l7701j14379j24469
20756E6481M1953k8685p9508p179J26922N7619q4234j01314k2385M2859q213P8801
20744G3117m9033m260M5771o0800J17612l2605J7835j25754r8297Q2241R8251
20733F4078R0221r5126q2310m0771J7541O5823k2861n4028j7312j00259L6473
20722a38531N3590N6978M3179Q891K5548j0460n2134J28205j9204q3853L1354
20711D3563L7323q8079p5395P5868K22489n0949j57688M7434o724j9438K5768
20700E4172J5475k9542l7044Q1576j38059K5815J75501J01566n6651j13228j0563
$$ y = [38404, -24867, -126025, -189477, -164005, -126200, -82494, -95376, -76349, -83412, -52105, -17677, 86703, 94353, -32644, -99642, 14288, 36946, 178943, 289525, 333030, 295329, 180950, 56481, 98434, 69749, -9759, -16938, 109984, 167603, 83369, -17945, -40330, 2529, -5684, 73117, 24084, 19824, 65595, 4795, 122407, 89802, 107637, -18117, -116414, -34173, 64078, 154299, 59173, -23137, -63908, -46367, 19456, -3405, -57433, -74745, -175004, -138531, -84941, -27963, 15216, 24107, 49655, 39195, -12939, 115266, 96062, 12209, 43563, 80886, -7193, -82588, -6720, 215769, 164820, 7132, 54566, 47842, 28404, 54172, 69647, 40105, 3061, 84637, -53422, -27607, 147894, 249460, 192809, 79581, 69018]
20689F9018L6086O3974j3638j06013n8167o5980L8211Q8665j4582p5437l6066
20678g3929o3053K9741K2643Q2306O8087O3402O8009o4299q9784M6313P3512l5608
20666A27340l6518M0526L6386q4857p6065J05864M5056k4526n4606r3557N502
20655i455o6561N1569Q4465P9544J07657n921j36919k9595L9567k4506J5467j09592
20643d280l8154j2186K085J1071o4193o1690J7031P6128j5180Q6557J69626J12196
20631B79011k8559j03886j90082n067K09681J65321n1112j58698k5091O2603o0911
20620I3210j02453l0262J3242m3941q3746J03936J57438J09146Q1132o0073j14353
20609A23276n6214N8342n3226L0769P4541p3725K6059N867n8188P4829M3542R8424
$$ y = [69018, 105104, 169078, 155440, 49427, -8740, -74720, -36509, 52156, 37574, -37863, -73929, -136982, -107241, -84598, -2292, 65795, 129197, 197206, 132907, 43123, 89436, 162948, 127340, 90822, 131348, 167734, 82877, 6812, 112676, 157732, 133206, 78600, -14957, -9455, -76016, -24447, 60018, 139562, 247219, 241298, 104379, 74784, 114351, 89845, 105312, -4280, -42434, -54620, -52535, -41464, -105657, -167347, -150316, -74188, -89368, -2811, 166815, 279011, 250452, 146566, -43516, -48583, 161098, 326419, 275307, 116609, 91518, 154121, 93210, -9243, -39505, -26263, -70204, -153950, -50014, 107424, 216570, 297702, 237629, 123276, 67062, 125404, 72178, 102947, 177488, 103763, 129822, 135689, 77501, 152330, 195872, 294296]
20597B94296l6864L110p7151m5465j04980K7686J84074R4952O2887j05551m7924
20586B49070l9415J15178n5161j6104M9146K5596p7882j05643q3589o6765Q8091
20575H2522P0411J07557J7563r7485l0341M4032q7594n853P1215j204R8292r6319
20563A72796j46758K0265J74486Q8240j223p4878N7605r9890p7914L1989o883
20552A37835j33468K090r359R1889k0258q6276M9775m7586o0783m0339J22295
20541E815Q2051O0662K9392M2830l1955M3171j764K4065p7306P9033k3407j1834
20529B20753l4248k7905O9860J04666k5214m4791m2896K0824l7137N9658j8611
20518B44959k9110J21385l6273n1820L608K12456J1488p8691p3853j03167p4816
$$ y = [294296, 257432, 260542, 183391, 137926, 32946, 60632, 244706, 339658, 402545, 296994, 249070, 209655, 324833, 269672, 253568, 302714, 328310, 250428, 144785, 61196, -5569, 82522, 152933, 260490, 278053, 180568, 150227, 194259, 106665, 100812, 172027, 170823, 269115, 172796, 26038, 46303, 220789, 309029, 307806, 232928, 290533, 190643, 112729, 144718, 137835, 4367, 6457, -2902, 88987, 68729, -17547, 32228, -15358, -76141, -116480, 5815, 87866, 148528, 177920, 220750, 188795, 231966, 230202, 254267, 176961, 255994, 232587, 220753, 186505, 158600, 228460, 333126, 307912, 263121, 220225, 241049, 203912, 263570, 244959, 215849, 337234, 300961, 249141, 252749, 465205, 476693, 398002, 324149, 220982, 146166]
20507A46166j5933r9165J11903J71869M5746m4008J30765K74325J20003k61653
20497E80018j81177k6070m0570j68879j0842K5075N1624j2271J37890K29458j02009
20486D82247k65695j29530o5175r286o6062O1768K35157J77978O8620J250p284
20475D83988j59485p0185J21880J5267M9010O1026N5502R3634J89525J54886L94984
20464A390032N11886K95251m10000m52764j01507O8406J85788M57099O36075j92434
20454B387832p02314n52173l04372j54499L0568j0859J7512J43020J87508K34160
20444A276383J70826j91966k00763o8609o7119M4688K62355J30687j07626k03290
20434A045566j06631m3453o629k2567L4333N4547J6773M6330K6193j04673R5127
$$ y = [146166, 130233, 31068, 142971, 314840, 360586, 316578, 447343, 721668, 841671, 580018, 398841, 372771, 332201, 163322, 152480, 177555, 229179, 216908, 354798, 584256, 482247, 216552, 87022, 21847, 12561, -53501, 8267, 243424, 421402, 490022, 491272, 483988, 324503, 254318, 376198, 391465, 440475, 501501, 557003, 650637, 840162, 995048, 1390032, 1901918, 2197169, 1787169, 1334405, 1232898, 1301304, 1487092, 1944191, 2580266, 2387832, 1685518, 1133345, 828973, 674474, 705042, 694183, 711695, 854715, 1042223, 1276383, 1447209, 1255243, 1054480, 985871, 918752, 963440, 1225795, 1356482, 1248856, 1045566, 938935, 895482, 888853, 866286, 900619, 955166, 971939, 1018269, 1044462, 939789, 1034916]
20423A034916n929k4339K79470M32282N65758L39339m88626n60949j10958k5055
20413A435909K20465N73371M94867j67974n94640l03309j56009k92859l35281
20404H74540p4087J29238N8494L5443m2827r2755p2316o9729O70J35234J04616
20393I86521L2956R7445K68229J97680K70594K4511k52043j45839q8346J49328
20383A541036N03177M84700L46247R605o0226k15026j38331K57524N23053K65475
20373C517234n4494q1798j03650n2308K60337M38857K40866j98472j20392J81675
20363D027855K70863L64329O13421P86613J089453J626702K391777L428470N633461
20354B0232944R546321J6207915K8609281M7275193M1670457k1664642m5301916
$$ y = [1034916, 1028987, 1004648, 1284118, 1716400, 2282158, 2621497, 2132871, 1571922, 1460964, 1435909, 1656374, 2229745, 2724612, 2556638, 1961998, 1658689, 1502680, 1209821, 874540, 800453, 929691, 988185, 1023628, 980801, 888046, 815730, 746001, 746671, 881905, 986521, 1019477, 1116922, 1385151, 1582831, 1853425, 1877936, 1625893, 1480054, 1391708, 1541036, 2044213, 2528913, 2875160, 2884765, 2824539, 2609513, 2471182, 2728706, 3251759, 3517234, 3462740, 3380942, 3277292, 3224984, 3485321, 3924178, 4165044, 3966572, 3846180, 4027855, 4298718, 4663047, 5276468, 6063081, 7152534, 8779236, 11171013, 14599483, 20232944, 29779265, 45987180, 74596461, 121871654, 163542111, 141877469, 96575553]
20347I6575553k1242441R0761J9305637M1817891L6554580l1232007n6572869
20340H5297105l3296945j7207226r776418n762149l911818k772493j681103j210788
20332I678165j167635p11683j43374j5468k88119j40808P6345j44629k01587K5700
20322F966907M27051K5969m18924O193L28092Q811J45829N14676P40822R06101
20312I651527J535699K496687L973821O713569J1715717K0301057L5972028N4658160
20304A47018265K9880967l9364616m3665039j5473289N720196K7115718M7992700
20297A59224902K2266939m8730449n4521502k9520042j5698819r108903n582710
20290A8329416m011411k870218j838265r15939n22391o57645j164276j109176
$$ y = [96575553, 75333112, 75423873, 94729510, 136547401, 173101981, 141869974, 85297105, 52000160, 34792934, 25016516, 19254367, 15342549, 12570056, 10888953, 9678165, 8510530, 7798847, 7655473, 7640005, 7351886, 7211078, 7287423, 7142794, 6941207, 6966907, 7393958, 7419927, 7001003, 7007196, 7335288, 7344099, 7489928, 8004604, 8745426, 9651527, 11187226, 13683913, 17657734, 24371303, 36087020, 56388077, 92360105, 147018265, 176899232, 137534616, 93869577, 78396288, 84116484, 111232202, 159224902, 181491841, 132761392, 78239890, 48719848, 33021029, 23912126, 18329416, 14318005, 11447787, 9609522, 8693583, 8171192, 7513547, 6349271, 5240095]
20282E240095m08430J81198N22129N56743j09986q03872p98674l59177k49979
20273C770047j29262n4604l45240l43800k93026m42192n59213l64161q9742q0650
20263A068157p3079j04677j20049j01890m5640P9598l7933n4472M7406m3373K5334
20252F39382K444j51361R679J01874P3543P0446N9084m8471J70791J98352N66836
20241A692599P45534j14603n59600n85895j50646K40080O04383O68353j4543q02005
20231A723657o83803l81439j13146o6749k10979p9016M5118R3432j07437K238
20221B21876K8957m814R2345J36266j9716K8419o6121l0015J1960L9916p384j61246
20209B70443k01583l9749N0319l4675O8014J67359n3237p5996j3374K3820q054
$$ y = [5240095, 4831665, 5012863, 5534992, 6091735, 5981749, 5177877, 4379203, 4020026, 3770047, 3640785, 3586181, 3240941, 2897141, 2604115, 2161923, 1602710, 1238549, 1148807, 1068157, 995078, 890401, 770352, 668462, 622822, 702420, 664487, 610015, 657421, 614048, 639382, 641826, 490465, 500144, 602018, 675561, 746007, 805091, 756620, 927411, 1125763, 1692599, 2438133, 2323530, 1763930, 1178035, 1027389, 1267469, 1871852, 2540205, 2525662, 1723657, 1039854, 658415, 545269, 478520, 267541, 188525, 233643, 327075, 219638, 221876, 250833, 246019, 338364, 474630, 454914, 483333, 417212, 387197, 399157, 439073, 431689, 270443, 68860, 29111, 79430, 44755, 112769, 280128, 226891, 150895, 137521, 161341, 153287]
20198A53287K7434R3899N6733o0313j56282j34553J25545q2174j42323l3782J21520
20187c1009p0729p65K8117J28137Q3194j61530N277J50436O1734j19622k8170
20176D5070L4321r938L6840R9130J23167K15q462q0670k3187j9253M6602R8619
20164C42454k1907p2075j1987L4808J1815M6804p4847L0565l6858Q62J18465J34119
20152E02218J70161K68265M65123K70512m44714m14397k20794j39295p3205P064
20142C90938n4203J08707O2573L4531M69756O40420L4178o29099m89582k56909
20132C11310o4143m1999p303O8444R7272p6068j01311p112K4454j9326j2745n6111
20120A15362l9788m9349O8212R8286j42716j15117L0384R3583Q7112M0152M8175
$$ y = [153287, 180721, 274620, 331353, 271040, 114758, -19795, 105750, 23576, -118747, -152529, -31009, -101738, -102503, -74386, 53751, 136945, -24585, -19308, 131128, 192862, 73240, 45070, 79391, 69453, 106293, 205423, 328590, 328805, 320343, 239673, 216486, 197233, 243835, 342454, 320547, 248472, 236485, 271293, 283108, 329912, 255065, 285630, 248772, 249634, 368099, 502218, 672379, 940644, 1405767, 1676279, 1231565, 817168, 596374, 457079, 383874, 390938, 336735, 445442, 508015, 542546, 1012302, 1652722, 1686900, 1057801, 568219, 311310, 247167, 205168, 197865, 266309, 363581, 287513, 186202, 179090, 203544, 184218, 171473, 115362, 75574, 26225, 94437, 192723, 50007, -65110, -34726, 58857, 145969, 186121, 234296]
20109B34296q5251j80155O4957j34037P5330P1292j51446J53146P5805j16672
20099G265o7879L3313J10744L8973m102k3249r7780j01336j8893j54786L0643
20088b47087J23393J26577R1011M6745j2449j36799J27232M2274j55413q0230
20078g4746K0923Q5772J03821M739J80250n3082o3847O0565K1018M2122p7208
20067B50327j05364o9646O6396m4092p2128Q572K7218K29K0730J9816n2732l7925
20055A1401k9082Q1931M9072J51820k057r7064j42728N9872P9973o2462j10650
20044i974k5143N1201p1378O3616O9330J54869Q7590k7061o1857J61183P3627
20033D66003r8010j6181l2236k8419P9572O2717P9310m3532j91014k01363k8208
$$ y = [234296, 149045, -31110, 33847, -100190, -24860, 46432, -105014, 48132, 123937, 7265, -60614, -27301, 83443, 122416, 118314, 95065, -2715, -104051, -122944, -277730, -247087, -123694, 2883, 93894, 140639, 128190, -8609, 118623, 160897, 5484, -74746, -53823, 31949, 135770, 140509, 320759, 267677, 203830, 264395, 285413, 327535, 250327, 144963, 75317, 141713, 97621, 25493, 34065, 61283, 61512, 82242, 102058, 49326, 11401, -17681, 64250, 113322, 265142, 263085, 166021, 23293, 83165, 163138, 100676, -9974, -35117, 16084, -55294, 8322, 77652, 232521, 320111, 293050, 231193, 392376, 466003, 367993, 351812, 319576, 291157, 370729, 433446, 512756, 469224, 278210, 76847, 48639]
20022D8639n5602j697M0675J65004Q4815J2220L2144L5566l661j6478j44263n4436
20010A42926j2004q2340N3160M6457J15549Q538p6615P894J4576J9883N6942j08237
19998A86729p1105O095k2847l0051j00511m7178L5244J90995J1942J995K1433
19987A82741K5277P7810Q3942J09741o8596o6246K1799N7823N9378P3773J66703
19976G24145l3596J7733L5975j66925j32310o7418r1988M0567J32876P1442n1340
19965D79161r02r9478O0803M4094P056L8307J49804N4637J12648q0267n4251L0214
19953G41826n1121L7818p5561l243J8583J45640J9545q4940O1259J11383J73639
19942A094828R7918K16364K87460J63331j63889L4667J14659J51326J70189L28930
$$ y = [48639, -6963, -8660, 32015, 197019, 281834, 294054, 326198, 361764, 358103, 341625, 197362, 142926, 130922, 48582, 101742, 148199, 263748, 272286, 195671, 203565, 218141, 238024, 294966, 186729, 115624, 121719, 98872, 68821, -31690, -78868, -43624, 147371, 159313, 161308, 182741, 208018, 285828, 369770, 479511, 410915, 344669, 366468, 424291, 483669, 557442, 724145, 690549, 708282, 744257, 577332, 445022, 377604, 285616, 326183, 459059, 530501, 479161, 478259, 378781, 439584, 483678, 490734, 529041, 678845, 733482, 846130, 765863, 711612, 741826, 690705, 728523, 652962, 649719, 668302, 813942, 833487, 748547, 809806, 921189, 1094828, 1192746, 1409110, 1696570, 1859901, 1696012, 1730679, 1845338, 1996664, 2166853, 2495783]
19932B495783L03623M0941J78697L40914K83995M7662M0933J28307M33245O24328
19922D918428P62230R69212J218885J419376K319941L581834N383538R372712
19914B9946156J7155407K9563888M7362772M1976814k1646263m6419758k2955761
19907G4983255p98585J8842512L9719512L5107087k9428424n4742821l2780085
19900E0902451j7017636r554367n701026l979003k847278j703634j191022j230347
19892G678138j248498r22558o80114l49372q4270O1761j15897Q7127L16996R3389
19882D836702m70155m72140j54455J14573M05524M77831K58362j51095j97345
19873D647802K84256M06125L3860M8186L16347M71297Q26660Q27479R90313J227527
$$ y = [2495783, 2799406, 2840347, 3019044, 3359958, 3643953, 3691615, 3732548, 3860855, 4294100, 4918428, 5680658, 6649870, 7868755, 9288131, 11608072, 15189906, 20573444, 29946156, 47101563, 76665451, 124028223, 166005037, 144358774, 97939016, 74983255, 74184670, 93027182, 132746694, 167853781, 138425357, 83682536, 50902451, 33884815, 24330448, 18629422, 14650419, 11803141, 10099507, 8908485, 7678138, 6429640, 5507082, 4826968, 4477596, 4393326, 4455087, 4339190, 4426317, 4743313, 4836702, 4366547, 3894407, 3739952, 3854525, 4260049, 4737880, 4996242, 4845147, 4647802, 4932058, 5338183, 5372043, 5420229, 5736576, 6207873, 7034533, 7862012, 8852325, 10079852]
19863A0079852J939989L162169M630409P223746J3265135K3768425M0712112N9448814
19855A64230651K6372645m6358421m6182915j6336667O804472K9197479M8084384
19848A65811628J6450442n2365641n3133870k8668072j5315885q842255n746693
19841A8189654m051751k714974j712856j374161j448246j222440q39399n72109
19833D253718l09556m0129k47753m27117j86738L6350r2936j35363j3939k37981
19823B598556j53302L736J73286k4411l55547j94545k58912m46353k40911j56869
19813I44728k2462m7027k07400l6040p1241j90921j3395O9012K6727M1218m6950
19802D46249q7550r5272l9862n7634K4328j9418J09972L30554O39100R32335L17364
$$ y = [10079852, 12019841, 15182010, 19812419, 27036165, 40301300, 64069725, 104781837, 164230651, 190603296, 144244875, 98061960, 81725293, 88529765, 117727244, 165811628, 182262070, 129896429, 76762559, 48094487, 32778602, 23936347, 18189654, 14137903, 11422929, 9710073, 8335912, 6887666, 5665226, 4825827, 4253718, 3944162, 3904033, 3656280, 3229163, 3042425, 3078775, 2985839, 2850476, 2836537, 2598556, 2445254, 2448990, 2622276, 2597865, 2242318, 2047773, 1788861, 1342508, 1101597, 944728, 922266, 875239, 667839, 631799, 560558, 369637, 356242, 425254, 451981, 493199, 446249, 358699, 263427, 223565, 165931, 190259, 170841, 280813, 611367, 1250467, 2182802, 2500166]
19791B500166n72324n55266k13404J19205L78880O16201K27471o28264n56043
19782A316622j86884J62861K26783Q3085k55226l42171j48917k9812J58525J20886
19772A105752K4769j22289k37322r9064j16457j45901j14222L1477j8818j07734
19762B00191O3024o780M6368J114O1624L2332J46279J53347J30836K45168L72390
19751A445893N32767o3334n65272m16842j83526j81590n5156j38649o200K02716
19741E70807J73511N09558R90281J142580N68267l46701r40452q49578l69383
19732A448890P2314K73937O46586L06128p89726p15152k88479j804k17900k28428
19722E06366j55993j4766m848m12l128J1418K5930j73774p6146j41452L0162O2859
$$ y = [2500166, 1927842, 1372576, 1159172, 1278377, 1657257, 2273458, 2500929, 1872665, 1316622, 1129738, 1292599, 1519382, 1602467, 1347241, 1005070, 856153, 826341, 984866, 1105752, 1130521, 1008232, 770910, 671846, 555389, 409488, 295266, 326743, 307925, 200191, 263215, 256435, 302803, 303917, 365541, 397873, 544152, 697499, 828335, 1073503, 1445893, 1978660, 1915326, 1350054, 933212, 749686, 568096, 512940, 374291, 368091, 570807, 744318, 1253876, 2244157, 3386737, 3955004, 3608303, 2667851, 1818273, 1448890, 1521204, 1795141, 2441727, 2747855, 1958129, 1242977, 954498, 952694, 734794, 506366, 350373, 335607, 330759, 330347, 327219, 338637, 364567, 190793, 114647, -26805, 3357, 66216]
19710F6216j1363M8924N4262n1068L686M6726J85163J2948j1424m8764n6561p5335
19698A63410k770O4980R5111j0136n1528n7730r6885q6087j3352K0605Q769m6175
19686a1788K6409J86155N5377J9266j8552p2574j53218q9658n6405J91957P8636
19675A55605j13673P5825M5294m3142O7359m1169j13998O131P8635l3263K0551
19664A04155o5110R2755J34036L0176L6801l8701L5087k7253j75699j6945o5171
19653D4131o3270j3462L8300M1981n2368M9164K771p0054o6206n1640J33558J76391
19641A69296N5355m7670N5480J02291r0818k16666l2303p126J33486J67735M1401
19630C30461m6311q3076j21174q7420J5978Q5177K6020p0971m6867J12103R9066
$$ y = [66216, 54853, 103777, 158039, 106971, 110657, 157383, 342546, 355494, 344070, 295306, 238745, 163410, 160640, 225620, 320731, 310595, 259067, 201337, 104452, 18365, 5013, 25618, 34387, -11788, 14621, 200776, 256153, 275419, 256867, 184293, 31075, -58583, -114988, 76969, 155605, 41932, 117757, 163051, 119909, 187268, 146099, 32101, 38232, 116867, 83604, 104155, 39045, 131800, 265836, 296012, 332813, 294112, 329199, 301946, 126247, 109302, 44131, -19139, -32601, 5699, 47680, -4688, 44476, 47247, -22807, -89013, -140653, -7095, 169296, 224651, 176981, 232461, 334752, 243934, 27268, -5035, -12161, 121325, 289060, 330461, 284150, 201074, 79900, -7520, 8458, 93635, 119655, 48684, 1817, 113920, 212986]
19619B12986J6917O277o7584j51671m0586K580J9573l3822o1744R3568L5370n395
19607B6469M3275K6816p8746J13486K5954K3565L1691n7534K9086o6741j13133
19596D188J49666N8552k91J8849j73059m2260J6762J0383K786K7918q1942q4898
19584i3346O0378J47049Q050l4555j12132M6370R3126J7667N1339k576l2315j36283
19572A2772j65474j5873O2569L6560P7337J36955N9955p2925j24274q2388r6214
19561a71000o080J40125K7376p4689l0786Q849K0029l3391n7367J29303J50053
19550A02422m839K3023m1518m7045o3644j9587K7019J47971J99340J65104J64495
19539F52741J91969r180k53767l33293k02816n4521N2068R8110R2414J9976j82906
$$ y = [212986, 229903, 236180, 168596, 16925, -23661, -21081, -1508, -35330, -97074, -3506, 31864, 26469, 69744, 96560, 17814, 131300, 157254, 180819, 212510, 154976, 184062, 117321, 4188, 153854, 212406, 212115, 230964, 57905, 15645, 32407, 42790, 45576, 73494, -8448, -93346, -32968, 114081, 122131, 87576, -24556, 21814, 114940, 132607, 183946, 181370, 149055, 12772, -152702, -168575, -106006, -69446, 7891, 144846, 204801, 131876, 7602, -74786, -171000, -177080, -36955, -9579, -84268, -115054, -106205, -86176, -119567, -176934, -47631, 102422, 97583, 120606, 79088, 32043, -31601, -51188, -24169, 123802, 323142, 488246, 652741, 844710, 835530, 581763, 248470, 45654, -8867, 43201, 141311, 233725, 253701, 70795]
19528G0795k4348P5018j26975j37085n6799l4447J40517O1181l4703O8075R3136
19517I4365j4104j01843n8996N5454O7841k668l3899N2930n7859p7236p151P662
19505g5504l9057j8930Q2450M8590K4018J5203J08267J41607m5658L2026J04413
19494C77425K87012R8977r6078k34682j14297q6135o6059j5564J36908J67045
19484D54552K17934L5061j58484j98464j73475j56612k39432O186J59612L7633
19474a5489k2520k6882K7725J15314n9p5966M4669O5719k3882m8158r3235k5802
19462g8566L9077P350q196M8485Q5521o888N1908j38579p0855k7825J95172J55849
19450B52453q0043L4752K8492j48373j22538k8150Q8073N3453j22256Q6919J79143
$$ y = [70795, 46447, 121465, -5510, -142595, -199394, -233841, -93324, -32143, -66846, 1229, 94365, 80261, -21582, -80578, -25124, 42717, 40049, 6150, 59080, 1221, -76015, -83166, -75504, -114561, -133491, -51041, -2451, 21567, 36770, 145037, 286644, 240986, 273012, 377425, 664437, 763414, 667336, 432654, 318357, 232222, 166163, 150599, 287507, 454552, 672486, 707547, 549063, 350599, 177124, 20512, -218920, -212734, -53122, -15489, -38009, -64891, -37166, 78148, 78089, 2123, 46792, 112511, 88629, 40471, -52764, -78566, -39489, -32139, -40335, 8150, 93671, 86783, 138691, 112, -70743, -98568, 96604, 252453, 172410, 207162, 235654, 87281, -35257, -63407, 24666, 78119, -44137, 42782, 221925]
19439B21925J09592K92155K28667k11635k80304j58044q1806m1822J41289N794
19429B25811m5029P954j9225P6943q4484j33353J4462J06618L243o1017K4221
19418A16144O5583M3681k9922l4044N6842o4727m6980M5689K0530M898L5557j422
19406B11829R463j4745j48141j9221M0393j07568j28247N7673J25584m9523j7226
19395c9729J9580r1293j11113j7115J6089O9346O1989J50305J41545P8835K5229
19384C03668p755j51964j72385q7255K6564K03945J55466q6036K2747J78471J36014
19373E21480J52228o2123j40279p175n4092J72986K86635K28498j70306m22063
19363E05789k31498n0208m3277m8496j40596l1860J59747R5751q7159L5031k0521
$$ y = [221925, 331517, 623672, 852339, 640704, 360400, 202356, 120550, 78728, 220017, 225811, 180782, 188736, 169511, 246454, 161970, 28617, 43079, 149697, 152940, 91923, 116144, 181727, 225408, 195486, 161442, 218284, 153557, 106577, 152266, 172796, 177694, 213251, 211829, 221292, 206547, 58406, 39185, 79578, -27990, -156237, -98564, 27020, -22503, -39729, -20149, -111442, -222555, -239670, -223581, -154235, -92246, 58059, 199604, 278439, 303668, 295913, 143949, -28436, -115691, -89127, 114818, 270284, 184248, 206995, 385466, 521480, 673708, 611585, 471306, 464131, 410039, 583025, 869660, 1098158, 927852, 505789, 274291, 224083, 180806, 132310, -8286, -40146, 119601, 215352, 128193, 163224, 142703]
19352A42703r6631O9436Q3388j00063o6316j7232M2165K06687Q9806j31387j87788
19341C4768r7395K7886N9278L8049j629l7185O6775O4843p4128p3053K8534J4220
19329E0963J5686P848r8957N8964P6614J45036Q0687j8659k6599J46449K53644
19318F91676M48429O7260k65396k46942l5851Q961J06939K03964P947k94051l66620
19307C26316j63740k09716j56145K6897R2147J70671R9409n8588K9097O4106m769
19296B15685n1000j20567P4793N1097n3361J4136j07352j09147l4505P563n9949
19285a72607L3603O9768q7546m6341j8831k7097J04406J00375M786l1199r9978
19274a70661j1505N5824K005L1668J93136L9170p7277J5645o847J1972J0989q2917
$$ y = [142703, 46072, 115508, 198896, 98833, 32517, 15285, 57450, 264137, 353943, 222556, 34768, -62627, -34741, 24537, 62586, 60957, 23772, 90547, 155390, 81262, 8209, 36743, 50963, 66649, 74497, -24460, 34504, 111118, 256154, 336841, 318182, 291583, 438032, 691676, 1140105, 1207365, 941969, 695027, 659176, 668137, 775076, 979040, 986987, 692936, 326316, 162576, -47140, -203285, -176388, -84241, 86430, 185839, 127251, 156348, 220454, 215685, 164685, 44118, 118911, 170008, 116647, 130783, 23431, -85716, -120221, -112658, -172607, -139004, -69236, -156782, -203123, -221954, -249051, -144645, -44270, -39484, -70683, -170661, -182166, -126342, -124337, -92669, 100467, 139637, 62360, 78005, 71158, 83130, 94119, 11202]
19262A1202n926K1235j8304N0628J01896j4220o5126j5493n19q1792p5977j12110
19250b04506M7788J06868K1786l6896J15266p3597o0932p4081j7361M6306R9830
19239b9529k4714m3977O0422m471l1032m0096M857N0859J18262N456K886R9248
19227A68171o4722j28710N1606j3127o091k5987l6411K0290p7667l6111N1790
19216i6969O9947N1819K7176O6018l8839n5180j7514j7260P1784q5891l6356j2697
19204g3962J3789r9800j0792K5692O3822J25932P9075n892j02135j497l3669o6753
19192h6190r0002n5285J67555L0483j8879Q9746N9774J0513M7515M5186m3427
19181A56989n946N7692n1961j6060p5982J15600j1074n5146O2993J20558l5989
$$ y = [11202, 5276, 26511, 8207, 58835, 160731, 146511, 81385, 65892, 65373, -16419, -92396, -204506, -156718, -49850, -28064, -64960, 50306, -23291, -84223, -158304, -175665, -129359, -29529, -54243, -98220, -37798, -42269, -73301, -113397, -108540, -57681, 60581, 66037, 68923, 168171, 103449, -25261, 26345, 13218, 7127, -18860, -55271, -34981, -112648, -148759, -96969, -27022, 24797, 51973, 117991, 79152, 23972, 6458, -10802, 60982, -24909, -61265, -73962, -60173, -159973, -170765, -145073, -81251, 44681, 123756, 117864, 15729, 14232, -19437, -86190, -176192, -231477, -63922, -33439, -52318, 37428, 97202, 107715, 155230, 200416, 156989, 151043, 208735, 156774, 140714, 64732, 180332, 169258, 114112, 177105, 297663, 261674]
19170B61674j76925N7945q1115j24110N6656R246r4724O6607O6460P0507J8379
19159A30600r3837j72159l3029P5864J3581Q1931Q1127j0479p9680N0725j29913
19148h5269n1145R3428K36199J11866o77n8459M0564K3358n2662q1327R477J05797
19136B91150J6883l9430L5261l5940j43126j43223J02407l0176l2118q6765m5438
19125a10515J18182K7726m9214J129q6940J1796P8914N3780j3321m6148N5346
19114D0735J7289Q6485J45580l4665O622p516j00725O378K0708n6084j57099n2812
19102h5104Q8190J06892L5914N6402L6673L9111m9240J00669L4795p3114J1956
19091C03144J1804L1938o6023k0909J24884P0848m9971J04370l3132j8056n9319
$$ y = [261674, 84749, 142694, 61579, -62531, -5875, 3371, -91353, -24746, 41714, 112221, 130600, 36763, -135396, -168425, -92561, -78980, 2951, 84078, 73599, -6081, 44644, -85269, -136414, -42986, 193213, 305079, 304402, 245943, 286507, 309865, 257203, 175876, 185353, 291150, 308033, 268603, 303864, 267924, 124798, -18425, 83982, 53806, 21688, -65077, -110515, 7667, 35393, -13821, -12692, -99632, -87836, -8922, 44858, 31537, -14611, 40735, 58024, 144509, 290089, 255424, 262046, 254530, 153805, 160183, 180891, 124807, -32292, -85104, 3086, 109978, 145892, 202294, 238967, 278078, 228838, 329507, 364302, 291188, 303144, 314948, 346886, 280863, 259954, 384838, 455686, 405715, 510085, 476953, 458897, 399578]
19080C99578l4071j276l4682P825O3063N857K8565J7522K7086l3829n7173J08823
19068D97288O7780M9092k7567M493J00921P5827K44563M62519O15674P14191J64587
19057B969368p96309o63869l36469k98016P6983K82694L54023J09741j51673j2023
19047A534450j00121n7081K54636K77543K73718p345j26861K6884R3547K88975
19037B458345P11190P80696J46097n43581l01800n7537M3414L63548M49474N30391
19027D580237P68944J257312J765728K369007L328537N539084J0039018J7563284
19019D7211151L0750350N1341699N0119338k1773021o0045222l8269379k0159591
19012C9175325j1762953p104620m510641k979704j704157j236812j052725o63589
$$ y = [399578, 365507, 364231, 329549, 337374, 400437, 406294, 434859, 452381, 479467, 445638, 388465, 497288, 565068, 614160, 586593, 591086, 692007, 767834, 1012397, 1474916, 2090590, 2804781, 2969368, 2173059, 1509190, 1172721, 874705, 951688, 1234382, 1588405, 1698146, 1546473, 1534450, 1434329, 1377248, 1631884, 1909427, 2183145, 2175800, 2048939, 2075823, 2169370, 2458345, 3169535, 3950231, 4096328, 3552747, 3250947, 3193410, 3236824, 3600372, 4049846, 4580237, 5349181, 6606493, 8372221, 10741228, 14069765, 19608849, 29647867, 47211151, 77961501, 129303200, 179422538, 157649517, 97604295, 59334916, 39175325, 27412372, 20307752, 15797111, 12817407, 11113250, 9876438, 8823713, 8160124]
19004H160124m86964j92425o43084j224056r74562l00440O7743K26660M074j08682
18994D528388Q544K81870P70925P80664q0565q03816m17404q1422J1135J67508
18984E165827O86140Q07752R87524J234027J606095J684329J884269L175957N980016
18975B3211936J1069606J9159526L3492083N2698085L4648780l7624478n2147729
18968H4507809k7764997j1885412k918290N067151J5246225L0711143M8711432
18961A41675061K5646275m2261607m9804532k7207591j5056931r231908n851054
18954A7907713l804972k355241j557141j323187j104871p42882p51834o45081
18946E622504l46504k72663l93678l27807j57285p9820k88240J8319M12438N79448
$$ y = [8160124, 7673160, 7480735, 6837651, 5613595, 4639033, 4338593, 4406336, 4632996, 4637070, 4528388, 4536932, 4818802, 5589727, 6370391, 6289826, 5486010, 5068606, 4987184, 4998319, 5165827, 5851967, 6659719, 7647243, 8881270, 10487365, 12171694, 14055963, 17231920, 23211936, 34281542, 53441068, 86933151, 139631236, 174280016, 136655538, 84507809, 56742812, 44857400, 41939110, 47006261, 62252486, 92963629, 141675061, 167321336, 125059729, 75255197, 48047606, 32990675, 23758767, 17907713, 14102741, 11747500, 10190359, 8867172, 7762301, 7019419, 6267585, 5622504, 5276000, 5003337, 4609659, 4281852, 4124567, 4044747, 3756507, 3774826, 4187264, 4766712]
18936D766712O80559K48690o67894p47132l76826j31993J06532K90964M84748
18927D654360L81897K57986P35848J280045J601169K029491L631287O831390J1868526
18918C3271999K0615042L5874146M8360193P240308m8954717m0952164k0751949
18911C4702858j1166239o571137m148368k807399j809475j288175j201487j159779
18903D550799q85410m90551m83487l98969l23262k27967k13015r2304j52358j30590
18893A152886K4044Q3746Q7576J48563m9011j95652j36228K8809n627j14273L6760
18882A061593K81396m205k76391k58437q9588j03419j18946K3405K4379o7170
18872D72617j33706j05519R657P7482n3728o295m3484N1737K8671P9138M412j96013
$$ y = [4766712, 5447271, 5695961, 5028067, 4280935, 3904109, 3772116, 3878648, 4169612, 4654360, 5036257, 5294243, 6030091, 7310136, 8911305, 10940796, 14572083, 21403473, 33271999, 53887041, 89761187, 138121380, 145361688, 96406971, 55454807, 34702858, 23536619, 16965482, 12817114, 10009715, 8200240, 6912065, 5710578, 4550799, 3665389, 3174838, 2691351, 2292382, 1969120, 1741153, 1528138, 1435834, 1283476, 1152886, 1176930, 1260676, 1348252, 1496815, 1447804, 1252152, 1115924, 1144733, 1139106, 1024833, 1061593, 1342989, 1338784, 1062393, 803956, 714368, 610949, 492003, 515408, 539787, 472617, 338911, 233392, 243049, 320531, 266803, 260508, 217024, 268761, 297432, 376570, 380982, 184969]
18860A84969q6067O5637J47481k88j32085k4186j28422j10116N9637R6021J09402
18849A81983q3055p3868r6723k6034J02856J17694L4100J11050J22325R9014q4304
18838D05038j26777j8344M9238j45630j03889K4427J49756M8809r7796m0208L5842
18827A80466m4428n0604N0732K6276l3184q9067p2473M1575J08167J17611j9656
18816B15415m837O1449m2476m6537Q0919p8746m6590k2210k2569M2277P0144R4391
18804C00630J05921p1415o5291j41215m4972J4241j28l1314j5672J13801k2097
18793A42489l5122J19021K8568K6794N1001J6720L8871l7348q0138k5153p3723
18782A71980j28911q1633j9154J7887M1868J9199N2097o7279M2449N9061O4388
$$ y = [184969, 98902, 164539, 312020, 311732, 179647, 155461, 27039, -83077, -23440, 72581, 181983, 98928, 25060, -71663, -97697, 5159, 122853, 156953, 268003, 390328, 489342, 405038, 278261, 259917, 309155, 163525, 59636, 84063, 233819, 282628, 184832, 144624, 180466, 136038, 85434, 136166, 162442, 129258, 40191, -32282, 9293, 117460, 235071, 215415, 210578, 272027, 229551, 183014, 263933, 185187, 138597, 116387, 93818, 136095, 206239, 300630, 406551, 335136, 269845, 128630, 83658, 97899, 97771, 66457, 50785, 164586, 142489, 107367, 226388, 254956, 281750, 332751, 349471, 388342, 350994, 270856, 245703, 171980, 43069, -38564, -57718, -39831, 2037, 21236, 73333, 6054, 48503, 107564, 171952]
18771A71952m1860Q3560J59995J51885M56597O40563N5914m07064m55391k53234
18761E62917j70090m9624k5802j29448j58228J7184q208M0407K9107J1269J8868
18750A38352o3272N1738J17947Q5912J83527J53251J59849K03170j02213k47459
18740F80802k9454j74935j20477l8149j28363k43383j46296M5017n274J43818
18730a6694J63019M9292n8962O457L4131p029O4140J1006M5067K14337R2237j12790
18718D84211k34633j53440L9556J495p8319q6670r5231O246J05406Q9436k5445
18707E2612R182J42294R4738R4364P1539K3923j29499j45024m1996j14907P9941
18696A37167q0866o6663Q3148J6146j4190r0052K2724R9872n5905n9485j4077
$$ y = [171952, 130092, 213652, 373647, 525532, 982129, 1622692, 1678606, 1271542, 816151, 562917, 392827, 343203, 317401, 187953, 29725, 46909, 38701, 79108, 108215, 119484, 138352, 75080, 126818, 244765, 330677, 514204, 667455, 827304, 1030474, 928261, 680802, 651348, 476413, 355936, 317787, 189424, -53959, -200255, -155238, -160512, -16694, 146325, 195617, 136655, 143112, 177243, 170214, 234354, 245360, 290427, 504764, 597001, 484211, 249578, 96138, 135694, 137189, 58870, -27800, -123031, -116785, -11379, 78057, 52612, 61794, 204088, 298826, 393190, 464729, 488652, 359153, 214129, 172133, 57226, 137167, 56301, -10362, 72786, 88932, 74742, -15310, 7414, 107286, 51381, -8104, -22181]
18685b2181J9103n091o0443L7619J02300m2217j01968q9117R4335J95914M2843
18674A71097J627k3410K8427M7022p7862n1864r7420k1910o4839j9499k736m3120
18662a54487J01180J65861R2180l2553q8945l2998l2347J6979j8491m7679k9327
18651f0627M9284p2962K4966J09629K397o1341l0526l3333J8893l7484j38673
18640b29777J35929N4007k7635Q790K5203l1817O2028m8862m8858n7517Q759J19453
18628c0297R5104J0080j92859k3322K3090j014P7831j02142J3260r2044K02J2998
18616b09113J02858J7068n3919R6937P6366K7965q2009j7911j0017k1188K8009
18605d4954J00553k4970o506l2486l921O4310n725M020K2105O2686n1249k00904
$$ y = [-22181, -3078, -8169, -68612, -30993, 71307, 29090, -72878, -161995, -67660, 128254, 171097, 172724, 149314, 177741, 224763, 146901, 95037, -2383, -24293, -89132, -108631, -111367, -154487, -53307, 112554, 204734, 172181, 83236, 50238, 17891, 34870, 16379, -31300, -60627, -11343, -84305, -59339, 50290, 52687, -8654, -39180, -72513, -53620, -91104, -229777, -93848, -39841, -67476, -58686, -33483, -65300, -3272, -52134, -100992, -158509, -149750, -30297, 64807, 74887, -117972, -141294, -118204, -119218, -41387, -143529, -130269, -222313, -222111, -209113, -106255, -89187, -143106, -46169, 30197, 58162, -23847, -41758, -51775, -72963, -44954, 55599, 30629, 24123, -8363, -12284, 52026, 46301, 50321, 72426, 135112, 83863, -117041]
18593a17041n629k2628p3357n418J6235k9035Q9338M5994p2219r201o9537Q9694
18581a62804k2796K8119J8252J44620J64150o3365j43434r2173O0428M6763J10789
18570H8549j1685l7532J696o268j2400m9004R2395J5141Q79j14768L7687P4881
18558G9571l8510k9427n9063j09036J2570O3493n0035J8249O779n4718Q9018j70
18546g1279k9460N6662l3115L8341m2098l2226R926L665J44040m7974q5954j32256
18534b21728q988J30031J4167L7699L4460j3106k426k7818Q2881J36689k8075
18523A33786o2951j3656r3352l9160k19245K9125R3320K8611l233M0871K7162
18512g8722r429J57604R088l0546O0746P6670K2092N1186J49505j52383j59486
$$ y = [-117041, -122670, -145298, -218655, -224073, -207838, -236873, -147535, -101541, -173760, -182961, -252498, -162804, -185600, -157481, -139229, 5391, 169541, 106176, -37258, -129431, -69003, -22240, 88549, 76864, 39332, 41028, 34760, 22360, -26644, 65751, 80892, 81771, -32997, 4690, 79571, 41061, 11634, -47429, -156465, -143895, -80402, -130437, -112188, -105409, -160127, -71109, -71279, -100739, -44077, -77192, -38851, -80949, -113175, -103249, -99584, 44456, -3518, -89472, -221728, -230716, -100685, -86518, -48819, -14359, -27465, -29891, -57709, 25172, 161861, 133786, 70835, 57179, -36173, -75333, -294578, -265453, -172133, -143522, -146755, -105884, -78722, -88151, 69453, 78541, 47995, 108741, 185411, 207503, 258689, 408194, 255811, 96325]
18501I6325q9052p8368K4660O4501r4881m7217o100K6250O4307K2779J24669K68866
18489C76739K95871J00092k12810l84613q3665n3133n2495l0639J07090N0091
18479A12528K0741p5119j42161J9381K7989J50241J2409q7853j44079j66450j4791
18468b87164l3811m8069L0706J23926J00315L6281R259o1126p6126r477K567J12318
18456a00401Q7902l9669n8271O7350q8614L3129O1516J16743Q9815J10056k6301
18445B53255j4159J88635J97929J73004k47191k02238o7742m9451j16804K2772
18435A38010J04405K34466K24578M0609j46022j69011j64106j19152J3538k5836
18425A31479n4256P8j00166j00096j25121k1276p529n7926R0898Q7016K9147J50580
$$ y = [96325, 7273, -71095, -46435, 18066, -76815, -124032, -130132, -103882, -39575, -16796, 107873, 376739, 672610, 772702, 559892, 175279, 91614, 38481, -14014, -44653, 62437, 112528, 133269, 58150, -84011, -64630, -36641, 113600, 126009, 38156, -105923, -272373, -287164, -320975, -369044, -338338, -214412, -114097, -77816, -68557, -129683, -205809, -215286, -212719, -100401, -12499, -52168, -110439, -43089, -131703, -98574, -37058, 79685, 169500, 279556, 253255, 239096, 427731, 625660, 798664, 551473, 349235, 281493, 232042, 115238, 138010, 242415, 476881, 701459, 742068, 596046, 427035, 262929, 143777, 157315, 131479, 77223, 77301, -22865, -122961, -248082, -269358, -276887, -334813, -243915, -156899, -127752, 22828]
18413B2828M1778m6595j0311P5774r0907q2621n1267J34995R255k8145n5409n5911
18401a36536O1097j2816n9240R5833k1388j1822m1750J39625J9758J9744P3627
18390A26132J19865J33558K19826L59203n3133l65158k20134q8417p2681j1615
18380A47446M8696j14756j49804O1030j1823k9698R017q2127J8545J22936J9535
18369C8997j7892o2925n6734O3629Q9620P8988o6035q0184J912m150j5823j8671
18357d9268M7445J06858j8620r832L1812l3843j09450j6107k9106p2530O3291
18346h9350R8213j04581P856R2503l3385j0464Q5602o1820l5297R134O4532J14528
18334A37471j3640r1870M6666m2613J6160j12714j2245J06576M7972L9977o9179
$$ y = [22828, 64606, 18011, 7700, 83474, -7433, -90054, -141321, -6326, 2929, -25216, -80625, -136536, -75439, -88255, -147495, -51662, -73050, -84872, -126622, 13003, 32761, 52505, 126132, 245997, 379555, 599381, 958584, 905451, 540293, 320159, 231742, 159061, 147446, 196142, 81386, -68418, -7388, -19211, -48909, -39892, -122019, -103474, 19462, 38997, 21105, -41820, -98554, -34925, 54695, 133683, 67648, -12536, -10624, -14774, -30597, -49268, -1823, 105035, 86415, 76583, 108395, 74552, -34898, -51005, -80111, -152641, -89350, 8863, -95718, -87862, 4641, -28744, -39208, 46394, -15426, -50723, -41589, 22943, 137471, 123831, 31961, 78627, 36014, 52174, -60540, -72785, 33791, 81763, 121740, 52561]
18323E2561j12079j664j06437o087J19062k0167p5181K8832K177j803J16781l2484
18311c6489K5314l4272J2063P2740o2666L825K7539M7876Q0151J06784o4885j35084
18299D2896o0510Q5970k8004j05967j04126R3966K468N557n7594M1380P696J04298
18287B8030J5865k3284Q5705J26068j19567j84676l52N6879j57665R8962K13413
18276A39378N8188N658Q8770o9665j24324K6954q7212j01035R8546M4682j15040
18265c5100j00508N3609o6471j31152J33272P7117j4800p7839K7715J06666J02655
18254G5164J14174M1975r6624n8222J7082l391p3974n3064J0271J9965j7622n5655
18242g9921p0936k6291m6497o8513J67064R2870J73854J15742J07456J7842j40604
$$ y = [52561, -59518, -61182, -167619, -173706, -54644, -74811, -149992, -121160, -118983, -120786, -4005, -36489, -11175, -45447, -33384, 39356, -23310, -19485, 8054, 55930, 136081, 242865, 177980, 42896, -17614, 68356, 40352, -65615, -169741, -75775, -73307, -67750, -125344, -83964, -76268, 28030, 43895, 20611, 106316, 232384, 112817, -71859, -72211, -15332, -172997, -74035, 139378, 197566, 203224, 291994, 222329, 98005, 124959, 37747, -63288, 35258, 79940, -35100, -135608, -81999, -148470, -279622, -146350, -69233, -84033, -161872, -134157, -27491, 75164, 189338, 231313, 134689, 76467, 93549, 90158, 16184, -36880, -26609, -6644, -24266, -79921, -150857, -177148, -223645, -292158, -125094, -32224, 141630, 257372, 364828, 382670, 242066]
18231B42066l2656k6042K7908J6988o1750r3956l8362M3372P8713J01609p8415
18220A79475r9734m8301L5321p5976k555l4756l0610O6444P8503l5663k7261r8015
18208i3128p4300j777L6910j0038K3372L2456N1500K1635J6171l8991P646J12284
18196H3740J51178n8356j32657n649K6969O0379J20351k8330j94438r8988l7107
18185a12908m2814J1437N1371R0345Q5965K6339o4697k8555l0918R6133J9959
18174A01657j0696j02089N4250K0411M9020k8193J1607K0434O785M5539J06805
18163B75530r364K7638q5415r5182J64201P2505M0379L62m7409r0203J40359o5635
18151C27766J0626l5089m6538k695J88265K9670Q7430q8114j45925m0023R05J14909
$$ y = [242066, 209410, 183368, 211276, 228264, 166514, 72558, 34196, 77568, 156281, 257890, 179475, 79741, 31440, 66761, -9215, -11770, -46526, -77136, -10692, 67811, 32148, 4887, -93128, -167428, -169205, -132295, -142333, -118961, -86505, -35005, -13370, 2801, -36190, -28544, 83740, 234918, 176562, 43905, 38256, 65225, 125604, 245955, 217625, 23187, -75801, -112908, -155722, -144285, -92914, -2569, 83396, 109735, 45038, 16483, -14435, 81698, 101657, 90961, -11128, 43122, 63533, 112553, 84360, 95967, 116401, 123186, 168725, 275530, 266166, 293804, 208389, 113207, 277408, 349913, 390292, 390654, 343245, 253042, 393401, 327766, 338392, 303303, 256765, 254070, 442335, 472005, 559435, 471321, 325396, 285373, 286278, 401187]
18139D01187Q5922o454K19525J27244J00995l0344M7251K6906J55536Q8531K00852
18128A417151L27770K75697K16067K19556K54632K38679L33902O55122M77436
18119D416012N95476J051505J506456K345452L190497M565548P295663J3317495
18111C8284104K4760217M5971937Q4487401J18335497J4335571j20585573r3983376
18104A11605778m5006290k2755390j2695368p743167n301753l725173k552528
18097A1826109j858722j671930j535094j209008r79723o84596n23304m98989l48539
18088B516204k06668k48576r0578p1921o8655j71644j09261o2596p2628k22169
18078A191508j58286j18050m3364r4310l4822n8278p4783q5152q7959R0619j8630
$$ y = [401187, 487109, 480655, 700180, 827424, 928419, 898075, 945326, 972232, 1127768, 1216299, 1417151, 1744921, 2020618, 2236685, 2456241, 2710873, 2949552, 3283454, 3938576, 4416012, 5011488, 6062993, 7569449, 9914901, 13105398, 17670946, 24966609, 38284104, 63044321, 109016258, 193503659, 311839156, 326174727, 205589154, 111605778, 66599488, 43844098, 31148730, 23405563, 18103810, 14378637, 11826109, 9967387, 8295457, 6760363, 5551355, 4571632, 3887036, 3363732, 2864743, 2516204, 2309536, 2060960, 1970382, 1898461, 1829806, 1658162, 1548901, 1486305, 1413677, 1191508, 1033222, 915172, 871808, 777498, 742676, 684398, 609615, 524463, 436504, 527123, 508493]
18067E08493j00116M2016l7115O7984K3467l9419j3523j2479j16120k5064J76314
18056D74438r9013j21663r4447n7342j3994P6848K4460r9957j70825j22526R6082
18045a07939J70571J42324N0975l192j73873m4185N7419r3311j8578J03034o9278
18034A3967j2104L5579P4673j8859r3532q9318K2014o113P9394N0135m6246r447
18022A43J4181j0193r3522O3583L0251K2650J01456P7620l7979l4225L0166j02329
18010F1802O947l9122p76K6467q8502m8894j70l1657J31606N4725N0446O0244
17998A83116J57782p6275k43783o871n0836R0030L2725o0180j55420N2149K7044
17987e0519j07944n9424j2619J09493J18719P8342N7133J9771q6463O9385N9813
$$ y = [508493, 408377, 450393, 413278, 481262, 504729, 465310, 451787, 439308, 323188, 298124, 474438, 375425, 253762, 159315, 101973, 87979, 164827, 189287, 89330, -81495, -204021, -107939, 62632, 204956, 255931, 252739, 78866, 34681, 92100, -1211, -19789, 83245, 13967, 1863, 37442, 112115, 93256, -276, -89594, -67580, -73693, 5701, 55836, 9590, 143, 14324, 4131, -89391, -25808, 4443, 27093, 128549, 206169, 168190, 133965, 164131, 61802, 68749, 29627, 28851, 55318, -33184, -82078, -82248, -113905, 17701, 72426, 122872, 183116, 340898, 264623, 20840, 13969, -36867, 53163, 85888, 25708, -129712, -77563, -50519, -158463, -217887, -230506, -121013, -2294, 76048, 133181, 152952, 66489, 135874, 195687]
17976A95687m5785j43136J5662l8532o3714N9413J20988J06575M2352j00394m1472
17965A07644j8703j09656K9172J43079k7007o9908j04753M5793R7130j9020L570
17954G7341m9209j46880M8834R4224K5291L5167j12560j36963P2677J41204N7080
17943A06206o0741j57125Q8033j1560j09335j5735n1285l7534J00107J03718q27
17932d6078j38315J051O3182J6479n3740k2790P5994r1125L2367J77235p879q7292
17920h0911l3289j0325q2618j12911J08561J80357l5520P387J30852J39119P5511
17909B86213r2639j74259M530O8723k131j57917p7847Q13j6459L9192J2455q6296
17897a95622J04764J03829j20150J37442K9500j37147j14395M03J15439R4990
$$ y = [195687, 149902, 6766, 22428, -16104, -79818, -20405, 100583, 207158, 249510, 149116, 107644, 88941, -20715, 8457, 151536, 124529, 54621, -50132, -4339, 92791, 73771, 77341, 28132, -118748, -69914, 24310, 49601, 84768, -27792, -164755, -92078, 49126, 106206, 45465, -111660, -23627, -35187, -144522, -160257, -211542, -249076, -148969, -45251, -46078, -184393, -183342, -120160, -103681, -157421, -180211, -104217, -195342, -162975, 14260, 6381, -80911, -114200, -124525, -207143, -320054, -211493, -31136, -66656, -59269, 71583, 210702, 286213, 193574, 19315, 23845, 92568, 90437, -67480, -145327, -144514, -160973, -121781, -109326, -195622, -90858, 12971, -107179, 30263, 59763, -77384, -191779, -191376, -75937, 19053]
17887A9053Q2151L137l2731l3826P3280L2033p6309n5304j3028m2413l9740j14884
17875a98581k7464P2905J58172J50998o7272q5240m2218j8929J6639l1545Q5924
17864A3389J70385J14195n2345k24711j52383R5187J07541O2405J179m3986j34396
17853d3540k5700J09806M4305o3204m1189J34529j1904k1588l5523m622J2372
17842E3742J5168K4892M721p310N9284k2766q8479j5563m1893O3597j05766o909
17830f7282J56511o996k6206l8768K0123J07477J5637j95662p7659N175p6443
17819a84093M5496N2815q085O6410J47495M2414j05025j7631q2222M9158L8775
17808D5507k6467j05613L154J2576k4559O8590o3872O94P5679j0304O7305k9149
$$ y = [19053, 101204, 104341, 71610, 37784, 111064, 143097, 66788, 11484, -1544, -43957, -83697, -198581, -226045, -153140, 5032, 156030, 88758, 3518, -38700, -57629, -40990, -72535, 13389, 183774, 297969, 245624, 20913, -131470, -36283, 71258, 133663, 134842, 90856, -43540, -69240, 40566, 84871, 21667, -19522, 115007, 103103, 81515, 45992, 41370, 53742, 68910, 93802, 98523, 91213, 150497, 127731, 39252, 23689, -18204, 45393, -60373, -67282, 89229, 82233, 56027, 17259, 37382, 144859, 160496, -35166, -112825, -107650, -184093, -138597, -85782, -93867, -27457, 120038, 162452, 57427, 39796, -42426, 6732, 45507, 19040, -86573, -83419, -70843, -95402, -26812, -90684, -89990, -14311, -24615, 42690, 13541]
17796A3541n0756N6431j99508n5817l4368J35630R7245K8492q5540J1516M091
17785g9043l4953o5028O3609R9982K894q939n8649l3622o8185j59678M6421J66525
17773a28666J0886J00760p5218j54680q7117J19249K46330o8098j43851m5852
17763b26257q250J6821J57271R4590j38018P869Q887p6137J9426J67803O0372
17752H4377q1620k60387j74348P8221J30457r4697L1368J32390L5214p2595L8910
17741a52710M8492q3934J9880J12559L0352Q2505n4034m2242l0107P172n7823
17730a19890j6836M9478k9057K712l488o3667q747l912N2494N9450J28713r3322
17718d6072o5400O398k2520J05600K9975q6153J6851J5493R2817m4559k17530
$$ y = [13541, -37215, 19216, -180292, -236109, -270477, -134847, -37602, -9110, -94650, -83134, -79043, -113996, -179024, -115415, -15433, -12539, -21478, -80127, -113749, -181934, -341612, -295191, -128666, -117780, -17020, -92238, -246918, -334035, -214786, 31544, -36554, -180405, -226257, -234507, -217686, -60415, 34175, -103843, -95974, -87087, -163224, -143798, 24005, 84377, 2757, -257630, -431978, -353757, -223300, -317997, -286629, -154239, -119025, -191620, -152710, -104218, -188152, -168272, -55713, -25361, 57144, 3110, -39132, -69239, -62067, -119890, -136726, -87248, -116305, -113593, -117081, -180748, -189495, -193407, -140913, -81463, 47250, -46072, -111472, -105074, -127594, -21994, 7981, -78172, -61321, -45828, 46989, 2430, -215100]
17707b15100p3796P557P7718J46587L3916k816J3693K1541M706o4751J7914j18163
17695a50994p7664j653N0124j3095J24756O2909J5646m8758j0646R0403N7741
17684I8769P7592J8359q1980M5705r7197p7415j7779J5466K1971J3736o9334o007
17672e8114M9157r9156o4975J63016L1022j34871M119P7539P4964O3381P2977
17661A79059j67273j4483O7761L444R488m9395j77986j05260m2024m1505L7199
17650c00975J48525k9560n568k568n1874M3052P2267M0463K9283K6127Q182l6399
17638e9045q434j8731p136N2242m4437p9540q1302P0186Q2385O5028o5636K5527
17626f8893J41351o8472m5695R0835l9331o4409j4526O6159j423o0573J7851K001
$$ y = [-215100, -288896, -281339, -203621, -57034, -23118, -25934, -12241, 9300, 14006, -50745, -32831, -150994, -228658, -230311, -180187, -193282, -68526, -5617, 10029, -38729, -49375, 41028, 98769, 176361, 194720, 112740, 158445, 61248, -16167, -33946, -18480, 3491, 17227, -52107, -58114, -8957, -108113, -173088, -10072, 20950, -113921, -109802, -32263, 42701, 106082, 179059, 11786, -2697, 65064, 68508, 77996, 28601, -149385, -254645, -296669, -338174, -300975, -152450, -182010, -187578, -190146, -242020, -198968, -126701, -86238, -56955, -30828, -22646, -59045, -67479, -86210, -93346, -41104, -85541, -165081, -246383, -176197, -93812, -28784, -94420, -68893, 72458, 3986, -41709, 49126, 9795, -54614, -69140, -2981, -4404, -64977, -47126, -45125]
17614d5125q9334j32130k7462K0907J45796M4103K1898L6546P1514j47749r1780
17603a92816l3768M1170J81200J28489L6425k1998r3632j20112J49871j4749l4471
17592B5609L0488j09346j20641l9073N3347J00842L5497j6413n7089l0151j5464
17581a42394K9332P0813k0938O9106j9506j28665r1505J1707K02262J06075J2926
17570I9213n6888N436J5265l234l2215q9285j22456l9467O374k0363N9437O7342
17558a10841K3316M2188J3054m8651j02186O1053Q3682J4413J21006J78130j8395
17547B56769j12667p9206n4952Q9239J7237p6570K3412p924j45873j17194L2023
17536a75706R1658m9341j5724M5213M833J05448J30955M5066j83241r6640M7990
$$ y = [-45125, -134459, -266589, -294051, -273144, -127348, -83245, -61347, -24801, 46713, -101036, -192816, -226584, -185414, -4214, 124275, 160700, 138702, 45070, -75042, 74829, 60080, 25609, 56097, -53249, -173890, -212963, -159616, -58774, -23277, -39690, -96779, -126930, -142394, -113062, -42249, -63187, 5919, -13587, -142252, -233757, -222050, -19788, 86287, 99213, 42325, 47761, 63026, 59792, 27577, -61708, -184164, -223631, -217257, -237620, -178183, -110841, -87525, -45337, -32283, -80934, -183120, -122067, -38385, -23972, 97034, 275164, 256769, 144102, 64896, 9944, 99183, 116420, 39850, 63262, 55338, -90535, -207729, -175706, -84048, -133389, -149113, -103900, -99067, 6381, 137336, 182402, -839, -97479, -49489]
17525d9489K9583L7533L1586P4785M4896j2386n4511m7459N4432o0051R0108O5345
17513B04372J66396o0472j26676n3197J03605l1669p8302r2351M769l9339O948
17502D084o0693j8898P4101P5231j4437n2455k10749l319K8987K7489k6O6234
17490h4451P3486O1802j0652j8433K2358r677j6614n4498J6356L3282p5140q0712
17478a42893N4048P4123o4367o0114P3511J13449J32257r3280j47496l1405q1815
17467a73982k6971K5814Q757O0967l7590n2446J6933J08045P2231r729l2631J06289
17455F5687J66629l0072m5796O3549r9494k3956J8037k1856J50815J13822N6496
17444D13861J51922L97441O74201L21772o20744o02867k76371j63147m2219O7613
$$ y = [-49489, -19906, 17627, 49213, 123998, 168894, 156508, 101997, 54538, 108970, 48919, 139027, 204372, 370768, 310296, 183620, 130423, 234028, 202359, 124057, 31706, 36475, -2864, 4084, -56609, -75507, -1406, 73825, 59388, 6933, -203816, -207135, -178148, -150659, -150685, -84451, -10965, 50837, 40185, 21752, 44110, 34433, 17819, -36679, -20323, 12959, -62181, -142893, -88845, -14722, -79089, -139203, -65692, 47757, 180014, 86734, -60762, -92167, -173982, -200953, -175139, -166382, -105415, -143005, -195451, -178518, -70473, 1758, -7971, -40602, 65687, 232316, 202244, 156448, 219997, 120503, 96547, 114584, 92728, 243543, 357365, 413861, 565783, 963224, 1637425, 1959197, 1338453, 735586, 459215, 296068, 253849, 321462]
17434C21462O1261j36389j50619o0705j4974L3806o4115j0172R7031J6390j21269
17423b8293k18787o3756J45010K27476J3151j57723k7575l0259j4051k2555M3932
17412a33430k6308K5961k0070J08705Q3226k75320r5768R7567J24439k7715j0228
17401a48941L9092J341k1071O6676l6720o4953L4594Q6129N3832J4216o0118q9629
17389a25552Q9472J31512n7875n1424J5510Q3623n6776j12833p6508J08907J30787
17378G8843o4065J6953l5102R0193L2091K1558k235r9089L8320R0617K7334p9878
17366A15540O781M3136j37976j40282l2929r936k1642L1021L1671K27697O1339
17355A74420j38903j12263n120n1519K4718K2469Q6802L1129J37557l4988r6498
$$ y = [321462, 382723, 246334, 95715, 35010, 20036, 53842, -10273, -20445, 76586, 92976, -28293, -247080, -310836, -165826, 61650, 74801, -82922, -110497, -140756, -154807, -177362, -133430, -159738, -133777, -153847, -45142, 38084, -237236, -333004, -235437, -110998, -138713, -148941, -109849, -108508, -129579, -62903, -99623, -164576, -129982, -43853, 9979, 24195, -35923, -125552, -36080, 95432, 37557, -13867, 1643, 85266, 28490, -84343, -160851, -51944, 78843, 14778, 31731, -3371, 86822, 118913, 140471, 138236, 39147, 77467, 168084, 195418, 115540, 122321, 165457, 27481, -112801, -145730, -155666, -177308, -146287, -114616, 113081, 174420, 35517, -76746, -81866, -133385, -108667, -86198, 604, 31733, 169290, 134302, 37804]
17344C7804j17154J0922M5138j21347j9859p8261L5960J98840J45485O3070m7880
17333A52718P8826K4657j61706j98145N117M7206p0789m3591N7066j76228O5492
17322b19377J75689k2385M1202K6427L1132m8040l9403k501j1873J5933O1852
17311H656j2011L6361p1161N4541M3495k8711m3761o0142j7775l7872O8920R5709
17299C6249R5001m9847r9206n241l3539p5297o4084K9246M2291p773Q789R536
17287a13875l46j00913M4Q5498j4274J6504M2384O1921j5148r6297K4348J07014
17275c140L9419m0232L5988q1192j9592Q1969P6796l0099l2522P393O026M1360
17263H2174l7737J6063Q0529k1277k40455j7500k4741P3612k7336J2927K3586
$$ y = [37804, -79350, -68428, -23290, -144637, -164496, -242757, -206797, -7957, 137528, 200598, 152718, 231544, 256201, 94495, -103650, -98533, -51327, -122116, -165707, -108641, -284869, -219377, -43688, -66073, -24871, 1556, 32688, -15352, -54755, -57256, -69129, -53196, 8656, -3355, 33006, -38155, 16386, 59881, 31170, -12591, -72733, -90508, -128380, -59460, 36249, 131250, 81403, -17803, -23044, -56583, -131880, -195964, -166718, -124427, -132200, -123411, -113875, -114221, -215134, -215090, -129592, -143866, -127362, -84978, -23057, -38205, -134502, -110154, -3140, 36279, -3953, 32035, -49157, -68749, 13220, 90016, 59917, 27395, 34788, 40814, 82174, 44437, 60500, 141029, 119752, -120703, -138203, -162944, -89332, -116668, -103741, -80155]
17252h0155m8433j41699L1248K8514J37866J2871j04J29247K5577k02809K1886
17241h5991O2485J16526J13226k3528M2002o9452q4174k5465J20846o2874l671
17230I9930n8502j29382q3717N0271J37502j8648m3247j492M9979N3204R4228
17219A50126j10068L4035R0071j16330j06537J5080l7066n474q595Q5128N6421
17208D6791j23516j24589o2659q7089P9814J05859N4468N5746K1580p4119p5477
17197a83191p1916N9874L0157l6421p6222K9487Q9085J03611K0909m5432O1625
17186a8434k2541N6006j28162j23411J37255M3514M6800m1976k8502J65595L9521
17175A25665L8481J6804j09684j67725j2481L8449l1026L045L6559J13911N8824
$$ y = [-80155, -128588, -270287, -239039, -210525, -72659, -59788, -59892, 69355, 94932, -107877, -85991, -23506, 93020, 206246, 182718, 224720, 155268, 71094, 45629, 166475, 103601, 99930, 41428, -87954, -171671, -121400, 16102, -2546, -45793, -47285, 2694, 55898, 150126, 40058, 74093, 164164, 47834, -58703, -43623, -80689, -86163, -94758, -9630, 46791, -76725, -201314, -263973, -351062, -271248, -165389, -110921, -55175, -33595, -107714, -183191, -255107, -195233, -165076, -201497, -277719, -248232, -159147, -55536, -34627, -80059, -18434, -40975, 15031, -113131, -236542, -99287, -55773, -8973, -50949, -79451, 86144, 125665, 164146, 180950, 71266, -96459, -108940, -70491, -101517, -98472, -61913, 51998, 110822]
17164A10822l1061L1193j13991L9284l2085o2912n6344m8005P387J26646M1704
17153A2638K5153K3336q2360J14500J2050r9103M24M2046n1144N7167k0159j25826
17141i1278J1539J9179L5856J08664O1512j8643j09860m4880o0827k5615J00N341
17129a08912R1167J36744J5950j7391n9515k9901j8006P0533K6665j33465Q8781
17118F2650N8799j58705r5707j5416K8532J05195K8426j33762Q2821N0654N1069
17107F4556q597r9598j10739n1375K52J01535J23324K6057m8692n3264k9553j08692
17095a94786q4140P0271k4541o4226o9533R3233R5931L3612K1303m2469p2958
17084b38303P096Q7579p9471o8906Q0673L7362R3558J1321J8220J9616J94702
$$ y = [110822, 79761, 110954, -3037, 36247, 4162, -58750, -115094, -163099, -155712, -29066, 12638, 37791, 61127, -21233, 93267, 105317, 6214, 6638, 48684, -2460, 54707, 34548, -91278, -79739, -60560, -24704, 83960, 145472, 126829, 16969, -27911, -88738, -114353, -114253, -108912, -17745, 118999, 134949, 117558, 58043, 28142, 10136, 80669, 107334, -26131, 62650, 121449, -37256, -132963, -148379, -119847, -14652, 13774, -119988, -37167, 13487, 64556, 55959, -43639, -154378, -205753, -205501, -103966, 19358, 45415, -3277, -56541, -86094, -194786, -278926, -208655, -233196, -297422, -366955, -273722, -177791, -144179, -122876, -165345, -238303, -231207, -143628, -223099, -292005, -211332, -173970, -80412, -69091, -50871, -31255, 163447]
17073A63447M2744k39156j30053q0148K7667P8769n9385k1479Q1634Q8327p5955
17062a23588m6863J3104O3820P3097J2851P2958n6404p005p7461K6836j1571O3299
17050C073p4033m3044M9733j9287j44977J00673K24715j00506q6733K2687P9624
17039A1925j3626m108K658J7186P031M7591n2625j20057J21379j2168q1362k2426
17027i8602Q6513J8898n7724j0225P0629N0947P6281J32299J150r5186j46292
17016B8688m0313M1583J798j8885n2847L0558J8511j39857o8368J16132J69083
17005H6083j6192m0233m5624l2353j183O9952p3539O041L7188j14192m5426m9024
16993b18502K7674N4517L2247J4203j5466J10428K11306k3724m9313J3306p3405
$$ y = [163447, 206191, -32965, -163018, -243166, -215499, -136730, -196115, -217594, -135960, -47633, -123588, -170451, -157347, -93527, -20430, -7579, 65379, 8975, 1970, -75491, -48655, -60226, 3073, -70960, -114004, -64271, -83558, -228535, -127862, 96853, -3653, -90386, -67699, 11925, -1701, -5809, -3151, 14035, 21066, 68657, 16032, -104025, 17354, 5186, -76176, -98602, -12089, 6809, -50915, -61140, 9489, 60436, 136717, 269016, 270166, 174980, 28688, -11625, 29958, 31756, 12871, -39976, -9418, 9093, -130764, -199132, -83000, 86083, 69891, 29658, -15966, -48319, -49502, 20450, -53089, -47048, -9860, -124052, -169478, -218502, -190828, -136311, -104064, -89861, -105327, 5101, 216407, 192683, 143370, 156676, 83271]
16982H3271l4241r808j19605r5898J16680q0288k8641L7629R4N3156P9177N3856
16970E5382j3076j12956P4186J04444p5424L2272J686M9448M2983m0821P4752
16959A92876Q4041o939j16204r3007o5435K5400p4585j6038M041J09472L2045
16948G5667j0029n5312j07764M2128p9116q5923L5497m7174P6190N9975N3817
16937d2044p3859k9940j9328J04789Q9826P4396r3857n2886O7536K6578r0228
16926c9017k7360m2371P7303K26343L8721j55589o0314J02678k5515m2826L744
16915E5797l7732J10641L8359j22525r506O9612k4907j18832j51001l4573K7152
16904a97515j05306L6007O2781J34553M4858n1260j25979k588J87760P0994J39400
$$ y = [83271, 49030, 39222, -80383, -176281, -59601, -139889, -168530, -130901, -130807, -77651, 1526, 55382, 42306, -70650, 3536, 107980, 32556, 64828, 66514, 115962, 158945, 118124, 192876, 276917, 269978, 153774, 60767, -4668, 20732, -53853, -69891, -65850, 43622, 75667, 65638, 10326, -97438, -55310, -134426, -220349, -184852, -232026, -155836, -95861, -42044, -115903, -145843, -165171, -60382, 29444, 103840, 9983, -42903, 24633, 51211, -39017, -66377, -108748, -31445, 194898, 233619, 78030, 17716, 120394, 94879, 52053, 55797, 18065, 128706, 167065, 44540, 35034, 104646, 79739, -39093, -190094, -224667, -197515, -302821, -266814, -204033, -69480, -24622, -75882, -201861, -204449, -16689, 54305, 193705]
16893A93705j3631L306Q1815O524q5848K9210O983k37904j92367J31791J77406
16882A00990K8335o4089q8626j47894n0479J59439N4699o212J02264j3317j74961
16871i9851R97M1614Q8482P2268L6642m3130r5900o3520j30614M0712J9680M3347
16859h9273J09886Q8530L3016o4759p5352j67592P01J22052K554r5714L1508P9090
16847b5353J45242l5176Q421K6915k7637o8387l8146q3568J7785L4549r8220J43142
16835d33M8885M4620j24282j2798j3492l5347j7475K1609M0864k4979k0369Q6160
16823g037K225n7353j05618J39964l4304l3226q6374j60494J02075R0658j04861
16812b54345M1728R9529r807N203K8037L1770L691j1836J7678j00303p8939q2947
$$ y = [193705, 180074, 183380, 265195, 271719, 185871, 215081, 222064, -15840, -208207, -76416, 100990, 129325, 65236, -23390, -171284, -221763, -62324, -7625, -13837, 88427, 75110, -99851, -98854, -57240, 31242, 103510, 140152, 97022, 1122, -62398, -193012, -152300, -132620, -89273, 20613, 109143, 142159, 77400, 2048, -165544, -164843, -42791, -40237, -135951, -104443, -25353, 119889, 84713, 93134, 120049, 92412, 24025, -14121, -97689, -79904, -45355, -143575, -433, 48452, 93072, -31210, -44008, -57500, -92847, -110322, -88713, -47849, -72828, -93197, -7037, -4812, -62165, -167783, -27819, -62123, -95349, -181723, -342217, -240142, -149484, -254345, -212617, -113088, -122895, -117692, -89655, -57885, -54194, -66030, -48352, -148655, -227594, -310541]
16800c10541p718J05629p5472o4260O4058J74525j8884l0606L6925R5716K1880
16789h748J2580j581n4849p2612K6329P0223Q2634l0565p6354j64907p1269o9994
16777c59113N7484P2889N4721J19590j22730j39023N1347J71947J9560O2282N4239
16766D3193r80K9090o7777q0111N2181K4180k2413n9928Q1865J40485N6325k1305
16754A74805q9756j6231O365J85j09548j17877K4268J02970M0811k4635j0695
16743a9338L5756m2139r389n1497k3846q0335o4455L7219m5O3350n3810O092K7821
16730a74616L0069M6234q346j18690J18059j7123K6936J37052P3797o1765q3303
16719c1696M4009Q3312O0412m4539j41416N8808N0201p6598r0577n9269J9011
$$ y = [-310541, -318259, -212630, -288102, -352362, -288304, -113779, -132663, -163269, -126344, -30628, -8748, 3832, 2251, -52598, -125210, -98881, -28658, 53976, 23411, -52943, -217850, -289119, -359113, -301629, -228740, -174019, -54429, -177159, -316182, -264835, -92888, -73328, -11046, 43193, 42213, 71303, 3526, -76585, -24404, -224, -22637, -82565, -700, 139785, 196110, 174805, 85049, 68818, 75183, 75368, -34180, -152057, -127789, -24819, 15992, -8643, -19338, 16418, -25721, -35110, -86607, -110453, -190788, -255243, -218024, -218069, -154719, -208529, -202437, -174616, -144547, -98313, -106659, -225349, -107290, -124413, -97477, 39575, 113372, 51607, -31696, 12313, 95625, 156037, 111498, -29918, 28890, 79091, 2493, -88084, -147353, -128342]
16708a28342L1936M9392L9745K7395k7321K5690k7067j4909l5002K3257q0668
16697a15894j2911L805J0107j4912K7438n4566j28855O1989R7031j5573k042J2118
16685a32265j9603m0894N8772K04874k4289j01516o232J05409M3648q0695j63554
16674a56345r1748j5971j092k3677k558O5796J37399L0745Q9145L5587M0383j22533
16662a4869j37079L4137O1323l7457O9315l3947J2761n3982P4733N4032j00747
16651g1780P639J4179n0769M9616N5988N7941M1750r495o0464O848L4805l8097
16639C8161j9209J44466Q9550m3438j27683j25272K5676p9421L8904J3494P3223
16628B8451j7302K2091P3357J02958L6037r3457j74201k4220q815k2180r3867
$$ y = [-128342, -96406, -47014, -7269, 20126, -7195, 18495, -8572, -23481, -58483, -35226, -115894, -128805, -125000, -114893, -129805, -102367, -156933, -285788, -223799, -126768, -142341, -144383, -132265, -151868, -192762, -133990, 70884, 46595, -54921, -61153, 44256, 87904, 7209, -156345, -248093, -264064, -265156, -288833, -291391, -225595, -88196, -57451, 31694, 67281, 107664, -14869, -151948, -117811, -56488, -93945, -24630, -58577, -45816, -99798, -25065, 28967, -71780, -64141, -49962, -100731, -51115, 4873, 62814, 104564, 95069, 34605, 41453, 76258, 38161, 18952, 163418, 252968, 209530, 81847, -43425, -17749, -97170, -58266, -44772, 28451, 11149, 33240, 106597, 209555, 245592, 152135, -22066, -46286, -55101, -77281, -171148]
16617a71148j1702M5858P7600j6676j08938j5894K7634J4803P6524J27627M0417
16606H6105n6812q2073n1016P2921K7926m1365O6086J50774o480j39784j0406
16595A5876j925m5003j20715q8014O9896p0316P2046L3007p8708J21724l1392
16584a23524P0797P841K6213L0267o442m5209m0129L7023R8790j9691J4423j8930
16572C1429N572p2183j21866J878P7528J4142j68691L4164N8855j41607k708L2547
16560b50940K0811J00677J02640J04618r4804o3668l2508M9486P5197j5744n356
16549i591k3072l1666l2297q039O229k2131n6726r5799J55430J65486J5464p8142
16537a4854J0771l8542J8222M4045k6646k7010o032J54246J3849o8289k5835m6624
$$ y = [-171148, -182850, -136992, -59392, -76068, -185006, -200900, -173266, -158463, -81939, 45688, 86105, 29293, -52780, -103796, -30875, -2949, -44314, 21772, 172546, 166066, 26282, 15876, 13951, -31052, -151767, -239781, -169885, -240201, -168155, -135148, -213856, -92132, -123524, -52727, -44886, -18673, 11594, 5152, -40057, -80186, -43163, 55627, 35936, 50359, 31429, 37001, -35182, -157048, -155170, -77642, -63500, -232191, -198027, -139172, -280779, -283487, -250940, -230129, -129452, -26812, 77806, -16998, -80666, -113174, -63688, 11509, -4235, -9591, -32663, -64329, -96626, -104665, -98436, -120567, -177293, -273092, -117662, 47824, 63288, -14854, -4083, -42625, -24403, 19642, -7004, -34014, -40046, 114200, 128049, 59760, 33925, -12699]
16525a2699n8678j8535r2067j55980J13878J02273k0792P2389L9087j6040J2045
16514c5119M9344N2224J7234o4238m1753p0215o6353k6530J15846R9284r4939
16503f5215r3504P4764n5551M863P1677Q1480M3642K056N2722q4022n7815O3230
16491C8327Q6M6356j9759k03899K2518r008M2353P3901j91501p4451N7669J78543
16479c8865j8422j60396j3959K0162J12499m2089J1481j4808j2686K8065N9202
16468f9816J39898M6455P9511j8598r2715J30914j00496j54042K7885k1354m3660
16457g6018n0222O7284J16584m1755p0098J0555L0779j32608N4944Q5110J8686
16446A3241j54202P8324l7413j09266K1207K648L471J23922J49872j5962j97189
$$ y = [-12699, -71377, -89912, -181979, -337959, -224081, -121808, -142600, -70211, -31124, -47164, -35119, 14225, 66449, 83683, 19445, -22308, -92523, -158876, -185406, -69560, 29724, -65215, -158719, -83955, -139506, -134643, -62966, 18514, 62156, 64212, 116934, 32912, -24903, 38327, 38413, 84769, 65010, -138889, -116371, -125379, -83026, -9125, -200626, -275077, -217408, -38865, -57287, -217683, -231642, -211480, -98981, -141070, -129589, -144397, -157083, -129018, -69816, 70082, 116537, 196048, 177450, 84735, 215649, 115153, -38889, -11004, -32358, -76018, -126240, -58956, 57628, 15873, -54225, -43670, -12891, -145499, -90555, -5445, 13241, -140961, -62637, -100050, -209316, -188109, -185461, -181990, -58068, 91804, 75842, -121347]
16435a21347j81029K1447M5656J17469R0074Q8015L5190j08499J9991j16120o6710
16424a75863j1368k1752J17604l701j65876M9415P0481O9330R3079q2447j16915
16413a78013N8168K6431n6613l1442R1612R232n0836n7232j5047N9890R9121m753
16401d9482r6348Q306Q9214k323N7542K0155J9406m6002k8826j10539o9657p799
16389b16353Q1238N1132J13363n8373j6840l3613K446m468P8604J05866K9107
16378A32109J9865m8566m4480j69670n6531Q5557M0004J08208K5033j23993l6033
16367f8497R7039J15149k5187j50235N3951M0764j62253k7809J3447P8432m6872
16356h2071L0738J48191J2986q123L6625m2179n751N9458l8159k5254r0889r1297
$$ y = [-121347, -302376, -280929, -235273, -117804, -27730, 60285, 95475, -13024, 6967, -109153, -175863, -187231, -208983, -91379, -95080, -260956, -211541, -141060, -71730, 21349, -61098, -178013, -119845, -93414, -150027, -181469, -89857, -80625, -131461, -188693, -203740, -143850, -44729, -49482, -145830, -137524, -48310, -50633, 6909, 27064, 46470, 468, -28358, -138897, -208554, -216353, -135115, -83983, 29380, -28993, -45833, -79446, -77000, -81468, -2864, 103002, 132109, 151974, 103408, 58928, -110742, -167273, -81716, -41712, 66496, 91529, -32464, -68497, 28542, 143691, 118504, -31731, 22220, 62984, -99269, -127078, -113631, -35199, -82071, -51333, 96858, 109844, 101721, 138346, 96167, 90416, 149874, 111715, 86461, -4428, -95725]
16344i5725K4457J3816n1879M5980n3909j8608o1432R4865J49002j1996r4296
16333e9725O2284M6901l5913m1163m7267R5603J60776n6696n2299l1725J6030
16322E6806j53042j07623m4635J00421J50194Q6809O016q0804j96982n9114n3862
16311b95816O6641J38311O0516p7949K9663L3181J2410O8903L6444j48702j11931
16300a88329K5239J48371q906M4123r5112j20635p3111L512J64746J53801j00730
16289d7031o0244o9092J06185K4485O8350J48759o5016j00106O729q326n7825
16278e3132j64814r043J46256K9386k6314m4542n5250K7067O2253J25511J31893
16267A69271Q9031q1477j8052k6777j6850N2081j54259m7485J38107N5371j14724
$$ y = [-95725, -71268, -57452, -109331, -63351, -117260, -135868, -197300, -102435, 46567, 34571, -59725, 2559, 49460, 13547, -27616, -74883, 20720, 181496, 124800, 72501, 40776, 56806, -96236, -203859, -248494, -148073, 2121, 88930, 94946, 14142, -182840, -241954, -295816, -229175, -90864, -30348, -108297, -78634, -45453, -33043, 35860, 72304, -76398, -188329, -163090, -14719, -23625, 20498, -74614, -195249, -268360, -264848, -100102, 53699, -47031, -107275, -176367, -70182, -45697, 22653, 171412, 106396, 6290, 13019, 4693, -53132, -217946, -226989, -80733, -51347, -77661, -122203, -177453, -150386, -88133, 37378, 169271, 258302, 176825, 158773, 131996, 115146, 167227, 12968, -34517, 103590, 158961, 44237]
16256D4237m6486k6960J9078O1313L0404K3084p9448o1060k68942o3903J59912
16245b08771K0401R2976O8800p9968O3273P4304K5764m3258k8992N0241o8807
16234c4037R0187L5913j1653M4548m8078J5917O9286L6153j2255r4313n6014K5575
16222F1229n7903l7733p4554J9105r4514J1124J26027J12216R7408j32449q6537
16211e6581N0510l899Q200M9292p2691L8573J10134R7083n3035k10507K7470M4791
16199B9340N3761P2542j68421k15438O3639K7687K450M8511L1997K7710k5200
16188e1422m7387o7809J3252O4527l1422L8517O9747q350M5856n7257J7869J04099
16176I0220k9076L958n2635L1864l3977p0887j4128r575j9935L5623o6082o0891
$$ y = [44237, -2249, -29209, -10131, 51182, 81586, 104670, 25222, -35838, -304780, -368683, -208771, -188370, -95394, -26594, -106562, -43289, 31015, 56779, 13521, -15471, 34770, -34037, 56150, 92063, 80410, 124958, 76880, 92797, 162083, 198236, 185981, 91668, 35654, 61229, 3326, -34407, -108961, -89856, -184370, -173246, -47219, 64997, 162405, 29956, -56581, -6071, -9970, -1770, 47522, -25169, 13404, 123538, 220621, 167586, -42921, -15451, 29340, 83101, 155643, -12778, -228216, -164577, -136890, -134440, -85929, -53932, -26222, -51422, -98809, -166618, -153366, -88839, -120261, -81744, -11997, -20347, 25509, -31748, -13879, 90220, 61144, 65102, 12467, 44331, 10354, -60533, -74661, -84236, -104171, -68548, -134630, -195521]
16164a95521J76132j4791r4122j7877o628o0111Q1795J55902J9863l9508l6041
16153c0907k8718M5510N5248N4072N9341K7356j8370j75082q5393j1641o923l595
16141a19102j7137p6287j05229P3198P5568O3667o8181n9345L2075L2778j9587
16130a87582K7996N9017k7200R0739L9386j4315j017p7077j19227N3935L1646
16119a23699J28156L7611p3974N3157N9636P3997k8776j49543j10451j1347m3217
16108a88450J6667J60284l3169k6554l5429j7269j6117N9349Q3865o766O395m6630
16096d3824J878j44062r46j9816j0577J03744J41294k7275r3314P6490l1520K2727
16084b5201L8826p4682j694M507J9876r9822L9313K541J6319N7443k3790J9530
$$ y = [-195521, -19389, -34180, -128302, -146179, -152807, -212918, -131123, 24779, 44642, 5134, -30907, -59625, -14115, 41133, 95205, 154546, 181902, 163532, -11550, -96943, -108584, -115507, -119102, -136239, -212526, -317755, -244557, -168989, -105322, -173503, -232848, -200773, -167995, -187582, -159586, -100569, -127769, -37030, 2356, -11959, -12976, -90053, -209280, -155345, -123699, 4457, 42068, -31906, 21251, 80887, 154884, 126108, -23435, -133886, -145233, -188450, -171783, -11499, -44668, -71222, -106651, -123920, -140037, -80688, 3177, -3589, 2806, -43824, -41946, -186008, -186954, -206770, -217347, -113603, 27691, 416, -92898, -16408, -47928, -25201, 13625, -61057, -62751, -58244, -38368, -138190, -98877, -96336, -80017, -22574, -46364, -26834]
16072b6834q8837k07117p8831J48095J00001J50820o3742n0307J05226J3881o5984
16061f3629L9113j0045m9287L1417M5045m4941m1663j02888k9354P5994L1385
16050a18853j2412m9516L4235Q9636k3291j03892p719M07M4191J2254n2266P0534
16038a16692J30536k2199j65040n6769N2231Q6886J65831o5001q7055J59546J46879
16027B29153L4051j14188o0151o6425j5701k4105p6399m3519M7416N154p3490
16016a58204k9889Q4758L2617J2833l9719Q570K708Q50K9957n1547q3708l4491
16004b25265N6534J86833Q8202J7164K2127o3718o5276k02686k0271J36382n8554
15993a28528m8447P0102M3749J7904N3620M9517j1611p7250L5295J3584q1206
$$ y = [-26834, -115671, -322788, -401619, -253524, -153523, -2703, -66445, -116752, -11526, 2355, -63629, -24516, -34561, -83848, -52431, -7386, -52327, -93990, -196878, -226232, -150238, -118853, -131265, -180781, -146546, -56910, -80201, -184093, -191812, -191405, -147214, -134960, -187226, -116692, 13844, -8355, -173395, -230164, -177933, -91047, 74784, 9783, -77272, 82274, 229153, 263204, 149016, 88865, 22440, 6739, -17366, -93765, -137284, -89868, -84714, -158204, -188093, -103335, -70718, -57885, -97604, -89034, -86326, -85476, -55519, -107066, -190774, -225265, -168731, 18102, 106304, 123468, 145595, 81877, 16601, -186085, -206356, -69974, -128528, -176975, -106873, -63124, -45220, 8400, 57917, 46306, -30944, 4351, 17935, -63271]
15982f3271n8605K719l748O0481o9366K431m1967J00335P5500n4945O4705P3564
15970H7833m7210J87685N368k19514q6945k0612k1488Q8298M1023O5l4528q4233
15958a04258K4164J3174L1782M1332o9412o879O1351J98739J6976j31604k6903
15947D8462k9787j2761j502P3658q6443k796K0517m138q934p4137p2620M5860
15935a04621J0239J4262L7231q9548J62466J25190K0327q0643q5925m9075j3700
15924e3797r1382m0818N3764L5462l7558k1306j081o0125m8920M8790L9443P4440
15912a03088K1405k1902r7193L3767Q3518J00625M2916n4734N3800k49J7161K9231
15900A05257q2752K9438M0188q9566q3076P266K1528J7167J02672J59112M70k9455
$$ y = [-63271, -121876, -119157, -122905, -62424, -131790, -129359, -171326, -70991, 4509, -50436, 14269, 87833, 40623, 228308, 233676, 14162, -72783, -93395, -114883, -26585, 14438, 14503, -20025, -104258, -80094, -66920, -35138, 6194, -63218, -70097, -8746, 189993, 206969, 75365, 48462, 18675, 5914, 4412, 78070, -8373, -11169, 9348, 5210, -3724, -77861, -150481, -104621, -94382, -80120, -42889, -132437, 30029, 155219, 175546, 94903, 8978, -40097, -53797, -145179, -185997, -132233, -96771, -134329, -155635, -156716, -216841, -265761, -216971, -177528, -103088, -81683, -103585, -200778, -167011, -83493, 17132, 60048, 5314, 59114, 58865, 76026, 105257, 22505, 51943, 92131, 2565, -80511, -73245, -51717, -34550, 68122, 227234, 227704, 198249]
15888A98249p6590p4967q9822j50879M4942J01275N4162P6113J5488Q947P3853
15877A80771p4340l4534N1787l3484j08593J02632J9873k1019j15367k12115k6743
15866b71132M5607Q7546p7845j728N7365M4211q9881p5196J02975J21317N6564
15855a97L6286N0409M5276j55735q8062M396m1700M7658J12784m2759q9072r2170
15843b12886Q66N0582N7119R531n583N8653O8202p481q9584O5647J1541j2308
15831e701N6461M8219N9746K0723q1883m1764j36644l0880k1437Q878l0594l5587
15819a90463J11383J48584j5440m610J5857O5242J5110k5393K787L6092j52117
15808G032n660P8842J2036J5055k3109o379j51353N9187O154q7978o5596J2845
$$ y = [198249, 121659, 46692, -43130, -194009, -149067, -47792, 6370, 82483, 97971, 106918, 180771, 106431, 71897, 123684, 90200, -18393, 84239, 104112, 83093, -32274, -244389, -271132, -225525, -137979, -215824, -217552, -160187, -115976, -205857, -281053, -178078, -56761, -197, 36089, 86498, 131774, -23961, -112023, -107627, -149327, -101669, 11115, -31644, -120716, -212886, -212020, -161438, -104319, -94788, -100371, -41718, 26484, 19003, -70581, -4934, 6607, -5701, 50760, 98979, 158725, 179448, 97565, 55801, -80843, -111723, -133160, -124282, -154876, -190463, -79080, 69504, 54064, 49454, 65311, 130553, 145663, 120270, 123057, 159149, 7032, 1372, 80214, 92250, 107305, 84196, 77817, -73536, -14349, -8195, -96173, -161769, -148924]
15796a48924j9290M3993J05848r570K4490K9704n1866j5136j09533j04929J29399
15785a25814R3747P3616j4667n3574k2384P5170N1583j32063q3997J21665Q1703
15774F4985r3506p6602J446o899j5407R2436J644j02505J4521L2036M5893N5639
15762A3681m2964L0031p8789L1674m2064k378M6868j0309N5020K1825j24486J9203
15750h2688R147R2266O9297K3995j63695J7596K4037j16038J7040J33630Q1772
15739A06359o1993j28381m0473L298M8840P2958R871P4496J16572q5344n9480
15728E6723j520K6960l7872j00475o2241O9928p6676l8812L4506O560o6452J5193
15716a74178Q7724P6709m4831r0012n6277R3868O5199O1025J44062K4887j76150
$$ y = [-148924, -168214, -124221, -18373, -27943, -3453, 26251, -25615, -40751, -150284, -255213, -125814, -32067, 41549, 26882, -26692, -49076, 26094, 77677, -54386, -138383, -16718, 64985, -28521, -105123, -103677, -110576, -125983, -33547, -31903, -134408, -119887, -87851, -41958, 13681, -29283, 748, -78041, -46367, -88431, -90809, -43941, -54250, 770, 22595, -101891, -82688, -73541, 18725, 88022, 112017, -51678, -34082, -10045, -126083, -109043, 24587, 106359, 44366, -84015, -124488, -121190, -72350, 608, 10479, 84975, 201547, 116203, 56723, 55203, 82163, 44291, -56184, -118425, -48497, -125173, -163985, -129479, -122919, -189371, -174178, -86454, -9745, -54576, -144588, -200865, -106997, -41798, 19227, 163289, 188176, 12026]
15705A2026l5339R2395p9539j6326n6052o5004O7756J06580K3506j4568K4103
15694E9538j20630q9941l9144M6946J36525J10463p4567j17873l3129l9551j4848
15683a76211M2230J18143p7302M9823L3270k6386m8634k5153O1160n1383J60380
15672E9937N8230p531p5820j09381O5887R855k9623m1783j54163j264J44542J18243
15660C7129L516j33415P0652L3331n2471m8346P6023J26426n7605j08819n4715
15649a08294P0858j5393r8636M6569J6050J14296L8446R9151M4599p3994j94174
15638f0522P4690N5686O720q1967k805q8539m2379J7880p946N8513J04821P2891
15626A07043q6952j01788M599j8435l3044k6694j51974O3958J55625J29835P9449
$$ y = [12026, -23313, 69082, -10457, -26783, -82835, -147839, -80083, 26497, 50003, 35435, 59538, -61092, -151033, -190177, -143231, -6706, 103757, 29190, -88683, -121812, -161363, -176211, -133981, -15838, -93140, -43317, -10047, -36433, -85067, -110220, -49060, -100443, 59937, 118167, 110636, 34816, -74565, -8678, 1177, -28446, -70229, -224392, -225656, -81114, 37129, 40645, -92770, -22118, 11213, -41258, -89604, -13581, 112845, 55240, -53579, -108294, -37436, -52829, -151465, -104896, -88846, 25450, 63896, 163047, 207646, 133652, -60522, 14168, 69854, 76574, -5393, -8198, -96737, -139116, -121236, -129182, -70669, 34152, 107043, 20091, -81697, -77098, -95533, -128577, -155271, -307245, -243287, -87662, 42173, 121622]
15615A21622J2793L6984J24729o5481o7568j11944m6569Q6059O5698K4354k4421
15604A56256r1873m8651o5307J08413p7837l0630O5581J5698n7081Q6096P2897
15593A33562J3554p3007L4384j4930p6634k7227N2458p9256q0642p6798J7047
15582a77489N29N2423p1085L5633R3964m993Q2725J35330J04737n3519j58277
15571C9978k4933P7006k1235r2601q4625O2556J8322J03332N9193p7096n5426
15560D471J68735l4691o8459J5603m5500q7721j1489J8470K0950M3028q6565m0023
15548a03191N4264L2666J09858Q6172l1334j19147P448R5240p176k19773j0654
15537a05627J6170J59308R0345j00607o2031L1560N0804N1955k3249j48856k8894
$$ y = [121622, 134415, 171399, 296128, 230647, 163079, 51135, 4566, 90625, 156323, 180677, 156256, 64383, 15732, -49575, 58838, -18999, -49629, 15952, 31650, -25431, 60665, 133562, 147116, 74109, 108493, 93563, 16929, -10298, 42160, -37096, -117738, -194536, -177489, -176960, -124537, -195622, -159989, -66025, -71018, 11707, 147037, 251774, 198255, 39978, 15045, 92051, 70816, -21785, -106410, -43854, -25532, 77800, 136993, 59897, 4471, 173206, 138515, 70056, 85659, 40159, -47562, -59051, -40581, -19631, 23397, -63168, -103191, -48927, -16261, 93597, 179769, 148435, 29288, 36736, 131976, 124800, -94973, -105627, -89457, 69851, 160196, 59589, -2442, 29118, 79922, 131877, 108628, -40228, -69122]
15526f9122P7095L735K5917M6181N3589k9324j71249r1862N5726M0845J28504
15515G0035J06888K1364q6068J0347j4069q1757r3597J459n621q5904j20570k018
15503b79511o039j5773O9334L6914j15005M8108N2300n5428P0709J19076O3006
15492a2309r507J7025N8647k1450Q5203J1127n2804j28723P2694J25695K8802
15481A74400p2447k2332L8748o2462n9404O3869J8025l6789r4010l8677K5761
15470f5318J04552J48574k7j60597m5441J15310K5446r7242j6073l6486p8349
15459a05651M8562J59054N7314r0926N3401M631o624j73917o4730l6011O7764
15448h7133K69R7351R3282m1065j03025R100Q4570L7177j3232J34398J24602M019
$$ y = [-69122, 7973, 11708, 37625, 83806, 137395, 108071, -63178, -155040, -99314, -58469, 70035, 176923, 198287, 112219, 122566, 108497, 26740, -66857, -65398, -71019, -156923, -277493, -279511, -285550, -301323, -231989, -195075, -310080, -261972, -209672, -265100, -194391, -75315, -12309, -21816, -4791, 53856, 32406, 117609, 128736, 75932, -52791, 19903, 145598, 174400, 101953, 79621, 118369, 55907, -3497, 60372, 78397, 41608, -52402, -91079, -65318, 39234, 187808, 187781, 27184, -18257, 97053, 122499, 25257, 9184, -27302, -105651, -57089, 101965, 159279, 68353, 121754, 126385, 119761, -54156, -118886, -154897, -87133, -86864, 10487, 103769, 62704, -40321, -31221, 53349, 90526, 77294, 211692, 336294, 340313]
15436C40313j76088L1824j23099j1332J78769K5459r2182q3109L370j9606o2552
15425A1767J49161P0181q1205j83682j23747M7097P688L6801J3488Q7688j9765
15414A5472l1100L931Q3814J4286r9847K7457L2390l6176j3860k2110M9088k5962
15402b617j04250N4981N2645P6460N925k7778r5566o738O0458O4553p0058q0052
15390g2037k0697M4140j9676j38307m0403n435J40095J15000J23742o2622N7474
15379A21274J25047l3006j56077k3979R4117N8346l9o3532r9251j3103n2522N4523
15367A1798j2781l3198j39444K9569Q8079O6574M6272K5513j11340j53885n4724
15356b37567n1134N2562l0894O0797M7040K8521J58696n3905j58123m2168R0614
$$ y = [340313, 164225, 196049, 72950, 61618, 240387, 265846, 173664, 90555, 93925, 74319, 11767, 160928, 231109, 149904, -33778, -157525, -110428, -102740, -65939, -52451, 35237, 15472, -15628, -11697, 72117, 86403, -13444, 14013, 46403, 10227, -3633, -25743, 23345, -2617, -106867, -51886, 759, 77219, 83144, 55366, -40200, -46938, 13520, 78073, 8015, -72037, -92734, -48594, -68270, -206577, -246980, -252415, -112320, 2680, 126422, 63800, 121274, 246321, 213315, 57238, 33259, 127376, 185722, 185683, 122151, 22900, 9797, -42725, 11798, -983, -34181, -173625, -144056, -55977, 10597, 56869, 82382, -28958, -182843, -237567, -288701, -236139, -267033, -206236, -159196, -130675, 28021, -25884, -184007, -226175, -135561]
15345a35561K7398p1455O6235o496K9325J1267J615l3299q143k2288O6231J23854
15333D8683j1061k6802K6170M2810J3745O2295L3497o3920o8279O871m5625l4353
15321a5969n4534p1045M87K7618j1344K0963K7376o7037P2511N8802m4924N8151
15309A055J7662L8298k0387P12o1306k8012r6754P96P8801M9730K4478J1290j02832
15296h6469L3788J68927N7754J35702K5529r1182l3726p0293p9061L9332Q125
15285A08426M1611m299j35723q5646p3286j03275m3801J00252k5489N4062J36895
15274c0273J20364J5915j61300o3494J50364J12373m7570Q351L4800K4152R044
15263A72726J575J7693l2117j44508j69118l7873l7517M3021P4630L6664j5915
$$ y = [-135561, -108163, -179618, -113383, -119879, -90554, -79287, -77672, -110971, -119114, -141402, -75171, 48683, 37622, 10820, 36990, 79800, 93545, 155840, 189337, 125417, 57138, 64009, 18384, -15969, -70503, -141548, -141061, -113443, -124787, -103824, -76448, -143485, -70974, -12172, -57096, 1055, 18717, 57015, 36628, 37340, -23966, -51978, -148732, -147936, -69135, -19405, 5073, 16363, -86469, -52681, 116246, 174000, 309702, 335231, 244049, 210323, 140030, 60969, 100301, 108426, 150037, 145738, 10015, -75631, -148917, -252192, -295993, -195741, -221230, -167168, -30273, 90091, 106006, -55294, -118788, 31576, 143949, 96379, 104730, 139530, 163682, 172726, 174301, 191994, 159877, 15369, -153749, -191622, -229139, -186118, -111488, -74824, -90739]
15252i0739m1837l6614n6064M0955J38179L2907L6563j4791r990J9875K3480J9660
15240F1584o9346l5707J32584J6759p6276L4965J45246R4579j04577j82828K371
15229A9354Q527m2211m0652p997o480J01853J66998k6160j81239r1227L2837l7664
15217a04061q2302k16719J01105k8568r2545L6161J67299J39992J45533R2651
15207A58546j7823Q1235k7086q6810j02314j4414k6254K962O0100m2962k6550
15196d1370N4629P7087K5419j07291l4385K3326m3798R9452J29652r4471j63378
15185g5128q3542R9766k8303K9147J31936k576L6312M5380k2883k2341j018O4430
15173A71180l1470j60762j68759O5890L4375K4272N2366L9483m5165n1246p989
$$ y = [-90739, -132576, -169190, -225254, -184299, -46120, -13213, 23350, 8559, -1431, 18444, 41924, 61584, -7762, -43469, 89115, 105874, 29598, 64563, 209809, 304388, 199811, 16983, 19354, 27881, -14330, -54982, -62979, -69459, 32394, 199392, 173232, -8007, -99234, -66397, -104061, -186363, -403082, -301977, -330545, -423090, -386929, -219630, -79638, 65895, 158546, 140723, 221958, 194872, 108062, 5748, -8666, -34920, -31958, 28142, -14820, -41370, 13259, 90346, 115765, 8474, -25911, -2585, -46383, 53069, 182721, 88250, -75128, -158670, -58904, -87207, -58060, 73876, 71300, 107612, 152992, 130109, 107768, 106750, 171180, 139710, -21052, -189811, -123921, -89546, -65274, -12908, 26575, -18590, -69836, -77825]
15162g7825L2949R7118N0287j06562l2118m6118K1799Q6160m3708N2139P0722
15151A04843k0597m055o3799L8618N2929j2422j18669r9817J94908J19687L8122
15140B29748j28421j78549J1806Q1618J28826q8301j34894N6382j18249P4127
15130f5907M5170O0087O5083K6766K5932K9602j23334N8054K9083j45515o6146
15119f1125J0889J93774R7930L1009J3280o1070j01120j21744l3125q4915Q661
15108a07556J32710J37873O8362L9016O5084O013L261m9459k7157j9740o991p9342
15096A62074p9646J8430O2731j7925o0808L5252O3953k3950R424j8343r1908M3230
15084A02514m3308m4327q7191O4128k1921J21715J08574N1207k1505m6026J33891
$$ y = [-77825, -44876, 52242, 102529, -4033, -36151, -82269, -60470, 25690, -18018, 34121, 104843, 84246, 80191, 16392, 55010, 107939, 95517, -23152, -122969, 71939, 191626, 229748, 101327, -77222, -65416, 16202, 145028, 56727, -78167, -21785, -140034, -65907, -20737, 39350, 104433, 131199, 157131, 186733, 63399, 121453, 150536, 5021, -61125, -50236, 143538, 241468, 272477, 285757, 224687, 123567, 1823, -31302, -116217, -107556, 25154, 163027, 231389, 270405, 335489, 341502, 344763, 295304, 268147, 248407, 241416, 162074, 82428, 100858, 163589, 145664, 84856, 120108, 184061, 160111, 169535, 151192, 59284, 102514, 59206, 14879, -72312, -8184, -30105, 91610, 200184, 251391, 229886, 183860, 317751]
15073C17751N5111Q0253J59643N2747j00621j74311k25421k13711N1518J03572
15063A06531J53285L1334K6732K5227l647r0558j38007m0087M9317m6810L5969
15052A09286o6030p4165q8775m9610J37859Q9348L8420J42662K5360n9817l0331
15041A74207O3623j5359k1581j446M8315k5007j0515j48209j34637j9731R151
15030h1189O0843J02985Q4739m0325j06290p3539o5886k0661P3715K6316j09533
15019a48825P4607K42447j7283o9670K6251p1273j56901k1899J9369p4463J87909
15008i731J7267r3824n9477M7952Q2946p3008L3585K4707p4520P953Q4307J5383
14996C540M4736n8487j03121m8639L9263K8271K6120j7914o6124k7468R9253R5195
$$ y = [317751, 372862, 453115, 612758, 665505, 564884, 390573, 165152, -48559, 2959, 106531, 259816, 291150, 317882, 343109, 339462, 248904, 110897, 70810, 120127, 73317, 109286, 43256, -30909, -119684, -169294, -31435, 57913, 96333, 238995, 264355, 204538, 174207, 237830, 222471, 200890, 199444, 247759, 222752, 212237, 64028, -70609, -90340, -81189, -20346, 82639, 167378, 127053, 20763, -52776, -118662, -139323, -65608, -39292, -148825, -74218, 168229, 150946, 81276, 107527, 36254, -120647, -142546, -123177, -197640, -9731, 7536, -86288, -145765, -97813, -14867, -87875, -54290, -29583, -104103, -96150, -11843, 3540, 48276, -10211, -113332, -161971, -122708, -94437, -68317, -86231, -152355, -179823, -80570, 14625]
14984A4625Q9845P3440m8229l297L4014j52781j74421j1449K8296j1374M9175
14973a12156K09948m449m7214j5907j45906j11096J3887K4367J8702M1294J18460
14962a0070O6301J477j12074q8221L5657M6461J11692K5776n2833q0007Q3057
14951B7216P1333p4018m2455R216J5483N4536K3915o4993P4151m0868k19679k7786
14939a93949J60529N2071m3337q1511m7778K2622Q2916J3766N1541r3537n0407
14928a27074P0628l0457r042O2981J24095p2671l1903n2030j06404k2016J82065
14917a1828K5900K2249j1242j11514J42399J10341o4391p3824r5198P7906O3416
14906G4214Q0157N3924j45091o4060L7638p7103K3891P8909p5726J04036R9759
$$ y = [14625, 104470, 177910, 129681, 126384, 160398, 7617, -166804, -178253, -149957, -161331, -112156, 97792, 93343, 46129, 30222, -115684, -226780, -212893, -188526, -169824, -128530, -10070, 56231, 57708, -54366, -142587, -106930, -60469, 51223, 76999, 24166, -55841, 27216, 98549, 24531, -17924, -8708, 6775, 61311, 85226, 20233, 94384, 53516, -166163, -193949, -33420, 18651, -24686, -106197, -153975, -131353, -48437, -34671, 16870, -76667, -127074, -56446, -86903, -95945, -32964, 91131, 18460, -13443, -65473, -171877, -193893, -11828, 14072, 36321, 25079, -86435, 55964, 166305, 101914, 28090, -67108, 10798, 74214, 154371, 208295, 63204, -856, 36782, -40321, -16430, 62479, -13247, 90789, 190548]
14895A90548L707m5803j3497J06217p0350j96206p1610K2671K5320Q2910J44838
14884A78745k8919j77501n9785m0636p3531m4441k8835m51L4314k1876J7617M2622
14872b02677R8082k6910j4075M5402R0255O8774l16m2453o4048K4877L3165o1239
14860e1163k3172M1327J0231O5623N6174J9404l2169K7137j39321l3069M6211
14849a2787k0846j60614L124J87728J40370L5385J144p5975m5616j651k9578k7310
14837f626R0146J8523n6096o940r8073o4069p7499m428j4144R9823J44550k5982
14825h15j95433K4529J43587N5358j03873l5013m3543l9372J84515N2698N4943
14814I7581L2784q4875O6281p3795q3907q353N8775L0517J00862k2566j43606
$$ y = [190548, 194255, 148452, 134955, 241172, 170822, -25384, -96994, -74323, -49003, 33907, 178745, 149826, -27675, -87460, -128096, -201627, -246068, -274903, -275354, -241040, -262916, -245299, -202677, -104595, -131505, -145580, -100178, -9923, 58851, 58535, 16082, -47966, -23089, 10076, -51163, -74335, -33008, -22777, 42846, 99020, 118424, 86255, 113392, -25929, -58998, -12787, -33633, -194247, -191123, -3395, 136975, 172360, 173504, 97529, 51913, 50262, 20684, -6626, 83520, 102043, 45947, 39007, -59066, -123135, -200634, -205062, -219206, -119383, 25167, -815, -196248, -171719, -28132, 27226, -76647, -111660, -155203, -194575, -10060, 42638, 97581, 130365, 45490, 111771, 37976, -45931, -54284, 4491, 35008, 135870, 113304, -30302]
14803c0302K046J25343J40689r8025l2419j33367q6413N6236J2224j8351J37110
14792G4771n9697n029r0573q3008J4554N2760J6959O5869k5974j72525j3397K8068
14780a97222J00089Q4486K3152M1641p466n0265j9271m0186r079j08020j08315
14769b90456J27413J65938M4264J02395j102r2812l5491K1801N4552l0940j1785
14758E3777L8948p8025l8270j53212M1648k7727J03274J34348o3542Q3728q2989
14747A1958k6399p975o4015k9121J27648O1604j3520j6591p7887m4318q185L3782
14735e3019J57605L3465j52824o4394J4411K3277M7081K3664m2800K4911N7171
14724F8548K5862K2931j2135j47387n1706K5910j09960n861K9794k9010O3182
$$ y = [-30302, -28256, 97087, 237776, 139751, 107332, -26035, -112448, -56212, -43988, -62339, 74771, 15074, 10045, -80528, -163536, -148982, -96222, -79263, -13394, -39368, -211893, -225290, -197222, -97133, -12647, 10505, 52146, 44680, -5585, -24856, -65042, -74121, -182141, -290456, -163043, 2895, 47159, 149554, 148452, 55640, 20149, 41950, 96502, 65562, 53777, 92725, 14700, -23570, -176782, -135134, -162861, -59587, 74761, 11219, 94947, 11958, -14441, -22416, -86431, -115552, 12096, 73700, 60180, 43589, -34298, -78616, -86801, -53019, 104586, 138051, -14773, -79167, -64756, -41479, 5602, 29266, -13534, 11377, 68548, 94410, 117341, 105206, -42181, -93887, -67977, -177937, -183798, -154004, -183014, -119832]
14713a19832Q2356Q8938j2397n5976l6660L9111O267m2372L7380J43712P1032
14702B01559m8179p1304j05592L0605J77092o1320j04983q4124j03790j0815O4995
14691a15856J29770J015r2752O6691N3442j13919N4159M8303o4944p1449l1079
14680a36619J29569J8185m4432n6616J5556K5192N2848P4322k4544r9454l2134
14669g8127K4433N2137o811R4884J59119O8460j2405j841o6630j11611j85558
14658f3950q3017N4770l5991r9060q1442M277J55641K1350L1825M971N393R6717
14646A1484O5499k6106q7493k5799N3899l3042j1525Q8312P0813j428p3582p2601
14634d1569Q4380m0737l2364l3464k3173J33412J4656K3129M0809k5927k5960
$$ y = [-119832, -37476, 51462, 39065, -16911, -53571, -14460, -8193, -50565, -13185, 130527, 201559, 153380, 82076, -23516, 7089, 184181, 122861, 17878, -66246, -170036, -180851, -115856, 13914, 14929, -77823, -11132, 42310, -71609, -17450, 30853, -34091, -105540, -136619, -7050, 11135, -33297, -89913, -74357, -49165, 3683, 78005, 53461, -45993, -78127, -53694, -1557, -8368, 86516, 245635, 314095, 301690, 299849, 233219, 121608, -63950, -146967, -92197, -128188, -227248, -308690, -304413, -148772, -127422, -95597, -90626, -85233, 11484, 76983, 50877, -36616, -62415, -8516, -41558, -53083, 35229, 106042, 104614, 31032, -41569, 42811, 2074, -30290, -63754, -86927, 46485, 61141, 84270, 125079, 99152, 73192]
14623G3192o4485m1103j09018O8062p2661P3318J13838m4688o4564j13664k1769
14612b03542Q2721N7909N83n3256j2723K4506J53435J32845j36254j20245J7577
14601e6444Q8934o9186O9833J40979L9994j11254r3687o7827M547j9181M9780
14590b3512O6052L8771j06782j1551K6646o157o6048O4279J28770p3995l2734
14579C739l7942m4640O5792k1917M1605o7735J17855N9232n5271R3853r3937p8453
14567a7819k3820L1415j1549n4420k3095N6360N4322Q7540o5833l7759O6193o4606
14555c071P0342J18830j33286r6792j05808M4180M3931r8351M700o6354N4904
14544a66775N4464j4096R4126J61264l0300j33523m1973l821K3705k0097L3289
$$ y = [73192, 8707, -32396, -141414, -73352, -146013, -72695, 41143, -3545, -68109, -181773, -203542, -120821, -62912, -62329, -115585, -128308, -103802, 49633, 182478, 46224, -74021, -56444, 32490, -36696, 33137, 174116, 214110, 102856, 9169, -58658, -54111, -73292, -23512, 42540, 81311, -25471, -37022, -10376, -16533, -82581, -18302, 110468, 36473, 3739, -34203, -78843, -13051, -34968, 6637, -61098, 56757, 115989, 60718, 154571, 60634, -17819, -41639, -10224, -21773, -76193, -99288, -42928, 11394, 98934, 33101, -4658, 61535, -3071, 67271, 186101, 52815, -43977, -149785, -105605, -61674, -160025, -155325, -221679, -166775, -112311, -126407, -32281, 128983, 98683, -34840, -76813, -80634, -56929, -77026, -43737]
14533d3737J289J01421l676M4765Q1458M5878o9567j80576j86818O692J79278
14522b3593J03008m5220o2473j3433j3640J16380M5377m4520j17156j927J18645
14511F1448J00669J29855j02721o3833k5089K7854L6887L5376n059o9982o6390
14500E9015J5535R4718N6922q2970k11201j3328Lr6102n4463J19123l9853M4117
14488a08484P6005J1041J28947J28002j297l3437N007m8619j36687k6890j03883
$$ y = [-43737, -42448, 58973, 55297, 100062, 181520, 227398, 157831, -22745, -209563, -202871, -23593, 79415, 34195, -28278, -41711, -55351, 61029, 106406, 61886, -55270, -57197, 61448, 162117, 291972, 189251, 125418, 100329, 128183, 165070, 200446, 195387, 125405, 59015, 74550, 169268, 226190, 143220, -67981, -81309, -81306, -177408, -231871, -112748, -152601, -108484, -32479, -21438, 107509, 235511, 234214, 200777, 205784, 157165, 20478, -6412, -110295]
$$ [...]
##END NTUPLES=NMR SPECTRUM
##END=
