##TITLE=XTC-z189_2
##JCAMPDX= 6.0         $$ Bruker NMR JCAMP-DX V2.0
##DATA TYPE= NMR SPECTRUM
##DATA CLASS= NTUPLES
##ORIGIN= BRUKER
##OWNER= patiny
$$ 1.79 TOPSPIN		Version 3.0
$$ 2012-05-21 04:20:02.439 +0200  patiny@icmbsg005
$$ Compression mode = diff/dup
##.OBSERVE FREQUENCY= 400.13188181139
##.OBSERVE NUCLEUS= ^1H
##.ACQUISITION MODE= SIMULTANEOUS (DQD)
##.ACQUISITION SCHEME= undefined
##.AVERAGES= 16
##.DIGITISER RES= 23
##SPECTROMETER/DATA SYSTEM= spect
##.PULSE SEQUENCE= zg30
##.SOLVENT NAME= D2O
##.SHIFT REFERENCE= INTERNAL, D2O, 1, 11.697
##AUDIT TRAIL= $$ (NUMBER, WHEN, WHO, WHERE, PROCESS, VERSION, WHAT)
$$ ##TITLE= Audit trail, TOPSPIN		Version 3.0
$$ ##JCAMPDX= 5.01
$$ ##ORIGIN= Bruker BioSpin GmbH
$$ ##OWNER= patiny
$$ $$ /opt/data/patiny/nmr/XTC-z189_2/10/pdata/1/auditp.txt
$$ ##AUDIT TRAIL=  $$ (NUMBER, WHEN, WHO, WHERE, PROCESS, VERSION, WHAT)
(   1,<2012-05-21 04:20:00.480 +0200>,<patiny>,<icmbsg005>,<go>,<TOPSPIN 3.0>,
      <created by zg
	started at 2012-05-21 04:17:55.631 +0200,
	POWCHK enabled, PULCHK disabled,
       configuration hash MD5:
       77 C7 B7 C4 10 F4 BA 30 64 2E BB 52 82 F2 DA 41
       data hash MD5: 64K
       86 71 97 EC 06 B5 96 EC 54 71 C9 6C A7 A7 87 1C>)
(   2,<2012-05-21 04:20:01.040 +0200>,<patiny>,<icmbsg005>,<audit>,<TOPSPIN 3.0>,
      <user comment:
       ICON-NMR User ID: patiny
       data hash MD5: 64K
       86 71 97 EC 06 B5 96 EC 54 71 C9 6C A7 A7 87 1C>)
(   3,<2012-05-21 04:20:01.588 +0200>,<patiny>,<icmbsg005>,<proc1d>,<TOPSPIN 3.0>,
      <Start of raw data processing
       ef LB = 0.3 FT_mod = 6 PKNL = 1 SI = 64K 
       data hash MD5: 64K
       2F 6A 81 DA 1C 76 0E 0E F9 DB A8 4B AD 9B 89 87>)
(   4,<2012-05-21 04:20:01.932 +0200>,<patiny>,<icmbsg005>,<proc1d>,<TOPSPIN 3.0>,
      <apk 
       data hash MD5: 64K
       7D 2B 91 73 CD 38 1B A2 B8 7D 49 F5 50 20 A2 80>)
(   5,<2012-05-21 04:20:01.964 +0200>,<patiny>,<icmbsg005>,<proc1d>,<TOPSPIN 3.0>,
      <abs ABSG = 5 
       data hash MD5: 64K
       62 AC B6 FA 31 91 75 66 68 37 AB 54 2D 03 73 18>)
$$ ##END=
$$ 
$$ $$ hash MD5
$$ $$ A4 7F 90 6D 2B 96 E3 A5 6E 78 1E BD 0A 9D 75 F7
##$RELAX= 
##$RELAX= 
##$RELAX= 
##$RELAX= 
##$RELAX= 
##$RELAX= 
##$RELAX= 
##$RELAX= 
##$RELAX= 
##$RELAX= 
##$RELAX= 
##$RELAX= 
##$RELAX= 
$$ Bruker specific parameters
$$ --------------------------
##$DATPATH= </opt/data/patiny/nmr>
##$EXPNO= 10
##$NAME= <XTC-z189_2>
##$PROCNO= 1
##$ACQT0= -3.02521000389291
##$AMP= (0..31)
100 100 100 100 100 100 100 100 100 100 100 100 100 100 100 100 100 100
100 100 100 100 100 100 100 100 100 100 100 100 100 100
##$ANAVPT= -1
##$AQSEQ= 0
##$AQ_mod= 3
##$AUNM= <au_zg>
##$AUTOPOS= <58 >
##$BF1= 400.13
##$BF2= 400.13
##$BF3= 400.13
##$BF4= 400.13
##$BF5= 400.13
##$BF6= 400.13
##$BF7= 400.13
##$BF8= 400.13
##$BYTORDA= 0
##$CAGPARS= (0..11)
0 0 0 0 0 0 0 0 0 0 0 0
##$CFDGTYP= 0
##$CFRGTYP= 9
##$CHEMSTR= <none>
##$CNST= (0..63)
1 1 145 1 1 1 1 1 1 1 1 1 1 1 1 1 1 1 1 1 1 1 1 1 1 1 1 1 1 1 1 1 1 1 1
$$ [...]
##$TE1= 298.3784
##$TE2= 0
##$TE3= 0
##$TE4= 0
##$TEG= 300
##$TE_PIDX= 1
##$TE_STAB= (0..8)
2 2 0 0 0 0 0 0 0
##$TL= (0..7)
0 120 120 120 120 120 120 120
##$TP= (0..7)
150 150 150 150 150 150 150 150
##$TPNAME0= <>
##$TPNAME1= <>
##$TPNAME2= <>
##$TPNAME3= <>
##$TPNAME4= <>
##$TPNAME5= <>
##$TPNAME6= <>
##$TPNAME7= <>
##$TPOAL= (0..7)
0.5 0.5 0.5 0.5 0.5 0.5 0.5 0.5
##$TPOFFS= (0..7)
0 0 0 0 0 0 0 0
##$TUNHIN= 0
##$TUNHOUT= 0
##$TUNXOUT= 0
##$USERA1= <>
##$USERA2= <>
##$USERA3= <>
##$USERA4= <>
##$USERA5= <>
##$V9= 5
##$VALIST= <>
##$VCLIST= <>
##$VD= 0
##$VDLIST= <>
##$VPLIST= <>
##$VTLIST= <>
##$WBST= 1024
##$WBSW= 4
##$XGAIN= (0..3)
0 0 0 0
##$XL= 0
##$YL= 0
##$YMAX_a= 8183837
##$YMIN_a= -3775059
##$ZGOPTNS= <>
##$ZL1= 120
##$ZL2= 120
##$ZL3= 120
##$ZL4= 120
##$ABSF1= 11.697
##$ABSF2= -2.290992
##$ABSG= 5
##$ABSL= 3
##$ALPHA= 0
##$AQORDER= 0
##$ASSFAC= 0
##$ASSFACI= 0
##$ASSFACX= 0
##$ASSWID= 0
##$AUNMP= <save_auto_nonLDAP.pm>
##$AXLEFT= 0
##$AXNAME= <>
##$AXNUC= <1H>
##$AXRIGHT= 0
##$AXTYPE= 0
##$AXUNIT= <>
##$AZFE= 0.1
##$AZFW= 0.1
##$BCFW= 0
##$BC_mod= 0
##$BYTORDP= 0
##$COROFFS= 0
##$CY= 15
##$DATMOD= 1
##$DC= 0
##$DFILT= <>
##$DTYPP= 0
##$ERETIC= no
##$F1P= 0
##$F2P= 0
##$FCOR= 0.5
##$FTSIZE= 65536
##$FT_mod= 6
##$GAMMA= 0
##$GB= 0
##$INTBC= 1
##$INTSCL= 1
##$ISEN= 128
##$LB= 0.3
##$LEV0= 0
##$LPBIN= 0
##$MAXI= 10000
##$MC2= 0
##$MEAN= 0
##$ME_mod= 0
##$MI= 0
##$NCOEF= 0
##$NC_proc= -3
##$NLEV= 6
##$NOISF1= 0
##$NOISF2= 0
##$NSP= 0
##$NTH_PI= 0
##$NZP= 0
##$OFFSET= 11.697
##$PC= 1
##$PHC0= 124.4194
##$PHC1= -8.07879
##$PH_mod= 1
##$PKNL= yes
##$PPARMOD= 0
##$PPDIAG= 0
##$PPIPTYP= 0
##$PPMPNUM= 2147483647
##$PPRESOL= 1
##$PSCAL= 4
##$PSIGN= 0
##$PYNMP= <proc.py>
##$REVERSE= no
##$SF= 400.13
##$SI= 65536
##$SIGF1= 0
##$SIGF2= 0
##$SINO= 0
##$SIOLD= 65536
##$SPECTYP= <>
##$SREGLST= <1H.D2O>
##$SSB= 0
##$STSI= 65536
##$STSR= 0
##$SW_p= 5597.01492537316
##$SYMM= 0
##$S_DEV= 0
##$TDeff= 65536
##$TDoff= 0
##$TI= <>
##$TILT= no
##$TM1= 0
##$TM2= 0
##$TOPLEV= 0
##$USERP1= <>
##$USERP2= <>
##$USERP3= <>
##$USERP4= <>
##$USERP5= <>
##$WDW= 1
##$XDIM= 65536
##$YMAX_p= 328830249
##$YMIN_p= -33110
##$CURPLOT= <Cups-PDF>
##$CURPRIN= <$Cups-PDF>
##$DFORMAT= <normdp>
##$LAYOUT= <+/1D_H.xwp>
##$LFORMAT= <normlp>
##$PFORMAT= <normpl>
$$ End of Bruker specific parameters
$$ ---------------------------------
##NTUPLES= NMR SPECTRUM
##VAR_NAME=  FREQUENCY,     SPECTRUM/REAL,   SPECTRUM/IMAG
##SYMBOL=    X,             R,               I
##VAR_TYPE=  INDEPENDENT,   DEPENDENT,       DEPENDENT
##VAR_FORM=  AFFN,          ASDF,            ASDF
##VAR_DIM=   65536,         65536,           65536
##UNITS=     HZ,            ARBITRARY UNITS, ARBITRARY UNITS
##FACTOR=    0.0854036701259332, 1,          1
##FIRST=     5596.92952170303, 1553,         -6833
##LAST=      0,             10259,           -20207
##MIN=       0,             -33110,          0
##MAX=       5596.92952170303, 328830249,    0
$$ Real data points
##PAGE= N=1
##DATA TABLE= (X++(R..R)), XYDATA
$$ [...]
44662 27909 26597 27662 28055 26559 25672 25413 27981 32468 36015 39642 43895 44295 41179 36820 33442
44647 33442 34428 39473 46182 50781 52264 53811 56605 59125 60253 62282 64814 63190 58440 54753 54824
44632 54824 55379 53784 53425 55618 59669 61113 59363 57794 60612 64801 62725 54760 49741 51915 54104
44617 54104 53268 51369 48385 46238 44959 43318 41421 39534 37300 34901 31894 29142 27359 26864 26146
44602 26146 22104 17619 16020 15412 14524 15371 15527 13798 12807 15750 18629 19876 20457 20844 22141 23236
44586 23236 23609 23672 22892 18899 13306 6709 -1111 -5177 -2129 1787 2367 5247 8476 7267 3607 1871
44570 1871 3030 5982 8756 9886 10290 9835 8108 6665 4866 1747 386 2007 2725 1837 40 255 -179
44552 1128 6051 10338 9664 6167 3641 3699 6181 8540 9935 10451 8682 7414 7041 7570 7987 4860
44536 4860 2416 2422 7245 12101 14429 17785 20175 21585 22192 18837 12886 7404 3128 744 211 -2306
44519 -6090 -6280 -3141 683 1696 912 -624 488 2804 4228 5300 4432 5280 7496 8390 9461 9001 6301
44502 6301 4261 2665 -1320 -4114 -2447 304 -234 -3123 -5267 -5370 -3593 475 4701 7237 6060 4462
44486 4462 4338 2446 107 2292 5336 7179 9254 8704 2467 -4370 -3023 1807 3619 2955 1026 1523
44470 1523 4040 3211 1449 2317 6251 9939 9072 9352 12827 14711 14732 15658 16269 16827 19011 19337 14069
44453 14069 7405 6439 10165 12592 12741 10571 6760 4717 6935 11338 14816 14971 10894 7638 6538
44438 6538 6808 3546 -1974 -4076 -4905 -3740 -1128 -88 1800 5059 6922 7697 6705 5201 6927 10387
44422 10387 12020 12992 13928 13233 12188 12457 13957 14278 10426 5678 5673 9866 13759 15458 13962 9378
44406 9378 2579 -556 -1038 -2549 -1830 1555 1472 -1290 -1744 -1171 2321 6767 9145 8713 8235 7158 5665
44389 5665 5482 5571 6553 7925 8436 6571 4164 1752 493 2756 5340 5837 4371 1859 1671 1519 2596
44372 2596 5840 8183 12239 16308 17127 16612 14143 10025 8774 11350 14153 14032 11872 11041 10502 8077
44356 8077 4911 2865 1836 4468 6043 3142 -785 -3008 -4288 -4685 -4256 -2721 -2713 -3239 619 3276 2474
44339 2474 1520 2205 5971 10305 12933 13912 14483 14471 14076 14480 15522 15931 14543 13387 8871 2590 -1257
44321 -3598 -2634 -180 495 -711 375 4276 4273 -489 -4883 -5586 -3710 12 1058 -1794 -3349 -1977 -564 79
44302 -642 -2830 -4734 -5576 -3593 -490 490 376 2377 4313 6047 4518 -925 -4575 -4784 -1100 2967
44285 4457 4705 4619 4832 6828 7982 7325 4391 117 -2878 -2443 -2 49 -1181 -1076 -757 -579 -1888 -4604
44267 -4604 -1675 6263 9191 5790 3415 2971 3302 1939 -2322 -5478 -6536 -4532 -1199 576 -388 -1898
44251 -1898 -2029 -2760 -3344 -5132 -6847 -5836 -5358 -6269 -7404 -7409 -5696 -2456 1473 4927 5206 4706 5067
44234 5067 5070 6532 7030 9013 13599 16511 15466 15087 15084 12324 9146 6525 4761 4083 4667 3681 3307 3792
44216 3792 2191 -1467 -3882 -5080 -5252 -3698 -4198 -7535 -8577 -7395 -5082 -160 2710 1957 916 -30
44199 -1862 -1631 -379 -436 -1859 738 5917 8216 6955 3466 -701 -4175 -4835 -6220 -9754 -12113 -11274 -8303
44182 -8303 -5140 -3379 -2458 -1469 268 2130 656 -2195 -3508 -2350 18 2575 5958 7146 5423 2555
44165 2802 1195 -744 -2081 -749 2450 1460 508 1182 2204 5009 6968 9095 10320 11972 13264 12095
44149 12095 8111 2503 -858 -1403 -2918 -4310 -3382 -1065 1809 5334 5641 2278 -928 -1308 -2538 -4036
44133 -4036 -4308 -5202 -4546 -4474 -4252 -2488 -1931 -784 1323 1080 -936 -6625 -11881 -9551 -5066 -4394 -5781
44116 -5781 -6178 -6262 -8078 -9232 -7167 -4603 -4894 -6151 -5556 -3636 -2872 -4595 -6317 -6998 -5771 -2757
44099 223 1001 -491 -3839 -4211 -1755 -1926 -4409 -6518 -7226 -6824 -5099 -3788 -4395 -5661 -4438 -1589 1704
44081 1266 -3249 -6693 -11167 -18382 -25709 -28721 -27470 -24536 -19961 -12640 -5366 -674 1544 884 -2784
44065 -5726 -5481 -3454 -883 2291 4438 4272 3233 4082 5738 5861 5394 6032 4923 593 -3059 -1550 -603
44047 -2693 -1442 1538 2341 2878 4028 3884 2907 1627 302 371 -27 -2756 -8684 -12248 -7820 -4262 -5866
44030 -5866 -9264 -11466 -11849 -12399 -12129 -7208 1642 7729 10251 12213 12569 11454 10416 9559 9174 8437
44014 8437 6361 1723 -3425 -5633 -8053 -12634 -16566 -17198 -15078 -12228 -10697 -9698 -7526 -3527 -1413
43998 -1667 -2023 -1492 -1404 -1346 -1732 -5054 -8447 -11070 -12290 -12628 -11792 -6509 -2227 -4002 -5109 -4131 -5176
43981 -5176 -6731 -6114 -2287 3922 6257 6630 8661 10890 9836 6627 4624 4299 5576 8393 10367
43966 10367 10567 8830 8483 8247 6065 5775 6920 6912 5517 3671 542 -4 281 -470 -1446 -712 -1468 -564 3431
43946 7102 8448 7625 7781 7493 7104 5591 306 -4291 -3638 -2006 -1870 -1431 -2420 -3562 -1839 1758 4563
43929 4563 6048 7471 9926 11730 12168 11067 10140 8936 6275 3285 1675 2338 6466 11565 15191
43914 15191 16441 15823 13090 10759 10721 9736 8968 11374 13305 14070 15891 15542 12795 12485 13843 12474
43898 12474 7278 1488 552 3097 4617 5768 4854 3060 2445 1503 964 -678 -4568 -7226 -5920 -2244
43881 923 3141 4436 5237 4642 3435 3343 5102 7003 8647 9857 10552 8028 1715 -3963 -6279 -5417
43865 -5417 -4771 -6045 -8660 -11135 -10787 -8402 -4480 566 4371 6153 4939 2175 -283 -2111 -2549 -2633
43849 -2633 -2004 1079 4410 4904 3821 2591 517 -434 451 -115 -2203 -4840 -9194 -10577 -8351 -7623
43833 -7623 -8304 -6361 -1093 2493 2684 2375 328 -2056 61 2774 4193 6543 8757 9601 7091 2095
43816 -548 -1982 -4793 -5481 -5650 -6785 -9774 -10704 -9350 -10058 -10019 -9614 -11206 -10141 -6486 -6278 -6998 -4054
43799 -4054 305 2698 3197 1718 -754 -2705 686 5185 4677 2643 784 -1603 -2124 -1244 1785 7744 10201
43782 10201 7611 5392 4321 4780 8047 9811 10568 10893 8948 6091 3053 1485 1941 4442 5924
43767 5924 3945 -463 -4035 -31 8011 9728 5954 1502 -2391 -3976 -1550 659 111 -1428 -2525 -3225
43751 -3225 -6457 -10834 -11891 -11801 -10448 -6853 -4471 -5744 -9073 -12226 -12948 -10967 -6847 -1153 2903
43735 5504 7137 7095 8359 10086 9086 6278 4563 4303 1938 -309 -944 -2546 -5512 -7091 -5313 -1067
43718 2640 4680 4687 3548 1139 -2284 -2547 -557 -349 642 3943 8414 9772 9265 10679 11572 9422 7325
43701 7325 6526 6539 6835 6896 6603 4909 1043 -3045 -3130 1576 5200 2902 582 2707 4039 3528 3322 1743
43683 1743 -240 -137 1674 3386 5477 6853 6047 7080 11570 14302 15473 17779 21390 23187 20884
43668 20884 17409 15740 15964 14959 12445 10712 8473 5955 3981 4082 5723 8438 11272 12160 9634
43653 9634 5303 3320 3863 3725 4508 4189 2647 2791 4926 7530 8622 8490 7753 6661 4171 -436 -2752
43636 -2752 -1635 446 2982 4223 5758 8026 13310 20275 24503 25559 23302 17554 12493 10526 10172
43621 10172 10253 10810 10613 7977 2109 -3619 -6150 -7831 -9378 -9161 -7238 -3850 -2226 -2721 -3652 -4773
43605 -4773 -4630 -4344 -2021 -1969 -5113 -7919 -10216 -11805 -11955 -11003 -10477 -8944 -6638 -2190 3392 6009
43589 6009 6054 6197 4035 -904 -4458 -6642 -8596 -7606 -2077 3691 5568 7160 11616 16474 18106 18477
43573 18477 17647 15202 14429 15029 14416 12131 12096 12988 15339 15081 11095 8422 8936 9538 10714 12695 11932
43556 11932 10061 7111 6001 6479 4284 223 -302 3320 4306 971 -1089 -671 829 2060 -280 -3534
43540 -3534 -6220 -10739 -15212 -16916 -14224 -11004 -8319 -4968 -1322 2004 4132 4862 6848 9880 8640
43525 8640 6312 4432 6163 9010 8347 6669 6792 9620 11414 11599 11729 12389 13760 13120 9209 7359
43509 7359 7546 5727 3861 2717 1275 185 1094 5276 10287 11427 11638 12626 11487 9902 8633 7339
43493 7339 5870 5915 5007 5037 5178 5662 5790 3326 -894 -2842 1047 5150 8185 13495 17346 16772 14681
43476 14681 12564 11377 9056 4067 2399 3348 2718 3324 6567 9552 10718 8811 5368 2551 -21 57
43459 502 -1747 -3889 -3538 -1222 -788 -577 1505 3981 6646 8180 11118 15238 15104 10808 7682 5615
43443 5615 5336 5632 2989 -238 -1875 -2857 -4694 -4635 -3787 -3037 -1264 1722 3285 3530 5753 11446 16077
43426 16077 17123 16029 13415 11572 10493 10334 10867 11203 11531 10833 10565 13065 16765 18927 19223 16120
43410 16120 12187 12396 14768 17257 20604 22517 19942 17038 16423 16470 15674 15013 17161 19442 21122 23557
43394 23557 25118 24778 23262 17605 9906 8261 10673 14448 17169 16992 13050 8550 8005 10057 11304
43379 11304 9477 7590 9348 9777 6173 3069 4677 7453 10581 11084 6698 4052 4970 4067 874 -720
43362 -1369 -730 516 1661 4684 6292 3463 -327 -2148 -4926 -7617 -6891 -5972 -5045 -2355 -436 2223
43345 6889 12501 15089 14237 11742 9698 8400 6424 4928 2909 2047 3256 4740 5855 6320 4630
43330 4630 3225 5510 5292 1407 -2734 -6126 -6466 -4330 -2591 -3278 -5333 -7534 -8279 -6118 -4205 -4782
43314 -4782 -3660 215 4316 8558 12277 12699 10608 7076 3939 1972 310 -1091 -4808 -10734 -12452
43299 -12452 -9471 -8511 -11519 -12127 -9515 -9378 -8729 -7410 -6440 -6981 -7694 -6902 -5811 -6998 -8348 -9905
43283 -9905 -11482 -10325 -7185 -4316 -3803 -4147 -4157 -2492 1658 5331 6647 5772 5519 5351 6373 8986
43267 8986 8105 6698 6067 6169 7003 3256 -5045 -12203 -11352 -5221 -1576 -2663 -6037 -7039 -4384 1125
43250 5965 7630 7116 8397 7562 3728 27 -3334 -6872 -9095 -10106 -10802 -11556 -13694 -14176 -11857 -8477
43234 -8477 -5344 -3853 -1676 1518 1420 -1108 -3344 -5790 -7877 -10740 -12390 -11896 -11433 -11521 -10037 -8272
43218 -8272 -8568 -9129 -8493 -5819 373 3803 1187 -2904 -3626 -3448 -3565 305 4889 4904 3115 3779 3569 3034
43200 3034 3639 4640 8695 10524 8915 10437 13671 12256 7931 6210 9390 12474 11149 6944 3308
43184 2496 5971 11094 12235 12380 12664 12301 9577 6105 4127 4953 4854 1072 336 7295 14052 17570
43168 17570 18166 14129 7426 1018 -1848 -1307 556 1618 553 -1281 -2694 -3315 -2902 -1248 1083 4887
43152 4887 9001 9976 9789 8199 6412 7902 12623 15789 17377 15035 8800 2150 -4942 -8751 -7222
43137 -7222 -6138 -6627 -3739 1313 6743 9287 9449 10018 8348 8533 7868 4293 -1561 -8225 -11974 -13009
43121 -13009 -10995 -8142 -4954 -2914 -3040 -3639 -817 2835 1732 -113 1185 6025 10439 12833 13211 12505
43105 12505 12636 11808 9714 8557 9365 8797 6012 7285 9659 8690 8660 11807 15437 18816 20446 19980
43089 19980 19893 20570 19843 16740 12458 9156 10009 13751 15257 14287 13551 10432 8248 9509 9425 6648 3465
43072 3465 3983 7761 11598 12775 10532 6629 4528 5577 7274 8712 11960 14490 14545 15648 18921
43057 18921 24400 29700 30384 29128 26732 20596 10887 3332 -213 -2897 -4334 -3498 -1009 -945 -1020 1915
43040 5511 7066 4640 3177 4793 6695 7996 9546 11372 14212 16085 14021 9513 5569 2491 340
43024 -985 -3296 -4109 -4540 -4810 -3909 -2471 1831 7885 12728 13263 10139 6443 6208 4962 411 -1590 1441
43006 4074 5715 7001 7196 6927 5406 3941 5306 9602 13966 16143 14630 10355 7552 8246 7109
42991 7109 4587 2408 96 770 3705 7837 12690 15515 15623 15257 15748 14090 11202 7986 5083 5729
42975 5729 8263 8503 4813 689 727 1254 2821 7382 9979 7687 5725 5400 3113 1430 26 -1044 703
42957 4372 8321 11747 14039 16680 18686 17608 13951 9212 7576 8871 12284 15098 13584 11414 11892
42942 11892 11277 9615 8128 4608 283 1386 6880 11583 14257 14336 14641 16229 17439 18414 15217 10578
42926 10578 7546 5182 2917 814 56 -702 -511 4837 14518 20657 19357 15308 11865 9439 9687 10642
42910 10642 9308 9768 11825 12092 12914 12658 10321 10229 10530 8714 6679 4053 1746 3481 6357 7840
42894 7840 8410 12188 16480 15998 14269 11626 5746 431 470 1475 991 3530 6935 5668 4632 7541
42878 7541 7503 5568 6852 9028 8889 8430 8811 8064 7839 9634 9909 10366 11390 13905 16638 13947 12783
42861 12783 15988 19663 23067 24445 24765 22881 21694 21135 18059 15020 13557 12977 12975 11447 11631 12604
42845 12604 12416 12355 12548 14329 19099 23764 25310 24770 25293 25032 25735 29932 33904 32789 29746 25602
42829 25602 18786 14737 14243 12335 8665 6134 5662 5654 7421 11548 15777 18554 19897 18288 15377 14264
42813 14264 12179 11599 12989 14626 14274 13242 11673 10642 12582 16225 18428 19201 19995 20539 21238 23723
42797 23723 24986 23361 20041 18498 18013 17739 20057 27461 33827 33831 31634 30640 29090 26776 26787 28390
42781 28390 30530 30622 31181 31533 31417 33247 35234 36043 35272 36777 41371 47158 50308 47835 45260 44541
42765 44541 47539 54177 59358 61651 62933 66156 70942 74139 73897 74727 74974 72366 71481 76397 88529
42750 88529 101324 106235 106676 104393 103063 106787 111659 112332 109804 111753 117809 124420 130228 133010 136795
42735 136795 141260 146108 153251 160537 167456 174093 182194 191469 203030 217782 233400 250916 275922
42722 275922 306459 339416 377492 419455 464964 517523 583226 663887 754957 861026 984587
42711 984587 1123367 1274865 1437836 1608156 1779924 1945006 2095117 2225431 2332443 2410443
42701 2410443 2452014 2451262 2404679 2315428 2193612 2046787 1883170 1706370 1519274 1334158
42691 1334158 1161858 1010066 878878 767058 672282 592344 525552 469929 425675 391682
42681 391682 363681 338787 316436 296616 279818 264278 248822 237035 228447 221079 216397 213162
42669 213162 209864 205317 201759 199646 198727 197365 194828 195497 199973 205607 210528 212829 213253 210409 208220
42654 208220 209509 212262 216313 219936 224181 226581 227992 231469 233112 233662 234184 236855 244269 253894 261449
42639 261449 269237 280076 292221 307515 325743 343408 359672 378390 402417 430298 461061 500235
42627 500235 549976 608930 678829 762084 863823 987742 1130439 1292584 1474825 1677447
42617 1677447 1900595 2137193 2381525 2626130 2858713 3072067 3263391 3422426 3533703
42608 3533703 3593289 3590805 3517142 3376988 3189412 2970912 2724892 2456398 2178875 1907155
42598 1907155 1654215 1429009 1235984 1074215 940818 830809 737383 657391 590611 537375
42588 537375 491470 450378 414027 381664 353513 330470 311114 293636 274999 255975 238096
42577 238096 220308 204132 192321 185251 181591 178661 174971 169658 166271 162078 152127 142742 138559
42564 138559 137643 134813 130510 127623 122751 114224 104495 98337 92822 87420 85891 83185 78467 75615
42550 75615 75291 76355 78649 81541 82196 77669 71563 68404 67458 66619 67347 67105 63549 62251 63048 64442
42534 64442 68785 74964 79435 80877 81380 82772 82218 79911 80360 81812 84402 89056 90124 88069 89317
42519 89317 97110 107724 114330 114974 114612 114964 115011 117973 124350 132903 143573 151236 156177 163859 172682
42504 172682 180098 186994 193047 201085 210089 216900 225334 237740 252289 266551 283283 299269 311566
42491 311566 325464 343643 362319 381838 403453 426143 455459 491267 531087 577466 630639
42480 630639 688291 752948 828413 915797 1016877 1134381 1264478 1405049 1556592 1720228
42470 1720228 1888564 2059456 2237209 2410104 2565493 2701694 2820637 2919646 2993367 3039402
42460 3039402 3054426 3043514 3019145 2990523 2958565 2923757 2894179 2876479 2873415 2889790 2927410
42449 2927410 2984498 3057246 3136486 3211836 3275374 3321956 3349964 3358342 3341389 3284527 3181048
42438 3181048 3041910 2880011 2699155 2501800 2293269 2079123 1869122 1672026 1494370
42429 1494370 1332957 1185830 1053911 939293 841632 756964 680614 614272 558744 512784
42419 512784 474432 440856 411422 386133 362523 338240 313677 290496 269163 250527 235267
42408 235267 221005 207759 196070 186590 179027 169313 159436 149975 140534 131827 123173 113102 102369
42395 102369 94344 91144 91041 90820 86522 79761 75809 73345 70504 69000 68126 66182 60236 53243 50736
42380 50736 50218 47597 44090 43082 45755 48776 50496 50234 49908 49767 47219 42506 39376 36899 33409
42365 33409 27921 24279 22487 21186 20652 19422 17838 16184 13497 11822 12604 13494 18784 28909 35797
42350 35797 35342 33346 31249 27769 23840 20913 21296 24373 26469 25284 22728 22971 25451 24944 21850
42335 21850 18278 17548 20143 24057 28097 29770 29445 28988 28241 27595 25968 24395 26428 28724 25242 21996
42319 21996 22366 26140 29994 31062 29661 27344 27237 29392 31147 33311 35984 38579 41266 44995 50354
42304 50354 52993 52445 51170 51822 54898 57812 59354 60370 62932 68848 73637 74041 74533 76183 78018
42289 78018 80601 83510 86685 89524 90570 91355 93245 94335 94520 94208 96088 101890 112166 121857 124952
42274 124952 125581 127791 131155 135593 143877 154207 159349 159713 161528 165428 170818 180084 191008 200847
42260 200847 213142 226829 241653 258644 278116 298798 320828 343906 373771 412859 453697
42249 453697 494952 541230 598321 667512 748411 838727 937331 1041202 1151320 1269868 1392307
42238 1392307 1513846 1631609 1741381 1836861 1913224 1969637 2006253 2028053 2040461 2040249 2020291
42227 2020291 1981878 1931076 1873020 1817125 1773897 1744270 1724950 1715944 1714510 1716011 1724061 1743227
42215 1743227 1768086 1787103 1795375 1792795 1777926 1749707 1709937 1655598 1582731 1492199 1386746
42204 1386746 1274303 1165251 1063141 966432 874304 788910 709904 637025 571359 516219 469925
42193 469925 429186 391408 358919 334260 317947 304392 287886 270673 257380 248988 241412 231721
42181 231721 219719 209220 202838 199457 199000 198885 198046 196418 194871 194740 196019 198132 200884 204313 209534
42166 209534 216249 222582 229856 240288 251293 261946 272604 285931 307492 335250 365352 398774
42154 398774 437767 482354 531229 587615 650223 719276 795606 872384 946677 1020906 1094702
42143 1094702 1164932 1230407 1287392 1329787 1355831 1372206 1382313 1383770 1372756 1348894 1315457
42132 1315457 1277465 1241251 1211667 1191243 1177995 1171033 1170869 1175249 1183990 1198144 1213884 1226687
42120 1226687 1231772 1228217 1219723 1202207 1173548 1136568 1087217 1022458 948001 872008 796698 721464
42108 721464 649293 582051 516277 457363 405562 358577 317218 282420 251236 224044 201863
42097 201863 182621 165132 150058 139808 131152 121738 113481 105107 100085 94908 84792 76890 73348
42084 73348 69833 66293 63900 61911 58385 52452 46968 43232 39639 38945 40117 39137 42546 47728 47204
42069 47204 43431 42389 41453 35860 28751 24046 23413 25747 29703 32644 33813 34521 32435 27890 21685
42054 21685 16987 14756 12837 10659 7445 5686 6715 7544 7256 4912 2413 814 393 3055 6888
42039 6888 9355 8526 7112 7208 8824 11361 11429 10096 9614 9486 8262 6268 4437 4620 4565 3558 3889
42022 3889 3712 2850 -1228 -6975 -9359 -9673 -9608 -10527 -10825 -11531 -15162 -19256 -18952 -17116 -16037 -13206 -8324
42005 -8324 -4152 -1898 -2747 -1682 3334 5247 2878 29 -4326 -11453 -16745 -18579 -18982 -15609 -11773 -10928
41989 -10928 -8284 -4101 -1553 1201 4392 7679 8043 2544 -4152 -5798 -6279 -6447 -3538 -1294 -552
41973 -2194 -7237 -10530 -11705 -12067 -11166 -9478 -6374 -4619 -4363 -6579 -7030 -6099 -5445 -5702 -7526 -9490
41957 -9490 -9723 -7518 -4572 -3363 -1550 -1080 -3686 -6130 -6596 -6996 -6419 -5011 -4141 -4832 -9033 -14830
41941 -14830 -18150 -18951 -18312 -17656 -16904 -16970 -19687 -21235 -20216 -18788 -16774 -13266 -7364 -2617 -5126 -9605
41925 -9605 -10158 -5505 482 1993 -980 -6208 -9191 -8704 -6842 -5236 -3914 -3750 -4280 -1180 2430 4874
41909 4874 5635 5088 5286 3818 -838 -3385 -793 1814 627 -1435 -3967 -7981 -9285 -8370 -10132 -9849 -7268
41892 -7268 -4912 -4307 -7323 -11496 -13130 -14480 -15559 -14487 -11366 -8504 -8608 -10611 -12079 -10609 -6075
41877 -6075 -4706 -6270 -6730 -3647 820 1556 1284 261 -645 -1046 -3220 -5112 -7829 -10263 -10942 -9716 -8592
41860 -8592 -9845 -8707 -5083 -2461 -676 2343 4635 5916 5434 2512 -476 -1775 -2270 -3816 -5527 -5728
41844 -5728 -4171 -3276 -4225 -3494 -2332 -218 2868 3454 269 -5977 -11550 -12350 -8984 -6648 -6428 -6673 -7707
41827 -7707 -8490 -8224 -9058 -10317 -9049 -7134 -6151 -4226 -1390 -1846 -5664 -8672 -9108 -10351 -13034 -14350
41811 -14350 -14848 -14773 -13553 -12577 -11646 -9524 -6015 -4072 -5206 -8914 -10516 -10722 -10348 -8469 -9381 -12215
41795 -12215 -13772 -12683 -9260 -6058 -3512 -2166 -2677 -4579 -8383 -10796 -11223 -11962 -14355 -16423 -15571
41780 -15571 -12010 -8789 -5306 -3293 -4835 -6497 -3913 -2542 -3400 -4067 -4322 -3420 -2951 -5444 -7321 -6741
41764 -6741 -6889 -6383 -6394 -7370 -7972 -3791 3377 6280 2302 -2493 -2730 -732 -33 888 4337 7234 7585 6959
41746 6959 6059 3626 1687 1121 738 1501 3947 6268 6212 5529 6731 6166 2688 286 -27 995 2494 2474
41728 2474 -858 -5631 -8017 -7787 -6090 -4260 -194 6572 12613 18637 23517 23274 19030 13607 9468 6901
41712 6901 3157 1941 3341 2671 3728 5768 6149 7458 10100 12526 11375 6294 356 -4361 -5889
41697 -5889 -6063 -6990 -8929 -10189 -8944 -6967 -5168 -4476 -3877 -2592 -2081 -2380 -3580 -6078 -8082 -9188
41681 -9188 -8604 -3765 -281 -1608 -3895 -5363 -3879 -612 -607 -3200 -5486 -7359 -8133 -8360 -8868 -10420 -11421
41664 -11421 -9937 -7090 -6783 -9426 -10891 -10088 -8976 -9326 -10592 -11702 -9061 -4269 -2436 -4149 -6441
41649 -6441 -8925 -11714 -13118 -12563 -11293 -11937 -14224 -12068 -6354 -3158 -3412 -8952 -15238 -15471 -10310 -2560
41632 2980 4864 3783 818 -1653 -834 453 1476 2455 4447 5732 5016 4011 3903 2497 718 879 706
41615 706 -461 82 3137 6988 10368 11017 7798 2481 -169 2725 7685 8514 4160 242 -2285 -4967 -6834
41598 -6834 -6648 -5720 -3688 -2073 -4143 -6065 -6918 -8913 -9221 -8529 -9386 -9334 -6579 -1791 2641 3988 3705
41581 3705 5303 3184 -1816 -4620 -2802 1533 2631 -455 -2043 -1762 -1903 -1666 379 3558 3074 200
41564 -3944 -6058 -4317 -4269 -4987 -4399 -4103 -5518 -6858 -5369 -1762 872 587 -1095 -2626 -4437 -5628
41548 -5628 -7140 -8351 -7623 -6097 -5940 -8058 -12316 -13213 -8942 -2991 -2629 -5178 -7599 -9391 -9791 -9280
41532 -9280 -9131 -9136 -6320 -3743 -3662 -5102 -5544 -4220 -3818 -1759 3680 8552 10088 10043 11984 13347 11143
41515 11143 7666 5100 6476 8303 7114 9279 13888 15576 14397 15161 16251 14430 15087 18350 20774
41500 20774 24097 27023 26543 24253 20438 15808 14202 12968 11886 15935 20972 20412 15214 12691 15605
41485 15605 18877 21438 24173 24919 24091 22609 19982 15475 11742 12112 12583 9749 5550 1416 -781 1980
41468 7298 9582 7800 3465 -1797 -3320 -954 1540 3021 2185 -712 -595 831 288 -2515 -5934 -9006
41452 -9006 -12705 -16102 -18305 -17383 -15780 -16239 -17364 -17047 -17628 -19065 -19490 -19468 -17793 -14131 -11537 -9855
41436 -9855 -9327 -6499 -1666 2114 4063 4571 3830 281 -3325 -5984 -7155 -5424 -3735 -3864 -3304 -2071
41420 -2071 -1299 -2797 -5516 -7497 -7844 -6826 -6861 -4546 496 3595 3105 2064 835 -1372 -1908 -1313 -740
41403 -740 -603 -1497 -2271 -3691 -7681 -11068 -9281 -4408 -804 -112 -642 -1563 -3852 -8025 -11021 -11898 -9175
41386 -9175 -5302 -1948 0 -96 -1442 -3694 -6595 -11205 -17701 -19955 -14144 -5568 213 1741 1278 1928 3664
41369 3664 2197 -3217 -10900 -13809 -10049 -7999 -8384 -9541 -9003 -4027 2853 6601 6526 5969 4720 3839
41353 3839 2147 -1943 -5117 -7864 -11829 -15415 -17034 -15289 -13453 -13810 -15715 -15138 -13311 -10593 -7545
41338 -7545 -6562 -6738 -6285 -7090 -9500 -11030 -9460 -7018 -5993 -7747 -13668 -15218 -9630 -5303 -4489 -4090
41322 -4090 -4571 -6054 -4774 -576 3629 2462 1137 3217 5151 2962 -2519 -6072 -5904 -5603 -7187 -8433
41306 -8433 -7959 -7602 -6628 -6138 -7683 -7638 -6536 -6478 -6417 -5285 -3078 -3542 -5273 -6594 -6281 -3659 -4129 -5725
41288 -5725 -5498 -9074 -13324 -12801 -9611 -7337 -7058 -6726 -5972 -6955 -9502 -10586 -7506 -371 5206 5430 4040
41271 4040 7163 10353 8184 3623 3476 8835 13456 14001 10074 5092 1527 -586 -1717 -2760 -821 975
41254 1644 -662 -5518 -9505 -11051 -9919 -9285 -7903 -3944 573 75 -3445 -5262 -5480 -5887 -5444 -4950 -4352
41237 -4352 -1686 -623 341 3578 7710 8415 7782 7143 5220 2896 1563 1074 1192 1305 939 -313 -1921
41220 -1921 -2447 -776 1440 2155 589 -2545 -3361 -1266 799 -250 -3931 -5267 -1895 1741 1194 -893 -51
41202 1299 -228 86 1691 2215 2368 4223 7627 8350 5875 4006 682 -6058 -10252 -9176 -4401 -872 -952
41185 -952 -1215 -705 -298 13 -1898 -4812 -4954 -4055 -3088 -2864 -2761 -3929 -5219 -5172 -6339 -4420 -1783 -1676
41167 -1676 -650 2705 4884 4766 4607 2981 1409 840 933 2641 3547 1176 -2341 -3160 -2343 -2968 -3899
41150 -3899 -3793 -3460 -3233 -6266 -9193 -8319 -6116 -6492 -7945 -8478 -7497 -6924 -7059 -6095 -4511 -3887 -4389 -5439
41132 -5439 -5822 -5178 -1114 3755 5735 5055 3738 195 -4178 -5482 -3067 -346 -236 -1209 -3367 -7420
41116 -7420 -11553 -13529 -14921 -15848 -14930 -12612 -10339 -11762 -13166 -12753 -12829 -11079 -8819 -9458 -10054 -9700 -11028
41099 -11028 -12462 -10707 -7229 -4735 -3962 -136 5674 8231 5701 -1609 -8487 -13132 -15596 -18015 -18783
41084 -18783 -17056 -15728 -15802 -17096 -18226 -16591 -13624 -12721 -11853 -10260 -12129 -15821 -17194 -13717 -9685
41069 -9685 -7873 -7621 -7177 -4540 -4132 -6106 -6766 -7244 -6996 -3928 -382 1358 568 -3887 -9136 -11847 -12843
41052 -12843 -12302 -9493 -8372 -12557 -15792 -16214 -15969 -14423 -12044 -10155 -11265 -11702 -7793 -3937 -3209 -3605
41036 -3605 -5775 -8557 -9987 -8600 -5928 -2397 -1140 -4907 -9965 -12520 -13151 -12277 -10973 -11603 -13855
41021 -13855 -13785 -9263 -6640 -7079 -6399 -3729 -647 -65 -1668 -1876 -604 18 -1384 -5092 -8454 -12524 -16791
41004 -16791 -17399 -15023 -13604 -13559 -13548 -13820 -14320 -13530 -12581 -13648 -15700 -16172 -14885 -12473 -11977 -14377 -19000
40987 -19000 -20712 -18624 -17917 -18784 -19105 -18367 -19196 -19103 -17584 -19013 -20452 -18601 -14108 -7942 -2054 1078
40970 191 -3929 -4484 -941 322 -176 -918 -3373 -5836 -6795 -6276 -7622 -11520 -15550 -16102 -11616 -5830 -2341
40952 -2476 -2752 -5223 -7615 -7245 -6897 -6032 -1547 2233 1586 -1088 -4733 -6304 -3880 -1282 -624 -1556
40936 -1556 -5229 -8492 -7055 -3171 -1522 -4004 -6383 -5524 -4971 -4753 -5622 -6335 -5381 -5384 -5620 -5894 -6097 -4553
40918 -4553 -1020 2631 4203 5039 5938 8057 9020 6919 2384 -3601 -4709 -3236 -1612 -32 -123 -2370
40902 -2370 -5135 -5361 -5468 -3387 1412 2995 1113 -542 1311 3117 3243 1559 -786 -1962 -2985 -4860
40886 -4860 -8536 -12339 -12400 -10466 -9131 -8976 -8618 -5222 -1655 -188 488 -1743 -5851 -8374 -10634 -11668
40870 -11668 -10605 -9549 -8680 -6578 -4345 -3572 -2889 -300 3509 3192 -1283 -4463 -4464 -2377 -555 233 209
40853 209 -274 -1300 -2625 -2041 1100 3956 7059 8252 5103 -3 -3662 -3800 -3354 -2344 -436 1248 570
40835 -1475 -2547 -2953 -3088 -2530 -908 1343 1699 -406 -779 737 2677 2661 1628 3113 4563 3984 646 -4699
40816 -10303 -13359 -12485 -9132 -3669 844 3878 4927 4711 5296 4138 -498 -3757 -2815 -1727 -3507 -5815
40800 -5815 -4123 944 2097 -1434 -4261 -5731 -7133 -7820 -5899 -2198 -1592 -3693 -3465 485 4439 4703
40784 4703 2618 1022 265 -3064 -8388 -11304 -11749 -10512 -9929 -11777 -12308 -9468 -5999 -5189 -5362 -3410
40768 -3410 -62 -319 -3883 -6506 -8938 -12052 -15478 -18596 -19358 -15045 -5765 -494 -1635 -3529 -6800 -8559
40752 -8559 -6133 -4690 -4824 -4869 -4578 -5204 -5581 -5546 -5153 -3299 -5508 -11936 -15571 -13285 -9768 -6739 -8489
40735 -8489 -14475 -20773 -23457 -18446 -12620 -7906 -4569 -5221 -5978 -5204 -4529 -6372 -9164 -11670 -14652 -17167
40719 -17167 -19440 -21332 -19918 -15895 -10047 -4749 -2736 -2084 -1082 -1300 -3765 -6539 -9092 -11173 -12142
40704 -12142 -11209 -6495 -3818 -6747 -10563 -13055 -10868 -8469 -10119 -11976 -10017 -4793 -322 797 -837
40688 -4073 -7848 -7556 -7607 -11031 -13424 -13461 -11799 -8062 -4648 -4413 -2587 -898 -1916 -4699 -8024 -10233
40672 -10233 -12383 -13264 -11719 -9955 -7738 -6539 -7305 -5401 -2889 -3546 -5854 -8650 -11179 -11285 -10409 -8236
40656 -8236 -6312 -8100 -10053 -9609 -9546 -8899 -5208 -1281 -157 1481 5355 9015 11204 8372 1981 -2125
40639 -4867 -5901 -6049 -7660 -11302 -14795 -15695 -12478 -5856 -616 -327 -3653 -9103 -11121 -8134 -3475 -1037
40622 -3877 -9475 -13925 -16179 -16359 -16360 -15094 -10082 -6224 -5390 -6118 -7846 -8296 -7699 -8448 -7748 -4453 -2380
40605 -2380 -2011 -1795 681 937 -1413 -1935 -1018 -2038 -3193 -2993 -4891 -9487 -11171 -9712 -8568 -5765
40589 -5765 -1170 2083 1118 -4029 -8535 -10339 -8331 -2500 2763 3451 -1337 -7737 -16427 -23618 -26935
40574 -26935 -29682 -33110 -32507 -26191 -19228 -14540 -9948 -8043 -8508 -7039 -6387 -9257 -12222 -12876 -9415
40559 -9415 -7511 -5771 -885 2163 2922 3107 2203 3358 8352 11773 11773 10619 9513 5957 120 -3110 -3162
40542 -3162 -6105 -11056 -13843 -14740 -12001 -7520 -5654 -5408 -4538 -4307 -2578 96 -343 -4364 -5927 -4255
40526 -4255 -2577 -209 1594 3345 4896 5736 6487 3283 -2855 -8505 -10688 -8261 -4939 -3172 -1750
40511 -1750 -261 -273 -3142 -7718 -11304 -13984 -14714 -12986 -10839 -9372 -7814 -5376 -2926 -3646 -6286 -6841
40495 -6841 -3763 -26 3927 4700 333 -2521 46 753 -3741 -8693 -14527 -19701 -19026 -16242 -13233 -10447 -7933
40478 -7933 -4350 -1114 257 -1016 -1818 -14 1321 -540 -3443 -2647 2007 1562 -3005 -6208 -6276 -4225 -2732
40461 -2732 -2431 -140 1565 541 -1708 -3340 -4831 -7043 -8669 -8348 -8834 -9207 -8479 -6152 -2344 -849 -2471
40444 -2471 -5026 -8291 -11459 -11160 -6988 -3037 -113 519 -23 735 323 -1177 -1835 6 2314 2721 2280 1293
40426 1293 -1040 -4077 -7709 -7282 -6646 -8472 -9173 -8452 -4123 658 523 -1292 -563 1732 1603 -2377 -9052
40409 -9052 -17780 -26466 -29079 -26743 -24572 -22207 -17116 -10197 -2212 4866 5942 2595 -290 -2636 -6126
40394 -6126 -8225 -9049 -8766 -5835 -2159 467 2622 922 -4398 -4364 -1873 -1051 -243 1219 1797 -273 -1162
40377 -1162 35 2588 2475 -236 -2362 -4041 -4346 -2816 -2713 -4120 -4183 -4078 -3422 -1961 -486 -2672 -6700
40360 -6700 -8979 -10036 -7561 -5362 -4899 -4683 -5515 -5427 -2786 -1230 -384 -1514 -4972 -5497 -3250 -1698
40344 -1698 -1177 -1112 -1515 -2434 -1110 -526 -948 -608 808 2371 644 -4533 -10692 -11736 -8833 -6265 -6410
40327 -6410 -10386 -14106 -14227 -12595 -11462 -7613 -3955 -2255 -3179 -2887 -4104 -7840 -10264 -11201 -11796 -8942
40311 -8942 -4364 478 4966 6035 5154 4023 4221 5711 6166 2682 -762 -4232 -6643 -3444 2870 6680
40295 6680 8092 6782 4169 1516 -4064 -8759 -8530 -7515 -6660 -5515 -5955 -6950 -5510 -1727 732 -364
40278 -4249 -8881 -10673 -9898 -8806 -8391 -5862 -4115 -4840 -7844 -10387 -8846 -6084 -6369 -6371 -3089 399 2995
40261 2995 2900 1285 1183 -252 -633 -850 -2703 -3175 -3928 -8072 -12787 -13153 -12716 -14727 -17475 -18741 -19086
40244 -19086 -19067 -14538 -7193 -2155 -986 -3205 -5166 -4376 -3238 -1822 -874 -65 2109 4970 7563 7122
40228 7122 4850 2113 -2478 -5002 -5238 -3473 -1171 -1758 -3764 -2796 1492 3944 3514 816 -1672 -2211
40212 -2211 -3863 -6597 -4555 -72 20 -3940 -7598 -8254 -9467 -10676 -10941 -8773 -4977 -2543 -569 1954
40195 4645 5328 5827 6235 3500 -71 -2113 -2400 -2578 -2158 -2673 -6964 -11740 -14300 -14637 -14866 -15237 -12844 -10751
40177 -10751 -10122 -8745 -4632 -1595 -2245 -1005 -579 -4750 -10252 -11630 -9308 -5169 -4393 -3767 228 6058
40161 6058 9468 8855 6961 3775 -1043 -4363 -5859 -6077 -6444 -8273 -6349 -2094 491 2042 1838 -296
40144 -2721 -3543 -832 2162 2555 1688 -16 -358 2372 3775 3443 1128 -5314 -9941 -10362 -10632 -13021 -14408
40127 -14408 -15282 -16317 -15725 -12389 -6267 -2993 -3951 -4011 -705 931 92 -1073 -4719 -7818 -8779 -9155 -9382
40110 -9382 -10974 -13368 -14873 -14370 -13852 -10832 -6352 -4404 -2240 1233 3093 2701 835 -1177 -2966 -3297
40094 -3297 -3056 -4492 -3822 -1103 229 -821 -3137 -3822 -2910 -4198 -6341 -4547 -761 2669 3554 -1137 -7101
40077 -7101 -10236 -8763 -6457 -6065 -6676 -7560 -7277 -6271 -4782 -5409 -7296 -9246 -9121 -8005 -8949 -10192
40061 -10192 -9446 -6670 -4914 -6292 -8513 -10174 -9191 -8719 -9856 -11693 -10797 -6786 -1995 1519 2236 186
40044 925 2654 3223 4028 3168 2190 1590 346 -1513 -3409 -5687 -7081 -6776 -8301 -10654 -9913 -7161 -7503
40027 -7503 -10265 -10851 -11086 -11999 -11685 -8933 -5083 -3575 -3286 -2235 -4177 -5673 -3111 188 1080 -1945
40010 -5007 -4914 -3683 -3827 -4236 -4664 -6018 -6783 -6662 -5381 -2936 614 2857 3548 4889 5607 4687 3751 1519
39991 -3668 -10174 -16280 -19098 -18012 -15772 -13952 -11913 -10248 -7458 -3919 -267 1925 1888 545 -2400 -6446
39975 -6446 -7929 -5837 -6203 -8170 -5494 -675 4718 7365 6213 4334 4472 4708 3453 3438 2471 152 105
39958 105 588 2276 2939 1836 1288 -994 -1936 -1681 -3907 -6540 -6454 -3154 1312 3110 2688 1474 -233
39940 -2786 -4336 -4897 -4505 -3839 -3002 -2382 -1399 1688 3031 2236 4196 6194 6666 4924 -383 -5736 -5618
39923 -5618 -2126 -1733 -3391 -5370 -8750 -9624 -7957 -6964 -8593 -10826 -9642 -7284 -9082 -13460 -15039
39908 -15039 -12231 -8416 -6730 -3929 -193 2657 6145 8976 11936 15283 13001 6249 4878 7308 8198
39893 8198 6913 3740 -1333 -6049 -8403 -7113 -3516 -2653 -4194 -3826 -3478 -3290 -2553 -4638 -9397 -13861
39877 -13861 -16141 -15101 -12620 -10060 -9575 -10814 -10982 -10375 -9417 -8633 -7695 -8206 -9614 -10204 -7548 -4930
39861 -4930 -5192 -3436 -2281 -5768 -9274 -9623 -6580 -2938 562 1021 706 3690 5865 5295 3456 2263
39845 2263 -740 -8345 -13083 -13153 -14365 -14803 -12283 -11654 -13505 -11452 -7226 -6337 -6211 -3301 734 3605 4503
39828 4503 6020 7391 6777 6000 5408 3709 742 -1313 -214 745 829 -803 -4176 -7602 -8975 -6339 -437
39810 5362 6869 3407 -2113 -5437 -5404 -3604 -858 -533 -3612 -4808 -2621 1005 3223 3014 1438 -479
39793 -2472 -5159 -4095 -669 2846 5231 4367 905 -639 630 1261 1394 1468 1612 2201 893 -1519 998 8655
39775 8655 14776 15314 15520 16129 15840 13686 9524 6669 4334 3507 3108 3241 3699 4105 3685 3897 5172
39758 5172 4616 2368 2889 3063 2583 5234 9376 13447 13652 9711 5228 4005 3024 4370 9157 13193
39742 13193 13800 10990 8018 5029 167 -5241 -8993 -9732 -7664 -5100 -3394 -610 4156 5907 2601
39726 -3601 -8448 -10735 -10326 -9706 -8265 -6182 -4223 -1583 2420 7175 9152 9023 8041 7268 5018 4104
39710 4104 7270 9502 8484 4762 -476 -5508 -10595 -11793 -9720 -9314 -9056 -5387 -2876 -1486 -703 -163
39693 -296 -2213 -2593 -468 512 1423 2271 161 -3504 -5885 -4840 -1728 648 2632 4959 5750 5598 5711
39676 5711 5827 5472 3796 1937 3057 7335 11292 13454 13194 12438 15621 17233 12372 4434 -618 -1139
39660 -1139 750 2126 2375 1859 470 -224 243 -1496 -3640 -5165 -4860 -839 2749 6165 7546 7804 7623
39643 7623 5875 911 -4227 -6332 -8386 -10886 -13651 -15296 -16396 -16288 -13030 -8849 -4982 -3142 -3206 -4471
39627 -4471 -3140 -668 1014 3553 7419 10488 10029 6584 3105 -383 -4664 -6855 -8248 -8699 -6753 -4210
39611 -4210 -5057 -6389 -4960 -3858 -4967 -6687 -10157 -13734 -15560 -13778 -10430 -7322 -4576 -2984 -6096
39596 -6096 -11078 -13094 -12907 -11422 -10169 -11788 -14440 -13992 -14297 -16371 -15998 -11791 -5595 -1922 -1333 -2297
39580 -2297 -4568 -5740 -5626 -7086 -8204 -6839 -6055 -6197 -3423 1967 5636 6076 6242 8722 10744 11816
39564 11816 10576 5519 2195 908 -161 -1514 -2097 -2535 -2414 561 5025 6992 5786 5494 5386 3495
39548 3495 -1182 -7473 -11980 -12351 -9915 -6030 -1598 2087 1007 -4004 -8386 -10974 -10575 -6502 -1723
39532 -353 -2172 -5623 -7934 -8144 -8427 -11229 -13925 -12488 -8843 -6624 -4294 -2596 -1295 1620 4200
39517 4200 4805 4044 4573 7604 6690 1941 163 1477 3652 5224 7434 11797 13487 13005 12349 9130
39501 9130 5533 4318 3793 1256 -1724 -1238 1269 552 -2354 -3834 -4830 -6851 -9461 -12657 -11782 -7889
39485 -7889 -5682 -3840 -1358 224 2967 6525 6875 3315 -104 539 4691 7672 7791 6247 5470 4350
39469 4350 1489 -2609 -5358 -5051 -2560 -1608 -1240 1034 1783 3410 4297 3374 2997 3163 3121 -317 -3673
39452 -3673 -2931 -976 -139 118 279 1134 808 -1688 -4557 -7167 -7251 -7151 -7607 -4214 1084 3927 6192
39435 6192 8671 9318 7635 3647 -1005 -3903 -3202 -1077 2529 4019 1801 896 723 -833 -2610 -3241
39419 -3241 -4188 -4570 -3793 152 4061 4357 3333 4746 8341 8187 6144 5468 3547 383 -1153 936 3189
39402 3189 3290 2588 1764 -733 -3057 -3720 -3179 -1750 568 2501 3189 3118 1198 -232 88 1626 3441 4249
39384 4249 3470 4467 8896 15402 21147 24876 31133 40124 45473 45821 45937 48807 52931 57105 61984 66574
39368 66574 69230 69248 68148 66809 64805 61934 58127 54566 49588 42488 35939 32530 29018 21938 14854
39353 14854 11112 7475 4977 3945 3029 3669 5465 5598 4152 2627 1142 -1062 -152 4585 8338
39338 8338 6364 2013 1017 2535 4658 5958 5743 4358 4128 3940 3558 5929 6533 3032 1516 71 -178
39320 1117 740 950 2327 5304 6670 5407 3498 5095 8334 8668 6188 6021 5889 3414 -326 -5934
39304 -5934 -9041 -9123 -7076 -3575 1281 4839 2306 -3833 -6753 -4458 1198 4853 2618 -1364 -4909
39289 -4909 -8085 -8026 -3728 -2049 -4044 -5949 -8238 -10585 -11504 -11115 -12147 -15014 -15492 -11942 -7177 -2247
39272 2620 4838 6600 7982 7328 6213 4827 1476 -2216 -3556 -2192 -249 -193 -37 1126 1775 1012 -1144
39254 -3373 -4270 -2337 375 1678 759 -1049 -3470 -5894 -5929 -3642 571 3934 4004 209 -1166 -214 1437
39236 1906 -441 -3505 -5106 -5097 -4810 -2031 767 1292 826 -1794 -4985 -9565 -12450 -13042 -13612 -11563 -5901
39219 -5901 -859 203 -2526 -4380 -580 4972 6249 3367 1049 -15 -24 352 1579 280 -3073 -5306 -7003
39202 -7003 -6450 -5735 -5291 -4380 -4708 -6572 -6816 -5054 -702 4453 7811 8763 8293 7029 6671 5751 4725
39185 4725 2974 2601 3599 2136 -928 -2185 -294 3994 6078 4075 1756 2323 5232 9369 11340 11582
39169 11582 11139 8688 5596 3865 3461 3237 3286 3047 3751 6220 9402 10212 7575 5303 3707 -705 -4885
39152 -4885 -3929 -1489 -2476 -3019 -1422 1841 4008 4021 3104 3011 3053 2585 3025 3758 6512 6817 5302 6622
39134 6622 5468 -1747 -8455 -10369 -8233 -4646 -736 2312 3409 1160 -606 703 2813 3654 2404 4247
39118 4247 6471 4295 1701 123 -2974 -8061 -9504 -6772 -2832 729 864 -1213 -3503 -5398 -4921 -1641
39101 -285 -803 -542 533 1550 3682 4451 1129 -2943 -5082 -3402 300 2485 4392 3328 3498 7531
39085 7531 9045 7226 8352 12943 15157 12816 10391 9412 8258 5041 -964 -6710 -10867 -12093 -11211
39070 -11211 -7665 -2900 -1074 -1828 -3399 -2723 -1421 162 147 -1606 -3320 -4988 -6557 -6200 -2297 2826
39053 6488 6922 4271 -620 -5745 -9045 -7576 -1078 5434 8702 7724 3634 -3168 -9653 -10871 -9893 -10962
39037 -10962 -11837 -11793 -11284 -9296 -6431 -3224 -3085 -5486 -5886 -3695 -2861 -6418 -12298 -15454 -13519 -9568
39021 -9568 -5377 -3067 -936 -604 -4093 -7025 -9763 -12286 -14909 -12844 -5512 2668 6927 7014 6121 6719
39005 6719 7545 6602 3653 328 -3563 -6165 -5990 -2591 2440 4548 3836 2019 -1269 -4794 -5410 -3725
38989 -3725 -4196 -6058 -8958 -11940 -12619 -14095 -16330 -15026 -10627 -8162 -9545 -12972 -12631 -7204 662 7299
38973 7299 9946 9270 6502 4056 3572 3989 3457 1290 -1341 -2338 -1756 -1248 -619 804 4346 6352 6190
38956 6190 7532 10498 13344 12673 8688 4227 -87 -2994 -5438 -7835 -8168 -4579 567 4344 4535 1901
38939 -715 -2791 -5086 -8021 -11270 -13876 -14999 -15936 -15933 -13996 -10812 -8688 -9132 -8004 -4743 -3203 -3580
38923 -3580 -3684 -2478 -1018 -817 -1133 2486 8657 10017 6551 2096 626 1610 1893 1549 3315 5748
38907 5748 6138 4288 4074 3781 3019 2746 1843 978 -131 -3847 -5483 -1502 2438 3756 2308 -127 1027
38889 5044 8696 8982 6872 3961 -1055 -5381 -6834 -3689 1935 7673 8291 4777 2824 2046 2479 2423
38873 2423 -859 -4701 -6284 -5597 -3774 -698 2935 4330 4651 4690 5622 6451 6875 7069 5663 3566 -923
38855 -6128 -9311 -10352 -9598 -7542 -6144 -7101 -7947 -7027 -5910 -4494 -4222 -5942 -6231 -6015 -5277 -3249 -1402
38837 13 519 1498 3438 3126 2612 1828 -224 -1667 -572 1652 5036 7324 4834 -617 -3678 -5784 -7777
38820 -7777 -5841 -2876 -935 -636 -4073 -6993 -6455 -3953 -356 602 1037 4365 6790 7217 8391 11721
38804 11721 14746 18119 20881 19666 17199 15478 13456 11372 10484 10951 11344 10118 8560 8527 6617 4624
38788 4624 5304 8046 9780 8730 7490 6360 4850 2224 -2121 -6248 -10318 -11700 -7744 -4477 -3407
38773 -3407 -1896 1181 4454 7329 8270 7949 7471 5945 2355 -3535 -6866 -4143 564 1492 -356 -1177
38757 -1177 1634 6175 9290 10405 9027 6975 6937 6958 5539 4232 4365 4853 3067 543 1466 3523 4804
38740 4804 5965 5686 3857 1139 2117 3523 2208 1368 -417 -2491 -4187 -3941 -3389 -5274 -7763 -8570
38724 -8570 -7728 -5441 137 3234 3868 4764 4947 4751 5360 7616 9590 10574 13050 16462 16201 15652 16623
38707 16623 18079 17877 14438 10179 5464 4198 3915 237 -2406 -263 4556 6617 5250 994 -1066 1553
38690 6792 12599 13599 8320 2538 11 -2256 -3146 -598 3680 7120 10859 12071 9999 6094 4587 4028
38674 4028 5798 10531 12892 10133 4519 15 337 4905 9192 11925 11787 8123 4489 2389 732 324
38657 1786 4574 6336 8739 11545 11045 9500 10226 10039 8361 7677 8122 9029 8780 6609 4454 6334
38641 6334 10875 15587 16815 14475 11458 8984 7203 6005 5341 7557 10338 10715 9901 9423 8306 7619
38625 7619 6034 4415 5172 7034 7078 6794 7814 9456 7605 2027 -108 3209 3973 457 -3611 -4784
38609 -4784 -4239 -3979 -1552 1492 5253 8977 11603 14688 13895 8676 3260 1285 3281 4866 4818 5398
38593 5398 5882 3216 -758 -1588 -353 -586 -2096 -4167 -3176 3152 10979 13914 11830 7453 5382 5688
38577 5688 4428 4057 6213 7128 5956 6559 8042 9510 9693 9218 10451 12824 14042 12242 9087 6730
38561 6730 6785 9177 11913 13311 14086 12021 8361 8498 11157 9449 6284 6444 7063 8574 12720 17154
38545 17154 17406 14828 14377 14869 15184 13173 8532 3324 186 1474 6112 11583 16049 17919 19187 19045
38529 19045 17174 18255 19801 18748 15548 12558 14001 17381 18697 20788 24076 24387 21314 17229 16103
38514 16103 18293 21324 26046 28805 27711 26391 28131 27708 22858 17624 15932 16529 17919 19445 18148
38499 18148 15738 17498 22168 26663 28283 28353 29837 29787 26258 24333 25231 27107 28020 26253 21770 18260
38483 18260 18303 19503 21735 23222 24621 28991 37812 46090 48381 47355 45035 41251 40380 40027 40296 41619
38467 41619 42499 45667 51534 53437 52923 51020 48403 46610 46339 47742 48832 52491 58178 62552 65646
38452 65646 65016 62640 59531 56140 55472 56301 59485 67107 73657 76151 76024 75603 74773 75102 76887 80271
38436 80271 82449 83758 87037 93201 99273 102684 105812 108746 113006 118071 122332 126024 130210 134173
38422 134173 135816 137212 144169 151466 158577 167095 175902 184730 194048 203477 211375 215792 219239 225603
38408 225603 233567 242632 252210 264190 277094 287578 298258 312178 328902 346576 365001 384111
38396 384111 403843 424326 444916 466042 491156 518937 548240 579881 611510 643157 675562
38385 675562 710592 754626 806550 861749 919742 982607 1053147 1136222 1232636 1339914 1459441
38374 1459441 1592459 1742365 1912510 2110752 2343476 2614112 2933538 3317087 3778594
38365 3778594 4325064 4956321 5663086 6433667 7256589 8122937 9023394 9938349 10827822
38356 10827822 11628081 12254419 12647711 12820656 12823564 12659027 12251231 11519704 10477161
38347 10477161 9252429 8018541 6901703 5947992 5150810 4489034 3941433 3490940 3119096
38338 3119096 2802782 2525834 2278752 2054927 1853372 1671546 1509547 1368468 1246738
38329 1246738 1140813 1049455 970248 897786 833619 777023 724835 674786 629119 591164 557603
38318 557603 524238 491108 462718 435837 408372 383565 361914 338607 313471 290339 269257
38307 269257 254031 241187 230196 220558 209545 198553 188106 174804 158748 146154 140547 136645
38295 136645 132271 127305 123004 120760 117947 114769 111793 108217 104175 100647 98336 97719 98239 96593 91243
38280 91243 83535 74999 68522 64195 61203 58767 56678 57584 58814 58051 57519 59629 58174 53317 48548
38265 48548 45197 41750 40005 40307 41472 41797 38058 33768 32836 30708 26202 24085 26066 27455 27340
38250 27340 27687 26433 25175 25509 24679 23463 23353 23217 22154 20418 21101 21746 21401 19633 18077 19026 21184
38233 21184 21904 24008 26811 27889 28999 28912 27615 26911 24368 20062 20630 23761 26372 26524 23955 18712
38217 18712 11143 5923 5020 8196 11866 12607 12725 14077 15394 14970 12951 10056 7526 6070 5091 6515
38201 6515 8384 7558 6685 7601 11432 12851 9628 5943 5588 8331 9574 8369 8322 10974 12708 11963
38185 11963 12717 14428 15164 14296 12207 10562 12137 14217 13877 10480 7146 6821 7917 9063 8067 6307
38169 6307 4856 4948 5563 6443 7078 4214 67 -2738 -3034 -2182 -471 1944 2171 2310 3136 2329 2686 2094 -1789
38149 -4570 -3099 997 2904 1455 -2298 -2915 -39 1695 980 993 1463 1502 2183 1933 2833 5881 6397 4390
38131 4390 1908 -843 -6343 -12069 -11244 -6132 -5823 -9812 -12846 -13618 -12798 -10873 -8200 -5705 -4289 -3169
38115 -3169 429 5935 9976 13468 13482 7424 2500 2520 3251 2784 695 -3278 -8002 -11178 -10680 -10232 -9676
38098 -9676 -6642 -1317 3515 5472 5141 4638 4132 1634 -1068 1105 5727 4487 -2734 -9418 -11886
38083 -11886 -11412 -10339 -8263 -4758 -772 1330 -702 -2292 -1776 -3004 -4648 -2641 -69 -643 -3015 -6504
38067 -6504 -9833 -12622 -13583 -10275 -5306 -1944 -1148 -1076 -690 -553 136 803 1728 4510 8703 12333 14182
38050 14182 12178 8129 5143 3366 4383 6999 5820 2231 -728 -3228 -3621 -2712 -2564 -2753 -4773 -8775
38034 -8775 -10159 -7338 -4807 -5095 -6310 -8897 -12976 -17232 -19863 -18189 -12780 -7532 -5337 -3861 -1925
38018 -1576 -2448 -3550 -2124 153 -1463 -3276 -3518 -6378 -10303 -11842 -13318 -15635 -15471 -13479 -8812 -3905
38001 -1508 618 3660 5986 5660 1787 -4083 -7328 -9354 -11092 -12801 -15076 -15651 -13974 -10411 -9543 -12946
37985 -12946 -13532 -9194 -5809 -3783 -6796 -13137 -16119 -14125 -9880 -8002 -9569 -10242 -11842 -14150 -12512
37970 -12512 -9682 -7711 -7420 -8031 -8319 -7215 -5031 -1501 55 836 2556 2391 2137 1356 589 76 170 726
37952 726 758 1057 78 -1845 -2760 -1016 801 1142 3428 3459 -604 -2701 -2513 -3492 -1719 2943 4004 1176
37933 -1798 -3996 -2284 312 -652 -2469 -2884 -2907 -3184 -906 2882 5578 6172 3402 1270 1904 3514 3239
37916 3239 1990 -450 -3646 -7043 -11188 -12690 -8825 -5120 -4141 -4501 -5491 -7843 -12156 -15911 -17114 -14785
37900 -14785 -9327 -3841 -1457 -244 5 1748 4503 2123 -5875 -11771 -11314 -9293 -10997 -11861 -8187 -4675
37884 -4675 -3687 -2793 -4136 -6210 -5166 -5312 -7377 -8667 -7676 -5677 -5851 -9285 -13234 -11459 -6217 -2555
37867 -711 1931 6046 8729 10459 11887 13252 14588 14306 14399 14702 10855 8482 7198 4529 2136 -424
37850 -1292 -839 -2308 -6979 -9288 -9726 -12138 -14338 -15664 -17232 -16006 -14675 -15109 -13542 -10379 -7131
37835 -7131 -2066 1248 2293 5066 6256 4841 -98 -4676 -5798 -6691 -5621 -2335 -451 580 3036 3352
37819 3352 1343 -2013 -5759 -8535 -10391 -10116 -9347 -7216 -6131 -4609 -1122 -391 -2045 -3821 -5656
37804 -5656 -5475 -3528 -5584 -9065 -7530 -4213 -1230 1276 674 -3774 -8587 -10754 -14440 -19201 -23373
37789 -23373 -25140 -22976 -19368 -16702 -17020 -17747 -14652 -11024 -9993 -10138 -9255 -8150 -8647 -9447 -8090 -7703
37773 -7703 -12777 -18972 -19298 -17242 -17777 -17333 -14252 -12194 -9949 -6189 -4123 -2817 -295 233 917 269
37756 -4369 -8232 -9689 -8764 -8307 -8807 -8062 -4325 -458 321 -859 -2649 -6469 -10100 -11120 -11119 -10143 -8378
37739 -8378 -6141 -4259 -3305 564 4894 5512 3585 1478 1548 2439 2578 1746 -942 -189 3944 5333 6964
37722 6964 7283 2693 -3782 -10779 -15705 -14510 -10699 -8655 -6507 -3389 -845 298 666 882 2537 4645
37706 4645 2171 -2905 -3617 78 3367 3016 389 -1163 733 2927 878 -2791 -7773 -11052 -9078 -4803
37690 -4803 -710 2675 4992 2651 -3798 -9626 -10495 -7681 -4572 -3538 -2383 -627 -1280 -1360 112 1273
37674 1273 1752 858 -763 -2052 -2934 -3697 -5367 -7966 -9729 -9982 -10579 -10124 -9034 -6497 -1335 2393 1925
37657 1925 -1601 -5524 -7136 -6243 -6840 -7692 -5627 41 666 -4041 -5558 -3735 -110 2960 6485 8049
37641 8049 4018 -2916 -7512 -8635 -9032 -7499 -4735 -2000 354 2587 3963 3514 11 -6030 -11643 -14579
37625 -14579 -14800 -13398 -10985 -8619 -4339 -2169 -2918 -4863 -6458 -7388 -7207 -7377 -7172 -5617 -6209 -8700
37609 -8700 -11045 -11202 -9668 -8195 -8120 -9018 -9073 -8642 -8447 -9345 -9445 -5637 31 2097 602 -440 1104 4855
37591 4855 7187 7550 6701 3419 622 -4464 -12035 -14735 -11411 -7662 -6443 -6552 -8286 -12619 -16921 -20919
37575 -20919 -21874 -20662 -20166 -19424 -16987 -14390 -12309 -7383 -2904 -796 -328 397 2524 2890 3104 3359 1142
37557 -2131 -4349 -6593 -9218 -9981 -7998 -5683 -4597 -2959 -674 -180 -853 -2788 -5204 -4644 -2663 -457
37540 2158 2287 1651 2112 3355 4348 1626 -2931 -5149 -4498 -2713 -1113 718 1169 -1389 -3139 -3694 -2697
37523 -2697 1289 5952 7602 7912 7967 7035 6376 4216 994 -4537 -8677 -8000 -5059 -4232 -6359 -7854 -10547
37506 -10547 -13888 -16350 -17095 -15844 -15718 -16458 -13828 -8766 -5759 -4536 -6248 -10576 -12503 -11365 -6769
37491 -6769 -3474 -6035 -10898 -14232 -14123 -13416 -15015 -18418 -20362 -16707 -10682 -5649 -2285 1417 4657
37476 4657 4966 4437 3580 2855 3551 4306 2866 48 -1965 -89 5002 6300 3515 133 -2930 -5400 -7484
37459 -7484 -8872 -10330 -12187 -11750 -8961 -5421 -767 1555 2493 3033 2922 2389 693 -166 2097 5602 6595
37442 6595 2875 -1417 -4208 -3600 -3447 -5202 -2938 693 1220 -2903 -8172 -7953 -2646 2232 3117 907
37425 477 3906 7940 7085 3012 682 1338 3060 6060 9364 8894 3417 -2873 -5506 -4924 -3457 -2089
37409 -2089 -1954 -4076 -7349 -11307 -11148 -8030 -6143 -5572 -4501 -3601 -6543 -9739 -9209 -8670 -9200 -9223 -10109
37392 -10109 -10245 -7388 -4215 -4438 -7048 -8497 -9479 -9392 -5787 553 6246 8188 6671 3731 1617 2184
37376 2184 5228 8637 9592 6639 2383 -1111 -4212 -7766 -10572 -9995 -8804 -7008 -2707 2094 6116
37361 6116 5702 3852 2707 -49 -3401 -2547 644 4497 7418 7962 6709 6158 4008 1906 202 1914 5321
37344 5321 4216 1745 -1318 -3339 -2837 -1499 342 874 713 3484 7037 6655 5882 7334 8952 12035
37328 12035 15658 20993 25204 24593 23733 25937 30162 31139 32607 38966 47099 55740 63025 66510 67159
37313 67159 65128 62167 59550 57120 55970 57763 58868 57080 55702 53141 45948 37871 30344 21735
37299 21735 13772 9576 9343 13047 16212 17201 16561 14363 14391 15958 18242 19831 20176 20618 20537 20593 18491
37282 18491 10068 426 -3119 -3105 -1684 -123 1066 2245 4338 6511 5515 4955 7171 9078 7521 4284
37266 4284 2289 -55 -3805 -5961 -5703 -4024 -2185 -2912 -4414 -5745 -4969 -1761 -306 -1796 -4887 -5398
37250 -5398 -5636 -4178 -1291 1592 5541 10560 13034 10661 7383 5251 1906 1435 801 -2311 -5747
37235 -5747 -7226 -5727 -4067 -1406 1424 1707 -2150 -9120 -14089 -15989 -14073 -10053 -8519 -7402 -4745
37220 -4745 -2938 -4461 -9192 -11730 -13175 -15048 -12840 -8000 -5552 -5322 -8070 -12390 -13565 -9772 -5170
37205 -5170 -3148 -1742 274 989 1385 864 434 47 -1882 -4859 -6569 -6201 -4845 -2186 -1343 -2467 -3551
37188 -3551 -2702 -2275 -3442 -2936 76 3117 5160 6550 7808 8875 9538 10230 10055 4472 -5528 -13858 -16713
37171 -16713 -15595 -13917 -11982 -10482 -9076 -4664 390 2346 3770 4537 2113 -3400 -9220 -11433 -11285
37156 -11285 -12231 -12076 -11448 -11350 -7318 -578 2213 1391 3270 6192 6604 7726 9897 8142 4229 4165 7701
37139 7701 10231 10921 11120 10836 9411 8306 8080 8853 7640 2326 -960 743 1390 540 358 -1575 -8008
37122 -8008 -15474 -17863 -14867 -11286 -8241 -5748 -3461 -1147 -1288 -2900 -4249 -6909 -6973 -4029 -1724
37106 -2041 -1404 670 899 -486 -147 811 474 743 -1576 -6601 -10668 -8918 -6839 -8461 -11262 -12876 -12217
37089 -12217 -9703 -8063 -7296 -9210 -9565 -4819 -2246 -4328 -7064 -7761 -3408 1602 3361 3734 5471
37074 5471 8246 6934 1353 -3694 -3319 -1378 -1057 254 1591 2760 2012 -2196 -6143 -7595 -7788 -9971
37058 -9971 -11261 -12757 -12105 -9843 -4522 4049 7561 7208 5434 284 -5723 -10677 -13525 -12974 -10229 -5497
37042 -5497 -1958 -2473 -5114 -3595 335 2626 1233 -3431 -7925 -7158 -3101 -3456 -6112 -5172 -3253 -5553
37026 -5553 -9735 -13556 -14973 -14687 -15250 -14862 -13148 -9839 -8387 -11024 -12922 -11040 -8848 -8531 -7501 -7597
37010 -7597 -8078 -10234 -14266 -15892 -15248 -13899 -12392 -10912 -11239 -11419 -10388 -8703 -5946 -1376 4372 8247
36994 8247 8524 5399 1747 -424 -2384 -6449 -9757 -7608 -2884 -1291 -905 2927 6086 4512 1001
36978 -2456 -4592 -5250 -6642 -7061 -6476 -5482 -3331 -1191 2389 3957 3317 4713 3493 1070 1028 4179
36962 4179 7049 7399 6782 5163 4133 3951 1267 -27 1661 3759 4594 3586 556 1161 2748 1976 1965
36945 1965 3169 2726 1471 -509 -3512 -4446 -2266 1309 3729 2888 357 -1461 -1180 -1443 -2694 83 3759
36928 3759 2924 1873 2864 4715 5255 3754 3555 2994 1343 -1420 -4057 -4246 -805 4198 7492 7698 6073
36911 6073 3205 -826 -1689 1864 6074 5755 2040 -1199 -2481 -3221 -4735 -4038 -4692 -8136 -9048 -6837
36895 -6837 -3649 -1572 -1631 -2769 -5372 -6170 -2160 2772 4150 926 -1826 -1608 -1620 -1852 -2451 -4702 -7335
36878 -7335 -9146 -8895 -9284 -10138 -10935 -9641 -5636 -3856 -4744 -5350 -4554 -3862 -2883 -2443 -1842 -11 1611 3023
36860 3023 5362 5897 3409 1309 1383 2423 4860 8162 8858 8813 8106 4554 3468 6046 8496 6573
36844 6573 -717 -7385 -9448 -10229 -10647 -9673 -8703 -7680 -8046 -7448 -7022 -7760 -8564 -8327 -7155 -4799 -1662
36826 966 2272 1264 604 -553 -1376 -1984 -1086 155 -85 -2208 -3664 -3054 419 2776 2698 3466 4060 1268
36807 -2000 -3040 -862 2183 4412 7050 9038 8183 7302 9012 10331 11311 10863 8965 6472 -316 -8429
36791 -8429 -11125 -8641 -5790 -2684 -2402 -3741 -2600 -1929 -2473 -916 3080 6513 3476 -4392 -11099 -12403
36775 -12403 -9299 -5431 -3246 -2617 -2425 -4658 -4745 -1876 477 265 -503 -1295 -2361 -2510 -1927 -1492 -944
36758 -944 -54 -65 -1922 -3598 -2934 -1806 -1695 -727 -559 -2346 -511 3476 4993 2904 2486 5117 6863
36741 6863 6533 4725 62 -3967 -4226 -2679 -1200 -1144 -1376 -3645 -7269 -7931 -5956 -1953 1279 774 -3494
36723 -7467 -7454 -5154 -1409 1831 1541 -865 -2055 -3014 -4273 -3462 -2318 -2418 -1918 532 3163 4352 2568
36706 2568 559 -1216 -4245 -5534 -5218 -5485 -4678 -2749 -4275 -4414 -1993 614 -919 -4695 -7514 -8246 -7825
36689 -7825 -9120 -8587 -7694 -7901 -9150 -8690 -3365 4623 9112 10261 10045 7836 7559 8411 8815 7110 3023
36671 660 -200 582 1911 1031 2245 3688 3799 2208 -1945 -5740 -5659 -5463 -6957 -4765 -222 2431 4030
36654 4030 3903 3335 4601 7089 9103 8611 5923 3165 3018 5637 8130 10642 14147 13303 7695 3226
36637 3570 3337 2851 3461 2311 -718 -832 3586 5008 1986 -1365 -3074 -280 5706 9807 8137 3329
36620 -93 -1655 -1944 -2097 -4119 -5350 -6810 -8469 -7139 -5109 -4107 -5706 -6235 -2184 840 828 1491 4837
36603 4837 7033 4875 2809 2310 1372 -76 -1353 -1906 -2227 -1200 467 1205 306 -751 -918 -435 486 595
36585 595 483 2242 4861 7093 5717 2565 0 829 1163 -2645 -7269 -8815 -7797 -5241 -1288 1672
36568 3089 4446 6789 8389 5892 1706 1728 5171 5820 1864 -1883 -2820 -3572 -6900 -8035 -7842 -10792
36552 -10792 -13603 -15105 -15674 -14688 -11460 -6676 -3633 -4327 -7045 -10137 -9380 -5065 -2510 -3526 -5601
36537 -5601 -3997 -2331 -3258 -2182 1240 1318 -760 -3055 -2716 -2883 -1724 2982 5475 6845 8497 9108
36521 9108 9188 9023 7312 3444 552 2022 4758 7861 11688 12786 9451 5261 3078 3680 2635 1088
36504 -1167 -3893 -5362 -2626 1946 4948 6491 5159 3033 2853 3283 168 -2354 -2148 -1132 847 2389
36488 2389 4230 4761 2115 -2219 -4081 -2299 -2473 -1947 -1320 -1771 -1788 -4469 -9176 -13092 -14401 -13333
36472 -13333 -13353 -12476 -10761 -10391 -11877 -12542 -13249 -15675 -16234 -13075 -8555 -5543 -6963 -8204 -6575 -5103
36456 -5103 -4816 -6866 -9413 -8764 -5387 -3634 -2076 -2288 -6265 -11310 -13629 -15922 -16850 -12953 -7271 -2963
36439 -2376 -2060 -3408 -4793 -1124 2461 2186 -669 -4701 -9345 -12363 -13389 -15232 -17307 -16359 -14757 -14766
36423 -14766 -12737 -7079 -3021 -4376 -6690 -5362 -3488 -1978 -245 -167 -552 -179 1115 3011 4357 4274
36407 4274 3716 2753 3412 3429 2235 2916 5818 7631 6768 2431 -1827 -1295 -652 -1200 31 1509 2032 3211
36389 3211 6253 8058 8450 8281 6884 1888 -1404 -663 -1161 -4495 -3731 -543 1965 3260 803 -1131
36372 -3578 -6424 -10384 -14587 -14991 -12088 -7749 -3030 1602 6468 8038 6400 4089 2040 922 -221
36356 -580 1417 2613 2339 1254 755 -612 -3151 -6894 -11195 -12676 -12239 -9420 -4012 814 -654 -4869
36340 -4869 -7742 -8738 -9182 -11571 -13340 -12218 -9030 -6025 -4517 -4756 -5911 -6778 -8351 -8334 -5811 -3329
36324 -3329 -1206 1663 6571 7700 3924 345 -1581 -2184 -2327 -2363 -3652 -6863 -6697 -3944 -3424 -2834 -2847
36307 -2847 -2699 -1935 -2614 -4824 -4059 -375 2389 4745 8672 11402 11350 8406 4599 2695 1524 -572 -2046
36290 -2046 -3539 -3293 -2277 -2854 -5851 -8251 -5372 -1100 812 2650 4778 6939 5735 2489 2171 6528
36274 6528 10582 11845 10472 6794 2975 -1652 -6608 -7549 -3460 703 2388 2822 1945 3315 4861 4533
36258 4533 2902 1591 2282 2259 -1298 -6383 -11745 -13983 -12428 -8309 -3996 -1855 -367 639 1848 2715
36242 2715 3643 4856 3051 2689 3422 2538 2576 5040 7273 7263 7823 10739 12673 10798 6771 3147 1729
36225 1729 1851 2988 4955 6374 7010 8296 10203 13109 15565 16191 17011 18867 19105 17567 15846 15866
36209 15866 15535 12654 8655 5343 2354 -960 -3231 -4720 -4938 -3148 233 3710 5302 5398 4189 3403
36193 3403 4428 6404 5952 952 -4097 -4574 -988 801 -258 -2492 -5154 -7017 -6364 -7123 -8103 -7652 -6659
36176 -6659 -6475 -7160 -8095 -7982 -8227 -10817 -14932 -18967 -20833 -20782 -19014 -17313 -15612 -13710 -8316 -3280
36159 -2748 -2119 943 1655 577 1929 2977 3080 3105 2570 -795 -5032 -6621 -8160 -8022 -7029 -6151 -3210 1894
36140 6592 8489 4006 -3170 -6372 -6373 -4841 -1793 -874 -2481 -4467 -7274 -11788 -15610 -15584 -14162 -11283
36124 -11283 -8558 -8576 -8864 -6853 -3849 -4033 -5567 -7903 -10298 -10639 -9918 -8775 -6053 -1317 2493 559
36107 -5244 -8024 -7763 -5139 -164 661 1519 1361 -382 171 1624 3061 4130 6498 9337 6992 4640
36091 4640 3888 5080 6718 4605 214 -1256 881 1082 -1846 -4169 -4744 -5190 -4275 -2202 2740 7912
36075 7912 9735 9844 9389 8241 5733 2115 -464 -2112 -2730 -3266 -5150 -6125 -6467 -7378 -7153 -3919 -22
36057 2880 5010 5090 2454 -20 -1949 -2264 -1307 -1020 -1625 -932 2099 3418 1370 -58 -2188 -5060 -7268
36040 -7268 -6808 -6808 -11156 -13198 -9823 -6152 -4781 -3898 -4024 -5723 -7364 -6803 -5173 -4189 -1457 1353 615
36022 -2363 -5968 -8367 -7446 -4417 -1510 -3417 -9893 -14452 -13061 -9548 -6823 -3917 -1379 -522 -1378
36007 -1378 -1446 245 1432 -617 -1768 -2458 -1961 -1109 -1335 -2228 -2887 -5686 -11016 -12131 -5545 4464 11962
35990 11962 15367 14951 15019 12306 6943 4952 6079 9328 12187 13269 14157 14195 15081 17486 17496 15214 12488
35973 12488 11612 11286 10810 10884 11884 12620 10849 9994 8474 5589 3375 1638 -941 -3604 -5018 -5852 -6985
35956 -6985 -6410 -6138 -5514 -5868 -7961 -10284 -12147 -11530 -7922 -3594 -1170 1193 4545 6629 9314 13652
35940 13652 17237 16947 13021 9476 6468 3845 3895 6162 7192 5687 1925 -2340 -5823 -4323 658
35924 7142 13068 13691 9292 6877 8889 9817 9061 7145 4448 2403 -355 -4480 -5949 -4410 -3622 -2231
35908 -2231 329 294 -1981 -1653 -1285 -4087 -4965 -3099 -3728 -4805 -3804 -1254 1847 4193 7069 11323
35892 11323 14473 15139 15636 17028 15550 10253 7568 7704 6508 5273 4731 4238 2962 1291 1379 686
35875 -455 -1890 -2410 -1836 100 4470 7102 6756 6555 5546 4056 6725 10353 12865 15178 14651 14044 14973
35858 14973 13444 10186 8303 7203 4993 3851 3549 3917 6210 5879 2815 1280 4126 8984 11229
35843 11229 12172 10946 6366 4948 8519 12011 14478 14824 11217 8188 8571 9695 11071 11652 10899 13022
35827 13022 18452 20471 19716 19933 16872 14678 14576 15590 19238 24176 28113 30069 32565 34747 32572
35812 32572 26936 23573 26124 32526 36407 35290 29668 25076 21988 19462 21765 26696 27221 24262 20562
35797 20562 17817 16725 16162 14208 10651 10953 10443 6400 2713 2889 6751 10078 12332 15620 18841
35782 18841 17820 17093 21070 26656 30233 29558 25158 19602 16573 17798 20690 23398 25649 26797 24334
35767 24334 21598 23014 26632 30417 33676 36685 41659 47452 51723 55980 61414 68925 75886 78904
35753 78904 83781 93271 104021 115022 126672 137038 146435 156838 166239 173961 181766 187186 189354
35740 189354 191557 194387 194341 188635 179510 170939 164651 155654 145004 135241 125818 118342 110944 103979
35726 103979 95471 86318 78110 73321 72221 72935 70938 65802 61092 58022 56976 59446 64482 71789
35712 71789 79721 84645 88709 93387 100069 108123 117446 126821 137912 151435 162992 172388 178420 181403
35698 181403 183364 183598 185223 187903 191088 195417 198038 195863 189459 180408 170040 156939 141883 126509
35684 126509 114405 106934 100349 92321 84870 77082 69154 63953 59682 52796 46664 46868 49722 50223
35670 50223 50229 50295 47352 43770 40883 38336 37704 35360 30701 26550 24762 22179 17768 15769 18168 23304
35654 23304 29303 30311 24993 18204 14011 13153 13828 14131 13699 12683 10353 8207 9081 10139 11144 13960
35638 13960 17156 17109 14472 10540 8306 8357 7218 4479 4058 6165 8334 10674 9746 6977 4560 3346
35622 3346 3807 4747 2758 1161 2750 3843 3932 4865 5344 2182 -1740 -2299 393 5289 11518 13952 13991
35605 13991 15071 13848 12014 12594 12999 8062 2346 1539 1307 241 1897 2637 2222 4305 7502 10799
35589 10799 12291 11130 11393 13041 12748 9521 5851 4845 4801 836 -4384 -6119 -4725 -3542 -3494 -3255
35573 -3255 -2145 -783 2612 5411 6069 5435 5834 5669 4559 4359 2457 -668 -3936 -4630 -2965 -2016 -1177
35556 -1177 -1361 -3118 -1360 4825 7085 5426 4855 5459 6825 6960 6381 5902 6602 6776 2455 -2029 -206
35538 3184 3540 363 -2974 -3171 -3203 -4200 -5059 -2780 -523 479 -46 -1117 206 3431 6387 7009 6164 6728
35520 6728 8101 9345 8631 6894 6745 5963 4459 4432 8167 10866 8731 4910 3250 4263 4954 3467
35504 3467 964 -85 -2442 -4582 -2257 1180 4012 5046 5168 6502 8032 6983 7227 10123 10519 6876
35488 6876 2701 1100 1460 3575 5425 4363 593 -2894 -4733 -5405 -3741 -2371 -3336 -3536 -4089 -3325
35472 -3325 1763 6702 5932 3038 1691 1674 2906 4718 5449 4630 4321 3006 242 -2819 -7189 -10925
35456 -10925 -11919 -10456 -7574 -6350 -8211 -10561 -9886 -6609 -4221 -671 595 -492 -1802 -2413 -941 -229
35439 -1635 -4168 -6599 -8687 -8570 -7424 -5322 -2190 -193 963 770 366 -2680 -7837 -9554 -6881 -3884
35423 -3884 -4917 -9479 -14950 -18555 -16947 -14250 -11376 -5963 -1480 -1315 -3529 -5237 -8013 -11073 -11610
35408 -11610 -12500 -14935 -17219 -15778 -11674 -9126 -8504 -8931 -8032 -4637 -2701 -2504 -3602 -5698 -6974 -5938
35392 -5938 -2489 995 2723 3712 3007 2005 3058 4392 1020 -3430 -7214 -11387 -13160 -11415 -9911
35377 -9911 -11755 -13231 -12558 -11474 -9352 -6655 -2067 3005 3875 2970 3966 5960 5555 3077 2057 5441
35361 5441 11155 14186 15746 17737 17297 14542 10714 7871 7764 8431 6161 3236 -832 -3385 -1260 2876
35344 8735 12450 11240 7002 2772 -891 -1879 1008 6943 11181 8974 4692 1086 -2619 -4851 -7466
35329 -7466 -11313 -11192 -7211 -4998 -2797 790 5185 7951 5786 2480 2967 2122 -2949 -5485 -3171 1116
35312 3152 5077 7564 6511 3489 1763 435 -598 -756 -215 -107 278 -907 -3803 -3984 -2107 -2754 -6475
35295 -6475 -12626 -15614 -14073 -10056 -6064 -5112 -4746 -4995 -7334 -9129 -8863 -9150 -6865 -677 3304 2895
35279 2895 607 -1894 -3798 -3446 -3935 -6142 -7531 -7463 -2404 4482 7169 6697 6898 8659 12686 14645
35263 14645 13789 12445 11549 11008 10351 9734 7174 4686 4592 5489 5790 5304 5502 7618 10125 12293 15112
35246 15112 16976 15782 12336 8237 6169 5529 4286 1854 -627 -3396 -5025 -4106 -929 2940 4955
35231 4955 5218 7123 8452 5048 201 -2976 -4609 -4340 -3199 -3753 -3298 -3318 -3085 -3005 -2986 425 6209 10595
35213 10595 9103 3424 -1398 -4055 -5608 -8148 -9923 -7751 -4232 303 3273 3149 1549 -194 54 -672
35196 -2759 -3481 -4824 -7921 -8401 -3339 903 1518 215 -2249 -3302 -1743 862 807 -1144 -1914 -3342 -4957
35179 -4957 -6653 -6304 -4934 -6006 -5887 -3440 -1277 -439 1879 6354 8880 8424 7042 5696 4084 3498
35163 3498 3616 3987 4058 4476 5508 4905 2690 811 -2754 -6250 -7071 -5072 -3583 -4708 -5107 -2388 1733
35145 1729 -57 452 116 -1610 -1487 -1019 -2748 -2040 -210 -1623 -3145 -3209 -2808 -2390 -3993 -5015 -2797 -686
35126 1330 5333 8556 9565 8442 7057 7780 9007 9598 8774 5395 1277 -805 12 2017 2793 3757 6763
35109 6763 9202 7881 6090 5085 4461 3399 2171 4882 8640 10094 8090 5159 3266 2291 2276 2332
35093 2332 1431 1764 1611 -842 -2322 -3093 -3623 -1725 689 975 262 -1102 -2208 -1829 147 3094 3241 2392
35075 2392 3420 5057 5726 5123 3383 2983 4363 3756 1770 1166 3702 5935 6342 4909 2405 3576
35059 3576 8034 13285 15681 14986 10700 4739 1944 2064 1987 1931 -1251 -4405 -3000 -601 2701 4384
35043 4384 1912 -1843 -2283 201 1830 1951 3631 9018 11510 10876 10719 11246 11301 9935 7850 6622 5539
35026 5539 3194 137 -2594 -4048 -3812 -905 2619 5404 5993 5289 3438 -202 -1010 1307 3691 3316 2058
35009 2058 4058 7838 11843 13803 14018 12001 6908 3520 3341 6892 9491 9170 4539 -105 1630 6239
34993 6239 8060 9635 10759 9799 7335 3671 2059 2860 4480 4871 3387 2225 3426 7433 11579
34978 11579 15356 18774 24017 28249 29191 28582 26044 23895 24837 27250 29089 30799 31880 32454 33771
34963 33771 33458 32041 31482 28950 25018 21474 20103 20041 18694 16897 16854 19671 22660 24858 24667 22300
34947 22300 19601 16119 16700 22420 28748 34446 38043 38615 38341 36640 36856 42447 46183 46084 44288 46124
34931 46124 51700 58474 63530 67423 70026 70057 72049 76864 80701 83136 85986 89778 94791 99604 103171
34916 103171 103988 103547 107034 114897 121630 129042 138101 147919 157983 168380 179004 189206 196800 204986
34902 204986 216288 226749 236771 248071 259332 271891 288982 310005 332335 356549 384303
34891 384303 417905 455467 494683 537896 587907 647340 723238 811597 908556 1016668 1138608
34880 1138608 1276039 1427046 1586890 1750993 1918787 2087567 2253366 2409095 2551734
34871 2551734 2676357 2775189 2843924 2880929 2886005 2859495 2803635 2718932 2608000 2474173 2321593
34860 2321593 2161547 2000665 1840225 1682891 1533143 1395663 1269123 1160365 1072069 1000775
34850 1000775 945735 900465 866296 846676 836039 835112 848531 870922 902494 948925 1008211 1083727
34838 1083727 1175651 1277999 1392724 1523225 1665018 1812317 1964174 2121241 2276634 2423343
34828 2423343 2559491 2684278 2787324 2859224 2896280 2895878 2864152 2802451 2712205 2595632 2453771
34817 2453771 2294568 2125729 1948894 1769895 1598197 1433876 1277559 1134695 1010043
34808 1010043 901474 802953 715874 640436 574248 519089 473683 434215 399275 368341 339994
34797 339994 317791 299264 280515 262701 245244 230263 220912 214068 204367 192381 181031 171630
34785 171630 162231 148606 133973 123913 117589 113155 110574 108456 106787 102789 97000 91937 88288
34772 88288 82193 75592 66947 56603 49927 49394 51365 53055 52911 52036 53340 53607 51354 47856 44062
34757 44062 39398 33668 28147 25627 25638 24043 22827 22910 22830 25052 27836 26129 23833 23815 24514 25395 25942
34740 25942 25224 21975 18274 16468 12503 7252 4087 2855 4166 6284 7651 8868 10862 14800 17270
34725 17270 15757 11201 3720 -1683 242 2261 3894 8557 12436 14505 15445 16131 15842 17150 18029 16361
34709 16361 16492 19764 21914 20308 16556 14267 13184 13853 13803 11712 12815 14407 13626 11200 8955 7323
34693 7323 2721 -626 1500 5256 5575 3543 1929 -707 -1058 2777 6348 8472 9262 10862 11627 11841
34677 11841 13019 11727 8628 8453 10441 13471 16204 16515 14963 13642 14019 15431 15510 13312 11557 12781
34661 12781 13054 13257 13677 13053 13584 13030 11184 10262 8778 8332 7586 7170 7909 7868 5573 3953 1667 -1302
34642 -2720 -1935 341 5194 11636 15942 14465 11790 11091 6920 1450 -1710 -295 4306 6871 5105 830
34625 -4103 -6932 -4138 193 3052 2945 -902 -4097 -5564 -5258 -4071 -3601 -4193 -5619 -4572 -2344 -1387
34609 -1387 422 3210 5286 5887 5977 6142 2496 -2465 -2212 -666 1630 5901 9760 11642 11002 9635 7249
34592 7249 2674 929 3365 7300 10186 7783 2520 -487 -1579 -2652 -4099 -5299 -4761 -3255 -2792 1329
34575 2722 963 1483 7399 12147 11795 9510 4451 -2106 -4685 -4862 -5733 -8013 -8956 -8686 -8544 -8134 -7480
34558 -7480 -9633 -12047 -9542 -7351 -11160 -15537 -16304 -13801 -10174 -7435 -7733 -7773 -9360 -9691 -4438 1512
34541 2202 -2719 -4352 -2654 -2857 -6058 -11979 -15691 -13206 -8075 -3267 169 2140 2481 3172 2226 111
34524 -776 -2186 -4786 -7037 -6460 -3784 -1400 -713 -1874 -1656 -907 1596 4056 3298 818 460 1477 1296
34507 1296 -68 -1415 -845 777 1675 1466 3248 4951 5173 4039 186 -4086 -6311 -7704 -7012 -3095 -1333
34489 -2743 -5093 -2663 2800 6417 5897 2399 -2964 -8359 -10015 -6211 -1028 2119 2166 -1551 -5836
34474 -5836 -5508 -1153 1728 -152 -3074 -4737 -4927 -2847 1656 6482 7898 8157 8785 8328 9438 8614
34458 8614 4686 2009 864 2387 4351 3389 -644 -2574 -1209 -322 -1889 -2955 -3552 -3962 -4443 -4591 -3260
34441 -3260 -17 1726 638 -1496 -649 -98 -1547 -3208 -5338 -4693 -3135 -4275 -3397 112 441 -1978 -4233
34424 -4233 -8397 -8900 -1907 5450 10658 15561 17174 15552 14153 11233 6843 4576 4642 6334 8700
34409 8700 8956 7336 6894 7090 5538 3030 2041 2355 2613 1568 542 3076 5721 4529 2618 2266 1087
34391 -2155 -5682 -4560 -2119 -2180 -3289 -4453 -3077 -374 142 -172 1262 5681 10094 12874 15830 16651
34375 16651 17113 16476 14390 12894 11384 9130 8970 8858 6495 2906 1228 327 -2078 -4374 -4841 -6473
34359 -6473 -11270 -16206 -17378 -14973 -11542 -8145 -5369 -1794 -1165 -2125 -4042 -6954 -6756 -3185 411 4137
34343 4137 5685 3287 -105 -1648 -2604 -2782 -2642 -3519 -4958 -5914 -5789 -4167 151 2348 607 -2058 -4227
34326 -4227 -3548 -2206 -1975 -2813 -5983 -8503 -11451 -11831 -8709 -8590 -10102 -11568 -9877 -5778 -4748 -8578
34310 -8578 -13185 -13060 -9170 -5391 -2317 1106 1517 -1253 -1783 603 1690 2048 95 -3022 -1533 3053
34293 6868 6877 4768 2335 -186 -3526 -3658 -62 982 -494 -217 -986 -3278 -4678 -6295 -7033 -6038 -5275 -3237
34275 -3237 447 5852 8283 5274 -915 -4051 -3937 -6379 -9767 -11245 -11479 -13251 -16261 -19061 -21912 -20351
34259 -20351 -15287 -10463 -8973 -7279 -3459 -1779 -3451 -6803 -7956 -5798 -3728 -3763 -3630 -3354 -4241 -4200
34243 -4200 -3248 -2610 -3014 -2107 -916 -2207 -6797 -7659 -3030 -571 -639 733 3428 4943 4813 3890 3601 5250
34225 5250 6813 6868 5389 3192 1816 3226 5777 6816 7872 7597 4927 1962 1635 658 -1410 -2685
34209 -2685 -3886 -4598 -421 4391 4297 3727 4288 4283 3184 1399 6 758 2821 5947 8060 7434 2660 -2976
34190 -5666 -5150 -4235 -4891 -5225 -3348 -468 910 -392 -2000 -2725 -939 1352 2578 1309 248 706 1555 2851
34172 2851 2347 235 -5034 -8596 -7516 -3885 -1183 356 1809 1983 738 -495 268 863 2755 4039 3616
34155 3616 2808 2943 6031 8631 8632 7918 5915 2754 -1075 -5073 -7178 -6977 -8512 -9200 -5265 268 2990
34138 2990 2297 425 -3830 -5997 -3444 -1149 544 3373 5206 4312 3713 2010 33 106 -1861 -5361 -5806
34121 -5806 -3797 -2794 -99 4814 6418 4768 2356 -1696 -4949 -8752 -11930 -11048 -7049 -2134 3382
34105 5676 5707 4057 3566 2877 1010 -730 -2306 -3212 -4994 -6003 -6102 -3227 1819 7039 11521 14140 15043
34088 15043 13073 12317 14768 18533 24123 26560 22115 15480 12226 11311 10501 9014 4172 -1079 -4889
34073 -4889 -7003 -7633 -6336 -7483 -12936 -15338 -14211 -8448 -2729 -2627 -3480 -5577 -8538 -9004 -6639 -5430
34057 -5430 -5899 -5266 -5642 -6289 -6819 -4702 -753 2755 7075 10219 10874 9798 9531 11607 12930 13835 16833
34040 16833 17511 13759 7438 2677 985 3697 9129 12416 15413 16827 14583 12547 12867 11299 7084
34025 7084 2556 2067 5286 5922 4105 3079 2539 816 -1721 891 6301 8082 7188 3227 24 -2348 -4065
34008 -4065 -3559 -1916 -2199 -647 1262 1056 2066 5864 5793 925 -1610 -2390 -1934 -1074 184 888 1847 3528
33990 3528 3137 2091 2043 760 -716 -812 -1156 -2388 -3613 -4113 -2905 -1006 580 3648 8002 10949 9750
33973 9750 5679 1498 -272 -168 2619 8109 9523 4061 -2519 -3274 652 4261 8679 10894 9808 9566
33957 9566 11626 15225 18067 16443 11404 5412 58 -2521 -4379 -6285 -7146 -6957 -5792 -3337 615 5485
33941 5485 9642 13751 14645 13535 13908 13191 8420 3074 578 1391 4641 6909 5741 4348 4286 2726
33925 2726 196 1868 5928 8273 7725 7663 9727 11646 11491 7829 2378 -2024 -3756 -4804 -5332 -2081
33908 -1912 -5049 -6227 -6085 -2344 2521 2568 1073 -471 99 2460 4423 6726 8266 9716 13408 15443
33892 15443 12537 9078 5897 1829 -717 1834 6529 10056 12445 11630 9375 7655 7588 7831 6431 6419
33876 6419 7048 6459 6186 8753 10983 12517 13236 14836 19260 23688 24622 22041 19594 19496 18077 16912
33860 16912 16933 16386 13932 13516 14363 14114 13233 13464 13382 10552 9120 10393 12874 14342 16128 19039 22013
33843 22013 20496 16086 11154 7040 6064 6333 5901 6376 8724 10957 11642 11498 11017 11733 12670 15322 18809
33826 18809 19974 20252 19776 17107 15472 16573 17360 16961 13593 12211 11392 10495 10676 10424 6951 1895
33809 -482 1933 6186 8806 10822 12309 11842 12272 12240 10935 9771 6660 2601 -609 -3721 -5786 -6517
33793 -6517 -8505 -11950 -14924 -12634 -5410 1467 4872 3944 1842 -315 -2695 -3506 -3539 -2661 -1772 -2887
33777 -2887 -4276 -5071 -3759 -2212 -2559 -1925 -2770 -2321 93 1001 2472 4462 4980 6411 7740 4435 -720
33759 -3422 -3033 524 5482 8888 11252 12849 13726 12619 10305 8605 7403 6584 6557 8186 8007 5811
33743 5811 5361 6992 11421 14209 11424 6583 2351 626 633 1454 2382 15 -3004 -5942 -7626 -4380 -3266
33726 -3266 -8525 -11401 -8097 -4014 -2760 -1017 -661 -3082 -6654 -11118 -11903 -6305 1317 7777 11645
33711 11645 14126 14360 13964 14384 13208 11786 9629 7544 7639 9722 13031 14901 13569 10835 10457 10953
33695 10953 10776 11601 10820 10297 11430 12627 13720 13689 12891 13596 12844 10637 8994 6959 5151 3955 5781
33678 5781 10842 13948 15239 15558 14422 12554 11438 11610 11198 7585 3371 264 -1852 -3957 -5062 -1696
33661 3886 5092 1832 -2022 -2372 -2593 -4934 -6444 -8018 -4419 4870 9827 8521 9162 12096 13048 10599
33645 10599 8126 8399 10293 8997 2948 -681 1195 4666 7353 7510 6407 6732 5523 2763 4264
33630 4264 7857 8612 6833 6287 6271 6616 9933 14712 17031 16972 16665 16599 14015 8528 3409 3108 4576
33613 4576 1913 -447 844 1181 -428 669 6862 13726 16047 13946 11408 8683 5870 3604 1985 679
33596 728 1287 -344 -1306 2156 8468 13422 16493 18635 19175 18460 14568 8464 6369 7256 8089 10856 13630
33579 13630 14812 16328 17871 18189 16947 13108 7849 7271 11080 11538 5791 314 -787 -1662 -48 3602
33562 6104 8855 11737 12816 11138 9784 10202 9842 9683 10628 12479 14308 14576 14965 13529 11753 9303
33546 9303 3541 1366 5068 9795 11133 9529 9466 11742 14188 18168 22504 24893 24468 21791 22784 24019
33530 24019 22817 22394 20692 17101 17660 21444 24374 24386 21457 19293 18129 17311 16474 14569 15460 19819
33514 19819 21330 19798 18224 15081 12124 12889 15218 12870 7224 4989 5906 8438 9273 8142 8077 9074
33498 9074 10160 9708 7364 5834 4827 2507 1604 2434 2810 3497 4324 3798 3095 2705 1912 2645 5697
33481 5697 9933 13640 15440 17815 20251 19465 18004 16996 13341 10792 11278 11680 13216 14740 14150 12315
33465 12315 11097 10618 10796 12118 12634 14780 18808 20803 21386 19839 16272 13529 10619 7818 7505 10159
33449 10159 12612 9890 6290 5225 7269 9675 11021 10784 10846 12445 13481 15325 19191 24499 27866
33434 27866 28578 26166 22329 18939 17452 17836 18085 15024 10772 10518 12536 15388 17848 15260 13686
33419 13686 15295 19447 23753 25096 25791 27024 25771 23200 18278 15170 17299 20852 23448 23649 23650 24918
33403 24918 25987 23150 22392 26236 27528 25976 22212 20731 22020 25007 26859 25609 23048 22140 23208
33388 23208 23346 21027 18267 16046 16145 18893 20918 22310 22531 20888 18773 16256 12883 9780 11273
33373 11273 14033 15899 18187 19278 20026 20977 20049 16559 14088 14307 16045 16793 17861 17018 11762 7713
33357 7713 5687 4582 4500 5539 7898 12138 18017 23292 26428 26025 22414 17472 15150 17109 17736 16908
33341 16908 17109 18807 21230 21493 17740 13154 11746 13790 14194 13458 15041 18855 22592 26342 29552
33326 29552 28398 26498 27885 31193 31847 28812 25301 23814 25632 29097 30662 28179 22220 17485 16107
33311 16107 17843 20954 24931 29840 34825 36524 34657 31199 28569 27543 27142 27320 29028 30949 31636
33296 31636 31406 32149 33187 33110 29791 26668 28079 28891 27102 27386 32591 37526 39136 41563 43959 46075
33280 46075 45298 42853 44147 46369 48206 49358 49724 47952 42541 41129 42114 41279 42090 43501 44441 45757
33264 45757 44711 42367 42439 44958 47065 45843 43918 40670 36450 34318 35135 34876 33732 34025 36711 39121
33248 39121 40639 43278 45439 48048 52436 55074 53464 50414 45068 37274 32662 30634 30861 32796 36183
33233 36183 37572 35537 34242 34330 36938 39688 39895 38584 37514 37565 36558 32850 30348 31328 33489 36689
33217 36689 42338 46751 48800 49715 45781 40585 40576 44946 49821 52429 53700 57208 63794 67016 65019
33202 65019 61441 59563 59463 60078 62369 64692 64770 63173 61456 59484 60049 61859 60004 55419 49980 43958
33186 43958 43786 49692 56156 60242 62557 66274 69488 68974 64213 58960 55103 55153 56145 55457 53526 49432
33170 49432 46340 47461 50788 52998 53676 52825 51033 48265 48861 52851 55609 56436 56005 55703 55632 57193
33154 57193 60407 63826 66376 66194 63581 64429 67151 67119 68005 70217 72671 75319 75889 77089 80238 81263
33138 81263 79136 76934 77177 75833 76275 81154 86136 88411 86771 83979 82824 84104 84616 83825 83427 84327
33122 84327 85613 82802 80947 82867 82285 75876 68410 64560 61900 56218 54581 55335 54651 54531 56466
33107 56466 59581 61002 61362 61766 64425 65281 64824 65303 66506 66257 65076 66520 68292 68409 69477 72653
33091 72653 77207 81615 82595 84188 88020 89100 86939 80086 76171 77097 77088 79241 84400 88512 90427 91224
33075 91224 91165 88021 83457 81362 83201 88996 95806 99621 102588 103224 101681 101262 101567 99742 95696 91956
33059 91956 92609 95814 99320 101666 100649 98584 98800 100137 100129 100989 103821 107309 108988 109891 110720 110135 108910
33042 108910 109477 109064 109205 110743 111042 108235 103769 100562 100934 102326 104108 105942 105436 106132 109627 114232
33026 114232 119347 122876 125022 127520 131586 134936 135423 135674 136539 138519 142421 146766 149886 152380 153380
33011 153380 151741 147485 144288 146581 151171 153401 153953 152236 148626 145127 141104 139866 141605 143769
32997 143769 149455 156507 159281 160280 161210 162368 163412 160751 156969 155914 156980 156652 157620 163386 171581
32982 171581 176520 176925 177617 183287 188971 190882 193837 195930 195015 195549 201846 211182 214929 213594 212284
32967 212284 215238 219547 223748 229307 236439 241021 242825 244264 246696 251155 257218 261020 262899 264552
32953 264552 265074 264772 264925 268650 272908 272136 268469 268496 272137 274480 275000 279738 288861 295474 301077 309068
32937 309068 316295 321358 324855 327295 327981 329733 334275 340062 343548 346282 348088 347827 350268 354206 359586
32922 359586 369089 381509 393049 403222 411395 420010 431395 444092 458100 472472 484751 496063
32910 496063 507201 514694 519580 523679 529069 536205 545376 554296 558460 562991 570368 579724 588386 594047
32896 594047 599255 603616 608476 616169 626869 641983 659141 678239 697371 715914 737850 762345
32884 762345 788451 814878 842414 876029 912481 947161 983432 1023925 1065037 1107832 1153665
32873 1153665 1198215 1241949 1286022 1330297 1371779 1406755 1436820 1464377 1490111 1512351 1532001
32862 1532001 1550774 1571255 1594930 1622454 1653185 1686545 1725747 1772156 1819714 1866808 1918480
32851 1918480 1971620 2027226 2086105 2146935 2211331 2277451 2344188 2414263 2489867 2567824 2647392
32840 2647392 2728621 2813417 2903602 2997025 3095334 3200091 3310676 3425645 3547692 3678146
32830 3678146 3814668 3957410 4107821 4266858 4434900 4611514 4799644 5000453 5211079
32821 5211079 5432497 5664973 5909847 6166412 6434684 6720029 7023466 7341381 7674095
32812 7674095 8025670 8396823 8791698 9214321 9665474 10145774 10658847 11205545 11787677
32803 11787677 12406748 13065253 13767108 14514137 15309924 16157203 17065400 18043905 19100266
32794 19100266 20243177 21481884 22831139 24305414 25922463 27704431 29679007 31881972
32786 31881972 34354857 37149760 40333475 43992661 48236441 53205942 59094653 66174007
32778 66174007 74803200 85373842 98167368 113288226 130711793 150290757 171754791
32771 171754791 194795717 219034675 243883061 268415946 291164075 309981661 322653481
32764 322653481 328414102 328830249 326004030 320074299 308962728 290370376 264168241 232956357
32756 232956357 200846959 171315426 145890871 124653499 107174140 92965201 81492161
32749 81492161 72177435 64507736 58089756 52636742 47935573 43830494 40209866 36994005
32741 36994005 34133569 31587529 29307142 27242873 25357544 23630763 22045594 20590913
32733 20590913 19258007 18035361 16910973 15874620 14913786 14019600 13190545 12423963 11711131
32724 11711131 11045315 10418231 9826254 9269913 8752659 8279965 7849701 7455513 7091767
32715 7091767 6755206 6442747 6149472 5871530 5606739 5356801 5123393 4908320 4707965
32706 4707965 4519863 4343999 4179144 4025174 3881649 3747213 3621009 3501651 3385688
32697 3385688 3275033 3170298 3066619 2966745 2871093 2778141 2690444 2610233 2534736 2461562 2391908
32686 2391908 2325805 2263718 2204393 2146439 2088031 2027803 1966883 1909594 1855960 1800597 1745139
32675 1745139 1695347 1649841 1606298 1565212 1522555 1473432 1418816 1364303 1314578 1268832 1224188
32664 1224188 1185940 1152159 1119734 1090202 1066154 1047643 1032344 1022215 1014601 1006930 1002380 1002922
32652 1002922 1006473 1008906 1010539 1011147 1008649 1004021 997879 989432 981024 973451 967132 961328 954847 943481
32638 943481 930419 919244 908161 892854 872395 853902 840638 825287 803683 781060 764415
32627 764415 753924 742530 726941 709726 692466 674813 660341 653647 650107 645557 642679 635928
32615 635928 626888 621342 615874 611036 607249 601394 591800 581489 574330 571239 569138 564604 558251 549475
32601 549475 541843 536663 531454 525036 518655 511874 505413 500436 494945 485328 476906 471500 467991 462014
32587 462014 452614 443631 433614 423693 413058 403089 396005 392137 388471 381549 375736 371590 367057 360895
32573 360895 355773 351878 348343 345386 342713 336345 328137 324257 323881 324003 322977 320044 313448 304660 299579
32558 299579 298920 298046 294064 288048 282522 279962 277959 276297 273895 270565 268221 264342 258085 252202 249180
32543 249180 246524 245900 245074 242388 241346 243445 244744 241744 236365 231116 228682 225261 223234 222764 220116
32528 220116 214624 209386 206932 201963 194241 188840 186458 186332 187256 187548 185709 181672 177011 174552 175986
32513 175986 177129 175827 171739 165555 162090 163281 166779 171203 170404 163120 154787 151605 152592 154611 155365
32498 155365 154132 151542 145915 141175 140040 141380 145509 150957 152821 150677 144881 136745 130964 127101
32484 127101 119873 114788 115840 117064 115441 112844 113377 117132 121284 121895 119269 117680 117704 115503 112136
32469 112136 108506 106302 107131 109888 110945 109376 107363 101747 96999 96672 94241 90538 90371 90135 87807
32454 87807 84628 82939 82410 81394 81137 79660 77460 77191 77887 78059 79025 82584 87344 89535 90606 92113
32438 92113 92438 93587 93333 89525 87717 87296 88415 90602 94225 96175 94683 93144 91062 88289 86166
32423 86166 87415 91671 94096 93333 90231 85418 77237 67600 61328 57771 58788 63582 65420 61499 57862
32408 57862 60377 63809 63417 62086 59240 55535 54548 54719 56037 59166 60940 59867 57728 56113 53773
32393 53773 50715 46151 40868 39763 42028 43405 43338 44422 43977 40024 36746 36844 37850 38807 41254 44341
32377 44341 47532 51252 55911 59189 59528 58277 57417 56305 56206 59715 63460 63582 60611 58028 59125 62086
32361 62086 65244 68658 72038 74035 76272 79051 79112 76909 74502 73825 74616 76522 76999 77461 77824 77830 78585
32344 78585 80653 85533 91131 95284 98159 97491 95955 99926 106359 113540 118519 120793 120275 119475 122735
32329 122735 127057 131746 139051 145538 149991 151538 151826 153296 159652 170063 180419 193537 207789
32316 207789 219207 228199 235651 244304 257205 273470 289098 306518 328216 353316 377900 400371
32304 400371 424213 450553 479227 508771 541319 579797 622473 668632 723163 791894 875079
32293 875079 968204 1076238 1206011 1362104 1549594 1766318 2008634 2281160 2581667 2900303
32283 2900303 3231919 3570689 3907742 4227409 4513355 4748823 4918658 5014835 5033802 4972714
32273 4972714 4825815 4590684 4272592 3891611 3480543 3073632 2694005 2350553 2051822
32264 2051822 1801508 1594744 1424038 1280016 1157020 1052416 961238 879425 807156 744686
32254 744686 691782 646144 605031 566884 532061 502281 475233 448301 426054 409031 392155
32243 392155 375670 364010 355296 345673 338075 332726 324666 315991 309749 306536 305652 305727 307360 308755
32229 308755 308284 308721 312893 319674 323781 326921 333537 340943 347439 354078 362528 373825 386373 400418
32215 400418 418299 437851 455056 470396 487514 508532 534046 564443 595434 627043 667723
32204 667723 718515 773838 834814 908641 997187 1098822 1218989 1363333 1536433 1740470
32194 1740470 1975933 2240699 2533418 2850833 3187631 3539164 3894979 4239266 4555060
32185 4555060 4823579 5024006 5144262 5186130 5150739 5032098 4822337 4520795 4147218 3731580
32175 3731580 3303042 2892922 2523561 2201982 1927832 1695319 1497478 1331853 1195977
32166 1195977 1082184 980890 890044 811998 744526 685195 634594 589097 547311 508276 473057
32155 473057 444090 416583 387393 359344 334910 312995 295029 277283 261334 248225 235083
32144 235083 223607 211960 200696 191640 181618 170625 161751 156584 154057 152508 150835 146443 139262
32131 139262 131500 123479 117766 116557 113921 110274 110311 109402 106876 105375 104178 103065 102025 99286 92814
32116 92814 88446 87037 84827 82145 79199 78304 79200 78016 72905 67617 64770 63549 59144 53405 47512
32101 47512 42744 37953 33934 32409 32197 32059 31904 31775 31256 31997 35148 39082 43545 45120 43495 43609
32085 43609 44380 44399 42500 39098 36553 33582 28022 25012 25070 23540 21527 23556 26851 29400 32277 35341
32069 35341 36060 34055 32635 31688 31985 30761 29884 29605 28415 25806 23721 23711 23342 21838 21486 24002 27266
32052 27266 29236 29485 27155 23686 21419 21224 21280 19530 17574 17006 15995 15920 17303 18198 17275 16383 16884
32035 16884 17392 15815 13119 10278 9139 10625 12112 12355 10468 6786 3245 1149 865 1701 3629
32020 3629 5296 3451 -319 -4565 -6821 -7634 -5887 -1652 626 1121 806 1575 3702 4229 2964 1153
32003 297 -292 -2187 -3001 -3914 -6224 -8425 -10088 -8637 -3443 1242 2768 2969 2651 4447 4860 434 -4850
31985 -6254 -2722 2158 5418 9091 12170 11412 11371 14989 16710 12834 6142 3327 2604 2710 3019 3791
31969 3791 3912 2774 3359 5384 8298 8378 6627 8553 11073 12229 13147 14944 14857 10581 6418 4585
31953 4585 2722 3176 3732 1480 -858 -4495 -8295 -10176 -11198 -11612 -11157 -9629 -6025 -1835 -2246 -2383
31937 -2383 1153 5988 7192 5187 6063 7778 6253 6709 13349 18083 16843 13532 11441 9075 4997
31922 4997 841 -3139 -3797 -2868 -4174 -5168 -2464 1409 5463 7073 6039 4359 5038 8621 11064 9037
31906 9037 3277 -1459 -4095 -4351 -5969 -7899 -7569 -5679 -2722 71 -456 -7241 -16694 -20901 -22576 -22757
31890 -22757 -19885 -15673 -13480 -11271 -9238 -5648 -388 2772 3040 2504 2344 622 573 2989 3628 1325
31873 394 2385 6784 9404 7827 4954 3103 4208 5395 4456 7022 11543 14424 13526 11685 9452
31858 9452 3968 -889 -976 2577 4559 3083 1190 -922 -3150 -5008 -3712 -160 1272 39 -1285 -967 -1362
31841 -1362 -3545 -4903 -7147 -9061 -6702 -2563 -1854 -1471 -1044 -1055 -1566 -4816 -11516 -18684 -23820 -24665
31825 -24665 -19609 -13761 -9692 -7121 -6397 -5512 -4723 -6903 -9917 -10479 -6847 -517 3342 77 -4030 -4375
31809 -4375 -3523 -1538 423 -587 -2966 -2238 1987 6639 10550 11185 11244 15352 20715 21277 18849 16954 14358
31792 14358 10633 8782 5515 2703 928 -1266 -1926 -2462 -2049 594 2745 2819 3113 2010 -1783 -5014
31776 -5014 -4379 -3161 -3423 -4501 -6676 -7009 -3323 1662 3776 2037 369 2771 3947 2505 1943 3357
31760 3357 4877 4273 2947 3157 3077 1034 -1868 -3014 -2264 454 5029 8542 9524 9712 7493 4482 1705
31742 -1223 -1646 -297 -1073 -157 1857 2845 3844 4528 4761 6570 8573 6853 4131 1677 -774 -2381 -2004
31725 -2004 2380 5108 4865 3562 531 -1683 -3173 -4971 -6031 -6248 -6581 -7764 -6996 -6870 -5373 -2721
31709 -2721 -289 3310 5962 3484 -2735 -7538 -10071 -9448 -9302 -10129 -9519 -6146 -1971 2474 2906 -1141
31692 -3621 -3135 -2721 -2242 -1235 -2358 -1803 3230 8489 10014 9515 8573 8193 8628 7265 5390 5926 7797
31675 7797 9901 12785 14648 14473 13932 12499 7627 3306 1747 2798 4019 3965 4183 4424 4713 2707
31659 2707 306 2 -423 -1309 -1456 1170 3589 4540 6701 8695 7677 5791 8518 10843 10044 10429 12434
31642 12434 14147 12998 9116 5190 4096 4222 3469 3168 1428 -715 -1212 174 423 983 2227 3239
31626 3239 3023 2599 3526 5161 5539 4546 4881 6640 6078 4263 3844 3726 3382 4333 7405 8632 6612
31609 6612 6122 6095 5636 5350 4429 2752 1124 368 342 -876 -1892 -3475 -6456 -7318 -5892 -3818 -1803
31591 -634 9 949 1293 -1191 -4679 -4171 130 2473 2176 2476 746 -1666 -2235 -2804 -3452 -4407 -5428 -5503 -3562
31572 -3562 -2715 -2869 -264 3604 8145 7666 4131 3966 5381 5563 4604 3075 5203 9563 11425 11053 9231
31555 9231 5786 5028 5513 2259 -1964 -5263 -5652 -1656 374 -1483 -2781 -1347 -834 -1909 -192 2684
31538 1278 -1541 -3919 -4269 -4575 -5352 -3255 191 1269 2235 5023 8370 8652 7894 7218 3819 -588 -4514
31521 -4514 -8659 -9528 -5288 -1955 -695 -678 -2866 -4000 -2810 -317 3276 7334 9402 9825 8122 5917
31505 5917 4180 2178 266 -1240 -3189 -5783 -5046 -801 1133 899 296 1704 4685 3399 1029 2061
31489 2061 2166 1920 1887 4126 6396 8634 9593 8026 8996 12128 12034 8389 5863 5782 6278 7331 8534
31472 8534 7250 5848 5644 6983 8609 8077 8126 9044 10806 14363 15859 15870 14289 10890 8781 9364 11931
31455 11931 14852 15341 14810 13767 11751 9518 5284 457 -3753 -5298 -3130 697 3711 4473 2660 3112
31439 3112 5417 4850 4388 5779 5993 5378 5997 6225 5465 7032 9519 11357 13278 13846 14791 14576 14226
31422 14226 14040 14021 15484 19280 21434 19587 18013 17489 17434 17985 17408 16384 18933 21604 22706 23446 22409
31405 22409 20441 21361 25109 25781 23105 20468 19195 19163 20930 22961 23702 26852 30300 30567 29111 28222
31389 28222 26995 24616 24294 23403 22557 25813 32765 36882 38547 40194 42518 45883 50818 53131 50157
31374 50157 48996 49945 50326 53701 58775 64222 69112 70991 69107 67957 66992 63569 58537 57850 61945
31359 61945 65881 69244 73093 74758 76266 79764 84559 90685 95370 98080 99434 101613 103745 108201
31345 108201 114918 121619 129004 135299 138493 144096 151391 155415 161732 170953 181640 193067 202533 211457
31331 211457 217491 220604 223718 231822 241661 252150 267154 283259 296974 310840 327130 342536
31319 342536 356330 372614 391809 412006 431661 451719 472795 495421 518410 544871 576632
31308 576632 611743 648919 687172 726215 769408 820813 882875 951094 1021596 1101314 1196064
31297 1196064 1306464 1433039 1575323 1733283 1913917 2119441 2352235 2616623 2908323
31288 2908323 3223063 3561451 3921885 4295414 4671175 5043072 5405168 5746065 6051889
31279 6051889 6311825 6515011 6650131 6709184 6690292 6595666 6428055 6194642 5902142 5557757
31269 5557757 5173707 4763468 4342309 3927783 3534485 3171728 2846828 2557494 2302495
31260 2302495 2086344 1903253 1745177 1606460 1483778 1374634 1276183 1190209 1116463 1052392
31250 1052392 995041 939554 887197 842193 804779 773522 746175 719373 693964 671443 652228
31239 652228 635834 622794 612685 602810 593005 585161 581430 578645 573706 569519 567378 567305 570280 576841
31225 576841 589601 605436 623670 641639 662284 686344 709526 731864 754538 782798 817657
31214 817657 857522 900936 950065 1008036 1075224 1146843 1223891 1313171 1416923 1535349 1674318
31203 1674318 1837042 2025740 2239008 2472288 2731008 3020333 3340586 3689879 4058603
31194 4058603 4442096 4834328 5225665 5604890 5957520 6273103 6543242 6758787 6908605
31185 6908605 6982081 6972235 6882857 6719472 6487048 6192870 5842422 5443873 5015070 4573364
31175 4573364 4135919 3716078 3323195 2964892 2648970 2375118 2139051 1935749 1759736
31166 1759736 1606801 1469823 1350585 1246112 1153246 1071867 995960 925895 861597 802207
31156 802207 748915 700416 654757 611861 573969 541201 511075 481921 453035 425440 400622
31145 400622 376483 355560 336088 318300 302094 286246 272378 260367 251975 246376 238652 228703
31133 228703 215719 204025 197087 191056 184706 178856 174967 168426 159361 151853 148507 146259 142679 139086
31119 139086 135980 134032 129427 123644 121099 118452 114717 110725 106251 101753 97593 94109 91743 89955
31105 89955 86310 81035 77615 75472 76316 79898 81496 76483 67828 59788 54095 51019 51906 56180 60321
31090 60321 61634 58806 57540 59999 62248 61431 58999 59984 61685 57365 50996 48446 48090 45158 40954
31075 40954 38948 40094 39258 34996 31591 29791 29808 32353 35676 37658 37478 34898 32772 35093 36377
31060 36377 32638 29479 29877 33133 35149 35571 34565 30481 26426 24922 25091 26190 28417 29547 27894
31045 27894 26692 25749 24838 22638 22249 25390 30989 35635 38370 41304 41692 39197 35483 31849 29944
31030 29944 31561 33135 30656 27080 25388 26477 26145 24651 23306 21847 22694 25381 26437 24322 22562
31015 22562 25007 28964 29467 28544 26255 20784 15139 11220 8800 7066 6648 8039 10117 13001 16589
31000 16589 16138 15066 17875 20392 20003 17678 13798 7910 3473 5534 10395 13352 14756 15999 19107
30985 19107 19668 16529 14660 15435 16580 17726 19314 20098 19110 17850 19795 21186 19858 18061 15203
30970 15203 12162 12175 14260 14082 10447 4972 2225 3197 4559 6648 7725 6456 4292 4889 7018 8939
30954 8939 10635 11013 10992 10747 9883 8686 5162 -1092 -5439 -7664 -8446 -4847 377 4636 7649 8457 7985
30937 7985 5639 3478 3120 5493 7343 6652 4450 2438 635 1062 4059 6911 6243 3498 4683 8773
30921 8773 10272 10069 8040 4244 1101 -1041 -2226 -2101 -1940 -1824 -535 -352 -1707 -2232 -1573 -1697 -4892
30904 -4892 -6567 -3222 -1880 -4349 -4865 -2498 -715 505 -261 -3082 -3852 -3289 -4170 -3839 -1441 477 754
30887 754 992 1540 2553 1990 831 652 1684 4483 6368 3194 -3279 -7278 -8862 -8397 -4298 -400 1370
30869 2637 2432 896 669 -1105 -6644 -11472 -14751 -16619 -18041 -17609 -14678 -10775 -8421 -11446 -15801 -16661
30853 -16661 -15991 -15671 -13990 -9367 -4128 -1504 -2725 -4035 -2288 -3096 -6938 -11321 -15985 -16921 -15364
30838 -15364 -12578 -10677 -10511 -10180 -6783 -717 4188 6314 5828 1946 -4092 -8106 -4645 272 1027 888
30822 888 -474 -1304 -2537 -6575 -9927 -11901 -13130 -13012 -10316 -6344 -5905 -6120 -3253 -812 -3525 -8343
30806 -8343 -11470 -10365 -6351 -3745 -4507 -6809 -8002 -6584 -4839 -2612 -977 -1759 -3472 -3819 -5075 -6588
30790 -6588 -6370 -4194 -2675 -3544 -4626 -7361 -9438 -10179 -11734 -11416 -8339 -6008 -4134 -3265 -3719 -3879
30774 -3879 -2684 -1429 -764 -214 -684 -2370 -5156 -6041 -5089 -6459 -7177 -6815 -5224 -2898 580 3934 5025
30757 5025 5596 5214 3409 3259 4461 5292 5680 4681 3090 -15 -3180 -6089 -9149 -12278 -12061 -6139 1247
30739 5107 2478 -1830 -4591 -6231 -7309 -9530 -9658 -6836 -5239 -5327 -5384 -6462 -6934 -5171 -1366 1941
30722 3747 2108 -1278 -5094 -8028 -5385 -205 3848 5854 6590 5631 3748 4821 7129 5370 1646
30706 -1846 -2701 -2543 -5147 -8220 -7699 -5603 -7803 -9025 -6167 -639 2212 509 -1256 -1770 -2740 -5316
30690 -5316 -7658 -7130 -5635 -4437 -5392 -9502 -13196 -14909 -13755 -10816 -7184 -4521 -2863 -1684 -894
30675 -894 -591 -1255 -1574 -2324 -2046 -2524 -7308 -12745 -14559 -13980 -13915 -11946 -10386 -11352 -10787 -9565 -9076 -8142
30657 -8142 -7003 -8611 -12076 -13744 -10624 -5664 -3793 -4815 -5810 -6066 -5265 -4233 -6990 -11126 -15668
30642 -15668 -20570 -22107 -20226 -16450 -12341 -11876 -16052 -19191 -14643 -6548 -1552 -1033 -1552 -1213 -287 -789
30626 -789 -2723 -8128 -11796 -9012 -4480 -3533 -6537 -9073 -7663 -1877 614 -3700 -9606 -13301 -16194
30611 -16194 -16598 -15546 -17031 -16032 -11404 -7292 -5144 -2929 -2437 -6094 -11202 -14072 -13801 -10801 -8973
30596 -8973 -11236 -12395 -11512 -12128 -12589 -9158 -6422 -7776 -11703 -14643 -14475 -12025 -9627 -7689 -7270 -11021
30580 -11021 -16408 -17047 -11603 -6656 -3925 -388 1932 319 -1329 -40 1731 -74 -3206 -2551 -187 -824 -1717
30563 -1717 -2629 -2996 -4118 -2308 2175 3194 -1844 -7508 -7320 -4556 -1954 995 1575 -660 -2533 -2085
30547 -2085 -3849 -5589 -6287 -7592 -9381 -9610 -7841 -7187 -8331 -8656 -7303 -6167 -7180 -9344 -8536 -2126
30530 5581 5808 1268 -4597 -10248 -10286 -9161 -11358 -13972 -14967 -14335 -11911 -8817 -5618 -4783 -7521 -8584
30514 -8584 -4238 1303 3865 3081 699 -901 -1497 1567 6618 11952 14141 12141 6351 2881 5163 8506
30498 8506 5441 -1103 -4057 -4394 -5307 -6862 -6104 -2438 721 2851 2221 1844 1506 -212 -1179 -675 -3093
30481 -3093 -9392 -13737 -12241 -10579 -9139 -5082 -1977 575 3512 4908 2853 -1275 -4335 -5636 -6444
30466 -6444 -5928 -6425 -8409 -11650 -14294 -15057 -13425 -9868 -8937 -9273 -8071 -7195 -7661 -9597 -11621 -12662
30450 -12662 -12526 -10548 -6500 -3214 -3733 -7401 -10597 -12555 -15393 -16638 -13755 -8654 -4769 -2385 1459
30434 3151 2516 3008 2815 2340 2375 2758 586 -2570 -4094 -4561 -1073 4733 8259 8149 4988 1225 468
30416 1867 3226 2875 54 -1720 -2153 -410 2420 3027 1736 322 -1268 -4482 -7807 -7613 -6622 -5610 -3119
30399 -3119 -750 187 -181 -58 872 2836 3896 3079 3550 4557 4440 5370 6646 4938 927 -832 -2832 -5780
30381 -5780 -7261 -7964 -9338 -10954 -9557 -2608 4816 5940 231 -4019 -3660 -1580 441 -186 -1017 -1776
30365 -1776 -2566 -2563 -4950 -9308 -12232 -13671 -12434 -11439 -10377 -7421 -4319 -2848 -4780 -7330 -6762 -3856
30349 -3856 -753 2485 4034 4069 5611 7692 5867 -1316 -7508 -8746 -6851 -3097 699 4399 8992 13684
30333 13684 14933 13796 12630 14024 14644 14936 15849 13064 11849 13297 15836 19229 20449 21439 23048
30318 23048 21276 15274 10963 11879 15578 18493 21740 22910 20147 15950 13704 13684 14416 13581 12390 13715
30302 13715 14733 16619 19504 19820 20097 19294 16427 13399 10446 7728 4873 1907 -2269 -5533 -6006
30287 -6006 -6391 -6241 -5064 -1871 3972 7448 7152 6542 5214 1422 -309 783 1967 1664 -251 -1133 696
30269 3983 5306 4186 2630 1442 1459 3486 5078 5258 5180 4036 4122 4341 3208 1129 -177 -287 1264
30251 4288 5538 6095 6801 8158 9787 9966 8226 6991 8112 8938 9490 11436 13311 14485 16436 16112
30235 16112 16274 17073 15126 12951 14048 17566 20990 23553 26311 28214 26612 23550 22752 25278 28504
30220 28504 29323 28044 28710 28670 24671 21262 18852 15482 17365 22674 25084 26292 27923 25333 19804
30205 19804 15711 13795 15803 17795 16293 13245 13330 16112 18303 16792 14826 14045 14898 16758 16358 12788
30189 12788 8644 6262 7438 9537 13182 16560 15936 12166 9100 7390 8385 12718 16894 17005 17398
30174 17398 22855 31196 38417 43889 48505 54063 60925 70235 85108 105830 125584 139300 149428
30161 149428 158151 167276 178029 189197 196049 195571 190682 182892 173191 163266 151372 137142 122047
30148 122047 106945 92828 81151 70237 63301 58491 53027 46731 39307 32814 27951 25869 26373
30135 26373 26391 25127 24853 24282 20797 17161 17272 18845 20321 21178 21649 23212 25360 27588 30001 30914
30119 30914 31809 30670 26270 21665 18924 20706 22907 21587 19233 17530 15643 15122 17183 22016 23978
30104 23978 22198 19282 17902 17686 19563 22924 25657 25687 22518 21949 24010 24941 25094 25390 28039 30722
30088 30722 31226 31934 34955 37234 36894 36529 37047 39315 43677 45049 43279 41697 42815 44186 44326 47162
30072 47162 51767 56081 60187 66806 77499 87991 96700 108337 125018 142846 161119 181394 200447
30059 200447 217358 233518 246545 254186 260967 267083 266833 260974 249227 234247 217449 199573 180100
30046 180100 157286 135101 114270 94807 80485 71161 62943 53809 48261 45486 41829 36810 32090
30033 32090 30927 31364 31730 30986 28808 27170 27734 28560 28257 25726 21048 17026 14440 12928 11515 7479
30017 7479 4240 3422 1117 -407 1044 1996 2572 3233 3225 2193 4958 9188 8506 4719 -227 -2610 -452
29999 3649 6855 7784 7611 8548 7859 4460 -308 -4115 -5088 -5314 -7611 -7711 -5304 -4794 -5779 -6580 -6088 -2052
29980 2656 4990 4972 4167 3992 2519 -1508 -4232 -2108 3237 6681 7556 7498 4627 -1029 -5529 -9126
29964 -9126 -14623 -18487 -19726 -21041 -18616 -14362 -11855 -10424 -7936 -4809 -5840 -7336 -5326 -2529 -2014
29949 -2014 -2848 -2555 75 2875 4619 3440 731 164 1138 3213 5402 2976 -44 335 -1599 -5311 -4279
29932 -4279 -2836 -4464 -7111 -9085 -9174 -7707 -5065 -1567 -1644 -3783 -6766 -10168 -11853 -11518 -10403 -12415
29916 -12415 -14860 -13235 -11612 -12957 -11619 -8333 -8148 -8580 -9287 -10006 -12178 -14520 -13654 -11311 -9090 -4576
29900 -4576 -2255 -2890 -1359 715 1151 -1081 -5711 -11675 -14433 -13431 -12453 -12351 -8756 -3600 -339 2212
29883 4171 3319 -1440 -5066 -5333 -4196 -2390 -379 3684 8575 10792 9338 4694 599 -1587 -3393 -4653
29867 -4653 -6946 -9891 -11563 -14472 -15008 -11654 -10158 -9909 -10390 -12859 -16232 -17782 -15661 -15112 -14670 -11623
29851 -11623 -8243 -5491 -5742 -9711 -12113 -11371 -8507 -3722 -549 -822 461 1413 562 1512 3683 3522 2385
29834 2385 3701 8161 13623 16154 14212 12586 14351 13713 10915 8643 6061 5359 4887 2675 1395
29819 1395 433 2892 6504 6224 4534 4893 5813 5921 7946 12304 14061 15082 16057 15641 14729 15324 16211
29802 16211 13594 9155 6573 5668 4124 2560 2990 2785 2468 2313 3661 8481 9005 7238 7232 7312 7914
29785 7914 6652 4796 3893 1135 -1285 -889 199 2510 4384 5962 7612 9524 11747 12321 10396 5100
29768 1044 1187 2369 5844 9335 7858 4292 3574 4310 1588 -3121 -8252 -14260 -15982 -13078 -10998
29753 -10998 -12930 -16997 -18825 -18330 -13414 -6627 -2711 -1233 -258 -493 -1801 -804 1247 3905 5847
29738 5847 2598 966 2514 3221 2517 1775 1823 1393 1543 2357 3247 1631 -3012 -5378 -2221 3844 10781
29721 10781 14130 13696 12866 11637 12897 15970 14937 13101 13119 11537 8126 5076 5578 7798 9096 10483
29705 10483 9406 6968 10155 18469 25272 26266 24740 25235 27704 29928 28561 25573 22509 17928 14262
29690 14262 12504 12306 10656 8761 10707 14646 15858 17289 19238 19644 19306 18925 19595 20916 22507 26475
29674 26475 31180 29493 22143 16696 18019 19956 18221 18340 20538 22651 25583 27528 28969 31122 32223
29659 32223 31680 29932 27743 28261 30265 33226 36646 39103 41149 44320 47247 48934 46927 41802 38601
29644 38601 36337 34087 34465 37240 39273 39736 37968 37217 39754 42556 42549 37343 33316 35272 41436 43113
29628 43113 38452 32783 29185 26064 21635 18508 16823 13353 11076 11425 11055 10936 10858 9297 6889 5899
29612 5899 6904 11730 19089 24345 28625 30295 29349 28638 27944 30657 36460 39028 37490 35580 33081
29597 33081 30844 29226 27782 26928 27405 27668 27685 27219 27141 28156 30188 27914 21219 13821 8198 6930
29581 6930 8338 9260 9210 9816 12588 17325 20967 20796 16183 10846 7083 5989 5025 6432 9518 11333
29565 11333 10354 7282 3271 1176 3450 6142 8993 12816 15470 13334 7563 2182 312 3326 6299
29550 6299 6050 5118 7358 11546 12958 9803 3375 -2131 -4593 -4316 -3702 -4176 -4853 -3917 -2862 -2698 -1553
29533 -1553 344 1254 -12 -2263 -4760 -5731 -8141 -9294 -6048 -495 5194 8809 12504 13475 10675 7057
29517 7057 4076 3665 5021 6254 8066 10401 13244 13736 10123 7817 10055 12711 14040 11988 8756
29502 8756 7943 9026 8521 6910 5935 6794 8588 10430 10349 8181 5527 2454 403 -968 -1325 2112 6367
29485 6367 4792 3431 4572 2709 -1620 -6571 -8270 -7759 -7611 -7040 -5086 -321 2847 2335 2740 5824
29469 5824 8032 7397 10722 16570 18379 15974 13657 13567 13820 16973 22253 24232 24435 23362 24032 27555
29453 27555 29863 31257 32411 31786 32802 38166 44647 50278 57736 65832 70029 72651 76168 81084 89567
29438 89567 99940 108088 112205 116022 118330 116775 111993 104760 96162 89129 82019 73307 65070 60465
29424 60465 58897 54682 50053 49803 48134 39282 29742 24756 22293 19574 19539 21302 20899 19704 20167 21268
29408 21268 22531 23558 24036 23209 21149 19433 17366 15376 14421 12137 12551 14447 13203 9994 7874
29393 7874 8707 12360 15088 18998 22489 23622 25522 27029 27127 25408 22437 19804 19367 19680 19745 21955
29377 21955 24636 26408 27944 27947 27665 28995 28971 27688 25948 24375 24268 23554 22429 24029 26435 30730
29361 30730 33643 34305 34399 35620 38861 44656 50649 53589 56026 60381 67157 74102 78766 83672 91516
29346 91516 102964 116607 129678 138953 149135 164432 179140 189932 196036 201709 210617 218294 221658
29333 221658 219293 209425 197668 183271 164562 146312 131286 120511 113485 106624 98044 87107
29321 87107 76419 68468 63623 61546 56259 49097 47529 50096 51852 49516 45951 44351 42159 42094 43357
29306 43357 41381 37074 33752 31688 28929 26106 25967 26493 27216 30217 29706 23431 19675 19177 17905 17572
29290 17572 18811 20644 22155 21775 19620 17285 16526 16734 18473 20805 23633 26051 26148 25975 27597 27662
29274 27662 27968 31559 32865 29075 23565 18918 16409 16220 17817 21118 23146 22497 18924 16373 16317 15326
29258 15326 15941 17422 17004 16265 17205 19075 19279 20776 25296 27765 31178 38007 44573 50885 56054 62023
29242 62023 68885 75836 82512 88152 93311 98582 103908 108032 110120 111039 111940 112581 110388 102751 91665
29227 91665 81702 74688 68124 63115 60878 58942 55848 49690 40053 32745 31144 34534 35385 31869 30787
29212 30787 34432 38791 40400 38315 33907 30664 28060 30279 34492 33929 31730 31238 31466 32157 33725
29197 33725 35832 37712 38499 37071 36581 36319 33778 31467 30247 29901 30742 31426 30880 29488 27787 26202
29181 26202 26754 29322 30606 32165 34097 34976 35882 36091 32146 25545 19704 17081 19355 23834 26905
29166 26905 29115 28575 27303 27617 26560 23536 21413 22472 25752 27114 27825 28921 29000 29709 29036 27117
29150 27117 27763 28685 26465 23273 21499 23270 27776 31299 32690 33612 33763 31834 30538 31217 30651 28791
29134 28791 25835 24438 22393 21841 25107 28455 27817 24431 23338 25091 27673 28832 31229 35735 39550
29119 39550 41257 41907 43034 43840 45744 50099 53223 53740 52990 50896 48753 50417 54256 55461 53194
29104 53194 47505 39565 31250 26359 27119 29079 29647 31966 36271 40002 40377 37489 33751 32836 35311
29089 35311 38236 39686 43906 47686 49420 48078 46895 48005 50765 53534 57884 61430 61738 61817 62333
29074 62333 62611 61134 60708 61777 63312 65887 71852 79550 86429 89443 85970 81978 83290 87435 90943
29059 90943 93035 93730 96586 100703 103812 107897 112244 113390 112038 113480 118351 123326 126160 128338 131790
29044 131790 134692 137202 141377 146407 151486 156965 161060 162204 160184 162331 172466 184350 194024 200783
29030 200783 207007 214612 221492 227442 235378 243984 248583 250802 260479 277245 292515 305567 321986
29017 321986 341451 360392 376396 394956 419579 446903 478027 513653 550509 591216 638070
29006 638070 689619 748064 811053 879815 959224 1046563 1141455 1249231 1364571 1479648 1596712
28995 1596712 1715050 1830930 1945074 2054759 2155230 2240706 2309641 2358535 2385262 2394338
28985 2394338 2383584 2350797 2303128 2250411 2194674 2139298 2087011 2044120 2015266 1997741 1992497
28974 1992497 2003652 2029715 2069639 2125649 2195540 2272021 2348867 2424338 2496432 2560370 2611587
28963 2611587 2646208 2658722 2648586 2619802 2571498 2500386 2410007 2308350 2197174 2079860 1967451
28952 1967451 1864343 1770825 1688684 1616558 1556532 1505497 1463307 1432030 1407814 1387775 1369972
28941 1369972 1354621 1344588 1338871 1331781 1320780 1305121 1281632 1248224 1211664 1176441 1142948 1109632
28929 1109632 1077605 1045680 1009847 975224 947833 928702 918325 910313 905862 910440 921981 935402
28917 935402 947667 962375 981265 1002156 1022495 1041536 1060454 1078538 1093433 1104335 1111864 1115110
28905 1115110 1114658 1112707 1109217 1101873 1093392 1085301 1078044 1071186 1065530 1062353 1065953 1083466 1110474 1143432
28891 1143432 1182466 1234734 1302914 1386403 1487483 1605856 1742863 1900902 2079484 2275186
28881 2275186 2482571 2701849 2930973 3158377 3368894 3557221 3727346 3878725 4004290
28872 4004290 4089534 4121411 4099994 4037982 3951096 3856201 3762397 3663499 3547343 3409381 3253487
28861 3253487 3103191 2984878 2903478 2855306 2840083 2862544 2919378 3000626 3102787 3222648
28851 3222648 3355845 3497827 3639508 3773022 3900105 4017239 4110969 4174182 4210681 4222624
28841 4222624 4205974 4164739 4107590 4036520 3958090 3880360 3812326 3762580 3733651 3725861 3742101
28830 3742101 3782846 3845124 3926355 4023119 4132547 4248021 4362401 4471180 4567571 4643598
28820 4643598 4696197 4725894 4731904 4713067 4673616 4618692 4553993 4489607 4435025 4394732 4373623
28809 4373623 4382497 4429824 4513964 4633074 4788782 4980275 5201744 5447758 5715696 5992940
28799 5992940 6271335 6548086 6813203 7056679 7268944 7442040 7569790 7650476 7686153 7673134
28789 7673134 7608146 7495671 7343048 7149558 6919072 6662734 6385921 6094356 5792384 5489002
28779 5489002 5191656 4910132 4654044 4429045 4238849 4085082 3968642 3895875 3867546 3878752
28769 3878752 3929304 4018841 4145476 4302956 4487153 4697152 4930085 5182575 5451543 5727269
28759 5727269 6001563 6266560 6511549 6729089 6916454 7067547 7175332 7234783 7240099 7191963
28749 7191963 7097754 6958976 6773180 6544904 6277399 5975372 5645263 5293041 4923031 4544377
28739 4544377 4171685 3814540 3474358 3156606 2870459 2615984 2390158 2191137 2015243
28730 2015243 1858566 1722987 1601686 1491651 1396294 1312753 1234566 1164714 1105742 1052782
28720 1052782 1003045 951923 900896 856340 818849 784863 753710 724759 697920 672455 648388
28709 648388 628367 613580 600437 588623 582263 578780 573638 568491 568116 574143 581911 591979 605912
28696 605912 620966 633837 644673 659695 677100 691107 700378 704922 705222 702594 696976 684988 668305
28683 668305 650238 627751 601791 576685 553614 534897 520533 508448 499182 493244 491233 493680
28671 493680 497157 499663 507788 525719 545404 562978 578135 591778 604470 612705 619714 626840 631845
28658 631845 630167 620332 605820 590048 570578 545901 517375 488338 460629 433125 406715 385453
28646 385453 367708 351889 338913 326582 317228 308329 298694 289213 278696 270542 267354 264412 257587
28633 257587 247506 239644 236455 234734 235140 235699 236220 236223 235599 237162 238103 238928 241383 245758 252099 256948
28617 256948 260388 261786 259877 254666 248018 242949 238043 236124 236622 236077 236903 239298 240250 238784 237066
28602 237066 237318 241116 248335 255517 260994 265951 271749 276309 277583 281647 290087 299769 306996 311241
28588 311241 318458 329934 347439 365860 378647 386427 395162 407663 422304 436304 451032 466938
28576 466938 487624 512708 538711 565438 593093 622889 655519 688541 721988 756971 796299
28565 796299 840581 889836 943977 1003619 1069084 1143775 1229842 1326444 1431173 1543424 1662445
28554 1662445 1787269 1916322 2043909 2170660 2293575 2404950 2503871 2585964 2649398 2693618
28544 2693618 2712523 2706827 2680915 2637687 2575220 2493712 2402107 2309433 2220865 2141222 2070993
28533 2070993 2012256 1969118 1941721 1932863 1942265 1965204 2003368 2054668 2112939 2177975 2248171 2322444
28521 2322444 2398596 2469935 2534577 2593657 2643846 2683645 2711962 2723683 2722185 2715920 2705247 2690477
28509 2690477 2675308 2661536 2653432 2653549 2661447 2679268 2706722 2741502 2780294 2815950 2845759 2868851
28497 2868851 2881253 2879405 2863059 2829407 2775555 2702620 2615256 2516285 2406413 2290599 2171394
28486 2171394 2050453 1933997 1827827 1730403 1639300 1556526 1484156 1422388 1373207 1332127 1293939
28475 1293939 1258923 1231503 1210234 1193814 1185743 1184334 1187051 1196009 1214248 1241049 1276487 1320942
28463 1320942 1375894 1445420 1526572 1615428 1714535 1827399 1951452 2084655 2225590 2365632
28453 2365632 2500344 2631421 2758012 2866790 2950531 3009791 3042415 3043391 3014781 2961238 2885730
28442 2885730 2790615 2678198 2547923 2404273 2255514 2108389 1965739 1828027 1696446 1576089
28432 1576089 1468815 1371745 1282340 1199632 1124886 1056342 989646 928796 875777 828285 786365
28421 786365 748243 714154 685877 660672 632252 605276 582138 562073 546696 534305 522706
28410 522706 509923 494720 479057 466245 458904 453710 450260 445307 439790 437356 435598 435287 438730
28397 438730 441890 441749 438343 433959 433303 434839 436424 438233 441139 446562 453104 457687 461436 463905 467416
28382 467416 473176 479368 488434 498896 512037 527132 541059 552571 564714 578071 595006 616567
28370 616567 638360 661102 689845 725588 766162 811527 861492 918595 981824 1052302 1133867
28359 1133867 1226055 1327520 1437756 1554431 1676998 1808551 1946204 2082176 2208998 2326996
28349 2326996 2434560 2529767 2614608 2689243 2752363 2796176 2815620 2820948 2820591 2812069 2793451 2763034
28337 2763034 2723326 2678837 2632090 2582292 2524287 2452237 2369553 2281255 2186092 2085218 1981074
28326 1981074 1875113 1773218 1683459 1609918 1554381 1509909 1475976 1458836 1457853 1466476 1482272
28315 1482272 1505665 1538140 1581125 1632304 1690127 1751645 1819968 1897625 1982213 2071005 2161573
28304 2161573 2253201 2348845 2450403 2557608 2665194 2772691 2878573 2983261 3085401 3182326
28294 3182326 3272598 3356118 3428061 3487155 3532271 3556331 3558629 3539083 3494282 3424317 3329341
28283 3329341 3213850 3085991 2953165 2820939 2691178 2566051 2446872 2331524 2222703
28274 2222703 2124954 2036349 1954635 1881608 1816978 1755288 1696565 1642486 1595394 1555072 1521950
28263 1521950 1498870 1487891 1485700 1486374 1489363 1499382 1519150 1549833 1589724 1636723 1691405 1753826
28251 1753826 1827562 1912925 2013559 2129734 2256034 2393369 2545651 2713115 2895080 3091244
28241 3091244 3300062 3517965 3743464 3975565 4203348 4416973 4614982 4788583 4928009
28232 4928009 5027939 5080234 5083608 5036575 4932687 4780631 4594870 4382844 4153611 3918599
28222 3918599 3687040 3468311 3269366 3094976 2948000 2826141 2724917 2641761 2576801 2523197
28212 2523197 2475310 2430393 2385734 2339766 2294785 2249218 2202272 2158554 2120837 2088863 2065718
28201 2065718 2055516 2056603 2065463 2080463 2098080 2115866 2136925 2160133 2180532 2195207 2203590 2205609
28189 2205609 2199135 2185086 2166509 2143473 2114489 2085176 2064940 2059252 2071125 2097618 2134134 2177061
28177 2177061 2227164 2283830 2344417 2404335 2460540 2511360 2556439 2593330 2619260 2635910 2646252
28166 2646252 2654190 2664552 2685394 2720851 2770304 2838613 2926361 3034051 3161075 3300037 3444134
28155 3444134 3587409 3724295 3849613 3954279 4033579 4081542 4094583 4071948 4010941 3913943
28145 3913943 3786524 3632218 3457114 3269595 3078532 2886301 2692789 2504527 2331971
28136 2331971 2176077 2032989 1902472 1785704 1683785 1596267 1518874 1452471 1399013 1353076
28126 1353076 1312037 1274487 1242330 1217490 1198326 1186465 1179011 1173232 1172194 1173484 1177035 1185519
28114 1185519 1200090 1218285 1238731 1263593 1293635 1330387 1375529 1427981 1488686 1556500 1629577
28103 1629577 1711747 1804711 1909925 2028458 2155412 2292691 2443421 2606827 2779157 2955729
28093 2955729 3133795 3309990 3481825 3649157 3808873 3957190 4092703 4213909 4315059
28084 4315059 4394722 4455396 4498415 4526947 4543398 4549019 4545447 4535288 4520632 4502309 4486019 4476271
28072 4476271 4479154 4504934 4555899 4630644 4727950 4848285 4990158 5150102 5324788 5504809
28062 5504809 5679729 5843199 5989461 6110539 6200191 6257403 6282137 6272599 6232374 6168132 6086031
28051 6086031 5993904 5902786 5821477 5758318 5717298 5695428 5689987 5702125 5728219 5759074 5787434
28040 5787434 5804713 5805920 5786731 5745474 5681440 5593063 5480690 5343776 5184156 5008549 4818295
28029 4818295 4614952 4405535 4195790 3987513 3783347 3593263 3421080 3266992 3133742
28020 3133742 3022725 2937189 2878359 2840883 2820306 2819812 2842201 2887693 2957876 3053182 3169470
28009 3169470 3304997 3462307 3644518 3851177 4075779 4315646 4569731 4834263 5102841
28000 5102841 5363461 5607861 5832072 6029480 6195913 6329602 6425115 6476132 6480781 6435251
27990 6435251 6340949 6201960 6022161 5808758 5559518 5273861 4962504 4634235 4299217 3971052
27980 3971052 3661502 3377473 3120554 2889044 2679602 2490060 2319473 2167311 2030895
27971 2030895 1910081 1803822 1704467 1612916 1532095 1456768 1385341 1317660 1252430 1188280 1128449
27960 1128449 1075766 1030545 990558 953797 920128 890614 866467 843392 817827 794171 776154
27949 776154 763588 750484 734161 721025 713984 708285 699484 689415 683477 682269 682455 684170 686093
27936 686093 687852 691733 695448 699635 707116 717574 730355 745144 762091 781193 799264 816195
27924 816195 834947 858042 885162 918202 953573 988367 1028518 1072744 1118363 1165565 1217336
27913 1217336 1277793 1342885 1411227 1485757 1567203 1661971 1771226 1889351 2015073 2156080
27903 2156080 2315572 2488599 2675671 2876462 3087169 3308826 3540424 3775890 4011983
27894 4011983 4249128 4485212 4714679 4927561 5122426 5301025 5464251 5609444 5733695
27885 5733695 5833083 5906635 5957694 5985356 5988601 5972225 5940126 5896255 5843813 5789793 5739800
27874 5739800 5692524 5645383 5598389 5554735 5512187 5470005 5430180 5392636 5354599 5316421 5278365
27863 5278365 5236635 5187195 5128044 5058708 4979996 4892832 4794688 4683700 4560348 4425162 4278529
27852 4278529 4117768 3944707 3769154 3598137 3437734 3288352 3150575 3028681 2922232
27843 2922232 2825319 2736960 2661438 2594415 2531811 2470856 2408025 2345768 2284555 2221256 2156453
27832 2156453 2091204 2024838 1956567 1888418 1822022 1757525 1691040 1622266 1555714 1495020 1440164
27821 1440164 1392368 1354503 1325352 1303921 1292114 1292620 1302016 1318183 1343452 1375898 1412724 1454159
27809 1454159 1502604 1554906 1611075 1670787 1731749 1793178 1856542 1921121 1983694 2046172 2109338
27798 2109338 2172251 2229559 2279039 2325504 2369560 2403900 2426799 2440716 2447584 2442670 2425168 2396114
27786 2396114 2354227 2304588 2254734 2202105 2146314 2090840 2032983 1972023 1911886 1851615 1788642
27775 1788642 1724162 1661477 1600935 1540881 1485893 1441025 1407137 1383023 1365052 1352548 1346116
27764 1346116 1346433 1354180 1363073 1370724 1383935 1401192 1419671 1440839 1464801 1489215 1512219 1531816
27752 1531816 1547062 1558339 1567758 1575888 1582793 1586531 1580206 1562508 1535794 1504143 1469218 1431421
27740 1431421 1390060 1347123 1304590 1263144 1217351 1167540 1117055 1062574 1004982 950423 899585
27729 899585 847625 795382 747082 703120 661123 621853 586724 556974 535022 516632 498076
27718 498076 481682 468740 457899 445921 432995 423555 414878 407110 402762 396523 386309 380010 377374
27705 377374 374319 373340 374564 373744 371551 370544 372056 376901 388841 403132 415155 425242 436856
27692 436856 453308 473998 497481 524328 554610 586502 619289 649143 676413 703763 730225
27681 730225 756672 782493 806073 826561 841770 851887 857029 854716 847660 836218 820410 803199
27669 803199 782715 762968 743455 725275 711094 698299 686566 675386 664657 657160 656514 660205
27657 660205 667734 681147 701663 726533 753083 785051 826608 874505 926553 987483 1061718 1149575
27645 1149575 1245209 1344821 1450637 1564310 1681435 1799040 1913059 2021589 2126346 2227315
27635 2227315 2322525 2410645 2490895 2556073 2608890 2661353 2717624 2781934 2856377 2934912 3010789
27624 3010789 3082697 3146793 3196016 3225462 3238108 3231940 3205882 3158973 3097062 3034020 2982617
27613 2982617 2949377 2942650 2966837 3015596 3084280 3170263 3273969 3389916 3508975 3627677 3741326
27602 3741326 3845171 3934546 4006341 4060695 4099074 4123969 4142900 4162771 4185332 4212485 4246289
27591 4246289 4291382 4351457 4430721 4530944 4648830 4779409 4917303 5048830 5162196 5251853
27581 5251853 5311863 5337541 5319607 5253659 5142521 4993056 4814148 4613874 4404763 4194819
27571 4194819 3985484 3780180 3582680 3394425 3215474 3046519 2887614 2736691 2592240
27562 2592240 2454685 2326657 2208315 2100328 2003408 1913358 1832907 1760957 1697476 1643035
27552 1643035 1594619 1553109 1522390 1501872 1487088 1477886 1476348 1482120 1491161 1507878 1532633 1564557
27540 1564557 1606372 1661613 1729243 1805136 1894464 2002561 2130375 2276068 2440017 2625645
27530 2625645 2833961 3066703 3319470 3585940 3864542 4152936 4441315 4718864 4978510
27521 4978510 5213781 5422720 5605451 5763528 5896253 6001994 6086781 6159175 6231833 6321864
27511 6321864 6444900 6603371 6798322 7026438 7278378 7546301 7820342 8095294 8365505
27502 8365505 8623186 8859905 9071215 9259660 9426973 9577970 9714690 9831422 9923761 9985361
27492 9985361 10006023 9977799 9899235 9769529 9586448 9355809 9092950 8815832 8537588 8270570
27482 8270570 8027162 7812443 7626678 7469398 7340941 7233888 7146980 7083660 7043068 7025613
27472 7025613 7033891 7066428 7114657 7170618 7219334 7240158 7218248 7145691 7017518 6827018 6571412
27461 6571412 6252821 5879698 5468556 5039383 4614454 4211467 3840830 3510643 3223240
27452 3223240 2975130 2759076 2570434 2409135 2273146 2157541 2058454 1972888 1898145 1833845
27442 1833845 1782458 1744683 1716298 1694259 1680276 1676021 1682849 1702874 1733792 1775383 1830074 1899631
27430 1899631 1984121 2084034 2200162 2329524 2472889 2630333 2799810 2978862 3164814 3351393
27420 3351393 3535242 3713356 3879471 4028138 4153629 4253489 4328475 4376592 4396494 4381472
27410 4381472 4331465 4248861 4135507 3996738 3835752 3652658 3452080 3240157 3023048 2810705
27400 2810705 2611936 2435635 2286352 2162434 2060855 1985258 1932465 1895080 1872153 1861919
27390 1861919 1861710 1872570 1893496 1916104 1936140 1951115 1958779 1958443 1947513 1925311 1891531 1842588
27378 1842588 1778924 1704455 1625174 1544599 1462021 1379325 1299250 1222663 1153819 1094849 1044361
27367 1044361 1000487 965097 941037 922750 905888 895261 892517 893099 897840 904870 910403 917346 933254
27354 933254 956024 979166 1004566 1033979 1065625 1098767 1134384 1176605 1226123 1277696 1330176
27343 1330176 1384224 1436806 1490918 1545654 1598918 1650363 1697799 1743136 1783975 1821573 1859779
27332 1859779 1897153 1933053 1971171 2014420 2062967 2119446 2181376 2246387 2314942 2388058 2465711
27321 2465711 2542322 2615753 2683480 2743751 2792617 2827440 2851013 2859834 2848607 2816954 2769586
27310 2769586 2711530 2643611 2565695 2481761 2392334 2297221 2198365 2100683 2010608 1927710 1848612
27299 1848612 1775721 1711100 1658656 1617232 1580157 1548575 1526026 1515506 1517542 1527774 1542844
27288 1542844 1565462 1593704 1626197 1661052 1693217 1725085 1758921 1787272 1808800 1824234 1831246
27277 1831246 1830781 1820132 1801914 1779495 1749102 1713069 1678307 1645508 1616679 1593414 1576489 1565331
27265 1565331 1556763 1551942 1554273 1567380 1590295 1617554 1648510 1684880 1725384 1765348 1803101 1844836
27253 1844836 1889252 1928645 1962467 1996405 2031728 2067976 2108137 2154016 2204856 2260774 2322178
27242 2322178 2391817 2471032 2557410 2646556 2734019 2813841 2875624 2913199 2926496 2916263 2885031
27231 2885031 2828820 2738069 2618200 2482481 2342268 2208024 2087297 1984551 1896658 1821072
27221 1821072 1758115 1704635 1660827 1620710 1581780 1543925 1509304 1478310 1454350 1437802 1422109
27210 1422109 1409341 1405820 1410793 1424907 1450139 1488094 1536088 1591863 1659512 1741828 1837138 1944799
27198 1944799 2057595 2169183 2282919 2397925 2504800 2595530 2665960 2709384 2725924 2716309
27188 2716309 2677620 2609382 2508126 2377105 2225818 2066767 1911362 1765782 1637630 1533772
27178 1533772 1450375 1383492 1330633 1287455 1253467 1226595 1208163 1199627 1196595 1194750 1192573 1189672
27166 1189672 1187291 1185549 1180777 1172849 1162320 1148136 1132152 1116965 1101016 1081109 1061776 1043204
27154 1043204 1027148 1014709 1003897 998390 997746 999196 1002983 1009398 1018181 1029027 1042006 1057333 1075789
27141 1075789 1096367 1119028 1144141 1169760 1196974 1228215 1265249 1311156 1369273 1442129 1528864
27130 1528864 1630397 1744205 1873679 2024519 2192322 2372932 2559502 2748976 2935129
27121 2935129 3105096 3253575 3378246 3474092 3535945 3557228 3529458 3449503 3328552 3179120
27111 3179120 3009650 2829590 2647816 2471016 2302490 2146416 2007732 1886244 1783392
27102 1783392 1698618 1631237 1581443 1547607 1526908 1519466 1526386 1546634 1582049 1639829 1721599 1823879
27090 1823879 1947213 2094127 2266475 2461300 2676996 2910927 3155227 3401137 3643822
27081 3643822 3878649 4096469 4284612 4427952 4517694 4547483 4515531 4424842 4278927 4084110
27071 4084110 3842868 3562946 3264669 2965216 2678793 2417231 2187962 1990045 1822933
27062 1822933 1684994 1568297 1469111 1384587 1312601 1251515 1199899 1156064 1117213 1082825 1051638
27051 1051638 1021727 995080 971630 951032 934788 921998 914089 912190 912960 922756 945020 975487
27039 975487 1012601 1057331 1109986 1169397 1239619 1320503 1411778 1513657 1620971 1726492 1827971
27028 1827971 1923362 2012418 2091253 2154313 2200686 2223340 2218454 2188100 2136953 2069920 1991898
27017 1991898 1908371 1824324 1744746 1675503 1621558 1588104 1576635 1584133 1609036 1650239 1708904
27006 1708904 1785270 1877047 1979530 2087593 2202198 2327721 2461509 2598873 2736300 2870829
26996 2870829 3000772 3124360 3241995 3354486 3456999 3542405 3607533 3651060 3670010 3664806
26986 3664806 3633606 3569598 3472600 3347197 3196572 3027232 2851774 2676524 2505215 2348096
26976 2348096 2214421 2107404 2027252 1979727 1962189 1966451 1988854 2029234 2084889 2147529 2212706
26965 2212706 2276221 2331532 2373282 2397514 2399439 2379625 2337571 2270309 2181532 2073654 1947576
26954 1947576 1809984 1670685 1535734 1411585 1303560 1205902 1116800 1041509 983412 937463
26944 937463 898596 862737 831647 807791 787903 769607 753757 739901 728734 717635 704961
26933 704961 693665 687423 684955 684743 690672 702929 714009 722390 737264 756722 782168 817255 862926
26920 862926 917870 979335 1046728 1119153 1194386 1274381 1358308 1442861 1529067 1615050 1698174
26909 1698174 1776833 1844909 1897247 1935826 1962861 1980209 1990798 1995798 2001727 2018794 2054647 2116094
26897 2116094 2205800 2324092 2470517 2646095 2848363 3069786 3306324 3546284 3769143 3951815
26887 3951815 4080822 4158645 4196518 4196108 4139686 4008824 3806792 3562520 3321448 3118938
26877 3118938 2962290 2847903 2770832 2720345 2682910 2650478 2621548 2587628 2533353 2456298 2357525
26866 2357525 2242273 2115841 1978164 1828893 1672739 1521907 1383252 1257313 1144361
26857 1144361 1046058 964914 897478 839576 788656 743524 705213 674075 649881 632225 617373
26846 617373 607063 603192 603754 606874 614325 625750 642550 664868 689549 714491 738131 762606
26834 762606 789670 817011 840347 856270 867163 875195 879302 878522 871013 851017 818704 783646
26822 783646 750757 714781 675915 637691 602857 570618 541790 517069 495423 474752 454608
26811 454608 435895 417678 398081 376981 358271 342944 327904 311997 297027 284034 273889
26800 273889 264883 256440 249376 244547 240272 233610 229118 227343 227896 229795 229298 227842 227282 232407 238818
26785 238818 243394 246843 250493 256336 262880 269084 274699 281566 291026 301398 311240 322683 338157
26772 338157 356799 376376 398539 425009 454056 483266 516339 557818 607559 662024 717319
26761 717319 774581 836194 902979 972539 1038600 1098887 1154540 1206318 1251081 1288993 1321643
26750 1321643 1346097 1357496 1352838 1338922 1323465 1304638 1280732 1256507 1231958 1205654 1176008
26739 1176008 1142026 1104557 1063177 1019706 972941 924071 872644 816041 758790 707017 661236
26728 661236 621710 586469 556211 532191 513956 499652 488347 478504 468465 460897 455046 445726
26716 445726 434077 421040 406369 389434 374104 363115 354350 347719 339696 331447 323878 315881 312051
26703 312051 311234 311312 315587 322804 328162 330519 331917 337191 348104 361502 375193 391906 411010 432575
26689 432575 457224 487377 524702 564821 607308 652361 700234 751987 806307 860894 916614
26678 916614 971949 1021851 1066593 1112001 1156226 1195722 1228030 1254631 1278224 1299841 1320559
26667 1320559 1338719 1353938 1365771 1370460 1367848 1356931 1333639 1298301 1250816 1193841 1128224 1054334
26655 1054334 976188 900446 828903 760964 698006 641210 590229 542981 499827 460909 428882
26644 428882 400292 373353 352883 338783 326247 314002 303000 292918 286311 281898 275927 272301
26632 272301 269967 263112 254104 246937 243494 244945 249751 255548 260081 264847 272604 281737 292702 307522
26618 307522 324765 341186 353958 365588 379747 397267 413218 428777 445273 461397 478384
26607 478384 494433 510750 525597 537367 548050 561724 576787 590261 602136 616170 632581
26596 632581 648886 667037 687724 710017 733847 755490 777529 797881 813424 825429 833478 836260
26584 836260 832236 819626 796255 763372 723896 680400 633813 586454 542575 499310 457053 418513
26572 418513 381450 350223 324482 302503 280969 261866 244814 228503 214355 200573 187816
26561 187816 176043 166899 159184 151523 146239 140655 132538 124149 118282 117509 116761 114406 111868 110535
26547 110535 108307 103049 99229 98617 96381 93375 90600 88709 89845 92602 95072 94222 92463 94038 99322
26532 99322 105082 106909 105698 104945 106278 107877 109909 113520 117069 121082 125805 133608 143211 153778
26518 153778 164894 174518 183518 194447 204077 212545 220919 229306 238449 245943 251604 257570 263071 266913
26504 266913 269915 271491 265893 255521 246090 238367 228302 215635 203486 191775 181745 173280 162779
26491 162779 152232 145281 139054 129856 119811 111110 108007 107366 104501 99619 95510 91005 87401 85890
26477 85890 84508 82416 80499 79395 77518 73642 70449 68796 66301 64168 63087 63686 66247 66095 62852
26462 62852 57971 54236 55410 60431 62849 58502 51604 45460 41571 38674 36911 39634 43021 41813
26448 41813 38272 38069 41998 43446 41200 38933 37786 36449 34749 32703 29804 26856 25655 27243 28332
26433 28332 27182 25304 23031 21041 20451 20326 23178 28670 33830 37123 37687 34202 30527 32327 37904
26418 37904 42455 45377 45382 44887 45127 44409 44278 43530 41740 41872 41279 38229 32832 26837 23161 22262 24781
26401 24781 28490 30043 31501 33581 33485 33413 33704 33466 33161 31412 31082 31827 32075 32254 30421 31187 35897
26384 35897 42374 45459 45097 45685 46810 48363 48867 48444 47564 45135 41356 37468 34935 33080 31543 28938
26368 28938 26016 23913 23080 24719 26939 28863 29634 28158 26661 27720 27381 26463 27644 29137 30636
26353 30636 30849 29598 26169 23347 21046 19893 24661 30126 31145 29145 27132 27646 30498 33183 35770
26338 35770 34784 32963 32420 31853 32696 35954 36730 33746 31972 34101 38558 38093 33734 28601 24305 22010
26322 22010 20298 20707 21340 19717 18575 20941 25542 28426 29667 27572 23250 21501 22878 25487 25903
26307 25903 24905 25092 25310 24975 25974 28301 26046 22633 22622 23955 25180 24308 22128 20788 20540 22581 26723
26290 26723 29310 30397 29840 26885 24401 22680 21585 19892 18544 21131 25521 25310 21966 19199 16119
26275 16119 13660 14132 17414 23156 27793 29549 30505 31705 31900 32583 34409 35921 35484 34040 31886 27946
26259 27946 25120 25260 28664 32197 32672 30582 30743 36069 40059 40709 41390 39305 35148 31006 27203 24063
26243 24063 20393 17487 16156 18990 22938 25381 27158 26494 27748 32010 33383 33015 32058 29325 27235
26228 27235 27582 29119 28083 25075 25362 27660 29250 31394 32716 30777 30583 37006 43194 45380 46471
26213 46471 45805 45191 43805 44559 44837 42149 40173 39688 37186 32969 28098 22802 20901 23008 23282 22881
26197 22881 25761 29341 31770 32645 33627 34754 34243 31679 27198 22499 16643 10931 11823 15462 17328
26182 17328 17356 16546 17479 20477 22092 22559 23335 24076 26896 30838 31742 30017 29231 29665 28918 25366 20471
26165 20471 17082 13882 11110 13017 19461 25359 28621 29645 29564 30147 29704 28659 31328 34736 34932 33155
26149 33155 33337 36466 39705 42255 41753 39784 38198 36763 34960 31909 30664 33236 36247 38471 42207
26134 42207 46874 53837 57984 56728 53727 54724 58054 60701 65150 71904 76870 79682 81783 82758 85892
26119 85892 90718 96575 100827 105861 111338 113175 109532 100422 91383 85415 80874 76476 72898 71100
26105 71100 70411 69822 69204 69336 71015 69712 66579 66816 69648 74018 76338 75488 75773 78608 81379 83593
26089 83593 86566 90294 92620 93789 95353 99336 106136 114476 122087 126426 132063 141160 151905 162678
26075 162678 171139 181238 194309 207543 222391 238580 254811 273389 296816 321607 343432 366806
26063 366806 394759 427898 465973 513591 571417 640104 726733 832164 956601 1104591 1280310
26052 1280310 1477261 1689200 1916373 2156447 2406807 2662996 2907059 3117646 3274872
26043 3274872 3368141 3404776 3396810 3336460 3202611 2983317 2688332 2355784 2027836 1733204
26033 1733204 1482746 1276591 1108669 972642 862956 773121 699503 638119 585267 538075
26023 538075 494572 456438 423597 392531 361634 335851 314593 293708 272177 252255 236109
26012 236109 220219 204245 192298 183171 174405 167272 158669 149618 145502 143851 140833 133834 122010
25999 122010 110847 102906 100011 99274 98546 98818 97949 95701 94290 92406 88366 82680 77837 76084 75756
25984 75756 72763 68144 64333 63560 65202 64969 62628 62502 63940 64392 65007 62780 62256 66767 71497 75507
25968 75507 79704 82806 86021 90196 89603 88001 90849 95597 97492 97498 99133 103922 111687 119804 125469
25953 125469 128558 132022 137966 146554 151478 152272 151366 150971 151471 148440 142327 136084 128814 120258 113723
25938 113723 109791 106798 101463 94212 91777 96972 102561 103229 101510 98828 94212 89054 87730 89798
25924 89798 91481 91983 93074 96570 102823 107835 110328 112774 112510 111166 113510 120220 127750 135972 141869
25909 141869 146880 154704 161608 166159 171560 179784 190057 201385 213194 224789 236069 251832 269040
25896 269040 284434 302736 324873 346564 369291 396757 433452 478190 530624 595497 669522
25885 669522 746891 832894 927559 1028975 1136940 1250186 1364261 1477326 1585190 1680094
25875 1680094 1756308 1811678 1848785 1867931 1865604 1837919 1786429 1720413 1646324 1567733 1489356
25864 1489356 1410992 1333489 1261109 1193549 1131745 1080150 1036883 1001186 976337 961220 948510
25853 948510 936294 929196 923706 916915 908713 896428 876613 849546 821188 790539 756902 717629
25841 717629 672000 622574 574312 531045 493542 460865 431860 409243 393833 382175 371283
25830 371283 357936 345053 335578 327876 320147 314107 308936 305821 305374 306040 308060 312883 318994 324238
25816 324238 331190 340706 353905 368394 380627 393614 407649 423393 443868 469249 498326 529532
25804 529532 563386 601437 642803 689520 741306 796230 855942 920888 991188 1066947 1149686
25793 1149686 1240144 1334301 1430448 1531356 1637427 1745184 1851616 1958741 2066617 2175370
25783 2175370 2283526 2386936 2479523 2558066 2626417 2684666 2730984 2764394 2781737 2789017 2793930
25772 2793930 2796346 2792538 2780872 2760788 2730524 2690447 2638766 2575233 2501572 2419428 2329043 2230785
25760 2230785 2124890 2009239 1884801 1759925 1642838 1534780 1436314 1345779 1261978 1183855
25750 1183855 1107972 1034056 964295 895938 832150 774507 721049 671138 625288 583935 547064
25739 547064 513846 485630 462101 438341 416412 400029 386240 372132 360220 352631 346979 342598
25727 342598 337061 330525 324446 319175 315657 313516 312514 313127 314568 317193 323582 332483 343119 354165
25713 354165 366833 381750 396831 410960 426722 450018 480853 514344 549015 581553 613584
25702 613584 646681 678781 708429 732230 750390 765224 777464 787097 791774 790443 788416 791630
25690 791630 800642 815761 835867 861067 894304 937411 987197 1040875 1100444 1169880 1246241 1322222
25678 1322222 1395653 1466496 1532495 1587611 1627300 1650536 1652762 1631741 1590997 1532895 1459536
25667 1459536 1374352 1275920 1165489 1050306 937513 832660 739497 658436 587958 528435
25657 528435 480286 442568 408535 375317 343230 314520 292316 273509 254898 236939 221821
25646 221821 211925 205182 199717 192388 181188 170247 159979 152738 148349 145065 141784 135591 130285
25633 130285 126876 123008 120436 117881 114486 110679 105732 99829 95697 94780 94651 92716 89800 87171 85365
25618 85365 83858 81861 79070 77346 77801 79679 81022 80075 80451 84900 92124 97742 97983 97429 99667 101545
25602 101545 104295 108941 113481 115918 115834 113279 112529 112847 107779 101018 94522 88620 86193 85944 84293
25587 84293 78376 68652 60056 55394 50213 44336 40732 39025 37854 35815 36015 36757 36529 36758 36661 36986
25571 36986 36438 36342 37226 36588 36062 35874 36811 40816 44628 45254 44018 42713 41150 41902 43394 40616 34035
25554 34035 30700 32583 34324 33083 31112 31003 30392 30417 32910 32737 29550 24474 21072 22854 28616 31108
25538 31108 29362 28079 25764 23966 24043 23691 21577 17553 13959 13778 15966 17136 16811 18503 21060 23847
25522 23847 27164 29333 30698 28099 22534 17382 15301 14721 15309 16652 19202 20786 21413 21873 20821
25507 20821 18379 16016 17659 19910 19872 21185 24992 28760 32534 36522 38146 35286 29588 23225 17532
25492 17532 14423 11531 8481 7888 7739 8311 8581 11170 14921 17880 20830 20353 15542 10022 8127 9670
25476 9670 12208 15241 15256 12429 10615 8964 8040 9648 15012 18494 18675 17682 16489 14276 12956 13648
25460 13648 14028 13276 13834 14431 16146 19380 23057 27040 30046 29827 27865 25489 21931 16373 9468 6240
25444 6240 4648 3121 4014 6108 6174 3792 3599 4710 6821 9325 10095 10407 10634 10181 7554 5004 3328
25427 3328 4465 8577 13334 19014 23818 23609 20151 17159 14196 12075 10090 9367 11426 13819 14145
25412 14145 12672 12774 16570 23102 28514 28481 23184 18003 13364 8428 6693 8786 11778 14189 13062
25397 13062 10772 11293 12211 13368 14324 16192 18865 18549 16802 16294 16940 16125 13418 11808 8895 6003
25381 6003 4530 2945 3030 5359 7434 7616 8226 9604 10852 10608 7927 6826 7872 7654 8770 10439
25365 10439 12991 15815 17079 18475 17567 14361 13661 15310 17327 17530 16435 15536 14518 14120 16075 16947
25349 16947 14423 10089 8788 12824 14533 14159 14232 12921 12790 13842 13120 11099 10623 11517 12798 14390
25333 14390 15141 15926 18489 20966 19483 15583 11990 11188 13908 14995 10478 3588 1944 5408 7270
25318 7270 6981 6168 3207 3379 7294 10094 10711 9538 3984 -1513 -1362 2949 6441 7038 5378 4785
25302 4785 5998 7943 10258 12574 13733 15565 16231 16315 17283 15805 12759 11577 11422 10882 8511 8204
25286 8204 11154 15369 19929 20785 18578 16217 14806 13977 12919 12681 13068 14971 17319 17568 18751 19926
25270 19926 18830 17347 16681 16779 17554 16249 13891 14593 16163 17426 16443 13319 14002 17043 18156 17149
25254 17149 16475 17209 16894 17598 18361 18528 19793 22330 24377 25541 26318 28628 29950 27284 24961 23214
25238 23214 21048 18343 16649 16248 15247 17409 22687 24877 25963 26273 22614 16772 11277 5914 3466
25223 3466 3606 5160 6969 7792 9449 9602 9655 11682 13591 13927 15580 16916 14019 8715 8413 11260
25207 11260 15033 19027 22501 26341 28074 27307 28784 33064 37128 40276 43912 44999 42206 38181 34100
25192 34100 27456 21025 21123 22029 20247 18700 20134 24424 24930 20349 18283 20260 22227 25315 29420
25177 29420 33176 34995 34473 34253 34070 31434 26508 25038 26880 30292 35966 36701 33805 32709 32517 31123
25161 31123 29136 27836 26217 26992 28442 29975 31593 32890 31148 28313 26714 24706 21510 18913 19987
25146 19987 22583 24507 24754 22747 18321 13174 8496 4061 1676 2717 1912 -517 -1468 603 5687 12563
25130 12563 15208 12885 10383 8271 5401 2533 2357 5472 8422 10791 12131 9901 4509 2353 4313
25115 4313 7249 11754 15155 17242 17176 13586 10772 10945 12620 14413 15359 17011 19457 21218 23158 26643
25099 26643 30479 33055 33236 31806 29139 25718 24827 23790 22783 22398 17837 10150 3489 5516 14345
25084 14345 21759 24191 22484 19550 17390 13941 12405 13061 11687 9150 9250 11224 14122 13878 10165
25069 10165 7341 7911 10965 13338 13930 15386 16949 18976 19782 19379 18552 13203 2924 -4119 -3766 -896
25052 -556 -1766 -2744 -614 4250 8582 11825 15964 16959 15934 16711 17678 15235 10591 9181 9771 11194
25036 11194 11426 9783 10675 12559 11679 8497 3287 52 1437 5244 9621 12463 14676 18674 22086 21527
25020 21527 19566 20488 25061 33329 39652 37690 31610 28188 27648 27132 26399 27357 27678 28565 32550 34348
25004 34348 33390 32926 34011 36063 36333 31237 26586 26213 27908 28442 26526 22689 18529 17640 22079 27177
24988 27177 30920 32565 32341 31382 31685 33798 35145 34096 32091 30478 29838 30307 31782 32939 30589 27182
24972 27182 26911 27412 25586 22923 21718 20768 21911 24797 24160 23354 23758 22348 20128 19306 17843 14011
24956 14011 9882 9265 13616 17368 19353 24072 27498 26309 23490 22347 23263 22229 20958 22680 26132
24941 26132 30366 35206 37454 37148 35146 31076 26843 23743 22635 25236 29171 32812 33503 31740 30117
24926 30117 29345 30088 30978 32328 34913 37502 36089 31458 28445 26903 25757 27171 27254 26579 27931 30999
24910 30999 33794 34684 32065 27512 26853 28664 29016 28294 30315 31155 31925 35791 41223 46071 44524 39454
24894 39454 37291 36465 35265 31729 27955 25013 21784 21008 23938 27023 28188 26892 21306 13797 8776
24879 8776 7868 8941 10188 10048 8833 5825 1189 1224 4568 5920 6076 7278 10040 13500 14848 13073
24863 13073 11666 10945 10540 11718 14436 14757 14205 13675 12281 9480 5016 3041 4934 9253 13051 14438
24847 14438 17183 22632 25439 23854 20596 20458 22639 22614 21095 21097 20167 18092 16439 15454 12821 8722
24831 8722 6291 7021 8548 9784 13142 18795 22545 23762 21480 16258 14959 16930 19035 18462 16084
24816 16084 17214 22173 26896 28580 29728 30511 28091 23874 19862 16224 14019 13187 11159 8268 6557
24801 6557 4645 4241 6389 8102 9408 12979 17768 20303 20310 18911 16964 17091 20183 23484 22751 19983
24785 19983 18643 18232 16834 12660 8061 7673 11224 14839 18449 19692 16973 14685 16323 18093 17621
24770 17621 14131 10527 9560 10204 11301 11628 12539 13973 15239 15500 14892 16100 19839 24522 25854 24074
24754 24074 23394 23534 21751 19772 16901 12255 8537 6729 7418 9053 8345 8370 9756 8251 7796 9367
24738 9367 10084 10371 9374 4892 252 605 1998 2691 5951 9487 9569 8905 7547 5298 3972 994 -518
24720 513 2877 6513 7616 8381 9364 8131 6648 8804 8879 7085 4053 2897 5284 9484 13561 13889
24704 13889 13966 13353 8194 4238 869 -2943 -4787 -4400 -531 4131 6983 9559 11549 11212 11628 13343
24688 13343 12684 11542 10866 8962 5655 3534 4416 7202 9124 8714 7745 10092 12316 13480 14826 14889
24672 14889 15265 19509 23480 26424 29525 32887 36426 36636 35681 35960 33452 30665 28718 26595 25977 27491
24656 27491 29419 29793 28617 23468 18479 14856 12389 10664 8349 7171 9592 13094 14166 13503 11873
24641 11873 10142 10001 11980 13731 14094 16797 22161 26864 29210 27448 23119 19166 18160 19083 18736
24626 18736 17317 15694 11809 7595 5874 7785 11936 17045 22263 26917 30472 32206 33254 35462
24612 35462 39922 45215 47616 46368 42684 38130 35890 36461 40025 43667 43786 44543 49638 54998 58443
24597 58443 61253 65809 70290 73760 77510 81432 87226 94691 104113 117233 131550 144566 156925
24584 156925 174961 200185 227048 254686 288852 331243 379264 430277 480848 527517 569702
24573 569702 611224 649350 677497 694267 699654 694695 680491 651284 603033 545381 485700 425793
24561 425793 369168 317244 272313 235134 203586 177712 157818 143518 134128 126780 118260 109201
24549 109201 100794 91182 81741 77951 78906 78670 73744 66534 62085 57882 52973 49586 49071 48649 44630
24534 44630 41824 41682 41996 39851 38181 39692 40252 40091 37579 34086 29638 26950 28426 29295 29213 30701
24518 30701 32789 31214 29330 30079 30436 31582 34920 38694 41692 41483 40989 40454 38521 38923 40165 39542
24502 39542 36411 34735 36349 38034 37931 38649 41250 42783 41459 35622 30679 28479 26980 25045 24357
24487 24357 26479 27209 27228 29419 34313 38813 40001 39735 42037 44443 48194 54226 59567 61992 64126
24472 64126 67910 72143 78666 84483 88466 94993 99835 101251 104185 110082 116806 121622 122645 127369
24458 127369 136062 144596 154686 165592 176775 188326 203974 225330 246226 269226 296509 326388
24446 326388 361136 400184 443306 489575 538083 591183 646069 699694 749363 794113 835938
24435 835938 872588 903552 928844 944262 949150 943550 928248 903099 869041 831174 790868 743037
24423 743037 688521 632574 578083 527035 479968 435460 393342 355101 322564 296056 274348
24412 274348 256437 239917 226050 214458 203864 194867 189758 185784 180148 172835 167506 166348 167331
24399 167331 168274 167183 161612 155885 154528 152832 150051 147068 145062 147012 151298 153745 153057 152534 153989
24384 153989 155791 156910 158293 160580 164740 172441 184516 197263 209032 224492 245058 265501 286296
24371 286296 306136 326724 353563 387114 427094 472328 519455 565497 611057 656802 703557
24360 703557 750462 790178 820673 847719 871524 885605 889314 882978 868275 845911 814177 772675
24348 772675 724002 673768 623473 573823 527624 482991 440054 401716 366081 331378 303429
24337 303429 282277 262413 244184 227733 212148 197442 185785 179367 175090 170876 166454 160760
24325 160760 152915 147949 146938 149034 151589 152921 151945 149963 147108 145489 146697 145880 143489 144072 146247
24310 146247 146249 145341 144701 146607 151736 159297 169931 181076 192692 203195 213113 221688 227087 231918
24296 231918 237646 244716 254042 265112 277028 291052 308250 327903 350805 378982 413178 451163
24284 451163 492582 539630 590470 644340 707166 779694 857467 937053 1019337 1103106 1185657
24273 1185657 1266042 1341210 1406235 1457867 1497254 1526216 1544790 1550176 1538775 1510667 1469116
24262 1469116 1415772 1350691 1277969 1200819 1120658 1037809 952601 871004 797776 732482 671916
24251 671916 618398 574877 536438 499324 465456 438148 414158 391767 372713 356398 342738
24240 342738 329464 318897 311690 304409 295863 287599 282108 278710 275652 273009 270162 268406 269661 271905
24226 271905 272356 271814 273041 278068 286086 295067 303219 311289 319466 328305 337785 346247 356295 371813
24212 371813 391570 411852 432984 457093 485941 519985 559702 608362 664792 730613 801933
24201 801933 875555 950132 1024019 1099798 1174911 1247096 1314491 1372563 1417192 1450539 1473510
24190 1473510 1485782 1481258 1458283 1423649 1378650 1322005 1254164 1177517 1098347 1021707 943769
24179 943769 862966 783768 710678 644620 584508 530465 482936 443892 414285 388066 362007
24168 362007 338155 319301 305341 296003 286580 274350 262132 249118 237988 229835 223282 218364
24156 218364 212212 200926 187464 176988 169450 165631 163698 157220 146666 135340 124675 117586 113641
24143 113641 113058 113541 112692 112208 111575 108630 105062 106313 108258 103876 96608 95176 96321 98691 101750
24128 101750 101659 99836 97442 92713 85376 81669 80580 75148 68230 62409 59201 57521 54820 51151 45842
24113 45842 40938 39413 39183 38537 41398 43454 42203 38931 35111 32534 32925 36199 38478 39269 40810
24098 40810 40799 37547 32062 29187 27664 25712 24832 23992 22994 21449 21629 21261 19616 19621 21796 22757 19854
24081 19854 17809 20103 21127 19830 18256 16933 18026 20605 21218 20914 20798 18621 15512 15853 18294
24066 18294 19942 22061 23251 22717 20876 20361 21947 24715 29678 33860 33288 28871 25412 23215 20365
24051 20365 19465 22276 24648 25068 27498 27905 23503 22440 26652 32174 35633 31902 24962 21254 21932
24036 21932 21596 18666 17399 19895 21955 18937 13235 11770 11933 11604 10431 11891 13293 10813 9231
24021 9231 8556 7383 5347 3953 4250 5508 8801 14211 16186 13954 10039 5341 2085 315 239 1238
24005 1238 4626 10353 13096 11133 8313 4662 1959 693 91 2012 4887 6907 7230 8026 9488 8745
23989 8745 8501 11046 14487 15386 13432 10635 6985 4438 5228 5577 4088 3368 3626 3030 -890 -3050 1755
23971 8584 14192 18939 21963 21437 19049 21177 26728 30671 30834 28878 28243 27615 23438 19873 19729 19414
23955 19414 17856 17986 16524 11201 5047 2342 3387 5349 6863 7958 9722 11690 12403 13447 13386
23940 13386 12186 11924 11657 11207 11531 12995 14383 13719 13588 12688 11056 11658 14308 15246 16213 17660 16669
23923 16669 13351 11777 11817 10347 8287 4616 3211 3091 4615 7232 11836 18591 22533 23495 23981 24651
23907 24651 24888 23785 20760 18184 17494 19240 20933 21678 21331 19820 17703 13769 12066 15436 19402
23892 19402 23401 26613 29956 34169 35434 33322 30937 28842 27805 29010 33091 36767 38461 38800 38773
23877 38773 36980 37499 41045 44042 44414 42900 42730 46723 51364 50559 46473 44240 45495 48354 51789
23862 51789 53920 55549 58351 63904 72444 80322 85609 89664 93120 97338 101585 105639 107762 108514 110442
23847 110442 116496 126962 136832 144544 152022 160162 170465 183846 199287 212398 224763 239339
23835 239339 257194 276451 298493 326527 358491 389875 423889 464970 515036 572252 635191
23824 635191 705808 783210 863229 947315 1036571 1126043 1213068 1296485 1376345 1448649 1509413
23813 1509413 1558554 1591550 1607718 1608548 1593745 1562737 1518896 1465609 1398304 1317214 1230238 1141668
23801 1141668 1050727 961946 880680 803435 726263 652615 589310 537939 494128 454378 419728
23790 419728 387413 356298 327945 305466 290256 275792 259913 246421 234150 222863 215932 211119
23778 211119 209604 206846 199262 190507 183051 176760 170279 167416 167383 166327 164191 162890 162283 162692 163632
23763 163632 162076 160112 163776 174081 182028 185031 188891 194447 200839 205553 205783 203277 203618 208424
23749 208424 214227 221413 230900 242775 256508 272363 291441 311091 332132 357116 387391 421502
23737 421502 457570 497367 543233 597320 661039 731489 803933 881007 965612 1052990 1138406
23726 1138406 1218313 1290362 1353850 1407940 1451281 1481208 1494629 1492246 1474908 1440566 1390355
23715 1390355 1328774 1258560 1177763 1091178 1005252 922179 840143 760227 687715 623056 565688
23704 565688 515295 469647 429230 393038 357833 326598 304593 293012 284172 272914 263507 256167
23692 256167 249370 242661 235780 227977 221129 216858 214229 209841 202503 197533 193459 188195 183786 180847
23678 180847 178032 177278 180885 185485 190697 193831 195968 199377 203257 210680 221343 230291 240429 255459
23664 255459 272810 294217 318882 348904 383140 422279 467229 516021 565112 615558 668584
23653 668584 720936 772677 822260 865959 905160 937126 960071 971500 968878 955662 934487 905034
23641 905034 868081 823957 770986 714236 657630 603893 552081 500579 452059 408685 370800
23630 370800 340377 316301 293649 269940 245123 223857 208625 197729 189385 182272 173874 163892
23618 163892 154275 146248 139481 133829 132034 132825 133542 132237 127001 120386 116609 116179 117014 115940 110806
23603 110806 102240 95373 90499 88399 92356 98696 104243 108473 111325 115831 118061 114647 108666 106367
23589 106367 108805 113911 121066 126816 131635 137226 141757 146993 152917 159009 166901 174442 181341 192144
23575 192144 208332 226402 246906 271997 301112 335233 374353 416968 461012 504306 549365
23564 549365 599621 654995 707537 751055 788693 824588 854310 875003 887146 889784 885649 873974
23552 873974 852391 821320 782434 735988 685275 636323 588388 540208 491733 445239 403661
23541 403661 365189 329948 301652 280194 261677 245985 231016 217727 207090 197876 189247 180103
23529 180103 171152 161845 149132 136280 127589 121651 116382 109791 100283 93475 90756 87944 83780 77749
23515 77749 72325 70974 70098 69076 68747 67046 64155 62089 62194 60388 56574 54659 51185 45461 40709
23500 40709 39441 38189 37601 39119 39773 39835 40987 40152 35990 29879 22313 16978 13874 13932 16944 20175
23484 20175 22962 25407 28231 30831 29022 27320 26417 26031 26736 26846 26433 25456 23145 20705 18114 16138
23468 16138 13012 7389 5230 7765 11073 12703 14500 15185 15425 18892 24301 27015 23610 19083 20681
23453 20681 25112 25423 24854 25468 29126 32375 33406 32493 30418 30540 30848 29826 27557 23319 18517 18394
23437 18394 21956 24538 25666 26804 26292 24856 22473 19507 18000 19164 20814 19632 20438 22769 24503
23422 24503 23197 20121 20045 22059 22551 20273 18314 17776 18157 16791 15882 19040 22606 24817 25555 22058
23406 22058 17363 12210 5840 2361 2827 4273 5732 5245 6716 10641 12468 12679 14992 17126 18787
23391 18787 19516 19651 21189 22519 22200 22789 26120 27054 26312 27796 32220 32916 30896 29395 28952 32166
23375 32166 36489 35664 31619 28788 27879 25370 21943 19402 17088 14445 13910 16426 18597 19137 19093 20152
23359 20152 19689 19417 16162 11761 11572 11938 11751 11734 12693 13932 12839 12499 14762 15392 12739 9603 8106
23342 8106 10456 13899 15430 16248 18600 21253 23151 22029 17518 12892 8062 3648 1175 -2513 -5911
23327 -5911 -6049 -3818 -1384 -426 -1478 -2494 -2388 -1266 589 1682 941 1662 2427 -404 -3674 -4601 -3792
23310 -3792 -4827 -7566 -8178 -6404 -5599 -4633 -2512 -2819 -4620 -6926 -9759 -9246 -3489 1712 5041 8643
23294 8643 9823 9672 10144 13178 17174 17306 16431 16777 13795 11168 11996 15732 21868 24326 22035 20129
23278 20129 20190 20531 17984 16650 20334 24198 25640 24738 22866 20067 18992 17018 14418 13775 13270 11985
23262 11985 10624 8507 5207 4217 5677 6868 6773 4351 1921 2424 2137 825 2634 5280 5273 3328 3417
23245 3417 3818 1024 1152 6373 9943 10616 11122 10368 8112 5952 5394 3477 446 -282 -1276 -1037 1058
23227 2205 2063 -569 -3184 -6037 -5638 -2990 -1604 -596 1817 5601 9157 10124 11475 12979 10498 5914
23211 5914 4387 5088 7187 7689 7698 9416 10624 9352 7770 6531 5708 7123 7866 6865 5967 6787 8139
23194 8139 10052 10966 10261 7909 4891 3604 3985 3954 5243 8443 13037 18124 20528 21328 18749 12467
23178 12467 9204 8576 6326 5700 8184 10194 10663 12240 11394 6222 1689 -1266 -4367 -6094 -4444
23163 -4444 -2384 -1502 -1102 3250 10827 16084 19160 18266 10799 5621 4447 3291 1903 1789 2363 4983
23147 4983 7976 6821 5912 6842 6533 3127 2270 4988 8407 8322 6999 5524 6464 8336 6493 4873
23131 4873 5276 7469 11794 14535 16245 16075 13379 11578 10436 10490 12950 16953 24688 29711 30759 29852
23115 29852 31232 33065 32269 30660 28550 25538 23913 25310 28325 32562 36429 40227 42039 45637 50476
23100 50476 52039 52301 51930 49539 48119 51134 55733 58671 59871 61257 62294 63306 65205 68436 71357
23085 71357 71028 71611 70110 65963 64221 68187 72173 74035 76816 82089 88401 94311 99751 102966 107453
23070 107453 116149 125077 130074 131971 134409 139240 142748 145743 148892 151036 155966 164628 172702 180288
23056 180288 189285 199829 212204 223866 234510 245663 256711 267149 279383 294617 310519 325784
23044 325784 338673 351279 365313 381584 402984 427054 449772 471164 492219 513553 536855
23033 536855 563583 595712 630589 666680 704321 745261 790231 838885 890035 943212 1001240
23022 1001240 1066622 1139280 1221137 1309768 1408083 1518664 1639951 1771540 1913747 2073468
23012 2073468 2258708 2472946 2723853 3025875 3391911 3836132 4376785 5033958 5817620
23003 5817620 6727328 7758825 8902404 10139921 11456374 12826305 14203394 15527951
22995 15527951 16722461 17707931 18424203 18840841 18949737 18735006 18168324 17227557 15930904
22986 15930904 14373968 12700948 11056812 9550158 8232292 7116134 6190145 5425319
22978 5425319 4793488 4274657 3847694 3487428 3177261 2907714 2672353 2465659 2280664
22969 2280664 2116281 1969092 1836799 1716407 1600061 1487956 1386199 1293833 1211346 1137731
22959 1137731 1069447 1005859 945749 890193 838857 791651 748918 710171 674672 639743 607224
22948 607224 577857 547768 518626 493632 473101 452983 433784 416093 397826 376239 355010
22937 355010 340080 330549 321164 309020 296785 288409 281496 272094 261028 250688 241322 233248 226584
22924 226584 221115 217685 213352 207166 201528 193665 185439 178277 170873 164619 161430 160217 161588 161274
22910 161274 156755 150440 146312 143466 139252 134321 129971 128979 131980 133728 130697 126193 122406 118698
22896 118698 116682 114938 112210 108728 105114 104083 103812 103416 101637 100060 99436 97597 94323 94218 99439
22881 99439 101781 99539 96006 92241 91737 91483 88621 83033 79966 82508 88437 93048 90614 84118 81149
22866 81149 80304 77225 73221 72847 73996 75977 78370 82270 82169 77937 74169 73746 73898 70427 65559 62271
22850 62271 62190 63190 63046 62669 62848 64782 67704 68345 65300 60537 54861 51507 51129 51337 49740 46479
22834 46479 44641 44773 44330 42805 41458 40298 38814 36810 35556 36357 40461 44618 48508 52152 52950
22819 52950 52867 55280 56948 56324 55181 55776 55797 56484 58204 57414 52486 47840 48163 50732 50014 46556 43620
22802 43620 42911 41546 40022 38936 36823 37039 37922 36353 34257 35260 39125 42156 43113 45629 48522
22787 48522 47721 45440 42833 40507 39931 41316 42179 42265 41130 38176 35728 36521 38440 38206 35882 35731
22771 35731 39785 42922 42391 40322 37619 36550 36638 35661 31680 26032 20752 18814 19117 20170 23170 25569
22755 25569 25303 23632 25887 29002 27999 25204 22937 18538 13606 12686 15230 18624 20603 20163 20753
22740 20753 22440 24770 25880 23787 22438 18937 16558 16402 16619 17595 16931 15876 15774 17443 19096 19443
22724 19443 18207 17293 17349 18657 20115 21837 22619 23215 25955 27823 29694 33755 36912 37951 37188 34860
22708 34860 31333 28030 26567 25510 25685 23549 18997 14343 9635 6177 7210 8693 6794 8891 16324
22693 16324 23244 27297 29625 33104 33492 29888 26148 22914 19760 18846 18758 17848 17480 18861 20305 18692
22677 18692 15757 16940 18326 15444 12681 14443 17456 22465 26337 27200 25580 21586 17882 15889 17589
22662 17589 20414 19935 18114 18721 20984 21243 18154 14852 12323 10160 9322 10446 11470 11719 10604 6694
22646 6694 2541 -14 1438 3990 5511 6314 7713 9419 10997 14468 17552 18858 20020 20405 19585 18175
22630 18175 15868 13830 13376 15103 13711 10028 6811 3631 -982 -3413 -5177 -5323 -2606 2363 6308
22615 6308 6659 7369 10126 11517 10893 11714 15136 18945 22719 24030 24317 22156 18083 16038 13708 10709
$$ [...]
##END NTUPLES=NMR SPECTRUM
##END=
