##TITLE=Analysis number 328898
Compound Code cc 10401
Book Reference ab3
Project Code adrs
Chemist Name stores
##JCAMPDX= 6.0         $$ Bruker NMR JCAMP-DX V2.0
##DATA TYPE= NMR SPECTRUM
##DATA CLASS= NTUPLES
##ORIGIN= Bruker BioSpin GmbH
##OWNER= nmr
$$ XWIN-NMR		Version 3.5
$$ Fri Jul 13 11:57:48 2007 GMT Daylight Time (UT+1h)  MAYBRIDGE\nmr@NMR_250MHZ
##.OBSERVE FREQUENCY= 250.131544655141
##.OBSERVE NUCLEUS= ^1H
##.ACQUISITION MODE= SIMULTANEOUS (DQD)
##.ACQUISITION SCHEME= undefined
##.AVERAGES= 16
##.DIGITISER RES= 18
##SPECTROMETER/DATA SYSTEM= dpx250
##.PULSE SEQUENCE= zg30
##.SOLVENT NAME= DMSO
##.SHIFT REFERENCE= (INTERNAL, DMSO, 0, 16.522)
##AUDIT TRAIL= $$ (NUMBER, WHEN, WHO, WHERE, WHAT)
$$ ##TITLE= Audit trail, XWIN-NMR		Version 3.5
$$ ##JCAMPDX= 5.01
$$ ##ORIGIN= Bruker BioSpin GmbH
$$ ##OWNER= nmr
$$ C:\u/data/dgb/nmr/ADRS/940/pdata/1/auditp.txt
$$ ##AUDIT TRAIL=  $$ (NUMBER, WHEN, WHO, WHERE, WHAT)
(   1,<2007-07-13 11:57:26.46 +100>,<MAYBRIDGE\nmr>,<NMR_250MHZ>,
      <created by zg, POWCHK disabled, PULCHK disabled
       configuration hash MD5:
       76 6E 9A 78 1E 09 19 81 EC 84 63 8F B0 6A 59 2D
       data hash MD5: 64K
       24 F3 F3 34 84 BE D3 0F 2C D8 CC 65 EA 54 88 D3>)
(   2,<2007-07-13 11:57:38.49 +100>,<MAYBRIDGE\nmr>,<NMR_250MHZ>,
      <Start of raw data processing
       ef LB = 0.3 FT_mod = 6 PKNL = 1 SI = 32K 
       data hash MD5: 32K
       BC FD CD 91 2B D1 C5 1E 7D 24 94 0D 2C 9B 6F 6E>)
(   3,<2007-07-13 11:57:40.26 +100>,<MAYBRIDGE\nmr>,<NMR_250MHZ>,
      <apk 
       data hash MD5: 32K
       5F C4 A9 1D 82 32 39 62 D9 8A 3B 11 CD 94 F6 7C>)
(   4,<2007-07-13 11:57:41.22 +100>,<MAYBRIDGE\nmr>,<NMR_250MHZ>,
      <abs ABSG = 5 
       data hash MD5: 32K
       1D 48 3D 28 C8 A9 BD A9 70 ED 16 F9 7D 29 F3 4F>)
$$ ##END=
$$ 
$$ hash MD5
$$ 0F 62 69 51 9D 98 B5 3F 88 9A AF 0F 9E 7C 11 B9
##$RELAX= 
##$RELAX= 
##$RELAX= 
##$RELAX= 
##$RELAX= 
##$RELAX= 
##$RELAX= 
$$ Bruker specific parameters
$$ --------------------------
##$DU= <C:\u>
##$EXPNO= 940
##$NAME= <ADRS>
##$PROCNO= 1
##$TYPE= <nmr>
##$USER= <dgb>
##$AMP= (0..31)
100 100 100 100 100 100 100 100 100 100 100 100 100 100 100 100 100 100 
100 100 100 100 100 100 100 100 100 100 100 100 100 100 
##$AQSEQ= 0
##$AQ_mod= 3
##$AUNM= <au_zg>
##$AUTOPOS= <26 >
##$BF1= 250.13
##$BF2= 250.13
##$BF3= 250.13
##$BF4= 250.13
##$BF5= 500.13
##$BF6= 500.13
##$BF7= 500.13
##$BF8= 500.13
##$BYTORDA= 1
##$CFDGTYP= 0
##$CFRGTYP= 5
##$CHEMSTR= <none>
##$CNST= (0..31)
1 1 145 1 1 1 1 1 1 1 1 1 1 1 1 1 1 1 1 1 1 1 1 1 1 1 1 1 1 1 1 1 
##$CPDPRG= <>
##$CPDPRG1= <>
##$CPDPRG2= <>
##$CPDPRG3= <>
##$CPDPRG4= <mlev>
##$CPDPRG5= <mlev>
##$CPDPRG6= <mlev>
##$CPDPRG7= <mlev>
##$CPDPRG8= <mlev>
##$CPDPRGB= <>
##$CPDPRGT= <>
##$D= (0..31)
0 1 0 0 0 0 0 0 0 0.06 0 0 0 0 0 0 0.0002 0 0 0 0 0 0 0 0 0 0 0 0 0 0 
0 
##$DATE= 1184324245
##$DBL= (0..7)
120 120 120 120 120 120 120 120 
##$DBP= (0..7)
150 150 150 150 150 150 150 150 
##$DBP07= 0
##$DBPNAM0= <>
##$DBPNAM1= <>
$$ [...]
##$SUBNAM7= <"">
##$SUBNAM8= <"">
##$SUBNAM9= <"">
##$SW= 20.6930455092707
##$SWIBOX= (0..15)
0 0 3 0 0 0 0 0 0 0 0 0 0 0 0 0 
##$SW_h= 5175.983436853
##$TD= 65536
##$TD0= 1
##$TE= 296.16
##$TE2= 300
##$TE3= 300
##$TEG= 300
##$TL= (0..7)
0 120 120 120 120 120 120 120 
##$TP= (0..7)
150 150 150 150 150 150 150 150 
##$TP07= 0
##$TPNAME0= <>
##$TPNAME1= <>
##$TPNAME2= <>
##$TPNAME3= <>
##$TPNAME4= <>
##$TPNAME5= <>
##$TPNAME6= <>
##$TPNAME7= <>
##$TPOAL= (0..7)
0.5 0.5 0.5 0.5 0.5 0.5 0.5 0.5 
##$TPOFFS= (0..7)
0 0 0 0 0 0 0 0 
##$TUNHIN= 0
##$TUNHOUT= 0
##$TUNXOUT= 0
##$USERA1= <user>
##$USERA2= <user>
##$USERA3= <user>
##$USERA4= <user>
##$USERA5= <user>
##$V9= 5
##$VALIST= <valist>
##$VCLIST= <CCCCCCCCCCCCCCC>
##$VD= 0
##$VDLIST= <DDDDDDDDDDDDDDD>
##$VPLIST= <PPPPPPPPPPPPPPP>
##$VTLIST= <TTTTTTTTTTTTTTT>
##$WBST= 1024
##$WBSW= 4
##$XGAIN= (0..3)
0 0 0 0 
##$XL= 0
##$YL= 0
##$YMAX_a= 674352
##$YMIN_a= -600657
##$ZGOPTNS= <>
##$ZL1= 120
##$ZL2= 120
##$ZL3= 120
##$ZL4= 120
##$ABSF1= 16.522
##$ABSF2= -4.171173
##$ABSG= 5
##$ABSL= 3
##$ALPHA= 0
##$AQORDER= 0
##$ASSFAC= 0
##$ASSFACI= 0
##$ASSFACX= 0
##$ASSWID= 0
##$AUNMP= <proc_1d>
##$AZFE= 0.1
##$AZFW= 0.1
##$BCFW= 0
##$BC_mod= 0
##$BYTORDP= 0
##$COROFFS= 0
##$CY= 12.5
##$DATMOD= 1
##$DC= 0
##$DFILT= <>
##$DTYPP= 0
##$F1P= 14.0000005364418
##$F2P= -0.99999901652339
##$FCOR= 0.5
##$FTSIZE= 32768
##$FT_mod= 6
##$GAMMA= 0
##$GB= 0
##$INTBC= 1
##$INTSCL= 1
##$ISEN= 128
##$LB= 0.3
##$LEV0= 0
##$LPBIN= 0
##$MAXI= 10000
##$MC2= 0
##$MEAN= 0
##$ME_mod= 0
##$MI= 0
##$NCOEF= 0
##$NC_proc= -2
##$NLEV= 6
##$NOISF1= 0
##$NOISF2= 0
##$NSP= 0
##$NTH_PI= 0
##$NZP= 0
##$OFFSET= 16.522
##$PC= 1
##$PHC0= -66.91003
##$PHC1= 16.34994
##$PH_mod= 1
##$PKNL= yes
##$PPARMOD= 0
##$PSCAL= 4
##$PSIGN= 0
##$REVERSE= no
##$SF= 250.13
##$SI= 32768
##$SIGF1= 0
##$SIGF2= 0
##$SINO= 400
##$SIOLD= 32768
##$SREGLST= <1H.DMSO>
##$SSB= 0
##$STSI= 32768
##$STSR= 0
##$SW_p= 5175.98343685301
##$SYMM= 0
##$S_DEV= 0
##$TDeff= 65536
##$TDoff= 0
##$TI= <Analysis number 999999
Compound Code 99
Book Reference 9
Project Code 9>
##$TILT= no
##$TM1= 0
##$TM2= 0
##$TOPLEV= 0
##$USERP1= <user>
##$USERP2= <user>
##$USERP3= <user>
##$USERP4= <user>
##$USERP5= <user>
##$WDW= 1
##$XDIM= 32768
##$YMAX_p= 376005753
##$YMIN_p= -375593
$$ End of Bruker specific parameters
$$ ---------------------------------
##NTUPLES= NMR SPECTRUM
##VAR_NAME=  FREQUENCY,     SPECTRUM/REAL,   SPECTRUM/IMAG
##SYMBOL=    X,             R,               I
##VAR_TYPE=  INDEPENDENT,   DEPENDENT,       DEPENDENT
##VAR_FORM=  AFFN,          ASDF,            ASDF
##VAR_DIM=   32768,         32768,           32768
##UNITS=     HZ,            ARBITRARY UNITS, ARBITRARY UNITS
##FACTOR=    0.157963299565203, 1,           1
##FIRST=     4132.6476996994, 0,             0
##LAST=      -1043.33573715361, 0,           0
##MIN=       -1043.33573715361, -375593,     0
##MAX=       4132.6476996994, 376005753,     0
$$ Real data points
##PAGE= N=1
##DATA TABLE= (X++(R..R)), XYDATA
$$ [...]
$$ plain form
17060 319426 330047 332187 340060 353442 364423 376813 383639 390845 417639 442267 460398 477890
17048 477890 489180 507026 545738 593296 640366 705543 773417 852870 943347 1027368 1114206
17037 1114206 1232747 1396963 1596326 1690373 1680695 1699029 1791041 1970405 2209670 2339004
17027 2339004 2389333 2475600 2665344 2946279 3263288 3624616 4076164 4693976 5523480 6496847
17017 6496847 7722521 9507436 12108573 15819272 20951527 27824827 36522705 45616544
17009 45616544 53355835 60686881 70843417 88153550 112962347 121615547 106058898
17002 106058898 91513747 88592264 99162865 117550405 114820440 91458510 70511478
16995 70511478 57601132 50106867 43834527 36057767 27678867 20650040 15558374 11964144
$$ packed form
17060C19426J0621K140P873J3382J0981J2390O826P206K6794K4628J8131J7492
17048D77890J1290J7846L8712M7558M7070O5177O7874P9453R0477Q4021Q6838
17037A114206J18541J64216J99363R4047r678J8334R2012J79364K39265J29334
17027B339004N0329Q6267J89744K80935L17009L61328M51548O17812Q29504R73367
17017F496847J225674J784915K601137L710699N132255O873300Q697878R093839
17009D5616544P739291P331046J0156536J7310133K4808797Q653200j5556649
17002A06058898j4545151k921483J0570601J8387540k729965k3361930k0947032
16995G0511478j2910346p494265o272340p776760q378900p028827n091666l594230
$$ plain form
16987 11964144 9356629 7496058 6207378 5335878 4727224 4169308 3616965 3149245 2800995
16978 2800995 2551233 2362484 2196443 2037935 1911918 1823390 1792145 1824769 1803807 1649827
16968 1649827 1483865 1389988 1374281 1433730 1403769 1240025 1087826 977470 891290 826857
16958 826857 755545 674552 607840 547271 504321 478740 453963 426975 401107 374411 355669
16947 355669 335710 323115 317009 302901 288834 277565 276881 274536 263147 245006 221074 210532
16935 210532 213792 210121 202881 198354 194728 199227 201345 195182 193311 185778 180498 179013 172965 177292
16921 177292 179069 172153 164278 160005 152843 147480 149294 149317 151099 147988 142880 143093 143172 144968 145738 146580
16905 146580 139377 135658 136184 132343 125449 125296 124373 116882 115412 117430 119071 121175 122314 119370 123161
$$ packed form
16987A1964144k607515j860571j288680q71500o08654n57916n52343m67720l48250
16978B800995k49762j88749j66041j58508j26017q8528l1245L2624k0962j53980
16968A649827j65962r3877j5707N9449k9961j63744j52199j10356q6180o4433
16958H26857p1312q0993o6712o0569m2950k5581k4777k6988k5868k6696j8742
16947C55669j9959j2595o106j4108j4067j1269o84k345j1389j8141k3932j0542
16935B10532L260l671p240m527l626M499K118o163j871p533n280j485o048M327
16921A77292J777o916p875m273p162n363J814K3J782l111n108K13P9J796P70Q42
16905A46580p203l719N26l841o894j53r23p491j470K018J641K104J139k944L791
$$ plain form
16890 123161 141075 170166 189230 207213 232122 261294 308435 362857 418662 448604 433580
16879 433580 417685 429101 467585 498082 490305 449064 398968 348544 298845 246239 205548 183066
16867 183066 163826 127890 86788 55358 37308 23345 10749 -4165 -9913 -14873 -21339 -19362
16855 -19362 -14396 -14913 -13525 -12089 -24439 -28808 -34959 -32174 -34216 -36899 -33653 -22486 -22382 -29202
16841 -29202 -26898 -25595 -27556 -32167 -35885 -34915 -30809 -24342 -19825 -21490 -20278 -20069 -18945 -10532 -13278
16826 -13278 -22274 -26110 -28402 -32015 -37716 -47095 -41313 -36630 -31280 -30618 -29502 -31279 -32063 -28461 -24170
16811 -24170 -14427 -7044 -10509 -20484 -19860 -9671 5493 8583 5804 796 -11877 -13433 -9291 -4540
16797 -4540 1926 6356 -1890 -9885 -7888 -8385 -11434 -12274 -11142 -7613 -4334 -4134 -3754 -4772 -4409 -6351
$$ packed form
16890A23161J7914K9091J9064J7983K4909K9172M7141N4422N5805K9942j5024
16879D33580j5895J1416L8484L0497p777m1241n0096n0424m9699n2606m0691k2482
16867A83066j9240l5936m1102l1430j8050j3963j2596j4914n748m960o466J977
16855a9362M966n17J388J436j2350m369o151K785k042k683L246J1167J04o820
16841b9202K304J303j961m611l718R70M106O467M517j665J212K09J124Q413k746
16826a3278q996l836k292l613n701r379N782M683N350O62J116j777p84L602M291
16811b4170R743P383l465r975O24J0189J5164L090k779n008j2673j556M142M751
16797d540O466M430q246p995J997m97l049q40J132L529L279K00L80j018L63j942
$$ plain form
16781 -6351 -6161 -8667 -10799 -8992 -3873 3287 -3048 -5652 -2198 -3162 3415 10614 11438 9118 6834
16766 6834 6474 7275 5627 -2687 -183 -1672 856 8077 3498 -9568 -7138 -1384 1444 -278 -4556
16751 -4556 -3877 -3152 -4139 -6810 -8311 -9253 -14260 -11520 -9779 -6826 -11863 -10350 -9245 -4263 1502 2976
16735 2976 772 -1669 -5790 -4916 -281 -146 -3720 -5012 -2611 2543 2619 3028 2204 -1702 -2804 -284
16719 -284 -5642 -12557 -16322 -9487 2495 8473 10012 12328 4661 -4239 -510 3695 3268 7258 15350
16704 15350 22073 19079 9888 5898 9807 21051 20776 21030 16186 4488 -5080 -7775 -8011 -9160 -13913
16689 -13913 -15782 -12559 -14983 -19178 -23858 -18297 -15568 -14151 -19392 -22798 -26345 -23218 -18011 -20857
16675 -20857 -16580 -10401 -10002 -11120 -15888 -23891 -27945 -24486 -19713 -18984 -12595 -5763 -4070 -66 -513
$$ packed form
16781f351J90k506k132J807N119P160o335k604L454r64O577P199Q24k320k284
16766F834l60Q01j648q314K504j489K528P221m579j3066K430N754K828j722m278
16751d556O79P25r87k671j501r42n007K740J741K953n037J513J105M982N765J474
16735B976k204k441m121Q74M635J35l574j292K401N154P6M09q24l906j102K520
16719b84n358o915l765O835J1982N978J539K316p667q900L729M205m27L990Q092
16704A5350O723k994r191l990L909J1244k75K54m844j1698r568k695k36j149m753
16689a3913j869L223k424m195m680N561K729J417n241l406l547L127N207k846
16675b0857M277O179L99j118m768q003m054L459M773P29O389O832J693M004m47
$$ plain form
16660 -513 -256 -7169 -12129 -10200 -4401 -10618 -17408 -27628 -20862 -17018 -24773 -29661 -30713 -27186 -22827
16645 -22827 -26297 -23600 -20246 -14489 -12429 -14789 -16430 -20391 -19442 -16890 -13235 -15200 -14102 -14223 -7424
16630 -7424 -5377 -7065 -8965 -9872 -7141 -8652 -7030 -11675 -15189 -19898 -22026 -14704 -9624 -10291 -6273
16615 -6273 -5132 -818 1059 3562 -4767 -15168 -13705 -6918 -7922 -14673 -20164 -18363 -9856 -4404
16601 -4404 -7984 -11978 -15244 -21249 -19763 -12530 -3618 -2815 -9164 -10419 -8950 -4529 603 517 -2215
16586 -2215 -4405 -9280 -9254 -11219 -15442 -20801 -20272 -11555 -5114 -5885 -11974 -16987 -16189 -10758 -6263 -616
16570 -616 -6451 -11613 -20551 -23106 -22458 -17225 -21820 -29612 -36126 -33770 -33290 -38521 -34570 -24801 -27347
16555 -27347 -21673 -21074 -17273 -14561 -17645 -21743 -23300 -25435 -24084 -24790 -21266 -14740 -15416 -18305 -17633
$$ packed form
16660e13K57o913m960J929N799o217o790j0220O766L844p755m888j052L527M359
16645b2827l470K697L354N757K060k360j641l961R49K552L655j965J098j21O799
16630g424K047j688j900r07K731j511J622m645l514m709k128P322N080o67M018
16615f273J141M314J877K503q329j0401J463O787j004o751n491J801Q507N452
16601d404l580l994l266o005J486P233Q912Q03o349j255J469M421N132q6k732
16586b215k190m875K6j965m223n359N29Q717O441p71o089n013P98N431M495N647
16570f16n835n162q938k555O48N233m595p792o514K356M80n231L951R769k546
16555b7347N674N99L801K712l084m098j557k135J351p06L524O526o76k889O72
$$ plain form
16540 -17633 -20758 -18421 -19056 -23817 -22862 -17001 -16508 -12489 -12696 -14326 -9864 -11602 -14668 -20421 -23149
16525 -23149 -24286 -19523 -18826 -14104 -7046 1144 1156 -1148 -5830 -3063 6335 6269 1249 -4579 -10528 -16438
16509 -16438 -14897 -14000 -13039 -16197 -20255 -13834 -12658 -16017 -15802 -8036 -6331 -12247 -5457 -4042 -8441
16494 -8441 -13485 -17734 -21157 -19919 -16065 -13029 -10098 -2153 -4763 -8948 -14393 -18190 -20068 -27615 -34261
16479 -34261 -29034 -25851 -25762 -23261 -24886 -25270 -25646 -15428 -14867 -14212 -15532 -18478 -20856 -19538 -20402 -19487
16463 -19487 -10088 -1800 -5307 -8075 -8961 -13386 -7886 -3720 -3087 -221 2707 1117 291 -2971 1805
16448 1805 -3952 -8647 -5168 1562 2704 2246 -11 3724 8525 -2176 -3684 -1370 -2193 1988 4309
16433 4309 10457 5573 -2206 1098 6743 16785 24236 31685 39885 48399 67949 92864 121308 165438
$$ packed form
16540a7633l125K337o35m761R55N861M93M019k07j630M462j738l066n753k728
16525b3149j137M763O97M722P058Q190J2k304m682K767R398o6n020n828n949n910
16509a6438J541Q97R61l158m058O421J176l359K15P766J705n916O790J415m399
16494h441n044m249l423J238L854L036K931P945k610m185n445l797j878p547o646
16479c4261N227L183Q9K501j625l84l76J0218N61O55j320k946k378J318q64R15
16463a9487R399Q288l507k768q86m425N500M166O33K866K928j590q26l262M776
16448A805n757m695L479O730J142m58k257L735M801j0701j508K314q23M181K321
16433D309O148m884p779L304N645J0042P451P449Q200Q514J9550K4915K8444M4130
$$ plain form
16419 165438 217952 255561 298167 351922 414651 511995 591594 583649 524818 489378 505305 551009
16407 551009 562936 502389 408120 330538 276442 237613 206044 171694 132681 102827 78525
16396 78525 62434 49923 35520 27754 27719 25411 16801 10203 8788 1828 7008 13806 14167 10557
16382 10557 3890 538 760 -239 -5696 -8292 -12626 -12681 -966 -692 960 2217 -5053 -2747 -3643 -4376
16366 -4376 -8381 -4725 -2586 -2574 -7374 -9783 -8152 -8392 -10248 -5241 -629 -4483 -8399 -6486 -2870
16351 -2870 -12321 -18162 -12316 -11855 -8000 -5989 -8853 -7678 -9745 -10051 -11512 -15287 -18947 -14472 -8974
16336 -8974 -6115 -3535 -4180 -8266 -10096 -16877 -18702 -18183 -17661 -12842 -11980 -8940 -10105 -10477 -11330 -10393
16320 -10393 -7474 -1748 897 -11648 -15850 -8735 -8722 -14502 -14340 -10548 -9569 -18632 -22430 -19132 -18487
$$ packed form
16419A65438N2514L7609M2606N3755O2729R7344P9599p945n8831l5440J5927M5704
16407E51009J1927o0547r4269p7582n4096l8829l1569l4350l9013k9854k4302
16396G8525j6091j2511j4403p766l5k308q610o598j415o960N180O798L61l610
16382A0557o667l352K22r99n457k596m334n5J1715K74J652J257p270K306q96p33
16366d376m005L656K139J2m800k409J631k40j856N007M612l854l916J913L616
16351b870r451n841N846M61L855K011k864J175k067l06j461l775l660M475N498
16336h974K859K580o45m086j830o781j825N19N22M819Q62L040j165l72q53R37
16320a0393K919N726K645j2545m202P115J3n780J62L792R79r063l798L298O45
$$ plain form
16305 -18487 -20080 -18493 -19052 -15215 -13770 -19412 -21503 -21880 -19523 -17839 -18934 -11048 105 -2626 -9853
16290 -9853 -12984 -13325 -7174 -11116 -18064 -16712 -15603 -16774 -15914 -15272 -13530 -7292 -7898 -7707 -8570 -13272
16274 -13272 -8958 -4694 -1506 2757 119 -4958 -12733 -17904 -15273 -13034 -13388 -6561 -4271 -11825 -15952
16259 -15952 -20865 -21224 -12868 -11597 -1917 -2267 -8485 -16438 -17197 -19654 -13244 -10726 -9746 -8636 -8040 -9500
16243 -9500 -8851 -5414 -4823 -3350 -3638 -12290 -13093 -7393 1176 980 -291 -5151 -8490 -10273 -6612 -9847
16227 -9847 -15115 -12661 -12119 -12424 -9059 -16960 -26871 -22914 -24852 -22265 -11650 -14264 -13863 -9038 -19176
16212 -19176 -23751 -19584 -16241 -10639 -9660 -10080 -6536 -11083 -18461 -17965 -9317 -12313 -14563 -16939 -24024
16197 -24024 -22131 -13549 -10419 -8461 -11228 -10990 -16650 -17894 -18695 -10152 -5621 -7459 -6346 -6671 -5621
$$ packed form
16305a8487j593J587n59L837J445n642k091l77K357J684j095P886J1153k731p227
16290i853l131l41O151l942o948J352J109j171Q60O42J742O238o06J91q63m702
16274a3272M314M264L188M263k638n077p775n171K631K239l54O827K290p554m127
16259a5952m913l59Q356J271R680l50o218p953p59k457O410K518R80J110N96j460
16243i500O49L437N91J473k88q652q03N700Q569j96j271m860l339j783L661l235
16227i847n268K454N42l05L365p901r911L957j938K587J0615k614M01M825j0138
16212a9176m575M167L343N602R79m20L544m547p378M96Q648k996k250k376p085
16197b4024J893Q582L130J958k767K38n660j244q01Q543M531j838J113l25J050
$$ plain form
16182 -5621 -4069 -6496 -13070 -17313 -16784 -20441 -13917 -5051 -6089 -6750 -10683 -10587 -13371 -13791 -14889 -16673
16166 -16673 -18886 -21400 -16862 -17183 -15528 -7082 -8358 -12326 -17903 -20771 -21403 -20001 -19970 -21766 -19051
16151 -19051 -15406 -12265 -12407 -15070 -8806 -2454 -6353 -11407 -12822 -11924 -10680 -16050 -18015 -13271 -12141
16136 -12141 -10728 -6007 -6113 -13887 -11807 -13148 -15996 -20268 -26657 -23225 -17518 -14098 -14208 -13734 -13935
16121 -13935 -17398 -17938 -15949 -12095 -6842 58 -1374 -3809 -11503 -13032 -10267 -4978 -9671 -17868 -8512
16106 -8512 -8883 -14679 -13519 -16601 -21279 -15503 -11207 -12082 -13726 -14928 -19902 -19860 -18271 -16151 -16787 -20739
16090 -20739 -15396 -13136 -15135 -10182 -16279 -16460 -11862 -10042 -10429 -16290 -15383 -10051 -6587 -13008 -12902
16075 -12902 -17561 -24072 -17387 -13080 -17598 -22626 -19487 -17916 -13598 -15768 -12461 -10538 -12962 -13487 -14057
$$ packed form
16182e621J552k427o574m243N29l657O524Q866j038o61l933R6k784m20j098j784
16166a6673k213k514M538l21J655Q446j276l968n577k868o32J402L1j796K715
16151a9051L645L141j42k663O264O352l899n054j415Q98J244n370j965M744J130
16136a2141J413M721j06p774K080j341k848m272o389L432N707L420j10M74k01
16121a3935l463n40J989L854N253O900j432k435p694j529K765N289m693q197R356
16106h512l71n796J160l082m678N776M296q75j644j202m974M2J589K120o36l952
16090b0739N343K260j999M953o097j81M598J820l87n861R07N332L464o421J06
16075a2902m659o511O685M307m518n028L139J571M318k170L307J923k424n25n70
$$ plain form
16060 -14057 -18406 -17851 -11212 -14260 -17672 -14447 -11085 -10178 -13387 -11172 -7020 -7888 -4892 -5085 -8230
16045 -8230 -11667 -10031 -5501 -8392 -8028 -6943 -9192 -16407 -19113 -16065 -14275 -13287 -12619 -11518 -14908
16030 -14908 -13195 -13103 -8481 -3906 -9165 -9766 -12654 -9326 -12147 -14034 -11378 -9494 -11139 -17485 -18361
16015 -18361 -12491 -7401 -8543 -10200 -2946 4701 1068 -2214 -2315 181 -2128 -8497 -9094 -2588 -5871
16000 -5871 -878 -2658 -3465 -6894 -9963 -2465 -2582 -5469 -9248 -14797 -17674 -17503 -11244 -9604 -13661
15985 -13661 -16035 -12527 -20333 -17337 -10534 -12051 -8834 -11226 -10560 -3980 769 1048 -1877 -6554 -10119
15970 -10119 -8395 -7078 -5995 2701 4230 -680 -609 1565 3438 -1715 -5667 -2155 -7747 -11929 -15147
15955 -15147 -15781 -12226 -8389 -6628 -4832 -13231 -15409 -11626 -11133 -7533 -8862 -8590 -10857 -15999 -16162
$$ packed form
16060a4057m349N55O639l048l412L225L362R07l209K215M152q68K996j93l145
16045h230l437J636M530k891L64J085k249p215k706L048J790R88O68J101l390
16030a4908J713R2M622M575n259o01k888L328k821j887K656J884j645o346q76
16015a8361N870N090j142j657P254P647l633l282j01K496k309o369n97O506l283
16000e871M993j780q07l429l069P498j17k887l779n549k877J71O259J640m057
15985a3661k374L508p806K996O803j517L217k392O66O580M749K79k925m677l565
15970a0119J724J317J083Q696J529m910P1K174J873n153l952L512n592m182l218
15955a5147o34L555L837J761J796q399k178L783M93L600j329K72k267n142j63
$$ plain form
15940 -16162 -11193 -6473 -10281 -7000 -6058 -7288 -4183 -2778 -1516 -2568 -6411 -8755 -6356 -5469 -8595
15925 -8595 -12876 -14925 -18475 -16392 -23862 -29217 -22280 -20063 -14511 -9782 -13696 -15387 -14995 -10015 -8243
15910 -8243 -10711 -5029 -4705 -6943 -5003 -6755 -16319 -17424 -7486 -5517 -8477 -12284 -9537 -9490 -5768
15895 -5768 -5027 -7374 -2077 1430 3439 -2477 -2991 -2725 -5365 -1013 513 2205 -6148 -10691 -7975
15880 -7975 -7440 -4998 -1173 537 7556 4752 4512 6493 1967 -3474 -667 -351 -1704 -1068 -2339 -4386
15864 -4386 -2987 -5729 -6806 -3950 -1899 455 395 1551 -5390 -14122 -18879 -19724 -12878 -8292 -12259
15849 -12259 -17689 -11499 -8659 -9271 -12748 -14867 -12761 -6297 -3889 -5631 -8185 -4411 -2545 -3360 -374
15834 -374 5575 3243 -3385 -117 -1095 -6373 -12822 -18638 -12821 -10588 -11986 -13578 -10691 -3753 -4942
$$ packed form
15940a6162M969M720l808L281R42j230L105J405J262j052l843k344K399Q87l126
15925h595m281k049l550K083p470n355O937K217N552M729l914j691L92M980J772
15910h243k468N682L24k238J940j752r564j105R938J969k960l807K747M7L722
15895e768P41k347N297L507K009n916n14K66k640M352J526J692q353m543K716
15880g975N35K442L825J710P019k804k40J981m526n441K807L16j353O36j271k047
15864d386J399k742j077K856K051K354o0J156o941q732m757q45O846M586l967
15849a2259n430O190K840o12l477k119K106O464K408j742k554L774J866q15K986
15834c74N949k332o628L268r78n278o449n816N817K233j398j592K887O938j189
$$ plain form
15819 -4942 -4890 671 138 -4448 -9698 -8451 -12406 -12683 -11622 -10231 -9459 -5752 -5959 -5491 -7330 -9950
15803 -9950 -13400 -13245 -10833 -10400 -13598 -14919 -8982 -7620 -6994 -7696 -5662 720 1513 -1085 -1775 -4980
15787 -4980 -10863 -9671 -11875 -11637 -13562 -14024 -13043 -6821 -5872 -5805 -8620 -7340 -3357 1190 -2578 -1832
15771 -1832 2096 1738 3194 -1308 -2324 -4433 -9962 -12494 -8625 -3020 -1400 -3364 -3950 -4257 -1991
15756 -1991 -7105 -6346 -2317 1917 6157 4496 -5552 -10216 -7579 -143 5975 5607 3687 2023 -5204
15741 -5204 -9919 -2124 2042 1710 1306 308 -1390 -1302 -3083 -3709 -987 -4728 -6300 -7288 -2583 2892
15725 2892 2817 274 -3739 -4361 -4008 -814 -5487 -7404 -11744 -9128 -3303 -2391 -11200 -18182 -17780 -16806
15709 -16806 -18282 -16871 -11719 -11683 -5521 2607 1992 -3396 -12200 -10502 -10599 -9172 -3963 -552 -1162 -6224
$$ packed form
15819d942N2N561n33m586n250J247l955k77J061J391P72L707k07M68j839k620
15803i950l450J55K412M33l198j321N937J362O26p02K034O382P93k598o90l205
15787d980n883J192k204K38j925m62R81O222R49O7k815J280L983M547l768P46
15771a832L928l58J456m502j016k109n529k532L869N605J620j964n86l07K266
15756a991n114P59M029M234M240j661j0048m664K637P436O118l68j920j664p227
15741e204m715P795M166l32m04r98j698Q8j781o26K722l741j572r88M705N475
15725B892p5k543m013o22L53L194m673j917m340K616N825R12q809o982M02R74
15709a6806j476J411N152L6O162Q128o15n388q804J698r7J427N209L411o10n062
$$ plain form
15693 -6224 -8232 -12033 -19788 -23584 -20217 -15975 -19026 -13891 -6061 -4085 -8725 -3452 -7703 -15100 -18343
15678 -18343 -13657 -14338 -7845 -4264 -1546 -922 -2476 -1280 -1658 -2713 -193 -375 -4474 -15153 -14277
15663 -14277 -11132 -7557 -8693 -12987 -10472 -16847 -21836 -19164 -18640 -20348 -23916 -11746 -4586 -10767
15649 -10767 -12908 -15608 -15075 -12297 -10855 -12810 -18221 -17185 -5899 -5033 -10273 -9600 -11127 -12560 -5833
15634 -5833 -3056 -4163 -6748 -4808 -2660 -3467 -4891 -5668 845 6690 11301 11991 8850 4107 1292
15619 1292 -1077 -7068 -7156 -11749 -11014 -12453 -17218 -12166 -4233 -9948 -14893 -12206 -4039 -7125 -8415
15604 -8415 -16621 -19305 -15004 -13958 -15647 -18276 -17383 -13581 -15064 -10463 -8114 -10362 -2998 331 -2771
15589 -2771 -6088 -8522 -5152 -3001 -4592 -9231 -10462 -2606 -2766 -2726 -6778 -7161 -2224 43 572 -1460
$$ packed form
15693f224k008l801p755l796L367M242l051N135P830J976m640N273m251p397l243
15678a8343M686o81O493L581K718O24j554J196l78j055K520j82m099j0679Q76
15663a4277L145L575j136m294K515o375m989K672N24j708l568J2170P160o181
15649a0767k141k700N33K778J442j955n411J036J1286Q66n240O73j527j433O727
15634e833K777j107k585J940K148q07j424p77O513N845M611O90l141m743k815
15619A292k369n991q8m593P35j439m765N052P933n715m945K687Q167l086j290
15604h415q206k684M301J046j689k629Q93L802j483M601K349k248P364L329l102
15589b771l317k434L370K151j591m639j231P856j60M0m052l83M937K267N29k032
$$ plain form
15573 -1460 -3367 -8608 -9706 -7793 -8053 -9397 -6824 -7604 -7246 -6689 -9705 -11525 -13240 -2520 -1142
15558 -1142 -5540 -5582 -4396 -7823 -14465 -14020 -9193 -6383 -12362 -17482 -10192 -7766 -11031 -20648 -21571 -21397
15542 -21397 -24989 -23416 -12422 -4907 -4347 79 -3457 -3662 -3617 -6714 -5329 -11473 -11044 -6561 -7023 -2231
15526 -2231 -4145 -5385 -8484 -10349 -14261 -12762 -9524 -7072 -7506 -7231 -12328 -16476 -16439 -18294 -16530 -16385
15510 -16385 -15695 -14168 -10663 -7860 -12185 -12007 -13817 -13574 -13162 -15820 -12332 -9940 -12089 -8549 -9543 -16608
15494 -16608 -16385 -18717 -20758 -17636 -14869 -5625 -5548 -7702 -16865 -18842 -15762 -12509 -10248 -9033 -4706
15479 -4706 -7531 -12415 -15512 -9270 -3055 -724 -2702 -315 2798 4583 2650 2706 1894 1809 -180 -7147
15463 -7147 -11220 -12113 -12120 -9161 -15331 -18616 -14087 -12099 -8267 -6677 -11800 -9972 -9586 -3152 -2222 -4784
$$ packed form
15573a460j907n241j098J913k60j344K573p80L58N57l016j820j715J0720J378
15558a142m398m2J186l427o642M45M827K810n979n120P290K426l265r617r23J74
15542b1397l592J573J0994P515N60M426l536k05M5l097J385o144M29M483m62M792
15526b231j914j240l099j865l912J499L238K452m34K75n097m148L7j855J764J45
15510a6385O90J527L505K803m325J78j810K43M12k658L488K392k149L540r94p065
15494a6608K23k332k041L122K767R244P7k154r163j977L080L253K261J215M327
15479d706k825m884l097O242O215K331j978K387L113J785j933N6q12q5j989o967
15463g147m073q93pK959o170l285M529J988L832J590n123J828L86O434R30k562
$$ plain form
15447 -4784 -8428 -9024 -10609 -5435 -5736 -3935 -8224 -13773 -10518 -11334 -12308 -9338 -9654 -11692 -6715 -3780
15431 -3780 -6319 -12925 -11973 -10732 -7265 -4267 -5276 -11312 -11430 -18082 -19467 -16971 -17954 -9654 -5546
15416 -5546 -7515 -10034 -4547 -2019 -1263 -1773 1080 960 1321 -3360 -8819 -13573 -6518 -10840 -13869 -10395
15400 -10395 -8530 -7256 -1615 -3103 -6239 -10226 -6122 -12544 -17906 -10561 -10176 -9295 -6085 -2563 -6950
15385 -6950 -13203 -10202 -8807 -10100 -6061 -4238 -6340 -11463 -12214 -6998 -2150 784 -8483 -18671 -16290
15370 -16290 -16251 -15848 -12548 -9974 -11206 -7827 -6257 -6763 -6457 -5011 -5177 -1508 -114 -13107 -17747 -10943
15354 -10943 -5241 -4228 -2078 -3579 -3108 -7837 -11260 -6127 -1086 -2404 -9591 -10806 -9118 -7731 -3659
15339 -3659 -3951 -6540 -4687 -7757 -12835 -12809 -17238 -20782 -16952 -9474 -12543 -11239 -10767 -11124 -5011 -8394
$$ packed form
15447d784l644n96j585N174l01J801m289n549L255q16r74K970l16k038M977K935
15431c780k539o606R52J241L467K998j009o036j18o652j385K496r83Q300M108
15416e546j969k519N487K528P56n10K853j20L61m681n459m754P055m322l029L474
15400a0395J865J274N641j488l136l987M104o422n362P345L85Q81L210L522m387
15385f950o253L001J395j293M039J823k102n123p51N216M848K934r267j0188K381
15370a6290L9M03L300K574j232L379J570n06L06J446j66L669J394j2993m640O804
15354a0943N702J013K150j501M71m729l423N133N041j318p187j215J688J387M072
15339c659k92k589J853l070n078K6m429l544L830P478l069J304M72l57O113l383
$$ plain form
15323 -8394 -4340 -4196 -2048 -546 -3644 1739 5525 3093 -3896 -15260 -15457 -12802 -13018 -7236 -14401
15308 -14401 -21322 -28252 -19651 -11492 -5986 -9018 -10118 -9743 -10379 -6258 -1115 3993 9064 7630 5856
15293 5856 4870 3530 -3500 -8907 -7818 -7192 -9846 -7593 -4811 -11086 -9682 -9116 -12326 -10546 -4421
15278 -4421 -2850 -8135 -3390 -3595 -946 -117 -735 2041 3193 -1551 -10696 -13613 -6427 -821 1210
15263 1210 -329 -1495 -1179 -1366 -3560 -5203 -9718 -9806 -12099 -5678 -1394 -11047 -13944 -5229 -3478 -5144
15247 -5144 -5828 -8808 -7194 -3043 -572 -6266 -12965 -10705 -14862 -22199 -25861 -25682 -26438 -22447 -20191
15232 -20191 -16783 -11303 -7000 -10425 -8304 -3690 -540 1790 3145 -2704 -8111 -5029 -5299 -6879 -4787
15217 -4787 -12762 -15140 -10777 -6062 -3453 -581 1383 3419 986 3638 3710 7587 6899 1339 -6785
$$ packed form
15323h394M054J44K148J502l098N383L786k432o989j1364j97K655k16N782p165
15308a4401o921o930Q601Q159N506l032j100L75o36M121N143N108N071j434j774
15293E856r86j340p030n407J089O26k654K253K782o275J404N66l210J780O125
15278d421J571n285M745k05K649Q29o18K776J152m744r145k917P186N606K031
15263A210j539j166L16j87k194j643m515q8k293O421M284r653k897Q715J751j666
15247e144o84k980J614M151K471n694o699K260m157p337l662J79p56L991K256
15232b0191L408N480M303l425K121M614L150K330J355n849n407L082k70j580K092
15217d787p975k378M363M715K609K872J964K036k433K652P2L877o88n560q124
$$ plain form
15202 -6785 -12859 -9236 -7533 2606 4216 -4378 -8387 -13407 -11076 -10510 -12680 -12750 -5775 -4864 -7765
15187 -7765 -9523 -16027 -17949 -15327 -9091 -12617 -7008 -7916 -4640 -4769 -13424 -19180 -14828 -4882 -7551
15172 -7551 -7451 -7329 -10919 -10360 -4115 -2950 -4289 -7586 -10795 -16929 -12943 -13570 -21036 -17371 -15659 -12000
15156 -12000 -12442 -11771 -9358 -5151 -3438 -2870 -1288 -6720 -5106 1090 -1274 -5801 -9427 -16388 -16708
15141 -16708 -18930 -22276 -22189 -15591 -11565 -8357 -6210 -4506 -9224 -15236 -11442 -5810 -1724 639 -650
15126 -650 -4064 -7702 -10550 -5479 -1410 1146 964 -5932 -10084 -14805 -17946 -11927 -3732 -9597 -14329
15111 -14329 -12366 -12381 -10468 -6632 286 5352 4824 2308 6598 2025 -2411 -9534 -7575 -1244 -3879
15096 -3879 -2500 -495 -1108 -3286 -5367 -8742 -7186 -4074 819 4889 2778 -3437 -10515 -13851 -11499
$$ packed form
15202f785o074L623J703J0139J610q594m009n020K331N66k170p0O975R11k901
15187g765j758o504j922K622O236l526N609r08L276j29q655n756M352R946k669
15172g551J00J22l590N59O245J165j339l297l209o134L986o27p466L665J712L659
15156a2000m42O71K413M207J713N68J582n432J614O196k364m527l626o961l20
15141a6708k222l346Q7O598M026L208K147J704m718o012L794N632M086K363j289
15126f50l414l638k848N071M069K556j82o896m152m721l141O019Q195n865m732
15111a4329J963j5J913L836O918N066n28k516M290m573m436p123J959O331k635
15096c879J379K005o13k178k081l375J556L112M893M070k111o215p078l336K352
$$ plain form
15081 -11499 -8039 -8732 -6555 -2786 1509 4441 5634 -4870 -13576 -13946 -9146 -10749 -13938 -17607 -18044
15066 -18044 -12994 -6449 -8816 -5153 -976 -4720 -2797 318 3812 4808 2122 -1542 -12998 -16347
15052 -16347 -17045 -17814 -15301 -15486 -9009 -2732 406 -3120 -5513 -3550 -886 2869 6913 5327 2790
15037 2790 2881 2185 3195 7432 4129 597 -1140 1919 3137 1910 2575 2900 3113 2161 -894 -3798
15021 -3798 -7144 -7672 -13078 -12904 -17326 -14714 -16699 -18587 -18711 -13519 -8188 -8786 -16555 -16973 -12974 -6679
15005 -6679 -2602 -3370 -10263 -13244 -11071 -10656 -7938 -7354 -9036 -7158 -5387 -4938 -7307 314 3898 1617
14989 1617 -2813 -2687 -3438 -1530 -4094 -5470 -4266 -5652 -12731 -9504 -5926 -6641 -5107 -2862 -2438 -3595
14973 -3595 -2257 -4092 -4358 -5019 -9898 -8440 -11639 -20200 -18960 -14889 -7799 -6176 -9104 -4383 3621
$$ packed form
15081a1499L460o93K177L769M295K932J193j0504q706l70M800j603l189l669m37
15066a8044N050O545k367L663M177l744J923L115L494R96k686l664j1456l349
15052a6347o98p69K513j85O477O277L138l526k393J963K664L755M044j586k537
15037B790R1o96J010M237l303l532j737L059J218j227O65L25K13r52l055k904
15021c798l346n28n406J74m422K612j985j888j24N192N331n98p769m18L999O295
15005f679M077p68o893k981K173M15K718N84j682J878J771M49k369P621L584k281
14989A617m430J26p51J908k564j376J204j386p079L227L578p15J534K245M24j157
14973c595J338j835k66o61m879J458l199q561J240M071P090J623k928M721Q004
$$ plain form
14958 3621 3173 4223 -2040 -9303 -7354 2168 7121 5063 5975 3089 1434 489 -1516 -4828 -10490
14943 -10490 -10713 -8079 -6819 -11942 -10086 -6550 -2744 283 4869 4631 562 2001 5343 5700 5631 2650
14927 2650 -490 636 -4078 -160 2000 -1822 -8522 -11072 -2189 2036 1204 2253 -1043 -1599 -6138
14912 -6138 -1462 -1572 387 -1350 -3854 -2989 -5767 -10130 -15164 -12443 -6676 -4683 -7 -3284 -6562
14897 -6562 -2453 991 -6149 -16809 -12775 -5853 -4006 -10136 -11640 -5074 -3815 -1626 -8431 -4728
14883 -4728 3261 1953 50 -5979 -8188 -3482 -174 -7975 -10708 -5842 -123 -2002 -2493 -3868 -12787
14868 -12787 -16345 -19774 -18493 -14279 -14229 -5755 1131 6519 10773 5386 2297 2850 -2679 -7035 -3700
14853 -3700 -3498 -5657 -51 6595 2497 3218 1306 -2812 -10018 -9538 -8244 -11319 -6650 240 -2618
$$ packed form
14958C621m48J050o263p263J949R522M953k058R12k886j655r45k005l312n662
14943a0490k23K634J260n123J856L536L806L027M586k38m069J439L342L57o9k981
14927B650l140J126m714L918K160l822o700k550Q883M225q32J049l296n56m539
14912f138M676j10J959j737k504Q65k778m363n034K721N767J993M676l277l278
14897f562M109L444p140j0660M034O922J847o130j504O566J259K189o805L703
14883d728P989j308j903o029k209M706L308p801k733M866N719j879m91j375q919
14868a2787l558l429J281M214N0Q474O886N388M254n387l089N53n529m356L335
14853c700K02k159N606O646m098P21j912m118p206M80J294l075M669O890k858
$$ plain form
14838 -2618 -2127 1036 -2663 1623 6664 4436 6554 7884 4341 104 -6525 -2405 728 -4239 446
14823 446 6944 4103 2108 1586 2355 -940 -7825 -7148 -4427 -499 699 760 4732 1880 -2667 -7615
14807 -7615 -4438 2738 4605 -2674 -2762 -2326 4554 7458 1258 -1192 -2901 1446 15 1592 -3268
14792 -3268 -1970 2826 902 -5158 -2984 -8236 -17525 -16697 -14026 -5148 1822 1583 2888 -2065 -2177
14777 -2177 -3652 2125 6661 5411 1694 2523 1723 6958 654 -13039 -19836 -13863 1734 9845 6527
14762 6527 658 -495 915 -1038 1978 -2795 2356 3214 3973 195 -5279 -11515 -8467 -1433 -6954
14747 -6954 -5827 -7008 -9850 -5551 -593 -1321 -5972 -5057 -7507 -2566 332 -2862 -6297 -8203 -6172
14732 -6172 -4286 1257 -2445 -6513 -8398 -7105 -4454 -1007 -2042 983 6208 1672 -3805 -6050 -7541
$$ packed form
14838b618M91L163l699M286N041k228K118J330l543m237o629M120L133m967M685
14823D46O498k841j995n22P69l295o885O77K721L928J198O1L972k852m547m948
14807g615L177P176J867p279q8M36O880K904o200k450j709M347j431J577m860
14792c268J298M796j924o060K174n252r289Q28K671Q878O970k39J305m953j12
14777b177j475N777M536j250l717Q29q00N235o304j3693o797N973J5597Q111l318
14762F527n869j153J410j953L016m773N151Q58P59l778n474o236L048P034n521
14747f954J127j181k842M299M958p28m651R15k450M941K898l194l435j906K031
14732f172J886N543l702m068j885J293K651L447j035L025N225m536n477k245j491
$$ plain form
14717 -7541 -9005 -7107 -416 6568 8856 3475 804 699 -736 -2922 -1870 7402 8838 9900 4076
14702 4076 -3851 798 3066 -1926 -2733 -854 6783 9688 8962 10405 7811 -4023 -12220 -7443 -1112
14687 -1112 -1878 -7461 -2568 1976 -3745 -8514 -9188 -2441 1467 5753 5013 -367 -7902 -2341 1544
14672 1544 2293 8332 3850 -652 4746 -799 -6769 -5894 -6133 -1914 -4285 -7324 -6143 -9894 -11409
14657 -11409 -11348 -6327 -3627 2735 2606 2949 -3997 -4257 -4597 -5182 -5857 -3454 -977 1624 2661 -1594
14641 -1594 -3681 -4292 -3767 -3489 -4972 -9388 -9316 -3877 -1621 -6974 -11289 -5407 -2755 -5858 -7047 -4666
14625 -4666 -2085 -4772 889 -1833 -7170 -7987 -6345 -125 7123 2268 7963 12308 5876 3189 2781
14610 2781 -1876 -5330 -752 1027 2319 -3410 -4708 -1568 -9000 -14525 -10435 -14027 -16711 -19272 -15244
$$ packed form
14717g541j464J898O691O984K288n381k671j05j435k186J052R272J436J062n824
14702D076p927M649K268m992q07J879P637K905p26J443k594j1834q197M777O331
14687a112p66n583M893M544n721m769o74O747L908M286p40n380p535N561L885
14672A544P49O039m482m502N398n545n970Q75k39M219k371l039J181l751j515
14657a1409O1N021K700O362j29L43o946k60l40n85o75K403K477K601J037m255
14641a594k087o11N25K78j483m416P2N439K256n353m315N882K652l103j189K381
14625d666K581k687N661k722n337q17J642O220P248m855N695M345o432k687m08
14610B781m657l454M578J779J292n729j298L140p432n525M090l592k684k561M028
$$ plain form
14595 -15244 -10683 -12864 -14823 -7601 -7463 -5944 -4116 -5991 -6274 -4295 -3512 -1613 -2661 -5656 1324
14580 1324 506 392 -1123 264 -1950 -2967 -7305 -4445 -2466 -8116 -5184 -3871 -5787 -6458 -4159
14565 -4159 -1733 -326 -7132 -1982 -2771 -4268 -4058 3048 2231 -1693 -10757 -12714 -9736 1125 2335
14550 2335 -5968 -9068 -6620 -6586 -8367 -13883 -6278 1854 -3115 -6750 -3397 -830 699 1991 6153
14535 6153 3949 4111 -515 -1083 -3095 4575 2743 -6623 -12917 -5797 -2164 4068 10033 -937 -1169
14520 -1169 6314 10807 11884 13473 13445 10694 7587 4299 2498 -400 8367 10541 3430 1980 -1913
14505 -1913 -6549 -7495 -8040 -10490 -10058 -12136 -4684 912 7519 11939 9279 854 2713 9086 10805
14490 10805 6478 3069 -3068 -6430 3073 -542 -1215 6132 11042 8731 9710 12153 9099 3283 -3477
$$ packed form
14595a5244M561k181j959P222J38J519J828j875k83J979P83J899j048k995O980
14580A324q18j14j515J387k214j017m338K860J979n650K932J313j916o71K299
14565d159K426J407o806N150p89j497K10P106q17l924r064j957K978J0861J210
14550B335q303l100K448L4j781n516P605Q132m969l635L353K567J529J292M162
14535F153k204J62m626n68k012P670j832r366o294P120L633O232N965j0970k32
14520a169P483M493J077J589k8k751l107l288j801k898Q767K174p111j450l893
14505a913m636r46n45k450M32k078P452N596O607M420k660q425J859O373J719
14490A0805m327l409o137l362R503l615o73P347M910k311R79K443l054n816o760
$$ plain form
14475 -3477 -5877 -6761 -5958 -7117 6129 5375 -1557 309 -4097 -8722 -11594 -8813 -5348 1866 6452
14460 6452 2468 -4937 -2462 7898 4335 1495 -4710 -3757 -1561 -2561 -2754 2297 773 -4396 -2692
14445 -2692 -1471 1259 677 -5215 -10865 -12646 -4441 5965 5004 -324 -9247 -5709 402 7079 7264
14430 7264 5718 4933 12594 11525 7375 1968 5506 9448 2453 -2746 -3712 -4998 -7307 -14275 -14417
14415 -14417 -15336 -12249 -4062 -6911 -9705 -6373 -4695 -3043 -1738 873 7560 10718 7892 13681 24468
14400 24468 26320 19788 7058 5733 7338 6083 5399 9600 7266 10177 5006 3689 7146 2956
14386 2956 1430 6449 9219 5902 2925 3366 -4339 -7893 -5703 -4422 1531 4643 8160 4446 3252
14371 3252 3720 724 1042 4112 -2727 -2660 1364 1602 -1865 1600 -361 -2312 -3811 -3901 -2182 4579
$$ packed form
14475c477k400q84Q03j159J3246p54o932J866m406m625k872K781L465P214M586
14460F452l984p405K475J0360l563k840o205R53K196j000j93N051j524n169J704
14445b692J221K730n82n892n650j781Q205J0406r61n328q923L538O111O677J85
14430G264j546p85P661j069m150n407L538L942o995n199r66j286k309o968j42
14415a4417r19L087Q187k849k794L332J678J652J305K611O687L158k826N789J0787
14400B4468J852o532j2730j325J605j255o84M201k334K911n171j317L457m190
14386B956j526N019K770l317k977M41p705l554K190J281N953L112L517l714j194
14371C252M68k996L18L070o839O7M024K38l467L465j961j951j499r0J719O761
$$ plain form
14355 4579 3968 292 10 -958 4296 6005 -2767 -9626 -11195 -8900 -6471 -9893 -9920 -13579 -14888 -10950
14339 -10950 -530 7776 8761 1077 5089 4572 4207 1238 -4458 671 -682 -1805 101 2566 7280
14324 7280 2119 275 6390 9359 3188 -1652 -3501 2 -2870 -6865 -3861 7016 -3739 -10509
14310 -10509 -10605 -5554 -5401 -4236 1750 227 2331 5525 2043 2545 985 2834 4060 3811 5482 12789
14294 12789 19095 14858 6218 7609 9168 11969 7687 1207 -2144 4504 7511 4288 -2085 -3392
14280 -3392 -2531 930 -226 -5558 -4721 -5460 -7618 -6637 -5928 564 118 2990 2960 2118 1488 7478 15552
14263 15552 6161 2976 13516 12550 11051 8766 4304 5432 5061 1114 -459 1456 1233 2856 2818
14248 2818 1756 8768 7208 11029 4920 4190 3176 -1519 -2980 2177 1198 3102 -1869 3198 3543
$$ packed form
14355D579o11l676k82r68N254J709q772o859j569K295K429l422k7l659j309L938
14339a0950J0420Q306R85p684M012n17l65k969n696N129j353j123J906K465M714
14324G280n161j844O115K969o171m840j849L503k872l995L004J0877j0755o770
14310a0509r6N051J53J165N986j523K104L194l482N02j560J849J226k49J671P307
14294A2789O306m237q640J391J559K801m282o480l351O648L007l223o373j307
14280c392Q61L461j156n332Q37p39k158R81P09O492m46K872l0q42o30N990Q074
14263A5552r391l185J0540r66j499k285m462J128l71l947j573J915k23J623l8
14248B818j062P012j560L821o109p30j014m695j461N157r79J904m971N067L45
$$ plain form
14233 3543 5837 7924 -1584 -289 -580 -3897 -3130 5586 4822 341 450 -32 3783 351 -6656 -2559
14217 -2559 3945 8401 349 -6172 -3288 1715 -2646 -3590 186 2996 3822 6648 4995 5770 3458
14202 3458 3843 4975 5293 6785 3513 -722 1973 4113 2947 7953 13325 10581 6788 9709 11688
14187 11688 8975 3504 2433 -3473 -5587 -8942 -6886 4 -1487 -1593 -2110 543 4538 6782 1808
14172 1808 8799 15070 11158 11635 13305 11802 7571 6069 3492 -1081 -568 -396 -7320 -13137 -8580
14157 -8580 319 8351 9063 3175 4465 4280 5113 9856 3465 -1218 -7809 -10583 -6440 271 1734
14142 1734 319 -4263 -4400 -1955 4200 7935 7220 7755 3591 200 2965 762 -612 1262 8430
14127 8430 10563 12549 15990 13391 7799 4486 1456 -318 2301 5608 11916 11152 2378 4615 5597
$$ packed form
14233C543K294K087r508J295k91l317P67Q716p64m481J09m82L815l432p007M097
14217b559O504M456q052o521K884N003m361r44L776K810Q26K826j653P75k312
14202C458L85J132L18J492l272m235K695K140j166N006N372k744l793K921J979
14187A1688k713n471j071n906k114l355K056O890j491j06n17K653L995K244m974
14172A808O991O271l912M77J670j503m231j502k577m573N13J72o924n817M557
14157h580Q899Q032P12n888J290j85Q33M743o391m683o591k774M143O711J463
14142A734j415m582j37K445O155L735p15N35m164l391K765k203j374J874P168
14127H430K133J986L441k599n592l313l030j774K619L307O308p64q774K237R82
$$ plain form
14112 5597 2023 -3664 -7038 -6525 -4492 -422 -1026 1210 1306 3624 2180 1048 -3858 1352 5891 4595
14096 4595 2693 7148 9611 9075 7052 6137 1773 533 2472 6676 6597 959 -2431 -1259 -4336 -1437
14080 -1437 6448 11118 5350 2796 5823 6794 2225 -2180 3 323 1932 -186 1483 5381 5498
14065 5498 6834 12346 16386 12100 4282 2916 14094 14477 10799 9256 5960 7488 5934 659 3671
14050 3671 894 -10846 -11852 -4739 -8902 -8321 -8844 -7089 -2212 3153 7823 1230 2732 7000 3011
14035 3011 19 2174 2852 4519 8093 6814 5992 4817 6537 6527 3551 4606 15754 12356 8982
14020 8982 7380 15876 13972 10870 19576 14479 6214 5663 973 913 -528 -4614 -2375 1857 7172
14005 7172 9389 10556 4691 1315 2808 669 2607 2443 1744 1490 3163 9837 13692 17106 14817
$$ packed form
14112E597l574n687l374N13K033M070o04K236R6K318j444j132m906N210M539j296
14096D595j902M455K463n36k023r15m364j240J939M204p9n638l390J172l077K899
14080a437P885M670n768k554L027R71m569m405K183L20J609k118J669L898J17
14065E498J336N512M040m286p818j366J1178L83l678j543l296J528j554n275L012
14050C671k777j1740j006P113m163N81n23J755M877N365M670o593J502M268l989
14035C011k992K155O78J667L574j279q22j175J720j0k976J055J1148l398l374
14020H982j602Q496j904l102Q706n097q265n51m690o0j441m086K239M232N315
14005G172K217J167n865l376J493k139J938j64o99k54J673O674L855L414k289
$$ plain form
13990 14817 9708 14243 13981 5587 22 3070 10755 14499 11818 9988 6647 2743 3334 4899 7463
13975 7463 5653 6935 2193 4086 8262 12103 11819 14180 12442 7556 17223 20933 21852 27142 28735
13960 28735 29493 19252 11133 5274 4537 3465 3418 7956 8491 8368 12255 13112 15045 9695 7322 6819
13944 6819 9327 8262 11712 14343 12340 11562 13814 14548 12648 17902 19991 24240 26934 28883 27488
13929 27488 21895 30988 36156 31377 31078 31905 34919 39508 36601 33914 28628 25605 21081 11636 10949
13914 10949 16273 19303 15088 10138 13157 15210 14427 16649 15804 14125 9323 4977 4182 6521 5258
13899 5258 9998 10603 8030 7068 4294 6593 8986 6718 9048 10397 12825 21436 23536 20730 17534
13884 17534 14045 11274 5997 7005 15284 15811 13807 15276 20477 16574 12603 7471 5372 1932 3035
$$ packed form
13990A4817n109M535k62q394n565L048P685L744k681j830l341l904N91J565K564
13975G463j810J282m742J893M176L841k84K361j738m886R667L710R19N290J593
13960B8735P58j0241q119n859p37j072m7M538N35j23L887Q57J933n350k373n03
13944F819K508j065L450K631k003p78K252P34j900N254K089M249K694J949j395
13929B7488n593R093N168m779k99Q27L014M589k907k687n286l023m524r445o87
13914A0949N324L030m215m950L019K053p83K222q45j679m802m346p95K339j263
13899E258M740O05k573r62k774K299K393k268K330J349K428Q611K100k806l196
13884A7534l489k771n277J008Q279N27k004J469N201l903l971n132k099l440J103
$$ plain form
13869 3035 2586 7943 11887 14076 11184 17347 15996 13257 22800 23297 18888 17174 14596 13786 12181
13854 12181 13388 16869 19995 18064 21425 18116 13368 11828 10702 7088 10370 12095 7895 7076 9297
13839 9297 12556 10926 2004 -3337 3242 1928 1381 6198 13999 12351 11048 14801 19188 22507 25329
13824 25329 22634 20649 21215 18753 18664 21797 22077 20929 21660 17138 17965 17672 17529 14555 8980 11046
13808 11046 14026 14744 10893 10983 10966 9455 9554 10962 14553 17236 13228 6017 7585 12740 13236 13251 9762
13791 9762 5697 1567 6974 5308 5795 8790 9288 8158 9219 14858 18785 15918 16621 12314 10823
13776 10823 7650 12832 14376 11900 12854 13638 14220 17674 20055 14624 3472 798 1684 7577 15450
13761 15450 16424 21586 20747 19148 10127 8138 16714 21948 9716 7011 16678 20656 16855 8556 6003
$$ packed form
13869C035m49N357L944K189k892O163j351k739R543M97m409j714k578q10j605
13854A2181J207L481L126j931L361l309m748j540j126l614L282J725m200q19K221
13839I297L259j630q922n341O579j314n47M817P801j648j303L753M387L319K822
13824B5329k695j985N66k462q9L133K80j148P31m522Q27k93j43k974n575K066
13808A1046K980P18l851R0j7j511R9J408L591K683m008p211J568N155M96J5l489
13791I762m065m130N407j666M87K995M98j130J061N639L927k867P03m307j491
13776A0823l173N182J544k476R54P84N82L454K381n431j1152k674Q86N893P873
13761A5450R74N162q39j599r021j989Q576N234j2232k705R667L978l801q299k553
$$ plain form
13746 6003 13115 19205 21707 15543 17016 11720 9033 14886 16161 10172 9349 12342 14863 12941 18128
13731 18128 20657 19907 18220 13078 10880 11460 16542 20092 23226 19130 13184 13755 13049 12970 10680 5222
13715 5222 10674 9628 11488 10526 9777 12187 17617 17580 14249 11469 14270 11259 9293 19870 27246
13700 27246 28838 22213 17689 17142 14965 12575 10892 13982 19601 17691 15956 19345 17353 15742 18934
13685 18934 22329 17813 9825 9731 9020 5365 2672 7080 10644 14061 19546 17924 18320 20410 22088
13670 22088 21865 23254 23479 19839 11506 6952 11408 14327 22147 22439 13736 12299 18248 16654 12618
13655 12618 12494 17446 19693 13764 11752 7500 10053 8380 6117 11508 13189 17887 28112 24972
13641 24972 12876 5490 14219 17742 13651 10200 13425 21405 22711 19779 20210 17164 8696 8836 15428
$$ packed form
13746F003P112O090K502o164J473n296k687N853J275n989q23K993K521j922N187
13731A8128K529p50j687n142k198N80N082L550L134m096n946N71p06p9k290n458
13715E222N452j046J860r62p49K410N430l7l331k780K801l011j966J0577P376
13700B7246J592o625m524n47k177k390j683L090N619j910j735L389j992j611L192
13685A8934L395m516p988r4p11l655k693M408L564L417N485j622L96K090J678
13670B2088k23J389K25l640q333m554M456K919P820K92q703j437N949j594m036
13655A2618j24M952K247n929k012m252K553j673k263N391J681M698J0225l140
13641B4972j2096p386Q729L523m091l451L225P980J306k932M31l046q468J40O592
$$ plain form
13626 15428 16667 15514 19411 25837 25028 22211 21222 17016 17811 11938 4627 1977 4928 8270 14202
13611 14202 17118 20549 17569 9210 7560 13362 16495 11552 12588 13437 13861 9117 12811 18248 14710
13596 14710 14773 19475 14765 16115 15094 17088 13984 9620 11063 6139 11065 9595 2614 6497 15923
13581 15923 20350 16480 12369 13492 19403 24688 26262 23943 21637 20630 18232 18156 14083 14149 12538
13566 12538 13413 12076 17664 21973 25408 20881 17601 18247 24014 30851 34856 27309 27552 35107 35980
13551 35980 33902 33344 33600 27894 24369 26321 27709 28624 28208 24609 29196 25251 18911 22441 22577 32081
13535 32081 21230 20308 18987 19754 24490 24053 27124 32225 28179 16789 14731 11733 12380 16636 19182
13520 19182 24418 27687 29992 22510 14963 13940 21102 25570 23542 22353 20189 15974 21110 21849 22302
$$ packed form
13626A5428J239j153L897O426q09k817r89m206P95n873p311k650K951L342N932
13611A4202K916L431k980q359j650N802L133m943J036Q49M24m744L694N437l538
13596A4710O3M702m710J350j021J994l104m364J443m924M926j470o981L883R426
13581A5923M427l870m111J123N911N285J574k319k306j007k398p6m073O6j611
13566A2538Q75j337N588M309L435m527l280O46N767O837M005p547K43P555Q73
13551C5980k078n58K56n706l525J952J388R15m16l599M587l945o340L530J36R504
13535C2081j0851r22j321P67M736m37L071N101m046j1390k058k998O47M256K546
13520A9182N236L269K305p482p547j023P162M468k028j189k164m215N136P39M53
$$ plain form
13505 22302 18478 20414 22665 21106 16910 17648 15336 12639 18608 25958 25392 17436 15343 16838 18296
13490 18296 15284 15745 16324 12148 16787 15448 18477 17684 14978 17890 21469 23346 24554 27497 30226
13475 30226 29191 26614 24129 23433 24036 27119 25202 23333 24468 26943 25313 26751 27170 24692 21133
13460 21133 21427 21596 24082 27210 25231 24817 23914 26513 20781 16933 12739 14527 20518 20799 16086 19807
13444 19807 23449 21901 16372 20694 25409 21398 18900 19731 23408 24035 21475 21455 23105 24431 23311
13429 23311 20148 19596 15772 14567 23066 26421 27290 24950 21876 22594 24283 22937 22639 20151 16656
13414 16656 21254 24965 31324 23854 17739 21479 23797 22187 26839 25984 23972 27705 24476 28041 34871
13399 34871 38732 41723 35389 29614 18705 11985 11189 10466 14774 21827 26199 24063 20443 17458 19826
$$ packed form
13505B2302l824J936K251j559m196P38k312k697N969P350n66p956k093J495J458
13490A8296l012M61N79m176M639j339L029p93k706K912L579J877J208K943K729
13475C0226j035k577k485o96O03L083j917j869J135K475j630J438M19k478l559
13460B1133K94J69K486L128j979m14r03K599n732l848m194J788N991K81m713L721
13444A9807L642j548n529M322M715m011k498Q31L677O27k560k0J650J326j120
13429B3311l163n52l824j205Q499L355Q69k340l074P18J689j346k98k488l495
13414A6656M598L711O359p470o115L740K318j610M652q55k012L733l229L565O830
13399C4871L861K991o334n775j0909o720p96p23M308P053M372k136l620k985K368
$$ plain form
13384 19826 22632 22628 23758 23377 22506 25378 26492 28391 28498 26853 22765 22977 23528 18487 22854 27854
13368 27854 30102 24979 23258 23433 23038 27507 29097 30893 26016 19737 22813 22736 20136 24677 28165
13353 28165 28246 28396 27110 26914 25689 20969 23800 25861 29704 29234 28551 25548 24722 31861 37249 36309
13337 36309 34349 33806 30702 27613 18585 19290 27823 27899 26636 28248 30890 37762 35645 34380 33530 29013
13321 29013 22302 21735 21706 25126 27651 27957 24726 29850 38309 45563 48805 48018 44074 35345 32431 30843
13305 30843 28968 28731 27486 25733 24823 17902 20908 22835 30069 27332 19517 21726 25726 25766 24215
13290 24215 15677 13492 19124 20391 26839 33425 31725 27628 26694 29217 38421 38826 31341 30849 33494
13275 33494 33381 29399 34370 33917 34652 36163 35678 31688 27934 25104 27694 34444 34376 31357 34067 34647
$$ packed form
13384A9826K806mJ130l81q71K872J114J899J07j645m088K12N51n041M367N000
13368B7854K248n123j721J75l95M469J590J796m877o279L076p7k600M541L488
13353B8165Q1J50j286j96j225m720K831K061L843m70o83l003q26P139N388r40
13337C6309j960n43l104l089r028P05Q533P6j263J612K642O872k117j265q50m517
13321B9013o711n67k9L420K525L06l231N124Q459P254L242p87l944q729k914j588
13305C0843j875k37j245j753r10o921L006J927P234k737p815K209M000M0j551
13290B4215q538k185N632J267O448O586j700m097r34K523R204M05p485m92K645
13275C3494j13l982M971m53P35J511m85l990l754k830K590O750o8l019K710N80
$$ plain form
13259 34647 33443 25649 30679 29727 28687 28768 26619 26499 27717 26552 31274 30499 29677 29387 33772 39011
13243 39011 38166 36971 29223 29962 32527 29559 30101 37763 46747 40055 34892 37709 39588 36975 35316
13228 35316 36051 32751 34977 35285 28166 26620 31781 31577 36069 33441 29467 25586 32132 34550 32635
13213 32635 33394 29575 33517 34424 32208 28739 22783 21038 27991 34609 32749 30058 29026 28918 28804
13198 28804 27398 26538 26384 29221 37644 39010 34317 31052 31261 27609 26863 32807 36740 46188 43730
13183 43730 38693 38641 40833 39654 37272 33815 31490 28240 27038 40119 36037 36110 33773 32410 34636
13168 34636 34417 41030 41930 38326 39946 45867 47629 41311 37908 40749 42947 43881 44112 45415 36464
13153 36464 31776 28959 31882 35210 40313 36582 29954 33846 33672 35455 43354 50030 48115 48738 46224
$$ packed form
13259C4647j204p794N030r52j040Q1k149j20J218j165M722p75q22k90M385N239
13243C9011q45j195p748P39K565k968N42P662Q984o692n163K817J879k613j659
13228C5316P35l300K226L08p119j546N161k04M492k628l974l881O546K418j915
13213C2635P59l819L942R07k216l469n956j745O953O618j860k691j032j08j14
13198B8804j406q60j54K837Q423J366m693l265K09l652p46N944L933R448k458
13183D3730n037n2K192j179k382l457k325l250j202J3081m082P3k337j363K226
13168C4636k19O613R00l604J620N921J762o318l403K841K198R34K31J303q951
13153C6464m688k817K923L328N103l731o628L892j74J783P899O676j915O23k514
$$ plain form
13138 46224 49622 48562 45309 45358 43583 38233 36501 34552 33314 30120 29616 36271 33917 26330 24724
13123 24724 26498 37537 38109 38803 38150 36006 34555 36339 34658 30041 29629 29696 31784 39752 46597 47127
13107 47127 47121 47703 49300 47645 45060 44516 38672 35712 35528 38820 44214 40138 38843 39250 36538 29821
13091 29821 26440 29559 29017 31581 42261 46686 48649 43070 40321 43812 36194 37742 41099 41779 42018
13076 42018 33421 28496 24978 27324 28935 30912 34945 36370 35379 36141 36465 45720 49483 49753 45711
13061 45711 46329 45413 40308 32141 33397 33216 33227 37790 41325 45823 48989 43065 42729 41084 38820 37734
13045 37734 33204 29821 30972 32617 42545 44839 42644 39296 36002 31749 34141 37732 38417 39440 34967
13030 34967 44387 48763 45986 42593 37561 34592 29645 38485 46070 43413 45252 42549 42150 40087 37759
$$ packed form
13138D6224L398j060l253M9j775n350j732j949j238l194n04O655k354p587j606
13123B4724J774J1039N72O94o53k144j451J784j681m617m12O7K088P968O845N30
13107D7127oN82J597j655k585n44n844k960j84L292N394m076j295M07k712o717
13091B9821l381L119n42K564J0680M425J963n579k749L491p618J548L357O80K39
13076D2018q597m925l518K346J611J977M033J425r91P62L24R255L763K70m042
13061D5711O18r16n105q167J256j81J1M563L535M498L166n924l36j645k264j086
13045C7734m530l383J151J645R928K294k195l348l294m253K392L591O85J023m473
13030C4967R420M376k777l393n032k969m947Q840P585k657J839k703l99k063k328
$$ plain form
13015 37759 39105 47907 50847 48634 43466 41054 46509 40571 33218 36230 39911 43638 42121 35629
13001 35629 26809 26376 29315 29434 35064 39499 41504 39837 39445 37585 30797 31271 33538 37988 33170
12986 33170 36373 32648 25592 31094 39096 40699 36489 40260 43310 48113 52413 51881 46440 40566 36724
12971 36724 46992 49631 42394 33776 36412 42183 37853 38163 37247 33753 30912 33067 35394 35990 37974
12956 37974 33551 35962 35774 37140 34373 35054 41577 42194 35965 30467 30678 31332 36123 39593 37718 35386
12940 35386 37910 41061 36617 37242 37131 36045 37761 36463 36373 38585 42430 41985 42030 44863 48396 53044
12924 53044 55619 59407 56427 55153 55185 49172 47238 43159 47217 47735 53345 54227 46980 45292 44333 40932
12908 40932 38575 38018 40919 36779 38943 50509 52801 53526 47631 36742 31760 34975 38382 38825 42583
$$ packed form
13015C7759J346Q802K940k213n168k412N455n938p353L012L681L727j517o492
13001C5629q820m33K939J19N630M435K005j667l92j860o788M74K267M450m818
12986C3170L203l725p056N502Q002J603m210L771L050M803M300n32n441n874l842
12971C6724J0268K639p237q618K636N771m330L10r16l494k841K155K327N96J984
12956C7974m423K411j88J366k767O81O523O17o229n498K11O54M791L470j875k332
12940C5386K524L151m444O25j11j086J716j298r0K212L845m45M5K833L533M648
12924E3044K575L788k980j274L2o013j934m079M058N18N610Q82p247j688r59l401
12908D0932k357n57K901m140K164J1566K292P25n895j0889m982L215L407M43L758
$$ plain form
12893 42583 40393 37241 36855 40875 37598 31271 30959 34074 35779 45100 53067 58510 59606 49729 44967
12878 44967 50435 53386 47647 38439 36807 42266 41753 39711 43457 38242 38519 41037 44027 45366 47116
12863 47116 47119 53648 51121 47453 47451 41982 43105 51292 50989 50596 52771 45127 46354 59675 60909 55964
12847 55964 49486 39251 38651 46088 45614 42465 43035 49675 53355 51986 53533 52539 48180 47577 45093
12832 45093 46449 46838 49908 47975 49673 54213 53108 48283 39366 41307 48622 47283 39842 40026 44085
12817 44085 45077 47189 51935 59928 64515 57808 53532 57028 57357 57278 53503 50308 52123 48829 50347
12802 50347 49910 52174 47501 37501 45318 47183 40252 39581 40441 40165 42583 47172 43611 43247 39144
12787 39144 43087 43644 49075 48360 43764 50395 60293 56249 55647 59688 58038 57631 48219 48790 51407 45457
$$ packed form
12893D2583k190l152l86M020l277o327l12L115J705R321P967N443J096r877m762
12878D4967N468K951n739r208j632N459n13k042L746n215K77K518K990J339J750
12863D7116LO529k527l668kn469J123Q187l03l93K175p644J227J3321J234m945
12847E5964o478j0235o00P437m74l149N70O640L680j369J547r94m359o03k484
12832D5093J356L89L070j933J698M540j105m825q917J941P315j339p441J84M059
12817D4085R92K112M746P993M587o707m276L496L29p9l775l195J815l294J518
12802E0347m37K264m673j0000P817J865o931o71Q60k76K418M589l561l64m103
12787C9144L943N57N431p15m596O631R898m044o02M041j650m07r412N71K617n950
$$ plain form
12771 45457 40163 49681 53757 50603 51880 50915 51305 51176 51813 51644 49316 42976 39233 41300 38055 40290
12755 40290 47126 49875 48655 49971 52457 51987 57235 56180 56831 53831 51943 55079 53606 49420 45073
12740 45073 45290 43411 48216 54981 54966 49605 51206 51660 53871 50629 50354 52953 52369 52032 57846 60733
12724 60733 60155 56157 51954 52932 45142 43912 51581 51197 46425 47610 55593 58140 58333 60023 57945
12709 57945 57601 53085 59448 64991 57009 51281 47220 40576 49253 55207 50550 52829 57294 63991 64045
12694 64045 57723 47017 45424 46540 51811 46020 48506 55581 57228 55812 52806 50439 48856 41966
12680 41966 37554 40036 51768 56218 50904 53427 59946 60589 52356 50930 52355 55539 55676 58127 57645
12665 57645 55718 55743 52422 47682 52954 56219 54504 41320 39371 44883 52130 56332 58568 52279 54206
$$ packed form
12771D5457n294R518M076l154J277r65L90j29O37j69k328o340l743K067l245K235
12755D0290O836K749j220J316K486m70N248j055O51l000j888L136j473m186m347
12740D5073K17j879M805O765j5n361J601M54K211l242k75K599n84l37N814K887
12724F0733n78l998m203R78p790j230P669l84m772J185P983K547J93J690k078
12709E7945l44m516O363N543p982n728m061o644Q677N954m657K279M465O697N4
12694F4045o322j0706j593J116N271n791K486P075J647j416l006k367j583o890
12680D1966m412K482J1732M450n314K523O519O43q233j426J425L184J37K451m82
12665E7645j927K5l321m740N272L265j715j3184j949N512P247M202K236o289J927
$$ plain form
12650 54206 49814 46658 54277 53127 47209 49219 55575 58277 55060 52861 49939 50277 54464 49668 46611
12635 46611 47724 55174 54481 55031 55486 56075 60060 63616 64967 62013 58440 60695 58653 61086 61444 64186
12619 64186 65441 63409 56694 53946 60605 66756 62846 51123 55479 60576 61043 59206 59040 61966 69550
12604 69550 63913 51247 52140 53490 45959 49531 49958 56502 60830 64409 62641 60822 57806 57360 55127
12589 55127 58125 60402 57850 54197 55504 63464 67494 58161 56066 63998 66676 61303 56745 58499
12575 58499 54511 58627 59191 59755 61028 52725 54628 52465 51576 52308 50474 53378 56543 56047 55753 57974
12559 57974 66620 64080 52642 50786 54367 58141 61335 62355 60576 59684 54083 54308 50919 55250 60390
12544 60390 61406 58097 56131 60660 59340 58379 60724 54128 49546 57660 61292 56998 50591 46270 48244
$$ packed form
12650E4206m392l156P619j150n918K010O356K702l217k199k922L38M187m796l057
12635D6611J113P450o93N50M55N89L985L556J351k954l573K255k042K433L58K742
12619F4186J255k032o715k748O659O151l910j1723M356N097M67j837j66K926P584
12604F9550n637j2666Q93J350p531L572M27O544M328L579j768j819l016m46k233
12589E5127K998K277k552l653J307P960M030r333k095P932K678n373m558J754
12575E8499l988M116N64N64J273q303J903k163q89P32j834K904L165m96k94K221
12559E7974Q646k540j1438j856L581L774L194J020j779q92n601K25l389M331N140
12544F0390J016l309j966M529j320r61K345o596m582Q114L632m294o407m321J974
$$ plain form
12529 48244 52907 59158 58238 58481 59871 60030 64429 57942 57196 55216 53867 52736 53848 60742 66746
12514 66746 65506 69744 69646 67085 62963 54201 53171 60553 70131 68541 66121 58398 54207 49807 50329
12499 50329 55626 57416 52894 55527 58734 59294 56889 55890 54557 55525 61623 66857 63936 61717 59117
12484 59117 59017 59440 56853 60510 60623 56572 50975 49318 55716 60463 64783 61900 63568 56594 57204
12469 57204 54338 56492 61975 64828 63692 64404 65149 66807 65317 63686 62380 58552 56915 58611 61991
12454 61991 64129 62395 66749 69921 72303 71880 72353 67455 65568 63155 64110 64148 61997 67292 67022 67437
12438 67437 73649 77312 80986 81218 73970 64508 58519 55158 62938 74630 75418 74790 72230 69169 64592
12423 64592 67067 62726 66937 67405 62454 57555 51617 54344 54196 56876 56860 56567 54860 56403 61085 60884
$$ packed form
12529D8244M663O251r20K43J390J59M399o487p46j980j349j131J112O894O004
12514F6746j240M238r8k561m122q762j030P382R578j590k420p723m191m400N22
12499E0329N297J790m522K633L207N60k405r99j333R68O098N234k921k219k600
12484E9117j00M23k587L657J13m051n597j657O398M747M320k883J668o974O10
12469E7204k866K154N483K853j136P12P45J658j490j631j306l828j637J696L380
12454F1991K138j734M354L172K382m23M73m898j887k413R55L8k151N295k70M15
12438F7437O212L663L674K32p248r462n989l361P780J1692P88o28k560l061m577
12423F4592K475m341M211M68m951m899n938K727j48K680j6k93j707J543M682k01
$$ plain form
12407 60884 60777 59086 54199 53072 55315 59396 64861 63017 63690 65631 60734 57084 49687 52330 55283
12392 55283 53283 52098 56639 60477 67477 70377 67360 59932 52570 55115 54204 47692 51231 55164 60968
12377 60968 61849 61793 68330 73728 75852 71478 71773 66924 65246 64019 62158 71629 66672 58191 54697
12362 54697 61250 62667 52956 47711 56054 53728 60461 68844 70273 64270 57297 55683 61550 70660
12348 70660 68364 62846 63611 61162 58602 57748 60027 57882 60020 56948 50144 55346 59266 62852 62648
12333 62648 60596 60784 63961 60823 57971 59807 59353 55921 56360 53705 52467 57420 58693 58162 55015
12318 55015 56065 60376 66519 67340 59059 54979 51814 53623 52430 51498 54078 52380 47127 50791 57857
12303 57857 55315 59485 68454 66666 63465 57023 51524 47542 45270 48964 54870 58560 59592 62793
$$ packed form
12407F0884j07j691m887j127K243M081N465j844O73J941m897l650p397K643K953
12392E5283k000j185M541L838P000K900l017p428p362K545r11o512L539L933N804
12377F0968Q81n6O537N398K124m374K95m849j678j227j861R471m957q481l494
12362E4697O553J417r711n245Q343k326O733Q383J429o003o973j614N867R110
12348G0660k296n518P65k449k560q54K279k145K138l072o804N202L920L586k04
12333F2648k052J88L177l138k852J836m54l432M39k655j238M953J273n31l147
12318E5015J050M311O143Q21q281m080l165J809j193r32K580j698n253L664P066
12303E7857k542M170Q969j788l201o442n499l982k272L694N906L690J032L201
$$ plain form
12289 62793 59565 61750 66582 65882 58404 55882 59157 65175 62063 57360 57929 58349 48093 45239 50364
12274 50364 52884 51071 41191 45413 53259 59413 62527 60246 52278 53715 54815 55327 56115 60713 63302
12259 63302 66279 60217 57881 60478 68004 73645 69145 59475 51498 50060 50514 46256 51464 62204
12245 62204 67065 62321 58978 58319 55982 54386 56754 63556 63627 58959 51404 56644 68041 62178 59476
12230 59476 57833 58260 56356 59311 61696 60977 55512 57252 64135 71358 67862 58630 51919 53969 57150
12215 57150 66096 63259 60563 58794 57173 54216 54051 57163 56226 55006 57752 53405 51137 53452 55874
12200 55874 52219 47245 47977 52952 57043 58202 59867 51567 50404 55061 63489 63326 56843 56358 61057
12185 61057 69045 68380 69515 65837 60992 57157 57464 60437 58400 55255 49719 48465 50217 45719 46804
$$ packed form
12289F2793l228K185M832p00p478k522L275O018l112m703N69M20j0256k854N125
12274E0364K520j813r880M222P846O154L114k281p968J437J100N12P88M598K589
12259F3302K977o062k336K597P526N641m500r670p977j438M54m258N208J0740
12245F2204M861m744l343o59k337j596K368O802P1m668p555N240J1397n863k702
12230E9476j643M27j904K955K385p19n465J740O883P223l496r232o711K050L181
12215E7150Q946k837k696j769j621k957j65L112r37j220K746m347k268K315K422
12200E5874l655m974P32M975M091J159J665q300j163M657Q428j63o483m85M699
12185F1057P988o65J135l678m845l835L07K973k037l145n536j254J752m498J085
$$ plain form
12170 46804 51952 59957 64452 68421 74558 71282 66958 60792 56285 56688 57164 60457 64579 55242 47440
12155 47440 53845 57315 56324 55271 50801 52283 46214 40231 45352 52439 55410 63175 64689 60015 65116
12140 65116 64011 58879 58841 64424 63384 56471 50787 48340 50386 53095 60570 65046 62826 56725 53326
12125 53326 52483 56547 48425 42111 45201 49551 54118 57832 66624 61992 53327 45799 49840 54740 52471
12110 52471 55428 57276 57155 51851 56163 60505 60565 66412 65453 66239 68156 64115 62553 52997 38391
12095 38391 41909 47177 51427 59435 67396 67437 59036 55665 52962 48379 57067 63717 62519 58293 61187
12080 61187 63932 58542 50438 44746 44868 48696 46039 45064 43640 45808 45267 52492 57077 55790 49030
12065 49030 43511 42593 41650 51124 59606 59336 55557 51643 54648 57651 56240 58107 59573 55286 58852
$$ packed form
12170D6804N148Q005M495L969O137l276m324o166m507M03M76L293M122r337p802
12155D7440O405L470r91j053m470J482o069n983N121P087K971P765J514m674N101
12140F5116j105n132l8N583j040o913n684k447K046K709P475M476k220o101l399
12125E3326q43M064q122o314L090M350M567L714Q792m632q665p528M041M900k269
12110E2471K957J848j21n304M312M342O0N847r59P86J917m041j562r556j4606
12095C8391L518N268M250Q008P961M1q401l371k703m583Q688O650j198m226K894
12080F1187K745n390q104n692J22L828k657r75j424K168n41P225M585j287o760
12065D9030n519r18r43R474Q482k70l779l914L005L003j411J867J466m287L566
$$ plain form
12050 58852 61930 61414 58155 59737 57560 56708 54570 46977 48516 47424 54364 61745 59325 65114 66474
12035 66474 62072 55793 46446 52454 61724 65464 62690 60331 52592 51771 47038 47894 57864 54430 46893
12020 46893 49478 50085 47908 48545 46825 47657 47443 50669 57547 59789 62174 58110 59961 58757 60031
12005 60031 58500 52773 47149 54927 57548 58709 57664 54605 50590 47025 44683 45469 42983 43191 49204
11990 49204 53567 51695 49230 46642 42003 43363 43912 47419 49393 50473 51601 51119 49777 52756 50295
11975 50295 47589 49737 53445 48606 39174 44085 50855 53129 49444 52726 53045 47210 47541 45129 43326
11960 43326 39431 38786 41165 41721 47841 45185 45453 50626 49284 54517 55618 52620 52707 47990 53751 51910
11944 51910 49664 48366 48698 47958 48023 48304 51850 45949 43108 39959 38411 39253 42671 44722 47309 44658
$$ packed form
12050E8852L078n16l259J582k177q52k138p593J539j092O940P381k420N789J360
12035F6474m402o279r347O008R270L740k774k359p739q21m733Q56R970l434p537
12020D6893K585O07k177O37j720Q32k14L226O878K242K385m064J851j204J274
12005F0031j531n727n624P778K621J161j045l059m015l565k342P86k486K08O013
11990D9204M363j872k465k588m639J360N49L507J974J080J128m82j342K979k461
11975E0295k706K148L708m839r432M911O770K274l685L282L19n835L31k412j803
11960D3326l895o45K379N56O120k656K68N173j342N233J101k998Q7m717N761j841
11944E1910k246j298L32p40O5K81L546n901k841l149j548Q42L418K051K587k651
$$ plain form
11928 44658 43928 42797 37315 35431 30795 29580 39688 40110 37709 40201 38767 42337 46632 50358 51849
11913 51849 49314 43303 43163 44632 38644 33129 39981 41404 39275 43178 47756 51791 56245 52615 53285
11898 53285 45534 39459 39967 40769 49039 52499 43502 42805 40403 41649 43668 40457 40701 42372 40208
11883 40208 38002 37100 35208 39913 44050 45299 43689 40829 43209 44493 39309 32707 33853 34384 30712
11868 30712 31593 34899 34285 34203 43611 46341 47016 46085 43437 33975 31045 29417 30173 35643 39864 36776
11852 36776 34141 31392 29880 31047 28229 26517 35787 37474 36299 40115 49695 53728 51781 45682
11838 45682 40332 27193 27983 34760 40905 41047 41074 36811 40411 39660 36447 32570 43496 44360 42629
11823 42629 40970 39377 35854 32989 35090 31376 35644 37256 36870 35727 39462 42706 42171 39259 40325
$$ packed form
11928D4658p30j131n482j884m636j215J0108M22k401K492j434L570M295L726J491
11913E1849k535o011j40J469n988n515O852J423k129L903M578M035M454l630O70
11898E3285p751o075N08Q02Q270L460q997o97k402J246K019l211K44J671k164
11883D0208k206r02j892M705M137J249j610k860K380J284n184o602J146N31l672
11868C0712Q81L306o14q2R408K730O75r31k648r462k930j628P56N470M221l088
11852C6776k635k749j512J167k818j712R270J687j175L816R580M033j947o099
11838D5682n350j3139P90O777O145J42K7m263L600p51l213l877J0926Q64j731
11823D2629j659j593l523k865K101l714M268J612l86j143L735L244n35k912J066
$$ plain form
11808 40325 36901 39645 43023 39572 40433 40394 40266 47661 50487 47508 48992 42274 31255 32260 36606
11793 36606 42134 47128 53198 46264 38163 38279 40207 37173 37582 40220 39452 44495 47651 41085 32219
11778 32219 27002 33250 37840 35725 31204 25077 20357 23233 25467 29923 28299 25815 27829 29659
11764 29659 26545 34836 38336 35685 37386 35928 40092 40038 39981 45844 44417 40954 38495 36889 37585 35401
11748 35401 40871 40963 41659 44930 44781 39616 34235 33643 32789 39455 36090 34204 34141 32497 30016 32229
11732 32229 28790 23927 24854 23001 28538 25346 30628 36426 35163 25640 14040 17582 25706 28366
11718 28366 24960 24287 32263 36337 38083 39524 38604 41626 42530 42451 42178 38502 31785 21370 26673 32252
11702 32252 30090 22561 16763 17801 20632 20125 17629 15792 17208 18908 23450 23847 20782 24133 26644
$$ packed form
11808D0325l424K744L378l451Q61l9j28P395K826k979J484o718j1019J005M346
11793C6606N528M994O070o934q101J16J928l034M09K638p68N043L156o566q866
11778C2219n217O248M590k115m521o127m720K876K234M456j624k484K014J830
11764B9659l114Q291L500k651J701j458M164n4n7N863j427l463k459j606O96k184
11748C5401N470R2O96L271j49n165n381n92q54O666l365j886o3j644k481K213
11732C2229l439m863R27j853N537l192N282N798j263r523j1600L542Q124K660
11718B8366l406o73P976M074J746J441r20L022R04p9k73l676o717j0415N303N579
11702C2252k162p529n798J038K831n07k496j837J416J700M542L97l065L351K511
$$ plain form
11687 26644 24729 30076 39419 40245 37901 26199 22880 25534 32958 33403 31839 37806 40651 40260 38505
11672 38505 28264 18003 20280 24532 21761 14331 15453 18877 20077 29661 29870 31029 32190 35066
11658 35066 30798 21397 21779 22222 18801 13061 15906 25518 29402 36567 41886 35870 34491 33486 30843
11643 30843 29006 22907 21216 23683 22869 21650 24993 33669 36460 28911 23134 20391 12831 12955 20370
11628 20370 28226 31572 24575 19902 22990 22429 23303 17595 17717 16399 17234 21370 25610 26567 26228 29156
11612 29156 24273 24520 26060 20481 21958 20497 18337 17416 16715 16179 11752 13336 17842 13849 14866
11597 14866 22816 26295 24062 21537 18062 23201 19609 15347 18953 19375 19151 22304 25157 20020 13295
11582 13295 9353 10026 17807 21574 18846 17785 16208 20487 16630 18556 23970 19031 20880 20182 17252
$$ packed form
11687B6644j915N347R343Q26k344j1702l319K654P424M45j564N967K845l91j755
11672C8505j0241j0261K277M252k771p430J122L424J200R584K09J159J161K876
11658C5066m268r401L82M43l421n740K845R612L884P165N319o016j379j005k643
11643C0843j837o099j691K467q14j219L343Q676K791p549n777k743p560J24P415
11628B0370P856L346o997m673L088n61Q74n708J22j318Q35M136M240R57l39K928
11612B9156m883K47J540n579J477j461k160r21p01n36m427J584M506l993J017
11597A4866P950L479k233k525l475N139l592m262L606M22k24L153K853n137o725
11582A3295l942O73P781L767k728j061j577M279l857J926N414m939J849o98k930
$$ plain form
11567 17252 15163 13594 10295 4842 3530 8823 8798 4625 5166 11523 16205 15524 9473 9345 15079 17902
11551 17902 20228 19994 14251 6007 5724 12712 7394 -838 -1209 2294 7942 10104 7123 4947 3866
11536 3866 8103 6018 8837 6280 4381 8396 14952 13684 10475 7082 -94 -557 -1828 16 4900
11521 4900 6788 5490 -2965 -5372 4425 13517 15448 10730 6776 8533 6218 -5936 -1415 1661
11507 1661 -1049 2812 3318 -1283 -3641 6207 9206 3233 1433 5005 4183 10324 12129 7190 5804
11492 5804 3318 3554 1994 3473 4424 622 5537 7382 6741 3134 6215 8014 3552 3873 13797 16771
11476 16771 14200 11856 11102 5318 4632 1164 -1763 -2505 3653 362 1382 7541 13225 12303 12221 12100
11460 12100 13069 6630 920 -7959 -2256 1981 -7094 -12131 -7142 -5282 -1639 -507 610 1565 2984
$$ packed form
11567A7252k089j569l299n453j312N293k5m173N41O357M682o81o051j28N734K823
11551A7902K326k34n743q244k83O988n318q232l71L503N648K162k981k176j081
11536C866M237k085K819k557j899M015O556j268l209l393p176m63j271J844M884
11521D900J888j298q455k407R797R092J931m718l954J757k315j2154M521L076
11507A661k710L861N06m601k358R848K999n973j800L572q22O141J805m939j386
11492E804k486K36j560J479R51l802M915J845o41l607L081J799m462L21R924K974
11476A6771k571k344p54n784o86l468k927p42O158l291J020O159N684r22q2j21
11460A2100R69o439n710q879N703M237r075n037M989J860L643J132J117R55J419
$$ plain form
11445 2984 1745 -3975 -5240 -1322 -171 5494 -334 -4376 -5217 -7501 -12106 -13066 -10317 -12233 -5368
11430 -5368 -7696 -8967 -13380 -17243 -11992 -2186 -7593 -8525 -10010 -8999 -12407 -5771 -1446 -2765 -2945
11415 -2945 1366 -103 -6082 -10462 -12021 -11600 -7597 601 -44 -5403 -3367 -5698 631 -5913 -17047
11400 -17047 -15516 -10853 -8410 -10961 -10037 -8256 -14864 -18192 -20557 -19666 -25385 -21736 -23813 -23164 -21397
11385 -21397 -20879 -25587 -19090 -15677 -16354 -18528 -19871 -18626 -19415 -16555 -22884 -21021 -17157 -13633 -10532
11370 -10532 -8463 -3956 -8428 -6720 -5871 -8916 -14993 -16325 -11892 -6464 -2574 -3848 -5014 -5375 -8852
11355 -8852 -14382 -10823 -7929 -9052 -4673 -2995 -9302 -13110 -15522 -23298 -23214 -18680 -24594 -26016 -22847
11340 -22847 -22873 -22484 -24263 -21897 -26266 -23555 -26985 -25245 -26486 -18545 -18089 -19068 -18835 -19782 -24484 -26269
$$ packed form
11445B984j239n720j265L918J151N665n828m042q41k284m605r60K749j916O865
11430e368k328j271m413l863N251R806n407r32j485J011l408O636M325j319j80
11415b945M311j469n979m380j559M21M003Q198o45n359K036k331O329o544j1134
11400a7047J531M663K443k551R24J781o608l328k365Q91n719L649k077O49J767
11385b1397N18m708O497L413o77k174j343J245p89K860o329J863L864L524L101
11370a0532K069M507m472J708Q49l045o077j332M433N428L890j274j166l61l477
11355h852n530L559K894j123M379J678o307l808k412p776Q4M534n914j422L169
11340b2847k6L89j779K366m369K711l430J740j241P941M56r79K33r47m702j785
$$ plain form
11324 -26269 -16315 -14901 -16049 -21398 -22908 -26658 -33444 -24830 -21991 -21059 -20498 -18278 -14456 -13450 -15320
11309 -15320 -12021 -12520 -15711 -13582 -10667 -9279 -4983 -5525 -4762 -7998 -12847 -12063 -10779 -5918 -3290
11294 -3290 -9383 -5237 -12955 -17450 -12233 -7494 -11459 -17604 -20129 -23458 -30959 -32135 -26675 -23475 -26208
11279 -26208 -23888 -23217 -26592 -21206 -19143 -19327 -16394 -16324 -19904 -26754 -28381 -30447 -24477 -24715 -34130 -33334
11263 -33334 -32202 -29293 -31586 -35502 -30373 -31068 -37746 -41633 -38723 -37311 -39261 -39367 -35788 -29898 -28477
11248 -28477 -33091 -42196 -44693 -41101 -35493 -25970 -27209 -31890 -33976 -34417 -32907 -34400 -36292 -40821 -37022
11233 -37022 -38464 -38002 -30787 -28777 -21299 -31495 -38438 -37139 -31615 -28914 -33497 -37571 -43570 -39100
11219 -39100 -39161 -40084 -39259 -40644 -37919 -34717 -37709 -39717 -42054 -35789 -32885 -28601 -27491 -34663 -39167
$$ packed form
11324b6269R954J414j148n349j510l750o786Q614K839R32N61K220L822J006j870
11309a5320L299m99l191K129K915J388M296n42P63l236m849P84J284M861K628
11294c290o093M146p718m495N217M739l965o145k525l329p501j176N460L200k733
11279b6208K320O71l375N386K063j84K933P0l580o850j627k066N970k38r415P96
11263c3334J132K909k293l916N129o95o678l887K910J412j950j06L579N890J421
11248b8477m614r105k497L592N608R523j239m681k086m41J510j493j892m529L799
11233c7022j442M62P215K010P478j0196o943J299N524K701m583m074n999M470
11219c9100o1r23Q25j385K725L202k992k008k337O265K904M284J110p172m504
$$ plain form
11204 -39167 -40219 -38521 -38645 -39472 -35854 -37901 -36425 -39979 -43135 -43400 -51210 -54777 -50219 -44590 -45431
11189 -45431 -46761 -42523 -42955 -36897 -30412 -33232 -31525 -33947 -44545 -43776 -36769 -35041 -38841 -47327 -53848
11174 -53848 -49626 -44333 -41442 -41879 -46514 -49818 -56542 -56604 -52977 -54154 -50865 -45964 -46790 -44751 -46627
11159 -46627 -53200 -48797 -48375 -50535 -55415 -53098 -50837 -47065 -42299 -47362 -43397 -40867 -45378 -53245 -56087
11144 -56087 -59790 -66231 -70766 -67493 -64319 -65235 -63971 -61167 -50407 -40321 -44049 -52671 -55104 -53090
11130 -53090 -41446 -38066 -35664 -36850 -39862 -47973 -48547 -58539 -61297 -59505 -58793 -59995 -60832 -57674 -56711
11115 -56711 -55729 -59209 -61182 -61602 -61689 -63802 -64672 -66433 -66156 -61613 -57527 -51554 -50417 -52692 -55915 -51554
11099 -51554 -42623 -49470 -53053 -54862 -53806 -55069 -54127 -50214 -49095 -49524 -48824 -46493 -53081 -65304 -68880
$$ packed form
11204c9167j052J698j24q27L618k047J476l554l156k65p810l567M558N629q41
11189d5431j330M238m32O058O485k820J707k422j0598P69P007J728l800q486o521
11174e3848M222N293K891m37m635l304o724o2L627j177L289M901q26K039j876
11159d6627o573M403M22k160m880K317K261L772M766n063L965K530m511p867k842
11144e6087l703o441m535L273L174r16J264K804J0760J0086l728q622k433K014
11130e3090J1644L380K402j186l012q111n74r992k758J792P12j202q37L158R63
11115e6711R82l480j973m20q7k113q70j761K77M543M086N973J137k275l223M361
11099e1554Q931o847l583j809J056j263R42L913J119m29P00K331o588j2223l576
$$ plain form
11084 -68880 -65071 -65098 -65377 -59929 -51455 -49022 -57152 -56209 -48140 -45743 -44205 -43031 -44811 -51693 -53900
11069 -53900 -51085 -48674 -54722 -57490 -48719 -40070 -37230 -33890 -41550 -42279 -46412 -50131 -44724 -40765 -36813
11054 -36813 -35672 -30915 -24527 -11885 1417 9794 18676 25493 47997 73836 87216 98219 98505
11041 98505 100750 101638 102120 110885 124629 147066 182409 226974 270812 301427 305058 279196 237299
11028 237299 206429 190782 197572 215585 245994 294669 346874 395579 424496 412231 360217 306170
11016 306170 255259 214734 190851 183859 193620 214414 247000 277180 284559 258365 216960 172213
11004 172213 132851 106774 93018 84215 81654 82783 86830 88751 81189 62443 37116 13517 -6284
10991 -6284 -18172 -36691 -52415 -62185 -66717 -68371 -65891 -66269 -66903 -68654 -72879 -76785 -89792 -86874
$$ packed form
11084f8880L809k7k79N448Q474K433q130R43Q069K397J538J174j780o882k207
11069e3900K815K411o048k768Q771Q649K840L340p660p29m133l719N407L959L952
11054c6813J141M757O388J2642J3302Q377Q882O817K2504K5839J3380J1003K86
11041I8505K245Q88M82Q765J3744K2437L5343M4565M3838L0615L631k5862m1897
11028B37299l0870j5647O790J8013L0409M8675N2205M8705K8917j2265n2014n4047
11016C06170n0911m0525k3883o992R761K0794L2586L0180P379k6194m1405m4747
11004A72213l9362k6077j3756q803k561J129M047J921p562j8746k5327k3599j9801
10991f284j1888j8519j5724r770m532j654K480l78o34j751m225l906j3007K918
$$ plain form
10977 -86874 -76096 -66488 -66120 -67739 -74788 -80797 -78334 -71853 -67435 -67387 -63386 -49000 -34774 -24739
10963 -24739 -19034 -16381 -29376 -38979 -40736 -36390 -28115 -30388 -37858 -36135 -28410 -18615 -16126 -19701
10949 -19701 -17404 -15216 -18330 -13340 -3705 276 -3674 -10456 -19133 -22338 -23860 -17698 -9372 -5917
10935 -5917 -903 3646 19079 39536 63974 84312 99811 134612 201389 282148 384654 541715
10923 541715 753708 1022689 1358131 1704544 1877279 1822444 1727502 1715548 1804052 1896996
10913 1896996 1780079 1444731 1083435 796665 576158 422274 315192 235485 177908 138145
10903 138145 103862 71695 43953 28377 13169 1855 -17878 -25177 -30895 -39889 -45280 -52865
10891 -52865 -61990 -67340 -73807 -80446 -79961 -90395 -95888 -97763 -98985 -100251 -98398 -97579 -95242 -92829 -96103
$$ packed form
10977h6874J0778R608L68j619p049o009K463O481M418M8M001J4386J4226J0035
10963b4739N705K653j2995r603j757M346Q275k273p470J723P725R795K489l575
10949a9701K297K188l114M990R635L981l950o782q677l205j522O162Q326L455
10935e917N014M549J5433K0457K4438K0338J5499L4801O6777Q0759J02506J57061
10923E41715K11993K68981L35442L46413J72735n4835r4942j1954Q8504R2944
10913A896996j16917l35348l61296k86770k20507j53884j07082p9707n7577l9763
10903A38145l4283l2167k7742j5576j5208j1314j9733p299n718q994n391p585
10891e2865r125n350o467o639M85j0434n493j875j222j266J853Q19K337K413l274
$$ plain form
10876 -96103 -105115 -106381 -103794 -105189 -97001 -91531 -89099 -86658 -85430 -82070 -69280 -67575 -59301 -54611
10862 -54611 -54003 -53102 -54601 -57830 -59657 -59873 -58872 -50785 -50228 -60072 -67624 -63919 -59710 -59254 -57191 -62396
10846 -62396 -64349 -64353 -63460 -63795 -61482 -59863 -58530 -52122 -42169 -47930 -51176 -54740 -62029 -69946 -69407 -74513
10830 -74513 -78741 -69225 -63545 -65970 -67812 -68751 -69273 -65523 -63154 -66119 -78473 -89934 -88470 -91244
10816 -91244 -92567 -104851 -122341 -143294 -165094 -180409 -176910 -172774 -181807 -200681 -214126 -217795 -203583
10803 -203583 -190189 -182558 -173050 -158973 -156577 -158525 -156600 -156898 -149936 -138762 -127350 -130142 -133413
10790 -133413 -125845 -122065 -120829 -119416 -121394 -124079 -128397 -132864 -130794 -129237 -123993 -105441 -96201 -86765
10776 -86765 -81979 -60585 -31599 -13052 1660 12964 21654 31595 45830 60488 75501 79115
$$ packed form
10876i6103r012j266K587j395Q188N470K432K441J228L360J2790J705Q274M690
10862e4611O08R01j499l229j827k16J001Q087N57r844p552L705M209M56K063n205
10846f2396j953mQ93l35K313J619J333O408R953n761l246l564p289p917N39n106
10830g4513m228R516N680k425j842r39n22L750K369k965j2354j1461J464k774
10816i1244j323j2284j7490k0953k1800j5315L499M136r033j8874j3445l669J4212
10803b03583J3394P631R508J4077K396j948J925k98O962J1174J1412k792l271
10790a33413P568L780J236J413j978k685m318m467K070J557N244J8552R240R436
10776h6765M786K1394K8986J8547J4712J1304Q690R941J4235J4658J5013L614
$$ plain form
10764 79115 80863 78228 71602 62262 55332 48584 46829 57939 62769 47560 36331 25944 18146
10751 18146 24035 17702 177 -19475 -42541 -69110 -96123 -119768 -127704 -129230 -140120 -139273 -140484
10738 -140484 -150210 -157002 -156317 -158891 -164421 -168812 -183699 -192397 -198197 -202700 -222668 -242565 -267136
10725 -267136 -277520 -281314 -284646 -273962 -262946 -254782 -252896 -256506 -269604 -292380 -322308 -347187
10713 -347187 -369818 -375593 -352228 -315864 -297773 -297760 -317366 -338108 -348779 -352034 -338680 -327277
10701 -327277 -326696 -321070 -312351 -297431 -263626 -227610 -197847 -193186 -205473 -226277 -234395 -231735 -226771
10688 -226771 -208307 -182579 -174989 -181620 -180416 -188146 -191095 -191403 -187025 -176990 -165038 -165414 -175434
10675 -175434 -179460 -155512 -134706 -124879 -120254 -100072 -90583 -74721 -57873 -52311 -54645 -54092 -48917
$$ packed form
10764G9115J748k635o626r340o930o748j755J1110M830j5209j1229j0387p798
10751A8146N889o333j7525j9652k3066k6569k7013k3645p936j526j0890Q47j211
10738a40484r726o792O85k574n530m391j4887q698n800m503j9968j9897k4571
10725b67136j0384l794l332J0684J1016Q164J886l610j3098k2776k9928k4879
10713c47187k2631n775K3365L6364J8091J3j9606k0742j0671l255J3354J1403
10701c27277N81N626Q719J4920L3805L6016K9763M661j2287k0804q118K660M964
10688b26771J8464K5728P590o631J204p730k949l08M378J0035J1952l76j0020
10675a75434m026K3948K0806R827M625K0182R489J5862J6848N562k334N53N175
$$ plain form
10662 -48917 -33073 -12345 10258 22050 41785 59474 78406 94361 112158 134999 169937 210202
10650 210202 256502 320952 389553 468075 506642 488095 452258 413193 367169 332602 329339 360113
10638 360113 405828 425699 393797 429130 643717 1111485 1895986 2793254 3435641 3555409
10628 3555409 3281650 2997952 2970795 3210022 3676334 4402642 5463921 6947104 8972766
10619 8972766 11627123 14674781 17751773 21033188 24584008 27688257 29358721 29322640
10611 29322640 28302489 27310322 27131747 28264773 30955838 35195085 40897945 48001382
10603 48001382 55727876 61770313 63449023 60491500 55218171 50182611 46902389 46072739
10595 46072739 48004874 52847051 60486446 70254570 80263290 86888212 86532798 79476058
$$ packed form
10662d8917J5844K0728K2603J1792J9735J7689J8932J5955J7797K2841L4938M0265
10650B10202M6300O4450O8601P8522L8567j8547l5837l9065m6024l4567l263L0774
10638C60113M5715J9871l1902L5333K14587M67768P84501Q97268O42387J19768
10628C555409k73759k83698k7157K39227M66312P26308J061279J483183K025662
10619H972766K654357L047658L076992L281415L550820L104249J670464l6081
10611B9322640j020151r92167j78575J133026K691065M239247N702860P103437
10603D8001382P726494O042437J678710k957523n273329n035560l280222q29650
10595D6072739J932135M842177P639395R768124J0008720O624922l55414p056740
$$ plain form
10587 79476058 69472939 59994763 52820472 48504289 47044271 48246008 51751256 56779794
10579 56779794 61746302 64082174 61635321 54951724 46712326 39227897 33545512 29839525
10571 29839525 27903808 27416989 28018204 29194255 30163465 29940803 27843945 24201560 20025628
10562 20025628 16153451 12978356 10531240 8700417 7348397 6361710 5620379 5043969
10554 5043969 4594549 4250762 3994059 3813464 3670536 3568071 3495848 3461264 3456102 3482743
10544 3482743 3541147 3633802 3753452 3893418 4057578 4269489 4537226 4866186 5289331 5833918
10534 5833918 6509520 7318525 8246598 9155375 9859150 10544163 11425883 12622997 14140525
10525 14140525 15790758 17480539 19527715 22241919 25862063 30627358 36802739 45025960
$$ packed form
10587G9476058j0003119r478176p174291m316183j460018J201737L505248N028538
10579E6779794M966508K335872k446853o683597q239398p484429n682385l705987
10571B9839525j935717m86819O01215J176051R69210k22662k096858l642385m175932
10562B0025628l872177l175095k447116j830823j352020r86687p41331n76410
10554E043969m49420l43787k56703j80595j42928j02465p2223l4584n162K6641
10544C482743N8404R2655J19650J39966J64160K11911K67737L28960M23145N44587
10534E833918O75602Q09005R28073R08777P03775O85013Q81720J197114J517528
10525A4140525J650233J689781K047176K714204L620144M765295O175381Q223221
$$ plain form
10517 45025960 56563316 73157013 97044041 130509778 175447822 233957824 304877819
10510 304877819 365164950 372598659 345767969 326558793 332258172 359862317 376005753
10503 376005753 337912031 268837886 203354162 152820447 116569841 91014712 72933817
10496 72933817 60010616 50590774 43423169 37593058 32722110 28764523 25673784 23293247
10488 23293247 21470827 20045211 18668788 17213175 15912613 14900059 14148425 13514276
10480 13514276 12699325 11714615 10770534 9935234 9222775 8626037 8118058 7672435 7280408
10471 7280408 6955190 6685388 6433865 6187220 5950011 5714014 5491038 5290594 5095264
10462 5095264 4910724 4739401 4585044 4451973 4335357 4219588 4110005 3991428 3843839
$$ packed form
10517D5025960J1537356J6593697K3887028L3465737M4938044N8510002P0919995
10510C04877819O0287131P433709k6830690j9209176N699379K7604145J6143436
10503C76005753l8093722o9074145o5483724n0533715l6250606k5555129j8080895
10496G2933817j2923201r419842p167605n830111m870948l957587l090739k380537
10488B3293247j822420j425616j376423j455613j300562j012554p51634o34149
10480A3514276q14951r84710r44081q35300p12459n96738n07979m45623l92027
10471G280408l25218k69802k51523k46645k37209k35997k22976k00444j95330
10462E095264j84540j71323j54357j33071j16616j15769j09583j18577j47589
$$ plain form
10453 3843839 3682405 3536827 3414686 3304950 3203855 3109976 3036803 2981185 2913343 2832812
10443 2832812 2743279 2666103 2597256 2531106 2472009 2425960 2388722 2353576 2315915 2274819 2233553
10432 2233553 2189209 2149835 2110374 2073687 2033191 1993631 1963052 1917007 1873917 1841325 1809222
10421 1809222 1786557 1768704 1749352 1719816 1691769 1666410 1654526 1650227 1639217 1617435 1589735
10410 1589735 1566674 1552646 1543680 1525303 1511007 1487354 1456020 1430096 1413207 1408341 1397245 1386215
10398 1386215 1368687 1365283 1371819 1382392 1409579 1439822 1492389 1586785 1730222 1914213 2101068
10387 2101068 2250051 2298404 2284168 2300918 2378982 2477146 2508155 2425113 2270527 2084761 1883379
10376 1883379 1707106 1550523 1446779 1391159 1319215 1205744 1087030 984381 906542 854231
$$ packed form
10453C843839j61434j45578j22141j09736j01095r3879p3173n5618o7842q0531
10443B832812q9533p7176o8847o6150n9097m6049l7238l5146l7661m1096m1266
10432B233553m4344l9374l9461l6687m0496l9560l0579m6045m3090l2592l2103
10421A809222k2665j7853j9352k9536k8047k5359j1884m299j1010k1782k7700
10410A589735k3061j4028q966j8377j4296k3653l1334k5924j6889m866j1096j1030
10398A386215j7528l404O536J0573K7187L0243N2567R4396J43437J83991J86855
10387B101068J48983M8353j4236J6750P8064R8164L1009q3042j54586j85766k01382
10376A883379j76273j56583j03744n5620p1944j13471j18714j02649p7839n2311
$$ plain form
10366 854231 823569 802860 786078 774104 762172 751629 746570 738761 728418 716322 708223 702234
10354 702234 699389 689334 687218 690945 684241 672251 656026 648402 647204 647041 648946 648924 647986 648070 651985
10339 651985 654340 652767 641268 630383 627461 631553 627448 617050 602542 583215 570687 560927 548594
10326 548594 544360 546681 547585 542347 537550 528524 511291 498999 521700 552295 569533 577007 560782
10313 560782 537042 543267 569215 593137 601020 585466 554971 531177 526647 527343 534786 542278 544362
10300 544362 536697 525099 511517 501193 496822 500185 506925 506383 504171 511587 513877 509314 511107 504054
10286 504054 496958 494313 490636 496270 495701 488526 476460 474100 477685 484570 488709 484640 477332 471141
10272 471141 467592 472463 475284 477881 482498 482417 471722 465932 466631 466224 463986 452590 444640 441718 433734
$$ packed form
10366H54231l0662k0709j6782j1974j1932j0543n059p809j0343j2096q099n989
10354G02234k845j0055k116L727o704j1990j6225p624j198j63J905k2r38Q4L915
10339F51985K355j573j1499j0885k922M092m105j0398j4508j9327j2528r760j2333
10326E48594m234K321R04n238m797r026j7233j2292K2701L0595J7238P474j6225
10313E60782k3740O225K5948K3922P883j5554l0495k3794m530O96P443P492K084
10300E44362p665j1598j3582j0324m371L363O740n42k212P416K290m563J793p053
10286E04054p096k645l677N634n69p175j2066k360L585O885M139m069p308o191
10272D71141l549M871K821K597M617q1j0695n790O99m07k238j1396p950k922p984
$$ plain form
10257 433734 432926 437607 428456 421341 418863 408192 410342 413971 413770 408473 406326 398642 386257 389291
10243 389291 399828 405791 404018 403810 403650 401234 401047 400691 405130 411910 412472 412492 418872 419954 412203 402378
10227 402378 396340 394421 389182 386328 388612 384147 380295 377354 379473 381776 390664 397825 399048 400954
10213 400954 399185 399542 398063 407157 414297 412382 407047 399628 390783 391741 398531 393166 374576 348406
10199 348406 331442 329955 331878 325703 320439 316288 320026 318174 314852 319443 319841 317613 319121 322825
10185 322825 323316 328000 335004 346237 361370 376621 389274 412278 423308 426680 428842 429186 424757
10172 424757 430469 436238 452567 478359 514166 550930 589555 617734 630601 604693 563648 524003
10160 524003 504593 509313 526440 557299 600679 643927 696169 725472 713154 666886 607470 551991
$$ packed form
10257D33734q08M681r151p115k478j0671K150L629k01n297k147p684j2385L034
10243C89291J0537N963j773k08j60k416j87l56M439O780N62K0O380J082p751r825
10227D02378o038j919n239k854K284m465l852k941K119K303Q888P161J223J906
10213D00954j769L57j479R094P140j915n335p419q845R58O790n365j8590k6170
10199C48406j6964j487J923o175n264m151L738j852l322M591L98k228J508L704
10185C22825M91M684P004J1233J5133J5251J2653K3004J1030L372K162L44m429
10172D24757N712N769J6329K5792L5807L6764L8625K8179J2867k5908m1045l9645
10160E24003j9410M720J7127L0859M3380M3248N2242K9303j2318m6268n9416n5479
$$ plain form
10148 551991 515840 502122 504694 512618 533402 563972 590677 601098 592953 556229 506187 468929
10136 468929 444337 428748 417617 418793 430319 430756 429107 424998 412190 386897 365172 348043
10124 348043 329398 316405 302617 303230 303334 304768 306945 307267 307850 311397 320043 328794 335345 333998
10110 333998 340013 344439 358184 367227 377928 405786 440725 475933 523529 603442 715708 862137
10098 862137 1069461 1351013 1700283 2071529 2264930 2204450 2085294 2049565 2123600 2219596
10088 2219596 2118375 1797888 1446454 1162627 946915 783358 670588 588601 529277 481212
10078 481212 438678 411801 390083 363793 338559 322448 307094 292161 276475 255677 242873
10067 242873 232039 224021 216757 205753 199193 200638 212617 218594 219310 219981 216386 212162 209781 208995
$$ packed form
10148E51991l6151j3718K572P924K0784L0570K6705J0421q145l6724n0042l7258
10136D68929k4592j5589j1131J176J1526M37j649m109j2808k5293k1725j7129
10124C48043j8645j2993j3788O13J04J434K177L22N83L547Q646Q751O551j347
10110C33998O015M426J3745R043J0701K7858L4939L5208M7596P9913J12266J46429
10098H62137K07324K81552L49270L71246J93401o0480j19156l5729P4035R5996
10088B219596j01221l20487l51434k83827k15712j63557j12770q1987n9324m8065
10078D81212m2534k6877k1718k6290k5234j6111j5354j4933j5686k0798j2804
10067B42873j0834q018p264j1004o560J445J1979N977P16O71l595m224k381p86
$$ plain form
10053 208995 205950 200752 194105 192933 198841 205088 211839 215106 214848 212618 214026 218490 225388 231201
10039 231201 230868 228097 220363 217204 214565 214847 222768 222256 222984 222904 217914 212065 214894 214189 214936 209380
10023 209380 200726 193988 188187 188150 187418 188659 188491 190466 190633 193488 192084 192248 194108 193415 195195 197345
10007 197345 198134 189457 187674 183538 180038 178861 176613 175679 176625 179395 188544 186026 182175 181398 176287
9992 176287 168572 166719 176705 175606 167033 169641 175179 183895 182235 175268 168582 162891 174535 184975
9978 184975 180094 170660 170874 185603 192609 191581 188274 184079 182785 175289 176635 179376 182464 183586
9964 183586 183926 179013 182560 179559 172117 171786 178672 178854 178062 177979 173199 169267 171439 177061 172555 166421
9948 166421 159958 159677 160416 159784 151281 155440 157204 150972 149276 150632 153333 155077 155519 151394 153798
$$ packed form
10053B08995l045n198o647j172N908O247O751L267k58k230J408M464O898N813
10039B31201l33k771p734l159k639K82P921n12P28q0m990n849K829p05P47n556
10023B09380q654o738n801l7p32J241j68J975J67K855j404J64J860o93J780K150
10007A97345P89q677j783m136l500j177k248r34R46K770R149k518l851p77n111
9992A76287p715j853R986j099q573K608N538Q716j660o967o686n691J1644J0440
9978A84975m881r434K14J4729P006j028l307m195j294p496J346K741L088J122
9964A83586L40m913L547l001p442l31O886J82p92q3m780l932K172N622m506o134
9948A66421o463k81P39o32q503M159J764o232j696J356K701J744M42m125K404
$$ plain form
9933 153798 154008 155662 158870 154607 149723 153738 150991 145567 144995 148582 141354 140491 140848 142485 142749 144346
9917 144346 138982 139201 141559 147710 151541 149908 146359 144999 144451 148804 147316 143707 142692 138084 139562
9902 139562 146000 152480 152622 148622 142903 143190 144537 151400 155420 151492 145739 141070 139722 135571 132198
9887 132198 129176 129816 132246 130655 130566 131746 133973 134382 139782 150812 152601 155472 156947 164234 163701
9872 163701 158025 151653 148341 147191 141834 134972 134194 142778 153290 151030 141742 139791 134210 133514 143501
9857 143501 146830 148012 151999 157378 156285 157199 150385 143310 140220 144098 147590 150169 151669 150541 145605
9842 145605 134160 128540 135390 144414 139081 132298 133576 130108 128674 137855 139884 134266 130308 129220
9828 129220 128529 128731 137142 140306 138492 135253 136568 133763 127997 125997 128502 130080 132863 137208 135042
$$ packed form
9933A53798K10J654L208m263m884M015k747n424n72L587p228q63L57J637K64J597
9917A44346n364K19K358O151L831j633l549j360n48M353j488l609j015m608J478
9902A39562O438O480J42m000n719K87J347O863M020l928n753m669j348m151l373
9887A32198l022O40K430j591q9J180K227M09N400J1030J789K871J475P287n33
9872A63701n676o372l312j150n357o862p78Q584J0512k260r288j951n581o96R987
9857A43501L329J182L987N379j093R14o814p075l090L878L492K579J500j128m936
9842A45605j1445n620O850R024n333o783J278l468j434R181K029n618l958j088
9828A29220o91K02Q411L164j814l239J315k805n766k000K505J578K783M345k166
$$ plain form
9813 135042 134723 132407 124866 120373 123267 121213 118536 121282 126329 132512 132566 128141 134514 132700 129339
9798 129339 128958 131790 132790 133550 134415 131075 123813 122322 122204 117799 120767 124615 123880 128984 136415 133392
9782 133392 125642 120202 117011 114852 114862 111969 113595 115322 120753 122178 120405 116525 113604 117855 118901
9767 118901 122463 119002 115091 108848 108834 115528 113434 111353 108378 111220 113951 115149 111341 118961 122939
9752 122939 116762 113345 106821 107390 113998 117934 115015 111922 106480 107095 115160 119641 121639 125796 118293
9737 118293 112860 116093 117817 121582 117923 113912 118811 113675 111927 109124 106541 106818 106614 103816 103621
9722 103621 108009 109152 101539 94065 96705 101851 105146 106039 108384 109819 108188 101095 90337 86617
9708 86617 82153 88674 94108 86662 80248 78819 85673 92030 89245 87860 91855 102434 110133 106335
$$ packed form
9813A35042l19k316p541m493K894k054k677K746N047O183N4m425O373j814l361
9798A29339l81K832J000P60Q65l340p262j491j18m405K968L848p35N104P431l023
9782A33392p750n440l191k159J0k893J626J727N431J425j773l880k921M251J046
9767A18901L562l461l911o243j4O694k094k081k975K842K731J198l808P620L978
9752A22939o177l417o524N69O608L936k919l093n442O15Q065M481J998M157p503
9737A18293n433L233J724L765l659m011M899n136j748k803k583K77k04k798j95
9722A03621M388J143p613p474K640N146L295Q93K345J435j631p093j0758l720
9708H6617m464O521N434p446o414j429O854O357k785j385L995J0579P699l798
$$ plain form
9694 106335 99781 104238 102006 92044 91553 96588 93850 100645 100068 99833 101124 101841 98206 97798 102453 104369
9678 104369 101521 100469 97229 85342 85519 87832 86088 90772 97434 95266 94413 87673 89873 91592 90798
9663 90798 88956 91278 92956 90420 83184 83620 84022 90409 89619 91624 96540 94225 95582 100696 104274
9648 104274 106644 102208 103464 103676 100863 106199 129152 146248 168363 209330 270657 306938 272679
9635 272679 215752 173237 147652 134677 125103 119434 112547 111510 112054 107972 101437 95151 93404 91636
9621 91636 86402 85012 89379 84692 88246 83827 81301 83688 87546 93096 94032 88250 93915 97210 95771
9606 95771 86759 81564 87676 88548 81850 79428 82470 84094 89392 87655 79297 84433 83654 85676 95097
9591 95097 99973 94447 88137 86186 92514 93334 86108 78995 79469 80488 85867 91673 94836 94405 94510 95144
$$ packed form
9694A06335o554M457k232r962m91N035k738O795n77k35J291P17l635m08M655J916
9678A04369k848j052l240j1887J77K313j744M684O662k168q53o740K200J719p94
9663I0798j842K322J678k536p236M36M02O387p90K005M916k315J357N114L578
9648A04274K370m436J256K12k813N336K2953J7096K2115M0967O1327L6281l4259
9635B72679n6927m2515k5585j2975r574n669o887j037N44m082o535o286j747j768
9621I1636n234j390M367m687L554m419k526K387L858N550R36n782N665L295j439
9606I5771r012n195O112Q72o698k422L042J624N298j737q358N136p79K022R421
9591I5097M876n526o310j951O328Q20p226p113M74J019N379N806L163m31J05O34
$$ plain form
9575 95144 91621 83324 78424 81632 79243 69234 73520 76157 87076 87690 85595 84664 88682 89824 83316
9560 83316 73921 70316 76122 79590 74852 76700 77435 72157 64420 62810 65920 74209 75661 76626 77056
9545 77056 77243 71382 73548 73577 77148 82173 81007 79968 81664 82497 79685 76305 77484 84006 92211 86925
9529 86925 78305 70977 73337 77891 87236 87880 81871 79521 69731 68711 71227 78543 78963 88257 87853
9514 87853 86463 78082 69949 66495 74035 74779 76926 78652 78327 79683 78213 75309 78764 81200 84456
9499 84456 78975 72298 69696 72653 72680 70176 69021 67856 70704 77990 80567 72154 68790 69758 69985 74474
9483 74474 76141 75508 77829 73076 70554 71645 73647 69883 70780 68704 72496 76586 77404 78424 81691
9468 81691 78980 81551 85523 85829 85075 86768 90618 87384 78781 74683 72633 72746 70309 70772 65986 69896
$$ packed form
9575I5144l523q297m900L208k389j0009M286K637J0919O14k095r31M018J142o508
9560H3316r395l605N806L468m738J848P35n278p737j610L110Q289J452R65M30
9545G7056J87n861K166K9L571N025j166j039J696Q33k812l380J179O522Q205n286
9529H6925q620p328K360M554R345O44o009k350r790j020K516P316M20R294m04
9514H7853j390q381q133l454P540P44K147J726l25J356j470k904L455K436L256
9499H4456n481o677k602K957K7k504j155j165K848P286K577q413l364R68K27M489
9483G4474J667o33K321m753k522J091K002l764Q97k076L792M090Q18J020L267
9468H1691k711K571L972L06p54J693L850l234q603m098k050J13k437M63m786L910
$$ plain form
9452 69896 74223 70619 67846 67739 64638 67186 73416 68492 68267 71831 68370 66922 67900 65107 66581
9437 66581 65145 66805 70075 71579 69766 63391 52817 52909 61905 63170 58864 65111 66502 68802 74238
9422 74238 75872 75054 68427 65433 68630 73137 75765 71159 63425 58799 54359 62995 73705 80657 77325
9407 77325 67990 63835 55306 58506 60853 55298 56142 55933 58970 61417 63661 63492 62705 51924 56786
9392 56786 55202 57413 51602 51241 61040 68509 73576 73641 69994 65816 65449 63462 71833 75303 74965 68115
9376 68115 65549 72221 75803 79549 79363 70656 62278 65769 73095 64649 56420 55865 57140 50463 45749
9361 45749 46209 49924 58387 58650 61969 62424 58656 60795 65839 66059 68114 65778 63143 66119 59567 55401
9345 55401 59556 62804 57619 57607 62242 68380 67219 55822 61181 64377 68598 66339 58302 57398 62698
$$ packed form
9452F9896M327l604k773j07l101K548O230m924k25L564l461j448R78k793J474
9437F6581j436J660L270J504j813o375j0574R2Q996J265m306O247J391K300N436
9422G4238J634q18o627k994L197M507K628m606p734m626m440Q636J0710O952l332
9407G7325r335m155q529L200K347n555Q44k09L037K447K244j69p87j0781M862
9392E6786j584K211n811l61R799P469N067O5l647m178l67j987Q371L470l38o850
9376F8115k566O672L582L746j86q707q378L491P326q446q229n55J275o677m714
9361D5749M60L715Q463K63L319M55l768K139N044K20K055k336k635K976o552m166
9345E5401M155L248n185j2M635O138j161j1397N359L196M221k259q037r04N300
$$ plain form
9330 62698 62197 57761 63912 62813 58573 58533 57212 62656 61096 57345 61241 61160 60589 63579 61117 55389
9314 55389 54844 55203 59230 60421 66077 63908 68293 66734 65468 71079 71205 61556 57519 61112 63402
9299 63402 67532 63484 58412 56228 63449 61825 66827 62971 64758 66416 67459 66029 63147 62451 66279
9284 66279 67448 67403 65107 68444 66682 60547 55694 54793 49375 47278 44867 45463 48146 51580 53551 54774
9268 54774 56441 60303 54869 56408 54244 59280 65773 69484 70349 69615 72353 76692 74626 65533 61474
9253 61474 62532 62670 63944 61555 61137 61661 68371 66092 64690 63049 61571 61227 59258 55632 48804 48271
9237 48271 50043 45244 51186 58488 60696 53872 50718 52843 56281 56259 52238 52720 53908 54572 57653 54161
9221 54161 55729 54734 57840 56529 53539 51703 51217 45012 46847 54306 65520 62451 58576 52601 50291
$$ packed form
9330F2698n01m436O151j099m240m0j321N444j560l751L896q1n71K990k462n728
9314E5389n45L59M027J191N656k169M385j559j266N611J26r649m037L593K290
9299F3402M130m048n072k184P221j624N002l856J787J658J043j430k882o96L828
9284F6279J169m5k296L337j762o135m853r01n418k097k411N96K683L434J971J223
9268E4774J667L862n434J539k164N036O493L711Q65p34K738M339k066r093m059
9253F1474J058J38J274k389m18N24O710k279j402j641j478l44j969l626o828n33
9237D8271J772m799N942P302K208o824l154K125L438k2m021M82J188O64L081l492
9221E4161J568r95L106j311k990j836m86o205J835P459J1214l069l875n975k310
$$ plain form
9206 50291 50099 46108 44862 45032 46380 45181 50580 61515 62500 59350 63573 63814 62396 59820 55396
9191 55396 51859 47295 46849 48109 53781 56466 60659 63441 60380 60785 63624 63163 54909 52616 50425
9176 50425 51586 51489 52474 60164 58323 53351 51856 58561 64157 65659 63115 58190 60812 55103 51668
9161 51668 58971 59868 57238 61416 55277 44842 43280 44035 47268 44217 43005 42987 40357 37604 36128
9146 36128 39963 49601 50817 47820 45190 48420 55904 56197 58935 60512 61539 55121 55199 58490 53851
9131 53851 51028 52881 52151 51337 49904 54586 57043 62891 61746 52980 48235 48286 46084 48084 53391 56633
9115 56633 59287 63006 58497 51632 48470 48357 47465 51348 58779 55841 53035 49849 45840 41102 44141
9100 44141 45843 42135 49923 50275 44815 48257 56205 62504 64615 68781 60051 50612 46676 48728 49356
$$ packed form
9206E0291j92l991j246J70J348j199N399J0935R85l150M223K41j418k576m424
9191E5396l537m564m46J260N672K685M193K782l061M05K839m61q254k293k191
9176E0425J161r7R85P690j841m972j495O705N596J502k544m925K622n709l435
9161E1668P303Q97k630M178o139j0435j562P55L233l051j212j8k630k753j476
9146C6128L835R638J216k997k630L230P484K93K738J577J027o418P8L291m639
9131E3851k823J853p30q14j433M682K457N848j145q766m745N1k202K000N307L242
9115E6633K654L719m509o865l162j13q92L883P431k938k806l186m009m738L039
9100D4141J702l708P788L52n460L442P948O299K111M166q730r439l936K052O28
$$ plain form
9085 49356 49395 52311 56206 52316 45933 45323 50219 53518 54723 58071 59277 57011 51555 45878 44963 48135
9069 48135 44572 47815 48135 43549 44437 49605 50584 47884 47312 42704 35536 34857 42561 48785 50173 44898
9053 44898 37734 33979 37346 44573 45999 45411 44636 45941 47519 43492 37151 42873 44435 49036 48803
9038 48803 40813 35714 39415 44052 49078 49839 42458 38028 41510 44918 52027 52313 49472 51866 49388
9023 49388 45925 47343 51642 50159 38619 32977 34383 35847 32459 36310 40293 44619 43489 44176 47213
9008 47213 46412 41446 39519 44868 42627 42156 41693 39771 33337 39528 41423 34162 41632 46640 44787
8993 44787 38592 39761 40833 40741 39617 37033 39341 41013 37059 35688 36345 33662 40730 42085 40761
8978 40761 37304 37676 42729 49545 45645 42499 39233 32449 34942 43966 44476 42562 42900 42125 44117 46877
$$ packed form
9085D9356L9K916L895l890o383o10M896L299J205L348J206k266n456n677r15L172
9069D8135l563L243L20m586Q88N168R79k700n72m608p168o79P704O224J388n275
9053D4898p164l755L367P227J426n88p75J305J578m027o341N722J562M601k33
9038D8803p990n099L701M637N026P61p381m430L482L408P109K86k841K394k478
9023D9388l463J418M299j483j1540n642J406J464l388L851L983M326j130O87L037
9008D7213q01m966j927N349k241m71m63j922o434O191J895p261P470N008j853
8993D4787o195J169J072r2j124k584K308J672l954j371O57k683P068J355j324
8978D0761l457L72N053O816l900l146l266o784K493R024N10j914L38p75J992K760
$$ plain form
8962 46877 39366 33341 37559 37633 39772 35189 34768 41761 41696 39773 44307 48930 42666 32162 29709 31467
8946 31467 25716 26969 34603 38789 39463 38130 38068 42287 46763 44831 40520 40867 38465 44776 47539 46188
8930 46188 46378 48435 41677 35798 33536 37819 40614 41782 38130 35336 43282 43924 44529 45898 44069
8915 44069 42736 41819 35913 40941 42268 48764 45279 45662 42825 44819 42819 37378 43369 43186 41916
8900 41916 42404 45323 50388 49492 41869 36168 26660 26411 32940 38689 31487 33791 46509 51396 43589
8885 43589 35833 37533 41005 43029 44306 39278 32901 33424 36794 38974 37384 31372 34639 33461 35572
8870 35572 37789 42975 45216 39385 37885 28339 27656 31772 33278 36362 37280 35699 35212 36931 40162
8855 40162 41411 39650 37332 35417 33847 27804 32135 34306 29197 27356 32357 30383 31466 30845 25137
$$ packed form
8962D6877p511o025M218P4K139m583m21O993o5j923M534M623o264j0504k453J758
8946C1467n751J253P634M186O74j333o2M219M476j932m311L47k402O311K763j351
8930D6188J90K057o758n879k262M283K795J168l652k794P946O42O05J369j829
8915D4069j333r17n906N028J327O496l485L83k837J994k000n441N991j83j270
8900D1916M88K919N065q96p623n701r508k49O529N749p202K304J2718M887p807
8885D3589p756J700L472K024J277n028o377N23L370K180j590o012L267j178K111
8870C5572K217N186K241n831j500r546o83M116J506L084R18j581m87J719L231
8855D0162J249j761k318j915j570o043M331K171n109j841N001j974J083o21n708
$$ plain form
8840 25137 24938 28815 35225 35908 30842 30894 36163 38045 39480 43490 47062 40146 36166 35781 32954 32467
8824 32467 37865 37419 35467 41474 46544 41324 39704 30012 34672 39565 36732 35581 31611 38318 44740
8809 44740 45590 40609 36603 38845 31778 36207 31773 28626 33945 30936 25662 32295 37474 38652 38446
8794 38446 33532 21119 22656 30597 30111 30179 27860 22986 20824 19675 19925 23379 24473 27767 30689
8779 30689 36721 37922 33848 26404 26910 32818 42271 43641 39429 38253 37323 34014 34466 31638 32904
8764 32904 38178 35838 34087 31770 41430 43542 40120 35232 33560 32328 25087 19918 22235 22854 32115
8749 32115 33629 32986 29236 25647 16843 12984 21159 28358 24520 25590 28095 24404 30052 37199 34612
8734 34612 28530 30221 26809 23233 25605 25370 21590 18723 24631 27598 24876 24697 23307 28084 39815
$$ packed form
8840B5137j99L877O410O83n066N2N269J882J435M010L572o916l980l85k827m87
8824C2467N398m46j952O007N070n220j620r692M660M893k833j151l970O707O422
8809D4740Q50m981m006K242p067M429m434l147N319l009n274O633N179J178k06
8794C8446m914j2413J537P941m86O8k319m874k162j149K50L454J094L294K922
8779C0689O032J201m074p444N06N908R453J370m212j176r30l309M52k828J266
8764C2904N274k340j751k317R660K112l422m888j672j232p241n169K317O19R261
8749C2115J514o43l750l589q804l859Q175P199l838J070K505l691N648P147k587
8734C4612o082J691l412l576K372k35l780k867N908K967k722j79j390M777J1731
$$ plain form
8719 39815 40855 37550 42582 41797 39666 37186 32786 26770 19531 20776 22295 22348 28626 28318 20149 17898
8703 17898 20119 23773 26025 20608 26142 36100 31703 28481 27099 27531 29657 40055 40573 32407 26904
8688 26904 29318 35928 34088 31955 33817 36329 34321 31659 28204 27817 25580 26906 28843 30688 32848
8673 32848 35797 34536 33958 25616 22379 24885 23678 23219 22583 32526 36686 30852 30781 29822 28872 30466
8657 30466 36189 43130 36374 23935 20176 26157 31795 37222 41517 36145 32879 37056 27048 21660
8643 21660 26604 27357 33866 41813 39213 33786 25552 21052 20887 25561 31744 39114 36832 27996 25354
8628 25354 28607 26220 25979 26158 31940 27862 20582 26076 29969 25830 27143 37848 38416 31026 27793
8613 27793 32262 29823 28212 26472 25938 25867 27399 25881 27858 31096 32150 29318 26964 29273 27568
$$ packed form
8719C9815J040l305N032p85k131k480m400o016p239J245J519N3O278l08q169k251
8703A7898K221L654K252n417N534R958m397l222j382M32K126J0398N18q166n503
8688B6904K414O610j840k133J862K512k008k662l455l87k237J326J937J845K160
8673C2848K949j261n78q342l237K506j207m59o36R943M160n834p1r59r50J594
8657C0466N723O941o756j2439l759N981N638N427M295n372l266M177j0008n388
8643B1660M944P53O509P947k600n427q234m500j65M674O183P370k282q836k642
8628B5354L253k387k41J79N782m078p280N494L893m139J313J0705N68p390l233
8613B7793M469k439j611j740n34p1J532j518J977L238J054k832k354K309j705
$$ plain form
8598 27568 16800 11895 17474 22029 26537 29347 33167 35993 32927 27067 25330 25667 23971 26038 28025
8583 28025 26463 26510 25440 22346 25896 25910 25065 25816 27745 30331 30774 32758 29010 24776 28660 30500
8567 30500 31914 34842 29914 28438 22893 27755 29911 38512 42047 34285 26130 29010 27338 20330 18751
8552 18751 25095 28209 26154 24405 27171 27685 35761 33667 31077 23402 18145 20380 24220 27519 24668
8537 24668 20070 23543 20620 17185 15952 20797 17621 17970 16930 20211 23056 24684 27756 28081 22232
8522 22232 13501 18349 19968 15357 16268 20203 21625 18976 18265 17314 22763 30841 29464 30992 34497
8507 34497 28773 25690 25891 25227 26753 23864 21459 21242 21601 23720 23344 26337 32048 30948 23149 22517
8491 22517 24395 23925 17978 16024 23403 18470 19291 23595 25652 25632 23675 20246 26787 35265 34212 31368
$$ packed form
8598B7568j0768m905N579M555M508K810L820K826l066n860j737L37j696K067J987
8583B8025j562M7j070l094L550J4q45P51J929K586M43J984l748m234L884J840
8567C0500J414K928m928j476n545M862K156Q601L535p762q155K880j672p008j579
8552A8751O344L114k055j749K766N14Q076k094k590p675n257K235L840L299k851
8537B4668m598L473k923l435j233M845l176L49j040L281K845J628L072L25n849
8522B2232q731M848J619m611R11L935J422k649p11r51N449Q078j377J528L505
8507C4497n724l083K01o64J526k889k405k17L59K119l76K993N711j100p799o32
8491B2517J878m70n947j954P379m933Q21M304K057k0j957l429O541Q478j053k844
$$ plain form
8475 31368 28364 21654 24086 26748 29978 31387 30736 28062 22816 22289 24771 23662 25510 20938 23036
8460 23036 24929 25828 24884 27171 25582 23490 24068 29989 30112 34064 31757 30321 23843 17627 18073 20006
8444 20006 25504 24264 20927 24364 33838 36034 31427 29573 37185 41273 41540 39937 35348 38608 36632
8429 36632 32339 32565 36248 37318 33575 28567 22260 21532 24400 25411 23440 29432 39411 36655 33133
8414 33133 25936 26108 33241 36454 31607 27889 24953 20055 28375 27680 21230 17783 15922 15610 14595
8399 14595 9148 12590 20943 19309 24417 21466 18003 16630 21416 25071 19296 16466 18255 19588 19591
8384 19591 19451 10255 6489 5051 6090 13357 21939 24655 24514 20669 20256 22793 31539 27886 23341
8369 23341 21376 23491 21169 24415 24429 21852 20078 21807 26007 27627 33742 33792 32232 36195 36758 33082
$$ packed form
8475C1368l004o710K432K662L230J409o51k674n246n27K482j109J848m572K098
8460B3036J893Q99r44K287j589k092N78N921J23L952k307j436o478o216M46J933
8444B0006N498j240l337L437R474K196m607j854P612M088K67j603m589L260j976
8429C6632m293K26L683J070l743n008o307p28K868J011j971N992R979k756l522
8414C3133p197J72P133L213m847l718k936m898Q320o95o450l447j861l12j015
8399A4595n447L442Q353j634N108k951l463j373M786L655n775k830J789J333L
8384A9591j40r196l766j438J039P267Q582K716j41l845m13K537Q746l653m545
8369B3341j965K115k322L246J4k577j774J729M200J620O115N0j560L963N63l676
$$ plain form
8353 33082 19257 24358 24307 25819 23083 18720 19411 22049 25272 23463 24093 18266 21222 25418 28563
8338 28563 27835 28629 32168 33020 27368 22708 23867 26082 27906 21090 18145 21078 24054 23997 19924 20825
8322 20825 25796 24343 20942 17508 18330 25069 27225 31016 21721 12358 11142 18277 19901 15905 19664
8307 19664 22277 22815 22761 22236 17963 12785 9745 11844 13807 8526 11812 13636 10360 13806 15630 13063
8291 13063 12702 8045 4436 11522 25250 25120 19948 23819 21792 21929 26456 31451 29846 25906 21374
8276 21374 20210 25557 25705 20932 16937 14901 14076 6329 2822 1122 2113 11126 16376 12796 7423
8261 7423 8126 11443 16306 13887 15513 22366 25567 30257 28768 23536 24297 20189 13193 4688 6964
8246 6964 10544 9536 6888 5268 2468 1280 2058 641 4359 8412 8314 11291 12763 9690 10757 12036
$$ packed form
8353C3082j3825N101n1J512k736m363O91K638L223j809O30n827K956M196L145
8338B8563p28P94L539Q52n652m660J159K215J824o816k945K933K976n7m073R01
8322B0825M971j453l401l434Q22O739K156L791r295r363j216P135J624l996L759
8307A9664K613N38n4n25m273n178l040K099J963n281L286J824l276L446J824k567
8291A3063l61m657l609P086J3728j30n172L871k027J37M527M995j605l940m532
8276B1374j164N347J48m773l995k036q25p747l507j700R91R013N250l580n373
8261G423P03L317M863k419J626O853L201M690j489n232P61m108o996q505K276
8246F964L580j008k648j620k800j188P78j417L718M053r8K977J472l073J067J279
$$ plain form
8230 12036 6374 5766 3690 6791 17578 27103 25719 25373 27874 28642 23230 20819 22120 21400 18064
8215 18064 12420 11876 18830 19288 19142 20273 16525 15109 21678 18525 20199 15859 13556 9193 9144 7323
8199 7323 13209 17193 20031 18429 18240 11929 17137 20301 22601 22753 19003 13678 10352 12102 16278
8184 16278 14895 15846 17324 17425 18007 15627 16864 12851 3446 4915 12114 11558 9278 13785 9765 2288
8168 2288 3079 9149 11252 9012 9946 16799 16069 13916 16550 10131 13396 19258 22590 26876 25593 19108
8152 19108 20429 22336 17860 18427 16889 17576 16254 11399 19819 23720 26878 31638 29760 33931 30043
8137 30043 20987 12516 9845 13895 15821 11303 3955 9512 8364 9705 14182 14335 14655 16194 15717
8122 15717 18384 15409 9265 8620 15922 14810 11006 15765 18549 18196 19812 18827 22945 22831 18897 16389
$$ packed form
8230A2036n662o08k076L101J0787R525j384l46K501P68n412k411J301p20l336
8215A8064n644n44O954M58j46J131l748j416O569l153J674m340k303m363m9j821
8199G323N886L984K838j602j89o311N208L164K300J52l750n325l326J750M176
8184A6278j383R51J478J01N82k380J237m013r405J469P199n56k280M507m020p477
8168B288P91O070K103k240R34O853p30k153K634o419L265N862L332M286j283o485
8152A9108J321J907m476N67j538O87j322m855Q420L901L158M760j878M171l888
8137C0043r056q471k671M050J926m518p348N557j148J341M477J53L20J539m77
8122A5717K667k975o144o45P302j112l804M759K784l53J616r85M118j14l934k508
$$ plain form
8106 16389 17638 19438 13118 6098 6898 9628 10741 8662 7540 5673 2054 3175 5173 13860 20682
8091 20682 22773 14657 18091 23087 18168 15915 19892 12756 16236 19308 11536 10188 15683 19948 24237
8076 24237 21331 20181 17752 12526 9837 10213 10755 17323 16338 9857 5903 2847 5108 6798 6361 4842
8060 4842 6111 5118 3504 6031 15132 19165 21257 20219 16184 14300 8063 5474 11903 19178 17961
8045 17961 17887 19513 19710 15969 13215 13112 12910 8772 7388 6045 11441 14136 9844 8207 13069 18422
8029 18422 15559 14176 14124 7621 2866 7975 15061 17027 20251 20954 13623 8509 14153 19225 17121
8014 17121 18855 19952 21506 19241 18704 14748 15510 20131 23587 26846 26003 26001 19111 11589 17498 16755
7998 16755 10070 8933 11131 13444 17983 19417 19673 18381 21668 25796 22258 18284 18023 16665 11463
$$ packed form
8106A6389J249J800o320p020Q00K730J113k079j122j867l619J121J998Q687O822
8091B0682K091q116L434M996m919k253L977p136L480L072p772j348N495M265M289
8076B4237k906j150k429n226k689L76N42O568r85o481l954l056K261J690m37j519
8060D842J269r93j614K527R101M033K092j038m035j884o237k589O429P275j217
8045A7961p4J626J97l741k754j03k02m138j384j343N396K695m292j637M862N353
8029A8422k863j383n2o503m755N109P086J966L224P03p331n114N644N072k104
8014A7121J734J097J554k265n37l956P62M621L456L259q43ko890p522N909p43
7998A6755o685j137K198K313M539J434K56j292L287M128l538l974k61j358n202
$$ plain form
7983 11463 7383 5247 6156 10003 12269 12157 11022 10995 23709 29372 20863 11931 8003 11268 8985
7968 8985 5620 3760 7895 8177 13792 14479 10201 3193 5637 3411 3097 8402 10274 10073 10287 13286
7952 13286 13058 19942 20241 20113 16035 15010 15739 16660 17843 9977 8786 7498 8027 7871 10783 14423
7936 14423 16049 15643 23105 23212 13648 12589 7789 21207 28067 23673 22072 15193 10892 16993 16733
7921 16733 15524 17155 9969 14087 16241 13813 12212 14042 15727 11618 7429 9979 9973 11164 11608 5247
7905 5247 4122 743 -1329 -2533 -262 2513 2558 1043 1951 1211 -771 2205 7533 8932 16478 12536
7889 12536 8677 4775 5123 9581 10675 10835 9757 9236 6479 8846 10334 4292 9294 10473 8697
7874 8697 6805 5551 10867 13447 6993 5448 6602 7117 5252 -1599 -275 4055 6906 12866 10383
$$ packed form
7983A1463m080k136R09L847K266j12j135k7J2714N663q509q932l928L265k283
7968H985l365j860M135K82N615O87m278p008K444k226l14N305J872k01K14K999
7952A3286k28O884K99j28m078j025P29R21J183p866j191j288N29j56K912L640
7936A4423J626m06P462J07r564j059m800J3418O860m394j601o879m301O101k60
7921A6733j209J631p186M118K154k428j601J830J685m109m189K550oJ191M44o361
7905E247j125l379k072j204K271K775M5j515R08p40j982K976N328J399P546l942
7889A2536l859l902L48M458J094J60j078n21k757K367J488o042N002J179j776
7874H697j892j254N316K580o454j545J154N15j865o851J324M330K851N960k483
$$ plain form
7859 10383 4705 7716 13611 14642 13478 11819 16633 16781 9414 5437 5831 10822 13729 17715 19908
7844 19908 17416 15058 13330 15746 18166 13806 6414 5128 12699 10768 8641 849 6543 10707 14864
7829 14864 8324 4752 6107 7354 11264 13283 10548 6195 -2690 -5687 -4505 1375 10670 11696 10367
7814 10367 13535 13934 11279 10440 9048 7172 6090 6053 7600 10422 7285 10836 12650 16011 20185 8657
7798 8657 8443 10960 11744 12499 11463 7850 10405 11952 11019 12871 9793 4915 4508 10376 15926 22954
7782 22954 21179 16857 10886 7418 5066 4237 -3980 -7621 -93 6048 4208 3464 4871 4655 7630
7767 7630 10742 8839 6701 10138 12868 16712 18399 17719 11905 16413 14391 9995 10251 9235 12648
7752 12648 12253 12150 10253 8135 3373 3716 11160 14540 13119 10048 8826 7058 13858 9981 7063
$$ packed form
7859A0383n678L011N895J031j164j659M814J48p367l977L94M991K907L986K193
7844A9908k492k358j728K416K420m360p392j286P571j931k127p792N694M164M157
7829A4864o540l572J355J247L910K019k735m353q885k997J182N880R295J026j329
7814A0367L168L99k655q39j392j876j082l7J547K822l137L551J814L361M174j1528
7798H657k14K517P84P55j036l613K555J547r33J852l078m878m07N868N550P028
7782B2954j775m322n971l468k352q29q217l641P528O141j840p44J407k16K975
7767G630L112j903k138L437K730L844J687o80n814M508k022m396K56j016L413
7752A2648l95j03j897k118m762L43P444L380j421l071j222j768O800l877k918
$$ plain form
7737 7063 8273 3725 3018 6619 2507 5617 2854 2212 4451 8588 8906 15079 15983 11643 8584 7574
7721 7574 10703 8164 3615 3224 109 883 -180 5526 7661 12800 17272 15538 15450 11474 10071 12106
7705 12106 12928 13999 8147 4005 7290 7792 6173 8333 12436 11039 9905 11699 13592 14349 10564
7690 10564 7548 3585 1047 2723 5681 11060 8413 -772 -4335 3274 4481 3714 3264 9505 13198
7675 13198 12963 6894 2032 5595 9595 14407 14078 8673 5955 4152 13963 14750 13766 11398 12185 15326
7659 15326 23882 21718 21289 19285 8696 8232 8655 7908 10554 9762 12863 6599 -573 3760 3524 3810
7643 3810 2443 12480 15856 10594 8586 6752 5854 8966 8749 8447 2389 -4224 -4833 -2500 487 3018
7627 3018 2021 5349 14168 14474 13600 8510 8044 10084 325 -7040 -12500 -8272 4238 8391 983 -49
$$ packed form
7737G063J210m548p07L601m112L110k763o42K239M137L18O173R04m340l059j010
7721G574L129k539m549l91l115P74j063N706K135N139M472j734q8l976j403K035
7705A2106Q22J071n852m142L285N02j619K160M103j397j134J794J893P57l785
7690A0564l016l963k538J676K958N379k647r185l563P609J207p67m50O241L693
7675A3198k35o069m862L563M000M812l29n405k718j803R811P87r84k368P87L141
7659A5326Q556k164m29k004j0589m64M23p47K646p92L101o264p172M333k36K86
7643C810j367J0037L376n262k008j834q98L112k17l02o058o613o09K333K987K531
7627C018r97L328Q819L06q74n090m66K040r759p365n460M228J2510M153p408j032
$$ plain form
7611 -49 6594 4604 -2439 -3579 3919 11981 12035 16431 16948 7180 4854 2050 5941 7827 8903 5384
7595 5384 6362 5263 6140 3114 -236 -134 5975 12610 13580 9302 3092 -2831 -2349 -253 1718 3907
7579 3907 6078 1781 1764 3270 4744 9593 7350 8231 7722 6711 10331 6658 5560 13577 13434 3903
7563 3903 5091 4296 1161 -725 -4560 1668 7015 6122 4191 5612 -88 -656 -455 1986 8145 9910
7547 9910 7168 9298 4612 3524 1950 -3636 -6150 -7586 -4075 2115 -946 -4034 865 7414 7723
7532 7723 -392 -5925 -5999 -307 10317 12289 2955 -3810 -5548 -6944 -8023 -5333 -2295 -24 -263
7517 -263 -1619 633 -1341 -5286 -8529 -5487 455 1398 8889 11647 14525 16929 17874 8281 7016 4562
7501 4562 -51 3201 7022 15319 17007 23107 14124 9959 10321 7890 4009 5400 13888 13655 10197
$$ packed form
7611d9O643j990p043j140P498Q062N4M396N17r768k326k804L891J886J076l519
7595E384R78j099Q77l026l350J02O109O635R70m278o210n923M82K096J971K189
7579C907K171m297j7J506J474M849k243Q81n09j011L620l673j098Q017j43r531
7563C903J188p95l135j886l835O228N347q93j931J421n700n68K01K441O159J765
7547I910k742K130m686j088j574n586k514j436L511O190l061l088M899O549L09
7532G723q115n533p4N692J0624J972r334o765j738j396j079K690L038K271k39
7517b63j356K252j974l945l243L042N942R43P491K758K878K404R45r593j265k454
7501D562m613L252L821Q297J688O100q983m165L62k431l881J391Q488k33l458
$$ plain form
7486 10197 8317 14224 10250 2413 -6773 -7117 -330 3032 1401 1488 -4757 -1689 653 1072 7898 6821
7470 6821 6221 3039 -1088 1004 4439 4882 13389 13815 6950 -3058 -8109 -9545 -5706 -3271 -5807
7455 -5807 -850 4383 6788 3710 1619 3575 10284 15091 10882 14038 8824 5677 7111 4026 2164
7440 2164 -3266 -1179 8799 13215 15012 7123 409 -2116 4933 6978 -854 -428 97 -1610 2931
7425 2931 2563 2253 7292 8049 3292 3622 3436 2179 8988 18705 17962 4940 3164 1959 -2995 562
7409 562 13180 13630 11779 11944 10750 12576 16570 11315 12414 14271 9878 5654 -598 2081 3746
7394 3746 3780 4282 7900 6028 3388 3787 5069 4900 11543 8494 5628 11029 13166 4167 -4294 -7140
7378 -7140 -1910 -4471 -7684 -10492 -9281 -10314 -6148 -3423 -4846 -7416 -3175 3025 4446 5745 10571
$$ packed form
7486A0197j880N907l974p837r186l44O787L362j631Q7o245L068K342M19O826j077
7470F821o00l182m127K092L435M43Q507M26o865j0008n051j436L839K435k536
7455e807M957N233K405l078k091J956O709M807m209L156n214l147J434l085j862
7440B164n430K087R978M416J797p889o714k525P049K045p832M26N25j707M541
7425B931l68l10N039P57m757L30j86j257O809R717p43j3022j776j205m954L557
7409E62J2618M50j851J65j194J826L994n255J099J857m393m224o252K679J665
7394C746L4N02L618j872k640L99J282j69O643l049k866N401K137q999q461k846
7378g140N230k561l213k808J211j033M166K725j423k570M241O200J421J299M826
$$ plain form
7363 10571 14978 11309 -356 81 5235 268 -2928 -5731 -213 4653 3656 2807 -122 -9613 -11623
7348 -11623 -6995 -2526 1991 5953 -271 -6641 -1424 2737 4808 -540 -4592 3301 8302 12758 8613
7333 8613 6418 6791 6464 4751 3962 1734 7658 13679 13459 13993 7697 836 -249 8870 582 -243
7317 -243 -289 -4686 743 8899 13970 9667 2589 5845 9061 3446 -1382 4251 3626 1959 2240 815
7301 815 2864 839 6306 6406 3946 10224 14548 24480 21809 10100 7481 12134 14476 12507 9198
7286 9198 6804 5753 7139 2643 -2506 -1862 1 9606 10416 2831 3322 -652 2425 8704 11551 10996
7270 10996 6897 -3702 -7124 -7254 -6531 -9207 -5879 -4260 -4626 -5672 -1400 3055 2781 -2228 -4280
7255 -4280 -4857 -4089 237 3763 -1687 -3457 -11283 -15104 -14671 -6155 -5103 -7678 -10083 -13257 -15896 -12151
$$ packed form
7363A0571M407l669j1665M37N154m967l196k803N518M866r97q49k929r491k010
7348a1623M628M469M517L962o224o370N217M161K071n348m052P893N001M456m145
7333H613k195L73l27j713p89k228N924O021k20N34o296o861j085R119q288q25
7317b43m6m397N429Q156N071m303p078L256L216n615m828N633o25j667K81j425
7301H15K049k025N467J00k460O278M324R932k671j1709k619M653K342j969l309
7286I198k394j051J386m496n149O44J863R605Q10p585M91l974L077O279K847n55
7270A0996m099j0599l422j30P23k676L328J619l66j046M272M455k74n009k052
7255d280n77P68M326L526n450j770p826l821M33Q516J052k575k405l174k639L745
$$ plain form
7239 -12151 -3767 -7897 -10447 -5169 523 966 -7712 -4025 660 -1759 7463 6015 -676 438 -905
7224 -905 -2424 818 2420 10713 15216 12181 8115 9294 9513 296 -2332 921 5586 4898 7583 4566
7208 4566 2221 -1871 -378 -1895 -2604 5351 8692 10225 7726 447 -2069 -7641 -5620 3558 6546
7193 6546 6104 8089 7564 6550 4952 11983 18178 20085 16714 8243 6524 12292 18360 16576 12269
7178 12269 2959 272 5062 6938 8434 8442 9789 12755 8333 -1072 -8497 -6882 -9312 -7659 558
7163 558 1620 -3336 -3259 -3025 -3180 -7393 -4225 -1755 4409 12626 10336 5621 7805 9371 -2383 -1924
7147 -1924 2274 3263 775 330 4261 3641 7403 4909 2758 3708 8267 15123 14519 9976 3721 36
7131 36 -1035 -1057 -2625 -2725 -2124 4271 7807 5659 103 -657 275 4058 4806 1692 -3211 -2054 -346
$$ packed form
7239a2151Q384m130k550N278N692M43q678L687M685k419R222j448o691J114j343
7224i05j519L242J602Q293M503l035m066J179K19r217k628L253M665o88K685l017
7208D566k345m092J493j517p09P955L341J533k499p279k516n572K021R178K988
7193F546m42J985n25j014j598P031O195J907l371q471j719N768O068j784m307
7178A2269r310k687M790J876J496QJ347K966m422r405p425J615k430J653Q217
7163E58J062m956P7K34j55m213L168K470O164Q217k290m715K184J566j1754M59
7147a924M198R89k488m45L931o20L762k494k151R50M559O856o04m543o255l685
7131C6j071k2j568j00O01O395L536k148n556p60R32L783P48l114m903J157J708
$$ plain form
7114 -346 -2178 -4757 -3736 1665 3759 6565 6946 7325 4418 -348 -6396 -8750 -6703 -2915 2427 2547
7098 2547 4670 9013 2475 -3074 -2831 3028 8053 7720 6278 7570 14812 14007 6129 8300 6913 4706
7082 4706 5855 8832 3134 -1433 -6970 -4191 -2360 -72 2708 -5176 -7753 -2128 8142 13214 6045
7067 6045 -323 4615 -656 -252 1873 -136 -1905 -3378 2674 9458 10591 3243 1059 222 -6647
7052 -6647 -8955 -1147 -613 1604 3321 -2144 -5711 -10204 441 1654 -1651 -5863 -5610 -6404 -6225 -1616
7036 -1616 -7268 -10468 -6552 -7631 -7184 -1346 5825 11039 11375 886 -5945 742 8219 5879 -1897
7021 -1897 -4723 -5051 -5720 -5263 -1135 -536 -920 -259 -853 -1254 -642 -2772 -3787 -2946 -6469 2730 9105
7004 9105 7835 6599 5391 7265 2698 -2574 -1461 1712 -2707 -9000 -5994 -1244 -2670 1857 5072
$$ packed form
7114c46j832k579J021N401K094K806L81L79k907m766o048k354K047L788N342J20
7098B547K123M343o538n549K43N859N025l33j442J292P242q05p878K171j387k207
7082D706J149K977n698m567n537K779J831K288K780p884k577N625J0270N072p169
7067F045o368M938n271M04K125k009j769j473O052O784J133p348k184q37o869
7052f647k308P808N34K217J717n465l567m493J0645J213l305m212K53p94J79M609
7036a616n652l200L916j079M47N838P171N214L36j0489o831O687P477k340p776
7021a897k826l28o69M57M128N99l84O61n94m01O12k130j015Q41l523R199O375
7004I105j270j236j208J874m567n272J113L173m419o293L006M750j426M527L215
$$ plain form
6989 5072 6190 12264 19049 14064 2036 -7373 -7571 -4481 3667 2844 4788 5288 2281 3147 1064 -2710
6973 -2710 -2829 -1651 -5427 -5149 -924 -531 -3402 -6979 -9853 -7561 -6842 -3448 -5810 -10755 -15122 -14192
6957 -14192 -15234 -20409 -18195 -10980 -2466 2345 2793 -3527 -915 -3075 -7096 -5855 -9972 -10708 -12737
6942 -12737 -6121 -180 2637 9786 6994 9477 11466 10045 -238 -4624 296 -2081 -3229 1285
6928 1285 8837 8916 7461 1622 3373 166 2329 8400 17849 18311 11809 1173 -3991 -4664 -8520 -4980
6912 -4980 -1708 -1802 -5345 -9078 -7912 -3272 -5509 -3555 3681 7774 7050 5785 5524 658 -6285 -1996
6896 -1996 372 1814 -3545 -2955 -508 2098 1910 3971 4166 5649 1580 -3378 456 -3856 -4528 -6227
6880 -6227 -2416 1243 2526 2880 4231 250 1808 1246 -8495 -10080 -3918 4638 2303 -894 -5568
$$ packed form
6989E072J118O074O785m985j2028r409j98L090Q148q23J944N00l007Q66k083l774
6973b710j19J178l776K78M225L93k871l577k874K292P19L394k362m945m367R30
6957a4192j042n175K214P215Q514M811M48o320K612k160m021J241m117p36k029
6942a2737O616N941K817P149k792K483J989j421j0283m386M920k377j148M514
6928A285P552P9j455n839J751l207K163O071R449M62o502j0636n164o73l856L540
6912d980L272r4l543l733J166M640k237J954P236M093p24j265k61m866o943M289
6896a996K368J442n359N90K447K606j88K061J95J483m069m958L834m312o72j699
6880f227L811L659J283L54J351l981J558n62r741j585O162Q556k335l197m674
$$ plain form
6865 -5568 -7655 -3248 -2404 -4305 -3129 -1748 -6284 -9899 -13254 -13717 -14169 -9053 -6928 -10367 -8904 -1570
6849 -1570 -867 -701 -5926 -9711 -9840 -8146 -12665 -21369 -19821 -14701 -7461 -3973 -5627 -6560 -3122 6066
6833 6066 1260 -7696 -12467 -11409 -10399 -6434 1981 -1107 3460 4181 -514 -3926 -6630 -5857 -5966 -13430
6817 -13430 -15388 -13359 -9161 -7666 2390 9723 3361 33 4019 4385 -2723 -6961 -926 11126
6803 11126 14855 7662 4155 4740 5484 12035 11980 5403 3199 4400 6438 7420 9288 6077 -1217 -2934
6787 -2934 -3880 -8731 -4830 4143 2651 -3197 1333 6397 6623 3955 2812 3526 5120 5750 1497 -1706
6771 -1706 -7336 -6670 -4340 -6322 -4576 3705 2158 -1677 4382 6855 1629 5649 5380 4223 4883 -2635
6755 -2635 -10167 -13965 -6110 -2243 4428 -533 -7990 -7170 1563 -1238 -6511 -9837 -10977 -9937 -5415
$$ packed form
6865e568k087M407Q44j901J176J381m536l615l355m63m52N116K125l439J463P334
6849a570P03J66n225l785j29J694m519q704J548N120P240L488j654r33L438R188
6833F066m806q956m771J058J010L965Q415l088M567P21m695l412k704P73j09p464
6817a3430j958K029M198J495J0056P333o362l328L986L66p108m238O035J2052
6803A1126L729p193l507N85P44O551n5o577k204J201K038R82J868l211p294j717
6787b934r46m851L901Q973j492n848M530N064K26k668j143P14J594O30m253l203
6771a706n630O66K330j982J746Q281j547l835O059K473n226M020k69j157O60p518
6755b635p532l798P855L867O671m961p457Q20Q733k801n273l326j140J040M522
$$ plain form
6740 -5415 -641 4911 13241 13520 5274 -3269 -7474 -4108 329 3156 -776 -6155 -6665 -4759 -7260
6725 -7260 -11020 -11931 -5362 -2264 -6042 -9188 -12709 -14486 -10596 -7878 -10235 -7984 -7045 -10825 -3762
6710 -3762 3218 3385 3263 2722 8851 7211 6790 10617 10470 9844 10188 7619 2763 1313 -3571 -5550 -11418
6693 -11418 -15179 -15335 -10615 -7759 -9099 -8844 -10783 -9329 -4105 -1866 -2779 1056 3992 9520 9310 3149
6677 3149 395 2730 7897 4899 4426 2277 4096 6890 6000 -3999 -11512 -13741 -6754 -2796 -9404
6662 -9404 -6688 1825 3082 2973 -4060 -7947 -14501 -17677 -10809 -8170 -8311 -12736 -16262 -14051 -13022
6647 -13022 -9316 -4556 -2111 3243 3882 -1927 -5205 -5362 -2176 -4382 -5316 -15904 -17586 -11409 -5648
6632 -5648 -444 -7504 -11926 -10187 -2485 -4634 -11463 -11854 -9326 -6780 -3964 -990 -4209 -7432 -9326
$$ packed form
6740e415M774N552Q330K79q246q543m205L366M437K827l932n379n10J906k501
6725g260l760r11O569L098l778l146l521j777L890K718k357K251R39l780P063
6710c762O980J67j22n41O129j640m21L827j47o26L44k569m856j450m884j979n868
6693a1418l761j56M720K856j340K55j939J454N224K239r13L835K936N528k10o161
6677C149k754K335N167k998m73k149J819K794q90r999p513k229O987L958o608
6662i404K716Q513J257j09p033l887o554l176O868K639j41m425l526K211J029
6647a3022L706M760K445N354O39n809l278j57L186k206r34j0588j682O177N761
6632e648N204p060m422J739P702k149o829l91K528K546K816K974l219l223j894
$$ plain form
6617 -9326 -11755 -7338 -1204 -1775 -2239 3620 5124 -2081 -6717 -3591 -1276 -2491 -3545 1420 3704
6602 3704 2279 3407 -8482 -9584 -5914 -8229 -7125 -3776 -6760 -13683 -6366 -3233 1245 8443 5997
6587 5997 -627 -6079 -3251 -99 967 745 6765 1574 -1941 3090 4057 1707 -2235 -2715 -4929 -4971
6571 -4971 -5408 -5751 -3603 -7373 -10713 -13451 -13474 -15662 -10414 1657 5855 2698 -760 -4259 -2088 -3928
6555 -3928 -9646 -6461 1293 631 -1923 -2740 -3525 -1452 -5931 -750 5951 6656 13962 12963 813 -6063
6539 -6063 -5595 205 -100 404 -930 -1247 2671 3243 3059 4436 2971 1616 6728 5728 3746 2337
6523 2337 6119 10365 10012 9852 3754 -2017 -2737 -163 3432 -1742 -5169 -765 5957 6199 1383 1026
6507 1026 649 -1674 -3010 -1535 9897 13315 5589 -1137 -1208 -3331 -5708 -3916 -2395 -2910 -125 -1624
$$ packed form
6617i326k429M417O134n71m64N859J504p205m636L126K315j215j054M965K284
6602C704j425J128j1889j102L670k315J104L349k984o923P317L133M478P198k446
6587E997o624n452K828L152J066k22O020n191l515N031R67k350l942m80k214m2
6571d971m37l43K148l770l340k738k3k188N248J2071M198l157l458l499K171j840
6555c928n718L185P754o62k554q17p85K073m479N181O701P05P306r99j2150o876
6539f063M68N800l05N04j334l17L918N72j84J377j465j355N112j000j982j409
6523B337L782M246l53j60o098n771p20K574L595n174l427M404O722K42m816l57
6507A026l77k323j336J475J1432L418p726o726p1k123k377J792J521n15K785j499
$$ plain form
6491 -1624 -1280 6023 4320 -4910 -5056 2255 9189 11798 9441 4025 -4495 -9342 -8010 -12785 -11023
6476 -11023 -9638 -11243 -8020 -7315 -7285 -3093 1251 -1593 -402 -2062 -4883 -5919 -3370 -2186 1037
6461 1037 2348 3048 830 -2343 -4365 -11727 -7278 -5939 -6504 -9449 -8769 -11652 -14922 -10675 -9691 -7441
6445 -7441 -3109 -16 -5322 -7310 141 -540 201 1736 3615 -423 -9905 -18865 -20296 -16494 -14665
6430 -14665 -13711 -7919 5417 4430 1404 683 -2775 -510 1483 1427 -3426 -510 463 -1420 -1630 -1799
6414 -1799 -4664 -3734 313 634 -3531 -3030 -1236 820 5450 1222 -275 -5945 -4040 -2322 -2432 -582
6398 -582 1527 -4993 3087 3989 -2793 -8689 -9361 -11773 -9884 -4104 -1780 -963 -3103 3235 531 -7004
6382 -7004 -5350 -568 2797 4523 1407 -922 2483 3827 2280 2271 127 -6666 -5747 -3734 -6741 -13870
$$ packed form
6491a624L44P303j703r230j46P311O934K609k357n416q520m847J332m775J762
6476a1023J385j605L223P05L0M192M344k844J191j660k821j036K549J184L223
6461A037J311P00k218l173k022p362M449J339n65k945O80k883l270M247R84K250
6445g441M332L093n306j988P451o81P41J535J879m038r482q960j431L802J829
6430a4665R54N792J3336r87l026p21l458K265J993n6m853K916R73j883k10j69
6414a799k865R30M047L21m165N01J794K056M630m228j497n670J905J718j10J850
6398e82K109o520Q080R02o782n896o72k412J889N780K324Q17k140O338k704p535
6382g004J654M782L365J726l116k329L405J344j547rk144o793R19K013l007p129
$$ plain form
6366 -13870 -13363 -8834 -8527 1451 6383 3223 -651 4758 8989 9378 3216 -155 1208 8640 8236 -1580
6350 -1580 -6937 -8718 -7235 -4656 -5621 -10384 -11075 -14742 -10378 -2477 6072 9488 9451 6662 3928 -2328
6334 -2328 -4923 -5029 129 3126 7301 3566 725 -1925 -6464 -9072 -5075 -4767 -6844 -6423 -8895 -13997
6318 -13997 -10641 -4978 1063 7521 8785 5231 1457 3238 -3498 -5187 -963 -3230 -5224 -6038 -6575
6303 -6575 -796 -5357 -6397 -3232 -3190 -696 -3657 -7921 -9044 -5831 -3325 3374 3645 -3018 -2814 -5790
6287 -5790 -5750 -338 -2073 -5549 -10808 -5052 1467 -3937 -4647 2857 1829 501 -808 -6687 -3526 183
6271 183 7171 8314 3228 1418 2394 -4483 -2730 -4852 -9369 -9445 3238 5819 -556 -3189 -1598 -956
6255 -956 -4442 -5904 -3127 -2106 671 -7613 -11731 -9883 -8973 -12262 -11033 -6527 -8582 -9985 -7731
$$ packed form
6366a3870N07M529L07R978M932l160l874N409M231L89o162l371J363P432m04r816
6350a580n357j781J483K579r65m763o91l667M364P901Q549L416l7k789k734o256
6334b328k595j06N158K997M175l735k841k650m539k608L997L08k077M21k472n102
6318a3997L356N663O041O458J264l554l774J781o736j689M224k267j994q14n37
6303f575N779m561j040L165M2K494k961m264j123L213K506O699K71o663K04k976
6287e790M0N412j735l476n259N756O519n404p10P504j028j328j309n879L161L709
6271A83O988J143n086j810R76o877J753k122m517p6J2683K581o375k633J591O42
6255i56l486j462K777J021K777q284m118J848R10l289J229M506k055j403K254
$$ plain form
6240 -7731 -7987 -10351 -11300 -12782 -8229 -7046 -8332 -5271 2244 -6870 -6537 -4749 -6686 -7289 -3334 -3495
6224 -3495 -4345 -3386 767 1840 851 -3707 -4443 -7146 -8654 -4822 -5561 -2854 -1085 -2724 -4780 -2274
6208 -2274 588 1462 1164 3526 11337 8189 3935 -1202 -2124 421 2411 6878 5078 2688 -4631 -7877
6192 -7877 -11866 -15795 -13677 -5255 -4969 -10019 -3921 27 -9924 -13823 -5411 -517 3581 -2846 -1275
6177 -1275 2892 2372 -3222 -6346 -5959 1971 -3278 -9699 -4410 -10030 -11854 -12327 -6964 840 4907 4445
6161 4445 3097 1106 -878 -3584 -1370 2038 4754 -3101 -4597 -3145 -5520 -6628 -3998 791 6360
6146 6360 6945 4387 1230 -3296 -4849 -10346 -7062 2205 2788 -3087 -5068 -1935 -3741 -5279 -3218
6131 -3218 -2453 -6641 -6279 -3547 859 3527 -3007 -4532 -3477 -1149 -6031 -14966 -17633 -17165 -13883 -6985
$$ packed form
6240g731k56k364r49j482M553J183j286L061P515r114L33J788j937o03L955j61
6224c495q50R59M153J073r89m558p36k703j508L832p39K707J769j639k056K506
6208b274K862Q74k98K362P811l148m254n137r22K545J990M467j800k390p319l246
6192g877l989l929K118Q422K86n050O098L948r951l899Q412M894M098o427J571
6177a275M167n20n594l124L87P930n249o421N289n620j824m73N363P804M067m62
6161D445j348j991j984k706K214L408K716p855j496J452k375j108K630M789N569
6146F360N85k558l157m526j553n497L284R267N83n875j981L133j806j538K061
6131c218P65m188L62K732M406K668o534j525J055K328m882q935k667M68L282O898
$$ plain form
6115 -6985 934 4837 -1257 -397 -2112 -877 -1120 -5454 -13500 -15969 -15089 -20647 -13168 -9142 -8668 -9310
6099 -9310 -10589 -7457 -7216 -2840 417 -421 5313 11206 4027 -2340 -2520 -659 -5583 -2696 3581 2632
6083 2632 4487 -1147 -5120 -1156 1954 1596 385 9030 5453 -6616 -8699 -8520 -5480 -6331 -8329
6068 -8329 -2300 2677 75 -853 -3588 -9280 -12470 -17266 -18765 -17681 -15254 -8190 1446 -3667 -9293
6053 -9293 -13658 -16686 -17015 -13184 -8228 -275 2936 2406 1671 2528 3392 1439 -1338 -6283 -8325 -13174
6037 -13174 -10419 -6053 -4060 1993 -333 -7982 -8484 -7737 -6067 -9297 -8092 -3420 -3439 -2136 -503 -1329
6021 -1329 9054 13551 11797 253 -1324 1184 230 3896 5577 7544 10539 14745 7857 6782 3059
6006 3059 -2512 -6664 -12514 -11119 -7323 -9713 -464 4576 3766 2495 -4132 -9953 -5526 -2491 -1643
$$ packed form
6115f985P919L903o094Q60j715J235k43m334q046k469Q80n558P479M026M74o42
6099i310j279L132K41M376L257q38N734N893p179o367j80J861m924K887O277r49
6083B632J855n634l973L964L110l58j211Q645l577j2069k083J79L040q51j998
6068h329O029M977k602r28k735n692l190m796j499J084K427P064R636n113n626
6053i293m365l028l29L831M956P953L211n30p35Q57Q64j953k777m945k042m849
6037a3174K755M366J993O053k326p649n02P47J670l230J205M672j9J303J633q26
6021a329J0383M497j754j1544j577K508r54L666J681J967K995M206o888j075l723
6006C059n571m152n850J395L796k390R249N040q10j271o627n821M427L035Q48
$$ plain form
5991 -1643 975 705 -3358 -3639 -1646 2828 518 -3072 1008 2579 5085 3537 3231 1591 -2366 -3488
5975 -3488 -2726 -7939 -14040 -11229 -4361 -3637 -200 -2613 242 -8241 -9674 -8967 -10768 -7120 -6015 -3305
5959 -3305 -576 2700 4431 -7320 -9229 -7862 -8567 -7011 -3308 -1247 -6707 -7839 -5372 -6776 -6753
5944 -6753 -6618 -9495 -15542 -15502 -16706 -16293 -14577 -15837 -9974 -7444 -7669 -6591 -8128 -11663 -12516 -5935
5928 -5935 -7835 -16107 -18088 -12725 -10951 -11034 -15551 -17778 -10404 -6622 -3319 -7685 -13347 -15930 -12125
5913 -12125 -13767 -10239 -6305 -6917 -7697 -8986 -10597 -11703 -2311 -4236 -6573 1588 3481 824 -1696
5898 -1696 -7458 -6444 -3670 -4580 -4462 -4443 -6085 -9784 -17023 -16000 -9338 -7717 -9942 -9602 -11645 -18069
5882 -18069 -16876 -13982 -4910 -529 -2829 -1170 784 282 -221 -8932 -13529 -15779 -21657 -21543 -17346
$$ packed form
5991a643K618k70m063k81J993M474k310l590M080J571K506j548l06j640l957j122
5975c488P62n213o101K811O868P24L437k413K855q483j433P07j801L648J105K710
5959c305K729L276J731j1751j909J367p05J556L703K061n460j132K467j404K3
5944f753J35k877o047M0j204M13J716j260N863K530k25J078j537l535q53O581
5928e935j900q272j981N363J774q3m517k227P374L782L303m366n662k583L805
5913a2125j642L528L934o12p80j289j611j106R392j925k337Q161J893k657k520
5898a696n762J014K774r10J18J9j642l699p239J023O662J621k225L40k043o424
5882a8069J193K894R072M381k300J659J954n02n03q711m597k250n878J14M197
$$ plain form
5867 -17346 -13907 -11146 -12440 -14546 -10618 -6724 -7213 -4885 -2099 -1127 -2706 -11248 -11163 -7711 -2309 2364
5851 2364 7023 3437 1189 3315 -1877 -8031 -6276 -6392 -752 5197 -145 -2657 -4099 -3857 -1491
5836 -1491 -5811 -3125 1204 3767 -1889 -8731 -11371 -7074 -4760 -3086 -6514 -4506 -5563 -5444 -5045
5821 -5045 -7758 -2726 1183 -4143 -15698 -14411 -9888 -12015 -15199 -18829 -21605 -18196 -11259 -10753 -12144
5806 -12144 -9530 -9795 -10121 -9103 -15327 -16507 -17777 -12291 -8795 -11607 -11586 -7206 -3779 -4849 4184 5262
5790 5262 2600 -1185 -7395 -14918 -10383 -7584 -9387 -13919 -16679 -13065 -8599 -10672 -11202 -16391 -16353 -17552
5774 -17552 -15313 -24571 -30394 -18239 -5032 -7533 -16403 -20493 -17215 -11415 -14303 -13617 -17303 -14382
5760 -14382 -6115 1666 -208 -9146 -6231 -7189 -1271 -3534 -13916 -15932 -22641 -25541 -17808 -13317 -15156
$$ packed form
5867a7346L439K761j294k106L928L894m89K328K786R72j579q542Q5L452N402M673
5851B364M659l586k248K126n192o154J755j16N640N949n342k512j442K42K366
5836a491m320K686M329K563n656o842k640M297K314J674l428K008j057J19L99
5821e045k713N032L909n326j1555J287M523k127l184l630k776L409O937N06j391
5806a2144K614k65l26J018o224j180j270N486L496k812K1M380L427j070R033J078
5790E262k662l785o210p523M535K799j803m532k760L614M466k073n30n189L8j199
5774a7552K239r258n823J2155J3207k501q870m090L278N800k888O86l686K921
5760a4382Q267P781j874q938K915r58N918k263j0382k016o709k900P733M491j839
$$ plain form
5745 -15156 -14898 -18834 -22145 -17511 -17158 -14577 -8149 -1341 -1959 -4068 -10597 -10912 -11138 -7490 -3133 628
5729 628 -7441 -6355 -5485 -8005 -11037 -8235 -7068 -4726 -1747 -973 -667 1260 2285 453 -4956 -13836
5713 -13836 -16324 -11433 -9767 -10809 -7831 -7452 -7888 -1821 -2799 -3007 -5301 -4329 -5101 -7429 -9888 -10749
5697 -10749 -6669 -6285 -7041 -1286 687 -659 5516 -1159 -4857 -6130 -4887 -4613 -1126 1517 -6
5682 -6 -237 2453 2520 -2153 -462 1945 -1531 303 -3964 -2022 -867 -2809 -4452 -2641 -7789 -10790
5666 -10790 -9535 -10654 -12761 -10481 -5944 -3787 -4764 -3484 -1016 -1456 -2959 -4329 -5113 -3898 -12089
5651 -12089 -13025 -15375 -13901 -13609 -10599 -11847 -12170 -17122 -11279 -3476 -1889 -2593 -5327 -4704 -2293 20
5635 20 2026 4612 6992 3103 -2360 -3564 1749 1361 3158 -4503 -10574 -11785 -8752 -6645 -3366 -5266
$$ packed form
5745a5156K58l936l311M634L53K581O428O808o18k109o529l15k26L648M357L761
5729F28q069J086Q70k520l032K802J167K342K979P74L06J927J025j832n409q880
5713a3836k488M891J666j042K978L79m36O067r78k08k294R72p72k328k459q61
5697a0749M080L84p56N755J973j346O175o675l698j273J243K74L487K643j523
5682fk31K690O7m673J691K407l476J834m267J942J155j942j643J811n148l001
5666a0790J255j119k107K280M537K157r77J280K468m40j503j370p84J215q191
5651a2089r36k350J474K92L010j248l23m952N843P803J587p04k734O23K411K313
5635B0K006K586K380l889n463j204N313l88J797p661o071j211L033K107L279j900
$$ plain form
5619 -5266 -1714 -1525 -4804 -2229 -2949 -3639 -695 -2676 -3093 -56 1380 -1393 -3178 -4771 -1048 685
5603 685 3014 1079 -2929 -5482 -10302 -11398 -6700 -3880 879 4056 -540 -5454 -4421 -6105 -9225
5588 -9225 -8164 -10053 -10864 -4843 -3126 129 -1934 -1745 -2799 -3679 -3976 -9458 -7141 -10084 -10071 -11517
5572 -11517 -9078 -8866 -10151 -6966 -10216 -17614 -18091 -12912 -1324 626 967 -5644 -7015 -6151 -3585
5557 -3585 -4351 -6611 -9371 -15019 -17700 -14195 -8848 -11042 -13985 -12864 -10195 -9174 -12755 -13631 -7588
5542 -7588 -8706 -8508 -7399 -8330 -14054 -11211 -8343 -9473 -11089 -7126 -7900 -11450 -10614 -9688 -7683 -4030
5526 -4030 5431 -259 -8178 -12937 -10677 -7904 -10346 -8076 -1492 329 -1000 -3009 -4447 -7571 -9432
5511 -9432 -6521 37 665 936 3659 1244 82 -3497 -12377 -17636 -7475 -14 339 -4667 -9148
$$ packed form
5619e266L552J89l279K575p20o90K944j981m17L037J436k773j785j593L723J733
5603F85K329j935m008k553m820j096M698K820M759L177m596m914J033j684l120
5588i225J061j889q11O021J717L255k063J89j054q80k97n482K317k943J3j446
5572a1517K439K12j285L185l250p398m77N179J1588J950L41o611j371Q64K566
5557c585p66k260k760n648k681L505N347k194k943J121K669J021l581q76O043
5542g588j118J98J109r31n724K843K868j130j616L963p74l550Q36R26K005L653
5526d030R461n690p919m759K260K773k442K270O584J821j329k009j438l124j861
5511i432K911O558O28K71K723k415j162l579q880n259J0161P461L53n006m481
$$ plain form
5496 -9148 -10770 -9577 -12849 -12260 -11471 -11205 -15662 -16394 -17494 -10268 -6468 -19249 -15597 -8879 182 4857
5480 4857 3194 -1093 -1082 -407 -6130 -13083 -12399 -4714 -6354 -8723 -7160 -8032 -12053 -10386 -13188 -17953
5464 -17953 -10414 -1192 -3145 -3308 -1664 -3700 -6758 -6866 -11222 -12085 -12696 -9761 -6434 -4893 -4834 -4017
5448 -4017 -9906 -21123 -20292 -12525 -7902 -11155 -15161 -17139 -16624 -10000 -7053 -8292 -9052 -8515 -12824 -13614
5432 -13614 -12061 -12190 -9165 -14082 -10745 -9190 -6997 -7328 -11523 -6453 1055 1380 -7422 -12296 -8017
5417 -8017 -6403 -16004 -14200 -12844 -6362 -4381 -6375 -5181 -2037 -5638 -6174 -859 -2026 2919 6449
5402 6449 2151 -555 -5871 -13492 -14687 -9912 -7373 -6847 -6398 -6802 -9978 -13238 -15932 -11830 -10072 -10283
5386 -10283 -9162 -2628 -4787 -12443 -15768 -13753 -10625 -12112 -6503 -9701 -9000 -12626 -11962 -6082 -1647
$$ packed form
5496i148j622J193l272N89P89K66m457p32j100P226L800j2781L652O718R061M675
5480D857j663m287J1O75n723o953O84P685j640k369J563q72m021J667k802m765
5464a7953P539R222j953j63J644k036l058j08m356q63o11K935L327J541N9Q17
5448d017n889j1217Q31P767M623l253m006j978N15O624K947j239p60N37m309p90
5432a3614J553j29L025m917L337J555K193l31m195N070P508L25q802m874M279
5417h017J614r601J804J356O482J981j994J194L144l601n36N315j167M945L530
5402F449m298k706n316p621j195M775K539N26M49m04l176l260k694M102J758k11
5386a0283J121O534k159p656l325K015L128j487N609l198P01l626O64N880M435
$$ plain form
5371 -1647 1503 1007 -652 -2586 -4868 -8539 -5894 -4734 -7197 -10267 -10492 -6248 -10283 -7478 2208
5356 2208 4645 1099 550 -2140 -4198 -5360 1326 1836 272 -6549 -6837 -1443 2968 -3327 -6848 -10831
5340 -10831 -10051 -7458 -7095 -9341 -7381 -654 -751 -6687 -11176 -7304 -6589 -7117 -3218 493 7331 6338
5324 6338 -973 -4472 -7412 -11289 -6087 -7255 -2897 -1982 -3238 -2806 -10446 -15831 -20407 -9218 -1990
5309 -1990 -3485 -7159 -9614 -11381 -14492 -14652 -15291 -17189 -14330 -13647 -14727 -12831 -9073 -6851 1733 3053
5293 3053 -6869 -8975 -9802 -9193 -9003 -6371 -12345 -13833 -9538 -10970 -15718 -13108 -10065 -7179 -525 3225
5277 3225 2514 -553 -4101 -7577 -10366 -5988 -3930 -8544 -10539 -7525 -10667 -12734 -8182 -6812 -6732 -8582
5261 -8582 -12480 -12621 -16877 -17189 -16105 -16162 -17782 -18773 -18694 -17780 -19323 -10876 -8321 -8361 -12038 -14838 -19124
$$ packed form
5371a647L150m96j659j934k282l671K645J160k463l070k25M244m035K805R686
5356B208K437l546n49k690k058j162O686N10j564o821k88N394M411o295l521l983
5340a0831P80K593L63k246J960O727r7n936m489L872P15n28L899L711O838r93
5324F338p311l499k940l877N202j168M358R15j256M32p640n385m576J1189P228
5309a990j495l674k455j767l111j60o39j898K859O83j080J896L758K222Q584J320
5293C053r922k106q27O09J90K632n974j488M295j432m748K610L043K886O654L750
5277C225p11l067l548l476k789M378K058m614j995L014l142k067M552J370Q0j850
5261h582l898j41m256l12J084n7j620r91P9R14j543Q447K555m0l677k800m286
$$ plain form
5244 -19124 -12723 -10152 -15056 -21693 -19020 -12477 -8451 -9286 -4978 -2129 -1976 -4172 -6811 -2613 -3314
5229 -3314 -3458 1192 983 -2480 -3250 -9144 -10811 -5016 5974 -1724 -1096 5927 2366 -917 -380 8313
5213 8313 2197 -4217 -12070 -5685 8403 7151 5594 878 327 -1900 -8623 -13296 -19376 -19213 -14268
5198 -14268 -7610 -5446 -12689 -15859 -11701 -4487 -1997 -6621 -11506 -13109 -17685 -20042 -19404 -20451 -19034
5183 -19034 -16184 -15048 -12748 -8835 -8290 -9566 -8426 -11845 -16936 -16790 -13845 -11182 -8810 -4699 -3885
5168 -3885 2868 1623 1944 -5207 -8004 -6315 -11697 -7869 -3824 3466 6148 6486 3507 -1551 -5458
5153 -5458 -6489 -6642 -5546 816 4278 5833 -2099 -8827 -8584 -8528 -11912 -18500 -15856 -11922 -11421 -7234
5137 -7234 -1029 -3820 4192 7103 1732 -2648 -11666 -16166 -13527 -8498 -6834 -5423 -4248 -8112 -14772
$$ packed form
5244a9124O401K571m904o637K673O543M026q35M308K849J53k196k639M198p01
5229c314j44M650k09l463p70n894j667N795J0990p698O28P023l561l283N37Q693
5213H313o116o414p853O385J4088j252j557m716n51k227o723m673o080J63M945
5198a4268O658K164p243l170M158P214K490m624m885j603m576k357O38j047J417
5183a9034K850J136K300L913N45j276J140l419n091J46K945K663K372M111Q14
5168c885O753j245L21p151k797J689n382L828M045P290K682L38k979n058l907
5153e458j031j53J096O362L462J555p932o728K43N6l384o588K644L934N01M187
5137g234O205k791Q012K911n371m380r018m500K639N029J664J411J175l864o660
$$ plain form
5122 -14772 -9118 -2629 46 38 -1342 1833 3308 5384 -868 -3814 -7166 -7063 -4977 -2084 -1649 -9227
5106 -9227 -8019 -2698 6295 10615 6232 -4054 -6150 -2826 -4652 -8385 -4831 -3140 -5646 4882
5092 4882 4801 -3196 -4310 -4091 -6375 395 7454 2167 469 -1549 -9470 -12350 -6176 -2175 -1182 1967
5076 1967 -2752 -15281 -21851 -13011 -7667 -5014 -7787 -14500 -13868 -5272 -4124 -6218 -5213 -13374 -7395
5061 -7395 -2174 -7754 -12167 -12413 -13240 -15408 -14741 -11415 -10873 -13783 -10116 -9771 -13617 -14491 -9343 -6308
5045 -6308 17 -1860 -8226 -11887 -11638 -16995 -20151 -17845 -11811 -3574 -49 -2181 1844 2823 -4668
5030 -4668 -8310 -10650 -8208 -1426 -338 -234 202 3434 2375 -3992 -4268 3620 7046 -1698 -3531 -2380
5014 -2380 -2297 -4449 -5487 -4903 -2048 4876 -2356 -8607 -13223 -15942 -17659 -21210 -18865 -10863 -15016 -14610
$$ packed form
5122a4772N654O489K675qj380L175J475K076o252k946l352J03K086K893M35p578
5106i227J208N321Q993M320m383j0286k096L324j826l733L554J691k506J0528
5092D882q1p997j114K19k284O770P059n287j698k018p921k880O174M001R93L149
5076A967m719j2529o570Q840N344K653k773o713O32Q596J148k094J005q161N979
5061g395N221n580m413k46q27k168O67L326N42k910L667L45l846q74N148L035
5045f308O325j877o366l661K49n357l156K306O034Q237L525k132M025R79p491
5030d668l642k340K442O782J088J04M36L232j059o367k76P888L426q744j833J151
5014b380Q3k152j038N84K855O924p232o251m616k719j717l551K345Q002m153M06
$$ plain form
4998 -14610 -13779 -12731 -12845 -6724 -4720 -6676 -9582 -9714 -12160 -8512 -1226 -3730 -3494 -3990 -6679 -8826
4982 -8826 -8546 -13116 -13818 -14761 -13722 -15450 -17087 -10561 -7295 -2128 805 48 -6267 -11091 -13719 -15197
4966 -15197 -11603 -12667 -17202 -19757 -18899 -18555 -15092 -4268 -377 -2851 -2044 -3008 -2797 -3912 -5249 -5602
4950 -5602 -4260 -4742 -1288 3008 5573 4350 -3525 -10795 -8153 -6224 -5866 -10764 -13301 -5840 -7626
4935 -7626 -6121 -3297 2007 3551 4069 6818 10292 6901 6568 6718 2431 -3685 -7003 -7509 -6443 -6162
4919 -6162 -7027 -4403 -2442 -4322 -2290 -3021 259 3113 729 -4861 -6642 -10890 -16346 -14621 -6857
4904 -6857 1566 -5177 -6480 -1069 2168 1920 1010 2882 2416 310 4011 -1096 -2381 -9201 -10276 -5926
4888 -5926 -4775 -2671 -9215 -10394 -6680 -12956 -14448 -20380 -21549 -12334 -1474 -4127 -6760 -9815 -5888
$$ packed form
4998a4610Q31J048j14O121K004j956k906j32k446L648P286k504K36m96k689k147
4982h826K80m570p02r43J039j728j637O526L266N167K933p57o315m824k628j478
4966a5197L594j064m535k555Q58L44L463J0824L891k474Q07r64K11j115j337l53
4950e602J342m82L454M296K565j223p875p270K642J929L58m898k537P461j786
4935g626J505K824N304J544N18K749L474l391l33J50m287o116l318n06J066K81
4919f162q65K624J961j880K032p31L280K854k384n590j781m248n456J725P764
4904f857Q423o743j303N411L237k48r10J872m66k106L701n107j285o820j075M350
4888e926J151K104o544j179L714o276j492n932j169R215J0860k653k633l055L927
$$ plain form
4873 -5888 -3621 -2172 -1582 -2707 -4258 -4888 1695 3689 6261 1963 169 -4191 -9765 -4939 -4376 -9272
4857 -9272 -8133 -2600 2570 2327 1114 3082 595 -4388 -5168 -1709 -215 -1368 -1632 227 -1979 -2638
4841 -2638 3671 6002 527 -1636 -5358 -7634 -8620 -13955 -12942 -13657 -12853 -10006 -6843 -5833 -7956 -8760
4825 -8760 -13158 -14490 -12063 -9155 -5463 -5266 -6202 -5935 -3649 -3775 -9723 -20922 -20896 -14530 -15376 -15250 -11229
4808 -11229 -11164 -16448 -19635 -14467 -13245 -7538 -11199 -13274 -8997 -4562 -6745 -5766 -6871 -7726 -8451 -5290
4792 -5290 -6264 -7712 -8190 -11906 -16024 -21757 -16519 -13881 -9950 -12244 -16808 -9877 -3508 2670 5105
4777 5105 951 -4707 -7018 -9681 -13815 -14942 -14056 -8780 -8164 -10503 -13893 -8143 -6737 -11448 -16351
4762 -16351 -16568 -15649 -5673 -16 -3455 -6438 -6354 -10269 -11207 -10216 -11599 -9604 -9764 -6494 -3587 -527
$$ packed form
4873e888K267J449N90j125j551o30O583J994K572m298j794m360n574M826N63m896
4857i272J139N533N170k43j213J968k487m983p80L459J494j153k64J859k206o59
4841b638O309K331n475k163l722k276r86n335J013p15Q04K847L163J010k123q04
4825h760m398j332K427K908L692J97r36K67K286j26n948j1199K6O366q46J26M021
4808a1229O5n284l187N168J222N707l661k075M277M435k183R79j105q55p25L161
4792e290r74j448m78l716m118n733N238K638L931k294m564O931O369O178K435
4777E105m154n658k311k663m134j127Q86N276O16k339l390N750J406m711m903
4762a6351k17R19R976N657l439k983Q4l915r38R91j383J995j60L270K907L060
$$ plain form
4746 -527 -1745 -3975 -8709 -9411 -10601 -11467 -7915 -13102 -9563 -7096 -3851 -2723 -8334 -17570 -11410 -12583
4730 -12583 -13558 -12394 -7723 -5182 -6110 -3624 -3772 -5522 -11894 -2494 -2162 -5754 880 2584 -4959 -12339
4714 -12339 -5090 -1699 -3960 -7952 -1160 -4244 -12685 -12156 -20231 -17906 -8715 -8083 -14278 -14342 -15351 -17640
4698 -17640 -14130 -5710 -10081 -9789 -6427 -5724 -12304 -11562 -14346 -15138 -12704 -11206 -5549 -5578 -4327 50
4682 50 7942 5107 -5993 -15446 -14737 -11808 -13912 -17234 -15709 -13542 -10098 -11339 -7453 -3268 -4673
4667 -4673 -4664 -8729 -13365 -9573 -2104 -1543 225 -61 -4406 -5927 -11638 -14145 -13559 -6307 -9344 -19980
4651 -19980 -14112 -9966 -9692 -6411 -8714 -8060 -5683 -5783 -3201 -8663 -6500 -7902 -6388 -2031 -7684
4636 -7684 -13817 -13152 -11872 -7669 -7744 -3915 -6915 -6045 -2898 -7284 -14259 -17445 -11410 -5355 -2822 -4319
$$ packed form
4746e27j218k230m734p02j190q66L552n187L539K467L245J128n611r236O160j173
4730a2583r75J164M671K541r28K486j48j750o372R400L32l592O634J704p543p380
4714a2339P249L391k261l992O792l084q441N29q075K325R191O32o195o4j009k289
4698a7640L510Q420m371K92L362P03o580P42k784p92K434J498N657k9J251M377
4682E0P892k835j1100r453P09K929k104l322J525K167L444j241L886M185j405
4667d673Rm065m636L792P469N61J768k86m345j521n711k507N86P252l037j0636
4651a9980N868M146K74L281k303O54K377j00K582n462K163j402J514M357n653
4636g684o133O65J280M203p5L829l000Q70L147m386o975l186O035O055K533j497
$$ plain form
4620 -4319 -3831 -5823 -7544 -721 -914 -2221 -8163 -7135 -8223 -11758 -5489 -2960 -1127 2490 1245
4605 1245 -2193 38 -1090 -457 229 -2688 -6458 -13167 -11977 -14698 -15205 -14799 -11921 -14678 -11266 -5094
4589 -5094 -6228 -11933 -18285 -12628 -11189 -11740 -10418 -2734 1199 -1839 -4963 -6042 -5616 -6532 -4522 -8360
4573 -8360 -18564 -14778 -2380 536 2190 5852 -1011 -8249 -10184 -4814 -4099 -6111 -8247 -5979 -4691
4558 -4691 -8901 -16120 -22838 -24679 -19533 -11529 -14646 -11558 -4462 1691 4731 7556 1 1860 3184
4543 3184 -116 -7555 -10991 -14327 -12975 -9442 -3292 -1773 -4740 -9662 -10930 -13217 -14272 -14788 -17626
4528 -17626 -15460 -5900 -4952 486 -4629 -6241 -7427 -8433 -7195 -9849 -11282 -14551 -10414 -7360 -11774
4513 -11774 -18235 -12304 -13367 -11958 -8171 -2056 3099 136 -5138 -2639 -6104 -8016 -10755 -8755 -11697
$$ packed form
4620d319M88j992j721O823j93j307n942J028j088l535O269K529J833L617j245
4605A245l438K231j128O33O86k917l770o709J190k721n07M06K878k757L412O172
4589e094j134n705o352N657J439n51J322P684L933l038l124j079M26r16K010l838
4573h360j0204L786J2398K916J654L662o863p238j935N370P15k012k136K268J288
4558d691m210p219o718j841N146Q004l117L088P096O153L040K825p555J859J324
4543C184l300p439l436l336J352L533O150J519k967m922j268k287j055n16k838
4528a7626K166R560R48N438n115j612j186j006J238k654j433l269M137L054m414
4513a1774o461N931j063J409L787O115N155k963n274K499l465j912k739K000k942
$$ plain form
4498 -11697 -10689 -11088 -9610 -5118 -2349 -2856 -7299 -7077 -7728 -8724 -12213 -14271 -13146 -1432 717 732
4482 732 -3718 -8851 -14381 -6029 -4667 -5949 -4722 -5420 -7679 -13407 -9806 -3401 -3490 -7865 -10380 -6354
4466 -6354 -8230 -4697 -2290 -704 5448 2603 -2445 -7028 -7711 -13403 -13991 -6769 -5429 -2987 -2421 -1869
4450 -1869 -545 -4183 -6500 -4256 -4513 -3857 -1748 -14 3025 -1130 -5151 -15188 -12037 -7964 -957
4435 -957 1216 6528 5318 -1511 -6850 -5352 2047 4782 915 -12172 -12640 -8437 -3411 6029 5096
4420 5096 -2979 -4762 -3544 -6436 -5372 -5001 -9772 -6282 -3372 -140 -643 2556 8119 -1213 -9548
4405 -9548 -9957 306 4595 3999 1172 2952 -2351 -3077 227 4822 3160 -1527 1765 598 -8197
4390 -8197 -9096 -9743 -11645 -11453 -9342 -8992 -10097 -4498 -2633 -5051 -10051 -5805 -4305 -3248 -4691 -10428
$$ packed form
4498a1697J008l99J478M492K769n07m443K22o51r96l489k058J125J1714K149J5
4482G32m450n133n530Q352J362j282J227o98k259n728L601O405q9m375k515M026
4466f354j876L533K407J586O152k845n048m583o83n692n88P222J340K442N66N52
4450a869J324l638k317K244k57O56K109J734L039m155m021j0037L151M073P007
4435i57K173N312j210o829n339J498P399K735l867j3087m68M203N026R440r33
4420E096q075j783J218k892J064L71m771L490K910L232n03L199N563r332q335
4405i548m09J0263M289n96k827J780n303p26L304M595j662m687L292j167q795
4390h197q99o47j902J92K111L50j105N599J865k418n000M246J500J057j443n737
$$ plain form
4374 -10428 -11313 -4969 3162 2692 1403 -1034 -1909 -4575 -7241 -8901 -8752 -10380 -14593 -18585 -19252 -18121
4358 -18121 -14980 -9702 -6411 -3868 -4988 -10224 -11291 -13505 -17368 -14090 -12547 -15984 -15359 -19825 -18129
4343 -18129 -11903 -13893 -16526 -12805 -10335 -4788 -5661 -10037 -12433 -5126 -5990 -8685 -4758 -6486 -6567 -6092
4327 -6092 -3922 -9659 -7807 -9585 -14878 -8933 -9906 -15409 -13190 -5826 -4211 -8373 -13681 -14339 -13742 -8073
4311 -8073 -9577 -3071 -2144 -5082 -9434 -2809 -2817 -1858 712 -2766 -4579 -4164 2532 2428 -1597 -2926 51
4294 51 -140 -5638 -9471 -11178 -10029 -8249 -6389 -7145 -6097 -5036 -4946 -4356 -7881 -10923 -8858 -6949 -17283
4277 -17283 -22931 -22387 -13308 -5462 -339 -819 -7718 -10744 -5280 -5260 -14390 -20330 -18440 -11273 -8357 -7385
4261 -7385 -9000 -10976 -7340 -3177 -1624 -5960 -988 -4544 -7310 -4264 -2998 -4682 -5058 -898 -197
$$ packed form
4374a0428q85O344Q131m70j289k437q75k666k666j660J49j628m213l992o67J131
4358a8121L141N278L291K543j120n236j067k214l863L278J543l437O25m466J696
4343a8129O226j990k633L721K470N547q73m376k396P307q64k695L927j728q1M75
4327f092K170n737J852j778n293N945r73n503K219P364J615m162n308o58N97N669
4311h073j504O506R27k938m352O625qR59K570l478j813M15O696j04m025j329K977
4294E1j91n498l833j707J149J780J860p56J048J061R0N90l525l042K065J909j0334
4277a7283n648N44R079P846N123m80o899l026N464K0r130n940J890P167K916R72
4261g385j615j976L636M163J553m336M972l556k766L046J266j684l76M160P01
$$ plain form
4246 -197 712 -11774 -19893 -14853 -6133 3947 4252 -5528 -8675 -7898 -9642 -5628 2461 10779 11759 3249
4230 3249 -3812 -2198 -4361 -4518 -5468 -10711 -7815 -5209 -7275 -956 1813 2747 306 7190 8388 1447
4214 1447 -4477 -3699 2772 4199 -4362 -14122 -15866 -12452 -10349 -6209 -1464 -10293 -16177 -12205 -9518
4199 -9518 -7223 -5829 -15269 -11973 -5157 1409 1863 72 -7822 -13751 -16169 -13588 -13693 -16645 -14763
4184 -14763 -14511 -12730 -8587 -8302 -6849 -5924 -6636 -7034 -4627 -6047 -12006 -15660 -15043 -10805 -7152 -7236 -10312
4167 -10312 -7824 -4721 -10570 -17290 -18870 -16061 -11074 -8657 -12246 -10137 -8285 -3516 -7409 -9449 -8494
4152 -8494 -2021 5650 5238 2998 1955 1601 49 -6790 -11229 -13177 -20168 -22046 -18898 -20311 -21885
4137 -21885 -23294 -18777 -16458 -15758 -17665 -9107 -6417 -7223 -3660 5781 7980 3852 2026 -394 -3252
$$ packed form
4246a97R09j2486q119N040Q720J0080L05r780l147P77j744M014Q089Q318R80q510
4230C249p061J614k163j57r50n243K896K606k066O319K769R34k441O884J198o941
4214A447n924P78O471J427q561r760j744L414K103M140M745q829n884L972K687
4199i518K295J394r440L296O816O566M54j791p894n929k418K581j05k952J882
4184a4763K52J781M143K85J453R25p12l98K407j420n959l654O17M238L653q4l076
4167a0312K488L103n849o720j580K809M987K417l589K109J852M769l893k040R55
4152h494O473P671m12k240j043l54j552o839m439j948o991j878L148j413j574
4137b1885j409M517K319P00j907Q558K690q06L563R441K199m128j826k420k858
$$ plain form
4122 -3252 -4108 -6547 -8904 -4268 -410 1525 -6587 -7825 -6175 -1995 19 -2394 -1525 383 -3516
4107 -3516 -1683 3910 2330 1248 -1494 -1360 -627 2838 -4673 -11664 -12342 -9203 -11894 -13315 -9652 -7702
4091 -7702 -2754 -11337 -11403 -9326 -6221 -6530 -15155 -16599 -22515 -15869 -13922 -13618 -8692 145 -5299 -13311
4075 -13311 -15705 -18822 -14979 -2230 -7364 -10674 -1945 5542 3851 1492 2223 346 -7084 -8330 -11356
4060 -11356 -14300 -6187 -3017 -2696 -2590 -1892 -9399 -12369 -17911 -23260 -18189 -12132 -4009 -1601 -446
4045 -446 -2461 -4712 -7241 -7123 -4269 -6642 -8142 -8311 -7676 -5725 -3250 -6200 -7515 2546 4639 -2175
4029 -2175 -3904 -5400 -6810 -7824 -7892 -4707 -7403 -5249 -5178 -5656 -14079 -11442 5648 18822 24365 11000
4013 11000 -18944 -29277 -6663 15202 16160 2557 -11248 -8677 584 -2985 -6000 -7416 -2176
$$ packed form
4122c252q56k439k357M636L858J935q112j238J650M180K014k413Q69J908l899
4107c516J833N593j580j082k742J34P33L465p511o991o78L139k691j421L663J950
4091g702M948q583o6K077L105l09q625j444n916O646J947L04M926Q837n444q012
4075a3311k394l117L843J2749n134l310Q729P487j691k359P31j877p430j246l026
4060a1356k944Q113L170L21J06O98p507k970n542n349N071O057Q123K408J155
4045d46k015k251k529J18K854k373j500j69O35J951K475k950j315J0061K093o814
4029b175j729j496j410j014o8L185k696K154P1m78q423K637J7090J3174N543j3365
4013A1000k9944j0333K2614K1865R58j3603j3805K571R261l569l015j416N240
$$ plain form
4000 -2176 -12215 -24082 -29054 -17143 -7345 -4102 -656 331 -3992 -2901 -1526 525 5567 5735 3160
3985 3160 2913 -6157 -12018 -6610 -2810 4677 1903 -5843 -5497 944 -326 -2775 -10382 -13097 -9671
3970 -9671 -8560 -11382 -3262 -1724 -2156 -4634 -9421 -6623 1697 -2568 -6224 -15117 -14331 -11107 -6766
3955 -6766 -1199 50 -5209 -1856 -5658 -823 324 -1126 -3445 193 -1646 -7162 -8149 -11632 -14751
3940 -14751 -7571 -11717 -14170 -4471 -604 -2234 1151 4218 490 -6456 -13274 -18575 -15964 -12673 -12794
3925 -12794 -16176 -15240 -9729 -2679 3235 -188 3006 6079 2618 440 936 2566 -2345 -2097 1909
3910 1909 -6374 -7495 -3776 -4187 -7993 -6108 -9228 -8923 -9679 -11252 -9019 -4953 -4966 -5985 -8366 -7895
3894 -7895 3438 285 -12148 -11702 -11838 -17221 -11054 -6677 -7412 -5076 -5651 -7715 -12048 -8265 -8247 -11404
$$ packed form
4000b176j0039j1867m972J1911R798L243L446R87m323J091J375K051N042J68k575
3985C160k47r070n861N408L800P487k774p746L46O441j270k449p607k715L426
3970i671J111k822Q120J538m32k478m787K798Q320m265l656q893P86L224M341
3955f766N567J249n259L353l802M835J147j450k319L638j839n516r87l483l119
3940a4751P180m146k453R699L867j630L385L067l728o946o818n301K611L291j21
3925a2794l382R36N511P050N914l423L194L073l461k178M96J630m911K48M006
3910A909q283j121L719m11l806J885l120L05p56j573K233M066j3j019k381M71
3894g895J1333l153j2433M46j36n383O167M377p35K336n75k064m333L783J8l157
$$ plain form
3878 -11404 -15583 -12717 -8484 -284 -2416 1770 3106 4171 4988 5076 -1638 -6946 -12257 -12913 -3439 -1139
3862 -1139 -4843 -4535 -11599 -8333 -4903 -7790 -7460 -9632 -13809 -11623 -4683 -5982 -10127 -12197 -10481
3847 -10481 -10005 -1389 5363 5806 9176 5820 3237 -2345 -5008 -9045 -9268 -8323 -7576 -13864 -16852 -11195
3831 -11195 -2057 1197 -4947 -12584 -10295 -3784 341 1307 -4075 -7181 -5547 -1802 -1273 -8543 -9684
3816 -9684 -8013 902 9158 5185 -3187 -9329 -4835 947 -3534 -8123 -16469 -18372 -10167 -5629 -6108
3801 -6108 -3286 -4740 -5756 -8037 -14675 -13189 -13713 -14050 -18580 -19487 -17570 -22288 -26697 -23949 -19060 -16175
3785 -16175 -10746 -4220 -2676 -7866 -9594 -3460 3991 5735 7142 5447 3933 3789 -949 -435 -102
3770 -102 -1762 -8372 -4111 1211 1359 -3334 -4183 1858 5492 -1133 -5415 3837 6349 1853 320 -2046
$$ packed form
3878a1404m179K866M233Q200k132M186J336J065Q17Q8o714n308n311o56R474K300
3862a139l704L08p064L266L430k887L30k172m177K186O940j299m145k070J716
3847a0481M76Q616O752M43L370l356k583n582k663m037k23R45P47o288k988N657
3831a1195R138L254o144p637K289O511M125R66n382l106J634L745N29p270j141
3816i684J671Q915Q256l973q372o142M494N782m481m589q346j903Q205M538m79
3801f108K822j454j016k281o638J486n24l37m530r07J917m718m409K748M889K885
3785a6175N429O526J544n190j728O134P451J744J407j695j514j44m738N14L33
3770a02j660o610M261N322J48m693q49O041L634o625m282R252K512m496j533k366
$$ plain form
3754 -2046 -2532 -2198 -1065 1654 3068 862 -9294 -12050 -11433 -10882 -6915 -7612 -5439 -1824 5975 10195
3738 10195 8845 8567 8766 7518 5661 6139 -844 -3820 -8720 -12427 -13458 -15690 -13182 -7487 -2330
3723 -2330 -4469 -7017 -7067 -8782 -5437 -1528 -3455 -10117 -8872 -3496 3747 2558 1234 7676 11001
3708 11001 8864 11457 5372 4965 7507 8810 4593 -3710 -2545 1213 -609 3469 -3376 -6865 -1791
3693 -1791 -610 -447 851 4797 4591 -2374 -7811 -114 3802 -70 -5954 -4438 -445 4057 3052
$$ packed form
3754b046m86L34J133K719J414k206j0156k756O17N51L967o97K173L615P799M220
3738A0195j350k78J99j248j857M78o983k976m900l707j031k232K508N695N157
3723b330k139k548n0j715L345L909j927o662J245N376P243j189j324O442L325
3708A1001k137K593o085m07K542J303m217q303J165L758j822M078o845l489N074
3693a791J181J63J298L946k06o965n437P697L916l872n884J516L993M502j005
$$ [...]
##END NTUPLES=NMR SPECTRUM
##END=
