##TITLE=XTC-1731o_2
##JCAMPDX= 6.0         $$ Bruker NMR JCAMP-DX V2.0
##DATA TYPE= nD NMR SPECTRUM
##DATA CLASS= NTUPLES
##NUM DIM= 2
##ORIGIN= BRUKER
##OWNER= patiny
$$ 1.79 TOPSPIN		Version 3.0
$$ 2012-05-21 00:56:49.635 +0200  patiny@icmbsg005
$$ Compression mode = diff/dup
##.OBSERVE FREQUENCY= 400.13188181139
##.OBSERVE NUCLEUS= ^1H
##.ACQUISITION MODE= SIMULTANEOUS (DQD)
##.ACQUISITION SCHEME= Echo-Antiecho
##.AVERAGES= 2
##.DIGITISER RES= 23
##SPECTROMETER/DATA SYSTEM= spect
##.PULSE SEQUENCE= hsqcetgpsisp2.2
##.SOLVENT NAME= D2O
##.SHIFT REFERENCE= INTERNAL, D2O, 1, 11.697
##AUDIT TRAIL= $$ (NUMBER, WHEN, WHO, WHERE, PROCESS, VERSION, WHAT)
$$ ##TITLE= Audit trail, TOPSPIN		Version 3.0
$$ ##JCAMPDX= 5.01
$$ ##ORIGIN= Bruker BioSpin GmbH
$$ ##OWNER= patiny
$$ $$ /opt/data/patiny/nmr/XTC-1731o_2/13/pdata/1/auditp.txt
$$ ##AUDIT TRAIL=  $$ (NUMBER, WHEN, WHO, WHERE, PROCESS, VERSION, WHAT)
(   1,<2012-05-21 00:56:48.591 +0200>,<patiny>,<icmbsg005>,<go>,<TOPSPIN 3.0>,
      <created by zg
	started at 2012-05-21 00:38:07.389 +0200,
	POWCHK enabled, PULCHK disabled,
       configuration hash MD5:
       77 C7 B7 C4 10 F4 BA 30 64 2E BB 52 82 F2 DA 41
       data hash MD5: 1K * 256
       76 56 C9 5B 3D 6C 23 94 1F 47 8D A1 32 6E B8 01>)
(   2,<2012-05-21 00:56:48.689 +0200>,<patiny>,<icmbsg005>,<audit>,<TOPSPIN 3.0>,
      <user comment:
       ICON-NMR User ID: patiny
       data hash MD5: 1K * 256
       76 56 C9 5B 3D 6C 23 94 1F 47 8D A1 32 6E B8 01>)
(   3,<2012-05-21 00:56:49.445 +0200>,<patiny>,<icmbsg005>,<proc2d>,<TOPSPIN 3.0>,
      <Start of raw data processing
       xfb same F2: SI = 1K WDW = 4 SSB = 2 FT_mod = 6 PKNL = 1 PHC0 = 0 PHC1 = 0 F1: SI = 1K ME_mod = 2 NCOEF = 32 WDW = 4 SSB = 2 FT_mod = 6
       data hash MD5: 1K * 1K
       D5 69 1E 68 49 A1 08 ED F2 5E C9 F4 23 FD C7 A6>)
(   4,<2012-05-21 00:56:49.533 +0200>,<patiny>,<icmbsg005>,<proc2d>,<TOPSPIN 3.0>,
      <abs2 F2: ABSG = 5 ABSF1 = 11.697 ABSF2 = -2.290992
       data hash MD5: 1K * 1K
       E8 18 0D 0A BB B9 39 65 69 B1 E4 57 4E 1E B5 57>)
(   5,<2012-05-21 00:56:49.624 +0200>,<patiny>,<icmbsg005>,<proc2d>,<TOPSPIN 3.0>,
      <abs1 F1: ABSG = 5 ABSF1 = 179.9984 ABSF2 = -40.017
       data hash MD5: 1K * 1K
       88 EB B9 9D 76 9D 8D F2 1C ED 98 BB 5A A0 F0 F0>)
$$ ##END=
$$ 
$$ $$ hash MD5
$$ $$ 6C 7D 4C 3B 3C 23 ED 3A 28 66 C2 9E 88 DA 34 A8
##$RELAX= 
##$RELAX= 
##$RELAX= 
##$RELAX= 
##$RELAX= 
##$RELAX= 
##$RELAX= 
##$RELAX= 
##$RELAX= 
##$RELAX= 
##$RELAX= 
$$ Bruker specific parameters
$$ --------------------------
##$DATPATH= </opt/data/patiny/nmr>
##$EXPNO= 13
##$NAME= <XTC-1731o_2>
##$PROCNO= 1
##$ACQT0= 0
##$AMP= (0..31)
100 100 100 100 100 100 100 100 100 100 100 100 100 100 100 100 100 100
100 100 100 100 100 100 100 100 100 100 100 100 100 100
##$ANAVPT= -1
##$AQSEQ= 0
##$AQ_mod= 3
##$AUNM= <au_zg>
##$AUTOPOS= <52 >
##$BF1= 400.13
##$BF2= 100.612769
##$BF3= 400.13
##$BF4= 400.13
##$BF5= 400.13
##$BF6= 400.13
##$BF7= 400.13
##$BF8= 400.13
$$ [...]
##$REVERSE= no
##$SF= 400.13
##$SI= 1024
##$SIGF1= 11.697
##$SIGF2= -2.290992
##$SINO= 0
##$SIOLD= 1024
##$SPECTYP= <>
##$SREGLST= <13C.H2O+D2O>
##$SSB= 2
##$STSI= 1024
##$STSR= 0
##$SW_p= 5597.01492537312
##$SYMM= 0
##$S_DEV= 1743549
##$TDeff= 1024
##$TDoff= 0
##$TI= <>
##$TILT= no
##$TM1= 0
##$TM2= 0
##$TOPLEV= 100
##$USERP1= <>
##$USERP2= <>
##$USERP3= <>
##$USERP4= <>
##$USERP5= <>
##$WDW= 4
##$XDIM= 1024
##$YMAX_p= 89792178
##$YMIN_p= -460372751
##$CURPLOT= <Cups-PDF>
##$CURPRIN= <$Cups-PDF>
##$DFORMAT= <normdp>
##$LAYOUT= <+/2D_inv.xwp>
##$LFORMAT= <normlp>
##$PFORMAT= <normpl>
$$ Bruker specific parameters for F1
$$ ---------------------------------
##$ACQT0= 0
##$BF1= 100.612769
##$FnMODE= 6
##$NUC1= <13C>
##$O1= 7041.95747781
##$SFO1= 100.619810957478
##$SW= 220
##$SW_h= 22136.3584106452
##$TD= 256
##$ABSF1= 179.9984
##$ABSF2= -40.017
##$ABSG= 5
##$ABSL= 0
##$ALPHA= 0
##$AQORDER= 0
##$ASSFAC= 0
##$ASSFACI= 0
##$ASSFACX= 0
##$ASSWID= 0
##$AUNMP= <>
##$AXLEFT= 0
##$AXNAME= <F1>
##$AXNUC= <13C>
##$AXRIGHT= 0
##$AXTYPE= 0
##$AXUNIT= <>
##$AZFE= 0.1
##$AZFW= 0.5
##$BCFW= 0
##$BC_mod= 0
##$BYTORDP= 0
##$COROFFS= 0
##$CY= -3
##$DATMOD= 1
##$DC= 0
##$DFILT= <>
##$DTYPP= 0
##$ERETIC= no
##$F1P= 0
##$F2P= 0
##$FCOR= 0.5
##$FTSIZE= 1024
##$FT_mod= 6
##$GAMMA= 0
##$GB= 0
##$INTBC= 1
##$INTSCL= 1
##$ISEN= 128
##$LB= 0
##$LEV0= 0
##$LPBIN= 512
##$MAXI= 10000
##$MC2= 5
##$MEAN= 0
##$ME_mod= 2
##$MI= 1
##$NCOEF= 32
##$NC_proc= -11
##$NLEV= 6
##$NOISF1= 0
##$NOISF2= 0
##$NSP= 0
##$NTH_PI= 0
##$NZP= 0
##$OFFSET= 179.9984
##$PC= 4
##$PHC0= 0
##$PHC1= 0
##$PH_mod= 0
##$PKNL= no
##$PPARMOD= 1
##$PPDIAG= 0
##$PPIPTYP= 0
##$PPMPNUM= 100
##$PPRESOL= 1
##$PSCAL= 1
##$PSIGN= 0
##$PYNMP= <>
##$REVERSE= no
##$SF= 100.612769
##$SI= 1024
##$SIGF1= 179.9984
##$SIGF2= -40.017
##$SINO= 0
##$SIOLD= 1024
##$SPECTYP= <>
##$SREGLST= <>
##$SSB= 2
##$STSI= 1024
##$STSR= 0
##$SW_p= 22136.3584106452
##$SYMM= 0
##$S_DEV= 1743549
##$TDeff= 512
##$TDoff= 0
##$TI= <>
##$TILT= no
##$TM1= 0
##$TM2= 0
##$TOPLEV= 0
##$USERP1= <>
##$USERP2= <>
##$USERP3= <>
##$USERP4= <>
##$USERP5= <>
##$WDW= 4
##$XDIM= 128
##$YMAX_p= 89792178
##$YMIN_p= -460372751
$$ End of Bruker specific parameters
$$ ---------------------------------
##NTUPLES= nD NMR SPECTRUM
##VAR_NAME=  FREQUENCY1,    FREQUENCY2,      SPECTRUM
##SYMBOL=    F1,            F2,              Y
##.NUCLEUS=  13C,           1H
##VAR_TYPE=  INDEPENDENT,   INDEPENDENT,     DEPENDENT
##VAR_FORM=  AFFN,          AFFN,            ASDF
##VAR_DIM=   1024,          1024,            1024
##UNITS=     HZ,            HZ,              ARBITRARY UNITS
##FACTOR=    21.6175375103957, 5.46583488805969, 1
##FIRST=     18110.137220953, 5591.54909048506, -1362025
##LAST=      -4004.60365218182, 0,           359832
##MIN=       -4004.60365218182, 0,           -460372751
##MAX=       18110.137220953, 5591.54909048506, 89792178
##PAGE= F1=18110.13722095
##FIRST=     18110.137220953, 5591.54909048506, -1362025
##DATA TABLE= (F2++(Y..Y)), PROFILE
$$ [...]
##PAGE= F1=10349.44125472
##FIRST=     18110.137220953, 5591.54909048506, 2291827
##DATA TABLE= (F2++(Y..Y)), PROFILE
862 -2849521 -2078016 523342 1874741 843184 -608413 -178996 120881 -1336782 -1769995
853 -1769995 -1253854 -869693 624904 2165718 1632020 920622 1356729 1345485 599121 -535528
842 -1341499 -505479 1776464 3037425 639579 -2403931 -2806400 -1605533 -274348 -368075
833 -368075 -1697003 -1380205 380760 539347 562514 373844 -952128 -1455128 -1032504 -333978
822 847200 1445914 1376435 1538926 1492955 2801073 2304740 -1127545 -2734966 -786277 1502625
811 1934638 720404 -487824 545614 1994434 940921 51629 465383 1084337 2063123 2206408
801 2206408 634450 -783986 -1395871 -1174605 361979 1316395 705147 555720 652077 -836269
790 -3127479 -3428473 -1587061 -497430 -249322 206234 -291318 -2256655 -3634400 -1751169
780 479545 989968 651406 761708 1276205 1165820 796928 1185509 1084714 -1482935 -3440599
770 -3440599 -1493928 1935992 2651217 1716281 1247130 710431 -353492 -726635 117058
760 2325316 4002994 2699405 -465069 -2780760 -3389408 -2648995 -1183492 232314 768590
751 768590 1159683 872129 -337862 -1494908 -1890044 -1807224 -1437686 -1324896 -416542 1032902
740 29312 -1496167 -504590 -464133 -2140737 -758648 2675250 4179422 3923265 3828545 2955570
730 2955570 1850932 852649 -618970 -1667690 -631180 704221 1685170 2365628 1334758
721 1334758 -1570083 -2523557 -1896561 -1908552 -1572931 480236 2635528 2260079 -1638865
711 -4500333 -3402479 -2065297 -2553462 -2570793 -1632523 -95100 242716 -435324 -533433 30725
700 19848 -346696 -179270 74818 -182110 138372 1719526 3613648 4160639 2618444 1933778
690 1933778 2299657 2114524 -43033 -2116351 -2033656 223442 1623252 2917169 2793687 1291731
679 -598052 -1500228 -861043 -433390 -437574 -450397 -91178 -109222 -707039 -586315 463210 767207
668 767207 -159968 -1161472 -1733591 -2452566 -2874364 -1300853 416891 887839 1708063 1976031
658 1976031 -865529 -2922970 -1563966 383839 1071733 1622538 1768825 897868 647329
649 647329 426435 -445191 -732538 -738283 -1031696 348953 2623014 3379945 3298754 1677456
639 1677456 -1965574 -2906974 -603804 209362 -591983 1181739 3332800 1542283 450953
629 879667 1147196 1278959 979325 -1023139 -2931142 -4320793 -3168209 465743 3712243
620 3712243 2715629 654067 -144754 -1948072 -2840281 -383393 1997032 747886 -415423
610 946209 1508462 478971 -748350 -623641 -628022 -930608 -1433749 -1227528 -1205519 -775788
600 -775788 -810530 -2188853 -1391074 185009 99173 -1697355 -1480500 641047 1075511 1350605
590 1350605 1714746 756742 -1312601 -2235819 -588687 2075503 2524874 872751 65368 1328332
580 1328332 1829050 1439058 1085178 131056 -1252663 -2141815 -3543170 -4226639 -2970006
571 -2970006 -2043678 -1196567 -443185 -1963058 -1961832 170940 345665 -67557 216708 -809985
560 -2592021 -2284483 -246010 379051 -843287 -1645563 -2218308 -2615743 -2974160 -2674018 -1640188
550 -1640188 156475 1707646 1004639 -560547 24281 517241 130401 46586 535754 1598161
540 1598161 1011941 -853376 -1628250 -590136 1043096 1318723 -627353 -952211 -1046594 -835421
530 -835421 1040925 2645177 2314946 874038 1156662 2205394 2705369 2002256 336022
520 89621 1799636 3962788 4050902 2323151 2169455 1330454 -390031 -746126 9241 -675174
509 -2606497 -5180120 -5674534 -3776030 -2138192 -480230 -470404 -1395713 -19407 971393 -119857
498 -11143 1790004 2274751 1001196 -912835 -2105487 -2052852 -2904854 -6612937 -16999980
489 -16999980 -30548795 -32557907 -15978224 227379 5795468 4976126 4752592 4452891 4304028
480 4304028 2873246 80950 -229585 2620650 3943924 2797467 1726933 1461530 1664118
471 1664118 296398 -860091 -89256 771779 1794099 2142541 1750012 1284727 992866 1595773
461 1595773 3189371 4137154 3758621 2111470 220221 -732015 -1174358 72582 891164 282607
450 600180 864491 1923621 3528485 1819206 -1580671 -2869071 -1620681 -202875 1178153
440 3244716 4756967 4368797 2320280 -453222 -2210072 -2970110 -3211779 -3108347 -1682295
431 -1682295 -962701 -1545408 -2893237 -2632151 -110801 2488401 4471437 5050649 2753443
422 2753443 876979 -152984 448077 193688 -2388605 -4010529 -2014180 595197 2936566
413 2936566 4907108 4642236 1701852 -1084872 -1594465 -540881 73175 -169386 -1131784
404 -1131784 -1699003 -1829811 -2634504 -3443049 -2649230 -2716501 -2424084 30830 644654 -1287805
393 -2069362 -496892 1505226 1396881 -830899 -1550541 -1547986 -1976078 -2134724 -1288031 -829438
383 -829438 -1489911 -561450 1600149 2326952 1986264 2573244 2231566 -804409 -2546775 -536546
372 1188162 -912548 -3116311 -2111017 1092625 2606275 1243336 -1490287 -1649108 -417060
362 -614803 -1481861 -1749584 -1781348 -1564418 -967759 -528829 -603541 107910 734169 161238
351 -1052468 -1108107 -511488 -40143 793364 1229362 1092257 1645852 3324987 3037203 -739928
340 -4123958 -2892483 97786 2035179 3206996 2728327 350557 -2775103 -3353264 -1282749
330 1381688 2536522 1515084 -413102 468030 2476423 1439503 1154211 1620382 -23599
320 -1656098 -1692444 -102426 1112145 -126334 -1446836 -724254 1047651 1920400 1068672
311 1068672 -68048 388487 -297674 -1738515 -1676161 -657571 138062 464609 403746 2255066
301 2255066 3167790 763200 -1959444 -2499925 -1076796 563642 509162 -608704 -1707129
292 -1707129 -1965080 -2246709 -1457405 1265056 3348481 3131569 3740948 4341611 3431251
283 3431251 2464067 779893 -880720 287446 745525 -1186159 -1245165 -526448 -857626 -2621
272 1486375 1333643 215775 -289527 -279640 652513 2190410 1989560 -142943 -999170 470922
261 585310 -357239 1438 814866 1158373 2379806 2628043 610315 -409024 413122 1502879
251 1502879 2145596 2136874 766811 -1551568 -2224139 -438905 553575 -933885 -2824426 -1217488
240 1597735 1930695 687106 -757690 -851995 -15558 1033730 1621301 549071 -943282 -942981
230 -942981 -55207 -244276 -966143 -1713441 -3071713 -3862874 -2815822 -1085595 -1206424 -1308594
220 -1308594 571627 650633 564398 2776053 3672230 2039723 961337 1074591 1993459 1738041
210 1738041 -1496350 -4811026 -4219122 -775602 177644 -841134 -777099 -745027 -1039584 -337114
199 259841 270203 1836357 2214103 -269046 -2135792 -1626938 -1133639 -1454464 -832711 -927475
189 -927475 -2484208 -2599695 -471944 1222351 -605317 -3600383 -4782151 -2362565 40093
179 481887 -1595524 -1949876 -1726003 -1686294 840383 3503886 2784163 1627951 1685294 1020211
169 1020211 -658154 -1486084 -756606 -129631 1849214 4265299 4012717 2220051 962355
159 435183 655365 1115895 133366 85839 1088616 748344 -420617 1019890 3421843 3796752
149 3796752 3829027 4033924 3170168 1276621 -841560 -2247270 -2045799 -491132 -241048 -3348898
139 -3348898 -4659029 -1292831 581763 -1746377 -3761060 -3365841 -3455569 -3778012 -3110209
130 -3110209 -1858920 -763791 314284 1505397 938431 -970578 -754186 -148443 -1252557
121 -1252557 -570203 2348022 3125557 1281301 -411558 -895218 -608909 905700 2425951
112 2425951 3300413 2829375 3160091 2881190 1499411 -1238218 -2682151 -1445085 -57147
102 501234 612814 377878 969925 1718050 -651175 -3710532 -3588527 -1076516 778145 842586
92 842586 1407135 1161462 -1000433 -2198273 -1355048 1402482 4479455 4584703 1918708
82 -754251 -2812024 -2862500 -1259925 629940 909451 815597 1022334 390782 -1079926 -2087184
72 -2087184 -2394794 -1916030 -1115075 -697778 -120736 -97797 -576610 -733176 -700583 -637483
62 -637483 -192246 399490 -323560 -2837560 -5123570 -3971961 -321384 1420553 323930
52 -1537916 -2279872 -1016267 46055 -563634 -1250029 809982 2717554 1291270 -1209195
42 -768495 660118 306325 494437 2531984 2721698 1107115 -301112 -1320547 -2231741 -1738714
32 -1738714 882299 3271854 3301222 1387279 414432 59774 95739 1185450 4237943 6471408
22 6471408 4401063 1077073 -215664 -1013591 -1052777 13484 615379 -888251 -2178127 -720342
11 474133 529154 -123300 -343834 -906933 -947520 -415110 998639 2283111 1941930 711505
0 801178
##PAGE= F1=10327.82371721
##FIRST=     18110.137220953, 5591.54909048506, 1263841
##DATA TABLE= (F2++(Y..Y)), PROFILE
1023 1263841 305483 -954715 -1701715 -2523723 -2140330 -1049715 -133323 427260 804582
1014 804582 557878 327569 155924 -170659 -1339564 -3431216 -3455171 -2303340 -1208870
1005 -1208870 -286884 -1240450 -2097194 -288900 1147001 182487 -733564 -545426 -1256904
996 -1256904 -761510 1131840 1762341 46064 -1897138 -2664921 -3102041 -3889723 -3316821 -95502
985 2628997 1985992 81285 199443 -2609 -13190 971813 114914 -983818 -304746 1413710
974 2401142 2325797 1612670 2046597 3412675 3875764 2965657 1325917 910492 2188556
965 2188556 2876593 2388348 2380905 2060173 -583880 -1754584 -63349 610467 -1087010 -901167
955 -901167 569745 1267803 1924013 2256550 1390991 -21138 -80300 1171065 816770 502975
945 502975 1536136 2317408 1642746 672965 375001 213095 -806044 -1281817 -976984 -488874
935 -488874 611246 885597 -361339 -213795 850669 887222 635952 -239991 -1805928 -2089127
925 -2089127 -1731402 -1797268 -1883415 -1825926 -1211513 -1085681 -1529486 -612397 662482 1249838
915 1249838 1118099 108174 4842 1163240 1727590 2484692 3375959 2310024 481448 348791
905 348791 1987838 2742668 918162 -1458441 -2266542 -2059953 -904097 493956 1500264
896 1500264 611081 -728285 -1227727 -1618633 -1452756 229264 758870 424266 336216 341168
886 341168 -409214 -2235178 -2541411 -933160 -994619 -2315987 -2010218 -1466347 -593044 481642
875 -505080 -2468257 -1106601 1296309 1082230 -114469 -547543 -1385737 -2447280 -1109236
865 233401 -530603 -1653297 -2305157 -1683358 732695 2458609 1742612 -313030 -654302 -706508
855 -706508 -1769667 -1732093 -1244537 -985940 730541 2468580 1942188 1138630 1246147 1356408
845 1356408 848068 -404443 -1529743 -1273582 499734 1800767 -160510 -2856060 -3127899
836 -3127899 -1477122 -22639 34892 -1184196 -902921 936905 1491780 1590359 1063301 -462523
825 -1227715 -843162 465244 2292022 2669224 2067752 2404084 2589566 2782889 929348 -2281666
814 -2984570 -1265395 723736 1334661 15043 -1153185 439359 2178436 840457 -198134
804 741944 1611838 1904702 1613954 129048 -1096695 -1062836 -157137 1071692 1312301 501565
793 -100953 -282610 -1254857 -2917777 -3115928 -1488256 -984161 -769173 -188179 -999878 -2425073
783 -2425073 -2549436 -840379 332735 901275 889196 717921 331320 -1178734 -1485380 506000
772 1479009 -844019 -3048466 -1895917 1369609 2278575 1192474 664437 562367 152699
762 -55748 148150 1325155 2983392 2367597 -170157 -2135895 -2766761 -2744762 -1068598 1347661
751 2288716 1988830 1226509 313413 -1262912 -2316441 -1898409 -750304 -588503 -183123
741 887497 119653 -1091043 -79981 -23830 -1645412 -432404 2739173 4068068 4134126 4124882
731 4124882 2952712 1736422 1111955 2328 -1273065 -68011 1265452 1435115 1335079 330090
720 -1870022 -2537922 -1666554 -1939655 -2052511 285578 2406615 1899877 -1796968 -4630767
711 -4630767 -3236509 -1570132 -2213738 -2482141 -1132021 472566 324201 -799743 -1459650
702 -1459650 -823413 -480269 -979241 -815779 138508 -215490 -616838 971924 3399433 4296546
692 4296546 3065059 2189763 2249979 2093979 -191598 -2786990 -2637293 365415 2489197
683 2489197 3827651 3337284 1736733 -548824 -2018896 -1672236 -1308927 -807533 48822
673 580517 242849 -171736 506873 1430866 1076394 -378182 -1401301 -1705815 -2074777 -1819649
663 -1819649 -115696 781139 774189 1671928 2011957 -849026 -3005646 -1411287 750363 1221169
653 1221169 1509202 2002910 1666569 1664042 1884320 1300396 649794 -294753 -1203736 446138
642 2764108 3269695 3052928 1661211 -1566975 -2447286 229820 1189939 314598 1682459
633 1682459 3140869 756918 67066 1548117 1917011 1338986 1010737 -319512 -1805012
624 -1805012 -3044317 -2689577 350135 3415706 2191139 473725 977547 -374024 -1856445
615 -1856445 223084 2888729 1431981 -803727 -369041 665296 789831 625821 1190246
606 1190246 623276 -753551 -1973786 -1708105 -1413436 -2397969 -4644156 -6030064 -2279683
596 -605459 -902543 -2295512 -1743154 211783 874621 1681750 1317016 97294 -1532511 -2520989
586 -2520989 -1009782 1614780 1855934 -678826 -2284769 -320918 1160961 1037160 543634
577 543634 -327648 -937565 -1282074 -2984013 -3943903 -2767817 -1894843 -866961 409475 -1277838
566 -2182498 -850241 -667398 -272701 1167870 272865 -2425532 -3041022 -1128259 -266040
556 -1127118 -1727604 -1903175 -1793579 -2321845 -2316735 -1584387 -143340 1645547 1358760 -447000
545 -815613 -264430 141201 557504 712127 833007 -94977 -946445 -1021565 -525248 164191
534 629359 160184 358539 -754826 -1148547 1084907 3025561 3043041 1673018 1683313 2400554
524 2400554 2689577 1991072 86467 -1172250 143887 2395926 2654297 1338990 1585692
515 1585692 1027056 173871 621210 1318722 350603 -1915348 -5328930 -6388260 -4206571
506 -4206571 -2192830 -18617 93599 -1368549 -514383 233966 -168163 563614 2339959 2402472
496 2402472 1359216 -57082 -1430170 -2060900 -2468666 -5083487 -12662653 -22786570 -26598241
487 -26598241 -14555327 -98942 4873175 5009520 5282327 4431483 3533371 1733258 -697972
477 -126097 3096085 3776498 2493626 1868633 1708410 1770255 471168 -1003331 -1206097 -1007333
467 -1007333 415644 878503 229087 317872 610461 1163828 2882886 4554130 4243454 2002227
456 -159380 -1162627 -2025096 -1824314 -772675 -973000 17792 734707 1192059 1724258 115435
445 -1952629 -2420372 -1485526 -265877 1250247 3201003 5117916 5607801 3034612 -74248
435 -2029431 -3095337 -3783232 -3158048 -781233 -254729 -1629738 -3993621 -4578268 -2039588
425 1793861 4306703 3945220 1657539 775411 251762 796971 176466 -2243838 -2918087
416 -2918087 -712490 1349849 2988893 4170723 3673607 1409527 -842812 -1823970 -1270388
407 -1270388 -455215 -261504 -830726 -1233304 -1594883 -3028476 -4273722 -3401677 -2783337
398 -2783337 -2165637 148920 584602 -1868645 -3331849 -1466044 935545 487568 -1794265
388 -1724024 -1147528 -1406968 -1573260 -630568 142184 -465436 -220229 1104343 2041281 2246204
378 2246204 2746951 1786431 -1083566 -2344046 -557536 102166 -2877515 -4793851 -3380797
369 -3380797 -207692 1674070 1152634 -975284 -981045 12009 -484895 -1284364 -1324723 -1624261
359 -1624261 -1491876 -414375 190106 -535936 -527945 286964 331230 -1020808 -1628910 -742923
348 315531 1111062 1234249 526800 461055 2039630 2639294 -401743 -4113569 -3791642 -700166
337 1768365 2628082 1678333 -753728 -2934714 -2168793 819754 3247389 3035977 1268386
327 -312612 130751 1472252 1018128 1638698 2495326 1085916 -925549 -996457 560913 1790629
317 1790629 642157 -1120019 -860669 1061612 2311485 1650569 733300 1220389 609720
307 -440887 -555719 -71991 753672 1221196 943733 2224083 3067489 720759 -2116808 -3008556
297 -3008556 -1936817 -464689 -262198 -814892 -1743822 -1763548 -1384365 -499799 2461596 4326297
287 4326297 3672791 4467561 5424980 4065602 2493420 675238 -663723 737794 1288886
278 1288886 -437284 -897459 -1043123 -1234251 -250650 692697 478562 -110485 -316010 256250
267 1968355 3374083 2301821 -706209 -1951448 -233717 45952 -1085246 -191666 1440139
257 1968192 2401710 2037113 296491 -432681 296507 1364330 2285286 2458848 1096799
247 -1292368 -1663837 194209 978966 -1170730 -3151435 -1078725 1842449 1620303 -10533
237 -940228 -486935 225143 873600 1413323 411704 -1432802 -1386895 315921 609211 -189557
226 -1285499 -2672163 -3504451 -2665465 -954781 -536792 -604845 1165911 2087673 2432349 4369672
216 4369672 4545305 2363383 1039019 1216226 1902497 1804902 -484657 -3036466 -2984226 -153148
205 1062783 -225031 -305504 -248248 -596236 -167929 255609 95236 1468929 1854455 -368658
194 -1439423 -1136334 -1567402 -1945707 -756733 -634090 -2331090 -2493582 -191396 1537910
184 -489109 -3425952 -4196475 -1765607 -54466 -221261 -2236962 -2705449 -2808984 -2960348 -413563
173 2476500 2354085 1808614 1971191 834937 -981298 -1251144 -676199 -514491 727670 2660606
163 2660606 2528512 581018 -720302 -1374542 -58050 1489561 1033056 380290 294560 -338922
152 -804697 1692555 4292500 4752322 4825608 5150001 4166881 1719442 -909947 -2483257
143 -2483257 -2261658 -737406 -177330 -3069393 -4469816 -1166044 123183 -2489132 -4570949
134 -4570949 -3855902 -3224485 -2817065 -1944590 -1017227 -235017 568723 1212278 982748 82331
123 310170 168957 -1201753 -321698 2843419 3341078 679804 -1287830 -1188271 -577204 1124355
112 2773448 3582317 2806037 2295076 1831700 1137664 -482016 -1855488 -1352430 -413398 164943
101 385382 408750 1330514 1593622 -1154864 -3938523 -3612762 -1319652 804359 1590474 2561179
91 2561179 1959392 -671760 -1499928 -131587 1898447 4159137 3995881 1600435 -602867
81 -2225250 -2496959 -1275876 465399 764541 413858 707776 526011 -925253 -2293541 -2459803
71 -2459803 -1224097 199390 907620 1363172 876704 -117936 79601 717023 846006 1091717
61 1091717 1144909 395602 -1849264 -4843091 -4323313 -184298 2609157 1267835 -1397330
51 -2350274 -955729 -617816 -1529471 -1062540 1460076 2651951 198178 -2213639 -676938
41 1744546 1538733 1310067 2476773 1946339 251193 -925953 -1989908 -2315973 -825523 1539172
30 2533041 1922239 184550 -936156 -1585001 -1182801 86945 2472866 4781077 4007134 1270039
19 -465313 -1545829 -1172541 730125 1394961 -1089219 -3382084 -1721262 327377 812563
10 812563 -22895 -678810 -1558427 -1878000 -1030076 900944 2147690 1620214 494623 442696
0 442696
##PAGE= F1=10306.2061797
##FIRST=     18110.137220953, 5591.54909048506, 407524
##DATA TABLE= (F2++(Y..Y)), PROFILE
1023 407524 -713340 -1458147 -1581000 -2666531 -3108173 -2200301 -425921 628753 883811 886889
1013 886889 991010 424496 -276436 -1559594 -3354199 -3598040 -2912750 -2424687 -1351219
1004 -1351219 -1670466 -1660677 437037 2035751 2198798 2278204 1846133 -243889 -601783 1055841
993 1681243 493708 -1064204 -2255399 -3104157 -4474323 -4604356 -1056666 2917319 3023459
984 3023459 1003402 436441 -78644 445163 1924210 1233990 -429119 -449057 1186922 2225669
974 2225669 1924707 1654880 2343758 3202729 3379504 2696985 1161134 824357 2603283
965 2603283 4229445 4125174 3299385 1406739 -1615378 -1504011 930512 802036 -723003
955 538881 2719623 2555873 1958615 986146 -553313 -1419922 -469235 996354 426398 275705
945 275705 1588267 2174911 1286620 210748 245643 941605 399740 -748468 -1415308 -1073123
935 -1073123 49870 -110616 -1479619 -888983 508981 1023418 1182231 61639 -2275367 -2629975
925 -2629975 -1268057 -227262 -468934 -1347041 -1177170 -1449047 -2216284 -1000519 887073
915 1870792 1377912 -297640 -799192 298607 837015 1511319 2209040 1354925 352421 1323825
905 1323825 3625989 4047828 1709641 -1320843 -3216895 -2886736 -690690 1085176 1879611
896 1879611 214870 -2551868 -3775629 -2629498 -1307799 340454 -2372 -1126668 -1064195
887 -1064195 -367786 -742907 -2104943 -2146411 -1199841 -1778741 -2497543 -1300879 -780530 -9362
876 1087289 98128 -2118176 -869028 1735470 1549687 -160583 -840388 -1874489 -3380368
867 -3380368 -2127033 29723 -187314 -1124247 -1401097 -929677 950126 2691587 2282507 95687
856 -793109 -1177304 -1887813 -1505019 -1096013 -940863 709932 2501815 2051421 1051071 890012
846 890012 1336339 1299814 -74914 -1609364 -2166058 -1160559 71191 -1142288 -2906579 -2792826
836 -2792826 -1061770 260873 588771 -336187 -298269 1299146 2139419 2163352 1442323 23618
825 -1045784 -968024 810126 3122391 3509438 2477999 2661057 3169086 2649956 -273361 -2914710
815 -2914710 -2496695 -1286615 -14904 627736 -495823 -1393259 365509 1916754 512893 -376117
804 989531 1819879 1383854 670660 -718918 -1923006 -1308330 533880 1466442 910998 43233
793 -802225 -1318939 -1848058 -2806725 -2539088 -1097525 -1393634 -1495886 -893399 -1668441 -2154009
783 -2154009 -1037756 -42225 -235288 264777 404906 247963 -815133 -3534068 -3856834 -374398
772 1608404 -133656 -2002110 -1787763 670169 1630334 474419 -194989 144759 436107 453608
762 453608 148028 324557 1526192 1479500 84690 -833788 -1440957 -2239266 -682942 2396181
751 3551415 2623099 1631810 982741 -993668 -2587809 -1932792 -254944 -80728 -65301 567448
740 49463 -634193 304732 533184 -855736 -134655 2140569 3127754 3503682 3568105 2517804
730 2517804 1439324 1128945 539496 -511134 637023 1661392 941261 43858 -745367 -2055310
720 -2055310 -2314050 -1128702 -1538056 -2325289 -49442 2122599 1554767 -1826823 -4182112
711 -4182112 -2457129 -689736 -1503770 -1804470 -132908 1158677 435320 -1154396 -2319005
702 -2319005 -1661459 -869649 -1471102 -1560102 -8309 -196267 -1237886 -97372 2349453 3351959
692 3351959 2741248 2062587 1892089 1689199 -378563 -3169764 -2981142 303481 2787732
683 2787732 3868809 3193600 1688268 -733061 -2510587 -2305021 -2004065 -1305874 205626
673 921266 523161 380689 1416717 2050195 1177102 -254734 -939917 -1132368 -1699874 -1199527
663 -1199527 477257 776710 718629 1608457 1815281 -931786 -3144509 -1520459 972935 1485442
653 1485442 1255344 1605892 1828351 2421666 3249752 3207714 2304292 333962 -1298401 257097
642 2382252 2708080 2350448 1502892 -725996 -1717311 384933 1211469 582707 1471134 2308164
632 2308164 -38134 -179593 1853977 2218526 1177119 803029 -13000 -822244 -1516543 -2065424
622 -2065424 -150184 2551712 1473194 -47566 1207430 541986 -1037898 303271 2565991
613 2565991 1142178 -1400373 -1677047 -480237 610580 1905667 3036794 2003895 -83573
603 -1017112 -821088 -662898 -1004100 -2287676 -4045050 -2565082 -2736794 -3105820 -2886482
594 -2886482 -1775409 -255529 830016 1839735 367511 -818853 -1545096 -2336871 -1060304
584 1213114 950335 -2141474 -3841955 -1530137 445330 401404 17638 -339622 -80251 82558
573 -1640422 -2916389 -2224226 -1774392 -651305 809018 -502423 -2152353 -1868510 -1661830
564 -1661830 -505474 1761829 939754 -2221101 -3306051 -1685264 -809530 -1416939 -1665975
555 -1665975 -1468761 -1111003 -1477927 -1459029 -1305401 -535084 1449110 1571686 -742168 -2044314
545 -2044314 -1115486 256721 1217758 1091065 269943 -896487 -820518 -484797 -738306 -775909
535 -775909 13952 932390 1222600 -855743 -1833504 777143 3163192 3663732 2563638 2095483
525 2095483 2245028 2189504 1561935 -335322 -2232653 -1400505 841330 1566764 795116 887288
515 887288 557505 743422 1988952 2527871 1221398 -1440662 -5230846 -6574876 -4184526
506 -4184526 -1723857 583720 634816 -1097025 -727729 -205294 -24676 1191321 2574775
497 2574775 1994148 1068057 443368 -619696 -2029404 -2022230 -2860553 -6595831 -12620874 -16653602
487 -16653602 -11015308 -364555 3486257 4440516 5081870 3843175 2213207 112717 -1645928
477 -169729 3028113 3116824 1783979 1474090 1350210 1174347 203411 -1145639 -2067968 -2236560
467 -2236560 -562743 -240760 -1241811 -841539 79377 510023 2090905 4260663 4049661
458 4049661 1531608 -754580 -1728462 -2377777 -2573082 -1614434 -1872570 -563372 736705 695819
448 695819 -187162 -1657520 -2148826 -1669724 -1291541 -694636 732418 2502855 4340406
439 4340406 5481853 3043858 395479 -1059562 -2374424 -3872805 -3299648 -520342 276889
429 -1016869 -3417715 -4724659 -2928010 935819 3300740 2186700 609015 758230 856371
420 856371 1238840 288671 -1498606 -784132 1378706 2336854 2695968 2723431 1704816 394796
409 -688960 -1702308 -1785936 -1045342 -408893 -384641 -551589 -1305398 -3192461 -4696581 -3913220
399 -3913220 -2967300 -2045498 260978 818455 -1906596 -4229601 -2438668 337895 -132483
389 -2255500 -1495103 -391753 -541593 -724700 70353 691508 198663 118542 802977 1812292
379 1812292 2290661 2735075 1465595 -957304 -1786841 -586943 -906356 -4076170 -5502971
370 -5502971 -4109723 -1458234 551884 858884 -331667 -144512 200978 -588474 -744531
361 -744531 -251697 -999156 -1414719 -136988 821359 -401314 -1269372 -432564 426458 -802667
350 -1870975 -756762 557964 968178 780903 -316977 -691279 994955 2375577 25832 -3733447
339 -4145500 -1175027 1162096 1569984 809655 -1121661 -2492922 -1096701 2154347 4095938
330 4095938 2654094 198736 -935658 -557709 149252 360087 1884516 3063005 2165557
321 2165557 116687 -355262 892052 2057023 1185846 -564840 -604556 889621 2087437 1725197
311 1725197 1434197 2287675 2035853 1214000 566724 537733 1296408 1589552 914874 1300865
301 1300865 1919093 215992 -2408992 -3411698 -2378681 -968339 -363011 -267500 -1355662
292 -1355662 -1522618 -570459 444054 3017700 4195586 3407473 4376595 5538265 3962659
283 3962659 2035111 237973 -723976 723377 1478502 126644 -707827 -1611590 -1658994 -606652
272 -154299 -192315 -204865 -333364 656608 3118303 4244065 2237723 -1453985 -3240332
263 -3240332 -1516521 -627048 -1437047 -99522 2083470 2834468 2446601 1142166 -524528
253 -918883 -136423 870808 1746245 2076410 1342186 -562470 -720999 988586 1611327 -998157
242 -3071342 -836901 2023126 1588803 -107823 -772249 -289385 -21473 196597 678244 14591
231 -1869613 -1881978 300293 1205339 634267 -603781 -2099554 -3246624 -2763729 -924074 254959
220 235184 1513196 3062813 3834378 5021376 4477809 2301373 912520 691266 737223
211 737223 1040407 304776 -1081084 -1408674 644711 2099074 718291 81597 -95455 -437617
201 -437617 -274122 -88292 -151995 1086282 1332480 -536838 -961533 -1110613 -2308230 -2297263
191 -2297263 -585196 -281528 -1934399 -2345026 -162699 1630881 -361651 -3420524 -3802850
182 -3802850 -1109035 472495 -479893 -2693760 -3653789 -4129157 -4355064 -2073150 616259
172 1334147 1554390 1923055 440601 -1146865 -730047 -307891 -814993 -575202 678891 843684
162 843684 -567443 -1915802 -2969774 -1074445 1240840 1235189 61303 -822590 -1228385 -514360
151 2563306 4761339 5055368 5197073 5567346 4221050 1469843 -1068702 -2439600 -2211817
142 -2211817 -1054490 -387475 -2700271 -3910532 -956940 -344906 -3150267 -4835175 -3945776
133 -3945776 -3007589 -2323661 -1223300 -352638 289512 838226 908625 840740 953142 1214845
123 1214845 416393 -934290 324876 3140876 2857532 -331193 -2109262 -1379129 -550296
113 1049909 2685311 3570493 2602570 1016078 100447 74294 -163853 -912993 -1107250 -757587
103 -757587 -390443 -328074 -103157 1156357 1030494 -1632709 -3683327 -3196764 -1646479
94 -1646479 298303 1788983 3105440 2482023 -242717 -739286 553155 1700886 3206104
85 3206104 3023168 1259386 -254149 -1465746 -2112963 -1385871 99124 514794 -160033 -30817
74 82635 -1075437 -2358790 -2434444 -686748 1179572 2110444 2669134 1948125 421024 631615
64 631615 1638189 2074230 2479054 2108654 1212566 -867161 -4385730 -4444708 -122873 3404972
53 2366527 -749435 -2136163 -925069 -1280684 -2337026 -939035 1665138 1909583 -1260652
43 -3310290 -630292 2677815 2607705 1843348 1864969 739675 -645963 -1309501 -2087469 -1682569
33 -1682569 446325 2025928 1594649 266775 -1000676 -2108383 -2855422 -1951122 -469604
23 916431 2352861 2681341 1065250 -811328 -2145443 -1597897 940540 1641686 -1554604
13 -4428858 -2489745 186327 812355 -67451 -956066 -1761435 -2453231 -1535725 620283 1573633
3 1573633 911534 151310 87004
0 87004
##PAGE= F1=10284.58864219
##FIRST=     18110.137220953, 5591.54909048506, -59354
##DATA TABLE= (F2++(Y..Y)), PROFILE
1023 -59354 -1281231 -1555685 -1012713 -2097039 -3247856 -2746556 -502225 882831 979454 1089895
1013 1089895 1408268 541310 -624740 -2097378 -3365890 -3460698 -3094942 -3038335 -1827426
1004 -1827426 -1752834 -1066500 1158544 2757455 3731436 4355274 3144975 457213 -398785
994 932577 1569518 1208216 326762 -1194892 -2455877 -4418932 -5227495 -1672365 3131590
984 4060836 2191044 854769 -129423 733460 2640014 2388402 391507 -269102 1141127
974 2146909 1641786 1689704 2531642 2887833 2820716 2323450 1084273 834005 2897284 5129715
964 5129715 5379539 3958797 863517 -2266934 -1180079 1681638 870608 -328241 1687680
954 4009344 3371762 2117921 231774 -1888769 -2287988 -615653 869552 246463 43062 1098747
944 1098747 1589291 811821 -239266 182046 1569637 1444523 36008 -1452321 -1558851 -606581
933 -1017463 -2097063 -1108453 406674 1018399 1285059 164743 -2243788 -2423559 -311445
923 1489757 1208132 -356428 -851300 -1594033 -2428730 -1053591 976492 1946513 1026780 -1015574
912 -1770118 -955169 -315247 240052 489618 -125372 -53843 1879350 4771495 4913854 2311869
901 -935645 -3530841 -3429356 -1012783 816919 1319789 -904337 -4643659 -6139543 -3511857
892 -3511857 -1432326 -5494 -949034 -2765587 -2522103 -1045334 -862771 -1607900 -1466718 -1145087
882 -1145087 -2067147 -2257883 -337636 271194 808783 1810001 933658 -1152119 -203463
872 2191574 1937349 19489 -886718 -2044871 -3671391 -2590016 -99055 -103644 -725107 -319112
861 -2733 1105679 2582570 2425325 601944 -422860 -1057570 -1658413 -1153056 -765581 -605675
851 -605675 680209 2297819 1908265 524687 231598 1274582 1813431 339598 -1534496
841 -2886170 -2668920 -1558249 -1950979 -2562968 -2038713 -667117 494016 1232123 705238 320059
830 1390630 2299284 2115612 1410410 411638 -873084 -1315698 604406 3188335 3834989 2572472
820 2572472 2318929 2966556 2220111 -1004076 -2750076 -1422259 -861957 -469305 61497
810 -576644 -1035018 404053 1387816 182654 -316941 1201062 1686025 653191 -371714 -1632190
800 -1632190 -2902887 -1924771 739390 1427097 278433 -413018 -1142056 -1924748 -2271248 -2691782
790 -2691782 -1772456 -504098 -1612797 -2219867 -1614797 -1890491 -1269797 615893 554140 -860357
779 -574426 -487153 -405749 -1844084 -5251500 -5570787 -1102109 1554958 510720 -592305 -1118371
769 -1118371 119268 980348 -135129 -1005476 -290904 594933 827143 230785 -322237 110895
758 393910 429050 926938 244831 -1249136 -35630 3174311 4197717 2861691 1965114 1504635
748 1504635 -698126 -2616313 -1879149 60791 305734 78236 239291 -98493 -143594 705216
737 1161858 113873 192362 1195764 1690476 2182755 2426273 1942956 1130010 931033 951541
727 951541 625671 1493840 1897161 433436 -1040856 -1484404 -2031564 -1931581 -517605 -891159
717 -891159 -2307085 -501656 1624492 1035669 -1782540 -3228883 -1260888 413451 -494854
707 -611992 1101134 1726324 463137 -1494671 -2891561 -2166652 -967752 -1706916 -2249985
698 -2249985 -305973 40049 -1366059 -1125663 707206 1653853 1906724 1649804 1231102 1081527
688 1081527 -343391 -2921933 -2841745 34895 2318183 3084058 2579305 1343288 -928929 -2709349
678 -2709349 -2492139 -2219161 -1668648 86722 972549 709953 751337 1833107 2187970 1153856
668 1153856 295373 242126 -56286 -1338535 -1104656 353089 406377 718412 1539299 1458888
658 1458888 -973035 -3084152 -1718625 1025653 1765177 915122 642229 1215872 2615771
649 2615771 4057078 4618437 3663273 909240 -1322507 -173256 1648039 1841905 1312249
640 1312249 1191930 165266 -1081992 -219489 328208 101932 577291 1018795 -768544 -364925
629 1640894 1858404 676694 268540 -390625 -580319 -566966 -1569784 -807694 1390510 638548
618 -911760 318707 408596 -787392 -323084 1131260 24637 -2168367 -2780818 -1846218 -424095
607 1986371 3670637 2676568 859372 1252572 1217520 764994 3577410 7195701 4664728
598 4664728 -2066292 -4721817 -4598157 -2736145 -1049838 -160127 1367781 2169097 -245018
588 -1132499 -681145 -960633 -231255 1252133 328066 -2717879 -3693727 -1445399 292419
578 24587 -147732 206085 1195658 1774658 315307 -1369361 -1428162 -1398187 -229823 981730
567 447850 -1492342 -2286724 -2205692 -567976 1953417 1058654 -2027968 -2899448 -1662923
558 -1662923 -1090831 -1650226 -1424661 -841600 -460346 -374684 -83711 -701883 -713249 1512319
547 2036071 -900619 -2823838 -1457535 646428 1926274 1564550 104536 -1029487 -390415
537 -94094 -999058 -1288787 -104917 1651240 1523741 -1263560 -2537057 357600 3130930
528 3130930 4107492 3332305 2269285 1836399 1543650 985362 -726372 -2534961 -2091813
519 -2091813 169 1278594 985862 507685 242011 1238755 2960580 3213360 1538396 -1373657
508 -4823055 -5985669 -3523572 -736236 1183644 922925 -770044 -630511 -89375 416246
498 1740423 2450198 1281645 395171 583806 94877 -1865602 -1577921 -520850 -1129838 -4384937
488 -4384937 -7131602 -6187185 -233455 2247833 3605494 4455013 3129642 888212 -1519566
478 -2516200 -288520 2562271 2255265 900908 653256 428955 81204 -235206 -1078912 -2379344
468 -2379344 -2519877 -787750 -805380 -2198984 -1905439 -603131 -303224 1031752 3334832
459 3334832 3209648 919387 -1166697 -2013572 -1920355 -1590707 -1139093 -2119583 -1107993 664470
448 474715 -1647617 -3171702 -2360675 -869514 -831634 -1063221 -89171 1446214 2960648 4322903
438 4322903 2541692 852833 449514 -971125 -3374848 -3387854 -819134 590270 200876 -1327422
427 -3167171 -2612663 168916 1630714 156475 -249479 774949 1409722 1556312 454849 -363631
416 1655918 3444332 3058781 2173299 1185676 -476402 -881288 -543232 -1266402 -2038424 -1600904
406 -1600904 -535992 182249 223988 -977302 -2904815 -4392085 -3925894 -3160703 -2038847
397 -2038847 447547 1338956 -1467861 -4559559 -3096472 2164 -132972 -1991906 -920772
387 555186 442053 143999 555935 760120 535158 597071 988311 1773318 2084820 2447543
377 2447543 1253501 -545301 -1097849 -752249 -1709792 -4245636 -5022445 -4064748 -2323542
368 -2323542 -429630 571786 369310 616105 3384 -1053666 -203899 1046240 -137217 -1423918
358 -1423918 -281097 1105977 -308469 -1936368 -1213316 478047 -408442 -1807847 -741099
348 340164 227551 -104560 -1245172 -1514974 453248 2265585 443275 -3045896 -3790404
339 -3790404 -1234112 254089 174250 113718 -853145 -1656079 -365940 2459950 3812753 1573401
328 -1321400 -2027057 -1397087 -1050667 -235720 1867843 3204120 2897068 1130899 -29812
318 628136 1675680 1299947 62017 -105140 528624 1311481 1306088 1803188 3175749 3462519
308 3462519 2783460 1518493 1059798 1645863 1598764 507167 24444 249493 -618037 -2822181
298 -2822181 -3647189 -2355085 -897220 153673 792171 -705251 -1258646 24994 1064075 2686402
288 2686402 3099813 2512471 3487036 4557477 3096219 1157465 -483702 -1047347 374665
278 1429374 580283 -470084 -1879436 -1964027 -992195 -854939 -520900 -60861 -339426 880546
267 3825285 4475705 1697704 -2346082 -4723211 -3082890 -1095211 -1135393 205615 2304525
258 2304525 3128121 2238014 141018 -1612395 -1717851 -779104 180371 763075 1177732 1417416
248 1417416 396753 331525 1789355 2328972 -374955 -2550949 -573229 2042781 1826226
239 1826226 504621 -226427 -256809 -604036 -753652 -405808 -694345 -2260345 -2226151 56014
228 1421695 1190293 93784 -1401597 -2900446 -2833846 -782005 1098832 1113539 1727936 3368040
218 3368040 4233007 4352077 3444034 1932470 643625 -485506 -1291017 -307934 704604 400274
208 400274 -55529 1342363 2896839 1665223 254972 -241135 -394312 -457079 -661242 -509414
198 -509414 770886 903810 -492105 -583492 -1373205 -3004208 -2308960 -363570 -45415 -1380850
188 -1380850 -2082911 -355127 1526223 -127194 -3459246 -3768311 -647086 1421525 -119085
178 -2671621 -4275895 -5143234 -5423981 -3702762 -1637250 -128545 961731 1611410 -17079
168 -1038166 -8741 325519 -882093 -1569940 -924384 -436026 -879082 -2243065 -3648758 -1844388
158 -1844388 651682 790557 -694104 -1808361 -1493597 487684 3413310 4634126 4468489
149 4468489 4907437 5464278 3722171 973743 -1042285 -1994550 -1803268 -1189387 -676221
140 -676221 -2286736 -3079845 -681754 -692536 -3547112 -4515139 -3663539 -2844902 -2160809 -866070
129 141839 818540 1136258 790337 757365 1625246 1892965 640393 -476592 1095878 3006948
119 3006948 1808329 -1318679 -2445784 -1268445 -449692 849068 2490738 3601106 2420800
110 2420800 -205606 -1740279 -1266489 -177796 118131 -556559 -779516 -728048 -1046606 -743000
100 -743000 715736 351451 -1885043 -2952037 -2221517 -1413105 670 1636550 2982664 2633857
90 2633857 245552 15720 765893 1152518 2192625 2235072 1157322 299309 -631656 -1698194
80 -1698194 -1534027 -268946 453562 -406893 -655459 -559164 -1277278 -2028199 -1992017 -95621
69 1884049 2861007 3744679 3224322 1385068 1167694 2068337 2977285 3867368 3276357 2088704
59 2088704 -21367 -3757701 -4177902 66668 3786724 3449787 390554 -1508461 -772020 -1536463
49 -1536463 -2455273 -619679 1661484 1065428 -2212127 -3800987 -443770 3340941 3390048
40 3390048 2153841 1219624 -161905 -984873 -1025935 -1311240 -383614 1810520 2413656 1031174
29 -681795 -1390974 -2352292 -2961308 -1639319 -10445 394327 429569 1337315 972678 -708275
18 -2201716 -1808528 873631 1525474 -1907624 -4701386 -2468907 397823 803073 -84111 -801943
8 -801943 -1167465 -2169466 -1349144 771722 1308750 559037 243349 280037
0 280037
##PAGE= F1=10262.97110468
##FIRST=     18110.137220953, 5591.54909048506, -380184
##DATA TABLE= (F2++(Y..Y)), PROFILE
1023 -380184 -1678360 -1635225 -501994 -1309963 -2931470 -2963608 -717872 701931 571618 666030
1013 666030 1142250 253104 -1254549 -2774782 -3513116 -3346348 -3331235 -3416083 -2089641 -1914851
1003 -1914851 -857369 1409753 2787876 3806017 4392786 2771086 387313 -513724 531998
993 1231893 1739197 1683735 112399 -1512702 -4005731 -5308357 -2017294 3039761 4674994
984 4674994 3116811 1093174 -366292 591550 2813958 3150259 1182760 129252 1227342
975 1227342 2043409 1351300 1430120 2262171 2354644 2212366 1780604 921371 823751 2903331
965 2903331 5187667 5601709 3951960 416050 -2473773 -1063705 1683954 675478 -71760
955 2141919 3983286 3437675 2312935 217040 -2196462 -2529438 -813294 539874 154622
945 -174291 267361 843318 474570 -470305 160876 1807152 1912866 717557 -1135956 -1732784
935 -1732784 -1071549 -1606089 -2234931 -999614 472978 820072 881702 1632 -1841646 -1733913
925 -1733913 666460 2717340 2570979 802593 -389206 -1502945 -2124651 -816999 854020
915 1444741 201170 -1780727 -2560912 -2168026 -1427820 -1103565 -1455928 -1847696 -789794 1710518
904 5048194 5178886 2518479 -649080 -3358119 -3681928 -1755269 -113146 67494 -2426276
894 -6354061 -7378816 -3875090 -1668719 -563540 -1650601 -3897008 -3577779 -1429747 -643859
884 -837634 -604238 -650529 -1703871 -1658080 600855 1423532 1602054 2338364 1744825 250712
873 818938 2612306 2217524 459925 -614143 -1818802 -3279820 -2409471 -155795 -264254
864 -264254 -482606 670037 796208 1068466 2149347 2237052 1178456 461255 -322954 -1108242
854 -1108242 -702624 -236319 30210 724421 1943999 1560692 -363843 -671618 1150283 2213090
844 2213090 718818 -1255383 -3147794 -3564798 -2571417 -2295266 -1948666 -1197791 -454712
834 680221 1893721 1730994 817462 1205411 1954224 1523148 1038303 681812 -639624 -1708740
824 -1708740 -59377 2625938 3726228 2429617 1560631 1974969 1455812 -1080210 -1810282
815 -1810282 -182251 -227631 -524975 -180951 -197867 -171142 569753 829327 30465 44672 1392843
804 1392843 1323971 -70992 -1200750 -2217997 -3498895 -2507026 476399 984916 -351522 -612003
794 -612003 -833959 -1700554 -2212441 -2431366 -980221 73882 -1625766 -2715838 -2074844 -1501096
784 -1501096 108067 2047725 959876 -1113397 -1114830 -1227699 -915440 -2457744 -5914816
775 -5914816 -6108895 -1343682 1497702 1015354 815540 -20286 -77430 567473 -346923 -1408392
765 -1408392 -502618 710353 1095141 478593 -426721 -828041 -466559 943785 2745263 1853147
755 1853147 -20542 807155 3525294 3995828 2549396 2027579 1742656 -386575 -2384687
746 -2384687 -1723583 275988 702430 342490 15689 -266936 295085 1107098 1733898 1096801
736 1096801 624385 342086 268796 607938 1144668 1475606 927549 599932 1208253 1910577
726 1910577 2391110 2004697 129508 -1536220 -1616295 -1763054 -1515107 -72524 -260095 -2008229
716 -2008229 -988830 763124 114768 -1820033 -2058377 31836 1483490 615008 819775 2184547
706 2184547 1878718 204545 -1844398 -3063139 -2179016 -763555 -1695827 -2749630 -655815
696 524399 -878665 -1810476 -1134368 -284501 923842 1067086 296586 463515 57750 -1955580
685 -2196651 -404470 1096383 1723320 1743839 901647 -951466 -2458165 -2144320 -1880725 -1739137
675 -1739137 -211764 809618 772572 756155 1543765 1820167 1130556 1185718 1843845 1229233
665 1229233 -1031468 -1422212 -345627 -241518 677190 1401337 977522 -889685 -2641433
656 -2641433 -1806058 898714 1882853 488598 -683867 -98724 2080246 3969570 4978075
647 4978075 4201287 1168656 -1355549 -806777 664487 709729 34903 638518 553780 -1001873
636 -1423237 -1089747 -993375 -832138 -510866 -1475492 -682949 837870 810536 -257359 -708972
626 -708972 -1594504 -1493581 -834833 -1442702 -1424350 166265 -290726 -2062182 -1624555 -947403
616 -947403 -1369720 -1607366 -985972 -1626028 -3193504 -3794590 -3448194 -2522929 -76159 1881588
605 1348385 742370 2215599 1696333 17917 -272454 -427213 -547789 -3047800 -1391235
595 -1325866 -260550 1047280 1194627 2918662 3204314 513114 -34051 1450911 1832504
586 1832504 1647566 1873320 356375 -1979381 -1784518 155523 998777 236227 254919 1246048
576 1246048 2629631 3484721 2486700 336109 -540896 -590601 600920 1270755 1547974 -176696
565 -1793074 -2029002 -355154 1807113 723638 -1815622 -1891093 -1053864 -1079501 -1773533 -1032744
555 -1032744 -10926 362601 949104 1528062 126109 -506538 2052527 2931370 -491488 -2565110
545 -2565110 -1007658 1280255 2520518 1942060 292585 -484791 262110 88130 -1133819
535 -1185349 355141 2237219 1424987 -1711931 -2896559 29560 2942028 4298026 3781613
526 3781613 2137223 1281357 1025848 483182 -944340 -1861277 -1520920 256599 1858975
517 1858975 1804625 678558 251542 1520395 3196505 3058971 1113242 -1599864 -3988707
508 -3988707 -4521915 -2143611 595735 1605763 730636 -687066 -340801 579398 1089001
499 1089001 2005424 1947494 486357 -361230 441463 547497 -1511072 -1126065 1387410 2442381
489 2442381 598602 -467872 -1229837 431978 1583047 2805928 3704601 2631983 -10565
479 -2742424 -3074243 -383806 1974289 1477352 42361 -374700 -814142 -1133787 -543258 -695351
469 -695351 -2057215 -1870217 -215385 -652057 -2432427 -2668677 -1433140 -1191678 -33743 2011884
458 1905933 363488 -1086546 -1709963 -725171 779677 529983 -1704013 -1635841 281326 378774
448 378774 -2374199 -4225055 -2671999 -217430 -49189 -1068143 -880505 393741 1691331
439 1691331 2946849 1941080 1237057 2030375 692104 -2351416 -3224742 -1351782 719702
429 1723153 1510351 -638553 -1357759 -280638 -262066 -1641675 -888874 709589 1635958 1566356
419 1566356 600759 865018 3609825 4702092 3157884 1586291 84562 -2079866 -1859897
410 -1859897 -259934 -574116 -2011109 -2017649 -575101 801607 938684 -616955 -2100079 -3276735
400 -3276735 -3314144 -3157171 -2020619 744779 2020669 -767010 -4301698 -3202551 122124
390 533169 -1103925 -181162 1470515 1353563 812746 697656 488218 677266 1227335 1631250
380 1631250 1879570 1643041 1884785 1089771 -52885 -521678 -1112490 -2237360 -3456842 -3500526
370 -3500526 -3266986 -2619329 -1040087 438922 1002741 1084833 -535954 -1770881 87558 2108604
360 2108604 684139 -1497372 -751891 970334 -301770 -2320722 -1771556 560403 139994
350 -1440462 -783969 -322457 -842498 -1119174 -1959846 -1802436 500289 2338598 849725 -2098343
339 -2708820 -837531 -683972 -1209119 -389830 -147489 -609525 60528 1945280 2718436 273164
328 -2594451 -2954304 -2023916 -1672959 -452950 1698961 2994436 3193978 1855451 -74055
318 -216215 670842 998430 709967 530330 127911 307252 632703 1736849 3536404 4397099
308 4397099 3904157 2253209 1481287 1775062 1395663 59928 -907816 -1121076 -1397976 -3119125
298 -3119125 -3525637 -1827415 -283528 1091241 2006982 73689 -845844 462821 1265513 1643053
288 1643053 1587526 1443487 2216136 2870337 1764533 115684 -1278352 -1453477 -20269 1342063
277 1079138 113815 -1498084 -1921642 -1240417 -1169152 -346417 366266 -232144 1036607 4056546
267 4056546 4062104 828190 -3183906 -6027587 -4393621 -1015659 -79787 652576 1884646
258 1884646 2505105 1657113 -619159 -2472622 -2429005 -1312792 -374648 -232278 151675 1335422
248 1335422 1304641 1267232 2495000 3004484 622831 -1603104 -257406 1941126 2260879 1684397
238 1684397 654764 -241046 -1155578 -1532333 -1446874 -1537846 -2469509 -2158002 -104545 1309211
227 1272035 574435 -570626 -2104124 -2385932 -231544 2017810 2050942 2042208 3090452 3533448
217 3533448 2630924 1912718 1572750 455941 -1928345 -3522330 -1677777 793089 1088292
208 1088292 717834 1775720 3225903 2335665 253308 -476438 -212979 -431678 -1207747
199 -1207747 -916042 610640 790827 -50422 -109004 -1537765 -3196018 -1807626 -51472 68895
188 -690057 -1590128 -627578 1337513 333829 -3268594 -4021837 -544301 2368978 767562
178 -2023427 -4102727 -5315116 -5762835 -4862186 -3683325 -1685917 288637 1217351 -339367
168 -591974 826650 1110259 -651191 -1888853 -1568786 -850346 -351849 -1666795 -3158775
159 -3158775 -1938473 132114 32086 -1510260 -2276264 -1001905 1822290 3899872 3854729
150 3854729 3087463 4131217 5212478 3334019 765683 -666184 -1210022 -1100500 -1005860
141 -1005860 -881838 -1933016 -2181645 -357440 -821224 -3555701 -3815621 -3191988 -2740105
132 -2740105 -2117125 -749083 407695 1187338 1322181 865437 857127 2075015 2292801 827808
121 2298 1548602 2255510 472022 -1904976 -2126027 -852825 -313663 626824 2379777 3782981
111 3782981 2295956 -1050663 -3148008 -2430920 -376918 1047042 211220 -404233 -555115
102 -555115 -1334312 -1171954 209940 -252452 -1960575 -2083078 -924548 -340015 378581 1251499
92 1251499 2153022 2265740 636127 626499 648555 535177 1465950 1881575 1261336 808248
82 808248 3583 -1398941 -1781666 -573491 617794 -201451 -933088 -1160820 -1438711 -1408609
72 -1408609 -1221398 438126 2151124 2928928 4233916 4356949 2572170 1552674 1855873
63 1855873 3269442 4813608 4215184 2685018 471107 -3109586 -3659425 206166 3503193
54 3503193 3954516 1470626 -822547 -731581 -1516863 -2062095 -366655 1316874 302291 -2418165
43 -3642486 -420704 3276749 3426268 1936555 599864 -677696 -954926 -418642 -156581 809572
32 2449523 2285762 763116 -751267 -1074085 -1810211 -2131522 -679198 968778 724072 -580468
21 259579 860347 -378806 -1907201 -1943570 269780 732457 -2384725 -4427610 -2002419 534591
10 473127 -486930 -607297 -394085 -1526849 -860316 1046025 1205728 421390 420260 613246
0 613246
##PAGE= F1=10241.35356717
##FIRST=     18110.137220953, 5591.54909048506, -360859
##DATA TABLE= (F2++(Y..Y)), PROFILE
1023 -360859 -1713661 -1562472 -24325 -356377 -2135895 -2731653 -945487 157746 -258429 -241779
1013 -241779 418244 -127797 -1654449 -2912417 -3282596 -3083084 -3564617 -3549253 -2183503
1004 -2183503 -2156150 -1012468 1281679 2202498 2390668 2523952 1230196 -250772 -875357
995 -875357 17474 858193 2061223 2802892 1497950 -392766 -3223817 -4754735 -1937923
985 2820383 4910099 3661038 1176651 -605038 234596 2641445 3553219 1945403 790646
975 1584837 2064059 1172552 946021 1589467 1760033 1734171 1245219 755800 927422 2795035
965 2795035 4582961 4841131 3288290 227982 -2067804 -1073783 950950 340858 110027
955 1948806 2910401 2888799 2520957 961157 -1376092 -2180547 -1164576 7365 125550 -259099
944 -465373 367251 583207 -228342 254952 1615086 1770847 1165018 -499147 -1380264 -1030907
934 -1030907 -1643392 -1940701 -665504 649843 506916 176005 -280483 -1192571 -859169 1291215
923 3106539 3265540 1801849 88275 -1178107 -1405558 -368932 613890 654757 -656772 -2186899
913 -2186899 -2796457 -2807054 -2108808 -2201797 -3156996 -3353409 -1715161 857278 4460931 4927392
903 4927392 2339321 -616610 -2911649 -3680671 -2613418 -1271018 -1388866 -3808925 -7019379
894 -7019379 -6936037 -3482956 -1783050 -992276 -1731889 -4035914 -3865848 -1365460 -87782
884 44348 297439 248837 -728355 -841987 1274252 2389612 2142715 2397588 2239316 1714641
874 1714641 1991363 2960586 2421796 1120570 -33136 -1223140 -2408563 -1793016 -238813
864 -590526 -381128 1275438 1154407 720734 1426328 1818721 1728963 1627675 789245 -362269
853 -204409 391898 770366 772497 1472039 1068189 -1417385 -1713956 876616 2288634 913785
842 -813049 -2868703 -3709290 -2791561 -2128386 -1324073 -620109 -446080 809441 2413116 2439286
832 2439286 989972 730521 1190174 583640 434581 776754 -389095 -2050129 -1012865
822 1674782 3286343 2065147 526571 348618 416283 -612098 -519145 625286 184139 -311558
811 -146234 334515 755148 700999 324620 7427 543477 1494313 822864 -698771 -1684023
801 -1684023 -2262305 -3370893 -2770024 -175434 217429 -869694 -517981 36601 -701789 -1675843
791 -1675843 -2062865 -479339 278071 -1613004 -2939187 -2238639 -762639 1478526 2843301
782 2843301 1157402 -811962 -1040423 -1420585 -1140223 -2593394 -5559866 -5474310 -1039792
772 1503589 1263993 1797068 1100948 -3701 380421 -120227 -1269326 -480938 675250 1137392
762 1137392 763581 -153993 -1181093 -901791 1482259 4046893 2900496 1048266 1592409
753 1592409 3262751 2847007 1571074 1560936 1541636 -181696 -2049570 -1572814 378382 1062077
743 1062077 602037 -202544 -560416 439244 1296437 1971373 1802965 1094465 -146753 -744545
733 -744545 -745714 78801 1131250 766283 151242 1187562 2858443 3010036 1913507 52443
722 -1385696 -1204505 -1388306 -1293320 -58900 28748 -1608724 -1454776 -540965 -1367992 -2205796
712 -2205796 -1146425 1026859 2204733 1499950 2018439 2660143 1311904 -582551 -2311111
703 -2311111 -2966888 -1867351 -502336 -1625946 -3057668 -1022967 1057303 -17740 -2085758
694 -2085758 -2809172 -2006492 43134 345311 -888997 -108532 706565 -558873 -1304827 -1012213
684 -1012213 -677422 88198 806073 412135 -804902 -1848022 -1449784 -1217056 -1572099 -642365
673 449158 614327 232416 463182 985923 1127144 2084550 3267148 2245542 -913594 -2012698
663 -2012698 -1364581 -1070255 411926 1019948 312875 -749095 -1856003 -1697531 559711 1630726
653 1630726 -82761 -2110855 -1840257 840512 2911085 4063752 3628202 903202 -1537396
643 -1618693 -532495 -699217 -1402830 -263106 16020 -1781835 -2899455 -2555624 -2388675 -2505855
633 -2505855 -2106800 -2278927 -1340009 -504390 -771396 -1620119 -2161604 -3504359 -3532807 -2393325
623 -2393325 -1778945 -1918183 -1006406 -1338479 -3389633 -4233173 -3346740 -2773173 -3266976 -3199747
613 -3199747 -3474903 -4591408 -5079695 -5352954 -5516652 -4321698 -2602044 -2899520 -2425720
604 -2425720 -1942928 -3491351 -7097972 -30010089 -62768241 -51844391 -9500901 12626145
595 9638454 6268835 5111856 4324014 5746016 5403770 3174180 2732914 4637136 5442612
586 5442612 4186613 2902232 1106637 -71204 1078873 2691619 2384952 1057157 1211478
577 1211478 2572211 3929678 4873258 4380992 1848383 296998 608001 1792791 1886663
568 1886663 2628647 1442233 -499051 -1131444 104806 1450103 194873 -1458185 -522826
558 -54584 -842856 -1739860 -562808 933014 1490302 2338425 2906471 908357 53742 3000123
548 3000123 4101719 567909 -1202558 132957 1969607 2836930 2031995 605095 428029
539 428029 948819 88181 -1054430 -590584 1162058 2631170 1271300 -1843161 -2673856
530 -2673856 -109034 2552593 4177062 3825746 1739891 691141 757298 174852 -913641
520 -406184 205894 1489752 2940996 2824408 1321236 548181 1467929 2584216 2034863
511 2034863 97839 -1775341 -2677548 -2387345 -216387 1967981 1719018 -24209 -1058198 -24982
500 1556141 1785404 1813849 1100806 -255852 -985290 147785 738647 -956413 -662663 2502163
489 4075533 3292867 3377013 2763083 1490214 1582412 2196701 2994873 2451676 -305262 -3299040
479 -3299040 -3159440 -349508 1552947 963241 -673922 -1360890 -2028903 -2093906 -555700 -54270
468 -1258011 -673950 888168 101813 -2006180 -3038870 -2340861 -2046483 -902973 586804
458 394380 -64554 -472004 -791263 774108 3442173 2680873 -892884 -2175500 -541041 150469
447 -2469454 -4761876 -3023340 181210 882625 -686712 -1412420 -374659 1048701 2154103
438 2154103 1627322 1527834 3182963 2105341 -1027362 -2692400 -1776224 694101 3103016
429 3103016 4036514 1824519 250816 -349266 -1865537 -2837121 -1404609 397167 1319951
420 1319951 1162340 647097 1877427 4541174 4735611 2574637 1053361 -393844 -2686468
411 -2686468 -2182791 209658 238206 -1759222 -2269850 -579288 1287443 1384723 -298068 -988116
401 -988116 -1641659 -2209850 -2812382 -1888092 1058068 2592974 -144785 -3691845 -2777504
392 -2777504 638019 1535795 -47299 409055 2060685 1966721 1117538 470104 51414 696120
382 696120 1782540 2292279 1836566 923378 1049569 816258 218391 -331655 -1721198 -2574992
372 -2574992 -2165245 -1518231 -2108684 -2479362 -1316163 391131 1338970 1062492 -1299770
362 -2533017 -18639 2518062 1133874 -1633886 -1390456 421700 -454502 -2365491 -1976297
353 -1976297 627179 683200 -917750 -953800 -1198743 -1840164 -1945640 -2311451 -1642279 886244
342 2460375 1135477 -1100624 -1212777 -178976 -1421120 -2302270 -772329 631524 373512
333 373512 235931 962125 1226679 -836504 -3081717 -3197836 -2224070 -1587745 -255941 1396855
322 2479175 3034298 2058728 -497177 -1518071 -839551 320106 1240716 1091867 -271238 -696145
312 -696145 -160474 1108888 3056674 4387207 4220176 2621847 1677698 1586134 1007322
303 1007322 -275324 -1158044 -1667338 -1862361 -3155615 -3028887 -988626 570168 1971494
294 1971494 2804924 680289 -310645 761945 971725 180476 143693 523233 962177 1000672
284 1000672 261201 -977507 -2088542 -1908011 -387434 1183080 1536457 1029702 -537585
274 -1591623 -1396123 -1137156 189864 880814 -112966 1066589 3749656 3033662 -292023
264 -3926592 -6963806 -5174947 -462471 1341494 955714 696408 839616 585313 -1028461
254 -2826218 -2831517 -1597311 -682720 -1031297 -815438 947724 1694606 1722227 2807071 3277533
244 3277533 1547438 -580758 -56238 1610023 2550452 2838209 1482144 -302562 -1529026
235 -1529026 -1940686 -2243573 -2423378 -2546083 -1747415 -136342 793668 611068 441781 130348
224 -840943 -1273834 649935 2790233 2871238 2417633 2308685 1868478 365520 330502 1306454
214 1306454 319975 -3313148 -5375212 -2698999 561511 845381 645351 1687112 2835803
205 2835803 2327489 -36249 -805534 46651 -226033 -1697166 -1487076 408285 832283 513321
195 513321 342046 -1463606 -2793973 -996992 182585 -51302 -102413 -1043942 -1049146 948496
184 827339 -2830615 -4504466 -1013625 2661527 1617772 -1087827 -3229587 -4660412 -5462936
175 -5462936 -5528239 -5245715 -3125092 -380702 705227 -616098 -62735 1512292 1684338 -384480
164 -1656335 -1304208 -480909 541156 -646616 -1957433 -1451029 -194852 -794273 -2175370
155 -2175370 -2271680 -192165 2670824 3517821 2343409 1130999 2991912 4995760 3432651
146 3432651 986373 -159347 -489151 -479225 -727115 -1115525 -1912681 -1609464 -169561 -855798
136 -855798 -3334682 -3219529 -2873594 -2752681 -2146178 -912667 202725 986151 1018504 821746
126 821746 971651 2150783 2261542 791500 142414 1173808 766969 -933507 -2020536
117 -2020536 -1380834 -395520 -355105 292602 2234792 3870546 2022232 -1518109 -3833361
108 -3833361 -3127449 -678515 1554387 863270 157161 128440 -1007086 -1289080 -302197 -772660
98 -772660 -2101781 -1584541 203086 1319557 1378587 642679 648945 1292434 756401 960077
88 960077 367601 17030 1085095 1872465 1355593 972206 194011 -1372470 -2158288 -772775
77 922348 316049 -858450 -1551649 -1506335 -749560 -425403 695286 1852982 2223499 3854811
67 3854811 4874869 3486213 1540294 992584 2810527 4983176 4549162 2802785 626226
57 -2489546 -3027497 121873 2492311 3490949 1973077 -400249 -933360 -1442302 -1562741 -446312
46 606537 -237980 -1922395 -2991088 -733079 2349153 2579268 1151323 88491 -885346 -918046
36 -918046 54291 793333 1267616 1905248 1479972 667221 -127481 -383208 -873364 -901757
26 -901757 350160 1908218 1511940 -606072 -358070 687810 -16975 -1449906 -2013514 -766885
15 -625695 -2931977 -3774392 -1373738 405292 -77244 -1122346 -488627 117302 -915986 -351443
4 1261146 1197539 441744 519951 869095
0 869095
##PAGE= F1=10219.73602966
##FIRST=     18110.137220953, 5591.54909048506, -63348
##DATA TABLE= (F2++(Y..Y)), PROFILE
1023 -63348 -1413319 -1336976 358306 566218 -1048181 -2144323 -1171172 -677356 -1374205 -1415680
1013 -1415680 -487902 -374815 -1511285 -2197333 -2409935 -2629089 -3715060 -3517526 -2253122
1004 -2253122 -2496618 -1409627 922072 1198270 -8549 -407700 -656887 -1143339 -1437508 -550354
993 502204 2125123 3496267 2655097 647289 -2191977 -3705861 -1511368 2582910 4834919
984 4834919 3754572 1132494 -709399 -116818 2355828 3716238 2604383 1529009 2128662
975 2128662 2223474 1089884 329508 668662 1183230 1380696 779565 611686 1179878 2715572
965 2715572 3681381 3456800 2146970 318379 -1120747 -1094410 -254238 -50954 230780 1319767
955 1319767 1385316 1951791 2548603 2038942 90338 -1588665 -1717456 -650619 78713 -223997
944 -810494 353622 1164131 477970 426105 1047783 1172911 1316193 260428 -569108 -447527
934 -447527 -1134612 -1388757 -279905 778169 117453 -578675 -516145 -492597 -125558 1329353
923 2609982 3166140 2330792 435930 -734947 -570918 118113 395896 -27101 -1088631 -1951937
913 -1951937 -2320339 -2578069 -2135606 -2835684 -4230044 -4236414 -2591990 -355238 3364966 4409781
903 4409781 1968912 -734506 -2362911 -3496122 -3265497 -2209742 -2547114 -4532634 -6267886
894 -6267886 -4931456 -2357777 -1589970 -1028941 -1069383 -3054247 -3269261 -871168 658508
884 853937 1080827 1354363 637392 29349 1572653 2970177 2348898 1918779 2234321 2813294
874 2813294 3030957 3222894 2614717 1897769 785279 -353149 -1371710 -1103265 -442033 -930473
864 -930473 -334365 1358022 953794 116907 574852 1338895 2164878 2748328 1950723 461327
853 323309 984882 1350978 700869 926355 564380 -2312858 -2688338 414339 1960569 892305
842 -246007 -2121953 -3215809 -2314320 -1554259 -889732 -447555 -477536 922679 2677643 2640374
832 2640374 745547 69404 284107 -356583 -201139 703235 -176275 -2250377 -1957375 659241
821 2650897 1503137 -635696 -1550740 -681442 112299 571747 609022 83069 6540 49859
811 49859 647161 1270444 659649 -104983 -17812 976330 1493135 317656 -1175575 -1810204
801 -1810204 -1731951 -2443551 -2569016 -973770 -640047 -1189945 -201038 1154819 670451 -890577
790 -1695918 -482598 -95049 -1725999 -2908377 -2187125 -106940 2292687 2826295 1216625
780 -1603 -291669 -960432 -1075579 -2308860 -4475992 -4030690 -316826 1598222 1237349 2121940
770 2121940 1824985 120630 296623 437179 -626166 -342313 350961 845049 907453 189141
759 -1066554 -893442 1833019 4419732 3125149 1650810 2046906 2355918 991851 86077
749 546115 921696 -160979 -1758062 -1485449 381796 1275844 666815 -560243 -1075811 108556
738 1056267 1670397 2014747 1498984 -167129 -1126595 -1460268 -535866 814027 538772 -357210
727 828044 3041644 3050229 1575117 127176 -771852 -505493 -1067571 -1420522 -590825 -198829
716 -1281681 -1777462 -2083975 -3251109 -3074192 -858372 1498820 2426708 1921485 2569667
707 2569667 2256457 -37943 -1926535 -2940567 -2846749 -1575294 -484379 -1682409 -3208001
698 -3208001 -1365920 1370090 794025 -2044339 -3990711 -3170324 -605157 -490672 -2210442
689 -2210442 -656560 1328059 774086 -537000 -1744045 -2605839 -1501931 -201293 -173595
680 -173595 -621860 -1125650 -734879 -588999 -1330584 -1142695 -95010 157505 -847026 -1278403
670 -1278403 -180414 1079797 2603336 3926529 2580118 -1082782 -2686783 -2381319 -1958543
661 -1958543 -216537 238150 -603559 -713900 -967428 -1441376 -1451 905363 -819422 -3351349
651 -3351349 -3586581 -850430 1142197 2123248 2035658 59903 -1980047 -2541094 -1864645 -2292813
641 -2292813 -2879339 -1515216 -1460969 -3331478 -4260283 -3669393 -3704934 -4155297 -3648264 -3283379
631 -3283379 -2424224 -2196601 -2587934 -3246146 -3937269 -5725863 -6155089 -4658551 -2478915
622 -2478915 -2339590 -2139454 -2533584 -4747965 -6890284 -6247564 -4682986 -4888218 -4983266
613 -4983266 -5202373 -6323609 -6925024 -7561734 -8812558 -9579390 -8621331 -9583444 -9519995 -12482593
603 -12482593 -15781827 -21675000 -88573054 -187134769 -155732792 -22919867 35916234 25780564
595 25780564 16623083 11241460 9013550 9532370 8600029 7154934 6483833 7938636 8541422
586 8541422 6422343 3852684 2265474 2280139 3597339 4936551 3793568 2130833 2411578
577 2411578 3819964 4792801 5603438 5492845 2845882 931720 1833483 2941015 2642540
568 2642540 3327931 2710556 1026186 126324 581396 919222 -336040 -906647 830701 951293
558 951293 -577500 -1613566 -217003 1688046 2732495 3456272 3502981 1224882 657759
549 657759 3925095 5012768 1851469 687234 1450916 2364796 2660441 1613524 649565
539 1134867 1355684 -66933 -855655 76579 1840082 2733630 1273639 -1493119 -1957609 -192684
528 1791116 3610188 3409469 1108519 59790 579462 -47672 -737284 1216516 2365263
519 2365263 2998025 3805208 3404427 1968810 803282 939985 1205328 338636 -1182838
509 -1663539 -1140322 -228440 1654585 2907326 1373572 -1306808 -1962090 77247 2341059
500 2341059 2116146 999187 -109852 -1035545 -1530040 -291583 688589 -369447 -333836 2596006
489 4220986 4690777 5300376 4981820 2446607 1892818 1640307 2190565 2322646 -209265 -3273193
479 -3273193 -2860196 -231385 1352971 621060 -1333415 -2232351 -3021018 -2713717 -455311
469 514257 -421213 394817 1948333 1017705 -1282703 -3129039 -3274328 -2859627 -1612246
460 -1612246 -799601 -1179738 -543240 305200 346559 1877649 5018523 4223634 -204870 -2812431
450 -2812431 -1829267 -515806 -2403724 -4941958 -3367240 208227 1523998 -258467 -1726602
441 -1726602 -841675 1036595 2175541 1659122 1644471 3510428 2806812 201633 -1919851
431 -2000779 410349 3798615 5266765 3240790 1460794 -260132 -2891136 -3433782 -2021839
422 -2021839 -372080 325599 277537 454413 2364813 4284051 3600125 1497104 541834
412 -487518 -2440905 -1895501 694229 898849 -1458756 -2477951 -780987 1309621 1294227
403 1294227 -218127 -44167 -119774 -1014251 -2181039 -1675094 1144703 2690118 18682 -3159252
392 -2137486 1218506 2283519 540810 480041 2016666 2049757 972709 -85489 -468381 530751
381 1876429 2314971 1229050 -169652 -70886 231553 -27729 -744696 -2614114 -2923447 -1028777
370 108990 -1221191 -2289155 -1506477 200016 1149648 457392 -2141779 -3125307 -509494
360 2068418 955809 -1861810 -2052056 -461682 -819059 -2148753 -1876262 539443 987162
351 987162 -471787 -1268631 -1983536 -2436844 -2379104 -2333842 -1337898 1186736 2408876 1118801
340 -357269 182360 405408 -1845963 -2950179 -1103919 1116717 1007608 172251 -141434
330 -274443 -1515725 -2607595 -2582331 -1970637 -968986 173011 953185 1710793 2478452 1692265
320 1692265 -1200681 -3004571 -2578498 -601769 1530678 1417242 -667511 -1580538 -1026998
311 -1026998 -67930 1711395 3309530 3601393 2498343 1560045 1088970 480277 -459211
301 -759203 -1285565 -1869452 -2837221 -2218720 -78746 1334288 2357750 2751496 867981 281739
290 993823 286518 -1272769 -838288 -11728 81740 -461442 -1069684 -2023871 -2858876 -2367438
280 -2367438 -729576 892834 1839137 2094389 690443 -1130520 -1506193 -871314 875161 1291924
270 1291924 -68488 944122 2994483 1605861 -1480551 -4486973 -7403776 -5346546 301021
260 2616578 950900 -1002480 -1480060 -790177 -1031734 -2523372 -2760488 -1511829 -668234
250 -1467280 -1540632 264640 1368380 1581112 2582074 2945996 2004270 188769 -34175 1097586
239 2502139 3454631 1928927 -429790 -1584748 -1818138 -2564353 -3089023 -2439567 -1093614
229 -434 8990 -690968 -384293 529723 739572 433068 1687140 3291008 3523593 2855639
219 2855639 1378094 -130671 -1642371 -803709 1197326 232815 -4207115 -6258866 -3025279
209 213298 38637 -41257 1151680 1882804 1620097 -517465 -1112446 365376 158699 -1990411
198 -2103133 138888 923386 935993 710279 -982944 -1776402 -24474 375276 -243934 343276
187 -505774 -1493849 435843 1276724 -2052794 -4804700 -1815272 2124784 2041863 -171355
177 -1922830 -3394833 -4695189 -5682389 -6062607 -4033626 -778028 214992 -818839 465041
167 2099460 2004670 -149471 -1024339 -361323 502360 1521364 509632 -538696 -549475 -155958
156 -1242914 -2320370 -1826117 530009 2581575 2251789 458668 -761195 1912282 5087934
147 5087934 4248857 1684192 363513 -5244 -65454 -429998 -1291154 -2123336 -1368080 -1809
136 -687295 -2867924 -2848808 -2634419 -2576131 -1982486 -1132706 -371067 169556 186254 574361
126 574361 1126557 2035564 1993932 645847 -56856 42027 -1030665 -1944183 -1551000 -348949
115 83341 -465941 -464 2085853 3776941 1643291 -1504750 -3467016 -2935671 -717635 1713544
104 1345177 882714 1383336 129301 -906083 -534754 -974929 -2231089 -1534393 978789 3210080
94 3210080 2796387 76103 -1052514 101216 813512 1248756 346059 -73238 1158214 2172529
84 2172529 1471724 888708 123445 -1416423 -2335606 -560371 1504686 1125542 -320398 -1382339
74 -1382339 -1196234 -37229 310544 743652 1255332 1150693 2835491 4661865 3820986 1170756
63 -108599 1924978 4546181 4384471 2711358 844391 -1695895 -2208099 -51300 1136686
53 2237346 1844313 -178877 -1121167 -1298040 -1176861 -797258 -159138 -306224 -819748 -1936449
43 -1936449 -1153002 968667 1248742 209071 -69569 -802308 -1069468 142712 1207082 871942
33 871942 393866 264050 716200 806136 327690 46784 200262 1060156 2493841 2400664
23 2400664 128141 -447929 536635 303390 -920287 -1898829 -1826348 -2061261 -3244617 -2816182
13 -2816182 -733606 80037 -455079 -1376496 -336131 193000 -550875 18599 1327909 1197622
3 1197622 508359 474631 947042
0 947042
##PAGE= F1=10198.11849215
##FIRST=     18110.137220953, 5591.54909048506, 380909
##DATA TABLE= (F2++(Y..Y)), PROFILE
1023 380909 -862104 -945785 660871 1317497 126281 -1327982 -1334173 -1579149 -2454403 -2471211
1013 -2471211 -1198948 -284448 -702447 -697863 -933486 -1975842 -3601024 -3315598 -2331543
1004 -2331543 -2823600 -1751619 599587 158504 -2434530 -3152871 -2076779 -1902166 -2063931
995 -2063931 -1104959 169438 1942203 3716392 3340398 1406131 -1037252 -2398144 -919343
985 2404758 4569991 3474036 1064335 -563064 -257818 2196917 3854940 3098224 2076583
976 2076583 2654634 2465305 1044053 -254933 -206900 702873 1085002 408412 525026 1566791
966 1566791 2772294 2909662 2023102 889950 612974 119053 -1011330 -1499049 -429267
956 301335 578092 78088 891244 2173649 2833858 1434571 -1178937 -2382424 -1245106
947 -1245106 -2681 -121489 -690367 742531 1997260 1415776 590714 279384 404512 1197353
937 1197353 872712 396708 454851 -281395 -759309 19252 712530 -314482 -1138525 -563226
926 87474 266212 817765 1518098 2430747 2243024 570373 -319869 41759 480125 357544
916 357544 -250160 -818012 -1035427 -1247555 -1561942 -1551027 -2937938 -4472264 -4265184 -3144488
906 -3144488 -1430603 2340418 3959232 1724929 -667143 -1724453 -3157757 -3477546 -2615725
897 -2615725 -3051240 -4288505 -4175761 -2047572 -724851 -1014064 -592832 139672 -1262880
887 -1961333 -114824 1368763 1454851 1620200 2362629 2062150 840121 1551742 3118197 2318291
877 2318291 1118896 1763563 3247493 3671603 3394303 2840321 2645930 1724979 650814
867 -456686 -670254 -774575 -1102131 -217324 1007566 353859 -491584 -115406 1003471 2442510
857 2442510 3540497 2901674 1298151 888940 1430930 1576116 430833 399606 255040 -2688907
846 -3328430 -185316 1339917 783430 445070 -1071905 -2316960 -1370848 -728363 -684924
837 -684924 -565372 -324909 1091391 2685662 2363513 193769 -535938 -350817 -891226 -611682
827 -611682 558274 -6720 -2202025 -2524896 -100618 1958346 814886 -1735742 -3240824 -1567627
816 738431 1045782 -191481 -466830 384041 354189 563694 1176155 472337 -422081 -122662
805 1252179 1490832 -13525 -1426629 -1624428 -749627 -902037 -1886592 -1530683 -1205019 -1187491
795 -1187491 275213 2179098 1903136 -146035 -1391145 -912469 -903517 -1917324 -2601791 -1972769
785 -1972769 170003 2287706 2206835 1336282 1124718 920812 -44278 -760453 -1656792 -2957325
775 -2957325 -2226835 648416 1832188 1091062 1895032 1966428 145220 262181 1213261 409104
764 -174763 -252645 292027 878202 427309 -638008 -484498 1927821 3886663 2657928 1766484
754 1766484 2075099 1087769 -905148 -1334199 -583871 220226 -196015 -1456932 -1304641 472731
743 1374121 518364 -1013812 -1683395 -561524 438438 953963 1810953 1870972 331661 -757541
732 -1226795 -515891 544243 313827 -674561 334652 2464180 2540746 1163469 391638 139202
721 326248 -738396 -1736496 -1417441 -722787 -938768 -1640851 -3231961 -4883674 -4131463 -1086767
710 1655053 2409815 2002723 2463421 1197076 -1717496 -3362861 -3471343 -2730578 -1436356
701 -1436356 -693928 -1735481 -3028301 -1436283 1466133 1365088 -1645784 -4248185 -3403791
692 -3403791 -801557 -1179177 -3257054 -1013513 1837652 1773222 16160 -2274198 -3996662
683 -3996662 -2558280 -1043931 -695755 -343976 -332084 -63603 -67038 -936219 -1370509 -532718
672 -356900 -2087070 -3105082 -1225741 1155646 2759667 3793367 2336087 -1245156 -2937338
663 -2937338 -2813812 -2500077 -938491 -694997 -1501059 -680639 -36638 -914047 -468010 68507
652 -1352268 -3861628 -4611964 -2293369 -534821 82917 165460 -931667 -2395431 -3127628 -2816576
642 -2816576 -3479399 -3893826 -2641026 -3096864 -4808032 -4862863 -3935318 -4316912 -5189500 -4718627
632 -4718627 -4166823 -3506005 -3614332 -3943805 -4483940 -5351047 -7366781 -8150444 -6318729
623 -6318729 -2938265 -2457741 -2945680 -3493121 -5606896 -8585909 -8522178 -6211326 -5712076
614 -5712076 -5649658 -6123831 -7668342 -8780791 -9482706 -11204149 -13572488 -13636329 -16135068
605 -16135068 -18172097 -24960790 -30217187 -37855913 -150813410 -320737600 -267621320 -38068431
596 58132535 39392681 27453783 18642086 14311796 13530906 12108905 11198819 10143020
588 10143020 10447216 10143017 7626969 4536864 3665968 4494843 5025045 6003712 4797962
579 4797962 3303422 3771458 4983558 5394065 5858629 5884965 3503450 1613134 2929102
570 2929102 3849905 3418357 3649908 3398378 2433835 1589525 1173794 581022 -426305 144289
559 2234096 1979194 -84858 -1115994 143441 2260641 4040461 4338166 3380441 1147023
549 1308828 4681878 5458252 3069762 2620891 2712434 2565929 2260032 984588 510766 1510658
539 1510658 1627107 102680 -278671 803011 2405335 2920575 1834079 -346145 -657650
530 -657650 -32836 936935 2918199 2986508 728496 -229510 638063 34884 -166719 2740882
519 4375157 4292607 4208660 3465996 2469144 1043935 342826 -184084 -1176031 -1905025 -823954
508 587402 1573303 3097660 3411018 952531 -2440033 -2777355 237066 2870592 2155013
499 2155013 -22768 -1225892 -1589958 -1766035 -510487 857329 450094 102956 2097069 3702802
489 3702802 5341625 6236566 5601736 3155228 2410552 1311202 1468393 2271393 308073
479 -2532585 -1995038 269298 1656980 646577 -1656039 -2610768 -3347469 -2745314 -196485
469 1040988 411155 1173743 2803643 2014393 -248715 -2678228 -3697119 -3219747 -1909843
460 -1909843 -1691311 -2293537 -890935 1114091 1543775 2428411 5024116 4673881 306524
450 -3134354 -2985602 -1308260 -2236251 -4574643 -3250017 225299 1859668 195886 -1589614
440 -735678 1683606 3045845 2226456 1946374 3376459 3052439 1392197 -762581 -1721032
431 -1721032 157866 3837521 5156759 3521540 2109074 39100 -2928014 -3301174 -2493508
422 -2493508 -1261957 -862443 -615273 337868 2570807 3497787 2216657 700103 368605
413 368605 -206106 -1443704 -924248 1326094 1528819 -898445 -2389635 -1027027 973498
403 884853 -179945 641730 1023028 212030 -1065825 -1108678 1161416 2442112 -102643 -2687152
393 -2687152 -1310200 1847178 2642911 582186 186656 1557100 1872904 818873 -470415
383 -700435 449078 1588246 1599285 177558 -1288105 -1063288 -395095 -539191 -1414269 -3369287
373 -3369287 -3085458 -231273 1052366 -811571 -2093788 -1514099 21799 721655 -268026 -2545465
363 -2545465 -3039971 -852616 1213992 442381 -1858589 -2298161 -1194528 -1023371 -1460581
354 -1460581 -1300519 489503 1181419 7211 -1370563 -2152536 -2218194 -2082392 -1881700 -916774
343 1358402 2311305 951557 156120 1267704 879884 -1700648 -2832521 -1107585 1348469
333 1325886 96330 -850124 -1222006 -1451569 -1146657 -1090052 -1149740 82949 825667 646119
323 646119 1022949 1879680 1143328 -1758033 -4074250 -3910657 -1307862 1758612 1690563
314 1690563 -825018 -2102452 -1748159 -1360147 53670 1669192 2419429 2061380 1351315 655604
303 131754 -318641 176692 -92737 -1236169 -1956264 -1023819 888974 1971553 2240093 1935383
293 1935383 722811 1020968 1416192 -355875 -2127044 -970685 120935 -68448 -940330 -1782190
283 -1782190 -2776718 -3359315 -2611665 -934481 613460 2085265 3174471 1901701 -582983
273 -1442263 -366772 1630393 1609800 -4724 811431 2101938 202544 -2385023 -4626977 -7203985
263 -7203985 -4928862 1045361 3425653 761987 -2565578 -3610636 -1948644 -564900 -1547893
254 -1547893 -2107439 -949342 -255360 -1380145 -1808061 -461457 563326 1075255 1939429 2100715
244 2100715 1859431 556254 -100832 627536 2182647 3361101 1884408 -522708 -1215989
235 -1215989 -1075311 -2212901 -3210189 -2041653 -288519 326954 -738064 -2181185 -1620279
226 -1620279 585643 2291796 2368764 2626862 3481196 4015770 3358344 754097 -1631986 -2703355
216 -2703355 -1221177 1169238 135357 -4325152 -5881936 -2543948 -15637 -775258 -856574
207 -856574 446472 768366 501655 -1020536 -1295874 673744 632989 -2006366 -2560521 -121603
196 971720 977108 893950 -109966 -335161 939742 602023 -305715 645867 -62803 -1824538
186 -1824538 -91512 1593274 -987196 -4504953 -2507215 993986 1847706 421820 -668875
176 -2017045 -3802461 -5459037 -6124183 -4151233 -764178 -201888 -1025191 889138 2684763
167 2684763 2158538 7495 -310927 759881 1706240 2410836 1548874 596230 380553 166541
156 -1101751 -1813486 -1162076 755316 1466768 361257 -1385814 -2093244 1162502 5422487
147 5422487 5438138 2516531 659391 79189 22600 -288869 -1427547 -2405342 -1364016 200804
136 -332993 -2283422 -2711933 -2350548 -2031897 -1565371 -1309105 -1192071 -1187870 -1144779 2571 1219483
125 1219483 1841024 1610537 425448 -564154 -1537339 -2667976 -2385131 -746881 618966 456942
115 456942 -603087 -246947 1781494 3296692 1100650 -1174607 -2182878 -1846717 -369659
105 1599994 1542735 1581218 2898373 1768609 -205317 -451693 -836798 -2320267 -1908014 1216209
94 4653564 4028501 -387873 -2561418 -971061 894572 1571661 683831 236913 1440308 2458608
84 2458608 1484833 598859 -102991 -1462372 -2177727 81221 2245758 1940087 467915 -671115
73 -532365 588761 773625 542632 536739 71320 1453700 3635182 3247663 414609 -1161434
62 874281 3694397 3857843 2607944 1272751 -822935 -1390446 -314058 -268970 491763 1120404
52 1120404 -138099 -1148372 -1200115 -1186018 -1409420 -813664 -620 429205 -833607 -1516153 -441930
40 -155642 -556083 93500 -688688 -1649615 -426648 782462 -293436 -1617749 -1105136 645692
29 1346039 524095 377454 588419 1108361 2458381 2904211 943463 -354134 275363 356630
19 356630 -564523 -1689254 -2650251 -3188246 -3190334 -1811363 -330530 -424551 -464819 -822561
9 -822561 -162527 -273542 -643452 26173 1050273 917474 274763 100097 673352
0 673352
##PAGE= F1=10176.50095464
##FIRST=     18110.137220953, 5591.54909048506, 363679
##DATA TABLE= (F2++(Y..Y)), PROFILE
1023 363679 -640520 -837840 503550 1398501 765364 -849406 -1773102 -2661327 -3516550 -3403104
1013 -3403104 -1784919 -153219 259018 796496 398288 -1550107 -3435205 -3248286 -2702725
1004 -2702725 -3311337 -2081292 220403 -845152 -4259579 -4999794 -2933752 -2572723 -2894571
995 -2894571 -1898217 -492624 1226708 3198239 3135501 1495203 -186772 -1399194 -677753
985 1996373 3924641 2707146 814991 -410029 -374467 2024820 3883966 3114374 1933281
976 1933281 2663968 2423647 717641 -884874 -968750 153426 555496 -99857 291537 1787497
966 1787497 2753070 2321224 841417 -303312 741537 1078337 -1012439 -2603020 -954208
956 123885 -185607 -778391 -280847 1079714 2649984 1799631 -1423608 -3151568 -1727644
947 -1727644 -216669 -153385 -393685 1130413 2565523 2071674 504868 -617530 -412774 724259
936 939984 956037 1142243 453676 -318859 38546 261592 -883540 -1485529 -496453 320041
925 165251 -91878 199647 1292676 1495572 383277 -165542 89139 518246 494616 17388
914 -6943 207510 -34790 -299356 -764392 -2702791 -3999303 -3558365 -3266352 -2018659 1815553
903 3735458 1790843 -140418 -964633 -2726125 -3262530 -2483193 -2881653 -3185647 -1342144
893 785828 1012126 -205261 93694 1348902 602966 -434013 574133 1745438 1712601 1762588
883 1762588 2873368 3114218 1453264 1301661 2842162 2174954 349714 1003436 2890781
874 2890781 3677123 3377066 3000002 3136793 2560429 1545531 93014 -715776 -1210851 -1040552
864 -1040552 -6915 424277 -353428 -843022 -410041 907259 2489753 3793218 3468597 2055304
854 2055304 1414464 1595851 1331825 -79431 -44100 285816 -2348687 -3480461 -872501 605906
843 743730 1204886 22063 -1298976 -259002 138478 -678325 -793292 43269 1276262 2452737
833 2452737 1756966 -463053 -863480 -409826 -790621 -658969 402898 87982 -1884918 -2497255
823 -2497255 -474262 1235362 38263 -2625676 -4372724 -2177850 852837 680032 -1428547
813 -1156491 822978 717441 131846 585308 241870 -654326 -374287 1324879 1537681 -129259
802 -1475247 -1298581 336363 766000 -924438 -1573033 -1214405 -850911 770754 2772391 2487882
792 2487882 231456 -1228720 -1532184 -1823362 -2070602 -2085561 -1701060 -63296 1485593 1343306
782 1343306 1608312 2154353 2015310 779445 -384912 -810798 -1335749 -554029 1535092 2094056
772 2094056 919206 1311878 1477695 -85370 181800 1966896 1505649 -157990 -1117540 -433458
761 659152 437278 -173861 77146 1705609 2703548 1745725 1432785 1606873 -206891 -2178295
751 -2178295 -2088398 -1280643 -230140 -206189 -1128917 -927937 748209 1344993 144476 -1519517
740 -2251450 -1347721 -412929 38886 1316048 2136297 1116233 108532 -241217 -30032 244566
729 85109 -688446 -122156 1345001 1613926 774777 736293 1010331 1046257 -398310 -2083181
719 -2083181 -2280378 -1289556 -544288 -966197 -3478810 -5682420 -5013641 -1560351 1739118
709 2402927 1858595 1793769 -170284 -3192822 -4383980 -3717461 -2685357 -1570717 -1071907
700 -1071907 -1688421 -2518120 -1192986 1322835 1515900 -1026915 -3512312 -2732107 -613107
690 -1631622 -3816271 -1190661 2048474 2160086 244666 -2447244 -4477839 -2925225 -1665805
681 -1665805 -1149616 -74748 372570 445648 249356 -447188 -1183615 -751144 -821052 -3180954
671 -3180954 -4575053 -1923125 1315416 2572030 2999601 1691766 -1236834 -2560449 -2455852
662 -2455852 -2532179 -1548155 -1588287 -2247430 -713716 674219 -278864 -727828 -596885 -1457989
652 -1457989 -3447339 -4583251 -3038298 -1537918 -1281253 -1335606 -1772882 -2634426 -3136128
643 -3136128 -3010090 -3791773 -4174392 -3298667 -4098747 -5414086 -4494249 -3371152 -4051129
634 -4051129 -5375800 -5181313 -4760926 -4279598 -4398405 -4476038 -4913283 -5914897 -7864044
625 -7864044 -8650275 -6469664 -2797919 -2298811 -3377845 -4025316 -5717232 -8787841 -9372373
616 -9372373 -6747272 -5438402 -5060505 -5861819 -7935887 -9840955 -10564328 -11919673 -14686339
607 -14686339 -15627944 -19638255 -23941089 -31962947 -38178875 -46101942 -178687496 -381584668
599 -381584668 -318160880 -45681617 66270532 42553670 32993767 24522701 18048552 16134135
591 16134135 14365294 13447997 12185557 11204567 9662288 7179179 4592456 4780689 5833565
582 5833565 4930790 5261060 4853583 4132889 4871663 5784539 5674563 5651906 5541986 3740379
572 3740379 2200701 3399949 4026398 3653891 3374800 3220690 3157063 2759897 1672899
563 1672899 403147 -172307 1440439 3483471 2779946 490252 -422064 260853 2333968
554 2333968 4921288 4746836 2580426 615344 1717531 4878090 5081321 3617153 3832173
545 3832173 3442770 2453148 1653168 215798 89645 1298043 1659067 674589 556862 1376488
535 1376488 2752724 3238036 2724972 1241232 809253 188451 3118 2117080 2664866 686673
524 -196769 709790 251193 634071 3725784 5394091 4687343 3849788 2867693 2427620 1014051
513 -177063 -1115477 -2014010 -1787874 505607 2003633 2408982 3482252 3254379 547694 -3022208
502 -3105999 425146 2858718 1734332 -1084223 -2134799 -2028627 -1901540 -598969 1220254
492 1287631 498665 1206691 2716090 5037558 6256690 4921869 3216194 2684281 994987
482 639557 1983125 859724 -1463536 -894271 958795 2169976 779506 -1769592 -2633573
473 -2633573 -3184382 -2534461 -162623 1231869 925569 1387006 3064267 2694158 778518
463 -1841477 -3503442 -3172197 -2024639 -2146654 -2885497 -1273095 1460749 2276152 2202763
454 2202763 3411674 3698726 385363 -3084215 -3726832 -2108923 -2233780 -3916002 -2731710
445 -2731710 213229 1653252 348542 -1236143 -299689 2427086 4011616 2930733 2385913
436 2385913 3047066 2987521 2311206 456433 -1163754 -154436 3103582 3874526 2732595
427 2732595 1957631 182684 -2295982 -2839484 -2852899 -2165630 -1993189 -1363383 255211 2481409
417 2481409 2631205 1234894 494301 425747 81822 -295034 276054 1834759 1898650 -260771
406 -2131249 -1461254 144354 117740 -324373 764885 1364198 1119615 240422 -378698 959945
395 1777984 -503672 -2445428 -645972 2200272 2380478 -23884 -498760 698305 1452078 781693
385 781693 -588122 -758445 336003 851690 101114 -1261494 -2345876 -1845909 -1031365 -1217041
375 -1217041 -2166760 -3869059 -3138918 -28904 989382 -1162257 -2144770 -1488989 -213103 167749
364 -866074 -2413783 -2291329 -841702 265759 -281693 -1669576 -2152712 -1656133 -994180 -459112
353 -494677 361433 1124365 324731 -1280821 -1790591 -1433349 -1289824 -1240687 -650876 1240334
342 2061160 532048 228422 1663276 970211 -1218648 -2107287 -828656 1169007 1069227
333 1069227 -164792 -1159007 -1547353 -853095 668652 638097 -118700 1090060 1397221 456495
322 427061 1242579 529931 -2090988 -4516308 -4550461 -1659091 1839817 1858770 -815878 -2401093
312 -2401093 -2423578 -2511407 -1447720 -63897 935718 1286285 1054458 426591 -3690 -34218 1130757
300 1250908 -235657 -714142 282765 1671133 2301490 1625408 537888 221651 1696319
291 1696319 1954001 -749131 -2229025 -347560 788473 365823 -493039 -1864543 -3265188
282 -3265188 -3604557 -2666953 -1132067 320826 2231819 3914065 2622581 -195868 -1273631
273 -1273631 163936 2195865 1713264 6933 618940 1175451 -993676 -2891074 -4329378 -6521254
263 -6521254 -4271971 1404180 3490552 464566 -3494844 -4871397 -2522598 151602 -297361
253 -1127399 -134521 342711 -903860 -1660880 -1054183 -362341 455042 998840 878599 1084846
243 1084846 388590 -255263 307487 1670377 2588519 1307777 -615968 -564371 93187 -1289253
232 -2734471 -1427083 451792 698722 -1231178 -3376346 -2868273 268162 3276021 3865190
223 3865190 3119307 3291321 4256092 3811843 698796 -2055155 -2610534 -1071173 952146
213 -147053 -3741729 -4458687 -1497497 -40847 -1221295 -1400723 -143439 -93299 -598802 -1406016
203 -1406016 -1336174 847278 1007544 -1796595 -2689258 -234708 935943 526634 789674 952776
193 952776 1200324 1761870 935113 -88747 827817 211125 -1912426 -481545 1745443 216940
182 -3356020 -2598512 -150143 1194594 593035 127490 -1002984 -3063826 -4984932 -5544208
173 -5544208 -3405794 -314285 -511362 -1284555 1208491 3415340 2414935 193919 254844
164 254844 1637180 2804937 3282733 2465285 1283785 1054358 632346 -329561 -664801
155 -664801 -423767 449698 -165746 -1535538 -2694838 -2551596 923837 5787169 6427491
146 6427491 3115443 653768 -140125 -95681 -292959 -1413464 -2397401 -1241741 608605
136 270862 -1575794 -2495356 -1730215 -970197 -820429 -1235937 -1885329 -2612684 -2580052 -707027
125 1337298 1827776 1380786 349658 -1038637 -2856000 -3542500 -2141075 166106 1376773
116 1376773 822596 -505304 -257837 1403533 2547394 600340 -547552 -224091 29615 520753
106 520753 1591515 1669353 2303189 4428205 3522125 680742 76134 -184563 -2025536 -2223082
96 -2223082 1154943 5343685 4763274 -506613 -3303551 -1376451 1293923 2189434 1519429
87 1519429 983993 1864117 2683777 1560283 443687 -134575 -1206045 -1409512 1249504
77 3198303 2728347 1470754 608146 559605 1286294 1149110 422226 170407 -408216 371469
66 2255507 2071491 -307758 -1647759 205713 2982136 3490620 2936715 2156553 217810 -504525
55 -339374 -1150482 -974836 362007 128420 -593941 -868573 -1324897 -1839942 -912156 765369
44 1660049 298259 -1331960 -1136420 -890551 -546740 779796 -418226 -2311131 -1323156 -133160
33 -1496222 -3107295 -1975594 560015 1322016 241284 152508 389297 829463 2153634 3077259
23 3077259 1547281 -125625 131152 361171 -179606 -1136696 -2722882 -3372638 -2393142 -641277
12 62536 -670981 240304 888782 345415 -807695 -844061 -49667 700522 508927 -165420 -335712
1 -335712 354897
##PAGE= F1=10154.88341713
##FIRST=     18110.137220953, 5591.54909048506, 272287
##DATA TABLE= (F2++(Y..Y)), PROFILE
1023 272287 -392699 -562196 435203 1301278 1201423 -374939 -1959834 -3199991 -3799041 -3488747
1013 -3488747 -1650515 410653 1494235 2189874 1496211 -1030266 -2774963 -2845966 -2824027
1004 -2824027 -3400319 -1848629 287998 -1149459 -4559224 -5181303 -2934729 -2715524 -3388399
995 -3388399 -2493894 -1158471 359769 2369807 2431115 1296858 570766 -613657 -650685 1592907
984 3242940 1951547 761075 -39061 -251312 2086949 4112570 2893902 1269060 2254566
975 2254566 2239130 333991 -1206661 -1178704 -157975 47592 -514585 132252 1951196 2789912
965 2789912 2141045 351898 -970245 718141 1598449 -998997 -3204180 -1417559 -114783
955 -648809 -987475 -1288579 -489974 1508201 1096806 -2177669 -3665206 -1778927 -273399
945 -138711 22115 1402758 2701189 2279267 261361 -1316016 -999235 92348 462829 895296
935 895296 1344973 862719 -17640 -79384 -398212 -1435359 -1508362 -271938 287571 -217679
924 -942298 -786406 228696 438953 45335 -242936 -382993 323145 873071 696770 1022805
914 1022805 1373135 916452 660287 -169741 -2281608 -2966116 -2332499 -2882701 -1895793 2001831
903 3788979 2255726 1015470 62110 -2130644 -2686189 -1916331 -2174534 -1563479 1471969
893 2978642 2538333 638912 716597 1993250 1789671 790972 938968 1639272 1622381 1460611
883 1460611 2616657 3473396 1802459 959080 2242304 2043029 2597 268706 1901826
874 1901826 2994147 3065408 2938750 3193634 3061949 2095793 182963 -1225359 -1656695 -791552
863 226692 -151452 -862020 -784904 -229786 1010467 2238107 3447560 3610829 2618594 1746203
853 1746203 1371718 640512 -787149 -369086 689523 -1335570 -3164001 -1612539 -76850
843 864953 1906756 893557 -388545 768988 833977 -835050 -1039832 395617 1303309 1969865
833 1969865 990204 -1030647 -820025 141856 -121012 -404080 208335 41746 -1388123 -1910671
823 -1910671 -551463 419296 -812753 -3214059 -4859293 -2718711 99868 -523382 -2659187
814 -2659187 -1623187 1302533 1065107 -417873 -145369 69020 -896096 -823034 1159784 1550203
804 1550203 -172643 -1455685 -1078209 1055981 1937924 -30447 -1085412 -679794 -332272
794 1082545 2706217 2127172 15167 -1273332 -2067919 -2515337 -2089076 -1526854 -1512665 -743858
783 154771 539275 1928376 2591248 2263520 884573 -220059 -44025 68533 590653 1958691
773 1958691 2119824 682902 528195 434491 -669931 -46198 2389869 2204471 -493108 -2204829
763 -2204829 -1249417 264842 177485 26276 439016 1139441 1238133 633850 695281 648527 -1234054
751 -2426255 -1802850 -1131543 -239652 -195785 -819810 -362752 1189787 1182858 -408971 -2008389
741 -2008389 -2659192 -1987211 -1244235 -797554 680881 2168620 1803855 978608 886389 505965
731 505965 -180078 -187451 -435270 -423076 71140 510653 439973 982442 1493267 1437793 -72007
719 -2312963 -2949995 -1668466 -102583 63547 -2683306 -5369073 -5366240 -1899580 1959070
709 2557207 1575441 777668 -1428701 -3976866 -4576691 -3552585 -2682364 -1916516 -1437015
700 -1437015 -1439851 -1774570 -729733 1003973 1251423 -345896 -2005984 -1446610 -233049 -1842347
690 -1842347 -3849849 -1234144 1865549 1866245 178504 -2200040 -4013402 -2680983 -2032346
681 -2032346 -1508595 113093 912594 807015 404535 103387 -546500 -687493 -1135972 -3858130
671 -3858130 -5370787 -2190434 1476230 2178406 1913305 984294 -939844 -1606776 -1401392
662 -1401392 -2000187 -1779297 -2173534 -2687436 -821062 1000771 276183 -714941 -798536 -944473
652 -944473 -2129829 -3478749 -2852268 -1547887 -1482501 -1978963 -2201784 -2518760 -2389255 -2119557
642 -2119557 -2864771 -3550918 -3192497 -3818752 -4556871 -3191200 -2196237 -2985443 -4664489
633 -4664489 -4953132 -4870852 -4453728 -4334524 -4025062 -4264390 -5286075 -6943522 -7270681 -4817631
623 -4817631 -1844618 -1827369 -3317973 -3896901 -4901549 -7345898 -8362953 -5923029 -4050278
614 -4050278 -3328558 -4177288 -6509993 -9178565 -10199398 -10699596 -12632924 -13969534 -18363152
605 -18363152 -23089976 -28712917 -33932836 -40522696 -153399790 -328322564 -272552442 -39665167
596 55946843 34035602 29568840 25477724 18239112 16048643 14170628 12860296 11799699
588 11799699 10086486 7604414 5328039 4012773 5292381 6065550 3679601 3057859 3946305
579 3946305 4458660 5495141 6130096 5711319 5198213 4754313 3585584 2523270 3021276
570 3021276 3313245 3064841 2576595 2361761 3056288 3395821 2058879 425605 287086 2658683
560 2658683 4506958 3291834 1027059 173180 -32572 1853785 5130253 4710383 1546535
550 -72781 1872853 4508438 4022590 3329937 4063714 3564370 2182230 1075572 -404393
540 -403134 662758 1595371 1726971 1654681 1925732 3144955 3830764 3685201 2841002 2156895
530 2156895 490883 -748859 1423243 2633802 1112298 227501 800522 609011 1627152
521 1627152 4208364 5200917 4104016 2965732 1935326 1896870 804606 -282320 -1107404
512 -1107404 -1755826 -724862 2025286 2855571 2236768 2772984 2593985 433926 -2582383
502 -2464442 798823 2415113 1039940 -1799410 -2558478 -2219376 -1925692 -518822 1781266
492 2101861 905053 360656 1546303 4057928 5660866 3709847 2693439 2647594 742440
482 -174312 1505407 1338451 -294460 247382 1735240 2679067 957404 -1608660 -2337687
473 -2337687 -2691430 -2265909 -393842 1146542 1197039 1259600 2788655 3009310 1769052 -617496
462 -2557069 -2672923 -2007571 -2125894 -2785976 -1548776 1265930 2434720 1531712 1067712
453 1067712 1796049 202150 -2462720 -3683187 -2552377 -2266810 -3074826 -1847995 314765
443 1106100 260929 -718017 353105 2944742 4534801 3546399 3047699 3049265 3047527 3016577
433 3016577 1615074 -395188 -392518 1913597 2171132 1492570 1263914 78381 -1375153 -2230330
423 -2230330 -2870269 -2694613 -2606983 -1661246 338494 2328548 2199867 1206123 1076662 758497
413 758497 345169 703038 1446152 2185192 2017928 428490 -1642093 -1910421 -938494 -754385
403 -754385 -547221 452230 1022590 1705600 1568952 438773 652907 955994 -865170 -2229173
393 -2229173 -173101 2269654 1736035 -894962 -1301710 -265907 1016512 1061707 -329483 -696206
383 -696206 242686 -16888 -1635932 -2601605 -3030047 -2202424 -1412559 -1675135 -2589364 -3866490
373 -3866490 -2944282 -222640 179467 -2039855 -2322550 -1299518 -297534 -163153 -957198
364 -957198 -1658642 -986754 -291606 -339464 -889913 -1261978 -1654179 -1701836 -570224 792335
353 390732 205802 871290 443897 -1013007 -1142642 -464540 -304707 -608857 -539110 1021911
342 1766006 -36630 -105805 1345794 651498 -633297 -971391 -281588 615213 155387 -697970
331 -1136275 -1272915 31304 2198907 1976754 795549 1746601 1769356 440186 -16406 597299
320 -42360 -2178450 -4265701 -4339736 -1559429 1773485 1939867 -657769 -2565670 -3048474
311 -3048474 -3212546 -2293945 -1353617 -503460 269667 735794 512228 77350 205441 1691156
301 1691156 2141682 780747 604824 1421020 2101127 2281981 766348 -990084 -505088 2113447
290 2460866 -752746 -1653980 756541 1722270 1031818 434656 -1520408 -3536074 -3619052 -2577688
280 -2577688 -1406003 45401 2310314 4090050 2573393 -139017 -1064116 533881 2379380
271 2379380 1558070 -71756 315365 251564 -1910740 -2988150 -3657675 -5580018 -3722081
262 -3722081 1166705 2797421 157000 -3536344 -4916628 -2367323 790378 675569 -247014
252 535176 776302 -334182 -1294541 -1406178 -1022101 -58779 -92317 -525338 -176571 -333147
242 -333147 -538030 121160 1023839 1343129 266478 -840884 51187 1275409 -177836 -1946521
232 -1946521 -853590 856355 852189 -1450346 -3987144 -3806656 -436851 3205607 4239274
223 4239274 2845868 2612911 4033727 3971704 1115626 -1375759 -1732394 -868221 168884
213 -880043 -2941435 -2716958 -476777 -60879 -1376321 -1664618 -565513 -566989 -1413428 -1724830
203 -1724830 -1414900 628239 920919 -1682989 -2593215 -221221 685303 -498686 181570 1722356
193 1722356 2315837 2193458 1207812 232304 711715 71868 -1893617 -792460 1556313 1149837
183 1149837 -1654889 -2015343 -899350 285902 253315 91347 -832401 -2827578 -4584753 -4758253
173 -4758253 -2237726 180693 -978497 -1858102 1211266 4077292 2772480 311569 314807
164 314807 1778280 3337825 4011405 3102867 1382091 1077107 787361 593828 621550 29646
153 -364063 -1796862 -3069918 -3438244 -2462725 848956 5557183 6347268 2893957 77488
143 -771261 -544267 -666004 -1461796 -2124068 -984906 987353 784806 -1047076 -2184192 -950438
132 174745 -140485 -1120675 -2416243 -3856884 -3940130 -1582409 1243339 1813423 1138321
123 1138321 248246 -1457070 -3610886 -3662801 -1676115 583477 1508308 920354 -336909
113 -247170 734597 1414709 11330 -24296 1586389 1921252 1521229 1649361 1616910 2741826
103 2741826 5310957 4486347 1153113 638543 648389 -1425664 -2339816 758706 4918986
94 4918986 4561190 -515503 -3310517 -1169068 1778218 2825520 2394149 1663085 1980481
85 1980481 2498826 1456338 274639 -165891 -863412 -379093 2417054 3894532 3065906
76 3065906 2182370 1851560 1556025 1756369 1284423 312127 84844 -352028 -300909 708580
65 504324 -917989 -1655103 -119647 2404824 3252420 3483895 3060377 1001228 83266 -286407
54 -1538671 -1908562 -277232 525812 347207 -438361 -1587296 -2085647 -606112 1531700 2344307
44 2344307 1046202 -713802 -1042814 -868604 141561 1641835 -220272 -2951949 -2428549
35 -2428549 -1376656 -2370810 -3616963 -2246514 198552 496790 -610255 -673352 -310802 366055
24 1656626 2742439 1480840 -145199 -79019 193898 98965 -447111 -2157501 -2681545 -1115034
13 395065 328986 -683456 1287180 3054088 967388 -1259468 -1094101 -247402 225182 -145679
2 -937387 -877726 -21389
##PAGE= F1=10133.26587962
##FIRST=     18110.137220953, 5591.54909048506, 151975
##DATA TABLE= (F2++(Y..Y)), PROFILE
1023 151975 -145993 -111626 573255 1182946 1464100 84802 -1784255 -2976731 -3116064 -2610369
1013 -2610369 -783019 1330041 2735744 3194068 2096047 -413659 -1648515 -1993274 -2457809
1004 -2457809 -2917840 -1023609 831500 -614548 -3309564 -3927220 -2381675 -2327219 -3289352
995 -3289352 -2663697 -1649739 -449973 1480738 1576690 1112353 1292803 -14698 -762589 1235523
984 2673494 1517803 1051095 526071 68777 2361901 4538539 2587926 346713 1584480
975 1584480 2001225 73768 -1073113 -701470 -33436 -185474 -683066 144951 2088676 2890660
965 2890660 2295244 556685 -960514 550309 1610071 -972877 -3230660 -1648434 -238543
955 -685137 -718798 -1949076 -2076609 -129452 -240291 -3015741 -3622382 -1200661 116288 174144
945 174144 574749 1595261 2465663 2102603 57267 -1556334 -1194059 -462776 -311664 299431
934 1015643 899595 287444 -72530 -922571 -1741157 -1153344 150350 225077 -534901 -1289544
924 -1289544 -1016579 -310501 -396033 -136204 -345857 -1022627 173957 1536972 1584790 1890288
914 1890288 2132231 1388631 990501 18937 -1720378 -1510577 -823408 -1993600 -1061419 2764822
903 4013203 3042766 2730705 1485126 -1205632 -1772083 -1005037 -1091391 191292 3671308
894 3671308 4483718 3740404 1400232 1069457 1801419 1918735 1433797 970805 1190106 1375706
884 1375706 873762 1651593 3121482 1974929 734190 1554707 2062845 408107 -20880 765288
873 1900002 2518016 2644494 2891137 3195293 2284151 4154 -1838328 -1856682 -358875 481703
862 -413547 -863211 -229366 427105 1291267 1792976 2749096 3539197 3014813 1857027 872144
851 -193422 -1410910 -416285 1514902 232408 -2399155 -2211466 -456852 1273616 2533328
842 2533328 1520766 468669 1728074 1362273 -986087 -1192985 525697 1109490 1372848
833 1372848 343619 -1233971 -311967 1209003 947199 86603 43984 -39703 -695584 -851828
823 -851828 -374171 -365364 -1515934 -3276044 -4682593 -3347510 -1479273 -2180328 -3384788
814 -3384788 -1479026 1902152 1463896 -624611 -424858 164719 -1088978 -1304177 900522
804 1502054 -224404 -1379425 -1005235 1179116 2284087 623566 -144115 267229 252942
795 252942 1170901 2104577 1036823 -635771 -1360851 -2169694 -2619672 -1803360 -990333 -1383722
785 -1383722 -1508396 -1165923 52744 2172452 2216318 1321783 74028 -349013 492202 1126621
775 1126621 1126451 1737713 1736082 369713 -264198 -863539 -1465659 -355212 2340705 2215434
765 2215434 -1179141 -3311645 -1967889 -137402 -210766 -138180 403797 364869 -65026 -398846
755 -398846 -290066 -564797 -1715360 -1586976 -444014 -3980 240215 -167159 -552796 337639
744 1748442 993925 -946585 -2317656 -2759998 -2201958 -1685951 -1230057 108433 1922442
735 1922442 2099118 1394186 1465875 673165 -738377 -503818 -34464 -488912 -923701 -467936
725 -467936 156647 978674 1378271 1392020 209628 -2312510 -3264533 -1717932 337537 1064501
715 1064501 -1197598 -4120305 -4993524 -1784309 2379770 2822274 1148935 -336320 -2246806
706 -2246806 -3838856 -3830836 -2966992 -2612381 -2262562 -1582920 -970371 -996439 -255552 609514
695 717451 230216 -216438 -32076 73086 -1915619 -3537654 -1236602 1275098 995458 -86979
684 -1627224 -2953301 -2138254 -2178063 -1767697 145188 1243538 1071049 467777 620138 364912
674 364912 -421712 -1316908 -4054544 -5476458 -2188666 1456349 1694103 905247 478952
665 478952 -409853 -424924 -79939 -1078866 -1521720 -2308181 -2802264 -1064883 818065 495178
655 495178 -552944 -485755 120492 -284167 -1725956 -1942034 -782415 -684468 -1778944 -2235611
645 -2235611 -2056644 -1001561 -202860 -807452 -2200323 -2377602 -2258174 -2347213 -1376060 -859998
635 -859998 -1554509 -3374774 -4208618 -4546631 -4075132 -3619692 -2875545 -2745233 -3630715 -4919793
625 -4919793 -4492342 -2007004 -317784 -1149921 -2803623 -3123625 -3330984 -4735984 -5821808
616 -5821808 -3989697 -2025066 -970089 -1359220 -3492247 -6627854 -8288574 -8131269 -8758914
607 -8758914 -9874945 -13128525 -15918666 -17459523 -20028113 -24442757 -92652245 -198322813
599 -198322813 -162848393 -23100007 34891339 19903230 18701122 19681143 14198291 12916221
591 12916221 11272794 9581105 9091427 7608739 4959290 2851013 2893975 4941097 5246095
582 5246095 1901355 299126 2347184 4182138 5428063 5861703 5406559 4568483 3735949
573 3735949 2887765 2138236 1676723 1713678 1557888 1334122 1090001 2170541 3301789 2209024
563 2209024 499183 605960 3283352 5013873 3298714 1029177 -104181 -1044462 799628
553 4525824 4223504 636097 -679143 1737765 3659627 2580338 2283535 3349171 3091803
544 3091803 1798903 601499 -781115 -862453 -206187 1452076 2967654 2789882 2497479
535 2497479 3713937 4535107 4252093 3821239 3006647 767954 -1213945 871818 2763633
526 2763633 1787840 829988 808454 958440 2566207 4293492 3982817 2757150 1851351
517 1851351 962496 1027532 492843 83150 -214887 -578016 853126 3201113 2919876 1272807
506 1283422 1593989 620339 -1145912 -884345 1267112 1653973 220750 -2033494 -2469043
497 -2469043 -2151046 -1912565 -421472 2258031 2686837 1227288 -230918 357418 2794588
488 2794588 4774990 2552506 1772744 2299645 520556 -892353 904488 1605346 639175
478 1101554 2278816 2817158 1008039 -1274669 -1953110 -2223700 -2122078 -824478 859994
468 1311730 1045698 2116801 2914981 2594620 769059 -1116184 -1943538 -2014198 -1793440 -2081109
458 -2081109 -1632601 595900 2058805 812733 -979864 -261124 -59535 -1359966 -2888406
449 -2888406 -2559849 -2283521 -2323958 -910206 475917 463307 35590 -203847 962434 2996093
439 2996093 4316006 3852405 3790941 3564380 3395174 3479496 2529792 435165 -522865 603608
428 707599 357332 340039 -335933 -706719 -1643994 -2457759 -2616149 -2493609 -1452908 544583
417 2201718 2295042 2050113 2168760 1266155 597445 1365453 2334387 2318190 1850989 1006138
407 1006138 -983657 -2196147 -1975556 -1520841 -782620 -48389 349893 2031078 2675086 1156676
396 314070 206119 -950693 -1822502 150096 2101000 1026734 -1636391 -2016319 -1118881
387 -1118881 669201 1574275 127653 -697194 148596 -682992 -2948912 -3348941 -3123016 -2069201
377 -2069201 -1362752 -1609760 -2403123 -3289289 -2432668 -500912 -871379 -2985633 -2390794 -807576
366 -41001 -32038 -388479 -433762 511711 655075 -435053 -1180911 -726113 -1011499 -1386926 235808
354 2128289 1167256 58184 492479 324969 -730571 -612543 222175 481095 -172080 -467646
344 -467646 988468 1554816 -611881 -702107 518146 25798 -198315 260752 390072 -229879
333 -1346964 -1514715 -944464 -577402 918728 2985591 2531396 1342563 1943732 1955871 622765
322 -278518 -37637 -581265 -2137724 -3507903 -3392145 -1065493 1578896 1940822 -359623
312 -2609927 -3513089 -3264438 -2213095 -1856889 -1623581 -826321 450080 874606 279647 228219
302 228219 1675444 2275162 1496866 1704565 2164455 2104060 1977680 24095 -2118487 -1207507
292 -1207507 2178521 2791022 -328385 -626759 2004790 2613518 1539306 1237508 -1048900
282 -3583631 -3392648 -2351641 -1702216 -108528 2432969 3759441 1829079 -390522 -802759
273 -802759 694628 2172249 1254440 -158447 -48053 -595101 -2475826 -2671969 -2663341 -4489814
263 -4489814 -3361151 453428 1666925 -5480 -2692748 -3777116 -1548121 1133125 1006501
254 1006501 216994 751066 796557 87880 -863961 -1402669 -1066397 -242379 -1061545 -1781641
244 -1781641 -1529733 -1357975 -859865 80950 384530 24998 -937307 -1206995 413000 2130967
234 2130967 725052 -1217997 -499478 872392 696873 -1409448 -3864326 -4138361 -1304211
224 2119805 3361615 1879481 1563299 3324881 3759916 1805119 91008 -569095 -978860
215 -978860 -1210488 -2035570 -2372090 -1369543 60405 -213234 -1428039 -1748043 -764415 -591577
205 -591577 -1694600 -1915834 -1565507 -96 252456 -1866090 -2359194 -12194 316432 -1834763
194 -869387 1918994 2795553 2234258 1360979 527575 289649 -501757 -1818321 -957998 1080918
183 1613063 158631 -849919 -913985 -418919 -328575 -642126 -1457653 -3047330 -4332405 -4026024
173 -4026024 -1101855 409231 -1689351 -2729481 894324 4497814 3261977 430119 -128721
163 1146162 3216693 4586311 3511124 1118931 468559 449781 1259124 1623277 130700
153 -1248006 -2764593 -3871968 -3637640 -2181602 635341 4412901 4885718 1726805 -1012375
143 -1688835 -1248913 -1373252 -1613597 -1595847 -542744 1196291 1007731 -766572 -1694868 -203494
132 979942 210968 -1049129 -2660970 -4552151 -4856237 -2397312 908728 1690380 815181
122 84157 -1678710 -3599829 -3169702 -1341349 255203 948238 681364 -182887 -284867 -180960
112 -180960 65959 -608071 231564 2631094 3145396 2261404 1797089 1462819 2809970 5212841
102 5212841 4111833 876020 925249 1408001 -554065 -2068830 199271 3592262 3518775 -518304
91 -2691465 -485039 2174476 3276704 2963945 1952293 1653099 1893715 1113381 3949 -348655
80 -574201 577785 3132063 4019313 2791100 2314914 2570449 2057851 1846612 1237766 281084
69 204732 35108 -542602 -634729 -891227 -1181788 -1278485 -157398 1922764 3060208 3959653
59 3959653 3588781 1304884 253162 -218948 -1504981 -2144666 -602849 992341 1443984 98487
48 -1735941 -2075309 -76502 1976337 2274547 1245783 158115 -268389 -164207 1264027 2422960
38 2422960 -91505 -3271708 -3367855 -2522904 -2571379 -2929827 -1878570 -434651 -850371 -1704848
28 -1704848 -1696915 -1031620 73629 1197817 2013591 786490 -457595 -355754 -64558 329826
17 293639 -1140507 -1360493 315752 1143103 510591 -454052 2230895 4714790 1499902
7 -1400499 -1189369 -448289 -257933 -889226 -1816440 -1363347 -310507
##PAGE= F1=10111.64834211
##FIRST=     18110.137220953, 5591.54909048506, -450098
##DATA TABLE= (F2++(Y..Y)), PROFILE
1023 -450098 -446553 -74924 412587 653483 1108112 11904 -1755639 -2530245 -2115275 -1486552
1013 -1486552 69136 1902514 3248335 3256506 1736953 -211350 -744933 -1195771 -1980136 -2352858
1003 -2352858 -306950 1187308 100548 -1555289 -2444470 -2132852 -2004611 -2931127 -2675617
994 -2675617 -2186071 -1405382 340499 541648 811927 1612336 86553 -1264936 550075 1927002
984 1927002 1198611 1308700 790423 79525 2350053 4615183 1970665 -797953 593575
974 1481863 -247252 -848639 -7569 290733 -250061 -846062 6313 1882785 2694097 2243681
964 2243681 816481 -742032 -1779 906356 -1251725 -3116891 -1817276 -386913 -618687 -584513
954 -584513 -2429021 -3402948 -1809805 -1734693 -3681537 -3144114 -252986 832906 723975 1105213
944 1105213 1622501 1878922 1567898 -138144 -1494316 -1229204 -969518 -1214023 -713750 95649
933 413315 467410 59081 -1199526 -1841563 -691129 549902 165509 -717089 -1159341 -619453
923 -619453 -307750 -755667 -92111 -431654 -1573779 161389 2223926 2198452 2092428 2125247
913 2125247 1186252 499349 -363867 -1185187 24568 542268 -928234 31673 3445879 3940215
903 3940215 3675167 4438885 3048499 -38609 -713860 -6518 21137 1556698 4772945 5326563
893 5326563 4422979 1837076 917615 706231 933040 1332471 675612 541794 1047783 95966
882 145789 2123759 1936066 612786 850431 2108479 1432238 249174 -126551 699058 1757370
872 1757370 2076424 2329410 2932893 2119290 -262160 -2214325 -1703075 100296 636022 -312140
861 -376602 605836 1275349 1559568 1209901 1947446 3400645 3193716 1679712 212301 -890205
850 -1725543 -156821 2590233 1999366 -1374071 -2532920 -454356 1882092 2977016 1925241
841 1925241 1341300 2638484 1732835 -1057305 -1296473 240727 634072 735113 -66102 -994804
831 -994804 548904 2434625 2039716 605798 -95722 -71541 146222 437959 -29055 -946334
821 -946334 -1825669 -2673624 -3997271 -4149054 -3552849 -3811670 -3395627 -654405 2574629 1915358
811 1915358 -177496 130428 608256 -1175013 -1628418 678727 1322619 -362709 -1248523 -1034911
801 -1034911 686585 1781636 990003 1010297 1308208 732482 1043380 1260184 -260359 -1336530
791 -1336530 -1266592 -1674465 -2020407 -1170723 -535715 -1256426 -1973860 -2006131 -99064 2151949
780 1100666 -604235 -1357972 -718774 710601 1774348 1138048 860694 861915 -56003 -955841
770 -955841 -2077585 -2214880 -617566 1813458 1459475 -2070170 -4194634 -2426056 -376635
760 -571338 -623500 -62979 -439744 -907543 -1164286 -1327159 -1672692 -1534113 -37069 1532371
749 1763437 1021175 -179477 -387469 1015982 2289673 896254 -1243107 -2307761 -2501714
740 -2501714 -1872993 -1452974 -1053853 -257230 1425422 1876829 1081460 1014750 196888 -1390919
729 -866603 315928 -351680 -1389873 -1131329 -155663 606459 615416 873703 362083 -2082343
718 -3205901 -1467318 649774 1572557 214094 -2543361 -4001058 -1144751 2848205 2913555
709 2913555 454391 -1387925 -2525334 -2942570 -2446784 -2106393 -2375327 -2388731 -1415598 -408374
698 -449166 -21248 208156 93175 531610 1235736 976993 52391 -2032366 -3197012 -1321138
687 323360 -252364 -461161 -956935 -1882344 -1721714 -2206989 -1953862 -49850 1321626 1250234
677 1250234 451327 932042 1194782 -159253 -1486047 -3928850 -5157022 -2233962 1061238
667 1177702 210615 256343 154094 520386 946846 -121359 -899018 -2047726 -2729812 -1551835
657 -1551835 67592 147633 -508682 108049 1386095 1468326 -38323 -867737 98160 366585
647 366585 -1236696 -2149464 -1447166 638771 2234475 1750807 -619257 -1274642 -114769 379306
636 301914 146720 -355413 -2077709 -3335997 -4087285 -3531392 -2787490 -1649186 -1003567
627 -1003567 -1603527 -2575003 -1452937 716701 1169676 -496533 -2032201 -1988751 -1492887 -1862877
617 -1862877 -2724129 -1731460 -136664 1264749 1755868 155321 -3070352 -5412779 -5333720
608 -5333720 -5114003 -5476317 -6681416 -6736804 -5514732 -5216127 -7605162 -33755558 -72042018
599 -72042018 -57413692 -5849022 15646019 7964802 6198066 8922935 7234721 7627843
591 7627843 6560190 4798337 4986593 4565333 2541013 596016 1381766 3601091 3603068
582 3603068 132057 -2053971 473047 3263224 4518968 4818754 4553009 3696834 2568566
573 2568566 1435234 564421 -570446 -580761 -697474 -290219 -394459 654267 2371188 1919080
563 1919080 367474 431212 2884300 4585291 2471317 -251498 -2191474 -3039510 -768804
553 3135786 3250778 -39979 -1140021 1231375 2442806 1061316 743586 1934464 2073745
544 2073745 1194109 120128 -1054071 -1366159 -1207102 1099789 3828989 3541271 2948885
535 2948885 4297974 4904088 3956790 3611755 2994057 793512 -1502759 300963 2650602
526 2650602 2203059 1150774 511284 1009098 3052763 3999950 2199389 977274 659265
517 659265 38948 -41884 71997 634873 953508 794400 2164988 3485367 2064740 -159748
506 -473935 371308 819707 694471 1006734 1480833 617768 -671589 -1954383 -2107220 -1969059
496 -1969059 -2010512 -586771 2211034 2714491 1238618 -632761 -803042 1402274 3694104
487 3694104 1640181 662190 1641554 174395 -1546537 185370 1478613 976296 1300166
478 1300166 2149707 2192532 678802 -1036374 -1822466 -2153205 -2164827 -1298422 406592 1276376
468 1276376 859819 1183286 2330383 2987960 1873020 216049 -1411877 -2255975 -1460953
459 -1460953 -1108093 -1568413 -394254 1279478 282901 -2092797 -1813579 -328394 -176196
450 -176196 -1798478 -2428220 -2447757 -2032831 -387622 463062 -129493 -285996 35515 1177140
440 1177140 2468524 3400024 3703011 4265805 4267952 3782047 3535323 2977325 1109772 -635923
429 -602742 -238330 -426998 -605471 -1080315 -740238 -1239578 -1759748 -1974275 -1784117 -969585
419 -969585 644336 1998638 2590875 3118390 3146694 1707619 810963 1605858 2728187 2142683
409 2142683 1316334 1200284 -360566 -2226602 -2713578 -2079338 -1026642 -493100 -251718
400 -251718 2148539 3306131 1538672 -66628 -374962 -728102 -1146723 370535 1736755
391 1736755 441956 -2091432 -2607042 -1806593 335626 1953236 378604 -990183 -36129 -964822
381 -964822 -3390184 -3244752 -2599327 -1555153 -873282 -933699 -1579881 -2273084 -1669882 -621026
370 -1645684 -3508702 -2117688 28983 617048 578844 691658 913754 1725863 1570698 -191780
359 -1153372 -239198 -508303 -924573 1223826 3295841 1662611 -59545 73958 -33083 -634317
349 -634317 -505735 327595 769616 -24360 -270029 1362080 1522739 -1043359 -1325582 -447582
338 -690148 -61342 1259899 972530 -1217070 -3125622 -2453712 -707151 309847 1620734
329 1620734 2974950 2359081 1499523 1836257 2109014 1025022 -311055 -564842 -1087812
320 -1087812 -2104600 -2556389 -2017923 -322484 1349924 1922004 131216 -2399938 -3571893
311 -3571893 -2598725 -1212303 -1477099 -2223697 -1754616 273255 1379168 483575 -7156 1219903
300 1803849 1814090 2438795 2468115 1778889 1588311 -227889 -2378749 -1517328 2027092 2953770
290 2953770 534850 669830 3172128 3273878 1697882 1518963 -624090 -3264860 -2815117
281 -2815117 -1878587 -1762325 61735 2795626 3311998 867188 -662470 -331822 830888 1833823
271 1833823 1113912 12244 -227591 -1130817 -2494229 -1843622 -1296922 -3127998 -2884297 -242900
260 699893 216344 -1115438 -1736379 -229476 1241999 787813 294972 527207 452815 355425
250 355425 -329127 -864366 -247685 156406 -1477043 -2416867 -2370657 -2137811 -909233 344608
239 40651 -834529 -1763135 -1463945 599718 2606150 1250917 -738153 -263913 803753 479910
229 479910 -1027165 -2931196 -3573476 -1805274 747312 1912225 803685 585749 2452421
220 2452421 3419123 2692377 1981652 637695 -1271517 -2649362 -3118383 -2097152 -681257
210 123327 -333086 -1332406 -1570912 -528864 -34833 -1163807 -1667469 -1504238 -650133 -666905
200 -666905 -2188774 -1883426 632365 246163 -2819955 -1874734 1736608 2937317 2261551
191 2261551 1618549 936162 -102519 -1142613 -1487502 -667699 734757 1842105 1837223 814707
180 69854 -271113 -505105 -1355390 -2187777 -3166351 -3891262 -3210315 -134046 433395 -2322101
169 -3418664 617821 4765515 4048622 889538 -578027 281807 2858552 5204585 4024814
160 4024814 1081088 -211533 -43437 1668168 2316464 247540 -1427625 -2419356 -3544569
151 -3544569 -3165772 -1724895 343725 2683102 2616984 164481 -2095912 -2433893 -1819252
142 -1819252 -1994537 -1584964 -677967 266939 1381794 1095134 -416141 -798471 513541 1357645
132 1357645 348412 -805131 -2321242 -4234136 -4772940 -2632413 641214 1602006 618263
122 95074 -1398407 -2696213 -2124545 -1070898 -464488 132136 364330 74592 -179159 -958287
112 -958287 -1027188 -939806 427885 2829947 3464680 2679586 2197817 1510356 2733243 4346632
102 4346632 2560841 -2633 918581 2050727 618898 -1223618 -163875 2072133 2240242
93 2240242 -384298 -1537663 557655 2486738 3537329 3185481 1887978 1138034 1207787
84 1207787 692640 -332044 -681204 -323000 1277685 3198184 3530765 2049749 1887540
75 1887540 2585153 1958393 1595116 1205919 469246 447307 460885 -460912 -1400257 -1508149
65 -1508149 -872933 -604100 26281 1452788 2748976 4048556 3494406 1122459 86111 -183322
54 -1211215 -1763023 -566215 1400859 2398629 741702 -1565670 -1853861 370568 1856552
45 1856552 1442349 848889 924711 770261 838439 2325546 2830835 -49470 -3160359 -3899607
35 -3899607 -3302962 -2165173 -1405318 -1152770 -1324350 -2358274 -2738469 -2546176 -1444014
26 -1444014 37969 732535 894930 -396337 -1108538 -855107 -525747 351110 762349 -235807
15 -124749 1224963 1210616 344699 -368897 2346689 4756573 1383427 -1486511 -1346951
6 -1346951 -918916 -1001611 -1853023 -2824022 -1989872 -802423
##PAGE= F1=10090.0308046
##FIRST=     18110.137220953, 5591.54909048506, -940972
##DATA TABLE= (F2++(Y..Y)), PROFILE
1023 -940972 -794935 -69331 352660 240545 677431 -141820 -1538757 -1705618 -815029 -195142
1012 883425 2239652 3255857 2869264 1055005 -145801 -43789 -316807 -1178949 -1607351
1003 -1607351 215630 1300284 800447 76254 -1315868 -2215427 -1711683 -2163589 -2264347
994 -2264347 -2373111 -2085018 -643195 -171228 742809 1715259 -33308 -1825479 -268892 1225558
983 1153911 1548848 734590 -228221 2023671 4223220 1261106 -1655684 -271599 904612
973 -463435 -612304 667424 857214 24677 -940970 -293669 1382687 2194586 1811340 746639
962 -620950 -767076 -241578 -1789256 -3050588 -1864200 -456187 -558306 -815727 -2659797
953 -2659797 -4015161 -2864650 -2697840 -3796820 -2294571 849817 1751845 1498996 1671930
944 1671930 1636792 1256009 995765 -230090 -1282976 -1253245 -1333883 -1883178 -1732350 -1168203
934 -1168203 -527213 425293 306417 -1145095 -1778890 -354543 788970 166636 -769661 -808665
924 -808665 18421 61992 -550839 179267 -453993 -1808135 312159 2626030 2151374 1403120
914 1403120 1279311 360008 -648962 -1217847 -782127 1295179 1398401 -103298 801466 3310907
904 3310907 3069991 3577467 5400484 4262726 1106312 261881 813125 820403 2123959
895 2123959 4570833 5378489 4355364 1706024 142330 -1063550 -839336 526281 80669
885 -205437 583011 -837579 -1638901 630741 1551642 389267 43369 1857393 2487160 805191
874 -650742 -395364 781718 1190654 1572786 2255567 1612226 -546105 -2216384 -1318013 304864
863 472980 -97655 229160 1258513 1822438 1491558 442056 1144630 3142568 2988875 1099942
852 -575768 -1364070 -1723909 211897 3481026 3400392 -442173 -2586772 -237706 2339427 2985584
842 2985584 2040704 2121654 3347691 1848124 -1141492 -1533643 -564357 -196067 -19289 -399072
832 -399072 -550341 1396378 3255128 2628752 795637 -362306 -114367 932576 1565163 301803
821 -1243956 -1640744 -1518736 -3129577 -5102219 -5659628 -5087764 -2909371 466450 3039570
812 3039570 2231162 812547 1388054 1208605 -1210375 -1736564 491369 881260 -681529 -1142123
802 -1142123 -1172429 -318398 627061 1064424 2004731 1996467 856387 665993 416792 -1257459
791 -1720674 -886896 -752418 -963425 -376073 -273035 -1142131 -1977702 -2219381 -169493 1651584
780 -461537 -2822089 -2800354 -1216840 558246 1933955 718673 -556043 -465162 -634282 -1536056
770 -1536056 -2963653 -2670987 -727214 915121 90249 -2943119 -4665479 -2559702 -386850
760 -837745 -1293727 -837281 -1126893 -1221380 -1581306 -2183266 -2294378 -766616 1566710 3321973
750 3321973 3465882 1757600 -302562 -373185 1483498 2649097 976871 -1110730 -1898690
741 -1898690 -1932622 -1070305 -455770 -234032 -327893 834180 1278720 116921 -445117 -867296
731 -867296 -2009851 -1221522 480468 -77749 -1296044 -1417158 -557786 -104594 -595684 -2120
720 351131 -1649743 -2800038 -996464 777803 1360404 838543 -1304259 -2675248 -103953
710 3166443 2557470 -552643 -2224369 -2298630 -1662625 -897790 -1100451 -1829098 -2069911 -887554
699 138081 -224343 -54568 -42520 -353665 565618 1961147 1335196 -280346 -2203744 -2959113
689 -2959113 -1435092 -734533 -1489313 -723856 -285410 -1180025 -1609888 -2075037 -1932239 -331246
678 1280220 1468645 474296 1032677 1732262 53224 -1596209 -3560710 -4594909 -2410461
669 -2410461 400305 825469 54667 411797 705038 1053139 1446154 704610 -1692 -1402739
659 -1402739 -2476692 -2145624 -977856 -621609 -617337 810402 2579452 2735647 1137443 -28642
648 569407 969715 -813434 -2047215 -714326 2290180 4664250 4155743 832712 -217925
638 1825062 2717223 1510629 768366 408479 -1062005 -2493094 -3609462 -3064222 -2159646
629 -2159646 -733009 432198 217567 -516888 900471 2453755 2220713 175187 -978219 -618058
619 -618058 303155 634204 53789 210595 1219315 2987566 4375153 3295160 314030
609 -2293687 -3043721 -2860396 -2162298 -1493654 -192611 1175790 3221781 2329300 -1314477
599 -3358541 -1491077 4071007 5605954 2109340 -2011996 -1603842 384843 2217004 1892793
590 1892793 405304 1083426 1936989 928945 -628581 7488 1726169 1782158 -1015095 -3096495
580 -3096495 -911110 2112433 3136603 3345143 3394591 2884247 1648324 -425800 -1963276
571 -1963276 -3049357 -2816260 -2911757 -1831704 -1629898 -893568 1035205 1400256 212173
561 14785 1790021 3347334 962227 -2940011 -6049886 -5567679 -2264360 1568752 2189262
552 2189262 -211850 -1161795 676753 1354380 62466 -539454 559184 983549 586251 -168595
541 -1093136 -1711823 -1931378 770549 4151493 3871543 3387160 4881772 4822700 2947235
532 2947235 2392393 2326999 726862 -1467749 -135750 2241992 2192945 1083264 57330 861308
522 861308 3120196 3630253 730890 -562425 -251053 -553707 -839668 -138133 1285737 1924510
512 1924510 1839623 2863641 2968161 717174 -1385609 -1625008 -583040 999465 2404137
503 2404137 2630414 1401827 -305401 -1252419 -1511630 -1459597 -1525122 -1983287 -878423 1674632
492 2278632 1084499 -691527 -1591437 169238 2608210 1183234 -94246 1038984 -143945
482 -1906671 -351453 1167698 853391 971676 1371726 946775 115066 -849388 -1869881
473 -1869881 -2290206 -1918138 -1264966 137639 1367084 1004616 451169 1537351 2985693
464 2985693 2540563 1104863 -1164574 -2548567 -1106223 12103 -1183765 -1188653 587185
454 248507 -1943593 -2266051 -343318 863584 -755212 -2336985 -2753109 -2183153 -366695 305441
443 -380973 -454186 25587 991885 1686647 2386005 3357108 4348265 4763024 3961368 3238089
433 3238089 3036614 1659794 -623144 -1364102 -530329 -682513 -1254288 -1851326 -1342577 -916871
423 -916871 -861877 -824718 -632125 -380396 563468 1735220 2813519 3799528 3577078 2008152
413 2008152 1095600 1611327 2698653 1772770 548927 951702 137969 -1857493 -2843087
404 -2843087 -2253149 -1135153 -563832 -343257 2232326 3461582 1568205 -405537 -687356
395 -687356 -220931 -177645 635638 1331310 80321 -2290809 -3066982 -2298883 -58482 1842188
384 99600 -1623887 -322624 -821391 -2855449 -2311852 -1564435 -801731 -23548 259801 -279264
373 -1038273 -790367 -472547 -1781712 -3241933 -1350769 1137956 1585575 1487868 1919598
364 1919598 1991982 2271933 1952638 4806 -972672 13774 -381698 -586993 2062362 3996442
354 3996442 1748279 -159918 -313606 -584194 -857758 -885467 -182000 428987 -197333 106931
343 2082945 1600047 -1301444 -1804468 -1229598 -1327380 -314693 1672051 1170153 -2237407
333 -4780571 -3321701 -568953 1059019 1953277 2370940 1776112 1342606 1609533 2276481
324 2276481 1490790 -214528 -973884 -1634258 -2304466 -1893044 -797570 300901 1045463 1813010
314 1813010 696127 -1936519 -3172956 -1520500 222851 -576859 -2421989 -2488073 40918
304 1608101 343265 -647687 417296 944887 1610116 2576148 2188695 1083243 1091375 -50544
293 -1836305 -1374555 1683784 2820540 1509508 1842545 3855246 3343049 1252653 948832
284 948832 -553204 -2724349 -2101068 -1346301 -1603948 388986 3190911 2899315 -24475 -912628
274 -912628 181318 877287 1382984 1111059 361865 -290285 -1433789 -2131739 -800736 92611
263 -1689084 -2224214 -724630 66939 588192 501911 322600 912579 939157 53056 -131996
252 -282944 -419525 179576 5960 -132279 954522 816938 -1410021 -2495953 -2652396 -2567004
242 -2567004 -804802 622158 -201642 -1301814 -2182161 -1736418 386597 2362296 943158
232 -977747 -364134 609461 111325 -727710 -1779139 -2510739 -1897600 -398563 499008 -136611
221 -331511 1350138 2794602 3254100 3440386 1376448 -1780895 -3856029 -3971464 -2385232
212 -2385232 -997600 -449343 -612295 -1355173 -1434702 -182974 634298 -260976 -1199403 -1403758
202 -1403758 -1335418 -1827139 -2844718 -1574994 1326857 357390 -3323495 -2762436 1094006
192 2723605 2188946 1730066 1157011 -572735 -1913254 -1226249 -193966 437010 1702143
183 1702143 2755990 2249909 1451321 584197 -232247 -1774828 -2697813 -3059773 -3368964
174 -3368964 -2572373 211257 -5801 -2931860 -3848370 274609 4519444 4653411 1447208 -953261
163 -645597 2271323 5486186 4413277 1247216 -802550 -654566 1559810 2391865 312789
153 -852929 -1073797 -2466356 -2439423 -1425447 -267144 565936 75745 -1466537 -3048424 -3038621
143 -3038621 -2343719 -2546356 -1544396 199075 1029712 1276926 858631 -81365 150712 788470
133 788470 982943 92379 -579920 -1664315 -3158234 -3796530 -2308987 345940 1296812 368367
122 102044 -884811 -1476810 -1033563 -967548 -1313880 -724550 -96804 145498 -126206 -1582416
112 -1582416 -1825548 -1080979 494851 2134094 2672038 2543468 2596978 1660918 2448796 2894962
102 2894962 216810 -1371604 440657 2271120 1672514 -164193 -363319 789411 1123102
93 1123102 -216228 -302838 1507702 2512587 3421647 2951603 1486659 608996 621657 174994
82 -883260 -1273481 -237285 1467619 2472661 2413907 970242 961305 1875670 1289903 1030466
72 1030466 1229371 825287 576260 516530 -374145 -1497672 -1122391 -19437 223124 323621
62 323621 888692 2118295 3514490 2751852 627520 -207712 -199740 -821371 -1000710 -219687
51 1682720 3055961 1558509 -902618 -1452355 544542 1224180 186023 116331 1397148 1736260
41 1736260 1836035 3028903 2886752 107192 -2486410 -3718854 -3396108 -1257226 534382
31 -171034 -2040346 -3345539 -3139242 -2615142 -1068039 525857 484196 -186147 -1391057 -1585597
21 -1585597 -1228478 -836934 463599 1164671 515902 835358 1594819 865349 131326 -245737
10 1797475 3347662 813717 -1251785 -1197279 -1258181 -1554941 -2418866 -3226172 -2189372 -1039852
##PAGE= F1=10068.41326709
##FIRST=     18110.137220953, 5591.54909048506, -1269329
##DATA TABLE= (F2++(Y..Y)), PROFILE
1023 -1269329 -1167939 -187094 278638 -53759 273105 -322291 -1247769 -861698 270866 751242
1013 751242 1296814 2158721 2788329 2291988 457194 -239752 238147 436524 -248423 -905331
1003 -905331 293010 938354 1021532 888553 -970857 -2565349 -1508872 -1134120 -1453681 -2053760
993 -2053760 -2243524 -1201936 -319479 990206 1674546 -206155 -2214104 -1042485 717562
983 1356224 1685431 354227 -801929 1417326 3349796 661609 -1825888 -606498 494396
973 -492028 -451104 1127791 1657623 711838 -891189 -670973 758926 1520067 1072962 262426
962 -715288 -1372123 -1336861 -2317278 -2984950 -1645409 -238822 -399893 -1185542 -2402671 -3523213
952 -3523213 -2759565 -2590468 -3053470 -1059643 2011272 2771157 2508034 2468517 1941206 1096717
942 1096717 903611 26717 -905796 -1136173 -1234847 -1794611 -2114382 -2200640 -1530152 284442
931 789213 -598883 -1424948 -75189 1051600 486567 -549884 -381222 658833 758434 347540
920 845507 -145719 -1379685 817637 2762438 1587868 261320 133804 -530414 -1731199
911 -1731199 -1928593 -245204 2335935 1851041 462042 1132253 2287327 1483267 2694539
902 2694539 5385394 4956886 2220743 1297277 1603911 1434478 2096332 3509571 4694440
893 4694440 3719907 1232211 -816108 -2666810 -2431253 -374012 -393054 -647514 234103 -1514549
882 -2990262 -727920 1087444 210914 -595814 1397163 3204382 1519414 -557889 -890575
873 -890575 36672 415288 1056632 1621206 1215839 -454471 -1516227 -552771 418168 238640
863 238640 268062 876923 1702626 2056630 1234796 -154231 733117 3001358 2657449 493894
852 -1066472 -1281767 -1165695 786094 4088690 4301730 468134 -2043335 331936 2637929
843 2637929 2717682 2158696 2960806 3988827 1993288 -951344 -1612369 -1360559 -943235 -597191
833 -597191 -543910 96106 2197298 3575965 2676547 733684 -533231 82208 1779998 2545163
823 2545163 813883 -895367 -634287 260794 -2019188 -5629262 -6921736 -5482787 -2004664
813 1633914 3303424 2502776 2236334 3131963 1977594 -945468 -1314157 629862 484065
804 484065 -841739 -814233 -1134046 -1295903 -490706 1233835 2858342 2320108 768240 344918
793 16726 -1359445 -1273760 34440 510752 396953 582843 18508 -784267 -1308126 -1686926
783 -1686926 -196367 871792 -1744614 -4141359 -3337073 -1417866 345551 1840272 206235
773 -1999931 -1765573 -1058640 -1746335 -3137201 -2405796 -362509 113880 -1274161 -3312919
764 -3312919 -4391763 -2163488 -299 -807367 -1733886 -1448639 -1381293 -905954 -1420798 -2388702
754 -2388702 -1942309 567312 2783816 4308918 4537300 2295514 -370052 -311906 1795168
744 2876789 1418315 -308407 -938235 -1020724 136617 1283740 1222686 69264 542719 793018
734 793018 -960941 -2236496 -2008186 -2295988 -1350531 565440 379631 -704899 -1303450 -958943
724 -958943 -877639 -1771641 -905417 301158 -969938 -2016495 -307749 853595 644243 465575
714 465575 -760024 -1323185 1118405 3236655 1699492 -1716604 -2686224 -1672137 -392607
704 404980 -15914 -882260 -1205998 -35602 619943 -202599 -143247 35343 -400702 460544 1902006
693 1902006 1126021 -693018 -2302276 -2752618 -1437511 -1585223 -2334983 -671642 376660
683 -939801 -1748936 -1703330 -1558409 -498266 1256138 1781034 600444 961387 1869923 224304
672 -1553816 -3021917 -3915422 -2635637 -292539 739431 414562 879370 1198525 1168660 1426368
662 1426368 1297385 960738 -534534 -2106408 -2701029 -2007376 -1531178 -846672 1380714
652 3383117 3273728 1584782 302747 286598 606735 -904926 -2003073 77786 3703635 6488724
642 6488724 5751665 1806578 439843 2831594 3880006 2080806 1089314 726249 -491112
632 -1831728 -3261075 -2909579 -1972121 -405748 1072530 1265197 757797 1940356 2758409
623 2758409 2524478 818974 240609 725663 1686216 2260785 1767287 1292274 1853114 3935530
613 3935530 5712325 4812404 2382566 184107 -1663178 -2120885 -346465 1271248 1724157
604 1724157 1710873 4189114 4541985 6412172 11289825 8776299 5691839 3322791 816352
594 -4301712 -7125604 -3745213 -1608755 -1292412 -2319706 -1501840 87047 -52762 -827380
585 -827380 -926761 -228753 167377 -1443895 -2772540 -1436095 996701 1600672 1768459 2169664
575 2169664 2307682 1171184 -2240338 -4863816 -5147859 -4388104 -4439423 -3016223 -2489269
566 -2489269 -2114841 -351534 757918 135960 -334811 529142 1600694 -1007641 -6632983
557 -6632983 -10695048 -7955232 -3238965 298245 1272948 23729 -785189 207978 599836
548 599836 -245334 -1130318 -331735 66568 -11405 -291683 -1004441 -1946955 -2273120 524912
537 3813902 3674204 3642581 5129889 4105863 1437283 549084 1219163 563578 -1238223
527 -492322 1421087 1545878 447198 -576089 489862 2752561 3189502 -45869 -1613401 -897383
517 -897383 -889630 -1228750 -102579 1718950 2127275 2030101 2727720 1855740 -780591 -2133115
507 -2133115 -1806438 -1026400 955063 3257107 3249837 889761 -965006 -1387740 -885595 -725222
497 -725222 -924386 -1788965 -1244929 717009 1421040 777269 -509163 -1939012 -875746 1427777
486 988702 -283424 611885 -498913 -2045181 -694611 739337 411545 256957 20087 -717480
475 -626866 -807701 -2054528 -2377995 -1041018 -473006 157997 1597213 1474991 147664
465 683590 2516295 2569594 1250958 -1288341 -2782658 -795699 998809 -568757 -1519852
456 -1519852 222425 588141 -949526 -1681382 -121790 1433057 -188914 -2555252 -3318051
447 -3318051 -2718489 -852835 -47900 -321411 -469080 -276541 404108 904059 1741509 2984615
437 2984615 3861400 4484274 3538699 2545527 2705411 1972128 -537223 -1627098 -420459 -583083
427 -583083 -1561728 -2444675 -2156739 -716672 -53573 498205 573491 4141 151989 1306700
417 1306700 2671559 3608035 3165807 2017530 1373189 1463463 2283085 1234217 -361756
407 227703 325238 -1210394 -2358988 -2062756 -1090444 -210377 144898 2293363 3181086 1264080
396 -733925 -831037 336757 849214 936199 925237 -224199 -2542674 -3527475 -2711384 -666499
385 951173 -915098 -2567550 -764501 -492806 -1751733 -980638 -354778 -35113 942444 1623491
375 1623491 1116367 100070 -44259 -199519 -1294409 -2175189 -174435 2265240 2574144 2335946
365 2335946 2815788 2455417 1964912 1433592 -252567 -891899 -99798 -740445 -594199 2410709
354 3980964 1380599 -267370 -602962 -1194192 -1341093 -1513919 -1046968 -431306 -623430 586238
343 2837056 1617508 -1421705 -2021452 -1602535 -1750824 -915846 1313373 836190 -3105649
333 -5852449 -3862803 -544547 1456953 1883050 1604429 1275903 1128427 1509687 2500582
324 2500582 1887675 -44360 -1171397 -2106709 -2742509 -1785438 -180019 540766 713436 1668636
314 1668636 1273838 -1200397 -2319475 -375246 1570659 447920 -2319602 -2964641 -323814
304 1301834 -299270 -1611850 -482876 89641 1043265 2151463 1413283 156900 565849 391947
294 391947 -746035 -740355 1370777 2498506 2374733 2726254 3910322 2744267 313369 -253826
283 -804984 -2021387 -1378689 -820872 -1169905 764016 3450144 2712208 -494359 -983655 685256
272 931944 993804 1284199 886232 -173022 -1427983 -1444638 261535 1275337 -251888 -1223830
262 -1223830 -747908 -111041 948762 1654702 1721614 1423349 330310 -788090 -817221 -1437739
252 -1437739 -1638520 -418336 84129 555973 2036787 1494657 -883149 -2066456 -2385149 -2505288
242 -2505288 -530500 822967 -371789 -1412955 -2126812 -1918222 -129881 1442195 -202972
232 -1906921 -679600 474663 -237148 -677475 -830344 -1281211 -1468335 -718438 -104697 -591233
222 -591233 -1072824 170380 1982927 3320510 4059730 1605172 -2142985 -4316382 -4241294
213 -4241294 -3001152 -2011320 -1320461 -877604 -1296016 -1219999 194784 1176665 671950 -571671
202 -1210469 -1828006 -2891293 -3647767 -1546213 1834956 670065 -3148082 -3244348 305192
192 2436336 2146107 1735086 1238082 -950960 -2610526 -1106747 349691 294469 1368337
183 1368337 2817971 3035307 2691743 1908534 546735 -1562945 -2539279 -2447783 -2637609 -2047596
173 -2047596 134 -700403 -3242222 -3719481 6926 3780937 4810956 2017038 -981705 -1264129
163 -1264129 1677803 5310266 4629586 1649187 -972110 -1016417 1162914 2019200 472684
153 385367 802351 -955584 -1589834 -1199558 -995394 -1330583 -1892515 -2578079 -3533766 -3341473
143 -3341473 -2684310 -2828266 -1418877 845622 1539851 942959 469544 372608 991620 603895
133 603895 46229 -359619 -302407 -816335 -1609946 -2095977 -1420528 139935 824826 155100
122 141376 -332360 -406821 -87671 -741790 -1699772 -1157272 -510587 -14878 -121268 -1893800
112 -1893800 -2212362 -1008118 581874 1018007 1176198 2029072 2925688 1930721 2089966 1374913
102 1374913 -2017593 -2746113 -322443 2045613 2309545 763314 -386032 100951 568948
93 568948 66709 736955 2127764 2291038 2988534 2452947 1059361 392067 381832 -315849
82 -1584627 -1961685 -242587 1198792 1200311 969687 -125096 -133076 838103 459194 421882 1393926
71 1393926 1317063 488831 43280 -478716 -996042 121256 1198408 1138619 741865 302711
60 1160543 2400213 1620763 124162 -377980 -246356 -438536 -137753 314211 1845929 3434548
50 3434548 2587058 248319 -959834 339210 273080 -1064298 -618098 1488214 2336231 2537234
40 2537234 3191518 2668250 447483 -1411825 -2857631 -2839789 -232062 2255371 837586 -2260780
29 -3452653 -2695224 -1745151 101280 1451817 433171 -996219 -1780833 -1568349 -1298344 -872219
19 -872219 735860 1546362 994900 1310501 1442724 283350 -58975 -94751 878807 1150114
9 1150114 -68794 -771393 -715307 -1358757 -1769393 -2334589 -2746248 -1777636 -929548
0 -929548
##PAGE= F1=10046.79572958
##FIRST=     18110.137220953, 5591.54909048506, -1231675
##DATA TABLE= (F2++(Y..Y)), PROFILE
1023 -1231675 -1334198 -285918 265538 -113538 123199 -303620 -830844 -185507 857700 1111132
1013 1111132 1231234 1712901 2081663 1813388 260319 -434922 97084 933007 602111 -393630
1002 -72399 84654 485951 630965 -1330337 -2913500 -1357947 -78308 -432259 -1282443 -1812776
992 -1812776 -1192696 80092 1412363 1468375 -405325 -2371180 -1659872 400891 1563794 1512948
982 1512948 -395986 -1618149 529824 2031490 182531 -1313886 -372389 212608 -561027
972 -617560 1105691 2398343 1511135 -864903 -1193960 -7150 603381 27973 -638452 -1128261
962 -1128261 -1694354 -2175198 -2801512 -3023966 -1370684 112056 -238883 -1504592 -1757078
953 -1757078 -2190251 -1747903 -1676089 -1782935 178442 2801625 3363039 3257179 3167238 2313718
943 2313718 1341896 1246751 398334 -691391 -1038559 -783846 -1036261 -1833070 -2895294 -2587681
933 -2587681 -207304 1105882 -6657 -1149307 -134016 1138821 861932 -422931 -435934 698833
922 1260873 1410273 1505828 200515 -642071 1269117 2282520 436430 -1099994 -1068464 -1345391
912 -1345391 -2495940 -2354637 200111 2771882 1665654 421052 708894 340087 -849807
902 829320 4063693 4626262 2784258 2023689 2055097 1601190 1399115 1696619 2860375 2299934
892 2299934 240156 -1912400 -3769890 -3431443 -1234129 -906736 -1049812 -316962 -2070616
883 -2070616 -3791059 -1855524 338050 -245096 -1299604 440428 2828392 1674306 -349217
873 -1003927 -559890 -332868 586285 970374 818477 -221425 -526664 142073 169331 -259291
862 320749 1040779 1580648 1669832 553827 -748979 460006 2628808 1986288 -207876 -1393427
852 -1393427 -981319 -481171 1097003 3867280 4215194 999249 -1172922 857315 2336165
843 2336165 1897438 1999027 3389569 4128073 1948620 -678758 -1617234 -1976848 -1594625
834 -1594625 -1199567 -903551 407998 2479595 3034184 1867582 138121 -851451 202606
824 2268759 2978741 1187661 -205650 807511 2094375 -1018318 -5596053 -7114131 -5167872
815 -5167872 -1269364 2139366 2944981 2338615 3312092 4449044 2408605 -645160 -623517
806 -623517 884558 79669 -917507 -524557 -1196802 -2204383 -1381564 1402730 3267235 2028055
796 2028055 282373 -58329 -145815 -825655 -253531 1105067 1499163 1416267 1249964 159736
785 -397742 -403057 -951321 -560241 -245804 -2512960 -4092129 -2837780 -1380529 26702 1375925
775 1375925 -515769 -3323623 -2858021 -1356483 -1727834 -2758672 -1545352 318907 -487983
765 -2337165 -3183030 -3584791 -1520222 433732 -734528 -1938662 -1797337 -1340983 -337507
755 -881365 -1907558 -732313 1996677 3084026 3868288 4340036 2266086 -502493 -287086
746 -287086 1775745 2756088 1950554 885488 273693 -112049 1272458 3171633 2817847
737 2817847 713693 614019 622634 -1787864 -3721132 -2865391 -2286508 -1345400 492349 786734
727 786734 -84320 -1166737 -1505202 -1636364 -2658296 -1726807 121848 -281414 -1119219 354134
716 846771 -295140 -770709 -1102152 -450726 2003476 2830880 305869 -2961057 -2908697 -1041313
705 370617 1049193 880951 170351 -141808 781750 836741 -327760 -153151 353734 -173562
694 182192 1123240 500991 -1043240 -2320097 -2556124 -1365559 -2154538 -2716585 -366997
684 901941 -1137519 -2063635 -1185907 -907305 -522369 1176823 1992081 680870 654728 1508180
674 1508180 280003 -1372064 -2459668 -3247423 -2789778 -851254 805126 962663 1381955
665 1381955 1533471 970247 1050912 1560144 1650752 220337 -1789805 -3173585 -2835977 -2316358
655 -2316358 -1148035 1561604 3503558 3019926 1348448 60979 -774065 -812422 -1648702
646 -1648702 -2016677 840348 4697303 7297511 6172211 2088708 494029 2613592 3611035
637 3611035 2058637 1255943 764986 -319636 -1410302 -3102178 -3114167 -2212333 -678913
627 721041 1260795 1084975 1653125 1819647 2050230 1356158 1438505 1795892 2412452 2851488
617 2851488 2157870 1381100 1917098 4128730 5450092 4293481 2727936 1477168 -1119127
607 -2177282 415651 2010136 435798 -673300 1654035 3283045 5070652 6178902 3185590
598 3185590 3559570 3642566 818222 -3136200 -6480316 -4276541 -3076939 -2428925 -2984119
589 -2984119 -2345280 -1014515 -823673 -517565 -1277319 -1784755 -1038375 -1325578 -1575506 -1072479
579 -1072479 137730 257116 490604 1241356 2163210 1300421 -3358847 -7157154 -6318555
570 -6318555 -4858580 -4834749 -3625732 -2962338 -2795495 -1419268 185354 324248 -202265
560 -200604 20472 -2898942 -10106809 -14239820 -9280345 -3328120 -298405 733277 524177
551 524177 -107721 -33838 257113 65773 -862237 -516932 -490963 -526620 -251348 -836104 -2072601
540 -2072601 -2189054 500747 3058544 3086946 3611826 4821549 2855922 -145767 -1252194
531 -1252194 61969 390016 -911885 -742604 341453 370674 -657734 -1294464 26927 2162360
521 2162360 2711546 -162075 -2144367 -1336946 -1050034 -1175498 181794 1793947 1439261
512 1439261 1346374 1999625 629356 -2028140 -2344424 -1050174 -776291 684627 2919680
503 2919680 2588523 64952 -1201826 -965224 -143713 8693 -246369 -1360654 -1475884 -311454
492 405597 460303 -129183 -1805061 -1626512 234098 891824 153197 448466 -885610 -2058186
482 -2058186 -867862 356802 -1407 -489856 -1524552 -2346539 -1339318 -856729 -2144836 -1993878
472 -1993878 674718 1107163 532683 1974094 2255911 452668 9577 1710754 2060310 786610
461 -1577355 -2737050 -451437 1730206 193265 -1241068 301058 1067350 247416 -457323
451 299934 1474195 -200541 -3035404 -4018493 -3330707 -1540933 -471967 -48579 -344446 -737976
441 -737976 -359451 401491 1750272 2757440 2865175 3234506 2431630 1587633 2089347 1991873
431 1991873 -379842 -1422176 -166354 -326423 -1545949 -2664756 -2649323 -652501 473350
421 1689625 1531909 31398 -564358 736860 2180214 2590522 2035014 1722080 1573290 1251603
411 1251603 1609809 612869 -1223647 -785523 130963 -510636 -1446993 -1579941 -876558 465216
400 1017184 2306408 2645716 797903 -1044466 -918746 736364 1657171 1219091 564822
390 -643145 -3079308 -4037258 -3112662 -1513880 -661301 -2526862 -3621369 -1336297 -287957
380 -700825 182460 654296 591253 1779090 2754646 2217006 911496 367074 -48663 -488279
370 -488279 -611093 1159067 3113336 3250042 2785543 3025745 2162444 911069 7588 -1130250
359 -1084112 -574354 -1499958 -1000164 2079338 3169625 630832 -392948 -736691 -1668172
350 -1668172 -1843725 -1998648 -1871620 -1538886 -1191831 947457 3154106 1351638 -1501879
340 -1980353 -1548634 -1947975 -1778747 195505 16692 -3630986 -6065140 -3932879 -598845
330 1403778 1440341 1016373 1166796 1069923 1634427 2711039 2068708 118334 -1106520 -2325008
320 -2325008 -3262675 -2267182 -408125 238496 374972 1546214 1748649 -331289 -1241872 459471
309 2380213 1235449 -2055534 -3214696 -884397 365842 -1449769 -2732853 -1303442 -531066
299 324095 1287770 271664 -868559 23044 753362 395511 201880 1234031 2097596 2900811
289 2900811 3196668 3290013 1524056 -893713 -1633744 -1240480 -1347628 -866459 -441108 -579605
279 -579605 970343 3305755 2671195 -486377 -897424 1021297 982454 700370 1467142 1388240
269 1388240 43025 -1167663 -650916 1021787 1933096 926926 -29375 -390604 -49677 1014937
258 1943427 1961773 979156 -514153 -1426544 -1539379 -2678159 -3010663 -1397368 -189471 862334
247 2415505 1838587 -159293 -1436133 -1923565 -2142115 -258931 785035 -598526 -1395468 -1800016
237 -1800016 -2021260 -892104 -64519 -2034127 -3302913 -1124354 402307 -533655 -1021404
228 -1021404 -478749 -342674 -730961 -181208 257657 -637223 -1790809 -1120340 947007 2770642
218 2770642 3651389 1316705 -2187299 -3913929 -3911354 -3693893 -3281703 -2176041 -1028600
208 -975543 -829889 432350 1300344 1155676 -76205 -1067311 -2126904 -3701164 -4479346 -1946945
197 1777182 933442 -2491125 -3312651 -453194 2121421 2039300 1564490 1160896 -1235942
187 -3221222 -1319012 636797 157243 829322 2046819 2816687 3155610 3064628 1461648
177 -878819 -1750670 -1433165 -1815333 -1710529 -635414 -1458153 -3162150 -3068378 -248107 2556065
166 4187336 2281139 -727861 -1547452 1020382 4491878 4432208 1972751 -767685 -1012831
157 -1012831 667748 1351101 607209 1679703 2409993 466773 -832797 -1058020 -1705790 -2677705
147 -2677705 -2938830 -2974125 -3522211 -3414640 -2895470 -2879749 -1316780 1000807 1511018 364786
136 1093 831691 1450513 -23105 -1210977 -909867 -68188 -94640 -173330 -259074 -343510 -72875
124 157499 -76089 64270 -164516 -493 505824 -270330 -1350656 -1003119 -848115 -531343 -318098
113 -318098 -1989819 -2361102 -941286 627630 -85669 -503780 1301510 3010513 2125245 1607835
103 1607835 73157 -3481622 -3781277 -1200801 1335181 2173750 1070826 -464539 -127780
93 534487 379644 1272329 2186473 1795719 2225463 1787319 780176 537017 419231 -825037
82 -2415127 -2610561 -351944 542745 -321278 -517084 -1058892 -1134845 -99420 -133170 -5499 1618168
70 1744603 65151 -982043 -929555 -274267 1583053 2312025 1938982 1199241 -217307 -43799
59 874202 374632 -243060 -404747 -413064 -218272 500590 796662 1875250 3605358 3702456
49 3702456 1613168 -568662 -303456 -809138 -1993827 -1121407 1197930 2378920 2722613
40 2722613 2773152 2226289 844685 -323175 -1671863 -1983686 434445 3164706 1597313 -1883395
29 -2721124 -1592484 -252954 1661724 2497038 437208 -1467902 -1485678 -984689 -1040306 -671607
19 -671607 1099879 1888782 1169018 1295953 975717 -328312 -221788 67781 72912 -855824
8 -1008767 -194129 10005 -1194354 -1599093 -1566640 -1443247 -790554 -502473
0 -502473
##PAGE= F1=10025.17819206
##FIRST=     18110.137220953, 5591.54909048506, -864409
##DATA TABLE= (F2++(Y..Y)), PROFILE
1023 -864409 -1238923 -320574 298041 19027 277470 21929 -276907 212220 856933 884126
1013 884126 809406 1081097 1395486 1562597 475276 -641083 -269862 1169417 1239385 -53923
1002 -570214 -969043 -683187 -360397 -1841529 -2849568 -1031343 909046 655482 -173227
992 -785131 -470393 981291 1935029 1238880 -475519 -2142083 -1832103 403075 1705146 1096627
982 1096627 -1247901 -2349254 -323372 718702 23098 -161516 453824 156583 -713396 -1021506
972 -1021506 781073 3026997 2303171 -740038 -1559668 -618378 -305987 -938825 -1395725 -1365320
962 -1365320 -1400660 -2392529 -2948225 -2905919 -994043 678103 200620 -1208391 -589127 -270982
951 -165725 -275196 -212259 1362209 3206367 3404489 3565257 3640079 2716444 2021164 2060960
941 2060960 916665 -507822 -687353 177378 380509 -824652 -2955076 -3331439 -826395 1195450
930 452381 -966927 -346168 1245957 1338343 -359199 -947715 164292 1507619 2401671 2083656
920 2083656 589771 243996 1573071 1364964 -813170 -2009945 -1721064 -1652265 -2517576 -2145378
910 -2145378 666561 2715486 1111107 6963 -85246 -1720097 -3218155 -1443281 1953605
900 3455333 2755446 2443562 2267497 1529091 470649 -316818 210648 440904 -963890 -2712373
890 -2712373 -3887239 -3366488 -1661333 -1345950 -1450061 -1009565 -2309690 -3745248 -2397288
881 -2397288 -458873 -818713 -1878352 -724591 1391358 1092130 -235469 -766438 -797706 -833813
871 -833813 203507 520737 570906 190662 566087 682340 -257158 -787767 89275 765470
861 765470 1137963 968122 -290210 -1178730 340139 2048348 1167573 -713666 -1410431 -544877
850 174193 1058714 2809256 3241143 1236922 -14517 1306427 1510422 708706 1585752 3274120
840 3274120 3725704 1850670 -162768 -1241857 -1963948 -1834451 -1684911 -1473640 265260
830 2230687 1851974 447862 -790351 -1200840 192394 2278671 2858145 1369930 626016
820 2368711 3645523 -105742 -4729918 -6068155 -4223605 -859792 1813514 1989578 1707718
811 1707718 3597028 4808816 2347666 -328490 253989 1293738 -70610 -755671 -329771
801 -1455483 -2880875 -1798785 1636307 3303292 1333961 -413801 -444476 -210668 -59255
791 981158 2018220 1913966 1806430 1481260 227852 2392 429944 -377528 -1229794 -1410957
781 -1410957 -2571091 -2695744 -1531448 -1092135 -226840 705638 -1357868 -4223617 -3380517
772 -3380517 -1356527 -1451024 -1932753 -211962 1241291 -675184 -2734046 -2561308 -2447309
763 -2447309 -814487 676744 -718686 -1821582 -1716933 -1044116 271601 -54201 -715635 1088102
752 3207262 2494263 2111825 2900599 1674510 -619521 -196747 1520625 2314549 2363832 2163805
742 2163805 1489529 610982 2051168 4656011 4125785 1469886 1130355 954200 -1963506
732 -4224809 -3020378 -1969353 -1208198 381976 1079704 265774 -1252995 -2157924 -2169415
723 -2169415 -2957660 -2234065 -99819 313106 -256746 907287 900000 -927601 -2148972 -1985610
713 -1985610 -251022 2251653 1997893 -1276868 -3983252 -2953074 -649260 523054 1079962
704 1079962 1468942 1006428 732880 1296855 791010 -370657 147062 850857 171177 -207576
693 11580 -159234 -1115633 -2164468 -2240358 -1215030 -2398167 -2643093 106173 1260963 -1504494
682 -2322682 -570067 -62358 -362215 985599 1925579 616184 164620 767398 256809 -1004077
671 -1887330 -2538538 -2616537 -1072573 917365 1375553 1691245 1738993 785027 700290 1549038
661 1549038 1852351 598056 -1622665 -3498309 -3324335 -2703030 -1360554 1289131 2892741
652 2892741 2206133 782439 -510266 -2218957 -2807172 -2759046 -1922067 1571108 5287504
643 5287504 7142466 5576210 1745456 50553 1527020 2373531 1721609 1428899 806526
634 806526 -277582 -1117105 -3009008 -3432938 -2567592 -1254298 -396130 356681 684641 592878
624 592878 290354 1072559 1715424 2427331 2463490 2459135 2557060 1504853 801187 1802159
614 1802159 3856339 3945054 2268379 1782332 1582483 -1069878 -2197246 772917 1807391
605 1807391 -1283970 -2449812 -232001 2496691 5156493 4656657 1718817 2140704 3601338
596 3601338 456032 -1884725 -2507816 -2267637 -2481063 -1841359 -1997656 -1671011 -1505223 -1656354
586 -1656354 -337213 -1111513 -2615472 -1819723 -956968 -169379 -111125 -361471 -658485 -188652
575 910113 2530124 2072083 -3235498 -7908040 -6291840 -4149585 -4048791 -3589103 -3132930
566 -3132930 -2936750 -1934101 -126146 909851 664773 81418 -649675 -4040150 -11912495
557 -11912495 -15034969 -8842728 -2446112 -114585 682930 1149731 740277 23869 234420
548 234420 701199 59172 -95935 -645883 -883735 -84570 -609530 -2060097 -1728764 821232
537 2350165 2414938 3298262 3960183 1399166 -1378850 -2407856 -763376 307671 -560166
527 -830784 -666817 -968537 -1904563 -1926929 -312841 1670542 2279905 20617 -2297726 -1613208
517 -1613208 -1081001 -759974 660828 1571618 219224 242757 1206702 -195039 -2726487 -2165055
507 -2165055 245829 172634 374934 1591707 964240 -744192 -910373 26054 727059 731720
497 731720 436717 -680153 -1319117 -942173 -382882 329923 437469 -1220720 -1971536 -735005
486 855295 1083016 570060 -1228452 -2023299 -910163 220006 14090 -855489 -2720181 -3409143
476 -3409143 -1742646 -828941 -1840198 -810815 3102690 3213116 1265805 2523338 3354981
467 3354981 1447461 -205895 898557 1406672 234353 -1611384 -2176937 89092 2277716
458 2277716 1084233 -352882 793771 1490826 1160948 935985 926238 1246173 -503342 -3391118
448 -3391118 -4452156 -3553312 -1916779 -677077 381611 -30437 -1042460 -878064 428525
438 2429062 2802723 1695733 1391797 1021138 715029 1428300 1795815 -49703 -782609 148627
427 19118 -1200316 -2360296 -2390767 -624441 779304 2656231 2197004 -163888 -1298634 272486
416 1718226 1352226 717961 1331814 1775564 1153529 951260 130005 -1695950 -1636831 -270045
405 86213 -332038 -815035 -394723 1358286 2021677 2342656 2212994 534878 -1164714 -892665
395 -892665 1016583 2185425 1546194 443284 -1057335 -3706564 -4354937 -3327775 -2311415
386 -2311415 -2421459 -4131909 -4346392 -1782742 -269306 -64057 896351 1347951 1193742 2480524
376 2480524 3503852 2930305 1486826 548486 -54754 371786 1129365 2498618 3637543
367 3637543 3556384 2845172 2648117 1401731 -369357 -1756523 -2260543 -1358942 -1070883 -2224298
357 -2224298 -1476470 1318863 1915583 -123284 -321143 -485135 -1625533 -1864891 -1809075 -2116963
347 -2116963 -2372753 -1582489 1133037 2849547 858940 -1417655 -1568953 -1027632 -1805960
338 -1805960 -2587655 -1228032 -811689 -3435691 -5216361 -3338068 -449787 1173367 937114
329 937114 925636 1639364 1439800 2121280 3009592 2179043 444527 -540438 -1879726 -3348188
319 -3348188 -2866838 -1161854 -332502 281039 1726962 2239729 658631 -67878 983624 2725271
309 2725271 1875119 -1473329 -3045667 -1354839 -773148 -2632248 -3504709 -1673096 -621505
299 -83580 441768 -801459 -1602673 -283678 963543 1350612 1392370 1560869 1962274 3209154
289 3209154 3454432 2361065 157808 -1815722 -2426251 -1394313 -664157 -480984 -54768
279 227301 1100108 2847269 2806117 83129 -525500 1297010 1234719 720030 1669693 1854950
269 1854950 480385 -515695 229413 1440760 2089018 1810254 1270171 322547 162055 840284
259 840284 1538159 1223168 -144683 -1230231 -1459246 -1857892 -3481911 -4033903 -2349735
250 -2349735 -576280 822148 2048214 1887175 697374 -712633 -1456399 -1570435 60722 690274
240 690274 -687476 -1175080 -1209079 -1813964 -1543939 -1681624 -3911854 -4480748 -1331452 566327
229 -542416 -1449512 -571304 249418 204585 997197 1349466 -411387 -2465132 -2331666 -91470
218 1908558 2614701 817565 -1728550 -2673776 -2980622 -3975465 -4086518 -2513952 -746527
208 -46142 38041 665580 1109386 1112445 206137 -915487 -2096656 -3977897 -4978518 -2552393
198 -2552393 1148254 1072878 -1510554 -2891145 -878002 1909915 1948408 1418980 1173977
189 1173977 -1243502 -3554300 -1744235 595169 25488 226793 845954 1763344 2715996
180 2715996 3628105 2203527 30110 -509875 -141442 -910852 -1436317 -1255386 -1861389 -2515871
170 -2515871 -1962474 -399782 1167695 2861693 2130632 -252143 -1477052 337242 3196686
161 3196686 3810393 2026511 -283209 -545656 413357 744007 686114 2487103 3271012 1565464
150 -132706 -863089 -2127592 -3283197 -3061948 -2639268 -3005187 -3227162 -2899845 -2664755 -1198681
139 714347 982209 -262113 -337614 1230494 1517557 -784894 -2342285 -1353521 136034 367334
129 367334 752278 1154098 537088 -314809 -549295 -272801 -176189 -614908 -377859 761604
118 483302 -270776 -265898 -1029017 -1326189 -740745 -1948255 -2419638 -1046134 580885 -781999
107 -1763506 628145 2840578 2127250 997280 -895702 -3935454 -4229802 -1923681 297152
97 1193688 512776 -795782 -230700 751287 640666 1210017 1683277 1086143 1194104 1039973
87 1039973 724921 917484 510592 -1416619 -3270386 -3056083 -561718 -341458 -1740870
78 -1740870 -1755588 -1730163 -1826054 -567278 -181068 -57656 1808965 1914203 -700295 -2363775
68 -2363775 -1700521 204499 2478639 2794995 2338625 1545589 -574598 -1300857 -801301 -789720
58 -789720 -525799 -489016 -850047 -323167 668105 980671 1739730 3624730 4629126 2747042
48 2747042 -503600 -1373948 -1910452 -2509418 -1359349 575852 1796678 2270725 1829364 1511368
38 1511368 990004 305261 -723921 -1348366 335242 2855949 1784270 -1155283 -1613780
29 -1613780 -404858 1121141 2898109 3157729 221520 -1788553 -868925 -158031 -722156
20 -722156 -539340 1269408 1989293 963850 845996 366910 -922970 -541248 66712 -347246
9 -2048078 -1894306 156812 643230 -994302 -1292354 -503378 108140 298103 -105923
##PAGE= F1=10003.56065455
##FIRST=     18110.137220953, 5591.54909048506, -658179
##DATA TABLE= (F2++(Y..Y)), PROFILE
1023 -658179 -1263095 -607017 29296 -83291 336265 333562 97428 56063 132658 29556 14730
1011 223043 635303 1198808 546492 -1056179 -848174 962554 1338569 -37697 -1042603 -2048698
1001 -2048698 -2310590 -1702923 -2156854 -2372853 -572237 1560247 1409162 770503 387122
992 387122 662562 1977071 2242206 902443 -504971 -1659214 -1556352 568523 1541024 389461
981 -2065496 -2841540 -987127 -268117 136140 1192048 1484244 148920 -1140627 -1647809
972 -1647809 299253 3354690 2818468 -521120 -1575676 -931842 -1101515 -1616010 -1565736 -973674
962 -973674 -484957 -1979337 -2727030 -2569715 -631225 1336431 1010400 -78842 966766 1681573
952 1681573 1355750 1046655 1254026 2345318 3210460 2855352 3278096 3654933 2956487 2865778
942 2865778 3065230 1488715 -198000 106306 1600131 2126759 610809 -2358267 -3486292
933 -3486292 -1286007 1004475 569520 -897328 -507553 1500053 1886830 -291122 -1658460
924 -1658460 -665042 1535464 3103014 2486632 964391 1030251 1646387 310146 -1664527
914 -2005946 -1454182 -1232883 -1705006 -1239871 1203865 2382058 513904 -413764 -694319
905 -694319 -2951309 -4770166 -3310054 -108187 1937761 2264610 2581107 2376256 1477568
896 1477568 -242061 -1985615 -2435354 -1318009 -1995925 -2866093 -2880704 -2189936 -1460466 -1653070
886 -1653070 -1925325 -1697554 -2064258 -2784245 -2156697 -986349 -1212523 -2074005 -1627081 -523134
875 -20805 -289699 -277025 -552744 -936028 -79452 382412 572225 816872 1615655 1109449
865 1109449 -564900 -1045133 -168973 390906 849081 473917 -901268 -1257649 432864 1439768
855 1439768 492569 -735602 -985456 16132 759120 776345 1242520 1813560 1424332 1367495
845 1367495 1767834 520930 -452385 1066888 2707633 3006253 1957020 819003 -167918
835 -1018958 -1389059 -1815059 -2022718 -176868 1693502 537265 -1054948 -1613650 -1324343
826 -1324343 98786 1844516 2363515 1404913 1390607 3705072 4739265 886789 -2937465
816 -3911879 -2762015 -611084 955775 779531 825826 3045790 4166684 1917403 94494
806 1297236 1977046 332556 -217960 -218878 -1879449 -3187498 -1624804 2003397 3208607
797 3208607 678602 -950166 -622542 -272454 485366 2003758 2571113 1781698 1625689 1387965
787 1387965 417062 503425 1051130 -78150 -1870037 -2192732 -1945222 -604056 -4547 -576494
777 -576494 -181902 158816 -2063424 -4401360 -3021647 -875296 -857863 -765522 1418388 2330833
767 2330833 -288800 -2263810 -1557737 -1210858 -165941 632238 -725484 -1311998 -1103622 -467432
756 876450 1004551 1065800 3135349 4058375 1480131 -203711 837115 825533 -544841 126330
745 1286582 1753375 2526069 3215760 2520286 1135760 2425903 5382344 4879884 2268878
735 2078997 1796770 -1290774 -3399988 -2238988 -1343390 -908328 440050 1332364 293788
725 -1603192 -2742039 -2248646 -2473673 -2177412 -165597 828175 518058 1381729 1196845 -786887
714 -2784074 -2752545 -574285 1860677 1005592 -2488495 -4407789 -2820744 -547233 339374
704 912076 1742197 1353585 1112330 1406678 650284 -76552 909795 1468280 488299 -603827
693 -935031 -454959 -767711 -1768303 -1727852 -998987 -2343482 -2215702 628538 1440932 -1758577
682 -2318584 94801 854445 -24780 637252 1469310 369577 -395277 -112312 225149 -436596
671 -1270298 -1687863 -1919562 -855577 955383 1388306 1638263 1865568 922001 708592 1367772
661 1367772 1488264 436487 -1663870 -3662098 -3458053 -2571560 -1356088 635848 1700216
652 1700216 1185970 290931 -1075887 -3519057 -4639705 -3745409 -1563049 2249907 5562920
643 5562920 6425490 4460945 991729 -620078 287704 1009536 1352034 1603551 991742 -111790
632 -820617 -2821526 -3529356 -2671762 -1768519 -1832112 -1056353 -96215 -570299 -1198199 -87766
621 1734032 2948709 2628044 1896809 1598469 299211 16191 1786658 3425646 1977649
612 1977649 -186937 311089 806705 -1291189 -1908900 951003 1386660 -1764152 -2405409
603 -2405409 -338418 2826250 6631973 7174182 4390546 2468600 3278036 -167626 -2195160
594 -2195160 529443 134815 -924100 -495953 -323552 -188323 -1548335 -2644010 -816382
584 -823838 -2811439 -2427679 -765292 828358 845729 -684095 -1252723 -372638 1068579 3101547
574 3101547 3146810 -1899244 -6870937 -5334079 -2750321 -2612094 -3189418 -3303594 -2899823
565 -2899823 -2054001 -247407 1691384 1994334 1186636 -192849 -4125188 -11468778 -13007405
556 -13007405 -6804681 -1053876 451714 858001 1596908 1432863 149305 119199 1066059
547 1066059 927643 354406 -726896 -1275774 -116362 -576670 -2100837 -1250639 1279176
537 1905426 1763254 2590408 2556741 -101307 -2254637 -2893300 -1288465 124053 -480625 -973672
527 -973672 -1516208 -2267393 -3127259 -2537072 -587832 1287929 1746925 -160141 -2524943 -1993269
517 -1993269 -1251762 -404932 956557 973118 -1177178 -898249 587721 -576704 -3065899 -2136151
507 -2136151 1223140 1288038 -50 -367432 -1151091 -1463869 -404133 1130538 1414546 1116902
497 1116902 728934 -136514 -938362 -1125560 -920400 201299 818327 -651791 -2183873 -1548605
487 -1548605 620463 1873686 573661 -1755293 -2305936 -1199260 123520 356814 -915203
477 -3455010 -3876105 -1977131 -913562 -1314137 789489 5365340 4975202 1909198 2902344
468 2902344 4378772 2669319 -145376 94036 729411 -152929 -1368879 -1392728 549093 2433338
458 2433338 1747567 596258 1136686 1379161 1262588 1765753 1373407 769149 -1010377 -3536344
448 -3536344 -4551671 -3405583 -1929998 -775961 558092 147385 -1250509 -1150628 672962
438 3104655 2704961 389947 -685220 -455065 -75715 573006 1124672 142861 -213827 120816
427 29028 -979423 -1981560 -1800288 -901414 670505 3046147 2273346 -708861 -2088119 -194072
416 1332393 232419 -596484 704034 1711835 914007 150424 -421192 -1906809 -2281611
407 -2281611 -1023227 53244 294119 -247397 -28029 1892640 2469225 2046071 1764599 366863
396 -1337976 -1056912 934471 2118831 1573615 333380 -1555891 -4336638 -4539751 -3515064
387 -3515064 -3070393 -3975620 -5413802 -4756688 -2227362 -713017 -261856 794468 1404430
378 1404430 1557549 2737646 3496351 2951062 1648648 351975 -511960 675003 2312199
369 2312199 3324954 3537811 3213076 2335888 1661038 242208 -1691063 -3482262 -3431509
360 -3431509 -1773221 -1585840 -2836262 -1985278 201985 374605 -852091 -228402 -86973 -1215732
350 -1215732 -1440431 -1077748 -1871508 -2905774 -1917959 768716 1625427 -38973 -1382039 -1122505
340 -1122505 -511637 -1680477 -3422723 -2736022 -1456018 -2644235 -3786348 -2446448 -229602
330 763651 330222 999023 2176886 1892184 2566331 3120708 2074417 759762 329279 -855829
319 -2878026 -3334444 -2209499 -1094646 287496 2044918 2515515 1364426 714689 1041793
310 1041793 2628023 2311384 -726956 -2618290 -1704472 -1828032 -3556571 -3763870 -1620439
300 -371638 -143501 -261939 -1703310 -2027679 -447384 776418 1731416 2396408 2145033 2016326
290 2016326 3198556 3414759 1289537 -1097233 -2278197 -2395077 -1178870 -197036 -338866
281 -338866 248925 999320 1059820 2055413 2840196 866996 -94881 1378294 1579179 928745
$$ [...]
##END NTUPLES=nD NMR SPECTRUM
##END=
