##TITLE=Analysis number 329256
Compound Code cc 10502
Book Reference 423/184
Project Code adrs
Chemist Name bruced
##JCAMPDX= 6.0         $$ Bruker NMR JCAMP-DX V2.0
##DATA TYPE= NMR SPECTRUM
##DATA CLASS= NTUPLES
##ORIGIN= Bruker BioSpin GmbH
##OWNER= nmr
$$ XWIN-NMR		Version 3.5
$$ Tue Aug 14 13:00:33 2007 GMT Daylight Time (UT+1h)  MAYBRIDGE\nmr@NMR_250MHZ
##.OBSERVE FREQUENCY= 250.131544655141
##.OBSERVE NUCLEUS= ^1H
##.ACQUISITION MODE= SIMULTANEOUS (DQD)
##.ACQUISITION SCHEME= undefined
##.AVERAGES= 16
##.DIGITISER RES= 18
##SPECTROMETER/DATA SYSTEM= dpx250
##.PULSE SEQUENCE= zg30
##.SOLVENT NAME= CDCl3
##.SHIFT REFERENCE= (INTERNAL, CDCl3, 0, 16.4481)
##AUDIT TRAIL= $$ (NUMBER, WHEN, WHO, WHERE, WHAT)
$$ ##TITLE= Audit trail, XWIN-NMR		Version 3.5
$$ ##JCAMPDX= 5.01
$$ ##ORIGIN= Bruker BioSpin GmbH
$$ ##OWNER= nmr
$$ C:\u/data/dgb/nmr/ADRS/620/pdata/1/auditp.txt
$$ ##AUDIT TRAIL=  $$ (NUMBER, WHEN, WHO, WHERE, WHAT)
(   1,<2007-08-14 13:00:09.09 +100>,<MAYBRIDGE\nmr>,<NMR_250MHZ>,
      <created by zg, POWCHK disabled, PULCHK disabled
       configuration hash MD5:
       76 6E 9A 78 1E 09 19 81 EC 84 63 8F B0 6A 59 2D
       data hash MD5: 64K
       3E BC 1D 39 B2 B9 EC 48 80 8D A9 02 E6 2A 02 0B>)
(   2,<2007-08-14 13:00:24.00 +100>,<MAYBRIDGE\nmr>,<NMR_250MHZ>,
      <Start of raw data processing
       ef LB = 0.3 FT_mod = 6 PKNL = 1 SI = 32K 
       data hash MD5: 32K
       15 2F 99 1F 02 FD 16 26 79 E7 D4 27 26 3C 38 61>)
(   3,<2007-08-14 13:00:25.66 +100>,<MAYBRIDGE\nmr>,<NMR_250MHZ>,
      <apk 
       data hash MD5: 32K
       E9 0E 52 B2 A5 A7 08 CE 85 40 62 05 1F 8C 13 EF>)
(   4,<2007-08-14 13:00:26.37 +100>,<MAYBRIDGE\nmr>,<NMR_250MHZ>,
      <abs ABSG = 5 
       data hash MD5: 32K
       82 B8 D9 97 73 3A 8F D3 F2 84 85 71 17 A0 F6 35>)
$$ ##END=
$$ 
$$ hash MD5
$$ 94 3A DB 86 A9 D8 39 09 3E 79 07 3B BB 45 A6 A7
##$RELAX= 
##$RELAX= 
##$RELAX= 
##$RELAX= 
##$RELAX= 
##$RELAX= 
##$RELAX= 
$$ Bruker specific parameters
$$ --------------------------
##$DU= <C:\u>
##$EXPNO= 620
##$NAME= <ADRS>
##$PROCNO= 1
##$TYPE= <nmr>
##$USER= <dgb>
##$AMP= (0..31)
100 100 100 100 100 100 100 100 100 100 100 100 100 100 100 100 100 100 
100 100 100 100 100 100 100 100 100 100 100 100 100 100 
##$AQSEQ= 0
##$AQ_mod= 3
##$AUNM= <au_zg>
##$AUTOPOS= <26 >
##$BF1= 250.13
##$BF2= 250.13
##$BF3= 250.13
##$BF4= 250.13
##$BF5= 500.13
##$BF6= 500.13
##$BF7= 500.13
##$BF8= 500.13
##$BYTORDA= 1
##$CFDGTYP= 0
##$CFRGTYP= 5
##$CHEMSTR= <none>
##$CNST= (0..31)
1 1 145 1 1 1 1 1 1 1 1 1 1 1 1 1 1 1 1 1 1 1 1 1 1 1 1 1 1 1 1 1 
##$CPDPRG= <>
##$CPDPRG1= <>
##$CPDPRG2= <>
##$CPDPRG3= <>
##$CPDPRG4= <mlev>
##$CPDPRG5= <mlev>
##$CPDPRG6= <mlev>
##$CPDPRG7= <mlev>
##$CPDPRG8= <mlev>
##$CPDPRGB= <>
##$CPDPRGT= <>
##$D= (0..31)
0 1 0 0 0 0 0 0 0 0.06 0 0 0 0 0 0 0.0002 0 0 0 0 0 0 0 0 0 0 0 0 0 0 
0 
##$DATE= 1187092807
##$DBL= (0..7)
120 120 120 120 120 120 120 120 
##$DBP= (0..7)
150 150 150 150 150 150 150 150 
##$DBP07= 0
##$DBPNAM0= <>
##$DBPNAM1= <>
$$ [...]
##$SUBNAM7= <"">
##$SUBNAM8= <"">
##$SUBNAM9= <"">
##$SW= 20.6930455092707
##$SWIBOX= (0..15)
0 0 3 0 0 0 0 0 0 0 0 0 0 0 0 0 
##$SW_h= 5175.983436853
##$TD= 65536
##$TD0= 1
##$TE= 297.16
##$TE2= 300
##$TE3= 300
##$TEG= 300
##$TL= (0..7)
0 120 120 120 120 120 120 120 
##$TP= (0..7)
150 150 150 150 150 150 150 150 
##$TP07= 0
##$TPNAME0= <>
##$TPNAME1= <>
##$TPNAME2= <>
##$TPNAME3= <>
##$TPNAME4= <>
##$TPNAME5= <>
##$TPNAME6= <>
##$TPNAME7= <>
##$TPOAL= (0..7)
0.5 0.5 0.5 0.5 0.5 0.5 0.5 0.5 
##$TPOFFS= (0..7)
0 0 0 0 0 0 0 0 
##$TUNHIN= 0
##$TUNHOUT= 0
##$TUNXOUT= 0
##$USERA1= <user>
##$USERA2= <user>
##$USERA3= <user>
##$USERA4= <user>
##$USERA5= <user>
##$V9= 5
##$VALIST= <valist>
##$VCLIST= <CCCCCCCCCCCCCCC>
##$VD= 0
##$VDLIST= <DDDDDDDDDDDDDDD>
##$VPLIST= <PPPPPPPPPPPPPPP>
##$VTLIST= <TTTTTTTTTTTTTTT>
##$WBST= 1024
##$WBSW= 4
##$XGAIN= (0..3)
0 0 0 0 
##$XL= 0
##$YL= 0
##$YMAX_a= 213579
##$YMIN_a= -148214
##$ZGOPTNS= <>
##$ZL1= 120
##$ZL2= 120
##$ZL3= 120
##$ZL4= 120
##$ABSF1= 16.44814
##$ABSF2= -4.245033
##$ABSG= 5
##$ABSL= 3
##$ALPHA= 0
##$AQORDER= 0
##$ASSFAC= 0
##$ASSFACI= 0
##$ASSFACX= 0
##$ASSWID= 0
##$AUNMP= <proc_1d>
##$AZFE= 0.1
##$AZFW= 0.1
##$BCFW= 0
##$BC_mod= 0
##$BYTORDP= 0
##$COROFFS= 0
##$CY= 12.5
##$DATMOD= 1
##$DC= 0
##$DFILT= <>
##$DTYPP= 0
##$F1P= 14.0000005364418
##$F2P= -0.99999901652339
##$FCOR= 0.5
##$FTSIZE= 32768
##$FT_mod= 6
##$GAMMA= 0
##$GB= 0
##$INTBC= 1
##$INTSCL= 1
##$ISEN= 128
##$LB= 0.3
##$LEV0= 0
##$LPBIN= 0
##$MAXI= 10000
##$MC2= 0
##$MEAN= 0
##$ME_mod= 0
##$MI= 0
##$NCOEF= 0
##$NC_proc= -5
##$NLEV= 6
##$NOISF1= 0
##$NOISF2= 0
##$NSP= 0
##$NTH_PI= 0
##$NZP= 0
##$OFFSET= 16.44814
##$PC= 1
##$PHC0= -40.06495
##$PHC1= 1.598786
##$PH_mod= 1
##$PKNL= yes
##$PPARMOD= 0
##$PSCAL= 4
##$PSIGN= 0
##$REVERSE= no
##$SF= 250.130018473778
##$SI= 32768
##$SIGF1= 0
##$SIGF2= 0
##$SINO= 400
##$SIOLD= 32768
##$SREGLST= <1H.CDCl3>
##$SSB= 0
##$STSI= 32768
##$STSR= 0
##$SW_p= 5175.98343685301
##$SYMM= 0
##$S_DEV= 0
##$TDeff= 65536
##$TDoff= 0
##$TI= <Analysis number 999999
Compound Code 99
Book Reference 9
Project Code 9>
##$TILT= no
##$TM1= 0
##$TM2= 0
##$TOPLEV= 0
##$USERP1= <user>
##$USERP2= <user>
##$USERP3= <user>
##$USERP4= <user>
##$USERP5= <user>
##$WDW= 1
##$XDIM= 32768
##$YMAX_p= 562937715
##$YMIN_p= -903548
$$ End of Bruker specific parameters
$$ ---------------------------------
##NTUPLES= NMR SPECTRUM
##VAR_NAME=  FREQUENCY,     SPECTRUM/REAL,   SPECTRUM/IMAG
##SYMBOL=    X,             R,               I
##VAR_TYPE=  INDEPENDENT,   DEPENDENT,       DEPENDENT
##VAR_FORM=  AFFN,          ASDF,            ASDF
##VAR_DIM=   32768,         32768,           32768
##UNITS=     HZ,            ARBITRARY UNITS, ARBITRARY UNITS
##FACTOR=    0.157963299565203, 1,           1
##FIRST=     4114.17335962252, 0,            0
##LAST=      -1061.81007723049, 0,           0
##MIN=       -1061.81007723049, -903548,     0
##MAX=       4114.17335962252, 562937715,    0
$$ Real data points
##PAGE= N=1
##DATA TABLE= (X++(R..R)), XYDATA
$$ [...]
27155 36890 -261335 68070 172045 69513 -22029 -28747 78374 188093 98370 -42352
27145 -42352 113864 90544 268739 217631 184327 106041 194201 185588 -10911 -97206 -160310
27134 -160310 -176721 -157373 -308163 -84730 -21607 -173361 -82452 137816 278081 288796
27124 288796 339789 291228 112818 -85833 -124925 -263485 -310262 -179394 -112578 -216735
27114 -216735 -236249 30944 71536 266980 266417 122602 7215 -95898 -67503 171921 464684
27103 464684 446638 521241 541346 553669 280103 187203 79796 38865 218910 257230 349971
27092 349971 178233 193073 326628 293078 75751 -17546 169339 297878 7356 -225437
27082 -225437 -357641 -369037 -373767 -301408 -218091 -120039 -94365 162821 171280 -117667 -362105
27071 -362105 -305061 -76990 -128711 -97544 -77759 49424 278613 106204 -322845 -275777
27061 -275777 -176781 -40924 34283 72933 263 -31080 -143583 12979 16903 -216869 -265048
27050 -265048 -375506 -361123 -404257 -230153 -45841 11675 -5862 27415 -55167 -83721 -59057
27039 -59057 80941 12837 -240761 -396857 -387653 -305997 -337527 -385227 -486445 -398127 -138874
27028 -138874 -174566 -440821 -241556 185333 268202 232996 103925 -66397 -138130 -92967
27018 -92967 -170808 -338781 -201443 19451 325583 355133 292431 204241 231200 181309 -96200
27007 -96200 -169550 -114104 -305695 -462342 -464689 -521289 -491493 -261592 -229436 -140553 -154024
26996 -154024 -76965 -47677 -224970 -112581 -131741 71591 269598 285727 237606 207537 76017
26985 76017 -47107 -245204 -220805 -21207 144065 140400 343980 395745 331584 234868 21035
26974 21035 -19299 -38631 -145928 -259103 -516391 -377469 -370320 -350057 -146191 31608 145820
26963 145820 114674 58727 81814 92766 115807 61059 -13015 133521 232265 172429 251608
26952 251608 69638 -311477 -605637 -569552 -265974 17161 -7769 -170758 -147071 -165299
26942 -165299 -154482 -132725 -406960 -242705 -19269 -17926 -138434 -178181 -137036 -141014 -136454
26931 -136454 -73075 126221 94761 -59488 -179725 53139 117833 42516 68453 93147 55267
26920 55267 203400 232851 299811 204307 224127 139891 32536 19679 -14738 -186582 -182903
26909 -182903 21936 74961 55387 210580 380004 301797 176379 -48854 -101807 -383583
26899 -383583 -551571 -341903 -238266 -45744 -52049 37426 -21164 53875 125879 137269 264015
26888 264015 -45806 -188811 -37214 214713 198710 119922 137318 97845 -203138 -231028
26878 -231028 131605 353094 -77157 -146953 100679 125902 -145135 -331903 -98370 120518
26868 120518 237496 151091 86713 23904 -45130 66142 248416 275641 290194 507902 397243
26857 397243 387687 355731 259128 55709 270700 306496 255061 92948 269618 159277 44471
26846 44471 98701 155368 -26267 -106681 -194133 -163744 -30521 101617 218610 40171 117683
26835 117683 207785 173115 -254821 -311701 -117329 -18532 171375 160211 32592 -168912
26825 -168912 -226341 -165967 -158106 -331152 -364998 -97157 23840 -213624 -321415 -210482
26815 -210482 -127887 -34900 -45278 -215358 -149282 -9661 23513 260172 378277 371633 94305
26804 94305 -174556 -324987 -201652 -110785 175564 380592 123118 -32139 -13852 -36315
26794 -36315 79193 24159 309264 341783 243137 231777 112176 -120391 -88959 -82877 -54511
26783 -54511 -142731 -224652 -336541 -263151 -63088 -189548 -167932 -56938 -111921 -247118 -308142
26772 -308142 -283170 -429192 -482319 -370415 -307738 -332938 -303755 -237184 -146498 -86127 21018
26761 21018 11858 -57947 35060 31857 258040 477357 401766 253483 -12838 -244006 -184645
26750 -184645 -29232 248412 150463 -55337 -93102 214395 240805 88211 -129929 -52289
26740 -52289 34727 49849 -4394 -22327 1002 -12294 -177366 68492 110747 234185 303340
26729 303340 313175 252840 106524 94194 109443 -6374 -196814 -16665 78958 -7215 102989
26718 102989 141961 226684 181323 17974 144893 125129 227736 266255 142415 189969 341448
26707 341448 377163 447731 211677 16609 17092 25979 180576 208940 285693 311699 204148
26696 204148 158926 84010 155766 80562 -157234 -281033 -142919 -9573 -325918 -435296
26686 -435296 -224585 -119622 -180653 -264926 -484418 -551223 -300607 -148159 -137799 -210244
26676 -210244 -76590 -74458 160416 283347 110727 -37197 15293 -191601 -58811 58348
26666 58348 8826 -47710 -29154 -174919 -313731 -351522 -187608 91153 337742 416315 430623
26655 430623 220053 -25926 -329123 -302593 -240810 -9075 218774 300249 657463 631584
26645 631584 159640 69125 316748 322639 57616 -123589 42394 324242 305027 287704
26635 287704 308599 149647 -6591 -188596 20540 107375 141551 151275 -42327 -87996 -187478
26624 -187478 -20028 18342 85057 173425 268245 18189 -305944 -376792 -287640 -58911 122569
26613 122569 92849 -139065 -91851 -223644 -290041 -288564 -250254 -126792 -94858 -237036 -166758
26602 -166758 -95277 -51227 -104151 -188994 -367308 -143204 -32346 -299970 -169237 284
26592 284 -122663 -17301 -444930 -556316 -362925 -373372 -253537 -18065 47075 44449 9145
26581 9145 -25219 259387 399904 242822 321266 321770 121587 139865 187505 84254 -21153
26570 -21153 -101689 13849 374401 309139 115266 -970 -31837 -191215 -112141 -31610 -105012
26559 -105012 48906 147259 211821 220105 461430 560399 512800 476500 205220 264736 259007
26548 259007 214329 219966 480174 376011 294004 446347 448912 165721 -80887 -192409 -142233
26537 -142233 167016 253709 233215 125249 134489 172420 303359 286759 40577 75561 251984
26526 251984 163288 88035 160488 72070 -83027 -107917 113792 203358 177688 210585 207236
26515 207236 158921 296946 264429 266626 310360 444291 332994 228833 235150 437652 353804
26504 353804 143813 24816 -243401 -264079 -88075 -26362 -132738 -34927 49966 95529
26494 95529 14867 56977 -25906 -152240 54225 284728 284057 366370 330860 236654 111439
26483 111439 24494 56093 -18401 -161632 -276546 -357712 -274934 -170309 -286026 -171154
26473 -171154 -210082 -397528 -193770 92592 -60068 -197665 -134488 80900 187918 135555
26463 135555 -78409 -45770 15068 132025 323384 186015 15617 77750 -65856 23206
26453 23206 -39032 -70231 -295643 -395058 -383645 -113488 27651 -133321 -92655 14220 -99608
26442 -99608 -233386 -287242 -287154 -203832 -95204 61276 95085 -131742 -219669 -107631 -132831
26431 -132831 -125731 57974 113394 -35542 -403863 -225553 -132475 -72126 36677 122221 210635
26420 210635 87315 111739 19010 -244342 -105366 -48268 -50133 97338 195380 26868 -335346
26409 -335346 -304987 -110955 -64531 -122700 -23391 38752 357549 306325 351197 245909 157753
26398 157753 346797 321883 304521 321952 311489 439062 424126 519040 405515 515802 195891
26387 195891 102694 103426 57859 -25404 249581 227857 125056 146964 224050 249034 80726
26376 80726 -102019 -197930 -279197 -373152 -307803 -225398 -40763 -166385 -139833 -336816 -297333
26365 -297333 -102853 74500 -60624 -251518 -393333 -347177 107727 295362 351528 298514
26355 298514 12261 70840 121318 273093 321480 144636 -97246 -134563 -130292 -1588 121647
26344 121647 134926 44213 57214 -164064 -142022 -269280 -334950 -525965 -512459 -349404 -396370
26333 -396370 -435716 -439681 -265243 -145993 -731 -119663 -273006 -236360 -271563 -286522 -61382
26322 -61382 57469 251580 506905 522683 483011 265365 -16762 39658 182408 209106
26312 209106 127692 -103159 -278343 -385540 -383640 -251939 241478 454948 411645 318578
26302 318578 86786 41007 375510 311506 256131 174070 -20087 -133896 -145000 113529
26292 113529 199770 72040 -93176 -307653 348 269512 297624 207666 265581 315790
26282 315790 300936 170125 263604 60511 -40896 -57287 -133621 -7558 -193282 -318052
26272 -318052 -447805 -110769 207857 333248 468669 396575 170254 186145 304093 237237
26262 237237 209985 -54024 7002 81715 110663 82321 -114052 -189833 -267633 -154674 277995
26251 277995 368477 157722 84748 289121 43265 -37486 38865 -94507 59958 101084
26241 101084 166552 51928 18810 69742 276400 395907 323879 217216 339591 353421
26231 353421 393182 104447 -26620 138832 247109 301423 173284 145159 21042 -121955
26221 -121955 -133834 46294 271883 379988 255809 238472 332344 230912 88173 -47132
26211 -47132 -134972 -104721 -123144 -241163 -137247 203252 211930 166711 305935 310892 265593
26200 265593 318107 305022 194908 63170 115890 114014 -84992 -217932 -288569 -383357 -320926
26189 -320926 -53602 67151 -182110 -87300 -25059 101325 72300 -70755 -307175 -535861
26179 -535861 -514074 -430796 -397079 -217892 -107385 -300158 -239940 -175239 -139793 -143824 -102684
26168 -102684 56866 236113 58700 24316 216397 384754 222794 340384 396583 351484
26158 351484 95079 -59384 -62469 127040 55613 -126710 -155724 -109941 -181615 5524 151535
26147 151535 142259 90148 92839 -18841 7425 -59740 -174673 1370 21112 -64333 -90445
26136 -90445 -70439 -3790 33371 -15920 41546 117390 -44988 -128497 -41654 92360 206809
26125 206809 66791 -26979 -64540 -26026 -122387 -310065 -326851 -95989 -186822 -163242 -135787
26114 -135787 -110547 -201772 -74515 21036 62048 -260753 -580582 -358389 53306 69095
26104 69095 -32123 66685 261059 145157 -115179 -64728 -130933 -338989 -75092 253898
26094 253898 38425 10190 10651 -89462 2594 118480 173980 54766 45737 229843 413170
26083 413170 489086 456518 495354 370237 152338 -39829 58472 -200156 -218571 -195252 -216975
26072 -216975 -240044 -123626 -76275 -14196 -80403 -169928 -174643 -166443 -29586 -1256 -137003
26061 -137003 -64432 42521 50548 62780 163153 71236 -12469 209517 333065 129616 -175957
26050 -175957 -131908 -110683 89092 -34990 -225774 54858 121813 -106944 -187958 -63678
26040 -63678 -81803 -47990 -112713 17359 -121438 -126186 112095 265918 362411 215342 -153340
26029 -153340 -251191 -234178 -348274 -65237 159666 299676 470976 313666 117599 220747
26019 220747 143654 22825 -10422 87496 176066 -54909 -50013 38017 34189 -147364 -39757
26008 -39757 189557 97611 73723 211556 378045 107968 19276 9605 287077 309544 229905
25997 229905 246635 164134 375686 191781 -24273 94980 34336 -7485 -143495 38581
25987 38581 88353 237909 414258 485210 347253 61060 -102866 -100629 -202863 -19694
25977 -19694 36984 -60893 -75459 -176581 -208691 30035 -70641 -207854 -16683 -58456 281140
25966 281140 140924 80289 -22156 -183407 -127571 -196305 -278974 -173069 -277947 -291952
25956 -291952 -252338 -248376 -337856 -245941 -7450 204728 162302 246473 311469 225814 347547
25945 347547 308029 167981 92672 28131 -176341 -253546 -111500 90335 171638 195300 16713
25934 16713 -251308 -127829 73217 89414 296011 326236 208945 113990 163828 172735 317616
25923 317616 204614 -44257 -78211 -83485 -108493 -18221 -184 20558 16525 -44691 160617
25912 160617 177082 105122 224408 139492 -67982 -282935 -289144 -235825 -381790 -504344 -390387
25901 -390387 -105057 -58916 -10200 104218 192691 59112 -3767 123363 87230 147080 278281
25890 278281 72771 -28476 -32480 86948 133695 148320 110426 154277 1465 -230977 -198865
25879 -198865 -372687 -596863 -541167 -233033 -64239 58960 192979 189757 16925 -194647
25869 -194647 -113732 -93545 90222 37887 -104742 -171710 -130028 -36964 34533 156629 145104
25858 145104 -57831 -216536 6758 152046 89094 -34477 30111 223481 224944 311842
25848 311842 313269 180738 -32094 -49288 26170 147104 111998 231475 85339 44228 -120430
25837 -120430 14251 211044 -220893 -348537 -350216 -256686 -285391 -81372 -15435 -93303 -126691
25826 -126691 -179355 -3428 131056 -66616 -288830 -57836 -18113 -30793 -25225 36653 -19870
25815 -19870 24208 -124030 -39205 77229 156891 181354 281871 289264 80206 -33375 8938
25804 8938 -39662 -302554 -475691 -227818 114771 53007 -32188 -82883 -125318 -276235 -338997
25793 -338997 -378018 -127266 -231524 -225276 -85135 -143341 -143692 -28440 -33626 -112578 -305847
25782 -305847 -258586 32367 382762 332519 57967 -252063 -253752 -154279 -219169 -344977 -279502
25771 -279502 -266743 -112163 90964 234842 380773 91304 -279964 -149042 -248999 -113611
25761 -113611 210636 207724 -123537 -115977 142241 327188 364784 249694 243258 119722 136540
25750 136540 226813 143304 18564 158718 130926 26325 -43795 46197 411646 552604
25740 552604 488180 260444 151253 -84163 -323426 -371890 -102322 78466 229041 329158
25730 329158 284588 226352 260521 197217 88721 144877 296177 304043 234421 49687 -160000
25719 -160000 -393591 -474398 -362615 -165054 -95199 -41351 -412878 -837932 -903548 -573844
25709 -573844 -327563 -148285 -14871 126343 152892 55331 -27434 -47698 275572 282530 43382
25698 43382 40618 110921 130636 266452 268085 493543 544462 298255 188145 146564 248154
25687 248154 -25582 -203036 -81218 23969 -65029 -235022 -82037 -103025 -93643 37781
25677 37781 112445 71186 -51960 10071 110468 146716 219601 290605 202871 66791 28603
25666 28603 75727 82132 -81555 26004 72348 -81954 -197604 -401662 -366018 -218443 -325454
25655 -325454 -433676 -474559 -108529 -105112 -247632 -147388 -254171 -258176 -114694 58217
25645 58217 173461 247998 289817 373933 476133 288468 183463 156881 223253 369280 279775
25634 279775 386326 539537 765202 730888 508492 334255 44747 12696 -49737 14398
25624 14398 3021 97706 157242 218990 156751 167267 -5661 -97732 -90000 -15932 225679
25613 225679 214909 17632 -280095 -270858 -238445 -271003 -98753 95458 184040 36691 -31846
25602 -31846 -134018 73448 265565 81030 4436 94919 -28951 279683 325205 222020
25592 222020 6724 -109768 -13 248755 541121 593838 408181 215432 49658 -2278
25582 -2278 109322 246832 275770 52275 149074 249124 213491 161433 93351 -3576 123121
25571 123121 124544 393395 555729 480954 431826 216440 111252 198869 75595 -7568 -13055
25560 -13055 31257 119052 125442 94238 45539 -4636 -5435 98342 219133 68644 -118801
25549 -118801 -184027 -176250 -153531 -394471 -414783 -134462 -65258 17575 231887 359356 342655
25538 342655 200476 -49976 -415505 -372905 -383690 -187036 120644 228623 192328 176946
25528 176946 84108 211512 135923 98604 205113 376634 373703 270463 369229 282231 261304
25517 261304 183165 130674 -89757 -119344 -165661 -33003 382592 410559 229211 153242 157388
25506 157388 118922 139816 72566 -7589 117167 -44544 -478423 -474854 -134538 -348901 -303240
25495 -303240 -113018 -135937 -184451 -98973 -26588 -52484 -222966 -156905 -234190 -181381 -309766
25484 -309766 -448760 -508325 -511272 -410065 -127550 31345 245827 191185 82690 -140650
25474 -140650 -272021 -8293 82616 -21478 186431 39629 -255968 -312849 -42281 11892
25464 11892 62388 -8316 88391 141700 -19621 -99471 -33557 50681 -62740 -94787 981
25453 981 238818 140044 30085 28997 38680 1237 54040 317923 667938 845439 741454
25442 741454 592569 352469 135074 20063 25076 86329 9003 111346 288775 388384
25432 388384 362965 81758 -52481 158319 464563 521411 426469 121228 166943 8819
25422 8819 -148397 -352445 -486425 -364226 -110159 275562 500077 536841 327555 15268
25412 15268 -32732 -1727 -224316 -364299 -47899 142213 60872 -16012 -39295 -203388 -48336
25401 -48336 35054 23244 -54358 -99498 -71307 -163574 -146250 -44959 111416 -20093 42261
25390 42261 79436 -81836 -16512 -65319 -29067 -177546 -315865 -108536 59941 -143977
25380 -143977 -147612 -325433 -452381 -259466 -15982 195501 289841 123184 60908 3902
25370 3902 27507 -163872 -117773 18213 104613 412539 435878 280788 127383 66407 60802
25359 60802 -185459 -153967 -123156 -394744 -196392 -12862 122054 495586 497160 252191
25349 252191 99889 -125952 -207637 -277111 -109578 -172615 -211782 -224379 -289605 -307186 2870
25338 2870 -61123 3758 -50457 -218967 -274883 -233142 -148441 93890 146056 29352 -65305
25327 -65305 -128034 -284947 -214764 -113965 -223382 -76737 72019 63729 340474 508275
25317 508275 314360 99483 53375 -10729 -112413 -106090 143556 204090 112596 68490 -126505
25306 -126505 -229517 -199933 -393869 -219440 -58386 35096 -95154 -192062 -187837 -75739
25296 -75739 -23311 146701 126216 45657 128806 323856 229047 -21687 -45553 51508 -92249
25285 -92249 -125642 106109 90200 -30554 -208510 -142886 -77291 78374 156646 355954 554633
25274 554633 352944 89982 292727 270032 271690 277394 112315 -64353 -78029 -80096 -25456
25263 -25456 -41857 -7683 15574 -182712 -223090 -17032 112430 186893 331615 383686 219354
25252 219354 323422 226154 -144079 -232907 -92327 -174042 -262860 -113318 98843 325029
25242 325029 177810 129671 299823 340304 378869 1395 -257839 -299949 -200472 -216642 -122613
25231 -122613 76566 53914 142673 154402 18603 -73950 -32333 82381 352508 577575
25221 577575 301592 124848 30759 -120187 160556 382877 181443 -4877 47869 223204
25211 223204 150646 109770 -23859 -98933 -251616 -335187 -346679 -297130 -343754 -455582 -467465
25200 -467465 -642126 -485549 -257795 51619 12406 -27712 68854 82981 242733 325137
25190 325137 282913 171630 111916 95957 93310 -41265 -143397 -26627 -65281 87563 293723
25179 293723 126293 -26958 140890 152077 310477 534977 610964 261791 27673 28749
25169 28749 148157 189500 157933 -80670 -276032 -235190 2645 38393 132660 284742 234185
25158 234185 269951 377277 461196 201260 238087 282461 258877 90116 4437 -59266 125895
25147 125895 53921 -3692 -60457 26349 319145 238681 -47444 -97507 -244174 -85183 -8528
25136 -8528 -201422 -473433 -504708 -368411 -286237 -176325 -139189 -142483 -234400 -157745 142857
25125 142857 226263 300536 196458 69196 -33320 -56768 -9257 151299 161982 77556 -55905
25114 -55905 -124802 -223256 -269255 -138026 -53839 -40411 -53239 120802 416360 431695 404960
25103 404960 359639 343543 210139 239123 32938 -313548 -310211 -322976 -272644 -278385 -320069
25092 -320069 -311876 -391190 -339612 -143680 -465349 -708306 -406020 -57082 -217590 -182535
25082 -182535 -65538 -90532 -40497 -113560 -38769 -57073 -92301 -110043 177673 264620 -27317
25071 -27317 -232270 -76754 -127508 27430 236403 292351 155271 16614 -70426 188262
25061 188262 199926 105065 474931 512594 325555 297946 268322 125455 104431 70181 -246444
25050 -246444 -320134 -442086 -495806 -467483 -514417 -440958 -359345 7146 145907 324451 149318
25039 149318 -94032 -92648 50104 211286 164159 -42287 98308 137669 -63958 -168649
25029 -168649 -229520 -366786 -169140 -80534 -110980 -107089 -21048 20472 -83338 -81230 63217
25018 63217 122206 -5835 -73778 -205827 -444109 -269436 -38505 231988 286865 243926
25008 243926 27671 294316 680605 493707 -995 -539139 -566223 -163075 -13830 170027
24998 170027 225734 168681 101966 202714 158997 173449 -24490 38649 168260 147489 104081
24987 104081 188634 304519 200706 113606 77376 -116211 -199657 32982 40032 -109287 8464
24976 8464 -89505 -39103 188977 113732 -12039 -187785 -47510 42641 92266 261958 297367
24965 297367 130999 95265 152423 12591 189200 195302 291832 240180 188022 224683 202756
24954 202756 111101 -202594 -337790 -194698 -127688 -35387 -129294 99516 124263 -85920
24944 -85920 -409780 -336312 -236506 -113540 86379 62612 -112224 -334974 -426261 -20815
24934 -20815 221501 257461 126648 20043 -16766 24590 46945 -91292 -222488 15915
24924 15915 102394 16891 -40761 -35864 -19338 93145 256526 331250 517655 487463 472675
24913 472675 442747 417222 410636 329597 47652 180865 113857 27446 -16721 -126464 -102543
24902 -102543 -81908 -279518 -335640 -96120 3216 -33176 -32270 -49549 7459 200285 302750
24891 302750 81438 75424 140995 393558 295959 145354 150794 112643 75650 -14026 4353
24880 4353 -43311 -274630 -469773 -337629 -227281 -344502 -52207 136368 235526 291331
24870 291331 187222 144484 -19399 -244819 -204247 -144938 -200459 -118322 -126024 68948 -55194
24859 -55194 -53984 3825 154422 163992 161091 139634 -72044 -64231 -8261 -182771 -409569 -635823
24847 -635823 -443167 -92821 109948 122269 -58197 -29239 -45902 257744 429968 389463
24837 389463 439523 364322 331075 371408 232570 46180 -37396 -79064 93235 -34410 -314806
24826 -314806 -406188 -356012 -113331 199493 350063 266494 83747 -115247 -303089 -451987
24816 -451987 -430395 -465783 -340692 -195834 -86424 -5292 103890 39162 21178 101831 181886
24805 181886 28015 -24513 40797 120626 128445 18966 1022 -3199 41881 69633 105678
24794 105678 187483 208995 253379 334899 285835 354416 274724 96556 4005 181035 24013
24783 24013 -291921 -440690 -611277 -370366 -216120 -207510 -142459 -87544 51440 326692
24773 326692 549211 483300 202953 -156902 -173689 -419138 -465198 -196536 -1394 -52990
24763 -52990 46714 262302 249115 109644 -114380 13083 133862 131253 84945 -17884 35322
24752 35322 29106 -111196 -287554 -476763 -405631 -142308 73736 -214201 -224118 -215218 -282675
24741 -282675 -463099 -633843 -495897 -479924 -552714 -286405 -280104 -318189 -353 49526 281125
24730 281125 128453 -261329 -278030 -220833 -96460 103831 -16519 -26693 -118653 -269742
24720 -269742 -357137 -445507 -335394 -232239 -126886 -166599 -44420 183397 -73716 -381855
24710 -381855 -399425 -310744 -307029 -15155 159308 -3024 -326228 -145197 -31708 -29187 17565
24699 17565 31175 -64494 -214002 2641 -134123 -192960 -195659 -44453 71565 52319 -19436
24688 -19436 -24457 193724 295991 258111 234164 184584 -71582 -256467 -240308 -375923 -169521
24677 -169521 -47598 -54181 -125103 -86184 -178897 -163485 -231670 -178589 -70904 -19474 112083
24666 112083 154439 358580 401117 457351 426567 350992 291393 98413 -5563 -150184 -294512
24655 -294512 -225757 -219175 -145251 -137074 135318 258015 88809 -137334 101575 322504 219586
24644 219586 111400 352240 422821 339291 413892 197020 -19673 33893 330993 368559
24634 368559 319820 201161 63761 -53519 -89585 -35189 -190296 -413835 -601756 -457863
24624 -457863 -199994 -37544 135661 71108 -16357 49015 23621 -42099 -4512 98027 11963
24613 11963 -62667 219179 441297 183851 206822 281397 157551 34795 -67526 -102746
24603 -102746 -199850 -405412 -396384 -437509 -446575 -586874 -193966 36227 -32999 -141025 -5640
24592 -5640 72092 87575 33395 -115158 -76153 -84086 -82121 -169844 -188340 -119713 -263708 -480905
24580 -480905 -414805 -255286 -267444 -39581 2677 -86923 -48637 5337 33688 -153171 -137176
24569 -137176 -105576 -28551 -3523 62269 145776 302956 72472 -131553 -124731 -164297 -64724
24558 -64724 -103078 -125047 -16536 -124812 -153576 86439 198328 45434 -59740 -71342
24548 -71342 -265430 -380785 -257007 -58538 64854 212731 -112852 -108067 -39064 -73548
24538 -73548 -29870 -206042 -219837 -339025 -503495 -349553 -177955 -298281 -54587 -13358
24528 -13358 117501 8497 -178466 -147977 -276319 -386623 -332064 -218355 -209452 -224567 -350891
24517 -350891 -602320 -658133 -366942 -334994 -413548 -276471 -354690 -239054 -76222 -51314
24507 -51314 -135578 -234747 -339859 -318354 -354297 -214531 -62275 8140 41065 137932 78322
24496 78322 -9437 -25630 56122 -103545 53011 300955 369949 124628 67675 -76805 19174
24485 19174 156224 324210 356125 221685 186129 252153 202699 92060 146230 214919 -80510
24474 -80510 27542 263493 168349 -13036 -22957 47853 -372261 -610073 -627473 -253483 20427
24463 20427 -80811 -214943 -119522 -38568 36089 -217302 -262257 -167562 -71713 -186107 -41787
24452 -41787 154575 399922 326858 -153761 -85326 294723 369952 338311 -105229 -354598
24442 -354598 -404760 -258837 -130054 -55623 -162731 -274811 -366312 -415414 -197120 24005
24432 24005 -223687 -137352 -208427 -205366 -279556 -443315 -540573 -572248 -656535 -690280 -492941
24421 -492941 -502079 -540937 -472790 -329054 -180570 -145140 -104699 -32091 35731 -51081 -98488
24410 -98488 -172821 -40351 81350 114548 128444 -145351 -277263 162161 437256 449648
24400 449648 404981 180592 73072 305181 349065 330779 385815 243759 213871 164352 163828
24389 163828 109231 115619 161659 14893 -97274 -340987 -417139 -267260 -269875 -195069 -108934
24378 -108934 -37386 44517 134318 141702 -155765 27799 142594 31213 67157 270667 115893
24367 115893 45331 372036 439295 375583 481401 570300 399764 220056 91570 -81552
24357 -81552 -84971 25442 86838 123858 159826 105113 44931 91216 275220 459202 592370
24346 592370 406188 -263584 -403475 -253274 -490158 -392729 -234710 -17429 57513 -27462
24336 -27462 -104501 26159 87816 10679 183948 290868 307070 79241 -16606 15070 74513
24325 74513 13611 42351 7356 -137324 18691 161202 -94135 -210315 -295946 -172945
24315 -172945 -122545 -190577 63732 146502 352103 328559 78606 -189712 -324868 -321795 -248372
24304 -248372 -179649 -6536 193351 82725 74793 28389 1739 -163813 -273626 -183416 -119424
24293 -119424 26627 125518 145866 -21691 20866 36960 -60205 -12017 39127 199666 193358
24282 193358 315812 96085 -39510 80884 85485 -124882 15116 1629 -147332 -216466
24272 -216466 -179111 -189955 -61072 -22479 41660 175431 141109 -148512 -323499 -169973
24262 -169973 -70385 -126725 25934 -29227 -8951 -7365 39135 141439 152986 274495 181624
24251 181624 -30126 -59615 -89312 13521 264845 199799 297157 225349 245552 338177 346521
24240 346521 287321 275488 212633 130708 183427 272186 118001 -112135 -4581 -47250 -70882
24229 -70882 132659 135022 211843 412351 496877 453352 286550 216007 147303 81406 -559
24218 -559 -14420 -61759 86716 110018 79328 282197 253987 164703 -97350 55179 140584
24207 140584 124172 -55549 -110538 82404 128571 86846 -173554 -340210 -349527 -68562 131711
24196 131711 110824 6748 -109073 -100991 61709 89221 108069 -127369 -348379 -468685
24186 -468685 -257027 -89673 -154571 -172966 139869 385834 436694 193199 12667 -121396
24176 -121396 -158567 -110320 98493 217022 299813 230496 28369 -33273 -56756 30691 -3651
24165 -3651 -13374 144576 177796 -26718 -257616 -267182 -232325 -229124 -152303 -1827 113939
24154 113939 174173 135528 -44861 -253754 -339727 -194268 -77807 33563 -19641 -174850
24144 -174850 -246948 10652 -116209 -252424 -190050 -142363 -185945 -48325 -20924 -260503
24134 -260503 -315752 -357496 -182744 -144608 -212464 -369127 -430817 -257121 53210 294747
24124 294747 212622 161233 304702 308996 359875 148013 -158267 -36349 109596 121274 -46974
24113 -46974 -147706 -13186 180569 262689 208662 56671 -30358 3828 266876 212011 333660
24102 333660 121303 58427 192353 216906 229508 167541 198445 82671 154688 89100 -23965
24091 -23965 24652 215680 154685 -90649 21707 80694 12942 110575 166372 223063 167866
24080 167866 56937 -15715 -135158 96277 240940 65949 3465 89253 93114 -81734
24070 -81734 -38236 117924 -140299 -337160 -384725 -356946 -151381 -20182 -323001 -276493
24060 -276493 -108590 -144520 23215 -77754 -534160 -769512 -617759 -601861 -344536 -242181
24050 -242181 -371160 -404875 -172494 11915 78403 3704 -90302 -192524 -20861 336352
24040 336352 520650 632688 365878 269652 264533 305130 168646 -55473 -105550 21223
24030 21223 -18687 -15865 -96097 -66573 216392 309656 -109888 -363090 -166679 102919 65279
24019 65279 117805 30575 -12701 132656 182406 -42923 -151573 61771 69855 -71225 -120578
24008 -120578 17812 62931 7589 65631 -219995 -76887 75257 135348 97032 239423
23998 239423 306851 358642 252641 207681 103528 -121143 -26005 132307 151895 193454 109908
23987 109908 221278 154917 17642 -31253 -9162 124401 141358 -25898 107349 38924
23977 38924 177544 266803 297505 76392 -150514 -281671 -399125 -485926 -623374 -722649
23967 -722649 -580415 -532401 -288166 -132150 1294 104801 145503 67386 128871 269399
23957 269399 365627 86926 -324703 -315137 -90524 -43156 -2854 74591 80962 137949 -19609
23946 -19609 21498 -304913 -417440 -232737 -30523 -19932 -138967 -49120 45985 20467 193541
23935 193541 383746 424860 237585 257521 232676 66206 -314401 -153132 -23536 91086
23925 91086 10667 -61272 207493 266065 89314 98580 178352 316594 236573 128406 162037
23914 162037 296361 232140 29197 -166816 -253627 -25760 -264051 -330583 -239244 -25334
23904 -25334 99476 38855 296485 300596 140405 243036 240686 192823 160161 279841 286899
23893 286899 338714 430872 370377 289526 172819 126917 244813 217348 328398 290717 318813
23882 318813 439117 222929 144694 355558 348528 395536 384950 374478 238301 365302 431616
23871 431616 346249 169247 194849 205966 86922 -209617 -284402 -349475 -178617 -54904
23861 -54904 -398588 -518913 -480754 -351549 -163512 -104061 -68276 -392345 -242890 -246604 -163666
23850 -163666 70096 104806 -152408 -121828 -174740 -29621 -120133 -191714 -39294 109259
23840 109259 92825 124510 -10649 -117558 -116483 100459 212001 243898 -42761 -51062 33149
23829 33149 -206580 -267699 -36179 -93347 -322799 -403104 -99457 179813 92283 32249 62814
23818 62814 204295 195629 198139 227581 84554 130016 113143 97629 3265 -192329 -508509
23807 -508509 -521676 -376603 -289541 -222049 60937 78647 58261 38369 276372 344314 110842
23796 110842 137148 275541 236565 84602 88423 -85852 -76360 -194140 -267243 -249211 -273644
23785 -273644 -298027 -398335 -211094 -284314 -77257 21643 -74046 -251782 -514058 -356746
23775 -356746 -290217 -215025 -63094 116976 35230 -13747 112143 71409 67072 49272 115468
23764 115468 10657 -215298 -170373 -181358 -154645 -126858 -24883 26269 -139548 -135848 147633
23753 147633 -92024 -388877 -471672 -502265 -248607 -40523 54984 30910 -27043 106495
23743 106495 43529 176591 442295 434659 190426 -39452 -3100 41526 196417 59378
23733 59378 -196293 -397392 -299947 -175784 -157889 -126364 -33324 -48281 144563 161118 -19871
23722 -19871 -55012 -94183 -62983 265304 305918 168980 110730 288321 110970 95651 66851
23711 66851 -109620 -376784 -532783 -437267 -357562 -211487 -184486 -65459 88658 6019
23701 6019 -233303 -370467 -446543 -283540 -3342 225467 150087 56151 79283 102679 189982
23690 189982 57089 -99031 -183676 -102941 -59787 -117306 -118098 38872 -15581 -171786 -309390
23679 -309390 -550322 -349500 -131173 -245495 -151547 108746 208465 308921 382274 264326
23669 264326 105471 222312 272908 366529 347015 38699 2195 -102891 -245327 -255734
23659 -255734 9597 135028 360803 176036 -64341 22336 11549 -206545 -206897 -43821
23649 -43821 -1301 6720 66162 197474 164887 32420 41523 243783 223958 102633 23095
23638 23095 227297 249212 212632 214559 188649 358409 426714 256238 15679 -29476 58531
23627 58531 -142551 -340396 -172456 -138187 -379926 -270767 -117753 -322327 -312397 -200334
23617 -200334 -301813 81863 182946 232827 281932 196169 49135 -97303 -108680 -200114
23607 -200114 -246036 -93499 -7302 -230700 -184559 -133816 -1791 -127337 -125082 -220927 -415479
23596 -415479 -421619 -135706 80784 58709 133033 219666 319211 210267 341449 460922 132628
23585 132628 -84993 -163636 -104750 -173019 -202120 -316934 -141132 147617 208164 283121 435057
23574 435057 366398 279285 64298 85260 184174 268146 73888 99116 -98882 -99018 89088
23563 89088 228098 243312 307319 434794 278125 -17476 -115492 -119647 -108634 -335625 -292203
23552 -292203 -165434 -58377 83347 145005 252501 110570 -46801 -189166 70440 45618
23542 45618 -314028 -337409 -224599 -194230 -119345 170257 98290 -94820 -135791 145307 304439
23531 304439 167345 -3546 -135295 -43609 64608 56790 -22446 111493 227371 68805
23521 68805 273583 312140 101717 56392 78174 199429 -78377 10265 -16541 -256101 -312845
23510 -312845 -96028 161921 235249 139958 -167641 -606627 -633123 -452991 -190493 -31635
23500 -31635 5263 156970 188417 32175 -281938 -275311 -96692 -20038 -33893 154358 334124
23489 334124 123204 101829 226532 281014 104643 -61420 -23903 398402 640145 534059
23479 534059 136718 -332357 -363655 -285612 -363675 -270642 115131 86326 139614 -20348 -13339
23468 -13339 -217406 -241973 -222258 -133715 29070 92126 104700 118168 98842 261265 330408
23457 330408 303739 107949 -188054 -112440 -82221 -237127 -355566 -250954 -53179 -45495
23447 -45495 -71557 -182106 13435 -89857 -174442 53172 -69141 -21143 7971 -79319 -150410
23436 -150410 -6938 248333 393946 224490 -8807 -207703 -302112 -310155 -464966 -320044
23426 -320044 -102251 86279 222869 32160 -121297 -134572 14966 16832 -123370 -297137
23416 -297137 -120244 240262 329610 149026 14875 -93849 14017 169222 62563 109287
23406 109287 16347 -81314 -190236 -99919 -81620 6823 149279 238943 91576 -35955 -204672
23395 -204672 -174533 -160820 8293 -113752 -225949 -235410 -432676 -512453 -351035 -238875
23385 -238875 -114470 -33107 6501 63711 -80143 -267256 -563076 -345186 -259563 -266984 -84899
23374 -84899 160145 381211 297834 323996 387810 6068 -145834 -384867 -399138 -271322
23364 -271322 35847 130958 -189538 -234289 -99086 -396005 -443908 -248274 -102376 -39191
23354 -39191 12824 35607 -135229 -165597 -210507 21365 33132 44550 -112964 73880 -63387
23343 -63387 -170653 208822 43749 -168380 -117814 -204628 -346395 -216586 54252 -45463
23333 -45463 -113635 -116919 -123002 -91815 114758 337615 214058 314330 526733 304486 34821
23322 34821 148167 283287 154128 -8386 -115692 -69031 23005 157232 264075 134926
23312 134926 -234932 -302849 -138995 -46437 106324 149706 192575 208480 206698 345759 375764
23301 375764 149481 -71540 -228557 -391759 -440523 -318733 -376470 -350769 -73540 250932
23291 250932 336186 281159 132187 134302 34472 169398 127245 47748 -232290 -96619 409549
23280 409549 544592 344347 238013 185379 9679 134153 309399 224496 474662 560245
23270 560245 153900 -14394 75521 105473 232785 206738 284729 274593 300890 605868 507296
23259 507296 344644 462221 398990 235838 159567 63893 -115215 -113113 -313300 -173970
23249 -173970 29546 198967 134834 -25303 143834 253083 109501 126203 195095 235035
23239 235035 82581 -88673 7462 -93733 -190442 -335010 -77033 152814 50598 171954
23229 171954 114973 -186435 -223691 -159479 -212058 -414262 -214712 114672 330110 178246
23219 178246 -12458 99072 -21068 41694 -49376 -224056 -286596 -129769 65947 -14071
23209 -14071 -212988 -215618 28695 185823 58065 39719 125723 -74080 18262 248633 248798
23198 248798 55802 228898 256784 342428 211460 214438 273489 165223 -117360 -85659 -127406
23187 -127406 -357239 -206291 63217 252128 198679 229943 203723 147399 167127 105065 408692
23176 408692 283057 78375 -55010 -167310 -111387 -139752 -31258 101213 -62355 -192300
23166 -192300 -114419 73603 165807 -83356 -163728 -222157 2666 134488 -35109 54331
23156 54331 53193 -87437 -156056 -15412 -136040 -384154 -348653 -151664 -145480 -325045 -319943
23145 -319943 -214825 -129047 -42802 -98606 -106094 -73679 -72210 -259653 -302265 -334896 -64470
23134 -64470 157247 108371 69882 -197226 -461920 -313769 -188575 -285605 -487656 -227310
23124 -227310 -40823 -14690 -21891 -41277 -162374 28239 179186 155602 32347 -137084
23114 -137084 -57547 4150 -191399 -152427 -45463 -17562 -10620 -81084 -82815 -90096 -92410 -10992
23102 -10992 -17613 25549 125647 -19346 -110425 145152 182659 97317 93960 -7208 -150026
23091 -150026 -269021 -62014 -77851 15061 68425 58761 117619 -87452 -149384 170906 434011
23080 434011 608945 567226 154848 -66453 -199063 -567723 -419452 -255428 -286278 -73654
23070 -73654 -129575 -113783 -169470 -92774 -92409 -84923 -176826 -463373 -799996 -518755 -345891
23059 -345891 -176972 -60972 -67609 -309162 -434636 -301230 -304195 -42144 211970 -5906
23049 -5906 -365485 -378440 -177302 -277293 -199638 110843 181313 205498 186730 273608 392994
23038 392994 331855 322256 85938 43415 -22337 -61494 42197 -43083 -182479 -129873 76654
23027 76654 324039 215026 41168 -90078 -417434 -489008 -371910 -369309 -378772 -267330 -266940
23016 -266940 -333596 -352611 -153928 -73135 60126 252423 160463 -156462 -271907 -1619
23006 -1619 148087 -145390 -329463 -224012 -46388 -105610 -246335 -293237 56296 28206
22996 28206 -64653 -208389 -307955 -180497 -34240 -72162 224436 241906 106403 113347 309314
22985 309314 351005 201989 58720 -37643 -281238 -424040 -487658 -381481 -156271 -105410
22975 -105410 7245 133934 -32035 -165163 -110811 -150254 -25898 187808 661544 649002
22965 649002 485996 371540 378754 214917 44444 225443 146409 -164374 -213384 -40902
22955 -40902 34203 -172841 -280489 -385477 -660426 -629539 -452381 -273790 -353691 -318386
22945 -318386 -401440 -182977 -88953 -397115 -601820 -591078 -359435 -361860 -209914 -321270
22935 -321270 -619815 -752519 -608897 -254099 -125787 -32911 -3012 -75221 -389711 -720643
22925 -720643 -494645 -450001 -601720 -738782 -621197 -339858 -139483 -184488 -228749 -256139
22915 -256139 -142271 -151330 -449473 -545725 -276666 -236247 -139132 19737 42389 30757 -52441
22904 -52441 -163434 -130573 -35752 -170471 -304594 -39301 -119091 -209779 -158331 23089 17374
22893 17374 -130914 -159199 -135075 -286793 -163985 -89242 -203829 -373708 -340740 -270901 -112731
22882 -112731 2509 196789 323640 202533 253219 352945 439062 155912 -20258 29211
22872 29211 153236 183179 48995 -7944 -239873 -337329 -138922 84944 256907 267430
22862 267430 230877 227058 80391 70907 79361 91581 123859 -155916 -36391 102727 -103657
22851 -103657 -91672 14289 132783 188235 402416 193078 -171785 -174244 -125012 -284933
22841 -284933 -339810 -250223 -267120 -124340 52116 3341 225266 162097 38277 67673 -295369
22830 -295369 -324122 50113 -17431 -85880 -45019 132220 267539 371483 284522 35782
22820 35782 -189255 -70296 117965 315501 440349 146978 68463 214649 -35798 43596
22810 43596 110242 -89521 -247766 -167523 -183245 2244 62195 -174910 -245319 -154010 -210181
22799 -210181 -248902 -393878 -394717 -221536 -107058 118424 37842 -82652 98541 101416 169574
22788 169574 298248 248961 387040 369007 236387 428701 254589 26997 -37989 -152559
22778 -152559 -188022 -121362 -296499 -207957 54147 261463 319986 367311 54088 -157618
22768 -157618 -117296 86894 2859 -42603 -177350 -123843 108145 -29740 -25664 -71683 3108
22757 3108 164713 287573 78503 204641 142790 270889 482370 333917 140867 180989
22747 180989 -122812 -28230 -17832 -98150 -80476 30007 -74109 -28874 55498 19058 -7051
22736 -7051 -103420 237155 276490 87476 154454 253310 317852 45329 -92747 -47282 -124429
22725 -124429 -48929 -71082 -270136 -376885 -431614 -498580 -508611 -145252 -153694 -485046 -520601
22714 -520601 -121869 253167 308014 253682 112646 36016 165631 335613 586158 449497
22704 449497 312334 209708 20855 32446 224253 225228 111578 -23891 40382 153986
22694 153986 61267 117186 135465 -38332 104998 -56808 -151888 140137 322842 233236
22684 233236 58280 -231692 -122529 38220 -49103 56706 424894 394437 113900 171040
22674 171040 115214 -24273 17980 264174 391140 405313 324364 1281 -319914 -488197
22664 -488197 -448427 -363608 -290262 -336180 -361175 -395262 -322218 -285856 -216299 -28599 20959
22653 20959 -171105 -495086 -460585 -274676 -185490 -122449 -155659 69401 228018 174005 134092
22642 134092 466585 702098 681844 356129 52183 89406 10193 -27134 97417 -135873
22632 -135873 -179125 -265033 -276300 -216656 -151796 -150347 -242786 -87587 -159612 -129759 -454386
22621 -454386 -414784 -139167 105262 250689 522387 695832 467255 -49787 -133293 -37247
22611 -37247 170232 214611 292244 354708 176737 -98629 -79932 174651 452940 346371
22601 346371 38071 -56597 -46636 8634 -91221 -67660 -4986 33699 -38535 -157238 -169391
22590 -169391 -222386 -242374 -201652 -65197 89190 -218140 -322566 -151641 -183170 -203382
22580 -203382 -319264 -355569 -536229 -512747 -369723 -159375 -270818 -175514 129434 106681
22570 106681 -120628 -206630 -161693 67415 -35323 -119285 -157686 -190125 -180526 -65086 21333
22559 21333 172525 54316 95433 -5996 63869 -289356 -490153 -486902 -439611 -111071 203366
22548 203366 262427 336257 238459 289893 122422 64015 229097 292017 356761 166772 -41146
22537 -41146 -257985 -271120 -398253 -516946 -320640 -316057 -169395 -79683 -39015 -17408 256979
22526 256979 352602 192814 182852 108757 -33541 -280351 -211515 -202363 -178421 -108332 41989
22515 41989 216754 379772 435206 400518 378617 145017 -32598 -173627 -5091 -21377
22505 -21377 -150528 -19753 53661 -67372 -283340 -352774 -339043 -72607 74611 31696
22495 31696 16852 53430 112024 77776 52732 241115 231824 111963 183541 127517 -7192
22484 -7192 -52284 13859 -202735 -426493 -330876 -391550 -509311 -281644 6634 14813 90760
22473 90760 34951 24515 48706 182213 174589 160793 20075 26808 174353 170094 204273 -75407
22461 -75407 -191222 -246758 -349175 -343648 -349784 -205914 -14411 71399 168593 154824 182237
22450 182237 71782 -25529 127748 238636 310304 271199 234572 106515 -21216 -227766
22440 -227766 141056 412456 496278 293937 351355 397988 178988 192857 12695 -6103
22430 -6103 -111966 -223278 -278131 -81351 -85491 96844 96855 -59642 35342 49278 248407
22419 248407 463228 349645 53892 -168406 -110523 -216306 -205575 -231722 -200973 -5239
22409 -5239 32659 255875 348889 204556 214142 185935 49767 99264 45222 75905 67672 94931
22397 94931 -26620 41922 -6274 -10888 215394 115931 28973 -128331 50003 -7183 -53263
22386 -53263 -340130 -368838 -96851 -121924 -9416 60057 103397 47598 -32478 95154 271849
22375 271849 215487 -65483 -128277 -142922 -170396 30341 225806 -82273 -398307 -374389
22365 -374389 -244650 -319840 -382957 -416600 -364984 -199207 -132971 -183422 104291 119778 -85476
22354 -85476 33324 -184159 -235415 -419523 -451642 -331556 -303962 7821 70584 -180306
22344 -180306 -142281 -242285 -224212 -393833 -235073 99711 72488 115683 157122 128052 27241
22333 27241 -38004 206705 154494 -170244 -217929 -65061 259693 242853 238215 106382 123895
22322 123895 -14635 68610 85257 -17675 -38157 -8832 80904 71437 -15242 9327 159741
22311 159741 369462 495639 455445 249091 -1856 181745 387958 579263 715541 725382
22301 725382 484311 411489 334691 230785 50933 -243258 -12767 101180 -175631 -303481
22291 -303481 -203272 112597 162128 293204 277069 333270 298829 137495 411966 393707
22281 393707 353289 246417 137775 220902 356542 338016 180019 224203 309043 212400 187469
22270 187469 100716 -227088 -29183 -49187 -8930 22330 -27682 -19582 -109682 -196211 -140317
22259 -140317 3232 135863 104786 68039 167906 384202 52127 -230292 -222062 -148556 -13590
22248 -13590 -125871 -166842 -280385 -256529 93189 229162 62858 -21415 60644 156854 101558
22237 101558 -71282 44795 230554 66370 6159 137123 68516 -73445 16281 11939
22227 11939 80667 -39764 -109303 -235842 -231195 -176187 -29672 12806 46029 -117403 -193823
22216 -193823 -204371 -302753 -365369 -276337 -253335 -329216 -293100 -224000 -514172 -513350 -188687
22205 -188687 -146220 -112949 164580 303324 244974 37763 -27078 -84952 213187 285135 238759
22194 238759 158523 -49156 -31429 -36089 65856 149059 96477 -119390 -227690 237678 352035
22183 352035 398810 215911 -293549 -457541 -59266 59552 46070 -72271 -170951 -189674
22173 -189674 -54053 -32026 -188641 -219541 -285463 -246262 153961 523993 355084 132221
22163 132221 82597 8017 -144477 -242886 -155929 27173 453721 543722 252135 131546
22153 131546 287480 262955 439755 387160 216152 -43861 -106740 108851 133170 5332
22143 5332 -262773 -259605 -73937 -195163 -221780 -179525 -153044 -29715 -328884 -389266 -271201
22132 -271201 -330891 -314073 45585 157713 25015 248992 257885 269502 94005 -65708
22122 -65708 -256423 -146052 -132667 -4869 -173522 -51305 -60375 -14949 142092 223909 370647
22111 370647 161798 239324 175866 247801 276766 431919 334618 271592 285585 -65548 -144870
22100 -144870 -41290 147650 118781 -128213 -306986 -382822 -223834 -161659 -23475 234374
22090 234374 152578 145412 -58112 -222202 -324365 -322791 -123634 101293 288810 54261
22080 54261 -195761 -389465 -322640 -214190 -110003 -162709 -13704 -32429 -285108 -375636
22070 -375636 -230731 80169 321496 400607 424890 467545 193459 -207810 -299815 -171437
22060 -171437 94516 152869 174004 161354 58326 -108127 -122550 47512 177221 185097 254777
22049 254777 419286 287827 89888 -11779 18221 139058 143809 63124 -126896 -197490
22039 -197490 -307025 -126546 -182540 -234397 -207195 -100247 -160081 -256711 -391953 -398297 -239321
22028 -239321 -79449 -26669 -104000 -7940 92843 -26797 -199260 -274877 -189637 -250548 -226034
22017 -226034 -82745 -182082 -145406 -61441 -257401 -113850 -67860 -75346 -61368 -31867 -235692
22006 -235692 -417414 -266720 -139393 -32821 76756 81005 145149 180839 467639 342066
21996 342066 462692 394668 305033 289532 254529 71541 64063 69965 -4209 -118445 -35895
21985 -35895 -49002 -74822 75966 -112965 -277055 -352971 -268340 -175393 -10867 67735 -1605
21974 -1605 142000 214293 53516 -130667 124096 225488 355149 248571 286264 263868
21964 263868 274827 204986 240880 531278 528446 302253 96564 -48749 -128399 23797 15892
21953 15892 116870 55997 -46894 -276336 -259715 -86565 -251305 -182750 -142828 -31739
21943 -31739 -49159 -42338 -1957 -125846 -174432 -245110 -360109 -156189 17077 -16685 -86706
21932 -86706 -186803 -307539 -84045 23894 101044 65962 67927 145346 264710 303570 192487
21921 192487 266569 217506 52037 5662 106559 164900 133691 -64238 -133326 -156028 -21388
21910 -21388 -133330 -290057 -254420 28623 46516 -58958 194760 241130 279974 214177 259821
21899 259821 277514 311201 180979 -69533 -192879 -54374 70031 -70971 -12848 190078
21889 190078 296255 103895 103353 43932 -3721 -272500 -161170 100131 266469 306917 188186
21878 188186 -34754 -991 -196925 58269 315821 380334 -203635 -442369 -359736 -38739
21868 -38739 -107821 -203777 -285372 -107498 -22924 -52765 64857 197934 151667 15323 -28677
21857 -28677 -38293 -80664 95140 82583 338402 351365 130078 -160043 -142898 84762 207786
21846 207786 -98133 -287295 -124420 96049 204854 160286 184780 -40806 -229404 -25614
21836 -25614 79680 186178 231660 42262 -49318 -60513 -108733 -167968 -394790 -348492 -367759
21825 -367759 -60816 73049 236983 -28780 -113439 -250413 -146116 155740 49547 119789
21815 119789 59698 -175143 5832 154371 98219 63638 -99496 -224544 -208143 -118221
21805 -118221 -73250 -81141 171855 172751 47060 94889 61399 -128534 -95349 -17702 -85360
21794 -85360 -218132 -122831 -159540 63638 133208 110547 -179003 -214119 -168594 -61809 15933
21783 15933 84091 -66340 -222029 -474107 -449748 -354605 -126909 -19847 -93107 -113105 -66213
21772 -66213 -277819 -221319 -13646 -80612 -268073 -278663 -299786 -377674 -337834 -177940 -104940
21761 -104940 -98320 -73677 -35328 163056 69057 -297254 -291926 -287295 -158528 29039 200055
21750 200055 16701 -143674 -173189 -223182 -151798 -158674 -364654 -344752 -476778 -786711 -724068
21739 -724068 -668218 -623680 -219712 193085 160481 151504 148126 279969 267762 78646 54638
21728 54638 39361 -53907 -26415 46059 116867 -88205 -315921 -390101 -411284 -461458 -486980
21717 -486980 -468447 -300204 -191779 -284525 -350773 -152248 -344306 -116491 -50892 -289567
21707 -289567 -421094 -211112 -201943 -279720 -417123 -470041 -238555 -373451 -651778 -725690
21697 -725690 -547024 -371103 -300575 -82742 -315355 -603146 -530481 -432003 -389019 -269622
21687 -269622 -198171 -205249 -55756 -596 -127267 -410782 -479847 -492197 -384281 -238621 -433307
21676 -433307 -332975 -261561 -243680 4783 35725 -247060 -324947 -212502 -130278 -82844 45762
21665 45762 139610 164213 151337 -151713 -70133 231383 128099 221242 294893 74404 16171
21654 16171 -95351 -253381 -228355 36741 267989 213843 293937 365869 373956 360983 204815
21643 204815 91383 104928 -67250 -90188 68331 -2594 -8119 -19149 -66081 -125502 -217582
21632 -217582 -325309 -266292 -116768 -98189 32700 9274 -145042 -257135 -254814 -283599 -269942
21621 -269942 -30271 33303 -70322 -39540 -84123 -166186 -272291 -270249 -69922 121925 483288
21610 483288 559147 499668 199184 -113356 -226149 -207005 -225268 53132 -98422 -301761
21600 -301761 -167436 150549 205908 340670 393959 205334 -7597 -15809 128971 208484
21590 208484 320355 328297 185994 242786 85420 -169330 -115781 20362 260537 333772
21580 333772 198775 50003 -500318 -613667 -342434 -246445 -514691 -275233 -115200 -200546
21570 -200546 -296473 -296450 -84043 104170 47736 67564 280793 151617 98745 293832 355984
21559 355984 395988 281569 247855 216417 -57778 39346 196346 268142 93009 105815 18555
21548 18555 3722 -202844 -179670 -239016 -107854 34891 70943 -35807 -156625 59056
21538 59056 186469 255322 182792 397962 380772 111725 -81502 -84749 -55195 -96078 -22368
21527 -22368 17176 136995 369330 197593 292876 304817 536230 458116 349287 378661 200899
21516 200899 -154275 -192981 -156273 7844 67703 21023 88951 87294 -48499 -322571 -339044
21505 -339044 -159264 5490 -163523 -209129 -269926 -197265 -6335 301379 388282 388182 266247
21494 266247 124790 271080 463482 471111 255522 172347 134552 56954 36713 -171063 -357165
21483 -357165 -183169 -257695 -191643 125425 -95 -155956 1258 -51840 -206073 58619
21473 58619 317388 345092 11699 180240 85588 -124451 95747 325928 244996 224839
21463 224839 12101 -91900 -342459 -396632 -262235 -235458 -267399 -43035 48154 -260593
21453 -260593 -225190 145484 153990 -24094 -252491 -112299 -236980 -393364 -443583 -402350
21443 -402350 -271489 -391708 -335967 -25303 264917 326941 369849 375174 307870 38341 -92943
21432 -92943 -287401 -500584 -432544 -223357 -207434 -242437 -276909 -87412 -37345 -206056 -399124
21421 -399124 -506761 -408449 -40305 41434 -141259 -206061 -265381 -218113 121926 377404
21411 377404 260324 219417 184743 42847 -123253 -307521 -282306 -213983 -151672 -64175 44284
21400 44284 -33809 123186 328546 272817 -59383 -90041 -10533 63877 344775 315818 226129
21389 226129 233905 382554 221309 -149219 45369 23700 -155148 -44379 34241 222977
21379 222977 50185 -275376 -523643 -510842 -364305 -183772 -199209 -373110 -394677 -375455
21369 -375455 -141995 -123841 -145779 34651 247688 335059 267505 252047 173438 -82790 -208147
21358 -208147 -30984 374107 228451 96492 45483 24407 1792 -43234 158475 168216 -167514
21347 -167514 -262076 -374507 -212552 -204292 -60575 88650 -38090 -225364 -109883 27066
21337 27066 124023 169623 42073 -68997 -214439 -403418 -330801 -330386 -241028 -106706 -161594
21326 -161594 10698 41533 293090 137503 7396 18119 80872 288442 177576 -97247
21316 -97247 -273569 153439 533374 549741 179740 -8840 142044 238469 -83988 -281609
21306 -281609 -260207 -42515 336727 430532 347108 213380 167873 95711 -28878 -250653
21296 -250653 -477753 -374671 -172800 2794 -84401 49619 300605 383528 391908 420016
21286 420016 283375 212632 98033 1256 -253784 -538365 -317002 -235454 -231838 -246503 -309529
21275 -309529 -295807 -279900 -137651 -25182 -11459 148307 328677 236626 144082 -71773
21265 -71773 80075 247254 -17256 -281802 -303562 -139643 -71882 -113205 71873 92226
21255 92226 98861 59457 -61318 -202555 -9565 127155 -79270 -394542 -484188 -394011 -103681
21244 -103681 -69401 -73623 39217 19568 -64934 -332543 -339563 -78316 27382 192768 123389
21233 123389 -7213 -168537 -243184 -96783 -157437 -120836 -102935 -171583 -260330 -127527 -138112
21222 -138112 -291852 -238686 -144558 -380511 -314895 -186107 -215079 -321684 -326384 -167055 -142128
21211 -142128 -246618 -307872 -296102 -344992 -285156 -369783 -273799 -78432 38763 108888 55222
21200 55222 -37647 -24174 48678 174663 307676 245414 -158883 -154007 -115085 -114370 -338782
21189 -338782 -78733 347149 361185 133883 -83438 -458569 -246268 331501 504089 480316
21179 480316 284913 367801 434751 230437 138526 -39270 194823 380280 338578 170562
21169 170562 170170 77170 -54983 -91790 -191442 -224089 -285009 -159662 -1664 15743 -6706
21158 -6706 -14452 241646 333388 105230 101375 92682 59325 223241 235771 188020 14791 -129220
21146 -129220 -247398 -276905 -111076 43839 -2069 -183143 -96957 -150752 -113054 -387074
21136 -387074 -450728 -319013 -411662 -534371 -326450 -3956 9926 -215902 -213943 -171981 -107153
21125 -107153 -269436 -237750 -250184 -85797 99819 215914 102849 -163040 -317006 -326670
21115 -326670 -119406 1085 -179520 -45073 -33405 -43934 -176909 -261649 -144795 -56925
21105 -56925 -118727 -157752 68840 105238 -197185 -447916 -400892 -313558 -179993 -173019 -94477
21094 -94477 -59808 5328 114035 35781 -37729 31167 70244 196928 156418 -21406 -60861
21083 -60861 -161951 -189443 -18268 306980 236172 47912 105714 -44450 -177114 101663
21073 101663 253574 326023 330725 236098 81565 -173785 -53299 70333 -134264 -218949
21063 -218949 -135121 -30017 37630 -106433 -155954 -11603 -136479 -360635 -290862 -107160
21053 -107160 -44354 -90201 -26715 117642 243056 155709 273363 173111 21094 -241222
21043 -241222 -316979 -88030 224188 248183 289154 133060 -294800 -182497 -360872 -276257
21033 -276257 -305524 -262284 -92782 298105 302452 148735 -137684 -233711 -206950 29322 75419
21022 75419 167073 145279 98971 100632 268066 143940 69524 -122440 -288377 -56286 293993
21011 293993 181618 188807 255195 148347 -182462 -247777 34205 -55094 -9272 -12979 -182128
21000 -182128 -62024 13778 -170526 -259004 -273757 -315457 -175129 11495 -11165 -91336 54516
20989 54516 45918 -150784 -324140 -533396 -459725 -320599 -123142 -112674 8176 72819 191413
20978 191413 110992 -20644 -80460 -69542 281226 326821 50217 -209351 13753 -2224
20968 -2224 -43809 -202557 -84791 -39091 -46132 -59871 -150008 616 -114092 -242353 -390758
20957 -390758 -455033 -306879 -297517 -305488 -353050 -367003 -546211 -353386 -155025 -93337 -4697
20946 -4697 -74244 -31962 -118063 -108640 53010 129142 157382 155878 215593 -74307 -55111 -60059
20934 -60059 -92260 39897 87172 19373 -118442 -145039 62568 126429 -151621 -342137 -321060
20923 -321060 -314401 -101638 356871 352233 274570 62808 -57193 24045 160528 181222 101980
20912 101980 48833 135271 -125602 -426617 -551671 -389928 -25139 205142 74607 -26595
20902 -26595 -190025 -225176 73961 24948 -101010 -82304 -140906 85542 117262 14650 -8722
20891 -8722 80907 120101 -24090 -55606 -141357 -249969 -166384 -57183 -159992 -200259 -96387
20880 -96387 -26044 115958 109989 15500 28108 -166614 -258112 -206115 -61760 -3752 17887
20869 17887 -38732 -99167 26462 88844 -85055 -137471 -116972 115891 77304 -70581 -222606
20858 -222606 -345861 -56776 124887 113563 103821 -42472 -107771 -77567 -27608 -284411 -190783
20847 -190783 215121 97899 175941 220987 286461 424335 333959 142043 -79916 -399186
20837 -399186 -605247 -374364 -10015 279313 189811 46843 -73840 -121035 -34055 -119379
20827 -119379 -30064 78818 151055 162027 58950 -38674 -57788 -11112 -183526 -227896 -120175
20816 -120175 -152915 -239202 -270002 -489912 -677749 -451942 3753 332859 363101 304941
20806 304941 -67881 -279420 -107690 -180088 217536 404123 331735 19519 -40253 -144267
20796 -144267 -431817 -486805 -300773 -194735 -131556 -50807 53928 -7451 -365258 -581956
20786 -581956 -333103 -4841 235696 251981 388681 211721 255817 -84547 -195723 -28621
20776 -28621 -46853 -321799 -558837 -261097 53354 311092 134294 -174866 -227995 -268313
20766 -268313 -348135 -320243 -168016 -86238 48735 145955 -10691 -4014 132641 186679 100112
20755 100112 -101008 -245431 -320056 -366889 -361279 -285910 -357027 -272345 -3559 -16335 -189720
20744 -189720 -107668 -8787 11236 -38414 102386 218045 154924 153052 24528 -325996 -329581
20733 -329581 -60670 -232204 -312806 -122788 -286072 -76396 -125989 -64037 -53359 -204124
20723 -204124 -349607 -481545 -341640 41225 93340 -105503 -175275 64801 189895 169388
20713 169388 171237 -77374 -244925 -394338 -340237 -411713 -414977 -231341 -126417 -168481 -488228
20702 -488228 -549174 -352634 -194402 -225460 -223447 -184059 -146333 -8609 50558 231900 404613
20691 404613 332820 199672 -72601 -142390 42127 108792 102030 -61582 -11420 -41148 -33597
20680 -33597 -184710 -179473 -116176 -155036 -231944 -219531 -358367 -284415 -137976 -15564 162020
20669 162020 7300 -150647 -168873 -156820 -206668 -128573 -35953 -81674 -85597 -177930 -136038
20658 -136038 96118 234311 478794 326287 140369 215615 -44283 -106757 -238896 -178995
20648 -178995 -80115 -81912 11936 205422 234451 137049 193511 56517 -216092 -302359 -79239
20637 -79239 -55220 -43414 172490 355760 317551 69119 -187032 -221887 -211921 -301081 -104972
20626 -104972 17260 -120700 1263 114026 -97942 -81519 -183803 -326213 -404659 -373962
20616 -373962 -417689 -300448 -127974 -281718 -555401 -542427 -310899 -211874 -72480 -37556
20606 -37556 -180602 -245827 -325490 -619120 -338127 115763 312541 330006 400990 467514 577985
20595 577985 314563 2602 -77154 1722 109852 153039 205798 44460 -114809 -98510
20585 -98510 -10728 78638 17414 -5535 228971 297128 500465 517488 162354 -161745 -251802
20574 -251802 23189 75339 49324 164799 320105 270396 148634 138629 84000 -37988
20564 -37988 18836 -205365 -157761 -257474 -327255 -444532 -583497 -606460 -178215 197144 241116
20553 241116 7851 -187442 -452423 -270530 -308189 -320017 -203038 -148989 -195555 -256784
20543 -256784 36268 -91390 -166793 -13586 -80656 -180365 -308159 -524085 -332438 -187807
20533 -187807 -4740 -161119 -238717 -305485 -335140 -77170 222310 154341 20276 -5611
20523 -5611 -148688 -319899 -212126 167639 279906 221545 297003 58564 -27347 3513 -82246
20512 -82246 -254493 -237742 -224499 -386553 -511771 -381095 -418051 -352481 -312007 -205547 333777
20501 333777 492930 427573 226776 33256 -9758 32391 274485 205761 164624 371518
20491 371518 439730 449714 166396 -305916 -418405 101651 185190 29499 118254 4082
20481 4082 -171850 -170303 110340 282611 157080 53390 24684 54601 150941 -128854 -203538
20470 -203538 -196030 -59510 119839 186446 33070 11340 -159112 -498720 -513713 -659195
20460 -659195 -612898 -471158 -358628 -326952 -146458 -33942 -230461 -302954 -106940 -168302
20450 -168302 -59172 284297 305070 176126 199921 396238 130404 149774 194279 74689
20440 74689 44037 -27775 -163377 -301573 -179033 -77332 -21073 -83298 -229231 -286962 -182506
20429 -182506 -466715 -595993 -349749 -387078 -239451 -92482 -183195 -436635 -540091 -320431
20419 -320431 26392 71038 -69571 24545 -135032 -203792 -212162 -176661 129851 314346 187966
20408 187966 -105572 -326121 -466315 -321620 -228754 -367994 -503944 -533139 -400838 -522479
20398 -522479 -573030 -242711 1558 72132 -37015 -151027 -147324 -172597 79614 147887 137701
20387 137701 92808 32321 201151 342389 -24374 152574 234326 201017 329475 513689
20377 513689 450283 420829 104260 -140164 -70293 119625 186565 324000 430474 423489 329291
20366 329291 136561 -114506 -267102 -121787 -177860 -77998 -13361 161784 340688 188761
20356 188761 1192 -144996 -20761 -150981 -278630 -174416 -270420 -129207 60987 64756
20346 64756 91797 63233 -104058 -18264 -49472 -91175 178949 27547 -175336 -111227 -3780
20335 -3780 -93476 -92819 -9979 220072 -43011 -80525 -54494 -73938 -96126 -87643 -90061 -79895
20323 -79895 -61947 -38216 -53927 -68150 -115704 -113770 -431095 -440648 -249220 -190476 -189966 -221284
20311 -221284 -50553 1825 75130 -51338 72646 -33917 8052 25289 -91513 -254043
20301 -254043 -125796 -39578 -141381 -78877 73423 56264 132104 78837 -116895 -139535 -322376
20290 -322376 -202262 384540 407015 256621 102302 -203050 -274668 -359159 -357157 -188931
20280 -188931 -213878 -188905 -121645 -102738 -117336 -153807 -216664 -29826 164061 79605 71748
20269 71748 -140181 -192055 158077 266911 239560 406254 505152 239723 109978 71049
20259 71049 183265 182080 134170 243724 -18056 -147300 -50299 115036 169961 105785 -9642
20248 -9642 -96372 -201270 -132723 -271092 -328644 -404777 -423921 -142940 -153498 -383035 -540739
20237 -540739 -428844 -391235 -359152 -433491 -231787 34652 113219 -78908 -377291 -371816 -298511
20226 -298511 -212234 -48589 -220596 -308753 -204623 -27625 33364 -32979 -245744 -27895
20216 -27895 -273796 -365877 -181383 18936 -49852 13733 -36391 -250547 -222591 -154552 -346994
20205 -346994 -229856 -220776 -241752 -242557 -223826 -28998 49329 7389 -47145 -172048 -443150
20194 -443150 -528811 -464650 -411819 -346011 -305018 -95732 -173134 -260882 -323692 -293346 -291742
20183 -291742 -271930 -335120 -253841 -274565 -444981 -458152 -424470 -333058 -251788 -397699 -440437
20172 -440437 -285995 -158658 -107748 25054 38503 -95961 -153891 -86890 -59646 -91763 -304862
20161 -304862 -351424 -258272 -230333 -296622 -256475 -170399 -165352 -46705 -116426 -157094 -315176
20150 -315176 -384637 -308562 -372424 -385114 -285260 -75234 7100 -141285 -293970 -446779 -460412
20139 -460412 -410735 -73846 50861 194080 221367 216489 337964 348084 134262 4417
20129 4417 -62645 141156 28842 54137 129795 273281 365199 383300 350578 392243 332046
20118 332046 65542 -208566 -44832 337789 627357 388009 269696 380773 501777 299398
20108 299398 -32347 68768 59168 38490 -115550 -180132 -65542 62536 -121440 -237277
20098 -237277 -147418 -141424 -196320 -99297 -113488 11817 131572 -4940 108484 144942 -40677
20087 -40677 -164729 -162536 33599 41359 68383 137655 169091 -94666 -293353 -81192 232210
20076 232210 244808 308140 357893 275334 243067 104383 271260 417243 589734 637165 443793
20065 443793 156161 84539 66418 81093 308067 357191 321597 300278 524074 690336 387783
20054 387783 218435 99515 123587 116811 -84416 -290917 2498 185348 191766 260890 338195
20043 338195 124769 -15034 -23325 -398119 -462485 -119154 -40572 -67026 -189763 -235288 -29807
20032 -29807 168784 138286 38783 83526 208131 68817 -57373 -68939 118247 322878
20022 322878 205802 133562 92402 -42513 -96269 -64239 -60961 90223 191768 130465 10417
20011 10417 -166823 -209891 -228275 14762 133104 138422 245873 133553 63880 -35654 206976
20000 206976 432677 327220 59409 4053 113783 -140579 -219197 39564 110829 103171
19990 103171 -28166 49335 75235 183573 -1621 -124335 -8315 60680 200913 127361
19980 127361 231777 81630 -88089 -218193 -140215 -79824 -280316 -183142 -128398 -430276
19970 -430276 -349508 -129564 -38358 190 -18869 96237 256228 404970 672965 398664
19960 398664 -3621 103695 261393 74291 -116283 -150326 -117428 -142702 -89204 -165679
19950 -165679 -169681 -122323 -76843 -91814 108216 239817 435852 416472 400100 314555 309857
19939 309857 237712 253992 84432 84519 216178 354333 161481 61490 -378830 -500375 -388006
19928 -388006 -297747 -195133 14112 -63456 -52941 -14509 930 -1962 -137597 49398 124761
19917 124761 184592 181639 22050 242264 227857 241203 274169 294891 205657 360813 293399
19906 293399 -17311 -134558 -60517 -273402 -280148 -166982 69738 44145 -109863 -62136
19896 -62136 35182 62083 -27330 -139923 -169413 -185879 -205567 -88033 -353488 -142833 66922
19885 66922 2887 -68678 38414 -181479 -149046 -172081 -335574 -409554 -336759 -260698 -136035
19874 -136035 -46153 164559 132778 -142752 -144986 -9434 57540 35517 -252609 -339587 -379692
19863 -379692 -345858 -206799 235406 207370 150923 170173 101978 -146773 -116270 -126768 -174172
19852 -174172 -50261 152660 49704 177657 296251 158438 -72471 -44400 239316 508872
19842 508872 303577 198761 400237 396033 291736 386070 189948 149961 212624 173611 141750
19831 141750 46495 -255957 -451661 -424725 -71664 -29842 -340164 -372339 -43402 106203
19821 106203 -71244 -246226 -169936 221017 238681 30340 145192 201796 -103052 -66571
19811 -66571 192496 257353 245773 -3046 -60338 145706 222517 -70777 -17251 -140698 20401
19800 20401 39578 280016 299290 340991 295657 167979 8472 46431 137892 -37965 -229315
19789 -229315 -143658 -277363 -266123 -228238 -505197 -506238 -326152 -82273 155149 193720 318526
19778 318526 384284 296020 143232 40801 2275 192667 450876 359569 58954 -34076
19768 -34076 -171565 -182495 -5585 234769 376691 615444 858898 786975 411421 184675
19758 184675 332607 249022 56619 275139 225968 187062 87690 97366 -153327 -311737 -145789
19747 -145789 -112938 -160787 -54760 40957 -148717 -106447 -31452 -15674 225354 685782 880730
19736 880730 1071598 1021298 777735 650300 411799 178776 125522 175105 -162716 -187854
19726 -187854 25911 95054 125129 268869 37536 -300511 -649871 -675150 -376227 -191758
19716 -191758 -36283 3132 -191082 -123381 -67206 -14767 44647 -128599 -432631 -398909 -415508
19705 -415508 -351448 -119587 205404 211803 89852 77570 72199 -42414 -274259 -268047 -406608
19694 -406608 -375856 -216064 -115784 -60454 -28650 -30450 -218341 -68357 59071 116765 -20008
19683 -20008 -65227 -50918 123119 387892 266375 180499 133778 190480 133292 100028 -12653
19672 -12653 -142685 -136494 -62382 -13956 -47178 -228426 -81411 24838 243359 198542 203388
19661 203388 160329 134403 -95223 -133487 39097 103821 52737 53661 5351 30926 286603
19650 286603 276884 164358 246184 257234 -34963 -352518 -417397 -109029 105425 214315
19640 214315 82038 -276043 -347053 -323102 -108213 36353 -156742 65996 334048 356721
19630 356721 26514 -130067 -197819 -111006 -88981 -105641 -85057 -115188 -185668 -198190 -149917
19619 -149917 -59140 76280 90093 90341 -52007 -256938 -321618 -118011 -20985 -73472 -61036
19608 -61036 106076 98259 32631 -120200 -41498 120931 343233 230874 98408 -111289
19598 -111289 -43799 230507 342502 270780 104585 17164 90431 -94663 73220 301081
19588 301081 274940 285072 347254 240434 247902 35889 -146475 -340749 -139433 -128465 -269892
19577 -269892 -262007 -196615 -69096 54079 -121544 11015 165470 156512 312605 380707 48583
19566 48583 25498 13430 -84829 69466 -118716 -161670 -131691 204346 190843 -137140 -105247
19555 -105247 70496 104842 198680 91052 -72049 167229 219102 71852 -18457 4926
19545 4926 5581 273653 148685 6746 -173519 -429851 -14507 30344 -107692 -249453 -185689
19534 -185689 -184591 11377 277681 527143 513634 399783 346183 103345 -184223 -68902
19524 -68902 -29847 38333 45772 205340 227853 -216428 -320475 -19567 1343 -94700 167522
19513 167522 362570 284874 204319 62528 112479 259592 378598 333062 362086 339778 433504
19502 433504 169067 -26027 -26006 -48805 -75796 1934 -12321 -156865 -209198 -314488 -469294
19491 -469294 -390521 -131095 -195708 -231798 -39192 112021 209675 42559 -172215 -175706 210737
19480 210737 599944 428008 274765 440647 494830 315771 381760 320018 86364 145048
19470 145048 166205 -79032 -192842 1833 266325 135949 18947 -42642 -19398 115046
19460 115046 240327 376545 229010 164631 150938 -8941 -52637 -70225 12296 56849 -17754
19449 -17754 11958 167123 -39422 -360407 -407472 -185359 186560 158995 -4819 -332471
19439 -332471 -213821 -152326 66960 225918 402413 438167 609942 709701 598819 513646
19429 513646 424125 276416 307076 177266 49655 -95513 -84732 139463 269118 147013
19419 147013 76588 55317 199557 466891 443825 474855 261062 70288 46002 280174
19409 280174 531116 459236 391273 175124 169935 272947 127458 -49166 382718 300058
19399 300058 68356 -49397 -16766 154316 189570 181369 136144 308654 71027 86529 -74539
19388 -74539 -122633 130753 205302 298737 246361 142758 156689 241458 226377 332726 135620
19377 135620 -58250 29599 185453 108935 130717 201734 286584 426131 393945 368667 286041
19366 286041 178910 40207 -104985 52336 225113 274408 139977 13393 -189241 23322
19356 23322 10273 -231077 -172627 -46967 99816 119488 200134 392537 528109 511890 237045
19345 237045 -155901 -302154 -169236 -27596 167749 315001 105505 47873 184630 180395
19335 180395 138528 198793 201888 -78479 -71759 39298 191733 212718 418913 538574 389813
19324 389813 250238 41433 68153 -152574 -362820 -391694 -364064 -325396 -205390 -40053
19314 -40053 -116802 -129380 -122725 99339 143717 168442 -15336 -34542 109104 459020 649682
19303 649682 711964 340978 164380 262083 300172 125384 86298 332211 214591 149175
19293 149175 237612 263318 676872 766839 668048 246355 211821 578088 783897 813240 563186
19282 563186 724770 641681 467254 706512 687131 761213 714555 701949 756961 809947 621068
19271 621068 623616 801956 1048328 1090582 818986 705302 740942 722553 683402 896725 1080281
19260 1080281 1114471 1149233 1413294 1846788 1985738 2120347 2325839 2124733 2056117 1987712
19250 1987712 1819978 1806996 1644037 1668491 1904304 2283829 2571393 2828056 3064776 3368361
19240 3368361 4093180 5205417 6964949 8568655 9478065 9208818 8526465 8230955 8471503
19231 8471503 8743826 9150208 9820382 11414165 14067116 17949709 24130337 35019236
19223 35019236 55337309 94165135 152563210 188313589 158247100 101261769 61593885
19216 61593885 39943432 28535751 22124994 18949118 18023035 17862118 17200763 15681482
19208 15681482 14679097 14231093 14132180 14004604 13751624 13572753 14295020 16142326 19477115
19199 19477115 25337759 35263261 53542743 88676589 146729167 195538643 178874857
19192 178874857 118764837 70850234 44434743 30102295 22021183 17026782 14153117
19185 14153117 12286206 10958566 10024089 9362752 8390748 7617838 7071618 6245019 5374820
19176 5374820 4333665 3654022 3258194 2859617 2518431 2234677 1800496 1700826 1705326 1684936
19166 1684936 1581891 1476595 1532911 1496676 1729617 2197210 2345053 2230526 2268235 2459853
19156 2459853 2766790 2438042 1931862 1335397 1077119 1110188 1085921 800447 635931 649163
19146 649163 430450 464380 631162 660575 359384 508477 368713 248253 265881 206501
19136 206501 19792 93291 56249 195412 -39556 12079 61672 63814 167609 273350 292807
19125 292807 567105 582615 527329 445425 428975 321131 118002 245821 663508 807878
19115 807878 675798 500480 423069 292701 235768 139529 331272 450479 55131 -62313
19105 -62313 -63175 -1615 150342 360047 468515 379788 337962 144404 93778 316646 445923
19094 445923 392328 399653 422400 321272 332905 374435 312856 238246 202432 259027 126570
19083 126570 135999 74304 229450 508955 650541 438618 488889 493299 382911 318140 383904
19072 383904 442465 470923 575546 641858 460737 281975 319719 122417 52269 -86401
19062 -86401 109650 216355 284951 448639 200125 13563 126921 276626 489247 555328
19052 555328 433083 347587 251977 239992 119536 245190 178267 265920 188272 143756 -113904
19041 -113904 -90069 -8724 88005 14806 23347 115273 108400 118937 289182 387401 321828 261504
19029 261504 235468 -33670 -111263 148002 172609 292655 329170 113846 52558 237874
19019 237874 376812 408734 259308 141829 136987 133153 161029 136800 157294 152608 230517
19008 230517 53844 23708 168708 -14371 -312708 -104975 16234 121300 40306 185548
18998 185548 387261 166252 -75988 19836 158702 167919 43398 71243 -11799 107420
18988 107420 -46187 -34646 143804 352551 449007 456700 678247 455704 402312 437511 424698
18977 424698 258464 275046 276646 86316 194714 162777 204911 145549 266932 304395 24481
18966 24481 20319 135265 235983 167517 -76777 -111664 214326 250658 99438 202902 300015
18955 300015 405360 233566 -94487 -99399 259389 520526 338666 299028 139936 131170
18945 131170 259048 222618 418859 482484 627467 803599 951435 835192 616729 494530
18935 494530 624358 547158 212626 216066 493629 528909 591007 629912 662078 687572 864470
18924 864470 1144036 1283298 1181681 1112593 985420 682520 355854 484907 514908 305989
18914 305989 189507 311097 401124 536292 769674 1012679 882100 895661 1022053 897342
18904 897342 762611 671958 629108 655198 533622 259874 319927 520449 479951 516980 602783
18893 602783 690442 814627 718927 701176 731675 908968 1005411 1062966 1311321 1271210 1208448
18882 1208448 1024866 887321 822146 701613 621740 707676 590278 739707 909179 771699
18872 771699 688514 675903 928058 1023603 856320 651622 747653 895132 782054 910088
18862 910088 1051093 984815 1253969 1357944 993063 799171 973189 1128204 1330849 1277472
18852 1277472 1171894 1130509 1243142 1238078 1096807 893584 693554 791582 1016173 1211297
18842 1211297 1336584 1403095 1382061 1752172 1837233 1692462 1464633 1258547 1102448 1173250
18832 1173250 1072478 1019880 1060720 1152088 1276988 1547094 1838406 1963567 2082086 2300864
18822 2300864 2489447 2348926 2048789 2050878 2365595 2982008 3692200 4581018 5820416 7141682
18812 7141682 7707955 7165889 6003642 4875964 4172582 3797402 3591955 3577489 3948889
18803 3948889 4618716 5022875 5525350 5755297 6023752 6223958 6392369 6797006 7516112
18794 7516112 8558219 10752615 13457774 15716010 15600922 14107401 13041984 13223242
18786 13223242 14410330 15627009 16292653 17483926 20615092 27048412 39435210 60258935
18778 60258935 85780996 99313249 89560838 70417089 58968852 55024963 51301711
18771 51301711 46397359 42920524 39583802 37267229 38056463 43586469 52159939 59472306
18763 59472306 61990060 62262793 64979649 69169702 70055867 66219616 58234984 50063068
18755 50063068 47548736 51939950 58898794 61336917 60409679 62700684 68439527 71373205
18747 71373205 67645061 58391950 50673186 48696135 47288934 41723471 35558393 33041730
18739 33041730 34360213 36700143 35603046 32289838 30778891 33177602 39821358 50863301
18731 50863301 64227769 76038603 89436490 110466654 129247580 128869073 107071721
18724 107071721 78070569 56722824 45553983 41347037 42447969 49906968 67249606
18717 67249606 96188344 123729652 125282357 99220406 69561243 50237284 40728788
18710 40728788 36828880 33956374 28600680 21905650 16645934 13025543 10711283 9361272
18702 9361272 8932889 8822804 8624624 8408426 8466608 9347665 11229259 13397154 14049108
18693 14049108 11996715 9026572 6796467 5517237 4815165 4674013 4743920 5177343 5541543
18684 5541543 5447530 5410684 5641110 6013950 5861790 5362561 5156988 5253004 4992293 4054567
18674 4054567 3419177 3261026 3106047 2921108 2481788 2123554 1834301 1823820 1958381 2076169
18664 2076169 1968640 1986088 2000974 1816644 1386613 1040679 891087 799480 965483 982952
18654 982952 823555 747574 865556 1242213 1074543 1009158 1266709 1649034 1801808 1768080
18644 1768080 1614040 1189106 973886 859301 704512 585832 774058 1024495 1130549
18635 1130549 946701 825768 829220 961085 1152514 1161603 1286954 1077709 1030673 1106782
18625 1106782 943997 882328 813612 644613 702096 518460 575811 448760 182322 -19870
18615 -19870 73591 374389 597250 621673 574871 556693 310635 495615 610291 574706 670618
18604 670618 761468 781847 736274 745240 494514 436110 247872 305891 580534 537443 346733
18593 346733 402606 388916 345343 623639 744432 553940 349064 350388 536621 520911 589215
18582 589215 512961 576749 583336 416074 454854 424523 319518 395165 361839 394902 387061
18571 387061 335586 248168 213855 216800 328673 560542 931995 803600 490833 362019
18561 362019 402885 528979 534478 742961 632859 591731 442378 498393 422714 367914 451247
18550 451247 496216 601332 683445 899330 1018821 900829 796355 821821 791675 607243
18540 607243 577098 749732 656847 437868 338743 66200 236267 445912 652548 831055
18530 831055 865118 565846 381379 438632 465891 658714 577415 420319 523972 744055
18520 744055 808656 911261 775787 845406 926283 737944 773582 606519 487029 603164
18510 603164 749540 883036 727262 904068 1167239 1307122 1252491 1290077 1382495 1496637
18500 1496637 1573508 1561176 1891098 2163604 2305881 2399246 2433556 2271048 2132739 2196956
18490 2196956 2268350 2574245 3180297 3685105 4711066 6632956 9265248 12636503 14803938
18481 14803938 13991456 12073715 11747953 12067781 11117916 9377277 8036599 7725168 8134439
18472 8134439 9358511 10755171 10291644 8329475 6686969 5640181 5113761 5121941 5165113
18463 5165113 5574978 6025824 6911124 8314439 10756448 14013915 16565742 17313056 18580356
18454 18580356 22881130 30934016 38749162 39115874 32688927 27373396 25072416 23259836
18446 23259836 20597053 18922277 19301987 21592037 25005131 26311689 23142786 18713923
18438 18713923 16007849 15216797 16030487 18374141 22847573 29327592 36338892 40711473
18430 40711473 43838389 51198190 66892900 88893777 105996893 110305950 112765952 120931629
18422 120931629 123489572 112268327 98818199 91745189 83943837 72576874 64410919
18415 64410919 63857552 68634488 75009462 83260620 91819531 95452859 97414083 99931933
18407 99931933 93595701 76674947 59019013 46550762 38937087 34652656 32691561 32783540
18399 32783540 35113068 40293484 49104796 63467737 85369863 114158932 141947941
18392 141947941 159846012 174488706 193773538 207250102 192771346 151355889 112264901
18385 112264901 89763755 81645719 83726125 90793993 102903804 129357214 177890941
18378 177890941 221873159 213786828 164897949 117489902 83670863 61569544 48933787
18371 48933787 41666703 37568359 36478877 38234266 39699250 36801074 30910803 26466191
18363 26466191 25121484 26597152 29791634 31577562 29564070 26541662 25201497 23133049
18355 23133049 19412782 16471579 14903363 14414998 15466803 17725221 18749668 17602233
18347 17602233 14931958 11750446 9048635 7576908 6714847 6099327 5982966 5951681 6062755
18338 6062755 6383811 6409951 5851454 5202351 4958224 4944236 5315816 5775425 6107571 6517154
18328 6517154 7252420 7678993 7628937 7625847 8181881 9681608 11036095 11419466 11336455 12214043
18318 12214043 13106485 12556564 11415170 11109984 11871824 13888791 17359184 21447665 25400403
18309 25400403 30804547 41213318 61523991 100539166 160480622 200903035 174754728
18302 174754728 115936753 72782120 48789419 35045190 26529281 21659295 19012028
18295 19012028 17311518 16553225 16639359 16168306 14439626 12773162 12239391 12333376 13463145
18286 13463145 15144785 17451051 20391094 25472240 34682186 51382708 82758562 135649713
18278 135649713 183691453 173307797 117882750 70905207 44857316 30728532 22850392
18271 22850392 18259661 14816244 11677129 9294862 7766898 6650103 5969336 5472654
18263 5472654 5300103 5049418 5232952 5107811 4923549 4710430 4408343 3895109 3223134
18254 3223134 2810672 2491500 2397306 2215862 1986305 1843747 1634530 1536968 2054701 2636686
18244 2636686 2669128 2297241 1932087 1756266 1597696 1731480 2104653 1974511 1924187 1702704
18234 1702704 1238791 951501 803915 745045 682229 588955 588411 656641 744941 803153 830234
18223 830234 853832 715699 776841 1005321 791278 650758 617213 667863 666104 635105 449837
18212 449837 348730 521634 734853 1053413 890931 830125 761627 847934 979134 942763
18202 942763 845982 870768 1048103 1078808 986964 831289 441439 371483 583742 589031 795969
18191 795969 510250 190007 43213 215363 567328 391286 344360 242047 182362 267435
18181 267435 441943 391498 649005 812515 465413 367924 527851 504196 541123 780127
18171 780127 698358 694469 525164 377773 480095 821066 1183463 998823 647998 635580
18161 635580 693955 933679 1413079 1610776 1374199 1176310 1105733 1205004 1260595 1369215
18151 1369215 1329098 1253714 1213873 1078654 980165 1090235 1071106 1135990 1269729 1531283
18141 1531283 1952178 2024917 2280396 2325567 2118622 2286481 2405325 2893204 3444688 3395156
18131 3395156 3518768 3798671 4185529 4528797 4609764 4931156 5458250 6072236 6622706 7526215
18121 7526215 8950353 10784450 12860330 15295136 18611462 23265782 29672042 39756151
18113 39756151 54771794 79176196 123060865 209362173 370316732 554160250 562937715
18106 562937715 387622806 223565663 133731926 86467768 59660252 43406838 33244424
18099 33244424 26234698 21076603 17299084 14530897 12568880 10915875 9319832 8073789
18091 8073789 7086078 6189747 5424608 4864313 4299679 3837989 3389198 2950949 2579766
18082 2579766 2303680 2170114 2322949 2304893 1990735 1790244 1917447 1850798 1973375 1980741
18072 1980741 1967081 1680336 1258805 906528 972824 926062 925802 838449 847559 990796 973717
18061 973717 1021172 940185 1091286 987979 844884 771742 766588 778060 598827 247421 477915
18050 477915 490153 553881 548486 544100 375221 382468 388362 286764 449244 677321 554266
18039 554266 524848 397564 219105 225009 340661 284377 113854 154759 200773 319174 209975
18028 209975 208291 121876 108856 368333 633548 469247 278908 239534 293187 292540 164657
18017 164657 279654 234263 304027 406219 351435 115083 272682 401418 185933 222744
18007 222744 332989 347842 85373 67914 237006 545403 503931 448830 269448 287491
17997 287491 398559 534714 656114 781167 776543 830072 712087 522368 433330 464469
17987 464469 796169 770624 497390 586489 866449 1155658 799107 342224 120755 232245
17977 232245 187666 103681 117069 -200048 -434796 -428311 -315443 -37099 84259 147442 88943
17966 88943 282782 327726 315820 287580 304348 350479 553157 573677 299110 293771 329129
17955 329129 227927 166562 13329 -33644 70721 140565 -30916 -37259 110442 167105 138957
17944 138957 279715 559857 736560 393854 397417 449664 547662 453358 563584 851325
17934 851325 1019926 859220 659069 672415 575587 492355 325236 135591 -226318 -216530
17924 -216530 -352514 -164333 -53033 137476 64038 201634 113325 -105866 -26287 -194624
17914 -194624 -317969 -20152 190834 337848 413151 554795 545225 383837 233910 479660
17904 479660 797544 599974 614979 709400 592996 534862 462268 472392 477416 393238 393868
17893 393868 368292 129420 121044 256505 302364 300576 443853 444131 496607 505615 584995 573742
17881 573742 392176 366862 141585 16769 16205 266278 377966 218795 218444 147402 74830
17870 74830 144369 187288 163658 315700 347862 322097 405789 416278 319187 526146 572541
17859 572541 551713 461915 278704 230388 199100 254910 222362 174172 262900 429028 189126
17848 189126 129108 253637 394272 286512 399707 306428 171403 326070 338964 170976
17838 170976 115010 233604 219440 85531 107994 145422 60273 50661 -62029 -177335 -183947
17827 -183947 -70325 77457 -31509 -239678 -226032 -243285 -146116 -71821 1684 162633
17817 162633 131631 -1498 -216600 -70715 106406 227063 59018 -40608 66181 -74939
17807 -74939 -313428 -232163 -69408 -30001 -74640 -204009 -417791 -443541 -261400 -272033 -266889
17796 -266889 -168920 -34692 71249 77379 -2851 -29340 -219344 -223823 -48476 -75613 -133360
17785 -133360 25295 -32241 -147933 -220568 -297266 -121812 19194 132686 126586 177067 135311
17774 135311 40545 -88649 136866 353843 48102 -344517 -356645 -200165 278110 662959
17764 662959 689784 599272 512935 424966 58911 -58302 -36180 145103 134906 -28273 -19671
17753 -19671 244078 549902 529813 314899 49180 31254 -24376 -64077 137205 -28347
17743 -28347 145251 347547 360006 247972 709429 1099495 863230 440224 325224 109423
17733 109423 -245620 -423537 -343489 -61978 23125 45160 -117897 -289121 -185615 -138796
17723 -138796 -51406 -5387 64923 72419 -126378 3699 -102256 -60885 -196636 -298822 -270831
17712 -270831 60514 46180 -111254 -308699 -86056 52976 -52742 -350636 -201657 -163700
17702 -163700 -309197 -279473 -243592 -14318 14865 142126 213873 -197872 -334807 -132944
17692 -132944 -122531 -227423 -370636 -398210 -226594 -311146 -245014 -373407 -419484 -177683
17682 -177683 -100087 -6134 -78223 -250710 -127029 41827 -2142 -37536 54193 203403 262440
17671 262440 -102242 -134165 -220203 -346915 -444119 -250509 -382178 -531974 -405232 -88336
17661 -88336 -143104 -210345 -25276 -277150 -235478 -222805 -176539 26633 4321 -83708 -95873
17650 -95873 -149925 77987 382897 169458 7510 111616 178986 211582 88662 -36773
17640 -36773 -72188 -56706 -18696 -112019 -5179 96138 -103069 -229465 -274601 -159046 14807
17629 14807 310563 417591 310787 162727 -135306 -441119 -243028 -215470 -232501 -213275
17619 -213275 -451957 -322926 -189355 -224434 -156916 -303044 -219963 -56152 139796 195514
17609 195514 -172271 -359009 -216360 -96138 -30978 145460 116381 26347 -33276 19829
17599 19829 34586 -26027 -213703 -383437 -528499 -414177 -404412 -594708 -625015 -542013 -379407
17588 -379407 -47267 169861 172873 75096 75118 98228 43645 83633 -61012 -333239 -442162
17577 -442162 -439215 -524797 -415386 -439326 -343767 -212212 -51695 -54515 -51946 75586 74826 139233
17565 139233 145096 -27167 -258406 -318749 -333176 -315948 -315865 -213522 -35220 564 205062
17554 205062 169998 -58352 -214808 156336 318446 174977 190928 101631 -258116 -213524
17544 -213524 84456 250656 242449 -1800 -77497 -143390 15120 19747 -230257 95304 314174
17533 314174 152457 24800 -155998 -303479 -325935 -192675 -45212 48961 -2614 150209
17523 150209 249775 380962 305434 324071 149346 -141896 -297142 -87451 28601 262436
17513 262436 199349 -4574 -78544 -47489 57705 55448 40024 72231 226260 -25804 -195773
17502 -195773 -239073 18383 184947 -185651 -244849 -152846 -39657 109995 21747 -449337
17492 -449337 -627878 -404972 -267749 -305448 -218994 -344791 -528206 -273310 -3402 7830
17482 7830 1696 140933 149090 244001 359401 503252 42151 -453162 -587496 -436190 -285396
17471 -285396 -110420 -149528 -12932 -47622 -222516 -150179 -64299 -232612 -114664 177878
17461 177878 171532 133318 -45819 -260113 -112197 -108283 -68207 68461 44651 -137574 -138132
17450 -138132 184411 294078 468786 582884 646455 788843 1209801 1887611 2871320 3241100
17440 3241100 2363032 1289636 754389 426819 304339 196270 85957 -31560 39318
17431 39318 155331 -33557 -155993 -347806 -444843 -230389 -158940 -273277 -204258 -50708
17421 -50708 -109508 -49291 31768 150940 126433 6359 34850 -138510 -377007 -292656 2884
17410 2884 306898 306805 -75648 -403234 -231742 -25479 55227 135985 122144 -128283 -523569
17399 -523569 -667259 -460609 -98623 110824 156928 98993 45504 -97734 -96540 69764
17389 69764 158816 178587 307631 -36763 -252939 -270461 -168265 -169373 -240456 -119332 -189303
17378 -189303 -266254 -362767 -361419 -167233 101766 -216810 -395233 -284591 -351618 -485074
17368 -485074 -539138 -365206 -275983 -197968 -281104 -377038 -266708 -257338 -79189 6019 31220
17357 31220 182699 434866 511173 381950 269470 182475 202241 295854 149396 3153
17347 3153 -86993 -35058 -41299 17716 179846 146051 256548 226311 172332 268693 -22232
17336 -22232 -1644 202069 100499 -19394 136163 103126 115404 -107774 -210163 -12892
17326 -12892 58258 110625 181167 -100147 -350401 -194276 -56960 -140150 -315960 -413164 -382042
17315 -382042 -436994 -562996 -366842 -18089 -11231 99585 174760 86583 50146 79799 77243
17304 77243 -134658 -457241 -230596 -69858 -50354 99469 -8366 -75327 -15237 32324
17294 32324 268823 298889 -113838 -555176 -573150 -386341 -223768 -352985 -349749 -259473 -333017
17283 -333017 -308439 -22655 30109 -338323 -424390 -358482 -364397 -316477 -352163 -292290 -273135
17272 -273135 -176918 -164677 -253372 -304881 -340309 -154279 -14020 -74636 -115701 -217734 -254615
17261 -254615 -225765 6549 -180286 -251695 -92429 -45497 -35624 -255776 -396568 -318155 -225391
17250 -225391 -170625 753 210447 203138 258633 407620 487056 265431 109452 -180093
17240 -180093 -386816 -427122 -127759 88748 101960 101829 141984 -17613 59742 88821 236483
17229 236483 271917 106708 -144713 -265147 -277065 -196806 -10203 74960 -78394 -345762
17219 -345762 -195839 -158094 38337 12253 -134485 -217090 -141986 50001 131621 -116994
17209 -116994 -374443 -455889 -100593 -80107 21514 72749 79824 40397 67909 92171 -117166
17198 -117166 -127241 -36395 -42103 157891 349569 124837 40503 167340 180743 -196337 -467788
17187 -467788 -435913 -321056 -183411 -16742 112848 105929 184651 181821 36292 157331 298345
17176 298345 341488 288631 3746 -98366 -183215 -390814 -441914 -404772 -375081 -195568 -175380
17165 -175380 -213301 -106330 -319708 -245257 -93314 -11368 238709 -146332 -224687 14873
17155 14873 140713 -61488 187149 252408 142298 39791 104307 130196 106044 -53920
17145 -53920 -129576 -37085 -25262 -233184 -194752 70090 76863 219027 181081 43600 -164700
17134 -164700 -154445 29615 181830 145720 -162643 -198517 -102643 -41121 -83570 -86100 -83457
17123 -83457 -89622 35567 221423 310151 302792 254864 266932 313698 343804 369396 243636
17112 243636 270161 401407 348531 80175 -109070 -348733 -140089 96612 6521 -57160
17102 -57160 28780 72485 182045 -61807 -368651 -516854 -381483 -405848 -526287 -532184 -252834
17091 -252834 -108544 -169761 -304360 -478157 -536412 -473774 -396508 72478 140733 274464
17081 274464 -48313 -216362 -178311 -232546 -199874 -230936 42114 116783 153558 157575 -4893
17070 -4893 -99083 -73479 -16327 26669 134135 44214 -20310 -49974 82728 46333 115811
17059 115811 404262 416699 174720 -51408 -160014 -95706 -57262 87681 112144 -24177
17049 -24177 -114296 -45879 -77292 -63789 -22303 -171967 -249513 -241532 -153810 -161692 -99117 -197837
17037 -197837 113319 144266 134993 282219 255077 294313 211901 -108600 -333687 -257205 -87587
17026 -87587 -80475 -312088 -145918 27721 7184 102107 171444 225608 233736 56223 -62462
17015 -62462 -150421 -22320 95293 -183851 -432514 -352027 -415338 -331764 -356126 -104149 46137
17004 46137 -366783 -444791 -303960 -73093 -59042 -129668 -230473 -326185 -237336 -371847 -577424
16993 -577424 -526819 -299769 -272436 -89050 -44461 -140230 -81052 -163916 -249491 -237991 -263411
16982 -263411 -231171 -314856 -340186 -209218 -271583 -189877 49406 257829 515478 610601 241358
16971 241358 175583 339699 369668 232157 252862 143019 58785 134437 48391 -6574 -275123
16960 -275123 -397765 -293088 -62344 -85231 64802 -3396 148041 345191 319035 305481
16950 305481 219131 120033 136608 40705 -5444 138306 -47484 -37889 -19818 -37582 -7512
16939 -7512 -141010 -236284 -56989 168116 263225 173691 259240 163727 29718 64250 -25872
16928 -25872 -116075 -166828 -157855 -108888 -214661 -402501 -375253 -395918 -303409 -280721 -226153
16917 -226153 -258053 -245245 -232452 -115499 17493 -54379 -185726 -132173 -30720 -32522 213364
16906 213364 363889 363678 215573 -64678 -40978 112556 43598 -61797 -173320 -209198 -14006
16895 -14006 44557 -73521 -119537 42037 115035 142046 9230 60967 69340 131085 153078
16884 153078 -224214 -500235 -394388 -296281 -231971 -252910 -194087 -250218 -33368 8110 -46994
16873 -46994 -139683 -191129 -62631 -97029 -208020 -253687 -320467 -233898 -124141 -103887 130144
16862 130144 -27091 -89304 -12791 -49517 -98413 33682 153913 174816 219627 133138 -26595
16851 -26595 -149591 -337512 -224270 -204173 -282883 -367404 -208711 -104893 -154916 -129516 7482
16840 7482 46061 -43132 -196311 -120299 77442 -26195 -233636 -266040 -327661 -157894 -428025
16829 -428025 -666877 -550425 -415268 -220819 -180783 -296017 -233359 -62914 -107276 16631
16819 16631 -196 -245006 -115613 84286 288816 438999 281699 170841 288194 409117
16809 409117 167245 129318 222662 12322 -194488 -398039 -216570 199832 126725 185556
16799 185556 149193 105159 -98385 -114973 50270 28896 155972 276404 340463 384820 229966
16788 229966 -79510 -93496 -78842 -242261 -174196 -225100 2272 118022 -33791 -132605
16778 -132605 -66269 -52993 27444 45249 -51323 73300 182684 184747 216984 151337 19638
16767 19638 8941 36009 11913 114816 163992 167509 394251 458628 217488 -254087 -384458
16756 -384458 -276166 -77574 238676 371026 341604 103736 -96948 -355107 -192912 -278747
16746 -278747 -85176 -84515 -338563 -398467 -263339 -145708 -125119 -258120 -223866 74751 180201
16735 180201 36270 30466 78354 -43702 31009 145410 289256 173297 37647 -102925
16725 -102925 -52894 -138976 -77134 -93217 -109456 -15109 1943 -66828 94121 76548 -269666
16714 -269666 -260630 -117246 238188 296852 132594 93543 187979 192512 117923 4982 11199
16703 11199 170442 222924 111537 203587 178854 79079 -196448 -331600 -354081 -439946 -561775
16692 -561775 -414427 -340469 -220518 -83935 -91921 91740 91251 349051 176043 131989 27865
16681 27865 -72338 -4780 44830 281199 306072 149885 -25520 -242513 -330974 -140300
16671 -140300 79073 176568 5358 -376523 -450524 -95990 136770 109517 243036 244475
16661 244475 -262713 -373642 -96420 -32671 -151576 -88103 -13067 49834 -96712 -213598
16651 -213598 -224549 -57254 -61571 4563 88727 -175810 -267217 -82680 -77597 -335633 -318633
16640 -318633 -199169 141754 531281 236974 38855 87430 121026 236795 340806 135905
16630 135905 26212 -116265 -60060 -11757 154297 378072 304869 -15172 -228498 -472643
16620 -472643 -558856 -300278 -29465 381479 360000 284351 229546 288133 294271 367190 90308
16609 90308 -88368 -346137 -61265 -102641 -317768 -137337 -72561 226569 355964 288188
16599 288188 -108555 11345 401192 243393 -150304 -376054 -427987 -474587 -318040 -184857
16589 -184857 -75474 111953 126918 176128 177706 -72311 -77980 -281134 -191927 -84893 145702
16578 145702 285943 323926 127321 98981 77831 103793 -99916 -139799 -228693 -120287 120774
16567 120774 221688 164012 122981 -129543 -292538 -308 79472 -141692 -88951 -136887
16557 -136887 -242875 -209271 -28841 219587 355731 375862 201105 86692 -111949 -258515
16547 -258515 -8542 124003 356630 84137 -127223 -86831 -91602 -61943 -132153 -71410 52324
16536 52324 281103 320553 147740 187207 408340 237112 104792 -45104 50417 200654
16526 200654 269317 221316 -191352 -279471 -339527 -249419 -280521 -394924 -449316 -335607 -364669
16515 -364669 -339650 -125679 -125074 -348081 -364220 -389790 -248481 -372527 -289610 269148 248877
16504 248877 61308 -50165 -87383 -288919 -220333 -64341 158219 312315 115960 38709
16494 38709 268495 432311 342479 98235 276365 430251 122135 -84966 38033 160655
16484 160655 225466 359379 274089 185663 173666 -154410 -299104 -51024 131156 -73190
16474 -73190 115773 6354 -166052 -60669 13274 -72120 -301566 -299775 -79707 352247
16464 352247 315628 290224 187366 61538 270131 318967 426048 256629 98636 -5110
16454 -5110 50418 -50434 -19200 83419 -86402 -314156 -409590 -388969 -191216 -185544 -156412
16443 -156412 -253595 -115786 -54435 -95153 185843 140862 39304 113692 58513 121733 -160054
16432 -160054 -390648 -355580 6452 -124001 -162488 102162 134373 35703 6754 192973
16422 192973 206506 -159218 -304181 -194233 -221202 -218997 -289474 -384069 -371450 -182829 85730
16411 85730 65085 98127 -17585 -61580 -7392 -72608 3962 89001 159797 153929 38815
16400 38815 317995 157160 184638 219563 292687 151177 -106458 -215014 -280804 -172472
16390 -172472 -241495 -324348 -198094 -75822 -89694 -104995 -141329 -332572 -191518 -221489 -486716
16379 -486716 -533787 -341310 -345196 -147473 94002 49204 57558 -295237 -433206 -411131 -348453
16368 -348453 -91845 160763 227312 234618 137635 -101352 -109482 -163382 -151701 93940 99957
16357 99957 -28988 -83281 -2509 -143167 -96712 -181934 -487419 -477417 -289055 -179236 -2743
16346 -2743 208332 127941 130058 -122274 -124363 -176938 -384632 -451004 -353760 -525815 -428103
16335 -428103 -346923 -201393 -280083 -288868 -259450 -150051 -173229 -312936 -379679 -374460 -311201
16324 -311201 -281162 -344945 -117698 -40034 -186843 -556322 -866455 -618641 -319271 -168267
16314 -168267 -1752 101557 274480 -6417 -256217 -247821 -15037 -92900 -132056 -84310
16304 -84310 30732 -58576 181668 349701 161594 -29817 29174 56986 59591 133158 -22044
16293 -22044 -358544 -286976 -302275 -583386 -222497 8402 267275 401826 403489 436205 503589
16282 503589 520418 209409 104120 31534 192396 321191 160468 142797 227314 159923
16272 159923 28506 -252971 -201377 -35466 38690 -237843 -362353 -150032 -38956 64494
16262 64494 269220 249395 38466 118230 -43178 -163217 -132729 5737 281551 446157
16252 446157 524490 379458 214745 115513 47474 142579 204298 368749 311383 133723 184863
16241 184863 195131 188435 233184 313297 149334 -168932 -43426 296360 351139 52756 -97808
16230 -97808 -296961 -451633 -526677 -426353 -163359 114746 95275 -18782 -229226 -235897
16220 -235897 -112026 -104182 -106196 -195415 -271508 79103 314065 359087 271262 111234 55851
16209 55851 37677 -169159 -176681 -171922 -177239 -166041 -450401 -568116 -275285 -6392 29244
16198 29244 20813 -98008 -163649 -196559 -24500 54624 -54522 -179807 -216952 -71343 163106
16187 163106 365757 336107 72324 -67321 -362669 -395010 -312760 -187989 76903 61152
16177 61152 292438 238345 60967 -91254 -175715 -59690 105411 -34505 -239214 -38715
16167 -38715 263510 396890 317467 -13538 -52836 64451 196925 10394 -294209 -97715
16157 -97715 66251 104374 -55498 -213729 -320006 -336875 -82241 31242 -96203 32464
16147 32464 -17083 -245592 -369801 -322937 -131558 -120836 231549 247181 -174926 -332783
16137 -332783 -108567 -81380 -222428 -251776 -225682 -190881 -20763 74504 223375 80870
16127 80870 616 15122 85737 62458 166646 72105 30767 -78906 -114929 -300746 -320243
16116 -320243 -273440 -195262 -60492 -85628 -248374 -37434 132598 167708 230091 83766
16106 83766 -9613 16284 229887 122310 244 295949 340685 153163 45050 22421
16096 22421 -371067 -474568 -361270 -529970 -276402 101042 188579 112932 -12219 37645
16086 37645 168512 245212 135895 139748 291613 257331 351729 432887 354591 174034 288764
16075 288764 225952 425285 557772 413893 382488 250264 193384 -1582 -151678 -277578
16065 -277578 -135383 53830 -15484 -107561 -15919 44873 326790 364246 148529 169942 371889
16054 371889 293175 73190 205389 557967 617033 336349 -78947 -268299 -202467 16780
16044 16780 -97026 -255673 -91294 74790 192907 210670 393247 329454 170464 284786
16034 284786 372907 627244 484975 367106 316542 182120 148418 243020 157777 106760 37812
16023 37812 1314 -149078 -296508 -70878 173156 102092 42586 -73404 -326408 -327645 -193185
16012 -193185 -93259 -56871 -63666 -144858 -191968 -17505 -103148 -143597 -13726 97879 139149
16001 139149 210549 252324 200586 -69691 -214703 -168957 -15850 -156751 -307435 -349564
15991 -349564 -266833 -205803 -276067 -335525 -174555 153313 246097 231456 84991 -69859 -9722
15980 -9722 -52562 35656 177563 112684 -285187 -142027 -130990 -245493 22835 102621 -64437
15969 -64437 125108 318419 410522 211710 -23450 -31068 -18412 -197187 26723 60849 123448
15958 123448 102067 -151444 -233394 -200494 -47111 98984 167643 -10615 -15964 59534 275741
15947 275741 137000 -67910 -10412 -10311 -8298 -72245 -156180 -83643 -87787 -270326 -173932 -24502
15935 -24502 305987 429310 265965 135413 79647 273702 286580 167907 108357 305723
15925 305723 580171 433602 194708 25212 24589 -70296 -219299 -271504 -140501 151686
15915 151686 54641 41079 65866 314198 209572 170169 251292 162883 4801 67058 114928
15904 114928 1547 -170478 -239409 -278596 -370782 -318391 -13941 316871 653300 698048
15894 698048 501005 280874 141205 225308 351187 303727 382890 331212 300962 136637
15884 136637 170771 90911 -20950 -72194 -132639 -300761 -440444 -378470 -376532 -230551 79130
15873 79130 297821 67228 -17264 210701 369253 337757 206276 288380 327549 171840
15863 171840 -113852 -194646 65528 65744 88859 330907 355950 109998 23792 93255 49702
15852 49702 114948 318118 178137 119598 -91317 -235372 -91732 -19853 -68366 -226961
15842 -226961 -230950 -318074 -230832 -222360 -364088 -314155 -334308 -356976 -146293 -48345 4905
15831 4905 -16767 -50813 -54303 234874 467034 447943 511443 321077 60512 -17338 78194
15820 78194 -75066 67533 -5904 -72235 -32993 111966 449699 452191 354764 347683 31741
15809 31741 -194789 -271052 -122098 110030 -42839 -328264 -391109 -337941 -301373 -242005 -40314
15798 -40314 77534 394945 418649 126600 -16556 25643 -18117 -21394 -95983 -350095 -431891
15787 -431891 -483346 -454808 -96507 125320 81437 -28509 -2209 -160654 -245072 -181844 -124658
15776 -124658 -182486 -314123 -233843 -105026 -136121 -266027 -122196 -63498 22285 35059 21567
15765 21567 -25493 290921 99077 -106832 40737 225706 214071 330673 184655 -186983
15755 -186983 -211336 -125028 -33049 115615 140118 13726 -182809 -189792 -6449 -62240 -90569
15744 -90569 -211010 -191490 -3529 -68064 -94760 -99086 -139552 -30274 -75687 -161052 33866
15733 33866 168124 126626 187476 123048 40973 -161362 -424013 -479496 -193581 -31170 -110941
15722 -110941 -107002 -172631 -204220 -100531 -29092 -178219 -143464 145482 225275 90379 -216638
15711 -216638 -225134 -178785 -353015 -371677 -467291 -491203 -276514 -80973 -143528 10052 -18371
15700 -18371 -116351 -82645 -69671 -147551 -346528 -444337 -451737 -297238 -142767 -101102 -297926
15689 -297926 -286008 -197397 32486 98234 110951 53389 211109 168748 86594 197728 773
15678 773 68633 219730 434263 327998 36133 -168475 -271472 -253693 -6294 184879
15668 184879 194467 134859 175665 409346 376751 150381 351162 614478 444971 473414 463625
15657 463625 150255 138954 184682 213413 86489 9961 -53681 18208 213256 235740 74280
15646 74280 176689 221160 218969 233947 52142 -141405 -346404 -572283 -320077 -68543
15636 -68543 -137720 -93823 109932 -5635 -77784 -192255 -373611 -468448 -442541 -395422 -193514
15625 -193514 -12223 -165741 118162 169719 244977 132895 52096 -178933 -439042 -423325
15615 -423325 -108253 48179 -42911 -42099 51903 35838 151136 219597 224812 74155 -160307
15604 -160307 -187705 -237711 -157149 -131277 6602 161091 -135721 -299985 -453718 -482995
15594 -482995 -472075 -324969 1287 141672 7254 37850 132711 177705 260955 315257 259648
15583 259648 279249 427579 220285 21320 -62036 -1858 65147 -29698 20931 19553 20175
15572 20175 58762 71922 -12010 101920 260293 319251 351686 73464 -68460 -17898 -82938
15561 -82938 -352991 -341102 -323490 -191851 100202 158944 219287 1220 -44545 137340 163245
15550 163245 116168 119276 64506 -138588 -187670 -211756 -319162 -23826 49214 -68988 -257026
15539 -257026 -155046 -70248 123783 31691 -95702 -27877 117948 -102525 -189442 -26063
15529 -26063 153208 148993 10390 -45002 22057 84648 67612 -28951 -40200 -24036 -133243
15518 -133243 -147903 79103 316211 326514 119790 103854 126734 19090 7303 95793 277415
15507 277415 547170 578362 351408 227442 221175 90527 40899 73614 198028 225861 79839
15496 79839 298545 389549 260722 135560 125349 -39773 20255 99564 152412 -35895 -185200
15485 -185200 -150231 -90132 -171780 -477245 -426155 -105203 156089 68193 7851 27389 46736
15474 46736 -3321 49262 159125 415120 424471 155492 -104540 -12010 24487 233898 306491
15463 306491 277213 164315 -230930 -384389 -198167 -10294 214161 567056 400204 343639
15453 343639 388770 100623 -15904 -117090 -146930 58114 274052 206074 -30113 111012
15443 111012 469176 383784 66087 -15432 93163 377125 279617 118978 364651 178904
15433 178904 -145697 -382731 -524378 -585641 -421563 -343744 -358324 -97875 229847 86587
15423 86587 14785 3053 -332662 -300549 -236483 -303308 -379376 172298 365964 370082 -43751
15412 -43751 24347 176431 -113577 -221825 38408 283269 154900 -98180 -53763 170169
15402 170169 215628 -180346 -505282 -286690 -60473 101185 -101433 -69457 57933 44013
15392 44013 -51105 -22133 227066 505631 368906 185709 207570 507675 437019 410502 376036
15381 376036 -27407 -88411 -88443 -159331 -210099 -244794 -350521 -254429 1588 12077 -108561
15370 -108561 -60047 -279271 -377802 -89336 -86168 50000 124415 -9562 -96767 -163068 66059
15359 66059 32481 143414 347106 556708 348536 156076 -59293 -5717 -71837 -82481
15349 -82481 -188657 -305317 -193443 -100187 17473 5946 -223082 -384750 -340903 -307136
15339 -307136 -249441 -48894 1861 -295319 -209773 -260266 -270267 -126943 -118676 -152077 -207901
15328 -207901 -268040 -172027 -62197 -139407 -265747 -115618 84534 -269652 -554726 -440185
15318 -440185 -141045 153983 353277 156978 24767 65176 9463 -32709 -36800 104426
15308 104426 187138 186534 72912 -48677 -133698 -117775 -276641 -336317 -207244 -285272 -351474
15297 -351474 -51149 64192 -189295 -106599 217975 321331 261333 157277 107011 16437
15287 16437 -119032 -23678 40555 -64177 -186307 -50962 -129781 25040 149492 274508
15277 274508 235810 277120 368064 337824 410858 249691 129295 290764 259103 56494 120009
15266 120009 -38321 -59503 7310 -81273 -282745 -18095 49725 5895 73537 267169 225641
15255 225641 46960 140422 320267 68592 121646 48173 -166421 -109061 -55970 137228
15245 137228 191814 89927 -95713 -70694 -85029 -219852 -230168 83606 160380 124025 169920
15234 169920 242235 121931 -156123 -240115 -230372 -26605 -84492 -65278 -253902 -93266 262434
15223 262434 64418 -230758 -257644 -233274 -171189 -274990 -218940 -142045 -39614 75132
15213 75132 32788 -112953 -311150 -196747 -53153 -142461 -155266 89602 227599 351729
15203 351729 288653 215756 401700 292537 -96017 -57100 128774 263844 207564 -42884
15193 -42884 -223139 -107037 36642 97188 75118 259731 360130 144940 1678 -13258
15183 -13258 -112050 -55107 -57179 -206575 -117600 -168900 -235186 -151838 -17869 50813 149361
15172 149361 66618 154766 -120192 -196473 -130269 -235198 -308019 -162679 -275245 -352148 -100283
15161 -100283 55131 205909 178078 160377 143148 -101995 -238879 -269078 -24319 -122071
15151 -122071 -169423 -23393 145250 208547 -170912 -235074 -46686 178209 142435 200697
15141 200697 136938 -52957 -42797 185345 245434 107891 153870 169862 249488 59901 17708
15130 17708 -66048 -177881 -36308 -40294 -62492 58260 216954 325193 351423 101019 202388
15119 202388 189642 270921 219328 65455 109754 151158 81693 57257 112190 72522 102867
15108 102867 198498 117493 47473 139913 67748 98453 -178955 -92297 -114691 -153236 -2173
15097 -2173 232958 191691 -59653 -187658 -205368 -173410 52959 25090 73640 -22009 -236542
15086 -236542 -225946 -171385 -149794 -175698 -218618 -39696 125786 221428 282753 260733 229224
15075 229224 262812 136585 237900 182202 51399 215668 406415 409329 262822 112721
15065 112721 295307 330800 29938 -151501 -93953 -115099 -265937 -159551 134700 140544
15055 140544 111625 -87722 -190061 -97019 -5048 -60387 -170504 -14487 204247 49300
15045 49300 -123508 -164930 -256430 -173506 -154927 4115 52370 -140100 -147496 -3704 -8382
15034 -8382 -84011 43254 142301 110957 129982 133094 79945 8282 -4364 -93553 -258545 -303319
15022 -303319 -181792 -168341 -142677 -139412 89328 313168 384182 379394 440241 282775 33622
15011 33622 -27284 -228723 -197277 -231186 -157119 27233 179591 565796 310223 33636
15001 33636 24153 28624 65758 24485 119935 110006 238391 236900 7471 22238 8810 42872
14989 42872 168915 246178 169284 113223 -91904 -374732 -240363 -81417 -186805 -219293
14979 -219293 -292998 -112901 45265 316875 372723 103228 66369 -61088 -141594 -10362
14969 -10362 -64436 -28177 20898 -191797 -194828 -4797 84050 -123890 -119126 -129007 -174803 -218282
14957 -218282 -284101 -197377 -43375 -88666 -132727 -316892 -419331 -432651 -658774 -605199 -355182
14946 -355182 -43058 42741 177520 221130 -20363 27434 60050 -104347 -210057 -338629
14936 -338629 -480353 -484018 -437845 -281536 -349284 -291840 -184415 -120116 52480 297647 188534
14925 188534 85927 267627 380530 175855 -187211 -33116 110441 -22783 34054 47725
14915 47725 128291 285633 405595 248955 254579 191887 18201 231433 284691 41826 64635
14904 64635 188135 174861 126051 207802 127062 -35559 1488 64660 47107 23049 -187721
14893 -187721 33930 171480 231835 445582 313230 156538 215953 314942 144982 154945
14883 154945 204712 -185070 -260463 -210811 -128278 37368 -51814 -195033 -50728 -173748
14873 -173748 -300089 -329456 -237021 -318651 -247992 -157459 -158225 56438 330181 367445 264041
14862 264041 -70783 -341612 -229924 -310898 -389727 -209817 -25539 202962 265931 -17461
14852 -17461 -134610 -126867 -404566 -236049 -248715 -181898 59569 244666 -53201 -366799
14842 -366799 -452664 -411092 -169599 2271 1943 81635 72504 35753 182400 44958 -32252
14831 -32252 3803 61690 -68372 -230391 -123631 -35107 33820 -87014 -157761 -253624 -52304
14820 -52304 142148 119526 157089 91837 110292 261889 156394 9447 -101801 -111635 -78606
14809 -78606 153571 259324 250918 173078 -77525 -255135 -114809 -148122 -228535 -194181 115568
14798 115568 139304 893 -28999 -99315 -66989 -24754 -51194 -30434 -95872 87884 213290
14787 213290 204022 -43790 -349571 -292802 -163798 -233955 -65896 137022 105163 34814 13621
14776 13621 -148250 -247014 -158596 34680 123237 115727 157724 172536 188580 54136 74786
14765 74786 8606 139334 210029 490254 350929 154977 172236 125217 -127673 -247576
14755 -247576 9767 152172 272716 133321 -171436 -451098 -648825 -472629 -389980 -145747
14745 -145747 -230920 -348257 -96704 -136110 -154397 26639 156813 247104 435031 220166
14735 220166 -83338 -205821 -156705 -100426 -75024 21809 112185 286451 318217 292051 163235
14724 163235 209186 486009 367819 220350 330569 534412 311384 42710 -13604 8028
14714 8028 98944 363275 343867 173929 33800 125301 45071 110940 297833 356541 285933
14703 285933 52719 -96189 -102472 -112887 -180935 -200129 -347021 -510984 -453118 -450131 -432820
14692 -432820 -149874 72050 48340 90686 158572 272960 295124 244066 79040 -63268
14682 -63268 -122959 -24461 -49868 -161688 -207200 -156097 -31098 196174 204188 351627 504756
14671 504756 405634 195626 12800 59567 -94241 -38038 125755 165279 257090 369786
14661 369786 424786 348044 78816 -79733 -262298 -381667 -302071 212 216042 402074
14651 402074 257934 -67094 -206174 -111023 -20246 91952 -97191 -481334 -153116 103635
14641 103635 164519 -80302 -302508 -277277 108327 117282 98088 106583 38495 123237 258012
14630 258012 77268 179509 -2886 -148423 -6933 -43997 159172 434352 588777 387564
14620 387564 185838 210255 236575 281540 464923 660688 699968 527402 267834 181138
14610 181138 359382 198980 -60906 -105521 -59423 -5495 41938 35676 92676 57293 84141
14599 84141 158446 202015 97194 26322 -87856 -191589 -30178 21154 -35526 -207346 -177616
14588 -177616 116755 157261 221298 225762 306054 418967 344862 88029 210282 272119 35442
14577 35442 28599 -60212 -54270 8149 -94647 -172514 -216905 -291030 -348181 -404823 -334807 -244945
14565 -244945 21370 -91231 -120342 -264012 -164487 96221 164819 198850 65517 165276
14555 165276 427856 473170 286904 -274104 -421975 -533537 -435244 -368621 -169539 -55404
14545 -55404 -247966 -333016 -263955 -168778 -205053 -49781 384154 411663 229028 91494 47799
14534 47799 -222509 -102700 -8854 -78960 -149143 -7799 149675 -295275 -406187 -434470
14524 -434470 -293348 -294231 -156680 86080 331139 524742 575466 281074 17007 29161
14514 29161 11110 146574 309868 480321 466570 449524 522213 450810 187991 52877 -24449
14503 -24449 178392 127286 187265 407664 421463 346171 141693 79411 -32001 112635 152027
14492 152027 25855 219556 598780 571685 293462 238030 286211 417687 558927 416512
14482 416512 292604 67687 -231905 -159384 10423 225470 322311 137930 -170260 -236904
14472 -236904 128618 365344 168067 40849 76405 295394 98302 -30124 -154708 -215225
14462 -215225 -311491 -183609 -72061 65596 360666 546648 385971 317243 436895 363298
14452 363298 269501 122691 -5381 126783 85227 111797 410044 491360 386678 197078
14442 197078 183627 155862 42150 259042 170731 108037 312596 530106 428923 119750
14432 119750 -129091 -23190 77667 137939 11462 -36323 249083 546510 397703 435806
14422 435806 302321 211357 321673 156330 377792 464683 119052 34089 172409 119991
14412 119991 -4509 -103480 54513 386603 423286 156475 -10443 153372 321468 440882
14402 440882 38184 -120537 -75309 -159009 -259862 -137307 48133 -100282 -132558 174870
14392 174870 270902 455751 263651 -40303 -169507 -59918 -102189 81269 139862 269258
14382 269258 81564 126912 207206 -40158 -323499 -340625 -363724 -227076 16608 30377
14372 30377 -53546 162999 348196 390539 287117 254552 273619 42609 -303314 -384829 -217357
14361 -217357 -315315 -151015 97546 134997 133954 210310 160466 -152917 -401884 -332101 -39688
14350 -39688 -47671 -113208 -100803 214773 479128 634103 558415 479754 484396 418538 510696
14339 510696 191806 -302165 -357566 29403 44954 -74286 -217603 -105375 197695 349179
14329 349179 229733 277461 127674 20360 254814 301890 111970 -8831 154585 101775
14319 101775 -209470 -278103 -214865 -95150 46467 129392 316346 445708 648560 688710
14309 688710 444191 440213 318189 191373 99683 127044 72248 252160 521778 531737 479207
14298 479207 411937 192038 72002 334008 446838 230165 63850 12660 -33372 36311
14288 36311 -130550 -268237 -406003 -579320 -302058 40679 179483 -92666 -69559 -180721
14278 -180721 -370988 -382321 -476921 -420775 -206909 -156867 105996 263210 195419 -39180
14268 -39180 24224 110243 160947 312656 221403 242030 319510 339223 278597 142561 76164
14257 76164 -104974 -145150 -118938 -140750 -164943 -148593 -98767 -98961 8959 60726 259401
14246 259401 496619 710550 703455 353657 91208 -37465 -63090 -188033 -247235 -127291
14236 -127291 -135052 -35220 -130741 -92821 -126245 6741 314477 153786 94063 177715 464328
14225 464328 448781 284656 217116 86977 -129430 -200175 -57129 114149 128673 88
14215 88 114527 215961 253610 401460 252211 -24078 -160588 -102746 16924 37904 -11153
14204 -11153 -43696 -50647 109789 48408 295708 205777 -147060 -169749 -172893 -165490 -15807
14193 -15807 57527 147427 123248 -52038 2412 59293 32862 189084 271413 181901 178780
14182 178780 375281 149083 -93189 -172463 -169472 -370631 -200353 112190 30980 -195490
14172 -195490 -176678 -67495 237941 26229 -121773 -14884 105593 49030 -59660 -330654
14162 -330654 -296642 -265315 -369807 -256003 -51862 72211 181376 200894 -131724 -251419
14152 -251419 -239512 -72525 70683 149777 194469 142482 138137 316945 251083 26255 -42654
14141 -42654 86010 221720 101438 -61089 -126346 49325 39484 124321 137055 -160187 -185866
14130 -185866 -188310 -30092 -172530 -124766 -20689 64426 363087 415231 215162 137700 125853
14119 125853 122827 -75358 37096 354664 336445 470308 551992 409029 253835 101054
14109 101054 -155895 -268714 -283941 -165559 -131561 -153533 -145162 7136 -166242 -53814
14099 -53814 73754 -146722 -166508 153867 288396 316088 493489 565319 337911 81231
14089 81231 52909 230115 591444 660513 360070 321933 225688 364539 194195 60832
14079 60832 163900 120232 236877 305851 389602 360614 102661 -132456 -310679 -295920 -97788
14068 -97788 150544 450842 367659 359770 260628 237787 547434 786265 632529 475116 391465
14057 391465 419304 539533 480231 171194 -122856 -105419 78085 -129550 -273502 -304806
14047 -304806 -155442 78884 -118945 -258911 -65440 69638 132546 221286 171043 35634
14037 35634 49462 202354 265760 310409 22040 240403 122289 102517 202913 213939 324404
14026 324404 173619 136767 281105 304760 -41345 -49639 87518 219923 334517 534376
14016 534376 512029 558875 482942 487110 454089 260408 -33707 -85559 -1636 172959 214299
14005 214299 216642 253296 253338 166538 53663 206 -91568 -5531 244806 245300 466144 411078
13993 411078 -39120 -127672 -186973 -165360 -14154 91884 321316 436343 373346 310164
13983 310164 53728 102278 226046 114230 169378 184710 137982 78247 102756 28650 84199
13972 84199 72885 434310 454788 156613 95934 73311 182482 330866 310382 299183 299682
13961 299682 165392 -112697 -42216 -16393 33941 111465 81656 25915 -180203 -337627 -184449
13950 -184449 -283289 -354793 -399212 -265572 -103076 295277 502043 605056 635999 596539
13940 596539 462274 223195 -18505 -107397 -168483 -124723 -177053 -17167 93967 28502
13930 28502 116466 80309 167045 127380 -50348 15522 41215 87537 -226330 -316930 -177196
13919 -177196 -24256 106892 -38087 -74230 17149 22152 -194313 -83506 -233615 -279008
13909 -279008 -196537 57423 327087 471864 172623 -84934 -61939 172492 165150 -4727
13899 -4727 50266 64793 17698 31941 -14964 181115 160040 5570 -7482 161431 -6693
13888 -6693 -63202 99628 152854 193042 206265 20595 -244752 -176126 -81067 -42256 -149058
13877 -149058 -227800 54118 350078 221357 60431 159447 325199 403271 520378 395134
13867 395134 288693 106373 -217583 -228442 -126403 -185270 -409302 -280671 -226638 -280908
13857 -280908 -134393 -10811 -56258 -80835 199067 270314 -52084 -128932 -55414 -12804 -116095
13846 -116095 -33174 170809 346901 -47133 -44366 -24457 69603 84986 61928 101605 81877
13835 81877 194981 373133 140831 -3440 185403 137238 -20028 -275384 41496 502504
13825 502504 445079 84644 -105096 -190562 -127398 -273538 -152978 -210559 -149698 5543
13815 5543 -41297 -56591 -24947 -185000 -379119 -372483 -309702 -435309 -313978 -102212 -32238
13804 -32238 -202146 -240081 -130093 -139988 157433 363796 90399 136237 66644 79431 228067
13793 228067 77902 274107 388533 357104 306124 124443 -78506 1095 53577 94211
13783 94211 -29752 -106514 -8720 -159320 -192687 -227921 -143066 -133248 -260422 -240577 -7867
13772 -7867 373940 400907 119613 86651 49216 -5965 -156197 -175932 -164825 -274043 -236683
13761 -236683 -47236 -120126 -186237 -119240 -95547 -164847 -302607 -171697 9249 174227
13751 174227 178203 68251 110144 91775 200488 364758 470516 374421 239176 73113
13741 73113 54054 223477 171779 262691 277503 313701 328196 227686 231630 140679 192866
13730 192866 -53353 -216720 44122 139767 224322 257411 -71577 -142255 -35238 -99367
13720 -99367 -324886 -236737 31732 177633 92575 91878 181416 110790 138585 252776 538427
13709 538427 352473 109782 -61251 82578 -17537 -154608 -148046 -7207 340354 246625
13699 246625 181528 285768 144564 119648 283389 47781 -3267 113880 20186 -11142
13689 -11142 31985 52059 -15781 71246 -223289 -244338 -80318 -111757 -149777 -153123 -335504
13678 -335504 -245754 90108 140374 147775 41193 -94457 -128294 -9690 -45199 -129837 -201076
13667 -201076 60763 152066 152910 -8921 -327485 -545560 -219822 -30069 -68428 -131850 -264942
13656 -264942 -84782 34513 130909 340027 317485 278315 124560 163231 223845 209828 339246
13645 339246 267555 336153 293006 163194 136671 -52026 -128523 -38261 36661 285166 282105
13634 282105 19436 -35557 15725 4646 129960 360286 264315 139662 147251 46979 -124517
13623 -124517 -83770 12191 6405 89454 42665 59410 171760 154165 71900 -99715 -163216
13612 -163216 102032 261334 221134 161662 -3919 13161 -146308 -91758 -177015 -297328
13602 -297328 -201531 10230 178466 266913 50328 -73260 -78506 -232645 -173954 -86191 -104812
13591 -104812 147152 121518 223926 -30396 -91471 -19104 235595 290613 200145 270438 361402
13580 361402 168507 -65670 -173757 -77739 -87590 68710 191623 -1830 -119358 -37517
13570 -37517 196200 169692 171082 352464 232509 78181 208068 167657 154013 32936 -220787
13559 -220787 -369907 -313245 -118449 18998 127093 44267 114017 4996 -162471 -244278
13549 -244278 -51814 -67252 49788 35796 -26224 19600 227309 304999 122166 38846 61031
13538 61031 -276601 -438538 -205301 -32976 -56249 -226046 -303698 -200039 -27029 -15450
13528 -15450 -318064 -330585 -303793 -246856 -133737 80855 -129971 -162845 145135 340321
13518 340321 250009 22756 -67539 -173194 -137125 -24958 125693 59692 -225723 -342663
13508 -342663 -185215 -237819 -339516 -249507 -146887 -860 368845 584112 686793 554998
13498 554998 356635 405289 143172 3259 233170 229149 120375 282323 357692 388131
13488 388131 360147 271191 73995 254659 128420 126206 303674 251599 86437 334829
13478 334829 666190 592697 429365 422257 332831 -88913 -330301 -304104 -215198 47953 221105
13467 221105 59651 -195837 -353729 -156985 38165 200969 78136 -94768 -135628 159100
13457 159100 255148 310946 347986 187193 38424 -162852 -11022 139980 211476 -10692
13447 -10692 -177127 -5534 96676 -47336 -166194 -11449 38116 -163633 -189720 23635
13437 23635 197139 452120 362781 192390 332416 447458 513773 556679 316455 157288
13427 157288 -171799 -282804 -286849 -81474 -5383 -2686 114639 399408 113708 5877
13417 5877 234166 570468 558557 276665 37324 58870 284735 172691 102440 86234 -25452
13406 -25452 -282643 -481269 -335369 -120366 -209607 -174044 -189184 -43402 164751 290859
13396 290859 290880 172939 -12801 21441 188883 203149 254816 210134 185678 81913 -2115
13385 -2115 187822 185481 -59069 -274140 -329820 -306671 -63913 -122710 10280 177651 36758
13374 36758 -148756 -230105 -156377 -187245 -335984 -244914 -79265 -114807 -73341 -199469 -71471
13363 -71471 38059 95489 -61067 -92726 33291 69488 167634 333111 255053 -19764 -173373
13352 -173373 -132027 -254339 -188986 -146282 -182452 -87537 162752 89595 -254795 -386737 -154700
13341 -154700 -73841 -68174 -223049 -235989 -114416 -70706 -151435 77231 257133 317526 196575
13330 196575 -8477 2622 31864 -17826 -132626 36844 14237 -125297 -263404 -291698
13320 -291698 -241033 -66538 143942 137866 68921 -180317 -338335 -378961 -432320 -233052 -67398
13309 -67398 14455 -81995 -100136 -6975 -61780 61036 -176085 -140154 -22718 46136 -72362
13298 -72362 -193876 -79939 -75730 -223745 -10555 248217 396266 299096 319020 487348
13288 487348 489086 360431 212692 180337 296224 225290 -44499 57771 226743 261234
13278 261234 281055 280603 273851 233706 25384 -312403 -185819 2438 -2692 -175620 -34874
13267 -34874 234036 368176 475034 411130 366581 284645 150679 140707 247252 234540 259028
13256 259028 321330 151467 46363 109612 273985 302478 250226 142576 202980 -44644
13246 -44644 -12045 90955 -88955 -346443 -212379 -125075 -389107 -198427 -282949 -462492
13236 -462492 -247866 -6600 152477 176837 234396 67486 -213893 -240570 -159945 140903
13226 140903 321818 231647 136775 53127 116072 80312 18052 -100118 -56232 21514 144774
13215 144774 384238 290403 294546 132852 37350 163650 36383 56844 271631 124178
13205 124178 -141569 118600 252155 204221 183306 160043 -33151 -105710 -16296 107882
13195 107882 43414 431 -134730 -172857 -173183 25604 -94358 -171553 -184781 100826 290673
13184 290673 324311 436288 236593 303539 117349 -27643 -98933 165922 261741 80725
13174 80725 -33352 -41756 -48210 74834 10904 -26482 108928 290165 390002 294505 27198
13163 27198 -98255 -190226 -99209 163823 323931 294758 188959 142332 22415 -47691 -130894
13152 -130894 -72644 196550 212864 -27243 -139580 -297863 -315333 -3492 213274 270697
13142 270697 205674 122820 123120 189255 -44562 -74911 -113911 -246742 -80448 12983 -32955
13131 -32955 -238237 -244243 -220195 -65218 28996 -147647 -230330 -284975 -55687 167640 91928
13120 91928 -191658 -469398 -475533 -354191 -105863 -43762 -169009 -181685 -103741 -135512 -281502
13109 -281502 -382927 -75791 -18606 88229 68357 5433 -62434 -167046 81597 280006
13099 280006 177453 98378 3439 47089 119508 46746 87982 96440 87320 -194435 -346379
13088 -346379 -198029 -126458 17400 168898 197854 257184 244953 -34230 -338564 -279261
13078 -279261 -198580 -297796 -254919 -100960 -195367 -113733 -47167 157690 397078 532211 504683
13067 504683 150252 91362 72306 90992 63195 -159024 -227041 -284487 -201242 -40339 302660
13056 302660 535209 576726 463220 381022 393443 162093 118411 345436 441288 397006 207725
13045 207725 -67809 -236495 -177371 -50045 70633 241139 175782 107899 13351 -156682
13035 -156682 -298229 -45343 195022 290229 163682 139047 124996 83241 -22113 -99559
13025 -99559 56957 126517 -76898 -321237 -495522 -265160 49855 118754 74583 -72617
13015 -72617 -3635 78420 146070 51997 76596 103221 197459 88513 -99395 -112680 8101
13004 8101 53325 23780 210700 217007 189611 251965 493913 593260 469970 350867 143244
12993 143244 78250 253925 295157 472538 332974 138980 62306 170175 142373 -135926
12983 -135926 -23861 285923 410350 325418 243470 198492 83058 -90545 -205516 -98137
12973 -98137 -3117 129201 -1304 -268071 -422677 -368087 -257594 -247510 -225703 37265
12963 37265 43833 -30019 148027 124558 100119 54886 -151052 -142707 -169353 -183100 -232772 -206927
12951 -206927 78047 42401 50392 63320 -70595 74835 340819 274626 238010 305496 185060
12940 185060 -38669 180654 114219 235188 38109 -71759 26749 -10874 24587 32380 278117
12929 278117 413281 379637 123496 132467 200308 63754 -112109 -327162 -440458 -361076
12919 -361076 -377882 -377460 -388901 -370748 -263751 -100397 21637 85687 75205 91901 129554
12908 129554 140496 55250 37297 -98238 -41183 67830 70921 193896 220539 163036 404221
12897 404221 571979 198590 29610 100325 141860 -164852 -276888 -295838 -199799 -157259
12887 -157259 -188520 153875 214131 9592 -38874 108588 20075 274698 174589 233594
12877 233594 315028 333295 224577 -26047 14356 28612 71647 77143 137834 97451 -48084
12866 -48084 -42062 -71132 -109599 -308056 -214500 -41821 -81805 -139760 -254425 -94711 -76272
12855 -76272 38064 -71456 -116543 -60333 163623 79229 133248 31488 -106711 -125638 -258218
12844 -258218 -414833 -251036 169581 140958 -20784 79545 38962 -50522 90356 76315
12834 76315 161402 182576 251604 316711 70093 -149353 -108153 -148428 115895 125684 59914
12823 59914 137569 108300 -88229 -247386 -272647 -228181 -93811 73220 53914 -97824 -160134
12812 -160134 389818 597250 489539 396992 347074 340981 208133 108574 158297 356280 391147
12801 391147 438447 358612 358533 379975 174926 -104655 -87828 -334307 -168836 64352 53082
12790 53082 160122 59640 -141157 -154548 -102969 -41510 -103829 -207554 -214343 -48815 11800
12779 11800 -6317 -18209 26000 198643 203916 151310 237164 120975 -39956 -2778 58892
12768 58892 95292 98750 70477 -38079 -155242 -118903 -231911 -86009 -56293 48457 52444
12757 52444 26844 -8263 10064 -175115 -106434 136957 -11539 -309549 -384349 -134044 134364
12746 134364 5644 -218031 -97592 -119970 -36722 -43470 199721 153508 -46669 -134357 -308129
12735 -308129 -429179 -478565 -486991 -377662 -287635 -320389 -176723 -52591 64740 51169 94185
12724 94185 305302 450314 471722 425992 236281 292606 40841 111533 9764 -83632 -78160
12713 -78160 -131422 -133983 -63583 -166225 -200081 -8741 242793 386070 251793 70552 -66311
12702 -66311 -66445 32224 -268796 -118431 135147 79553 255071 383570 385487 263868 181606
12691 181606 113010 12598 182329 147390 313624 294959 307172 217868 60137 -39701 119457
12680 119457 -79747 -221966 -173014 -47010 66796 -63903 -224484 -80710 -35065 -51942
12670 -51942 91791 -214589 -274712 -308090 -332147 -455441 -308928 -200422 -170784 -20864
12660 -20864 -52903 -153874 -86301 107280 182079 212470 214204 190360 299865 258135 217403
12649 217403 371673 364071 476731 621736 253135 -153080 -153976 -189525 -402379 -164552 -37508
12638 -37508 1093 16214 20420 -6444 70865 127951 -68562 -128319 -124798 -17579 253320
12627 253320 283676 308963 149782 -77272 -154742 -117652 14577 61828 91531 1167 -140486
12616 -140486 -466905 -473779 -395211 -340623 -221464 -400090 -430504 -319846 -456182 -346018
12606 -346018 -112667 5189 -34570 -71536 -16829 -37321 168951 147776 338703 280919 -16474
12595 -16474 -174914 -136619 108688 126721 -233480 -310599 -260705 49661 -16017 -174396 -29346
12584 -29346 71053 -23810 -312457 -417255 -480665 -530063 -240216 -61352 -164896 -353681
12574 -353681 -356033 -278522 24020 228860 204920 36720 -93345 81578 230070 125788
12564 125788 70603 164599 207965 203003 74461 90941 238815 214343 -14181 22778 718
12553 718 16158 199737 -22312 -243429 -345071 -251234 -49007 -50499 -481002 -580373 -320237
12542 -320237 -319201 -190333 -169585 -134476 -55535 181826 221650 134424 105033 16243 -174182
12531 -174182 -348796 -363999 -257600 -152807 134806 343944 250325 31239 17589 6623
12521 6623 -93063 8699 155942 212316 16462 164503 205163 81 -294464 -193571
12511 -193571 -77056 -18968 -172515 -128232 -67282 -16914 -138420 -207772 -21317 19899 211196
12500 211196 377694 475698 235933 -94904 -148331 -367431 -353482 -402495 -468952 -150491
12490 -150491 54474 -184944 -246072 -220812 -291191 -16650 -252090 -270974 -335550 -208439
12480 -208439 261663 367171 325879 137020 -62184 -76387 111028 202794 -119773 -178001
12470 -178001 -143614 -283620 -462672 -590052 -582678 -461744 -367775 -341454 -183554 -10717
12460 -10717 131650 -11534 -59155 237110 75095 -250463 -204222 61864 49985 -115298
12450 -115298 59985 312639 304211 119228 120838 253795 232201 412481 237991 82151
12440 82151 164533 175524 321781 476722 350074 297893 38381 -342286 -408617 -273361
12430 -273361 -113432 -31366 -192484 -362242 -288275 -216223 -433880 -526365 -430374 -435223 -550036
12419 -550036 -490331 -491134 -380922 -332110 -161806 -78989 -37786 -256155 -228416 -9520 137806
12408 137806 -19767 -217842 -439869 -455360 -610244 -444520 -344981 -175973 -129249 -227311
12398 -227311 -272426 27733 120266 -212866 -283609 -220985 -226468 7081 130369 31708 -258911
12387 -258911 -315358 -206142 -281872 -362002 -238116 -203513 -354180 -128115 73407 28739
12377 28739 -186627 -25860 -91836 -233481 -6163 68227 60465 -9075 3605 57774 22270
12366 22270 330733 473704 460274 420321 397267 546144 473259 373643 296107 158815 102912
12355 102912 74855 187495 297881 147418 46277 -130211 -212825 -18258 -43116 177676
12345 177676 192278 9861 -350070 -305970 -342508 -239086 -110021 31241 28037 79348 67468
12334 67468 15012 75613 197997 25596 -183192 -19435 -57376 -54090 -374904 -442907 -87286
12323 -87286 -17489 -376825 -594527 -264269 -46659 -209575 -363930 -294902 -306145 -169301
12313 -169301 156037 307741 311009 158753 254199 317768 148426 -99955 -122458 -218747 -178570
12302 -178570 -119271 -115510 -332292 -68822 -49939 -179560 -262560 -336914 -160944 36074 20081
12291 20081 -80868 24187 -24735 -142169 -152819 -232776 -44295 59199 72262 60137 41160
12280 41160 -47918 -75176 -16476 -80096 62861 142551 -48547 -433871 -399277 -145483 -120919
12269 -120919 154742 299428 229217 -117486 -32505 223713 164216 359006 74435 46380
12259 46380 234371 180338 176420 191014 366525 418152 347975 68420 -102140 -24293 199095
12248 199095 456532 488742 498362 264043 47860 -153770 -68169 141949 126495 99460 237997
12237 237997 451227 409359 335037 206010 377192 497509 425768 489721 290015 43238
12227 43238 -84155 -66410 94692 79111 6346 -182311 -284691 -363631 -406405 -139392 52963
12216 52963 -97201 -55811 -19065 319132 579015 460713 86592 -47786 -180366 -300767
12206 -300767 -174566 -183488 49720 -81638 -102748 -213999 -365369 -118865 90680 167385
12196 167385 211119 194174 223006 356144 271621 -2378 -211481 -155402 -100159 -93739 29753
12185 29753 117438 -107176 -291249 -398414 -411647 -464533 -178436 41767 85965 -40035
12175 -40035 -50024 -43072 -195328 -21187 236391 385896 122895 105857 109377 175137 44437
12164 44437 16639 46935 -148787 -76191 113808 -92336 -153172 -38369 -83114 257566 499805
12153 499805 543474 423550 238623 -9902 -115561 70640 130989 -110344 -50248 -52046
12143 -52046 -60926 -153662 -185422 61355 60070 -250801 -186704 -103281 7999 188843 59376
12132 59376 -177767 106663 237906 -12198 -291294 -388897 -224430 -247487 3985 -57490
12122 -57490 -217053 -256890 -93119 16221 97424 300260 391570 463382 322889 374039 414534
12111 414534 52872 -5523 153185 305746 256273 188579 -48197 -260824 -392708 -500025
12101 -500025 -259609 -36730 192484 340401 324331 108691 70888 -52843 7363 49938
12091 49938 39214 -2615 64565 91655 33106 112994 133049 -260612 -413044 -167166 117705
12080 117705 394272 439177 454080 498972 353050 75276 14418 142004 131658 235326
12070 235326 216752 188105 141511 130313 -141214 -283850 -192536 -91544 124209 99188 -26776
12059 -26776 -137237 -81624 206914 258256 137666 363689 306935 172095 237507 -86975
12049 -86975 -264572 -174287 -308905 -150247 -168388 -356057 -594747 -545629 -412949 -325296
12039 -325296 -181556 -77379 216032 270766 14801 19253 196194 215868 287364 136438
12029 136438 211736 259527 207501 -53468 -226837 -229800 -292046 -306818 -381808 -440623 -435610
12018 -435610 -532917 -431926 -275515 -60134 -77107 -272335 -160899 -275838 -261479 -132806
12008 -132806 -161861 -68272 -102721 -46931 -86008 -168331 -109130 -52557 138127 157255 -116314
11997 -116314 -127984 -2200 -47006 -136134 -577 3891 -120223 -29624 -125573 -336957 -250923
11986 -250923 -85572 -31787 181801 373470 432500 403272 181085 -129703 -108203 50868
11976 50868 -39966 136 71098 -111634 -118034 33616 101996 200187 100160 78629 71861
11965 71861 35831 118004 130599 -38117 -182966 -13308 -9174 107489 369269 134972 22585
11954 22585 -38660 -66568 -53712 -2292 -104075 -172011 -217061 -213304 -108095 -143054 -239764
11943 -239764 4208 82673 -29649 -320736 -237411 -236099 -238917 -235751 -43696 72214 -185804
11932 -185804 -312816 -283229 -299259 -292796 -433654 -419082 -638358 -642058 -284807 -75871 -89633
11921 -89633 -244870 -90270 108959 83958 -9978 90440 251817 67122 41260 121438
11911 121438 -13239 -238961 -202348 -249319 -136849 -37593 -2134 27926 51633 243480 161648
11900 161648 -19261 151685 123492 45819 -49527 83197 59850 73417 -78142 -200455
11890 -200455 -160411 -180180 -110351 34022 26538 -135218 -220467 -24777 67417 -110899 -99344
11879 -99344 -126022 -96915 137665 68338 -149386 -80487 -172440 -144559 -46505 -53227 30820
11868 30820 57410 -141864 -439769 -504297 -397665 -277898 -63371 56274 169696 45214
11858 45214 -130640 189383 295047 456965 491955 338791 161720 134750 191781 240680
11848 240680 127499 280366 248057 19892 5246 -184937 181977 67658 -197831 -360797
11838 -360797 -267205 -216992 -87931 -78846 -77941 -94296 -20449 122446 41420 -9963 -58775 -79030
11826 -79030 66561 45485 310089 242210 293189 212830 143494 107435 -17799 15125 -142990
11815 -142990 -321880 -351489 -279869 -165511 -24199 -143620 19118 39542 246038 341028
11805 341028 195805 132735 16512 -18402 157096 289492 378754 499051 435119 48032
11795 48032 96464 79267 -86320 -21317 149175 185301 116439 137214 128553 -74540 -185747
11784 -185747 -368457 -426516 -169533 85922 174315 415903 621940 482679 472702 121682
11774 121682 -214502 -272710 -125488 -32904 -133534 -375218 -404466 -359488 -272054 -332961 -204853
11763 -204853 -102226 78458 346033 516990 209685 178825 58640 -60076 -140520 -62527
11753 -62527 -143713 -267421 -388726 -295941 -186042 -102967 323952 219743 -18408 -231963
11743 -231963 -276044 -348809 -419492 -587985 -584958 -364654 -347053 -415835 -220172 15133 78960
11732 78960 147906 264864 107565 -226882 -416604 -465288 -131610 95774 52943 -109591
11722 -109591 -9113 143967 190936 78138 209039 442035 558342 623783 436028 257779
11712 257779 341447 353587 159247 87261 204650 510085 303211 183628 191434 -43637
11702 -43637 -133335 -108719 -139527 -56676 -26987 -112937 -63933 13035 -139696 -219941 -238487
11691 -238487 -162255 -210629 -311975 65662 507796 526956 487732 219467 -19609 -79721
11681 -79721 -90689 -216242 -184622 -174575 -276721 -157036 -82548 -202692 -219227 -292381 -106523
11670 -106523 -66382 -8389 123361 250696 208088 411191 319451 138660 -40324 65245
11660 65245 116990 222883 225938 93660 70189 148911 139568 -109852 -86115 -48144 -130794
11649 -130794 -300570 -382532 -381859 -513454 -299261 -220977 -125858 -40678 75784 146403 -58883
11638 -58883 60071 101061 120408 126793 23045 6488 13265 -107289 -138769 -60970 -27445
11627 -27445 -52588 -13033 141281 178961 180933 218544 534951 518018 172869 -585 -63035
11616 -63035 -146252 -87061 62906 -291882 -470586 -298752 -156109 150026 78433 -190841
11606 -190841 -220238 -154697 -143721 -237058 -290134 -157654 -164030 -222816 -322726 -456073 -482997
11595 -482997 -448091 -288146 -292778 -126847 -81157 -122995 54639 -66643 -330894 -343450 -151597
11584 -151597 -33030 -17427 77279 -29902 -156230 -147592 27014 127880 77667 -113101
11574 -113101 -67196 169808 109055 31129 -4233 -136782 -271023 -217585 -92611 -32140 -28362
11563 -28362 51460 369001 663147 414398 33240 -56597 114740 249679 366574 225334
11553 225334 69452 105449 81406 88223 267819 441382 288424 70916 126396 268699
11543 268699 162926 72898 174878 114928 -175701 -245863 -543 126618 104751 225312
11533 225312 281565 144980 -108265 96309 322703 203339 285739 126104 -42433 -94794
11523 -94794 177761 198201 -25632 -237668 -209787 -165879 -238441 -243349 -426685 -425745 -192736
11512 -192736 37751 -118525 -109297 -171609 -94259 182627 314412 644116 736233 749260 438844
11501 438844 120850 -75288 -7101 191716 40587 77655 42333 308742 366608 305565
11491 305565 487381 490743 221718 77372 82776 -78667 42972 179092 212813 172606 -157811
11480 -157811 -206617 -144652 -258735 -51459 263555 343713 327920 403263 517163 304986
11470 304986 131445 -49521 67619 -182204 -367337 -356613 -99342 106263 112595 160020
11460 160020 157686 146946 308043 114404 -99713 52226 -105381 -217404 12832 327276
11450 327276 284708 304164 454232 324733 45088 162194 195497 9195 138452 443004
11440 443004 380901 433606 214582 34090 17690 150194 -41226 -101859 80751 189161
11430 189161 -142389 -337694 -135128 24584 53606 -61125 -61047 -139760 -424431 -364243 -397681
11419 -397681 -233216 84328 254090 606671 828298 357340 99237 199236 99207 42119
11409 42119 -317170 -284670 -110978 -96802 -178424 -126870 123536 -31434 -175374 -220648 -236339
11398 -236339 -318556 -384340 -159147 -56345 237789 233574 56385 -63631 16724 -76926 -88916
11387 -88916 4833 -20294 -65922 -178566 -278660 -460545 -399090 -305270 28534 121972 -85294
11376 -85294 35263 79042 18926 53628 81794 171013 204008 249419 229613 47048 -84540
11365 -84540 -235525 -296822 -412323 -152824 149453 217317 355540 372539 375006 362375 145320
11354 145320 -14390 -161394 -216722 -220541 -304058 -284487 19555 45092 31047 148992 208493
11343 208493 6708 -239443 -147761 221309 263288 290338 332865 227113 64011 -160415
11333 -160415 -112985 43937 242565 517436 416881 164101 335949 25028 -99320 -173215
11323 -173215 -100109 -265061 -256714 -165782 58429 14740 106859 69440 34076 67386 -63077
11312 -63077 61619 252725 180401 114205 -90060 -146504 -91817 -237417 -342454 -315811 -346795
11301 -346795 -242121 -146137 -137147 -53144 -158981 -337105 -340733 -405461 -371823 -109178 160906
11290 160906 223526 116928 115291 144989 4047 -201293 -32255 -17601 -65372 28884 -94712
11279 -94712 -91610 -62703 151903 335178 154552 -95578 -123266 12982 30510 61449 39537
11268 39537 49943 80151 64295 17700 -66881 -77622 -146500 -13001 355612 363513 544596
11257 544596 490973 470854 258032 -70252 94800 147209 140051 -122746 -199872 -261014 -61551
11246 -61551 -3262 64594 157017 267575 412310 303805 232924 77261 -193216 -42154
11236 -42154 13966 -35867 -227738 -337080 -252616 -401689 -256991 94210 6754 -265831
11226 -265831 -265781 -232693 -187094 -266445 -148237 77188 239620 301356 289272 317462 171111
11215 171111 3553 -132172 -346666 -358781 -177791 -162829 -193386 -242988 -306449 -335642 -228421
11204 -228421 64890 141792 85065 154611 221548 232083 105985 -9008 -87475 -14065 34552
11193 34552 39725 -67262 -113136 -15556 -8776 -147928 -247923 -208131 -82264 -45052 72474
11182 72474 146492 -90676 -264980 -259230 -209354 22115 73858 60207 56675 36699 -40534
11171 -40534 -55486 -67132 -53730 -132348 -216497 -287161 -299073 -530326 -629261 -573175 -158174
11160 -158174 -104186 -341747 -358852 -323600 -165989 68973 135017 11722 96161 -2932 11139
11149 11139 99026 73438 98167 262847 102308 4201 -102851 -177735 -255107 -99407 -153578
11138 -153578 -96903 146569 103971 -11183 92705 150167 265602 249404 110586 -94296
11128 -94296 -500016 -497014 -225473 -108518 43994 330297 284241 383436 313607 8678 -91860
11117 -91860 -273292 -201298 -342122 -312776 118059 421134 461199 225690 145226 181716 179970
11106 179970 256634 108933 -144596 -154551 58298 -92466 -276356 -297733 -327195 -236887 -100835
11095 -100835 -159317 -104538 -191080 -101726 194097 59101 -38855 -171493 -155208 -171762 -167315
11084 -167315 161313 213371 224496 53760 84074 124270 4051 -106336 -61786 225404
11074 225404 -10968 -337538 -315392 -369390 -424124 -361677 -343454 -484841 -201200 8780
11064 8780 325945 251911 13703 179148 186700 266644 244086 171279 169381 99496 -27853
11053 -27853 -145901 23999 -31564 -101420 -202573 -360391 -269916 -529028 -615448 -413651
11043 -413651 -171107 176698 67567 67865 245573 285055 40008 42590 75465 8514 97973
11032 97973 -76947 -392130 -629600 -548609 -359169 -244851 -426513 -489530 -524416 -375498
11022 -375498 -339543 -396035 -171532 -58324 -1383 -265776 -581780 -615259 -434913 -289234
11012 -289234 -125447 -205112 -163301 -3286 -60157 -85260 55383 -120047 -11072 331488
11002 331488 243243 240089 164193 -89228 -308435 -412634 -127816 12657 -48924 -260254
10992 -260254 -263318 -29939 105338 313767 223476 216193 247575 253247 137803 -95288 -183843
10981 -183843 -226918 -130970 -33204 70923 98973 247189 312368 157292 171753 -51135 -219368
10970 -219368 -382025 -304200 8141 26841 -228244 -219787 -96102 -261390 -139215 173780
10960 173780 209500 68573 -8799 2524 867 -77165 -150980 -328443 -236129 -244447 -150457
10949 -150457 -78889 143708 272536 217247 443911 201602 -12228 123205 97204 55531
10939 55531 84973 81632 73077 -253076 -384319 -413931 -378900 -374422 -271416 41257 92678
10928 92678 -42831 -289017 -163391 -127314 -161063 -48932 89603 191440 106492 -84246
10918 -84246 -27724 -48365 -155316 -91455 74765 141884 90996 228727 384016 248854 225227
10907 225227 -13252 -126261 -94535 46479 119116 128134 213152 231937 187381 325309 55358
10896 55358 -113142 66721 173613 143270 82772 23912 128779 200970 399360 437536 159655
10885 159655 -11490 -50057 -256681 -238709 192262 283749 150648 54844 229563 239697
10875 239697 370836 110629 -9627 60825 106278 182450 105760 105127 208207 108576 -125493
10864 -125493 -177746 -229370 7869 -170002 -196616 -42972 100148 306890 264623 87186
10854 87186 -123704 -68864 58526 63676 18511 -135249 52259 155549 227843 430954 476152
10843 476152 297828 140275 -68735 -126184 -133434 -399378 -504652 -324411 -32185 141213
10833 141213 149448 145765 96275 -63627 -346876 -336693 -250099 -319965 -297087 -302321 -312537 -197789
10821 -197789 -402013 -300774 -122882 -62968 -49778 -5204 -196438 -198223 -316168 -363635 -367625
10810 -367625 -21034 87788 28748 -5344 103574 342015 341677 504235 425080 106409 -60411
10799 -60411 -261982 -194872 -175408 -224041 -2990 119675 88521 25523 -92713 -107149 106473
10788 106473 161370 -19224 -184196 -259088 -396788 -216031 -74037 7391 90691 -55126
10778 -55126 -73322 -240077 -349958 -415566 -386266 -330462 -295449 -173341 -126975 -208088 -416624
10767 -416624 -278179 -178943 33587 85465 131886 -47711 -46433 59335 50397 59124 279488
10756 279488 148408 56754 325641 279994 90477 -25379 -251349 -364870 -568231 -598092
10746 -598092 -436479 -200706 -13440 -204334 -196096 -162537 -147563 166759 348357 130578
10736 130578 248234 268882 324331 216559 356543 457994 351982 219147 -100931 -293343
10726 -293343 -32924 -46644 125816 156754 125624 2539 -168632 -292342 -94471 62914
10716 62914 -8957 -15399 13833 90242 168428 126931 52393 111814 30994 -2033 12224 207908
10704 207908 270368 474600 526746 409087 353353 261167 291206 250433 275163 526552 486536
10693 486536 234100 148678 -53673 -161282 10906 100796 57735 -7562 129299 -54032
10683 -54032 -237630 -223629 -152977 -265456 -333536 -302274 111594 148925 168599 240710 199673
10672 199673 312968 228971 219536 519679 571111 430000 253666 -58368 -231755 -292679
10662 -292679 -448082 -199929 -185886 -249976 -231755 -215896 -365015 -302157 -349195 -298458 -289965
10651 -289965 -288255 -88861 38271 101913 -95441 -67026 15380 86313 -140469 78377 179087
10640 179087 420305 467876 327341 251856 566370 581296 393038 269154 274131 108064
10630 108064 135561 163826 112458 111144 274056 481593 531877 422978 341093 188462 219568
10619 219568 416220 471856 255306 47775 -152040 -162055 -100947 -146368 -128320 -97220 6566
10608 6566 96717 195902 134180 168059 8970 -23391 141396 30980 -35997 132062 335939
10597 335939 398226 244849 40454 57302 333835 425911 321418 92913 -107312 -103092
10587 -103092 -92915 -192898 -372432 -288658 52182 -8979 13283 -57477 -2979 94307 19520
10576 19520 4478 -261807 -451641 -102229 186403 290278 238624 159186 -132883 -313707
10566 -313707 -206556 24073 145632 235695 561919 608400 665869 364466 251416 187525
10556 187525 213040 85382 185278 147759 71798 -124232 -160262 -223672 -160644 36789 132656
10545 132656 306914 231304 101305 298837 363258 350388 232520 13623 -158216 -21606
10535 -21606 121241 31875 14846 116414 350048 401454 150097 -30079 18321 -84231
10525 -84231 -30847 50997 75870 102114 182736 41350 39392 102466 -68719 -165111 153842
10514 153842 221525 189053 238088 142555 -95066 -222646 -40586 -4318 43796 100425 -61752
10503 -61752 -64243 100385 115739 79182 93492 333792 309521 213286 76815 -101337 -62076
10492 -62076 -115051 -291359 -379187 -86398 37591 71350 118098 57568 -172602 -275030 -367565
10481 -367565 -333492 -448342 -384217 -287113 -205795 -98214 -34616 182474 262219 -44813 -264601
10470 -264601 -34830 -14118 -73316 -143085 -298216 -134131 -85059 -36507 -37520 -109521 -260184
10459 -260184 -101510 79897 301853 265589 64653 90578 -257488 -402733 -203278 -202514
10449 -202514 -60019 -58409 -22814 -37851 -99299 -268118 -75244 94081 -93345 -227725
10439 -227725 -264364 -435971 -513870 -437836 -302416 -128943 -287356 -152782 -65489 -174823
10429 -174823 -143666 -47150 35809 210952 352671 199666 -27660 -56316 17987 247917
10419 247917 212023 6088 -5913 -133918 -110742 -327356 -415970 -231902 85327 -43240
10409 -43240 -104532 -31007 1049 -142432 -240625 -244413 -45063 -40461 -173904 -236993 -78995
10398 -78995 -140816 -235678 -187857 -48523 97631 81192 -244490 -237869 -122039 -135531 -212472
10387 -212472 -50741 -165657 -152412 -193000 -213380 -393207 -369745 -131245 -74637 -63075 -65674
10376 -65674 -256827 -190414 -103832 -60019 -573 3624 28807 235262 200953 234385 85501
10365 85501 8718 43040 187270 243447 246433 -133968 -315641 31250 111103 331429 461073
10354 461073 229576 -22941 -68607 194173 281252 570008 574201 575475 881089 1196466 1164941
10343 1164941 1035100 1072273 1080091 1113467 1193322 917843 541302 427469 407367 248075
10333 248075 9965 -178167 -193408 -140266 -96535 80580 271440 111670 139650 145934 -10763
10322 -10763 -118010 -72915 14040 67314 -66347 -158377 -119176 -33630 -86347 -191802 -432728
10311 -432728 -447745 -271172 -132882 52436 20760 -133212 262391 254566 -16179 -56309
10301 -56309 207277 188373 226817 294450 279571 -6806 -99796 -23413 -155139 -169715 -195235
10290 -195235 -195114 -210614 -307584 -286317 -57049 -92624 -38359 101651 290037 141274 8207
10279 8207 132536 100488 -35860 -126991 -209873 -117678 294583 117989 -95658 -42736 -79362
10268 -79362 18855 -42698 -11113 -140281 -314946 -387342 -177684 89497 191870 36821
10258 36821 -187895 -386255 -252544 -296455 -259521 -93750 -27323 -20507 -65223 -168124 -245387
10247 -245387 -116663 9787 -52422 -2549 -259998 -362430 -301091 -93266 112143 87935
10237 87935 73410 319796 447744 188114 146255 125034 -2026 135305 178040 152060 111209
10226 111209 -88055 -376361 -376994 -233838 81168 221271 235304 476379 538627 421869
10216 421869 452056 418802 221594 124090 -32106 -153488 -105685 14736 83494 70717 -61075
10205 -61075 38885 12071 -37637 96105 210377 124731 -140651 -156479 27467 192200 2877
10194 2877 -198375 -192330 37199 82167 156694 229359 304565 255705 136231 305832 272971
10183 272971 46680 -142309 -38644 65577 99680 315106 185520 -9727 -140142 2118
10173 2118 -39034 45582 121577 518934 650025 466947 620175 554342 421833 275598 273880
10162 273880 202275 186543 128058 -106169 -50099 93043 141320 122458 308690 364872 258922
10151 258922 12164 -118052 -112200 -212810 -437501 -355826 -163152 -203507 -228850 -190376 126454
10140 126454 348002 308771 342844 435530 323073 272296 186638 158821 43963 16619 124263
10129 124263 356824 414067 399545 326117 -55798 -63447 -5528 -135524 -475917 -480725 -474342
10118 -474342 -441520 -222064 -41732 67252 143198 211386 245620 79674 60595 104272 75116
10107 75116 -31898 -73678 -348208 -425051 -402923 -260395 -156339 175750 466383 721494
10097 721494 454816 285571 248739 101691 93651 138013 150225 26608 -120044 -19913
10087 -19913 98213 83158 12166 -215175 -395591 -495484 -220382 105963 33344 -81977
10077 -81977 2918 175095 37878 -52759 -97838 16010 -51979 -101610 -71153 14182 136777
10066 136777 93447 44424 -78758 73870 -10005 -171984 -186464 -332596 -280697 -102450
10056 -102450 -132314 -178975 -71330 339977 568914 325810 232846 111074 244235 369887
10046 369887 192228 24578 -77170 -201629 -35784 92234 9388 -79485 -24610 -137369
10036 -137369 -94311 -195312 -190756 67946 139638 -145278 -242210 -22971 119963 51776 51041
10025 51041 170990 181016 91526 88571 -38489 -10888 -128205 45446 -133626 -199852 -357932
10014 -357932 -363895 -50306 -76986 112673 92813 -308406 -438233 -216177 92886 147829
10004 147829 139867 274241 489926 357142 190115 159867 200143 -42906 -234721 -196741
9994 -196741 -171507 -247560 -265646 -277337 -351538 -184827 -66410 74343 238045 470018 560929
9983 560929 488056 312150 287095 292575 263411 136726 -143816 -384232 -471154 -202312 -136905
9972 -136905 22027 -45632 -108190 -29821 -110756 -264403 -260572 -131647 -7475 -181698 18576
9961 18576 175670 -76585 -117727 -2811 79584 -21058 46315 146614 318627 332589 103717
9950 103717 -11266 -44330 -132340 -188596 -89044 44701 120445 46323 -21174 -226541 -190821
9939 -190821 10875 36033 120876 114356 152270 269203 321791 65221 224543 266786 431736
9928 431736 293908 50972 -41924 -5043 192045 101120 75161 368526 425503 23138 -50279
9917 -50279 119152 -20274 -27532 22635 -237333 -343527 -504730 -347824 -160925 -31552
9907 -31552 29272 222462 107601 24518 -242690 -282207 -263605 59414 224662 218651 178399
9896 178399 -141958 -170470 225945 515705 296403 313478 140921 -904 123734 305775
9886 305775 296000 130744 85718 -118469 -365697 -485278 -220376 -325088 -225127 -38425
9876 -38425 -7934 -19402 -327206 -424639 -340981 8678 -67323 -173654 -82597 -184574 -169406
9865 -169406 -109624 37302 66885 405585 586736 675708 521210 177969 8960 73901
9855 73901 198792 280825 608592 595705 229464 -157874 -320974 -393160 -235679 3380
9845 3380 -76849 92645 74143 116030 56312 20276 -246946 -295364 -128437 -83881 -213833
9834 -213833 -352835 -413144 -263735 224460 251367 168418 156419 134702 99863 15352 -97162
9823 -97162 -35956 -45636 -126197 -292221 -384067 -452620 -485896 -505590 -346262 -170466 -82440
9812 -82440 77808 337698 312655 280525 221251 116350 62806 46623 117458 285030 141085
9801 141085 114679 185303 152917 133484 -67774 -150785 -179744 -102805 42679 242101 122828
9790 122828 -29312 -79493 30264 -6723 -52833 -122260 -383584 -233269 -163744 -152948 -197489
9779 -197489 -73392 164622 275993 51730 -61278 -53217 -58350 -155794 -165534 -215114 -194143
9768 -194143 75174 127290 41045 -155056 -111887 76950 499596 361689 179834 153976
9758 153976 505175 590307 323686 91667 68686 -86540 -170865 -297378 -81212 -52764
9748 -52764 -190739 -280669 -194447 -238516 -300494 -105009 227143 150509 12415 -46122 -180715
9737 -180715 -246213 -347792 -249940 -233778 -198304 -197588 -231826 -245067 -46802 189807 237670
9726 237670 286534 265035 21620 -120173 -64661 -17873 5068 95398 139259 242789 189363
9715 189363 24542 -490 188378 126529 133819 272444 258355 -40459 -163457 -236703 -63554
9704 -63554 -15597 115299 69461 166992 203798 157432 210432 187244 145467 71867 123901 219680
9692 219680 143679 120607 324974 257419 -16423 143879 164314 -30085 -83713 -42837 -19341
9681 -19341 -168118 -297083 1080 92902 -15972 -59819 -26090 -45131 -175150 -117962 84046
9670 84046 9541 -43717 -108087 -50378 252492 273421 30899 -123531 -188262 -16902 129263
9659 129263 341341 242842 237684 309560 123800 -18322 -98837 -62959 -81807 -93527 -2394
9648 -2394 -13149 -75146 33103 -26830 107829 145594 -129476 -199457 95096 151671 120615
9637 120615 15317 44431 50755 -5199 -155900 -147154 -66481 -272175 -208689 -285557 -170236
9626 -170236 -59110 -250967 -243741 -77263 -189992 -170774 -248632 -178024 57202 21833 -171042
9615 -171042 25895 126447 103304 273404 99515 -387750 -455521 -263570 -89511 -79838
9605 -79838 49030 21616 -276425 -195042 -116705 -92312 15502 132936 142794 -8746 102767
9594 102767 284382 146492 -37655 -29113 113666 502536 561951 597519 522847 506631 244131
9583 244131 119790 19174 -19807 217503 240736 125227 -16062 33916 -51690 -5834 -93226
9572 -93226 -265579 -73318 59838 113844 133260 -149667 -284223 -153604 -114055 -63246 -16315
9561 -16315 -286114 -186913 -88413 -158379 -180073 47929 56832 -64968 13493 297166 311815
9550 311815 59884 26002 71868 113753 186955 242083 294036 306324 154586 -27676 5483
9539 5483 -161632 -270724 -38664 -112116 -305897 -305924 -14659 168403 18041 -240708 -255631
9528 -255631 -182077 -108536 -23366 22948 31357 250430 296414 347393 316482 -5724 -110377
9517 -110377 -145143 -312252 -206674 -80792 60587 56384 -49333 -39670 -70332 -279423 -286699
9506 -286699 -133069 -88611 -190790 -284458 -464813 -330192 -56871 -10990 154592 214237
9496 214237 94952 55153 -115023 -169137 -102412 -138768 -269583 -328669 46947 321427 197423
9485 197423 229783 99867 -225133 -185395 8296 114106 5925 2750 92675 14151 -204199
9474 -204199 -326615 -138473 69617 251725 20430 -157187 -194257 -178307 -140955 -198239
9464 -198239 -4900 -7278 -182895 -187478 -226712 -36279 -152358 -183160 -149897 -170303 -109644
9453 -109644 -90021 121335 20641 78890 154947 353305 419302 512646 518046 682924 528378
9442 528378 71711 -209586 -92643 34330 110069 -108096 -85105 -148499 -189843 -183397 -296506
9431 -296506 -284767 -292569 -362992 -241959 -1666 215506 283808 318937 342452 264467 84051
9420 84051 199102 274797 9251 11337 172584 5840 -88664 -112836 -155700 -114230 -193267
9409 -193267 -124130 67088 -228894 -233792 -222152 -178695 -1231 170309 295444 200477 25119
9398 25119 320025 590976 522503 287224 90309 -94530 -264092 -225978 -74625 87111
9388 87111 176152 252524 429672 242600 121107 60391 105297 419263 365830 215861 334603
9377 334603 367010 298961 306877 325089 299754 159017 300448 494798 518589 518454 413310
9366 413310 314784 36573 45823 131709 79862 -7757 -10434 33902 -107627 -138281 58026
9355 58026 189249 113448 -102821 -228153 -149901 -162637 -304775 -30345 255776 289416 238691
9344 238691 139760 50305 167524 178381 -69062 -301061 -211660 -135890 -223832 -218645 -295765
9333 -295765 -47906 -72454 23380 171011 404520 375616 57314 173713 190180 183549 227771
9322 227771 366092 296291 198529 3049 6107 146451 -11641 -5664 -157209 -138997 -64411
9311 -64411 58889 -126873 -7034 178692 115316 149506 -16371 -38075 -120205 -106948 -43595
9300 -43595 161262 139142 -78127 75400 135977 73376 -108608 -234184 -69757 30389
9290 30389 51767 89574 -35939 71832 74921 87097 47420 -69319 -101814 -157930 -106828
9279 -106828 -63352 43943 57540 64365 127153 116692 -69291 -251017 -13749 -93326 -117866
9268 -117866 -74786 40559 335683 242211 5550 183169 379309 382085 57129 -34379 -10700
9257 -10700 -151416 -4123 -68048 -243188 -182388 229382 579209 425916 288073 121429
9247 121429 -53570 99752 212267 157219 132571 120240 144450 195792 263211 328716 292424
9236 292424 357314 49119 -34559 -120852 -179166 -180627 141699 311718 130843 167426 173671
9225 173671 246012 100321 7630 156465 92796 115697 213712 323018 325165 401327 235089
9214 235089 565179 463642 92778 107116 226099 233610 265776 328608 224172 82876 207772
9203 207772 292418 91094 69725 468611 512322 309736 342559 85865 193403 137212 -23005
9192 -23005 -108627 51920 164722 -79731 -159491 83285 350063 259858 126674 169294 204740
9181 204740 189882 279324 465181 221059 -87196 121592 14805 49508 104083 119225 -138419
9170 -138419 -55951 53719 180312 551860 519440 576008 314370 173165 -2708 131089
9160 131089 381631 366140 255098 283935 516820 455334 456330 408780 575955 386854 303059
9149 303059 383895 428853 438491 346947 292537 394772 615402 731517 814694 917042 847737
9138 847737 736372 622554 631729 432879 172237 341721 421000 565201 421341 159046
9128 159046 328110 511504 635675 726430 699656 448309 353698 171990 141477 244683
9118 244683 313183 352267 461243 423749 347434 572460 689976 814464 578775 291951
9108 291951 268843 497961 671607 785376 1204727 1482490 1318233 1021707 790705 706532
9098 706532 783153 866087 863642 969862 1032677 901144 979158 1125701 1355402 1505383 1695243
9087 1695243 1659794 1762834 2060001 2052595 2584278 2874957 3045601 2904069 2966989 3168786
9077 3168786 3238937 3268618 3349866 3703849 3963725 4559368 5188950 5882156 6551325 7184015
9067 7184015 8027851 9334554 10679341 12151031 14130868 16647180 20036273 24588203
9059 24588203 30552396 38951003 50774768 67395457 89336247 115143171 137536651
9052 137536651 145618018 134658231 111226392 85642369 64355224 48500762 36927461
9045 36927461 28692207 23242573 18993134 15557017 13216769 11572922 10053549 8716066
9037 8716066 7609327 6781104 6049325 5196000 4462649 3967118 3651609 3465650 3072397
9028 3072397 2778085 2739595 2559848 2266311 1963423 1643507 1220670 1094616 1062694 1050113
9018 1050113 1192424 1033409 1045126 1202485 1180081 1102959 778695 485445 615250 748659
9008 748659 545061 471586 462742 251553 215894 391931 555846 487215 504636 593015 536376
8997 536376 429253 277098 135857 143118 16800 181733 75863 48467 83008 109740 479987
8986 479987 778975 575059 614680 690064 649526 589812 383363 29631 -34416 78195 219591
8975 219591 274793 16114 -229884 -327901 -109943 -91773 -124157 73899 162823 83535 47701
8964 47701 -83758 -159782 -162080 -85903 -74955 209037 402113 130438 5544 290658 623678
8953 623678 513966 272970 193850 114210 105350 73096 -100797 -188123 -204647 -323184 -296063
8942 -296063 -381599 -572286 -457927 -291652 -248571 -6722 134298 235284 173150 19421
8932 19421 207784 60882 -76472 314306 511533 267074 356402 327639 224228 417018
8922 417018 397365 23165 -277212 6543 106388 -205908 -430172 -500534 -346700 -114698
8912 -114698 106553 202898 266681 282821 307455 192762 369825 513401 161208 -25870
$$ [...]
##END NTUPLES=NMR SPECTRUM
##END=
