##TITLE=XTC-814d_2
##JCAMPDX= 6.0         $$ Bruker NMR JCAMP-DX V2.0
##DATA TYPE= NMR SPECTRUM
##DATA CLASS= NTUPLES
##ORIGIN= BRUKER
##OWNER= patiny
$$ 1.79 TOPSPIN		Version 3.0
$$ 2012-05-19 08:51:32.678 +0200  patiny@icmbsg005
$$ Compression mode = diff/dup
##.OBSERVE FREQUENCY= 400.13188181139
##.OBSERVE NUCLEUS= ^1H
##.ACQUISITION MODE= SIMULTANEOUS (DQD)
##.ACQUISITION SCHEME= undefined
##.AVERAGES= 16
##.DIGITISER RES= 23
##SPECTROMETER/DATA SYSTEM= spect
##.PULSE SEQUENCE= zgpr
##.SOLVENT NAME= D2O
##.SHIFT REFERENCE= INTERNAL, D2O, 1, 11.69961
##AUDIT TRAIL= $$ (NUMBER, WHEN, WHO, WHERE, PROCESS, VERSION, WHAT)
$$ ##TITLE= Audit trail, TOPSPIN		Version 3.0
$$ ##JCAMPDX= 5.01
$$ ##ORIGIN= Bruker BioSpin GmbH
$$ ##OWNER= patiny
$$ $$ /opt/data/patiny/nmr/XTC-814d_2/11/pdata/1/auditp.txt
$$ ##AUDIT TRAIL=  $$ (NUMBER, WHEN, WHO, WHERE, PROCESS, VERSION, WHAT)
(   1,<2012-05-19 08:51:31.274 +0200>,<patiny>,<icmbsg005>,<go>,<TOPSPIN 3.0>,
      <created by zg
	started at 2012-05-19 08:49:45.365 +0200,
	POWCHK enabled, PULCHK disabled,
       configuration hash MD5:
       77 C7 B7 C4 10 F4 BA 30 64 2E BB 52 82 F2 DA 41
       data hash MD5: 32K
       1E 22 44 45 C3 86 BE 8B A9 AD 89 98 10 50 21 07>)
(   2,<2012-05-19 08:51:31.665 +0200>,<patiny>,<icmbsg005>,<audit>,<TOPSPIN 3.0>,
      <user comment:
       ICON-NMR User ID: patiny
       data hash MD5: 32K
       1E 22 44 45 C3 86 BE 8B A9 AD 89 98 10 50 21 07>)
(   3,<2012-05-19 08:51:32.203 +0200>,<patiny>,<icmbsg005>,<proc1d>,<TOPSPIN 3.0>,
      <Start of raw data processing
       ef LB = 0 FT_mod = 6 PKNL = 1 SI = 16K 
       data hash MD5: 16K
       B1 E8 9D 0F 6D EC DF 8B 8E C4 96 A3 C4 E7 33 C1>)
(   4,<2012-05-19 08:51:32.299 +0200>,<patiny>,<icmbsg005>,<proc1d>,<TOPSPIN 3.0>,
      <apk 
       data hash MD5: 16K
       F5 25 B0 BD 8A D7 0D 89 A8 30 3A 1A DF 43 4D 0E>)
(   5,<2012-05-19 08:51:32.324 +0200>,<patiny>,<icmbsg005>,<proc1d>,<TOPSPIN 3.0>,
      <abs ABSG = 5 
       data hash MD5: 16K
       07 97 CD 15 8D DD 11 9D 34 7F 64 80 16 75 9E 4A>)
$$ ##END=
$$ 
$$ $$ hash MD5
$$ $$ 62 BB 1E 2A C6 4A C1 91 2F 43 A9 2D F4 ED BE C5
##$RELAX= 
##$RELAX= 
##$RELAX= 
##$RELAX= 
##$RELAX= 
##$RELAX= 
##$RELAX= 
##$RELAX= 
##$RELAX= 
##$RELAX= 
##$RELAX= 
##$RELAX= 
##$RELAX= 
$$ Bruker specific parameters
$$ --------------------------
##$DATPATH= </opt/data/patiny/nmr>
##$EXPNO= 11
##$NAME= <XTC-814d_2>
##$PROCNO= 1
##$ACQT0= -9.16730304209974
##$AMP= (0..31)
100 100 100 100 100 100 100 100 100 100 100 100 100 100 100 100 100 100
100 100 100 100 100 100 100 100 100 100 100 100 100 100
##$ANAVPT= -1
##$AQSEQ= 0
##$AQ_mod= 3
##$AUNM= <au_zgglp>
##$AUTOPOS= <17 >
##$BF1= 400.13
##$BF2= 400.13
##$BF3= 400.13
##$BF4= 400.13
##$BF5= 400.13
##$BF6= 400.13
##$BF7= 400.13
##$BF8= 400.13
##$BYTORDA= 0
##$CAGPARS= (0..11)
0 0 0 0 0 0 0 0 0 0 0 0
##$CFDGTYP= 0
##$CFRGTYP= 9
##$CHEMSTR= <none>
##$CNST= (0..63)
1 1 1 1 1 1 1 1 1 1 1 1 1 1 1 1 1 1 1 1 1 1 1 1 1 1 1 1 1 1 1 1 1 1 1 1
$$ [...]
##$TE2= 0
##$TE3= 0
##$TE4= 0
##$TEG= 300
##$TE_PIDX= 1
##$TE_STAB= (0..8)
2 2 0 0 0 0 0 0 0
##$TL= (0..7)
120 120 120 120 120 120 120 120
##$TP= (0..7)
150 150 150 150 150 150 150 150
##$TPNAME0= <>
##$TPNAME1= <>
##$TPNAME2= <>
##$TPNAME3= <>
##$TPNAME4= <>
##$TPNAME5= <>
##$TPNAME6= <>
##$TPNAME7= <>
##$TPOAL= (0..7)
0.5 0.5 0.5 0.5 0.5 0.5 0.5 0.5
##$TPOFFS= (0..7)
0 0 0 0 0 0 0 0
##$TUNHIN= 0
##$TUNHOUT= 0
##$TUNXOUT= 0
##$USERA1= <>
##$USERA2= <>
##$USERA3= <>
##$USERA4= <>
##$USERA5= <>
##$V9= 5
##$VALIST= <>
##$VCLIST= <>
##$VD= 0
##$VDLIST= <>
##$VPLIST= <>
##$VTLIST= <>
##$WBST= 1024
##$WBSW= 4
##$XGAIN= (0..3)
0 0 0 0
##$XL= 0
##$YL= 0
##$YMAX_a= 5230802
##$YMIN_a= -4201427
##$ZGOPTNS= <>
##$ZL1= 120
##$ZL2= 120
##$ZL3= 120
##$ZL4= 120
##$ABSF1= 11.69961
##$ABSF2= -2.293603
##$ABSG= 5
##$ABSL= 3
##$ALPHA= 0
##$AQORDER= 0
##$ASSFAC= 0
##$ASSFACI= 0
##$ASSFACX= 0
##$ASSWID= 0
##$AUNMP= <save_auto_nonLDAP.pm>
##$AXLEFT= 0
##$AXNAME= <>
##$AXNUC= <1H>
##$AXRIGHT= 0
##$AXTYPE= 0
##$AXUNIT= <>
##$AZFE= 0.1
##$AZFW= 0.1
##$BCFW= 0
##$BC_mod= 0
##$BYTORDP= 0
##$COROFFS= 0
##$CY= 15
##$DATMOD= 1
##$DC= 0
##$DFILT= <>
##$DTYPP= 0
##$ERETIC= no
##$F1P= 0
##$F2P= 0
##$FCOR= 0.5
##$FTSIZE= 16384
##$FT_mod= 6
##$GAMMA= 0
##$GB= 0
##$INTBC= 1
##$INTSCL= 1
##$ISEN= 128
##$LB= 0
##$LEV0= 0
##$LPBIN= 0
##$MAXI= 10000
##$MC2= 0
##$MEAN= 0
##$ME_mod= 0
##$MI= 0
##$NCOEF= 0
##$NC_proc= -5
##$NLEV= 6
##$NOISF1= 0
##$NOISF2= 0
##$NSP= 0
##$NTH_PI= 0
##$NZP= 0
##$OFFSET= 11.69961
##$PC= 1
##$PHC0= 86.37099
##$PHC1= 4.463141
##$PH_mod= 1
##$PKNL= yes
##$PPARMOD= 0
##$PPDIAG= 0
##$PPIPTYP= 0
##$PPMPNUM= 2147483647
##$PPRESOL= 1
##$PSCAL= 0
##$PSIGN= 0
##$PYNMP= <proc.py>
##$REVERSE= no
##$SF= 400.13
##$SI= 16384
##$SIGF1= 0
##$SIGF2= 0
##$SINO= 0
##$SIOLD= 16384
##$SPECTYP= <>
##$SREGLST= <1H.CDCl3>
##$SSB= 0
##$STSI= 16384
##$STSR= 0
##$SW_p= 5599.10414333707
##$SYMM= 0
##$S_DEV= 0
##$TDeff= 32768
##$TDoff= 0
##$TI= <>
##$TILT= no
##$TM1= 0
##$TM2= 0
##$TOPLEV= 0
##$USERP1= <>
##$USERP2= <>
##$USERP3= <>
##$USERP4= <>
##$USERP5= <>
##$WDW= 1
##$XDIM= 16384
##$YMAX_p= 431794760
##$YMIN_p= -412615
##$CURPLOT= <Cups-PDF>
##$CURPRIN= <$Cups-PDF>
##$DFORMAT= <normdp>
##$LAYOUT= <+/1D_X+nopp.xwp>
##$LFORMAT= <normlp>
##$PFORMAT= <normpl>
$$ End of Bruker specific parameters
$$ ---------------------------------
##NTUPLES= NMR SPECTRUM
##VAR_NAME=  FREQUENCY,     SPECTRUM/REAL,   SPECTRUM/IMAG
##SYMBOL=    X,             R,               I
##VAR_TYPE=  INDEPENDENT,   DEPENDENT,       DEPENDENT
##VAR_FORM=  AFFN,          ASDF,            ASDF
##VAR_DIM=   16384,         16384,           16384
##UNITS=     HZ,            ARBITRARY UNITS, ARBITRARY UNITS
##FACTOR=    0.3417421962486, 1,             1
##FIRST=     5598.76240114082, 49599,        -66159
##LAST=      0,             -71811,          -105007
##MIN=       0,             -412615,         0
##MAX=       5598.76240114082, 431794760,    0
$$ Real data points
##PAGE= N=1
##DATA TABLE= (X++(R..R)), XYDATA
$$ [...]
##PAGE= N=2
##DATA TABLE= (X++(I..I)), XYDATA
10441b703210P422P644Q4537Q5267N4368N0775O0603N5560n0082j78359k14834
$$ -2703210 -2695788 -2688144 -2603607 -2518340 -2463972 -2413197 -2352594 -2297034 -2347116 -2525475 -2740309
10430b740309J20671R1803O9231q7547J98352j532J1714l2836J63475J32481j54121
$$ -2740309 -2619638 -2527835 -2458604 -2546151 -2347799 -2349331 -2337617 -2370453 -2206978 -2074497 -2228618
10419b228618J16001n837J13249o1075O3405P0562L2795N9706L0909L396j11195
$$ -2228618 -2112617 -2118454 -2005205 -2066280 -2002875 -1932313 -1899518 -1839812 -1808903 -1805507 -1916702
10408a916702M9459k06089J8594K50066j14090N9355n5026j0859L7784J25363
$$ -1916702 -1867243 -2073332 -2054738 -1804672 -1918762 -1859407 -1914433 -1925292 -1887508 -1762145
10398a762145o1198J28607J15547n2448j9510P2667m0771J51526n7240J49235
$$ -1762145 -1823343 -1694736 -1579189 -1631637 -1651147 -1578480 -1619251 -1467725 -1524965 -1375730
10388a375730j98914Q1228q952K09418q4747J45898q893L3013l7239P6386j75593
$$ -1375730 -1574644 -1493416 -1502368 -1292950 -1377697 -1231799 -1240692 -1207679 -1244918 -1168532 -1344125
10377a344125r1153Q9537p6389o0875j0391q6944J30317j26016L7378N9766J34091
$$ -1344125 -1435278 -1345741 -1422130 -1483005 -1493396 -1580340 -1450023 -1576039 -1538661 -1478895 -1344804
10366a344804P1402L0843N8911j89894O8949J35844l5695N8221r8635P2670J2884
$$ -1344804 -1273402 -1242559 -1183648 -1373542 -1304593 -1168749 -1204444 -1146223 -1244858 -1172188 -1159304
10355a159304Q8141j08723J38500j64848J14831M4285P1960N0851r9212J31597
$$ -1159304 -1071163 -1179886 -1041386 -1206234 -1091403 -1047118 -975158 -924307 -1023519 -891922
10345h91922q2104L613j4624J88618p7343l7505L1679l8589n463P9123k0429N5774
$$ -891922 -974026 -970413 -985037 -796419 -873762 -911267 -879588 -918177 -923640 -844517 -864946 -809172
10333h09172o7477O4161J34996J890j24310J23096J51130m4132r4210j13150P6353
$$ -809172 -876649 -812488 -677492 -675602 -799912 -676816 -525686 -569818 -664028 -777178 -700825
10322g00825n0895J04022j6561j78198p895J25254j26683Q1246M3230N5212L3043
$$ -700825 -751720 -647698 -664259 -842457 -850352 -725098 -851781 -770535 -727305 -672093 -639050
10311f39050q3850R0118N8664m5250J23245r1741J10716L2768k0056j22890n8945
$$ -639050 -722900 -632782 -574118 -619368 -496123 -587864 -477148 -444380 -464436 -587326 -646271
10300f46271J7535J39012k0843j33051J05618j79669N0526Q8579q9132L4206Q6578
$$ -646271 -628736 -489724 -510567 -643618 -538000 -717669 -667143 -578564 -667696 -633490 -546912
10289e46912O7260l9586P3260K6153r0597R9709j4111j50153N9866J11736n8603
$$ -546912 -479652 -519238 -445978 -419825 -510422 -410713 -424824 -574977 -515111 -403375 -461978
10278d61978r5947K13653r5764m3773J77615j19744J20787j4479n1138O6372j9972
$$ -461978 -557925 -344272 -440036 -483809 -306194 -425938 -305151 -319630 -370768 -304396 -324368
10267c24368J4585j0091j024J12455p9116N7274m6826k7093O1688M7534K4863
$$ -324368 -309783 -319874 -320898 -208443 -287559 -230285 -277111 -304204 -242516 -194982 -170119
10256a70119j20171L4802L2317m0454m924J23401p9692Q0192O3938r8187m7920
$$ -170119 -290290 -255488 -223171 -263625 -268549 -145148 -224840 -144648 -80710 -178897 -226817
10245b26817i4741c9503m4849m0841L5496c5436r946m9763b7058k9396k7712C3276
$$ -226817 -94741 -39503 -84352 -125193 -89697 -35436 -45382 -95145 -27058 -56454 -84166 33276
10232g5744o133c5761n3219k7925a5160F0764a00234K5817E4325k6259n971e4876
$$ -75744 -81877 -35761 -88980 -116905 -15160 60764 -100234 -74417 54325 28066 22095 -54876
10219F9394M3776n5971g8412A9165J7446J10442A9992h11A52261l1907b8478G8653
$$ 69394 113170 57199 -78412 19165 36611 147053 19992 -811 152261 120354 -28478 78653
10206A99425C4822R954J24631k3578k5371D5907M6601J30074j03755O6163J44930
$$ 199425 34822 44776 169407 145829 120458 45907 92508 222582 118827 184990 329920
10195C29920o0435j447j6152j12636Q6876p8246Q8043p7937Q8364J45761A56935
$$ 329920 269485 268038 251886 139250 226126 147880 235923 157986 246350 392111 156935
10183B65899j5565A05301J90918r2814l0500J48166j3748Q6328j65881J50102
$$ 265899 250334 105301 296219 203405 172905 321071 307323 393651 227770 377872
10173C77872K881j60063K1456M0635R442J926J7713m3802J23996k1591j0707M2395
$$ 377872 380753 220690 242146 282781 292223 294149 311862 268060 392056 370465 359758 402153
10161D02153q171l0566J8529j788K2383n332j53148J58723o4601O7023K8010k0489
$$ 402153 393982 363416 381945 380157 402540 397208 244060 402783 338182 405205 433215 412726
10149D12726M5888M0j19707J03447L773K17J6676p2888j5725J51911j64032P2563
$$ 412726 458614 458654 338947 442394 446167 446384 463060 390172 374447 526358 362326 434889
10137D34889J2870L5883j15442J35172L2950Q302k603p2850l7248M8020K5498
$$ 434889 447759 483642 368200 503372 536322 544624 542021 469171 431923 479943 505441
10126E05441k1315N8988k6105K7955K0841J12993j85551J44306j12129J35751
$$ 505441 484126 543114 517009 544964 565805 678798 493247 637553 525424 661175
10116F61175n3665R1658j01924j03476R9424k9075K0555O5366j3900l6408R9033
$$ 661175 607510 699168 597244 493768 593192 564117 584672 650038 636138 599730 698763
10105F98763o2516K8811n9935J24162q9390J06298j48812N9278k3363L794L5077
$$ 698763 636247 665058 605123 729285 639895 746193 597381 656659 633296 637090 672167
10094F72167o2058K8047N7598J90393j65636K288M9884p9289Q9821q7597N2226
$$ 672167 610109 638156 695754 886147 720511 722799 772683 693394 783215 695618 747844
10083G47844J0822K339l9279r3765L3653J70616J2278j81268N1823L4041J3786
$$ 747844 758666 761005 721726 627961 661614 832230 844508 663240 715063 749104 762890
10072G62890Q8222j38567J14730q5552J32337k2803k3932r599J8251j8227l662
$$ 762890 851112 712545 827275 741723 874060 851257 827325 817726 835977 817750 814088
10061H14088J12866o3070O0284o6526M4685K1908n7532J6019j182l4368j8343
$$ 814088 926954 863884 924168 857642 902327 924235 866703 882722 881540 847172 828829
10050H28829R9425K6310l6663J6417k3981n044P9173n8813J01608j06408J0938
$$ 828829 928254 954564 917901 934318 910337 905293 984466 925653 1027261 920853 931791
10039I31791k4879J8347M9102K3850m2581L5956N9226k14073J87889o1177Q9656
$$ 931791 906912 925259 974361 998211 955630 991586 1050812 836739 1024628 963451 1053107
10028A053107l729q5392J27942q8185k6839M4237l9082R3713K7208r9937J78633
$$ 1053107 1049378 963986 1091928 1003743 976904 1021141 982059 1075772 1102980 1003043 1181676
10017A181676k16702K01226j57990M3678K2258M2238l4944O35R1220q4578k7162
$$ 1181676 964974 1166200 1008210 1051888 1074146 1116384 1081440 1082075 1173295 1088717 1061555
10006A061555J27820n5741m1282P1694p9883Q3179q6654O5640j5152K8745K8626
$$ 1061555 1189375 1133634 1092352 1164046 1084163 1167342 1080688 1146328 1131176 1159921 1188547
9995A188547m1182r87J7512p8811M6653R3993o6271m2018J31412j3961M7562m772
$$ 1188547 1147365 1146378 1163890 1085079 1131732 1225725 1159454 1117436 1248848 1234887 1282449 1277677
9983A277677n5879n319j5205m5528J26531o6221Q2499k6588j46170R4444P3315
$$ 1277677 1221798 1216479 1201274 1155746 1282277 1216056 1298555 1271967 1125797 1220241 1293556
9972A293556l556o5700P3787M6627l4648L45m6310J11966m8312j91879Q2978P9131
$$ 1293556 1290000 1224300 1298087 1344714 1310066 1310411 1264101 1376067 1327755 1135876 1218854 1297985
9960A297985N9461j790n77M1618R039J45790k73677J29103r582Q2238p9230N0990
$$ 1297985 1357446 1355656 1355079 1396697 1405736 1551526 1277849 1406952 1397370 1479608 1400378 1451368
9948A451368k7783q5892P8534M5395O6232n8264k0213M1081P7043j67396K15941
$$ 1451368 1423585 1337693 1416227 1461622 1527854 1469590 1449377 1490458 1567501 1400105 1616046
9937A616046r4432n0182r4634J08359O3980k644p1758k2782N9032P5224p9530
$$ 1616046 1521614 1471432 1376798 1485157 1549137 1546493 1474735 1451953 1510985 1586209 1506679
9926A506679M4487O517O6851n6750l9029N5925j27290K69086j37690P177j4553
$$ 1506679 1551166 1557683 1624534 1567784 1528755 1584680 1457390 1726476 1588786 1595963 1581410
9915A581410N4226K6419o8475P2983m7148J6727R3896M1012p8069L8286r2570
$$ 1581410 1635636 1662055 1593580 1666563 1619415 1636142 1730038 1771050 1692981 1731267 1638697
9904A638697P424J39978l6622j48147K73447j18183R9051n9980m2691R2124k6578
$$ 1638697 1646121 1786099 1749477 1601330 1874777 1756594 1855645 1795665 1752974 1845098 1818520
9893A818520j3323p9757J96927j77838J60246q5745k1662p2073K50560n6604j1227
$$ 1818520 1805197 1725440 1922367 1744529 1904775 1819030 1797368 1725295 1975855 1919251 1908024
9882A908024N1769m6504m1952K8047o7805R2830P6539j4844M6231N3745j87984
$$ 1908024 1959793 1913289 1871337 1899384 1831579 1924409 2000948 1986104 2032335 2086080 1898096
9871A898096J30516n630O3020k3224n300m9652K5737M088j3467k0411J90735J0954
$$ 1898096 2028612 2022982 2086002 2062778 2057478 2007826 2033563 2037651 2024184 2003773 2194508 2205462
9859B205462j14602J03318j2012J42346j30169j4678J04228J44337q8831K1350
$$ 2205462 2090860 2194178 2182166 2324512 2194343 2179665 2283893 2428230 2339399 2360749
9849B360749J62235k4071J52235J58668j10456J91713m34725n08924n39545q0214
$$ 2360749 2522984 2498913 2651148 2809816 2699360 2891073 2456348 1947424 1407879 1327665
9839A327665J60855J23930n1859K56299k2838K9020J76645N1428J3334o7038M1024
$$ 1327665 1488520 1612450 1560591 1816890 1794052 1823072 1999717 2051145 2064479 1997441 2038465
9828B038465N5189R760q0403J72273J2803p4937M0426O7863Q6911K1876k23419
$$ 2038465 2093654 2103414 2023011 2195284 2208087 2133150 2173576 2241439 2328350 2350226 2126807
9817B126807K1661j2933J60042R2706j8613N1599M8754j65098R5403r5015M4408
$$ 2126807 2148468 2135535 2295577 2388283 2369670 2421269 2470023 2304925 2400328 2305313 2349721
9806B349721J03943Q6739j13480J06954r5888M0483P1892l0238P9311j45703O2199
$$ 2349721 2453664 2540403 2426923 2533877 2437989 2478472 2550364 2520126 2599437 2453734 2515933
9795B515933N9067k4677j124J35422M9839m3001q0857M8034P6780p3304J11354
$$ 2515933 2575000 2550323 2549199 2684621 2734460 2691459 2610602 2658636 2735416 2662112 2773466
9784B773466r4553q407J20006m7319P0610L6784J5648K8371o4642J66482m1022
$$ 2773466 2678913 2670506 2790512 2743193 2813803 2850587 2866235 2894606 2829964 2996446 2955424
9773B955424j3616m3570o6000J56038L5516p8942J18550k3450j01311P0974J33629
$$ 2955424 2941808 2898238 2832238 2988276 3023792 2944850 3063400 3039950 2938639 3009613 3143242
9762C143242K7373n8240j4688P7472K8722k1365N2659p858p3610J95474n6410
$$ 3143242 3170615 3112375 3097687 3175159 3203881 3182516 3235175 3227317 3153707 3349181 3292771
9751C292771j18299n442J79518N7868R1207L005n9051L1675Q006L8452L9772O67
$$ 3292771 3174472 3169030 3348548 3406416 3497623 3500628 3441577 3473252 3481258 3519710 3559482 3560149
9739C560149N4897j5140J59354j32218J9353J6897J13886q0880J21786J17928
$$ 3560149 3615046 3599906 3759260 3627042 3646395 3663292 3777178 3696298 3818084 3936012
9729C936012j18544L1276J09228j20418M0507J13290P1939n1675M7995J29343
$$ 3936012 3817468 3848744 3957972 3837554 3878061 3991351 4063290 4011615 4059610 4188953
9719D188953p972P8337J02735k08189L1945J58395N6574p5929J72463j13392R0549
$$ 4188953 4180981 4259318 4362053 4153864 4185809 4344204 4400778 4324849 4497312 4383920 4474469
9708D474469J39675M4044n4592m3162N3253N1828L3608L5106Q7041O1901p0439
$$ 4474469 4614144 4658188 4603596 4560434 4613687 4665515 4699123 4734229 4821270 4883171 4812732
9697D812732J34421Q3933j5966J94473k01j15918K04895m6859J94115l1026J19303
$$ 4812732 4947153 5031086 5015120 5209593 5209392 5093474 5298369 5251510 5445625 5414599 5533902
9686E533902j6772J17236R2103j05239J20503N2106M9841J11276q1961J50689
$$ 5533902 5517130 5634366 5726469 5621230 5741733 5793839 5843680 5954956 5872995 6023684
9676F023684N4029J57228J19582j42120J94574O5447J2047K64021K7199j6474
$$ 6023684 6077713 6234941 6354523 6212403 6406977 6472424 6484471 6748492 6775691 6759217
9666F759217R8644J53852Q8558J64797m0966K01769O7857J04816L4962J57923
$$ 6759217 6857861 7011713 7100271 7265068 7224102 7425871 7493728 7598544 7633506 7791429
9656G791429J68636o2480K83994N1637J36398J26567J19815J33810J69475J33114
$$ 7791429 7960065 7897585 8181579 8233216 8369614 8496181 8615996 8749806 8919281 9052395
9646I052395J80485J89543P9438J27258K22029K24011K57914j5014L83492K84603
$$ 9052395 9232880 9422423 9501861 9629119 9851148 10075159 10333073 10318059 10701551 10986154
9636A0986154J66209K58237J69503K24618K82554L64546K31453K58979L26509
$$ 10986154 11152363 11410600 11580103 11804721 12087275 12451821 12683274 12942253 13268762
9627A3268762L01157M84028K49020M75818M78144L62924M49342N44280O25033
$$ 13268762 13569919 14053947 14302967 14778785 15256929 15619853 16069195 16613475 17238508
9618A7238508N22545M65874O19693P41325P70558P99290P99012J042601Q55506
$$ 17238508 17761053 18226927 18846620 19587945 20358503 21157793 21956805 22999406 23854912
9609B3854912J238536J172976J404530J480049J658088J773557K137163K290629
$$ 23854912 25093448 26266424 27670954 29151003 30809091 32582648 34719811 37010440
9601C7010440K880501L220615L829897M619090N751970P547240R990544J2500020
$$ 37010440 39890941 43111556 46941453 51560543 57312513 64859753 74850297 87350317
9593H7350317J8148819K5800009J0864261k0035749B2900767a20780904l5087476
$$ 87350317 105499136 131299145 142163406 122127657 22900767 -120780904 -155868380
9586a55868380J6856450K5763131J8984339J4344912J1121892Q960943P228212
$$ -155868380 -139011930 -113248799 -94264460 -79919548 -68797656 -59836713 -52608501
9579e2608501N359008M422299L618745L081280K713525K333543J998823J612858
$$ -52608501 -47249493 -42827194 -39208449 -36127169 -33413644 -31080101 -29081278 -27468420
9571b7468420J527057J356415J309387J103598R17115J030493P90067R93851M40891
$$ -27468420 -25941363 -24584948 -23275561 -22171963 -21254848 -20224355 -19434288 -18440437 -17999546
9562a7999546P77071N58004N62435P22093M52335M15980M78848M85511K15989
$$ -17999546 -17222475 -16664471 -16102036 -15379943 -14927608 -14511628 -14032780 -13547269 -13331280
9553a3331280M40331L29751M16050L45273L17674M09859J23832K89415O0357L47017
$$ -13331280 -12890949 -12561198 -12145148 -11799875 -11482201 -11072342 -10948510 -10659095 -10598738 -10251721
9543a0251721K26164K16404L40267J82542J01369J70860J10762L72878Q1583K03800
$$ -10251721 -10025557 -9809153 -9468886 -9286344 -9184975 -9014115 -8903353 -8530475 -8448892 -8245092
9533h245092K431K38708J07261J04998J84952L62014j42397K46813J05940J01886
$$ -8245092 -8242661 -8003953 -7896692 -7791694 -7606742 -7244728 -7387125 -7140312 -7034372 -6932486
9523f932486R9857J11504K23806l214J41951L0655J0545J48379J18750M7450J96612
$$ -6932486 -6832629 -6721125 -6497319 -6500533 -6358582 -6327927 -6317382 -6169003 -6050253 -6002803 -5806191
9512e806191l1316K53737j9825J28744L5838m3374K47200N9167R3412q4272P7230
$$ -5806191 -5837507 -5583770 -5603595 -5474851 -5439013 -5482387 -5235187 -5176020 -5082608 -5166880 -5089650
9501e089650Q1217J48416O6863L060J31507M1375k4053Q5721k5916J33716K2218
$$ -5089650 -5008433 -4860017 -4793154 -4790094 -4658587 -4617212 -4641265 -4555544 -4581460 -4447744 -4425526
9490d425526Q6320J83080j33990J68435l0358J35017j23943J11483O2651J2733
$$ -4425526 -4339206 -4156126 -4290116 -4121681 -4152039 -4017022 -4140965 -4029482 -3966831 -3954098
9480c954098j6374J77917L8794j05641R3135N8845Q7421J8120j1824Q7374q0542
$$ -3954098 -3970472 -3792555 -3753761 -3859402 -3766267 -3707422 -3620001 -3601881 -3613705 -3526331 -3606873
9469c606873L69023j68728l8877O2157l3770J51860n3092Q4045p786K05515m9534
$$ -3606873 -3237850 -3406578 -3445455 -3383298 -3417068 -3265208 -3318300 -3234255 -3242041 -3036526 -3086060
9458c086060k6028l8193J19413J21072j42219J13982L7706J3888M6726O819p7431
$$ -3086060 -3112088 -3150281 -3030868 -2909796 -3052015 -2938033 -2900327 -2886439 -2839713 -2832894 -2910325
9447b910325J56644O3604q9813P2279K2105K3687M7462l6516l4053N9406O0850
$$ -2910325 -2753681 -2690077 -2779890 -2707611 -2685506 -2661819 -2614357 -2650873 -2684926 -2625520 -2564670
9436b564670k3200J42020j34694k9538K95960j09755L4268P637l305M8198j1158
$$ -2564670 -2587870 -2445850 -2580544 -2610082 -2314122 -2423877 -2389609 -2381972 -2385277 -2337079 -2348237
9425b348237j05522J20971K7479J23916o6027Q7909l0306j5551N5047j2845j2105
$$ -2348237 -2453759 -2332788 -2305309 -2181393 -2247420 -2159511 -2189817 -2205368 -2150321 -2163166 -2175271
9414b175271M5628O6395n7042J08659m8033P6977j991Q304m0886L4092j16607
$$ -2175271 -2129643 -2063248 -2120290 -2011631 -2059664 -1982687 -1984678 -1976374 -2017260 -1983168 -2099775
9403b099775J67948j3594R9362m1382R8164q2713q4646J31206P5496m6753N4625
$$ -2099775 -1931827 -1945421 -1846059 -1887441 -1789277 -1871990 -1956636 -1825430 -1749934 -1796687 -1742062
9392a742062R4316l4002n2888n7535J78595k10345J54005K2609M2104j00243R6754
$$ -1742062 -1647746 -1681748 -1734636 -1792171 -1613576 -1823921 -1669916 -1647307 -1605203 -1705446 -1608692
9381a608692j7189j86617J85179q094J66842j44733L5483K3025Q1531j03707J31283
$$ -1608692 -1625881 -1812498 -1627319 -1635413 -1468571 -1613304 -1577821 -1554796 -1473265 -1576972 -1445689
9370a445689j76182J47982L9398Q6479j33787R9830o9346J28906j51115O6171
$$ -1445689 -1621871 -1473889 -1434491 -1348012 -1481799 -1381969 -1451315 -1322409 -1473524 -1407353
9360a407353K3329n2911J21242r3734J25018j5849M8013J4423j991j1261O6592
$$ -1407353 -1384024 -1436935 -1315693 -1409427 -1284409 -1300258 -1252245 -1237822 -1239813 -1251074 -1184482
9349a184482m7519Q4508L0438q6506J25018J77136k09416J20627o8475O628K30600
$$ -1184482 -1232001 -1147493 -1117055 -1203561 -1078543 -901407 -1110823 -990196 -1058671 -1052043 -821443
9338h21443j28198J13546J69341l2913l4379K20433R6879o4676o8596m78117o07352
$$ -821443 -949641 -836095 -666754 -699667 -734046 -513613 -416734 -481410 -550006 -1028123 -1635475
9327a635475k51041q5710J82418K08684K1573J70274l9352O1871K7604p3127K88293
$$ -1635475 -1886516 -1972226 -1789808 -1581124 -1559551 -1389277 -1428629 -1366758 -1339154 -1412281 -1123988
9316a123988j45309L9788m096L6495J04562k139j5131m8365P7675k1131r9020
$$ -1123988 -1269297 -1229509 -1233605 -1197110 -1092548 -1094687 -1109818 -1158183 -1080508 -1101639 -1200659
9305a200659Q0907K6239m4267J64794l1411K5679k24686K65448N479p7287m463
$$ -1200659 -1119752 -1093513 -1137780 -972986 -1004397 -978718 -1203404 -937956 -932477 -1009764 -1014227
9294a014227j4677J36599J1396m5561p6816m7876Q8285o0958J5488p930J57985
$$ -1014227 -1028904 -892305 -880909 -926470 -1003286 -1051162 -962877 -1023835 -1008347 -1016277 -858292
9283h58292n4771o7085N9864M8136K1184J03736k4917m6832j13930J35580o7256
$$ -858292 -913063 -980148 -920284 -872148 -850964 -747228 -772145 -818977 -932907 -797327 -864583
9272h64583l9998J24058m6966R4156j07854M1386J06351l2951K1214j9339n7162
$$ -864583 -904581 -780523 -827489 -733333 -841187 -799801 -693450 -726401 -705187 -724526 -781688
9261g81688O3807P0304m3072n1093N8833L2729j48987J87540j07915K9881J37082
$$ -781688 -717881 -647577 -690649 -741742 -682909 -650180 -799167 -611627 -719542 -689661 -552579
9250e52579q6036m5294o2077O0897j8509M8674k4109L9292r3060J18736L1096
$$ -552579 -638615 -683909 -745986 -685089 -703598 -654924 -679033 -639741 -732801 -614065 -582969
9239e82969k0976o2963o3548K05551j15522N1636j05781J44900j20529J16768
$$ -582969 -603945 -666908 -730456 -524905 -640427 -588791 -694572 -549672 -670201 -553433
9229e53433j00902K5165L7422K2730O0463o7408j00706L5098m7335R5956L8302
$$ -553433 -654335 -629170 -591748 -569018 -508555 -575963 -676669 -641571 -688906 -592950 -554648
9218e54648k6389Q3659j4061Q0488m9161O0907o0092j04774J18770O1769j89905
$$ -554648 -581037 -497378 -511439 -430951 -480112 -419205 -479297 -584071 -465301 -403532 -593437
9207e93437o864J02754K7114j45466K11364j53242J01888J26440j32755l7659
$$ -593437 -600301 -497547 -470433 -615899 -404535 -557777 -455889 -329449 -462204 -499863
9197d99863J69837j1273k50894K79831j22421L7358L8490K6581j9447n1624n915
$$ -499863 -330026 -341299 -592193 -312362 -434783 -397425 -358935 -332354 -351801 -403425 -409340
9186d09340l2258P2904r8723M6931P2304j27862b25685j52019J1803n8717N5570
$$ -409340 -441598 -368694 -467417 -420486 -348182 -476044 -225685 -377704 -365901 -424618 -369048
9175c69048L3361M9055p0285L1165n7913R4633q7986P1239k5881Q8363j34409
$$ -369048 -335687 -286632 -356917 -325752 -383665 -289032 -377018 -305779 -331660 -243297 -377706
9164c77706J07411k4783o6113R3075m0231m5289P0310m0352R8289j31148R1341
$$ -377706 -270295 -295078 -361191 -268116 -308347 -353636 -283326 -323678 -225389 -356537 -265196
9153b65196j25285J12673M1052J4796m1976L8128k8730j5013o5500J03623N3266
$$ -265196 -390481 -277808 -236756 -221960 -263936 -225808 -254538 -269551 -335051 -231428 -178162
9142a78162o9215Q2091r7221J07077j47830J14461p8851J9683a18960o4316N8276
$$ -178162 -247377 -165286 -262507 -155430 -303260 -188799 -267650 -247967 -118960 -183276 -125000
9131a25000j32424M0985k799O0928r7086P7995k1987N5024J9103n4108f8345p3972
$$ -125000 -257424 -216439 -219238 -158310 -255396 -177401 -199388 -144364 -125261 -179369 -68345 -142317
9119a42317e7104k2468o9051M9136l0569j1070n9804P8258r6356J08313J3935
$$ -142317 -57104 -79572 -148623 -99487 -130056 -141126 -200930 -122672 -219028 -110715 -96780
9108i6780n0711J4248J0531B8870a65759O6069K0223j17748O8182L9283q3854
$$ -96780 -147491 -133243 -122712 28870 -165759 -99690 -79467 -197215 -129033 -89750 -173604
9097a73604F3238a40089e1306O609j98667h9325l1243L1518L6125L883B4716h1555
$$ -173604 63238 -140089 -51306 -44697 -243364 -89325 -120568 -89050 -52925 -49042 24716 -81555
9084e059C644L9946b6668B9657a04859f070q7446C3821a43587B8574a90764N4949
$$ -5059 3644 43590 -26668 29657 -104859 -6070 -93516 33821 -143587 28574 -190764 -135815
9072a35815A01212k1304a50851A0412f9395a1309m7621A21056C3978o374N6634
$$ -135815 101212 79908 -150851 10412 -69395 -11309 -58930 121056 33978 27604 84238
9061H4238B0367K426F47P8182a5463O784I683L7741k0133J0869J61439k6331d0145
$$ 84238 20367 22793 647 78829 -15463 -8679 9683 47424 27291 38160 199599 173268 -40145
9047F635B035N6507b4132l8310G8902L822m0222B795R8814d6848A15694C5299
$$ 6635 2035 58542 -24132 -62442 78902 82724 42502 2795 101609 -46848 115694 35299
9034I6203A0852L6885j4287J01296J0268M3223G678J32852M4845E1525k676N7946
$$ 96203 10852 47737 33450 134746 145014 188237 7678 140530 185375 51525 48849 106795
9022A06795N5308D290K26186n1454j3260k7935m6956k2342J47917o4828n115M0022
$$ 106795 162103 4290 230476 179022 165762 137827 90871 68529 216446 151618 146503 186525
9010A86525E2751K08427j14350J32762m8300m5852R080A8173J78692r0638m0924
$$ 186525 52751 261178 146828 279590 231290 185438 194518 18173 196865 106227 65303
8999F5303P9190N2241n8763O7161M8139C666L04599o3542j7117o8137Q5733r2926
$$ 65303 144493 196734 137971 205132 253271 3666 308265 244723 227606 159469 245202 152276
8987A52276Q6916Q685K687j00344J14921j17967R1039L2403l165m3931M2518p5929
$$ 152276 239192 247877 250564 150220 265141 147174 238213 270616 267451 223520 266038 190109
8975A90109M4460L3190A18649Q7720k2397o0396K70096j12815R066m7041J7969
$$ 190109 234569 267759 118649 206369 183972 123576 393672 280857 289923 242882 260851
8964B60851j02764N4387o9115J12507N7755l1937r9209K03821j02490J9521j4647
$$ 260851 158087 212474 143359 255866 313621 281684 182475 386296 283806 303327 288680
8953B88680j25107O3188J11429j41201N3572l8829q154J30962k0576j6092p301
$$ 288680 163573 226761 338190 196989 250561 211732 203578 334540 313964 297872 290571
8942B90571J11528n4191j09319J27015j7537P644o6839J43986n3503q4997l271
$$ 290571 402099 347908 238589 365604 348067 355711 288872 432858 379355 294358 291087
8931B91087J29799q4382k4362J0091N5205m1031J49337k24040J21501k0406j2555
$$ 291087 420886 336504 312142 322233 377438 336407 485744 261704 383205 362799 350244
8920C50244J11444j68053K5463R6523n0730R9534j15716m938P5361O4863j95545
$$ 350244 461688 293635 319098 415621 364891 464425 348709 343771 419132 483995 288450
8909B88450O5744N2066n3265J35181p7828o5144J20127o3606J4115n2683L4892
$$ 288450 354194 406260 352995 488176 410348 345204 465331 401725 415840 363157 398049
8898C98049m9651m5188j1011J24224K5024o7928Q1381q544j8621o2314R9180l1715
$$ 398049 348398 303210 292199 416423 441447 373519 454900 446356 427735 365421 464601 432886
8886D32886r9124J16869m1714k5777P2330N6335J0477j31290J42840j5612j2187
$$ 432886 333762 450631 408917 383140 455470 511805 522282 390992 533832 518220 506033
8875E06033n9134J61954j35268L5373n0593M0767n9560R2216p5907J76828j37478
$$ 506033 446899 608853 473585 508958 458365 499132 439572 531788 455881 632709 495231
8864D95231j35241J13002M3051Q0739j17445M0070Q3271j19593M8257L8726R2800
$$ 495231 359990 472992 516043 596782 479337 519407 602678 483085 531342 570068 662868
8853F62868k66255L49797j37468m8889n8162K1399M7462J5834n3362Q673R302
$$ 662868 396613 746410 608942 560053 501891 523290 570752 586586 533224 541897 551199
8842E51199o4028J46618p8395M084J7240r277k7237L4162j16197J11209N7263
$$ 551199 487171 633789 555394 559478 576718 567441 540204 574366 458169 569378 626641
8831F26641q9544P6627L9608r105o5229j6723O4939o4254N68J28689m6809m9754
$$ 626641 537097 613724 653332 644227 578998 562275 627214 562960 563528 692217 645408 595654
8819E95654q2655K05329M1126q3172K7971l1509n3283J40225r7370j14956J16123
$$ 595654 512999 718328 759454 676282 704253 672744 619461 759686 662316 547360 663483
8808F63483l9096J53949j09310k6636j3389r4688J19135R1546N2751j67775J23926
$$ 663483 624387 778336 669026 642390 629001 534313 653448 744994 797745 629970 753896
8797G53896o2624J31591o7168n3699L8773J31571j35686l3404J66624q3877O4261
$$ 753896 691272 822863 755695 701996 740769 872340 736654 703250 869874 785997 850258
8786H50258l5141m9470J01154L2290j20829O7905m4250P9340K9939j82939J03880
$$ 850258 815117 765647 866801 899091 778262 846167 801917 881257 911196 728257 832137
8775H32137R2120q8499M4171m2964J39104q0529p4254J04353l1434j31081O9932
$$ 832137 924257 835758 879929 836965 976069 895540 821286 925639 894205 763124 833056
8764H33056K8043Q8643N0428O147k7739J37924n9843q7652M087R4045J3444Q4387
$$ 833056 861099 949742 1000170 1006317 978578 1116502 1056659 969007 973094 1067139 1080583 1164970
8752A164970j48485P4626q6483N5275O4543n0138J45614p5875J35980k8168p1384
$$ 1164970 1016485 1091111 1004628 1059903 1124446 1074308 1219922 1144047 1280027 1251859 1180475
8741A180475J66240R456L3724m3744J15266K6388m2929J00183M0007Q1440L2105
$$ 1180475 1346715 1356171 1389895 1346151 1461417 1487805 1444876 1545059 1585066 1666506 1698611
8730A698611J33500L0940J43728N0262M1909K81679R4999K34725M66161K35406
$$ 1698611 1832111 1863051 2006779 2057041 2098950 2380629 2475628 2710353 3176514 3411920
8720C411920L53642J1858o83605j390779A30287f55830k39496c90925A44199O60151
$$ 3411920 3765562 3777420 3093815 1703036 130287 -655830 -895326 -390925 144199 804350
8710H04350N87130L26450K32291m96764G9799a446316j053664l26977L03945N66132
$$ 804350 1391480 1717930 1950221 1453457 79799 -1446316 -2499980 -2826957 -2523012 -1956880
8700a956880L39568K61263K62654Q2958J56096J45761K5690J71350M3207O5743
$$ -1956880 -1617312 -1356049 -1093395 -1010437 -854341 -708580 -682890 -511540 -468333 -402590
8690d02590R6644K6500M8180m4380d9670m6210c0969j3185p5112e7019A9763C624
$$ -402590 -305946 -279446 -231266 -275646 -49670 -95880 -30969 -44154 -119266 -57019 19763 3624
8677I7035l1144O7142n1928J34863n9505k1589J51503n2413A03804J49130j7209
$$ 97035 65891 133033 81105 215968 156463 134874 286377 233964 103804 252934 235725
8666B35725A14455K08237o4800J07P2172M4647q5631J26409j3818n1527P7372
$$ 235725 114455 322692 257892 257999 330171 374818 289187 415596 401778 350251 427623
8655D27623j22270J12814k3656L6955K2079o4539N7374n5392l9948R6196J40062
$$ 427623 305353 418167 394511 431466 453545 389006 446380 390988 351040 447236 587298
8644E87298j41387J9570N0023j65765N3313O1570j69435J09981j2929P7619j7776
$$ 587298 445911 465481 515504 349739 403052 464622 295187 405168 392239 469858 452082
8633D52082q229j0787J40041m5487l7813J14326q6511l656q8387O8566q2934J31707
$$ 452082 443853 433066 573107 527620 489807 604133 517622 513966 425579 494145 411211 542918
8621E42918N892J32694j99252k8450P4562J22822M6393j62593k5655R5325k0673
$$ 542918 548810 681504 482252 453802 528364 651186 697579 534986 509331 604656 583983
8610E83983J40822r3885P231N3693j8696j7364Q9591k37697O7418J21662L143
$$ 583983 724805 630920 638151 691844 673148 655784 745375 507678 575096 696758 699901
8599F99901p943L6820j95409J33813j06097L8031K406q729L3335N6903l4572N1673
$$ 699901 691958 728778 533369 667182 561085 599116 601522 592793 626128 683031 648459 700132
8587G00132Q7455j1938j07682R1988m3740q1998q6441J57650k1728Q8940p5547
$$ 700132 787587 775649 667967 759955 716215 634217 547776 705426 683698 772638 697091
8576F97091j34337J53680l3058m6467K21412j24630j17198O88r14J15417l2257
$$ 697091 562754 716434 683376 636909 858321 733691 616493 617181 616267 731684 699427
8565F99427R3194J8709j20094J57626j61666K3842j6864P744J35991M5105k06764
$$ 699427 792621 811330 691236 848862 687196 711038 694174 701918 837909 883014 676250
8554F76250P4798P7436j51384J04364l6453R7856j5827J7054j22803J24066j09424
$$ 676250 751048 828484 677100 781464 745011 842867 827040 844094 721291 845357 735933
8543G35933l6477K0277Q5081Q6241j11828K0195J16365j78782M6080j8273K0287
$$ 735933 699456 719733 804814 891055 779227 799422 915787 737005 783085 764812 785099
8532G85099l2841J31632o0593l5536J24714j75064Q0454P0225N7688j43082L0432
$$ 785099 752258 883890 823297 787761 912475 737411 817865 888090 945778 802696 833128
8521H33128M7649j6513j265J7906L9134p8777O3679j08221Q2728Q0207j51546
$$ 833128 880777 864264 862999 880905 920039 841262 904941 796720 879448 959655 808109
8510H08109J12864k2324M7035m3874k3823p2919J67734j47007O4372J55346k10642
$$ 808109 920973 898649 945684 901810 877987 805068 972802 825795 890167 1045513 834871
8499H34871K0080l853K8822K3410p3097K15035j78816J39368n2658q3101j3925
$$ 834871 854951 851098 879920 903330 830233 1045268 866452 1005820 953162 870061 856136
8488H56136k9295O9245j8235J28593o5602J2690P388n2332Q7480M6995j33448
$$ 856136 826841 896086 877851 1006444 940842 953532 960920 908588 996068 1043063 909615
8477I09615J10386m4611j2155q752R5834j0432o4376K5653Q569L661N618o0461
$$ 909615 1020001 975390 963235 954483 1050317 1039885 975509 1001162 1009731 1013392 1019010 958549
8465I58549P0617k04525K86473j18702R0956j51688J69387k6376m0309L9451j71418
$$ 958549 1029166 824641 1111114 992412 1083368 931680 1101067 1074691 1034382 1073833 902415
8454I02415M5880N9990l8550J4429O3070j2244q6291J53640m0108j4027j25362
$$ 902415 948295 1008285 969735 984164 1047234 1034990 948699 1102339 1062231 1048204 922842
8443I22842P289J43015k3938k8970j5077P7690m1500N3729l9818n8326J23786
$$ 922842 930131 1073146 1049208 1020238 1005161 1082851 1041351 1095080 1055262 996936 1120722
8432A120722j47675J25935o0939M9631l7989q7381O2300J43370j4245p8156O8170
$$ 1120722 973047 1098982 1038043 1087674 1049685 962304 1024604 1167974 1153729 1075573 1143743
8421A143743j6404N0155p9792n4760N2310m8683N8120J20437j62846M6739j1408
$$ 1143743 1127339 1177494 1097702 1042942 1095252 1046569 1104689 1225126 1062280 1109019 1097611
8410A097611k1849J22366m3994j50736K43304j80560K02528k05343j99L0694J3314
$$ 1097611 1075762 1198128 1154134 1003398 1246702 1066142 1268670 1063327 1063128 1093822 1107136
8399A107136M8864M0725p8312J59770j64148K09527j02416k2680n7168J8599l127
$$ 1107136 1156000 1196725 1118413 1278183 1114035 1323562 1221146 1198466 1141298 1159897 1156770
8388A156770o1271N9122R4906m8760j69857J14974M5542l4585J25349p2676j26348
$$ 1156770 1095499 1154621 1249527 1200767 1030910 1145884 1191426 1156841 1282190 1209514 1083166
8377A083166J53064O4267j95271R3687J27382k25962k8095K95429j46874J7112
$$ 1083166 1236230 1300497 1105226 1198913 1326295 1100333 1072238 1367667 1220793 1237905
8367A237905R90j423J47917j55078J00334j39612J17248N0280j10449J24313j00565
$$ 1237905 1238895 1237472 1385389 1230311 1330645 1191033 1308281 1358561 1248112 1372425 1271860
8356A271860j36518K45864n2309j65790J25707P5670m6700N352P152q1486J50370
$$ 1271860 1135342 1381206 1328897 1163107 1288814 1364484 1317784 1323136 1330288 1248802 1399172
8345A399172m5618P6086r3945J21949n9478P5864j30308M4931j05621N6385p3937
$$ 1399172 1353554 1429640 1335695 1457644 1398166 1474030 1343722 1388653 1283032 1339417 1265480
8334A265480J00519J08980j13037K607M2492l0722q887N7086R6213k00841O4046
$$ 1265480 1365999 1474979 1361942 1364549 1407041 1376319 1367432 1424518 1520731 1319890 1383936
8323A383936M1751o6766J0760L6307R9473J7590n4281p1140Q9907j7144k9064
$$ 1383936 1425687 1358921 1369681 1405988 1505461 1523051 1468770 1397630 1487537 1470393 1441329
8312A441329k7540J56881j73565j2174J09169O5037m3588n8225K7293J2479j79334
$$ 1441329 1413789 1570670 1397105 1384931 1494100 1559137 1515549 1457324 1484617 1497096 1317762
8301A317762J83606P0062j22705M046L8413Q3874M864q0628n2387O4942O3297
$$ 1317762 1501368 1571430 1448725 1452771 1491184 1575058 1579922 1499294 1446907 1511849 1575146
8290A575146j5043j03798K7302J29305M840k4849o0732p4835k7132M2849L5310
$$ 1575146 1560103 1456305 1483607 1612912 1617752 1592903 1532171 1457336 1430204 1473053 1508363
8279A508363j42650K60311j57644P4494j08083Q8918k35112J89722n7507k3634
$$ 1508363 1365713 1626024 1468380 1542874 1434791 1523709 1288597 1478319 1420812 1397178
8269A397178j00029J30423p956j1007J9697r9514L5550L3683k4922J9933J3726
$$ 1397178 1297149 1427572 1419616 1408609 1428306 1328792 1364342 1398025 1373103 1393036 1406762
8258A406762o2471n3879J4036N3636J9809r0749L5120l8152j66726J50645o1796
$$ 1406762 1344291 1290412 1304448 1358084 1377893 1287144 1322264 1284112 1117386 1268031 1206235
8247A206235o3483J77463j60463J12433L0788L3987q9394N1096j06170o2886l3940
$$ 1206235 1142752 1320215 1159752 1272185 1302973 1336960 1247566 1298662 1192492 1129606 1095666
8236A095666R4999k5697n9813j6060N8657o6908J40939j71546r2330K00766p6187
$$ 1095666 1190665 1164968 1105155 1089095 1147752 1080844 1221783 1050237 957907 1158673 1082486
8225A082486N4229o4634J11298k9898M4182j37481j931M3505j20699J78653P7642
$$ 1082486 1136715 1072081 1183379 1153481 1197663 1060182 1058251 1101756 981057 1159710 1237352
8214A237352k0405N5805p8754n8437P6536J46544j51407P8941m3563J00225q4905
$$ 1237352 1216947 1272752 1193998 1135561 1212097 1358641 1207234 1286175 1242612 1342837 1257932
8203A257932J07315Q141L8432l1297J58340O3238m6990J35198K05854P32693B89538
$$ 1257932 1365247 1373388 1411820 1380523 1538863 1602101 1555111 1690309 1896163 2628856 289538
8191D431126A775658e44061B10058O68817L12554p9600J22089K1663J53408k19547
$$ 4431126 1775658 -544061 210058 878875 1191429 1111829 1233918 1255581 1408989 1189442
8181A189442K09409p0641l0200J72990m2877j2498R7019m705k7139K05765r8503
$$ 1189442 1398851 1328210 1298010 1471000 1428123 1415625 1512644 1507939 1480800 1686565 1588062
8170A588062o4240n9090J7818P4107k6958n7215j9933l2714M4666J4602N4429
$$ 1588062 1523822 1464732 1482550 1556657 1529699 1472484 1452551 1419837 1464503 1479105 1533534
8159A533534n9763n1262J27497K6847q6984O5860m8224p922n5996m051J15705
$$ 1533534 1473771 1422509 1550006 1576853 1489869 1555729 1507505 1499583 1443587 1439536 1555241
8148A555241j83928L506J57303j4879j70670l0306k5188j681L1816j4339L5646
$$ 1555241 1371313 1374819 1532122 1517243 1346573 1316267 1291079 1289398 1321214 1306875 1342521
8137A342521m9526m2190J25131L3162n5557j8368Q3577k8391k1637o1954k6610
$$ 1342521 1292995 1250805 1375936 1409098 1353541 1335173 1418750 1390359 1368722 1306768 1280158
8126A280158q7153J70242n4092q6740J12123l1099J59821j21075q0134J07443
$$ 1280158 1193005 1363247 1309155 1222415 1334538 1303439 1463260 1342185 1262051 1369494
8116A369494k8546m1921M8924l6874N0565L6605K3956r0174Q8521P4033l1575
$$ 1369494 1340948 1299027 1347951 1311077 1361642 1398247 1422203 1332029 1420550 1494583 1463008
8105A463008K167j8455R6690q9200N8864j4603Q8195j13277P1526J15472k3580
$$ 1463008 1465175 1446720 1543410 1454210 1513074 1498471 1586666 1473389 1544915 1660387 1636807
8094A636807j25027J96091n8371o5160J88427P3893O2346j13654j7586J60496
$$ 1636807 1511780 1707871 1649500 1584340 1772767 1846660 1909006 1795352 1777766 1938262
8084A938262K3768P9851m5376K3758M4475K17905J5780Q9164J55968R5372K04889
$$ 1938262 1962030 2041881 1996505 2020263 2064738 2282643 2298423 2387587 2543555 2638927 2843816
8073B843816K75831K78695L29945k81922j275473C21933d32027J7195h1516A77974
$$ 2843816 3119647 3398342 3728287 3446365 2170892 321933 -432027 -414832 -81516 177974
8062E01148J21974K27645J61978J30259K24397n1784J15687K24273J74691O3274
$$ 501148 623122 850767 1012745 1143004 1367401 1315617 1431304 1655577 1830268 1893542
8052A893542J78217J64499K82532M17012K35465p3577r09054C23778a235862n1719
$$ 1893542 2071759 2236258 2518790 2935802 3171267 3097690 2188636 323778 -1235862 -1287581
8042a287581L70053L17879b20451a06421A10542J21098M1902J49298J82642o2851
$$ -1287581 -917528 -599649 -220451 -106421 110542 231640 273542 422840 605482 542631
8032E42631J89234P5324p1974J9290P4018Q5508m228n1544K623l4710K04431r3687
$$ 542631 731865 807189 735215 754505 828523 914031 909803 858259 860882 826172 1030603 936916
8020I36916J78263n6902J29735k17572Q6222Q3733j06827q848J18456o848o6226
$$ 936916 1115179 1058277 1188012 970440 1056662 1140395 1033568 1024720 1143176 1136328 1070102
8009A070102Q6403P1753m8289o4001J00588r707M4678M7219K6980q0839K2841
$$ 1070102 1156505 1228258 1179969 1115968 1216556 1206849 1251527 1298746 1325726 1244887 1267728
7998A267728j0572Q7154j80523R7628R0263o8651M6262K4014N2840l6304o5611
$$ 1267728 1257156 1344310 1163787 1261415 1351678 1283027 1329289 1353303 1406143 1369839 1304228
7987A304228J28563o3671L6185J04678o7210q2204K8542k4551N3805M3771J30126
$$ 1304228 1432791 1369120 1405305 1509983 1442773 1360569 1389111 1364560 1418365 1462136 1592262
7976A592262n1728l8201l3181J3846O253n1630P9460Q042Q5468n1320J234J27811
$$ 1592262 1540534 1502333 1469152 1482998 1489251 1437621 1517081 1525123 1610591 1559271 1560505 1688316
7964A688316k53717J82244k04628K37978O5658p3264M0696j08429Q4945M1578
$$ 1688316 1434599 1616843 1412215 1650193 1715851 1642587 1683283 1574854 1659799 1701377
7954A701377q471p4569Q5461o0624o5343L7779N9516Q6359q3072j9656R6349K1874
$$ 1701377 1692906 1618337 1703798 1643174 1577831 1615610 1675126 1761485 1678413 1658757 1755106 1776980
7942A776980l2707j09820J03580R878J23548j34258K4077J02365j27973L0405
$$ 1776980 1744273 1634453 1738033 1747911 1871459 1737201 1761278 1863643 1735670 1766075
7932A766075n5848O1836J37970j10929P9333k1149p6049k6441J25646k3629j17540
$$ 1766075 1710227 1772063 1910033 1799104 1878437 1857288 1781239 1754798 1880444 1856815 1739275
7921A739275P7264J06557J9401q3533k4798K2359N1660J36254j96599K8561N7151
$$ 1739275 1816539 1923096 1942497 1858964 1834166 1856525 1908185 2044439 1847840 1876401 1933552
7910A933552l2574l3247R4211l8917J51372j46506J6525k3905J51113j5421L3608
$$ 1933552 1900978 1867731 1961942 1923025 2074397 1927891 1944416 1920511 2071624 2056203 2089811
7899B089811o7073j8911N3703p8701J52218j00793J10186o7906J16932j51963
$$ 2089811 2022738 2003827 2057530 1978829 2131047 2030254 2140440 2072534 2189466 2037503
7889B037503R7052n5401M491R4637J37887j71961P5482j42981J91974J0631O7125
$$ 2037503 2134555 2079154 2083645 2178282 2316169 2144208 2219690 2076709 2268683 2279314 2346439
7878B346439K507j58356J70503J6966p0794Q9978j63646M1319J6878J4763K43765
$$ 2346439 2348946 2190590 2361093 2378059 2307265 2397243 2233597 2274916 2291794 2306557 2550322
7867B550322n0344k2498j58481K66264o4073p4506K51629K7016p7517J38878j35344
$$ 2550322 2499978 2477480 2318999 2585263 2521190 2446684 2698313 2725329 2647812 2786690 2651346
7856B651346Q2698M455n3316J49582J46112r7671Q6083R726k717J54135p868J23660
$$ 2651346 2734044 2738499 2685183 2834765 2980877 2883206 2969289 2979015 2976298 3130433 3122565 3246225
7844C246225N932P2490j10390K81604n083J19463N7675M0792K23712k9091J15865
$$ 3246225 3252157 3324647 3214257 3495861 3490778 3610241 3667916 3708708 3932420 3903329 4019194
7833D019194R0541L33251J72277J68852L42174M2218L42825M64768L87839Q12586
$$ 4019194 4109735 4442986 4615263 4784115 5126289 5168507 5511332 5976100 6363939 7176525
7823G176525P27366M56430l98824j953571B832361e79109k245837k19915P62273
$$ 7176525 7903891 8360321 7961497 6007926 2832361 -579109 -2824946 -3044861 -2282588
7814b282588R38256O43363b1217D12659L83636M92092L56086M18158L61199M51945
$$ -2282588 -1344332 -700969 -21217 412659 796295 1288387 1644473 2062631 2423830 2875775
7804B875775N08567M42166O59379P20553P79317L35121p03440k419882a97596
$$ 2875775 3384342 3826508 4485887 5206440 5985757 6320878 5617438 3197556 -197596
7794c621607j938062j4963Q34304Q67914O86957M83539M43751L59576L39516K30581
$$ -3621607 -5559669 -5574632 -4740328 -3872414 -3185457 -2701918 -2258167 -1898591 -1559075 -1328494
7784a328494K04838Q5550M55212p7361K61837L2643L7297a00791L7262L0818E8465
$$ -1328494 -1123656 -1038106 -582894 -660255 -398418 -365775 -328478 -100791 -63529 -32711 58465
7772A5595K75590o6021j5780J70730O3003j60065K83028j00006r5418K79292p3800
$$ 15595 291185 225164 209384 380114 443117 283052 566080 466074 370656 649948 576148
7761E76148j0542J49513p8858P7785M2383p9859K06110o2495K7617R3166j2020
$$ 576148 565606 715119 636261 714046 756429 676570 882680 820185 847802 940968 928948
7750I28948k7226M4084J9822M4366Q1607o9145p0664J13991j0966R2457p0882
$$ 928948 901722 945806 965628 1009994 1091601 1022456 951792 1065783 1054817 1147274 1076392
7739A076392J50538n9753r8065J63071j09551N5718Q8158o2143l0615K3521J68373
$$ 1076392 1226930 1167177 1069112 1232183 1122632 1178350 1266508 1204365 1173750 1197271 1365644
7728A365644r7006j49121K23421k0796J00273j08360r8288R7487L4515L1330L136
$$ 1365644 1268638 1119517 1342938 1322142 1422415 1314055 1215767 1313254 1347769 1379099 1382235
7717A382235P686K3032L1019n0866J20244j62590K3181M1622l2408K15393j66474
$$ 1382235 1389921 1412953 1443972 1393106 1513350 1350760 1373941 1415563 1383155 1598548 1432074
7706A432074J10517K2651q7606n6562o711J5098J12475n5535J14157J8565j1654
$$ 1432074 1542591 1565242 1477636 1421074 1414363 1429461 1541936 1486401 1600558 1619123 1607469
7695A607469o1161j5816J6144M5904j9567M8552j00442O4865K2822Q1399R9825
$$ 1607469 1546308 1530492 1546636 1592540 1572973 1621525 1521083 1585948 1608770 1690169 1789994
7684A789994j17989o0791M5605p4691K33113j22918Q3948j15961R8619n3579J8437
$$ 1789994 1672005 1611214 1656819 1582128 1815241 1692323 1776271 1660310 1758929 1705350 1723787
7673A723787M5487L8414k16618J88951j06677K84999l33801K08627j52138J31523
$$ 1723787 1769274 1807688 1591070 1780021 1673344 1958343 1624542 1833169 1681031 1812554
7663A812554M2191K5852n3160j07795L9888K7044j3978N2827j14272K73628o5015
$$ 1812554 1854745 1880597 1827437 1719642 1759530 1786574 1772596 1825423 1711151 1984779 1919764
7652A919764L2503r5279j14617R9838J08543N617o6383j1238O2532p8860K2716
$$ 1919764 1952267 1856988 1742371 1842209 1950752 1956369 1889986 1878748 1941280 1862420 1885136
7641A885136r6658J61679k4320o3587K4788Q6549j05830N580J10251J39266j58741
$$ 1885136 1788478 1950157 1925837 1862250 1887038 1973587 1867757 1873337 1983588 2122854 1964113
7630A964113j12755J33095r7399Q3021Q2045M691J1803K3072j23892M0783J11084
$$ 1964113 1851358 1984453 1887054 1970075 2052120 2056811 2068614 2091686 1967794 2008577 2119661
7619B119661n7300N7601j9126K9889l2847R1167j05403n1147J3757K5830r5695
$$ 2119661 2062361 2119962 2100836 2130725 2097878 2189045 2083642 2032495 2046252 2072082 1976387
7608A976387J56404o9204P0434J3909j34949J51828M4153o3562R441M4941r6045
$$ 1976387 2132791 2063587 2134021 2147930 2012981 2164809 2208962 2145400 2154841 2199782 2103737
7597B103737J61776j49764J43111n9600j4191n506M5679K6887m8613Q2033L954
$$ 2103737 2265513 2115749 2258860 2199260 2185069 2179563 2225242 2252129 2203516 2285549 2289503
7586B289503n8791N1160o6867O4123k9553l2710J17343M0015n5565j74247J09535
$$ 2289503 2230712 2281872 2215005 2279128 2249575 2216865 2334208 2374223 2318658 2144411 2253946
7575B253946n6338J22046q5862J59223j06870p2414J02595L3162M217j2216P079
$$ 2253946 2197608 2319654 2233792 2393015 2286145 2213731 2316326 2349488 2353705 2341489 2348568
7564B348568K6040m6082L5648j1413J24419j35049p8821J65808k4909p6922J08034
$$ 2348568 2374608 2328526 2364174 2352761 2477180 2342131 2263310 2429118 2404209 2327287 2435321
7553B435321q0713k874q806k7888J37160K1205j4086k618r093n943j01219J44488
$$ 2435321 2354608 2351734 2342928 2315040 2452200 2473405 2459319 2456701 2447608 2441665 2340446 2484934
7541B484934p9476P0327J4437m7016K0182l9282Q7466j38990P8335n4847O9257
$$ 2484934 2405458 2475785 2490222 2443206 2463388 2424106 2511572 2372582 2450917 2396070 2465327
7530B465327n6971Q9551N5869j70271M903J08970M829P1533j91456R3119j5177
$$ 2465327 2408356 2497907 2553776 2383505 2388408 2497378 2502207 2573740 2382284 2475403 2460226
7519B460226K0139J15219o7270l2108L6983j9203J71356j07647l0538p3771N0975
$$ 2460226 2480365 2595584 2528314 2496206 2533189 2513986 2685342 2577695 2547157 2473386 2524361
7508B524361J26004M20m3874l7742J26079m7148K6526l4298O5006j1789q5042
$$ 2524361 2650365 2650785 2606911 2569169 2695248 2648100 2674626 2640328 2705334 2693545 2608503
7497B608503J31744J2564r5432P4220K5704J00439j16214m826m3056o5417J71954
$$ 2608503 2740247 2752811 2657379 2731599 2757303 2857742 2741528 2736702 2693646 2628229 2800183
7486B800183o4270n2344K1588l9284J77324q7594Q3347n2117J1246J4034j18645
$$ 2800183 2735913 2683569 2705157 2665873 2843197 2755603 2838950 2786833 2798079 2812113 2693468
7475B693468K8065J87671l3914n4299O8532N8231L767q1190m6540R2124k7913
$$ 2693468 2721533 2909204 2875290 2820991 2889523 2947754 2951521 2870331 2823791 2915915 2888002
7464B888002K7191k8407L4353J50174q8950o227J11831j84792j7746J58620q3034
$$ 2888002 2915193 2886786 2921139 3071313 2982363 2976136 3087967 2903175 2885429 3044049 2961015
7453B961015P7424j1290j36221J20010N523o8270J09551r4294J21144j11045J05443
$$ 2961015 3038439 3027149 2890928 3010938 3016461 2948191 3057742 2963448 3084592 2973547 3078990
7442C078990J32076r9826j08671J79525K5891k281m4217j30198R5578J74754l6500
$$ 3078990 3211066 3111240 3002569 3182094 3207985 3205704 3161487 3031289 3126867 3301621 3265121
7431C265121o4432j23992J68287Q7399m8006j00414Q3093N3795j0625Q5199j29389
$$ 3265121 3200689 3076697 3244984 3332383 3284377 3183963 3267056 3320851 3310226 3395425 3266036
7420C266036J26404r5839O8899k1802J05569p7147q3545K0538R5854n3953J800
$$ 3266036 3392440 3296601 3365500 3343698 3449267 3372120 3288575 3309113 3404967 3351014 3352814
7409C352814j11123J92075p6409j7036O9681j3647q3804J96895J3282k41870J55062
$$ 3352814 3241691 3433766 3357357 3340321 3410002 3396355 3312551 3509446 3522728 3280858 3435920
7398C435920P311J85584l42033J03880J9951L7270Q7708m8518J48728r1344r8457
$$ 3435920 3443231 3628815 3286782 3390662 3410613 3447883 3535591 3487073 3635801 3544457 3446000
7387C446000J15307r8348J91149n2082P428k2621J8071Q536m2427R1558j698n4915
$$ 3446000 3561307 3462959 3654108 3602026 3609454 3586833 3604904 3613440 3571013 3662571 3660873 3605958
7375C605958O5444R856O6024j19703J66660o165J796M9203o611q7030J77860j24368
$$ 3605958 3671402 3681258 3747282 3627579 3794239 3788074 3789870 3839073 3832462 3745432 3923292 3798924
7363C798924P7640K3884o9182J2879K13265k50188J58377m8398l95l7037L0989
$$ 3798924 3876564 3900448 3831266 3844145 4057410 3807222 3965599 3917201 3916806 3879769 3910758
7352C910758J29491q0449L906R3031m9759O4292n0684R5606j52511K62034p6146
$$ 3910758 4040249 3959800 3963706 4056737 4006978 4071270 4020586 4116192 3963681 4225715 4149569
7341D149569n5494R1660m049J50806P2974j76038J6541j69046J05578J38948j30135
$$ 4149569 4094075 4185735 4181686 4332492 4405466 4229428 4245969 4076923 4182501 4321449 4191314
7330D191314J74273m9578O7916N3886k6707J2413L9486J9750J3450n7665R4720
$$ 4191314 4365587 4316009 4383925 4437811 4411104 4423517 4463003 4482753 4496203 4438538 4533258
7319D533258J7043o4889m676K54595j26516M4111j14838J23552J10907j58688
$$ 4533258 4550301 4485412 4480736 4735331 4608815 4652926 4538088 4661640 4772547 4613859
7309D613859J06215J2682R4308L7528n4318J15978M3562K7452n9835J71834j5901
$$ 4613859 4720074 4732756 4827064 4864592 4810274 4926252 4969814 4997266 4937431 5109265 5093364
7298E093364q5279J17490r744n9529J69645P6935l4663Q845N8941O773O7917l4172
$$ 5093364 5008085 5125575 5115831 5056302 5225947 5302882 5268219 5277064 5336005 5342778 5410695 5376523
7286E376523R053J80518j62333J59874K1433J19105r4095R3431Q8574J11994J4596
$$ 5376523 5385576 5566094 5403761 5563635 5585068 5704173 5610078 5703509 5792083 5904077 5918673
7275E918673J2220J25007N963R7341J58184p5440R6507J0729K31251n3760R7133
$$ 5918673 5930893 6055900 6061863 6159204 6317388 6241948 6338455 6349184 6580435 6526675 6623808
7264F623808M2449J24561Q7641K44202O1693M3755J36932K22387K64786L5554
$$ 6623808 6666257 6790818 6878459 7122661 7184354 7228109 7365041 7587428 7852214 7887768
7254G887768K61969M77541K60236L11758J38567M6596n12066j036072r02137l7998
$$ 7887768 8149737 8627278 8887514 9199272 9337839 9384435 8872369 7836297 6934160 6896162
7244F896162K27153J87285p4012p49383j273470m46671q1763L90378J85511J44766
$$ 6896162 7123315 7310600 7236588 6487205 5213735 4767064 4685301 5075679 5261190 5405956
7234E405956m3413M0732K10972O19316K37302L19181j29410m9212J71577J58131
$$ 5405956 5362543 5403275 5614247 6233563 6470865 6790046 6660636 6611424 6783001 6941132
7224F941132K92251L07292L70319M19962M83699K52282J74663K57628N66631M47294
$$ 6941132 7233383 7540675 7910994 8330956 8814655 9066937 9241600 9499228 10065859 10513153
7214A0513153N45274K24908p17667j234904j061768q7481N16851M93494m24755
$$ 10513153 11058427 11283335 10565668 9330764 8268996 8181515 8698366 9191860 8767105
7205H767105q88748p38311K14262J186812R39307r4421j744087k807025B101838
$$ 8767105 7878357 7140046 7354308 8541120 9480427 9386006 7641919 4834894 2101838
7195B22097b30908F94934J776749J576556R39550l63036j710926B63569b461668
$$ 222097 -230908 694934 2471683 4048239 4987789 4624753 2913827 263569 -2461668
7185d370853o32009N35115J122652R49039R29237O35145b36505C15166L76039
$$ -4370853 -5002862 -4467747 -3345095 -2396056 -1466819 -831674 -236505 315166 691205
7176F91205N94267K98788K04242K61252j5697L2557L02997K70634K49385K19326
$$ 691205 1285472 1584260 1788502 2049754 2034057 2066614 2369611 2640245 2889630 3108956
7166C108956K07372j76473r5193J37567J98340J23718K70274K88618K30006N3824
$$ 3108956 3316328 3139855 3044662 3182229 3380569 3504287 3774561 4063179 4293185 4347009
7156D347009K94604J10038J77091J24575J86551K01454L24351N0126K78256K99020
$$ 4347009 4641613 4751651 4928742 5053317 5239868 5441322 5765673 5815799 6094055 6393075
7146F393075K95075L6765L46478N59241K14736M87860L66746J73545k09825q28057
$$ 6393075 6688150 6724915 7071393 7630634 7845370 8333230 8699976 8873521 8663696 7835639
7136G835639j043754o22025k6788M32948M83887L38399k65221m17566m26855j37668
$$ 7835639 6791885 6169860 6143072 6576020 7059907 7398306 7133085 6715519 6288664 6150996
7126F150996J34430k66129o11693r95817p8255L23090M79533L62214P02642P48748
$$ 6150996 6285426 6019297 5407604 4411787 4333532 4656622 5136155 5498369 6201011 6949759
7116F949759P30293P08689J91712l85625j191846r78577p13317J10808M92504
$$ 6949759 7680052 8388741 8580453 8194828 7002982 6024405 5311088 5421896 5914400
7107E914400O96381R03770R20732P64491L02579r7348j33916O55663O05369N40712
$$ 5914400 6610781 7514551 8435283 9199774 9502353 9405005 9271089 9926752 10532121 11072833
7097A1072833J77735n43036j343694p22235m81563o61082o71035j50792r52969
$$ 11072833 11250568 10707532 9363838 8641603 8160040 7498958 6827923 6677131 5724162
7088E724162k125438A004387a03696j59961A9567K05724M82272J84851N1191M65619
$$ 5724162 3598724 1004387 -103696 -263657 19567 225291 707563 892414 943605 1409224
7078A409224Q77380Q73701M13035L90417j16981o27600j052303p72801K44902
$$ 1409224 2286604 3160305 3573340 3963757 3846776 3219176 2166873 1394072 1638974
7069A638974N33928J182394J085822J031715R86747N20912J02035o27348k67787
$$ 1638974 2172902 3355296 4441118 5472833 6459580 6980492 7082527 6455179 6187392
7060F187392M50361n74000j545905j651847m05383J11768q68818g9905m02215
$$ 6187392 6637753 6063753 4517848 2866001 2460618 2572386 1703568 -79905 -482120
7051d82120B21346J221426P84481L15445L84109O94098N94768M37122K37268L8789
$$ -482120 221346 1442772 2227253 2542698 2926807 3620905 4215673 4652795 4890063 4928852
7041D928852N97014N39390j69325j640051A748046B41092A02601Q35085R06429
$$ 4928852 5525866 6065256 5895931 4255880 1748046 241092 102601 937686 1844115
7032A844115J009120Q38258P86100P27556O01431Q10671R04730R20802R87121
$$ 1844115 2853235 3691493 4477593 5205149 5806580 6617251 7521981 8442783 9429904
7023I429904q890m21946p98185j081527j027715K78486R42442J38676j285058
$$ 9429904 9421014 8999068 8200883 7119356 6091641 6370127 7312569 7451245 6166187
7014F166187k201441A944567m19618G31827f3869j048621n78269L8654O85950
$$ 6166187 3964746 1944567 1524949 731827 -63869 -1112490 -1690759 -1652105 -966155
7005i66155b7324A280638J456412J295064N84923q70782A856925f81437k504310
$$ -966155 -27324 1280638 2737050 4032114 4617037 3746255 1856925 -681437 -3185747
6996c185747j444814k73692O52152J441803J373748d32693I0199k1412d1969p49226
$$ -3185747 -4630561 -4904253 -4252101 -2810298 -1436550 -432693 90199 68787 -41969 -791195
6986g91195n7734a98482F18200R58405N85819L85517L83081J96401L91142Q48666
$$ -791195 -848929 -198482 618200 1576605 2162424 2547941 2931022 3127423 3518565 4367231
6976D367231J056395P02062J52952m74879j009194j625151j526149F73765C4672
$$ 4367231 5423626 6125688 6278640 5803761 4794567 3169416 1643267 673765 34672
6966f48058n62274n73577o33957k65074M37010P63251M69434M25705f5854A68474
$$ -648058 -1210332 -1783909 -2417866 -2682940 -2245930 -1482679 -1013245 -587540 -65854 168474
6955D20213G9232a7428C10609K60554Q5410R4567j1895B02080h87926n76859p85382
$$ 420213 79232 -17428 310609 571163 656573 751140 739245 202080 -887926 -1464785 -2250167
6944b250167o10832k24774O44284N83215N75329M48422J02765P6830j01961j33799
$$ -2250167 -2860999 -3085773 -2441489 -1858274 -1282945 -834523 -731758 -654928 -756889 -890688
6934h90688J59406J83506b26238D9268L81628N22662L38875L54278M88262K80224
$$ -890688 -731282 -547776 -226238 49268 430896 953558 1292433 1646711 2134973 2415197
6924B415197M95939L67471L15592K67619J06454Q4598R149J50126K09663N11093
$$ 2415197 2911136 3278607 3594199 3861818 3968272 4052870 4062019 4212145 4421808 4932901
6914D932901P98824O15453Q17069L43590K95452k29026k16380J32940l97367p15373
$$ 4932901 5731725 6347178 7164247 7507837 7803289 7574263 7357883 7490823 7093456 6378083
6904F378083l6870P79851P09930n9390n48359l26957K78225M72335k67779j908951
$$ 6378083 6341213 7121064 7830994 7771604 7223245 6896288 7174513 7646848 7379069 5470118
6894E470118k236998A192063f83E47251J154256J551535J379222J691634J478915
$$ 5470118 3233120 1192063 -683 547251 1701507 3253042 4632264 6323898 7802813
6885G802813J836143J697509J302503k7936p00986j582593q65090n6219p85831
$$ 7802813 9638956 11336465 12638968 12611032 11910046 10327453 9462363 9406144 8620313
6876H620313k551461B491061a59494k675385k665569p67528K86159P44782R93768
$$ 8620313 6068852 2491061 -159494 -2834879 -5500448 -6267976 -5981817 -5237035 -4243267
6867d243267o33238k280093r82526Q80739K482767K247938g43965a65356j109938
$$ -4243267 -4876505 -7156598 -8139124 -7258385 -4775618 -2527680 -743965 -165356 -1275294
6858a275294j636796m2290N93116j56589j370047k095777k373329q20449N86672
$$ -1275294 -2912090 -2954380 -2361264 -2517853 -3887900 -5983677 -8357006 -9177455 -8590783
6849h590783J381260J352020Q14162K53834M8459K32190M32755K22336m90052
$$ -8590783 -7209523 -5857503 -5043341 -4789507 -4741048 -4508858 -4076103 -3853767 -4343819
6840d343819n09859j94679L00191P52074P68646M88174K24702K74110L55444K07502
$$ -4343819 -4853678 -5048357 -4748166 -3996092 -3227446 -2739272 -2514570 -2240460 -1885016 -1677514
6830a677514j23775n00742o33430k62592j95274J31271J97059k0655M33831M81886
$$ -1677514 -1801289 -2302031 -2935461 -3198053 -3393327 -3262056 -3064997 -3085652 -2651821 -2169935
6820b169935J95948j46284j55026J79241K93774M65329L9684J40811J427q3188
$$ -2169935 -1973987 -2120271 -2275297 -2096056 -1802282 -1336953 -1297269 -1156458 -1155031 -1238219
6810a238219m28894j047026q87999J75072L19714j02783p3934K77940P13745O76442
$$ -1238219 -1667113 -2714139 -3602138 -3427066 -3107352 -3210135 -3284069 -3006129 -2292384 -1615942
6800a615942M72477M0208j321976j323746j42502M59371M26514O60299K22496
$$ -1615942 -1143465 -1103257 -2425233 -3748979 -3891481 -3432110 -3005596 -2345297 -2122801
6791b122801K37901K10462K09506K91160e28460b07643B40497N51648O52432K97905
$$ -2122801 -1884900 -1674438 -1464932 -1173772 -528460 -207643 240497 792145 1444577 1742482
6781A742482m13450b28245j863760n88201K37404Q67322d61568D92194R59587
$$ 1742482 1329032 -228245 -2092005 -2680206 -2442802 -1575480 -461568 492194 1451781
6772A451781N25325n89507c35138k751954j256509K34864P75160P79119P67294
$$ 1451781 1977106 1387599 -335138 -3087092 -4343601 -4108737 -3333577 -2554458 -1787164
6763a787164O63088e23766c8396E75577M85501J87620m13745A06517a53635B51966
$$ -1787164 -1124076 -523766 -38396 575577 1061078 1248698 834953 106517 -153635 251966
6752I69669N40091N02160j72462m64493D68592h34493o85473K75440d81081A36531
$$ 969669 1509760 2011920 1839458 1374965 468592 -834493 -1519966 -1244526 -481081 136531
6741A94455c31478o74133J02392M51562i735G49077O37783M69757P11977M98535
$$ 194455 -331478 -1005611 -903219 -451657 -9735 749077 1386860 1856617 2568594 3067129
6731C067129N08556Q0778m54932j191763H73811k65515L00373P55921P46145Q77123
$$ 3067129 3575685 3656463 3201531 2009768 873811 608296 908669 1664590 2410735 3287858
6721C287858O90865M56889r6476l17597j63472N87608J051474J347866J253230
$$ 3287858 3978723 4435612 4339136 4021539 3858067 4445675 5497149 6845015 8098245
6712H098245J312658r3132k202634B982125h37262j542897l45187J30608P44666
$$ 8098245 9410903 9317771 7115137 2982125 -837262 -2380159 -2725346 -2594738 -1850072
6703a850072g57313D35432J276597J125385J157112J295588J437010J526580J735773
$$ -1850072 -757313 435432 1712029 2837414 3994526 5290114 6727124 8253704 9989477
6694I989477K087955K038232Q71605k004546n643738D65632d184173l630083l764898
$$ 9989477 12077432 14115664 14987269 12982723 7338985 465632 -4184173 -7814256 -11579154
6685a1579154j523698J052897K324694K104501J789861J875611J591075f92050
$$ -11579154 -13102852 -12049955 -9725261 -7620760 -5830899 -3955288 -2364213 -692050
6676I60465J746687K126821K029294J706956K42045k281494B343649a929524n556072
$$ 960465 2707152 4833973 6863267 8570223 8812268 6530774 2343649 -1929524 -7485596
6667g485596p509707n073558k20667J930365K570190K083696J689475J546224
$$ -7485596 -14995303 -20068861 -20289528 -18359163 -15788973 -13705277 -12015802 -10469578
6659a0469578J379850J311086J084780J378486J250680J068272J004532M70892
$$ -10469578 -9089728 -7778642 -6693862 -5315376 -4064696 -2996424 -1991892 -1521000
6651a521000k17982j030236k745551n015746m518154j466311Q24804J344991J299080
$$ -1521000 -1738982 -2769218 -5514769 -10530515 -15048669 -16514980 -15690176 -14345185 -13046105
6642a3046105J088652P89681Q83747P52423N71581N18882O11364L13036M80168
$$ -13046105 -11957453 -11167772 -10284025 -9531602 -8960021 -8441139 -7829775 -7516739 -7036571
6633g036571O42297L96832P1334j71687r46269j004886o80266J54095K70481M94429
$$ -7036571 -6394274 -5997442 -5926108 -6097795 -7044064 -8048950 -8729216 -8575121 -8304640 -7810211
6623g810211L58313K89550K91335K49212J19512K21765J21821J58008K10808J79759
$$ -7810211 -7451898 -7162348 -6871013 -6621801 -6502289 -6280524 -6158703 -6000695 -5789887 -5610128
6613e610128K4780J95455R4150O9237N6869J71415J47150J25069Q8327Q1687O9924
$$ -5610128 -5585348 -5389893 -5295743 -5226506 -5169637 -4998222 -4851072 -4726003 -4637676 -4555989 -4486065
6602d486065k7321J31565k0511J82433q3146J99047R3526N5717R1887R3594N5347
$$ -4486065 -4513386 -4381821 -4402332 -4219899 -4303045 -4103998 -4010472 -3954755 -3862868 -3769274 -3713927
6591c713927j30577K54020j32827m681J87749N5574O8687k9704M2456J05221j5101
$$ -3713927 -3844504 -3590484 -3723311 -3727992 -3540243 -3484669 -3415982 -3445686 -3403230 -3298009 -3313110
6580c313110Q7262O4259K4216n5363J98584J1916R7968J3176K3197N8166N5800
$$ -3313110 -3225848 -3161589 -3137373 -3192736 -2994152 -2982236 -2884268 -2871092 -2847895 -2789729 -2733929
6569b733929O4229M120q7198J24156J47019o5591J04703j56369O4578Q0579Q5277
$$ -2733929 -2669700 -2665580 -2752778 -2628622 -2481603 -2547194 -2442491 -2598860 -2534282 -2453703 -2368426
6558b368426J76892o1313j08059K90357o9754l4628J2535J89345j93598K46440
$$ -2368426 -2191534 -2252847 -2360906 -2070549 -2140303 -2174931 -2162396 -1973051 -2166649 -1920209
6548a920209K793k7777p3433L1645P9636J55632j02756J08424p9018Q8032L4466
$$ -1920209 -1917416 -1945193 -2018626 -1986981 -1907345 -1751713 -1854469 -1746045 -1825063 -1737031 -1702565
6537a702565J0802R3186k9381J53139k08178J67813P6643j28790R1393J02193
$$ -1702565 -1691763 -1598577 -1627958 -1474819 -1682997 -1515184 -1438541 -1567331 -1475938 -1373745
6527a373745j50717J38540k7425L3907O2708M1091j8513O6386Q8293k9809J3464
$$ -1373745 -1524462 -1385922 -1413347 -1379440 -1316732 -1275641 -1294154 -1227768 -1139475 -1169284 -1155820
6516a155820N4327J8024J52729k18075Q9354Q9778Q851Q4669l8840N9700l1703
$$ -1155820 -1101493 -1083469 -930740 -1148815 -1059461 -969683 -960832 -876163 -915003 -855303 -887006
6505h87006P9414M0565l0200J99219j73842Q8862O3179J34554J7831M6216K6335
$$ -887006 -807592 -767027 -797227 -598008 -771850 -682988 -619809 -485255 -467424 -421208 -394873
6494c94873n8963J45196n4987J3006a67811r1115Q9932Q432k03509a40866o003
$$ -394873 -453836 -308640 -363627 -350621 -167811 -258926 -168994 -160562 -364071 -140866 -146869
6483a46869A9434L9032K17024M7000N0756P1214K27502Q0878K27226P0374K59654
$$ -146869 19434 58466 275490 322490 373246 444460 671962 752840 980066 1050440 1310094
6472A310094K30771J54819m30158A94888f58627n62650J43245K06199R4989L5608
$$ 1310094 1540865 1695684 1265526 194888 -658627 -1221277 -1078032 -871833 -776844 -741236
6462g41236j55723K1068O4880J95678L02659J16112A30979J71884M11909J38832
$$ -741236 -896959 -875891 -811011 -615333 -312674 -196562 130979 302863 714772 853604
6452H53604K96357K38687R1674K33317P8350k64909p09230A17136h03533p67478
$$ 853604 1149961 1388648 1480322 1713639 1791989 1527080 817850 117136 -803533 -1571011
6442a571011q37958o08289j89285J49820K13273K05667L48719K80657M54785J9152
$$ -1571011 -2408969 -3017258 -3206543 -3056723 -2843450 -2637783 -2289064 -2008407 -1553622 -1534470
6432a534470K16435R2089K38445J94952J69414J17965o1400p8566o6844K68690
$$ -1534470 -1318035 -1225946 -987501 -792549 -623135 -505170 -566570 -645136 -711980 -443290
6422d43290J26052Q4516l07455q23028r70600m41591J44400L85644J65335J87879
$$ -443290 -317238 -232722 -540177 -1363205 -2333805 -2775396 -2630996 -2245352 -2080017 -1892138
6412a892138J30178N4486L31250j02189J87440J12210L4071J85796J7927j43368
$$ -1892138 -1761960 -1707474 -1376224 -1478413 -1290973 -1178763 -1144692 -958896 -940969 -1084337
6402a084337R9553k0190J78695o9315Q8978J14855k08187J91915M5698j9379Q1520
$$ -1084337 -984784 -1004974 -826279 -895594 -806616 -691761 -899948 -708033 -662335 -681714 -600194
6391f00194N0050K7559m1442j5163J47891l1949j1089J28535m1519O1571J8846
$$ -600194 -550144 -522585 -564027 -579190 -431299 -463248 -474337 -345802 -387321 -325750 -306904
6380c06904P1916m8853J9667Q0611P0919j00069g2757j4963k4602j1895e0719
$$ -306904 -234988 -283841 -264174 -183563 -112644 -212713 -72757 -87720 -112322 -124217 -50719
6368a8463B6341i5252k594H4051K74C803J51061o1987B8999Q8309j1234M444M7263
$$ -18463 26341 -95252 -97846 84051 84325 3803 154864 92877 28999 117308 106074 110518 157781
6355A57781O1249j979L0409j0432J43623k3753j11956J05493j3878j5368M0485
$$ 157781 219030 217051 247460 237028 380651 356898 244942 350435 336557 321189 361674
6344C61674o4363J66311k29440L13481j94907J52266j2027j6623J11279m8916
$$ 361674 297311 463622 234182 547663 352756 505022 492995 476372 587651 538735
6334E38735Q3538q2008J12748J01346j25275J75365k36252J59391p6683m7599
$$ 538735 622273 540265 653013 754359 629084 804449 568197 727588 650905 603306
6324F03306K07931K6821k2449j32480R7834K1278P2426L0217j6800J2353R4886
$$ 603306 811237 838058 815609 683129 780963 802241 874667 904884 888084 900437 995323
6313I95323m893J2322q997M3900k7143k5121J24551r4064Q2302M2878N8986O1213
$$ 995323 990430 1002752 993755 1037655 1010512 985391 1109942 1015878 1098180 1141058 1200044 1261257
6301A261257j06134p5146J21695p6288j1026R9152r8589L9433N8427q0429j000
$$ 1261257 1155123 1079977 1201672 1125384 1114358 1213510 1114921 1154354 1212781 1132352 1131352
6290A131352J37126L9351Q73N422O3050P9984j78661J64616P8601j59658J62959
$$ 1131352 1268478 1307829 1308702 1314124 1377174 1457158 1278497 1443113 1521714 1362056 1525015
6279A525015j23810L6236N078K722K6262L5620M9400l586M5650P8593j25287J37780
$$ 1525015 1401205 1437441 1442519 1445241 1471503 1507123 1556523 1552937 1598587 1677180 1551893 1689673
6267A689673m038J313J35555l5379N9654K1898p2910M0569j9227L9484l208N0380
$$ 1689673 1685635 1686948 1822503 1787124 1846778 1868676 1795766 1836335 1817108 1856592 1853384 1903764
6255A903764j12944j4572J23407n0332Q2877N7684J05346O857p6926R049R1192
$$ 1903764 1790820 1776248 1899655 1849323 1932200 1989884 2095230 2102087 2025161 2034210 2125402
6244B125402K727J8891J3576M3851M5939Q546o1225k9716p7273J00499j410J42572
$$ 2125402 2128129 2147020 2160596 2204447 2250386 2258932 2197707 2167991 2090718 2191217 2189807 2332379
6232B332379M3444j04007Q3840l025m6156J38281l0567o6786K17743N0965O0473
$$ 2332379 2375823 2271816 2355656 2352631 2306475 2444756 2414189 2347403 2565146 2616111 2676584
6221B676584n9347l6627K09850q5311n0916K3473L8955N3149r668R1766M1492
$$ 2676584 2617237 2580610 2790460 2705149 2654233 2677706 2716661 2769810 2760142 2851908 2893400
6210B893400n4356P2795K3372R5902J6102R0089k7033R4265j73818J48344M4094
$$ 2893400 2839044 2911839 2935211 3031113 3047215 3137304 3110271 3204536 3030718 3179062 3223156
6199C223156J751k5813J24411J3765J17585K5596p5128Q6540J17775p0665J25154
$$ 3223156 3224907 3199094 3323505 3337270 3454855 3480451 3405323 3491863 3609638 3538973 3664127
6188C664127k0969o8510M7057J78018L982m0504R2267J81245M3513q9303N7517
$$ 3664127 3643158 3574648 3621705 3799723 3803705 3763201 3855468 4036713 4080226 3990923 4048440
6177D048440k494L7232R3506l1521K00147R0240J06413j60968M9184J27726J91074
$$ 4048440 4045946 4083178 4176684 4145163 4345310 4435550 4541963 4380995 4430179 4557905 4748979
6166D748979j35811N9177J86690K8399j04J12989J30212j10510J56756N9619K05924
$$ 4748979 4613168 4672345 4859035 4887434 4887330 5000319 5130531 5020021 5176777 5236396 5442320
6155E442320J26946m4777O7751J62745K1483R6346J31014O7848Q6889J48530J65643
$$ 5442320 5569266 5524489 5592240 5754985 5776468 5872814 6003828 6071676 6158565 6307095 6472738
6144F472738P5457L6851Q6059q9830K51848J95225J19217J42356K14470J21929
$$ 6472738 6548195 6585046 6671105 6581275 6833123 7028348 7147565 7289921 7504391 7626320
6134G626320K18579L17261J97845K24518J05567M14708L04979K93005K43029M00821
$$ 7626320 7844899 8162160 8360005 8584523 8690090 9104798 9409777 9702782 9945811 10346632
6124A0346632N03547N55106L19373P19115M74035R21356J019211J662125J736791
$$ 10346632 10850179 11405285 11724658 12443773 12917808 13839164 14858375 16520500 18257291
6115A8257291R08163j411149m302825o543781H46466b389410k79890a068974I12323
$$ 18257291 19165454 17754305 13451480 6907699 846466 -2389410 -2669300 -1068974 912323
6105B464303J623729J056903Q83396J016544R06532J159773J444096J685334J864885
$$ 2464303 4088032 5144935 6028331 7044875 7951407 9111180 10555276 12240610 14105495
6096A4105495J404247n98069l492358n707420g8504l504032n49015J479917e52253
$$ 14105495 15509742 14911673 11419315 5711895 -78504 -3582536 -4131551 -2651634 -552253
6086A200704J570438J268103J167500J061729J261393J148046J202995J245708
$$ 1200704 2771142 4039245 5206745 6268474 7529867 8677913 9880908 11126616
6078A1126616J488221K001370K597796K919674J679977j599004o700951B947802
$$ 11126616 12614837 14616207 17214003 20133677 21813654 20214650 13513699 2947802
6069g396805n973520j240839K287940L186349K735936K357432J771240f16178
$$ -7396805 -13370325 -14611164 -12323224 -9136875 -6400939 -4043507 -2272267 -616178
6060I18572J459001J708353J989963K584695K897885J933808n92111n677701b234926
$$ 918572 2377573 4085926 6075889 8660584 11558469 13492277 12900166 7222465 -2234926
6050a2519910o626347j997255J764152K711369K469303J923811J218917J226859
$$ -12519910 -19146257 -21143512 -19379360 -16667991 -14198688 -12274877 -11055960 -9829101
6042i829101Q46321N63359Q50271R03739O30384O08491L80086N10953L52755L59924
$$ -9829101 -8982780 -8419421 -7569150 -6665411 -6035027 -5426536 -5046450 -4535497 -4182742 -3822818
6032c822818L81503L05386L03649J62589L49980K79454J90449J50628K87943L63264
$$ -3822818 -3441315 -3135929 -2832280 -2669691 -2319711 -2040257 -1849808 -1699180 -1411237 -1047973
6022a047973M2260J66957K85247J28940J78990g6569A77686J8649L08833J6324
$$ -1047973 -1005713 -838756 -553509 -424569 -245579 -76569 177686 196335 505168 521492
6012E21492R9352K93037J95082o792K91034J07493J85991O2634J71941J49138
$$ 521492 620844 913881 1108963 1102171 1393205 1500698 1686689 1749323 1921264 2070402
6002B070402J69910J88792J16127J0960L07205P9016J60758K21139J67202J96518
$$ 2070402 2240312 2429104 2545231 2556191 2863396 2942412 3103170 3324309 3491511 3688029
5992C688029J05013J45691K11640J91776J27561K29524J72907L00801K58625J81258
$$ 3688029 3793042 3938733 4150373 4342149 4469710 4699234 4872141 5172942 5431567 5612825
5982E612825J79210L36495J90258K83139K14977M07783M26234L25711L28897L71499
$$ 5612825 5792035 6128530 6318788 6601927 6816904 7224687 7650921 7976632 8305529 8677028
5972H677028N44659M53142N67727O16603Q19816P72140O72442J032818J270887
$$ 8677028 9221687 9674829 10242556 10859159 11678975 12451115 13123557 14156375 15427262
5963A5427262J287862J795336K504546K958022J968131j305540p499556D897262
$$ 15427262 16715124 18510460 21015006 23973028 25941159 24635619 17136063 4897262
5954f844530o494201o30677K416610L264815K732386K012500J714506d37947I38900
$$ -6844530 -13338731 -13969408 -11552798 -8287983 -5555597 -3543097 -1828591 -437947 938900
5944B408584J324973J466134J281761J367155J767389K259290K800190K696758
$$ 2408584 3733557 5199691 6481452 7848607 9615996 11875286 14675476 17372234
5936A7372234J123899l100324F869535d193665q950682l572904P72358L160950
$$ 17372234 18496133 15395809 6869535 -4193665 -13144347 -16717251 -15944893 -12783943
5928a2783943K930922K352925J848849J678684J305640a195032F4654J720597
$$ -12783943 -9853021 -7500096 -5651247 -3972563 -2666923 -1195032 64654 1785251
5920A785251J876902K234152J720563J13984l369920a985299o678561m084902
$$ 1785251 3662153 5896305 7616868 7730852 4360932 -1985299 -8663860 -12748762
5912a2748762o82963J584760K122162J700778J549090J059576J026989P97969
$$ -12748762 -13431725 -11846965 -9724803 -8024025 -6474935 -5415359 -4388370 -3590401
5904c590401J058532Q63196Q06236d227I04257J003448J360924J543227J908448
$$ -3590401 -2531869 -1668673 -862437 -4227 904257 1907705 3268629 4811856 6720304
5895F720304Q57920j402935A549998e165023n943378k682248M15898J888221J666934
$$ 6720304 7578224 6175289 1549998 -5165023 -11108401 -13790649 -13374751 -11486530 -9819596
5886i819596J378136J075603O29050O48898O49736M35751N23439L12133L81948
$$ -9819596 -8441460 -7365857 -6736807 -6087909 -5438173 -5002422 -4478983 -4166850 -3784902
5877c784902M26789L08874L41356L01682L16240K05465J02933L11998K60242K53908
$$ -3784902 -3358113 -3049239 -2707883 -2406201 -2089961 -1884496 -1781563 -1469565 -1209323 -955415
5867i55415J63269R3255K99969e7261G7848J11074l0919R0829K17857J10749J93447
$$ -955415 -792146 -698891 -398922 -57261 77848 188922 158003 248832 466689 577438 770885
5856G70885J46801K29939J78845P4551P5103J40582J44659J97992J39445J47589
$$ 770885 917686 1147625 1326470 1401021 1476124 1616706 1761365 1959357 2098802 2246391
5846B246391Q6652K10197K55557J7131J63166J43141J97511J76294r9834J63596
$$ 2246391 2333043 2543240 2798797 2815928 2979094 3122235 3319746 3496040 3396206 3559802
5836C559802K09362K83751M5503J72367R1400L06575Q4091K75350J96119o5260
$$ 3559802 3769164 4052915 4098418 4270785 4362185 4668760 4752851 5028201 5224320 5159060
5826E159060L42391J77924R2680K86193k8118J42700L32004J02639K50299K89383
$$ 5159060 5501451 5679375 5772055 6058248 6030130 6172830 6504834 6607473 6857772 7147155
5816G147155J98743K06924J72363L10124J58586L31271K51714J10022K94763L74505
$$ 7147155 7345898 7552822 7725185 8035309 8193895 8525166 8776880 8886902 9181665 9556170
5806I556170K76595J42034M40841R7991M23240L28272M83124L68896L07985L59107
$$ 9556170 9832765 9974799 10415640 10513631 10936871 11265143 11748267 12117163 12425148 12784255
5796A2784255L16715L49407L67574L38204M14101N35233M89614M36884O46749
$$ 12784255 13100970 13450377 13817951 14156155 14570256 15105489 15595103 16031987 16678736
5787A6678736M84700O06025P69409N52136Q69491O22697P75008J077688P78155
$$ 16678736 17163436 17769461 18538870 19091006 19960497 20583194 21358202 22435890 23214045
5778B3214045J052297R65218J032089J187785J327826J223785J532498J637929
$$ 23214045 24266342 25231560 26263649 27451434 28779260 30003045 31535543 33173472
5770C3173472J843427J980715K073661K353262K481580K955067L056173L790584
$$ 33173472 35016899 36997614 39071275 41424537 43906117 46861184 49917357 53707941
5762E3707941M312422M953642O156125P238909R087176J1173194J4548028J9630916
$$ 53707941 58020363 62974005 69130130 76369039 85456215 96629409 111177437 130808353
5754A30808353L0740616M2568506J7755551m4064624A5815125a86126846n8255506
$$ 130808353 161548969 204117475 221873026 177808402 15815125 -186126846 -244382352
5747b44382352K6307179M3388421L0992503K0362017J5497293J2965963J0481639
$$ -244382352 -218075173 -174686752 -143694249 -123332232 -107834939 -94868976 -84387337
5740h4387337Q348495O646762N613309M770902M027617L444750L173073K576399
$$ -84387337 -76038842 -69392080 -63778771 -59007869 -54980252 -51535502 -48362429 -45786030
5732d5786030K319411K084020K004264J676686J538477J451436J402888J294723
$$ -45786030 -43466619 -41382599 -39378335 -37701649 -36163172 -34711736 -33308848 -32014125
5724c2014125R84610J015646R65199R16235P26688Q50324P84015P88809P32079
$$ -32014125 -31029515 -30013869 -29048670 -28132435 -27405747 -26555423 -25771408 -24982599 -24250520
5715b4250520M52957O60838N74116N72801M00041N21167M68719N09164O24231
$$ -24250520 -23797563 -23136725 -22562609 -21989808 -21589767 -21068600 -20599881 -20090717 -19466486
5706a9466486K66061L64487M42111L67446L69538K04570L39281J94088K65519
$$ -19466486 -19200425 -18835938 -18393827 -18026381 -17656843 -17452273 -17112992 -16918904 -16653385
5697a6653385K82623L00189L09841J73942K55728K51242K01000L98918L18810
$$ -16653385 -16370762 -16070573 -15760732 -15586790 -15331062 -15079820 -14878820 -14479902 -14161092
5688a4161092K68805J8374L23248P2582J66027K84906J44284J68308J90800K23358
$$ -14161092 -13892287 -13873913 -13550665 -13478083 -13312056 -13027150 -12882866 -12714558 -12523758 -12300400
5678a2300400K97651Q022K41827J63597P2469J37463K05484J55412K36394J98388
$$ -12300400 -12002749 -11994727 -11752900 -11589303 -11516834 -11379371 -11173887 -11018475 -10782081 -10583693
5668a0583693j0327K86088R0984J17029K46906K03083j1451K38403J44647K85095
$$ -10583693 -10594020 -10307932 -10216948 -10099919 -9853013 -9649930 -9661381 -9422978 -9278331 -8993236
5658h993236L473R2886K02231K86117N1521J97052R9806P8735L43243K07669L00322
$$ -8993236 -8989763 -8896877 -8694646 -8408529 -8357008 -8159956 -8060150 -7981415 -7638172 -7430503 -7130181
5647g130181P3741K58045K27078K45397M41637K86925N31924L31950Q17370P99609
$$ -7130181 -7056440 -6798395 -6571317 -6325920 -5884283 -5597358 -5065434 -4733484 -3916114 -3116505
5637c116505J004772e28957A975733J840440r62212d088191j3067693n184390
$$ -3116505 -2111733 -528957 1975733 3816173 2853961 -4088191 -17155884 -22340274
5629b2340274J242516K477180K218828J214713J056260O51482Q09514N29149K42091
$$ -22340274 -21097758 -18620578 -16401750 -15187037 -14130777 -13479295 -12669781 -12140632 -11898541
5620a1898541M28565M07485L07363K14954R9312M59360K5337J30488K57565m9333
$$ -11898541 -11469976 -11062491 -10755128 -10540174 -10440862 -9981502 -9956165 -9825677 -9568112 -9617445
5610i617445J89248K01997Q7315j3048J56096K9916J01588J41483J60365Q404
$$ -9617445 -9428197 -9226200 -9138885 -9151933 -8995837 -8965921 -8864333 -8722850 -8562485 -8554081
5600h554081J59212R2847M5703J04296K4915J26455q59M7152K21646l2472L9623
$$ -8554081 -8394869 -8302022 -8256319 -8152023 -8127108 -8000653 -8001512 -7954360 -7732714 -7765186 -7725563
5589g725563M8023L6783Q0187L8973K04928q7315J21276l4329J46554o0501J26004
$$ -7725563 -7677540 -7640757 -7560570 -7521597 -7316669 -7403984 -7282708 -7317037 -7170483 -7230984 -7104980
5578g104980j15059J47418R8661l9695J31474j16006N8438j6073J58305P2017
$$ -7104980 -7220039 -7072621 -6973960 -7013655 -6882181 -6998187 -6939749 -6955822 -6797517 -6725500
5568f725500M102J60064j44779J17139L4969O8801L0256k6357O9613J61767R5273
$$ -6725500 -6721398 -6561334 -6706113 -6588974 -6554005 -6485204 -6454948 -6481305 -6411692 -6249925 -6154652
5557f154652m4952J8090P8856O0565m3356L3193N8134R4823P8711K6281J4343
$$ -6154652 -6199604 -6181514 -6102658 -6042093 -6085449 -6052256 -5994122 -5899299 -5820588 -5794307 -5779964
5546e779964J13406P4912k9382L53370J16481J05460K97363j21835m37421r89376
$$ -5779964 -5666558 -5591646 -5621028 -5267658 -5151177 -5045717 -4748354 -4870189 -5307610 -6296986
5536f296986p10410q930J65945J42038J46574K39445J87025p8669P0219J48436
$$ -6296986 -7007396 -7016326 -6850381 -6708343 -6561769 -6322324 -6135299 -6213968 -6143749 -5995313
5526e995313l8279J56678O1156J6798O4840m4950J55359l7350r8229J03105Q5904
$$ -5995313 -6033592 -5876914 -5815758 -5798960 -5734120 -5779070 -5623711 -5661061 -5759290 -5656185 -5570281
5515e570281O1487P6246j13910K15849j24762P4908m9719P0383k6431M0030M4545
$$ -5570281 -5508794 -5432548 -5546458 -5330609 -5455371 -5380463 -5430182 -5359799 -5386230 -5346200 -5301655
5504e301655N9864p4040L5091P1751j7407M8752M4972R1466O702O741K1561l4278
$$ -5301655 -5241791 -5315831 -5280740 -5208989 -5226396 -5177644 -5132672 -5041206 -5034504 -5027763 -5006202 -5040480
5492e040480j1688j0049J43676m3896O5096m5519J39190o0652p7447Q037L0550
$$ -5040480 -5052168 -5062217 -4918541 -4962437 -4897341 -4942860 -4803670 -4864322 -4941769 -4933732 -4903182
5481d903182O6998J6667k2788O2977K5586j4195J2157M2042P481P5265j82190
$$ -4903182 -4836184 -4819517 -4842305 -4779328 -4753742 -4767937 -4755780 -4713738 -4706257 -4630992 -4813182
5470d813182J69745m8970L0275R8644l7051K2105Q754O2618Q364q9830J69202
$$ -4813182 -4643437 -4692407 -4662132 -4563488 -4600539 -4578434 -4569680 -4507062 -4498698 -4588528 -4419326
5459d419326j27424K7763J09128R691q3881j2462J42824p1090L9113j2556J50984
$$ -4419326 -4546750 -4518987 -4409859 -4400168 -4484049 -4496511 -4353687 -4424777 -4385664 -4398220 -4247236
5448d247236j10333j8919J20503p3497O5071J30648k10836K44769n7763j41454
$$ -4247236 -4357569 -4376488 -4255985 -4329482 -4264411 -4133763 -4344599 -4099830 -4157593 -4299047
5438d299047n937K16045k6171j6296j07449J90476m9624p7385P9643k7360j38207
$$ -4299047 -4304984 -4088939 -4115110 -4131406 -4238855 -4048379 -4098003 -4175388 -4095745 -4123105 -4261312
5427d261312J00855M8792P7384l6017L8809J42663M3751j58373Q619P678r3818
$$ -4261312 -4160457 -4111665 -4034281 -4070298 -4031489 -3888826 -3845075 -4003448 -3994829 -3987151 -4080969
5416d080969J41050r9253K9620P298P4751p2738O1588M9359m0799R1556k877k2037
$$ -4080969 -3939919 -4039172 -4009552 -4002254 -3927503 -4000241 -3938653 -3889294 -3930093 -3838537 -3841414 -3863451
5404c863451O0935m3068k3660J39861K8948j89325P2737n6204J02853p3787J47802
$$ -3863451 -3802516 -3845584 -3869244 -3729383 -3700435 -3889760 -3817023 -3873227 -3770374 -3844161 -3696359
5393c696359K224o6395N5034n735o7952P8659m5720n63r365j441R9762m9942J38058
$$ -3696359 -3694135 -3760530 -3705496 -3711231 -3779183 -3700524 -3746244 -3746807 -3756172 -3757613 -3657851 -3707793 -3569735
5380c569735p1261K8205M8612j1506n4398J11820n0486K4817k9176J19041j18758
$$ -3569735 -3640996 -3612791 -3564179 -3575685 -3630083 -3518263 -3568749 -3543932 -3573108 -3454067 -3572825
5369c572825n5476J08587l1953o427P470K5785J06516k4475J4930k2187K2445
$$ -3572825 -3628301 -3519714 -3551667 -3558094 -3550624 -3524839 -3418323 -3442798 -3427868 -3450055 -3427610
5358c427610j5085N1457K8959q3704P353J22495L617n7563N1594j86271K02957
$$ -3427610 -3442695 -3391238 -3362279 -3445983 -3438630 -3316135 -3312518 -3370081 -3318487 -3504758 -3301801
5347c301801k8239j01971J65741N2874k24614J78368m0295j6295k590j5078P7712
$$ -3301801 -3330040 -3432011 -3266270 -3213396 -3438010 -3259642 -3299937 -3316232 -3318822 -3333900 -3256188
5336c256188o8922J64025n6878o9781o0257R4612M4659j56P3893q8452j7054Q5806
$$ -3256188 -3325110 -3161085 -3217963 -3287744 -3348001 -3253389 -3208730 -3208886 -3134993 -3223445 -3240499 -3154693
5324c154693n9172J6065M0706m6151j32864J38601M3025m0117J46117j20616L8079
$$ -3154693 -3213865 -3197800 -3157094 -3203245 -3336109 -3197508 -3154483 -3194600 -3048483 -3169099 -3131020
5313c131020R8510j10464M7295n7998R935J3139O7809M0465j03073L38907k85161
$$ -3131020 -3032510 -3142974 -3095679 -3153677 -3143742 -3130603 -3062794 -3022329 -3125402 -2786495 -3071656
5302c071656m4205j868J12591n0242N3911m2759P3033j96865K43392o6743P668
$$ -3071656 -3115861 -3117729 -3005138 -3055380 -3001469 -3044228 -2971195 -3168060 -2924668 -2991411 -2983743
5291b983743n6088J59426j40625O6937Q3824o9275p0829J00270n7497J10988q5600
$$ -2983743 -3039831 -2880405 -3021030 -2954093 -2870269 -2939544 -3010373 -2910103 -2967600 -2856612 -2942212
5280b942212K5874R6519j29456O0519J24778j74611J3539J21296M6062j42191
$$ -2942212 -2916338 -2819819 -2949275 -2888756 -2763978 -2938589 -2925050 -2803754 -2757692 -2899883
5270b899883N7679J2038k2628J111k192O8942p5654K6369P0366q1821J46717j56965
$$ -2899883 -2842204 -2830166 -2852794 -2851683 -2853875 -2784933 -2860587 -2834218 -2763852 -2845673 -2698956 -2855921
5258b855921K31559j30140P7712M5822q5751j4859J18420j07993N5541r0826O9688
$$ -2855921 -2624362 -2754502 -2676790 -2630968 -2716719 -2731578 -2613158 -2721151 -2665610 -2756436 -2686748
5247b686748J12931j67756P9326m8074K8068N7013m5425P8572M2113p2805q2973
$$ -2686748 -2573817 -2741573 -2662247 -2710321 -2682253 -2625240 -2670665 -2592093 -2549980 -2622785 -2705758
5236b705758J24517n4559J1455J53154k11770J27827k29846P8095J24228r9558
$$ -2705758 -2581241 -2635800 -2624345 -2471191 -2682961 -2555134 -2784980 -2706885 -2582657 -2682215
5226b682215K2300r0653N7149J06203M429o1439O7801N8502n3915N3557m4291
$$ -2682215 -2659915 -2750568 -2693419 -2587216 -2582787 -2644226 -2576425 -2517923 -2571838 -2518281 -2562572
5215b562572m079O4557o6262J7549Q5086p1512j3750N3089n3943P7632M268n1710
$$ -2562572 -2566651 -2502094 -2568356 -2550807 -2465721 -2537233 -2550983 -2497894 -2551837 -2474205 -2469937 -2521647
5203b521647l7266m3715R2882O592M9036q3266J08322k9881M5892l0710k4557
$$ -2521647 -2558913 -2602628 -2509746 -2503154 -2454118 -2537384 -2429062 -2458943 -2413051 -2443761 -2468318
5192b468318M2190K17425j70026j27241Q1563p9536J06523J29467j17354j01221
$$ -2468318 -2426128 -2208703 -2378729 -2505970 -2424407 -2503943 -2397420 -2267953 -2385307 -2486528
5182b486528J92417L898K7725j31702p2769J40703m6643M2712j3997k6953P8496
$$ -2486528 -2294111 -2290213 -2262488 -2394190 -2466959 -2326256 -2372899 -2330187 -2344184 -2371137 -2292641
5171b292641q3521O9247o3335J01289l3504P1281p5611J5739j7007J27036j45523
$$ -2292641 -2376162 -2306915 -2370250 -2268961 -2302465 -2231184 -2306795 -2291056 -2308063 -2181027 -2326550
5160b326550R8807j3880r5005j04090K01872j21418J11235q2332Q8288Q543o4013
$$ -2326550 -2227743 -2241623 -2336628 -2440718 -2238846 -2360264 -2249029 -2331361 -2243073 -2234530 -2298543
5149b298543J50343j16765k9391L8310J7102l5517Q6795M1176o3033q0148J48793
$$ -2298543 -2148200 -2264965 -2294356 -2256046 -2238944 -2274461 -2187666 -2146490 -2209523 -2289671 -2140878
5138b140878j49077K6926L1474J09757o2148p9149J30827m8046R7744n0833O5512
$$ -2140878 -2289955 -2263029 -2231555 -2121798 -2183946 -2263095 -2132268 -2180314 -2082570 -2133403 -2067891
5127b067891K5624j35303o1260P8138M7496k6558j5200j6592P4564k9417O697
$$ -2067891 -2042267 -2177570 -2238830 -2160692 -2113196 -2139754 -2154954 -2171546 -2096982 -2126399 -2119702
5116b119702K5853n6161N5684L7279j08114R9310m8101k143K23497j09049P150
$$ -2119702 -2093849 -2150010 -2094326 -2057047 -2165161 -2065851 -2113952 -2116095 -1892598 -2001647 -1994497
5105a994497p1404Q8283k07511J34635n058K0816j8838K2032J0576J6239j09417
$$ -1994497 -2065901 -1977618 -2185129 -2050494 -2055552 -2034736 -2053574 -2031542 -2020966 -2004727 -2114144
5094b114144J07062N1468k16412J88715j16577J39483m4214m7746K16987k32810
$$ -2114144 -2007082 -1955614 -2172026 -1983311 -2099888 -1960405 -2004619 -2052365 -1835378 -2068188
5084b068188M2376L9891P2213q85j58331J75655j10008J40791n5927j79756J27383
$$ -2068188 -2025812 -1985921 -1913708 -1914593 -2072924 -1897269 -2007277 -1866486 -1922413 -2102169 -1974786
5073a974786M9967M7452j18198N1351O2363J1221q0110O0121m8465l0890O6718
$$ -1974786 -1924819 -1877367 -1995565 -1944214 -1881851 -1870630 -1950740 -1890619 -1939084 -1969974 -1903256
5062a903256M6172j03165J19612m9370o7763R2065Q9394j09503M9184M3114r7293
$$ -1903256 -1857084 -1960249 -1840637 -1890007 -1957770 -1865705 -1776311 -1885814 -1836630 -1793516 -1890809
5051a890809J1271O7106k4185m7198n1772J04538o0971J49024j43577r021R9364
$$ -1890809 -1879538 -1812432 -1836617 -1883815 -1935587 -1831049 -1892020 -1742996 -1886573 -1895594 -1796230
5040a796230L1787j09727Q0460j34912K30596q5757L0949q4711O1124O1773j92392
$$ -1796230 -1764443 -1874170 -1793710 -1928622 -1698026 -1783783 -1752834 -1837545 -1776421 -1714648 -1907040
5029a907040K00159k9849j1630O1530n5335K7427j44766J28578j0665j0783J6048
$$ -1907040 -1706881 -1736730 -1748360 -1686830 -1742165 -1714738 -1859504 -1730926 -1741591 -1752374 -1736326
5018a736326P4771r5684J04472j86920O0155R1246l7491P0006l9291j04005J25362
$$ -1736326 -1661555 -1757239 -1652767 -1839687 -1779532 -1688286 -1725777 -1655771 -1695062 -1799067 -1673705
5007a673705N5819p3753P2655j73779K48994j19776j22817K6457L0919L9968j28675
$$ -1673705 -1617886 -1691639 -1618984 -1792763 -1543769 -1663545 -1786362 -1759905 -1728986 -1689018 -1817693
4996a817693K72559j39509k05j6156L6868o6670N9098P8670r0840Q6988k0094
$$ -1817693 -1545134 -1684643 -1684848 -1701004 -1664136 -1730806 -1671708 -1593038 -1683878 -1596890 -1616984
4985a616984n3247R7211m9781L6321r1778M166M1047L3691j10241J63822k9871
$$ -1616984 -1670231 -1573020 -1622801 -1586480 -1678258 -1674092 -1633045 -1599354 -1709595 -1545773 -1575644
4974a575644j5516j746o3988N5373L2347J43816j91446J53230j33336O321r915
$$ -1575644 -1591160 -1592906 -1656894 -1601521 -1569174 -1425358 -1616804 -1463574 -1596910 -1590589 -1600504
4963a600504K7482Q9311n2599n4843J37934j25952p8111R5833J16733j05386l2987
$$ -1600504 -1573022 -1483711 -1536310 -1591153 -1453219 -1579171 -1657282 -1561449 -1444716 -1550102 -1583089
4952a583089Q5521j9731o663n2384M1215N6869q4162M4754O4806j06799j0318
$$ -1583089 -1497568 -1517299 -1523962 -1576346 -1535131 -1478262 -1562424 -1517670 -1452864 -1559663 -1569981
4941a569981J2929O7811k6925K700k0780L8856O2670r8066J47481J7130l7715
$$ -1569981 -1557052 -1489241 -1516166 -1513466 -1534246 -1495390 -1432720 -1530786 -1383305 -1366175 -1403890
4930a403890J8058q0416J3842j11976P2753N9990j35945J48515r5705r8558K15530
$$ -1403890 -1385832 -1466248 -1452406 -1564382 -1491629 -1431639 -1567584 -1419069 -1514774 -1613332 -1397802
4919a397802J23090j38358r6082J31830J3185n8721r5811J83037l3295j29694
$$ -1397802 -1274712 -1413070 -1509152 -1377322 -1364137 -1422858 -1518669 -1335632 -1368927 -1498621
4909a498621Q2585m2359P0661O6596r100j89594K23754p2089j05788J09394m9996
$$ -1498621 -1416036 -1458395 -1387734 -1321138 -1330238 -1519832 -1296078 -1368167 -1473955 -1364561 -1414557
4898a414557Q9934j48710P0496J89342q6414n9497N9929q3456Q7428j88923J28447
$$ -1414557 -1324623 -1473333 -1402837 -1213495 -1299909 -1359406 -1299477 -1382933 -1295505 -1484428 -1355981
4887a355981N7762q4391M2976k1854R1225r0018J76648k74188J03019P67J08572
$$ -1355981 -1298219 -1382610 -1339634 -1361488 -1270263 -1360281 -1183633 -1457821 -1354802 -1354035 -1245463
4876a245463j7913p0203l347N3934r429J02816o6004M5986l7009L9207q7330J5489
$$ -1245463 -1263376 -1333579 -1336926 -1282992 -1292421 -1189605 -1255609 -1209623 -1246632 -1207425 -1294755 -1279266
4864a279266p5683J57083q7852O126N6726l7944O8200L4546m8779p7572J48066
$$ -1279266 -1354949 -1197866 -1285718 -1279592 -1222866 -1260810 -1192610 -1158064 -1206843 -1284415 -1136349
4853a136349K3092q9675n2345J30220j35224k2100M1108K9045Q952J2559o0389
$$ -1136349 -1113257 -1202932 -1255277 -1125057 -1260281 -1282381 -1241273 -1212228 -1203276 -1190717 -1251106
4842a251106K00210n3396m4421p3360J92895r4811q1880K3041O0365M3003j49165
$$ -1251106 -1050896 -1104292 -1148713 -1222073 -1029178 -1123989 -1205869 -1182828 -1122463 -1079460 -1228625
4831a228625N7572j35900J90694o5325R9249K6289q4912M9395o601n0457l0996
$$ -1228625 -1171053 -1306953 -1116259 -1181584 -1082335 -1056046 -1140958 -1091563 -1098164 -1148621 -1179617
4820a179617J18819q4357L243P0210r96O336j0090k9423l8276J25892p8815j2927
$$ -1179617 -1060798 -1145155 -1141912 -1071702 -1072698 -1066362 -1076452 -1105875 -1144151 -1018259 -1097074 -1110001
4808a110001J22830m9534Q3502j23676l8697O1617n2214J06618J3354p0127j5435
$$ -1110001 -987171 -1036705 -953203 -1076879 -1115576 -1053959 -1106173 -999555 -986201 -1056328 -1071763
4797a071763o196r014N2590n5206J17577j0811p0139k6666R2507j32171J94889
$$ -1071763 -1077959 -1086973 -1034383 -1089589 -972012 -982823 -1052962 -1079628 -987121 -1119292 -924403
4786i24403k8449j63028K03154Q1898j14744m9589M3144k4942J077M904j1320
$$ -924403 -952852 -1115880 -912726 -830828 -945572 -995161 -952017 -976959 -975882 -970978 -982298
4775i82298O522M1701q240j80366K02469l0421P2958j8841m7937l4457O4977L881
$$ -982298 -975776 -934075 -942315 -1122681 -920212 -950633 -877675 -896516 -944453 -978910 -913933 -910052
4763i10052N023J3694k3256L2513o962k4146J84381k67842j0635J72444r090j6566
$$ -910052 -905029 -891335 -914591 -882078 -889040 -913186 -728805 -996647 -1007282 -834838 -843928 -860494
4751h60494J2317k7646k4126m0288J77379j04039n5727M3345Q3087Q9546n6489
$$ -860494 -848177 -875823 -899949 -940237 -762858 -866897 -922624 -879279 -796192 -706646 -763135
4740g63135k07105J76089N4731n6647r7508O3303m1940n8236J75394j08275J13993
$$ -763135 -970240 -794151 -739420 -796067 -893575 -830272 -872212 -930448 -755054 -863329 -749336
4729g49336j57196J12650M5424j2667J3688n7335k6101Q1602k0067M5423j05155
$$ -749336 -906532 -793882 -748458 -761125 -747437 -804772 -830873 -749271 -769338 -723915 -829070
4718h29070k6032J8449K5552Q3439L0191j27711J12847n7407P7673p8871J11907
$$ -829070 -855102 -836653 -811101 -727662 -697471 -825182 -712335 -769742 -692069 -770940 -659033
4707f59033n8179l4534R415K2988l1630p9527L1553R1590J46836j80135P4609
$$ -659033 -717212 -751746 -742331 -719343 -750973 -830500 -798947 -707357 -560521 -740656 -666047
4696f66047O5309j48529J36348O1119r0533r5341M9370J11859j33347n2298N6696
$$ -666047 -600738 -749267 -612919 -551800 -642333 -737674 -688304 -576445 -709792 -762090 -705394
4685g05394J31766K3373j05392O2019N4675j19697M3806R9422m6194K0515j37323
$$ -705394 -573628 -550255 -655647 -593628 -538953 -658650 -614844 -515422 -561616 -541101 -678424
4674f78424n5521J41315M5994m3262j22360M7916J28886j25480P3267P8759j49858
$$ -678424 -733945 -592630 -546636 -589898 -712258 -664342 -535456 -660936 -587669 -508910 -658768
4663f58768O3338M3580N1479j9061r6126L1362N141k5725P4668J19287j01493
$$ -658768 -595430 -551850 -500371 -519432 -615558 -584196 -579055 -604780 -530112 -410825 -512318
4652e12318M6024p7203Q9424j09858m8876J34466P307j86113J79955K6667j12205
$$ -512318 -466294 -543497 -454073 -563931 -612807 -478341 -471034 -657147 -477192 -450525 -562730
4641e62730P6179l4876J87491j77822J1532M9334J13712k60927R7589J23929L5889
$$ -562730 -486551 -521427 -333936 -511758 -500226 -450892 -337180 -598107 -500518 -376589 -340700
4630c40700j02599q2217m1503J06838Q4455r3040O7008l0523P4598n1810M6061
$$ -340700 -443299 -525516 -567019 -460181 -375726 -468766 -401758 -432281 -357683 -409493 -363432
4619c63432L747N8867p8142n002l192O518J5820K9026r4863R7201Q5715j10367
$$ -363432 -359685 -300818 -378960 -383962 -387154 -380636 -364816 -335790 -430653 -333452 -247737 -358104
4607c58104J0349P1523o3700l7346M690L2434R4201j29868j2608R751J11670q9647
$$ -358104 -347755 -276232 -339932 -377278 -372588 -340154 -245953 -375821 -388429 -378678 -267008 -356655
4595c56655J23548k6831q1946P3322k6179P5622o1466q0367N1396M4478J18856
$$ -356655 -233107 -259938 -341884 -268562 -294741 -219119 -280585 -360952 -309556 -265078 -146222
4584a46222j11466M5396o4623P4301Q830M5605j20464j4960J01480M9254q7921
$$ -146222 -257688 -212292 -276915 -202614 -193784 -148179 -268643 -283603 -182123 -132869 -220790
4573b20790j19335J29121K8622p8703i8404p6904j33873a35998L0036j40182K7559
$$ -220790 -340125 -211004 -182382 -261085 -98404 -175308 -309181 -135998 -105962 -246144 -218585
4562b18585K8008r0097d1051q3741l4769j2312r6973e0155j26951J6347q1753
$$ -218585 -190577 -280674 -41051 -124792 -159561 -171873 -268846 -50155 -177106 -160759 -242512
4551b42512J09728O3891p1188M1264a5314j26592a5436j10012K6377A84a22836
$$ -242512 -132784 -68893 -140081 -98817 -15314 -141906 -15436 -125448 -99071 184 -122836
4539D3821j7708Q6987e7348D6788b1700k8115g645o9325d575A73020p5557A8301
$$ 43821 26113 113100 -57348 46788 -21700 -49815 -7645 -76970 -4575 173020 97463 18301
4526D0156O4904d404A01860D5237c7306D5636J5579P1888o2531K4174j8651k0471
$$ 40156 105060 -4404 101860 45237 -37306 45636 61215 133103 70572 94746 76095 55624
4514E5624Q66O508J66066q8993O8760k2553r2294J06865n3586A0692Q4268O5990
$$ 55624 56490 62998 229064 140071 208831 186278 93984 200849 147263 10692 94960 160950
4502A60950O0373m8462K8607o9963k81J36706k7615l0713r6606L5871l3926j8772
$$ 160950 221323 172861 201468 131505 131224 267930 240315 209602 112996 148867 114941 96169
4490I6169K62720A76686K18963n4667j67807l255J27065P283n2368o799J38425
$$ 96169 358889 176686 395649 340982 173175 169920 296985 304268 251900 245101 383526
4479C83526j87965K15593j46173o963J6080J14586j28563K6760J16636M212L9599
$$ 383526 195561 411154 264981 258018 274098 388684 260121 286881 403517 407729 447328
4468D47328o0767J18052j60349J27076r1739m0756J34747j69427K02976j27578
$$ 447328 386561 504613 344264 471340 379601 338845 473592 304165 507141 379563
4458C79563j848n739J7799J17873N0062j98128J08611N8881m4625O5623O4586
$$ 379563 377715 371976 389775 507648 557710 359582 468193 527074 482449 548072 612658
4447F12658j13970J17553j23080P0633K4441J1658n0504m9979L3154N0562k3773
$$ 612658 498688 616241 493161 563794 588235 599893 549389 499410 532564 583126 559353
4436E59353k1820J21277m7734O5535l7354R1840r9704N3735q1773J02508o7843
$$ 559353 537533 658810 611076 676611 639257 731097 631393 685128 603355 705863 638020
4425F38020J38278p4657K6321m4772M5625J08307j78371J78062o3379Q8451q9649
$$ 638020 776298 701641 727962 683190 728815 837122 658751 836813 773434 861885 772236
4414G72236l2567J70342o779o8602O0978r8061M4985Q1523j30181J21707L3719
$$ 772236 739669 910011 903232 834630 895608 797547 842532 924055 793874 915581 949300
4403I49300J5203j5204k3345M1517n2113J3033l7605J69738o9238m3410j7615
$$ 949300 964503 949299 925954 967471 915358 928391 890786 1060524 991286 947876 930261
4392I30261k7240J91932q6003R377N5256o2466J5442m3169R7952Q0680j73023
$$ 930261 903021 1094953 1008950 1018327 1073583 1011117 1026559 983390 1081342 1162022 988999
4381I88999L6709Q9958q2575J44525l9192k4274O0417N9952j6525m6606J28070
$$ 988999 1025708 1115666 1033091 1177616 1138424 1114150 1174567 1234519 1217994 1171388 1299458
4370A299458r4663O2129K2212j761J04075p7796r303N4945j36590J56952m3492
$$ 1299458 1204795 1266924 1289136 1287375 1391450 1313654 1304351 1359296 1222706 1379658 1336166
4359A336166P6061j14515M6544N8613K9824k7877q1424J34162L6521m2592n6576
$$ 1336166 1412227 1297712 1344256 1402869 1432693 1404816 1323392 1457554 1494075 1451483 1394907
4348A394907J60761n0428J2769m099R0693k4148n432J21707j58819J53841l0917
$$ 1394907 1555668 1505240 1518009 1513910 1604603 1580455 1575023 1696730 1537911 1691752 1660835
4337A660835N1939o1519P7207k2382R9505k8292P6243o1599n2625K6659J40844
$$ 1660835 1712774 1651255 1728462 1706080 1805585 1777293 1853536 1791937 1739312 1765971 1906815
4326A906815m7581O778J02078p2633L3285J21781k3002J07273j64975k3085J15967
$$ 1906815 1859234 1866012 1968090 1895457 1928742 2050523 2027521 2134794 1969819 1946734 2062701
4315B062701J5070l9860K0677L3347p190J9425J03700l6466Q7475K0581l5244
$$ 2062701 2077771 2037911 2058588 2091935 2084745 2104170 2207870 2171404 2258879 2279460 2244216
4304B244216P8597N6281l5252L0740M824J18654j3761l236n9941J55635L8666
$$ 2244216 2322813 2379094 2343842 2374582 2379406 2498060 2484299 2481063 2421122 2576757 2615423
4293B615423n4449K04360j0771R4245N9606O2965P8991O7758r8720j14951m13613
$$ 2615423 2560974 2765334 2754563 2848808 2908414 2971379 3050370 3118128 3019408 2904457 2490844
4282B490844k37274j2859p245K37535O5048j21694K96790R0838j6673j5247Q8891
$$ 2490844 2253570 2240711 2233466 2471001 2536049 2414355 2711145 2801983 2785310 2770063 2858954
4271B858954J18516j38J90124K1451J10051M7077j30413k88891l49718o0473M2721
$$ 2858954 2977470 2977332 3167456 3188907 3298958 3346035 3215622 2926731 2577013 2516540 2559261
4260B559261J71724j2103J57636M9486l5588Q1939K0483J94378J785m3216J18883
$$ 2559261 2730985 2718882 2876518 2926004 2890416 2972355 2992838 3187216 3189001 3145785 3264668
4249C264668M3670O7129o0899J00153k7744J97567j39n6131J01660p3823K669
$$ 3264668 3308338 3375467 3314568 3414721 3386977 3584544 3584405 3528274 3629934 3556111 3558780
4238C558780J24825J18944q5950J31657J46545J16668n3571p5853J60852K7739
$$ 3558780 3683605 3802549 3716599 3848256 3994801 4111469 4057898 3982045 4142897 4170636
4228D170636L6935j25714J86694O8940m9296J35050O5107M6712J7408m8632K96254
$$ 4170636 4207571 4081857 4268551 4337491 4288195 4423245 4488352 4535064 4552472 4503840 4800094
4217D800094p9908J19823J4644Q8252J9276J8592O6481Q5015Q662K45188j55140
$$ 4800094 4720186 4840009 4854653 4942905 4962181 4980773 5047254 5132269 5140931 5386119 5230979
4206E230979J84597O3271k1514l724K25776L1279J3717J74458L4683l773J88794
$$ 5230979 5415576 5478847 5457333 5453609 5679385 5710664 5724381 5898839 5933522 5929749 6118543
4195F118543N6545J09256l5999J39387L0530J47047n940P7134J65496J29941J4103
$$ 6118543 6175088 6284344 6248345 6387732 6418262 6565309 6559369 6636503 6801999 6931940 6946043
4184F946043P4989J50067J69895J82730j33629J72116J26560K11404Q652J39070
$$ 6946043 7021032 7171099 7340994 7523724 7390095 7562211 7688771 7900175 7908827 8047897
4174H047897J15990Q7566R7885J89822J61837J24820J13953J44747J18380L26560
$$ 8047897 8163887 8251453 8349338 8539160 8700997 8825817 8939770 9084517 9202897 9529457
4164I529457L4099J79274N1099K29461J71002K75162K7512K90841K13650J70491
$$ 9529457 9563556 9742830 9793929 10023390 10194392 10469554 10497066 10787907 11001557 11172048
4154A1172048J53904K17018J49574J62242K57078L23216K02498K34196M01505
$$ 11172048 11325952 11542970 11692544 11854786 12111864 12435080 12637578 12871774 13273279
4145A3273279J74866L18340L14801K41335M71870K94675M57361L43550L30762
$$ 13273279 13448145 13766485 14081286 14322621 14794491 15089166 15546527 15890077 16220839
4136A6220839L00810M87460M18832N97020M32239O11260L87271N70127O61504
$$ 16220839 16521649 17009109 17427941 18024961 18457200 19068460 19455731 20025858 20687362
4127B0687362P55248N88707O62409O61803J066212Q15144Q79370J027230J184393
$$ 20687362 21442610 22031317 22693726 23355529 24421741 25236885 26116255 27143485 28327878
4118B8327878J264134J302943J329153J600657J768899J890830K176777K575349
$$ 28327878 29592012 30894955 32224108 33824765 35593664 37484494 39661271 42236620
4110D2236620K731866L174652L828159M426934N133809O194810P902365J0574907
$$ 42236620 44968486 48143138 51971297 56398231 61532040 67726850 75629215 86204122
4102H6204122J4957147J5547782Q95965l0956127A2802774f1581419k2954399
$$ 86204122 101161269 116709051 117605016 86648889 12802774 -61581419 -84535818
4095h4535818R260511J7627365J4588363J1312326Q971043Q082425f818997H86624
$$ -84535818 -75275307 -57647942 -43059579 -31747253 -22776210 -14693785 -6818997 886624
4086H620059Q047610Q788725J0535971J4158063J6953727Q214245j7549126a384775
$$ 8620059 16667669 25456394 35992365 50150428 67104155 75318400 57769274 -1384775
4077h2612553m1428786J648663J6155033J5216619J1134082Q107889O569247N467212
$$ -82612553 -124041339 -122392676 -106237643 -91021024 -79886942 -71779053 -65209806 -59742594
4069e9742594M806737M178375L545532L095783K447102K182428K024866J714392
$$ -59742594 -54935857 -50757482 -47211950 -44116167 -41669065 -39486637 -37461771 -35747379
4061c5747379J707769J282296J350514J081832J146381J141543P99874Q62720
$$ -35747379 -34039610 -32757314 -31406800 -30324968 -29178587 -28037044 -27237170 -26374450
4053b6374450Q83255O83946N45152P46692P52661N66279O11608M03108M84337
$$ -26374450 -25491195 -24807249 -24262097 -23515405 -22762744 -22196465 -21584857 -21181749 -20697412
4044b0697412M48779N15113K74081O08186K63398L63346K88317M49128K74612
$$ -20697412 -20248633 -19733520 -19459439 -18851253 -18587855 -18224509 -17936192 -17487064 -17212452
4035a7212452L63892K92431K53519K67372L52977J41619K30654M55708J25086
$$ -17212452 -16848560 -16556129 -16302610 -16035238 -15682261 -15540642 -15309988 -14854280 -14729194
4026a4729194J25436R8466L68577K06352R8429J81431L92161Q1047J43622K22970
$$ -14729194 -14603758 -14505292 -14136715 -13930363 -13831934 -13650503 -13258342 -13177295 -13033673 -12810703
4016a2810703J40910J53155J22735K05315Q6230J77713K24051J1484K19619O4942
$$ -12810703 -12669793 -12516638 -12393903 -12188588 -12102358 -11924645 -11700594 -11689110 -11469491 -11404549
4006a1404549k0217L13993K12263q7998J75597J01371J32527J48508J14229J5962
$$ -11404549 -11424766 -11110773 -10898510 -10986508 -10810911 -10709540 -10577013 -10428505 -10314276 -10298314
3996a0298314J94211o8371K76374O2509o7440J27798J92788J38723L6909J3317
$$ -10298314 -10104103 -10172474 -9896100 -9833591 -9901031 -9773233 -9580445 -9441722 -9404813 -9391496
3986i391496L0189J20498J20007l1645J66472O7580J15374N5261J67138l3141
$$ -9391496 -9361307 -9240809 -9120802 -9152447 -8985975 -8918395 -8803021 -8747760 -8580622 -8613763
3976h613763l5695J13205Q3655P4059J15826Q1417o1313K51375l7923J23365k4378
$$ -8613763 -8649458 -8536253 -8452598 -8378539 -8262713 -8181296 -8242609 -7991234 -8029157 -7905792 -7930170
3965g930170l2916J32855k94N2193J49380j71072J80092L4978N2146N6793R0725
$$ -7930170 -7963086 -7830231 -7830525 -7778332 -7628952 -7800024 -7619932 -7584954 -7532808 -7476015 -7385290
3954g385290r9430K89780N8223l2829K7849L079P9773o6845K01684K0036j51186
$$ -7385290 -7484720 -7194940 -7136717 -7169546 -7141697 -7138618 -7058845 -7125690 -6924006 -6903970 -7055156
3943g055156R0389J42133O002J13571j03393J35149j9974J65733L5355K3262K6273
$$ -7055156 -6964767 -6822634 -6816632 -6703061 -6806454 -6671305 -6691279 -6525546 -6490191 -6466929 -6440656
3932f440656M0411M2648M5977r312O6580l7948P8384P8307J19738L586p2228J40083
$$ -6440656 -6400245 -6357597 -6311620 -6320932 -6254352 -6292300 -6213916 -6135609 -6015871 -6012285 -6084513 -5944430
3920e944430L6091J34435q7776K43710j32397q396J59229J46935N8487J61289
$$ -5944430 -5908339 -5773904 -5861680 -5617970 -5750367 -5758763 -5599534 -5452599 -5394112 -5232823
3910e232823p8668j13787m39726k95691k0304l7631K03311P9149p8427L60827
$$ -5232823 -5311491 -5425278 -5865004 -6160695 -6180999 -6218630 -6015319 -5936170 -6014597 -5653770
3900e653770L6248q3399J05147J52097P187O8212J09923J52838l7840O1633l9307
$$ -5653770 -5617522 -5700921 -5595774 -5443677 -5436490 -5368278 -5258355 -5105517 -5143357 -5081724 -5121031
3889e121031m74671k73377j73467J58738p5212J77446K6705R0442L5329K3429
$$ -5121031 -5595702 -5869079 -6042546 -5883808 -5959020 -5781574 -5754869 -5664427 -5629098 -5605669
3879e605669P3581J14053l1918M4386L2804k9930K8434J14014p5583P1345K3437
$$ -5605669 -5532088 -5418035 -5449953 -5405567 -5372763 -5402693 -5374259 -5260245 -5335828 -5264483 -5241046
3868e241046O7974R6516j6894N3787j03409k7981Q2066J35057l1164k846K5119
$$ -5241046 -5173072 -5076556 -5093450 -5039663 -5143072 -5171053 -5088987 -4953930 -4985094 -4987940 -4962821
3857d962821P0637J5761K1650K5772j14330J38673p2132J7271K2181M9953M6283
$$ -4962821 -4892184 -4876423 -4854773 -4829001 -4943331 -4804658 -4876790 -4859519 -4837338 -4787385 -4741102
3846d741102r7785J52467j15581R9298j1617Q8138q3894L4713O9718J26627p7078
$$ -4741102 -4838887 -4686420 -4802001 -4702703 -4714320 -4626182 -4710076 -4675363 -4605645 -4479018 -4556096
3835d556096l5546p5978J09049o4702J23442L7609P7152r2579j7459J30295m4319
$$ -4556096 -4591642 -4667620 -4558571 -4623273 -4499831 -4462222 -4385070 -4477649 -4495108 -4364813 -4409132
3824d409132M6143j16644K07540j46599Q775L1112M313Q1362n3310J15380j66702
$$ -4409132 -4362989 -4479633 -4272093 -4418692 -4409917 -4378805 -4374492 -4293130 -4346440 -4231060 -4397762
3813d397762J32320l1086o4136R4390L2171l065o4685J12733Q3468j95361L4488
$$ -4397762 -4265442 -4296528 -4360664 -4266274 -4234103 -4237168 -4301853 -4189120 -4105652 -4301013 -4266525
3802d266525N6106k9792Q9043N9080J46238j38105k1237j58376Q7708J93693k07213
$$ -4266525 -4210419 -4240211 -4151168 -4092088 -3945850 -4083955 -4105192 -4263568 -4175860 -3982167 -4189380
3791d189380J11624O0760k764q4980J16860n9532O3671l4455m9704P7858M5451
$$ -4189380 -4077756 -4016996 -4019760 -4104740 -3987880 -4047412 -3983741 -4018196 -4067900 -3990042 -3944591
3780c944591m1768k4628M1856L0417l2031P8050N9908K7027j7703j1190m8528
$$ -3944591 -3986359 -4010987 -3969131 -3938714 -3970745 -3892695 -3832787 -3805760 -3823463 -3834653 -3883181
3769c883181M5506K0647N0541k1517r5846O5388L0396L927m989N8314r9934P9482
$$ -3883181 -3837675 -3817028 -3766487 -3788004 -3883850 -3818462 -3788066 -3784139 -3789128 -3730814 -3830748 -3751266
3757c751266l1387O6478n7177P897K2470l9049p236K718J00946J15918j50855
$$ -3751266 -3782653 -3716175 -3773352 -3765455 -3742985 -3782034 -3789270 -3786552 -3685606 -3569688 -3720543
3746c720543L2023o5769J43873l0050j6307l7474M4583j3294J01289j48426O1762
$$ -3720543 -3688520 -3754289 -3610416 -3640466 -3656773 -3694247 -3649664 -3662958 -3561669 -3710095 -3648333
3735c648333j2767K41518j46964l7489Q2190J1130r7044R9439K5905l1592p9721
$$ -3648333 -3661100 -3419582 -3566546 -3604035 -3521845 -3510715 -3607759 -3508320 -3482415 -3514007 -3593728
3724c593728J33788K2511j88101Q2024L5625J25714k5630j23678N2902p1253O7460
$$ -3593728 -3459940 -3437429 -3625530 -3543506 -3507881 -3382167 -3407797 -3531475 -3478573 -3549826 -3482366
3713c482366Q8071j33366J54066j92305K18129k5556j38388P6373P4545l5112
$$ -3482366 -3394295 -3527661 -3373595 -3565900 -3347771 -3373327 -3511715 -3435342 -3360797 -3395909
3703c395909J69208q8139L4225q9853P365M4212k887k6850j13586J66824r0793
$$ -3395909 -3226701 -3314840 -3280615 -3370468 -3363103 -3318891 -3321778 -3348628 -3462214 -3295390 -3386183
3692c386183L2317l5830Q1962l2544n2899J164K12856o0351K5930r8396o149L7137
$$ -3386183 -3353866 -3389696 -3307734 -3340278 -3393177 -3392013 -3179157 -3239508 -3213578 -3311974 -3318123 -3280986
3680c280986J48222j81180O2841p5139R0112K9378l6489j00991J40136k0776r799
$$ -3280986 -3132764 -3313944 -3251103 -3326242 -3236130 -3206752 -3243241 -3344232 -3204096 -3224872 -3234671
3669c234671j248k9598J07901M39K6293n9882j5083q9021O3965M1017P7588m6079
$$ -3234671 -3235919 -3265517 -3157616 -3157177 -3130884 -3190766 -3205849 -3294870 -3230905 -3189888 -3112300 -3158379
3657c158379J6591j31027J22547P0936m9313j4899J01025j29037M1100J03447
$$ -3158379 -3141788 -3272815 -3150268 -3079332 -3128645 -3143544 -3042519 -3171556 -3130456 -3027009
3647c027009l4295l7088m1980O1290K9030q1733O4197j6483M0922K1493N469m8769
$$ -3027009 -3061304 -3098392 -3140372 -3079082 -3050052 -3131785 -3067588 -3084071 -3043149 -3021656 -3016187 -3064956
3635c064956L5179q2206J03034N599r1116O5215P6219l0974j13383P9880L0990
$$ -3064956 -3029777 -3111983 -3008949 -3003350 -3094466 -3029251 -2953032 -2984006 -3097389 -3017509 -2986519
3624b986519o4246J02447m0885j3280J65279p5132p3543k1454n2245M7883K6589
$$ -2986519 -3050765 -2948318 -2989203 -3002483 -2837204 -2912336 -2985879 -3007333 -3059578 -3011695 -2985106
3613b985106J10364j56541J21268M3309p4052J08345n4274q1009q3412j9371K02264
$$ -2985106 -2874742 -3031283 -2910015 -2866706 -2940758 -2832413 -2886687 -2967696 -3051108 -3070479 -2868215
3602b868215p2628P9906l4077m1654p9646J65418j5899j30481J43156K3201j28920
$$ -2868215 -2940843 -2860937 -2895014 -2936668 -3016314 -2850896 -2866795 -2997276 -2854120 -2830919 -2959839
3591b959839P1535O5938j14269J94878j62886Q4035r7927R9213K7532n3540L9522
$$ -2959839 -2888304 -2822366 -2936635 -2741757 -2904643 -2820608 -2918535 -2819322 -2791790 -2845330 -2805808
3580b805808j20296R3472j13512J89166j60618J16923n2212J02465l1084q7121
$$ -2805808 -2926104 -2832632 -2946144 -2756978 -2917596 -2800673 -2852885 -2750420 -2781504 -2868625
3570b868625R4902K0047j42506J73152J3575q8132M9009n8255l3703J97810k10925
$$ -2868625 -2773723 -2753676 -2896182 -2723030 -2709455 -2797587 -2748578 -2806833 -2840536 -2642726 -2853651
3559b853651J75723q2020o5924J32356K4479j50006J11916j3210P3537j58667
$$ -2853651 -2677928 -2759948 -2825872 -2693516 -2669037 -2819043 -2707127 -2720337 -2646800 -2805467
3549b805467P7535N0142k710j76019J75732r5018O1062j08765J40730j0121J10313
$$ -2805467 -2727932 -2677790 -2680500 -2856519 -2680787 -2775805 -2714743 -2823508 -2682778 -2692899 -2582586
3538b582586j50259J70051k83887K18278M3406k19831K17839j24155J9569m1289
$$ -2582586 -2732845 -2562794 -2846681 -2628403 -2584997 -2804828 -2586989 -2711144 -2691575 -2732864
3528b732864J26934M454m9715Q3164j37232Q5690l1460J7530Q9188K5425j1306
$$ -2732864 -2605930 -2601476 -2651191 -2568027 -2705259 -2619569 -2651029 -2633499 -2544311 -2518886 -2530192
3517b530192r0032M5336l9575J80553j44478j48750J21285l1032O5305r4488O3322
$$ -2530192 -2620224 -2574888 -2614463 -2433910 -2578388 -2727138 -2605853 -2636885 -2571580 -2666068 -2602746
3506b602746K6260n5805Q2347j46147J97305j26269P2008m1296R0819j6605P344
$$ -2602746 -2576486 -2632291 -2549944 -2696091 -2498786 -2625055 -2553047 -2594343 -2503524 -2520129 -2512785
3495b512785j29082Q5152J33384k58133k8267J86617j80842J70824N016m1542
$$ -2512785 -2641867 -2556715 -2423331 -2681464 -2709731 -2523114 -2703956 -2533132 -2528116 -2569658
3485b569658L967Q7348n4622O1053j23318N1267K7317l6827k1083P216K1510P6375
$$ -2569658 -2565691 -2478343 -2532965 -2471912 -2595230 -2543963 -2516646 -2553473 -2574556 -2567340 -2545830 -2469455
3473b469455j09736Q0214P8013k20610P9572J44912P534R450m1975O9796j76226
$$ -2469455 -2579191 -2498977 -2420964 -2641574 -2562002 -2417090 -2409556 -2400106 -2442081 -2372285 -2548511
3462b548511J03250K0892j49653K266J28349j75460J69714o0411o152J51029o1068
$$ -2548511 -2445261 -2424369 -2574022 -2571756 -2443407 -2618867 -2449153 -2509564 -2515716 -2364687 -2425755
3451b425755m3650O2311m2670K6384J40993j65730m0781Q1309j2264r7225Q8370
$$ -2425755 -2469405 -2407094 -2449764 -2423380 -2282387 -2448117 -2488898 -2407589 -2419853 -2517078 -2428708
3440b428708k5040l0663J7611Q9145p319j43803N2614N0765P4608m4894L655J3686
$$ -2428708 -2453748 -2484411 -2466800 -2377655 -2384974 -2528777 -2476163 -2425398 -2350790 -2395684 -2392029 -2378343
3428b378343j31052R4985Q6205q5632J43922o3036l6884m2082k9535J25725j08104
$$ -2378343 -2509395 -2414410 -2328205 -2413837 -2269915 -2332951 -2369835 -2411917 -2441452 -2315727 -2423831
3417b423831j1198q1897J43307q2955P5666P9755m2998K2728n6821R6746p8034
$$ -2423831 -2435029 -2516926 -2373619 -2456574 -2380908 -2301153 -2344151 -2321423 -2378244 -2281498 -2359532
3406b359532l0055O9108p7218O3084L7818l7829Q1468j60635L6562J21301q8498
$$ -2359532 -2389587 -2320479 -2397697 -2334613 -2296795 -2334624 -2253156 -2413791 -2377229 -2255928 -2344426
3395b344426M0240J7288k5680O8324J1044r3148j0995j6574n7845J69459o5852
$$ -2344426 -2304186 -2286898 -2312578 -2244254 -2233210 -2326358 -2337353 -2353927 -2411772 -2242313 -2308165
3384b308165O2408j64852J48006l7295j8119R5495j64305R8644L9470l1474P0644
$$ -2308165 -2245757 -2410609 -2262603 -2299898 -2318017 -2222522 -2386827 -2288183 -2248713 -2280187 -2209543
3373b209543j73285J84319o9594o3348k8168M010J15748J1549p0982O2867o1813
$$ -2209543 -2382828 -2198509 -2268103 -2331451 -2359619 -2355609 -2239861 -2228312 -2299294 -2236427 -2298240
3362b298240J40497j92577P2533r0050J43436m7578n7400M8430O2521j9383L1873
$$ -2298240 -2157743 -2350320 -2277787 -2367837 -2224401 -2271979 -2329379 -2280949 -2218428 -2237811 -2205938
3351b205938j19963J18138r0060K3379j945N6281q7729j4306L2270N8701J00955
$$ -2205938 -2325901 -2207763 -2297823 -2274444 -2276389 -2220108 -2307837 -2322143 -2289873 -2231172 -2130217
3340b130217n9333l4872k8756K33979p7221k03758J28304L4901j07923K85o3385
$$ -2130217 -2189550 -2224422 -2253178 -2019199 -2096420 -2300178 -2171874 -2136973 -2244896 -2244611 -2307996
3329b307996J71765j56775J36673K0085j2685l7538j3674J0787L3404P435p2587
$$ -2307996 -2136231 -2293006 -2156333 -2136248 -2148933 -2186471 -2200145 -2189358 -2155954 -2148519 -2221106
3318b221106n3378Q1451l7117N7617L0369K317o6648R9680N3198j66415R8975
$$ -2221106 -2274484 -2193033 -2230150 -2172533 -2142164 -2139847 -2206495 -2106815 -2053617 -2220032 -2121057
3307b121057j9832R597j20524j7770K2895J27317j01858P4890n2974J72226k77486
$$ -2121057 -2140889 -2131292 -2251816 -2269586 -2246691 -2119374 -2221232 -2146342 -2199316 -2027090 -2304576
3296b304576O7861P7313O8256R95N7091j19808L8211j551k0695q4178J0929O611
$$ -2304576 -2236715 -2159402 -2091146 -2090151 -2033060 -2152868 -2114657 -2116208 -2136903 -2221081 -2210152 -2203541
3284b203541J56844j72901O7067P903O978o813R7920q9273m6150K6653L3344K5287
$$ -2203541 -2046697 -2219598 -2152531 -2144628 -2137650 -2144463 -2046543 -2135816 -2181966 -2155313 -2121969 -2096682
3272b096682j2356K6025l5506L8137M2268j06792j7591O7543K1594p1631R5732
$$ -2096682 -2109038 -2083013 -2118519 -2080382 -2038114 -2144906 -2162497 -2094954 -2073360 -2144991 -2049259
3261b049259o5004m919J1844K5375l5940P6251p308j0439l2346K5257O055j3589
$$ -2049259 -2114263 -2119182 -2107338 -2081963 -2117903 -2041652 -2048960 -2059399 -2091745 -2066488 -2060433 -2074022
3249b074022J1287K9045L9149r9653P635k7299N9043M2305q2419p269M2759l2194
$$ -2074022 -2062735 -2033690 -1994541 -2094194 -2086559 -2113858 -2054815 -2012510 -2094929 -2102198 -2059439 -2091633
3237b091633j4411O1041J1639n0079P1376o3506J528l5118l8893O6271q610j39774
$$ -2091633 -2106044 -2045003 -2033364 -2083443 -2012067 -2075573 -2074045 -2109163 -2148056 -2081785 -2090395 -2230169
3225b230169K41079j09000M9219j3454J13782m646p2638n3135Q4246j22459P4088
$$ -2230169 -1989090 -2098090 -2048871 -2062325 -1948543 -1953189 -2025827 -2078962 -1994716 -2117175 -2043087
3214b043087J02357j18996M8476J37952j04879o7762O8326o3256j0316P7624M8060
$$ -2043087 -1940730 -2059726 -2011250 -1873298 -1978177 -2045939 -1977613 -2040869 -2051185 -1973561 -1925501
3203a925501m0965j6912n2388M688l7065m6723P5759O898j16203Q6018k0321n457
$$ -1925501 -1966466 -1983378 -2035766 -2031078 -2068143 -2114866 -2039107 -2032209 -2148412 -2062394 -2082715 -2088172
3191b088172L2108J73197j58221R824P7622j14629J01394J1402Q195K7215j8182
$$ -2088172 -2056064 -1882867 -2041088 -2031264 -1953642 -2068271 -1966877 -1955475 -1947280 -1920065 -1938247
3180a938247k905N603j6340K550m0205J10759j41240M6378J06473p2853o0129
$$ -1938247 -1941152 -1935549 -1951889 -1949339 -1989544 -1878785 -2020025 -1973647 -1867174 -1940027 -2000156
3169b000156J43791j0381j31019m3362M481R8949J13588k03403P1932l7064P4585
$$ -2000156 -1856365 -1866746 -1997765 -2041127 -2036646 -1937697 -1824109 -2027512 -1955580 -1992644 -1918059
3158a918059J2466p3166O0099m4678R1289n7283L7013j67184P2377K3904o5p0936
$$ -1918059 -1905593 -1978759 -1918660 -1963338 -1872049 -1929332 -1892319 -2059503 -1987126 -1963222 -1963287 -2034223
3146b034223J01226O8584j58583J7705m4778N5152N6752l1944J32951l2203n3456
$$ -2034223 -1932997 -1864413 -2022996 -2005291 -2050069 -1994917 -1938165 -1970109 -1837158 -1869361 -1922817
3135a922817M2523q6167p072L2264m7570J14993m0176M7587J05539p0265j19734
$$ -1922817 -1880294 -1966461 -1973533 -1941269 -1988839 -1873846 -1914022 -1866435 -1760896 -1831161 -1950895
3124a950895j9369Q1081L7077q6767l96Q0855q6387R8643o4736j12188R9036M2623
$$ -1950895 -1970264 -1889183 -1852106 -1938873 -1939269 -1858414 -1944801 -1846158 -1910894 -2023082 -1924046 -1881423
3112a881423o8193J14956l0180j25677J10644O3785r2915J2978k0159J5114N0618
$$ -1881423 -1949616 -1834660 -1864840 -1990517 -1879873 -1816088 -1909003 -1896025 -1916184 -1901070 -1850452
3101a850452j0640j36555J35040k2194R444k611r1620M4652M0067R125j8082j1415
$$ -1850452 -1861092 -1997647 -1862607 -1884801 -1875357 -1877968 -1969588 -1924936 -1884869 -1875744 -1893826 -1905241
3089a905241O2738o7086M4056J9633j63775J1103K26885j09206R409k052P6332
$$ -1905241 -1842503 -1909589 -1865533 -1845900 -2009675 -1998572 -1771687 -1880893 -1871484 -1873536 -1797204
3078a797204j25293N1288L8100L4320j13118P4367k2913R972L0635j06834R4111
$$ -1797204 -1922497 -1871209 -1833109 -1798789 -1911907 -1837540 -1860453 -1850481 -1819846 -1926680 -1832569
3067a832569M4609j28445P394J60606j66365L6771O0585P344p0720M6046q716
$$ -1832569 -1787960 -1916405 -1909011 -1748405 -1914770 -1877999 -1817414 -1810070 -1880790 -1834744 -1843460
3056a843460J12316j99495L9239N185J2757J2236P8722m2423n2556J19764m3844
$$ -1843460 -1731144 -1930639 -1891400 -1886215 -1873458 -1861222 -1782500 -1824923 -1877479 -1757715 -1801559
3045a801559m8881k0464M7187N0676r1197J21902j73005J48748j54840J6675p381
$$ -1801559 -1850440 -1870904 -1823717 -1773041 -1864238 -1742336 -1915341 -1766593 -1921433 -1904758 -1912139
3034a912139J17744o143k4317O6705P917j47626J53930l5832M4520j41040K2389
$$ -1912139 -1794395 -1800538 -1824855 -1758150 -1750233 -1897859 -1743929 -1779761 -1735241 -1876281 -1853892
3023a853892r0999J20105L4918M0915l7645J1695l9472p5279J04473Q6493p7692
$$ -1853892 -1944891 -1824786 -1789868 -1748953 -1786598 -1774903 -1814375 -1889654 -1785181 -1698688 -1776380
3012a776380L786o8315P9213o0279R7097j25341P7982l5240M9617k7722P400J07390
$$ -1776380 -1772594 -1840909 -1761696 -1821975 -1724878 -1850219 -1772237 -1807477 -1757860 -1785582 -1778182 -1670792
3000a670792j35184L1586m7738N9407j14000J05979j03366P5680K9053O1909r2398
$$ -1670792 -1805976 -1774390 -1822128 -1762721 -1876721 -1770742 -1874108 -1798428 -1769375 -1707466 -1799864
2989a799864o0919p0154K49151r6611K9620m1931k7027O7676J25836j25925M889
$$ -1799864 -1860783 -1930937 -1681786 -1778397 -1748777 -1790708 -1817735 -1750059 -1624223 -1750148 -1745259
2978a745259L0171m6924k8587R9084O1292q8584l4238O8167O0749r6404N2974
$$ -1745259 -1715088 -1762012 -1790599 -1691515 -1630223 -1718807 -1753045 -1684878 -1624129 -1720533 -1667559
2967a667559j39461R9319p6220J13822p1899O9090l3288L8067j88560J19278r540
$$ -1667559 -1807020 -1707701 -1783921 -1670099 -1741998 -1672908 -1706196 -1668129 -1856689 -1737411 -1746951
2956a746951P4494q0152K085n9201R1792j3085k3439K9514l1114l2020N3423Q5138
$$ -1746951 -1672457 -1752609 -1750524 -1809725 -1717933 -1731018 -1754457 -1724943 -1756057 -1788077 -1734654 -1649516
2944a649516o0220l563o5012M9237O6619j3219O003k383j17988K6452Q6785j9239
$$ -1649516 -1709736 -1713299 -1778311 -1729074 -1662455 -1675674 -1669671 -1672054 -1790042 -1763590 -1676805 -1696044
2932a696044K3408o38j388J19052k75621J02293l5783K25310q5630p3519q4234
$$ -1696044 -1672636 -1673274 -1674662 -1555610 -1831231 -1728938 -1764721 -1539411 -1625041 -1698560 -1782794
2921a782794P5616J3085n5296j1502J27819J309j46045R4310O7975K0200j91738
$$ -1782794 -1707178 -1694093 -1749389 -1760891 -1633072 -1631763 -1777808 -1683498 -1615523 -1595323 -1787061
2910a787061J65008P2408j26992o2326k3957l278Q8583M326j0752J7537l0089
$$ -1787061 -1622053 -1549645 -1676637 -1738963 -1762920 -1766198 -1677615 -1673289 -1684041 -1666504 -1696593
2899a696593l1105l2374k0604M8586k0442R6671n5420R1356p0456k9742M9433
$$ -1696593 -1727698 -1760072 -1780676 -1732090 -1752532 -1655861 -1711281 -1619925 -1690381 -1720123 -1670690
2888a670690m1084M6262N2766j37770P5342j60051q623J68158o939J4142j6552
$$ -1670690 -1711774 -1665512 -1612746 -1750516 -1675174 -1835225 -1843848 -1675690 -1682629 -1668487 -1685039
2877a685039Q7540J4105p9599n1003J9182j2550J8799J9482p7058M5873Q4260
$$ -1685039 -1597499 -1583394 -1662993 -1713996 -1694814 -1707364 -1688565 -1669083 -1746141 -1700268 -1616008
2866a616008j3196p2044q260N3733J44111j89815K4539M5747J2423j66836J71095
$$ -1616008 -1629204 -1701248 -1709508 -1655775 -1511664 -1701479 -1676940 -1631193 -1618770 -1785606 -1614511
2855a614511l5862n0195O4302o2711J32391m445q7642O5900l2130p6516j4306
$$ -1614511 -1650373 -1700568 -1636266 -1698977 -1566586 -1571031 -1658673 -1592773 -1624903 -1701419 -1715725
2844a715725J56050P42q1230n5744J8277L0116n0417L0894J133j999M1588j12516
$$ -1715725 -1559675 -1558933 -1640163 -1695907 -1677630 -1647514 -1697931 -1667037 -1665904 -1667903 -1626315 -1738831
2832a738831Q9026L5012j71372J6273K05961l3785j37944J25273o0370M5655n0875
$$ -1738831 -1649805 -1614793 -1786165 -1769892 -1563931 -1597716 -1735660 -1610387 -1670757 -1625102 -1675977
2821a675977r2430J10045O8354k8668Q8744l8209n2947N3982j50590J64880o8332
$$ -1675977 -1768407 -1658362 -1590008 -1618676 -1529932 -1568141 -1621088 -1567106 -1717696 -1552816 -1621148
2810a621148J08702j39611J19268j16418M0942J36088j10602o5846N530K6313
$$ -1621148 -1512446 -1652057 -1532789 -1649207 -1608265 -1472177 -1582779 -1648625 -1643095 -1616782
2800a616782J05869o7668N6333k02049J48887o9809M9680k9968j66881J44105
$$ -1616782 -1510913 -1578581 -1522248 -1724297 -1575410 -1645219 -1595539 -1625507 -1792388 -1648283
2790a648283n7942J53060j5127l3176l4981l9344J28003Q3267j46078N0084l6883
$$ -1648283 -1706225 -1553165 -1568292 -1601468 -1636449 -1675793 -1547790 -1464523 -1610601 -1560517 -1597400
2779a597400J48106k05497p731J07840q8231n4332N3363Q9951k6680j01470J02145
$$ -1597400 -1449294 -1654791 -1662522 -1554682 -1642913 -1697245 -1643882 -1553931 -1580611 -1682081 -1579936
2768a579936j7103J3814j2015J03888j88503M7110J30274K8744j85162R4875m4019
$$ -1579936 -1597039 -1583225 -1595240 -1491352 -1679855 -1632745 -1502471 -1473727 -1658889 -1564014 -1608033
2757a608033R6482k4238q2477L794J4374O4561j9629R0496j17979l4211R8061
$$ -1608033 -1511551 -1535789 -1618266 -1614472 -1600098 -1535537 -1555166 -1464670 -1582649 -1616860 -1518799
2746a518799o4307K1754J5592n7669o8524O5397L0917L1584j5291K5706j87561
$$ -1518799 -1583106 -1561352 -1545760 -1603429 -1671953 -1606556 -1575639 -1544055 -1559346 -1533640 -1721201
2735a721201J70299J8621j13065J61934j44335P1884k1097L0702p081L8414P8647
$$ -1721201 -1550902 -1532281 -1645346 -1483412 -1627747 -1555863 -1576960 -1546258 -1553339 -1514925 -1436278
2724a436278j43346l3320M0612P481J5209J9234l8676J27964p7710j24547J05869
$$ -1436278 -1579624 -1612944 -1572332 -1564851 -1549642 -1530408 -1569084 -1441120 -1518830 -1643377 -1537508
2713a537508m6667N3304M8293l1093j4852o8611J12236o4273n9326o4695R6272
$$ -1537508 -1584175 -1530871 -1482578 -1513671 -1528523 -1597134 -1484898 -1549171 -1608497 -1673192 -1576920
2702a576920m6879L2490k3232Q9156j30457L4264P9860O6715r105q2940J25839
$$ -1576920 -1623799 -1591309 -1614541 -1525385 -1655842 -1621578 -1541718 -1475003 -1484108 -1567048 -1441209
2691a441209m0044K7121j12960r5855J62917m6580P8542n9478m2199O5030Q4965
$$ -1441209 -1481253 -1454132 -1567092 -1662947 -1500030 -1546610 -1468068 -1527546 -1569745 -1504715 -1419750
2680a419750q9306j803j51982M6938O8589O759J09011j28152l1375r0018J72867
$$ -1419750 -1509056 -1510859 -1662841 -1615903 -1547314 -1540555 -1431544 -1559696 -1591071 -1681089 -1508222
2669a508222J0204K7363j37754J17734j65488J37674j3882K789P0211n0636j24371
$$ -1508222 -1498018 -1470655 -1608409 -1490675 -1656163 -1518489 -1532371 -1529582 -1459371 -1510007 -1634378
2658a634378J01516J930M6068l5026o2303J24730o2518m7045j9345L6490M3090
$$ -1634378 -1532862 -1530932 -1484864 -1519890 -1582193 -1457463 -1519981 -1567026 -1586371 -1549881 -1506791
2647a506791O6644J0662j12019L5651O8224r5967K8080n0962N164R934m0140L4744
$$ -1506791 -1440147 -1429485 -1541504 -1505853 -1437629 -1533596 -1505516 -1556478 -1551314 -1541380 -1581520 -1546776
2635a546776J28170p4484j9985L5945p5157Q5430M9607o5488N4059K8845o8422
$$ -1546776 -1418606 -1493090 -1513075 -1477130 -1552287 -1466857 -1417250 -1482738 -1428679 -1399834 -1468256
2624a468256k852p2510N0587J09472k40211K10J34499p729l4990P1117o8478Q9362
$$ -1468256 -1471108 -1543618 -1493031 -1383559 -1623770 -1623560 -1489061 -1496790 -1531780 -1460663 -1529141 -1439779
2612a439779r0205k2633j7050M5111L5807k0850p3610J20091l6280P1146j02513
$$ -1439779 -1529984 -1552617 -1569667 -1524556 -1488749 -1509599 -1583209 -1463118 -1499398 -1428252 -1530765
2601a530765J45149p1726j19707Q2765L4440j13645j1942J99323P654j68477J45097
$$ -1530765 -1385616 -1457342 -1577049 -1494284 -1459844 -1573489 -1585431 -1386108 -1378454 -1546931 -1401834
2590a401834j7789j09788N3368j06139J9427Q7359P8622n5733p1159o8745N9038
$$ -1401834 -1419623 -1529411 -1476043 -1582182 -1562755 -1475396 -1396774 -1452507 -1523666 -1592411 -1533373
2579a533373J14742n1974j19304K05466l8677r8804k437j0398J53134r5757n1931
$$ -1533373 -1418631 -1470605 -1589909 -1384443 -1423120 -1521924 -1524361 -1534759 -1381625 -1477382 -1529313
2568a529313R5849j81632J64031j6458j48515J58691Q0702M0024j61159n1899
$$ -1529313 -1433464 -1615096 -1451065 -1467523 -1616038 -1457347 -1376645 -1336621 -1497780 -1549679
2558a549679M906K35009J7166r7195j21037J55859K3058p0104k8124J6638j24790
$$ -1549679 -1544773 -1309764 -1292598 -1389793 -1510830 -1354971 -1331913 -1402017 -1430141 -1413503 -1538293
2547a538293l9130J45560J0688j65071J94027p7219J22097k01911J36063N5219
$$ -1538293 -1577423 -1431863 -1421175 -1586246 -1392219 -1469438 -1347341 -1549252 -1413189 -1357970
2537a357970r2410L5789j4693m4721p4087N8896m2322J24351q663q8335L5941
$$ -1357970 -1450380 -1414591 -1429284 -1474005 -1548092 -1489196 -1531518 -1407167 -1415830 -1504165 -1468224
2526a468224o7944J74474O1630l1572j04096m8199l7356J33055q2715l7592O2054
$$ -1468224 -1536168 -1361694 -1300064 -1331636 -1435732 -1483931 -1521287 -1388232 -1470947 -1508539 -1446485
2515a446485n2258J3240P8674p8029j492P0799M1398k5463q8448O0965L5147j47303
$$ -1446485 -1498743 -1485503 -1406829 -1484858 -1486350 -1415551 -1374153 -1399616 -1488064 -1427099 -1391952 -1539255
2503a539255R9772n6596J50679o2295o6236n086Q8506n9469L6847R5409j3271
$$ -1539255 -1439483 -1496079 -1345400 -1407695 -1473931 -1479017 -1390511 -1449980 -1413133 -1317724 -1330995
2492a330995j75979J01505j56628Q6893J00979m7863j56345K29206o1391R4010
$$ -1330995 -1506974 -1405469 -1562097 -1475204 -1374225 -1422088 -1578433 -1349227 -1410618 -1316608
2482a316608j7458j43972M7429J6097N0024n5501n7527j1063J73873j44173l864
$$ -1316608 -1334066 -1478038 -1430609 -1414512 -1364488 -1419989 -1477516 -1488579 -1314706 -1458879 -1462743
2471a462743O1627r4048R6304Q537o9277M5500k5301K3909O4448r4712L913K357
$$ -1462743 -1401116 -1495164 -1398860 -1390323 -1459600 -1414100 -1439401 -1415492 -1351044 -1445756 -1441843 -1439486
2459a439486P3373j29960R5150L4294j09737N3006m7352K4181n2167J0036M0171
$$ -1439486 -1366113 -1496073 -1400923 -1366629 -1476366 -1423360 -1470712 -1446531 -1498698 -1488662 -1448491
2448a448491R8107j21602m634J12152P6767j63759O3489o0418p455J46936j15939
$$ -1448491 -1350384 -1471986 -1476620 -1364468 -1287701 -1451460 -1387971 -1448389 -1455844 -1308908 -1424847
2437a424847N015m8872k7805K25133j49168m9983K45919j52610j1572r864N4395
$$ -1424847 -1419832 -1468704 -1496509 -1271376 -1420544 -1470527 -1224608 -1377218 -1388790 -1398654 -1344259
2426a344259j3280r7422J06927o887N5475n3032m6485m6094J64154l5826p0390
$$ -1344259 -1357539 -1454961 -1348034 -1354921 -1299446 -1352478 -1398963 -1445057 -1280903 -1316729 -1387119
2415a387119l8001J9244l9280J23789j17268j1267N1220n7126Q9482O4026j02235
$$ -1387119 -1425120 -1405876 -1445156 -1321367 -1438635 -1449902 -1398682 -1455808 -1366326 -1302300 -1404535
2404a404535Q6019n9947j1155R7740j20300M3952L9308j50012N7020M1574m0183
$$ -1404535 -1318516 -1378463 -1389618 -1291878 -1412178 -1368226 -1328918 -1478930 -1421910 -1380336 -1420519
2393a420519J7024K4399M6195O2012j62227K1353J98718j68546K8775N179k44
$$ -1420519 -1403495 -1379096 -1332901 -1270889 -1433116 -1411763 -1213045 -1381591 -1352816 -1347637 -1347881
2382a347881N5680j2881o7815L6966J4817j22249J16719j09271J29646j17715
$$ -1347881 -1292201 -1305082 -1372897 -1335931 -1321114 -1443363 -1326644 -1435915 -1306269 -1423984
2372a423984R0890p6492P6643q910j18060J12705j03507L7756Q775O6529P6178
$$ -1423984 -1333094 -1409586 -1332943 -1341853 -1459913 -1347208 -1450715 -1412959 -1404184 -1337655 -1261477
2361a261477j40730R9625j12853M1675N6163q7964M7781R9579J8192j83078N5039
$$ -1261477 -1402207 -1302582 -1415435 -1373760 -1317597 -1405561 -1357780 -1258201 -1240009 -1423087 -1368048
2350a368048o8324J88367q1907k0892M3774O5296j84861J70857j09014K1645J3149
$$ -1368048 -1436372 -1248005 -1329912 -1350804 -1307030 -1241734 -1426595 -1255738 -1364752 -1343107 -1329958
2339a329958M7482j53877J09735q6244J8654J4008p705J44838n6537Q708K6239
$$ -1329958 -1282476 -1436353 -1326618 -1412862 -1394208 -1380200 -1387905 -1243067 -1299604 -1290896 -1264657
2328a264657j26534J8124J48734l9010o9766j1986k4295L6414k3465J9440j0587
$$ -1264657 -1391191 -1373067 -1224333 -1263343 -1333109 -1345095 -1369390 -1332976 -1356441 -1337001 -1347588
2317a347588k4420j8726L2989n7244J43995O347J05563j66854q8788k8459J13713
$$ -1347588 -1372008 -1390734 -1357745 -1414989 -1270994 -1264647 -1159084 -1325938 -1414726 -1443185 -1329472
2306a329472j12627J21811J6962j13651J54555n8579j56708J51850N5937l8920
$$ -1329472 -1442099 -1320288 -1303326 -1416977 -1262422 -1321001 -1477709 -1325859 -1269922 -1308842
2296a308842k8538L9771k2463j22773Q5975P662j4467O5750r2918J7467J6625
$$ -1308842 -1337380 -1297609 -1320072 -1442845 -1356870 -1349208 -1363675 -1297925 -1390843 -1373376 -1356751
2285a356751J01846q4005q9989J57305j47116m5376J51250N0182l7133m6130n0587
$$ -1356751 -1254905 -1338910 -1428899 -1271594 -1418710 -1464086 -1312836 -1262654 -1299787 -1345917 -1396504
2274a396504n7539K21502j22700Q0006j39413J2277J14299j08165J19535k1932
$$ -1396504 -1454043 -1232541 -1355241 -1275235 -1414648 -1402371 -1288072 -1396237 -1276702 -1298634
2264a298634J20503j99073K5451J24974n9683n7393K4730N118j4305K4126N0256
$$ -1298634 -1178131 -1377204 -1351753 -1226779 -1286462 -1343855 -1319125 -1314007 -1328312 -1304186 -1253930
2253a253930l3731M0483j04942O5125p1320Q1582q584r0031J22421n8859N0006
$$ -1253930 -1287661 -1247178 -1352120 -1286995 -1358315 -1276733 -1285317 -1375348 -1252927 -1311786 -1261780
2242a261780K1686q7357L0835J43610j98377j4639P6091R2751j97930l135J3071
$$ -1261780 -1240094 -1327451 -1296616 -1153006 -1351383 -1366022 -1289931 -1197180 -1395110 -1398245 -1385174
2231a385174Q2516K4138k25760K21590l9687Q1276o5112R777j3875n0686R2386
$$ -1385174 -1302658 -1278520 -1504280 -1282690 -1322377 -1241101 -1306213 -1296436 -1310311 -1360997 -1268611
2220a268611j03652J56897j3062j7862J1568L0879j25339R150j07961J39537R5165
$$ -1268611 -1372263 -1215366 -1228428 -1246290 -1234722 -1203843 -1329182 -1320032 -1427993 -1288456 -1193291
2209a193291j05146J4200Q4440n0644q3773j0726j2224J45336j2759r2871l8131
$$ -1193291 -1298437 -1284237 -1199797 -1250441 -1334214 -1344940 -1357164 -1211828 -1224587 -1317458 -1355589
2198a355589N0835N3217m8468O159Q9007n4357P897o7572r4314N7016J34137N195
$$ -1355589 -1304754 -1251537 -1300005 -1293846 -1204839 -1259196 -1251299 -1318871 -1413185 -1356169 -1222032 -1216837
2186a216837o9995K0716L592p5173M6580n7734N5720M0565q4058N6410P7713r5706
$$ -1216837 -1286832 -1266116 -1262524 -1337697 -1291117 -1348851 -1293131 -1252566 -1336624 -1280214 -1202501 -1298207
2174a298207m6684R3640J4633j72569J10607k6006J22051j06377L6922N647j9987
$$ -1298207 -1344891 -1251251 -1236618 -1409187 -1298580 -1324586 -1202535 -1308912 -1271990 -1266343 -1286330
2163a286330q1051N5294j4246j0493P608o8664Q9304J51964j3143k36137J23358
$$ -1286330 -1367381 -1312087 -1326333 -1336826 -1329218 -1397882 -1308578 -1156614 -1169757 -1405894 -1282536
2152a282536k1820N4916j2470j77543J74455M2695M044O4159j06204l5232L2775
$$ -1282536 -1304356 -1249440 -1261910 -1439453 -1264998 -1222303 -1218259 -1154100 -1260304 -1295536 -1262761
2141a262761o32K2682k06373K55647j63044P4610J3333J06927o9653m3366k9494
$$ -1262761 -1263393 -1240711 -1447084 -1191437 -1354481 -1279871 -1266538 -1159611 -1229264 -1272630 -1302124
2130a302124L6711K642M7689r6731K7843N6854j79478N9033J09059J357j26581
$$ -1302124 -1265413 -1262771 -1215082 -1311813 -1283970 -1227116 -1406594 -1347561 -1238502 -1237145 -1363726
2119a363726J02546j02739K12915j62884L109L1452J7158N0008j5034M0903l5810
$$ -1363726 -1261180 -1363919 -1151004 -1313888 -1310779 -1279327 -1262169 -1212161 -1227195 -1186292 -1222102
2108a222102j14404J42901j25546P8257j2582m458O858j3014k975J9460J4462
$$ -1222102 -1336506 -1193605 -1319151 -1240894 -1253476 -1257934 -1251076 -1264090 -1267065 -1247605 -1233143
2097a233143O8225j13228P8645J9984j80251M4367O0937L4894l7010r9730J15171
$$ -1233143 -1164918 -1278146 -1199501 -1179517 -1359768 -1315401 -1254464 -1219570 -1256580 -1356310 -1241139
2086a241139j10167K10723j28457p8585R545J12993n9090M8345P2077n5457p1
$$ -1241139 -1351306 -1140583 -1269040 -1347625 -1338080 -1225087 -1284177 -1235832 -1163755 -1219212 -1219283
2075a219283J00758j03548J347L1366o9524J16854k597j34438J21393O5824k18133
$$ -1219283 -1118525 -1222073 -1220726 -1189360 -1258884 -1142030 -1144627 -1279065 -1157672 -1091848 -1309981
2064a309981J31215q3839J25079j2184r7280L0518O0127j50847P9558J28434j13979
$$ -1309981 -1178766 -1262605 -1137526 -1149710 -1246990 -1216472 -1156345 -1307192 -1227634 -1099200 -1213179
2053a213179M0620j4326k44633K68861r195q0709K6833M0518r2250o772m7336
$$ -1213179 -1172559 -1186885 -1431518 -1162657 -1171852 -1252561 -1225728 -1185210 -1277460 -1284232 -1331568
2042a331568J1177k3731J10674r4115M3911n2856J49046m5633n0325J27028j54061
$$ -1331568 -1320391 -1344122 -1233448 -1327563 -1283652 -1336508 -1187462 -1233095 -1283420 -1156392 -1310453
2031a310453L0557K167J80648q9143l4589L6755j53782J99756j35087M6397j72356
$$ -1310453 -1279896 -1277729 -1097081 -1186224 -1220813 -1184058 -1337840 -1138084 -1273171 -1226774 -1399130
2020a399130K02624m155j45174M8605m7026P7930Q3149m0740N8691q2497J10135
$$ -1399130 -1196506 -1200661 -1345835 -1297230 -1344256 -1266326 -1183177 -1223917 -1165226 -1247723 -1137588
2009a137588l8677m1347K3981r3183P1754O0303n3671Q6404p7629p7504j9463
$$ -1137588 -1176265 -1217612 -1193631 -1286814 -1215060 -1154757 -1208428 -1122024 -1199653 -1277157 -1296620
1998a296620q612Q5499J2760r1730P8409j4716O0080L5366m9897q105L2565q3433
$$ -1296620 -1305232 -1219733 -1206973 -1298703 -1220294 -1235010 -1174930 -1139564 -1189461 -1197566 -1165001 -1248434
1986a248434j8293J21732p1509J1781K4291J7455n1126q1886J01933k8486O4099
$$ -1248434 -1266727 -1144995 -1216504 -1204723 -1180432 -1162977 -1214103 -1295989 -1194056 -1222542 -1158443
1975a158443j55930m7205J77111J8199j66247J70372r9996O7654j0820m0824N0997
$$ -1158443 -1314373 -1361578 -1184467 -1166268 -1332515 -1162143 -1262139 -1194485 -1205305 -1246129 -1195132
1964a195132R6616j53078P905j4710N4353J46908q5392j0394j89667J15779J7441
$$ -1195132 -1098516 -1251594 -1243689 -1258399 -1204046 -1057138 -1142530 -1152924 -1342591 -1226812 -1209371
1953a209371j19356K64887j46172j02023P5320J30306k9650j58906J45969p0844
$$ -1209371 -1328727 -1063840 -1210012 -1312035 -1236715 -1106409 -1136059 -1294965 -1148996 -1219840
1943a219840M3868j03111P0562J32524j99808J50261r8069J77968p9830r9761
$$ -1219840 -1175972 -1279083 -1208521 -1075997 -1275805 -1125544 -1223613 -1045645 -1125475 -1225236
1933a225236J15816j28821J19634p8612n0586Q9652O1437j12161J4070J13947
$$ -1225236 -1109420 -1238241 -1118607 -1197219 -1247805 -1158153 -1096716 -1208877 -1194807 -1080860
1923a080860j57902N89L7621j3781K0415J97537j26077j23771J02731o3970J39676
$$ -1080860 -1238762 -1238173 -1200552 -1214333 -1193918 -996381 -1122458 -1246229 -1143498 -1207468 -1067792
1912a067792o2185l3480l2732M050P4090j42536J73152j63926J09570n1378P0591
$$ -1067792 -1129977 -1163457 -1196189 -1192139 -1118049 -1260585 -1087433 -1251359 -1141789 -1193167 -1122576
1901a122576m5364l5422L7344l7773J87525r7452k5096l1732M6900o5671J8822
$$ -1122576 -1167940 -1203362 -1166018 -1203791 -1016266 -1113718 -1138814 -1170546 -1123646 -1189317 -1170495
1890a170495L3092n1561J94556p9182j84228K3375n121R3658o3995K7596n9229
$$ -1170495 -1137403 -1188964 -994408 -1073590 -1257818 -1234443 -1239564 -1145906 -1209901 -1182305 -1241534
1879a241534o932P1467j8297K5685M4671J3634j11774N9692R8374j81328j8079
$$ -1241534 -1248466 -1176999 -1195296 -1169611 -1124940 -1111306 -1223080 -1163388 -1065014 -1246342 -1264421
1868a264421O4236L3426j13409N8326p1177J19678p4894j43255J97358K0548l4690
$$ -1264421 -1200185 -1166759 -1280168 -1221842 -1293019 -1173341 -1248235 -1391490 -1194132 -1173584 -1208274
1857a208274O3315K5257n64N4247M5395k64295Q8430l9511O6522J51472j01629
$$ -1208274 -1144959 -1119702 -1120266 -1066019 -1020624 -1284919 -1196489 -1236000 -1169478 -1018006 -1119635
1846a119635K6023j8239j64344O4658J00662o2703M5865K5590J00692q7133n9339
$$ -1119635 -1093612 -1111851 -1276195 -1211537 -1110875 -1173578 -1127713 -1102123 -1001431 -1088564 -1147903
1835a147903m5990j535O2903o6335Q9177M8618j9323m6157o1957J10650j44068
$$ -1147903 -1193893 -1195428 -1132525 -1198860 -1109683 -1061065 -1080388 -1126545 -1188502 -1077852 -1221920
1824a221920M333K0232j58560J57021l013R7208l1692l8514K8825J6869m7505
$$ -1221920 -1217587 -1197355 -1355915 -1198894 -1201907 -1104699 -1136391 -1174905 -1146080 -1129211 -1176716
1813a176716M2131J4090l6593j04758J19126Q1183k5212j37797Q1619L1812r0404
$$ -1176716 -1134585 -1120495 -1157088 -1261846 -1142720 -1061537 -1086749 -1224546 -1142927 -1111115 -1201519
1802a201519L6040P5725j75827J68957q8879J14544j09435l5186J34579p0320
$$ -1201519 -1165479 -1089754 -1265581 -1096624 -1185503 -1070959 -1180394 -1215580 -1081001 -1151321
1792a151321O2380j8857q971O810N581m3772q3929K3881L3191L1523O0371j22902
$$ -1151321 -1088941 -1107798 -1116769 -1109959 -1104378 -1148150 -1232079 -1208198 -1175007 -1143484 -1083113 -1206015
1780a206015K9700M8392P6951j261o5068p7955P4064j50306K67898j89976L7149
$$ -1206015 -1176315 -1127923 -1050972 -1052233 -1117301 -1195256 -1121192 -1271498 -1003600 -1193576 -1156427
1769a156427K5006J0139J6370n2150k1161r651k8157O1846K0604O8615r6444O0712
$$ -1156427 -1131421 -1121282 -1104912 -1157062 -1178223 -1187874 -1216031 -1154185 -1133581 -1064966 -1161410 -1100698
1757a100698l1156k4642q290N4152J0588J462J0518l6403n7155L6679R8495P546
$$ -1100698 -1131854 -1156496 -1164786 -1110634 -1100046 -1098584 -1088066 -1124469 -1181624 -1144945 -1046450 -1038904
1745a038904j44971K4885P2931j07332p112P7727P4360q8860J8520O43P54o4325
$$ -1038904 -1183875 -1158990 -1086059 -1193391 -1200503 -1122776 -1048416 -1137276 -1118756 -1118113 -1117359 -1181684
1733a181684J03136L2408m3037l8388k1338k8132M0944O2422o6590l5330l8965
$$ -1181684 -1078548 -1046140 -1089177 -1127565 -1148903 -1177035 -1136091 -1073669 -1140259 -1175589 -1214554
1722a214554Q9046J07781J899j69571J45335j09292N6589n3371R1460Q8566k84957
$$ -1214554 -1125508 -1017727 -1015828 -1185399 -1040064 -1149356 -1092767 -1146138 -1054678 -966112 -1251069
1711a251069Q2132O9089K8573j49487M3228P6007N9083j08177o933N3697O3748
$$ -1251069 -1168937 -1099848 -1071275 -1220762 -1177534 -1101527 -1042444 -1150621 -1157554 -1103857 -1040109
1700a040109k07863J90868n2316n7762J7542N8963m4623M7542p6902J3304m8348
$$ -1040109 -1247972 -1057104 -1109420 -1167182 -1149640 -1090677 -1135300 -1087758 -1164660 -1151356 -1199704
1689a199704J23992M3884r2808L1471J14771j45240n8730O8017Q7061j11162Q5895
$$ -1199704 -1075712 -1031828 -1124636 -1093165 -978394 -1123634 -1182364 -1114347 -1027286 -1138448 -1052553
1678a052553l1139R1142l5733k1152j49098L3038P477O7092k8938J4657O6922
$$ -1052553 -1083692 -992550 -1028283 -1049435 -1198533 -1165495 -1158018 -1090926 -1119864 -1105207 -1038285
1667a038285p046j12830J1166n7104J57030K7536j67517N8240j18365J20182O5765
$$ -1038285 -1045331 -1158161 -1146995 -1204099 -1047069 -1019533 -1187050 -1128810 -1247175 -1126993 -1061228
1656a061228j38809L9531n5102J10577M4494o6789o4762N6602K2827R1177r8231
$$ -1061228 -1200037 -1160506 -1215608 -1105031 -1060537 -1127326 -1192088 -1135486 -1112659 -1021482 -1119713
1645a119713J3015q4200J57890p0764J5142J44739j89714K3551o5123J26330j49104
$$ -1119713 -1106698 -1190898 -1033008 -1103772 -1088630 -943891 -1133605 -1110054 -1175177 -1048847 -1197951
1634a197951J12760l7023Q9335j24380J444O4968N6908j24189Q2072N603n2725
$$ -1197951 -1085191 -1122214 -1032879 -1157259 -1155815 -1090847 -1033939 -1158128 -1076056 -1070453 -1123178
1623a123178M5574P5140j49025Q2445J17973j33960M1901j65865J05453N523j1721
$$ -1123178 -1077604 -1002464 -1151489 -1069044 -951071 -1085031 -1043130 -1208995 -1103542 -1098019 -1109740
1612a109740N4344k8313o1377J04532r4961K4609J13861o0340q6294N7662M057
$$ -1109740 -1055396 -1083709 -1145086 -1040554 -1135515 -1110906 -997045 -1057385 -1143679 -1086017 -1081960
1601a081960L3412n0473L3566r76j05617J41217q5024j5438n0137L5932N270o8057
$$ -1081960 -1048548 -1099021 -1065455 -1066431 -1172048 -1030831 -1115855 -1131293 -1181430 -1145498 -1140228 -1208285
1589a208285J81562k39178Q8586M7170k1880J51853j25699O2877R2200j50783
$$ -1208285 -1026723 -1265901 -1177315 -1130145 -1152025 -1000172 -1125871 -1062994 -970794 -1121577
1579a121577J66006j47831l8779P8128R1908k30377P8315N9256k1948Q724N3721
$$ -1121577 -955571 -1103402 -1142181 -1064053 -972145 -1202522 -1124207 -1064951 -1086899 -1078175 -1024454
1568a024454o4024j1133k2494J7287J03205j1287j50655N7903j65424K76377r1203
$$ -1024454 -1088478 -1099611 -1122105 -1104818 -1001613 -1012900 -1163555 -1105652 -1271076 -994699 -1085902
1557a085902j2413k1433L7201m9883Q0584j24968M8771L5425n553O737N3268k0192
$$ -1085902 -1098315 -1119748 -1082547 -1132430 -1051846 -1176814 -1128043 -1092618 -1098171 -1091434 -1038166 -1058358
1545a058358m9274M8032J8275J537l4325j20199J41908N0248k8390K212r3822
$$ -1058358 -1107632 -1059600 -1041325 -1039788 -1074113 -1194312 -1052404 -1002156 -1030546 -1028334 -1122156
1534a122156J10446Q5609o7415m4357o214l6793k4964Q3631m3002L4566r2393
$$ -1122156 -1011710 -926101 -993516 -1037873 -1044087 -1080880 -1105844 -1022213 -1065215 -1030649 -1123042
1523a123042N4824L9289j873j22749K24400j93065L0597K8199j0349n8924M8247
$$ -1123042 -1068218 -1028929 -1030802 -1153551 -929151 -1122216 -1091619 -1063420 -1073769 -1132693 -1084446
1512a084446J2880J36531j37746q2877Q2196O9638o1266j25124J72209j01628
$$ -1084446 -1071566 -935035 -1072781 -1155658 -1073462 -1003824 -1065090 -1190214 -1018005 -1119633
1502a119633P8842k0208m8077J63340q2679J040L2783j70189Q5403K5800n1212
$$ -1119633 -1040791 -1060999 -1109076 -945736 -1028415 -1027375 -994592 -1164781 -1079378 -1053578 -1104790
1491a104790N3377r7874J18757p2423j8826J07277n2055N9646r6670M5679J7522
$$ -1104790 -1051413 -1149287 -1030530 -1102953 -1121779 -1014502 -1066557 -1006911 -1103581 -1057902 -1040380
1480a040380l2790L3637j4506J06521r7987m957p6703J00715l9744q9183J33956
$$ -1040380 -1073170 -1039533 -1054039 -947518 -1045505 -1050462 -1127165 -1026450 -1066194 -1155377 -1021421
1469a021421O90r8557P6105J21020k8283k10641Q4660K3386J5202m3779P6846
$$ -1021421 -1020731 -1119288 -1043183 -922163 -950446 -1161087 -1076427 -1053041 -1037839 -1081618 -1004772
1458a004772q6259K7371j06415J00065p46K7265j4487K2825j55223J62061J8148
$$ -1004772 -1091031 -1063660 -1170075 -1070010 -1070756 -1043491 -1057978 -1035153 -1190376 -1028315 -1010167
1447a010167o1783l7210Q5873j04187L0892L2003n2067J17369n5686j376M2419
$$ -1010167 -1071950 -1109160 -1023287 -1127474 -1096582 -1064579 -1116646 -999277 -1054963 -1056339 -1013920
1436a013920m323Q860j9461m3182N4289j00426M1911m2909J55974n7904N8213
$$ -1013920 -1018243 -1009383 -1028844 -1072026 -1017737 -1118163 -1076252 -1119161 -963187 -1021091 -962878
1425i62878k9330N08q9332j0625M1556l3225k0045J61396j48815j6103K5231M8882
$$ -962878 -992208 -991700 -1081032 -1091657 -1050101 -1083326 -1103371 -941975 -1090790 -1106893 -1081662 -1032780
1413a032780n8197N7219m1940M0515r8122J8055K10970j75569L5137J54974k13158
$$ -1032780 -1090977 -1033758 -1075698 -1035183 -1133305 -1115250 -904280 -1079849 -1044712 -889738 -1102896
1402a102896P9627J07858j26005P5842R11M56Q053p0967k6041M7060p529r9053
$$ -1102896 -1023269 -915411 -1041416 -965574 -964663 -964207 -956154 -1027121 -1053162 -1006102 -1013631 -1112684
1390a112684J92675j68218j4175K4626L3086o1606L9175j5671L1040J8910K8622
$$ -1112684 -920009 -1088227 -1102402 -1077776 -1044690 -1106296 -1067121 -1082792 -1051752 -1032842 -1004220
1379a004220o0971J02973j96679P1126k8232J57427k2945j54152N0817N1577j15233
$$ -1004220 -1065191 -962218 -1158897 -1087771 -1116003 -958576 -981521 -1135673 -1084856 -1033279 -1148512
1368a148512J55121n0326q1906O0365k7416Q6763j7048K9065k6020J5409o4807
$$ -1148512 -993391 -1043717 -1125623 -1065258 -1092674 -1005911 -1022959 -993894 -1019914 -1004505 -1069312
1357a069312j1202l2456J55369K4861j98780M6990N4136Q42L0224j12388J13817
$$ -1069312 -1080514 -1112970 -957601 -932740 -1131520 -1084530 -1030394 -1029552 -999328 -1111716 -997899
1346i97899q8194O3983j6495P9110j27405P7285k8348N9370p721L9671k10921
$$ -997899 -1086093 -1022110 -1038605 -959495 -1086900 -1009615 -1037963 -978593 -986314 -946643 -1157564
1335a157564K16664j12254J33271j53217P6348m5608k6657P8444Q339P7105j31791
$$ -1157564 -940900 -1053154 -919883 -1073100 -996752 -1042360 -1069017 -990573 -982234 -905129 -1036920
1324a036920M6040j18163J67451m4037m5940K3090J7053p2197N0747M2628j12794
$$ -1036920 -990880 -1109043 -941592 -985629 -1031569 -1008479 -991426 -1063623 -1012876 -970248 -1083042
1313a083042J13179p820K2400Q72p142p2604M5650j03j6743R1462l722j83665
$$ -1083042 -969863 -977683 -955283 -954411 -961553 -1034157 -988507 -988610 -1005353 -913891 -917613 -1101278
1301a101278J8904L3890N095j2119K5190K1497M1597j32338M9814J41410j68447
$$ -1101278 -1082374 -1048484 -1043389 -1055508 -1030318 -1008821 -967224 -1099562 -1049748 -908338 -1076785
1290a076785N9380M2448p2691j622j8614K542p3522J81087o8753J7871N568j2173
$$ -1076785 -1017405 -974957 -1047648 -1049270 -1067884 -1065342 -1138864 -957777 -1026530 -1008659 -1003091 -1015264
1278a015264Q9157L4866j16393o5385O0817N063O2206M2646j53199O2522m8881
$$ -1015264 -926107 -891241 -1007634 -1073019 -1012202 -1007139 -944933 -902287 -1055486 -992964 -1041845
1267a041845N705K9252P7422j25631R2225N1258j58613o5548K1245P4259P539
$$ -1041845 -1036140 -1006888 -929466 -1055097 -962872 -911614 -1070227 -1135775 -1114530 -1040271 -1032732
1256a032732P7313q5483L316N0485J47372j69319l4089K988n8438K01274q7621
$$ -1032732 -955419 -1040902 -1037586 -987101 -839729 -1009048 -1043137 -1040149 -1098587 -897313 -984934
1245i84934r7792J31478o1787o4264J31026j88535J24935J06119m4588L1684o4829
$$ -984934 -1082726 -951248 -1013035 -1077299 -946273 -1134808 -1009873 -903754 -948342 -916658 -981487
1234i81487N0130q2517K7991L0213o2200O1791q506q0278M9436n9719N8926l1047
$$ -981487 -931357 -1013874 -985883 -955670 -1017870 -956079 -964585 -1044863 -995427 -1055146 -996220 -1027267
1222a027267k5072l8497J23174O818j00312K9887p6684R1947M9055r6439J3459
$$ -1027267 -1052339 -1090836 -967662 -960844 -1061156 -1031269 -1107953 -1016006 -966951 -1063390 -1049931
1211a049931k3839J15396p1094L2512K3398k9249M6292Q4139k15913J05446q2933
$$ -1049931 -1073770 -958374 -1029468 -996956 -973558 -1002807 -956515 -872376 -1088289 -982843 -1065776
1200a065776l493o182l3361j4263J02914M3501l4185j0545j7820O8351Q581M2913
$$ -1065776 -1069269 -1075451 -1108812 -1123075 -1020161 -976660 -1010845 -1021390 -1039210 -970859 -962278 -919365
1188i19365r9841k9337P225J44377n2418P655j17442R4859J499k3758m4127N2135
$$ -919365 -1019206 -1048543 -1041318 -896941 -949359 -941704 -1059146 -964287 -962788 -986546 -1030673 -978538
1176i78538P5950j47457j9317R6720p1916M2399J825j53480K20338O741n0191
$$ -978538 -902588 -1050045 -1069362 -972642 -1044558 -1002159 -1000334 -1153814 -933476 -926735 -976926
1165i76926K3368o7371J11911k7468l5822O623q8029L2012M3017n1725K9701k855
$$ -976926 -953558 -1020929 -909018 -936486 -972308 -965685 -1053714 -1021702 -978685 -1030410 -1000709 -1003564
1153a003564n892N9102j07826P3488j095O6968K3323j13731p6943O2718O6883
$$ -1003564 -1009456 -950354 -1058180 -984692 -985787 -918819 -895496 -1009227 -1086170 -1023452 -956569
1142i56569j36893P5204J7623N1871K8122k4965p3639J01600m9977Q125J23290
$$ -956569 -1093462 -1018258 -1000635 -948764 -920642 -945607 -1019246 -917646 -967623 -959498 -836208
1131h36208j36379j67511J20817O5946l7277K6012q2464N9108Q1591j16063q0236
$$ -836208 -972587 -1140098 -1019281 -953335 -990612 -964600 -1047064 -987956 -906365 -1022428 -1102664
1120a102664J17545m9106l4169J47957p144Q546J5711j8586j04898J45012r0973
$$ -1102664 -985119 -1034225 -1068394 -920437 -927581 -919035 -903324 -921910 -1026808 -881796 -972769
1109i72769p0241k4768J80303q5194j8306n7785R696J9965P6407j01645K15573
$$ -972769 -1043010 -1067778 -887475 -972669 -990975 -1048760 -1039064 -1019099 -942692 -1044337 -828764
1098h28764k16639L3159j45023J21170L4347o6934J36032r3779L7999K7904r5731
$$ -828764 -1045403 -1012244 -1157267 -1036097 -1001750 -1068684 -932652 -1026431 -988432 -960528 -1056259
1087a056259L3930j25962J00471J26368J0342l1356k861j31190K42601j47357
$$ -1056259 -1022329 -1148291 -1047820 -921452 -911110 -942466 -945327 -1076517 -833916 -981273
1077i81273R6218P2641k75355J38522O9209o5024K282j33338K4667J53319o3263
$$ -981273 -885055 -812414 -1087769 -949247 -880038 -945062 -942780 -1076118 -1051451 -898132 -961395
1066i61395j18885R4226q075P7061O4117j01089O0311m1872p5532M0798J4284
$$ -961395 -1080280 -986054 -994129 -917068 -852951 -954040 -893729 -935601 -1011133 -970335 -956051
1055i56051r903L4194p1224j7724J28200r8326K6477j16078K72564k12255Q141
$$ -956051 -965954 -931760 -1002984 -1020708 -892508 -990834 -964357 -1080435 -807871 -1020126 -1011985
1044a011985M8833K7405r9506J1781N6285j16901N9351R4405k8973R8611j06177
$$ -1011985 -963152 -935747 -1035253 -1023472 -967187 -1084088 -1024737 -930332 -959305 -860694 -966871
1033i66871K5642R2524j87595Q7912m7868K8183N6765o5643j8011K4788o3120
$$ -966871 -941229 -848705 -1036300 -948388 -996256 -968073 -911308 -976951 -994962 -970174 -1033294
1022a033294P7427K160m2922P2127n4344j0190J53289j36201J15092k4792K0054
$$ -1033294 -955867 -953707 -996629 -924502 -978846 -989036 -835747 -971948 -856856 -881648 -861594
1011h61594j08324Q3383j10594P4702K0346M3664j88185J56168q935q4245P1973
$$ -861594 -969918 -886535 -997129 -922427 -902081 -858417 -1046602 -890434 -899369 -983614 -911641
1000i11641m974r554O5899r1399J7892K8045r3479R4336p4693n5343J35109j93664
$$ -911641 -916615 -926169 -860270 -951669 -933777 -905732 -999211 -904875 -979568 -1034911 -899802 -1093466
988a093466J05767J4770q5475N3746J42571j06872Q5386k03100J73262o8885M9695
$$ -1093466 -987699 -972929 -1058404 -1004658 -862087 -968959 -883573 -1086673 -913411 -982296 -932601
977i32601q404n1282q717J00306j66638P9296N4079r1152P7302K6171J1725j628
$$ -932601 -941005 -992287 -1001004 -900698 -1067336 -988040 -933961 -1025113 -947811 -921640 -909915 -911543
965i11543O9047j70773Q4471R240m1820M6074M1496J18j16468k3733j20937J79479
$$ -911543 -842496 -1013269 -928798 -919558 -961378 -915304 -873808 -873690 -990158 -1013891 -1134828 -955349
953i55349J7701m8536m6311N9787O5235l9040l9587N556O8698n5081L8007R887
$$ -955349 -937648 -986184 -1032495 -972708 -907473 -946513 -986100 -980544 -911846 -966927 -928920 -919033
941i19033r3505P540L4718j88614K12060L3257m4489L8516K332n0584O9421q5182
$$ -919033 -1012538 -1004998 -970280 -1158894 -946834 -913577 -958066 -919550 -917218 -967802 -898381 -983563
929i83563R510J46416p9302q1297Q823N1570o257N0539r566l9052k5604M0744
$$ -983563 -974053 -827637 -906939 -988236 -979413 -927843 -934100 -883561 -893127 -932179 -957783 -917039
917i17039q7902J39813o3008j32435K07305j30092k6541J38236j40275J11378
$$ -917039 -1004941 -865128 -928136 -1060571 -853266 -983358 -1009899 -871663 -1011938 -900560
907i00560o1922k2786p088O2047m564R3429o5534M820m3428q546n2375J00624
$$ -900560 -962482 -985268 -992356 -930309 -934873 -841444 -906978 -902158 -945586 -954132 -1006507 -905883
895i05883j72876J18314j60119J08557J58396r2056L8839r8155Q1983L1471k501
$$ -905883 -1078759 -960445 -1120564 -1012007 -853611 -945667 -906828 -1004983 -923000 -891529 -894030
884h94030o78M0462j06893K479K151N7039q9042J10196R7073K3866j84262K1162
$$ -894030 -894708 -854246 -961139 -958660 -956509 -899470 -988512 -878316 -781243 -757377 -941639 -920477
$$ [...]
##END NTUPLES=NMR SPECTRUM
##END=
