##TITLE=XTC-1731a_2
##JCAMPDX= 6.0         $$ Bruker NMR JCAMP-DX V2.0
##DATA TYPE= NMR SPECTRUM
##DATA CLASS= NTUPLES
##ORIGIN= BRUKER
##OWNER= patiny
$$ 1.79 TOPSPIN		Version 3.0
$$ 2012-05-20 20:48:26.367 +0200  patiny@icmbsg005
$$ Compression mode = diff/dup
##.OBSERVE FREQUENCY= 400.13188181139
##.OBSERVE NUCLEUS= ^1H
##.ACQUISITION MODE= SIMULTANEOUS (DQD)
##.ACQUISITION SCHEME= undefined
##.AVERAGES= 16
##.DIGITISER RES= 23
##SPECTROMETER/DATA SYSTEM= spect
##.PULSE SEQUENCE= zgpr
##.SOLVENT NAME= D2O
##.SHIFT REFERENCE= INTERNAL, D2O, 1, 11.69961
##AUDIT TRAIL= $$ (NUMBER, WHEN, WHO, WHERE, PROCESS, VERSION, WHAT)
$$ ##TITLE= Audit trail, TOPSPIN		Version 3.0
$$ ##JCAMPDX= 5.01
$$ ##ORIGIN= Bruker BioSpin GmbH
$$ ##OWNER= patiny
$$ $$ /opt/data/patiny/nmr/XTC-1731a_2/11/pdata/1/auditp.txt
$$ ##AUDIT TRAIL=  $$ (NUMBER, WHEN, WHO, WHERE, PROCESS, VERSION, WHAT)
(   1,<2012-05-20 20:48:24.952 +0200>,<patiny>,<icmbsg005>,<go>,<TOPSPIN 3.0>,
      <created by zg
	started at 2012-05-20 20:46:39.042 +0200,
	POWCHK enabled, PULCHK disabled,
       configuration hash MD5:
       77 C7 B7 C4 10 F4 BA 30 64 2E BB 52 82 F2 DA 41
       data hash MD5: 32K
       80 7A 07 A6 F9 62 9E 7D 96 D2 26 9C 86 C1 A6 66>)
(   2,<2012-05-20 20:48:25.346 +0200>,<patiny>,<icmbsg005>,<audit>,<TOPSPIN 3.0>,
      <user comment:
       ICON-NMR User ID: patiny
       data hash MD5: 32K
       80 7A 07 A6 F9 62 9E 7D 96 D2 26 9C 86 C1 A6 66>)
(   3,<2012-05-20 20:48:25.898 +0200>,<patiny>,<icmbsg005>,<proc1d>,<TOPSPIN 3.0>,
      <Start of raw data processing
       ef LB = 0 FT_mod = 6 PKNL = 1 SI = 16K 
       data hash MD5: 16K
       A1 89 95 A3 FA 69 27 91 02 17 B2 4B 90 34 4A ED>)
(   4,<2012-05-20 20:48:25.998 +0200>,<patiny>,<icmbsg005>,<proc1d>,<TOPSPIN 3.0>,
      <apk 
       data hash MD5: 16K
       61 08 76 B7 1D 7B 72 76 77 86 2E 7D C3 75 B4 F1>)
(   5,<2012-05-20 20:48:26.019 +0200>,<patiny>,<icmbsg005>,<proc1d>,<TOPSPIN 3.0>,
      <abs ABSG = 5 
       data hash MD5: 16K
       4F D9 2A E3 36 26 4D 92 A0 34 55 FF D4 95 CC 39>)
$$ ##END=
$$ 
$$ $$ hash MD5
$$ $$ 28 C3 FF A9 A5 9A 66 15 64 69 1B E4 00 AF A1 99
##$RELAX= 
##$RELAX= 
##$RELAX= 
##$RELAX= 
##$RELAX= 
##$RELAX= 
##$RELAX= 
##$RELAX= 
##$RELAX= 
##$RELAX= 
##$RELAX= 
##$RELAX= 
##$RELAX= 
$$ Bruker specific parameters
$$ --------------------------
##$DATPATH= </opt/data/patiny/nmr>
##$EXPNO= 11
##$NAME= <XTC-1731a_2>
##$PROCNO= 1
##$ACQT0= -9.16730304209974
##$AMP= (0..31)
100 100 100 100 100 100 100 100 100 100 100 100 100 100 100 100 100 100
100 100 100 100 100 100 100 100 100 100 100 100 100 100
##$ANAVPT= -1
##$AQSEQ= 0
##$AQ_mod= 3
##$AUNM= <au_zgglp>
##$AUTOPOS= <49 >
##$BF1= 400.13
##$BF2= 400.13
##$BF3= 400.13
##$BF4= 400.13
##$BF5= 400.13
##$BF6= 400.13
##$BF7= 400.13
##$BF8= 400.13
##$BYTORDA= 0
##$CAGPARS= (0..11)
0 0 0 0 0 0 0 0 0 0 0 0
##$CFDGTYP= 0
##$CFRGTYP= 9
##$CHEMSTR= <none>
##$CNST= (0..63)
1 1 1 1 1 1 1 1 1 1 1 1 1 1 1 1 1 1 1 1 1 1 1 1 1 1 1 1 1 1 1 1 1 1 1 1
$$ [...]
##$TE2= 0
##$TE3= 0
##$TE4= 0
##$TEG= 300
##$TE_PIDX= 1
##$TE_STAB= (0..8)
2 2 0 0 0 0 0 0 0
##$TL= (0..7)
120 120 120 120 120 120 120 120
##$TP= (0..7)
150 150 150 150 150 150 150 150
##$TPNAME0= <>
##$TPNAME1= <>
##$TPNAME2= <>
##$TPNAME3= <>
##$TPNAME4= <>
##$TPNAME5= <>
##$TPNAME6= <>
##$TPNAME7= <>
##$TPOAL= (0..7)
0.5 0.5 0.5 0.5 0.5 0.5 0.5 0.5
##$TPOFFS= (0..7)
0 0 0 0 0 0 0 0
##$TUNHIN= 0
##$TUNHOUT= 0
##$TUNXOUT= 0
##$USERA1= <>
##$USERA2= <>
##$USERA3= <>
##$USERA4= <>
##$USERA5= <>
##$V9= 5
##$VALIST= <>
##$VCLIST= <>
##$VD= 0
##$VDLIST= <>
##$VPLIST= <>
##$VTLIST= <>
##$WBST= 1024
##$WBSW= 4
##$XGAIN= (0..3)
0 0 0 0
##$XL= 0
##$YL= 0
##$YMAX_a= 5245168
##$YMIN_a= -4389238
##$ZGOPTNS= <>
##$ZL1= 120
##$ZL2= 120
##$ZL3= 120
##$ZL4= 120
##$ABSF1= 11.69961
##$ABSF2= -2.293603
##$ABSG= 5
##$ABSL= 3
##$ALPHA= 0
##$AQORDER= 0
##$ASSFAC= 0
##$ASSFACI= 0
##$ASSFACX= 0
##$ASSWID= 0
##$AUNMP= <save_auto_nonLDAP.pm>
##$AXLEFT= 0
##$AXNAME= <>
##$AXNUC= <1H>
##$AXRIGHT= 0
##$AXTYPE= 0
##$AXUNIT= <>
##$AZFE= 0.1
##$AZFW= 0.1
##$BCFW= 0
##$BC_mod= 0
##$BYTORDP= 0
##$COROFFS= 0
##$CY= 15
##$DATMOD= 1
##$DC= 0
##$DFILT= <>
##$DTYPP= 0
##$ERETIC= no
##$F1P= 0
##$F2P= 0
##$FCOR= 0.5
##$FTSIZE= 16384
##$FT_mod= 6
##$GAMMA= 0
##$GB= 0
##$INTBC= 1
##$INTSCL= 1
##$ISEN= 128
##$LB= 0
##$LEV0= 0
##$LPBIN= 0
##$MAXI= 10000
##$MC2= 0
##$MEAN= 0
##$ME_mod= 0
##$MI= 0
##$NCOEF= 0
##$NC_proc= -5
##$NLEV= 6
##$NOISF1= 0
##$NOISF2= 0
##$NSP= 0
##$NTH_PI= 0
##$NZP= 0
##$OFFSET= 11.69961
##$PC= 1
##$PHC0= 89.82856
##$PHC1= 3.556473
##$PH_mod= 1
##$PKNL= yes
##$PPARMOD= 0
##$PPDIAG= 0
##$PPIPTYP= 0
##$PPMPNUM= 2147483647
##$PPRESOL= 1
##$PSCAL= 0
##$PSIGN= 0
##$PYNMP= <proc.py>
##$REVERSE= no
##$SF= 400.13
##$SI= 16384
##$SIGF1= 0
##$SIGF2= 0
##$SINO= 0
##$SIOLD= 16384
##$SPECTYP= <>
##$SREGLST= <1H.CDCl3>
##$SSB= 0
##$STSI= 16384
##$STSR= 0
##$SW_p= 5599.10414333707
##$SYMM= 0
##$S_DEV= 0
##$TDeff= 32768
##$TDoff= 0
##$TI= <>
##$TILT= no
##$TM1= 0
##$TM2= 0
##$TOPLEV= 0
##$USERP1= <>
##$USERP2= <>
##$USERP3= <>
##$USERP4= <>
##$USERP5= <>
##$WDW= 1
##$XDIM= 16384
##$YMAX_p= 429662025
##$YMIN_p= -264694
##$CURPLOT= <Cups-PDF>
##$CURPRIN= <$Cups-PDF>
##$DFORMAT= <normdp>
##$LAYOUT= <+/1D_X+nopp.xwp>
##$LFORMAT= <normlp>
##$PFORMAT= <normpl>
$$ End of Bruker specific parameters
$$ ---------------------------------
##NTUPLES= NMR SPECTRUM
##VAR_NAME=  FREQUENCY,     SPECTRUM/REAL,   SPECTRUM/IMAG
##SYMBOL=    X,             R,               I
##VAR_TYPE=  INDEPENDENT,   DEPENDENT,       DEPENDENT
##VAR_FORM=  AFFN,          ASDF,            ASDF
##VAR_DIM=   16384,         16384,           16384
##UNITS=     HZ,            ARBITRARY UNITS, ARBITRARY UNITS
##FACTOR=    0.3417421962486, 1,             1
##FIRST=     5598.76240114082, -4688,        -87557
##LAST=      0,             26789,           -151968
##MIN=       0,             -264694,         0
##MAX=       5598.76240114082, 429662025,    0
$$ Real data points
##PAGE= N=1
##DATA TABLE= (X++(R..R)), XYDATA
$$ [...]
$$ plain form
11312 -42170 -21297 84969 109270 -29277 72842 89780 -1944 -47066 -39344 -39862 -65459 -64467 44642
11298 76259 126550 157314 190837 163738 369178 40566 25877 113379 184958 112451 -121245
11286 4379 29908 -8643 17341 -3930 -13527 35170 -9978 98183 127239 40029 29125 285396
11274 285396 67475 271812 234474 160084 236786 104574 109032 44697 144667 -16291 4428
11262 5807 39919 -63060 -48251 -67266 -224765 -163134 -7642 16998 81831 56349 45451 91302
11250 91302 64998 113837 8197 4397 102699 97621 -63394 29681 12766 91224 81377 38144
11237 128330 65385 105057 -40486 -54269 -141411 118866 28873 6721 -78407 -39409 83264
11225 40116 178049 -71181 124694 165838 49389 70687 97387 71037 -55432 42682 -23396
$$ packed form
11312d2170K0873H4969K4301b9277G2842J6938a944m5122P722n18k5597R92D4642
11298G6259N0291L0764L3523k7099K05440D0566j4689Q7502P1579p2507a21245
11286D379K5529h643A7341c930r597C5170i978I8183K9056D0029j0904K56271
11274B85396F7475K04337l7338p4390P6702A04574M458D4697R9970a6291D428
11262E807L4112f3060J4809j9015j57499O1631g642A6998O4833k5482j0898M5851
11250I1302k6304M8839H197l800R8302n078f3394B9681A2766P8458r847C8144
11237A28330o2945L9672d0486j3783q7142A18866B8873F721g8407L8998H3264
11225D0116J37933g1181A24694M1144D9389K1298K6700k6350e5432D2682b3396
$$ plain form
11213 897 49712 -20803 63452 152020 5072 126683 -39078 -27491 51436 87306 -47377 43640
11200 1910 37706 -11647 72432 31140 15547 -99049 21138 112504 33308 16264 46539 135977
11188 135977 142895 285191 138042 206113 330715 164235 238469 146616 169691 85249 100091
11177 100091 1150 27391 63119 1559 36918 61911 108857 -11849 190944 132206 119146 69921
11165 69921 111908 220953 129523 163793 95742 165341 70059 87540 130666 79192 -70883
11153 32592 121270 18483 -77425 -25130 -99736 59754 -14496 -13856 70724 14254 83934 30502
11140 -94973 -58201 20144 40876 105500 48909 -25154 87226 -22516 -16185 -36726 -75465 -26672
11127 -29334 -164955 1092 -73450 56129 15774 -194737 7453 -46027 -40521 -197327 -3734 -69782
$$ packed form
11213H97M8815b0803F3452Q8568E072J21611c9078J1587E1436L5870d7377D3640
11200A910L5796a1647G2432C1140A5547i9049B1138R1366C3308A6264L0275Q9438
11188A35977O918J42296A38042O8071J24602A64235P4234r1853K3075q4442J4842
11177A00091A150K6241L5728A559L5359K4993M6946a1849A90944n8738j3060m9225
11165F9921M1987J09045r1430L4270o8051O9599G0059J7481M3126n1474g0883
11153C2592Q8678A8483g7425b5130p4606E9754a4496O40G0724A4254O9680C0502
11140i4973L6772B0144K0732O4624D8909b5154H7226b2516O331k0541l8739b6672
11127b9334j35621A092g3450E6129A5774a94737G453d6027N506j56806c734o6048
$$ plain form
11115 -69782 25166 80533 -102411 46324 -86488 -45882 -3251 11994 26525 -64092 45763 15285
11102 3464 33919 -122567 108879 -64294 8871 77080 -13302 -37522 -32362 -15181 8739 -43446
11089 21991 -11139 -112494 -31198 27840 -76304 -4319 163083 28336 -27511 -124410 -10418
11077 75455 -57383 12461 -90806 47131 17880 114356 60354 -4365 -70206 -18999 -33602 103829
11064 -44820 -67173 18797 75165 76263 -153791 -14743 -77777 12099 -10448 10811 4842 -45007
11051 -48153 -40218 -1440 -59216 -190878 -107724 47731 -107788 -72237 98474 26734 -58464 -57431
11039 -57431 91683 -10492 -61438 -11214 -117139 -25716 -60344 12100 -24596 9131 38814 2299
11026 -92547 -44711 48201 -24371 -22164 125254 50225 18695 13771 -74909 -84269 45651 -3171
$$ packed form
11115f9782B5166N5367a02411D6324h6488M0606c251A1994J4531f4092D5763A5285
11102C464L0455a22567A08879f4294H871O8209a3302k4220N160a5181H739d3446
11089B1991a1139j01355c1198B7840g6304d319A63083B8336b7511r6899a0418
11077G5455e7383A2461i0806D7131A7880R6476n4002d365o5841a8999j4603A03829
11064d4820k2353A8797N6368J098a53791a4743o3034A2099a0448A0811D842d5007
11051d8153P935a440n7776j31662Q3154D7731a07788L5551I8474B6734e8464J033
11039e7431I1683a0492n0946a1214j05925b5716l4628A2100b4596I131K9683B299
11026i2547d4711D8201b4371K207A25254E0225A8695m924g4909r360D5651c171
$$ plain form
11013 -67297 11779 -74901 -110657 38247 22613 71143 -96025 -34029 -39580 -21909 30941 -128487
11000 -69209 10168 13637 -1315 -74877 -81026 -15963 -71593 -74317 69157 14557 51941 13457
10987 -91920 -44078 5132 -31540 18942 9261 -32883 -77588 -51454 -132504 18403 14608 -10907
10974 -72425 -14187 -94756 5399 -27333 -7935 -99085 -52768 54732 -45675 52574 -55461 36016
10961 -37433 -56825 -28157 -66939 -76363 -107661 6362 119070 32028 28708 -158389 -50290 102538
10948 126728 -56490 68868 -85601 -82715 -65800 11512 110617 -124391 -12584 -91924 43000
10936 -96424 124637 39723 -100529 48858 52664 -80685 48657 -21848 81383 -4548 -36297 -23507
10924 -23507 -30901 2299 90266 -11649 129182 42581 211334 298656 410428 241141 279112
$$ packed form
11013f7297A1779g4901l5756C8247j5634M8530i6025c4029n551J7671C0941a28487
11000f9209A0168L469a315p3562o149a5963n5630k724F9157A4557L7384A3457
10987i1920d4078E132c1540A8942I261c2883m4705K6134q1050A8403l795a0907
10974g2425a4187q0569E399b7333g935r1150M6317E4732d5675E2574e5461C6016
10961c7433j9392b8157l8782r424l1298F362J12708C2028l320a58389e0290A02538
10948A26728e6490F8868h5601K886J6915A1512R9105a24391a2584p9340D3000
10936i6424A24637C9723a00529D8858L806h0685D8657b1848H1383d548l1749J2790
10924b3507p394B299Q7967a1649A29182D2581J68753Q7322J11772j69287L7971
$$ plain form
10913 279112 96395 8610 74572 79785 -15441 45557 -32965 124813 -76405 154478 -66859
10901 -68407 9487 -75006 54103 126324 137933 112553 203572 324845 236768 374818 154486
10889 149650 -18399 134179 -82407 -27590 10890 -59871 -146717 -33521 -30650 -29338 26734 45344
10877 45344 34970 28987 76787 111562 -28597 -97444 11300 -122381 -123648 116822 14541 32002
10865 32002 -21842 -6888 -71951 -44310 32151 -9453 18734 62536 69166 69665 273527 245921
10853 245921 414515 447682 265836 322648 323960 371225 325954 327900 236180 5208 59474 59162
10841 59162 -17672 60561 -26039 -57179 -5561 -62751 -70255 -38582 77378 -56155 39916 -42478
10828 17752 101214 -119479 -110284 -166681 85264 -95874 -86706 -3235 53041 -96549 -15422 -27526
$$ packed form
10913B79112I6395H610O5962N213a5441D5557c2965A24813g6405A54478f6859
10901f8407I487g5006E4103P2221J1609k5380R1019J21273q8077J38050A54486
10889A49650a8399A34179h2407b7590A0890e9871q6846c3521K871J312B6734J8610
10877D5344j0374n983M7800L4775b8597o8847A1300a22381j267A16822A4541J7461
10865C2002b1842f888o5063K7641C2151i453A8734M3802O630M99K03862k7606
10853B45921J68594L3167j81846N6812J312M7265m5271J946r1720E208N4266l12
10841E9162a7672F0561b6039l1140e561n7190p504L1673G7378e6155C9916d2478
10828A7752Q3462a19479R195n6397H5264i5874R168c235E3041i6549a5422j2104
$$ plain form
10816 -27526 -40923 -20408 -15382 96236 -44244 95914 -86208 57081 66648 21389 78753 35323
10803 30348 39071 99152 7980 38302 24455 -28479 -68358 150805 16350 284001 201280 6805
10790 195334 141116 94285 125660 50902 -26830 -6322 2807 76803 -8778 71939 83945 20145
10777 -14303 -104999 146639 73399 173714 142769 179446 270097 235730 80908 316667 286531
10766 286531 164818 137286 170244 125958 70728 16297 803 46613 62936 39080 -94934 43962
10753 84942 36806 -76570 16288 -21073 55968 2728 4568 -44649 13972 -1192 -41147 -3196
10740 -51309 -54671 80839 144197 31846 -98411 145317 13422 111456 47435 35329 -16702 66008
10727 106501 95706 2567 48283 -48004 119205 131381 124636 219320 181231 119899 157291 120380
$$ packed form
10816b7526j3397b0408N026I6236d4244I5914h6208E7081R567B1389N7364C5323
10803C0348Q723O0081G980L0322j3847b8479l9879A50805A6350K67651q2721F805
10790A95334n4218m6831L1375E0902b6830f322B807P3996h778G1939J2006B0145
10777a4303r0696A46639p3240J00315l0945L6677R0651l4367H0908K35759l0136
10766B86531j21713k7532L2958m4286n5230A6297H03M5810J6323k3856i4934D3962
10753H4942C6806g6570A6288b1073E5968B728J840d4649A3972a192l9955c196
10740e1309l362H0839O3358C1846i8411A45317A3422R8034D7435j2106a6702F6008
10727A06501j0795B567M5716d8004A19205J2176o745R4684l8089o1332L7392l6911
$$ plain form
10715 120380 153907 190194 164699 186767 167127 163847 240978 177762 182139 255590 337760 170109
10703 170109 314705 438769 388063 507083 557450 490111 618837 698127 756790 1003432
10693 1003432 1065322 1334992 1385078 1768691 2043892 2457272 2607349 2922149 3308948 4104752
10683 4104752 5328924 7312485 10434846 15725428 24286594 34236726 41949303 37033824
10675 37033824 23519625 12587226 7770913 5676044 4584018 4047487 3781366 3575858
10667 3575858 3808778 4094987 4369320 4647050 4864912 5313175 6162230 7699535 10037112
10658 10037112 14126462 21200602 32336511 47320361 61650828 59780883 42246666
10651 42246666 22111585 12482952 8439673 6255294 4966570 3929962 3250116 2855335
$$ packed form
10715A20380L3527L6287k5495K2068j9640l280P7131o3216M377P3451Q2170j67651
10703A70109J44596J24064n0706J19020N0367o7339J28726P9290N8663K46642
10693A003432O1890K69670N0086L83613K75201M13380J50077L14800L86799P95804
10683D104752J224172J983561L122361N290582Q561166R950132P712577m915479
10675C7033824j3514199j0932399m816313k094869j092026n36531k66121k05508
10667C575858K32920K86209K74333K77730K17862M48263Q49055J537305K337577
10658A0037112M089350P074140J1135909J4983850J4330467j869945j7534217
10651D2246666k0135081r628633m043279k184379j288724j036608o79846l94781
$$ plain form
10643 2855335 2707407 2541589 2276070 1963278 1908397 1929681 1824093 1913731 1971669 2186381
10633 2186381 2277834 2481779 2818711 3156350 3614425 4286722 4942519 5526551 6660417
10624 6660417 7880467 9848127 12833226 17617340 24890424 35583224 47592697 56407306
10616 56407306 56310996 51599310 50761822 55971747 60418926 53455136 38746100 23451751
10608 23451751 14082150 9536013 7153877 5694477 4524204 3630090 3072743 2703024
10600 2703024 2272362 2020692 1603042 1413298 1361778 1378303 1146684 1221770 1070827 1118028
10590 1118028 985636 1073110 950317 983774 945409 1019940 1070879 983097 1003623 1145374 1257930
10579 1257930 1155100 1335897 1441032 1732705 1921366 2014140 2291216 2603107 2943394 3427699
$$ packed form
10643B855335j47928j65818k65519l12792n4881K1284j05588Q9638N7938K14712
10633B186381R1453K03945L36932L37639M58075O72297O55797N84032J133866
10624F660417J220050J967660K985099M784114P273084J0692800J2009473Q814609
10616E6407306r6310m711686q37488N209925M447179o963790j4709036j5294349
10608B3451751r369601m546137k382136j459400j170273q94114n57347l69719
10600B703024m30662k51670m17650j89744n1520J6525k31619P5086j50943M7201
10590A118028j32392Q7474j22793L3457l8365P4531N0939q7782K0526J41751J12556
10579A257930j02830J80797J05135K91673J88661R2774K77076L11891L40287M84305
$$ plain form
10569 3427699 3806340 4395719 5273064 6520579 8500162 11552271 16641957 23957088 33262006
10560 33262006 39512721 41964366 36413387 33156905 33119350 34712161 33886471 26416059
10552 26416059 18033416 11391082 7831598 6162286 5439719 4781185 4677264 4672448 4948066
10543 4948066 5523997 6549066 8262638 10991634 15477776 21351358 26630319 29555064
10535 29555064 27021971 24128554 23135093 24605762 24800145 20867213 14567095 8853105
10527 8853105 5552620 3930654 3027718 2302772 1998324 1638346 1498563 1191330 1230426
10518 1230426 951184 910417 910235 707567 583024 608370 625929 690022 453965 449190 329198
10507 329198 303893 366231 330405 316766 260392 143449 270315 249210 248533 317594 121105
$$ packed form
10569C427699L78641N89379Q77345J247515J979583L052109N089686P315131R304918
10560C3262006O250715K451645n550979l256482l7555J592811q25690p470412
10552B6416059q382643o642334l559484j669312p22567o58534j03921m816K75618
10543D948066N75931J025069J713572K728996M486142N873582N278961K924745
10535B9555064k533093k893417r93461J470669J94383l932932o300118n713990
10527H853105l300485j621966r02936p24946l04448l59978j39783l07233L9096
10518A230426k79242m0767j82k02668j24543K5346J7559O4093k36057m775j19992
10507C29198k5305O2338l5826j3639n6374j16943J26866k1105o77O9061A21105
$$ plain form
10495 267087 127672 70843 152444 110995 112834 156908 137379 177754 106647 38480 52115
10484 52115 51612 79984 194189 43834 114034 12635 -48022 74087 91461 116067 208122 62593
10471 103637 100922 52421 38362 105665 129171 51091 103605 23287 50703 138271 -22468 53415
10458 -77802 -48433 -24748 41717 -30789 1068 76281 33014 44512 -5770 4223 92066 51664
10446 51664 109245 62903 48106 51506 25823 15828 -779 85450 -14800 133115 79492 83713
10434 83713 123861 222697 316067 379417 244961 360258 160415 22909 -12681 90737 138508
10423 138508 73108 -35631 -70239 9958 33783 -508 -16143 -83674 -50611 55689 158498 60176
10410 94513 174438 128195 191378 392987 267083 234253 132077 76451 33479 -80295 -51557
$$ packed form
10495B67087A27672n6829Q1601m1449J839M4074j9529M0375p1107C8480J3635
10484E2115n03K8372J14205D3834P0200A2635d8022G4087J7374K4606R2055F2593
10471A03637k715m8501j4059O7303K3506E1091N2514B3287K7416Q7568b2468E3415
10458g7802K9369K3685D1717c0789A068P5213C3014J1498e770D223Q7843m0402
10446E1664N7581m6342j4797L400k5683r995g79H5450a4800A33115n3623M221
10434H3713M0148R8836R3370O3350j34456J15297A60415B2909a2681I0737M7771
10423A38508o5400c5631l4608I958K3825e08j5635o7531L3063E5689J02809F0176
10410I4513P9925m6243O3183K01609j25904l2830j02176n5626C3479h0295K8738
$$ plain form
10399 -51557 84706 -43994 -35762 8954 20531 25505 24749 57054 -112394 9210 49891 52342 -10087
10385 147679 71949 110576 8694 88460 122309 178822 228600 360843 339509 354338 262284
10374 262284 305407 320122 417366 348118 233427 36499 123614 -8592 -31577 -10400 67984
10362 -11432 75901 27592 -19010 -17677 32593 -62629 -68792 24741 -62090 4246 45709 -36441
10349 58793 -24008 -11118 37609 -41834 -4466 10706 119987 -67741 -74128 -85781 8093 -8394
10336 63466 -80402 -54983 97492 121850 169797 20224 67452 114946 74371 109460 18166 148700
10324 148700 122858 169056 190512 103782 177154 217179 169933 102683 14018 25668 -35337
10312 104385 -52048 8951 82441 15217 54294 99408 23028 37957 95035 83362 85567 167707
$$ packed form
10399e1557H4706d3994Q232H954J1577M974p56L2305a12394I210M0681K451a0087
10385A47679G1949L8627H694P9766L3849N6513M9778J32243k1334J4829r2054
10374B62284M3123J4715R7244o9248j14691C6499Q7115h592k2985a0400F7984
10362a1432G5901B7592a9010J333C2593f2629o163B4741f2090D246M1463c6441
10349E8793b4008a1118C7609d1834d466A0706J09281f7741o387j1653H093h394
10336F3466h0402K5419I7492K4358M7947B0224M7228M7494m0575L5089A8166J30534
10324A48700k5842M6198K1456q6730P3372M0025m7246o7250A4018J1650c5337
10312A04385e2048H951P3490A5217L9077M5114B3028J4929N7078j1673K205Q2140
$$ plain form
10300 167707 194418 153219 219240 104947 189646 201151 128624 202583 92452 -22349 -114951
10289 -114951 -55852 -119358 68403 -86611 -38050 -17313 -44223 -107932 -51777 15772 -90996
10277 -47222 31726 56026 -4974 44993 -58227 -60473 705 46088 -26436 2174 -39963 -65453 -43095
10264 -43095 -73781 6986 -60756 -111096 71023 3597 -101829 110353 -63260 -24929 10235 -40723
10251 23462 59300 -590 11318 28722 -138644 25405 -41142 -10163 14122 66363 -71290 -49645
10239 -49645 -50659 -23698 18981 -49669 61253 -13526 -12384 44633 -34895 1834 -60874 -35225
10227 -35225 16556 -53809 -14311 65905 25834 41577 33652 -155552 -80083 -6418 -73396 75146
10214 43867 -84405 -83342 -196578 -15224 -53505 -12339 -58215 57803 -67309 53686 52379 22584
$$ packed form
10300A67707K6711m1199O6021A04947Q4699J1505p2527P3959I2452b2349r2602
10289a14951e5852o3506F8403h6611c8050a7313k6910o3709e1777A5772i0996
10277d7222C1726K4300d974D4993e8227k246G05M5383b6436B174c9963k5490K2358
10264d3095l0686F986f0756n0340G1023C597a01829A10353f3260b4929A0235d0723
10251B3462L5838e90A1318J7404a38644B5405d1142a0163A4122N2241g1290K1645
10239d9645j014b3698A8981d9669F1253a3526J142D4633c4895A834f0874K5649
10227c5225A6556e3809a4311F5905B5834J5743p925a55552P5469f418o6978G5146
10214D3867h4405J063j13236a5224l8281a2339m5876E7803f7309E3686j307B2584
$$ plain form
10201 -104426 -7718 -60724 -125417 13455 -56893 -31909 -33559 -5353 -51495 71145 45539 39642
10189 39642 -23221 83203 51325 -89567 -33176 -2142 -23689 -110650 -61002 -17939 -92334 -80468
10177 -80468 -38941 -77833 -61654 -186358 -67517 5534 22142 -27482 63590 -206365 -101239
10165 108337 -67218 13137 20723 -11573 63113 45795 47418 -60705 -15388 -53024 -73678 -34673
10152 51967 -34835 143247 46604 -36870 -35040 -33364 -13104 -59948 -141326 -22999 -53724 119490
10139 16998 -25239 14709 -133142 -72 13943 97420 -17870 5514 65542 -42984 97415 571 -145501
10125 -8979 -44263 -107998 80067 -65470 -175887 22373 49800 92303 12202 -24544 1834 -69854
10112 40207 -608 31626 -58990 104812 2680 96923 -63817 -1290 58042 -7032 3449 -2913 -40243
$$ packed form
10201a04426g718n3006o4693A3455e6893K4984j650e353m6142G1145k5606n897
10189C9642b3221H3203l1878h9567c3176b142k1547q6961M9648a7939p4395J1866
10177h0468c8941l8892J6179j24704f7517E534J6608b7482F3590b06365a01239
10165A08337f7218A3137P586a1573F3113j7318J623f0705a5388l7636k0654c4673
10152E1967c4835A43247D6604c6870J830J676a3104m6844q1378b2999l0725A19490
10139A6998b5239A4709a33142g2A3943Q3477a7870E514O0028d2984I7415E71a45501
10125h979l5284o3735H0067f5470j10417B2373K7427M2503A2202b4544A834f9854
10112D0207f08C1626e8990A04812B680R4243f3817a290E8042g032C449b913l7330
$$ plain form
10099 -40243 -115589 -5783 -55896 -25326 5962 -20434 32520 7085 38402 25082 -53542 -139530
10087 -139530 -55902 -87906 -64492 -74128 -1970 19030 -62264 16915 -52290 7638 56874 -1847
10074 -17516 -32565 -1471 -81572 -12030 -20014 1534 -18981 -49112 119776 -25834 72054 -64334
10061 -9826 -191460 61105 -144213 -135406 -54079 -56446 -58170 -29558 -59272 16048 -3275 -92498
10049 -92498 -158665 40331 -80782 -32972 -15368 75226 1612 -34428 57675 -11283 -88985 -36005
10036 -149483 17322 9988 -41949 -31940 -118630 -102469 -11411 2633 -112330 -75603 -117221 -27077
10023 26978 67734 -94753 -29392 6425 -70943 -64547 -129099 -18188 14928 -37563 93697 9351
10010 114339 -19867 -33692 65335 11623 -1774 -74400 -49113 -38670 -77976 41506 60203 132012
$$ packed form
10099d0243p5346e783n0113b5326E962b0434C2520G085L1317j3320e3542q5988
10087a39530e5902l2004K3414r636a970A9030f2264A6915e2290G638M9236a847
10074a7516j5049a471q0101a2030p984A534a8981l0131A19776b5834G2054f4334
10061i826j81634F1105a44213Q807e4079k367j724K8612k9714A6048c275q9223
10049i2498o6167D0331h0782c2972a5368G5226A612c4428E7675a1283p7702c6005
10036a49483A7322p334d1949J0009q6690J6161a1411B633a12330L6727m1618b7077
10023B6978M0756i4753b9392F425g0943O396o4552a8188A4928c7563I3697I351
10010A14339a9867j3825F5335A1623a774p2626K5287J0443l9306D1506J8697P1809
$$ plain form
9998 132012 -63201 66551 -76235 -43360 -56497 136579 -80035 -6122 12107 -19008 -37124 -26048
9986 -26048 70066 -34304 -29784 -3579 -60994 -46334 -81868 -35200 -102214 -41662 56468 75351
9974 75351 -22482 40653 53673 -159801 18454 -88614 -120115 -4131 134270 -40362 -38183 -48472
9962 -48472 66729 -22781 -76829 -48218 -25578 78358 4193 61108 29200 -530 -47954 2675 44039
9949 44039 -21564 -33285 56087 41886 -15588 63690 -12488 16706 33707 -55100 -63230 -26512
9936 -52930 300 -78462 -9586 -52365 -200105 -80786 -30330 65573 -39435 -15663 12767 19906
9924 19906 -53147 4370 15040 -49782 -102491 26942 47263 -7887 -1114 1465 58706 -85236 16449
9910 -107697 -85593 -29104 -33321 -144260 -47440 -16514 47029 64308 -110506 -37683 -106297
$$ packed form
9998A32012f3201F6551g6235L2875j3137A36579h0035f122A2107a9008j8116J1076
9986b6048G0066c4304M520c579n7415J4660l5534c5200o7014d1662E6468J8883
9974G5351b2482D0653J3020a59801A8454h8614l1501d131A34270d0362K179j0289
9962d8472F6729b2781n4048K8611K2640G8358D193N6915B9200e30m7424B675M1364
9949D4039b1564j1721E6087j4201a5588F3690a2488A6706J7001e5100q130b6512
9936e2930C00g8462i586m2779j47740h0786c0330F5573c9435a5663A2767P139
9924A9906e3147D370J0670d9782n2709B6942K0321g887a114A465N7241h5236A6449
9910a07697K2104b9104m217j10939d7440a6514D7029J7279a10506c7683o8614
$$ plain form
9899 -106297 -43321 -35024 -82630 34173 -1816 -59740 -166642 82636 -18280 -107335 -60892 -137457
9887 -137457 16216 -1508 -15107 -13960 22979 -51691 25112 62402 65281 37186 -22251 -157378
9875 -157378 71854 -17628 20756 37427 28533 -49092 -143722 50558 -78276 -13242 152839 -15441
9862 93045 -64820 56201 -43780 82023 -68240 -109442 -7475 -15016 9543 117916 37296 46384
9850 46384 202715 221031 103029 204936 241143 438893 441682 744332 1034226 1288551 1372487
9839 1372487 894917 421004 376706 184134 60435 136971 -17748 7916 13591 -62717 36566
9827 18046 -87362 -10545 -58877 213863 38331 2117 -50000 -2831 75095 -123069 13916 -98108
9814 14757 -94042 -78110 -5472 -58515 -37306 -151495 56888 -8064 -29443 22109 4140 41822
$$ packed form
9899a06297d3321Q297m7606C4173a816n7924j06902H2636a8280q9055M6443p6565
9887a37457A6216a508j3599J147B2979e1691B5112L7290K879k8095b2251j35127
9875a57378G1854a7628B0756J6671q894d9092r4630E0558g8276a3242A52839a5441
9862I3045f4820E6201d3780H2023f8240m1202g475p541I543J08373C7296R088
9850D6384J56331J8316A03029J01907L6207J97750K789L02650K89894K54325Q3936
9839A372487m77570D21004m4298A84134F0435P6536a7748G916N675f2717C6566
9827A8046h7362a0545m8332B13863C8331B117e0000b831G5095a23069A3916i8108
9814A4757i4042J5932e472n3043K1209j14189E6888h064k1379B2109D140L7682
$$ plain form
9802 41822 -53316 59457 32812 27841 -3003 33109 87675 50726 -139507 -105780 -93837 -90729
9790 -90729 -29993 -44556 31439 -136722 15269 10557 -140465 -96447 -3109 93998 -28535 -9821
9777 63007 2007 -88216 64421 -90385 -19073 -60251 -48991 -41640 104077 -72545 -55045 51557
9764 -35869 -122702 871 -48850 -4881 -80326 -43906 -52756 -40826 124115 17579 -20804 12807
9751 -63009 9516 -2501 -85194 -60542 141316 2120 22534 114908 -73329 -52724 -85684 -2782
9738 -129060 8706 -49063 -46276 -18240 21940 27586 -23717 -102867 -11584 -3936 48782 -931 -80993
9725 -80993 46127 -2736 -24092 -83113 -92427 -27030 10179 -174943 15386 71562 75205 2382
9712 -65535 -108167 -24342 173855 2868 -45203 45823 18617 -12369 -135383 55379 57368 -43746
$$ packed form
9802D1822e3316E9457k6645m971c003C3109N4566l6949a39507L3727J1943L108
9790i0729b9993j4563C1439a36722A5269m712a40465M4018c109I3998b8535i821
9777F3007B007h8216F4421i0385a9073m1178J1260P351A04077g2545J7500E1557
9764c5869q6833H71d8850d881p5445L6420q850J1930A24115A7579b0804A2807
9751f3009I516b501q2693K4652A41316B120K0414R2374g3329K0605l2960b782
9738a29060H706d9063K787a8240B1940N646b3717p9150a1584c936D8782i31q0062
9725h0993D6127b736k1356n9021r314b7030A0179a74943A5386N6176L643B382
9712f5535m2632b4342A73855B868d5203D5823A8617a2369j23014E5379J989d3746
$$ plain form
9699 76000 40254 -90373 32571 -37320 26339 103610 -29625 -42605 91272 -59672 75146 -41103
9686 -15070 -83265 -56858 72212 51857 -21705 -6309 27320 -82297 -60144 -154969 31001 -52316
9673 94321 -16637 78549 202464 60715 17770 36049 94890 12911 41581 96449 172072 30497
9660 93047 107560 117404 21774 109386 49843 70742 86809 114743 55803 32561 179501 205330
9648 205330 122617 69156 150681 159603 246279 101734 225593 281869 218233 105926 177810
9637 177810 174228 237641 319248 310528 423787 368736 311038 270155 447766 458032 549434 596457
9625 596457 566020 861051 749025 758673 603784 782774 795045 905140 1020012 955324 1072437
9614 1072437 1279409 1475775 1642826 2040197 2035861 2355553 2679765 3035348 3482153 3794653
$$ packed form
9699G6000l5746i0373C2571c7320B6339P7271b9625j2980I1272e9672G5146d1103
9686a5070o8195K6407G2212k0355b1705f309B7320h2297K2153r4825C1001e2316
9673I4321a6637G8549J23915F0715A7770J8279N8841A2911K8670N4868P5623C0497
9660I3047J4513R844B1774Q7612D9843K0899J6067K7934E5803k3242J46940K5829
9648B05330q2713n3461Q1525Q922Q6676A01734J23859N6276o3636A05926P1884
9637A77810l582O3413Q1607q720J13259n5051n7698m0883J77611J0266R1402M7023
9625E96457l0437K95031j12026R648j54889J78990J2271J10095J14872o4688J17113
9614A072437K06972J96366J67051L97371m336L19692L24212L55583M46805L12500
$$ plain form
9604 3794653 4435767 5197602 6015218 7022703 8107070 9464945 11059816 13110950 15996337
9595 15996337 19864214 25252854 33547356 47424937 69001720 103339543 155102959 220644489
9587 220644489 272717098 219461780 111893586 63139189 42869316 28508184 20252983
9580 20252983 15029806 11303310 8475918 6862109 5691776 4769988 4335328 3840091 3499366
9571 3499366 3018992 2614394 2550873 2327855 2257644 2089337 2010413 1772719 1725356 1510778
9561 1510778 1486213 1448056 1380104 1228832 1134667 979903 945361 983073 781983 863830 781289
9550 781289 757197 547255 574938 530260 499513 516355 508564 384031 476820 464710 314027
9539 314027 436103 354411 382015 347979 286732 310497 292111 326209 254646 265056 194028
$$ packed form
9604C794653O41114P61835Q17616J007485J084367J357875J594871K051134K885387
9595A5996337L867877N388640Q294502J3877581K1576783L4337823N1763416O5541530
9587B20644489N2072609n3255318j07568194m8754397k0269873j4361132q255201
9580B0252983n223177l726496k827392j613809j170333r21788m34660m95237l40725
9571C499366m80374m04598o3521k23018p0211j68307p8924k37694m7363k14578
9561A510778k4565l8157o7952j51272r4165j54764l4542L7712k01090Q1847q2541
9550G81289k4092k09942K7683m4678l0747J6842p791j24533R2789j2110j50683
9539C14027J22076q1692K7604l4036o1247K3765j8386L4098p1563J0410p1028
$$ plain form
9528 194028 236718 205149 172297 179490 76994 84984 98919 60053 154877 261842 197609 244728
9516 244728 165227 120777 175735 193252 154148 90487 238570 83261 95733 96941 22099 100531
9504 100531 107955 42550 68569 20268 3609 31951 121955 103007 80478 50214 -34529 4100
9491 96429 36647 127163 -54317 133717 -70107 1895 142230 -62683 11574 -72885 -20150 -17546
9479 -17546 -18552 84560 57598 45297 136607 34383 -32941 78715 34968 -136580 102312 54473
9467 54473 -28347 105498 37330 -64047 65469 131788 44011 76499 35336 -9050 41852 92947
9455 92947 72198 -67364 -10691 169280 54206 -112761 17669 -50346 -84675 -27992 11979
9443 64817 11363 -81234 29454 -107013 -121920 97513 -37657 -57287 10716 -57374 6889 -54914
$$ packed form
9528A94028M2690l1569l2852P193G6994P990J3935l8866R4824J06965o4233M7119
9516B44728p9501m4450N4958J7517l9104o3661J48083H3261J2472J208B2099P8432
9504A00531P424D2550K6019B0268C609K8342R0004j8948k2529l0264c4529D100
9491I6429C6647R0516e4317A33717g0107A895J40335f2683A1574g2885b0150K604
9479a7546j006H4560k6962j2301R1310C4383c2941G8715C4968a36580A02312m7839
9467E4473b8347A05498C7330f4047F5469O6319D4011L2488C5336i050D1852N1095
9455I2947k0749f7364a0691A69280E4206a12761A7669e0346l4329b7992A1979
9443F4817A1363h1234B9454a07013j4907I7513c7657j9630A0716e7374F889e4914
$$ plain form
9430 -82023 20597 25662 1479 26573 25339 88928 23298 -20882 -58932 70160 5076 75617 75124
9417 75124 -34353 -11976 60387 -88653 -23747 -51815 -41310 63039 -896 -34287 23181 -17351
9404 -1295 29944 11392 -27688 -65944 15867 -97713 -3804 -97034 -20808 22851 -2574 109919
9391 -34177 -2888 52177 -53542 37431 52986 -54583 28488 -74790 -6064 -58281 110240 66120
9379 66120 4061 -78798 -67428 -68178 -26111 17978 3076 -16258 47627 -36294 -15055 -200119
9367 -200119 -186200 -80856 84425 -31469 -12879 -104768 -10144 42466 100429 31549 46938 -10082
9354 -94214 77923 -39041 -601 -45285 -24435 -57216 -71755 -133769 -8537 -31911 -96640 -74230
9342 -74230 -64382 -108526 124456 25169 6880 42302 999 156895 172053 71746 242244 398933
$$ packed form
9430h2023B0597N065A479K5094j234O3589B3298b0882l8050G0160E076P0541m93
9417G5124c4353a1976F0387h8653b3747k8068J0505F3039h96l3391B3181a7351
9404a295B9944A1392b7688l8256A5867i7713c804r3230b0808B2851b574A09919
9391c4177b888E2177e3542C7431J5555e4583B8488g4790f064n2217A10240m4120
9379F6120D061g8798J1370p50b6111A7978C076a6258D7627c6294a5055j85064
9367b00119J3919h0856H4425c1469a2879r1889a0144D2466N7963C1549J5389a0082
9354i4214G7923c9041f01m4684K0850l2781j4539o2014h537k3374o4729K2410
9342g4230R848m4144A24456B5169F880L5422I99J55896J5158G1746J70498J56689
$$ plain form
9330 398933 684950 793314 1105523 1362277 1143166 715892 365120 253941 135496 167512
9320 167512 133843 71956 128018 -86805 -18465 45717 -55965 72183 49981 76436 89571 16164
9307 -65397 -148950 49003 48246 -1668 -12773 -32666 57178 32556 62927 -65508 -134944 78572
9294 -49152 -80484 -50060 -53690 -21599 26194 29685 33908 -47337 -69610 -71873 -4193 -128252 -85801
9281 -85801 88629 65754 18605 118067 -4292 -81246 101070 -9498 -19337 -52442 29020 -44308
9268 -18062 -359 34852 -26102 63686 -12583 -61758 93971 -175946 -100991 -48451 -24397 7286
9255 -129423 112568 -51455 50631 -129290 -109080 -74250 -165469 89461 -34651 -88908 144617
9243 46344 5730 73528 -18771 -120693 -29459 -101673 -41681 -111130 6831 70828 8150 -6274
$$ packed form
9330C98933K86017J08364L12209K56754k19111m27274l50772j11179j18445L2016
9320A67512l3669o1887N6062h6805a8465D5717e5965G2183k2202K6455J3135A6164
9307f5397q3553D9003p57a668j1105j9893E7178k4622L0371f5508o9436G8572
9294d9152l1332L0424l630b1599B6194L491M223d7337k2273k263d193j24059M2451
9281h5801H8629k2875A8605R9462d292p6954A01070i498r839l3105B9020d4308
9268a8062c59C4852b6102F3686a2583m9175I3971a75946P4955d8451K4054G286
9255a29423A12568e1455E0631a29290K0210L4830r1219H9461c4651n4257A44617
9243D6344E730O7798a8771j01922b9459p2214d1681o9449F831O3997H150f274
$$ plain form
9230 77035 -88586 -7236 -124110 40493 -55427 88230 -107496 837 -132528 -15188 15385 -72774
9217 -46200 20355 -34258 31146 62976 -4970 -6144 -51590 -157831 -15669 -34410 27293 21744
9205 21744 -22236 -24791 -1666 -108987 92525 -54687 29375 -136274 -32980 8866 -93921 -27052
9192 -44589 -113288 22487 -33715 11199 21676 -6947 -130684 -104111 -4451 -34667 -52049 -53966
9180 -53966 -20884 -18374 18600 -42463 -43534 -44711 1632 41917 -10378 -13289 119534 21281 -65357
9166 -44936 -63968 36984 19509 -22276 -55307 -16200 -24459 59767 -18622 5904 107364 -59558
9153 -71609 -12826 33958 15192 57922 -9988 18924 -55051 -43617 43770 80426 -31271 18189
9140 13810 110903 -56874 -67701 -66329 -42125 -27014 78848 -35547 43625 -30217 95370 -4898
$$ packed form
9230G7035h8586g236j16874D0493e5427H8230a07496H37a32528a5188A5385g2774
9217d6200B0355c4258C1146L1830d970j174m5446j06241a5669j8741B7293n549
9205B1744b2236k555a666j07321I2525e4687B9375a36274c2980H866i3921b7052
9192d4589o8699B2487c3715A1199J0477f947j23737K6573d451l0216j7382j917
9180e3966b0884K510A8600d2463j071j177A632M0285a0378k911A19534B1281f5357
9166d4936j9032C6984j7475b2276l3031a6200q259E9767a8622E904J01460e9558
9153g1609a2826C3958A5192M2730i988A8924e5051J1434D3770L6656c1271A8189
9140A3810R7093e6874j0827J372K4204J5111G8848c5547D3625c0217I5370d898
$$ plain form
9127 583 13139 1511 -128019 -52728 -64626 56559 -53028 -79004 -88323 17873 -14873 45257
9114 -22157 -25870 -50067 40209 86514 -54087 -120071 -108866 21143 -153012 -65570 52075 72942
9102 72942 -55418 -32733 -62740 -115766 -42 -54339 -8049 -55694 -57071 22212 -45017 63125 -98447
9088 -28420 45016 -73414 -31403 -171268 -71527 9161 31515 27895 124816 25568 -29928 150297
9075 82946 103812 -94184 -102286 -60355 -74462 88369 -109850 -53830 -60836 59185 70967 -63261
9062 42315 -27054 24106 -82877 -70586 10937 -63284 51995 67753 -47497 -72131 25161 -8410
9049 -17955 6961 35039 -123151 -17911 966 -35907 113950 -5780 -201811 -28299 -1739 440 -30979
9035 -4362 -148077 -56913 -55520 -55918 45372 -83831 -79457 -16850 -103330 -67418 -61356 -80435 -135161
$$ packed form
9127E83J2556A511a28019e2728j1898E6559e3028k5976r319A7873a4873D5257
9114b2157l713k4197D0209M6305e4087o5984J1205B1143a53012f5570E2075K0867
9102G2942e5418K2685l0007n3026d2n4297h049m7645j377B2212d5017F3125i8447
9088b8420D5016g3414c1403j39865g1527I161K2354l620R6921B5568b9928A50297
9075H2946K0866i4184q102M1931j4107H8369a09850e3830p006E9185J1782f3261
9062D2315b7054B4106h2877J2291A0937f3284E1995J5758d7497k4634B5161h410
9049a7955F961K8078a23151a7911I66c5907A13950e780j96031b8299a739D40c0979
9035d362j43715e6913J393l98D5372h3831M374a6850q6480L5912O062j9079n4726
$$ plain form
9022 -135161 -40045 86481 -79870 1570 -214382 -114518 -123327 -21110 -18684 71260 -59539 -65817
9010 -65817 -107849 5970 -11587 20661 -23300 -55551 121297 3047 -92548 -25456 -33125 -91549
8998 -91549 19946 13308 -48361 30458 -62939 -54842 -51468 2948 7731 -69696 22280 26109 28446
8985 28446 -100267 32024 52842 13724 -3993 -5331 23754 20095 66800 -126872 -112830 4318
8972 37527 -106672 -5976 -44337 11032 -100138 44568 -83508 -18546 -1978 85672 -89144 60609
8959 -10620 -34269 6715 54632 124139 -36992 82622 13854 113080 -34712 120775 26507 135283
8947 135283 185510 141733 214671 154292 156238 120983 175453 3570 180948 207753 220559 236515
8935 236515 277141 369540 309769 420536 572309 546907 689468 736076 933955 967886 935688
$$ packed form
9022a35161d0045H6481g9870A570b14382R9864q809b1110K426G1260e9539o278
9010f5817m2032E970a1587B0661b3300l2251A21297C047i2548b5456p669n8424
8998i1549A9946o638d8361C0458f2939Q097L374B948M783f9696B2280L829K337
8985B8446a00267C2024K0818A3724c993j338B3754l659M6705a26872J4042D318
8972C7527a06672e976l8361A1032a00138D4568h3508a8546a978H5672h9144F0609
8959a0620k3649F715M7917O9507c6992H2622A3854R9226c4712A20775B6507J08776
8947A35283N0227m3777P2938o0379J946l5255N4470C570J77378K6805J2806J5956
8935B36515M0626R2399n9771J10767J51773k5402J42561M6608J97879L3931l2198
$$ plain form
8924 935688 1111691 1200778 1382048 1471380 1713055 1719200 1987216 2022207 2038877 1916443 1886925
8913 1886925 2059801 1878919 1947883 1907869 2095715 2150687 2193658 2073414 1986762 1804027
8903 1804027 1746424 1459609 1371144 1353367 1174816 1159191 1049076 957262 957667 764682 596908
8892 596908 606608 608733 331582 420413 400704 255140 283433 315822 216218 158339 292543
8881 292543 323933 191290 136208 111659 181285 272871 201900 77845 97033 218038 106709
8869 264071 151107 154814 50160 125659 89913 168996 183415 83811 163499 -10677 69809 64649
8857 64649 2266 -30586 48048 108295 82569 192442 -12114 25762 155806 130880 121732 68315
8845 68315 219695 166663 168095 63214 126221 100019 66824 82178 48213 23487 -6197 173068
$$ packed form
8924I35688J76003Q9087J81270Q9332K41675O145K68016L4991J6670j22434k9518
8913A886925J72876j80882O8964m0014J87846N4972M2971j20244q6652j82735
8903A804027n7603k86815q8465j7777j78551j5625j10115r1814M05j92985j67774
8892E96908R700K125k77151Q8831j9709j45564K8293L2389r9604n7879J34204
8881B92543L1390j32643n5082k4549O9626R1586p0971G7845J9188J21005A06709
8869B64071j12964L707E0160P5499l5746P9083J4419H3811P9688a0677F9809n160
8857F4649B266c0586D8048O0247k5726J09873a2114B5762J30044k4926r148n3417
8845F8315J51380n3032J432F3214O3007k6202l3195J5354l3965B3487f197A73068
$$ plain form
8832 -235 78291 42262 73556 94433 101712 74802 31931 133424 61309 17437 -55022 203285
8819 109984 -56732 31631 30987 72756 -104689 71366 62787 91362 -91099 164212 24123 46717
8807 46717 -26154 105946 562 -7149 -43316 33093 -53685 -134347 20749 -86530 11701 -45150
8794 76941 -69099 -83652 -37904 -33554 -71825 70398 5986 -71655 12272 -56396 -50737 -148713
8782 -148713 4332 -102987 34416 -58329 8187 90335 -36156 -45939 -128331 25905 81614 -85498
8769 -12459 73900 35034 21574 -111965 620 -82746 12810 94851 -6585 47033 173227 -63983
8756 -109692 -8724 -74864 -22358 -47502 -147748 -58854 -8909 25360 12020 -28375 22688 37950
8744 37950 -22843 29186 92330 97421 86263 63073 21970 89389 -26063 -2418 118428 136539
$$ packed form
8832b35G8291l6029L1294K0877P279k6910C1931J01493F1309A7437e5022B03285
8819A09984e6732C1631o44M1769a04689G1366q579K8575i1099A64212B4123K2594
8807D6717b6154A05946E62g149l6167C3093e3685q0662B0749h6530A1701d5150
8794G6941f9099j4553c7904M350l8271G0398E986g1655A2272e6396N659r7976
8782a48713D332a02987C4416e8329H187Q2148c6156r783q2392B5905N5709h5498
8769a2459G3900C5034j3460a11965F20h2746A2810Q2041f585D7033J26194f3983
8756a09692h724o6140b2358k5144j00246e8854h909B5360A2020b8375B2688J5262
8744C7950b2843B9186O3144N091j1158k3190B1970O7419b6063b418A18428J8111
$$ plain form
8732 136539 68597 90257 73111 130914 87447 175877 348900 177754 425090 386056 572194
8721 572194 852382 1189923 1408396 2107355 2668555 3331535 3357310 2769389 1915274 1409651
8711 1409651 1165285 977513 1317082 1559689 2107881 2695789 3199187 3118559 2644865 1919052
8701 1919052 1173988 651329 484193 361939 261030 215379 188431 69811 -95 2969 154696
8690 154696 -16488 131513 46677 21726 68402 -24469 -36107 4281 96551 108082 108350 23692
8677 -46481 38716 -61235 49027 -41312 15265 -44980 -92660 18644 55835 -94928 28957 -20304
8664 11553 4998 -31964 17015 11762 -19766 -39643 30095 31989 -102818 -133622 -83799 71031
8651 -27712 -126341 68567 -137069 -110816 -76435 -93833 132594 -47061 -107422 -53001 -96361
$$ packed form
8732A36539o7942K1660j7146N7803m3467Q8430J73023j71146K47336l9034J86138
8721E72194K80188L37541K18473O98959N61200O62980K5775n87921q54115n05623
8711A409651k44366j87772L39569K42607N48192N87908N03398q0628m73694p25813
8701A919052p45064n22659j67136j22254j00909m5651k6948F9811i5B969J51727
8690A54696a6488A31513D6677B1726M6676b4469j1638D281R2270J1531K68B3692
8677d6481C8716f1235D9027d1312A5265d4980m7680A8644L7191i4928B8957b0304
8664A1553D998c1964A7015n253a9766j9877C0095J894a02818l0804M9823G1031
8651b7712r8629F8567a37069K6253L4381j7398A32594d7061o0361e3001m3360
$$ plain form
8640 -96361 -44484 44016 -35874 -84677 81146 91753 58266 93035 -25813 92915 -86521 -122548
8628 -122548 -46081 53049 -32476 -73480 -114907 25900 -25988 24052 44575 -3729 -35808 -81299
8616 -81299 -56349 -111453 -25898 -11237 -63366 -117046 -115746 25357 -14700 21937 -22931 42693
8603 -35283 -60253 -10662 -75154 16587 62145 -30153 -59914 12633 -174073 55459 -59069 31662
8590 -81565 -90313 -74517 -13434 -3285 -84470 -55295 14116 -9097 -54474 -47346 -79680 8460 -12499
8576 -136902 29126 -42122 -78318 -132957 -113543 -83751 -116998 -128566 -177126 29467 -95948 -160279
8564 -160279 -120234 -5480 -201025 -148881 12276 -83489 -49697 -33263 39728 -69715 43636 -52105
8551 -22707 -95449 33870 -14524 -65130 102071 -88247 -71714 38630 -61282 -44448 76485 76864
$$ packed form
8640i6361d4484D4016c5874m8803H1146J0607l3487L4769b5813I2915h6521l6027
8628a22548d6081E3049c2476m1004m1427B5900b5988B4052K0523c729l2079m5491
8616h1299K4950n5104b5898a1237n2129n3680J300B5357a4700B1937b2931D2693
8603c5283k4970a0662o4492A6587M5558c0153k9761A2633a74073E5459e9069C1662
8590h1565q748J5796a3434c285q1185K9175A4116i097m5377P128l2334H460a2499
8576a36902B9126d2122l6196n4639J9414K9792l3247j1568m8560B9467i5948o4331
8564a60279M0045e480j95545N2144A2276h3489L3792J6434C9728f9715D3636e2105
8551b2707p2742C3870a4524n0606A02071h8247J6533C8630f1282J6834G6485L79
$$ plain form
8539 76864 -100938 -62318 -73928 -97855 -76857 -17963 -33820 -23604 -13976 -58429 49226 -107698
8526 4030 -78793 -177277 -156141 -19706 136631 -18300 15724 -104572 59726 32064 -166022
8514 -55573 -93389 -68716 -50452 50355 -19604 41718 -23869 -80985 5784 -49432 -20235 22934
8501 -78369 -122070 -61020 7525 -76901 -61373 10732 -105501 17553 -46582 -91781 -106610 25201
8488 -98868 61864 33051 42478 -22102 21272 -1266 -33895 14562 91558 -36168 -132044 81066
8475 42550 -121458 11458 18543 -74787 -99684 24000 60886 -104599 -75877 11230 45708 -52839
8462 36663 -12204 -38788 -32892 -58455 46526 -603 -47992 -20284 55409 -8445 114843 -1927 -77243
8449 -77243 65647 -60659 -113542 -131965 33458 -169559 -76191 -50872 -26586 -31706 5062 -192911
$$ packed form
8539G6864a00938L8620j1610k3927K0998a7963j5857J0216R628m4453D9226a07698
8526D030g8793r8484K1136a9706A36631a8300A5724a04572E9726k7662a66022
8514e5573l7816K4673J8264E0355a9604D1718b3869n7116E784d9432b0235B2934
8501g8369m3701f1020G525g6901J5528A0732a05501A7553d6582m5199j4829B5201
8488i8868F1864k8813R427b2102B1272a266l2629A4562P6996c6168r5876H1066
8475D2550a21458A1458P085g4787k4897B4000L6886a04599K8722A1230L4478e2839
8462C6663a2204k6584N896k5563D6526f03m7389b0284E5409h445A14843a927p5316
8449g7243F5647f0659n2883j8423C3458a69559g6191K5319K4286n120E062a92911
$$ plain form
8436 -18785 -16551 -21575 -120210 -43989 5076 25727 31253 -128795 591 -74474 -68042 -51823 84139
8422 9017 -20258 16593 41761 -34483 -22629 117979 -75361 100530 10810 78634 -41923 -116280
8410 -116280 157652 27170 10525 25784 -115108 82706 68278 -66446 -40663 57248 -133614
8398 10331 -44749 -86263 -15100 -161 -66721 -110250 -14595 -130906 -151172 54870 -198753 5457
8385 -173842 -95723 -73809 -50511 -60837 -90984 -94489 -57100 -33844 -39743 39617 -34297 7027
8372 20176 -242662 -33804 -9643 -35174 73395 -18433 -80473 87145 119612 -76467 -21613 -168643
8360 -168643 -25826 -16322 -24847 27152 68070 -82181 -35557 25435 51725 -36845 -51128 46947
8347 -93333 -36447 -85344 38686 -36893 -85869 -53136 -167088 -82368 -132252 59233 -787 -60151
$$ packed form
8436a8785K234n024r8635d3989E076K0651N526a28795E91g4474O432J6219H4139
8422I017b0258A6593K5168c4483J1854A17979g5361A00530A0810O7824d1923p4357
8410a16280A57652B7170A0525J5259a15108H2706j4428f6446K5783E7248a33614
8398A0331d4749m1514a5100a61o6560m3529a4595j16311k0266E4870a98753E457
8385a73842P8119K1914K3298j0326l0147l505L7389K3256n899C9617c4297G027
8372B0176b42662c3804i643k5531G3395a8433o2040H7145L2467g6467b1613j47030
8360a68643b5826R504q525B7152M0918h2181c5557B5435K6290c6845j4283D6947
8347i3333c6447m8897C8686c6893m8976L2733j13952h2368m9884E9233g87n9364
$$ plain form
8335 -60151 -57089 -152409 -69842 -63283 -76338 -21513 -31561 20879 -45243 -33672 -28366 -37250 96717
8321 -95436 -43561 -62246 -118979 -83005 -122269 115966 -61527 -35088 26648 52444 15178 -11806
8308 -105839 17950 69883 -68387 -132489 22498 -28134 -92080 18847 -104992 82104 -57504
8296 9395 -28588 -52884 103463 3956 18716 -66820 -41689 19079 8467 -8414 -15817 38317 84261
8283 84261 12900 -19212 -2526 82402 -51252 4250 36853 10191 23277 28823 131832 47817
8270 60300 46396 139003 133522 -10093 117353 86589 259924 98756 43685 21630 135981
8259 135981 -38778 38968 62536 151145 -1180 68702 161682 185248 219500 187475 183488 172846
8247 172846 237353 171721 254142 199814 166694 243439 277098 275781 167401 103455 83012 245680
$$ packed form
8335f0151L062r5320f9842O559j3055b1513j0048B0879d5243J1571N306q884I6717
8321i5436d3561j8685n6733L5974l9264A15966f1527K6439B6648K5796A5178a1806
8308a05839A7950N1933f8387o4102B2498b8134o3946A8847a04992H2104e7504
8296I395b8588k4296A03463C956J4760f6820K5131A9079H467h414p403C8317M5944
8283H4261A2900a9212b526H2402e1252D250L2603A0191J3086N546J03009D7817
8270F0300j3904R2607n481a0093A17353l0764J73335I8756D3685B1630J14351
8259A35981c8778C8968K3568Q8609a180F8702R2980K3566L4252l2025l987j0642
8247A72846O4507o5632Q2421n4328l3120P6745L3659j317j08380o3946k0443J62668
$$ plain form
8235 245680 193381 356488 165619 -13294 208733 66609 109391 182902 188681 140294 135440
8224 135440 -6094 108630 91157 -42619 -7276 -30030 -32710 155038 81628 41508 71101 83224
8212 83224 49274 -37468 -9478 -2026 6811 -48684 -88504 99705 25918 67498 33751 -45304
8199 -77324 -126045 -69961 -45413 44403 18453 15410 250940 434485 461926 497127 86477 42134
8186 3802 -72738 -49517 44670 39635 50711 3388 -79835 -32049 35380 44331 37885 30330 41266
8173 41266 7340 100825 5243 40027 113436 8428 31492 215960 68102 135295 137996 114147
8161 114147 142559 56550 -13309 100596 95955 107628 49244 141280 82213 165658 115847 197971
8149 197971 61072 170215 84341 194411 267841 145842 91903 109704 132869 276479 171725
$$ packed form
8235B45680n2299J63107A65619a3294B08733F6609M2782P3511N779m8387m854
8224A35440f094A08630j7473d2619g276k2754k680A55038p3410m0120K9593J2123
8212H3224l3950c7468i478b026F811d8684l9820I9705B5918M1580l3747d5304
8199g7324m8721N6084K4548D4403A8453l043K35530J83545K7441L5201H6477D2134
8186C802g2738K3221D4670n035J1076C388g9835c2049C5380Q951o446p555J0936
8173D1266G340R3485E243L4784P3409H428K3064J84468F8102O7193K701k3849
8161A14147K8412E6550a3309A00596m641J1673D9244R2036n9067Q3445m9811Q2124
8149A97971F1072J09143H4341J10070P3430j21999n3939J7801K3165J43610j04754
$$ plain form
8138 171725 236914 161348 168040 94970 148768 314742 137876 274955 86680 210942 286907
8127 286907 183139 157950 171708 196363 184044 235927 375357 204349 164531 100197 121111
8116 121111 96105 92990 164609 22695 64175 5750 115647 -25447 194487 153858 75348 136185
8104 136185 -19 101846 150562 153150 144926 91917 186182 -21029 -31146 125530 -24158 13419
8091 173887 14407 166019 -17130 56668 -23417 88440 90415 145264 18623 40910 94827 55375
8079 55375 92103 136868 261734 104722 121711 282946 292642 465467 707028 1123306 1741032
8068 1741032 2592407 2860325 2195587 1274003 625987 546960 214884 438204 184124 163903
8058 163903 331960 250789 197292 223282 250511 314313 493276 452896 575681 721425 913950
$$ packed form
8138A71725O5189p5566O692p3070N3798J65974A37876J37079H6680J24262P5965
8127B86907j03768k5189J3758K4655j2319N1883J39430j71008l9818o4334K0914
8116A21111k5006l115P1619B2695M1480E750J09897b5447A94487m0629G5348O0837
8104A36185a9A01846M8716K588q224n3009R4265b1029j0117A25530b4158A3419
8091A73887A4407J51612a7130E6668b3417H8440J975N4849A8623K2287N3917l9452
8079E5375L6728M4765J24866A04722J6989J61235R696J72825K41561M16278O17726
8068A741032Q51375K67918o64738r21584F25987p9027B14884K23320A84124k0221
8058A63903J68057q1171n3497K5990K7229O3802J78963m0380J22785J45744J92525
$$ plain form
8047 913950 1216087 1683264 2324435 2974744 2851863 1587741 885129 570106 443072 311683
8037 311683 136071 220042 78838 118418 136548 162110 129233 114456 191670 145452 352290
8026 352290 280919 214340 216246 125185 177 118619 -39155 102212 -51027 101013 -80578 53910
8013 37963 -45730 111914 -69585 1847 6918 34616 -52798 60295 -4239 21339 -10247 -69367
8001 -69367 -57661 29144 -19950 -112746 -39558 18628 47667 -15158 -76869 56317 -36585 -42185
7989 -42185 -60272 -67004 -84540 -42091 -123104 49609 -62576 -13733 -48129 -1505 -108994 -130335
7977 -130335 -5753 -104943 27469 -83522 87931 -80992 -1451 22707 -108975 -21837 -52778 -47304
7965 -47304 -54886 -45992 1291 -112452 -143147 -93556 -18607 -125928 -103255 14258 16251 -42358
$$ packed form
8047I13950L02137M67177O41171O50309j22881j264122p02612l15023j27034j31389
8037C11683A36071Q3971G8838L9580J8130K5562l2877j4777P7214m6218K06838
8026C52290p1371o6579J906r1061A77J18442c9155A02212e1027A01013h0578E3910
8013C7963d5730A11914f9585A847N071K7698e2798F0295d239B1339a0247n9120
8001f9367J1706B9144a9950r2796c9558A8628K9039a5158o1711E6317c6585n600
7989d2185j8087o732j7536d2091q1013D9609f2576a3733l4396a505j07489k1341
7977a30335e753r9190B7469h3522H7931h0992a451B2707a08975b1837l0941N474
7965d7304p582Q894A291a12452l0695M9591a8607j07321K2673A4258J993d2358
$$ plain form
7952 -60679 -72195 -78584 -29090 -85797 -63369 41650 23243 66673 -2593 -45446 -20755 -43962
7940 -43962 -22619 -94943 -26821 -46222 29261 -98693 -61151 9714 43612 -156203 -39846 -37508
7928 -37508 24344 -138068 -53122 18762 -23470 -37280 1967 -56825 -50988 -49578 -14108 41919
7915 -118647 -88097 -61317 -42622 38558 43107 50974 -36950 -52172 -123192 32501 -27378 -33699
7903 -33699 -26242 -139070 48202 -37915 43631 42442 -161715 -22564 17994 -50279 71271 -28905
7890 72539 -31592 44845 -14742 -41862 -99900 38042 -36695 28881 79926 41123 -71550 -21151
7877 -61059 53067 -49219 32262 -15330 72397 -100487 -44257 -144994 -3724 50041 -82929 -320
7864 -49270 55948 133658 -22558 -246608 -89283 -19325 51396 -41247 -90787 18774 -1152 90110
$$ packed form
7952f0679j1516o389b9090n6707K2428D1650j8407M3430b593m2853b0755k3207
7940d3962K1343p2324b6821j9401B9261i8693L7542I714L3898a56203c9846K338
7928c7508B4344a38068e3122A8762b3470j3810A967e6825N837J410a4108D1919
7915a18647L0550K6780J8695C8558M549P867c6950j5222p1020C2501b7378o321
7903c3699P457j12828D8202c7915D3631j189a61715b2564A7994e0279G1271b8905
7890G2539c1592D4845a4742k7120n8038C8042c6695B8881N1045l8803g1550b1151
7877f1059E3067d9219C2262a5330G2397a00487d4257j00737c724E0041h2929c20
7864d9270E5948P7710b2558k24050h9283a9325E1396d1247m9540A8774a152I0110
$$ plain form
7851 84337 -9689 -17672 98815 6032 17057 50507 111706 255452 -60357 -7139 145141 229431
7839 229431 95121 26371 95399 182497 102046 162060 310804 360573 323643 428341 521474
7828 521474 371344 528686 619922 807094 1136697 1560406 2040995 3061106 4186775 5821055
7818 5821055 6921445 6973205 6050426 3950111 2408237 1520994 1241968 995145 712872
7809 712872 734618 780053 647268 654272 697890 845357 846324 1087422 1302975 1681290 2418710
7798 2418710 3445794 4885142 6352001 7259817 7058392 5766674 3662962 2010547 1388594
7789 1388594 952072 745610 585270 499932 314025 306337 173600 242924 46021 56617 156510
7778 156510 68280 149072 130454 97929 37870 2896 74974 50779 163723 -8651 60668 39190
$$ packed form
7851H4337i689p983I8815F032J1025L3450O1199J43746f0357g139A45141Q4290
7839B29431I5121B6371O9028Q7098q0451O0014J48744M9769l6930J04698R3133
7828E21474j50130J57342R1236J87172L29603M23709M80589J020111J125669J634280
7818E821055J100390N1760r22779k100315j541874q87243k79026k46823k82273
7809G12872K1746M5435j32785P004M3618J47467R67K41098K15553L78315P37420
7798B418710J027084J439348J466859R07816k01425j291718k103712j652415o21953
7789A388594m36522k06462j60340q5338j85907p688j32737O9324D6021J0596R9893
7778A56510F8280Q0792j8618l2525C7870B896P2078k4195J12944h651F0668k1478
$$ plain form
7766 39190 170033 3456 2605 82260 35064 23582 52509 97134 -22191 -10648 79175 28659
7753 -14998 33553 24774 -64808 -78944 73607 -107887 93886 40251 -17254 57700 -28390 97708
7740 -14450 -8433 -952 78344 -14325 35440 -52922 52788 -40061 -149809 -45973 4615 80204
7728 80204 -97951 -52921 -117635 -6801 -53255 10078 -23090 12044 20570 -24704 -48203 -45085
7716 -45085 39998 38191 93449 -6683 -57244 -85514 -42817 -72890 -82156 -61617 51585 38736
7704 38736 -39218 -42651 11796 101648 -84443 70576 -149942 -13528 -41149 -17681 99491 79923
7692 79923 56956 -33478 214660 1938 -71562 -16987 85321 11397 29103 -13326 -6784 -124034
7680 -124034 10967 -4303 -8776 -100756 -71039 3824 38905 -31071 -1798 -11132 -58643 100905
$$ packed form
7766C9190J30843C456q51P9655C5064j1482K8927M4625b2191a0648G9175B8659
7753a4998C3553q779f4808j4136G3607a07887I3886D0251a7254E7700b8390I7708
7740a4450O017i52G8344a4325C5440e2922E2788d0061j09748d5973D615P5589
7728H0204i7951M5030o4714f801m6454A0078b3090A2044Q526b4704k3499L118
7716d5085C9998j807N5258f683n0561k8270M2697l0073r266K0539E1585j2849
7704C8736c9218l433A1796Q9852h4443G0576a49942a3528k7621a7681I9491j9568
7692G9923k2967c3478B14660A938g1562a6987H5321A1397J7706a3326O542j17250
7680a24034A0967d303m473r1980K9717C824L5081c1071a798r334m7511A00905
$$ plain form
7667 -28754 27589 39437 -18346 -48987 30730 -62935 -225170 26500 -26329 26746 -13136 27160
7654 -72822 -53883 176730 -82345 -39780 477 -59093 -10985 -43390 -50107 -97468 77950 -134386
7641 44555 -81268 19138 -46951 -72975 -43462 43833 88024 -10829 40621 -96441 11726 -14898
7628 39534 1341 -34703 8193 -70410 -131846 1534 -32967 50393 -17096 -150784 -66481 -6311
7615 -47056 -95871 -93865 -23672 -56433 -73182 -57400 -93249 -55797 -87963 -15025 -25915 -115494
7603 -115494 -46359 -132164 30978 -86024 28569 -185550 -99831 -116105 -24152 -132903 -82861
7592 -82861 -48723 13630 -37345 69155 64458 63974 34599 -7825 43020 -41806 19286 60802 51928
7579 51928 -50649 -13952 41998 -55681 -15255 85224 -147186 48026 53257 34775 24802 -5538
$$ packed form
7667b8754B7589J1848a8346l0641C0730f2935j62235B6500b6329B6746a3136B7160
7654g2822J8939A76730h2345c9780D77e9093a0985l2405o717m7361G7950a34386
7641D4555h1268A9138d6951k6024K9513D3833M4191a0829D0621i6441A1726a4898
7628C9534A341c4703H193g0410o1436A534c2967E0393a7096j33688f6481f311
7615d7056m8815K006b3672l2761j6749J5782l5849L7452l2166a5025j0890q9579
7603a15494d6359q5805C0978h6024B8569a85550Q5719j6274b4152j08751N0042
7592h2861L4138A3630c7345F9155m697m84k9375g825D3020d1806A9286M1516q874
7579E1928e0649a3952D1998e5681a5255H5224a47186D8026N231j8482r973e538
$$ plain form
7566 -11581 -31783 -74924 -27961 23917 -42409 12798 -29202 15541 47681 113199 68631 4428
7553 -3211 -24233 118800 4344 125766 -118606 -41110 -31675 -25057 43387 14591 -74455 -47316
7541 -47316 70390 69268 -32042 -28232 -73708 -106727 -53530 4607 -12952 119061 33039 8055
7528 84316 -77241 -102127 -19637 -6007 3257 15505 -46608 4377 10958 -97397 -29544 112261
7515 -45525 -76764 -106609 -21058 -17919 69514 -32046 23900 -48184 98447 44153 34558 76075
7503 76075 6745 -66020 67478 -50451 -41545 -31484 111 -15792 -161513 -77894 -19095 80828
7490 -55956 4617 -159644 -11516 -84707 53709 39146 -81647 -15638 -70526 11702 -150349 102985
7477 -85927 -1153 13418 -78773 -25691 -10914 -13098 8231 -70220 -102956 -59569 -14796 -31294
$$ packed form
7566a1581k0202m3141b7961B3917d2409A2798b9202A5541L2140O5518m4568D428
7553c211k1022A18800D344J21422a18606d1110R435O618D3387A4591g4455K7139
7541d7316G0390j122c2042L810m5476l3019N3197D607a2952A19061C3039H055
7528H4316g7241k4886a9637f007C257J2248d6608D377O581i7397b9544A12261
7515d5525l1239k9845b1058L139F9514c2046B3900d8184I8447D4153r595M1517
7503G6075F745f6020F7478e0451Q906J0061A11a5792j45721g7894a9095H0828
7490e5956D617a59644a1516p3191E3709j4563h1647a5638n4888A1702a50349A02985
7477h5927a153A3418g8773b5691a0914k184H231g0220l2736M3387a4796j6498
$$ plain form
7465 -31294 23959 76235 2994 55113 47362 4799 -34679 41072 67317 89161 24259 -2944 -67935
7452 -67935 110427 58794 14292 81945 -88756 -18157 67968 55604 21335 -54334 47339 100734
7440 100734 -47492 -43505 17538 31411 42104 9585 8705 107954 -11329 5392 36521 3118 26788
7427 26788 3835 -73467 11057 80988 135896 23510 82399 6263 -31320 -16921 -21772 76441
7414 -11757 126051 138508 99042 -5424 -33603 11306 123943 106220 -19760 68729 -53607 10722
7401 45159 -53361 104969 32493 164452 8561 64858 -475 -28803 5796 120169 -5697 -58580
7389 -58580 66442 129405 34271 33278 60789 68605 -5149 -97470 -2730 -29568 -35563 -8319 24844
7375 -67638 -63506 10219 -24249 -27264 -55575 41482 45974 177262 5862 76579 7230 55163 17891
$$ packed form
7465c1294B3959N2276B994N2119p751D799c4679D1072K6245K1844B4259b944o4991
7452f7935A10427n1633A4292O7653h8756a8157F7968j2364B1335e4334D7339N3395
7440A00734d7492L987A7538J3873J0693I585q80R9249a1329E392L1129C118K3670
7427B6788C835g3467A1057O9931N4908B3510N8889F263c1320J4399m851G6441
7414a1757A26051J2457l9466e424k8179A1306J12637j7723a9760F8729e3607A0722
7401D5159e3361A04969C2493J31959H561N6297d75k8328E796J14373e697n2883
7389e8580F6442O2963C4271r93K7511P816e149r2321b730k6838n995h319B4844
7375f7638M132A0219b4249l015k8311D1482M492J31288E862P0717G230M7933A7891
$$ plain form
7361 1783 -49267 72091 12016 50249 41487 -2946 122639 -43995 97495 130722 46435 -14336
7348 86793 -15280 66447 -29587 -17305 52016 43266 86675 189682 -22364 24469 59868 150816
7336 150816 17852 116220 117367 142601 165863 205629 5019 92646 62878 -6092 127468 86848
7324 86848 195556 55435 203020 90243 236645 101539 223247 48286 185112 131364 76049
7313 76049 182181 139687 16257 70547 67608 85530 145559 190932 269340 148931 77280 219911
7301 219911 174637 222457 130382 182679 40618 186536 228335 -40560 146329 25018 100636
7290 100636 84975 107792 270783 126384 272790 -10196 198515 152796 140459 137335 249082
7279 249082 213579 251461 66966 208412 197259 342774 296970 306615 217849 378188 457822
$$ packed form
7361A783d9267G2091A2016L8233q762b946A22639d3995I7495L3227D6435a4336
7348H6793a5280F6447b9587J2282E2016q750M3409J03007b2364B4469L5399R0948
7336A50816A7852R8368J147K5234K3262L9766E019Q7627k9768f092A27468m0620
7324H6848J08708E5435J47585I0243J46402A01539J21708D8286J36826n3748n5315
7313G6049J06132m2494A6257N4290k939J7922O0029M5373P8408j20409p1651J42631
7301B19911m5274M7820r2075N2297D0618J45918M1799d0560A46329B5018P5618
7290A00636j5661K2817J62991A26384J46406a0196A98515m5719j2337l124J11747
7279B49082l5503L7882F6966J41446j1153J45515m5804R645q8766J60339P9634
$$ plain form
7268 457822 514329 596347 552606 633835 616057 629286 725967 731541 725837 797941 929289 947390
7256 947390 1086355 1063028 1179763 1175813 1421137 1594618 1748706 2139482 2631719 3051785
7246 3051785 3584018 3619027 3355815 3052056 3197908 3658120 4019801 4307715 3865507 3386844
7236 3386844 2755853 2693546 2708528 2615116 2591201 2351093 2302397 2415946 2495547 2761118 2723338
7225 2723338 2613115 2555932 2369567 2112789 2122493 2147409 2183526 2197709 2221128 2496436 2630376
7214 2630376 3024652 3501495 4200459 5196505 5839217 6136561 5504732 5179728 5519014 5951503
7204 5951503 6505406 6661226 6259288 6109716 6478787 7789171 9235097 10225081 10155565
7195 10155565 9159838 7629439 5869190 5032406 5021016 5697160 6853817 8210462 8863748
$$ packed form
7268D57822N6507Q2018m3741Q1229j7778J3229R6681N574n704P2104J31348J8101
7256I47390J38965k3327J16735l950K45324J73481J54088L90776M92237M20066
7246C051785N32233L5009k63212l03759J45852M60212L61681K87914m42208m78663
7236C386844o30991o2307J4982r3412k3915k40108m8696J13549P9601K65571l7780
7225B723338j10223n7183j86365k56778R704K4916L6117J4183K3419K75308J33940
7214B630376L94276M76843O98964R96046O42712K97344o31829l25004L39286M32489
7204E951503N53903J55820m01938j49572L69071J310384J445926R89984o9516
7195A0155565r95727j530399j760249q36784j1390O76144J156657J356645O53286
$$ plain form
7186 8863748 8533725 7470918 5776894 3923716 2726873 2064637 1749387 1579131 1287075
7177 1287075 1105316 1149260 913337 1002849 974856 1123796 1160522 1110099 981364 768289
7167 768289 950393 1097052 1180093 1102627 1106260 1063670 730538 814941 579306 707072 687892
7156 687892 737482 833524 848632 940215 928153 1065507 961363 1184482 1244609 1240475 1418470
7145 1418470 1476491 1407505 1582951 1748928 1867674 2154745 2465967 3015518 3502070 4228552
7135 4228552 4447685 4388094 3644832 3383536 3463890 3651973 4037776 4447822 4374684 4247328
7125 4247328 4313184 4493537 4686111 4670044 4029531 3467721 2965574 2857801 2572627 2743271
7115 2743271 3085058 3579033 4145741 5127611 5537060 5532892 5104892 4556245 4020062 3573480
$$ packed form
7186H863748l30023j062807j694024j853178j196843o62236l15250j70256k92056
7177A287075j81759M3944k35923Q9512k7993J48940L6726n0423j28735k13075
7167G68289J82104J46659Q3041p7466L633m2590l33132Q4403k35635J27766j9180
7156F87892M9590R6042J5108R1583j2062J37354j04144K23119O0127m134J77995
7145A418470N8021o8986J75446J65977J18746K87071L11222N49551M86552P26482
7135D228552K19133n9591p43262k61296Q0354J88083L85803M10046p3138j27356
7125D247328O5856J80353J92574j6067o40513n61810n02147j07773k85174J70644
7115B743271L41787M93975N66708R81870M09449m168m28000n48647n36183m46582
$$ plain form
7105 3573480 3470297 3245637 3290041 3380118 3239943 3167183 3449737 3432537 3471060 3350026
7095 3350026 3454034 3611119 3644393 3637679 3778765 3977376 4382930 4756413 5477172 5857024
7085 5857024 6101785 5902419 5661682 5405402 5067619 4557998 4474624 4522668 4879306 5197349
7075 5197349 5602371 6067331 6350551 6605864 6672419 6173502 4968474 3969862 3377199 2913156
7065 2913156 2778043 2596109 2607773 2632582 2961995 3528646 4345277 5571490 6395418 6467780
7055 6467780 5144614 3697410 3294691 3201078 3034265 2861535 2792037 3144677 3373075 3359215
7045 3359215 3245616 3096588 3303052 3804937 3876132 3649711 4021725 4667897 5320029 5675003
7035 5675003 5208346 4022828 3212777 2734253 2440025 2415070 2465461 2549882 2676113 2659595
$$ packed form
7105C573480j03183k24660M4404R0077j40175p2760K82554j7200L8523j21034
7095C350026J04008J57085L3274o714J41086J98611M05554L73483P20759L79852
7085E857024K44761j99366k40737k56280l37783n09621q3374M8044L56638L18043
7075E197349M05022M64960K83220K55313O6555m98917j205028r98612n92663m64043
7065B913156j35113j81934J1664K4809L29413N66651Q16631J226213Q23928P2362
7055F467780j323166j447204m02719r3613j66813j72730o9498L52640K28398j3860
7045C359215j13599j49028K06464N01885P1195k26421L72014O46172O52132L54974
7035E675003m66657j185518q10051m78524k94228k4955N0391Q4421J26231j6518
$$ plain form
7025 2659595 2935964 3344759 3968097 4650223 5655699 6079070 6299966 6531176 6262540
7016 6262540 6448281 7211104 8300897 9006572 8730001 7803221 7589941 7787273 7498237
7007 7498237 6917791 5663095 4500985 4159789 3926625 4172374 4914030 5985237 7209349
6998 7209349 8198330 8394711 7715040 6077248 4146940 2904800 2369581 1922616 1632028
6989 1632028 1319334 1300435 1227140 1139432 1139860 1222631 1318207 1496967 1681327 1887983 2232649
6978 2232649 2542838 2948024 3251973 3790871 4478273 5452962 6510476 7315865 7826541
6969 7826541 8030498 7753083 7371236 6961388 6680131 6358676 5778599 5239822 4188129
6960 4188129 3717426 3474572 3288055 2774996 2693286 2275434 2117431 1862811 1975557 2218168
$$ packed form
7025B659595K76369M08795O23338O82126J005476M23371K20896K31210k68636
7016F262540J85741P62823J089793P05675k76571r26780k13280J97332k89036
7007G498237n80446j254696j162110l41196k33164K45749P41656J071207J224112
6998G209349R88981J96381o79671j637792j930308j242140n35219m46965k90588
6989A632028l12694j8899p3295q7708M28Q2771R5576J78760J84360K06656L44666
6978B232649L10189M05186L03949N38898O87402R74689J057514Q05389N10676
6969G826541K03957k77415l81847m09848k81257l21455n80077n38777j051693
6960D188129m70703k42854j86517n13059q1710m17852j58003k54620J12746K42611
$$ plain form
6950 2218168 2519867 2903237 3196447 3442779 3538078 3434968 3184895 2849750 2574502 2390973
6940 2390973 2300911 2314216 2281709 2289573 2497783 2410944 2375763 2071824 1955483 1637486 1287628
6929 1287628 1051081 968345 1028902 929682 1084912 1078572 1127327 1166435 1153434 1347360 1590131
6918 1590131 1636114 1837275 1773827 1829615 1981543 2021337 2199007 2489356 2830824 3358032
6908 3358032 4067541 4472982 4458696 4802113 5474772 5083841 4507345 4918913 5425091 6078609
6898 6078609 6347885 6222712 6242739 6805998 7409454 6985617 5970921 4989413 4207453 3828677
6888 3828677 3591482 3237053 3484967 3475229 3766629 4020198 4677829 5622063 6941270 8545422
6878 8545422 9722536 9513201 10240640 11704227 12776641 13413101 14188587 14482440 12919247
$$ packed form
6950B218168L01699L83370K93210K46332R5299j03110k50073l35145k75248j83529
6940B390973r0062J3305l2507P864K08210q6839l5181l03939j16341l17997l49858
6929A287628k36547q2736O0557r9220J55230o340M8755L9108j3001J93926K42771
6918A590131M5983K01161o3448N5788J51928L9794J77670K90349L41468N27208
6908C358032P09509M05441j4286L43417O72659l90931n76496M11568N06178O53518
6898F078609K69276j25173K0027N63259O03456m23837j014696r81508p81960l78776
6888C828677k37195l54429K47914r738K91400K53569O57631R44234J319207J604152
6878H545422J177114k09335P27439J463587J072414O36460P75486K93853j563193
$$ plain form
6869 12919247 11263626 10639664 9915026 10295880 10618969 9876488 7297538 5431936 4721158
6860 4721158 4207136 4046222 4042658 3888346 4401016 5004335 5970687 6858293 7325607 7155394
6850 7155394 6521584 5061890 4167372 3789076 3750237 3907545 3837162 3478008 3060369 2890864
6840 2890864 2759462 2810053 2685169 2686608 2611689 2824396 3064684 3528822 3902660 3992830
6830 3992830 4043926 4402637 4725122 4558393 4358338 3881903 3551493 3139473 3201520 3136772
6820 3136772 3294240 3457993 3464382 3481867 3191024 3036564 3076390 3329744 3607792 3874389
6810 3874389 4140537 4467615 4715262 4788524 3709346 3033687 2797554 2853522 2826507 2746402
6800 2746402 2971166 3078548 3550411 4105640 4385934 3237302 2394682 1984218 1990336 2073602
$$ packed form
6869A2919247j655621o23962p24638L80854L23089p42481k578950j865602p10778
6860D721158n14022j60914l564j54312N12670O03319R66352Q87606M67314j70213
6850G155394o33810j459694q94518l78296l8839J57308p0383l59154m17639j69505
6840B890864j31402N0591j24884J439p4919K12707K40288M64138L73838R0170
6830C992830N1096L58711L22485j66729k00055m76435l30410m12020O2047o4748
6820C136772J57468J63753O389J7485k90843j54460L9826K53354K78048K66597
6810C874389K66148L27078K47647P3262j079178o75659k36133N5968k7015q0105
6800B746402K24764J07382M71863N55229K80294j148632q42620m10464O118Q3266
$$ plain form
6790 2073602 2130676 2281317 2122614 2051045 2036700 1982299 2097240 2220552 2588913 3123052
6780 3123052 3876958 4804253 4999104 4031927 2909319 2263107 2117145 2260412 2693564
6771 2693564 3251116 4294950 5318066 5457453 4541272 2742997 1947336 1451238 1251593
6762 1251593 1439181 1430380 1393757 1548885 1906654 2198027 2678739 2725217 2450816 2062062
6752 2062062 1696409 2205598 2525789 3086508 3763904 3972834 4159519 3433535 2473307 2134628
6742 2134628 2137869 2268419 2811339 2546379 1953952 1463091 1102884 1023434 1048764 1029493
6732 1029493 1147634 1189945 1474380 1742881 2172954 2850438 3636607 4114241 4178964 4062549
6722 4062549 3420801 2786455 2603176 2837115 3161392 3260017 3293580 2657747 2187033 2310931
$$ packed form
6790B073602N7074J50641j58703p1569j4345n4401J14941J23312L68361N34139
6780C123052P53906R27295J94851r67177j122608o46212j45962J43267M33152
6771B693564N57552J043834J023116J39387r16181j798275p95661m96098j99645
6762A251593J87588q801l6623J55128L57769K91373M80712M6478k74401l88754
6752B062062l65653N09189L20191N60719O77396K08930J86685p25984r60228l38679
6742B134628L241J30550N42920k64960n92427m90861l60207p9450K5330j9271
6732A029493J18141M2311K84435K68501M30073O77484P86169M77634O4723j16415
6722D062549o41748o34346j83279K33939L24277R8625L3563o35833m70714J23898
$$ plain form
6712 2310931 2457923 2884348 3509385 4602782 5825554 8111576 10795703 13546578 14992133
6703 14992133 13745845 10996140 8922755 7277345 5806162 4630688 4022411 3778337
6695 3778337 3629532 3885909 4221673 4798446 5728841 7271239 9564016 12599137 17134256
6686 17134256 22473158 26862759 27713993 24773128 22455103 19664014 14623205 10183306
6678 10183306 7603619 6169176 5370186 5064414 5038508 5259747 5729515 6789613 8216435
6669 8216435 10650693 13935402 18312863 22717691 25983839 26948698 27183244 26135779 20321783
6660 20321783 13347680 9120283 6825022 5516816 4500476 4103284 3690029 3654401 3712177
6651 3712177 4261091 4872684 6037565 7585258 9421365 11707855 13731331 15553874 16225903
$$ packed form
6712B310931J46992M26425O25037J093397J222772K286022K684127K750875J445555
6703A4992133j246288k749705k073385j645410j471183j175474o08277k44074
6695C778337j48805K56377L35764N76773R30395J542398K292777L035121M535119
6686A7134256N338902M389601Q51234k940865k318025k791089n040809m439899
6678A0183306k579687j434443p98990l05772k5906K21239M69768J060098J426822
6669H216435K434258L284709M377461M404828L266148R64859K34546j047465n813996
6660B0321783o974103m227397k295261j308206j016340l97192m13255l5628N7776
6651C712177N48914O11593J164881J547693J836107K286490K023476J822543O72029
$$ plain form
6642 16225903 13629647 9321442 6163417 4284845 3282803 2555685 2169892 1759985 1716460
6633 1716460 1631185 1502320 1584071 1636105 1950807 2169499 2668448 3235964 3962756 4270897
6623 4270897 3909414 3013797 2136493 1582253 1332881 939745 885840 647483 627609 583694
6613 583694 449862 421022 408129 411691 307128 445989 353859 415065 356008 483500 486874
6602 486874 599462 612053 788554 927035 821734 820024 677853 706246 566135 448653
6592 448653 453731 335746 311620 231872 233027 234926 314702 190626 137974 197311 65320 103838
6580 103838 146831 212597 204744 221826 232191 224620 209509 437298 434441 362386 480205 243469
6568 243469 497104 253427 317010 146098 82043 174052 207856 132701 102017 4822 42034
$$ packed form
6642A6225903k596256m308205l158025j878572j002042p27118l85793m09907m3525
6633A716460q5275j28865Q1751N2034L14702K18692M98949N67516P26792L08141
6623D270897l61483q95617q77304n54240k49372l93136n3905k38357j9874m3915
6613E83694j33832k8840j2893L562j04563J38861r2130O1206n9057J27492L374
6602D86874J12588J2591J76501J38481j05301j710j42171K8393j40111j17482
6592D48653N078j17985k4126p9748J155J899P9776j24076n2652N9337F5320L8518
6580A03838M2993O5766p853J7082J0365p571j5111K27789k857p2055J17819k36736
6568B43469K53635k43677O3583A46098o4055R2009L3804p5155l0684D822L7212
$$ plain form
6557 42034 -19697 53790 -2488 152778 -85655 196362 22786 191847 177128 60938 145339
6546 145339 226245 183193 208581 108268 172756 43201 221471 -16964 -39363 82634 -1981
6534 -73178 43524 37324 -102012 -35250 -77644 4526 36216 6983 110180 -15345 94015 95874
6522 95874 38525 -85371 55187 -30303 -24691 15847 58968 42779 28364 15207 75507 108510
6510 108510 51399 -47790 127204 -53965 38915 41473 -2103 165557 252240 84881 67078 145774
6498 145774 135739 95592 221653 175632 206285 35429 26874 -28185 102552 108104 162338 118024
6486 118024 340954 244135 119072 208274 90834 156922 81985 96920 210562 208310 245059
6475 245059 186387 317474 479381 707694 897019 1314881 1779824 2348402 2237129 1810771
$$ packed form
6557D2034a9697E3790b488A52778h5655A96362B2786J69061j4719F0938Q4401
6546A45339Q0906m3052K5388j00313O4488D3201J78270a6964k2399H2634a981
6534g3178D3524o200a02012c5250m2394D526L1690F983J03197a5345I4015J859
6522I5874C8525h5371E5187c0303N612A5847M3121j6189j4415j3157O0300L3003
6510A08510E1399d7790A27204e3965C8915K558b103A65557Q6683H4881j7803P8696
6498A45774j0035m0147J26061m6021L0653C5429q555b8185A02552N552N4234m4314
6486A18024K22930r6819A19072Q9202I0834O6088p4937J4935J13642k252L6749
6475B45059n8672J31087J61907K28313J89325M17862M64943N68578j11273m26358
$$ plain form
6465 1810771 1479129 1158371 1136695 1009748 940209 813423 545894 439767 505146 417420
6455 417420 418739 579812 615024 658864 949799 1207664 1419719 1925057 2083332 2479718
6445 2479718 2897931 3262542 3324904 3175908 2907663 2628135 1925658 1550498 1064606 834394
6435 834394 653624 592995 444359 454041 408758 465343 570574 719153 857416 1214167 1199335
6424 1199335 1196068 1358141 1175538 1294842 1473267 1808085 1974002 1978455 1567038 715144
6413 500600 436462 283062 98859 195804 230859 170290 73391 192323 184794 128146 109397
6402 109397 224890 261701 311695 289096 316206 162159 105794 155593 34847 132695 93062
6391 93062 39952 46687 19742 90085 112396 21206 -52793 71862 168772 -46569 92593 38637
$$ packed form
6465A810771l31642l20758k1676j26947o9539j26786k67529j06127O5379q7726
6455D17420J319J61073L5212M3840K90935K57865K12055N05338J58275L96386
6445B479718M18213L64611O2362j48996k68245k79528p02477l75160m85892k30212
6435H34394j80770o0629j48636R682m5283N6585J05231J48579J38263L56751j4832
6424A199335l267J62073j82603J19304J78425L34818J65917M453m11417G15144
6413E00600o4138j53400I8859R6945L5055o0569G3391J18932p529n6648j8749
6402A09397J15493L6811M9994k2599K7110j54047n6365M9799C4847R7848l9633
6391I3062C9952O735A9742P0343K2311B1206e2793G1862R6910d6569I2593C8637
$$ plain form
6378 24541 22517 2338 -15559 17073 -23970 6291 23258 167107 56189 161487 42390 55352
6366 55352 36141 76573 22680 -26565 -86866 -47703 249044 55785 37511 16407 103922 -12209
6353 -25242 -127218 -5432 -81592 -78192 -76661 -63187 -138678 -92457 -15337 -42234 -80162 -29953
6340 -16980 -170917 34981 -66431 -11950 61738 -38299 17763 15950 -57632 17828 -22309 20108
6327 110531 -5750 90286 -25234 42266 -31134 -9363 -8080 -19888 -32953 19394 71901 77213
6315 77213 33255 -98881 -44136 14474 126596 -62691 -64361 98351 74919 78323 47480 -18813
6302 19391 -95961 83597 78610 30229 24751 22784 189640 184951 47969 4291 182905 -16309
6289 6688 116116 128144 14559 16561 27427 61957 -37721 -41887 78034 -123008 -39480 100101
$$ packed form
6378B4541k024B338a5559A7073b3970F291J6967J43849E6189J05298D2390J2962
6366E5352j9211M0432B2680b6565o0301L9163B49044E5785j8274A6407Q7515a2209
6353b5242j01976e432p6160L400J531J3474p5491M6221a5337k6897l7928b9953
6340a6980j53937C4981f6431a1950F1738c8299A7763j813e7632A7828b2309B0108
6327A10531e750I0286b5234D2266c1134i363J283j1808j3065A9394N2507N312
6315G7213C3255i8881d4136A4474J12122f2691j670I8351k3432L404l0843a8813
6302A9391i5961H3597m987C0229n478j967J66856m689D7969D291J78614a6309
6289F688J09428J2028A4559K002J0866L4530c7721m166G8034a23008c9480A00101
$$ plain form
6276 132305 33772 99185 154900 18115 97263 63756 69518 -126307 171741 -56319 134800
6264 -41212 78295 210545 -18231 -34857 1151 89060 126585 -3977 64508 3690 39924 221757
6252 221757 136051 62285 201445 99276 -4446 138697 -25949 127793 -32294 140017 -58493
6240 166169 34929 -32588 101838 135564 9305 225013 269826 78643 96017 143935 32262
6228 123223 79864 -38443 37378 167393 95175 55559 31453 -98558 42115 75689 40533
6217 40533 807 -130229 -39371 -65566 8505 87956 45673 45847 20054 138063 101817 96618 207136
6204 207136 -66588 -41824 -49526 64464 -16003 -38365 -55281 -3207 8424 -122032 -69851 8540
6191 33305 61198 -22067 21408 7175 116017 100749 157283 155115 129138 124344 95358 136073
$$ packed form
6276A32305C3772O5413N5715A8115P9148l3507N762a26307A71741e6319A34800
6264d1212G8295J32250a8231j6626A151Q7909L7525c977F4508C690L6234J81833
6252B21757q5706F2285J39160I9276d446A38697b5949A27793c2294A40017e8493
6240A66169C4929c2588A01838L3726I305K15708M4813G8643J7374M7918C2262
6228A23223m3359c8443C7378J30015p2218l9616k4106i8558D2115L3574l5156
6217D0533H07a30229c9371k6195H505P9451m2283J74B0054J18009l6246n199J10518
6204B07136f6588K4764p702F4464a6003k2362j6916c207H424a22032N2181H540
6191C3305K7893b2067B1408G175J08842j5268N6534k168k5977m794k8986M0715
$$ plain form
6179 136073 99055 91151 83552 -25446 -18799 162254 71444 29757 49527 54448 56406 71918
6167 71918 82065 63957 92900 118107 101228 101709 11326 175268 24444 12345 25261 106759
6155 106759 72782 55173 101141 199786 81063 154462 55181 132089 132724 144251 142954 180704
6143 180704 210089 357818 320560 342691 445086 191980 256217 267124 239841 287623 309748
6132 309748 280132 190769 401707 470701 435914 611908 651333 758793 972161 935963 1193334
6121 1193334 1405791 1722263 2109939 2524162 2982721 3581530 4480297 6064811 8182474
6112 8182474 11679779 15910469 19698191 20873325 18807561 14304789 9758847 6451532
6104 6451532 4796683 3974670 3642066 3610033 3544431 3638704 3873909 4215934 4846749 6057126
$$ packed form
6179A36073l7018p904p599b5446O647A62254G1444B9757J9770M921J958J5512
6167G1918J0147j8108K8943K5207j6879M81A1326J63942B4444j2099J2916Q1498
6155A06759l3977j7609M5968R8645H1063P3399E5181P6908O35J1527j297L7750
6143A80704K9385J47729l7258K2131J02395A91980O4237J0907k7283M7782K2125
6132C09748k9616q9363K10938O8994l4787J75994L9425J07460K13368l6198K57371
6121A193334K12457L16472L87676M14223M58559N98809Q98767J584514K117663
6112H182474L497305M230690L787722J175134k065764m502772m545942l307315
6104F451532j654849q22013l32604l2033o5602R4273K35205L42025O30815J210377
$$ plain form
6094 6057126 8022610 10896750 14815625 18326079 19973777 18278005 14387536 9839987
6086 9839987 6672348 4975641 4123945 3676810 3564877 3517727 3530655 3761511 4205907 4645846
6076 4645846 5485379 6498824 7909922 10135532 13686669 19064046 25641093 31774039
6068 31774039 34462017 32090919 25414066 17625291 11870960 8771307 7041487 6249584
6060 6249584 5879117 5853788 5947193 6126278 6722695 7858375 9466062 12481199 17087641
6051 17087641 23309326 29442857 32486928 30666948 24634204 16993820 10881665 7298062
6043 7298062 5419424 4298134 3579547 3126336 2505797 2058219 1711919 1386358 1231072
6034 1231072 987821 793869 850577 788040 611848 536176 555547 469561 469034 612985 511275
$$ packed form
6094F057126J965484K874140L918875L510454J647698j695772l890469m547549
6086I839987l167639j696707q51696m47135j11933m7150J2928K30856M44396M39939
6076D645846Q39533J013445J411098K225610L551137N377377O577047O132946
6068C1774039K687978k371098o676853p788775n754331l099653j729820p91903
6060F249584l70467k5329R3405J79085N96417J135680J607687L015137M606442
6051A7087641O221685O133531L044071j819980o032744p640384o112155l583603
6043G298062j878638j121290p18587m53211o20539m47578l46300l25561j55286
6034A231072k43251j93952N6708o2537j76192p5672J9371q5986n27J43951j01710
$$ plain form
6023 511275 319465 509756 335024 454405 365043 312237 385676 400735 381696 295108 360290
6012 360290 410319 244234 225728 326126 189723 149969 175221 235607 263101 152265 261437
6001 261437 219235 170356 160467 258173 222847 258665 162557 315558 218043 195201 279867 244537
5989 244537 314988 277266 261943 320446 369055 267223 150739 274387 341681 406570 580530
5978 580530 327495 534064 560259 800529 729586 854553 927161 1001110 1099735 1331803 1505321
5967 1505321 1748133 1972075 2340612 2926420 3285294 4097267 4983841 6165795 7777594
5958 7777594 10374758 14613553 20727078 28587903 35458910 37670201 32754969 23945699
5950 23945699 15693247 10319242 7523881 6255528 5436972 4755899 4320208 4193237 4063787
$$ packed form
6023E11275j91810J90291j74732J19381q9362n2806P3439J5059j9039q6588O5182
6012C60290N0029j66085j8506J00398j36403l9754K5252O0386K7494j10836J09172
6001B61437m2202m8879r889R7706l5326L5818r6108J53001r7515k2842Q4666l5330
5989B44537P0451l7722j5323N8503M8609j01832j16484J23648O7294O4889J73960
5978E80530k53035K06569K6195K40270p0943J24967P2608P3949R8625K32068J73518
5967A505321K42812K23942L68537N85808L58874Q11973Q86574J181954J611799
5958G777594K597164M238795O113525P860825O871007K211291m915232q809270
5950B3945699q252452n374005k795361j268353q18556o81073m35691j26971j29450
$$ plain form
5941 4063787 4252995 4610943 5063364 6061361 7095180 8859297 11595680 16201070 22239902
5932 22239902 29076398 33370583 32557275 26268582 18366790 11900145 8549891 6692583
5924 6692583 5631603 5066599 4870002 4800593 4721772 5028135 5410960 6691968 8707268
5915 8707268 11826391 15960370 19941020 21688859 19859211 15112271 10093762 6649151
5907 6649151 4791108 3977136 3359016 3100193 2941911 2683670 2660986 2744215 2784062 3148890
5897 3148890 3559538 4134744 5056112 6447547 8908378 12511929 16618033 19597272 19844551
5888 19844551 16591433 11667961 7328834 4847977 3517085 2748128 2351919 1838151 1644109
5879 1644109 1342116 1220022 1129984 743195 735535 624611 507422 516188 421599 511820 496854
$$ packed form
5941D063787J89208L57948M52421R97997J033819J764117K736383M605390O038832
5932B2239902O836496M294185q13308o288693p901792o466645l350254j857308
5924F692583j060980n65004j96597o9409p8821L06363L82825J281008K015300
5915H707268L119123M133979L980650J747839j829648m746940n018509l444611
5907F649151j858043q13972o18120k58823j58282k58241k2684Q3229L9847L64828
5897C148890M10648N75206R21368J391435K460831L603551M106104K979239K47279
5888A9844551l253118m923472m339127k480857j330892p68957l96209n13768j94042
5879A644109l01993j22094r0038l86789p660j10924j17189Q766r4589R0221j4966
$$ plain form
5868 496854 270716 502429 398415 330997 236832 430918 364252 314288 330068 497040 383518
5857 383518 312284 332895 231097 240843 123185 180383 329164 165830 200298 149017 357637
5846 357637 31873 90943 58368 144163 288881 157379 123888 210251 114660 138681 134897
5835 134897 179897 135622 161843 77803 241704 125824 131085 49749 120221 89010 85063 115241
5823 115241 88678 199182 158779 219597 104322 43154 218514 149280 178482 125957 78316
5812 78316 243985 205564 314058 172917 241269 183327 215971 210286 216432 363503 340476
5801 340476 225044 325437 412401 476468 333095 339181 430495 522365 530385 486965 610863
5790 610863 617878 657369 742935 798508 858856 839316 900359 974577 1063332 1202765 1156046 1396088
$$ packed form
5868D96854k26138K31713j04014o7418r4165J94086o6666m9964J5780J66972j13522
5857C83518p1234K0611j01798R746j17658N7198J48781j63334L4468n1281K08620
5846C57637C1873N9070l2575Q5795J44718j31502l3491Q6363r5591K4021l784
5835A34897M5000m4275K6221G7803J63901j15880N261D9749P0472l1211l947L0178
5823A15241k6563J10504m0403O0818A04322D3154J75360o9234K9202n2525m7641
5812G8316J65669l8421J08494j41141O8352n7942L2644n685O146J47071k3027
5801C40476j15432J00393Q6964O4067j43373O086R1314R1870Q020m3420J23898
5790F10863P015L9491Q5566N5573O0348j9540O1043P4218Q8755J39433m6719K40042
$$ plain form
5778 1396088 1445474 1615254 1703030 1837080 1980558 2141922 2518989 2862451 3228710 3545408
5768 3545408 4006616 4518645 5250852 6101468 7200148 8737437 10021867 11308167 12164979
5759 12164979 13632527 15582253 18214324 21630805 26320608 32910069 41985225 55993941
5751 55993941 78811253 115297799 178720613 274735779 369320604 429662025 294675393
5744 294675393 149294128 82791754 55108658 40232727 29873128 22090621 16596236
5737 16596236 12774448 10424586 8858142 7837547 6770978 6084223 5492455 4884991 4572297
5728 4572297 4044958 3825209 3521085 3266601 3098048 2848160 2846719 2684721 2406968 2400782
5718 2400782 2264033 1875991 1726815 1733599 1575915 1547480 1368330 1235821 1207953 1127219
$$ packed form
5778A396088M9386J69780Q7776J34050J43478J61364L77067L43462L66259L16698
5768C545408M61208N12029P32207Q50616J098680J537289J284430J286300Q56812
5759A2164979J467548J949726K632071L416481M689803O589461R075156J4008716
5751E5993941K2817312L6486546O3422814R6015166R4584825O0341421j34986632
5744B94675393j45381265o6502374k7683096j4875931j0359599p782507n494385
5737A6596236l821788k349862j566444j020595j066569o86755n91768o07464l12694
5728D572297n27339k19749l04124k54484j68553k49888j441j61998k77753o186
5718B400782j36749l88042j49176O784j57684k8435j79150j32509k7868q0734
$$ plain form
5708 1127219 1008921 878066 954856 896654 948899 876552 815783 859434 845894 790546 757847
5697 757847 921998 685217 841764 597142 632774 626063 601788 542731 496611 300374 420475
5686 420475 390053 447227 345451 471163 352033 370180 279661 276625 190334 370815 383166
5675 383166 320173 269004 284289 286613 273654 272973 210778 275160 200223 164497 219266 214378
5663 214378 137840 198263 175144 180291 243375 193784 258710 178504 167121 102571 150807 128051
5651 128051 31370 1173 -63789 102344 207166 94000 105337 121304 97795 91177 83015 37119
5638 157429 24963 82615 -39302 30464 165058 60356 46544 112973 203872 146839 76420
5627 76420 81678 92643 -116469 121853 4595 99917 -6103 28421 53182 94060 56422 169929
$$ packed form
5708A127219j18298j30855P6790n8202N2245p2347o0769M3651j3540n5348l2699
5697G57847J64151k36781J56547k44622L5632o711k4275n9057m6120j96237J20101
5686D20475l0422N7174j01776J25712j19130J8147r0519l036q6291J80481J2351
5675C83166o2993n1169J5285K324j2959o81o2195O4382p4937l5726N4769m888
5663B14378p6538O0423k3119N147O3084m9591O4926q0206j1383o4550M8236k2756
5651A28051C1370A173f3789A02344J04822I4000J1337J5967k3509o618q162C7119
5638A57429B4963N7652c9302C0464J34594F0356j3812O6429R0899n7033p0419
5627G6420N258J0965a16469A21853D595R5322f103B8421K4761M0878l7638J13507
$$ plain form
5615 169929 74469 71035 -24166 76911 154418 52163 14580 30502 117109 36423 64384 55372
5603 55372 87963 106353 146207 -46087 76555 -47761 47129 173406 6808 36945 -26235 37921
5590 446 8748 31588 218402 41673 51906 -9538 1375 43257 19199 62811 60826 63987 114725
5577 114725 -64485 6219 42353 28764 116837 -75872 -17901 69377 75520 30122 72733 20112
5564 -32283 12593 68415 -82443 98909 28978 -31587 30628 80774 76150 29762 -47886 -122026
5552 -122026 202490 113324 111666 -26521 78391 166771 211844 135779 101226 185866 203985 183178
5540 183178 302022 410689 604702 811967 1261221 1694108 2173918 1914104 1063285 522409
5529 390402 121401 216991 160260 117737 64482 114146 152601 93998 6191 75955 -22861 181280
$$ packed form
5615A69929G4469l434b4166G6911P7507E2163A4580J5922Q6607C6423K7961r012
5603E5372L2591J8390L9854d6087G6555d7761D7129J26277F808L0137b6235C7921
5590D46Q302K2840J86814D1673J0233i538A375M1882A9199M3612j985L161N0738
5577A14725f4485F219L6134j3589Q8073g5872a7901F9377O143C0122M2611B0112
5564c2283A2593N5822h2443I8909B8978c1587C0628N0146m624B9762d7886p4140
5552a22026B02490q9166j658b6521G8391Q8380M5073p6065l4553Q4640J8119k0807
5540A83178J18844J08667J94013K07265M49254M32887M79810k59814q50819E22409
5529C90402A21401R5590n6731m2523n3255M9664L8455n8603F191O9764b2861A81280
$$ plain form
5516 102009 72141 101885 68495 -18763 28342 52363 -12578 6582 109730 109197 -96575 137646
5503 65834 -92451 -87223 20845 29468 77825 31868 152648 -6459 -150350 1185 -154215 -41098
5490 23506 90291 -133216 -81766 -19984 4893 -62350 -117974 -112939 -40974 -59211 37279 7608
5477 89865 127138 -40537 89395 149483 -6303 -86727 63659 161631 -94193 -45606 -40655 32182
5464 52018 -14470 125920 -71767 -61890 20680 48917 62498 17278 34248 73316 51777 104251
5452 104251 64106 -122278 -45722 95827 64039 -13350 31650 -70764 -72671 -61714 104225
5440 7661 -21570 73909 -44565 -45269 -16849 -101245 -60151 3741 55795 143560 -35457 122320
5427 -9291 -220224 -67593 -56673 -37940 50857 -13530 -6337 -79882 -18936 53732 13102 19931
$$ packed form
5516A02009k9868K9744l3390a8763B8342K4021a2578F582J03148n33i6575A37646
5503F5834i2451N228B0845Q623M8357C1868J20780f459j43891A185a54215d1098
5490B3506O6785a33216N1450a9984D893f2350n5624N035d0974j8237C7279G608
5477H9865L7273d0537H9395O0088f303q0424F3659R7972i4193d5606M951C2182
5464E2018a4470A25920g1767R877B0680K8237J3581A7278J6970L9068k1539N2474
5452A04251m0145a22278d5722I5827l1788a3350C1650g0764j907J0957A04225
5440G661b1570G3909d4565p04a6849q4396M1094C741N2054Q7765c5457A22320
5427i291k10933f7593J0920J8733E0857a3530f337p3545a8936E3732A3102O829
$$ plain form
5415 19931 27169 104832 -9877 125287 8184 12408 23584 -77121 18550 9953 74065 -122542
5402 70299 24737 48767 29607 -134098 -18007 -69179 -66974 -101657 71802 -43524 39343 -55385
5389 91985 -19385 -9794 62252 -14237 107695 5050 16253 1247 76456 48552 -17693 61251
5376 -72203 67413 15746 25454 60553 -28262 131673 -126624 13838 16911 -7092 -23096 27292
5363 31098 -46554 -104980 -134387 -52576 -141442 61003 36905 68442 -4699 99005 66518 75264
5351 75264 193 11307 59843 47365 53170 72126 7743 -53384 47518 16232 -110976 63791
5338 68475 -17116 7933 -68089 33962 44812 6324 60110 3416 125646 -87481 26729 71914
5326 71914 -21064 -46867 -41824 37533 -7147 21281 -95301 51296 -85097 29159 84853 57258
$$ packed form
5415A9931P238P7663i877A25287H184M224J1176g7121A8550q597O4112a22542
5402G0299B4737K4030j9160a34098a8007n1172K205l4683G1802d3524C9343e5385
5389I1985a9385R591F2252a4237A07695E050J1203A247P5209k7904a7693F1251
5376g2203F7413A5746R708L5099b8262A31673a26624A3838L073g092j6004B7292
5363C1098d6554n8426k9407e2576q8866F1003k4098L1537d699I9005l2487Q746
5351G5264A93J1114M8536j2478N805J8956G743e3384D7518A6232a10976F3791
5338F8475a7116G933f8089C3962J0850F324N3786C416J22230h7481B6729M5185
5326G1914b1064k5803N043C7533g147B1281i5301E1296h5097B9159N5694k7595
$$ plain form
5314 57258 22706 -68309 -45434 54199 -8085 72760 -13066 -29255 -4321 3304 35102 -29035
5301 -59246 46598 17931 65357 -9624 -63622 6065 39983 -109472 16772 -19820 85659 5802
5288 -56976 63389 -26492 -24515 -31170 -40385 21049 -60977 12887 44228 61586 125136 6107 60477
5275 60477 61477 -7999 43688 49620 -24742 -126325 55541 106115 6438 -10661 80536 -157590
5262 53519 1482 90251 -111835 14133 -11810 9538 -46567 -49143 -40243 -5612 59 -96475 -80293
5249 -80293 -48527 -23373 -15648 64447 33012 -90864 35273 -140409 29011 -130725 150105
5237 17516 35929 48627 -27112 60126 34254 115715 146362 101 107643 51354 5372 80643
5225 80643 93438 98043 22691 -20804 133388 -17919 67568 58644 -4246 25918 -14799 48616
$$ packed form
5314E7258B2706f8309K2875E4199h085G2760a3066j6189d321C304L1798b9035
5301e9246D6598A7931M7426i624n3998F065L3918a09472A6772a9820H5659E802
5288e6976F3389b6492J977o655r215B1049f0977A2887L1341J7358O3550F107N4370
5275F0477J000g999D3688N932b4742j01583E5541N0574F438a0661H0536a57590
5262E3519A482Q8769a11835A4133a1810I538d6567k576Q900e612E9i6475J6182
5249h0293L1766b3373P725F4447l1435i0864C5273a40409B9011a30725A50105
5237A7516J8413J2698b7112F0126k5872Q1461L0647A01J07542E1354E372P5271
5225H0643J2795M605B2691b0804A33388a7919F7568q924d246B5918a4799D8616
$$ plain form
5212 -36273 -64009 147941 -69056 -18427 -47298 -3641 60982 42412 12510 161743 -51486 -34711
5200 -34711 59340 119236 76760 38339 47197 -14783 81257 201890 -84601 169721 15938 -16306
5187 41514 -3671 7888 36011 -39456 80414 7345 -71135 -56683 50582 -14389 -30787 25753
5174 69638 71485 7497 32095 2464 93033 -82034 1814 2607 51654 -57234 154489 -19660 -69671
5161 -69671 29796 -58861 111456 -49205 148567 87421 129563 77159 -59677 32453 61849
5150 61849 39931 35155 59531 16361 -43224 -16834 66525 -9798 23667 119310 10592 52285
5138 52285 -49510 -68144 89952 99141 4019 37584 -50903 33400 -34729 93325 73641 14806
5125 95154 2498 21960 2912 36180 -32103 30161 -64585 142282 -41286 22255 -43552 143295
$$ packed form
5212c6273k7736A47941f9056a8427k8871c641F0982j8570A2510J49233e1486J6775
5200c4711E9340N9896m2476C8339Q858a4783H1257J20633h4601A69721A5938a6306
5187D1514c671G888K8123c9456H0414G345g1135J4452E0582a4389j6398B5753
5174F9638J847G497K4598B464R0569h2034A814P93M9047e7234A54489a9660n0011
5161f9671B9796e8861A11456d9205A48567o1146M2142n2404e9677C2453K9396
5150F1849k1918m776K4376A6361d3224a6834F6525i798B3667R5643A0592M1693
5138E2285d9510j8634H9952R189D019L3565e0903C3400c4729I3325j9684A4806
5125I5154B498J9462B912L3268c2103C0161f4585A42282d1286B2255d3552A43295
$$ plain form
5112 -48530 -24282 -31036 86706 60988 -81236 -14780 10612 -114600 135590 -87506 -6384 1359
5099 14979 89121 45818 3670 34965 -59560 39179 -71985 -6699 42083 86425 -83973 101300
5086 -160296 71168 -21496 -124681 109354 2098 17467 -30940 -62176 -28932 885 -118611 -34234
5073 -44525 30689 -93329 -71046 -31549 41766 75169 -91998 -46514 6452 -30003 28049 -22366
5060 -122822 -27689 -28618 -69612 -175057 -27111 42383 -112292 -21074 7822 -38414 -110809 -27632
5047 -127362 19328 29277 -26314 29907 36273 81155 -311 -102743 -24769 41418 -69047 40167
5034 28463 -44185 38541 43459 15645 208146 -85082 -58828 -69120 -17903 -80200 -31621 -118693
5022 -118693 -48929 -67008 -48948 129798 56965 -48164 -81823 115594 -83982 35237 -79352
$$ packed form
5112d8530K4248o754H6706k5718h1236a4780A0612a14600A35590h7506f384A359
5099A4979P4142m3303C670L1295e9560C9179g1985f699D2083M4342h3973A01300
5086a60296G1168b1496j03185A09354B098J5369c0940l1236b8932H85a18611c4234
5073d4525C0689i3329K2283c1549D1766L3403i1998M5484F452c0003B8049b2366
5060a22822b7689r29m0994j05445b7111D2383a12292b1074G822c8414p2395b7632
5047a27362A9328R949b6314B9907O366M4882c11j02432b4769D1418f9047D0167
5034B8463d4185C8541M918A5645J92501h5082K6254j0292a7903o2297c1621q7072
5022a18693d8929j8079J8060A29798E6965d8164l3659A15594h3982C5237g9352
$$ plain form
5010 -16111 101213 56309 -32329 -27348 -34475 31884 105426 -6825 25352 47729 46 134259 -6665
4996 20062 -15857 62870 2159 -26829 -28306 36780 47121 52162 -78985 -92258 -8853 3476 104628
4983 104628 80469 4039 -64209 36116 53042 -52154 -47706 -52536 -27164 83313 -10744 28905
4970 29225 -5712 46808 -102628 19254 70006 16085 -23917 -9018 12603 99216 -44926 10565
4957 821 77066 72794 20406 53049 51991 22262 -18031 66835 -67969 64554 108451 7357 -39473
4943 36493 12078 136586 -86207 -4955 108444 34301 -83275 11136 3439 47083 -36754 -118716
4931 -118716 2749 57126 389 -31489 -52016 -8134 84146 -5341 42597 58267 56089 -19919 -77209
4918 -77209 -48983 134685 -178040 -12262 -52306 -73953 -21840 -55241 -145695 -73716 -6032 13426
$$ packed form
5010a6111A01213m4904c2329M981p127C1884P3542f825B5352K2377D6J34213f665
4996B0062a5857F2870B159b6829j477C6780J0341N041g8985j3273h853C476J01152
4983A04628k4159D039f4209C6116J6926e2154M448m830K5372H3313a0744B8905
4970B9225e712D6808a02628A9254N0752A6085b3917i018A2603Q6613d4926A0565
4957H21P6245m272B0406L2643j058B2262a8031F6835f7969F4554M3897G357c9473
4943C6493A2078J24508h6207d955A08444C4301h3275A1136C439M3644c6754q1962
4931a18716B749N4377C89c1489k0527h134H4146e341D2597J5670k178a9919n7290
4918g7209K8226A34685a78040a2262m0044k1647b1840l3401r0454P1979f032A3426
$$ plain form
4905 -49786 -44614 -29292 59757 -144817 96851 1046 67675 100129 -3211 18505 -53352 -10356
4892 -11509 11792 -30415 -85328 124751 -44675 -116036 19188 -5069 25514 67298 -72362 -2372
4879 18641 21284 15448 88690 117408 14283 29279 -28749 -139363 2265 -107914 -56359 -31396
4867 -31396 -153831 77482 59909 -11213 -772 47635 27314 19179 -139108 -97071 89133 5700
4854 7284 93293 -12775 8421 -47443 -41353 -108223 93168 61017 -21682 35808 -2765 -5208 -51763
4841 -51763 12632 -188204 86630 60016 24896 98908 -21957 97296 81309 92981 130427 284617
4829 284617 461905 481648 827503 359270 128507 60797 -25653 3998 -32494 -47997 -2697
4817 98207 -17611 61292 3509 17346 -104027 80185 56218 165340 92155 -47419 29686 7955
$$ packed form
4905d9786N172J5322E9757a44817I6851A046O6629L2454c211A8505e3352a0356
4892a1509A1792c0415n4913A24751d4675p1361A9188e069B5514M1784g2362b372
4879A8641K643n836P3242K8718A4283J4996b8749j10614B265a07914N1555K4963
4867c1396j22435G7482j7573a1213g72D7635k0321q135a39108M2037H9133E700
4854G284Q6009a2775H421d7443O090o6870I3168l2151b1682C5808b765k443m6555
4841e1763A2632a88204H6630k6614B4896P4012b1957I7296j5987J1672L7446J54190
4829B84617J77288J9743L45855C59270A28507F0797b5653C998c2494j5503b697
4817I8207a7611F1292C509J3837a04027H0185k3967J09122p3185d7419B9686G955
$$ plain form
4804 71756 60058 -84295 -26147 104631 -8999 26447 -80582 -42280 -29901 -94323 16490 -23231
4791 -69361 115521 -42604 59432 10819 -12315 5347 20901 22045 -65058 -89738 -73499 9968
4778 3695 39899 80821 -55443 -4215 -16141 7573 29914 -5055 138859 -134517 85848 117155
4766 117155 50071 3499 13214 -128414 -146778 183614 47727 -110447 73255 -32384 -75983
4755 -75983 -181084 -108027 -47757 -9986 -70512 105022 82497 38474 -171220 -103737 39328
4743 -60329 -151466 39450 -70452 95193 -43295 11689 -56929 -77856 32968 -83542 91658 -12526
4730 38476 19732 -10713 20634 -11383 -24213 -120358 -133204 -957 65395 -36116 100042 -28588
4717 9222 21781 -1476 -16566 -5296 -8082 30934 -27327 -115655 -59988 -77428 -93643 -61564 142378
$$ packed form
4804G1756j1698h4295b6147A04631h999B6447h0582L8302J2379o4422A6490b3231
4791f9361A15521d2604E9432A0819a2315E347J5554J144f5058k4680J6239I968
4778C695L6204M0922e5443d215j1926G573K2341e055A38859a34517H5848L1307
4766A17155E0071C499R715a28414j8364A83614D7727a10447G3255c2384m3599
4755g5983j05101P3057d7757i986o0526A05022k2525C8474a71220O7483C9328
4743f0329r1137C9450g0452I5193d3295A1689e6929k0927C2968h3542I1658a2526
4730C8476j8744a0713B0634a1383j2830r6145j2846i57F5395c6116A00042b8588
4717I222J2559a476j5090e296k786C0934b7327q8328N5667j7440j6215L2079A42378
$$ plain form
4703 31074 98639 33932 -26400 -108027 71373 33149 88876 133207 -29061 -53014 -190269 -75575
4690 59920 -82714 13929 47352 29656 -17873 137227 12753 110028 -33707 -9082 -66961 -131011
4678 -131011 7479 -27597 -71166 15023 71548 74069 -53934 -2552 23528 -44347 -69271 23980
4665 -10216 -92902 -62837 -21887 -17526 -19343 28647 113082 5669 33455 89596 -127717 -14149
4652 93399 15945 -70561 11441 -46468 -133918 17634 51556 -53444 38917 -8943 -70256 -67678
4640 -67678 74769 -28447 -16239 1782 -73972 -44750 -54789 -4726 -33843 -71858 -2795 -10563 33753
4626 -43467 -97530 -17688 4869 -183388 -114537 -95877 -105520 51329 -48127 128031 -15586 -56280
4614 -56280 -48372 47784 -36308 7226 -11052 -70282 -218073 -32785 -63263 44569 57030 52397
$$ packed form
4703C1074O7565C3932b6400q1627G1373C3149N5727M4331b9061k3953j37255g5575
4690E9920h2714A3929L3423j7696a7873A37227A2753R7275c3707i082n7879o4050
4678a31011G479b7597m3569A5023N6525K521e3934b552B3528d4347k4924B3980
4665a0216q2686L0065b1887M361j817B8647Q4435E669K7786N6141a27717a4149
4652I3399A5945g0561A1441d6468q7450A7634L3922e3444C8917h943o1313K578
4640f7678G4769b8447J2208A782g3972K9222j0039d726k9117l8015b795p768C3753
4626d3467n4063a7688D869a83388O8851J8660r643E1329d8127A28031a5586m0694
4614e6280P908D7784c6308G226a1052n9230j47791c2785l0478D4569J2461m633
$$ plain form
4602 52397 46866 -125712 -19988 -29321 -34888 -70876 -20530 93188 -116468 86664 -75845 -125591
4590 -125591 -107463 -145629 23917 -8096 11898 -17155 -119384 1854 800 -17947 -20203 -10584 31148
4576 -87735 -5930 18999 6537 50125 148004 24985 -148444 -34437 -103959 -39622 30325 48549
4564 48549 -25642 -109531 -50446 -171294 -106381 73943 -191088 -54347 36075 -78142 -21560
4552 44855 59275 39349 -42073 142338 32039 -56645 38993 -26781 -145782 59376 -50646
4540 -42675 -97199 60481 -51307 -26242 -41571 8569 67513 -82639 35777 123411 -106428 7683
4527 14277 31311 -50138 -121579 27103 -121752 68133 -1443 -60656 -11701 -3780 28651 35449
4515 35449 2874 58820 54331 -7678 -41518 -11343 -64331 -67680 -54156 -56263 -63043 63542 -80992
$$ packed form
4602E2397n531a25712a9988r333n567l5988b0530I3188a16468H6664g5845m9746
4590a25591J8128l8166B3917h096A1898a7155j02229A854H00a7947k256R619C1148
4576h7735e930A8999F537M3588R7879B4985a48444c4437o9522c9622C0325J8224
4564D8549b5642q3889e0446j20848O4913G3943a91088e4347C6075g8142b1560
4552D4855J4420j9926d2073A42338C2039e6645C8993b6781j19001E9376e0646
4540d2675n4524F0481e1307K5065j5329H569N8944h2639C5777Q7634a06428G683
4527A4277J7034e0138p1441B7103a21752F8133a443n9213a1701c780B8651O798
4515C5449B874N5946m489g678l3840a1343n2988l349J3524k107o780F3542h0992
$$ plain form
4501 41585 -17750 177205 7835 40690 79198 -23664 -48721 -99677 26261 -66544 -12395 23711
4488 -141557 -145681 -29463 -78947 31211 21247 117285 -78879 88463 -50197 -69650 20314 -5514
4475 147287 30067 -59940 49038 -2080 24649 17212 7091 9763 -109182 15121 -65247 15380
4462 -47052 -51842 156751 -28371 48807 -4204 -59873 85812 36208 -789 18272 -61448 -121869
4450 -121869 -36319 -91669 22433 -85662 28020 -38298 14781 46087 408 -26196 2238 -50411
4437 -91554 -30261 143239 48637 63440 -57683 -36687 -87396 341 -38768 -15673 -116493 -38229
4424 91310 26081 -2995 6287 30143 -31227 17227 -22568 32290 74491 100077 160814 22575
4411 -29060 80905 11702 64140 32252 -15405 27314 54039 -179219 4990 25246 -52614 131867
$$ packed form
4501D1585a7750A77205G835L2855L8508b3664k5057n0956B6261f6544a2395B3711
4488a41557m124b9463m9484C1211r964R6038g8879H8463e0197j9453B0314e514
4475A47287C0067e9940D9038b080B4649p437G091K672a09182A5121f5247A5380
4462d7052m790A56751b8371D8807d204n5669H5812C6208g89A8272f1448o0421
4450a21869c6319n5350B2433h5662B8020c8298A4781L1306D08b6196B238e0411
4437i1554c0261A43239D8637J4803e7683K0996n0709C41c8768a5673j00820c8229
4424I1310B6081b995F287K3856c1227A7227b2568C2290M2201K5586O0737B2575
4411b9060H0905A1702N2438l1888a5405B7314K6725a79219D990K0256e2614A31867
$$ plain form
4398 36219 -66753 83943 -16048 33185 -116535 -39099 11896 -80164 14896 -79174 36646 18262
4385 -2238 -14919 -110838 -2959 9961 -39059 -42042 -100667 27134 58238 -53558 -266 -27212 50295
4371 51048 33501 -8268 -45466 -34640 -4536 -15444 27489 -44112 -21317 -12035 32713 44872
4359 44872 3380 -4767 30818 -88263 -8399 12906 3762 -12693 -56266 90972 -91133 37044 -112162
4345 -15201 -44495 5760 -75270 -13377 -54245 -42208 65476 30025 -69907 -38175 -58845 69060
4332 -70180 -43049 -27427 44147 39662 -89267 11582 -9979 -14288 -141639 62651 68159 -68059
4319 97096 -54732 -9119 -30560 -34004 -1612 -114304 -81160 127751 -64251 -3735 -155626 55313
4306 -12162 -104315 6981 18481 -27835 -73129 8819 209646 29230 81298 20600 121524 31601
$$ packed form
4398C6219f6753H3943a6048C3185a16535c9099A1896h0164A4896g9174C6646A8262
4385b238j2681r5919b959I961c9059k983n8625B7134L1104e3558b66k6946E0295
4371E1048j7547h268l7198J0826d536j0908B7489d4112b1317R282C2713J2159
4359D4872C380d767C0818h8263h399A2906C762a2693m3573I0972i1133C7044a12162
4345a5201k9294E760g5270a3377m0868J2037F5476C0025f9907L1732k0670F9060
4332g0180K7131J5622D4147m485h9267A1582i979m309j27351F2651N508f8059
4319I7096e4732i119k1441l444a612j12692L3144A27751f4251c735j51891E5313
4306a2162r2153F981J1500b7835m5294H819K00827B9230N2068B0600J00924C1601
$$ plain form
4293 -28185 -127122 -17977 91326 57797 132137 99424 84448 210765 309050 319046 588072 779246
4281 779246 1063798 909774 577552 395781 366635 191267 112117 18742 95175 136243 117896
4270 117896 120048 176404 168705 253315 278287 418257 580339 677561 990861 909974 673426
4259 673426 279583 211625 255704 189004 153226 225627 51945 54771 62242 29472 -21578 -51136
4247 -51136 71424 31013 45205 94556 57960 33459 61706 113024 83447 53729 -3040 15844
4234 -228703 20663 138156 -79799 60853 98931 -65942 47118 79434 105747 -25073 61603
4222 96075 113148 -64100 -84516 -142951 116652 -45040 21870 119982 11723 30439 11962 -18411
4209 89401 -24939 56341 40289 157172 -126050 1224 -56793 140138 86459 4280 56262 82144
$$ packed form
4293b8185r8937a7977I1326l3529P4340l2713j4976J26317R8285R996K69026J91174
4281G79246K84552j54024l32222j81771k9146j75368p9150A8742P6433M1068j8347
4270A17896K152N6356p699Q4610K4972J39970J62082R7222L13300q0887k36548
4259F73426B79583o7958M4079o6700l5778P2401E1945K826P471B9472b1578k9558
4247e1136G1424C1013J4192M9351l6596k4501K8247N1318k9577k9718c040A5844
4234b28703B0663J17493g9799F0853L8078f5942D7118L2316K6313b5073F1603
4222I6075J7073f4100k0416n8435A16652d5040B1870R8112A1723J8716A1962a8411
4209H9401b4939E6341j6052J16883a26050A224e6793A40138n3679D280N1982K5882
$$ plain form
4197 82144 1619 90288 120530 8707 211301 -20894 37576 57953 47589 73743 108480 8658
4184 28599 36192 130284 55886 98179 164698 107521 125200 -54658 72751 154294 186654 191782
4172 191782 -33148 46767 118222 143129 116088 -7578 233538 189447 220021 212810 173462 276531
4160 276531 227056 281144 194753 334431 134442 278877 339616 439822 358275 432503 398097
4149 398097 396660 224194 437702 357581 429770 438594 381942 563397 514970 549634 477819
4138 477819 680825 708579 734903 765348 677462 818553 870410 1044321 1045556 1199323 1125633
4127 1125633 1245950 1271857 1342015 1424280 1635557 1711103 1808292 2147155 2325183 2652445
4117 2652445 2907986 3167538 3584909 4071108 4498949 5130845 5791711 6483189 7634330
$$ packed form
4197H2144A619Q8669L0242H707K02594b0894C7576K0377j0364K6154L4737H658
4184B8599P593R4092E5886M2293O6519n7177J7679e4658G2751Q1543L2360N128
4172A91782c3148D6767P1455K4907k7041g578B33538m4091L0574p211l9348J03069
4160B76531m9475N4088q6391J39678A34442J44435O0739J00206q1547P4228l4406
4149C98097j437j72466K13508q0121P2189Q824n6652J81455m8427L4664p1815
4138D77819K03006K7754K6324L0445q7886J41091N1857J73911J235J53767p3690
4127A125633J20317K5907P0158Q2265K11277P5546R7189L38863J78028L27262
4117B652445K55541K59552M17371M86199M27841O31896O60866O91478J151141
$$ plain form
4108 7634330 8706715 10177811 12039371 14516511 17553323 21792780 27242078 34940052
4100 34940052 46846285 65256374 94742984 135990626 176657463 194268918 150793928
4093 150793928 91936655 57988720 41832196 33406576 28411802 25424841 23445476 22776072
4085 22776072 23582310 26139543 29957638 35922466 45163165 60177471 84510273 121014596
4077 121014596 162211182 189846663 167122097 104830514 61772017 40442326 29435471
4070 29435471 22666103 18029343 14263996 11033938 8817428 7304925 6344075 5552408
4062 5552408 4855907 4414877 4035132 3682213 3322203 3132585 2744188 2682964 2496818 2376683
4052 2376683 2271853 2036463 1968454 1927470 1775040 1649694 1428371 1332236 1310977 1227181
$$ packed form
4108G634330J072385J471096J861560K477140L036812M239457N449298P697974
4100C4940052J1906233J8410089K9486610M1247642M0666837J7611455m3474990
4093A50793928n8857273l3947935j6156524q425620m994774k986961j979365o69404
4085B2776072Q06238K557233L818095N964828R240699J5014306K4332802L6504323
4077A21014596M1196586K7635481k2724566o2291583m3058497k1329691j1006855
4070B9435471o769368m636760l765347l230058k216510j512503r60850p91667
4062E552408o96501m41030l79745l52919l60010j89618l88397o1224j86146j20135
4052B376683j04830k35390o8009m0984j52430j25346k21323r6135k1259q3796
$$ plain form
4042 1227181 1188829 1078515 1020516 933691 988399 862774 909846 844467 690284 684634 722566
4031 722566 543533 547532 674266 561459 644863 530920 650705 606285 506242 605534 458998
4020 458998 422499 352236 540875 445410 450537 439469 390828 482141 256904 322120 248434
4009 248434 365717 240963 322125 214454 337974 282752 302458 227094 394116 251737
3999 251737 185345 244902 233415 325623 122362 288006 208248 211245 153754 194940 201751 112160
3987 112160 180605 93782 142813 182484 173532 127474 335501 8945 197141 151047 99941 145416
3975 145416 136919 169695 211512 161757 34310 94196 158080 135388 174679 295351 97842 37032
3962 101195 39938 192354 137133 146426 221162 201860 65181 79438 13345 73906 80364 171801
$$ packed form
4042A227181l8352j10314n7999q6825N4708j25625M7072o5379j54183n650L7932
4031G22566j79033L999J26734j12807Q3404j13943J19785m4420j00043R9292j46536
4020D58998l6499p0263J88639r5465N127j1068m8641R1313k25237O5216p3686
4009B48434J17283j24754Q1162j07671J23520n5222J9706p5364J67022j42379
3999B51737o6392N9557j1487R2208A22362J65644p9758K997n7491M1186O811q9591
3987A12160O8445q6823M9031L9671q952m6058K08027H945J88196m6094n1106M5475
3975A45416q497L2776M1817m9755C4310N9886O3884k2692L9291J20672I7842C7032
3962A01195C9938J52416n5221R293P4736j9302F5181J4257A3345O0561O458R1437
$$ plain form
3950 171801 182432 11524 10342 -15925 126107 -45908 45769 152253 98579 95357 43917 180175
3938 180175 118673 78916 88315 77623 22555 143027 33754 77783 39226 32761 162785 87978
3926 87978 -110160 55476 3442 116958 45370 14685 68254 235889 119758 105036 171924
3915 171924 200597 178747 246231 193913 290915 327822 417581 598226 822290 926831 1032890
3904 1032890 656554 392250 391574 362088 152991 220281 133380 269695 164141 156398 130176
3893 130176 213402 204252 244094 267433 546277 852285 1033595 906950 698449 460624 209644
3881 351263 201921 223014 165901 180583 -29893 -10376 45623 51452 16710 -37464 -27222 79266
3868 -65092 37504 14985 7774 -34195 34458 38596 32110 15443 30455 38082 -91658 35045 69884
$$ packed form
3950A71801J0631A1524j182a5925A26107d5908D5769J06484n3674l222D3917J36258
3938A80175o1502l9757R399j0692B2555J20472C3754M4029l8557o465J30024p4807
3926H7978a10160E5476C442J13516D5370A4685N3569J67635j16131j4722O6888
3915A71924K8673k1850O7484n2318R7002L6907Q9759J80645K24064J04541J06059
3904A032890l76336k64304o76k9486A52991O7290q6901J36315j05554p743k6222
3893A30176Q3226r150L9842K3339K78844L06008J81310j26645k08501k37825B09644
3881C51263j49342K1093n7113J4682b9893a0376D5623N829A6710c7464J0242G9266
3868f5092C7504A4985p211c4195C4458M138o486A5443J5012P627i1658C5045L4839
$$ plain form
3855 69884 5131 -22716 -15727 99525 18416 41384 26827 167584 -79503 57885 -63845 56879
3842 -30041 121976 -9663 13179 -41705 -7114 20772 35094 43800 58758 146490 59924 -10081
3829 -9141 7727 -28837 -958 36842 -16867 106145 -84482 53498 160242 42304 -57942 34357
3816 159401 59387 -77216 -10597 109954 138165 40109 -31160 -28883 88357 129652 53462 -42106
3803 32128 -16774 -28249 -69049 -39206 14780 106707 80087 -57993 48909 10348 -172389 93851
3790 32093 179267 68788 83946 -149256 36294 82950 2344 8996 14407 46022 -9032 102835
3777 66028 -22898 66328 -35090 -61725 62024 -30094 -38008 -103773 6467 87157 -146853 -33431
3764 108155 79119 16599 -21855 -29164 -155617 26447 -9451 -54008 126420 -3229 -951 -7988
$$ packed form
3855F9884E131b2716O989I9525A8416K2968j4557J40757g9503E7885f3845E6879
3842c0041A21976i663A3179d1705g114B0772J4322Q706J4958Q7732E9924a0081
3829i141G727b8837i58C6842a6867A06145h4482E3498J06744D2304e7942C4357
3816A59401E9387g7216a0597A09954K8211D0109c1160K277H8357M1295E3462d2106
3803C2128a6774j1475m0800K9843A4780R1927k6620e7993D8909A0348a72389I3851
3790C2093J47174F8788J5158a49256C6294M6656B344O652N411L1615i032A02835
3777F6028b2898F6328c5090k6635F2024c0094p914o5765F467Q0690a46853c3431
3764A08155k9036A6599b1855p309j26453B6447i451m4557A26420c229i51p037
$$ plain form
3752 -7988 91713 11734 46903 84576 8595 1208 -56544 -137463 37710 -23371 -7033 2284 -61011
3738 -56216 35579 6159 -35394 -84288 15090 10253 88239 34329 8505 -19364 -1574 -46497 44876
3724 30979 -17278 34261 47292 86844 -11023 99499 -32835 55057 -10629 18937 71228 78009
3712 78009 80477 -22537 -44709 48074 -82466 33802 -61588 24476 -25413 -40401 -62768 -676
3699 -9663 68992 72908 74665 98886 159473 -1056 63376 66880 100315 144691 -11979 2449 -35567
3685 18322 -41973 31415 56736 -20966 -44481 61122 -10746 9178 -921 19458 52734 -27829
3672 24916 37310 -77670 -1960 47187 -86017 103245 -33786 -36276 -20693 86575 42662 -8131
3659 42013 -23451 55005 148181 129836 156114 163266 111018 75917 78065 -5511 64147 173462
$$ packed form
3752g988I1713A1734L5169L7673H595A208e6544q0919C7710b3371g033B284f1011
3738e6216C5579F159c5394m8894A5090m837P7986C4329H505a9364a574m4923D4876
3724C0979a7278C4261J3031L9552a1023I9499c2835E5057a0629A8937N2291O781
3712G8009K468b2537k2172D8074h2466C3802f1588B4476b5413j4988k2367f76
3699i663F8992L916J757K4221O0587a056F3376L504L3435M4376a1979B449c5567
3685A8322d1973C1415K5321b0966k3515F1122a0746I178i21A9458L3276b7829
3672B4916J2394g7670a960D7187h6017A03245c3786k490J5583H6575D2662h131
3659D2013b3451E5005R3176j8345K6278P152n2248l5101K148e511F4147J09315
$$ plain form
3647 173462 148360 21180 34677 89983 -59972 138018 89174 -77010 132665 72418 53882
3636 53882 92170 -29466 154190 93683 126315 162365 -10437 93408 155809 -33275 109343
3624 -69147 73013 54488 141833 115984 100 -1123 22033 46236 134748 -78143 149061 -44646
3611 54586 38652 -57329 45900 84305 157421 58918 -18895 118538 14454 -99817 82526 -68501
3598 31985 -85857 6665 16689 34430 147079 127060 19601 -75675 -35779 109079 193752 73792
3585 7392 7482 -14815 -34081 -59555 -52266 -40501 5487 -81173 54680 17424 11459 58774 -16492
3571 -42698 105631 342 122245 9744 -44611 87855 40440 -36578 -89972 -50771 21164 37347
3559 37347 -54660 12557 85192 138834 -40776 -87317 21192 -49694 -54961 -105722 53014 -11636
$$ packed form
3647A73462k5102B1180J3497N5306e9972A38018m8844g7010A32665o0247j8536
3636E3882L8288b9466A54190o0507L2632L6050a0437I3408O2401c3275A09343
3624f9147G3013j8525Q7345k5849A00a123B2033K4203Q8512g8143A49061d4646
3611E4586j5934e7329D5900L8405P3116E8918a8895A18538A4454i9817H2526f8501
3598C1985h5857F665J0024J7741J12649k0019A9601g5675c5779A09079Q4673G3792
3585G392R0a4815j9266k5474P289J1765E487h1173E4680A7424n965M7315a6492
3571d2698A05631C42J21903I744d4611H7855D0440c6578n3394L9201B1164J6183
3559C7347e4660A2557P2635N3642d0776m6541B1192d9694n267n0761E3014a1636
$$ plain form
3546 64414 4087 56639 1299 -104890 46432 56491 -26570 162852 19164 112699 8729 83190
3534 83190 -64097 33584 -7483 -17605 -51097 42010 -46365 25800 -63425 -47123 -68182 63734
3521 85324 -58876 -9641 -86814 55785 23041 -21545 103555 -16449 74155 35475 -9474 55564
3508 -18100 29742 -58801 36927 41161 -136421 -9009 31440 -88388 -102142 -74396 -41486 21542
3495 -44565 38277 49755 -144442 64475 48483 3867 10746 106307 33421 71809 3338 45025
3483 45025 -130198 -34373 -81953 47817 -25889 50808 -17248 18797 -38625 40926 3830 147890
3471 147890 -98578 13906 22292 2351 -120141 -22821 2073 54920 -6800 43978 55976 -50001
3458 79809 62295 -46959 -14844 -99296 -154306 -19413 -49473 -28567 765 -10033 -143073 -94417
$$ packed form
3546F4414D087N2552A299a04890D6432J0059b6570A62852A9164R3535H729P4461
3534H3190f4097C3584g483j0122l3492D2010d6365B5800f3425J6302k1059F3734
3521H5324e8876i641p7173E5785B3041b1545A03555a6449G4155C5475i474E5564
3508a8100B9742e8801C6927M234a36421i009C1440h8388j3754K7746L2910B1542
3495d4565C8277J1478a44442F4475j5992C867O879R5561C3421L8388C338M1687
3483D5025a30198c4373m7580D7817b5889E0808a7248A8797c8625D0926C830J44060
3471A47890i8578A3906Q386B351a20141b2821B073N2847f800D3978J1998e0001
3458G9809j7514d6959a4844q4452n5010a9413l0060K0906G65a0033j33040M8656
$$ plain form
3446 -94417 11155 -112559 -65336 90317 115933 -64915 4240 -12542 41317 100423 3780 -24075
3433 46673 -37748 22077 -107588 -77148 63283 31355 91064 44355 -21921 -151392 -72965
3421 -108848 -39384 68049 -12159 -46183 -20092 18490 55924 15229 -38206 -24081 -2133 -149577
3409 -149577 -37150 -5446 -34986 -58054 37684 -60847 -34114 -42650 30652 75031 -26718 163779
3396 -76332 42951 -63245 -33021 -40772 49970 -44075 2814 -142732 -43589 4885 80205 77833
3384 77833 -41723 71110 8208 -7358 65319 -28320 -21741 63559 -89769 10516 -68308 71888
3371 26169 -120721 -175175 -36704 567 7028 -25891 24876 79342 598 -52440 7217 10933 391
3357 -95573 -144250 26418 41158 4465 22472 -8282 -23639 -89893 18815 -30907 -9782 -2474 -33299
$$ packed form
3446i4417A1155a12559M7223I0317K5616f4915D240a2542D1317N9106C780b4075
3433D6673c7748B2077a07588L0440F3283C1355N9709D4355b1921j29471g2965
3421a08848c9384F8049a2159l4024b0092A8490L7434A5229c8206J4125b133j47444
3409a49577c7150e446k9540k3068C7684f0847K6733q536C0652M4379b6718A63779
3396g6332D2951f3245L0224p751D9970d4075B814a42732d3589D885P5320k372
3384G7833d1723G1110H208g358F5319b8320O579F3559h9769A0516f8308G1888
3371B6169a20721n4454c6704E67O461b5891B4876N4466E98e2440G217L716C91
3357i5573m8677B6418J4740D465J8007h282j5357o6254A8815c0907i782b474l0825
$$ plain form
3344 -33299 48571 -32683 -4903 62196 -50213 -23245 63358 17286 34682 -72427 -773 -13101
3332 -13101 108801 -44279 -126424 67005 -15838 43843 -77858 -138358 -21654 15371 -3369 20434
3319 54647 6479 -18724 91603 97252 21365 -1191 -31172 -77185 33516 -22247 38258 13945
3306 60780 -114351 22043 662 -84171 56606 -52293 -116736 72092 -7512 -20171 -121143 -126151
3294 -126151 -38940 32774 -94895 42623 4577 -103138 63253 47682 50018 -40269 51639 -146981
3281 19890 -77264 33387 -36631 -135335 13897 -54700 -74604 -38429 -54333 17165 -35759 -5364
3268 -16449 -20757 -43942 -32084 36334 48056 34831 -5323 -24432 43830 -33679 -6899 -60901
3256 -60901 57006 -60958 46112 -39043 -133595 -89679 -7959 -13279 71136 -51842 72551 3248
$$ packed form
3344c3299D8571c2683d903F2196e0213b3245F3358A7286J7396g2427g73j2328
3332a3101A08801d4279q2145F7005a5838D3843g7858o0500b1654A5371c369B0434
3319E4647F479a8724I1603N649B1365a191k9981m6013C3516b2247C8258A3945
3306F0780a14351B2043F62h4171E6606e2293o4443G2092g512j2659j00972n008
3294a26151c8940C2774i4895D2623D577a03138F3253j5571K336d0269E1639a46981
3281A9890g7264C3387c6631r8704A3897e4700j9904L6175j5904A7165c5759e364
3268a6449m308k3185J1858C6334J1722j3225e323j9109D3830c3679f899n4002
3256f0901E7006f0958D6112c9043r4552M3916g959n320G1136e1842G2551C248
$$ plain form
3243 -24576 -112664 -20009 -38069 -13493 801 12268 2945 -15562 -9343 14263 53813 112834 -95938
3229 -40450 -39244 74133 -8179 -29903 54578 -2395 113105 95500 -108161 3634 60935 57974
3217 57974 -122635 -6865 -27670 64402 21706 82463 33985 -921 36794 40358 -497 -98640 2970
3203 -52916 -88720 -38306 8003 9076 -98908 -115789 -32009 -40274 74970 -45919 -6628 -139175
3191 -139175 -35496 -28593 -28197 -6633 -108727 -40477 38258 72780 -66060 155294 37441 -93902
3178 -118105 -103600 65515 -48937 -128131 -85112 -88745 11927 -49048 18566 29544 -36638 -31430
3166 -31430 -7112 30632 -88137 -84594 -107813 -117010 -51460 -140554 5607 -78815 12640 -2306 164856
3152 -47315 -94259 27288 -42268 -23648 -6409 -11863 79952 -48095 -45845 60335 85401 -125385
$$ packed form
3243b4576q8088b0009j8060a3493H01J1467B945a5562O219A4263L9550N9021i5938
3229d0450J206G4133h179k1724E4578b395A13105j7605a08161C634N7301k961
3217E7974a22635f865k0805F4402B1706O0757C3985i21C6794L564d97r8143B970
3203e2916l5804c8306H003J073i8908j6881c2009q265G4970d5919f628j32547
3191a39175c5496O903L96f633j02094d0477C8258L4522f6060A55294C7441i3902
3178a18105J4505F5515d8937p9194M3019l633A1927d9048A8566J0978c6638N208
3166c1430g112C0632h8137L543k3219r197e1460q9094E607g8815A2640b306A64856
3152d7315m6944B7288d2268J8620f409n454G9952d8095K250F0335K5066a25385
$$ plain form
3139 13288 -667 -70988 -42414 -7890 -1952 94918 -105725 -28924 35090 -4986 69494 -54678 -15823
3125 -13924 -89669 25667 123960 85231 44046 -77327 1765 132310 85642 28102 -103211 50382
3112 15228 9135 -28615 66136 -46660 37145 82263 -242814 33331 -48659 -159884 -34026 56751
3099 -103742 -10970 65377 -76031 -43408 -33399 -64358 -57475 2623 -29897 66205 53994 -70258
3086 -32784 3980 -63396 -70825 -21808 47597 -34484 50346 -136605 -57639 -44405 -15383 -52368
3074 -52368 63609 -4485 171607 97131 -45471 -98110 107225 -78920 -50317 73145 -103673
3062 65000 -63413 -106147 37433 -66003 42477 -265 -55113 -53765 -104465 -2752 -99651 89361 35968
3048 -3779 -50513 104688 36308 -66453 -67020 -52748 -9458 -92421 12225 -49275 63645 29865
$$ packed form
3139A3288f67p0321K8574g890a952I4918a05725b8924C5090d986F9494e4678a5823
3125a3924p5745B5667R8293l8729m1185g7327A765J30545m6668B8102a03211E0382
3112A5228o093b8615F6136d6660C7145M5118b42814C3331d8659j11225c4026E6751
3099a03742a0970F5377g6031L2623J0009l0959O883B623b9897F6205j2211g0258
3086c2784C980f3396p429b1808D7597c4484E0346a36605e7639J3234a5383l6985
3074e2368F3609d485A71607p4476d5471n2639A07225g8920K8603G3145a03673
3062F5000f3413m2734C7433f6003D2477b65n4848J348n0700b752r6899H9361C5968
3048c779m6734A04688C6308f6453n67J4272i458q2963A2225d9275F3645B9865
$$ plain form
3035 -53383 -3568 -57601 71601 11624 -112826 -8330 -1135 -7402 -32054 -103343 3509 -18385 19297
3021 -48526 -44751 -61982 -101647 60912 -90528 -49474 -25602 -3197 76091 -50078 55977 -44703
3008 -18265 74434 1143 70397 37506 -7164 78175 -8970 96595 -53421 -28232 15118 -149222
2995 -95609 -38476 41658 -104219 -25002 -24639 -138477 -2809 55198 -13156 -62613 -46992 -118734
2983 -118734 115538 14117 -91459 1673 68068 126537 2802 -36610 6268 -29715 -102900 11146
2970 -44364 -42287 -26584 -123392 -133979 14831 -5600 -48011 -17784 -41519 -108840 17659 45173
2958 45173 59593 236 8303 -41290 -101471 11526 82073 -118856 -47955 -105137 1925 113583
2946 113583 24917 21020 38215 -51853 -48364 20972 107162 24902 -25169 26407 -42679 109347
$$ packed form
3035e3383c568n4033G1601A1624a12826h330a135o267k4652p1289C509a8385A9297
3021d8526L775j7231l9665F0912i0528M1054K3872c197G6091e0078E5977d4703
3008a8265G4434A143O9254l2891g164G8175h970I6595e3421K5189A5118a49222
2995i5609c8476D1658a04219b5002L63j13838b809E5198a3156m9457J5621p1742
2983a18734A15538A4117i1459A673O6395N8469B802c6610F268b9715p3185A1146
2970d4364K077J5703r6808j0587A4831e600m2411a7784k3735o7321A7659K7514
2958D5173J4420B36Q067d1290o0181A1526P0547a18856d7955n7182A925J11658
2946A13583B4917l897J7195e1853L489B0972Q6190B4902b5169B6407d2679A09347
$$ plain form
2933 -66347 26839 -68447 -67355 20731 -11802 -1903 -53501 -102992 40631 -154577 -751 -9339 48
2919 45068 -66433 172954 20334 829 24467 73652 -10635 47718 -63597 -14668 -72857 10617
2906 27714 893 39165 -121789 -114041 -2433 65260 -78335 -80729 8995 83578 60721 -2331 -17065
2893 -17065 -9398 36659 -47813 -83872 55436 -8138 -113508 -27804 -38845 -44682 -63733 51811
2880 89245 -98527 31176 58769 -35004 30415 -98575 -2704 9926 -64039 -20119 -64611 29366
2867 -13653 -44938 -32868 -85259 -14051 26649 -34933 -94188 40263 34276 16038 -58057 -9381
2854 -71472 79168 7980 33976 -41550 -68293 6626 -75253 -48593 -28333 -256352 -32566 -23379
2842 -23379 73985 152649 -79662 55750 -112438 -51631 -22771 45880 -32809 -36312 -10218 -105981
$$ packed form
2933f6347B6839f8447J092B0731a1802a903n1598m9491D0631a54577g51q588D8
2919D5068f6433A72954B0334H29K3638M9185a0635D7718f3597a4668n8189A0617
2906B7714H93L8272a21789P748b433F5260g8335k394H995P4583k2857b331j4734
2893a7065P667C6659d7813l6059E5436h138j05370b7804j1041n837j9051E1811
2880H9245i8527C1176K7593c5004C0415i8575b704I926f4039b0119m4492B9366
2867a3653l1285J2070n2391a4051B6649c4933n9255D0263n987A6038e8057i381
2854g1472G9168G980K5996d1550k6743F626g5253K6660K0260k28019c2566R187
2842b3379G3985P8664g9662E5750a12438e1631b2771D5880c2809l503a0218r5763
$$ plain form
2830 -105981 -122203 -13782 8999 -47220 -2774 36816 101771 -20619 -120360 -14400 -46483 -24722
2818 -24722 -59789 -107235 -45407 25919 -13399 46174 -23915 63970 -168484 -38557 -51442 -49833
2806 -49833 47846 61618 -66555 16654 -37546 29029 35593 -28536 -151086 -13668 58682 49030
2794 49030 -130788 118019 63251 25634 -109029 -24567 -51046 15178 34820 -102816 -116198
2783 -116198 73583 -44416 39798 35367 38153 19355 -30318 -126853 -18423 -3358 -131048 43262
2770 -53775 -37594 124198 23298 -92306 35551 -136309 11187 1046 -95357 29780 37217 -60120
2757 -100550 43697 -91971 -21866 112561 -18178 25840 -22725 21102 -133440 -26638 137226
2745 -18457 -30650 8360 13745 -9719 29469 -12978 -75428 -114813 -125842 -12530 54300 -7438 -38378
$$ packed form
2830a05981j6222a3782H999d7220b774C6816O4955b0619r9741a4400l2083K1761
2818b4722l5067m7446d5407B5919a3399D6174b3915F3970a68484c8557j2885J609
2806d9833D7846J3772f6555A6654c7546B9029O564b8536j22550a3668E8682r652
2794D9030a30788A18019n4768B5634a09029b4567k6479A5178J9642a02816j3382
2783a16198G3583d4416C9798m431K786j8798c0318r6535a8423c358j27690D3262
2770e3775J6181A24198B3298i2306C5551a36309A1187A046i5357B9780P437f0120
2757a00550D3697i1971b1866A12561a8178B5840b2725B1102a33440b6638A37226
2745a8457j2193H360N385i719B9469a2978o2450l9385j1029a2530E4300g438l0940
$$ plain form
2732 -38378 -76278 21539 -51229 -77536 -677 -58773 -2144 -82797 71234 86672 110275 -78724
2719 -7861 -148413 40416 55897 -35904 52023 50716 22339 -14234 -5250 7490 -12267 19188
2706 13618 -121920 -107350 -44666 -35079 177185 31580 -46827 43106 -50817 -29862 -162817
2695 -162817 78052 22622 -196762 20187 4637 -7159 -88954 -14200 -77460 -55680 16429 -83128
2682 16545 -17747 108597 63335 -67011 -32589 -97502 -20630 12394 -76673 36927 -110782
2670 141915 -15206 -113042 -173935 -19488 -68797 -124167 -54838 -59158 -144105 67551 -96700 27234
2657 41502 -83945 -7642 148113 -26463 -16698 25360 129961 -1317 5123 -189518 -4550 73761
2644 -53656 -41859 -1336 -54260 -23048 10837 -31309 124464 80015 -11705 6363 -125032 2604
$$ packed form
2732c8378l7900B1539e1229k6307f77n8096b144q0653G1234J5438K3603g8724
2719g861j40552D0416J5481c5904E2023j307B2339a4234e250G490a2267A9188
2706A3618a21920J4570d4666R587A77185C1580d6827D3106e0817K0955j32955
2695a62817G8052B2622a96762B0187D637g159q1795a4200o3260K1780A6429h3128
2682A6545a7747A08597m5262f7011c2589o4913b0630A2394g6673C6927a10782
2670A41915a5206r7836o0893a9488m9309n5370e4838m320q4947F7551i6700B7234
2657D1502h3945g642A48113b6463R765B5360J04601a317E123a89518d550G3761
2644e3656J1797a336n2924b3048A0837c1309A24464m4449a1705F363a25032B604
$$ plain form
2631 -88447 -49432 -74192 -9810 31674 -21790 69742 -20280 -116862 -11633 81609 -58960 -85456
2619 -85456 -45808 -16645 37576 28252 23036 -169964 -61350 -45892 -52803 -5349 50145 -105776
2606 -43455 -94866 -96687 72907 -160122 -51898 -1210 -4424 -66882 98652 -80167 176842 -8785
2593 12846 5986 18770 66391 -71031 -147699 109887 -43247 -7273 -123409 179601 -73830 24892
2580 25991 -86381 -84076 -42094 -78288 94600 -162001 -133358 96877 -84984 -14809 -53663 27140
2567 -27918 -32202 35210 -104806 -40927 -48971 5854 23598 8991 -10833 1362 94266 98773 -97847
2553 -37242 125439 20405 -61623 39941 66471 83169 18935 32773 -46252 -57118 35016 -12819
2540 3679 -13211 105384 34304 70865 -77739 -139755 -26051 76906 10261 -4698 707 -53386
$$ packed form
2631h8447L9015k4760i810C1674b1790F9742b0280r6582a1633H1609e8960k6496
2619h5456L9648a6645C7576r324n216a69964f1350J5458o911e349E0145a05776
2606d3455n1411j821G2907a60122e1898a210l214o2458I8652h0167A76842h785
2593A2846E986J2784M7621g1031p6668A09887d3247g273j16136A79601g3830B4892
2580B5991h6381K305M1982l6194I4600a62001K8643I6877h4984a4809l8854B7140
2567b7918m284C5210a04806d0927q044E854J7744H991a0833A362R2904M507i7847
2553c7242A25439B0405f1623C9941K6530J6698A8935J3838d6252j0866C5016a2819
2540C679a3211A05384C4304L6561g7739o2016b6051G6906A0261d698G07e3386
$$ plain form
2527 -68473 -19920 -72078 82602 68139 43016 -34095 35690 11543 -63666 94706 -60058 -39303
2515 -39303 -22364 37027 -100523 12444 -110652 -6389 -89884 1754 -44393 -72567 -1093 -23896
2503 -23896 -28543 -187825 33057 8134 -130694 -57363 3239 -19380 -63352 -18648 -52026 20619
2490 7776 -105969 -35357 587 -34908 64257 38367 -52996 -56610 -39082 -40061 -97357 -118826 -49166
2476 71516 -65814 62621 20633 -8804 52174 36034 4102 46987 -16135 -9902 -15995 41918 33433
2463 33433 31150 684 -67834 127772 101812 -98069 -5996 28267 65145 -5730 101496 -46441
2450 -96685 -7509 -26990 -41483 77833 35413 -31020 -56290 9565 -11748 -34510 -20700 -84133
2438 -84133 -64964 42523 32632 42919 -84411 48864 -108861 -85165 -108272 39394 -36790 8318
$$ packed form
2527f8473a9920n2158H2602j4463k5123c4095C5690A1543f3666I4706f0058K0755
2515c9303J6939C7027a00523A2444a10652f389q3495A754d4393k8174a093k2803
2503b3896m647j59282C3057H134a30694e7363C239a9380m3972a8648l3378B0619
2490G776a05969c5357E87c4908F4257k5890e2996l614J7528r79n7296k1469d9166
2476G1516f5814F2621B0633h804E2174j6140D102M2885a6135O233o093D1918q485
2463C3433k283F84f7834A27772k5960i8069e996B8267L6878e730A01496d6441
2450i6685g509j9481j4493G7833C5413c1020k5270I565a1748k2762J3810o3433
2438h4133J9169D2523r891J0287h4411D8864a08861K3696k3107C9394c6790H318
$$ plain form
2425 -8817 -10690 -169878 110068 58179 -17425 -5654 -53346 -15687 -77250 -16285 -33483 31904
2412 -115484 64937 -12403 23982 -48593 -37488 88500 -44597 -108774 -95902 -69410 10040 34057
2400 34057 8936 -35764 -130774 4970 63884 31773 -55285 -67266 -104457 -74395 56048 -64823
2387 -66009 -59358 -164751 -57719 -39141 35966 32812 50679 -14125 26827 -23262 -50567 -70603
2375 -70603 -42755 26275 32717 57371 72482 70630 -82849 -45617 127219 38943 -18324 21045
2362 67350 25114 -3911 93553 -76531 52621 15951 67872 13602 11448 -81118 113428 84554
2350 84554 -28514 -21788 -54106 -50434 171881 -45227 -136406 45647 -79294 52756 -78512 51312
2337 20170 -95937 77390 -39303 -78881 -81405 -23551 -34856 -32491 -80886 32428 -13558 5469
$$ packed form
2425h817j873j59188A10068n1889a7425e654m7692a5687o1563a6285j7198C1904
2412a15484F4937a2403B3982d8593J1105H8500d4597o4177J2872K6492A0040K4017
2400C4057H936c5764r5010D970N8914C1773e5285j1981l7191L0062E6048f4823
2387f6009O651j05393e7719J8578C5966l154J7867a4125B6827b3262k7305k0036
2375g0603K7848B6275O442K4654J5111j852h2849L7232A27219C8943a8324B1045
2362F7350B5114c911I3553g6531E2621A5951N1921A3602k154h1118A13428k8874
2350H4554b8514O726l2318L672A71881d5227r1179D5647g9294E2756g8512E1312
2337B0170i5937G7390c9303l9578k524b3551j1305K365m8395C2428a3558E469
$$ plain form
2324 -30761 131089 -39985 -17841 -150442 -8168 37069 11846 102608 -28783 79880 145221 76694
2312 76694 -67696 37172 -138494 38833 -99398 45135 93885 66604 -58272 -111258 -76107 -59896
2300 -59896 -9869 -10315 47778 48788 -41027 -92917 -136759 2508 -4896 92166 -6718 -2265 96157
2286 52101 -171182 -56134 -32324 -46279 -8876 -43249 -75926 -17854 24187 -91672 -135483 -21558
2273 29692 39045 51852 -167614 19007 -92130 -7543 -42465 31619 32780 -19795 94119 96432
2261 96432 41076 38289 8236 57990 8479 -26056 46718 -7473 -47452 -101788 128110 48345
2248 -39035 5605 1661 -75625 -89054 45579 -87495 41331 -181157 -38873 108694 53027 -15185
2235 -12684 -72663 -63208 -10915 -14978 -84202 -119555 93780 108411 -90160 -155659 -14256 -29423
$$ packed form
2324c0761A31089c9985a7841j32601h168C7069A1846R0762b8783G9880O5341o8527
2312G6694f7696C7172a38494C8833i9398D5135M8750k7281e8272n2986L5151J6211
2300e9896i869m46D7778J010d1027n1890m3842B508d896I2166f718b265I6157
2286E2101a71182e6134K3810j3955h876l4373l2677a7854B4187i1672m3811b1558
2273B9692R353J2807a67614A9007i2130g543l4922C1619J161a9795I4119K313
2261I6432D1076k787H236M9754H479b6056D6718g473l9979n4336A28110D8345
2248c9035E605A661g5625j3429D5579h7495D1331a81157c8873A08694E3027a5185
2235a2684n9979R455a0915m063o9224l5353I3780J4631i0160o5499a4256j5167
$$ plain form
2223 -29423 -8028 18342 -94088 3804 -18042 -34994 -31482 -3026 -58644 -57025 116124 77671 118659
2210 118659 23120 -180608 -91258 44424 44282 26392 79041 -114655 82045 111533 -81308 41735
2197 40392 -75215 -43505 -93555 18947 72136 93 -42753 -10714 -45890 -68293 1190 -40016 -54758
2184 -54758 107801 35926 -24777 34083 18981 -97911 -12148 8387 -47296 89225 28631 24009
2172 24009 -84003 64335 -164048 -5690 23860 16703 -101647 54699 -38764 -39359 3223 104265
2160 104265 -142855 6084 -49902 41285 -79245 96651 -59853 71556 65698 120859 39815 -43201
2147 -60291 62751 29380 -36069 37254 -38053 44921 -113267 -32464 26636 38159 29672 4726
2134 35669 -41092 24278 -13832 7008 -70913 -73954 -202110 -10682 -25166 138563 52384 66938
$$ packed form
2223b9423h028A8342i4088C804a8042j6952L512c026n5618J619A16124l8453M0988
2210A18659B3120a80608Q9350D4424j42j7890N2649a14655H2045K9488h1308D1735
2197D0392g5215L1710n0050A8947N3189I3d2753a0714l5176k2403A190d0016j4742
2184e4758A07801C5926b4777C4083j5102i7911a2148H387d7296H9225B8631m622
2172B4009h4003F4335a64048e690B3860p157a01647E4699c8764n95C223J01042
2160A04265a42855F084d9902D1285g9245I6651e9853G1556n858N5161C9815d3201
2147f0291F2751B9380c6069C7254c8053D4921a13267c2464B6636J1523q487D726
2134C5669d1092B4278a3832G008g0913l041j28156a0682j4484A38563E2384J4554
$$ plain form
2122 66938 26060 -102680 -94810 48959 79293 42079 -27915 -76183 5784 -15198 -39241 -110570
2110 -110570 12598 53646 -29054 -79057 -124889 29193 -36967 -1328 51792 -64054 76720 -30807
2097 50927 -22726 -9899 -32969 -130856 -138520 -56402 -12218 -25317 -64413 90851 125490 17014
2084 47319 36445 82692 24555 46270 -24290 -39721 -15583 66570 55949 -83419 72422 -119119
2071 3747 -105689 -95360 -15482 -21452 -40766 36779 -17883 -60602 18174 -95251 -73795 -21870
2058 -23908 -70599 -8363 50187 44619 23708 -36696 105958 60667 -39455 -27782 -72984 -17944
2045 14190 -52058 -61798 -2374 78389 -97091 -23818 9023 37190 -88514 -128017 59808 -10584
2032 22173 -130405 -52787 45261 45110 -155061 95567 20187 90852 104062 -70542 12798 16818
$$ packed form
2122F6938B6060a02680P870D8959L0334l7214b7915m8268E784a5198k4043p1329
2110a10570A2598M1048b9054n0003m5832B9193c6967a328E1792f4054G6720c0807
2097E0927b2726i899k3070r7887p664e6402a2218j3099l9096I0851L4639A7014
2084D7319j0874M6247B4555K1715b4290j5431a5583F6570j0621h3419G2422a19119
2071C747a05689J0329a5482n970j9314C6779a7883m2719A8174i5251K1456b1870
2058b3908m6691h363E0187n568k0911c6696A05958m5291c9455J1673m5202a7944
2045A4190e2058r740b374G8389i7091b3818I023K8167h8514l9503E9808a0584
2032B2173a30405e2787D5261j51a55061I5567B0187P0665J3210g0542A2798M020
$$ plain form
2020 16818 -60337 -121174 10463 -76972 -2431 -12778 62227 49438 -64192 61176 38570 -18702
2007 27177 -18841 50735 36715 -6354 -34508 -59434 -43490 59593 119846 24504 78436 48066
1995 48066 -13701 102478 43215 -49257 -50137 -24855 -91734 -87008 64014 -13067 28543 45352
1983 45352 67173 -45667 -179783 -105822 24997 109806 -59610 -118862 -35211 -20592 -105612 -51495
1970 35863 45370 -24317 -141090 26224 -148869 -70197 -53167 -53893 -29491 -2063 -74634 -23601
1957 -27061 7620 -8328 -42662 -74422 106468 56654 95873 -23581 -78485 67634 -25427 -18653
1945 -18653 -21468 30935 -35802 -146229 -180566 -22923 -26973 -31413 100103 -43176 -12778 -8413
1933 -8413 -54718 -21551 -1267 64339 158951 -68060 -11942 64272 -14637 -19612 -28353 32644 -48016
$$ packed form
2020A6818f0337o0837A0463g6972b431j0347F2227j2789f4192F1176k2606a8702
2007B7177a8841E0735j4020f354k8154k4926J5944E9593O0253B4504N3932l0370
1995D8066a3701A02478D3215d9257q80b4855o6879M726F4014a3067B8543J6809
1983D5352K1821d5667j34116P3961B4997Q4809e9610n9252c5211J4619q5020e1495
1970C5863R507b4317j16773B6224a48869g0197J7030p26K4402b063p2571b3601
1957b7061G620h328l4334l1760A06468m9814L9219b3581n4904F7634b5427O774
1945a8653k815C0935c5802j10427l4337b2923m050m440A00103d3176a2778M365
1933h413m6305b1551a267F4339R4612f8060a1942F4272a4637m975q741C2644d8016
$$ plain form
1919 72261 102787 -28378 -99599 -2692 -15107 -110693 -29537 -76617 -85081 -22468 -138462 -8746
1906 82554 -91119 19280 5858 -11602 -86270 -120311 -95897 53672 -932 -12865 -66569 -38270
1894 -38270 -118535 102118 105806 -26989 67248 25387 26193 164078 32812 -50468 -87902 -60882
1882 -60882 -74128 63615 -88388 46768 -3710 64842 -49423 -46474 3313 -84223 -97388 -95824 52326
1868 61242 -34853 57761 -12482 -63517 -57809 100584 -9681 -25230 -2551 38379 -34395 -44635
1856 -44635 -91910 43877 35307 -49150 36684 -16235 -179868 105391 3677 57486 -16376 -8143
1843 -33853 -48653 14745 -1795 52942 -44226 36303 82549 34240 -7124 81096 -16402 -28624
1831 -28624 -22497 -28995 -9681 -115181 -16595 -64642 -67529 689 -52753 -98390 -40217 -50779 147450
$$ packed form
1919G2261L0526b8378p1221b692j2415r5586b9537m7080q464b2468j15994h746
1906H2554i1119A9280E858a1602p4668l4041K4414E3672i32j1933n3704K8299
1894c8270q0265A02118L688b6989F7248B5387Q06J37885C2812e0468l7434K7020
1882f0882j3246F3615h8388D6768c710F4842d9423K949C313h4223j3165J564E2326
1868F1242c4853E7761a2482n1035N708A00584i681j5549b551C8379c4395j0240
1856d4635m7275D3877q570d9150C6684a6235j63633A05391C677N3809a6376h143
1843c3853j4800A4745a795E2942d4226C6303M6246C4240g124H1096a6402j2222
1831b8624O127o498i681j05500a6595m8047k887F89e2753m5637d0217j0562A47450
$$ plain form
1817 36090 44798 17479 53971 -40787 77845 -93796 73364 -1913 31726 -42825 19409 132924
1805 132924 125957 -34759 13500 -6750 121028 -12086 44536 -115645 73981 90703 -6235 -40086
1793 -40086 -24372 -17881 24292 -757 67910 100091 -20825 -115360 123126 -18212 -4656 39152
1780 35325 -180348 -116595 54271 6957 -23523 -68527 -21035 27478 -1793 81193 16175 13814
1768 13814 66982 35528 41854 -22531 -2247 -86006 -1420 21441 22742 111051 -16332 13825 86757
1755 86757 25824 75104 -19716 87472 -113468 87189 -132946 -38289 -67999 -53583 -55302 -46440
1743 -46440 -57375 -38150 43402 -51334 30704 -1233 -49132 -27991 -1543 -158854 40632 70820
1731 70820 -40042 -95907 59137 -58905 10176 -119094 -59470 -169631 13718 83147 17908
$$ packed form
1817C6090Q708A7479L6492d0787G7845i3796G3364a913C1726d2825A9409J13515
1805A32924o967c4759A3500f750A21028a2086D4536a15645G3981J6722f235l3851
1793d0086J5714O491B4292g57F7910L2181b0825r4535A23126a8212d656C9152
1780C5325a80348O3753E4271F957b3523m5004b1035B7478a793H1193A6175k361
1768A3814N3168l1454O326b2531b247q3759a420B1441J301Q8309a6332A3825P2932
1755H6757B5824M9280a9716H7472a13468H7189a32946c8289k9710J4416j719Q862
1743d6440j0935J9225D3402e1334C0704a233m7899K1141a543j57311D0632L0188
1731G0820d0042n5865E9137e8905A0176a19094e9470j10161A3718O9429A7908
$$ plain form
1719 -121347 -8193 111337 125270 17244 -37671 1829 2429 18397 -102874 -63659 -139535 -11694
1706 -36062 -101790 65794 -34046 100746 7608 69499 -124305 3973 30176 16126 -107469 86139
1693 14329 5248 146834 13572 12302 -149935 5836 -4116 51282 37203 -11005 4214 -103255
1680 -45760 -34882 31732 -118736 41174 -34490 -74762 14879 61130 -56877 127449 43358
1668 42426 -15410 -5736 39579 -60138 -159608 -36572 -26806 46247 -53607 -9141 -26552 -78126
1656 -78126 -47700 27221 -84773 58581 -82178 40791 -11534 -24836 5780 136855 11152 -14922
1643 -173427 35423 -56 104145 14471 57825 55403 -39882 -125304 7221 -60429 -9217 -56435 -33156
1630 -33156 -65571 112623 -9526 44060 -3246 97874 23168 -32493 23841 22480 -87406 52988
$$ packed form
1719a21347h193A11337J3933A7244c7671A829O00J5968a02874L9215p5876a1694
1706c6062o5728F5794c4046A00746G608O1891a24305C973K6203j4050a07469H6139
1693A4329E248J41586A3572j270a49935E836d116E1282j4079a1005D214a03255
1680d5760J0878C1732a18736D1174c4490m0272A4879M6251e6877A27449D3358
1668D2426a5410e736C9579f0138r9470c6572R766D6247e3607i141j7411n1574
1656g8126L0426B7221h4773E8581h2178D0791a1534j3302E780J31075A1152a4922
1643a73427C5423e6A04145A4471M3354k422c9882q5422G221f0429i217m7218K3279
1630c3156l2415A12623i526D4060c246I7874B3168c2493B3841j361h7406E2988
$$ plain form
1617 -21086 -61739 -13267 -68863 -77852 -85932 -70280 -63873 14737 83210 -100314 29085 5043
1604 1312 53769 -78331 28466 -54104 5672 -170183 -58660 11327 81537 -89018 78796 10112
1591 -85667 6183 -66578 70385 96024 17036 -84541 27575 -57079 -126951 -149672 -32484 -26093
1579 -26093 49923 -84626 29809 -19041 -87933 -24221 -18612 40119 -33083 -103161 21955 -23862
1566 70639 -1143 -143695 -86389 -29334 35655 -20743 28337 -21295 -16285 69301 -19440 -16927
1554 -16927 -18194 -8690 40768 -3048 27920 31391 -95940 -59149 -10001 64963 -31140 -22288 -108310
1541 -108310 31995 -20326 23088 131061 87733 -28290 49166 25129 -8126 -75436 -54136 141263
1528 149685 -117885 -19580 -20401 -81646 16469 -7471 -20191 -75024 -28298 -14568 54774 -27369
$$ packed form
1617b1086m0653a3267n5596q989q080J5652O407A4737O8473a00314B9085E043
1604A312N2457g8331B8466e4104E672a70183e8660A1327P0210h9018G8796A0112
1591h5667F183f6578G0385K5639A7036h4541B7575e7079o9872k2721c2484O391
1579b6093D9923h4626B9809a9041o8892b4221N609D0119c3083p0078B1955b3862
1566G0639a143j42552N7306b9334C5655b0743B8337b1295N010F9301a9440K513
1554a6927j267h690D0768c048B7920L471i5940L6791a0001F4963c1140Q852q6022
1541a08310C1995b0326B3088J07973m3328b8290D9166k4037h126o7310K1300A41263
1528A49685a17885a9580q21o1245A6469g471j2720n4833b8298J3730E4774b7369
$$ plain form
1515 32309 -93408 -38107 10678 18968 2804 -99097 92820 211740 141557 51033 -56889 -56754
1503 -56754 -101456 -20572 -68734 55619 34070 -97045 100383 17154 7003 -14457 131529 157096
1491 157096 66443 33056 -6879 71800 -30322 -17265 -60264 80139 -68425 -44490 134028 77607
1479 77607 -33198 -115780 -968 81160 73894 103350 -6235 -28398 29137 -20757 -14300 -125748 10854
1465 14126 11306 158228 61509 -60340 72897 -78583 -37733 -26993 27634 -107472 -167204 17114
1452 -69722 9848 2531 -20815 -48263 -81666 71259 -25682 10065 -151291 -24978 -53536 179938
1439 -28029 64432 -34757 -40087 99021 -74507 39872 -19676 50424 -33982 17476 -6568 -29135
1427 -29135 -51946 29508 -71174 111614 27020 82447 -58211 1243 46763 43277 -60903 37137
$$ packed form
1515C2309i3408c8107A0678Q290B804i9097I2820J18920p0183E1033e6889J35
1503e6754m4702b0572m8162E5619k1549i7045A00383A7154G003a4457A31529K5567
1491A57096F6443C3056f879G1800c0322J3057m2999H0139f8425K3935A34028n6421
1479G7607c3198q2582i68H1160p266K9456f235k2163B9137b0757O457j11448A0854
1465A4126k820J46922F1509f0340G2897g8583c7733J0740B7634a07472n9732A7114
1452f9722I848B531b0815k7448l3403G1259b5682A0065a51291b4978k8558A79938
1439b8029F4432c4757n330I9021g4507C9872a9676E0424c3982A7476f568k2567
1427b9135k2811B9508g1174A11614B7020N5427e8211A243M5520l486f0903C7137
$$ plain form
1414 64382 65595 -31161 -81963 50706 -85216 51590 -44389 144658 -152174 50688 -117761
1402 -29665 -28360 69672 -113855 -76717 -45017 -20663 136466 -38583 34460 -112117 55559
1390 63037 -16333 -5682 53639 5148 -72799 -4014 67411 -25122 -4840 3158 -88373 -2640 -7480
1377 -7480 -21757 -22095 45258 -73329 69139 87063 -23719 -100909 -50855 54850 -97419 28051
1364 -151875 44554 101215 -170487 15180 1254 71025 19982 125358 63698 -60166 58477
1352 10140 -34425 141739 -38094 -11944 86980 -16666 13340 -12426 -31552 45074 46645 -8583
1339 -104143 44991 -159942 -90241 -22615 45967 27868 59468 56681 -11419 24499 -1071 -124179
1327 -124179 -111893 46755 115820 7720 -89718 -39621 28148 -54882 53897 -66822 145804 19633
$$ packed form
1414F4382J213c1161n0802E0706h5216E1590d4389A44658a52174E0688a17761
1402b9665J305F9672a13855L7138L1700b0663A36466c8583C4460a12117E5559
1390F3037a6333e682E3639E148g2799d014F7411b5122d840C158h8373b640m840
1377g480j4277l38D5258g3329F9139J7924b3719p7190N0054E4850i7419B8051
1364a51875D4554N6661a70487A5180A254O9771A9982J05376o1660f0166E8477
1352A0140c4425A41739c8094a1944H6980a6666A3340a2426j9126D5074J571h583
1339a04143D4991a59942O9701b2615D5967j8099L1600k787a1419B4499a071j23108
1327a24179J2286D6755O9065G720h9718c9621B8148e4882E3897f6822A45804A9633
$$ plain form
1314 -28638 35140 27365 131243 47184 -59635 -78419 117786 56378 -30461 -89667 85012 -13517
1301 1887 81248 46418 -7912 66447 54771 -86140 58055 47804 -4869 -89733 -12363 94078
1288 -66771 -107505 -38675 44053 -9472 134027 -27759 84041 51068 29548 67370 203608 45848
1275 6332 -37042 22795 -79820 26747 -12409 16782 12508 -55309 18037 -90274 -48032 -57362
1263 -57362 69771 -50101 -28014 -6012 29843 113216 14657 92962 -66143 19408 9338 -2178
1250 -126960 -40108 -178987 -74776 -61186 87541 36338 64221 -74581 8449 -111495 40891
1238 -29869 28037 38267 30081 94310 66619 -18652 6902 9435 -65071 -11565 23347 -155508
1225 -97028 48789 -97142 -56196 -15844 -32375 -46479 -1981 -185317 60672 -45971 -13220 -2032
$$ packed form
1314b8638C5140p775J03878D7184e9635j8784A17786E6378c0461n9206H5012a3517
1301A887P9361l4830g912F6447j1676h6140E8055j0251d869q4864a2363I4078
1288f6771m0734c8675D4053i472A34027b7759H4041l2973k1520L7822J36238D5848
1275F332c7042B2795g9820B6747a2409A6782m274e5309A8037i0274M2242r330
1263e7362F9771e0101K2087f012B9843Q3373A4657P8305f6143A9408I338b178
1250a26960d0108j38879g4776J3590H7541C6338K7883g4581H449a11495D0891
1238b9869B8037J0230q186O4229k7691a8652F902K533f5071a1565B3347a55508
1225i7028D8789i7142M0946a5844j6531j4104a981j83336F0672d5971a3220b032
$$ plain form
1212 15267 27759 -63514 -5267 60383 -51625 -11908 59451 -16881 -12587 -126757 -82175 -12460
1199 -14070 -39741 -36910 -6267 127095 72193 -55617 -27874 -141001 13873 -86992 -14411 24673
1186 -69278 -2997 61561 5755 45399 -69890 -14853 44574 29269 142800 -40649 9141 -25964
1173 64058 19722 56518 29403 21510 -48078 74815 76182 82962 69959 -41732 -27910 -13589
1160 27715 38356 40285 13416 69204 -46803 -76456 40700 -77669 63336 156091 -40514 66430
1147 84780 -42089 42412 -47996 -17436 -64178 5278 3774 39646 139196 18941 20732 32637
1135 32637 -58339 10438 -105710 4647 104335 -20484 80388 -13159 69145 114663 -103831 73094
1122 26522 -91387 10186 -20883 37081 -99139 -60811 -31493 -44964 57635 43390 -39801 -62419
$$ packed form
1212A5267J2492f3514e267F0383e1625a1908E9451a6881M294j14170M4582a2460
1199a4070k5671K831f267A27095n4902e5617K7743j13127A3873h6992a4411B4673
1186f9278b997F1561E755L9644f9890a4853D4574j5305J13531d0649I141b5964
1173F4058A9722L6796k7115p893d8078G4815J367O780j3003d1732J3822a3589
1160B7715J0641J929A3416N5788d6803k9653D0700g7669F3336R2755d0514F6430
1147H4780d2089D2412d7996a7436m6742E278j504L5872R9550A8941J791J1905
1135C2637e8339A0438a05710D647R9688b0484H0388a3159F9145M5518a03831G3094
1122B6522i1387A0186b0883C7081i9139L8328K9318j3471E7635j4245c9801k2618
$$ plain form
1110 -62419 31517 -61222 -13746 -79350 87924 3474 62045 -50585 87586 135078 -103221 -64403
1098 -64403 -69480 81119 -110105 -61106 -43730 6221 186595 102374 51249 27700 -39335 5504
1085 127933 -39429 110773 72418 -16735 -116147 -13450 25648 -11083 50536 -45682 105144
1073 61716 -118603 -36523 -40595 -60529 -20204 -1700 43834 15719 -35867 -38334 172932 -29751
1060 -62404 16165 -32602 -39110 81255 -97223 -64670 59100 -107784 -26406 -56084 -37145 -27675
1048 -27675 -45978 -75054 5438 -10623 81354 7740 944 66904 -23391 29740 12575 -25079 -2080
1034 86684 -4531 -11493 26591 -52526 39429 -153291 -68746 120208 9784 6791 10083 -46677
1021 13214 40796 16166 1787 20603 126857 140214 49790 106019 -2094 9698 -74165 -35451
$$ packed form
1110f2419C1517f1222a3746o5604H7924C474N8571e0585H7586M7492a03221L8818
1098f4403n077H1119a10105M8999J7376F221J80374q4221n1125k3549c9335E504
1085A27933c9429A10773l8355a6735r9412a3450B5648a1083E0536d5682A05144
1073F1716a18603c6523m072j9934b0204a700D3834A5719c5867k467A72932b9751
1060f2404A6165c2602o508H1255i7223L2553E9100a07784b6406k9678J8939R470
1048b7675j8303k9076E438a0623H1354G740I44O5960b3391B9740A2575b5079b080
1034H6684d531o962B6591e2526C9429a53291f8746A20208I784k993L292d6677
1021A3214K7582A6166A787J8816J06254J3357D9790N6229b094I698g4165c5451
$$ plain form
1008 151757 -2761 1077 -61594 -65467 50761 -331 9644 -27494 -80052 -86903 -25668 10228 12488
995 12488 18378 -5381 -34984 -7019 -122919 -26106 13503 -59 37343 -46316 -24329 -14517 45697
981 -14850 -50068 11682 39065 4785 53429 -39645 -47863 14600 150446 19050 -5826 -50042
969 -50042 -83956 49421 20668 -72903 -65092 2484 -47744 98831 66101 -12359 -50787 45074
956 70722 -17792 85280 45811 -24401 90669 -5004 -20394 34005 43161 31387 56417 112733
944 112733 48851 84864 54329 -41816 -20812 -126731 -21450 -91850 83028 39210 -166401
932 66833 121096 -176717 -48863 -29202 -2714 98157 52041 -29229 -62477 24947 108089 43724
919 -7010 57978 46684 -32193 74995 -74619 104817 829 17317 -12281 33813 84244 -10811
$$ packed form
1008A51757b761A077f1594l873E0761c31I644b7494n2558o851b5668A0228K260
995A2488N890e381k9603g019j15900b6106A3503e9C7343d6316K1987R812D5697
981a4850l5218A1682K7383D785M8644c9645q218A4600J35846A9050e826m4216
969e0042l3914D9421B0668g2903P811B484d7744I8831l2730a2359l8428D5074
956G0722a7792H5280l9469b4401I0669e004j5390C4005R156j1774K5030N6316
944A12733D8851L6013l0535d1816b0812j05919b1450p0400H3028C9210a66401
932F6833N4263a76717d8863J9661b714I8157m6116b9229l3248B4947Q3142D3724
919g010E7978j1294c2193G4995g4619A04817H29J6488a2281C3813N0431a0811
$$ plain form
906 -83329 17603 -56840 -107604 -29923 4221 61984 8319 -70068 -56068 23536 21809 63986 -52098
892 -6348 49882 43665 12763 45436 64145 28712 1634 -93866 25864 -44661 2635 18538 74184
879 74184 66205 -18968 61272 28824 -7996 -42373 -36879 -83897 28314 94526 -2109 -44881 96380
865 -26482 -66536 -44945 -64848 110786 19990 80064 -30271 113476 73172 12551 -20411 48704
852 -38757 54727 -46497 19201 54290 -90050 -42935 214153 68503 16203 -45763 -49609 69080
839 -168252 -43436 -86862 37593 -64262 74835 22778 47395 60082 92457 -28072 -18667 11756
826 6964 20965 24969 49125 117843 40769 55791 -24786 -16934 -112079 75420 -147473 25606
813 83253 2132 -23701 73736 35194 -77836 -14517 5304 7457 -36496 -7121 12300 -64285 -72843
$$ packed form
906h3329A7603e6840n0764b9923D221N7763H319g0068J4000B3536j727M2177e2098
892f348D9882o217A2763L2673J8709B8712A634i3866B5864d4661B635J5903N5646
879G4184p979a8968F1272B8824g996l4377N494m7018B8314O6212b109m2772I6380
865b6482m0054K1591j9903A10786A9990O0074c0271A13476m0304A2551b0411D8704
852c8757E4727d6497A9201L5089i0050d2935B14153F8503A6203d5763l846F9080
839a68252d3436m3426C7593f4262G4835B2778K4617J2687L2375b8072R405A1756
826F964J4001M004K4156O8718D0769J5022b4786P852r5145G5420a47473B5606
813H3253B132b3701G3736C5194g7836a4517E304K153c6496g121A2300f4285q558
$$ plain form
800 -72843 43690 -96758 33381 -84039 19984 -104182 26938 68335 30297 26466 -20019 59497
787 15319 71045 -166678 -36216 33680 51721 -183081 11563 -92309 45129 23349 10739 -4781
774 -19708 -74829 97247 5583 42169 -80369 -34590 38164 96157 -8122 4325 -5930 15191 -26659
760 70847 -72810 119629 -11162 114926 63083 22612 -59917 -145050 -21104 -48439 27614 50574
748 50574 -20128 12071 98677 -14605 -10723 48680 -35278 77512 8800 -4438 9187 62272 -50210
734 20842 74187 -39278 21915 -62359 -25884 35253 -30593 -31963 -2204 -9328 94262 -11172 -60904
721 -60904 92629 29554 -29279 -31694 66159 130038 28537 -72973 -33832 -20003 8862 71449
709 71449 19329 33225 -21772 35556 -28665 155367 42683 1220 116558 -31723 -8810 31702
$$ packed form
800g2843D3690i6758C3381h4039A9984a04182B6938M1397C0297l831b0019E9497
787A5319N5726a66678c6216C3680J8041a83081A1563i2309D5129k1780A0739d781
774a9708n5121I7247E583L6586h0369c4590C8164N7993h122D325e930A5191b6659
760G0847g2810A19629a1162A14926n1843B2612e9917q5133b1104k7335B7614K2960
748E0574b0128A2071Q6606a4605L882D8680c5278G7512H800d438I187N3085e0210
734B0842N3345c9278B1915f2359b5884C5253c0593j370b204p124I4262a1172m9732
721f0904I2629B9554b9279k415F6159O3879B8537g2973c3832J3829H862O2587
709G1449A9329J3896b1772C5556b8665A55367D2683A220J15338c1723h810C1702
$$ plain form
696 -53883 16225 -63221 -111395 -6258 78859 41154 -102806 17832 4443 -78401 -16100 59246
683 -29782 71608 -6643 -54897 -134745 6604 -13755 199167 23470 -38456 46980 100573 -40502
670 -1352 -46968 -28726 64807 19455 41514 34795 -42294 -57929 -60055 -43204 29582 -70856 111761
656 14763 92895 33853 107497 91003 60373 148573 42487 19475 97040 -8926 -11387 83581
643 -100641 17587 30549 -129556 122008 130565 -120225 74044 -12156 709 -2440 80378 -82102
630 -61672 45075 -59736 14288 -26930 43998 71744 -13874 4219 -96588 1319 44774 13831
617 41046 62116 104720 66081 4584 33183 12479 30416 156061 111414 -64358 -58739 45190
604 -66494 20961 -39328 68569 -99882 -68881 -26917 163238 41573 52668 -33503 -17586 71942
$$ packed form
696e3883A6225f3221m8174f258G8859l7705a02806A7832D443g8401a6100E9246
683b9782G1608f643m8254p9848F604a3755A99167B3470c8456D6980N3593d0502
670a352m5616J8242F4807A9455K2059o719d2294j5635k126J6851B9582g0856A11761
656A4763P8132C3853P3644j6494l0630Q8200D2487A9475P7565h926k461H3581
643a00641A7587J2962a29556A22008Q557a20225G4044a2156G09b440H0378h2102
630f1672D5075e9736A4288b6930D3998K7746a3874D219i6588A319M3455A3831
617D1046K1070M2604l8639D584K8599A2479J7937J25645m4647f4358N619D5190
604f6494B0961c9328F8569i9882L1001b6917A63238D1573J1095c3503J5917G1942
$$ plain form
591 -11462 42578 -1721 -108626 -79831 226075 -13853 41203 6008 -58417 -35398 -12202 -23931
579 -23931 -7574 18162 -106350 -13121 101729 21131 -68565 72812 -47833 52957 47139 67873
567 67873 124363 -63911 29847 48904 -2015 -45109 44035 -24305 9127 101111 104052 -81267 18227
553 -35881 -40775 -55161 -95012 96858 14232 52921 87719 -14136 -29020 -102331 -4745 21253
540 -26229 -51974 -47159 -51972 -91956 4185 -56024 -41934 31708 -35096 -10259 -33914 57666 -45613
526 107714 -39971 73519 60202 5420 72477 49723 -10259 -13024 36802 -102057 -64452 -149845
514 -149845 76379 30720 10612 27678 -135065 12833 39735 -67253 16146 7978 9308 3933
501 -17194 31955 81429 -13367 67374 45098 -23604 -34280 38948 -23926 -50341 -3395 16869
$$ packed form
591a1462D2578a721j06905K8795B26075a3853D1203F008e8417K3019a2202j1729
579b3931g574A8162a06350a3121A01729B1131f8565G2812d7833E2957n818K0734
567F7873N6490f3911B9847J9057b015m3094D4035b4305I127R1984K941h1267A8227
553c5881m894j4386l9851I6858A4232L8689L4798a4136j4884p3311d745B1253
540b6229k5745M815m813l9984D185e6024J4090C1708c5096a0259k3655E7666d5613
526A07714c9971G3519j3317E420O7057k2754a0259k765C6802a02057L7605q5393
514a49845G6379C0720A0612J7066a35065A2833K6902f7253A6146G978J330C933
501a7194C1955M9474a3367F7374k2276b3604j0676C8948b3926k6415c395A6869
$$ plain form
488 79332 -55753 73796 30517 52489 26855 -27566 135034 103596 52011 -22695 -55306 55518
475 95610 70443 86624 6088 89308 55396 -44805 117075 -32608 -46808 -32963 -30465 29011
462 -56309 -21582 175961 -61617 -18709 65046 103566 14463 33232 27218 77162 811 -94743
449 139720 -73179 18388 216464 85297 -178858 81987 16261 46027 -30724 39281 -20945
437 60880 37315 19392 4130 -45608 13093 -15919 -105154 39301 -14070 25433 -17855 91464
424 48624 -85351 -56134 47983 89711 77402 43064 57217 8074 42808 6631 -17754 50998
411 34334 20711 2533 -71120 -8177 -15578 16811 -9545 50153 -115227 -78592 58668 -120628
398 -21112 -92031 -10798 -54780 -2262 -41699 -166137 37499 53677 43613 8878 468 -69739 72951
$$ packed form
488G9332e5753G3796C0517K1972k5634b7566A35034l1438n1585b2695l2611E5518
475I5610k5167J6181F088Q3220l3912d4805A17075c2608j4200J3845K498B9011
462e6309b1582A75961f1617a8709F5046L8520A4463J8769o014M9944H11i4743
449A39720g3179A8388J98076H5297a78858H1987A6261K9766c0724C9281b0945
437F0880k3565j7923D130d5608A3093a5919q9235C9301a4070B5433a7855I1464
424D8624h5351K9217D7983M1728j2309l4338J4153H074L4734F631a7754E0998
411C4334j3623B533g1120h177p401A6811i545E0153a15227L6635E8668a20628
398b1112p0919a0798m3982b262l9437j24438C7499J6178j0064H878D68f9739G2951
$$ plain form
384 -63608 -98898 -12780 37337 32083 -81592 -16198 18947 13001 -8879 -35348 102472 62022
372 62022 49548 105297 15651 -8828 -57722 -120178 -49465 18358 126941 99344 -38180 48973
359 -26462 -3839 64885 -3532 62692 -41577 -148477 -71942 -3916 55459 79030 3855 52633 -12618
345 65652 40766 102772 50217 -57805 133188 13185 20665 -116925 -44685 50936 53806 -3006
332 16785 -30282 57628 -14812 97827 19428 34362 -1279 12550 40023 -40200 72158 29260
319 -63406 73138 40822 -110614 61668 111493 61377 -53128 -17893 22171 71357 -28002 -15278
307 -15278 -58882 23655 -1211 97925 -35841 -62982 -58079 -7937 91219 -103071 -79147 110110
294 33410 70529 68047 14302 -76085 47298 34305 45945 -58722 51005 -43995 -60800 56560
$$ packed form
384f3608l5290a2780C7337n254h1592a6198A8947n946h879k6469A02472m0450
372F2022j2474N5749A5651h828m8894o2456d9465A8358J08583k7597c8180D8973
359b6462c839F4885c532F2692d1577j06900g1942c916E5459K3571C855M8778a2618
345F5652k4886O2006E0217e7805A33188A3185P480a16925d4685E0936K870c006
332A6785c0282E7628a4812I7827A9428J4934a279A2550K7473d0200G2158B9260
319f3406G3138l2316a10614F1668M9825n0116e3128a7893B2171M9186b8002J2724
307a5278m3604B3655a211I7925c5841k7141M903g937I1219a03071K3924A10110
294C3410L7119k482A4302g6085D7298j2993J1640e8722E1005d3995j6805E6560
$$ plain form
281 -154905 5328 -18687 53618 156483 26440 5067 10577 69135 -7584 76011 40017 -45378
268 -52624 557 -65389 52250 -39581 71187 63840 38260 96791 7211 -43864 74474 51716 -78764
254 -31269 147997 67595 -27364 -65399 24773 -40526 10336 19081 171804 -4700 -21812 26785
241 -62918 -47483 37869 19914 642 -70364 -48784 98575 -4394 44693 -56141 43913 51780 -52815
227 -138360 -20379 -129796 -4124 -85479 -22081 -59004 27751 -15904 30278 48250 28742 12431
214 90282 -131116 -92252 114956 33797 87275 147901 99935 42155 -73299 -37773 80417 -33239
201 -11349 31379 68449 14826 53493 7871 42603 57044 28099 -17055 35611 -32693 238 -52585
187 48744 19362 -50969 124174 -61818 -52507 -9531 80095 42208 -29738 -48327 -31250 47359
$$ packed form
281a54905E328a8687E3618J02865B6440E067N510N8558g584G6011l5994d5378
268e2624E57f5389E2250c9581G1187p347k5580N8531G211d3864G4474k2758g8764
254c1269A47997F7595b7364l8035B4773d0526A0336Q745J52723d700j7112B6785
241f2918J5435C7869j7955F42g0364K1580I8575d394D4693e6141D3913P867e2815
227a38360b0379j09417d124q1355b2081l6923B7751a5904C0278J7972j9508A2431
214I0282a31116L8864A14956C3797N3478O0626m7966D2155g3299L5526H0417c3239
201a1349C1379L7070A4826L8667G871L4732J4441B8099a7055C5611c2693B38e2585
187D8744A9362e0969A24174f1818R311i531H0095l7887b9738j8589J7077D7359
$$ plain form
174 116342 -62489 -68126 -140696 -57129 31068 85165 48217 -101313 -39756 -67229 21983 32193
162 32193 13572 -67463 77862 50689 34130 61018 56036 27031 -25789 68782 20591 21836
150 21836 110605 35627 -1615 37912 -6414 -67257 -2924 69543 -4544 99413 78288 46444 24271
137 24271 7110 -55690 -21097 -55948 -59907 34832 92874 -65575 361 -91413 -28386 179108 50159
123 22057 -22805 -7501 -20260 -101155 -49618 2279 25521 90003 -55145 9643 153432 2993 -72934
109 -152339 -61171 32524 40783 26402 56260 -85717 20498 -5552 49204 -31723 15267 14617 -29587
95 41781 -13264 -6687 84341 -80278 -600 121196 -67990 22999 -47350 -54858 -66984 -60307 -16223
81 19019 32197 -44725 -63943 -5644 -54306 14753 -60081 -81166 -58276 -4341 -54073 24830 -13247
$$ packed form
174A16342f2489n637p2570e7129C1068N4097l6948a01313c9756k7473B1983J0210
162C2193A3572f7463G7862k7173j6559K6888m982B7031b5789F8782B0591J245
150B1836Q8769C5627a615C7912f414o0843b924F9543d544I9413k1125l1844k2173
137B4271G110e5690b1097l4851l959C4832N8042f5575C61i1413b8386A79108E0159
123B2057b2805g501j2759q0895d9618B279K3242O4482e5145I643J43789B993g2934
109a52339f1171C2524Q259j4381K9858h5717B0498e552D9204c1723A5267o50b9587
95D1781a3264O577H4341h0278f00A21196f7990B2999d7350p508j2126O677a6223
81A9019J3178d4725j9218e644m8662A4753f0081k1085K2890d341m9732B4830a3247
$$ plain form
67 4620 -13703 5842 -18835 -16434 -41838 -17169 13639 -52278 -2329 20269 59134 40582 46689
54 46689 22215 -46703 -1760 -39867 -78474 -74496 -21510 29610 -45756 -11399 24388 17451 -1507
40 12969 8198 19424 88823 23 46795 -58800 -94161 -15356 -10722 59046 -11932 -56050 -64286
27 -64286 45698 -69312 -21107 53530 -71874 -7514 724 39909 -42834 -33851 -48326 -32476 15928
13 -1039 -17421 -16681 -59001 35517 49029 -26495 -7509 19229 -48738 -23911 -18163 18489 26789
0 26789
$$ packed form
67D620a3703E842a8835K401k5404a7169A3639e2278b329B0269L8865j8552O107
54D6689B2215d6703a760l8107l8607L978b1510B9610d5756a1399B4388o937a507
40A2969m771J1226O9399B3M6772e8800l5361a5356M634E9046a1932m4118q236
27f4286D5698f9312b1107E3530g1874g514G24L9185d2834Q983j4475J5850A5928
13a039j6382P40m2320C5517J3512b6495g509A9229d8738b3911N748A8489Q300
0B6789
$$ Imaginary data points
##PAGE= N=2
##DATA TABLE= (X++(I..I)), XYDATA
$$ plain form
16383 -87557 -51366 -133836 -43994 -75215 -32957 -52619 -32118 -23185 5976 -130110 -120870 887
16370 -60589 -32056 -20734 -61360 -54099 2248 5587 30820 -57688 -24747 -8278 90188 20107
16357 29687 34650 80254 13465 79694 57529 112363 77525 62658 70383 -8511 48346 154629
16345 154629 36289 38925 64556 132127 113185 172885 62579 97760 147853 107758 142562 120328
16333 120328 96599 189963 129596 113018 96876 121634 122066 199972 151803 188406 176272 145603
16321 145603 146000 227832 247534 302342 255243 229965 198891 213741 197978 232446 198798 178717
16309 178717 238224 238382 186775 222517 238957 285107 258992 197495 318025 323939 382893 236077
16297 236077 263216 379799 273254 161576 382407 235112 361009 251608 351049 278982
$$ packed form
16383h7557L6191q2470d3994l1221c2957j9662K0501Q933E976a30110R240H87
16370f0589K8533J1322m0626P261B248L339K5233e7688b4747h278I0188B0107
16357B9687M963M5604A3465O6229k2165N4834l4838j4867P725h511D8346J06283
16345A54629C6289K636K5631O7571j8942N9700F2579L5181N0093m0095L4804k2234
16333A20328k3729R3364o0367j6578j6142K4758M32P7906m8169L6603j2134l0669
16321A45603L97Q1832J9702N4808m7099k5278l1074J4850j5763L4468l3648k0081
16309A78717N9507J58n1607L5742J6440M6150k6115o1497J20530N914N8954j46816
16297B36077K7139J16583j06545j11678K20831j47295J25897j09401R9441p2067
$$ plain form
16287 278982 352033 340765 355854 312941 382096 289651 368879 309958 406499 351855 304874
16276 304874 309352 378141 292725 432839 316515 288125 438838 423088 358301 414403 371829
16265 371829 439101 379462 504226 463370 322128 281795 428996 268410 331109 380600 519872
16254 519872 558529 494649 443307 459732 439295 420980 416191 398935 509271 478676 365003
16243 365003 455467 455970 470083 454131 382251 490875 405662 399384 467208 501167 536471 493422
16231 493422 501809 482130 624481 453699 496260 538861 503110 340786 379951 515716 526055
16220 526055 440911 506820 509167 545667 664577 534521 513114 547315 529397 471916 523375
16209 523375 547120 536259 542993 504091 481660 548176 625306 624960 548148 646302 467356 565601
$$ packed form
16287B78982P3051j1268J5089m2913O9155r2445P9228n8921R6541n4644m6981
16276C04874M478O8789q5416J40114j16324k8390J50713j5750o4787N6102m2574
16265C71829O7272n9639J24764m0856j41242m0333J47201j60586O2699M9491J39272
16254E19872L8657o3880n1342J6425k0437j8315m789j7256J10336l0595j13673
16243C65003R0464N03J4113j5952p1880J08624q5213o278O7824L3959L5304m3049
16231D93422Q387j9679J42351j70782M2561M2601l5751j62324L9165J35765J0339
16220E26055q5144O5909K347L6500J18910j30056k1407L4201j7918n7481N1459
16209E23375K3745j0861O734l8902k2431O6516P7130l46p6812R8154j78946R8245
$$ plain form
16197 565601 466305 582904 544314 584433 738452 582951 515654 463199 607635 676168 566085
16186 566085 650958 537203 606451 561082 645846 603060 540649 628248 509530 591101 654680
16175 654680 603467 517529 603214 490866 592907 525684 618320 709192 653735 560577 597426
16164 597426 586263 590279 545176 496512 620743 644996 658093 562969 621312 591885 717855
16153 717855 532490 607193 639451 621294 598018 665071 603096 595829 651856 541412 594974
16142 594974 636492 465254 609548 498494 556489 648053 626030 567981 666380 565753 601373
16131 601373 612089 613075 592250 672462 637126 651889 665443 609116 589129 515603 629023 464432
16119 464432 561768 519390 693735 644013 576745 642306 791071 592417 588217 633497 666967
$$ packed form
16197E65601r9296J16599l8590M0119J54019j55501o7297n2455J44436O8533j10083
16186E66085Q4873j13755O9248m5369Q4764m2786o2411Q7599j18718Q1571O3579
16175F54680n1213q5938Q5685j12348J02041o7223R2636R0872n5457r3158L6849
16164E97426j1163M016m5103m8664J24231K4253J3097r5124N8343k9427J25970
16153G17855j85365P4703L2258j8157k3276O7053o1975p267N6027j10444N3562
16142E94974M1518j71238J44294j11054N7995R1564k2023n8049R8399j00627L5620
16131F01373J0716R86k0825Q0212l5336J4763J3554n6327j9987p3526J13420j64591
16119D64432R7336m2378J74345m9722o7268O5561J48765j98654m200M5280L3470
$$ plain form
16108 666967 700844 629731 642484 585625 555459 639318 594864 711498 596633 484900 579779
$$ packed form
16108F66967L3877p1113J2753n6859l0166Q3859m4454J16634j14865j11733R4879
$$ [...]
##END NTUPLES=NMR SPECTRUM
##END=
