##TITLE=XTC-888_2
##JCAMPDX= 6.0         $$ Bruker NMR JCAMP-DX V2.0
##DATA TYPE= NMR SPECTRUM
##DATA CLASS= NTUPLES
##ORIGIN= BRUKER
##OWNER= patiny
$$ 1.79 TOPSPIN		Version 3.0
$$ 2012-05-19 12:20:23.135 +0200  patiny@icmbsg005
$$ Compression mode = diff/dup
##.OBSERVE FREQUENCY= 400.13188181139
##.OBSERVE NUCLEUS= ^1H
##.ACQUISITION MODE= SIMULTANEOUS (DQD)
##.ACQUISITION SCHEME= undefined
##.AVERAGES= 16
##.DIGITISER RES= 23
##SPECTROMETER/DATA SYSTEM= spect
##.PULSE SEQUENCE= zgpr
##.SOLVENT NAME= D2O
##.SHIFT REFERENCE= INTERNAL, D2O, 1, 11.69961
##AUDIT TRAIL= $$ (NUMBER, WHEN, WHO, WHERE, PROCESS, VERSION, WHAT)
$$ ##TITLE= Audit trail, TOPSPIN		Version 3.0
$$ ##JCAMPDX= 5.01
$$ ##ORIGIN= Bruker BioSpin GmbH
$$ ##OWNER= patiny
$$ $$ /opt/data/patiny/nmr/XTC-888_2/11/pdata/1/auditp.txt
$$ ##AUDIT TRAIL=  $$ (NUMBER, WHEN, WHO, WHERE, PROCESS, VERSION, WHAT)
(   1,<2012-05-19 12:20:21.587 +0200>,<patiny>,<icmbsg005>,<go>,<TOPSPIN 3.0>,
      <created by zg
	started at 2012-05-19 12:18:35.676 +0200,
	POWCHK enabled, PULCHK disabled,
       configuration hash MD5:
       77 C7 B7 C4 10 F4 BA 30 64 2E BB 52 82 F2 DA 41
       data hash MD5: 32K
       E9 ED 95 F4 C6 2B 6C 40 A2 74 2A 3A DC FF 96 8A>)
(   2,<2012-05-19 12:20:21.977 +0200>,<patiny>,<icmbsg005>,<audit>,<TOPSPIN 3.0>,
      <user comment:
       ICON-NMR User ID: patiny
       data hash MD5: 32K
       E9 ED 95 F4 C6 2B 6C 40 A2 74 2A 3A DC FF 96 8A>)
(   3,<2012-05-19 12:20:22.655 +0200>,<patiny>,<icmbsg005>,<proc1d>,<TOPSPIN 3.0>,
      <Start of raw data processing
       ef LB = 0 FT_mod = 6 PKNL = 1 SI = 16K 
       data hash MD5: 16K
       10 5F 27 5C 90 4D CD 54 41 BC 87 51 29 0B 98 83>)
(   4,<2012-05-19 12:20:22.766 +0200>,<patiny>,<icmbsg005>,<proc1d>,<TOPSPIN 3.0>,
      <apk 
       data hash MD5: 16K
       3F 55 43 10 08 EB B2 50 FB F9 FB 9C B4 A1 86 5E>)
(   5,<2012-05-19 12:20:22.782 +0200>,<patiny>,<icmbsg005>,<proc1d>,<TOPSPIN 3.0>,
      <abs ABSG = 5 
       data hash MD5: 16K
       8A 0A 51 08 34 58 F3 8F BB FC 1D 2B 51 77 44 0B>)
$$ ##END=
$$ 
$$ $$ hash MD5
$$ $$ 74 A3 DF 0B 9B 9D 62 27 9F 14 34 B4 D4 83 A5 C5
##$RELAX= 
##$RELAX= 
##$RELAX= 
##$RELAX= 
##$RELAX= 
##$RELAX= 
##$RELAX= 
##$RELAX= 
##$RELAX= 
##$RELAX= 
##$RELAX= 
##$RELAX= 
##$RELAX= 
$$ Bruker specific parameters
$$ --------------------------
##$DATPATH= </opt/data/patiny/nmr>
##$EXPNO= 11
##$NAME= <XTC-888_2>
##$PROCNO= 1
##$ACQT0= -9.16730304209974
##$AMP= (0..31)
100 100 100 100 100 100 100 100 100 100 100 100 100 100 100 100 100 100
100 100 100 100 100 100 100 100 100 100 100 100 100 100
##$ANAVPT= -1
##$AQSEQ= 0
##$AQ_mod= 3
##$AUNM= <au_zgglp>
##$AUTOPOS= <20 >
##$BF1= 400.13
##$BF2= 400.13
##$BF3= 400.13
##$BF4= 400.13
##$BF5= 400.13
##$BF6= 400.13
##$BF7= 400.13
##$BF8= 400.13
##$BYTORDA= 0
##$CAGPARS= (0..11)
0 0 0 0 0 0 0 0 0 0 0 0
##$CFDGTYP= 0
##$CFRGTYP= 9
##$CHEMSTR= <none>
##$CNST= (0..63)
1 1 1 1 1 1 1 1 1 1 1 1 1 1 1 1 1 1 1 1 1 1 1 1 1 1 1 1 1 1 1 1 1 1 1 1
$$ [...]
##$TE2= 0
##$TE3= 0
##$TE4= 0
##$TEG= 300
##$TE_PIDX= 1
##$TE_STAB= (0..8)
2 2 0 0 0 0 0 0 0
##$TL= (0..7)
120 120 120 120 120 120 120 120
##$TP= (0..7)
150 150 150 150 150 150 150 150
##$TPNAME0= <>
##$TPNAME1= <>
##$TPNAME2= <>
##$TPNAME3= <>
##$TPNAME4= <>
##$TPNAME5= <>
##$TPNAME6= <>
##$TPNAME7= <>
##$TPOAL= (0..7)
0.5 0.5 0.5 0.5 0.5 0.5 0.5 0.5
##$TPOFFS= (0..7)
0 0 0 0 0 0 0 0
##$TUNHIN= 0
##$TUNHOUT= 0
##$TUNXOUT= 0
##$USERA1= <>
##$USERA2= <>
##$USERA3= <>
##$USERA4= <>
##$USERA5= <>
##$V9= 5
##$VALIST= <>
##$VCLIST= <>
##$VD= 0
##$VDLIST= <>
##$VPLIST= <>
##$VTLIST= <>
##$WBST= 1024
##$WBSW= 4
##$XGAIN= (0..3)
0 0 0 0
##$XL= 0
##$YL= 0
##$YMAX_a= 10594504
##$YMIN_a= -7209855
##$ZGOPTNS= <>
##$ZL1= 120
##$ZL2= 120
##$ZL3= 120
##$ZL4= 120
##$ABSF1= 11.69961
##$ABSF2= -2.293603
##$ABSG= 5
##$ABSL= 3
##$ALPHA= 0
##$AQORDER= 0
##$ASSFAC= 0
##$ASSFACI= 0
##$ASSFACX= 0
##$ASSWID= 0
##$AUNMP= <save_auto_nonLDAP.pm>
##$AXLEFT= 0
##$AXNAME= <>
##$AXNUC= <1H>
##$AXRIGHT= 0
##$AXTYPE= 0
##$AXUNIT= <>
##$AZFE= 0.1
##$AZFW= 0.1
##$BCFW= 0
##$BC_mod= 0
##$BYTORDP= 0
##$COROFFS= 0
##$CY= 15
##$DATMOD= 1
##$DC= 0
##$DFILT= <>
##$DTYPP= 0
##$ERETIC= no
##$F1P= 0
##$F2P= 0
##$FCOR= 0.5
##$FTSIZE= 16384
##$FT_mod= 6
##$GAMMA= 0
##$GB= 0
##$INTBC= 1
##$INTSCL= 1
##$ISEN= 128
##$LB= 0
##$LEV0= 0
##$LPBIN= 0
##$MAXI= 10000
##$MC2= 0
##$MEAN= 0
##$ME_mod= 0
##$MI= 0
##$NCOEF= 0
##$NC_proc= -6
##$NLEV= 6
##$NOISF1= 0
##$NOISF2= 0
##$NSP= 0
##$NTH_PI= 0
##$NZP= 0
##$OFFSET= 11.69961
##$PC= 1
##$PHC0= 88.9722
##$PHC1= 4.361303
##$PH_mod= 1
##$PKNL= yes
##$PPARMOD= 0
##$PPDIAG= 0
##$PPIPTYP= 0
##$PPMPNUM= 2147483647
##$PPRESOL= 1
##$PSCAL= 0
##$PSIGN= 0
##$PYNMP= <proc.py>
##$REVERSE= no
##$SF= 400.13
##$SI= 16384
##$SIGF1= 0
##$SIGF2= 0
##$SINO= 0
##$SIOLD= 16384
##$SPECTYP= <>
##$SREGLST= <1H.CDCl3>
##$SSB= 0
##$STSI= 16384
##$STSR= 0
##$SW_p= 5599.10414333707
##$SYMM= 0
##$S_DEV= 0
##$TDeff= 32768
##$TDoff= 0
##$TI= <>
##$TILT= no
##$TM1= 0
##$TM2= 0
##$TOPLEV= 0
##$USERP1= <>
##$USERP2= <>
##$USERP3= <>
##$USERP4= <>
##$USERP5= <>
##$WDW= 1
##$XDIM= 16384
##$YMAX_p= 308922346
##$YMIN_p= -494953
##$CURPLOT= <Cups-PDF>
##$CURPRIN= <$Cups-PDF>
##$DFORMAT= <normdp>
##$LAYOUT= <+/1D_X+nopp.xwp>
##$LFORMAT= <normlp>
##$PFORMAT= <normpl>
$$ End of Bruker specific parameters
$$ ---------------------------------
##NTUPLES= NMR SPECTRUM
##VAR_NAME=  FREQUENCY,     SPECTRUM/REAL,   SPECTRUM/IMAG
##SYMBOL=    X,             R,               I
##VAR_TYPE=  INDEPENDENT,   DEPENDENT,       DEPENDENT
##VAR_FORM=  AFFN,          ASDF,            ASDF
##VAR_DIM=   16384,         16384,           16384
##UNITS=     HZ,            ARBITRARY UNITS, ARBITRARY UNITS
##FACTOR=    0.3417421962486, 1,             1
##FIRST=     5598.76240114082, -203004,      -132418
##LAST=      0,             80398,           -367944
##MIN=       0,             -494953,         0
##MAX=       5598.76240114082, 308922346,    0
$$ Real data points
##PAGE= N=1
##DATA TABLE= (X++(R..R)), XYDATA
16383 -203004 7974 -69379 -105561 -22932 36242 -83591 -90751 58955 -117757 59958 -37834 -45679
16371 -45679 -87554 121082 -50980 -6827 -68062 -51902 -68533 89703 -147958 95322 -246249
16359 120780 -32357 -126357 -192548 -49277 -89591 -124679 -33798 -27608 -96869 -13998 -149806
16348 -149806 -99350 24369 -13821 -35981 -19289 86948 -93964 -97984 34396 -40105 85518 -85869
16335 149356 -177750 -28960 -15085 -110566 -46634 73139 -16620 18408 18 -91353 4159 -870
16322 -75293 67106 117953 -164464 115595 60930 -206 -139964 70131 -73778 -6942 -168454
16311 -168454 -148410 -139198 8392 -99285 -33808 -78542 -89655 -11893 -55834 12936 -156584 207655
16298 -57351 26096 106605 -50832 -60796 92245 -4853 -69804 90586 -80104 85943 -31996 -10808
16285 -43639 -148348 -9116 18503 -107232 -79792 -121820 8910 65269 238559 -29891 76389
16273 -190523 126295 -144409 31375 -106160 59432 -196081 77819 131093 3429 12890 -30456
16261 -125549 -186634 -134760 -171733 -10359 -32041 -49227 -9382 -83832 -182507 -94270 -12905 130155
16248 72261 70782 88149 -10614 -45271 -139106 31488 18304 -167676 133212 -51499 16278
16236 -102085 -20403 -9474 1031 50244 13426 -129462 -161771 10754 16266 356775 121919
16224 37205 -275509 -69964 -239878 -104279 99869 -146071 -94133 -172084 23935 -2771 8027
16212 212989 122431 -197887 -43565 -35453 217886 -27630 33365 -220968 -100182 -41810 132167
16200 67437 -241693 23076 75896 -104503 -68499 19841 -164248 -142947 81059 4469 -59911
16188 111829 -158115 -157839 -94388 -208674 -226494 -26286 -181444 48435 -187070 292879 -90339
16176 -104262 -12423 -27789 249195 59410 -126954 -158126 -192967 48402 195679 -62439 177512
16164 32798 -266784 3869 41402 -1422 203288 81930 -42917 125707 -65252 -254451 -89678
16152 -319853 -178012 -200980 -102221 103605 12883 -13398 53317 -41934 -17258 -173674 -84110
16140 -62249 -101461 -334 126146 -351879 71058 75083 216610 38576 -84649 50427 93243 -14722
16127 -69262 144528 129826 179826 33341 101261 -27745 26121 -59087 35507 -14699 52447
16115 90471 -190667 -93085 -143136 -39349 -175706 383741 115249 27653 29677 -182107 257647
16103 -89280 82063 39559 -3704 -36427 103618 113978 -88674 -111261 217379 159353 -170160
16091 44741 68197 180276 152419 79522 -35757 93882 107782 -275639 17791 -159309 -272845
16080 -272845 4487 -224438 -241227 16672 -234094 -96245 121325 78883 -58795 116129 -61854
16068 -46043 -23981 -31816 -76905 -100242 83560 34004 -64546 -80269 -48146 -213421 45791 6866
16055 69744 -74272 18721 -203900 239397 194040 126070 123506 -3780 131867 -115952 -52901
16043 -60679 -34035 -44053 -101179 -47295 54848 -213511 -35962 197491 107388 71414 -65885
16031 104293 11843 93084 87597 34541 242569 -139020 82047 -13004 27043 -37985 47298
16019 133831 -132015 -29969 -186059 -123525 187693 -60826 -88722 114864 -251746 5957 -245471
16007 5101 -23236 99296 -92841 36740 170632 146311 -3256 79209 21434 95810 -135481 89439
15994 -72301 -102488 -2037 -134795 -269204 -167804 237525 -24964 -117518 76475 101519 110450
15983 110450 36986 -112041 -67021 -242208 156431 101066 -44385 44189 -30597 46726 44530
15972 44530 -38598 107413 143151 -131205 102375 -46491 58432 49728 64196 103735 -44711
15960 54677 174253 190624 -14009 101559 -33464 19522 -11696 23274 43270 -243572 234296
15948 61904 -175322 44095 -32805 -15387 197787 -26638 -210854 -100467 156651 82053 -222565
15936 45618 154423 -144306 -75242 51204 292344 -49034 -51024 -60641 -246034 -3442 154985
15924 -114482 -41503 -123130 167070 95432 89884 341947 -58594 -129414 133472 8312 273771
15913 273771 -81073 -95872 87865 -183352 -686 -125750 -69881 107770 77955 -14690 -134253
15902 -134253 58247 -132391 -200816 -135925 -104241 41109 -193412 -61556 72334 -201362 66072
15890 -137622 77244 189125 -41763 106268 125899 -83296 65136 -13456 76781 152794 -160058
15878 -11449 87543 -57679 6371 198189 300346 45056 -114564 -318465 -8752 169852 158907
15867 158907 -311662 -33699 -96510 92449 70214 -110093 -72845 170558 -965 154483 51382
15855 -162416 89477 -8357 -107929 -159032 -114070 276956 -12523 -83046 -69523 39043 -51822
15843 133565 81796 110756 249383 -175155 -60353 264478 85002 115972 289856 134068
15832 -151370 98313 -1708 -119954 47700 -19277 147816 -126138 85593 154215 116630 102283
15821 102283 -25297 89921 -191074 -182059 -96973 -78150 -119179 -129492 -113724 84964 12355
15809 4631 15044 113631 65672 -12909 163023 143146 129061 -262073 13353 -103651 -207056
15798 -207056 -121750 179109 -98735 92011 -28610 -39847 114099 95177 122747 -134794 -190306
15787 -190306 -148700 -166697 -79761 39439 -235510 -95598 254459 -41336 -70751 295622 25279
15775 -14996 -4575 57103 -105691 -47673 16129 250726 -149573 278153 -35725 -98652 -37800
15763 359567 -45831 -265906 -51628 100116 -37692 2384 256924 -83114 -259112 -50765 55783
15751 73413 -30403 -120595 -114228 -234350 -67639 -86852 -41843 -64448 3594 -6237 16982 215934
15739 215934 45778 185222 -152303 -209405 -252636 -67670 -104797 -176755 30593 -104345 94679
15727 180340 -174443 -15854 -56682 272783 -59110 156202 -125732 -88795 -190610 -259373
15717 -259373 134533 -77010 59584 22055 95077 -205411 -104845 232497 69100 -167516
15706 256568 33393 -203980 46713 94844 -86317 -175144 -47073 -62993 -55313 -8497 -35528 36256
15693 46111 263520 -72510 -84583 -29864 -104390 77239 137506 -118617 -55973 133340 130706
15682 130706 87709 -12137 -185331 32204 172810 110595 5654 -91504 217722 -30956 224672
15670 252306 82654 124819 253850 -31224 -565 -31251 -257134 -13514 116629 163983 -249493
15658 -39620 -92639 -58316 26097 -24062 -36655 303455 -51602 27127 -33536 -251646 -156178
15647 -156178 213475 -76864 -101933 20732 1027 107939 134032 -91299 44493 134741 -17266
15635 42726 -131799 -30858 -191967 196321 211560 163491 -143145 22997 -121250 -160755 108295
15623 -200119 69493 86092 -179578 -15858 -69955 95485 22984 -89863 -1704 28098 -84508
15611 -210189 58799 -18631 131287 187340 228313 21233 48944 -33460 -36425 -20407 264756
15599 -7295 -195771 -3105 175536 -179026 -110789 -175764 -44436 -147955 -193662 263019 57350
15587 128399 -260748 -21595 -78479 42859 55160 112336 59002 318451 117608 -92450 54045
15575 120377 -70934 -25048 -78089 -7930 35390 -192729 -102122 19463 93818 2474 96904 -182534
15562 38664 12093 -61769 -219002 129115 -32275 51819 -88332 10071 -55691 -62976 -102951
15551 -102951 165674 142209 141654 79302 -5031 -119784 94139 -151589 171770 9846 109611
15540 109611 -24563 -118523 93573 43178 16453 -38182 -141806 77724 -67232 -209910 150223
15528 -343206 -48979 -136456 107018 91169 107130 -133037 -80465 61966 48054 -48697 17928
15516 400469 18606 -83358 -93716 744 36565 -21517 -22048 128531 -163209 182872 261640 2940
15503 24127 -91334 -15668 -181247 -181718 38379 177639 231364 20558 -44386 -47796 59922 44978
15491 44978 87194 101426 28967 33769 -92480 -66416 179329 167015 48312 96148 -17525 26194
15478 -137940 138587 -119870 56250 21545 49538 -46272 -158214 -76769 -93091 -193521 -75371
15466 -166987 338351 -45359 -23871 -71408 109848 124936 -13942 -188267 31577 -56954 -33901
15455 -33901 -140653 294083 67356 75561 -110951 233290 956 14071 -32470 33953 205388
15444 205388 -79692 28649 108791 265987 -147243 398044 243634 -44214 -74109 232305
15433 -23646 45312 52660 -4265 -15104 77992 -20458 44751 116746 101176 -739 251933 100213
15420 -130746 -190861 -161279 -103922 26766 -238736 101768 -234087 15027 -52573 28 87683
15409 87683 133320 83659 -70697 28220 -21812 -127247 -137490 102253 -139603 -110304 -172108
15398 -172108 -120044 -143926 126050 52923 -153558 63248 -45784 194288 -28832 -187045 -204198
15387 -204198 -237039 30153 -137167 1179 83137 91845 -53197 28917 108148 230608 -66174
15375 -66374 34307 -158896 77710 30257 121768 270698 125161 -173547 124787 -43497 303035
15363 -97974 222022 -258446 -201773 116024 -167945 -51311 -3369 -6112 -288983 -133616 7282
15351 -118075 163743 100188 -20930 139286 93924 144964 -236482 305159 -40446 -30317 23473
15339 -136173 245915 -94309 -263 -219568 -82647 -154653 141224 -83125 39701 -5395 51482
15327 188905 35902 -98434 -126214 -16318 70342 -109159 -97835 -359021 169163 -59653 203649
15315 230420 -69645 47873 -29318 32761 -15707 -7508 15141 37115 -27072 -101958 -18113 -67695
15303 -67695 -110241 12070 -128069 -102395 51133 -108187 35914 282078 172771 -30921 -152558
15292 -152558 -132032 -205832 124223 31994 6372 68396 -80044 101538 -128613 -79621 -157763
15281 -157763 -103335 29825 12474 245726 202086 126144 -154848 122081 150520 87173 217519
15270 217519 -228165 -82567 42038 -242641 25832 36239 -67220 -15439 18073 -79231 -17831
15258 -279609 83288 115085 314622 -33734 -187347 -74486 77423 23674 -131700 -31157 -8311
15246 212650 -9513 -208679 -88009 126048 -20168 156610 -138100 -77111 78916 11520 -301620
15234 -107952 173870 22821 -43217 155118 -135975 153327 -110312 126515 89482 67233
15224 67233 -29249 -105721 349475 -142661 92887 162006 91079 141053 23726 -107362 22060
15212 127157 192297 100394 17006 -239197 -207457 126197 -297749 6337 17099 -29996 -227734
15201 -227734 -13290 69706 101553 -61292 -134923 37407 51309 -15744 -180467 66023 54971
15190 54971 132605 -2932 94297 83024 36192 8583 -90259 45053 -234341 76102 -180079 -121012
15178 -121012 -6709 142127 95312 -102015 47011 -130628 -45582 125386 66174 -119254 -96190
15167 -96190 142481 107196 104327 -271802 115755 -96076 -159213 -256720 -121238 -221408 123101
15155 104849 80821 -58259 38066 33504 -58789 189703 -101908 192522 288215 323672 220915
15144 220915 -77277 -178406 104184 87205 269027 82347 254269 60375 -7818 114373 197985
15133 197985 259711 -133848 124493 -178919 70312 99399 314855 -11336 19521 -16298 -6065
15121 -116072 276807 58985 180411 -69004 -97902 232985 -81091 -123869 -278186 135554
15110 -9752 131011 30474 -158478 -141354 -184491 -105540 -138803 104975 177360 -343498 -127093
15098 27229 -247166 105125 -104074 -375193 -152661 -3665 -32888 -26239 52963 77617 135904
15087 135904 -4949 135491 110774 94666 -131716 60134 60872 124413 -62757 42139 -18528 -39731
15075 -39731 23711 -11856 15608 -184297 81563 -62064 151026 18042 127892 -110850 162320
15063 336803 -50732 17224 8137 -264039 -86718 136232 195276 -78053 61336 50787 -9469
15051 216533 -77142 187827 -43534 -196021 -93485 24677 54107 157749 334204 32573 146065
15040 146065 -84342 -162247 121323 2247 164398 71914 150628 -37686 -62037 -52476 -38553
15029 -38553 18083 -202346 42463 56170 131471 -33351 125335 -66363 26053 -20503 -14702
15018 -14702 -12176 206278 96258 67186 121588 92791 321497 76926 -53189 25760 98323
15007 98323 -50850 132208 -17128 272214 -69382 149650 -157237 108990 1431 86391 -172982
14995 -42756 38486 61227 -67700 340679 59105 -11784 -247085 -26030 116963 11202 132660
14984 132660 53771 -138407 -49786 223983 -18683 208138 -232066 -177628 35552 -44927 14389
14972 -146585 -83435 165471 -105111 93667 141975 21199 240363 -19790 -188992 11307 -6772
14960 265784 115937 -154635 143831 -248448 233608 62981 176464 8222 -112409 -54177
14949 62928 -92242 -181939 -85579 16556 210076 11641 -34043 -152207 396276 -6804 78650
14937 -31203 -33879 -105015 -25319 -205615 -176745 138396 177281 63270 135422 74981 -67447
14925 86321 -87978 52144 -215110 154729 -2020 -32918 63542 4729 -34793 69628 -22622 47436
14912 79422 94346 47446 64126 92632 -11087 -64819 53646 117757 -6545 113945 30618 -280635
14899 73126 153673 212264 103256 9935 -51271 44367 152673 -39190 -282550 -49185 139702
14887 51270 241578 145869 230112 71790 707 -232455 -97334 200707 -6414 3843 -92047 -11343
14874 88667 222946 -87365 18771 87269 34907 -117965 22235 244794 -150812 173543 110442
14863 110442 130205 -56966 -12800 175422 190038 -42354 62933 221856 -105669 191881 127293
14852 127293 130612 -85727 176298 -31649 -153952 -17719 -233854 45935 -206521 72283 -42982
14840 157859 134872 -63403 -228827 162315 190011 -104949 -37947 134668 21643 195777
14830 195777 -152324 132660 112336 -37272 53847 66967 118762 -30014 -295268 59460 -288634
14818 55697 203966 -117518 -167927 209622 27862 -100104 -15726 112455 202115 110799 -31057
14806 33505 157307 127093 -91462 72413 -1415 -18105 -9747 107362 -100887 -30100 299272
14794 33346 -31510 98710 -41812 -104547 100701 101509 86275 98845 249432 25487 28231 303613
14782 303613 -55914 48372 -83900 4209 -1292 -226375 -157225 -108285 -8554 22053 14807 -6817
14769 111072 -90114 -215289 133650 156349 203984 -144667 28267 195829 -40556 35056 198558
14758 198558 3203 164328 221532 32205 131857 -69387 197639 -87657 -103885 -17797 -75288
14747 -75288 31040 -111976 30479 119000 132678 121461 -165663 -57199 -11604 -225557 -111931
14735 -225740 57952 -31506 95935 62917 -79135 -277137 83332 43021 196447 58558 25634
14723 -145547 -39457 73684 24517 147815 -109018 40001 -134781 98463 -117023 -66527 -120838
14712 -120838 93488 155068 -220647 -119496 187423 178735 48935 167727 161818 -102826 -109022
14701 -109022 -207316 -17341 -89654 -80523 175916 -95837 102482 -49150 12961 -117554 35574
14689 28500 -30829 67350 -62374 -116272 71860 -143940 -39754 30100 -49043 163794 119247
14678 119247 -70043 -250844 -47628 34637 -22484 187389 -85806 227961 -152360 14903 -59440
14666 214319 -876 266974 93083 -73350 -199199 -14350 80827 202626 -145365 9509 90851
14655 90851 67447 -100767 112807 151355 -85937 13324 25223 181875 -202074 402824 95949
14643 -72398 -8932 -80491 -199188 -171755 -197306 -55563 -194780 -111672 -113640 -23905 64318 -43860
14630 63219 143548 -68057 -80101 10728 -75848 18420 -201102 173530 -79565 -91007 -99921
14619 -99921 21979 -13074 290760 -98682 33028 -91795 301296 -250652 59712 122319 -19631
14607 -70177 -109666 87175 -141856 81779 -126384 184964 64566 13174 -74458 88576 3149
14595 164945 -160361 131980 133377 870 -227713 36094 82026 -40967 -205490 260901 103058
14583 1321 9630 136136 96495 -27024 -7561 97701 87130 -205049 -107908 59694 91218 -96621
14570 41885 4007 -188968 33231 41308 184290 -155418 253791 33916 201511 13338 -121465
14558 59108 16413 -193833 53539 -69156 130470 329738 171224 -56810 -163666 115917
14547 -50002 39358 106221 24826 143633 188925 66770 -201237 -124631 20293 93175 -91932
14535 -98433 -195030 -108997 263627 72687 4604 -119677 -137100 -59136 -106647 -30019 37334
14523 -120124 27858 -13677 -24444 121304 -67587 -78842 -14824 -12304 90394 -28256 24710
14511 -118500 -164897 271653 189714 -7014 49772 -156314 -261162 -2921 -112462 80715 176943
14500 176943 -171599 223233 208824 84750 -43602 -269450 -50516 71836 -141001 73457 23175
14488 -31233 -74552 21903 20864 228038 66054 90416 -42001 -56187 63307 -64859 -35015 -98498
14476 -98498 -105036 128713 -118021 -6845 -88374 -8315 64664 132516 239387 36904 -188178
14464 42266 -133913 -13344 -39630 -281388 131686 -129388 -32105 133401 48467 90773 67857
14453 67857 75331 172715 76080 154958 -103745 128145 104647 -59884 -169919 6959 -24670
14441 307228 -81153 -79669 27331 305064 75817 88884 -78123 80161 218103 -13066 -98200
14430 -98200 22802 -34246 70769 69373 -245319 -207349 77019 -133672 282183 -263118 -3842
14418 85749 -76854 -265592 114959 100596 -13851 203296 108899 -157069 139154 79664 2857
14406 149813 52 199934 -219461 -104317 71244 -98356 -41372 27465 256756 50060 -18934
14394 214734 67047 -173261 -203954 -17261 -18361 12060 678 55036 -91500 28574 -59173 64828
14381 143680 -158214 102342 356471 -49207 -47097 17642 13301 70610 47173 6890 -119219
14369 -107863 101840 -7604 45824 22982 74369 87156 -62341 219932 -21813 -63332 79028
14357 94668 -36576 30996 185447 37612 -8679 -112670 227438 -98823 54831 49395 31342
14346 31342 62742 124323 7818 167658 -145889 -56411 -166246 -93891 -184674 188229 -187834
14334 166326 19269 -33245 11838 257777 47724 -23614 96447 43070 167519 61876 1122
14322 78785 26240 -48184 92597 -123836 10218 145539 430021 27387 151189 23087 56896
14311 56896 230555 41302 -197455 -55038 -293197 201438 -15085 19003 -127999 37507 36723
14300 36723 152531 -15673 242710 24047 10223 -187072 147775 161345 -54197 -23332 284747
14288 182003 15452 111540 -74761 82251 -163086 231072 -70903 23424 95695 101150 -23493
14276 7245 13165 -110506 115013 -156132 94478 157622 -59572 25543 424778 -195270 25094
14264 56201 -135863 -269642 -34720 -7835 40742 -120011 -4405 -78985 208299 25292 -64839
14252 -60275 -114147 -5734 -63000 -176599 -7038 -28366 87772 -15950 53859 -142656 183010
14240 20560 176398 -232583 53935 72446 399 52361 128615 -61252 63932 127684 -74225 151203
14227 50062 143184 -148731 -163954 57557 31909 80736 99273 -83163 -110636 46913 268680
14216 268680 -87183 100240 -15873 -78100 31859 -15649 92307 -62806 -114289 -41795 -85767
14205 -85767 46039 105449 97791 41996 -104136 -34524 -66902 -109566 134808 134835 180280 20227
14192 85886 214789 148209 -158786 237960 72030 -31246 21643 -28447 -38268 260698 -30641
14180 84216 8578 134293 -425289 -56949 -10090 -48117 19364 -250765 103153 -254855 129851
14168 -90944 -51445 -307326 -3307 423983 62403 31227 -61527 -4627 135806 46927 10461
14156 -108645 280569 234362 203372 -50514 -61343 360484 -43709 -201710 -106601 217889 32733
14144 -193183 86365 -207593 302395 202882 33320 91982 -173218 4191 50368 -174705 -33973
14132 -232718 -172166 318686 203200 149202 -211255 -100625 207226 -15352 32887 138658
14122 138658 -74268 -129082 3477 -192279 88044 -97254 13114 79511 -2333 -210571 -6243 29666
14109 -41359 5053 149686 33347 -130288 23499 -7346 -22463 42843 -214147 -63952 60494
14097 141516 -273748 -34542 3265 251545 -201886 95364 94932 -177884 60021 -169631 -122687
14086 -122687 120920 -262205 8488 8922 80599 107128 21832 153610 76235 -202616 158667
14074 -109743 87489 20024 -349888 -23045 -19921 51424 143747 -87773 38970 -119037 -45516
14062 159904 -27765 4370 -67259 106548 -54671 -78750 32076 35083 22821 15029 89421 72107
14050 72107 64217 -69831 149795 69582 195683 -40851 -199487 184325 51335 -102422 -82974
14039 -82974 55151 115958 -85833 -128931 -79129 209925 44308 135679 -24943 -1008 -116320
14028 -116320 27783 -95423 101056 30745 -53025 -93821 148311 -188310 -96682 8608 35020
14017 35020 211986 26174 126448 28756 -83641 291520 -87810 70788 -193874 212030 315153
14006 315153 -3657 -26249 137721 350637 79272 171238 -160496 -16961 34953 113564 -45195
13994 23520 -30535 179441 82701 44055 76496 12653 -14151 -86607 63241 -100070 162205
13982 153646 140893 153083 9920 -17854 -55310 234296 10144 -84450 336497 239307 -1826
13970 173980 55414 9823 63367 -7763 11702 197793 -100598 106557 98397 -36594 -1942 192244
13957 -92235 -136399 -109359 -105595 -100521 42960 -57354 49667 226694 -41842 -51332 52788 75592
13945 75592 -99642 -101511 57714 -154280 41993 24426 -69738 113504 -113033 185560 114013
13934 114013 211851 -5419 -97431 -143732 20407 -382054 -74790 281623 -44795 -20778 -55403
13923 -55403 -111734 -57175 -39661 -105519 22276 55771 -158389 80801 -150308 234504 -104030
13911 -53295 43536 -202544 265909 214320 167087 29527 -173796 -222713 -60553 128118 29540
13899 29650 -309739 -130044 299807 -15561 70926 -18755 155626 227400 -4813 -38476 -148570
13888 -148570 107797 75325 -289 -139875 48404 5104 -12835 213681 -43963 -73300 149106
13876 55055 192349 236785 -141484 23831 26707 -141233 -46802 -40129 250105 -97684 42555
13864 -137515 -164118 -68116 40387 -18389 47765 -93237 -370850 -31543 52423 157740 70168
13852 71885 -26447 47320 -50520 -109035 -85833 47576 -3446 214655 -108061 -14582 8760 58966
13840 58966 -97930 9825 -183877 154321 56309 -94994 -196704 40523 21329 -145883 -158313
13829 -158313 127091 64041 125328 162111 35413 73988 -113930 -197678 102940 1570 -106595
13817 69176 -141861 -125456 225492 -16011 -56125 -180004 76098 -99044 174517 228051 227822
13806 227822 -96769 47525 52457 101113 -168920 -41762 119312 -46028 -164608 -27984 335790
13794 142691 111115 9010 -29766 -140568 -89533 -27388 5767 -64895 -23059 210028 -13490
13782 -28212 42437 101544 -189620 96157 349831 -11153 -73137 -113858 214119 67252 19669
13770 -231777 206300 -92568 -60738 196814 -106704 310916 108256 -84916 -8132 2695 233040
13759 233040 157152 20177 -181278 78056 -97062 -38634 -68628 -129007 105987 111079 -18922
13747 -107039 327956 182836 79310 -177046 -49558 -351994 -124148 -19398 -205739 204754
13736 264904 -4902 188577 -122854 41556 -118209 9487 -51633 124661 345887 -87062 -103267
13725 -103267 104445 -609 172219 108022 17927 -75926 81836 101557 -20162 41081 -25425
13713 -5696 -156418 -107483 106246 117232 -170790 94308 204776 -72145 -144941 -139101 -52714
13701 115244 149240 213948 -234056 -157266 -136007 204356 166608 -187120 -114721 128695 74241
13690 74241 -29421 205511 -144179 188779 416288 98507 -121602 95712 -65707 113339
13679 -113522 117419 133205 -79925 -188830 40763 58400 101558 214865 81022 27852 -81730
13667 177164 68524 111212 -160099 -3459 57654 -88063 -101267 -203437 108889 18246 36303
13656 36303 47658 -242415 -78503 197701 99728 -94079 177798 160896 -168652 -12622 21573
13644 -45955 267559 207199 73706 54876 -154097 206695 -68435 260224 117833 -86458 -113740
13633 -113740 -20026 -670 39290 -50086 -63547 51673 22651 228716 287387 -62620 31322 -41993
13620 -110629 33657 162487 -214222 -31817 -77164 169727 -189209 11088 146453 -16706
13609 181654 -45939 -27234 -115202 -25653 -34293 -253944 -6727 -40538 -192026 -123130 -9957 39595
13596 146218 55918 39742 145647 28182 104206 -253243 135875 10404 128302 -22742 110997
13584 -178150 -191962 -158691 -18645 34855 205893 -18153 6411 81633 -209422 35901 -51507
13572 -90947 19755 36432 -135394 55482 -28988 119173 -25686 96301 -59014 -182204 191936
13560 -151125 64562 41434 139730 -149916 -195342 103324 44361 -46038 -179461 166243 259420
13549 259420 -69079 -25863 -142001 167033 -124059 44139 51834 83946 153044 23990 -115070
13537 -1230 95911 -154944 1599 -162314 -42803 32181 57462 -158530 79724 -48551 -120496
13526 -120496 -346017 -179886 -130742 190661 -152468 55684 24295 -154511 -44783 184665
13515 95934 217152 44473 -62204 -92908 63033 -73444 72290 17945 -2047 -62384 130131
13503 20718 41777 126044 -14717 -5117 50288 -189030 -55270 134904 91016 -124798 36900
13491 195120 248352 -86628 218908 -57794 194366 -65090 116225 -240735 25653 52048 82505
13480 82505 68302 118511 -34641 124590 -19250 46079 84448 -31367 11393 -933 -48838 -35398
13468 -35398 -129765 -16924 130571 103200 -80868 -7714 42531 -320898 78893 174216 133634
13457 133634 -470685 -163661 45159 -603 146096 205572 54816 -228365 260480 -73657 -15362
13445 19335 208720 10945 82860 -67425 105466 184153 39671 193823 73878 16785 19286
13434 19286 189631 -32100 178325 -59265 -236375 -49485 -108586 122698 235384 -11545 57841
13422 193002 -55691 -38605 208413 -125068 -39728 104277 -18437 -109362 -153103 132243 -74288
13410 349802 -43751 75659 -2389 59013 -108485 53266 275467 5 90085 -34539 145718 -46130
13397 30752 -141566 3330 69393 -120111 58451 125457 -12755 32000 -300277 -18797 20448
13385 9668 22920 -111823 -227501 252990 -32668 -166581 203793 103078 27506 268847
13375 268847 -122164 -127443 10840 97681 31261 99899 -34190 51702 -36191 -37906 29152 62677
13363 62677 -7461 15181 -20849 -78949 -79837 158319 -14563 -46406 114763 -153928 -3525 -12611
13351 -12611 160728 39083 136366 -130570 211676 -115335 98144 -125910 -175693 40908 9093
13339 100562 -63700 -13326 18253 -99677 -4263 -31142 62505 64893 -185030 42625 -239247
13327 -44465 -22431 -164671 177792 3472 479 -140494 190560 181565 -28303 156380 126315
13316 126315 -21556 43828 323360 -120931 -223948 226959 105599 21094 140619 169444
13306 169444 254146 98642 111015 172560 118605 -149772 -57647 25203 34956 40682 55883 182766
13294 182766 185844 288172 -143868 -213506 140549 -71502 134 134130 -62077 176716 159102
13283 159102 219130 -181055 101597 192498 -118908 308658 130109 90419 123829 5531 118793
13272 118793 -27635 -79584 -65158 -111484 43937 -41948 44480 31258 -16282 18029 -178935
13260 -14021 297225 15079 -64266 -86354 246811 -200536 4705 -134049 58888 -141824 100950
13248 151427 -38321 -45235 -86339 -71892 83431 99159 151080 69528 44597 -16776 -97354 96915
13235 71751 71841 134423 -174652 -3555 47132 -68711 139314 9729 -98137 246738 98699 -26013
13222 55436 -75095 -39948 -26813 -35223 112905 27338 36803 42817 -258873 -58303 93189 -205642
13209 167878 -189882 -108924 -96833 232921 124581 -99462 14096 -104841 160457 91608
13199 91608 -147857 -49363 136544 -15356 -25156 -19970 196455 173256 163335 74899 181641
13188 181641 -95058 126999 -41203 -130657 -44138 -318292 121205 141436 -155602 11773 -73000
13176 -202895 71543 139060 -195956 180779 -114100 57673 -8612 -70885 -78437 -72346 -55296
13165 -55296 32691 133461 26264 -175719 -215723 190435 85579 -2419 -215848 52536 26709
13154 26709 -180954 -75306 77154 14254 5681 -5623 49988 -126197 161865 -121792 -33746
13142 -79340 -171284 -72962 -193492 60381 83791 135260 39850 11612 -147813 -62251 52417
13130 230155 -140663 127727 -97444 108251 -122189 35142 -217502 38877 81402 -184848
13119 -126997 274485 282372 96520 -59637 31556 179671 62892 -252253 64172 -30984 122559
13107 104532 -91500 66053 127196 -36323 -90179 24913 -268814 -82063 160399 -120543 246013
13095 67534 221207 -171941 114238 305951 -115592 -225618 35741 139619 97102 -61305
13084 91300 159065 -14618 15030 301839 -47164 -65861 -38817 -65255 141840 36185 -21800
13072 207822 130091 273707 -92502 -64501 205622 -85774 76509 -86314 1847 93346 -120630
13060 8446 -183134 37320 -131906 -148992 20955 157352 89239 -108160 -15193 -54946 290271
13048 -10490 -143213 25150 83511 -52507 26503 133918 -16597 84562 152790 156334 108145
13037 108145 2353 -29013 -282332 136352 56398 48901 73117 -44577 -211784 -42660 -237304
13026 -237304 69892 -75036 -199067 -10838 247294 2749 131102 -63535 111114 106563 -84398
13014 4861 -181567 20031 144670 67833 -83922 29043 222221 -46897 -111786 -133617 41451
13002 -1321 -139166 -94734 364343 45582 -98934 -233484 104251 355067 13111 26904 63528
12991 63528 120711 -82163 -19293 -41571 -236869 -13814 -43284 135497 -211984 356061 -154574
12979 166867 -109509 -34761 245085 -158536 120895 -135638 169638 -56387 86394 -192866
12968 -197976 76921 -90446 213500 101593 5272 179452 -293727 120463 -40786 42655 39559
12957 39559 10754 222081 226961 -95141 -99036 202891 -36554 171447 -94361 -37855 93876
12945 -18591 -49920 86491 221267 -415434 167849 -30104 -108859 -40765 209842 5310 -155798
12933 -147606 6311 -27529 13128 161329 -46209 94164 131014 -116696 101747 -115973 226290
12921 23333 129388 160687 47612 -123341 144758 351163 -108319 -257422 15942 -74280
12910 -67770 149759 -95701 -403020 103532 238215 -223168 -39986 -47900 151061 244625 -1969
12898 -61326 -76858 87611 163631 30487 -49323 54477 -133372 -57421 -163725 123214 -163072
12886 -271673 -228968 67993 -8499 6634 -129553 -57450 -71449 -35029 21594 -13122 211414
12874 120546 -106884 195445 118066 -160289 -23434 484 188686 64123 80169 36611 -5225
12862 77738 -66152 -103882 66647 82759 41746 -141812 -30311 -49349 16636 228747 93262
12850 29836 -15313 426 -58048 -112823 -23143 -22048 -174384 -31161 -56676 -13112 74722 -64663
12837 110375 29107 60839 194939 70426 48570 60666 -103036 -45857 -95552 -173368 -140024
12826 -140024 7554 18614 -28195 -161889 -29544 22462 -159000 -14759 37885 46554 -61655
12814 -127006 -314079 112170 -167667 -32041 164790 117879 -379392 129970 -189141 -35793
12803 69916 80384 289989 -43359 -287800 83252 165054 -7476 -159418 -33699 77132 -219803
12791 -6739 4180 103126 60438 -111853 164625 197872 -79131 100589 -115608 172532 340369
12780 340369 99314 -160259 -122494 -99032 -6188 40100 -37949 280285 -92911 21639 21281 -142484
12767 -62556 -53472 -101729 602 43743 153219 -294652 -40892 -269371 -184145 52601 105960 -166382
12754 -23599 97684 -141287 155908 148140 442 21255 170687 7806 -35720 -199089 103546
12742 143432 -195328 -65571 -333891 10977 20463 -166264 119376 98740 -199902 -129386 -28432
12730 -21705 -54781 268142 163828 24133 -47459 -11490 30278 -43282 -48016 -52957 266139
12718 -131154 39168 231977 110982 -99300 -234064 -26769 110084 136009 25970 191009
12708 191009 -47142 -44705 16067 13503 96529 -89370 -178014 -4268 -126912 -218535 -30432 -137106
12696 -137106 166669 -171259 314980 -232997 -127036 211012 -63843 -131860 -53378 -40770
12686 -40770 6841 3339 -123453 111552 40731 49663 -5962 212400 220093 119846 -172945 49631
12673 157782 -4710 -174192 88645 116993 73505 -200055 2694 -159690 37269 50401 -32059
12661 104273 -23304 -288080 -58238 -48750 -245872 -66103 -153487 52523 -99454 112156 -126011
12649 -12452 -210515 41718 21459 -4773 -161335 -136754 94555 80800 21423 -35898 7593 77283
12637 77283 -4556 22649 -82349 51230 -36490 80695 -46167 81870 54304 -7027 117036 -17469
12624 19020 -114591 49438 193761 -169513 91011 224460 -103369 98644 15530 -93197 67074
12612 -154390 39789 -98903 76661 -83577 -111488 -24913 34766 18256 15682 169278 19219
12600 -50274 -16525 -272825 -150509 73350 111776 -45700 81792 263100 152418 102758 230967
12589 230967 -113402 31782 77464 -37734 12948 144739 34350 177269 104547 -4464 226847
12577 56679 93845 129271 -59420 -191021 -174787 111549 54530 -89860 -180802 141362 163288
12566 163288 172691 -162244 112147 38180 -4811 22578 -3347 640 -222343 -223013 207318 -89426
12553 89852 11792 91534 -133444 49732 -56101 -67784 132006 28607 204918 -45063 -20138
12541 -59639 54465 -54613 -272352 -15386 -179359 -16656 149578 -136141 -34028 156141 98503
12530 98503 -82404 95802 158631 65213 51211 -1019 -6050 -69889 18696 73046 -39400 31894
12517 59112 -15543 5410 112650 -56357 53774 172781 -31153 -155085 -146341 -38286 27236
12505 31861 -43329 117274 -278336 -24398 160674 -44533 -7105 -227071 -207617 -197154 -99265
12494 -99265 307272 43485 17821 -190579 137058 33084 135409 15305 27536 24977 398677
12483 398677 53243 -46267 -31600 58414 318 205739 -58787 -112472 -134239 -6648 -3851 -5045
12471 -5045 144904 206050 279785 -184050 28243 -21107 18586 -150059 100394 -30425 -108865
12460 -108865 -39220 127064 -123891 187700 275610 -167105 27442 -4700 -7090 41231 -14418
12448 -34385 -169393 -69416 173312 -147934 269726 -150639 126406 -117561 62397 -118892
12437 -158297 -297716 177327 221116 -81084 157923 181792 30963 139709 68476 21800 207016
12426 207016 146065 -307271 -33044 229612 -152651 89172 26513 -19930 -78204 -72904 16764
12414 15698 323980 26735 -188981 -83206 -16758 -101072 234616 50848 -30752 -181800 -83758
12402 19935 -148219 -47152 91335 -7656 -5935 -3215 -231739 76029 52240 -82281 67642 -139337
12389 132184 2697 77123 -42068 79212 249408 19337 103870 -195222 5268 -20288 -38871
12378 -38871 -40951 270597 1752 -31646 -31058 -26863 62291 11739 99937 -60489 80319 -1477 58390
12364 135094 57655 -51995 26480 -223489 8138 21206 -248209 244921 14642 41540 -30881
12352 242809 1965 -166777 -80897 17362 -15114 -21925 52302 -41056 8850 170712 -136431
12340 -7563 96449 133477 43275 -306879 23284 182010 -24324 40110 230807 128143 -184144
12328 -80636 121130 216863 -76223 81307 108825 237445 -241609 169177 -94481 -56765 2087
12316 -77793 -143695 126454 -106449 -148408 76695 -410644 229260 80900 119500 77786 -58967
12304 -102250 97255 116212 214860 128976 -104825 -50239 44114 108962 -115794 -26416 -14472
12293 -14472 -205113 -26927 -59710 181931 95617 -59707 141907 -96559 152224 63215 -9678
12281 58031 43059 74172 1249 -3674 -5557 52693 170309 8569 -20964 134539 -23475 -13987
12269 -13987 18541 -90768 -47708 5062 25077 129166 -372468 -23740 56137 -173194 -52608
12257 -131425 -63522 130689 -38112 8775 -229751 -84197 3261 -47770 298115 4668 -80496
12245 9580 -211004 -169357 40574 59603 -113811 21394 -343089 -85883 43526 71958 30008
12233 126995 170225 -82130 -113473 5688 -65247 9111 -114267 128757 -46932 -27201 5223 171211
12221 171211 8427 -68902 -50324 27358 119214 -69000 -66485 67362 -100150 78415 -257689
12209 213967 -20704 136542 -4568 71782 -27570 86608 187227 58609 202716 -54821 -139997
12198 -139997 3399 85477 -287276 -202243 99187 -113088 55817 155085 -30102 7743 85357
12187 85357 244804 -197367 43268 -195994 -130882 60023 -174207 -105529 -128870 -55032 -19357
12175 -38204 -199798 -88320 -60808 123196 5666 90139 -208207 -96243 -25728 91629 27674
12163 136446 257542 -315084 76181 58861 112674 -139944 -77748 10814 54721 -106095 -30562
12151 -10969 -157786 148525 -85557 64674 66036 -174372 54859 -34051 -125227 -109539 70927
12139 102820 -175895 -110323 79582 -55149 -178389 -186611 -87497 48859 -22661 -241770 157191
12127 -30131 37790 134369 170122 9778 151310 191484 -13874 -82228 84771 164603 -247696
12115 31626 -169042 -56328 57036 76841 -149587 263208 178941 -158774 66813 -281233 35620
12103 -191836 34861 96773 -47577 5095 -22043 29516 -15448 -152123 112290 -343387 71929
12091 296647 164656 114145 -71451 250115 110006 58159 -185513 34797 265398 62946
12080 -33104 152787 129918 -224037 108775 4256 3913 -92030 -79678 356436 -21880 212151
12068 -69821 -75581 -98055 -47530 6467 87946 -154103 66530 200199 -10008 -106658 -166379 207600
12055 3629 -96823 -104346 -17881 144531 -102513 -112873 11304 254743 155822 -102174 -102515 45460
12042 241023 -49319 -72355 -53961 26091 -156060 -117815 -82973 79709 -29406 74500 89135
12031 89135 -95316 -200460 98033 -255054 106201 246327 -69888 -131513 -14352 16094 -280567
12019 -8614 -118997 74274 -61011 160250 -16543 10396 168724 173263 193612 -117216 -80317
12008 -80317 -83172 -16299 -177675 45861 -17838 49674 -9343 -137758 276762 149045 164768
11997 164768 -139274 -154123 -140604 74502 150613 97531 -118676 45517 1202 -49278 168662
11985 -18019 -237369 16738 93468 111768 -77478 -9002 -78347 1342 35705 -75557 87653 89583
11973 89583 -125649 -224245 -174540 28872 139699 61847 -176602 -8588 -109576 128191 98461
11962 98461 -112356 127974 6621 173473 76194 -31384 -50747 -96730 -27820 206106 -136814
11950 -188987 -275649 55777 -61160 17544 -45198 199611 -47869 93601 70792 -218615 122869
11938 28740 104986 -4285 80446 120965 351743 117937 -17989 187198 261736 128318 71027
11927 71027 -101375 -100990 176144 -63004 -132694 86997 -14113 -153 255473 264321 71412 109004
11915 109004 94502 -157926 -104001 47274 -120897 -29510 -103758 -118096 -122735 272897 -49324
11903 2275 -114278 178335 -120088 -74171 -74249 -9293 84149 -38502 37059 -71448 -94667 10800
11890 90840 109144 -106730 -122886 -10050 -156948 -158460 -20091 69395 207488 -18473 37504
11878 33403 125872 -124226 -140666 -13934 82713 178987 132649 206219 -1368 89384 -82778 1059
11865 -77690 286646 -961 202814 132944 -61692 -93520 117317 -99693 -143813 119517 -3492
11853 -223377 -195036 38497 -103700 181450 -4188 -325109 -18836 -38098 -240764 -20694 -47777
11842 -47777 -7063 -9131 -57739 36368 -208714 -145212 73393 -28416 -35707 -139537 -307831 51001
11829 -175168 88606 40299 -159131 19179 -104492 -251815 -90975 194117 -311474 10234
11818 73770 -74668 31089 20302 247997 48409 -56993 71959 -58552 -67208 -206115 181554
11806 70563 -76464 -23764 -100379 166902 -41425 -19332 125278 -99740 231256 134304 227982
11795 227982 339029 61999 23423 -173274 16333 218264 63010 100732 185148 -7578 -156186
11784 -156186 -40000 183780 -182882 184860 -82702 -94726 -104811 168323 21557 67079 87162
11773 87162 -68710 -87735 28798 5313 -33587 81078 -65674 107440 12201 104662 60203 91499
11761 91499 -22083 57158 -14634 122509 -30956 202984 -137296 166565 40199 23504 91013
11750 91013 -159107 355330 -148767 -29582 -28334 55473 49042 63708 -29126 106241 330503
11739 330503 -115631 20597 -77387 9669 224590 13814 -76063 -103274 -79769 40422 -101143
11727 121967 -155964 -58431 -100670 24815 -222604 -79274 -105334 17333 -81947 -137089 57817
11715 -30806 238924 -159712 -51400 -76983 156617 -158190 -78254 30540 93159 -91791 108999
11703 -182621 -119708 -83771 -120449 91262 -7309 70529 120690 -69863 -3539 -203496 152788
11691 -42395 180593 57192 -21558 -173511 -199292 -25125 -115505 -141764 -31040 -35759 85364
11679 -246 135366 52133 -139852 -80584 21306 -5624 32331 156547 -167328 -349408 -46140
11667 -31230 -111521 167129 -177600 -102860 80196 -208764 -65226 -198673 -99786 -63112 98748
11655 -43927 153552 -37040 11894 31565 141460 -36613 -65623 11224 -172801 -7349 393080
11643 102269 170416 -54408 46984 -140872 -117289 196030 -71132 58246 36645 111860 70513
11632 70513 -5931 -10557 18695 84999 -251270 104332 131685 -116747 -59656 -13083 271404
11620 36935 306803 107402 141017 179064 -3643 -6027 -184351 61202 -24437 -47524 113043
11608 153553 51671 4015 -218086 133331 6937 -148010 24177 147864 -165198 -104283 -48037
11596 133056 39855 -92048 -167831 16162 78841 -44383 27833 44551 -302040 249381 66955
11584 233900 -240927 21502 -92573 149057 -173668 -135479 -70825 -187376 -42288 -153317
11574 -153317 212559 -9750 54961 -13280 -90992 120534 -77887 -63986 70415 -67567 -246378
11563 -246378 -77528 -37668 70403 -94643 -18162 -185635 -137187 59384 -230127 -9397 -186721
11552 -186721 -33041 -292820 29601 -49883 163005 185885 -118122 -47018 51345 -57071 -208258
11541 -208258 85059 -111033 31950 15753 23490 181051 113552 22989 78666 -252993 122011
11529 -18772 41610 -135941 11523 59459 43301 -43590 42361 -87667 41503 -407078 23090
11517 -16296 -64378 12904 216308 -17521 2803 -3902 -59388 111079 51297 219355 211810 -147049
11504 273967 -47423 -251209 -226387 -108407 186762 -161757 -26527 102902 -106781 -100299
11494 -100299 -10498 25965 147974 11685 -19219 31135 -31450 173664 -44923 -162663 124377
11482 20992 9518 190867 47900 106109 -36185 251193 92126 -181625 205376 99324 193515
11471 193515 91694 -219773 5299 41446 228590 -75783 138452 25956 53257 246315 103474
11459 166037 11549 44031 136709 262790 99775 -121723 107543 18171 -271850 -146880
11449 -146880 -297254 49368 -1142 -158060 38308 55333 -116807 218041 -34002 203104 120157
11438 120157 20769 -119667 187841 -45411 -17941 31870 -207086 -90850 339541 54805 -120305
11426 -9970 -206764 -32147 -8419 9180 -35937 -86095 -13687 -37021 -81526 152730 186673 -45821
11413 -54981 104892 40591 80614 -22378 -40569 -96589 81864 -59244 -198459 -216143 -56689
11401 7058 -73251 -275364 -85959 20733 -102575 62500 -143945 90660 283123 -58204 171861
11389 73770 -223794 179163 -303542 -262076 74857 100018 -12369 16314 20000 -107736 119700
11377 188488 127545 -14207 -138144 -39755 22999 -295107 161122 41076 -128298 -109697 -134658
11366 -134658 34685 -274463 -82089 -207222 -107789 13821 185582 269028 -122793 6079 2622
11354 -63533 -6090 107616 -18567 -90224 -169922 -67604 111658 80545 -231692 77997 -20101
11342 99122 77719 -232786 -253043 -312112 233958 -68999 135695 124812 -56378 -88586 -87581
11331 -87581 -122226 202647 -328392 326969 -150896 92701 -102261 -82007 176296 163321
11321 163321 100505 -12737 70786 -24591 53476 -45549 213266 94539 -174334 68 -101461
11309 -24780 -106408 213498 187089 -32331 -85026 -37338 -132481 -13848 -57825 -41530 -22938
11298 -22938 -199896 27356 151477 279262 131069 41415 -312420 8157 -2332 176801 -59437
11286 -93449 42760 90832 -160104 -122479 -78502 -182215 46732 46110 171445 79913 4246 -85764
11273 -33810 -11996 247534 91685 -214358 -211237 157321 -190174 92228 91769 211988 -68647
11261 -93910 -174336 156025 -6536 -289335 214543 -107734 42747 -4973 40100 46290 173497
11250 173497 -12947 66279 36268 81832 8746 -163852 28941 -89015 -221687 156505 -64045
11238 -2202 -174027 188754 -183863 86342 19190 -259235 -74853 98880 -74724 -296629 7884
11226 -49873 34258 -94189 -97641 197384 -11335 -67498 133733 -217994 -12949 -170094 -199754
11215 -199754 132334 -172336 -122852 -152029 -90087 -78246 350865 -77325 130325 -26743 63430
11203 -4033 50542 65996 -345336 -98363 -160776 -53707 -176614 -6967 -212610 -241649 -160487
11192 -160487 186281 -189553 -92976 262624 -170521 163511 -142468 -98383 102082 83625
11182 83625 -65562 -136310 -7846 -146155 47776 187838 63969 -35107 154890 -284874 42032
11170 -4806 235145 79012 -21615 -24892 79127 37533 54359 -86240 -135103 -92045 -64565 282251
11157 -198907 -1081 -300992 -92050 -84902 27494 13532 -244511 146655 135106 123431 102039
11146 102039 -69138 -217416 84133 101853 105529 -51639 -56359 -364131 121410 218417 -31184
11134 -80488 -52706 -44350 -105383 45399 129828 119811 -29759 158947 95431 -68929 -69514 -82070
11122 -82070 82082 -70050 209497 84613 193848 -217074 -42572 -83920 -15146 -18618 -102079
11111 -102079 -136430 -164089 113656 -42268 -53491 -203499 -6163 -23168 -57930 -61430 -39491
11100 -39491 187023 -62597 38705 -200012 -20559 105520 49521 66728 -287489 200382 3732
11088 -156850 86372 -5932 74405 -73910 43533 119112 -173307 -74582 51012 -40066 -86973
11077 -86973 -76724 88922 26083 -261239 37358 146082 -8510 -305525 121158 68774 47589
11066 47589 -1161 142793 151009 154787 53770 231370 8876 -267725 -31866 -129038 -242723 49881
11053 -127546 -179824 -91503 65041 162206 71426 66994 21197 98821 -88203 72973 -239553
11041 96308 28591 -307884 225435 52060 6544 52928 -15968 145929 -29153 46013 109225
11030 109225 -117231 -622 -189575 -71431 -250560 23609 -168548 123309 35786 102354 -115394
11018 126366 -74880 -68740 -93441 -156569 -15597 -231227 108807 -116710 -157855 71540 97094
11007 97094 -74285 -96222 152773 -182213 939 -114089 35803 -17124 -108570 -145261 92650
10995 -168237 -44597 88763 -37821 158412 250389 147998 161853 55274 -167354 -108335 47102
10983 91946 -202370 33173 -321132 159338 -117210 3411 158671 -98734 -167697 -106443 23462
10971 125487 78678 -102221 -228563 -327118 -118564 -10206 -32915 -111136 -71438 35179 168968
10960 168968 -42977 -18757 -175544 38232 83275 135914 -127187 -49692 -7270 50184 -17350
10948 3616 168771 61306 137908 -68027 -25437 -112029 -31534 123918 141720 200115 80246
10936 68770 -39297 16231 151563 63794 -136802 -49768 -26398 -187928 -29802 -101441 98280
10924 27470 -348327 -65046 10696 -57698 133748 -75687 100124 -140121 -132590 174621 134003
10913 134003 -60143 -347114 94855 -111674 97826 307060 -78405 -118023 -186507 -204502 -32229
10901 -72798 -135536 -116548 -170194 -37124 -117243 -114082 107220 93663 -69435 -142328 70362 -54467
10888 113213 -143005 57810 69810 -29342 230873 2298 12518 59521 81873 -53245 -69681
10877 -69681 148800 175649 -213706 -14104 236678 -170858 -145120 -65146 -93939 -194332 -15664
10865 200253 -83152 27030 -180657 -22455 -8083 -220780 -156463 -328212 158612 149195 31228
10853 -42954 -62140 -1862 -49011 55086 -25664 -186743 -230661 -7041 219718 -91535 -274880
10842 -274880 2354 102105 -8061 -59861 123009 259889 -144979 32872 -126276 -94046 -326270
10831 -326270 74986 -134320 -86747 -23636 -45787 -246907 -50692 25193 -12294 -236820 209578
10819 -40698 74413 -649 4765 -72950 106441 182977 17848 64541 -39690 60101 -52081 -115118
10807 -115118 -112442 -44486 37389 -45202 -260918 3091 -134542 -276857 126969 -294796 -175341
10796 -175341 -123673 42973 -193318 -191831 115065 -114891 80066 -187613 141226 115687 59974
10785 59974 -234892 32018 59577 -53528 140252 166795 157219 108096 4215 266456 -52823
10773 135404 -162522 55976 79885 -32732 75080 -151502 -159232 82760 -107617 -57097 145266
10761 62550 175820 -205329 -126069 -338106 113906 12684 99359 25760 159388 158480 -10168
10749 -218816 113558 -981 65768 23442 85576 87144 -40979 -47835 -368625 -112315 -26891 147497
10736 -123433 -51389 193402 237085 -134684 20080 32657 -49617 128744 -115401 5312 -91117
10724 98914 193483 -78179 -85328 55342 -42577 -143868 -139047 -109380 -44401 189564 141866 -78573
10711 -280712 -223210 75787 -115237 -348063 219520 -157020 -61635 -5213 -120628 -110147 80364
10699 -135325 -42178 -13180 38286 -58850 87332 130004 -3460 159313 -103270 -65313 -291159
10688 -291159 349 290665 144587 97639 -246311 58600 -112759 -61031 125624 101690 -45551
10676 -92770 162810 -65495 -133764 92952 -32522 156550 94523 182285 6048 -90298 -133264
10665 -133264 -28444 -115044 -187008 168748 113234 134066 -99346 80197 27344 139166 -11861
10653 -69219 5633 93548 -196434 -73727 -24256 -113215 -35123 -181216 -36363 202397 776 53007
10641 53007 95426 40732 -168661 -181120 -190568 -382846 -78300 11773 9237 -120123 72058
10629 199349 -103643 -72609 -93632 -111889 -151990 58321 86208 -90427 12305 -221837 166495
10617 -199269 -34625 -6487 198530 186506 -69088 14512 190970 -126118 -72163 -118222 -19481
10605 17666 22813 -42312 -129832 30396 -66421 80784 34077 32365 -21278 13121 -53039 151782
10592 66762 -67530 125338 141182 -55202 -29988 -134208 -111073 -35512 57552 -257994 -54268
10580 8599 86988 -35549 43991 140993 144803 152226 -69274 -85728 81398 -170404 -118769 149036
10567 -56726 -82420 -42066 115660 89929 -93533 -36136 159779 132708 -238186 -59933 -209021
10556 -209021 86040 -68746 -195486 -4684 -167160 89732 16322 -143348 39662 165189 80549
10544 -91563 -37160 16113 -28686 66494 113673 125371 -303515 -69885 -43538 -40818 -53852 11728
10531 184876 -159045 36450 -81292 -65071 36652 -43267 235958 -15255 -36656 89192 46443
10520 46443 21079 103537 -36839 23459 37832 -85652 -24805 -33406 -2214 154139 -50258 120984
10507 -171397 9416 -36041 -96392 26507 128668 177856 -113267 55913 -37689 22853 -117176
10495 179088 -202881 8939 38582 -93966 18116 32030 -42367 -103893 -72614 -151981 -23235
10483 -104352 41184 -125696 216551 -171720 -46317 -130488 105690 -180617 -71623 134009
10472 -271533 172541 159932 -146941 -143279 -31905 55584 -5411 79250 3417 70844 -222498
10460 -52704 -4109 -100272 -104798 -1253 218042 -131212 -24349 -77785 -4712 -240678 84235 81168
10448 81168 -171017 -247279 -28848 165454 -243830 -32438 46603 124670 -93028 10393 81257
10437 81257 -185210 68511 200575 -5974 5757 -30528 -124004 -264617 -13671 102593 -218061
10425 262607 -1813 -37201 124948 -192258 -14624 28335 47491 17595 -274072 -31295 69831
10413 -56792 59959 65745 88173 8199 120379 -97764 -73386 450 -58433 -89854 -119751 118396
10400 68171 16733 12089 -25572 28028 45958 -75176 -119585 -101058 36879 -146880 -27601 -139459
10388 -139459 654 30544 -98685 -8696 86714 -37288 -228544 62787 -195800 85537 88310 -71363
10375 35492 108970 -14015 -58736 37837 -49563 77566 -43325 -206779 -329206 137008 -155286
10363 -165648 141428 77095 50330 131159 290720 -91207 42191 -143840 -15322 41791 -59819
10351 21638 -168398 227619 14114 -103115 33729 84657 -303430 99033 -139037 -71915 -69875
10340 -69875 -322859 -147263 -164888 -111215 179787 -7441 -29172 -57709 162341 -44 -201447
10329 -201447 -161303 277265 94266 -127118 118698 -268568 177746 41711 140136 -14279
10318 -97315 180944 -65029 -2661 -309305 -280841 31378 -99788 4814 -79339 -13701 235342
10306 -62703 -93336 -175360 -226298 -124849 178400 -63954 74360 74706 28127 -204947 -204092 2911
10293 1448 88576 160051 132464 -61249 -188321 -37992 35701 103030 55423 -44912 -304095
10282 -304095 260792 79834 -6521 79066 -9717 5237 -113946 21237 6243 78853 -119319 -156566
10270 -156566 -267592 12579 261915 -18617 -61965 -45050 -29813 25448 -125043 -266427 -215077
10259 -215077 979 -33200 -145939 155059 13194 33159 -112460 -201775 -91972 255069 -105503
10247 -32242 -80374 -174770 30252 -75923 -161129 -104924 -97517 -170436 115688 -60133 171290
10235 -38945 -158977 -191990 -38410 -105860 -94398 -25370 41215 -53591 -85363 60384 138075
10224 138075 -37471 -82818 -42337 33059 -53289 56982 -10312 169515 44361 200965 66216
10212 100114 56931 -70670 -24595 -144831 -75147 -59917 -139784 139667 159999 222376 -187717
10200 -103908 -152330 -51496 102641 44199 -7236 -56900 -102307 -32576 -44532 -168480 -32447
10188 29366 -75870 74186 -13089 250983 299016 -133060 63159 -167602 -226616 -60161 12023
10176 -12232 -347324 185691 -171071 -193597 -100088 -22296 -137403 -160579 -231320 -79954 -2476
10164 130192 -127256 -106532 194130 -112476 -289848 -189022 165809 341818 37004 61932
10154 61932 63055 261097 116364 -188033 -203695 81960 -49918 -3071 -141268 -190783 -120820
10143 -120820 208863 151598 -226418 51578 -160620 206460 194267 -39178 -163403 -167354 -77483
10131 61901 -134193 -133110 45064 219914 148766 -197339 -85772 18045 -167105 -14211 -27768
10120 -27768 232550 87155 -150593 -74630 -165100 -36165 -54301 103466 -14935 -192383 80596
10108 -181001 -86185 -242797 109776 -57681 263425 14877 242924 14260 -62773 122970
10097 179440 -203655 -191171 10365 -215054 -91525 140669 -75501 -63928 355629 88614 -161436
10085 -54288 -161196 -245201 -189210 -84315 193141 -97605 -213826 -277526 22564 -83948 13235
10073 -80393 117223 -65853 114663 -13727 -211122 -99500 41247 -172594 -88944 -113718 180904
10061 16883 -70907 14437 142752 -132673 16699 -167929 42524 143085 23641 49587 221371
10050 221371 -11875 -45293 -24729 -90283 -55579 150497 -16889 -127522 52588 -136261 -154579
10039 -154579 92604 -28003 51452 -140420 -50710 -155092 64476 -49277 15645 -272950 -4914
10027 136127 -29613 -72228 57783 -51641 158518 -82142 52509 -153671 6869 -26783 -76095
10016 -76095 6688 46145 -127236 28885 89544 -191250 -242453 -196379 -125178 -12270 -59295
10005 -59295 46404 58670 -54818 89977 -24522 -14533 -100302 33065 -6435 -15808 205039 -131222
9992 -2979 14925 -160280 -95155 227703 -21095 -32521 -347391 246436 -231503 8128 -142294
9980 -48290 -69245 14938 -11514 -9521 25821 2363 -115944 93602 157950 25942 -118244 -30282
9967 12102 5960 151509 -259553 92436 -242594 -31970 -61975 187964 -70267 -110589 97490
9955 14757 -203167 -15698 -284886 -131741 -64908 37606 -92770 -200898 -126306 -4738 156012
9943 8006 11483 86830 140736 -79509 -203445 -108305 280006 -194506 -52401 -87040 59385 108718
9931 108718 -157121 -222343 -231366 -29155 -100592 -42427 211779 148019 48751 93765 -86315
9919 -319417 -133181 -60748 43494 -233497 -11449 -133961 -245770 28875 110086 -214008 9459
9907 -197465 -43295 -124127 -95041 104467 -2437 -75946 61194 135194 82510 180555 -94141 -195752
9895 -195752 -177847 -166844 190400 -141897 129358 -96088 61777 -42270 -131885 -109635 -232824
9884 -232824 39007 99893 -56223 -299764 -357271 12468 723 -40585 191235 205363 24028 38048
9872 38048 -93426 147072 96516 -128967 -159837 156391 -111241 -257236 299252 -148496
9861 252249 111842 -150922 35916 -34830 1337 149144 -169362 121232 -211537 -181599 141479
9849 110004 -3146 244603 17862 -177001 -221456 -135932 17641 18878 -131514 -55992 -22601
9837 -77281 -49761 -220620 19543 127706 -4753 12927 -334448 -68057 -57315 29356 -75215
9825 -64844 214545 71610 21744 -158246 50722 -162477 -88915 -19747 -228437 -71148 45685
9813 -131394 -88445 87309 -72162 73761 -174790 1622 161355 121906 17943 11026 -15212 66118
9800 -130002 -89612 167730 -19567 -271314 -263996 -18581 -152147 -44175 253692 -152069 -51952
9788 174614 -134383 -93495 -180115 -7751 -199575 -95676 -120786 1934 5891 -280022 -84269 -71506
9776 -71506 -206187 110855 -24253 -151019 -97603 -221 99049 -8592 -52600 7555 40954 191662
9764 191662 -97890 -22078 -66168 -88184 -269277 219933 80956 -181920 -251776 -60455 -141330
9753 -141330 -137457 -93727 84766 -238876 -356 75056 19852 34411 44387 -309031 86563 -101826
9740 74900 -98473 36718 -2594 94781 63591 168176 5240 -312590 15279 -152809 40564 -259553
9727 34607 -87300 -272936 11473 -72608 -97528 57876 -90637 -78514 27513 -61751 -130351 72246
9714 -140727 -226677 107516 -8277 -10722 -20053 150144 -116414 -33247 290215 69226 -151181
9702 107118 -164668 -141124 -27988 -10247 -452 272389 -15949 -12279 -51668 -138259 -79296 -97717
9690 -97717 -61849 -284353 70882 -124393 -17754 99879 9913 -189795 33016 50521 -1019 151087
9677 -202872 -70536 -311304 -157199 -272781 -62283 -215707 -126991 -81778 -235022 108262
9666 -31694 -48521 -3575 32253 -15709 47910 -282790 46033 -12380 173879 -63415 -76339 -410386
9654 -410386 -11152 -151034 317374 107657 184561 -44496 -36803 203146 -127884 -162992 -103355
9643 -103355 103137 1031 -190599 145467 -85063 116290 38777 -103166 -81719 -106565 84317
9631 -150174 97287 62419 212116 258352 -238380 -25491 291 -54421 169501 -92043 -49435
9620 -49435 -40996 95647 -222123 -132444 -129399 -290603 64439 67010 12462 -92637 -312435 -73305
9607 -114475 -40040 -143157 -36322 82690 -69523 -40530 12609 -66868 -18983 149608 -31128
9595 -192736 -236918 15256 115572 302353 -63989 -176351 -47407 -67430 75256 43049 -131417
9583 -17200 -242690 16001 -61782 -43900 -229032 26036 157163 58929 -191726 -181003 110479
9571 -169687 -61330 112998 22965 126392 -101017 344948 58495 -43021 277271 -102006
9560 -280237 -226576 246942 20747 -97012 -39352 -96663 -127336 -121505 15338 -4212 -34673 -54237
9548 -54237 -77814 47981 -84034 191030 -338434 -67070 -260414 -317010 -99966 -43310 -149307
9537 -149307 -79440 210603 44879 -43488 28704 -23524 -33004 -13733 -100908 -221354 -127810
9526 -127810 -109803 118948 141534 -157531 -75131 -100851 -149685 -163306 87429 -180710 -90425
9515 -90425 51792 -55481 -80994 -82149 163246 -50976 14127 18882 -59372 -106351 -69674 158339
9502 -69671 -19537 152774 -15915 -42133 -111796 10111 -44699 194926 -413241 64113 -144838
9490 -95745 35231 207941 115175 -162223 -167519 -28606 -218746 -54291 306889 -75732 -13813
9478 -44006 129405 -13414 -113120 230179 5172 -187722 223331 -99911 -295470 41222 97746
9467 97746 61421 -78226 244117 -139906 -39322 -126155 -113946 -263796 -190252 19631 128453
9456 128453 76026 -193950 39958 -33324 -90581 110221 -85711 -53953 250350 120308 -3904
9444 -205891 111006 -56454 122041 -4830 -55332 -17858 359383 -66708 93880 34192 -281813
9432 -75799 37502 -145643 103169 -248967 -90401 -9869 -119593 -84636 -154657 -190908 -6923
9420 -239195 -37859 -56578 17273 -124213 185845 -175744 -20353 187368 -20417 -179415 60804
9408 -113102 173304 35075 2390 125698 -144749 -165086 -254692 96541 145294 259668 19270
9396 -110062 45886 -94030 52708 181350 231221 413355 598706 989399 1459834 1829195
9386 1829195 1718589 1421867 1091121 715163 670448 719818 778400 725464 1406590 1990484
9376 1990484 1648877 1854292 1221013 750838 283521 347134 368737 -100124 180327 268209
9366 268209 -98048 169249 -47001 263100 -28192 25001 155521 17882 40296 -2287 -113172
9355 -113172 -41467 -31054 -6741 136046 118718 -28871 -46380 143803 -93761 -131538 -23078
9343 57 10579 -41189 -10211 -112882 40159 -190096 181291 -765 49947 42276 -116819 -2162
9330 -389525 317865 -92489 82971 -256760 -90909 -126658 -229282 132587 -125235 109964
9319 124899 -90040 60262 -115961 -23021 -128453 -305535 -114028 -22472 -64736 135 -214458
9307 87446 147201 77560 38313 -97857 -120698 -23133 -7017 -22240 -82170 -284082 200839 -48010
9294 -72292 -120350 143872 -99571 -158313 40242 41138 81925 -58556 25924 75881 -27737 -47704
9282 -47704 55349 178305 -4165 89910 -41438 -98822 21977 -237807 -80874 88192 -72463 36086
9269 -95237 -58991 -20691 -157527 -56524 -130655 139094 -125970 -179629 -27383 -227370 98625
9257 -34064 -25601 -89899 -196086 -189581 -136140 -145609 -83757 63813 -123565 -171113 30344 -190670
9244 9986 78902 -110762 152619 -231656 30091 139641 162600 52851 77749 71969 171940
9233 171940 65998 -63601 -31112 -235891 73390 -84420 -253982 -172543 -79743 59726 -190830
9221 -202710 -224075 119339 -76012 -96797 -195488 -165075 -125295 -22735 -307857 49620 -6039
9209 -222202 -12706 -187852 -199159 61968 124066 115907 19934 109176 -82790 183403 181474 -100848
9196 102653 -98086 -86746 -57039 -94898 243415 132139 -113775 -178848 -51993 146891 139586
9185 139586 -177950 46880 -61102 20347 -79423 157509 -189177 -121212 7082 47503 24862
9174 24862 -141721 -66718 -6368 114671 316071 -132812 11610 13622 114613 78247 33469
9162 -122670 -119176 31200 -154558 -156140 -29536 186701 28467 -170400 88387 -153548 57048
9150 -61563 -176075 -47056 -58383 -127526 -18480 -91548 -235606 -53986 -4591 -250659 2960 120714
9138 120714 24988 67898 -232191 7379 38029 -109566 22926 -80129 -121415 -227192 176189
9126 -162958 -163824 23350 174725 -261108 40336 -122656 10208 4781 358999 -45788 162926
9114 208836 188655 433953 357502 913543 1168127 1994678 2163099 1477374 597364 572927
9104 572927 448416 143059 163133 191616 477991 241069 468724 372788 595337 1233047
9094 1233047 2180446 2640491 2367429 1313760 515157 255463 239956 72172 210254 -128931
9083 82929 141261 -70643 -13132 -227451 167513 139469 198533 -68478 -17675 -68959 -188213
9072 -188213 50562 -113433 237539 212182 260931 -108415 122369 49750 -51526 -661 -54294
9061 -54294 -101527 -143541 -57774 10843 -157574 33028 -31696 -19750 90221 216597 275089
9050 275089 318727 742974 709634 717873 664087 426209 59933 78446 69863 121336 17672 -12378
9037 31852 157483 109574 33455 69425 -1143 82268 -8312 73027 105046 79644 5160 1569
9024 484426 231229 365628 677288 1147620 1491296 1599736 1640804 1386118 953584 521975
9014 521975 341202 281116 171121 122383 213632 107588 133694 134103 -21852 149458 119063
9003 119063 38319 41358 163961 94227 249782 -37490 29586 76541 99827 -81274 385795
8991 603807 745948 1265888 870023 801589 420620 7423 152331 90911 540533 680633
8981 680633 1037078 1144038 1164470 845842 585292 275403 145813 292173 204437 66024
8970 331362 405071 396480 298541 1098921 1271444 1865868 2254568 2242174 1576355 872947 823246
8959 823246 673776 396909 59577 446042 132289 384005 673604 985318 552357 938323
8949 938323 1461762 928863 999545 404645 462368 310622 168565 123399 202902 166057 194894
8938 194894 143256 121509 191660 314853 -66445 185727 -99902 143770 133587 408675 252221
8927 252221 155748 255094 437594 136749 545286 -9635 336096 28286 -161981 423113 54776
8915 341876 32452 498223 254581 243047 165095 -126831 94378 135257 150388 -601 -5782 -31929
8903 -31929 215794 -6320 -132610 -44676 -36818 205468 -184537 10947 21929 45049 18709
8891 208017 16352 61633 67876 -62393 -19455 -39327 -88742 -25315 81153 59085 195306 155243
8879 155243 22074 25982 136042 263698 -13135 -114251 72551 -62002 -162380 34841 -70931
8867 -9277 -64634 146690 -182907 153418 -15526 -48378 -158304 119014 -116016 79842 -9543
8855 -97620 133924 91917 -92247 70754 159963 82596 -201621 -86679 -132549 -29652 -197597
8844 -197597 -43810 4917 98833 57370 167873 -55737 -195986 -158526 -106438 -46132 177038
8832 -182744 40345 35910 81811 276978 -78495 -1543 -120442 50455 -177163 52135 -62341
8820 -61209 -80103 74653 149245 37876 -47539 239065 -153983 18941 10954 247309 40834
8808 -165224 -102397 -54240 -85625 -207762 -54618 -270097 -72605 2658 232981 -108434 -161775
8797 -161775 -48673 -22064 -84223 -16760 173260 43956 -206760 -19008 -108398 -34652 20337
8785 -290117 -196199 -35719 -313943 49375 46355 227414 85569 -31693 -214604 10334 -36564
8773 -129466 172877 54276 -142708 28386 -47 85844 -40273 72352 111520 -138929 -92947 -59497
8761 -59497 27197 -17338 -128565 32759 27404 78236 191898 -17194 7619 -242869 218533
8749 35308 45710 322827 143737 160336 108392 202054 136299 389172 150020 326862 115224
8737 181228 388992 603648 457415 579912 870369 815013 1272724 1560179 2012568 2272860
8727 2272860 2908621 3671668 4327129 5122292 6053789 7867916 11313332 18877246 32864341
8718 32864341 53194392 72822529 80920250 72326802 53157699 33875807 22507289
8711 22507289 17834489 17636842 22918580 34703125 53404972 72856817 81213925 73296331
8703 73296331 52909622 32228010 18248033 11338719 7776326 6176692 4857627 3771710
8695 3771710 3324644 2652217 2026724 1792939 1499660 1421699 889177 931298 753694 697316
8685 697316 648920 602608 526266 532460 584337 334920 520921 391003 81151 343188 195122
8674 195122 319497 102198 413308 265700 300635 161013 286322 188956 -98024 209046
8663 344881 303515 209573 378122 385554 586647 556779 455469 409839 473382 249897 77078
8651 171579 -199911 -6212 202645 245681 -29827 94278 351805 167627 160545 86838 -79404
8639 4673 -80458 -5180 -42904 86066 309653 356478 265700 562950 1100336 933853 965326
8628 965326 663232 519794 244484 -1933 3320 87070 -98666 67803 -49454 136063 74230
8617 74230 76913 40918 -21763 -124076 110428 -30779 14889 -165501 245874 334680 119093
8605 127225 -38628 378923 554415 397636 266901 172437 323425 -80977 -97249 28987 -63229
8593 -229003 37846 134746 63474 158652 189647 -171111 132697 7474 -79570 30682 102604
8582 102604 -237864 -67796 16601 -169107 -143692 5025 155183 -127117 73506 -119141 185305
8570 -133243 -126887 -167216 25602 19071 -196260 -47775 -67370 -3362 -284602 -16546 -101417 -52509
8558 -52509 -41417 -88814 -49686 -134473 -270747 -130407 -121089 -151087 -14830 19022 -27657 -203468
8546 -203468 -275898 -103918 38770 -196549 -80470 -272378 -46174 -118721 -201514 -351965 -83038
8534 56471 -407354 -41546 87818 44828 64952 -122651 120111 130618 -88678 -246389 -231566
8523 -231566 -203183 -186161 16009 10156 -167189 -193841 177692 127619 42699 -192845 -35536
8511 32984 50158 -40122 -14432 -186546 154570 222295 -229076 100753 -148912 146155 666288
8500 666288 853710 605098 695549 662988 660318 180655 255829 113341 218181 428221 299479
8489 299479 755140 562792 689831 411478 249278 217302 289313 33822 -82998 184506
8478 -43336 126279 4126 50002 75452 -65820 -51473 157391 183332 701050 805888 934372
8467 934372 714680 679416 672084 526228 280748 447270 252240 571305 791430 1156047
8457 1156047 955288 752087 462253 250980 424286 444744 37502 199480 -94956 -37274
8446 -44125 38265 -190824 20815 340180 -2912 -106966 -89211 -162323 126277 -232968 -97870
8434 171953 160377 28256 -43904 -391673 -77680 43187 62403 -159447 -138167 76654 171770
8423 171770 -132972 -22787 -169565 25272 30603 -101290 -265749 -221167 -178753 -124415 -106136
8412 -106136 -178185 134301 -28445 66752 -5108 77350 -92105 -113895 -103121 -68923 19434 43093
8400 43093 25304 -67516 -218359 -189149 205164 -5800 -125789 -258594 -351480 -197286 -47807
8388 -341843 -333671 -152919 -223977 -311128 -130390 213924 -141688 -222511 7241 -213931 -86762
8376 -125451 -139738 -148297 110407 -78720 -144118 -78224 151794 63022 -6450 -117755 -76223
8365 -76223 -281371 -210831 2504 -247421 133925 1081 -303153 -83226 -283287 187550 -47972
8353 -16329 -14458 -71637 -314275 126039 122058 -70936 11860 -108072 -267034 -75185 -10201
8341 -77424 -54163 -23957 -127677 -15008 -149276 -172440 -251069 -13306 -242046 -339980 -146198
8329 -112092 44769 100802 -78418 -129570 -46806 128891 -351864 -53276 -16068 -284216 62403
8317 -45889 -3635 161344 59330 -36871 -114001 -262856 2149 -20884 -83006 60302 97757 -107758
8304 -88259 -927 263279 275995 22246 -205847 -97092 -50360 56811 118271 -73322 76817 107201
8292 107201 118080 18632 4136 188080 -173992 8698 -94400 10373 46276 44059 54762 15619
8279 315970 92318 113483 125272 117604 -158097 10012 -98857 14831 8859 105308 41636 103814
8267 103814 29180 -85147 -72163 -74 221634 290691 92378 200617 158988 107686 -81399 255469
8254 71112 119699 238146 120598 136221 257268 207187 254750 363531 434092 295449 446479
8243 446479 319993 407804 173227 307186 522369 646216 596717 480633 582603 563530
8233 563530 533574 483329 521397 640231 668928 836565 616123 713667 711325 665509 591447
8222 591447 963019 760387 611700 618767 371619 392710 606516 310819 427831 378092
8212 378092 279670 410785 596161 157070 205826 96626 293430 94381 -172209 51182 91189
8201 91189 93902 -208658 109758 -174255 -48206 -254794 -166832 -18382 1592670 18455 4409870
8190 4409870 3554180 809670 332216 36171 221710 157023 336956 271068 408625 230210
8180 230210 479273 210726 495019 66332 249675 304813 273489 385379 414093 402559 509565
8169 509565 468421 523695 361269 361913 444412 872938 691467 599649 580337 637142 678188
8158 678188 763133 690766 889944 710877 812336 789321 889733 741191 683000 702858 863165
8147 863165 995202 446459 1046101 666972 789326 864684 1024432 691519 696745 792944
8137 792944 634797 1020477 701197 659574 706503 957790 872807 618531 581256 570173 555048
8126 555048 516887 695364 774367 644616 343339 457146 641513 706837 529409 649360
8116 649360 802251 483427 545411 448775 454426 454071 564766 515443 621268 637160 523874
8105 523874 486561 288679 369854 512508 466439 258340 289911 440577 560018 319635
8095 319635 347822 411727 366717 509996 253668 366044 759646 713256 929537 963955 1091357
8084 1091357 1273404 1439452 1614185 1987986 2406195 2685887 3349276 3738065 4694753 6126062
8074 6126062 7686159 10379416 16852800 31110739 51218612 68681180 66526952 42304826
8066 42304826 23350548 13504010 9509079 7346539 6019969 5358579 4573776 4667874 4493894
8057 4493894 4247499 4736426 5208271 5359350 6108628 7212843 8409865 11037913 15663257
8048 15663257 27495119 47059544 68746790 74714225 53731779 29913489 16502565
8041 16502565 10519738 7575693 6070507 4630508 3780292 3095267 2582054 2148812 2149983
8032 2149983 1892123 1671002 1799164 1514454 1125080 1127867 1062846 750542 591856 601990
8022 601990 655948 481788 450493 656058 483990 414946 296614 530743 196832 442071
8012 442071 376129 341316 330502 588835 -128050 168917 379543 35828 366100 187336
8002 187336 438440 -42122 127689 162625 -110142 82682 -40521 162459 293442 128438
7991 -2662 2034 299068 28537 21512 9793 -13717 -247488 180752 -100829 259498 123075
7979 64615 -80848 87761 314485 -53578 -182484 -85894 -203906 60812 66798 -84023 -91525 -243300
7967 -243300 -25933 23946 -90734 97971 186965 198417 -37871 -250641 -268126 -14448 -50822
7956 -50822 -9369 137976 -65380 101407 -265422 -18173 -222181 -37063 -35653 139078 105304
7945 105304 -188420 -56022 -65054 7412 180234 144780 -19571 889 -207258 -63135 46321 -65696
7932 -140439 37121 -17878 106181 46213 -63132 74718 -120054 109784 -289148 59089 45980
7921 45980 275176 92707 -59556 -38387 -53713 -92709 -36678 115644 -48267 63275 2016 54359
7909 54359 186317 -122852 20702 69244 46985 -215280 -46362 208457 -18874 245560 -77134
7897 -149261 64056 -157041 -163800 65514 24781 -237458 49445 139070 -30574 172414 142902
7886 142902 -22517 109262 50377 292671 -46984 -97376 129085 38910 273415 222573 191926
7875 191926 181680 121060 -5772 138666 -24693 -109693 104552 161765 452219 213103 107176
7864 107176 207230 250900 149933 309793 45951 421189 272469 116423 193401 340763
7854 340763 250071 630401 402122 403440 714896 697830 806509 695025 1004809 904750
7844 904750 1059131 1018839 1319985 1326682 1535748 1752300 2094149 2545250 2936420 3482504
7834 3482504 3777900 4802744 5194685 6356282 7765515 9151155 10823269 13010984 16183934
7825 16183934 20811323 28017870 41364011 66193068 106375610 154696459 188288619
7818 188288619 183681968 141397066 88471356 53836336 35877215 26608388 21329056
7811 21329056 18042360 15609662 14665281 14224129 14424454 15206753 16222768 17814956 20828525
7802 20828525 25395669 33521715 49165918 78019478 122858836 171657382 198540681
7795 198540681 184708344 134305036 81904426 49781980 33027086 23984770 18022887
7788 18022887 13757329 10969030 8642184 7343276 6069946 5030616 4484147 3940061
7780 3940061 3347962 3019118 2930974 2797786 2509584 2527345 2436665 2144232 2074572 1998212
7770 1998212 1981804 2169851 2116309 2149965 2300208 2117920 2067631 1773987 1593391 1395541
7760 1395541 1408770 1109303 1065173 1281021 913091 897938 1070887 1065687 886182 774381
7750 774381 863641 636614 414975 827502 876495 686015 872316 681094 654884 890266
7740 890266 943903 710154 925350 1010608 1322409 1445126 1882427 2503645 3127413 4045862
7730 4045862 4407878 4353439 3733700 3068476 2786990 2276025 2089453 2025817 1759539 1713842
7720 1713842 1858109 1987259 2386932 2837178 3236367 3515335 3365303 3414729 3505024 3423293
7710 3423293 3043624 2434243 1983122 2084214 1922216 1976552 1649714 1338418 1171505 799541
7700 799541 666069 663908 568757 403248 313970 445923 296801 492594 484718 690507 918926
7689 918926 1086590 1467567 1219028 1076912 936792 660155 769453 539388 858926 716852
7679 716852 691665 1003007 1148409 1464755 1432643 1426407 976448 918146 501725 712477 476763
7668 476763 206202 586264 355054 484997 181814 24322 -92200 -109205 -42994 -24120 -6752
7656 65920 -126852 -202852 102395 17116 -124205 38111 -5588 109711 89027 311327 -59410
7644 -8470 -179495 90274 178991 179288 79293 116153 54949 85509 56273 280182 71573 257115
7632 257115 -264429 170467 150639 147136 115714 -74449 122476 19756 25746 -107897 58863
7620 -17066 -45729 84674 -148899 6145 -12257 -184010 -100686 141479 -4202 103105 -252775
7608 35498 -277773 196858 227011 235159 -158983 -51199 52376 236177 -262245 4570 -923 124699
7595 -77817 363375 73701 181190 -45603 173689 67773 -61245 37855 384600 148289 -23663
7583 335287 307293 414616 785002 700820 851269 917227 842057 778496 600508 653083 415074
7572 415074 685515 848114 995059 1192631 894848 843518 800900 950901 1219410 1453808
7562 1453808 1261683 887327 629531 792115 912278 1006963 890063 1165989 609930 587276
7552 587276 624905 220943 150614 185827 228129 102562 75767 247054 334674 -118636 296760
7540 125260 377335 243668 145996 382076 509495 356894 829720 882545 863341 527895
7530 527895 390141 639533 693987 701244 503157 667712 319200 399669 200761 361099
7520 361099 272856 329180 278000 218718 403247 190187 261467 -73166 -12862 33200 90340
7509 90340 60319 126764 213494 5764 157218 161837 3346 59763 171497 -146627 229139 -215111
7496 -165003 -158516 -92028 49682 130831 -29139 -208517 -31548 -143318 48214 169331 18279
7484 -15521 -85147 110185 -4410 -104425 -88208 -14039 70743 -273734 162834 -284897 96461
7472 53280 -29503 -42810 -53799 214099 2380 122090 -128804 -87584 90391 75527 -164194
7460 204996 -16992 260837 472201 251451 529541 324708 125579 309207 298388 270013
7450 270013 589941 404880 13631 355359 371074 264933 146359 168063 170612 168738 145495
7439 145495 152163 222912 -25185 82616 167171 112176 108953 -48508 500007 -124791 170000
7427 380931 409464 197214 413016 412735 366158 518995 413015 471165 525114 726785 688396
7416 688396 530056 710194 643255 786781 827625 743204 1020857 1197828 1045552 900227
7406 900227 845922 571070 594331 671047 377216 859409 915788 868071 576846 789058 475960
7395 475960 478594 364966 150365 358354 123433 172688 -67816 242310 327296 215180 251745
7384 251745 -26810 53012 -12058 246011 -82689 -152475 139752 84827 194550 223021 -95351
7372 -39440 -90635 -16452 -27160 -55887 18535 197534 -117381 23745 128059 52633 -133207
7360 24967 199050 86430 -175370 35604 200763 144362 39237 -25671 55832 -27852 84290
7348 282010 277132 328884 440309 591174 458486 485969 71810 186739 248778 276162 308816
7337 308816 365724 564440 574767 339012 491642 421468 425352 507788 386237 378278 68722
7325 322083 441576 167533 435293 270002 470987 571389 529423 426292 354566 435441
7315 435441 397687 128438 105864 174287 65581 147665 187839 159603 123116 68409 385624
7304 385624 324113 120896 389032 175820 378060 470237 514179 464245 555824 607885 713159
7293 713159 705621 407564 434748 491627 177592 450180 508169 555775 698725 648085 911834
7282 911834 1034347 996847 979413 1013205 1120193 837291 1047628 973926 1022808 745677 964621
7271 964621 1300023 1487044 1550907 1588720 1818275 1982122 2167493 2465960 2523590 2950675
7261 2950675 3115874 3297970 3880648 4505995 4830055 6145516 6989180 8692610 10654701
7252 10654701 13970639 19294273 28407708 42430078 58672537 71350219 72072683 62116636
7244 62116636 54105877 55271377 65125090 77365435 81581289 70667586 53922162 42539771
7236 42539771 37359878 37304605 36177288 31888563 26595638 22223000 21475527 23289349 25959684
7227 25959684 27873347 26873977 23966262 19980681 17813574 17735999 19279966 22174970 26837702
7218 26837702 31688975 35744911 38605928 43171483 53486024 72314233 96694810 116907481
7210 116907481 119448319 107116062 98688064 103887355 120036816 134931367 135350468 122420147
7202 122420147 115284108 129081076 163764447 204760510 230652943 228248734 200279293
7195 200279293 157161766 117558395 96558761 97867262 118731853 154186200 190781844
7188 190781844 209841368 202331324 171808044 126879890 83168525 53936040 37573682
7181 37573682 28577866 23072255 18855003 15900404 14041194 13166216 13219292 14542241 17422793
7172 17422793 19007075 17843816 14755193 12154119 11550750 12849951 15185202 17817957
7164 17817957 17449318 14409208 10044518 7715609 6157746 5392733 4697312 4603249 4603827
7155 4603827 4213617 4300628 4333324 4476350 5021922 5166374 5614992 6312327 6860547 7887876
7145 7887876 8914731 10471235 12413580 15567962 19868264 27161241 38870416 55778978
7137 55778978 73455728 82616121 77763333 63770858 53252459 51419904 57992414 68589460
7129 68589460 77413842 79088660 76411012 77503102 83348562 87407872 81260227 65671568
7121 65671568 49107442 37225236 30403342 26932767 26429001 29553856 38036818 53680054
7113 53680054 73835004 89401101 89738812 74552513 53606096 36765042 25763105
7106 25763105 19507195 15546817 12961168 11300534 10331669 9371198 8771284 8733603 8526154
7097 8526154 8940977 9106781 9834009 10685338 11879635 14309871 18116586 25744708 37750454
7088 37750454 53395234 68473123 76685943 76622835 73013672 66428926 54305607 40753014
7080 40753014 34088974 33942136 38117383 46031871 57396867 70361076 84190742 96970047
7072 96970047 101234649 90921941 69289265 50374590 37836139 31220068 27986441 27675433
7064 27675433 28484447 31781659 38818627 53743473 79811999 114460782 141279208 140279668
7056 140279668 110779805 78993913 62234474 56794841 52881218 46233548 43922573 48188755
7048 48188755 55181815 58099940 53907737 53091019 60403723 69643230 73540528 71273248
7040 71273248 76996906 95221173 118041689 127608803 112666962 84768309 59626664
7033 59626664 43533148 35356025 30905763 29109911 28538985 29953648 33397029 39817121
7025 39817121 51201401 68883419 91423286 112780079 125045141 128119025 125259856
7018 125259856 121154851 127556467 149049714 174451782 185959162 175990059 161576007
7011 161576007 162283079 170648376 170457613 157167700 131258528 100527504 79821897 70863884
7003 70863884 72900577 86859138 113665693 150839817 185216716 200612198 190509787
6996 190509787 153443342 105024816 69746056 48979623 36820684 29588494 24332585
6989 24332585 20991097 18981189 17707958 16844644 16416599 17074204 17624635 18965749 20981414
6980 20981414 24202419 28458245 34670480 43055612 57731662 80293493 110470620 142164977
6972 142164977 166970954 180149358 177768993 168376614 159723025 153897580 150677033 145883751
6964 145883751 138090255 120947816 96066442 78846726 69878093 62797240 55817972 47648764
6956 47648764 38362122 33087891 32904119 35987684 43086260 51598060 60360260 68307255
6948 68307255 73929636 71966142 65414570 57842944 48277998 39800043 36241984 35922500
6940 35922500 38718425 42077366 45146351 46533756 43897973 39091588 33799159 26750052
6932 26750052 19754378 14854907 11830899 10029532 8926697 8303936 8439802 8687690 9743119
6923 9743119 12144277 15430412 19870320 23261311 24359462 22321414 18428183 15841625
6915 15841625 14972046 15828633 18162377 23800746 34911873 50354356 65629953 75982019
6907 75982019 80731119 93111457 100876603 91630669 83343463 90563113 104806638 113790768
6899 113790768 114908541 117419840 126351432 145372577 152269143 130720383 100085774 76955066
6891 76955066 61061710 49027300 39885787 34873375 33556000 34888516 38526107 46340361
6883 46340361 63100039 92457599 130489936 162869289 175402525 178956714 206831690
6876 206831690 252654057 287901398 307532858 308922346 274405288 231112195 206398257
6869 206398257 199273514 201827630 217303325 213961739 166277091 107428052 71196627
6862 71196627 53283295 44905163 41400181 41781945 48103304 62354913 85033359 112419723
6854 112419723 133001764 137709521 124626053 94910762 65019100 50588233 48715756
6847 48715756 53669185 57547631 54591886 43448980 32062585 25259030 22700079 22885252
6839 22885252 24649311 28292925 33398919 40022673 47517338 52383986 55560954 61176351
6831 61176351 71214890 83007306 90206319 86294456 74518252 60137724 48550540
6824 48550540 42354618 42061006 46386488 52310026 55423414 53003721 47566843 43496402
6816 43496402 43249710 46906566 52854555 56339754 57037316 62070118 73298364 89118032
6808 89118032 93932568 73984513 56597955 46943703 40979327 37274573 37127940 40889243
6800 40889243 51849473 67932659 83752320 85130655 64617929 44612529 35632379
6793 35632379 33685238 33883538 33402330 31035535 27800113 26184825 26529008 28328761 29111207
6784 29111207 30136966 33172720 44550013 65408126 90781607 102832871 88432883
6777 88432883 66019535 44908995 33616751 30025935 32724424 45069520 71496973
6770 71496973 106935745 134542881 127485906 85345655 50319469 32446481 24910420
6763 24910420 20737706 18982436 18605975 19327478 23080939 31594209 44626695 56480436
6755 56480436 58042591 47633987 36424967 33976223 40062939 51871701 67163087 80818839
6747 80818839 91098571 92603443 76241091 53529894 41897217 43338447 52342792 60039781
6739 60039781 55073393 39554411 25349742 17463133 13789359 11699655 11100886 10757698
6731 10757698 11591066 13693359 18115894 26050614 33507115 35470995 29160479 20067082
6723 20067082 14779207 13567176 15109875 20792389 31777327 43958104 50789970 43885572
6715 43885572 28342432 16139903 10153833 7312696 5926608 4573733 3674359 2928538
6707 2928538 2720598 2552653 1728786 1702435 1781889 1402506 1447228 1171218 1183451 1275150
6697 1275150 1586884 1542985 2030197 1909639 1795503 1691242 1531068 1469959 1392079 1365566
6687 1365566 1231131 1481016 1340056 1293271 1313823 1481324 1149752 1003477 1009737 1062356
6677 1062356 1133874 1149415 822854 872106 994653 1115573 1183542 1245746 1225317 1210204 1428336
6666 1428336 1276359 1267429 974051 959805 965752 1001935 769060 1170277 843214 1142533 1325069
6655 1325069 1342501 1046685 1139471 1204469 1139540 1177634 1108775 1052871 1006813 964156 844551
6644 844551 1077920 1018411 941484 1039977 777829 702641 515527 507408 528369 471082 44175
6632 547043 670845 452243 942062 675210 643394 492792 990915 622667 659729 729149
6622 729149 571082 427491 481022 661310 691866 527107 663534 457457 404293 311950
6612 311950 384670 240813 338134 293819 819253 537746 380436 419728 697499 459550
6602 459550 470900 405169 406599 642291 270830 425808 403014 782909 946172 755820 502946
6591 502946 512715 385044 501995 400435 456041 699361 707924 604796 480164 584865 449522
6580 449522 429475 210515 326096 371266 557142 512768 424502 176195 354877 346096 372064
6569 372064 196452 299896 358567 492670 594429 530897 513998 468024 291798 364138 358069
6558 358069 360146 452253 482984 760497 773410 691490 622616 336162 427587 501302 281903
6547 281903 432899 464982 201408 224796 536761 446639 505483 449626 554931 411028 394495
6536 394495 617506 99051 522908 731385 862178 899032 597806 501625 538198 400840
6526 400840 552731 550467 654219 454569 436309 468063 507655 614574 386460 456809 277273
6515 277273 429086 429758 163156 343518 776298 510043 998161 599243 803809 1005546
6505 1005546 566285 610406 316686 700452 578244 568969 518322 549934 497441 614161 591278
6494 591278 812236 743843 818818 1070806 1531876 1976929 2941207 3344568 3499259 3077961
6484 3077961 2796815 2381262 1988792 1938011 2102546 2388535 2920526 3483547 4020014 4669379
6474 4669379 5993368 7629586 10787653 18708599 31699394 47085394 56001239 49709908
6466 49709908 38879553 29343962 24643589 24390427 24199903 21663797 16226327 11443176
6458 11443176 9065091 7574834 7395631 7377625 7602248 8710934 10175291 12697875 17175490
6449 17175490 23513764 33344751 45183211 58645939 71142225 77077214 77620349 76629114
6441 76629114 70913416 59543095 44104842 33128875 24079422 16966597 12386517 9900620
6433 9900620 8435728 7778065 6896830 7015493 7299372 8467212 10982944 14567359 18570256
6424 18570256 20988078 20569433 20613869 24162733 32921503 43262426 48947382 43928831
6416 43928831 28739727 16300429 9691606 6893170 5244389 4196976 3641179 3098290
6408 3098290 2704153 2281556 2081075 2010942 1702127 1901736 2104669 2524736 2688706 2910864
6398 2910864 2544557 2022942 1025081 964999 993428 871520 930470 547150 441115 378878
6388 378878 479222 253292 682370 422132 511354 384192 585875 457903 739525 525699
6378 525699 438634 395384 574045 250071 316728 228025 168097 332462 321609 235300 304200
6367 304200 226637 238815 -6363 445207 255351 108279 420252 232680 200116 177197 492058
6356 492058 74184 595595 98565 248870 29046 83857 124365 263463 -14313 162554 11531
6344 158846 15451 275019 175787 345766 364076 166693 -31774 259539 222591 145470 116317
6333 116317 146761 17916 124498 123573 307820 192648 139914 102773 115434 -263026 193964
6321 4541 38942 54891 154507 229095 67936 219835 361239 17237 29389 204028 -39308
6309 178912 132828 318397 57926 -57385 37641 38556 70596 197392 20155 274455 339363
6298 339363 121597 249563 153496 7486 436976 -119549 198449 78284 366493 73893 -108658
6286 -29453 -48378 283480 -82035 294453 -63021 -18961 105208 34398 26396 76589 -67245
6274 326232 129563 -14341 267368 -269 34536 260643 45599 227322 209413 91465 365897
6263 365897 194195 362674 165504 121054 368557 212297 199511 265063 319009 247249 360293
6252 360293 128222 420194 57423 51355 -4584 195663 246215 312093 114804 133875 177664
6241 177664 249336 73805 257260 183317 189171 268399 259351 324461 299075 351911 385128 333230
6229 333230 447279 348086 423915 331732 552592 362008 372679 211550 430217 -40364 352494
6217 -129513 267576 287119 449952 299612 177598 170612 254443 65785 168797 158621 280715
6206 280715 39324 34489 183765 288996 186193 360631 96517 259977 353130 -122351 176921
6194 203171 -115702 237332 117689 32748 -3585 268719 62976 -17403 -160083 73189 206089
6183 206089 -25860 -255313 -56664 -103602 68370 113922 281843 103444 157677 -25319 96109
6171 187629 -84837 305662 187669 -216596 22254 -14689 175234 219322 102679 133675 130016
6160 130016 141576 37474 -13866 250346 2102 138681 30631 399940 158487 -163789 -52472
6148 -9621 84885 68451 113782 113556 -781 -168059 -83249 -189284 -30891 -56199 -40679 -43924 -64809
6135 -64809 -104479 111723 168734 -60448 -29220 111408 149874 -38298 -23897 228332 -92902
6123 -13489 166870 77201 11068 242493 237900 -15501 254696 -94787 117803 89408 16496
6111 -39678 167890 82287 -31452 125546 210735 -84375 -123513 339636 -91170 -41862 6204
6099 18577 103118 27941 110751 153949 -110161 -124792 125325 188493 99061 -3176 102885
6087 274430 222953 54978 152428 -62838 -92123 -74671 36468 1384 -134971 -79198 330 -6491
6074 -40294 -127970 -36567 -15933 51932 -188829 -150554 337387 53467 68802 35206 -67129
6062 129999 141868 14601 -8311 -97949 211586 39579 -175793 72781 -216884 120231 103703
6051 103703 181816 -99201 25955 25542 148944 85316 119479 -329248 107596 63107 62058 115171
6039 115171 62949 79063 167587 -48173 101285 215461 79032 -14155 80900 -116771 113297
6027 35832 -161772 -222744 339444 262243 59871 -58246 16114 6447 -66749 -137265 -67817 -9296
6014 61978 -133227 115828 134555 10538 121201 59475 19112 143973 238222 345413 278723
6003 278723 94778 73447 133662 64538 -119595 87367 90058 -33487 -144264 200606 -146105
5991 55571 -242569 -233658 61216 -85492 64412 70406 19082 -209391 217167 31347 91450 152666
5979 152666 -101655 160319 180594 164000 68240 -42279 87946 127627 125003 14267 100755
5968 100755 71397 -40026 -121464 160580 -81285 47784 -15103 36445 -125598 -120090 151009
5956 83666 13066 -5185 -4673 82642 -35666 167633 15552 67883 -196373 -84865 -70442 148397
5943 70254 -197130 349468 -160835 -22245 92014 -82541 -43647 125974 50950 31537 -53660
5931 -83735 136423 136625 54677 179936 28603 -67837 200898 142021 -66487 214003 -77571
5919 -88173 57763 -73983 91038 56878 123327 212359 197527 -138652 -211541 5323 -166391 55235
5906 -71117 -37661 -76574 -29796 212490 -209668 -10917 -140550 192889 58799 246025 -52473
5894 -271568 79038 29966 -131994 4380 197999 196484 -45297 102796 -198729 -89245 240319
5882 -253411 18064 43185 -6164 -180602 456897 159007 235989 -224065 144991 286704 -153448
5870 19386 -87971 -102898 254457 -20986 -88928 49501 100584 -144550 -233535 -79770 -8422 118687
5857 330829 -24124 217246 54430 66168 129331 15826 108376 -35315 175676 69175 -2691
5845 -242867 -37848 257534 33224 -19935 98860 193197 82646 101974 -34103 -117056 -32673
5833 32336 -151109 -290095 -66188 31160 55505 77897 4827 -75306 -22578 425034 -70932
5821 -186211 139239 146660 190536 -27378 216273 -38373 -159041 176439 -36865 91101 35287
5809 217665 -77205 145676 -230270 -24874 118915 -213448 24539 190422 220499 -158011
5798 271292 -127643 -124588 101286 -190662 -166633 -137732 -111349 126718 -13804 34847 139878
5787 139878 -49078 -105991 83124 44404 -48143 -114170 -102552 86842 724 -5146 4615 -37373
5774 14135 160185 -88090 -5121 121789 -90331 -150371 77138 -395957 41600 86189 211676
5763 211676 -33315 -32623 -49887 252869 -179328 47851 215927 339251 250288 78550 289146
5752 289146 270889 33687 305171 8439 29580 -43352 332387 58803 -180017 -181529 5410 53198
5740 53198 -17070 30313 178372 30392 -169382 -9013 53021 171227 -72150 -49872 -67732
5729 -67732 146864 107152 17752 -93830 -226284 -110838 -20266 -32796 -74551 10052 -8457
5717 7939 -201960 52925 62369 -111057 101803 -119475 -52330 285961 95613 322423 -245267
5705 -6171 -120034 -97125 -78479 221878 -59147 19188 16808 -159391 21571 182815 65863
5693 -222980 -20468 185337 28071 -7601 211869 -144822 66679 -94270 225729 237804 -23167
5681 46191 -157832 125136 138690 -280654 -81510 343188 72789 -32267 37406 -178030 21208
5669 99101 320740 189257 166668 -99954 -214549 -33941 2355 -137299 184033 -95969 34354
5657 238892 87741 -169527 -49584 -22317 10904 -77686 179514 39924 -1790 -129578 281510
5645 -46797 122068 77735 144192 -233329 92361 -156965 -66587 7022 88885 -196757 169287
5633 100777 107752 166168 173140 -69508 88955 -35513 -45142 -88044 61476 -152592 172048 -304681
5620 234786 81552 20550 226725 -48818 48177 -44620 95483 -45117 150098 -126664 -28455
5608 -117063 103715 83695 -54211 -166202 -50257 -116878 -151303 65924 1510 -55728 125099
5596 223409 -74372 40164 115683 102632 -40295 112348 55733 -59685 -9875 -115563 -74515
5585 -74515 6201 -97101 230929 142788 -17136 -68649 42578 294861 20954 -46136 230037
5573 -114105 243331 -193685 -132653 117158 -13210 -202095 -963 77798 36096 103368 36265
5561 -311826 312138 186329 -85951 -2036 -89497 -89420 133307 -152189 43060 -102640 43851
5549 -69385 -93171 -30595 202979 -100549 136528 -37369 122352 123999 -17773 -139776 -124666
5538 -124666 -54625 83665 -56042 -254805 -70677 -154832 36593 173642 43750 -71403 -127759
5527 -127759 150373 -264545 -288245 36789 -29200 188828 -7798 -93210 25852 118647 96284
5516 96284 79360 64809 48940 -29927 -9343 82974 -59801 64410 261958 62895 31036 234455
5504 234455 41795 -205151 124835 -120668 76814 -70423 51664 10153 133002 158681 49668
5492 -117695 62959 263049 73464 38685 360932 142228 60200 -178427 113721 182681 45548
5480 221980 90318 95856 109064 136782 246417 218894 -19471 -149854 -88449 -88529 270351 88557
5467 -91513 260245 93562 -53985 24861 140235 31434 -16931 -93663 -37170 -121095 -191072
5456 -191072 -87835 -106112 51696 304684 154637 -38955 183332 144985 -79091 272603 -100280
5444 120500 14936 220749 210820 -29114 43815 76071 -30029 -73116 206488 -44977 28020
5432 -80180 32366 -39532 -142847 -71866 102862 44608 67657 147589 158887 97856 102740 250215
5420 250215 -23333 90486 -83560 -88376 -24745 165550 91131 63443 -118650 -22756 -43145
5409 -43145 -33550 132822 -67045 293519 -20013 -32905 30023 -140397 -51767 80443 149792
5398 149792 192041 75118 -154109 174933 -137106 -58586 -146463 60818 61255 -17560 9223 136405
5386 136405 72167 161715 33740 150021 164076 100174 39884 281291 50705 29220 -98305
5374 136566 -56245 278459 -930 -84193 73311 41611 31352 45777 -18413 -44459 -110970 227945
5361 130493 -24928 -740 7480 97915 170582 -20416 -2918 198848 237188 37049 186490 150261
5349 150261 158910 176289 191082 173093 176291 288979 16900 255517 133160 105334 46823
5337 86750 39220 85073 44374 154177 -89365 219064 198429 233425 29800 76014 -134158
5325 216490 58014 221550 185330 -35590 -2482 -32843 59476 95971 244768 331964 232840
5314 232840 237461 -87279 209918 94074 76694 196463 254343 290213 149637 279546 48707
5302 267907 -83652 -17594 192455 92797 146610 295630 106020 239473 64261 49243 212340
5291 212340 -116363 12411 388951 -22773 155695 26106 376691 -61750 89818 -99585 48717
5279 45312 -25218 156542 -93652 301323 276108 137061 274944 213723 111185 205666 192985
5268 192985 150194 64729 196868 238045 43139 137030 200379 12500 61340 34917 55329
5257 55329 233407 211702 220430 226610 251895 -10491 -23016 87489 35052 386660 131608 -43754
5244 -88571 145650 108677 129921 86778 111383 35478 349736 39003 19991 105318 19966
5232 65912 -21640 93918 73731 125580 390483 254165 110143 289125 -177288 -12055 -127688
5221 -127688 144841 130049 303851 311955 274528 360530 -45321 157467 181145 382124 195520
5210 195520 243727 298581 104992 192385 126264 451186 111574 395756 581549 703051
5200 703051 653549 893643 1384828 1877732 2699350 5021358 7831145 10855561 11714981
5191 11714981 8687105 5268954 3240351 1973107 1531356 1121709 706001 658502 607740
5182 607740 531205 381901 360177 285221 182473 410097 481131 152409 388881 425879 399882
5171 399882 451840 493868 422673 721526 699921 880286 877794 1013757 1549560 2039070 2801252
5160 2801252 4868278 7816060 10835444 11693159 8819138 5206732 2845644 2090519 1402371
5151 1402371 917250 898469 922499 806379 599331 494492 709906 343502 302102 464446
5141 464446 409317 605986 334070 384557 614998 393368 682007 642104 717759 511157
5131 511157 373464 425836 276102 298329 472793 367783 534570 461666 618405 998162
5121 998162 897276 1300773 1443250 1778594 2069389 2696969 3316263 4281217 6915956 10187113
5111 10187113 12921343 14333763 13829220 13557621 14062447 12637190 8568868 5417675 3636705
5102 3636705 2951892 2329717 1933911 1795607 1519649 1406145 1660942 1709189 1580348 1453745
5092 1453745 1999285 2725040 3313777 4508599 6929251 9772838 12444364 12288596 9213760
5083 9213760 6853640 6419077 7897821 10451075 12751999 12077661 8328458 5948963 4068378
5074 4068378 3009488 2531400 2536050 2495907 3082860 3297052 4692666 7153133 10313733
5065 10313733 12496110 11076223 7308690 4500735 2834083 2316624 1462849 1221614 1072743
5056 1072743 1002998 1045094 709234 893123 918803 647635 750569 1069076 1007301 1282374
5046 1282374 1115870 1021714 1857095 2474352 3438424 5553168 8282550 11116476 10882668
5037 10882668 7615034 4646651 3123856 2195257 1641411 1430409 1143621 1074403 1078605
5028 1078605 732339 626882 761539 383815 367817 603581 293258 286282 70875 265507
5018 265507 273800 629443 123401 90722 246331 169226 351914 334317 297731 168232 292936
5007 292936 102034 319562 236227 203532 528562 415065 223732 495108 181501 181605 210158
4996 210158 423121 173222 359537 294590 327795 254855 610320 253578 257607 148765 430691
4985 430691 157666 254514 197731 401883 34329 149692 162758 267975 288907 731035 308986
4973 254669 252395 391764 355692 313363 324872 229565 159057 175634 123068 443156 48064
4961 -28995 274079 307410 333570 -157449 80289 -175059 334077 67886 221502 75221 271849
4950 271849 42245 -30931 245707 11120 222403 401897 144817 -101239 49245 186082
4940 186082 -119321 49477 92344 -67879 148900 -221832 16480 258647 -101115 191725
4929 158506 -588 -207796 163633 -40872 125657 65740 -11940 235563 -30361 129830 226843
4918 226843 105904 186443 -5642 79263 236824 -10423 -1285 241198 189243 79894 -117565
4906 134717 -60049 195866 46495 198624 143694 47001 30616 139157 215557 49161 269963
4895 269963 194457 20992 253578 -56668 183589 -51992 21116 229862 -32411 -132192 159492
4883 73678 91099 -7632 225068 76518 -72063 246839 161780 80306 212390 234649 -208543
4871 -200888 156524 -10516 -6564 92899 -226516 -20019 42904 115237 21218 62929 240834
4860 240834 -38799 127789 -30761 -43393 184574 -2868 -117818 20830 69830 241808 56981
4848 -142100 100817 109094 9043 -130207 -156492 171183 8530 114491 -56487 -70118 264101
4836 279355 -162011 -96882 -73692 107702 330065 495226 293289 241631 -64610 30438 -21206
4824 369588 14584 49295 216285 31500 -287999 173622 101447 21165 135621 -248361 -45625
4812 124578 -127150 107487 50235 -55090 78168 114035 3979 -193389 -262037 -158861 -144920
4801 -144920 139085 54176 -40217 192534 114085 86999 128896 122917 172008 -242787 176875
4789 36794 -100337 133849 -39480 -86040 -91974 -221885 -31807 201284 55651 -298184 199216
4777 25828 157069 67741 -83120 -27082 192917 155682 62921 23283 122576 -29988 172087
4765 36751 99951 193807 88014 -31974 294675 112408 -25918 -54961 -24536 -75808 -286704
4754 -286704 80325 110428 33161 82609 -47257 18181 191108 45811 -66299 -24420 -9096 189068
4741 61245 257234 123438 60665 -29339 273525 70900 -117385 -6352 -6763 238702 218787
4730 218787 167129 -137644 134 39261 -121155 -135303 -4014 170021 151160 -100790 18991
4718 110722 -56461 181926 123821 -189742 -284547 -59356 176217 -173187 -28303 12344 67577
4707 67577 -94170 291028 -35459 172598 43505 -9289 313535 103898 38049 31421 -315014
4695 90174 89078 -89212 220476 102200 -147109 159257 -81235 168652 -57300 108356 115023
4684 115023 27416 233547 16740 -99216 59372 -65318 27138 17039 -75581 170384 35931
4672 135493 -77439 -87853 92070 57152 218978 130811 122120 -50167 54165 97807 86857 -20297
4659 238038 13022 -56474 15 136766 -8119 287007 -16418 231240 43497 291542 157075
4648 157075 154722 -60899 246328 107879 75080 9944 100905 -119355 -246190 162651 396030
4637 396030 99016 -70249 69446 292173 -103451 127506 86140 -11466 151151 112152 24489
4625 132212 136248 196437 65528 138953 12011 75959 39687 6784 164451 189048 58810 25156
4612 -52641 291721 -176726 5529 149328 -94059 89199 163381 -167694 -91593 18783 278351
4601 278351 -67271 376801 41822 103114 33880 -58248 188686 -30549 44955 49502 -236595
4589 -159964 186182 -150875 -128666 79062 88923 -10542 36465 150321 -181089 -8017 80000
4577 59047 210084 115956 14365 89456 16980 51488 87713 22273 57550 -35872 7537 167827
4565 167827 36436 -118880 40624 298006 222851 -74029 -81371 -94172 172431 -106515 -252383
4554 -252383 -180818 92855 4592 220954 123333 172123 59446 20250 66655 124850 -6013 -37178
4542 -37178 -136374 -146833 -58442 39267 -20758 117976 59619 154516 -30285 98501 -35481 112064
4529 -166423 40921 -48264 -828 18911 99090 -45389 -342017 19818 8012 5025 -52977 -31532
4517 -31532 88374 148256 -88143 26058 289344 -141109 -28670 191139 10565 22112 -120600
4505 -13599 -31800 -11134 -91184 -195467 -129076 -41706 98037 122990 73588 -198228 -55763
4493 -66210 40982 112707 6929 -10779 217959 164218 239398 2042 -73238 -169337 56436 148987
4481 148987 -180741 -164669 -147660 110828 103668 15201 -193627 24323 906 -29130 15447 5316
4468 108908 49934 125518 -53284 -141508 36284 36405 -214229 -20937 -58915 37816 -185510 65959
4455 -219088 -140658 -55236 -146489 241377 -20780 -50952 180127 -8015 195194 -260753 -77032
4443 138246 324785 -102191 -321953 89694 -121820 159630 -50094 160786 169675 -9396 2947
4431 40919 -94956 -134920 -63878 -61953 -90662 278598 -30230 64280 93023 -40174 -139305 44136
4418 122133 242918 54747 -120025 133617 -116811 291460 21371 -69873 -129002 18222 106074
4407 106074 36074 96230 -155295 -115204 -200162 -72887 -50013 360723 317614 56294 73990
4396 73990 168113 150447 128801 14883 -97758 113821 225012 -243632 -8303 36238 -274429
4384 -65846 -115274 111482 60682 197293 135416 191472 -73068 -78835 -252532 -143350 -39988
4372 -190093 -161009 -57317 -72201 -105228 -18223 56110 14528 -17752 -165447 -35239 -9859 -138081
4360 -138081 -94740 66041 107399 12622 -136925 -303707 -4158 -55721 -14014 262982 73658
4348 -106862 60077 -96279 -67184 319082 -78257 -66811 91412 35263 -134015 -135124 -55351
4336 -30757 76924 -59157 277021 -166850 81648 -265397 -187264 64403 170273 -27132 -114604
4325 -114604 39116 -201543 -74716 -172349 -59596 270306 -179762 108616 -291540 166443
4314 34006 -135167 80549 -25862 -173106 892 -304332 -174272 -142791 290092 -94098 16292
4302 -91695 -27417 -115411 -16933 -286502 175819 -22249 -157975 -25041 -75166 -45684 39414
4290 -33702 -72827 -63244 -17181 -10533 -13848 121892 -89207 -43955 140285 -50135 -125804 223848
4277 -175436 19583 -130204 -138940 -494953 83583 -279564 -168162 3041 -9771 63964 -72768
4265 2458 -232715 67873 -36006 -19649 118457 -227109 75798 -269288 105593 -93391 -76996
4254 -76996 -181992 -335903 -94382 135365 -44831 80338 30554 -29484 4562 62230 963 -215359
4241 -58834 8223 -35020 108715 -73177 93606 -21159 52215 182993 114964 -1754 149056 122185
4229 122185 165740 929 49940 91748 -222223 136396 -151636 -13516 198354 -276152 164628
4217 -20088 19897 132063 211973 -172467 -132434 146045 33798 -24160 -220414 -5846 5588
4205 -2897 175 -208950 -130233 -74854 -19634 -147221 -94917 -240471 -25292 -144557 151058
4193 159828 -329876 -6552 -22317 53353 -88738 -98867 -76902 53161 246315 222584 205577
4182 205577 227517 -199076 -4219 -35 -130492 206809 -175880 39602 9372 -27458 -56031 -38630
4170 -38630 63787 128772 -177338 -78579 -14309 230804 -26097 74772 -242665 -144942 88368
4158 198797 47048 -31355 -142427 -10679 -89878 139460 204531 477852 91556 -71525 -101719
4147 -101719 -119816 -95688 56226 -207211 69040 -110252 125227 80136 22797 74365 -205210
4135 -55291 -172508 259863 -185207 160839 67584 254137 183539 90949 27772 -151807 -177997
4124 -177997 43351 -40315 80593 178587 -28629 53760 12096 -16726 152421 -149990 -116258
4113 -116258 -60499 55230 -33203 -172837 76179 -102213 104994 -169973 155788 20832 36083
4102 36083 -131912 177843 5013 64785 167472 -135136 42227 205997 78088 135778 233062
4091 233062 -11783 72524 193738 -88468 179722 55255 -64704 86879 38798 -94939 -25714
4079 216000 46575 92532 26229 133725 77075 78923 -122821 -18049 -180267 -95717 72537
4067 -82743 -288220 40124 -16068 29518 70184 -92183 -20377 -18327 165181 -54749 -127419 140264
4054 -90097 -180013 133547 -86977 -388225 130814 -131649 37058 -116095 -71940 -69982 -301353
4043 -301353 -78717 -25811 -33228 41371 -265941 -162298 27452 -121600 -103180 130470 22969
4031 24190 -50533 -72996 -14642 -148942 -197441 -200796 -1219 -16796 102964 -67759 -54176 56461
4018 -38511 -172359 -135171 -161564 -79294 22295 -42900 23734 -26720 -39107 -13332 2220 5755
4006 5755 -5092 30904 -97836 -90911 12232 43513 -64970 127828 80742 -339849 -5793 -39264
3994 -39264 -134835 62106 -116049 -338684 118416 -63989 -62714 -207000 -36544 42367 -11062
3982 -263819 -139761 72938 -189565 -30497 -224630 -118083 189337 63327 49616 47382 232337
3971 232337 80606 67756 86850 62064 -153428 315045 -159881 -128168 -26296 23568 -63201
3959 -139400 -173549 -432049 -136916 35160 -111808 -29401 -80774 -172180 -31425 -18719 269077
3947 116381 -119168 10041 -23984 41977 25642 156346 29576 4622 -180588 55363 117686
3936 117686 -57907 -66821 -205829 160272 -138714 -182203 89146 253648 -104285 62323 -53784
3924 87614 -62169 -440620 121912 13513 -117867 -53335 112952 99598 -174568 -167782 -14893
3912 -187822 -159879 -305406 -77940 12610 -94539 41869 115087 -46946 -152724 -66949 -215871
3901 -215871 -182803 -222185 -163480 80410 -98780 56925 -191553 77789 -42425 -210276 34398
3889 90416 -103883 -38166 -47516 -60541 201642 -211836 100856 61254 -105931 -128514 17581
3877 195130 226985 248680 31516 -196860 57745 78847 -23492 160615 -252858 -82059 -150662
3866 -150662 127221 89952 14185 204383 -97755 -65516 -64355 -186962 -286243 -25385 -327830
3855 -327830 -26882 -203053 -144609 -98409 -118983 -54544 140366 50121 -68982 48261 105929
3844 105929 205495 133885 -101017 -480817 258511 -81030 108614 -323996 156943 7575 213813
3833 213813 24300 171100 -31959 -84535 352 -300847 -37446 -192857 2380 -148505 58960
3821 -68913 -56236 -119304 -81665 -21823 1692 -33833 -22390 207568 -164804 235900 270180
3810 270180 -16273 -124988 210233 -10097 -680 -198298 79052 -22571 -117934 -7672 215149
3798 -62926 161556 -2405 163361 -90157 -19144 6187 -173205 -106641 29425 -61936 -87658 176963
3785 57260 -88209 -114576 42367 -77197 -105741 -111213 -184855 113706 -44772 74349 -227965 -89338
3772 -52585 92724 -203276 -46070 50001 -104372 40995 -116192 -47765 -48552 -67831 26651 142431
3760 142431 -70862 111682 -232390 61546 -5025 117491 153967 -76141 -134741 -17362 170691
3748 -10656 -5119 -47864 11803 26854 -34675 12991 -34443 -289863 -250562 -230754 -340755 -124110
3735 32083 58942 -162221 -104444 104140 77318 -52120 -230978 -164386 -74920 -67407 -162502
3724 -162502 101017 -92311 -24655 275759 -38931 -187795 -65690 -80250 56817 -215238 -54368
3712 -195432 -113348 -77278 108170 20927 -67746 6022 6584 -94162 -46684 -134417 -51867 166909
3699 3526 23251 -72590 -85300 185398 -42078 -32022 158895 15688 -39864 -107649 2500 -189371
3686 44607 -131345 115745 59211 -165804 -22259 -206700 164754 -92456 5542 -64310 130813
3674 -8349 57382 -75395 -132628 189187 -100548 115729 30697 -90004 -365977 -255547 106964
3662 -291 -7564 -224583 -201389 35108 -194229 113960 -70218 -43732 -230140 -52176 -115572 -99805
3650 -99805 -94176 -97884 -38894 -19319 -178964 -34197 -253208 283074 97777 -80156 25531 -136258
3637 -88345 -106791 16578 -61000 -5900 -87662 -105522 5169 -126462 73147 -256236 19474 -77574
3624 -178948 -7341 -139326 137704 137542 133522 -68828 -175313 -194153 10203 -227796 144492
3612 138024 -125278 102070 -138565 -5510 179956 202531 893 -8854 -79828 -97628 -77159 109857
3599 164288 -9690 106997 45347 -83454 -151355 -39757 -210202 40202 -53646 -85747 -4236 27846
3586 -180254 -315114 -2158 96340 -100150 -299213 -124617 112946 27947 74334 -32640 -39036
3575 -39036 -175114 -61672 66493 -55162 -147059 -145740 28478 -108717 80910 -35207 297747
3563 -76399 -208593 199935 -210568 -336399 -174840 93990 -417277 79878 106528 25362 -27240
3551 -246926 -178470 48237 -112822 -27494 -34780 126283 -116523 157458 44190 88938 -169542
3539 -38842 45264 -110121 -66370 58391 -47983 39701 -167641 -56416 -94234 74721 -5226 -210591
3527 -210591 288527 -54561 -81898 -108857 -219956 -139821 -64813 -15430 -204875 -242435 -65307
3515 50129 -113454 -163021 -70909 -54304 -278266 123768 -65461 223578 -334589 99451 -116225
3503 -52572 56704 -47688 -98365 35500 183096 -102955 22700 -61677 228098 -195599 125057
3491 -219427 -183379 -35294 -290488 -44341 130852 37949 140463 40740 215325 51336 40500
3480 40500 -43635 -101892 -84175 -28355 -383489 253443 -2218 -136664 91712 -25972 40327
3468 -76233 -140277 202070 -48880 -4084 57287 -29406 57944 -237281 -95552 -50909 92918 91972
3456 91972 -231966 -342024 -68478 162899 -63029 -234962 -125245 -5725 13229 4247 -220386
3444 17552 52623 -107396 -139432 -3732 -137418 -138135 14710 95858 -57548 -24704 -90538 -6980
3431 -106647 263152 -204016 -168553 183082 -112477 94682 -34448 -38897 -20988 -23942 -18005
3420 -18005 100754 -61250 -412880 95787 -113742 -173225 63084 -167154 -40343 -122382 -38078
3408 46338 -196104 96109 114746 -196537 -56969 -63496 95398 -160966 49670 -10466 -59475
3397 -59475 -42321 -41875 -412536 -253524 -34244 7012 237502 63331 -19377 -11122 251275 -70055
3384 74148 -460240 183281 42042 93649 16108 95980 -41475 -40088 110213 -78546 -46769
3373 -46769 -325577 -14594 -108206 86363 38877 -250494 -134437 -41973 100306 -52646 -31157
3362 -31157 -42146 16185 -129589 -4230 -171282 156067 -154089 80274 53346 97 -198713 32286
3349 -12643 -63158 -75249 -222911 88715 -34909 -195515 -137957 -313807 -390810 -172655 68244
3337 107298 -94643 -89880 189700 81799 159858 -60423 -253245 -26012 51585 54119 206213
3326 206213 32455 37692 -243747 -73236 -23982 -47682 -113898 128934 -98413 -148730 124045
3314 -16883 -191877 63264 -392844 -154917 73905 -130552 -220248 -72221 55686 97088 -93416
3302 -75702 21173 -104689 15858 128929 26071 -131253 75888 1662 -43405 -60425 -177798
3291 -177798 42551 2287 -36995 -130862 6685 -224040 70688 166989 -148599 -67860 -120619 111176
3278 -180370 29356 -49891 22948 106485 -47414 -172381 -200974 162016 19108 -218144 -239625
3267 -239625 174872 -17709 61374 2438 164253 -37981 -81003 65947 87310 -161516 167789
3255 -89738 -1631 -85468 -77136 -129206 -98681 59582 -153642 -169213 -42496 150899 -91257 67983
3242 -29386 45851 148171 -161291 -32423 -6734 -162398 -234672 -115041 -1816 10502 -274111
3230 -150712 76503 -76716 -226320 5967 -174195 186207 113415 -16741 -20499 -337117 -17323
3218 -141038 -62526 158223 -7304 15421 139804 -22260 -33359 93907 81096 -74897 -337303
3207 -337303 57358 -38716 16742 57750 60168 -134054 137339 -1363 -292893 -3062 -112681
3196 -112681 112379 -136475 -22642 -126487 -90293 -41560 -118140 -34072 -19998 -156913 -128275
3185 -128275 -295886 -22180 142818 -50067 -69233 -55460 -5260 139753 -172166 -141288 44292
3173 -92383 -32243 123926 191557 -105932 -47496 -133231 212986 -117232 -154001 66019 28932
3161 -164169 -128281 34175 -6831 4366 -12041 158047 -244517 -219573 -133816 90193 -133384
3149 -154978 49998 89898 123469 52345 -71919 -199339 -25747 -48259 -88249 56559 -207014
3137 16106 17819 -77867 10283 74717 -84827 -108880 -206687 -21942 -106048 -31577 -152723 -79247
3125 -79247 189585 -137637 -291570 7719 -129398 -95886 -22446 -202219 -230478 -56787 -120520
3114 -120520 -228417 -126150 -77872 -146478 -79176 -134241 -95649 -33285 -251370 152124 121821
3103 121821 49210 101701 66698 -4331 -159933 43936 -58361 -126277 -40850 46799 -13723 -13003
3091 -13003 15119 -139309 169496 25353 -177449 166194 121472 -154142 38304 -113820 -62669
3080 -62669 -216178 -73509 225677 183612 30378 87547 -36284 -113139 -147724 67725 -28380
3068 -171892 -103089 -142046 25664 -67955 -145606 -90832 -115776 65553 -14014 83601 -150525
3056 -2819 -122304 -276587 -14075 212784 159277 -180116 -38864 -139915 -265333 108182 63384
3045 63384 -91373 183131 -229386 -155515 -65735 95236 -148103 93398 -146494 -71271 -234190
3034 -234190 123244 -173125 226906 107195 18217 136687 -242091 -238921 85215 40109 117749
3023 117749 -2398 -28312 21683 -101501 68079 -65837 25838 -14627 138480 102257 270961
3012 270961 57373 58234 415746 -24384 -83489 -259613 -16437 -79066 -269705 -127890 -13324
3000 68657 -223512 -146198 -91118 -130174 -246359 -387627 -87884 15020 152096 152701 19005
2988 -3641 229773 309165 41778 -103672 26143 139460 -50651 -51294 182217 150560 -123086
2976 -106563 49959 -162464 191122 -385262 7470 -168637 -116178 -93991 37795 -225792 -168453
2965 -168453 113858 -65787 -185727 -37914 -238710 -99202 -160510 -12017 -68956 55319 -326620
2953 10324 36855 99471 -36651 -7584 -5301 -180736 -119007 -178401 -26088 101922 -230479 -33286
2940 3152 -199066 -51319 -42020 1089 -89622 -36558 90583 52246 44762 88802 -2005 139639
2927 -189712 -7676 -83286 -146974 -123809 69845 -183528 113407 -102173 -69014 -9711 -184046
2916 -184046 49238 -156 -52210 -73860 98517 -16601 -36879 15317 -144568 13587 -228446 -80954
2903 -66915 45238 -116663 191898 -14593 200267 226320 -146519 79584 -147423 125877 -91163
2891 -155718 21291 117241 18374 -68229 -15413 54689 -229941 -205422 -88250 -378043 250829
2879 -134862 21635 43854 71595 -75993 71541 -169629 -129697 -168581 108785 75262 172456
2868 172456 -75128 -263154 -54076 -217551 165596 -160028 188466 -34185 51652 151645 49678
2856 -28089 -214036 96186 39081 -55461 -88838 -215287 -4557 -70949 -91782 67246 -26933 -198897
2844 -198897 102477 98815 44968 -48235 107863 137780 101249 168518 -68076 -103384 -72204
2833 -72204 -44690 56927 -301295 -416085 7527 82404 -183192 97732 70879 -62528 -203804
2822 -203804 51151 53980 -147851 74321 -60038 -37664 18650 -76055 -52950 -116376 -114820 59786
2809 -98631 -147733 -168636 11719 196191 -127351 -44890 186255 -314293 -22401 -21070 -153471
2798 -153471 164076 -160885 -312825 581 104993 156395 -165704 -80009 -250895 -35722 36182
2786 -118852 -49631 -135422 95979 -93026 170831 129317 147873 269689 -20532 229338 -84242
2774 389243 -119611 -21657 132931 -29623 -50425 -39912 -36207 -119662 58503 -35020 -18654
2763 -18654 184005 -64473 -318823 -152861 37897 46310 168075 -95055 96200 -43223 43931
2751 -139134 -11797 7596 -139727 -269649 119579 34142 -11558 4742 -240152 -102230 -218049
2740 -218049 -356910 -140743 -183102 -47746 -24846 -80806 -70814 72404 -56334 -106588 221025
2728 -163529 -127631 -66049 -161110 -215695 -36681 260088 -83788 -30329 -55025 -226420 114962
2716 208954 -258355 -19061 -98310 -77186 -80853 -84497 -155274 149346 147655 -60213 -156342 122000
2703 -204890 -89123 79542 107629 -97611 -14346 53286 165244 -238254 80568 50492 62829
2692 62829 -68454 -176505 96506 93563 19970 -312657 -83146 158429 -56094 157020 -49363
2680 -140895 -222318 -176222 -40088 -240292 47723 -13734 -13420 -147468 155188 35922 111965
2669 111965 77192 53111 -88221 -250394 -127903 77200 -40468 -143510 53314 -283110 87375
2657 131190 62142 -235710 -175082 -166580 -96769 -97137 -133195 82372 -164287 -155970 181780 -125463
2644 75767 -6675 -13657 -96047 -270358 -33949 51526 202575 144528 -78775 -57964 19509 39664
2632 39664 5368 31978 84495 -37085 1505 42531 -14484 87971 -98188 33563 39133 188530
2620 188530 24381 -41359 -57220 -110227 -1001 -90895 -107819 24737 -139189 -237812 -258018 25578
2607 7596 -26762 -40541 -159464 166005 -106271 38850 242968 108210 272204 61572 41055
2596 41055 -101071 -220636 -216821 -200122 -53811 -161589 -77719 -153752 -184927 -300910 -180697
2585 -180697 -123080 -49544 55393 -259724 -73585 82226 -88905 -43101 52723 -46661 107148
2573 11692 -174673 -91300 51694 -102096 -33021 -140662 121612 -11479 38105 334 -175437
2561 135210 -108007 -136340 -152809 66271 -114934 33664 94388 50694 104901 -57783 112881
2549 139080 -28107 -2546 115787 -49772 -46188 123180 -24608 -117735 66316 6863 287114 39879
2536 -60375 -54801 95852 97561 -406364 -94967 84630 -128520 -121574 -19932 -245653 -103504 228138
2523 -54512 -149865 -100308 -62748 79925 -11521 -80627 85435 -129279 62163 22646 -197072
2511 224540 85961 104013 -71607 -365631 65084 333670 89322 151771 44948 -93907 -119300
2500 -119300 -371911 13950 -73133 84689 -46145 -119627 17739 -114217 3685 72762 26270
2488 153548 89099 28712 -99365 -102208 54935 -214079 66483 22012 -241331 -62539 -164863
2477 -164863 -62117 -218582 -127880 253959 -59818 -76981 -88589 60406 -176277 -233275 54306
2465 -218475 -146879 114332 35655 -108985 -124851 -157073 32850 32396 -24966 -212502 -73132
2453 15369 173138 -119916 -44581 -103561 29254 43881 157094 -170213 -77247 -118753 236834
2441 176904 -120881 -79269 -13810 50307 -12543 191965 -44751 -15533 -256498 -131876 -3623
2429 -25890 53308 -121510 184376 90768 79404 75456 170521 -106832 76084 193848 -59393
2417 221584 -52164 31040 -112625 -124659 77169 -160148 -153494 123216 -259588 -157370 -67591
2405 19803 -175911 -86639 -261816 -44595 52079 -11836 -87431 -106255 -140112 -344595 233530
2393 -29276 3679 -270346 -156086 -50065 -71635 215622 15739 200578 -69726 -28222 -23519
2382 -23519 20029 -87620 106243 -460559 -77771 -20613 -151886 143017 194291 38186 -28395
2370 148433 232270 -126536 57846 -98809 -70557 -148622 -432058 -46116 126632 -25491 -122379
2359 -122379 206363 -17724 -151767 -149279 154558 334720 303344 124666 -41792 61084 174372
2348 174372 -11469 -169105 -44693 77689 42909 -151074 -154170 -92629 -59165 95999 -835 13697
2335 -127833 -66705 -188222 -106536 74242 -85235 143180 -151576 195393 -24982 -74791 25463
2323 93517 8350 -36931 -48037 25100 -52805 -147901 -23129 162587 -112181 154246 -13499
2311 231338 26533 -69358 41231 108585 -5852 83082 -72781 -50934 -65956 -55739 75712 -11106
2298 -64154 -329225 -51820 -33311 -64069 -62246 -21284 104832 -7478 99212 71916 83693 7248
2285 83193 201341 -73534 46765 934 -143215 -181009 -234086 -100128 44891 -55879 -161345
2274 -161345 -276925 26893 76 -17517 -298623 89549 -181971 -28357 17565 76770 39206 42117
2262 42117 -149738 102091 -262898 -105848 14508 179076 -34521 82234 -84760 85916 -61442
2250 -184833 24116 -134580 -18907 -214454 98663 -86655 -159250 -36537 -162667 41529 70759
2239 70759 72313 -184953 66429 -15462 -125008 -66346 -230094 -116714 72032 -192900 -123137
2228 -123137 291810 59510 -146855 -95789 128089 248270 -78637 -238322 -65842 5051 114467
2217 114467 -36996 137161 1032 -64342 -43168 35442 1644 -104307 -57498 52938 90707 -104360
2204 42603 -42146 -162199 -217143 77428 -16454 -211280 -80098 6301 -101330 163431 -367712
2192 12561 -208581 17398 9137 -55196 56821 -353239 -60799 -35370 -194696 236386 -132906
2180 83320 -104011 81900 74986 94771 161531 35415 -280817 -79454 -104100 212226 22715
2168 -205625 -149297 -131438 258740 -125440 77073 -18211 84880 17062 -138442 -36590 122667
2156 -1732 164985 118787 -138091 138630 144174 -92633 77700 -60923 281093 -4996 -58538 11049
2143 -79271 -59438 -135283 -279718 -189491 -159932 -78994 -44410 -36072 97040 66582 159233 210742
2131 210742 47581 75669 161907 127042 216439 -94140 -203560 131482 63927 -166534 107675
2119 33318 71229 -75567 121185 -46544 140311 13261 -32346 -63242 -126366 130895 162906
2108 162906 40182 -211600 -54651 79796 37147 -52307 -122677 51352 228149 20772 -57072
2096 71609 -33531 1727 -103133 -205647 52044 -148399 65391 -192472 -120962 35946 -61053
2084 -343567 18375 -25632 -1697 117265 -101213 146569 24128 -17061 -60160 -13712 -39705
2073 -39705 169573 -15400 75915 26949 137929 -132080 -260342 62740 41564 83743 -167195
2061 -124254 -50859 -311561 145305 163533 22728 82299 105726 302792 -82637 -171143 12963
2049 -333131 -35036 -59612 -167014 -52964 -145966 133354 115014 -32524 -61605 -274760 -43748
2037 -68143 6103 -64706 122129 30549 35850 3068 -100467 -3471 -108839 -7130 -14651 274266
2024 165306 -30468 139596 -19925 171244 -3876 14437 -288066 -193774 209397 -136807 86824
2012 34453 -31550 -35519 -43677 -75582 30679 14709 49958 -86743 88399 -1693 -84036 -4061 119317
1998 -72549 -62876 66390 -52496 -16238 53321 -201273 -54609 42221 7936 -38220 50455 8719
1985 -81766 -86983 -14906 75465 -245680 88692 157531 -54828 157171 -57499 -326295 -353002
1974 -353002 61083 91585 -10251 -99512 -186426 36595 -108845 55022 -153334 110360 -58702
1962 56831 70198 -175227 38290 -179432 16345 -123368 100852 -338523 -78951 -49710 43775
1950 38436 -81913 247619 3520 54728 -192884 -137748 146072 -95051 -34372 54907 -63730
1938 11027 95068 -175432 153706 -63389 5342 -180238 -62217 -88212 -12745 -54585 25387
1926 -10578 -240709 274101 70082 -73142 154546 -102205 59201 33543 -17456 -9996 11433
1914 -263989 -77169 -14503 -86227 -63336 -115226 14147 -27851 92732 222694 -31846 43822
1902 162232 182473 -67070 103452 -131966 22922 -114175 33502 -305229 -19592 -94119 191428
1890 242628 -2465 -241308 85109 -39504 -71023 176478 -26941 62453 -78558 -53195 -55382 -136917
1878 -136917 -181896 52551 65724 243960 261530 266505 78263 -8561 137855 -194682 -268318
1867 -268318 -14428 4360 96640 201267 -251746 48790 -95399 96748 68841 204430 -209337
1855 170191 97962 56275 -56772 -55225 -48312 318202 145155 21186 -6802 47492 23414 33078
1843 33078 -232702 127150 48755 65544 -158671 -356851 91148 -125577 -70467 -72003 88797
1831 -308366 -25441 -1503 -152486 -7189 79802 185879 86169 -54953 -148354 -91597 9982 -119464
1818 -88709 -19409 137350 -67361 -27359 -23877 37037 99564 125124 -62602 35799 -209795 -104500
1805 58215 12433 132404 -17173 -31757 -144059 -160253 -32490 -202930 -268678 -65970 -116146
1794 -116146 62445 -106145 -208744 75655 -114530 75906 -147413 -75184 14675 -150224 -173821
1783 -173821 134663 44683 -9166 167528 -94056 133280 -101399 210390 105548 -110470
1772 10040 -34068 -50135 138067 149583 -188255 35817 149277 151368 -136150 192462 -10813
1760 -80242 146887 -149277 -46480 -50063 -10210 30857 -44696 59216 -101010 183865 -65038
1748 123532 35612 -19572 134633 237845 -11999 53812 -22936 157876 91190 63650 -79579
1736 241560 -37135 -131829 -117726 82901 58433 59328 27183 -213462 -52940 -86070 -40836 170656
1723 -150704 76472 -80158 55140 40288 -351238 -166581 -289170 -143302 189533 201206 145089
1712 145089 49235 -111257 41241 46258 32913 -11138 -107448 -144555 13153 54480 -70827 -17672
1699 14406 56437 -21725 106266 -74740 -132874 -178751 72094 -251789 -50670 -110862 158051
1687 58226 -71423 -25513 223489 -53535 -11870 19065 -97986 185727 104242 169713 303600
1676 303600 7851 112563 -150441 -113133 -13945 36901 -36819 -109206 131883 -4900 -49655
1665 -49655 -30039 284067 -59470 -29046 -92567 16555 -52851 -15172 -13997 58262 -129625 -93848
1653 -93848 -209540 -26273 -172089 123296 20391 151308 -192675 96214 57653 34431 -18895
1641 66011 -237806 -99055 100614 -226789 56245 -149559 140205 216730 11462 -221208 1066
1629 -188141 37227 142372 221009 -46450 131388 -40844 233170 -322196 25314 3235 -77827
1617 -125194 179767 -4961 -8927 -6112 -229032 7535 -210324 21954 67718 132048 -118223 219551
1604 17220 -20090 48732 -152102 68932 -123249 164614 1652 42309 -124430 93398 19774
1592 94970 97711 50608 -158584 -137849 -148190 -84219 -24266 32470 -230334 283083 121848
1580 163815 5025 -301342 -83614 40087 -90195 -4513 211854 194970 -173337 73527 170070
1569 170070 68914 50359 202171 -43780 93188 56909 62089 48091 -12564 -56627 -52222 -103597
1557 -103597 -128834 29348 19822 -217062 -8821 -65415 82993 -54847 10723 -72249 -191565 -61374
1544 80249 162678 -79242 117056 40748 -92550 203033 -67956 58842 25307 -126013 -65843
1533 -65843 -39919 176848 87688 145333 209769 27567 -186507 -7045 159633 71036 -38404
1521 20091 -296286 -182753 148414 58233 -179101 -144808 1115 -11839 33074 199830 -81593
1509 -88550 -59900 68782 92315 175777 -16631 -28593 -25776 105206 -169147 224618 22335
1497 49282 -4071 -90313 108332 -1919 -31480 434826 -92374 -77052 -120029 -199476 41977 -84482
1484 146794 157192 -5351 147589 -47933 183503 126403 -130473 -138009 6341 -75967 -29054 -12647
1471 52582 -46637 -96607 750 -142075 56490 -58751 -70469 -357 167012 -79544 -232216 -63048
1458 -58720 -150369 -124898 39474 29603 -34708 127872 -28762 -12372 -134827 -56687 16555 122489
1446 122489 56498 -118164 33740 125106 -141289 -91994 -174769 50203 65923 76384 102585
1435 102585 -73645 -189606 -157734 282053 -60071 98494 88418 -62494 31141 51463 160251
1424 160251 235377 76275 -69617 -192966 40848 -14542 -33088 -66868 89457 20075 10176 -154882
1411 277273 139743 -87538 36124 -49052 -167641 79389 73677 -206957 -34945 -23286 215855
1399 301144 138381 -225576 52460 -69832 -84026 354908 -180296 42953 -92090 38993 -173877
1387 -219422 401783 -52748 10740 -10537 -70132 187155 304635 -6100 22766 -168767 -65408
1375 100104 -311358 104295 18293 66743 249822 -15946 -25443 118322 205222 -50118 204116
1363 90455 14692 49180 -37816 130432 -124197 -23632 63330 -17156 -110803 -14711 -153136
1352 -153136 121398 -41629 -98094 -48851 123721 -85621 132616 -153964 -68086 -123147 -176211
1341 -176211 40736 205965 -60169 -7355 135781 162631 155915 23988 -245567 -602 71365 -107272
1328 59190 -44167 -22147 71033 -199392 -181968 77252 -53855 -78200 138895 -11732 -20498 105905
1315 159742 26640 101376 -145241 13334 -78556 105613 -131631 45519 -32074 351737 -50784
1303 91977 65681 48341 119107 309181 -146542 -197758 148936 11654 -53252 53599 -167568
1291 18851 -167115 -16332 -97626 4266 31029 -156845 284466 165393 -79343 72298 -145518
1279 271358 40892 233365 -34651 -14689 128001 3337 189057 -83857 -234760 -206407 51903
1267 -145240 131582 -19413 -49567 -45729 123200 38148 205864 -56417 -106670 51200 -33301
1255 -147528 -10437 -43374 -41297 38118 -29060 41285 -162165 141731 155573 39922 3820 168051
1243 168051 225204 58704 -64860 -119441 50598 21043 130909 225089 -90293 5974 -3537 -121925
1231 -121925 -67039 218271 -33768 -251539 22493 -30817 -7909 -87806 -16789 -205840 -44458
1219 -60251 -27848 25552 292536 -28599 209162 316291 -124445 111909 54100 183295 -6149
1207 53048 72011 -120312 -76527 103131 -79544 15366 172546 29423 83651 199575 -81592
1195 117634 -14120 -229629 6656 -306623 35402 -100936 -22113 75113 -65096 62402 21253
1183 -87685 -63728 89866 55260 -250913 81487 86627 64839 35289 -312053 -171176 79725
1171 -164106 -40173 5820 -3433 -12994 6347 -381 127407 -483 129926 23349 -113630 -86106 118564
1157 -77886 76225 -49264 11729 -158295 -179400 224199 297039 36903 -60121 -102160 54792
1145 14687 -65047 6134 136233 166868 257357 -434990 93120 201096 107068 57378 -129207
1133 -83341 -141553 -55903 -29487 163679 -264601 -186309 33533 -26410 246250 150827 1383
1121 -54419 44451 -6345 -166572 12182 -86340 -49052 -125748 -112011 39158 129455 -45770 -28965
1109 -28965 164033 27101 210755 146541 152998 192623 -153633 44487 101273 183786 84008
1097 66087 116839 120693 -27405 24249 -374496 7963 195884 -3171 34752 40065 209467 -55812
1084 -21641 132657 -145617 -51286 61486 68558 37624 25112 45841 184943 64426 -28948
1072 -127283 37985 7482 -120060 3750 131104 -88138 -235640 86515 129807 -43802 159773
1060 63043 29571 -172794 212208 -38139 15780 2552 -49902 -75257 -32492 66802 -163956
1048 165085 -174837 106344 -282900 46254 112972 -31089 161397 48027 -33035 -45829 81570
1036 -268940 -116118 12167 45965 160395 -170515 -194937 34007 88779 200254 -51626 -97608
1025 -97608 -140466 -46205 52749 94112 55581 27217 68171 -22293 36138 99220 -26724 88319
1012 -23466 -126997 72411 35317 -34541 18814 2534 -234223 84052 -186231 30833 -315461
1000 41851 -189705 160372 427 -238928 113787 137866 148957 88816 246965 258295 212026
989 212026 171875 182775 30444 178081 -51529 229836 34284 -68413 205791 -182652 35746
977 -143347 -180772 76330 44019 147153 218915 226907 -4805 -43912 -109397 27963 -97089 336930
964 -70965 120065 -63881 -580 -13197 -43227 -174360 -116421 -224622 124757 38623 193046
953 193046 -47512 73044 -133734 -150993 46792 -109494 -79546 -128893 252620 -150591 83637
941 -237569 -142218 72010 142656 -73980 70551 -22342 -65900 33253 -43367 -136171 -56876 140589
928 4515 3081 -67676 -21933 394846 63910 -79129 182384 78927 214797 -146355 -103800 58781
915 86299 -211738 -137682 106774 -20235 71172 120963 -171258 112993 183160 3773 -150014
903 -41587 346892 -61781 170282 164383 -16879 159187 267508 64269 -162094 -8919 134390
891 34632 -75266 -169782 -57659 50856 132652 -246179 60677 -209484 130908 339054 -65919
879 -163208 -89380 -6216 71398 208201 21768 5304 95564 -70078 178998 -205895 -182683 14520
866 222910 -76122 143206 -76529 -107081 207603 89527 -39416 119313 -225204 42601 -58442
854 -38218 73520 20464 -7753 168521 -130099 -31375 -10500 176275 52438 -188789 254154
842 152431 15398 78793 -153176 56831 -12456 133248 236465 293286 -2215 14814 -199915
830 -39826 -35991 114394 -98263 146526 24873 -306 148535 -55372 250467 -36236 22555 -7074
817 -84334 -81119 71807 140244 155410 10947 99532 -59325 32628 -30795 123998 57067 -65899
804 153003 9769 -175039 97223 71380 104573 -96934 -96006 200960 -13547 138193 -162036 77799
791 -108674 7549 136317 94397 73568 55142 -123307 -13060 81664 63040 -144226 -52939
779 -165866 133246 -74172 116750 128499 96148 19894 89225 -41191 -65800 89464 292283
768 292283 -34814 -357417 -30955 271437 185031 104099 -10640 -2400 -82081 -31891 -24796 142284
755 -99367 30324 86636 119996 103033 -52527 41855 -32681 77564 44592 18893 188439 177050
743 177050 -139865 50745 -11356 31475 -55964 247934 85858 174773 -523 -237119 -59686 108173
730 233876 -21774 101583 -47252 96594 -58627 -59737 -210161 -223145 85579 10055 -82675 130395
717 200611 -154649 168958 -107860 243141 -66899 -127616 162401 -198729 -42264 -54085 -9923
705 -108854 41382 140056 132782 180385 -106924 68029 111183 105884 -16661 -33752 -117656 96762
692 108927 -190743 -77526 132373 -20694 1477 -854 -28586 -19411 -42263 66491 155773 4372
679 53718 52285 91979 142254 41458 9807 -25451 71524 -107709 45308 13855 -27081 199180
666 -183403 -83827 -159352 -54621 95039 144180 -22487 119463 506 201608 181255 170264 35041
653 -40501 -9313 -17960 -11340 5823 206448 55173 93852 109208 298714 18088 68439 -52171
640 -159638 -249994 -10753 28763 -159397 -81302 -72515 204618 -251110 -115826 164565 8926
628 43708 74147 230987 219938 73931 -161268 -4243 -32660 -14847 -236703 -128767 279043
616 91664 -75675 81210 -32443 118998 -112168 -65778 58582 75256 269525 -42149 -43874 -89552
604 -89552 -94991 84961 -222406 22037 -65047 -102296 29053 -27714 -124977 295845 -775 97448
591 -68120 268146 98460 94079 -51102 62867 -189022 -25653 119634 149144 85683 -8105 -119473
579 -119473 -41203 12077 -37686 66643 57313 21905 32547 -61301 -1670 28783 8299 39808
567 39808 243283 114648 -77118 14926 23257 129810 80317 -56883 91582 69022 109646 139954
555 139954 91340 153152 -102072 32229 62383 -140196 54882 290232 140551 185053 -141617
543 -170009 4778 8456 249977 240159 -47065 -168421 -55727 -58592 233607 20526 -258523 54424
530 69294 265992 -118922 21300 50727 -36087 -7691 -181578 -45322 170241 -130929 -168207
519 -168207 112832 98763 43161 30616 180429 105202 7954 279088 -37037 -14088 64211
507 57716 -216973 -63593 110596 208343 131018 93846 -109890 -76471 31990 5901 -53619 96446
494 -63080 -45459 -1520 -126352 139726 6100 -17446 -271746 171975 45177 284392 119818
482 79435 4725 -173219 59140 105498 80746 185051 -133076 2039 14454 -149422 269300
470 151922 66640 -40321 -185415 425412 -177 -11578 38666 26954 145130 117204 4052 111238
458 111238 56240 213968 224331 21118 181567 -179478 58399 -222161 17603 28481 25948
447 25948 -112512 -107774 -259854 -25810 -47653 -59671 -84217 -136588 -239058 259323 16890
435 -64608 1635 203623 -68321 133297 2342 -64954 -50987 -47318 -69127 263629 10544 -49237
422 76527 56838 -162973 -20751 -12578 63456 92796 77140 50529 116092 159466 16998 105489
410 105489 -66281 -214659 188026 -81837 34306 -148392 132716 -108711 149637 147351 -56181
398 82445 -234267 54728 111844 -2157 157671 151651 -63914 8105 -454 152937 134442 -20170
385 303322 -39376 20557 -22342 -41119 127733 264096 -48319 189947 29599 -123620 153906
373 43900 -42201 107886 35091 40575 -29844 80972 16500 -62385 33895 -10556 -161774 -76213
360 95345 177639 341588 98770 138847 -101191 62867 -152113 -48657 -60843 41644 273197
349 273197 152617 91465 56041 164812 14970 -150408 188462 164583 -30810 -157298 -5616
337 39919 -16159 228258 5037 -118067 73154 145019 -128869 -177237 -110008 380315 -66632
325 112880 48961 38163 170285 242404 -76088 -10678 -76881 45966 234651 -61624 -111267
314 -111267 37284 -197637 7768 119273 82863 27989 157769 -81889 140744 51489 162106
303 162106 -41424 -70591 54224 -15983 -135196 185990 131220 -184544 -79827 161508 -46248
291 34433 -31726 -15548 -179907 37685 105111 152711 253098 -140683 46761 -130978 -66612
280 -66612 121346 39762 -41566 81791 -82649 111924 -94886 63593 -68187 -86480 61358 28785
267 -205514 33436 -68435 68732 -79245 50205 128676 110784 321154 -48904 -139182 -95681 161452
254 149304 -992 -115320 130241 181535 221375 174052 101081 -137859 -268597 -84984 -170494
243 -170494 -207468 -1938 -119499 193573 217564 51761 61089 -133234 44361 -63934 -108392 -115689
231 -115689 40380 -60220 -18363 -287028 229779 35969 -113984 -67263 180030 -213911 105306
219 -194326 -132262 59814 -195078 56560 93671 83505 -31708 -28289 -37209 61598 -82016 -52158
207 -52158 53647 69690 -27455 4254 313795 82832 244331 181513 -28854 33619 138225 -43738
194 -45273 -100930 177999 -16991 129773 -72452 31765 -103745 -75096 -165268 -22247 -72570
183 -72570 -15980 -30140 -24550 64935 -153833 -82185 58556 -356051 -93554 103712 90951 221620
171 221620 22747 -122617 155155 109170 266518 -29823 -78666 52524 24973 -217444 245258
159 -23609 -106817 116180 270206 71872 -147246 -16428 -201087 84117 103951 -143512 138724
147 39912 -76968 182100 199048 -48365 -16130 -84379 36028 6614 81305 -127358 62519 -284550
134 93736 -97505 72014 72213 -88926 185533 -160664 11932 193765 42914 -204355 -120738 190789
121 125125 -2120 70229 55255 -114836 -22753 -133841 -13140 35846 -27222 -125344 -67130 -15625
108 94803 194191 -19479 -185230 -55216 128027 -65535 85555 -59533 -230515 109821 -120223
96 45823 -58184 34011 -11701 39843 -2418 -81353 114488 -152084 18373 -109670 -182455 -28293
83 -57311 -69345 31731 -110714 140789 46130 -111526 -182334 -30330 97480 -9501 -204585 -136211
71 -136211 124043 -29033 58404 -36925 -56609 53723 -193565 -91106 36347 43899 -92577 36440
58 -41850 15113 -130606 2170 33838 -6206 -147038 -45405 53918 -25981 125931 8339 -50181
45 49043 -135913 -157451 49391 -162582 -13891 67008 73275 -28295 15914 -15037 -100646 -89792
33 -89792 -79475 -19242 6716 -52541 -24344 -85102 7614 -73074 -185256 -31242 -84432 -20943
20 -124887 -115501 84596 -50767 -117325 -62425 -156992 -26527 -7207 -89364 26867 29932 -184264
7 12371 -100002 -47440 -155293 40566 -171153 -14580 80398
$$ Imaginary data points
##PAGE= N=2
##DATA TABLE= (X++(I..I)), XYDATA
16383 -132418 -132443 -124495 -109163 -81037 24291 53353 -236918 -195851 -182982 -82400 -38784 -142858
16371 -142858 -34049 -50051 -23253 33193 -7001 174389 -57865 78351 13656 -23531 -20628 24844
16358 65614 141266 120411 170896 38068 103667 218943 199244 266692 100056 171005 371592
16347 371592 235350 263758 280439 213113 311638 492221 387377 307166 341949 339538 269193
16336 269193 562490 342684 372575 503400 442373 452140 336285 373397 453678 586854 322489
16325 322489 383744 655600 362620 437152 397004 621032 506518 701937 660783 782679
16315 782679 582079 627481 522102 679846 524876 655553 616303 756023 708731 597673
16305 597673 908746 786708 757256 645272 790809 721669 674041 703838 829606 741625
16295 741625 767552 868650 651984 848480 796010 669359 713042 704863 928544 796947
16285 796947 1095100 679629 717578 827256 902309 1010089 1009212 914303 979092 988272 1025310
16274 1025310 1105083 992467 944696 1185049 993841 907660 1242603 1273403 1035529 1022355
16264 1022355 1147922 1017309 1299294 1284108 1207263 1051259 1083744 1229247 1263042 948924
16254 948924 1246082 1149181 1231898 1025813 1279818 1091639 1380746 1237885 1357046 1203962
16244 1203962 1301775 1067491 1049024 1302526 1357972 1123430 1299459 1284569 1051362 1192396
16234 1192396 1259736 1436349 1384726 1203427 1370656 1282613 1166261 1418810 1265819 1242622
16224 1242622 1252413 1371540 1378156 1425332 1392800 1294711 1332580 1410917 1235193 1400936 1453947
16213 1453947 1372158 1591851 1499338 1275976 1302723 1343925 1494985 1407331 1192793 1302698
16203 1302698 1554042 1470575 1154516 1658544 1432870 1408886 1480499 1443811 1292434 1466026
16193 1466026 1670492 1469961 1435594 1296873 1369902 1515403 1516743 1376213 1478519 1583909
16183 1583909 1506139 1636683 1565062 1482667 1542600 1416065 1520305 1244979 1510921 1482066
16173 1482066 1571415 1726773 1640384 1573504 1626825 1571226 1603938 1353774 1793629 1591518
16163 1591518 1602757 1447136 1728964 1660823 1464430 1723308 1451222 1567661 1534202 1575162
16153 1575162 1728237 1582153 1663534 1687791 1433535 1663611 1668736 1808052 1831674 1576234
16143 1576234 1764937 1582554 1543537 1387575 1710362 1759320 1514044 1858688 1855460 1810242
16133 1810242 1751891 1630330 1679989 1717151 1734487 1734790 1586201 1703559 1758156 1614089 1503630
16122 1503630 1398989 1774528 1727508 1757285 1434082 1751720 1619353 1571563 1721962 1716226
16112 1716226 1633838 1729286 1543288 1664488 1742804 1618194 1871371 1742125 1453230 1579588
16102 1579588 1613397 1762912 1727335 1850636 1642137 1403135 1723448 1674044 1909179 1586781
16092 1586781 1623337 1625665 1614029 2060176 1670833 1852954 1844324 1854988 1455633 1721813 1660333
16081 1660333 1616121 1507949 1762130 1733524 1716385 1498013 1803798 1536002 1443085 1815632
16071 1815632 1563223 1559763 1518784 1779651 1521827 1765527 1368499 1738024 1699508 1578803
16061 1578803 1763779 1513860 1709609 1667098 1613785 1627176 1608780 1656961 1575759 1694414
16051 1694414 1605706 1716116 1557210 1405971 1440873 1772380 1703989 1699206 1537333 1658474
16041 1658474 1629582 1691695 1549768 1838720 1886953 1970862 1853052 1710288 1833950 1641198
16031 1641198 1825217 1532377 1485041 1810809 1778152 1770761 1689401 1599392 1692504 1746908 1823088
16020 1823088 1767997 1832072 1813146 1634596 1643558 1740316 1608736 1556945 1770581 1583833 1567927
16009 1567927 1655927 1723481 1610679 1744415 1735568 1556817 1766568 1809733 1505394 1459594
15999 1459594 1869613 1708559 1604376 1712348 1706535 1520056 1800693 1545324 1741474 1774325
15989 1774325 1807906 2082427 1724238 1703652 1508793 1729087 1669849 1663108 1682395 1858611
15979 1858611 1560705 1769015 1735840 1803937 1909419 1706183 1972942 1845991 1654584 1596985
15969 1596985 1684161 1574352 1818203 1843712 1833787 1826814 1559808 1877124 1794290 1752593 1713835
15958 1713835 1691532 1772245 1827436 1719500 1853782 1573281 1620005 1525583 1730458 1836077
15948 1836077 1657564 1628532 1742130 1614311 1808532 1644627 1738733 1738817 1766963 1529951 1744750
15937 1744750 1551134 1606715 1534860 1704346 1595022 1842178 1673840 1736340 1662137 1643652
15927 1643652 1778704 1596132 1733024 1413282 1526715 1780904 1711886 1792257 1529328 1677764
15917 1677764 1663146 1639743 1874029 1536281 1704170 1763142 1675977 1505238 1728432 1691197
15907 1691197 1682543 1789663 1498088 2018898 1729975 1643272 1705789 1701102 1616876 1901222 1742718
15896 1742718 1699289 1719309 1614348 1831033 1757771 1556469 1912921 1403043 1757666 2015146
15886 2015146 1647421 1711723 1614322 1726253 1640631 1767155 1856623 1679264 1644484 1817713
15876 1817713 1637584 1845674 1713503 1700229 1593803 1542038 1528650 1750192 1597761 1770616
15866 1770616 2076071 1693198 1693646 1600966 1923936 1696386 1507156 1618065 1584492 1694959
15856 1694959 1683437 1691281 1700616 1784141 1573160 1564996 1704533 1797098 1956043 1822195 1661386
15845 1661386 1654901 1754558 1608956 1875265 1819216 1764241 1898931 1837000 1676714 1566415
15835 1566415 1863573 1838023 1769447 1657017 1884897 1782395 1604117 1534819 1882091 1927819
15825 1927819 1693906 1760920 1397924 1628983 1785365 1846829 1676491 1668629 1830321 1614065
15815 1614065 1625563 1876382 1781695 1765189 1996977 1558317 1746732 1764487 1513537 1924210
15805 1924210 1684927 1727541 1551633 1743322 1595743 1495707 1455485 1658422 1547955 1808951
15795 1808951 1750202 1746841 1695466 1712215 1777818 1645473 1714523 1529411 1525866 1888904 1711555
15784 1711555 1627909 1891320 1708426 1659148 1570607 1688870 1947646 1737037 1736174 1777792 1724329
15773 1724329 1752535 1712629 1867055 1692951 1831356 1860488 1845729 1583823 1809305 1771442
15763 1771442 1911592 1578995 1594455 1759655 1649644 1683215 1577962 2044387 1652242 1797859
15753 1797859 1839761 1551168 1884499 1980151 1760413 1428014 1822972 1689401 1852287 1717074
15743 1717074 1631848 1464665 1934202 1644989 2073428 1845420 1836801 1866570 1640856 1505487
15733 1505487 1885615 1574971 1393598 1590412 2049312 1670037 1677955 1888565 1622970 1650648
15723 1650648 1843243 1532541 1597313 2045542 1557448 1705334 1578967 1544043 1626039 1795682
15713 1795682 1620083 2177363 1519085 1727934 1677354 1689856 1698741 1616283 1940000 1717689
15703 1717689 1716699 1855955 1670664 1585485 1769879 1634524 1739319 1869097 1684864 1935887
15693 1935887 1284089 1847571 1984747 1713847 1534845 1697134 1751796 1776321 1693621 1869600
15683 1869600 1707637 1858123 1718487 1969437 1745847 1794513 1716802 1834142 1870837 1765233
15673 1765233 1686827 1712546 1807361 1748573 2107742 1798563 1805799 1950519 1854884 1801105 1856504
15662 1856504 2050513 1789626 1841931 2076672 1767804 1801843 1837921 1852715 1730528 1757175
15652 1757175 1786716 1869965 1767287 1699238 1753904 1838467 1857784 1702735 1689001 1658924 1840392
15641 1840392 1679989 1655539 1651448 1844084 1806577 1713042 1786002 1679532 1917782 1803005
15631 1803005 1879173 1596286 1776682 2005676 1791248 1751569 1832579 1925956 1765248 1900763
15621 1900763 1980740 1738944 1782651 1843633 1588806 1520613 1740076 1896489 1924672 1794763
15611 1794763 1708927 1788317 1477015 1519197 1684776 1636310 1715313 1649498 1540136 1675401
15601 1675401 1671295 1985697 1803392 1567931 1784870 1738369 1681445 1779913 1783199 1307301 1703157
15590 1703157 1788431 1677789 1508336 1743777 1699678 1629647 1949403 1783909 1701098 1574960
15580 1574960 1821439 1808856 1637465 1687248 1875974 1823244 1707342 1712264 1879961 1871318 1568518
15569 1568518 1768455 1860067 1557877 1803387 1838841 1910857 1720868 1834581 1959864 1885713
15559 1885713 1759574 1740932 1893256 1778081 1716924 1708382 1824736 1819848 1754851 1976687 1803878
15548 1803878 1761454 1802457 1551890 1849727 1817217 1730124 1966238 1741202 1891912 1874226
15538 1874226 1995281 2109599 1770388 1837385 1566071 1546867 1671897 1759528 1963852 1846984
15528 1846984 1601557 1749178 1861079 1762849 1755041 1929595 1582294 1669829 1804039 2002390
15518 2002390 1914138 1965394 1952219 1875778 1699001 1817367 1686636 1794503 1790415 1621624
15508 1621624 1695773 1681108 1807701 1840192 1974732 1829984 1898031 1682859 1757100 1842083
15498 1842083 1830666 1687025 2037147 1772261 2012659 1619293 1964580 1857099 1852223 1585389
15488 1585389 1787714 1512025 1592020 1917755 1863723 1807354 1904439 1597606 1705750 1874652
15478 1874652 1772033 2033955 1762184 1673919 1783878 1628539 1810048 1914136 1486955 1752119
15468 1752119 1856031 1780278 2148308 1791961 1782393 1753985 1631603 1761911 1767304 2192682
15458 2192682 1432843 1717674 1649148 1893455 1616960 1474058 1740228 1823701 2030722 1706801
15448 1706801 1906418 1634662 1757660 1843821 1811371 1550108 1914375 1760780 1808093 1765957
15438 1765957 1878135 1858220 1808090 1776378 1865216 1858408 1776013 1947138 1991503 1568226 1981607
15427 1981607 1655675 1951192 1889337 1935135 2043410 1533061 1672838 1971347 1765278 1705461
15417 1705461 1689943 1851099 1923597 1853249 1565076 1818694 1954743 1789987 1732582 1694468
15407 1694468 1894779 1761109 1702509 1892580 1815910 1871393 1786368 1863310 1660706 1640519
15397 1640519 1620425 1796673 1691036 1772621 1798438 1829499 1686695 1874686 1596786 1760970
15387 1760970 2000374 1705284 1831344 1694521 1865761 1929476 1830296 1875016 1846833 1788735
15377 1788735 1719973 2082431 2065614 1481379 1875999 1749335 1784401 1742329 2032031 1720538
15367 1720538 1920069 1598992 1738295 1903302 1609934 1918559 1749755 1663313 1664722 1885548
15357 1885548 1793923 1963937 1720116 1606177 1707339 1792222 1763978 1619393 1966980 1903448
15347 1903448 1633173 1620457 1636933 1577236 1713053 1831502 1826070 1936057 1805013 1780539
15337 1780539 2064952 1948337 1719898 1716781 1874196 1871807 2004584 1828874 1696881 2018359
15327 2018359 1671851 1763280 1769321 1967666 1657124 1891508 1717904 1808514 2078182 1771250
15317 1771250 1947415 2073489 1980049 1725079 1902550 1823354 1880508 1922708 1994410 1816348
15307 1816348 1876288 1591823 1789417 2145232 1784246 1933380 1868268 1773622 1767340 1741897
15297 1741897 1908018 1818948 1847401 1729422 1736786 1971774 1718173 1609939 1738699 1717626
15287 1717626 1853918 1756010 1887401 1975965 1891781 2000594 1967596 1945312 1892679 1966260 1910850
15276 1910850 1767195 1801042 1604437 1787535 1883682 1875836 1778433 2102277 1581378 1780922
15266 1780922 2079693 1862796 1761969 1624651 1890817 1871361 1960058 1737734 1950861 1931438
15256 1931438 1930352 1733209 1923464 1947194 1895755 1662756 1794227 1871754 1875034 1789973 1597956
15245 1597956 1799935 1848097 1828911 1811216 1899686 1770296 1940224 1982735 1791632 1885556
15235 1885556 1812924 1928547 1884832 2141664 1854157 1781963 1963315 1925165 1778766 1942384
15225 1942384 1680053 1797254 1910088 1509986 1790093 2069923 2021642 1873648 1824253 1963271
15215 1963271 1881775 1879104 1961990 1974921 1866101 1679094 1840599 1938807 1988454 2063608 1940472
15204 1940472 1782547 1848731 1667756 1896824 1635453 1835118 1884265 1739272 1793348 1977754
15194 1977754 1838785 1890481 1580644 1931375 1493958 1470750 1977405 1999458 1742202 1896662
15184 1896662 2136582 1575866 1904618 1926268 2057292 1826917 2083215 1907426 1765211 1852265
15174 1852265 1794730 1682719 1918768 1800864 1675633 1735572 1798535 1900243 1856221 1943355
15164 1943355 2246262 1964383 1999156 1913061 1909110 1947892 1904453 1877700 1787783 2003901 1823507
15153 1823507 1946370 1627222 1834595 1806576 1940521 1954162 1860563 1966805 2001587 1922135
15143 1922135 1938076 1919561 1818482 2010258 1802846 1936333 1765707 1826615 1663457 1919426
15133 1919426 1839366 1962059 1748948 1991472 1965037 1767023 2030024 1892258 1611818 1923402
15123 1923402 2058625 1814953 1657468 1837737 1752351 1823297 1822273 1969002 1740855 1873761
15113 1873761 1987588 1999326 1641422 2013091 1885623 1959049 1937582 1889090 1876624 1962555
15103 1962555 1946489 1946410 1989545 1723629 1810588 1884444 1762979 1811985 1804309 1597831 1667786
15092 1667786 2043945 1716888 1822803 2024509 1957390 1855268 1814544 2030504 2040710 1941299
15082 1941299 2053681 1843473 1754519 1922069 1780971 1814541 1811016 1893845 1932222 2043529
15072 2043529 1909875 1850667 1818502 1803108 1967210 2147258 1713291 1628119 1974622 1956598
15062 1956598 1911453 1779938 1986934 2018979 1696891 1759689 1950217 2040910 2223341 2006862
15052 2006862 1887153 1982921 1578860 1951371 1983195 2046109 1968892 1994925 1795682 1602371
15042 1602371 2011991 1857193 1822453 1770990 1757471 2011686 1994146 1668317 1964530 2068709
15032 2068709 2028341 1787383 1820963 1944313 1892119 1938570 1937045 1981740 1827259 1617897 1942459
15021 1942459 1866072 2011951 1750790 2058296 1921150 1737017 1894695 1871306 1862890 2000305
15011 2000305 1942086 1966973 1924769 1944133 1876442 1792865 1771481 1734301 1744732 1866736 1867017
15000 1867017 1916192 1918057 2139606 1668732 1995208 1782492 1917716 1966768 1987407 1680290
14990 1680290 2215785 1721894 2083964 1750447 2014849 1836964 1800325 1990081 1802632 1664175
14980 1664175 1951420 1822873 1870524 2123669 2068063 1949478 1899851 1888287 2011517 2055799
14970 2055799 1980764 2088880 1940755 1795604 1809018 1838690 1991405 1861719 1673414 2053768
14960 2053768 2121117 1900669 2057479 1703309 1805725 1886646 1920949 1781514 1801810 2047577
14950 2047577 1748069 1949896 1898409 2029935 1990698 1961551 1877084 1862107 1826455 1764456 1615086
14939 1615086 1735039 2078365 1872500 1903516 1987050 1800740 1989088 1627899 1721814 1691949
14929 1691949 2017153 1724583 1764054 2049022 2189408 1844794 1749388 1928462 1939582 1888893
14919 1888893 1875091 1845868 1911366 2039496 1987237 1920516 1963903 1843097 2044556 1857820
14909 1857820 2004259 2116136 1898709 1962295 1720086 1949200 1981013 1915970 1731888 1856940
14899 1856940 1831490 1980986 2052783 1982528 2069523 1920857 2103017 1727059 1828962 1740126
14889 1740126 2041785 1937314 2060466 1925684 1995390 1808906 1831892 1952985 1854223 1912432
14879 1912432 1786630 1816167 2117844 1985360 1854505 1809878 2190305 1892625 2117381 1696181
14869 1696181 1663022 1839168 2160119 1921352 1917459 1771290 2064832 1996592 1915505 1982530
14859 1982530 1734522 1783550 1782809 2003785 1739644 1935220 2031882 1968066 1851687 1765349 2374262
14848 2374262 1982090 1880769 1960084 1956112 1904341 1672311 2037603 1771363 1872989 1802189
14838 1802189 2051151 1898377 1940455 2017081 1750140 2193287 1832280 2041877 2010097 1847948
14828 1847948 1962786 2025077 1813067 1948170 1766467 1895444 1997639 1806578 1979204 1810920
14818 1810920 1854372 1924974 1965194 1837544 1737137 1890683 2060191 1933211 1542079 2073755
14808 2073755 2098295 1770752 1980902 1921328 2188214 1937422 1895180 2170051 1869332 1823260
14798 1823260 1801810 1952170 1786101 1720514 1853161 1978319 1944313 1967522 1985579 2083913
14788 2083913 1978447 1940525 1953844 1855781 1981467 1840355 1744720 2097373 1971229 1984512
14778 1984512 1823620 1853821 1813896 1895723 1975202 1896247 2000007 1792435 2187064 1877735
14768 1877735 2096582 1673432 2031747 1998261 2030787 1791423 1624986 2157555 1912929 1956516
14758 1956516 2076892 1803179 2054305 1877184 1820860 2018860 1942431 1881237 1890682 1838261
14748 1838261 2191282 1815657 1943677 1717819 1843907 1882513 1841478 2062220 1909357 1859595
14738 1859595 2102161 2086625 1922513 1780925 1814634 1897836 1589237 2105335 1904937 1968193
14728 1968193 2038321 1831334 1890937 1745981 1915321 1935783 1875746 1867880 1871138 1992421 1723238
14717 1723238 2100282 1929977 1813871 1814577 1736321 1628740 1823604 1659116 2042473 2170706
14707 2170706 1901799 1988744 2076097 1944188 1908310 2031030 1827353 1831079 1983652 2267023
14697 2267023 1910589 2177010 1860405 1964068 1867068 1927614 1963115 1995903 2022343 1993103
14687 1993103 1838968 2019991 1860538 1947049 2027105 1947016 2145371 1873268 1995283 1967903
14677 1967903 1946778 2219096 2095011 2174195 1838223 2028172 1954070 1872629 2328968 1903517
14667 1903517 1818202 2035126 1906707 1826035 2125079 1871000 1968351 1909868 1962525 1908261
14657 1908261 1974114 2052707 1938727 2143890 1813133 1804107 1917485 1942771 1921572 1869685 1991297
14646 1991297 1983926 1898429 1905160 2012574 1878885 1898578 2152964 2015355 1906056 2113821
14636 2113821 1907211 2151695 1750502 2064658 1768822 2075527 1698848 1966435 1894526 2117685
14626 2117685 1987888 1977131 1840015 1958793 2049381 2123132 2126720 1910934 2049362 2238917
14616 2238917 1708937 2069116 1873636 1945928 2102031 2012276 1850931 2279554 1967316 2028870
14606 2028870 1987172 1992763 2038910 1930058 2019277 1749125 2032905 2124943 2032656 1980195 2149177
14595 2149177 1823510 1930899 2176875 1983697 1903549 1996283 2127722 1991399 1752690 1959526
14585 1959526 2196083 2194006 1890719 1986417 1666284 2036879 1983073 2131060 2105683 2114580 2018304
14574 2018304 1868307 2033158 2090092 1835004 1917017 2005056 1793412 2042674 1924161 1798592
14564 1798592 2345571 2054852 1824069 1945255 2225059 1867420 1838795 1884891 2006679 1922715
14554 1922715 1900381 2102762 1906282 1830770 2171100 1837953 1770549 1868161 1978841 1887383
14544 1887383 2049305 2126993 2132465 1829172 2116074 1966910 2039840 1966800 1924501 1949560 2112539
14533 2112539 2113669 1985354 1999714 2156517 1922366 2081722 2175576 1921687 1902915 1938905
14523 1938905 1920441 1889282 1981342 2110415 1963665 2159273 2112351 2107423 2210504 2061267
14513 2061267 2005792 1918468 2026249 2037427 2012936 2118936 1902206 2067719 2033507 1891894
14503 1891894 1866060 1698929 2054820 1955591 1875303 2025991 1928842 2145530 1993361 2075804
14493 2075804 2049854 2003988 2029233 1938369 2068050 1989351 1972329 1923311 2247973 2164858 2102615
14482 2102615 1987253 2002883 2022116 2027489 1904101 2003163 1841196 1931628 2094828 2047404 2024753
14471 2024753 2149574 2158989 1953580 1904598 2146145 2184734 1925214 2058960 2269217 2006438
14461 2006438 1972730 2088209 2021461 2123949 1894079 1939206 2010009 1956153 2037057 2005282 2143096
14450 2143096 2002013 1989304 1887544 1800035 1893296 2127489 2124622 1699558 2067472 1784132
14440 1784132 1860345 1994948 2189168 2056290 2300049 2073222 2072102 2259900 2174936 2046573
14430 2046573 2072053 2144801 1896222 2237815 2019402 1876009 2131521 1822854 1825348 2311279
14420 2311279 2019056 2089120 1945378 2208761 2144165 1945643 2184832 1873223 1916087 1870986
14410 1870986 2311209 2034967 1983019 1883413 2044397 2035468 2138983 2064476 2316887 1896213
14400 1896213 1998045 1983372 1957509 1993092 2096952 2176470 2214584 2224633 1800489 2174257
14390 2174257 1995110 2189109 1772584 2328131 2004092 2071987 1848600 1884052 2092020 1966518
14380 1966518 1790861 2322082 2096642 2115265 2026090 2105130 2036278 1933703 2173038 2115028
14370 2115028 1813599 2078001 2171880 1989915 2311017 2310551 1993964 2241899 2096479 1893948
14360 1893948 2092663 1871586 2144532 1998588 2231612 1849896 1982545 1946645 2063946 1853888
14350 1853888 1846283 2114847 2134040 1945277 2254633 2185044 1938906 1972791 1879873 2078410
14340 2078410 1919652 2100438 2172317 2141911 2162549 1808568 2110699 1949034 2224714 1929384
14330 1929384 2112530 2139156 2245270 2195571 1901615 1979034 2033942 1931833 1997890 2094922
14320 2094922 2110823 2072042 2170626 2056881 1932496 2060862 1957456 2060256 2126522 2193090
14310 2193090 1890421 1859016 2134626 2089748 1936514 2060931 2012006 2096114 2040345 2042945 2039556
14299 2039556 1954246 2017336 2266054 1958376 2073593 2255594 2251749 2066636 1975512 2036133
14289 2036133 2010161 2000061 2172121 2202123 2107028 2100534 1965987 1986190 2231580 1947609 1892088
14278 1892088 1959393 2045015 2106619 2137866 2021351 1876212 2017362 2061347 1923742 2070045
14268 2070045 1961972 2127123 2029475 2088133 1944939 1981934 2010127 2063032 1981741 2117796
14258 2117796 2122142 1867884 2198406 2051691 1984398 2035630 2189796 1993143 1972543 2172106
14248 2172106 2145253 2019327 1902607 1921714 1847754 2085996 2105586 1955751 2085444 2239879
14238 2239879 1960930 2125357 2108188 2150468 2017928 1843839 1889585 1978850 2066383 2006033
14228 2006033 2173133 2170007 2147798 2134874 2002507 2134215 2285018 2088725 2019444 2267279
14218 2267279 2024501 2011455 1876449 2067031 2032761 2168706 2087212 2178870 1902416 2187964
14208 2187964 1939942 2124585 1978374 2190530 1923908 2060265 2290846 1968180 2068664
14199 2068664 1894228 2232498 2134770 2024390 1922289 2284053 2178395 2139646 2294430 1989973
14189 1989973 2075187 2039808 1969771 2048737 2241020 1969476 2279380 2275314 1925877 2300850
14179 2300850 2023654 2191353 2085620 1972494 2040071 2094518 2072220 2180872 1941966 2252804
14169 2252804 2408061 1868505 2154846 2080273 1959094 2011317 2226094 2107009 2079803 1957609
14159 1957609 1991993 2197278 2231975 2239172 2213486 2124055 2143406 2013159 2107738 2177351 1762533
14148 1762533 1994621 2074001 2070829 2021099 2171527 2004249 1996066 2130181 1891993 2382865
14138 2382865 2340503 2229211 2125190 2159282 1961859 2047172 2095484 1934023 1979121 2068314
14128 2068314 2071797 2194245 2074627 2038825 2084413 1907116 2046016 2046406 1979170 2320091 2363718
14117 2363718 1867614 2021891 2098525 2183864 1770815 2012927 2372902 1859486 2099943 2341411
14107 2341411 2219013 2003762 1955676 2070765 2039602 1934652 2127333 2164945 2074176 1968383
14097 1968383 1990147 1955664 2036487 2024268 2111409 2225854 2187673 2314991 2177274 2140057 2186618
14086 2186618 1969533 2027093 2118851 2002206 2265823 2107501 2385315 1985739 1982926 2151991
14076 2151991 2238674 2428099 2197204 2124341 2208430 2165236 2100340 2400652 2120323 2008210
14066 2008210 2043178 2158864 2118345 2249131 2019711 2160781 2116788 1778683 2222405 2019162
14056 2019162 2199819 2137919 2103616 2240699 2084070 1986947 2322699 2181051 2290028 2102968
14046 2102968 2091800 2339671 2080222 2260382 2258277 2196995 2016666 2129086 2098898 2170572
14036 2170572 2004136 1949447 2330235 2119772 2125445 2176379 2355416 2195418 2266471 2090627
14026 2090627 1995421 2125741 1955349 2410865 2281978 2260637 2364586 2218054 2074567 2202572
14016 2202572 2159116 1988079 2133190 1922857 2112397 2156715 2284787 2185641 2042037 2165289
14006 2165289 2452432 2236177 2227236 1980324 2291203 2216367 2272629 2171430 1941424 2263729
13996 2263729 2102917 2000852 2027534 2194975 2029059 2081241 2178565 2251416 1992498 1885370
13986 1885370 2058843 1951053 2394517 2083514 2176554 2096105 2233757 2176964 1830418 2102892
13976 2102892 2099361 1921836 2064116 2092749 2259772 2052320 2086202 2184216 2149198 2177044 2311105
13965 2311105 2339114 2174888 2121622 2242977 2159816 2116300 2026533 2199420 2341905 2099857
13955 2099857 2104707 1985117 2457985 2103194 2256038 2099929 1928632 2002246 2088708 2012098
13945 2012098 1944545 2242704 2076489 1983292 2101257 2175066 2134657 2321994 2094225 2068274
13935 2068274 1858514 2471068 2183098 2061149 2252047 2094728 2281928 2133261 2110416 2238238
13925 2238238 2221175 2129452 2128745 2287549 2135105 2280868 2074353 2178689 2089159 2020838 2221276
13914 2221276 2295632 2200019 2209686 2248135 2055573 2349462 2051482 2078454 1999620 2196316 2203101
13903 2203101 2137354 2219581 2120486 2274196 1953846 2127012 1910303 2209257 2215059 2188229
13893 2188229 2184614 1833064 1937399 2189903 2117276 2052679 2187185 2395058 2133754 2191348
13883 2191348 2342256 2121526 2106548 2100640 2152282 2226377 2183778 2108758 2278165 2303626 1974486
13872 1974486 2222796 2102931 2043289 1954669 2121185 2358735 2257525 2230982 2346906 2236843
13862 2236843 2151656 1897312 2287455 2197931 2245194 2190330 2199336 2353371 2204250 1994573
13852 1994573 2014463 2035304 1973346 2176272 2362084 2154605 2268288 2414364 2032377 2028282
13842 2028282 2087491 1975666 2248017 2448463 1967075 2257733 2112413 2287424 2252421 2248677
13832 2248677 2269416 2041882 1990399 2435467 2128508 2125716 2158313 2307748 2597085 2085933
13822 2085933 2279409 2211456 2255016 2359963 2124508 2194649 2073219 2112191 2345345 2060178
13812 2060178 2205599 2235272 2275740 2319746 2196173 2156301 2396663 2010630 2179828 2166611
13802 2166611 2302657 2068902 2210468 2084464 2460714 2220505 2305526 2269646 2152851 2370124
13792 2370124 2268660 2096917 2418533 2299965 2239362 2309608 2199531 2247883 2406942 2261162
13782 2261162 1999501 2178722 2186836 2300086 2205403 2280671 2120429 2209935 2082493 2145476
13772 2145476 2267659 2200329 2271371 1980050 2390036 2138410 2229974 2203142 2321710 2152414
13762 2152414 2049791 2315373 2123850 2271679 2344548 2238756 2154594 2199244 2206640 2105707
13752 2105707 2233007 2091419 2356745 2378072 2203112 2419441 2215250 2252385 2227298 2269528
13742 2269528 2086130 2206272 2323917 2174284 2243681 2306197 2447218 2198184 2276311 2176986
13732 2176986 2180631 2332682 2147139 2340634 2076364 2143650 1922568 2026569 2112414 2430040
13722 2430040 2115322 2212791 2125409 2211892 2251690 2431576 2323103 2121413 2254269 2044658
13712 2044658 2187637 2221361 2136027 2476720 2141170 2236937 2184432 2022102 2195970 2244255
13702 2244255 2346807 2234042 2370324 2339428 2132184 2411757 2297617 2101968 2188589 1975380
13692 1975380 2272713 2419182 2167115 2199759 2157503 2235356 2280391 2236181 2319856 2180484
13682 2180484 2289321 2226145 2259744 2040487 2276960 2319379 2052593 2210165 1972565 2258767
13672 2258767 2144161 2400026 2351369 2371425 2507709 2108648 2318199 2199551 2159495 2074384
13662 2074384 2137794 2414370 2236725 2191607 2203162 2126544 2394940 2370150 2097206 2381426
13652 2381426 2187101 2110787 2249762 2114677 2070675 1922567 2425467 2278084 2317585 2165611
13642 2165611 2132882 2276463 2250055 2214774 2323148 2211736 2261882 2293933 2231068 2236738 2396601
13631 2396601 2264006 2231067 2197807 2269887 2108090 2193679 2291001 2187683 2097891 2469653
13621 2469653 2279084 2350815 2191973 2447463 2086057 2158563 2078278 2134515 2174617 2204761
13611 2204761 1998744 2161384 2465149 2041069 2166134 2200666 2090437 2265966 2210258 2493560
13601 2493560 2174493 2257244 2471571 2489704 2494696 2184069 2312999 2074878 2041808 2279715
13591 2279715 1967803 2093898 2340072 2381383 2274673 2342268 2476418 2330905 2320852 2358409
13581 2358409 2331578 2284694 2251668 2184816 2356578 2466713 2479561 2415720 2423858 2180728 2276410
13570 2276410 2537080 2196183 2196438 2248439 2087447 2233144 2270049 2472927 2146007 2043083
13560 2043083 2299851 2338757 2115237 2196824 2206772 2325896 2164363 2202964 2230015 2399449
13550 2399449 2222318 2327065 2237270 2477748 2389678 2417502 2189813 2157535 2103347 2363259
13540 2363259 1985016 2601204 2144221 2144125 2173594 2314048 2180788 2441443 2269233 2242675
13530 2242675 2291925 2184854 2202141 2357703 2370824 2442350 2475113 2269923 2258077 2325422 2258077
$$ [...]
##END NTUPLES=NMR SPECTRUM
##END=
