##TITLE=Analysis number 328778
Compound Code cc 12301
Book Reference lab3
Project Code adrs
Chemist Name stores
##JCAMPDX= 6.0         $$ Bruker NMR JCAMP-DX V2.0
##DATA TYPE= NMR SPECTRUM
##DATA CLASS= NTUPLES
##ORIGIN= Bruker BioSpin GmbH
##OWNER= nmr
$$ XWIN-NMR		Version 3.5
$$ Tue Jul  3 12:41:45 2007 GMT Daylight Time (UT+1h)  MAYBRIDGE\nmr@NMR_250MHZ
##.OBSERVE FREQUENCY= 250.131544655141
##.OBSERVE NUCLEUS= ^1H
##.ACQUISITION MODE= SIMULTANEOUS (DQD)
##.ACQUISITION SCHEME= undefined
##.AVERAGES= 16
##.DIGITISER RES= 18
##SPECTROMETER/DATA SYSTEM= dpx250
##.PULSE SEQUENCE= zg30
##.SOLVENT NAME= DMSO
##.SHIFT REFERENCE= (INTERNAL, DMSO, 0, 16.522)
##AUDIT TRAIL= $$ (NUMBER, WHEN, WHO, WHERE, WHAT)
$$ ##TITLE= Audit trail, XWIN-NMR		Version 3.5
$$ ##JCAMPDX= 5.01
$$ ##ORIGIN= Bruker BioSpin GmbH
$$ ##OWNER= nmr
$$ C:\u/data/dgb/nmr/ADRS/250/pdata/1/auditp.txt
$$ ##AUDIT TRAIL=  $$ (NUMBER, WHEN, WHO, WHERE, WHAT)
(   1,<2007-07-03 12:41:05.30 +100>,<MAYBRIDGE\nmr>,<NMR_250MHZ>,
      <created by zg, POWCHK disabled, PULCHK disabled
       configuration hash MD5:
       76 6E 9A 78 1E 09 19 81 EC 84 63 8F B0 6A 59 2D
       data hash MD5: 64K
       80 B5 2A 86 1C D8 38 8C B1 57 38 8D 4E B9 01 11>)
(   2,<2007-07-03 12:41:25.00 +100>,<MAYBRIDGE\nmr>,<NMR_250MHZ>,
      <Start of raw data processing
       ef LB = 0.3 FT_mod = 6 PKNL = 1 SI = 32K 
       data hash MD5: 32K
       4E 19 F3 3C 4B 0C C8 99 07 D4 30 5E 28 EF D1 2B>)
(   3,<2007-07-03 12:41:29.33 +100>,<MAYBRIDGE\nmr>,<NMR_250MHZ>,
      <apk 
       data hash MD5: 32K
       B8 A7 CA 2D 75 CE C3 64 4F 77 81 6A B1 C5 75 38>)
(   4,<2007-07-03 12:41:30.76 +100>,<MAYBRIDGE\nmr>,<NMR_250MHZ>,
      <abs ABSG = 5 
       data hash MD5: 32K
       8D BD F8 1B 02 A8 DA 90 B0 73 5F F9 89 AE 2E AC>)
$$ ##END=
$$ 
$$ hash MD5
$$ 25 DD C5 33 EF 83 E2 72 5B A4 DD 67 4C B6 13 D3
##$RELAX= 
##$RELAX= 
##$RELAX= 
##$RELAX= 
##$RELAX= 
##$RELAX= 
##$RELAX= 
$$ Bruker specific parameters
$$ --------------------------
##$DU= <C:\u>
##$EXPNO= 250
##$NAME= <ADRS>
##$PROCNO= 1
##$TYPE= <nmr>
##$USER= <dgb>
##$AMP= (0..31)
100 100 100 100 100 100 100 100 100 100 100 100 100 100 100 100 100 100 
100 100 100 100 100 100 100 100 100 100 100 100 100 100 
##$AQSEQ= 0
##$AQ_mod= 3
##$AUNM= <au_zg>
##$AUTOPOS= <28 >
##$BF1= 250.13
##$BF2= 250.13
##$BF3= 250.13
##$BF4= 250.13
##$BF5= 500.13
##$BF6= 500.13
##$BF7= 500.13
##$BF8= 500.13
##$BYTORDA= 1
##$CFDGTYP= 0
##$CFRGTYP= 5
##$CHEMSTR= <none>
##$CNST= (0..31)
1 1 145 1 1 1 1 1 1 1 1 1 1 1 1 1 1 1 1 1 1 1 1 1 1 1 1 1 1 1 1 1 
##$CPDPRG= <>
##$CPDPRG1= <>
##$CPDPRG2= <>
##$CPDPRG3= <>
##$CPDPRG4= <mlev>
##$CPDPRG5= <mlev>
##$CPDPRG6= <mlev>
##$CPDPRG7= <mlev>
##$CPDPRG8= <mlev>
##$CPDPRGB= <>
##$CPDPRGT= <>
##$D= (0..31)
0 1 0 0 0 0 0 0 0 0.06 0 0 0 0 0 0 0.0002 0 0 0 0 0 0 0 0 0 0 0 0 0 0 
0 
##$DATE= 1183462863
##$DBL= (0..7)
120 120 120 120 120 120 120 120 
##$DBP= (0..7)
150 150 150 150 150 150 150 150 
##$DBP07= 0
##$DBPNAM0= <>
##$DBPNAM1= <>
$$ [...]
##$SUBNAM7= <"">
##$SUBNAM8= <"">
##$SUBNAM9= <"">
##$SW= 20.6930455092707
##$SWIBOX= (0..15)
0 0 3 0 0 0 0 0 0 0 0 0 0 0 0 0 
##$SW_h= 5175.983436853
##$TD= 65536
##$TD0= 1
##$TE= 296.16
##$TE2= 300
##$TE3= 300
##$TEG= 300
##$TL= (0..7)
0 120 120 120 120 120 120 120 
##$TP= (0..7)
150 150 150 150 150 150 150 150 
##$TP07= 0
##$TPNAME0= <>
##$TPNAME1= <>
##$TPNAME2= <>
##$TPNAME3= <>
##$TPNAME4= <>
##$TPNAME5= <>
##$TPNAME6= <>
##$TPNAME7= <>
##$TPOAL= (0..7)
0.5 0.5 0.5 0.5 0.5 0.5 0.5 0.5 
##$TPOFFS= (0..7)
0 0 0 0 0 0 0 0 
##$TUNHIN= 0
##$TUNHOUT= 0
##$TUNXOUT= 0
##$USERA1= <user>
##$USERA2= <user>
##$USERA3= <user>
##$USERA4= <user>
##$USERA5= <user>
##$V9= 5
##$VALIST= <valist>
##$VCLIST= <CCCCCCCCCCCCCCC>
##$VD= 0
##$VDLIST= <DDDDDDDDDDDDDDD>
##$VPLIST= <PPPPPPPPPPPPPPP>
##$VTLIST= <TTTTTTTTTTTTTTT>
##$WBST= 1024
##$WBSW= 4
##$XGAIN= (0..3)
0 0 0 0 
##$XL= 0
##$YL= 0
##$YMAX_a= 321914
##$YMIN_a= -189744
##$ZGOPTNS= <>
##$ZL1= 120
##$ZL2= 120
##$ZL3= 120
##$ZL4= 120
##$ABSF1= 16.522
##$ABSF2= -4.171173
##$ABSG= 5
##$ABSL= 3
##$ALPHA= 0
##$AQORDER= 0
##$ASSFAC= 0
##$ASSFACI= 0
##$ASSFACX= 0
##$ASSWID= 0
##$AUNMP= <proc_1d>
##$AZFE= 0.1
##$AZFW= 0.1
##$BCFW= 0
##$BC_mod= 0
##$BYTORDP= 0
##$COROFFS= 0
##$CY= 12.5
##$DATMOD= 1
##$DC= 0
##$DFILT= <>
##$DTYPP= 0
##$F1P= 14.0000005364418
##$F2P= -0.99999901652339
##$FCOR= 0.5
##$FTSIZE= 32768
##$FT_mod= 6
##$GAMMA= 0
##$GB= 0
##$INTBC= 1
##$INTSCL= 1
##$ISEN= 128
##$LB= 0.3
##$LEV0= 0
##$LPBIN= 0
##$MAXI= 10000
##$MC2= 0
##$MEAN= 0
##$ME_mod= 0
##$MI= 0
##$NCOEF= 0
##$NC_proc= -4
##$NLEV= 6
##$NOISF1= 0
##$NOISF2= 0
##$NSP= 0
##$NTH_PI= 0
##$NZP= 0
##$OFFSET= 16.522
##$PC= 1
##$PHC0= -61.5475
##$PHC1= 7.755101
##$PH_mod= 1
##$PKNL= yes
##$PPARMOD= 0
##$PSCAL= 4
##$PSIGN= 0
##$REVERSE= no
##$SF= 250.13
##$SI= 32768
##$SIGF1= 0
##$SIGF2= 0
##$SINO= 400
##$SIOLD= 32768
##$SREGLST= <1H.DMSO>
##$SSB= 0
##$STSI= 32768
##$STSR= 0
##$SW_p= 5175.98343685301
##$SYMM= 0
##$S_DEV= 0
##$TDeff= 65536
##$TDoff= 0
##$TI= <Analysis number 999999
Compound Code 99
Book Reference 9
Project Code 9>
##$TILT= no
##$TM1= 0
##$TM2= 0
##$TOPLEV= 0
##$USERP1= <user>
##$USERP2= <user>
##$USERP3= <user>
##$USERP4= <user>
##$USERP5= <user>
##$WDW= 1
##$XDIM= 32768
##$YMAX_p= 336267328
##$YMIN_p= -230053
$$ End of Bruker specific parameters
$$ ---------------------------------
##NTUPLES= NMR SPECTRUM
##VAR_NAME=  FREQUENCY,     SPECTRUM/REAL,   SPECTRUM/IMAG
##SYMBOL=    X,             R,               I
##VAR_TYPE=  INDEPENDENT,   DEPENDENT,       DEPENDENT
##VAR_FORM=  AFFN,          ASDF,            ASDF
##VAR_DIM=   32768,         32768,           32768
##UNITS=     HZ,            ARBITRARY UNITS, ARBITRARY UNITS
##FACTOR=    0.157963299565203, 1,           1
##FIRST=     4132.6476996994, 0,             0
##LAST=      -1043.33573715361, 0,           0
##MIN=       -1043.33573715361, -230053,     0
##MAX=       4132.6476996994, 336267328,     0
$$ Real data points
##PAGE= N=1
##DATA TABLE= (X++(R..R)), XYDATA
$$ [...]
30449 15225 -65958 -70681 -46206 -87998 -85754 -61867 -49355 -37612 8273 -32403 -80226 -74828
30437 -74828 -34101 -10806 33110 106286 121346 107762 37098 30625 60217 48328 -7303 16967
30425 16967 38694 11847 -30119 -23921 -43767 -52596 -30968 -37270 -26016 -35437 17350 6546
30413 6546 -31170 -17632 -17669 4953 25119 48797 35311 14218 -5987 8387 39209 -29680
30401 -29680 -31365 39597 6300 3301 56997 64868 40942 12062 -47828 -128378 -105790 -71327
30389 -71327 -62106 -63927 -64320 -38349 18530 55186 71967 15806 -26513 -96513 -124156 -81446
30377 -81446 -28223 6380 1258 -38789 -12328 51468 96919 157371 154157 91352 75364 86791
30365 86791 36513 45068 -15140 -24502 -9142 -38375 -37936 -24996 -7875 -17123 -49204 -16150 -36554
30352 -36554 -52480 -106161 -117117 -118827 -37790 -30297 -86686 -46733 5064 -16640 10803 -34330
30340 -34330 -88517 -78560 -9241 -31373 -43054 -11966 -15429 -32963 -41071 -38031 11715 49744
30328 49744 54553 21496 34156 65791 77691 163 -24244 -17390 9016 29874 -27486 -63209
30316 -63209 -13183 -21212 2571 -11323 -5880 30098 53153 43059 51118 63039 62300 42970 23141
30303 23141 59436 51910 33006 35734 54375 61841 34477 -7066 27950 33895 -20012 -36235
30291 -36235 -18871 5298 -9320 -20867 -56158 -36070 -16563 -16421 -14761 55445 59983 62544 28581
30278 28581 -3035 -34076 15821 41196 23516 17865 59009 37029 44476 35577 1212 -80378
30266 -80378 -176264 -120488 -109792 -106982 -66621 -79566 -122277 -102704 -73127 -70855 -5597 43968
30254 43968 40968 28771 -18206 -37325 -34137 14683 30031 21583 24690 48953 17994 25439 10615
30241 10615 26783 2190 -68240 -59072 -4560 46097 78223 47120 42363 80145 75298 63140
30229 63140 146384 164563 95643 64722 46948 28538 21973 -24958 -26084 -32286 -30578 5882
30217 5882 30950 24270 68452 49590 -55011 -111939 -61162 -30597 57851 66568 41222 -17441
30205 -17441 -66076 -78037 -48342 4471 34512 54840 48999 43925 54460 24818 -8832 26869
30193 26869 -5857 -52743 -83427 -37901 13461 -27552 -20980 -15249 -83146 -45224 -3922 7995
30181 7995 -20760 -61893 -46833 -40092 18832 30838 85199 119584 57222 29434 23838 56361
30169 56361 56778 39516 -19170 -17175 -40837 6639 20763 -23513 22375 112445 161843 119102
30157 119102 52085 11934 -3561 10610 -1708 24877 51832 101381 123801 107387 81747
30146 81747 62182 -33774 -46549 -16485 -6709 17866 -6980 -12729 -28961 -36257 -24346 -37220
30134 -37220 -26062 -68647 -72321 -15699 7681 36753 89714 50761 -55871 -125425 -125699 -82498
30122 -82498 -59857 -25592 -37141 -134856 -92331 4153 31689 9386 -19160 3574 33569 22948
30110 22948 34576 -11327 -3299 52892 28319 -52688 -65673 -63446 -59527 -45035 4949 16143
30098 16143 35429 31230 -8244 -88850 -114355 -48812 32220 16920 33758 7690 -23281 -41190
30086 -41190 -73066 -115758 -155435 -106509 -95339 -96742 -59191 -31177 9859 38990 14446 -34660
30074 -34660 -75922 -92298 -79535 -85098 -61959 -18444 35118 71416 35511 -31157 -26394 12770
30062 12770 32918 108834 80599 47705 -16813 -41403 5470 4004 478 4310 11886 -23981
30050 -23981 -50390 -38715 10564 33626 63057 73644 96027 52574 64567 31161 -32612 13881
30038 13881 76593 123503 143515 122733 29441 45617 87722 75877 38391 -38675 -56607 -9095
30026 -9095 30411 -18875 -40541 -77119 -83390 -33668 25001 7466 58234 71117 49693 69908
30014 69908 24453 -5437 -32272 -14180 -8134 43532 64751 47721 3470 -23862 -79516 -116707
30002 -116707 -77067 -39199 -35230 -52457 -68235 -80371 -114597 -110416 -112270 -60073 -2665 10864
29990 10864 -44040 -66330 -17043 -7613 -42993 -34185 -33046 -60786 -92578 -111125 -102851 813
29978 813 66387 33326 6220 -8877 -28240 38661 72173 66143 49091 8989 -83196 -159520
29966 -159520 -148893 -106077 -28749 80764 121152 104188 68683 20164 41686 88625 33343
29955 33343 -92208 -24118 53017 26860 16356 -12653 -106925 -112435 -36959 -4785 -13381 -63282
29943 -63282 -83464 -42424 -37343 -81694 -80304 -16895 -46296 -10152 44445 -5952 -10064 15105
29931 15105 23781 -16242 -36089 -26258 -107792 -104248 -61086 -8716 85664 44468 -24013 13910
29919 13910 21589 36671 56766 8632 -43807 -37186 -67883 -59581 -12462 -31959 -48652 -16902
29907 -16902 -34161 11397 445 -10080 -23937 -13590 -12114 -26778 -46938 -1620 -814 -56331
29895 -56331 25155 88838 72860 91964 89234 9906 -28467 -37149 -18217 -20198 -20675 -5603 9464
29882 9464 77312 100177 48663 -28730 -40020 23471 28811 26000 -4227 -7497 -5856 -18851 -47347
29869 -47347 -37032 -38219 -13622 4471 10472 -52733 -54838 -67460 -27948 28293 50631 9001
29857 9001 9077 -29202 -12792 -11215 -56790 123 34494 52226 41519 -24978 -141150 -113031
29845 -113031 -9621 -14130 -6258 9569 67301 54526 65234 26519 -30285 -25714 8115 25539
29833 25539 57908 -3922 -47778 -101167 -47218 -24221 -22571 -12636 61232 60280 18114 -66305
29821 -66305 -101011 -81324 -11458 37685 -22869 -47687 5049 -4187 -26748 -42870 -131322 -96067
29809 -96067 45866 74082 14363 -13077 -3683 29530 52935 47690 33523 25337 50182 11936
29797 11936 1733 -31033 -13236 53378 70407 6405 -51758 41360 60042 12919 19303 -27257
29785 -27257 18195 665 -19455 -17981 -69999 -125748 -121552 -102982 -47783 -12380 -50080 -57664
29773 -57664 -12698 14818 18343 1371 46874 134554 112682 9839 -18345 -61444 17558 61769
29761 61769 81146 13503 -40428 -850 23908 43869 10601 -18658 -90797 -104155 -100091 -30113
29749 -30113 -9617 -26573 -53052 -17308 34580 74950 46795 35725 14742 -18816 -5475 -30390
29737 -30390 12258 -4622 -19630 -49966 18141 67330 46098 36559 68584 70242 26467 4601
29725 4601 -5396 -15661 27007 56950 26046 45625 65681 73749 118418 67902 -13046 -14461
29713 -14461 35128 9170 43344 61727 72635 58376 28187 8609 9776 -26250 -21512 -26179
29701 -26179 -46170 -41324 -43900 -2657 -16341 -87256 -118538 -58715 868 20508 38351 21330
29689 21330 -22697 -38872 1218 15346 -12730 -18528 14040 22295 7013 13281 -12111 -110932
29677 -110932 -93039 -78362 -79936 -93215 -59363 1107 13542 49911 35315 33751 83895 108270
29665 108270 103053 104857 65200 -18869 -60667 -5677 61472 46673 20231 24311 -47991 -31718
29653 -31718 -54662 -72032 -45991 -56398 19988 12709 -84384 -59248 -12369 -78117 -150852 -164840
29641 -164840 -62708 -25981 -46974 -22139 20720 20402 36000 24749 -13914 666 -22348 5238
29629 5238 72087 31501 18317 23098 41181 34192 15682 -34840 -28414 27530 30399 56696 40365
29616 40365 -11435 -6443 50521 82602 103825 19462 1376 23178 -6919 -41732 -7962 -517
29604 -517 41649 58607 18888 2188 -47176 -104343 -112441 -124731 -73251 39977 20786 22733
29592 22733 24585 -1123 11794 69559 73511 109003 91080 42227 71411 72191 13564 5209 -6647
29579 -6647 5883 21498 -42708 -60875 -32864 -7932 45391 84582 76599 54413 12293 17692
29567 17692 -18357 -2299 -47927 -109361 -117622 -73551 -88812 -97380 -133632 -144007 -135986 -66015
29555 -66015 -52515 -109752 -103947 -63107 -77239 -22323 57047 69383 110018 95837 3411 -37388
29543 -37388 -77644 -125592 -109877 -116555 -103277 -45934 -38888 -42138 -15363 -40302 -26984 -36941
29531 -36941 -43425 -40294 -18148 -7301 12583 32720 -22380 -59379 -36275 -80514 -102578 -106993
29519 -106993 -148417 -121539 -58876 4629 27588 33977 55229 49331 1329 -26988 -5620 -46950
29507 -46950 -60458 -47448 -42549 -63704 -72478 -69370 -105646 -51522 -49418 -14861 6394 -20971
29495 -20971 -67181 -75618 -43489 -26611 44175 57977 92769 72549 3034 31323 85120 97026
29483 97026 30303 -42143 -88367 -127904 -88405 -44940 -11682 43243 60833 -22568 -32937 -8909
29471 -8909 -363 -10845 29669 21333 51240 34658 28791 63275 19682 -76836 -57827 -44995
29459 -44995 -81199 -66560 -49456 -30348 -14708 -19575 -7808 24737 12513 -17026 -41641 -52956
29447 -52956 8639 -1843 -56075 -74279 -6144 25255 20381 35129 5445 -25273 -21140 -38306
29435 -38306 10616 47845 29389 89159 99705 94067 96087 91127 40846 36358 128770 191627
29423 191627 208533 187852 66482 -44552 -45163 8418 23835 29165 54123 7751 38715 36389
29411 36389 -2239 -71754 -93750 -34299 44301 45637 4286 -76652 -121240 -10691 23418 4425
29399 4425 -12518 -27768 -39988 -10412 -73680 -85676 -56168 -44602 -26285 -15458 -63409 -102895
29387 -102895 -73395 -85221 -64805 -22164 -23721 53080 66280 81204 122243 107093 85901 14037
29375 14037 -1349 -1013 -11451 -16118 -46288 -19020 5013 -9455 -23019 43922 11368 -2436
29363 -2436 17336 64798 66542 21294 29416 -19457 -10743 -30440 -32408 14272 69007 58397 3577
29350 3577 -93957 -129641 -91169 -28720 -65258 -27279 48047 2010 -10322 -33668 -11078 -35636
29338 -35636 -88681 -99922 -67600 -105895 -100613 -46344 1067 6089 7812 4050 -9492 -1289 -46597
29325 -46597 -7624 38729 52391 44917 18768 -18470 35092 11675 -14764 -11901 28004 31362
29313 31362 -17038 -22028 -15183 19156 53688 61296 20034 -22719 -20763 -38880 -28874 27804
29301 27804 51465 38718 28805 59719 68703 49572 57337 -361 4169 16744 19834 -10021 -68908
29288 -68908 -48979 -81321 -108677 -143528 -99916 -70298 -77661 -71735 -88871 -81719 -9795 40559
29276 40559 44185 56891 -1229 -134770 -151981 -106011 -137850 -74164 -6793 31882 17354 -74110
29264 -74110 -71833 11610 41599 -591 -14363 -20325 -31471 -20163 6567 -16116 -9254 44537
29252 44537 37572 33730 57383 85499 69888 -11118 -2081 14707 24762 57271 84859 100394
29240 100394 79502 11058 42974 99552 83012 22957 34563 -4644 -53665 -52133 -10944 7922
29228 7922 3746 23317 93108 109269 55405 49725 65554 73513 53834 58523 24738 12027 31520
29215 31520 55631 32216 17159 35731 67061 69172 81615 21876 35674 16518 -6759 993
29203 993 48169 77309 58894 -23372 -72359 -47251 7970 40794 16456 -14428 -3285 -74522
29191 -74522 -29257 16462 -22302 -62096 -9438 76162 20382 -12571 -5775 22981 20203 6151
29179 6151 -22467 38101 38343 11663 35926 -38135 -51056 -32775 35281 51356 -1021 -32195
29167 -32195 28407 34190 -1076 29962 27279 11058 -12804 -30549 26777 78676 99277 42812
29155 42812 60874 104903 57155 14384 75212 116679 50023 45397 19650 579 14077 5263
29143 5263 39835 77402 69326 20943 9164 32929 36253 26765 55043 53301 10617 22896 38955
29130 38955 37813 37086 12343 -39247 -56620 -69443 -44578 -19336 29014 8115 -3219 27022
29118 27022 49636 -1178 -76173 -89489 -9313 31251 20259 19652 74515 98257 113871 93537
29106 93537 127870 111336 45410 20432 19962 35684 59447 49056 -16464 -5922 250 -75843
29094 -75843 -73969 -26686 -9088 -47184 -43289 24651 37184 51389 107251 45488 -28550 13545
29082 13545 114181 99748 99456 79993 26345 -30365 -51003 25257 49219 22678 31540 92900
29070 92900 54374 25059 -54682 -67008 3670 576 -11327 349 6593 -5772 -8714 -22897
29058 -22897 -29585 -17818 -10276 -62547 -48297 -62392 -21596 8815 35974 -24051 -47653 -28562
29046 -28562 -24123 -8117 45293 40124 26995 40894 39151 39481 18713 -11050 -58544 -28662 35322
29033 35322 3850 -28875 2994 19852 17414 -7811 -46275 -12023 23276 83915 104755 114117
29021 114117 63232 -48030 -76290 9735 37072 -2597 30161 97168 94066 43772 49300 -1930
29009 -1930 3468 -16610 33117 71522 65591 39511 -25209 -68039 -61205 -58152 -33370 -13578 -4629
28996 -4629 -6879 -25952 -21054 -19033 -30592 -40990 -54632 -51748 -75339 -53256 -9997 23638 52006
28983 52006 53761 111333 35852 -618 48880 49794 42594 38998 58037 41564 45930 27697 -8675
28970 -8675 -53952 -26269 20727 1888 -24692 -56094 -59956 -32004 -30238 -49601 6877 15803
28958 15803 21513 38634 47101 32314 22024 9467 23286 -46453 -72512 -68960 -52057 -44047
28946 -44047 -43483 -35637 -65064 -15953 10354 37071 100061 110812 -11669 -50884 -15836 -51780
28934 -51780 -60769 -34193 9040 20239 -3026 -30837 -52089 14332 15663 -11758 -67279 -57492
28922 -57492 58836 106117 150030 138277 131519 185181 190636 137475 68993 20595 -64220 -85824
28910 -85824 -60230 -26228 -38359 -78460 -47637 -31695 -35852 -36960 -37926 -36018 -11530 41883 46813
28897 46813 13685 -21158 -35200 13266 -2116 -29249 -31201 -20836 -30968 -7525 36069 -30591
28885 -30591 -48618 -97964 -92208 -100013 -78842 -46216 -34201 -33213 27487 43171 329 23924
28873 23924 13341 -2950 -3902 -42088 -73535 -85711 -76830 -23508 8787 13194 73069 100126
28861 100126 48568 42866 21462 80638 78772 15046 815 27893 16084 -14784 -26692 -19705
28849 -19705 -37453 -19715 9105 -9265 -10460 2677 18812 -3771 -44420 -116879 -58563 -21090
28837 -21090 -20691 19405 45621 14595 -24799 -109828 -71505 -29012 -38014 -65202 -144296 -146301
28825 -146301 -112378 -51789 -20063 -57378 -71251 -120976 -115512 -100023 -47221 -61435 -40180 22080
28813 22080 39546 -46063 -70204 -25536 6287 31940 52035 71882 30926 31072 40848 26983
28801 26983 70095 134510 85709 5938 -23903 7948 14699 -11810 7500 31963 56313 95036
28789 95036 65494 37745 17515 -32990 -52616 -53412 9907 24267 -36082 -16583 20949 9852
28777 9852 -3470 -844 -9464 14178 39550 15544 45248 59063 78806 87959 54334 84883
28765 84883 103281 85716 73301 33473 29197 -9677 1459 -57637 -102196 -69047 -51605 -47710
28753 -47710 3733 2814 44437 50239 7255 12591 13098 25546 25021 24817 24218 10865 33091 69013
28739 69013 97626 119731 116674 65612 17034 -25314 -60219 11903 9350 -15629 52752 47671
28727 47671 -231 2189 -7269 -19535 41488 74931 63128 47464 40964 7646 -55752 -62633
28715 -62633 -43505 -76600 -85777 -73079 -64769 -95106 -83938 -76145 -72650 -30064 -37111 -21497 -9106
28702 -9106 37205 45437 56635 54111 76741 77844 96709 81707 57024 14818 -18190 -43652
28690 -43652 -29079 -49038 -60671 -45977 -49937 -79107 -62677 -62948 -79663 -64378 -46148 6181
28678 6181 -20857 -13119 -8921 -29326 -66631 -41692 -7618 42408 41735 -15258 17629 64451 24828
28665 24828 -5119 -33577 -53337 -47118 -28277 -32137 8997 -5037 -32368 4821 41112 59632
28653 59632 14506 -21880 -20150 -27104 -19103 16050 22780 -19411 567 -19383 -10681 -19391 -18186
28640 -18186 -10952 47220 88145 60729 34772 55638 20562 -16134 -106030 -82192 -33342 -33905
28628 -33905 -9639 23071 25791 60987 76008 76851 74529 49771 -29293 -14345 -22168 1931 29084
28615 29084 67669 51257 38928 65917 72481 -13965 -34495 -9927 1860 -5360 2880 -6303
28603 -6303 2315 64976 66482 45978 35963 44939 29923 -22102 -47303 -25289 74222 112641
28591 112641 119529 56580 4274 14474 -12180 -15153 -31166 -16023 -29473 -30572 -18033 -13141
28579 -13141 21471 16466 -426 -40833 -53569 -38050 -72384 -102984 -67800 -75737 -84202 -146081
28567 -146081 -98967 -18948 19012 55651 82107 48877 9204 22101 11468 35585 49280
28556 49280 90615 99918 47353 -18133 11348 78731 26028 8310 41440 51820 -2690 -30101
28544 -30101 -14524 -5264 25289 7252 7648 55171 7322 -57115 -80492 -86499 -89020 -28559 5608
28531 5608 -4354 -13828 46695 72943 63716 33010 79756 124374 109877 53697 4549 -13148
28519 -13148 -3453 8715 26410 21164 28482 27283 53659 47047 -17982 -52766 -30515 -31677 433
28506 433 22959 73185 56929 35751 -23426 -77463 -60016 -52552 -37351 -53536 -86120 -62323
28494 -62323 -80616 -118747 -140076 -79186 15775 79476 87586 51912 -10781 -7007 8896 14974
28482 14974 22506 -42285 -21999 96393 62364 20081 62297 46612 5943 -78986 -65281 -1664
28470 -1664 9340 22489 -7259 -17083 31819 3977 -71614 -101948 -88029 8775 -25565 -79005
28458 -79005 -39966 13695 -31525 -27738 8347 76160 101082 51133 50338 11436 -13901 34258
28446 34258 61652 54886 31008 14314 -28635 -54905 -92730 -57919 -61356 -31130 10443 18393
28434 18393 -5724 25030 52001 43085 62620 34406 -3409 27360 43316 110811 141921 139852
28422 139852 43557 -5960 -43794 -53770 -75659 14228 76801 90738 105418 81625 69598 81229
28410 81229 65667 -2289 21156 41378 35258 78683 61979 68681 73923 6553 -9061 -7488
28398 -7488 -28915 -39994 -51806 -11677 45884 76539 64675 -8656 -127495 -106321 -50621 -12852
28386 -12852 -45609 -48764 -65695 -112588 -97794 -35362 -45227 -9267 14720 6800 57001 34609
28374 34609 -585 9617 68376 117401 93982 43214 90529 93812 75592 108878 73683 52746
28362 52746 -18109 -59755 -37430 -10808 19661 25562 -13515 -80765 -89371 -84271 -21456 -23799
28350 -23799 15039 19748 35997 -1141 19984 -28091 -13704 -30168 -100095 -64027 38880 61126
28338 61126 34537 25911 5638 10150 -4313 25809 34979 42588 -11822 -80589 -55173 6809
28326 6809 72541 57569 13170 -29887 7849 11904 30246 83516 57583 -764 47336 97851
28314 97851 125355 61874 43896 47992 35875 15726 22957 49122 56431 61672 59831 83936 112452
28301 112452 118705 47656 15335 11222 175 26817 60929 57000 21757 -11177 -33564 14878
28289 14878 35499 42552 79882 22287 -30316 -38387 -39010 -15864 3401 10074 -3166 29297 2043
28276 2043 3887 6799 -35273 -82721 -54234 -37239 -23089 -14616 -48187 -28175 15736 29455
28264 29455 23696 -38084 -21987 -20184 474 -24762 -57244 -78457 -19124 -22157 -20842 51012
28252 51012 46408 54573 42854 -1156 -54940 -87112 -118584 -69079 -17943 -33910 -68425 -70270
28240 -70270 -3999 -53586 -65860 -92560 -133107 -51513 9558 59100 108736 94161 32015 40849
28228 40849 73914 106160 82362 31233 38246 33065 41891 67341 111507 104768 21546 -9143
28216 -9143 -49775 -27499 38421 58357 738 31174 -4367 -24840 40258 41349 90575 70703
28204 70703 55084 1664 9183 -53067 -39045 10126 10114 43132 37723 9311 3204 11774 -35841
28191 -35841 -6908 -16739 10429 41514 47177 57340 23477 29509 5573 27654 -35838 -102155
28179 -102155 -85227 -62853 -20504 3854 35509 18326 -20321 1322 -15687 12563 81781
28168 81781 157753 131948 106329 59078 -5183 -25400 -45536 -51902 7837 17275 -2797 -19718
28156 -19718 32770 21921 -19049 7601 -14464 -38060 -73236 -78515 -40266 -49437 -68378 -45366
28144 -45366 -26783 -44138 -68574 -5848 82473 120109 90988 66607 23069 29258 70959 56178
28132 56178 62925 42156 73602 91769 80022 70614 92981 66580 68744 33793 14572 72896
28120 72896 81517 -3461 -3633 -22849 -80801 -57497 33177 28903 59171 33000 9332 89935
28108 89935 60751 23891 27762 55023 33227 24866 16724 43862 91704 91653 12372 -27601 -4613
28095 -4613 38832 74013 116250 134079 170328 142622 71358 566 -76013 -33012 -21039 2369
28083 2369 49853 -13520 3933 16808 17499 33249 -10667 9443 1030 14852 22748 55130 24094
28070 24094 -7554 9279 98131 68149 45549 72812 72880 77637 79766 120070 67285 94947 97961
28057 97961 71919 -11762 15001 14419 68217 46969 9594 -27495 -21216 13948 71507 28627
28045 28627 -11644 -7495 23455 432 -16318 -11952 32675 43093 59665 56825 57789 67490 57878
28032 57878 78636 138761 100572 103497 135188 179102 153459 60601 51862 26117 -6256 34557
28020 34557 45910 35866 7062 -40971 952 42338 47883 104696 128236 106056 86292 21995
28008 21995 -4882 -12617 -18068 -37906 -55014 23155 95204 81314 4405 -7509 33165 49904
27996 49904 34461 26296 21644 1432 4801 51427 35709 -16644 -61095 -35020 2933 86951
27984 86951 144734 80495 -1353 -36744 -31556 12758 64661 10368 15313 33227 4904 14686
27972 14686 -3760 19535 -11058 -50957 -40508 -25703 31562 119753 173512 145837 104285 98647
27960 98647 130032 64714 -12458 44261 100911 22200 145 4161 -30803 -35303 -675 -13437
27948 -13437 11389 67983 15942 -28549 -55335 -103241 -76209 -48060 -57476 -46368 35760 96005
27936 96005 71097 65383 33739 -14554 -59347 -47287 -29470 -29991 16765 1220 23215 25132
27924 25132 24873 28943 -25338 -43119 -37919 -324 4209 11627 -23181 -27752 -4503 -26944 -60946
27911 -60946 -18581 26628 60806 85793 63853 44722 40799 23381 35112 42494 91967 118012
27899 118012 159130 136671 102761 85955 31488 43305 76605 56391 51747 120358 116627 144447
27887 144447 140860 100168 59151 9544 -1247 7109 105439 142640 150907 87425 66960 63119
27875 63119 2418 -26117 18419 -17469 -55261 -38417 32736 52576 24980 -6789 -90481 -94939
27863 -94939 -73909 -55727 -25658 8721 -5689 -44387 -28191 18022 49442 17719 -14172 -12599
27851 -12599 5856 71834 156341 126043 123529 105149 61096 34829 -3857 -10471 27259 60898
27839 60898 43726 42345 13098 17958 29815 27418 5662 21390 1142 22079 22871 -11468 22987
27826 22987 30852 65162 50357 50287 124422 138198 133585 92958 55493 -26883 -29500 -32167 17618
27813 17618 28693 59491 49168 18889 63996 31279 43666 98717 105373 90003 77853 57743
27801 57743 27457 24496 -19568 -42552 -20250 12829 11719 -18755 -24295 -18540 -26666 24902 48597
27788 48597 80648 99988 86155 131693 107457 137447 166817 194193 197579 135666 91985 123279
27776 123279 128382 103405 79980 50705 2921 -23853 -8554 8473 73784 92764 64740 59225
27764 59225 54685 84387 112702 93661 68749 76189 8606 -8240 54321 42214 48884 41279
27752 41279 43539 6134 -500 37419 52772 44016 8207 -9509 23896 59422 78811 37802
27740 37802 -5200 65885 45305 37542 84383 90595 105816 145576 139212 84737 85760 100428
27728 100428 97736 21172 14683 14049 48587 130500 181175 169104 100200 46400 62145 71438
27716 71438 112793 76921 68201 69374 57048 100481 61699 36230 27661 60411 47600 53399
27704 53399 67126 102997 61273 -6515 -13305 87930 86904 58034 22851 4142 3538 64512
27692 64512 71460 66026 59474 63268 70767 67039 14841 4014 60453 98167 46623 22701 54808
27679 54808 154264 173181 141539 171611 130270 103051 56894 50063 48047 5751 17339 95967
27667 95967 110530 77704 57043 119460 133430 139004 113912 79627 84805 79424 77653 38522
27655 38522 -26454 18047 47400 78626 33091 25694 3629 -10548 40012 115854 128223 105245
27643 105245 93904 105878 68295 67891 45008 93722 182455 231169 178454 129760 83222 73714
27631 73714 79602 19629 18427 43355 -641 11134 45869 5687 -9701 30562 64322 75902
27619 75902 88222 65159 54724 33485 35744 82075 104272 87520 89198 141555 137935 140792
27607 140792 173892 189368 174834 147897 115148 145871 100322 102285 139592 123965 154337 143383
27595 143383 127739 116150 176035 159745 84037 3773 28061 39589 39777 38842 44524 97223
27583 97223 155845 174839 148055 54679 60000 112562 142702 124983 93900 91485 149196 198766
27571 198766 161892 67040 -11230 -5470 -22793 -3142 55177 54859 90547 71059 86160 54287
27559 54287 35672 76997 47465 2696 39334 82224 67564 4199 31358 54228 53441 75490
27547 75490 78530 59558 85917 28821 60271 107583 111294 89395 102082 78901 65498 43500
27535 43500 104443 148120 158388 144971 166284 176902 151301 138019 164898 155674 187805 194849
27523 194849 152488 85808 107956 96380 79922 80951 134902 131624 81903 90915 159413 185684
27511 185684 132923 108731 104439 123115 80524 81073 121814 127310 90998 71275 78545 80783 135530
27498 135530 178350 196782 174180 210718 262674 272995 230939 169268 171157 182840 205118 185097
27486 185097 166564 164503 223885 274403 270787 239336 179098 193512 183912 135607 118491 110646
27474 110646 124158 99005 111560 118264 88662 70738 64760 129696 127452 135607 174832 244928
27462 244928 212070 149268 165753 206449 180272 177477 212708 223439 211466 197165 182828 193075
27450 193075 200791 225081 227061 223205 217146 238831 220034 219379 181137 198694 278840 293593 225192
27437 225192 236627 271630 209301 171808 180309 234842 226857 189029 149571 150031 182765 159920
27425 159920 214902 264253 246269 316618 341511 307644 301148 277592 213345 216501 276165 331078
27413 331078 303474 241094 220194 221943 269927 333400 360130 335156 323426 296213 268402 297458
27401 297458 338150 301469 287003 342292 362982 319896 302291 321001 316487 311917 304247 321720
27389 321720 343584 313763 384477 394061 405337 430838 405548 377664 380751 407738 397922 376197
27377 376197 383185 382272 386190 354816 254404 267439 344694 407442 444504 449036 431252 461278
27365 461278 425934 386276 313385 310002 353601 410044 421472 368550 345485 334479 354105 381613
27353 381613 393188 387203 368173 382157 399805 389391 357340 406422 465930 455604 457470 433985
27341 433985 438020 454683 518546 464771 443574 407808 418707 434455 392440 363515 379295 477901
27329 477901 485267 481186 539481 503250 445415 510576 520178 486670 536292 568032 574592 569655
27317 569655 621113 641794 590475 595836 605589 590687 638217 610836 576876 524410 558836 677005
27305 677005 694303 652084 632580 703116 720883 692154 752196 816790 862825 820970 779489
27294 779489 703318 660064 697609 696435 716586 718143 724530 747101 715944 744432 777377 781425
27282 781425 831324 848033 847345 864441 849887 826984 852927 844344 888045 902882 876431 868993
27270 868993 904007 1016298 1082862 1016097 991730 994416 991876 1061748 1168601 1185584 1176701 1136297
27258 1136297 1149963 1147145 1179358 1240754 1253395 1266949 1312247 1307960 1329260 1357994 1304402 1356550
27246 1356550 1373481 1342759 1346545 1422230 1513230 1542681 1598990 1626451 1641090 1675969 1711724
27235 1711724 1699520 1643845 1672348 1701995 1763320 1820697 1793236 1820279 1865822 1936837 1980607
27224 1980607 1957190 1960420 2024550 2123859 2199366 2305727 2382608 2411998 2413397 2449254 2482631
27213 2482631 2539084 2625720 2663965 2667967 2719095 2824024 2911213 3045782 3199148 3295795 3387132
27202 3387132 3453659 3537848 3597894 3648854 3728496 3803950 3923214 3976823 4148904 4291364 4441915
27191 4441915 4648545 4756973 4880461 5058724 5212513 5350303 5528083 5713879 5914396
27182 5914396 6113152 6372641 6683880 6965287 7184410 7438065 7682898 7988612 8318732
27173 8318732 8633131 9020194 9422984 9866365 10322312 10771214 11239389 11757236 12349990
27164 12349990 12940552 13622838 14317118 14974526 15696252 16543018 17458686 18427340 19456835
27155 19456835 20577206 21755940 22941481 24211724 25631019 27232239 28879878 30601904
27147 30601904 32490589 34384441 36295717 38326212 40492106 42676392 44889018 47042096
27139 47042096 49117106 51172694 53024228 54642286 56057823 57186326 57923672 58294547
27131 58294547 58225511 57796678 57025020 55977735 54607283 52888809 50985046 48926525 46840298
27122 46840298 44697981 42498467 40280538 38195175 36150753 34137780 32214229 30413175
27114 30413175 28621527 26999235 25521977 24130432 22791040 21541113 20319098 19178610
27106 19178610 18111182 17117018 16291289 15517638 14758812 14040839 13369207 12728160 12178589
27097 12178589 11620207 11077876 10563678 10124363 9772581 9293951 8882305 8566357 8200084
27088 8200084 7797941 7553493 7301056 7014125 6714685 6457745 6162180 5937102 5752639
27079 5752639 5598397 5422436 5247278 5059120 4826712 4645134 4530605 4432106 4360919 4240225
27069 4240225 4110203 3957091 3826776 3718224 3650177 3537781 3481098 3377472 3211436 3111621
27059 3111621 3033938 2954412 2927565 2882054 2835560 2807133 2714777 2658593 2578592 2538887 2486651
27048 2486651 2405363 2358911 2285684 2254360 2244924 2175363 2084784 2019424 2011286 2015169 1965176 1889690
27036 1889690 1783765 1744977 1764650 1816670 1776644 1719901 1691092 1679617 1553362 1488989 1443925
27025 1443925 1403331 1411360 1418692 1400298 1410855 1419120 1395934 1329890 1308056 1263631 1239472 1259158
27013 1259158 1296116 1192714 1145095 1120321 1121427 1057361 996471 990652 1031662 1063336 1043840
27002 1043840 1000805 968935 1024033 1031374 1037054 1002416 985707 954663 946638 913868 834744 828971
26990 828971 817555 830925 834828 821429 762765 786713 791331 755470 705546 707361 660782 666455
26978 666455 652481 696860 701802 678440 663114 676206 676357 695368 714522 721316 692788 597718
26966 597718 548719 565082 641384 706390 689578 667375 645819 576736 493911 410798 406805 416421
26954 416421 426043 460888 509259 537679 501459 498756 523999 504839 479629 475126 485377 565174
26942 565174 629612 562039 443391 447282 458085 469227 389672 393225 392574 337599 351854 395880
26930 395880 385125 399995 386214 371062 389984 377091 313434 286351 300335 273952 333212
26919 333212 393595 390348 349424 359425 314754 315626 290537 298812 342313 383303 304921 241571
26907 241571 275044 337122 331471 289249 297035 291787 335216 307836 253356 266436 250408 345264
26895 345264 369343 323530 257248 229677 262921 274405 268008 247178 318189 360070 376260 403455
26883 403455 337640 273510 218155 238476 274664 288047 237944 212411 237122 223497 243806
26872 243806 275662 290617 282999 300291 272364 261954 317285 287203 250903 285474 333157 258603
26860 258603 238276 236788 196688 165737 149857 176472 195530 211109 289392 316230 347726 325384
26848 325384 265661 242479 217043 177956 162783 166508 172201 172718 167767 121608 78238 78361 119815
26835 119815 136265 107685 150112 154901 169287 105885 137939 180648 173056 179970 117872 111132
26823 111132 117335 156766 205099 203945 181471 143532 129111 134334 170429 116049 93723 127111
26811 127111 140620 103953 179950 191700 171015 164374 103626 36034 47473 104484 150263 154030
26799 154030 169590 182951 221065 188966 132055 122780 94472 88048 95005 110291 38463 45548
26787 45548 57112 69194 61972 46237 94967 154570 124221 69253 27567 51553 102167 89107
26775 89107 58979 67340 52200 47355 22952 69650 105516 138774 149493 137960 107741 104369
26763 104369 120745 119049 64580 79969 31553 39597 107559 167136 166261 124853 108295 96632
26751 96632 71261 118755 118086 62201 66719 123389 143370 153930 147233 167585 102782 99314 134161
26738 134161 140486 92307 23874 45704 70260 101305 132726 124894 30517 62538 93619 122125
26726 122125 132910 123773 90196 37616 32098 96040 48530 9559 11697 15986 50166 104201
26714 104201 125551 145328 124662 115632 100231 86453 32432 -10453 35245 122577 110794 44075
26702 44075 31206 56851 50547 42903 50523 90946 113145 116778 87279 141110 95031 24967
26690 24967 1626 24838 -34090 -17086 30429 5133 36026 65728 65888 55669 46968 71508
26678 71508 85369 77574 37480 7763 -14676 4610 70055 100750 116690 106375 65822 45164
26666 45164 16977 52531 17118 41058 72070 77390 59368 38442 30750 26611 47345 55506
26654 55506 90918 72945 -22757 -78839 -28917 -47080 -43415 25420 1684 -8617 15236 56870
26642 56870 141308 131003 142057 94949 65003 74204 109243 24418 11524 -23731 -27534 10691
26630 10691 24509 -607 -21378 -20047 16381 60823 15332 -47408 -93465 -73805 50766 113119
26618 113119 24687 23729 23531 13302 -6805 -28541 4525 52801 108714 86062 58793 91540
26606 91540 98210 33061 -68343 -112602 -81154 -33788 3428 50015 69516 6927 1670 -25350
26594 -25350 -11699 52879 100346 81711 37433 35304 40226 31267 21426 34022 66435 79552
26582 79552 98925 69525 41377 35448 111700 117538 41367 -12494 -58889 -54152 -29905 -40580
26570 -40580 -24140 -38925 -87116 -85187 -11697 15526 -16930 -6905 8548 24566 20058 19880
26558 19880 59904 121417 133448 132495 107158 60641 97061 91184 70577 43332 45024 9115
26546 9115 -23629 -18222 29290 -33445 -61968 -39946 -11974 2953 30447 4964 -26986 7932
26534 7932 34277 18212 2113 41759 -508 -33404 -53622 -19430 57501 98847 90895 41182
26522 41182 52236 -3001 -13026 5870 17686 42701 45717 31896 19641 -7091 -36770 -64684
26510 -64684 -37745 15366 57369 34696 50431 58923 35262 20439 19508 5721 23962 78091
26498 78091 56513 45441 13206 42572 38101 47136 86188 49754 37373 14998 34744 63209
26486 63209 49909 47388 30492 14789 41786 32410 7759 -28818 -6900 -15147 -21472 8974
26474 8974 -10843 -59094 -4257 34124 74106 58374 73462 110660 120583 52401 -28403 -24130
26462 -24130 14083 7358 37971 56005 92874 76059 35971 -20332 -9402 3915 -30022 26225
26450 26225 94919 84822 47316 30062 -8061 24392 48877 22076 -37245 -6295 -10569 -5850
26438 -5850 9214 -9377 10569 37515 12943 -7452 -15198 -14531 71009 130526 132376 167955 144033
26425 144033 53841 42008 26556 -2875 -20294 -10094 22257 47097 39520 -2305 -27884 3961
26413 3961 62542 70024 92250 122193 102336 81484 64641 47871 12052 49750 55012 49880
26401 49880 14208 -3455 21261 67349 74504 33631 24253 16619 85204 128802 129691 57478 3662
26388 3662 -4860 3407 15192 27958 20851 18629 1916 38409 42112 26678 20291 7312 -31915
26375 -31915 -37559 -80619 -139755 -147990 -143127 -67070 4822 3105 22747 18981 40970 36086 47588
26362 47588 5884 25230 44089 -17285 -58143 -41898 -42327 6127 31211 55411 105568 139372
26350 139372 151770 121157 57025 -42547 -75529 -33896 -17865 -12168 14357 -1193 -18348 13452
26338 13452 -11905 -26488 3627 -33245 -40891 61467 85260 56870 34109 6441 28479 35319
26326 35319 18690 -6340 -23250 -40881 -38138 -30826 7396 28578 -21926 -12711 -5121 29107
26314 29107 43415 24726 -34824 -63311 -52666 -19049 43931 89623 73433 73271 60631 37954
26302 37954 24601 -1040 7487 -20445 -75864 15545 64224 25375 -48755 -89364 -77789 -69607
26290 -69607 -72852 -15156 -9905 -14293 -31957 -22441 10907 50401 58996 49158 15209 29214 -20019
26277 -20019 -39244 -57375 -29426 -42121 -43849 -13832 57054 53455 16588 26453 50547 72345
26265 72345 42043 -1542 -19 32598 -26560 -6793 52781 128354 134082 54364 -1337 7200
26253 7200 66937 43820 77737 45886 26753 1533 20278 76476 81600 52564 50562 -7671
26241 -7671 -11246 66891 96841 78773 41404 61500 120417 65381 46923 89377 86606 51884
26229 51884 -3141 13499 46422 16376 50506 47882 -24250 -42081 1555 6808 11855 75998
26217 75998 82818 11225 -30795 43367 75687 64359 20772 -1784 4129 15239 43233 22310
26205 22310 33392 43107 8126 -34028 -48028 -46886 -18159 14531 40318 1715 21946 44038
26193 44038 46625 26756 44774 -21541 -67699 -8535 29537 31465 37130 94130 132871 76388
26181 76388 22652 18126 46217 93981 91125 51572 11429 -25707 -42076 -45740 -35083 -63396
26169 -63396 -59867 -69357 -76303 -56100 -62538 -118297 -72535 8516 48510 8002 -29370 -32054 -11495
26156 -11495 29463 84610 67309 96155 99170 91582 66617 37957 1453 -2493 25715 59117
26144 59117 69666 20801 17303 12300 56537 59728 93643 35590 13775 -17994 6332 61404
26132 61404 78270 55794 58237 74434 31417 -41081 -19364 51697 75258 54639 46318 74664
26120 74664 28879 -14776 25901 16158 8144 14678 106135 125429 26763 -28925 6003 37704
26108 37704 66308 77791 22335 -20026 -18716 -45870 -72950 -44270 -41192 -9576 -38875 -35047
26096 -35047 -16435 -15906 7198 4530 10711 73220 77073 43601 60112 25322 -8188 -44319 11013
26083 11013 32257 40488 -7657 -21728 30117 45298 37374 31300 27343 49826 28073 -8712
26071 -8712 14111 31951 21463 -27361 -20642 -12535 -16325 -1573 33583 87576 34259 -8608
26059 -8608 -34783 -21750 -75334 -70296 9250 36050 -3205 -11539 -12765 -28860 -12392 -23554
26047 -23554 23778 37523 -14707 19593 66714 40554 63050 96525 83362 31204 -39809 -29762
26035 -29762 -21252 -60326 -84530 -78016 -41719 1557 17634 -51231 -114034 -112741 -92859 -37189
26023 -37189 -12576 -48910 -41944 2357 61465 25077 -100942 -42271 59430 48712 37766
26012 37766 57769 48882 6531 7333 15161 38045 33142 33412 21360 28011 35424 28112 64510 70203
25998 70203 -6404 -60544 -42739 -12872 38376 59009 -7195 -21701 11048 4212 -27972 33675
25986 33675 45610 -2181 -37081 -624 -14122 -82089 -102956 -108602 -110433 -153391 -95430 -37068
25974 -37068 8797 31092 35195 39119 66453 34133 34233 41785 40251 -34083 -50095 -31035 20941
25961 20941 32703 25816 19534 70345 2199 -26597 -22186 37445 44166 29477 454 -14251
25949 -14251 17109 56285 58559 17921 -45364 -30743 -105536 -105133 -51773 -663 -49721 -62718
25937 -62718 -43208 -39516 -102409 -101315 -61283 -40907 -26537 82890 132004 83214 -45523 -89628
25925 -89628 -86123 -84422 -125056 -48029 -12189 -43731 -26260 -2812 19597 66883 115902 102776
25913 102776 13827 -68561 -47551 4400 -18427 -2136 -24750 -26605 45989 79628 76833 60964
25901 60964 -14874 -33969 -11591 -12016 -2460 27207 -35915 -37059 46037 27929 30719 61785 108119
25888 108119 94581 44399 -1714 -26721 -57344 -54409 -53534 -36000 -32931 -69016 -80702 -40520
25876 -40520 -14320 842 -18335 -59478 -108003 -95277 -80911 -132388 -74408 -24735 -27359 -2818
25864 -2818 -8097 -10093 -25024 -25667 -16619 4416 -13289 -69273 -74749 -85174 -119739 -105723 -48816
25851 -48816 2613 34630 54459 35204 -4427 -42066 -42462 -25963 -11028 21753 42305 54864
25839 54864 33230 -56791 -146185 -99059 -20486 10015 -18754 -70136 -69427 -81329 -51313 -34489
25827 -34489 -26456 -6845 9604 25169 -28033 -102911 -91040 -20734 9165 28707 -13786 -40555
25815 -40555 -12294 -64300 -120055 -148443 -118141 -141572 -77845 -48049 -26661 -28781 -23278 -45637
25803 -45637 -35575 -6956 34279 61243 77614 59744 25864 30994 74062 75097 17318 9731
25791 9731 -43076 -82228 -66306 -28553 10041 24225 28712 36151 -15493 -77028 -83783 -77509 -83908
25778 -83908 -104810 -67029 -82945 -77417 -105469 -139169 -167631 -149721 -94113 -110560 -38076 -34940
25766 -34940 -24025 -3860 -62980 -80112 -49219 -90092 -58666 -22757 2417 -32400 -37236 -22458
25754 -22458 -44768 -67613 -79578 -87862 -20370 -50154 -74077 -12750 11095 20512 30320 -1479
25742 -1479 -14655 -35425 -23076 41880 -7942 -54344 -55222 -93943 -76194 -75080 -40687 -1206
25730 -1206 55576 18399 -11961 -58045 -68008 -22753 11226 18863 2536 -26583 -2000 -19008
25718 -19008 -41331 -78454 -79031 -81828 -69594 -32641 -7333 -24968 -66602 -29798 13149 21905
25706 21905 21717 18561 16989 -23368 -68484 -109303 -65260 15303 60210 49949 51320 -21496 -9995
25693 -9995 25569 2116 -806 9725 -41818 -27828 -14797 6063 21431 71663 99771 83600
25681 83600 18198 7239 44709 28854 25929 23671 15531 -78082 -141368 -105084 -48615 -8790
25669 -8790 10051 -29420 -59349 -21248 5337 15247 -29837 -49929 35482 76485 52540 57149
25657 57149 34949 35931 -11819 -11953 6540 76552 80448 54730 66385 72881 60912 37196 22548
25644 22548 -1269 -43441 -39206 1048 21478 73256 104691 114608 115681 83317 23361 19037
25632 19037 -17245 -15910 2265 25446 17873 -17546 12141 49425 23768 5684 -16029 -7745
25620 -7745 -8304 4606 17844 61428 97205 75778 41515 7052 -6939 39690 49758 22444
25608 22444 -10270 -82469 -123812 -109241 -79943 -52456 -64278 -43868 -3724 -10664 14500 -7565
25596 -7565 14959 42666 24309 33016 11782 -53399 -70854 -21855 -5163 -8665 12156 8270
25584 8270 47233 12611 41292 66526 91357 23256 -4101 26428 16288 -21839 -20109 -41680
25572 -41680 -4884 25316 13743 7061 -40157 -66149 -51490 -27506 -72123 -19872 30776 25607
25560 25607 57651 65990 28966 -10831 9924 26859 70614 55459 9954 -9211 24296 101181
25548 101181 139257 128602 93384 34826 -27727 -23665 -1910 -9595 -24940 -20641 -59809 -48857
25536 -48857 -57836 -7124 27296 88343 172410 178929 140685 78114 -18324 -27822 4474 33813
25524 33813 -4312 8440 -4397 -25125 -95433 -151076 -98114 -4953 -10138 -47482 -50032 -17006
25512 -17006 21293 16581 -7700 -18897 -7986 -35560 -21649 -27475 21600 34966 -36318 -51441
25500 -51441 -153402 -115043 -42905 10575 -6264 51108 135222 189063 105007 39962 -4725
25489 -4725 -11624 16198 47412 57695 -2647 -41812 -22767 -63180 -40111 -63252 -121831 -131231
25477 -131231 -74828 -13042 -26664 -9916 43907 38306 35201 19397 -23667 -66924 -91255 -98262
25465 -98262 -107379 -125725 -50264 -4048 -8384 -40976 -43593 -60402 -98522 -63472 -59675 -101460
25453 -101460 -73496 3463 -37526 -27427 595 994 5312 35598 90777 95294 28497 21957
25441 21957 22402 -934 -2673 -18857 -10792 -19552 -50025 -47262 -39688 2655 54322 36712 -19142
25428 -19142 -93130 -137041 -61585 -74393 -94627 -66738 -72495 -33833 -45801 -14712 -13158 -76295
25416 -76295 -59044 -3003 18072 18690 23009 19273 1806 19991 24097 39024 23821 61692 96188
25403 96188 108869 106189 54750 48936 -22811 -131419 -147124 -119027 -5041 -22552 -27151 10912
25391 10912 -8659 -55090 -15650 -45710 -75486 -32644 -14964 28544 39682 43381 59449 29191
25379 29191 -33183 -21160 12999 13189 -58646 -114876 -107643 -52018 -34677 -44251 -58426 -40322
25367 -40322 -4946 11262 -25923 -61056 -78999 -79325 -35190 -15788 -59978 -24074 28 14613
25355 14613 761 -1107 -8111 32710 83025 67703 28126 24251 43930 26971 -14167 -57464
25343 -57464 -27293 -44898 -72120 -16251 -61751 -107085 -100013 -140975 -140232 -96435 -52140 -7710
25331 -7710 61966 31602 -12703 38799 83594 21333 5753 28186 -15038 11489 -12472 52488
25319 52488 121866 77777 5671 -18455 -3839 -18192 -63854 -69228 -67823 -129073 -190550 -160041
25307 -160041 -125389 -100351 -92335 -62869 -7878 8480 -52162 -90564 -145011 -147213 -116569 -93865
25295 -93865 -117045 -120172 -118966 -113861 -72311 -30707 10816 -10395 -17121 -31533 -58515 -22793
25283 -22793 10053 -6900 -14976 -29843 -19345 46672 41155 12585 17956 16611 13058 50020 43593
25270 43593 38546 45102 74469 52109 5764 20763 95777 65331 17289 -43446 -55451 33841
25258 33841 4336 -85591 -77464 -57122 -51430 -56165 -70663 -75522 -10924 40048 34391 -2299 -17835
25245 -17835 -16323 -6562 22331 103279 99579 59342 17667 6541 25478 -131 -29352 -20108
25233 -20108 2921 91830 114988 64818 24950 47380 32266 9769 7803 -8751 -36415 42930
25221 42930 74909 22065 -52184 -30947 -52690 -70481 -62524 -23949 9678 26185 -716 -72628
25209 -72628 -101361 -95036 -93768 -73885 -54669 -31755 4192 18997 33599 19544 3421 47648
25197 47648 -1462 -59925 -66992 -51496 -54915 -65595 -63480 -18059 19074 77165 90844 74583
25185 74583 33553 -23840 -31988 -71362 -40703 -4605 27672 16830 43261 53768 23987 -40056
25173 -40056 4323 47445 28589 -729 38133 28101 20488 -934 -19719 -49441 -63748 -88177
25161 -88177 -49920 -16245 4973 62080 101197 104404 69897 17818 -27544 -75271 -92947 -89817
25149 -89817 -103282 -57213 -12149 -72424 -66289 -18455 11467 8606 -23102 -1754 41785 74834
25137 74834 104064 66449 64810 45356 28010 49389 -7631 -87327 -97948 -63566 -92859 -104368
25125 -104368 -65544 -50650 -64123 -96888 -81033 -65793 -44422 -13417 -19466 -46437 -17557 33
25113 33 -15520 14313 -1590 -20614 -11224 -55419 -84856 -78845 -43496 7071 14195 3837 -8871
25100 -8871 7889 -18353 -11697 28883 44463 -9561 -20059 -11131 -25429 -19839 -1243 -5167 -6915
25087 -6915 -2561 -9352 31080 45423 -20263 9534 46232 42505 33065 33954 44429 53660 55940
25074 55940 35869 28121 70749 70388 44237 -7475 -90485 -98435 -105029 -28520 -10445 -19113 -21666
25061 -21666 12729 -35417 -16958 18810 -8614 -40314 -41568 -35561 2429 26018 6843 77959
25049 77959 100890 66345 88499 103974 126164 181167 184565 115739 74774 26757 8829 -10028
25037 -10028 -3092 20158 51250 72434 -15663 -39163 -40943 -35741 -23467 -26932 -4629 70202
25025 70202 24990 2964 6435 -14722 -59047 -2462 10778 -11843 40731 98105 90771 75070
25013 75070 35513 -5094 34471 78015 44004 -33365 -93418 -61591 -55135 -32238 -65215 -40056
25001 -40056 -19256 -44365 -54118 -21561 32191 35487 37747 6173 -12619 -30182 -18106 11488
24989 11488 -48582 -89929 -146825 -190820 -179152 -124140 -63313 -31572 -48210 -6860 39895 638
24977 638 -52356 -66868 -35460 -73874 -72428 -36415 6259 28014 -22859 -90888 -77716 -54734
24965 -54734 -74181 -79337 -90326 -72125 -42624 -44822 -4273 45591 51103 40535 31557 54915
24953 54915 51735 32716 33177 29436 -46603 -7396 34574 30619 -1195 -1480 35016 12937 1153
24940 1153 64511 57526 -50508 -149423 -117603 -104490 -54181 -26466 1337 -15436 -5409 29077
24928 29077 1735 24194 31201 8254 19272 69026 60624 94944 66898 14406 50 32840
24916 32840 51998 19661 14769 27038 7212 -31105 6093 42437 18491 -18986 -32073 14829
24904 14829 71755 61966 82133 88095 88671 63077 38654 32820 -17456 -29624 33663 -11950 -21506
24891 -21506 -9619 1882 -14876 -133844 -105885 -94244 -115128 -94611 -86992 -84284 -90838 -121956
24879 -121956 -110736 -49952 -63318 -100459 -87325 -88134 -72293 -60153 -83896 -51448 -33068 -55047
24867 -55047 23559 57958 -6889 -46542 9305 51878 44033 6625 -7479 13551 20890 2623
24855 2623 -16369 -37812 -32679 -26976 -59428 -73534 -70046 -65438 -62908 -55757 -18329 19297 -3474
24842 -3474 45020 39227 19927 25706 54506 34667 68981 80681 28612 -16983 -10678 -19057 27586
24829 27586 42419 37809 -24875 -68879 -43796 17315 87093 35011 20511 -21286 -34513 17741
24817 17741 -6026 -14335 -43475 -70658 -42345 -735 56661 85160 27388 24428 -5105 34556
24805 34556 61189 89345 84019 42636 11361 -1049 -4815 3077 -13006 -1969 -38736 -64756
24793 -64756 -56601 -55842 -82056 -94798 -124512 -114787 -142039 -116853 -31506 -22739 -60086 -60624 -33341
24780 -33341 -29913 -52613 -47981 -109144 -64299 -1265 -51400 -149870 -151292 -139983 -91469 -67613
24768 -67613 -53805 9645 43762 71219 40363 5099 -45229 -88912 -10798 12862 -12202 59158
24756 59158 52765 17493 74375 78349 45256 7059 -7495 -58116 -107025 -105618 -78016 -166167
24744 -166167 -188592 -116177 -31344 -36432 -36890 -25905 -96324 -150084 -122406 -104349 -6211 91328
24732 91328 98292 19824 3767 -33622 -73469 -72031 -56149 -62953 -108398 -67301 -34070 29344
24720 29344 93895 24724 -4421 7336 -19045 -117798 -108840 -84753 -89606 -79090 43388 74329
24708 74329 -1872 -35497 -73980 -52214 -60691 -38141 -41297 -12038 21205 27625 42283 -16294
24696 -16294 -73574 -65131 12611 11710 18985 20380 7281 29031 -14025 -46159 -15467 9574 -54215
24683 -54215 -22278 14933 -49292 -54312 -36027 -45780 -98503 -114911 -80919 -134221 -99250 -43008
24671 -43008 -70504 -57848 29132 51693 -10967 -62993 -58608 -43672 2080 41946 32929 -5332
24659 -5332 -85276 -125251 -85155 -14748 59937 857 -15920 13776 -11379 -8992 19513 -37928
24647 -37928 -49264 -6353 4639 -36766 -11677 28243 79466 64532 78748 140654 194708 167345
24635 167345 97235 52381 -6223 52024 42774 73484 112017 117842 99352 95925 87125 52532
24623 52532 22600 13397 34132 44309 -22711 -77545 -65695 -34161 10185 28061 35526 61571
24611 61571 74854 66683 26899 -28322 -71703 -74778 -82748 -35045 -10776 514 -6948 -41544
24599 -41544 -42287 -47398 -39851 -30653 -64500 -89288 -52569 -33004 -43272 493 2705 27146 37191
24586 37191 61505 108054 84580 69963 50172 82061 71909 78894 3394 11471 5276 -27655
24574 -27655 -13719 -1539 -8337 2354 -16044 -14359 -43345 9575 -1742 -7445 71123 74730
24562 74730 50857 6495 -14955 -6863 -77335 -90517 -62971 -50894 -33949 -46021 -36884 29260
24550 29260 19065 -30135 4292 57105 66314 83816 53950 44333 26017 -33468 -97953 -60669
24538 -60669 -37159 -56589 -68490 -65121 -17125 6052 -8627 12820 39580 38151 -20185 -48606
24526 -48606 -71668 -72549 -11173 -31499 -21702 -32038 -817 32065 -17569 -27902 -6392 -5186
24514 -5186 -17165 31322 40634 7754 -17693 17464 -17346 -46247 -10559 9875 76024 80833
24502 80833 60721 14971 28838 42153 29237 -17812 -36594 5589 -1615 41576 20626 -22448
24490 -22448 -51392 -81307 -72438 -126825 -93843 -86741 -99721 -107266 -112273 -70230 -3492 20186
24478 20186 -18726 -3439 17881 36052 45382 32343 87651 99619 118991 106410 67091 77107
24466 77107 57553 -17779 -32030 -42596 -17101 -58028 -103755 -101048 -83783 -66874 -83214 -97325
24454 -97325 -128688 -86071 -44192 -3193 -12497 -17559 -65743 -109048 -74114 -60345 -71978 -101304
24442 -101304 -84975 -89392 -87518 -44415 -7596 -4939 -31026 -67881 -131923 -120219 -47242 10999
24430 10999 71137 71907 80677 2423 -41 31025 7196 -28479 34451 9523 32358 64981
24418 64981 5675 -13143 -33219 -12445 5805 -2245 -21263 -17067 1808 39648 18250 40577
24406 40577 88793 59162 37207 26296 50753 29937 12065 -8601 -63871 -38655 -26619 -18406
24394 -18406 -39808 -67395 -78661 -71246 -81834 -53236 11372 55936 4479 -56072 -46130 16915
24382 16915 73248 38852 11353 76018 70256 29304 38254 2957 -18683 -26592 -47911 -86275
24370 -86275 -58408 -122919 -105027 -74888 -87490 -63743 6930 -11068 6319 38958 39449 -15856
24358 -15856 -105512 -99941 -49130 -30385 -92189 -70139 7876 50170 36391 -18465 -62032 -65068
24346 -65068 -102777 -148660 -111352 -52037 -2759 51118 1765 -104296 -112092 -67861 -1043 -46824
24334 -46824 -69113 -33345 -15716 -24062 -10762 -29121 -19088 2722 7158 -24349 -82043 -65397
24322 -65397 -55498 -12350 -29695 -55886 -98137 -128275 -66854 -79000 -72771 2696 -11948 -17162
24310 -17162 15211 36569 10712 -32335 -61497 -53950 -8821 28209 1434 -17437 -39279 -20956
24298 -20956 21385 -418 -106767 -112952 -68552 -42517 -20459 -31089 -34296 -50937 -113380 -93569
24286 -93569 -77234 -111982 -110221 -46354 -3572 -21076 -129228 -44053 57530 135797 143458 115571
24274 115571 36569 -38273 -79261 -76203 -44534 -8785 -9217 1678 -6480 -43731 -98282 -94411
24262 -94411 -57864 16833 -19649 -20877 -29556 10929 18116 -56020 -101794 -93359 -93710 -140752 -114508
24249 -114508 -12175 40864 69571 62162 26026 25634 30300 53968 50763 14137 -14482 33987
24237 33987 10425 -27367 -28138 -56829 -88625 -59117 -1877 6475 21047 59722 56806 -32278
24225 -32278 -35678 -24596 -4172 -4382 2949 -20318 -17236 -20628 532 -17073 -21767 -43058 -46210
24212 -46210 5872 -15692 -35598 -18740 -37331 -46917 -12517 20493 -21610 -94289 -91337 -49445
24200 -49445 16026 -14023 -72226 -24504 116469 135149 61488 38156 44813 -33488 -36987 -29685
24188 -29685 -23377 414 -2791 2792 7810 2656 -720 16362 -9130 30943 55307 46570 71706
24175 71706 95936 84246 44433 -11730 -10861 -21176 46654 51732 72001 75178 2627 -101989
24163 -101989 -144941 -104833 -39671 8613 -46067 -35601 -26498 -59708 -70676 -63711 -40458 -31917
24151 -31917 4075 2357 49929 43980 7525 5476 -20569 9152 64936 131050 151995 140602
24139 140602 114864 75111 22905 -5547 -30241 -44265 -29401 3226 65613 46945 23824
24128 23824 10560 -31637 -1469 44292 77126 36118 -22897 -59237 -2467 12481 10566 56474
24116 56474 56340 -4430 -20283 -20354 -30233 30645 19071 -26889 -53746 -33973 -3040 5816 49996
24103 49996 72219 41217 68055 74738 26424 -10025 -32079 -11549 58063 75598 26260 74102
24091 74102 308 -32631 -42641 -41814 31293 39222 39476 12433 -39755 -32050 -47228 -35336 -19522
24078 -19522 -22399 -3034 86700 109709 71754 22113 20982 -47905 -82094 -69606 -43400 -22343
24066 -22343 -24733 11773 -8241 -62252 -89901 -130786 -78917 -43608 1254 1904 -47761 22012
24054 22012 74970 10959 -46743 -79470 -144176 -201605 -180163 -132277 -105720 -74425 -70121 -55923
24042 -55923 -76129 -65761 -32387 49002 71834 51687 83083 56653 10421 42372 70565 29485
24030 29485 23825 42528 30015 -15214 -5442 -18678 -45245 -40820 -48008 -88528 -89518 -54554 8665
24017 8665 21071 -4828 10948 40042 47806 25737 7123 -15030 31267 57294 26484 22485
24005 22485 11113 -7948 -30125 -38752 -69393 -37674 -55405 -73709 -48456 -61692 -12207 46228
23993 46228 30627 1458 12425 14850 27701 77887 25127 -33331 -12711 -7675 20960 34780
23981 34780 53672 5172 -33797 10065 47609 30647 -2604 -22724 -56205 -47292 -26480 12359
23969 12359 -28831 -80933 -105438 -111601 -57296 5097 -9747 18231 20567 24561 38432 38103 -16202
23956 -16202 -24779 -28325 266 14603 -19527 -31008 -45079 -27814 7918 -6499 -33872 -69117
23944 -69117 -91268 -60013 -54557 -11513 -3961 35741 77601 37313 23276 49306 57016 66952
23932 66952 73251 80031 95069 87909 130393 89091 14171 -15868 -8164 -7187 -68940 -64193 -90049
23919 -90049 -88250 -23823 -2397 -10241 19985 -5799 -44338 -17392 14084 -5164 -90599 -111553
23907 -111553 -46593 6371 16365 30944 19588 30784 14740 3800 46509 47944 17562 32535
23895 32535 50298 55719 123892 91845 65963 55871 14221 14607 26302 37827 23208 -43414
23883 -43414 -69816 -30811 -25024 -55769 -65297 -64911 -9224 -4176 -45665 -93387 -106688 -130785 -101209
23870 -101209 -72798 -52782 -38464 -22818 -43744 -58439 -31590 -3403 890 -18842 50654 56184
23858 56184 27445 -14646 35651 -657 -60024 40129 77968 78934 78428 56194 5005 -16881
23846 -16881 20342 52870 9589 18464 58133 39845 12023 -67498 -65042 -37365 38397 14227
23834 14227 -47137 -126576 -104950 -39554 -33087 -26667 -24827 -56344 -67809 -60839 -73487 -21630
23822 -21630 11121 -56384 -42556 -33867 -69044 -92286 -74389 -71990 -36633 25554 94807 79493
23810 79493 26497 -34859 -39366 -31621 -37417 -20816 -17183 -79662 -58289 -935 21214 21861 49450
23797 49450 66821 61128 68994 32142 -26229 -40125 10556 36468 25877 43368 83903 62652
23785 62652 57802 45913 -9390 -108962 -96793 -99625 -30780 16181 17993 17959 -16102 -32909 -22296
23772 -22296 -4069 17408 16300 16473 47613 63407 94773 134381 81404 22298 -15125 -30605
23760 -30605 -15031 8391 32284 40539 22114 -31399 -62467 -107421 -83182 -35829 -52065 -47161
23748 -47161 -37595 -61559 -76977 -108365 -122881 -100441 -65631 -56 -36797 -64077 -82332 -115401
23736 -115401 -127530 -77640 -36737 -23655 -36144 -86550 -137300 -63607 -19346 2792 34023
23725 34023 4704 -23922 -86975 -130369 -154071 -131201 -91176 -86229 -59358 -8583 -42413 -83537
23713 -83537 -108395 -99599 -65169 -4155 15118 -24528 -40807 -2631 101198 108942 60453 35113
23701 35113 7409 10697 -9598 -43356 -66958 -47106 -32275 6218 57308 31476 -42355 -83167
23689 -83167 -75836 -31859 -2080 -9209 -60242 -117165 -131796 -84718 -32714 -7403 8057 32225
23677 32225 28990 16464 -4188 -6734 10722 -23464 -87232 -65765 -46608 -56836 -93843 -27820
23665 -27820 23087 -28293 -69116 -35752 20679 20397 -8683 -49364 -37414 -13802 -26209 -28815
23653 -28815 17192 34476 70835 142635 159367 178977 123776 7059 -80434 -120888 -164296
23642 -164296 -79296 -2532 52366 51140 8199 -25758 -28539 -1842 6805 -13444 -44645 -38979
23630 -38979 -17000 1574 43519 57875 10759 2689 -62289 -157242 -179222 -208110 -199977 -119881
23618 -119881 10107 45072 -38675 -39075 -33753 -24629 -20540 13455 -15371 -31461 -33959 -29366 -54047
23605 -54047 -59830 -1333 52151 14096 -26096 -26576 26773 50418 8931 -3700 9150 38217
23593 38217 89676 63284 -14487 -12391 21957 23848 2935 -39009 -73730 -88313 -47774 -27822
23581 -27822 -57304 -10276 21963 74507 115326 140000 107111 35444 26750 44141 75990 66940
23569 66940 66627 26545 11136 30455 9255 -29302 -90458 -144264 -131392 -101130 -30281 -16193
23557 -16193 -34965 -26276 15766 -1917 22947 29958 -18968 -83113 -111125 -133728 -75746 -57548
23545 -57548 -45560 -13367 14123 8530 12221 37489 61063 42230 42386 36151 -11422 -22705 -7413
23532 -7413 -22569 -21030 -57134 -26418 33770 90819 88514 63994 52502 15267 -14172 5823
23520 5823 27378 -10861 -10946 73446 41222 -28828 -25205 -19194 -34778 -15636 -15368 38497 121314
23507 121314 137861 79729 45843 3941 -66887 -42861 24425 53144 77599 91033 15418
23496 15418 -4529 19726 -21744 -26873 -100334 -100240 -78124 -112235 -107805 -133494 -164480 -210470 -161714
23483 -161714 -98506 10726 21995 29103 -3392 -44618 -81889 -34083 -45807 -40756 -78294 -115037
23471 -115037 -78424 -52904 -58104 -65677 -39999 48547 94655 80655 9450 -32679 -16591 47266
23459 47266 57383 65102 66029 -9286 -25901 -50172 -95404 -61208 -50109 -63483 -47175 -33578
23447 -33578 -68656 -85690 -48082 -63705 -23635 -29427 -9378 24287 8201 22877 -2229 17351
23435 17351 94177 146251 72007 11171 -21381 24831 -17238 -35935 -11193 5733 33210 17051
23423 17051 38572 81456 87492 61015 66685 73535 67305 55262 86984 31677 11434 44502
23411 44502 9039 14679 23580 34406 32752 31418 21803 -573 2423 44004 31239 -19872 -7903
23398 -7903 -18460 -50043 -24222 -8280 25436 85659 90662 43523 -21462 -19262 -25211 -24784 -65504
23385 -65504 -60237 -13708 -12315 -8677 -6948 -26393 12313 40081 75564 30824 56749 49941 -44037
23372 -44037 -38914 38291 36055 21219 47024 77281 -42483 -75322 -4442 10556 2070 -1120
23360 -1120 -12460 -18636 -25358 -48392 -23517 -17752 -12104 -9567 -44573 -32847 34759 33550 -19068
23347 -19068 -23107 -29318 948 39522 42680 75135 98585 31904 -20871 -16308 12268 29166
23335 29166 38250 17510 9152 -32023 -65247 -73913 -86285 -68090 -56564 -101866 -62189 6701
23323 6701 34870 27605 76 -5506 -40334 -100190 -91739 -107671 -117126 -106953 -84600 -65963 -79037
23310 -79037 -59723 -51460 -37123 -81294 -89196 -48039 -18978 -31127 -48718 -94701 -71054 -8670
23298 -8670 15783 20908 7404 -10777 -28052 -6357 14704 46158 66729 57998 7556 -9697
23286 -9697 9640 16579 -9044 -60680 -28340 -33581 -71788 -77475 -138195 -130501 -77644 -97497 -76553
23273 -76553 -15736 24117 -26930 16929 56960 9155 10667 32096 50259 -24225 -22725 -62092
23261 -62092 -44568 -18524 -27278 -5013 -10295 -72024 -100071 -78406 -99552 -93035 -43818 -57933
23249 -57933 -54168 -3860 26750 22062 3214 -376 -6323 -1204 2299 -11128 -18588 431 -12430
23236 -12430 14663 -35901 -65850 -82150 -23554 -13329 9519 55548 12955 -19047 -54396 -76165
23224 -76165 -62215 -40795 -47271 -12413 3792 2246 -10671 15530 47812 70207 40171 -18840
23212 -18840 -13418 -792 35233 66041 7272 11476 19727 75954 110666 102282 145504 107064
23200 107064 51056 88630 90094 44359 19557 41506 49675 19227 18009 61029 -30285 -37508
23188 -37508 -77028 -53350 3394 16829 26271 13888 15817 6691 -24029 -39849 -47600 -70182
23176 -70182 -64423 -64633 -48270 -12819 4030 20661 10499 1885 13479 79530 122182 79393
23164 79393 96109 92037 70934 12249 -55903 -81842 -91687 -77949 -76714 -76660 -28602 4861 -5713
23151 -5713 12961 36433 36970 11427 -13701 -87089 -166073 -165754 -85098 1359 -32565 -55683 -27736
23138 -27736 16606 47096 7939 -65172 -143123 -145896 -85578 -5902 -17372 -81514 -65182 -2486
23126 -2486 -1466 6860 -370 6723 31096 52786 49214 -26390 -35662 14264 15732 56797 27304
23113 27304 1246 -43671 -137026 -149341 -125064 -62482 -27101 5325 13047 4610 3041 -18592
23101 -18592 -14804 15016 20747 49755 77062 40467 -26386 -31179 -70929 -18555 -53287 -52147
23089 -52147 -26365 -4928 2030 16295 57961 25753 39056 8288 -18533 28043 51347 33926
23077 33926 33872 36984 45457 29503 -11877 -65201 -33419 -41511 -47694 -15325 -25456 -62655 -57903
23064 -57903 -75215 715 34898 60831 64993 36431 -10441 -3468 3130 50025 53866 68671
23052 68671 82493 23189 20418 87668 72818 20615 -30855 -5421 -30324 -71778 -73422 -66454
23040 -66454 -102763 -102653 -61724 -77566 -46911 -8931 -4413 -16818 -46668 -78854 -64012 -32091
23028 -32091 -60406 -29310 23844 -43717 -64404 -89485 -49168 14220 5669 1096 19526 -22051
23016 -22051 -37861 -53491 -64264 -16548 -35839 -32286 -41726 -53937 -55009 -75187 -62122 -46884
23004 -46884 -35844 1289 -14280 29146 16272 2018 -35434 -190 -16329 -17615 -43346 -108539
22992 -108539 -112537 -54046 -73073 -69847 -47589 -87098 -104743 -103070 -49787 -65197 -70763 -67518
22980 -67518 -43114 -76823 -108721 -24279 -4296 20314 66110 139073 105371 57158 91646 129612
22968 129612 50023 7349 -51218 -68443 -8960 -23563 -45785 -87314 -81470 -23495 -8003 -10387
22956 -10387 -34104 -38558 -84505 -57095 21282 45809 19117 -17162 -70126 -45953 -83112 -74350
22944 -74350 -89507 -38845 -23823 -8938 -392 21428 28562 17962 2737 14534 7675 -23427
22932 -23427 -69620 -45366 4080 16818 50634 33882 49229 -27969 -76197 -74448 37227 73168
22920 73168 90050 34474 43640 136460 102249 44463 18936 46074 27856 35351 21416 -1136
22908 -1136 -26196 -91660 -64994 -89085 8139 9890 14741 27797 30599 104330 58553 65210 54352
22895 54352 74845 45822 2444 -15699 -9957 54294 109557 39782 11602 4001 -4924 20696
22883 20696 49520 23040 2747 -6514 -8291 5626 44125 43316 -22462 -80255 -77256 -126941 -163842
22870 -163842 -153412 -101775 -53252 18971 23565 47134 44359 -28570 -59638 -198 -6902 45005
22858 45005 66399 36444 50512 26525 -45077 -86157 6102 32023 -28640 -21639 66231 96627
22846 96627 50969 3487 -1306 17202 836 -21555 12740 -11097 -44635 -34888 601 -19142
22834 -19142 2621 -23836 -72883 -40959 -54513 -69487 -58440 22563 -12491 -21541 11414 35513
22822 35513 -15970 -41038 -9750 -26413 -65223 -32265 14327 36513 47888 1450 -33493 -16802
22810 -16802 36623 7829 -8050 12514 10372 35950 60264 39280 44835 55748 69254 61368
22798 61368 93384 87773 45086 -29079 -25773 -79239 -65604 -17287 39572 40512 -8305 -2797 -52575
22785 -52575 -65882 -30292 -8164 16599 63853 68657 47078 29642 16577 35178 37539 11642
22773 11642 -33195 9791 7660 53483 36519 -47863 -139299 -132795 -100892 -16139 2787 -6814
22761 -6814 -26353 -51247 -38411 -8718 10723 -57793 -147905 -171263 -142653 -62824 -11554 -20516
22749 -20516 -33601 -88008 -99678 -42815 -45426 -111703 -56352 -31738 -39561 13831 19999 -21479
22737 -21479 -72050 -6476 -69326 -120473 -96949 -30652 -14116 2844 -4170 -7133 20439 -2421
22725 -2421 -6718 -69506 -83581 -80936 -128076 -163160 -140069 -117535 -73245 -76275 -54887 -7974
22713 -7974 -29638 -55094 -99353 -173963 -149576 -82934 -5816 -19995 -79075 -80304 -39293 -81998
22701 -81998 -103045 -98807 -87433 -85966 -105889 -99917 -62744 36294 89135 89450 18283 -42874 -22223
22688 -22223 19085 21969 -15868 33274 5043 -40612 -51919 -112668 -115548 -74302 -49618 -56818
22676 -56818 24177 57140 -9093 -97640 -117366 -46252 -18268 -12395 -33612 5805 -2739 -96798
22664 -96798 -77923 -66758 -73785 -31552 -31025 -104694 -153320 -135834 -119618 -87617 -532 70513
22652 70513 134451 62078 19543 729 -23482 -31417 -42238 -39806 -28332 48781 69731 62755
22640 62755 11846 24554 31014 30576 1374 -52578 -43496 -28459 -73119 -53227 1346 731 32174
22627 32174 73821 108737 99466 83145 54647 56586 30089 5199 55378 112094 176356 105918
22615 105918 48743 -19470 -29926 -33801 -13857 42412 105311 94081 18302 -36001 -76662 2624
22603 2624 46412 -4322 -42269 -26397 -11496 28077 39732 65827 65348 894 -14753 -67273
22591 -67273 -59665 -64457 -50826 -8655 2312 -28567 -31509 -6697 -56508 -21991 -26761 11242
22579 11242 70237 41039 23047 31060 50423 39046 -19236 -31226 -10526 -36342 -351 1362
22567 1362 18857 88986 85093 17402 -12205 10236 17533 -47799 -89142 -76286 -47946 -25613
22555 -25613 -6219 46350 19420 -5319 -19918 -83998 -52207 313 68029 56788 39667 61991
22543 61991 7907 -41990 -105744 -124828 -87036 -113891 -61441 -36913 -75553 -13689 18996 34469
22531 34469 8489 -11530 3449 27485 37219 22342 65147 52765 17742 2117 11770 33004
22519 33004 13795 -10100 -50712 -115899 -131446 -126610 -74239 21699 25015 -30437 -91356 -37444
22507 -37444 -58334 -3623 73687 105456 83582 9475 -31782 -36250 -69401 50523 82681 122748
22495 122748 122370 78446 63581 45290 56125 13421 -16395 -29999 -43912 -33348 2650 41388
22483 41388 22454 -1430 -7114 952 -16895 -34324 -37286 -28102 -15413 -966 531 -16987 -39264
22470 -39264 -57297 -51046 -14744 55113 80384 94791 53378 34660 -11049 32177 54212 42934
22458 42934 12616 69119 27648 -64929 -76378 -59836 -26650 -8610 -4901 -21763 -20900 32861
22446 32861 -68585 -94592 -19978 10010 19107 11380 14181 43115 63478 34672 4800 -15988
22434 -15988 -44707 -97661 -79687 -45515 1390 -14839 -37367 -15835 -35895 -65756 -69840 -3745
22422 -3745 -18730 -74093 -21780 11574 2570 2670 26778 22675 2829 26289 24716 -20794 -30924
22409 -30924 -11719 11691 -29468 -59076 -76632 -111242 -83872 -109334 -61055 25713 19158 -16914
22397 -16914 -23191 -25228 -1655 24605 66788 49555 -10671 17228 10608 -37640 -83737 -66933
22385 -66933 -65535 -73632 -77344 -78789 -57152 8796 -12159 -79965 -90681 -38641 -8709 29521
22373 29521 12440 -5902 -34369 -83679 -61200 -12362 -12612 -19808 -77636 -146346 -82819 -42863
22361 -42863 -36361 -31374 -99237 -103793 -8811 -2034 -4911 34830 20190 2503 -35196 -97519 -116202
22348 -116202 -61436 -71800 -54257 11896 6350 -65150 -86359 -87945 -74828 -28911 23011 1048
22336 1048 3048 15077 26006 48544 39456 91457 122013 76186 45435 79255 86634 56379
22324 56379 -12037 -43524 -68326 -46459 -28461 -24454 -32690 -23278 3087 51397 70968 58423
22312 58423 -12666 -110887 -140264 -52606 -60372 -55986 -68477 -41632 -18545 -14173 -34983 -5394
22300 -5394 -17187 -12512 -33597 -61246 -47795 -46493 3951 43525 7507 42578 28319 -39143
22288 -39143 -67758 -53504 -46678 -37364 -51277 -36207 -50797 -65566 -7643 17063 619 -24944
22276 -24944 20284 39372 52449 -45064 -123870 -96722 -105050 -22985 -36116 -120964 -108541 -38309
22264 -38309 -5331 39863 31912 88911 92239 4323 -69458 -78567 -93926 -77126 -60369 -55230
22252 -55230 54835 96956 83571 102440 94588 93210 31873 45080 104681 121802 131328 131919
22240 131919 33185 -39248 -47837 -50826 -44921 -53289 -53713 3385 23723 -24228 -23265 -57372 -61450
22227 -61450 -18130 38157 35720 65266 65000 -14168 -11639 -14685 -34858 -29982 -4821 9248 -44628
22214 -44628 -69124 -68626 -91826 -71590 -47866 -80513 -44949 19593 40646 -32768 -63938 33838
22202 33838 39951 15490 44147 83689 65339 14415 -24445 3850 21760 6426 -37108 -47257
22190 -47257 -50678 -70281 -125154 -107979 -128877 -80969 -43508 6900 -25250 -13806 1411 843
22178 843 -27933 -93202 -92818 -86797 -93649 -58458 -59342 -53477 -30723 -49790 -56419 2193 20244 10762
22164 10762 25092 59808 88587 133261 143595 38794 -11104 -29250 -47564 -65677 -42832
22153 -42832 977 21402 16073 13404 25614 41289 52961 15143 9675 -25680 -77062 -124593
22141 -124593 -105451 -78462 -116887 -109215 -75295 -113623 -151457 -146304 -69689 -20131 -7575 -75990
22129 -75990 -90525 -52915 -63108 -100556 -54665 -45363 -71684 -155931 -229937 -164417 -134306 -104850
22117 -104850 -35005 -10515 -33656 -33167 -27986 -6190 547 23246 19839 24684 -9622 -45992 -51701
22104 -51701 -76969 -66842 -35522 11629 48962 -19005 -111762 -106351 -30581 -15621 -32033 -41960
22092 -41960 -123913 -150511 -171658 -178408 -161545 -132061 -79629 -70746 -111832 -92023 -29903 -23761
22080 -23761 -31319 -2114 17065 -11509 -5373 22562 73123 14992 -51264 -80604 -135632 -52211
22068 -52211 33126 39681 690 16620 24666 22428 16220 25220 5100 -1120 -21568 -13645 37712
22055 37712 25522 9896 35768 30111 26013 -24082 -35073 -44929 -93285 -68121 -27339 -21516
22043 -21516 16081 30629 -2732 -94452 -31303 -33220 -36190 -1442 -2894 -65144 -71226 -84000
22031 -84000 -123534 -104930 -31819 -13643 5401 38711 65114 116495 117738 84820 16457 32651
22019 32651 38978 45540 30758 1495 2025 -20480 -55647 -28191 -63262 -105911 -86508 -51763
22007 -51763 -58989 -33949 -23053 19445 58487 5216 -28305 -51412 -31946 -36311 -27844 -3518
21995 -3518 -54683 -40014 -11543 -59119 -126836 -63427 16782 41268 -41200 -31226 35926 23752
21983 23752 -56845 -75071 -79479 -75709 -82697 -85269 20377 64336 9622 -35126 -7472 -20335
21971 -20335 -1373 -34075 -65765 -36251 50 -45830 -111075 -71875 -17465 -40255 -23018 -45714
21959 -45714 -13880 -611 13317 10968 -4115 -23345 -42838 -39877 -41724 -73180 -33735 6587
21947 6587 22247 78691 56103 -34733 -40203 4432 -15884 -67562 -99020 -112673 -117944 -113497
21935 -113497 -86407 -63899 -55610 -31562 18203 24290 -36113 -57581 -145540 -166440 -100503 -48314
21923 -48314 -42413 -110474 -86291 -62888 -7901 3807 51517 57658 31116 32727 42165 49745 17603
21910 17603 18400 69028 26084 -30317 -74596 465 69001 20171 13090 -4521 -73477 -96390
21898 -96390 -33595 24170 -8749 -76524 -113826 -98312 -56001 -7701 28324 -2866 -61262 -82829
21886 -82829 -85209 -59423 -49191 -63433 -52776 -97600 -86105 -34357 -34074 -76074 -102068 -53167
21874 -53167 -11175 2962 -29970 -114872 -112535 -70250 9193 -10859 -17075 -25102 -102578 -142058
21862 -142058 -76565 24148 81068 95992 77944 122925 39420 -38213 -63515 -38250 -43634
21851 -43634 -35146 18157 -35332 -24780 -32952 -16776 6861 -67549 -72909 -34967 6695 -15779
21839 -15779 -43649 -74529 -57374 -25478 -17653 -17827 -37839 -68709 -43636 -38970 -33140 -7596 -17467
21826 -17467 -71367 -57186 11480 -17437 -65258 -78234 -57868 -31572 5565 60781 45029 50088
21814 50088 40063 6874 -22819 -38747 -36957 -51469 -71278 -80117 -79311 -134139 -147053 -115813
21802 -115813 -125559 -121986 -46064 -44433 -64859 -17564 57675 4530 20779 48870 129904 129796
21790 129796 19734 -39348 -27402 2556 33179 34842 49476 59220 46032 21242 13031 4947
21778 4947 -25418 -73513 -25227 -8923 -2679 34694 -9168 -12367 11024 -14982 -42557 -58408
21766 -58408 -47202 -28084 -7370 64336 83762 2162 17750 53549 56278 23280 -21333 -104977
21754 -104977 -147159 -150118 -93263 -39590 -31092 -45510 -53100 14324 3989 6003 -16386 2682
21742 2682 -34431 -44304 -2826 28820 -41583 -72381 -70893 -19176 92340 49950 13602 -24709
21730 -24709 -65428 -18761 23115 8392 5601 8702 41053 13185 41078 36838 -45847 -92272
21718 -92272 -25170 30412 42082 44873 63506 72678 26147 19703 31464 45203 34103 -24832
21706 -24832 3995 48935 56599 19494 -19663 -96343 -103570 -36939 35728 -5517 -57532 14777
21694 14777 55977 51734 54357 9519 -5896 14591 -3949 6373 23941 63229 14893 -6559
21682 -6559 20829 17591 -9449 -72586 -48690 6630 71992 49306 56913 94526 -10138 -62253
21670 -62253 -68262 -71076 -65556 -27165 5767 56228 29457 -16219 -75630 -69965 -80094 -57768
21658 -57768 -11888 -12031 -36481 -10799 -35520 -23302 -7654 9072 -3283 -7571 -44932 -34177
21646 -34177 -7685 21018 64676 84308 38214 -23335 25842 40943 15095 -10891 16897 24468
21634 24468 60236 48732 16409 -3686 -22631 5262 -19312 -18359 -39855 -15672 9132 -66600
21622 -66600 -70669 -60861 -10939 24795 31710 22571 -8650 18504 49496 50163 4069 -10067 -68560
21609 -68560 -49241 -35822 -7355 -21736 -16179 2517 -33747 -29093 522 -24485 -99594 -36788
21597 -36788 17907 -29363 -66740 -59899 -20056 6679 6894 8679 9344 -121251 -161396 -119751 -107741
21584 -107741 -98647 -99609 -89991 -69796 -132737 -150182 -108501 -69094 -80984 -59669 -117802 -119967
21572 -119967 -103935 -13323 45989 50922 24414 49382 14767 -4851 1844 -26664 -22274 9171
21560 9171 1428 -28358 -32091 -13535 -66322 -93378 -88816 -518 -20857 -47169 -68345 -52650
21548 -52650 -8337 -15022 -17649 -55411 -98277 -84768 -47573 -32072 -6491 -21526 -2205 8179
21536 8179 40393 51315 51827 -52365 -103298 -36292 593 -37738 -15261 34839 -3832 -5967
21524 -5967 16235 -51040 -65432 9758 -8543 -70755 -66372 -25554 11769 -24673 -59809 -83138
21512 -83138 -78687 -52167 -44115 -51742 -38937 -18653 7852 -5087 -2466 -60619 -95110 -142412
21500 -142412 -101896 -31611 18822 13322 -14403 -1599 15625 -2837 20511 24839 12556 -42561
21488 -42561 -42961 -39807 -53527 -2287 8404 27278 13639 14828 32127 22254 50524 6789 -42243
21475 -42243 -15159 1109 6549 16780 43203 38844 -30681 -60010 -85060 -101520 -95472 -48043
21463 -48043 5754 9422 19661 55505 98652 120451 97629 63783 54100 42871 37134 -5943
21451 -5943 -15226 -43438 -57995 -66031 -19837 -12011 -44393 -53718 -51633 -43286 -40432 -71735 -74244
21438 -74244 -63211 -429 20182 27894 10246 4146 71241 44902 -11782 -3773 -1539 -15236
21426 -15236 -44827 -50410 -53583 -62310 -47078 -43105 -78246 -33877 -35824 -22335 13492 25634 -12309
21413 -12309 -22927 -43386 -64532 -41542 -29701 -39076 -30442 -4450 32675 11270 42164 8284
21401 8284 -48599 -78746 -51838 1469 -39175 -65634 -96684 -100258 -63572 -57870 3992 25178
21389 25178 -18668 -39204 -6165 22841 -1646 -20470 4376 -19292 -2276 -58764 -100843 -43033
21377 -43033 -17225 3777 -44476 -85781 -64858 -25214 27857 -13486 -70592 -75222 -45288 13539
21365 13539 13974 44893 18684 18549 42665 3171 -42057 7805 38672 55597 42204 -38323
21353 -38323 -25674 17721 856 -28955 -35166 6594 33492 -8561 -53035 -11615 52091 67618
21341 67618 5532 -45459 -75170 -38558 62383 149221 114024 45177 61711 54024 -14258 -47724
21329 -47724 -37994 62524 98730 33352 -4103 -16275 7024 -3974 87492 88476 23363 26656
21317 26656 82471 121551 117282 81902 33229 -17197 -91049 -78460 -78869 -14322 22608 14982
21305 14982 58807 46743 32409 -6288 -37145 -41035 3615 -1392 54296 87423 -7267 -79696
21293 -79696 -83939 -86073 -89329 -70844 -83621 -89736 -43257 -55846 -64975 -31106 -41740 -52474 -1341
21280 -1341 30993 30130 7084 16819 57447 118642 121252 75764 16180 45616 73773 34158 14087
21267 14087 18836 -52332 -60063 -6451 -36970 -77760 -38781 24856 -16029 -96113 -103497 -32658
21255 -32658 4983 -43004 -72913 -114454 -90252 -75438 -15500 -24781 -62242 -33916 1165 37531
21243 37531 46627 20694 -18593 -45845 -32733 17916 13351 -28525 -51241 -26389 44116 30856
21231 30856 -20337 -48366 80894 58443 33480 27232 44795 6621 -18926 -10154 -269 -20640
21219 -20640 -51958 -27970 -11508 -33070 -24841 -6307 -40421 -47657 -86310 -55397 -6785 -4340
21207 -4340 -29494 -13457 -27142 -16813 -28711 -43157 -30579 -24550 -36794 -67327 -19842 24733
21195 24733 47485 47709 25762 15864 -16944 5721 69921 125774 89700 27530 -3579 -14722
21183 -14722 -17204 10777 31321 35642 29078 -1918 7787 29984 30378 -25927 -47453 -11798 -19485
21170 -19485 -65894 -67321 -80533 -81658 -66917 -38892 -59099 -56129 -90318 -117828 -80247 -33193
21158 -33193 -34511 21873 -14557 -29002 -57203 -28661 -21987 28168 27570 -26623 21804 57406
21146 57406 -9361 -47302 -85208 -113084 -108377 -76176 -15830 -16440 -1949 -4634 16915 75299
21134 75299 108725 79654 -11909 -97942 -76043 -18069 13552 9281 -31176 -9598 10499 -17497
21122 -17497 -54898 -65234 -63127 -35963 -37400 28337 48235 39642 13137 -18963 -45556 -38724
21110 -38724 -40073 -65074 -99502 -109370 -77329 13646 31646 2376 21192 47703 52762 34997
21098 34997 28177 93605 48591 12638 55746 100270 73141 41849 22994 -81864 -106274 -55477
21086 -55477 -23291 21329 -23908 -51579 -93623 -123764 -112807 -76142 -75419 -111529 -97529 -86846
21074 -86846 -42267 24120 65363 46611 18820 40823 28532 38551 22095 17031 15083 12625
21062 12625 16382 10934 81421 138048 132681 110278 79273 26238 28043 64477 99025 72375
21050 72375 45609 57584 61985 39067 78478 65794 -27937 -71081 -95628 -115777 -122430 -48411
21038 -48411 -52167 -42011 17459 -2055 -39117 -8554 67783 29094 57127 28818 -17716 23662
21026 23662 53617 4959 -55228 -67389 -57511 -64996 -34269 -35096 -3579 21858 -690 -50877
21014 -50877 -59097 -34254 6174 25437 -12476 -33962 -34914 -80461 -63974 -45281 -61579 -102155
21002 -102155 -80682 -42996 -61192 -54984 -34283 -29227 -45819 -109811 -95753 -77345 -40205 -10079
20990 -10079 69800 40965 -11801 -18035 -25233 16569 8091 3381 -1999 -5351 43167 -11677 -35263
20977 -35263 13868 -1658 34122 67240 78496 69838 21356 -33395 -29700 -59333 -48838 -28020
20965 -28020 -101277 -131061 -58623 9585 13627 18742 37859 76397 94190 76127 80610 62996
20953 62996 56029 71555 48873 23113 2398 31412 43915 -15357 -49508 -87377 -51762 -31620
20941 -31620 -46375 -70423 -56610 -72724 -29003 14868 46330 39594 31112 7042 -13915 69791
20929 69791 135009 92207 101799 84576 50501 102218 153884 143472 108188 98489 150056 167840
20917 167840 142557 144938 127850 129153 121958 178047 181878 286936 391506 525955 703396
20906 703396 1026698 1338959 1499938 1520546 1404987 1173434 851742 563589 368386 248606
20896 248606 220552 233031 211742 146438 69192 98703 131143 172349 124150 94942 65879
20885 65879 57778 64732 -3817 22129 52379 62144 71292 22958 -573 -13041 -2699 -23742
20873 -23742 -16567 39465 50327 13848 75444 93776 106633 66667 76893 40511 12068 -34891
20861 -34891 -58381 600 31572 63514 79279 39872 49910 26286 64721 76747 48370 -21409
20849 -21409 -62003 -72294 -58597 -8598 -25158 17464 62744 27076 43453 76388 43895 22632
20837 22632 31612 67768 71017 60786 101034 100514 65685 62945 39678 8293 46201 85004 76883
20824 76883 16285 15892 8383 -49223 -60335 -33251 -5206 15566 -11783 7475 -28020 -79440
20812 -79440 -46035 -33802 -23701 -42992 -7946 33029 8560 33520 59821 23634 -67183 -104104
20800 -104104 -112537 -57366 -10878 44757 107553 140796 111474 105688 61366 13995 9700 31072
20788 31072 41376 63717 52366 16551 25335 8905 -38805 -3298 20615 33432 2699 72469
20776 72469 32974 -71610 -61053 -55468 -77831 -93034 -118584 -30431 20884 42864 86814 50284
20764 50284 35957 -10841 -5107 -67462 -98959 -103999 -74343 -7265 28225 64170 38082 23712
20752 23712 13811 -1807 8792 -47451 -71474 -29519 -12710 70572 57009 -8071 -44200 -10365
20740 -10365 38315 107019 110688 89990 80566 70838 87883 82911 40336 5241 -43120 -15946
20728 -15946 14182 32861 81507 106174 93173 43224 -21221 -36081 -17057 -14438 49972 99278
20716 99278 60002 -4637 -1204 3267 -9170 -25203 4781 962 38837 56601 17356 12798
20704 12798 16599 -47715 6280 61564 64915 83176 92047 100337 100735 129626 101487 107185 119546
20691 119546 30236 35991 49900 54595 37039 25166 13983 68423 40188 14652 31659 6495
20679 6495 -64262 -60926 -22496 -86858 -86145 -50903 -74 4434 21968 50612 84053 105667 99955
20666 99955 124979 174434 184006 111078 64778 106721 142905 110171 122254 84612 108221 138377
20654 138377 66653 71926 154193 232124 245498 314838 285126 222499 196686 238918 284270 327120
20642 327120 312774 285158 268891 237499 279125 325190 378989 425382 387948 371652 306822
20631 306822 238746 177392 155718 163726 184074 195081 189109 207499 153102 125788 183077 139460
20619 139460 96240 74790 15383 -27497 10399 86443 90615 90721 63261 22255 17426 67964
20607 67964 144149 159338 170500 187273 252978 266464 201447 157385 158045 147917 173547 225969
20595 225969 270087 272348 335783 366987 357550 350069 318460 266415 276671 231942 266896 253423
20583 253423 169155 57503 59012 95454 147740 126681 90959 91204 44208 22299 22347 82609
20571 82609 81821 91577 107120 57778 50993 63344 97890 91364 98725 206836 231386 186185 178302
20558 178302 146579 99281 89928 60877 47502 53304 72439 50835 53593 45655 45736 44863 68271
20545 68271 112943 138881 144741 96926 57770 39728 -25851 -18981 21382 47070 27453 40639
20533 40639 115197 131478 143230 126075 96957 124928 129700 151976 148150 121333 85769 35209
20521 35209 32519 67918 77566 73501 64490 75100 108280 159648 120663 88733 105885 142154
20509 142154 167587 124309 99582 114298 131363 89890 99472 99513 78060 98817 87914 98877
20497 98877 76539 39552 17649 -16597 42778 144849 131652 145005 143666 88768 94329 103257
20485 103257 78677 36130 -14478 21736 7402 2759 84603 168670 154151 110369 103694 81369
20473 81369 121890 197777 176573 166675 167031 192211 195526 158091 146961 127485 60197 1807
20461 1807 -27069 -28239 12682 123098 210366 229146 157599 62658 85136 46396 22450 -26628
20449 -26628 -51295 43639 103065 83293 98274 88133 76821 83477 144192 164808 160006 206193
20437 206193 347384 488749 581844 616163 602860 454652 344374 265154 160839 56887
20427 56887 93339 142946 139338 125326 124331 136404 128774 131469 160324 148745 122139 164538 181398
20414 181398 147004 116651 176675 195192 178577 174260 223962 252977 286538 314869 242132 205187
20402 205187 237844 207666 200531 219155 190772 194161 135012 153985 202408 191084 165248 129134
20390 129134 98306 133811 213246 240028 210370 209538 261138 287476 328434 348109 281967 264427
20378 264427 309706 394255 370158 378399 404573 446327 446070 479517 492357 442325 452355 452727
20366 452727 461350 461922 445165 482508 537991 593778 557882 507282 548125 667791 724156 709198
20354 709198 723081 733326 708663 741714 773851 838382 925854 1001351 1059577 1112279 1191357
20343 1191357 1311762 1460873 1617535 1795871 2027188 2370600 2841988 3405681 3848072
20334 3848072 4099840 4319799 4426889 4514969 4843254 5329767 5790929 6130810 6230061 6271672
20324 6271672 6503103 7043692 8031734 9362968 11168570 13560257 16568690 20414487 25435392
20315 25435392 32422780 43237828 61296007 92778697 147727940 228690142 301734470
20308 301734470 335681395 336267328 291758894 210156818 135146477 86282028 58418724
20301 58418724 42448196 32785237 26328222 21584879 17765300 14458007 11718259 9646328
20293 9646328 8154216 7112583 6472036 6204046 6150693 5935151 5697036 5499823 5122362
20284 5122362 4779288 4616565 4517070 4279158 3759915 3144679 2602695 2229700 1939983 1741954
20274 1741954 1592019 1455032 1400191 1374737 1285430 1204291 1215387 1162284 1096690 1075933 1043032
20263 1043032 962672 876273 873949 909393 857143 798106 763639 798635 872889 857058 806250
20252 806250 714688 684701 717222 694055 701307 733425 758188 705183 635066 554003 542113 558836
20240 558836 507257 470309 443187 431435 436022 421939 353933 363683 418396 439792 369372 428122
20228 428122 459150 468760 453442 405058 399412 389360 358084 352247 365521 342947 307316 274459
20216 274459 317592 343623 444386 493168 534340 601895 582366 487317 481426 472404 451012 423910
20204 423910 377123 401196 457773 475757 439124 421706 389060 387616 454156 457284 434789 496480
20192 496480 533790 505823 513853 531896 523766 499051 463889 490570 567780 621609 735210 904695
20180 904695 1136904 1467565 1803729 1874796 1637398 1287796 1054872 890104 875563 847292
20170 847292 811522 811494 772808 722328 738804 789261 837721 887586 925688 931371 971630 1033200
20158 1033200 1195070 1319207 1483552 1598565 1721195 1795599 1820675 1878487 2017809 2163456
20148 2163456 2268344 2377316 2519346 2638830 2791658 3020693 3351972 3720863 4177553
20139 4177553 4771807 5587378 6597474 7961899 9924069 12776733 17144175 24027460
20131 24027460 34477535 47487601 57197056 59067149 57362337 59153352 64660878 66040602
20123 66040602 59173374 49544930 43519777 43726207 50967383 65078625 80753876 88755478
20115 88755478 86021379 72907044 54369529 38009330 26805156 19768509 15231906
20108 15231906 12214402 10128560 8655387 7610919 6904402 6398742 6005473 5833206 5734712
20099 5734712 5635527 5547384 5445850 5465759 5615998 5822242 6009891 6242118 6643425 7236010
20089 7236010 7936450 8936066 10413990 12873229 17140111 24380516 35966797 49605594
20081 49605594 57047294 54020814 45084302 38640536 38343747 45162819 58549328 71246960
20073 71246960 73424966 67329993 64420621 68973783 74133870 72053479 65876259 63744242
20065 63744242 66284484 65388649 55350259 40927071 28758158 20523148 15176286 11705255
20057 11705255 9372120 7667371 6406439 5529694 4890576 4339298 3860300 3586007 3379085
20048 3379085 3248905 3067771 2860006 2742304 2602939 2457742 2326910 2201264 2039170
20039 2039170 1937796 1831892 1662660 1462033 1273447 1175256 1184939 1193754 1114964 1078203 1022169
20028 1022169 1001614 1035416 1047841 1133398 1309723 1618387 1794532 1806679 1758838 1732557 1569516
20017 1569516 1214563 992933 840057 696920 623191 583818 511203 444105 451777 406502 367335
20006 367335 346001 368863 415045 389399 364646 317829 320505 337222 343546 321789 327876 329062
19994 329062 289041 267690 273489 248276 215063 257418 274131 342573 352340 318929 340198 392634
19982 392634 398735 467713 536661 557445 477925 454829 478738 433835 349138 309578 293677 333315
19970 333315 334818 395947 441455 515862 547230 534595 551237 549034 596069 598227 520916 447545
19958 447545 401178 405443 417004 463788 479950 463859 334516 316055 338884 269432 223057
19947 223057 227723 234407 243927 262128 281208 244444 189154 161705 152463 207502 263631 350377
19935 350377 356989 306891 263043 195932 139883 137433 170992 254375 279461 231639 161478 162915
19923 162915 183924 261162 298227 346121 402908 485353 508861 454427 387234 341903 348042 299190
19911 299190 338350 388493 369676 366568 407168 419346 422593 372736 302498 226020 166317 163777
19899 163777 150897 130586 73351 34596 21551 -7390 -34340 -53971 15058 57117 72753
19888 72753 168882 261865 295357 269476 212395 180031 177855 167200 184833 270830 316939 280360
19876 280360 187794 78684 92530 136843 142392 100705 12450 -4195 19134 59882 51209 -1575
19864 -1575 -29307 -70971 -118593 -71879 -20776 22362 63121 37181 -18063 -42433 -22077 2225
19852 2225 604 -7953 27833 40106 -4265 24026 1246 -24246 -23797 -36358 2988 -5180 41091
19839 41091 106671 171977 177427 117746 163670 156868 144472 107031 172967 278578 256463 209259
19827 209259 174188 197854 192749 183973 197869 166295 75436 58740 78328 90377 69178 38697
19815 38697 93008 123221 98537 90532 8031 -15659 -26369 21849 88683 85280 40387 9671
19803 9671 33597 77284 67800 32298 56128 30917 24978 -17702 -41317 -52020 -12509 -6869
19791 -6869 -13241 7017 101968 80403 112869 88456 95374 149756 101720 34996 81864 87357
19779 87357 122220 161793 189615 207449 171936 162160 159769 149403 133171 76799 87437 70124
19767 70124 12392 -25507 -42603 -24504 -26127 -13944 109450 164320 156192 148254 156693 42729
19755 42729 -39726 -65992 -20565 30468 12129 -12307 28088 58295 58195 91642 130125 62214
19743 62214 -12114 -19841 20323 49235 139899 151687 104128 115469 99561 92187 114651 117264
19731 117264 118203 112194 103787 89291 52524 69024 18394 32341 49999 67452 79493 148092
19719 148092 137114 139373 86531 90515 167285 222908 263987 308416 425252 604993 708179
19708 708179 931122 1266878 1572089 1717032 1626663 1468403 1222386 963308 758371 596448
19698 596448 483163 383265 381417 342043 230204 182963 193419 195851 175300 126443 120485 128110
19686 128110 88847 78388 99879 78456 19913 50283 74087 101246 122564 135463 124154
19675 124154 93663 64650 64102 112390 95833 69287 44703 -9179 25090 105847 104726 31193
19663 31193 -35253 -16493 5059 24995 75856 87135 22975 63687 118423 131437 113218 79705
19651 79705 79893 81792 123410 192890 203458 119233 72855 149577 185643 160039 136752 100915
19639 100915 70990 41112 29904 -10750 -52572 -9872 4612 58406 38322 -6073 -2826 51695
19627 51695 133558 114750 148394 146587 195890 214745 168311 145020 68560 109024 131743 91881
19615 91881 4877 -36825 65423 124518 162250 220104 246073 202087 242069 242549 240057 273557
19603 273557 386608 446610 445217 431171 423641 387936 381090 413461 394416 412228 435993 490266
19591 490266 561997 510938 372449 305943 235920 214767 251260 259116 220358 201583 200480 217978
19579 217978 263718 229177 245739 279364 256071 324641 366517 338912 349215 311558 236583
19568 236583 209962 201668 191187 207245 230672 258997 280841 267078 338408 413183 344431 384677
19556 384677 379810 357023 355244 351495 400735 476551 535600 553498 529652 485377 537581 566175
19544 566175 541599 576459 638928 686508 726056 736541 719565 635616 490122 353311 254613
19533 254613 222927 189739 144271 171549 182552 151604 145903 172148 266426 286583 295268 295555
19521 295555 303699 341767 343062 327202 372781 349843 276013 262147 271199 273453 275954 304182
19509 304182 263521 233396 263508 321402 351327 311073 401172 518715 598822 635335 735516
19498 735516 961493 1269068 1491927 1598777 1481121 1231215 1004435 873842 814306 836079
19488 836079 945225 1059269 1137645 1230644 1311649 1341239 1387805 1403112 1387263 1346635 1299110
19477 1299110 1331965 1382156 1426445 1465967 1588222 1767832 1947597 2159151 2405130 2590911
19467 2590911 2777660 3006786 3298717 3553813 3797550 4156514 4563183 5169566 6069291
19458 6069291 7296002 9137659 11897946 16018635 22544234 32877158 47232038 59248815
19450 59248815 60759902 57911331 60093804 68809036 73778713 68925154 65332897 70492459
19442 70492459 74504367 63294370 47395950 37369965 34509800 37827094 47212334 57723897
19434 57723897 54674760 40151689 26728332 18314416 13457766 10600047 8901912 7860633
19426 7860633 7040157 6408116 6009886 5741309 5526664 5366642 5247469 5252823 5309504 5383378
19416 5383378 5497127 5583335 5632646 5949219 6481092 7214113 8023117 9064139 10581803
19407 10581803 12980873 16681633 22416104 31650768 46400121 67560374 87719999 97069128
19399 97069128 94680129 79792945 62297293 51681983 50034983 56753504 69967499
19392 69967499 78418156 73079613 65006001 64073417 68599781 65850298 51542684 35832194
19384 35832194 24609253 17507091 13062184 10118558 8064128 6665990 5732018 5035921
19376 5035921 4508075 4183246 3869009 3563914 3333482 3132099 2929266 2716850 2472850
19367 2472850 2263825 2033789 1812953 1663138 1599167 1457052 1265781 1158098 1077969 1047410
19357 1047410 1042000 1003933 994313 984357 968604 1048696 1047291 969763 883722 850827 850782 924029 1040181
19344 1040181 1103609 1161096 1341360 1663654 2071913 2408767 2451064 2283806 1977387 1699164
19334 1699164 1523895 1408443 1289051 1271448 1230865 1066062 891855 728719 648672 657705
19324 657705 664606 614975 618603 553709 516527 517181 524587 472542 385946 348893 341910 345295 410224
19311 410224 506638 489217 455491 543433 654965 696176 717419 680048 654122 614640 495531
19300 495531 408092 355025 360121 341221 310976 307930 385803 438007 459063 439560 489966 454509
19288 454509 459136 424505 389370 338636 386833 395074 359099 328779 396092 418365 410557 391582
19276 391582 345956 316768 343504 364444 430806 377706 291145 214382 200178 206184 229537 253101
19264 253101 191791 211369 151871 102629 143609 162964 183343 208531 120461 131452 158350
19253 158350 206260 261829 248140 166208 148743 184393 164710 169986 78333 64009 26492 -3002
19241 -3002 22226 34297 8205 81694 92331 62315 17999 36520 36971 71691 109867 133545
19229 133545 86721 106666 109824 76972 101022 64094 68960 54182 32278 33236 39845 36525 61303
19216 61303 137015 219932 297030 314809 229114 192643 205836 230006 220571 236490 247273 241527
19204 241527 203094 136480 137927 219509 186987 177909 219201 202892 217155 165755 98706 89104
19192 89104 96470 132744 123046 124797 105313 35935 54036 57133 34736 59570 19966 25776 43217
19179 43217 28852 76695 92623 120138 109991 67470 28817 3355 35051 87689 56801 27189
19167 27189 82228 112056 121794 206071 231367 229879 214383 174473 125702 124424 109990 122432
19155 122432 184741 173271 145896 201784 294553 267540 183303 179279 242264 301497 281560 232741
19143 232741 139517 135647 119600 63957 66356 64299 42147 32039 9994 66281 106757 160328
19131 160328 187703 183898 206750 133324 50924 71940 104189 171626 212067 182173 188822 147181
19119 147181 117231 60807 60016 65230 85475 73685 60190 75671 114163 69300 44552 26308
19107 26308 40006 794 20814 29587 35724 -26399 -25634 -39461 11997 98211 133881 166778
19095 166778 192593 219266 240479 260120 319433 286022 272571 207521 179582 164447 141434
19084 141434 142530 176169 181346 160603 175699 167333 82054 28365 55065 57150 34144 -1427
19072 -1427 38451 17186 25211 82429 115628 136904 191982 220053 216480 197666 230242 216490
19060 216490 228006 255608 246900 245836 291266 301466 312231 347853 347125 290573 235125 172198
19048 172198 139766 126432 116838 124998 60433 30088 76590 61794 70606 62642 30518 61969
19036 61969 61632 35404 30944 38455 71364 79982 37128 47780 25213 40208 49356 60022 105838
19023 105838 105673 160849 254179 244891 243996 309798 387755 473722 439214 407112 426507 431132 419548
19010 419548 466272 511715 547154 516013 420447 279104 212183 220551 213587 220736 170499 97319
18998 97319 59080 62000 32352 49813 65535 73545 74073 56332 80532 167096 171976 146935 151866
18985 151866 131614 115399 125792 186580 214056 256930 344524 299115 282774 329278 346692
18974 346692 360918 362569 322901 262436 270968 315670 337916 285300 289869 321401 371602 429175
18962 429175 438245 421664 402440 434659 475055 480513 471146 446949 370825 265562 210142 167855
18950 167855 146128 151227 216376 227669 179414 153566 168805 215914 268530 233967 202591 264256
18938 264256 255378 299549 344105 380688 430966 517945 567387 716365 902024 1045388 1114720
18927 1114720 1117214 1079832 955554 869515 822778 756502 689159 668934 643307 640482 622157
18916 622157 547973 474654 464053 359772 285368 300972 283227 287060 329254 265269 185961
18905 185961 145471 139703 146280 185477 184882 172006 186179 261974 349757 451954 582090 557711
18893 557711 508082 451913 383140 264858 221921 286170 262500 247556 285939 336248 366866
18882 366866 444913 488334 554799 598293 665611 662685 602496 461450 400655 343552 344483 400264
18870 400264 393634 355606 368836 376516 318682 307331 354818 325563 284848 269180 244769 226342
18858 226342 188241 121814 100866 85360 89494 85486 96962 105866 78931 37624 44116 57920
18846 57920 12478 31534 83221 75150 29812 26437 -4436 50995 24377 7036 -16943 -86994
18834 -86994 -150649 -70368 4775 74492 60254 25146 48252 121546 88605 109528 97244 99053
18822 99053 80621 59234 36266 38360 76187 63526 53049 43357 78888 195449 182009 159103
18810 159103 161094 119453 113679 118231 76645 60598 -10142 -40720 -30584 -1053 -1408 63739
18798 63739 48172 57919 32924 63388 50241 -8703 -21696 7400 21630 20364 47590 50285
18786 50285 81531 29879 -41015 -35565 34728 14456 -13509 -11941 -2152 -28626 -32281 -16672
18774 -16672 66192 127958 161018 129782 105202 130759 117761 60563 19869 51578 80032 70808
18762 70808 101277 134365 196251 209650 169070 167460 184977 205042 215854 194021 164151 142442
18750 142442 155453 141385 152821 192449 152573 115490 121371 134874 95169 80219 113528 172269
18738 172269 124065 90853 58616 24146 98914 122200 114547 78948 89040 80562 88743 136820
18726 136820 157705 145333 81193 68681 62822 103291 162669 242715 175616 150672 200956 165345
18714 165345 133125 182709 222373 246572 283094 386899 291822 220862 198480 108701 96713
18703 96713 119197 109208 114653 120769 122501 77046 29318 17630 49007 39812 54222 112239 107242
18690 107242 115235 125862 96412 109014 188422 165425 163585 159005 159902 197303 236342 239091 194366
18677 194366 191097 195611 172519 183022 216934 156254 117699 115720 123182 162367 188657 198441
18665 198441 169350 133165 114786 64682 116155 139243 121195 74520 63555 76815 113307
18654 113307 99991 57054 28620 36602 129041 177491 208726 200954 223421 244734 235160 239014
18642 239014 226906 212214 218097 242973 226798 253228 263428 251751 257570 308417 312526 294920
18630 294920 316663 332595 351967 418360 417986 364614 359057 337997 224915 190395 250586 239155
18618 239155 233993 236069 256006 261990 296415 283658 284345 295503 279527 249588 275733 257870
18606 257870 217890 248406 271935 293397 308150 349691 340488 350579 353348 427416 503169 587221
18594 587221 678177 685586 660760 720594 829877 925184 976052 1008004 1068336 1124489 1132983 1180774
18582 1180774 1281834 1389225 1549571 1635479 1722331 1743532 1766072 1824348 1911277 2016702
18572 2016702 2145693 2355443 2716690 3271851 3929045 4898142 6336436 8575936 12244175
18563 12244175 17925825 25529825 30625617 28174297 22057884 17312740 15391462 15967083
18555 15967083 19112488 25395458 34323808 39323415 34059989 24521653 16831658 11970813
18547 11970813 9018982 7147416 6021955 5373228 5017824 4753372 4469299 4172838 3944978
18538 3944978 3896890 3951955 4035614 4173230 4370247 4563091 4696803 4847528 5120370 5403299
18528 5403299 5729084 6250860 7055026 7963427 9261911 11184106 13957971 18264376 25123683
18519 25123683 35845299 52497608 74719506 89331956 83316727 68501095 56294654
18512 56294654 47957312 44285264 46821458 56468252 70961566 78567573 69961133 55244031
18504 55244031 45204032 42503698 43855906 40747969 31791067 23071751 17205536 13548314
18496 13548314 11347307 9988924 9138996 8686873 8439690 8075521 7577534 7114678 6829181
18487 6829181 6749803 6839934 7022320 7237839 7572661 8018729 8511647 9019781 9692453 10743822
18477 10743822 12217369 14403827 17412776 21428825 27212484 36167669 50485243 72485237
18469 72485237 100417848 120681452 123637208 116275856 105089475 95871126 87292927 75391664
18461 75391664 65276376 62416096 68630377 84062772 102895999 110621890 108048385 106171258
18453 106171258 102423630 95402902 84961204 67565764 49252141 35554650 26669370
18446 26669370 20868267 16915762 14201123 12257515 10836049 9742889 8923870 8263912
18438 8263912 7786534 7487611 7291895 7197453 7194712 7305292 7498284 7538713 7640332 7980229
18428 7980229 8588766 9408917 10629788 12477787 15327476 19920059 26692430 33817042
18420 33817042 38977358 44644595 51300363 57265225 61274698 61558334 60652290 57766379
18412 57766379 51099000 44935491 43539709 47728616 56276811 66867837 72064759 69699036
18404 69699036 64678396 54386295 40211243 28198072 20263668 15304821 12112727 9994786
18396 9994786 8513071 7398983 6545168 5845093 5308370 4933100 4657313 4446391 4213873
18387 4213873 4051122 3979591 3896784 3864857 3930670 4021371 4177181 4303260 4554168 5001190
18377 5001190 5613523 6582956 8235351 10941644 15267165 21378971 26452430 27973597
18369 27973597 28566314 27285832 22501661 17649088 15131035 15173348 17627332 21267545
18361 21267545 23182564 23074055 22241344 18893017 13812652 9568708 6793240 5058716
18353 5058716 3943830 3261992 2799359 2486974 2230050 2049891 1914768 1719270 1526728
18344 1526728 1455743 1369848 1325238 1362783 1313833 1284518 1238691 1215989 1270466 1317073 1297300
18333 1297300 1231291 1097987 972229 899536 913860 963780 961008 944975 950999 941623 971193
18322 971193 1003488 974130 902894 875131 860081 790303 702488 638326 564641 577877 568644 497119
18310 497119 401764 346650 344525 388102 416538 446888 423756 486416 498204 601092 715870
18299 715870 780242 683549 564347 418311 277510 231850 241512 228131 202132 246848 305724
18288 305724 291881 265781 307252 345431 318561 383351 391011 424379 469139 563774 669166
18277 669166 707227 732851 712481 653572 542119 529838 532753 441339 434381 391338 384087 432153
18265 432153 480233 481125 454734 415722 336494 255691 187330 223509 217472 211314 202229 202537 197051
18252 197051 230869 225077 249213 227617 165356 135997 173535 169531 150202 162215 171211 156888
18240 156888 154591 161372 135553 84342 94507 115670 140688 166185 175857 224004 176441 158595
18228 158595 198128 240560 283259 309788 268935 214095 161811 141574 154657 192075 152099
18217 152099 88107 82368 104086 117847 122904 140761 124183 82600 78491 55226 47941 136669
18205 136669 201437 175842 174321 129023 81243 65527 18284 11530 37128 81125 30082 -5531
18193 -5531 49619 58405 102107 100247 119327 120999 72059 87994 57525 39826 149482 169855
18181 169855 112731 99893 86388 13835 -24004 -18678 10781 18637 57310 105713 112082 94370
18169 94370 73133 99115 126518 83609 55261 68567 78464 131749 96977 38851 31743 33740
18157 33740 58006 17355 7898 63351 64380 53452 46410 37173 26066 49238 79587 125172
18145 125172 132196 148127 109809 35994 1553 41895 98934 83974 -17572 -4156 28956
18134 28956 21303 53753 53455 -27481 -10741 21825 73941 45330 57575 38021 76618 123841
18122 123841 129458 72580 62941 61368 23857 50678 86471 62974 66272 14311 -12781 231
18110 231 24692 16566 2614 21232 106274 146735 102914 45294 22210 8375 13807 -8320
18098 -8320 25625 371 14644 93067 113964 76499 -18488 -44820 -5737 -1728 10234 18389
18086 18389 30403 23004 72105 111393 116741 86762 25369 3758 44845 31159 1887 28048
18074 28048 33571 36723 34309 25885 8218 35873 37338 90903 148971 153640 129303 93345 99802
18061 99802 143718 141012 104034 42088 14355 -3086 46773 89111 94022 109946 88144 83825
18049 83825 62713 66557 96130 149887 166306 192125 206645 204527 230453 233869 236869 269144
18037 269144 325709 287738 222398 164471 112026 43149 29875 29834 -17062 -7023 36667 60912
18025 60912 32988 70239 90871 51046 77767 112010 115486 131447 83228 94429 88861 88635
18013 88635 57333 83965 94883 112983 108424 134674 100231 99515 80013 61840 93640 171708
18001 171708 209628 170548 184901 201965 231729 234158 273069 267939 307882 356152 411427 393228
17989 393228 388053 312765 265081 233297 283475 266227 275936 237692 235110 251623 263241 208937
17977 208937 161903 111175 24157 126414 258033 222543 189586 123106 57003 74268 69414
17966 69414 76394 -1704 -14453 -16659 36648 110539 174448 201027 211995 233088 273169 283703
17954 283703 299890 303737 280299 289487 438361 515107 585057 637105 586310 491553 375433
17943 375433 270401 183760 201643 259208 289878 323729 320879 238485 171633 153741 117414
17932 117414 96405 65976 41724 82359 51706 72862 91210 35206 65970 130479 134138 137713
17920 137713 119702 77134 70291 82504 92051 87695 68345 47035 121318 199714 240165 238154
17908 238154 272377 296125 362314 422638 409332 361725 326361 277166 294015 337538 392497
17897 392497 397257 345341 276535 239402 222226 158422 107139 104240 55905 63351 58624 60745
17885 60745 74943 28011 7557 43889 67140 61201 122798 169881 157001 183630 160363 157155
17873 157155 140338 44185 20159 2510 -41114 19878 38880 47722 108293 163522 184357 148603
17861 148603 126649 171542 126029 164095 177346 217978 221955 216158 222001 161712 175893 173889
17849 173889 152089 90661 45589 45105 84048 84253 44846 39923 -17311 -31519 38479 122846
17837 122846 102369 41920 44722 25941 19061 -5513 -6139 16961 6041 17238 12652 -2772
17825 -2772 28952 13311 -243 -44086 -10545 -6824 -5625 -51802 -78624 -106065 -78890 -155695
17813 -155695 -164263 -110309 -47816 -18820 7978 -57594 -26023 -58142 -30992 25083 42108 8211
17801 8211 46952 103154 75072 11688 -25393 -14857 11037 67624 75113 35700 48601 11350
17789 11350 29857 62968 130959 153849 129548 145598 154307 96127 55484 26907 21551 67204
17777 67204 129181 106589 33201 -9766 -50373 -76049 -24593 65139 106879 59783 61041 -2349
17765 -2349 -35056 -6211 23253 61750 74261 73316 108442 141911 70350 6178 24873 5524
17753 5524 16487 -23077 -45409 -48797 -71043 -61548 -25663 -9181 22270 66317 71280 16448
17741 16448 7657 21778 12055 -39468 -15813 36749 61345 2701 -96044 -57150 -31129 -107897
17729 -107897 -141874 -152571 -51299 18585 42914 46042 6772 -15376 1875 102287 155690
17718 155690 118860 52092 -6894 -76026 -96018 -86293 -111628 -88590 -36125 -53644 -37890 -2048
17706 -2048 48228 49403 64387 75787 91657 104865 49800 35011 85031 66991 51493 38107
17694 38107 -41640 -85106 -87734 -98316 -102740 -56129 -30516 -21378 -25996 17869 17277 14982 5923
17681 5923 -3368 4597 9917 -39011 -22120 7671 55331 76102 41165 -35582 -27759 -5682 -3360
17668 -3360 37580 35571 18918 -10942 -31529 -3334 7724 -5218 -10339 1430 11980 22151
17656 22151 26436 37296 -517 12071 18980 1763 -28154 -74501 -34445 -45418 -23612 31918
17644 31918 4987 -23113 3116 -16435 -11753 23459 87259 34635 -12975 -21814 6568 25202
17632 25202 28080 89279 62970 -46363 -112995 -47354 -53390 -43558 7108 -7133 -41162 -76691
17620 -76691 -52663 -38316 -33279 -6241 8039 33993 56145 35550 17710 27243 17157 12147
17608 12147 -20114 -10040 28948 11453 -7554 -40081 1189 49493 31173 -12482 10892 -7232
17596 -7232 -62020 -42500 -14229 -5489 56767 74508 87275 79762 17634 546 18161 29427
17584 29427 5311 -25288 -175 -15278 -24442 -77231 -144408 -141367 -125434 -87420 -65752 -33416
17572 -33416 -58846 -120384 -113326 -53156 -49149 -84409 -94985 -63318 -27968 -60031 -50508 -16143
17560 -16143 46292 81439 43124 -13429 -16424 -47017 -50758 -9352 -19351 6245 40718 -8521
17548 -8521 -61881 -67920 -71418 -27486 -1761 10184 1631 9735 58213 26515 6650 1872 39934
17535 39934 48375 24415 -43686 -21822 11535 44286 103829 99518 67985 32292 30607 73917
17523 73917 91335 115867 65860 37686 -7804 -56781 -84415 -75873 -77422 -79379 -27685 -6003
17511 -6003 -13223 -75546 -114455 -116775 -93734 -41878 -2557 19136 8706 26791 4808 20967
17499 20967 -30731 -66724 -125462 -138825 -118402 -128540 -123514 -75902 -38495 -27980 14911 -27160
17487 -27160 -73386 -24170 -30336 -117052 -71590 19357 3242 -10948 -47191 -27451 4069 133
17475 133 -11448 16908 -20612 -68768 -124157 -80886 3616 70424 42028 -21712 -53550 -85116
17463 -85116 -92257 -70634 -64490 -51895 -62175 -122184 -94364 -55488 -42106 -39571 -60432 -59195
17451 -59195 -83583 -74370 -42235 -48181 -43267 -43749 -47865 -41190 -30935 -72817 -69973 -49170 -21719
17438 -21719 27854 9021 -69442 -75952 -25766 53435 71828 3117 -65732 -66916 -59387 -71014
17426 -71014 -72549 -43547 -69722 -75324 -44316 1863 52613 65341 74984 59243 5496 19835
17414 19835 -13113 -42001 -75746 -51990 -105053 -90658 -20775 -4775 -28582 -57492 -47656 -21084
17402 -21084 903 -82184 -33704 -13091 -6759 -36353 -20841 -25137 -59795 -47763 -74443 -132129
17390 -132129 -116071 -108768 -67285 14799 88209 88060 36278 -19708 -47282 -57179 -49264 -15870
17378 -15870 -11516 14218 -37667 -68572 -72037 -56415 -47829 -37150 -13109 -32964 10085 16236
17366 16236 -11324 -14872 -43198 -77332 -75999 -60814 -82785 -74969 -36755 25926 62774 18749
17354 18749 -2540 25605 26329 20099 -21400 -44070 -147877 -171629 -84090 -21843 23697 39388
17342 39388 11891 889 10502 26726 49778 -16493 -14629 -1819 2194 1086 -69222 -100318
17330 -100318 -102955 -98772 -47373 13236 51364 78665 100526 108556 78926 45512 18786 43582
17318 43582 53879 -30629 -95175 -119357 -97870 -52474 -32065 -41415 -8849 -22850 -92171 -86617
17306 -86617 -73771 9830 6980 13605 41171 10786 -22976 -35460 -10342 -13995 -8592 29615
17294 29615 43289 57587 -13695 -48083 -50052 18223 27843 -38248 -54531 -60170 -82053 -88916
17282 -88916 -98339 -148896 -137450 -112114 -81053 -78040 -100905 -88031 -64726 -40880 -23437 1946
17270 1946 38425 22536 -35439 -37182 -65480 -45891 9139 7431 -3021 29264 25087 401
17258 401 -74400 -66671 -22350 15895 59868 42825 -18718 -24051 -33485 -90155 -132647 -97451 -47060
17245 -47060 -8680 -69488 -113556 -122316 -97377 -46285 -30000 -79001 -76600 -28638 -64970 -103718
17233 -103718 -148303 -135850 -73494 -54722 -71065 -75602 -70041 -42663 20539 19083 -41362 -106718
17221 -106718 -118727 -61045 -27829 13388 -13301 -74275 -88109 -48587 10478 10018 -21639 -38762
17209 -38762 -71510 -45451 -50655 -60060 -90015 -98052 -86613 -22362 -10038 -10457 -2690 -36205 -85686
17196 -85686 -142128 -100864 -88208 -95278 -161589 -94658 -2916 27063 -7020 -15014 22464 60930
17184 60930 119438 162380 133279 44171 -40894 -15850 39571 16804 -25864 -36207 -19704 -51071
17172 -51071 -65176 -14825 12437 16297 31714 -9705 -47670 -43450 -52271 -56501 -54407 -65290 -49895
17159 -49895 7156 74895 24879 -42040 -30272 -1285 -9595 49944 40190 16682 41334 55899
17147 55899 15242 8721 26597 65550 39380 13036 83250 92015 45601 19812 -15358 -7576
17135 -7576 13588 10038 -596 -54359 -104041 -53841 67411 62070 -2856 -30891 -21601 -70494
17123 -70494 -68239 -121101 -135173 -89860 -41083 4303 -33463 -52363 -46421 -9714 32937 23456
17111 23456 -20709 -33359 -24387 9233 37048 30189 -23574 -17436 -11588 102896 110948 74198
17099 74198 68985 136525 93895 59875 50081 60273 117322 98088 21892 -10026 -89185 -147052
17087 -147052 -141740 -107655 -44360 -26910 -30878 20179 23087 5914 11114 23850 -6838 -28509
17075 -28509 48581 12250 -31288 -77061 -78651 -46538 30976 50945 83583 144499 192220 110892
17063 110892 20392 -9630 -1828 -50599 -58831 -51063 -93862 -77452 -32158 -3510 -43868 -26279
17051 -26279 4218 60614 38947 -5110 -39041 -36645 -52096 1264 6103 -77038 -123331 -96182
17039 -96182 -65892 -73195 -79541 -103210 -93587 -94620 -162391 -192229 -162362 -152742 -147963 -93046 -131128
17026 -131128 -166714 -144340 -99742 -35574 19242 -35092 -121507 -168198 -144597 -117284 -137003
17015 -137003 -94729 -45454 -103004 -137707 -131377 -83752 -112243 -162204 -157638 -181709 -150271 -76841
17003 -76841 -69624 -63012 -59514 6263 79732 94737 37749 -19799 -39363 -36285 -69191 -55046
16991 -55046 -53202 -67798 -69145 -111542 -104185 -84149 -71782 -69003 -15202 -25743 -122334 -129402 -100098
16978 -100098 -49898 -20788 -15605 -45651 -25033 37114 39001 21414 29802 -15528 -78433 -101559
16966 -101559 -136739 -156013 -164822 -141029 -92162 -26794 -9241 19033 32981 -54759 -66108 -37226
16954 -37226 -80306 -82643 -52619 -37250 -70477 -18693 39486 22765 -64780 -109861 -56511 -51049
16942 -51049 -53425 11788 70088 26957 -43005 -134174 -97499 -7831 5250 -31549 -41684 -27672
16930 -27672 -12749 46344 63259 26189 -33012 -15280 35806 51038 911 -34873 -14705 14600
16918 14600 49590 46100 64762 29795 -8469 -9717 -43540 -68878 -66293 -26571 54098 36073
16906 36073 9273 36577 83587 79779 12701 -38362 -22854 -15681 -48450 -60255 -22103 64121
16894 64121 44492 11422 1261 14545 709 -18730 -11027 -11871 -56362 -48402 29487 25576 -48405
16881 -48405 -46943 -17525 -31733 -3001 -59193 -74495 -24447 -64474 -138319 -128846 -95076 -95564
16869 -95564 -107385 -103881 -59581 -81140 -100760 -117085 -79380 -56133 -25173 15739 77869 78494
16857 78494 2546 30457 -28730 -132267 -133858 -86844 -83663 -58344 -46860 -11216 10271 -7010
16845 -7010 8882 -6964 -22394 -61959 -89553 -70728 -37883 -77040 -87919 -51582 -16022 -8915
16833 -8915 -5921 -2601 -16180 -30071 66101 114984 76630 28654 29181 -42812 -59401 -29855 -40880
16820 -40880 -40588 7592 -5152 -33387 22780 50854 13927 -35995 -24649 66013 77357 26740
16808 26740 -60149 -133917 -106595 -93613 -84302 -92327 -103836 -97559 -90544 -59827 -30368 -22051 -33797
16795 -33797 -80756 -51039 -2030 19253 36833 6049 -9442 -9615 14632 47907 74638 28780
16783 28780 -4252 3166 33055 18218 10972 -56165 -69150 -18782 36503 39035 -10512 4237
16771 4237 -17233 -16841 -18951 -16230 7105 7631 -10701 38503 98357 135921 140027 66939 40503
16758 40503 28558 -3940 31657 34712 -14037 -23802 16760 93669 86443 79896 87857 111952 82121
16745 82121 33084 -31777 -47049 -93891 -109576 -87442 -3184 -24432 -85812 -105098 -89898 -17039
16733 -17039 -3776 889 40503 4300 32623 50176 22876 -31206 -67642 -69320 -75282 -41800
16721 -41800 13838 56794 -7590 -44077 -34595 -4329 20235 -1583 -18259 24097 69967 29714
16709 29714 27159 37408 -7838 -40111 -48765 -53701 23395 99739 42600 -23219 -70639 -105956
16697 -105956 -87585 -65276 2769 15038 -2792 -5851 -37509 -61550 -45675 -10322 20744 9846
16685 9846 -37227 -77548 -103397 -69452 -36706 -89651 -80940 -47545 -28793 -29794 23375 47683
16673 47683 32965 -12605 7756 14925 17243 -45417 -69500 -75773 -60886 -64191 -62624 -15475 31529
16660 31529 37290 -10061 -30473 12813 7108 -6903 27127 32094 15454 -20554 -67673 -124209
16648 -124209 -95735 -88545 -90613 -101492 -153835 -125582 -106113 -109601 -114029 -64903 -47620 32390
16636 32390 12765 -46902 -65590 -16198 -2984 12544 7133 19531 23512 48701 49328 -6375
16624 -6375 -46506 -83171 -32110 -37143 -31546 1465 -4520 -29661 -2719 13377 18137 27501 14593
16611 14593 20711 -15193 17688 -5323 4049 -15237 -16765 31373 33426 8600 2436 -36686 -53546
16598 -53546 -89549 -13844 79214 77471 82591 55939 26464 -58373 -96980 -51333 -1845 9031
16586 9031 41946 81232 62439 30191 47021 21028 -31275 -55685 -68052 -72699 -126398 -104796
16574 -104796 -114252 -122876 -63621 -17950 -42141 -62097 -82224 -91862 -72866 -85079 -43114 -1425
16562 -1425 32935 33025 56227 53607 -16771 -91671 -64397 -51732 3733 2851 -38925 -10344 79027
16549 79027 64925 46900 34808 41133 44945 34424 -9189 -16384 -20321 -84448 -75299 -4446 32092
16536 32092 -16115 23349 14824 4970 -18145 -35368 -10438 -28345 -34697 16954 -19981 -31333
16524 -31333 -44497 -90836 -47171 -51969 -91079 -52835 -41654 -26683 24222 -9313 22041 32775
16512 32775 39156 -38675 36824 103649 99269 71565 14748 -51592 -77390 -67588 -61735 -91358
16500 -91358 -109943 -107610 -48300 24206 57579 94977 87286 97843 60731 13423 38025 26734
16488 26734 37871 7530 -10514 -21810 15292 10174 15422 28703 51288 28641 -2499 -50142
16476 -50142 -64554 -53883 1241 -18991 -63006 -27725 2809 -2114 6674 -10729 23565 19050
16464 19050 44142 98364 55234 17187 -25221 12967 -9431 16500 35927 45775 -5509 -61138
16452 -61138 -88385 -21110 42027 44056 51897 27976 39574 49098 2603 -11311 -54307 -14577
16440 -14577 32672 67621 59230 38756 41857 14669 -40384 -68306 -81151 -46838 674 36122
16428 36122 34448 -461 -38067 -87158 -78496 -55290 -100325 -171064 -153313 -85725 -27216 -61808
16416 -61808 -4142 29965 9939 23289 81840 108700 90648 25557 -26044 25950 23586 -34313
16404 -34313 -6456 75906 78675 5226 -43422 -49558 -44731 -76045 -129691 -107306 -24467 -7768
16392 -7768 -28263 -26980 -92277 -53401 -9658 2473 15659 63207 9218 19915 3069 -44794
16380 -44794 -67700 -63111 -71902 -33042 4733 11739 -12231 -53334 -53508 -36268 37318 51807 -13480
16367 -13480 -47563 -58214 -39229 -61186 -44863 695 1618 83566 144381 126570 121010 110612
16355 110612 116560 109835 76326 22229 -1686 8168 1370 -4062 15548 16852 16602 49162 87870
16342 87870 152991 116171 110916 37363 -53102 -89382 -55754 -62349 -32663 -47861 -52007 -656
16330 -656 9896 3588 3571 -25743 -37681 -39784 -3150 63928 53450 -46610 -90372 -47510 -13179
16317 -13179 26535 64390 9376 -46576 -111996 -114041 -3085 25095 -9428 747 -8827 -57755
16305 -57755 -55049 -42642 -49765 -16276 -5342 -10118 -29013 -14345 -38876 -81186 -105036 -99750
16293 -99750 -40222 -11894 -47641 -22794 -29232 -65748 -77474 -107207 -82723 -36368 -25162 -19665
16281 -19665 24957 74832 60623 -22754 -60910 -29220 -23800 -67430 -60546 -83306 -113997 -83291
16269 -83291 -38390 -62315 -79260 -41906 -31678 -5659 46008 76355 64183 41767 44227 86592
16257 86592 32494 32159 83891 87202 36095 -4133 -39383 -97628 -116050 -42733 -8761 49085
16245 49085 34333 -37218 -33441 -12604 12593 21093 -29952 -15090 8221 24855 15634 -42154
16233 -42154 -95557 -57773 -33510 -4496 22439 40101 -25551 -66562 -45440 30077 11460 -10839
16221 -10839 21979 -822 -7670 -19656 -60325 -67248 -60798 -65195 -58334 -61060 -51275 -65879 -34780
16208 -34780 74783 73695 29726 17173 22251 -11824 -19523 15004 -31172 -25720 -66101 -58673
16196 -58673 -34747 -64811 -127937 -73697 16827 -87424 -154174 -64851 -10977 26583 65861
16185 65861 53474 80827 110363 85799 6283 -63038 -33967 2189 -26763 -45935 -48676 -25520
16173 -25520 -31139 -37544 -48657 -53615 -70500 -31432 15558 34498 18090 -9720 -59461 -32865
16161 -32865 -35196 -126223 -141728 -95296 -84597 -39163 -87839 -91251 -125244 -102020 -75440 -50790
16149 -50790 -35077 -16170 -62092 -57011 -74722 -36817 -5903 22515 48270 16014 -33917 -30788
16137 -30788 9627 676 -8003 -54192 -91240 -79665 -79606 -52024 3196 4325 -12137 -12157 14913
16124 14913 28273 35460 18343 7921 19491 19741 -7478 -4827 84720 123021 102564 62806
16112 62806 3359 -3096 -19988 -68145 -82627 -47071 20310 49501 57354 11210 -18931 -39213
16100 -39213 30419 32589 5275 -22297 12651 3488 8995 -5630 -18495 -45292 -98092 -68429
16088 -68429 1621 48017 44485 39902 9360 -47863 -78442 -47024 -29086 -57556 -29582 -33836
16076 -33836 -58215 -42370 -46139 -91772 -96138 -54360 -35816 16837 35845 18253 41398 14547
16064 14547 11156 5572 31500 108928 60836 26903 20002 65200 52625 -1594 38770 72205
16052 72205 49804 29943 -30137 -71115 -74452 -47531 -50333 656 33453 90021 106059 52423
16040 52423 -18652 -74179 -93989 -110212 -81510 -69558 -63985 -28150 -13302 -16019 -29063 -8213
16028 -8213 -57175 6937 7267 -36267 -9677 6456 26951 15494 -41052 -54850 -5321 -37400
16016 -37400 -32661 51997 42172 16964 24316 35291 -15898 3852 36217 13622 44206 26613
16004 26613 -286 -22811 -33892 -46095 -11541 7448 15410 16510 -32798 -49901 -74164 -96545
15992 -96545 -33929 62315 69725 88069 46316 16178 67696 54905 -32019 -34800 -12022 -31831
15980 -31831 -21595 5119 28040 42930 -10767 29188 61062 70612 60010 10370 -20239 -79493
15968 -79493 -111628 -119147 -62631 -37005 -111929 -160515 -119446 -93246 -67986 6427 11850 -18158
15956 -18158 -56754 -70074 -85215 -69326 33732 35726 -14715 -2807 -76367 -59524 -559 -15733
15944 -15733 -80510 -85894 -99411 -116076 -89431 -28197 -25090 37560 18510 2109 12026 -39109
15932 -39109 -9258 22149 3481 58813 29636 -4818 -364 -38478 -59838 -94342 -165838 -84554
15920 -84554 -19888 -35842 -17066 -19671 -24972 -23578 31654 -8890 -45552 -28516 -25604 -72675
15908 -72675 -71986 -91145 -110882 -45854 -26117 11257 -31942 -45820 12615 -50386 -110395 -52314
15896 -52314 -92150 -91520 -120186 -173659 -164125 -107608 -71178 -52648 -52607 -28564 425 -3806 -70711
15883 -70711 -138620 -132537 -64310 -38538 -71587 -91790 -74262 -30980 19846 -16548 -45840 421
15871 421 16787 -18995 -11512 -2437 -13229 -10157 -7763 -27504 21084 2556 2199 -26254 -6448
15858 -6448 -22884 -43427 -3370 -4838 -25602 -34169 -12697 -38563 -68215 -73381 -41485 -62745
15846 -62745 -74436 -83492 -35713 -43125 -50176 -56918 -50605 -76246 -89763 -24710 -48530 -86471 -122643
15833 -122643 -130443 -138151 -98393 -72768 -48688 -39474 -29153 -22863 -10037 -15706 -67490 -86397
15821 -86397 -99144 -128611 -163107 -136308 -61066 -67835 -51220 -40464 -19827 -66155 -84054 -61681
15809 -61681 -4897 15988 63646 104315 82640 40265 -36984 -116140 -83090 -32422 -10059 11592
15797 11592 38682 57819 38281 -23120 -31872 -1428 -3783 -18408 -2744 2701 19040 -15159
15785 -15159 -55084 -69382 -25154 1314 23950 40470 20719 11900 -563 638 -35013 -11779
15773 -11779 -11763 -50396 -66482 -16136 24131 -10356 -18012 -5743 -48288 -104980 -135945 -121866
15761 -121866 -81870 -8635 -378 -9395 -4692 13237 -10262 -4580 -28555 -11876 7456 -14967
15749 -14967 -23834 15501 31132 -5392 17310 1672 -90191 -58614 -38621 474 -1685 -20802
15737 -20802 -33666 26741 7890 -47261 -68611 -78513 -84952 -43163 -10543 45253 49795 52283
15725 52283 64312 59493 55988 18461 -29121 23607 21136 -16818 31223 64794 82309 54921
15713 54921 5547 12561 -15559 -7494 22919 50638 88733 27619 -42481 18523 78389 57723
15701 57723 20471 31444 -2092 -38838 -50083 -19326 -55477 -6896 28762 -34330 -91944 -102360
15689 -102360 -123319 -139203 -154001 -170020 -145818 -103457 -88289 -56286 -95254 -51277 -54754 -94016
15677 -94016 -121400 -44498 -28521 -27681 7659 9333 -82314 -114369 -34424 -2812 5455 12988 30373
15664 30373 56415 16745 18244 59990 18293 -19379 -182 1838 -17431 -15275 76340 19427
15652 19427 -28938 -15396 -25081 -62567 -1045 24871 -26049 -11953 -4895 29400 47699 34516
15640 34516 25401 3930 -29938 -43329 -96545 -122503 -105459 -29512 38406 -6927 -47262 -64071
15628 -64071 -113622 -131559 -122290 -80043 -77193 -74583 -44969 -56591 -120230 -155700 -151660 -122620
15616 -122620 -97693 -117799 -155538 -68778 -40656 -54073 -23101 8090 11540 -30996 -93243 -83129
15604 -83129 -143133 -182379 -126542 -60332 -73388 -73890 -73684 -48520 -71030 -105794 -115171 -122905 -82034
15591 -82034 -74196 -70772 -63411 -54796 -62255 -105358 -33675 -7826 61427 87159 38648 -19048 -21293
15578 -21293 -17826 -12646 56793 75501 19859 -67330 -52104 -89513 -115903 -117086 -99876 -84272
15566 -84272 -93932 -102977 -70860 -29643 19521 45209 24734 30179 -2170 -75317 -11208 -5623
15554 -5623 23527 -15680 -7962 -10908 -84857 -149818 -198253 -115664 -37490 -19672 -36073 24079
15542 24079 67992 25142 4942 -23075 2545 -27239 -45075 -49876 24867 111752 89061 29118
15530 29118 15745 12675 -18712 -1613 -16505 14710 17963 20302 31797 31432 55370 61157 74110
15517 74110 57077 24947 19606 35035 80882 90994 47421 -3526 -27872 -66888 -74017 -59239
15505 -59239 -72371 -76376 -84694 -44738 -46303 -66999 -43071 -33857 -9836 -10856 -49001 -102137 -120542
15492 -120542 -75671 -72505 -124047 -111871 -109938 -40343 -26052 -42339 -90922 -49011 -39229 -102752
15480 -102752 -135964 -96702 -49019 -1771 33954 47899 32906 59131 105641 103771 57128 38048
15468 38048 8957 10223 -5349 -27743 -3462 64482 65414 86551 36321 4717 19071 62770
15456 62770 81295 47426 4679 36648 34515 20111 -18296 -60965 -43893 -20634 -34341 -105685
15444 -105685 -120977 -97635 -12686 10975 -61400 -72171 -69396 -60212 4481 11050 -3802 165
15432 165 368 38945 33478 41857 89810 50417 23153 60344 86274 87712 57487 -8384 -10731
15419 -10731 97 -2853 -30312 -27564 -935 6464 -33086 -27447 -8123 27904 7590 -31549
15407 -31549 -65467 -106489 -114814 -133822 -115981 -98927 -67762 -41557 -40732 6715 10999 33030
15395 33030 91911 44286 -17510 10775 65081 29981 -34221 -26440 -30740 -105287 -157232 -73855
15383 -73855 -5053 -66017 -54127 3471 36835 68713 74872 45509 -9312 -69442 -78940 -101705
15371 -101705 -30655 90870 60762 39931 64584 100699 114046 103927 51807 92126 99722
15360 99722 37134 -748 13341 45070 74972 18035 -19889 -11864 808 -25995 -24572 54725
15348 54725 67108 16678 -57813 -96562 -96783 -55295 369 27475 -25705 -63087 -44210 -114895
15336 -114895 -138381 -120277 -59620 20402 31601 29977 55014 -3523 -12299 94836 77525 51728
15324 51728 10350 -42034 -49502 -28624 17554 31930 -11054 -23052 18829 61957 -15751 -6271
15312 -6271 -12077 34211 43877 55340 21963 36145 2070 12512 38004 30492 24153 53576 -10058
15299 -10058 -64280 -46184 -65257 -59181 -27893 -37246 -78605 -106191 -114245 -123061 -134096 -103590
15287 -103590 -17833 -35567 -27745 15779 81304 78654 39178 45026 39387 20039 -2743 49588
15275 49588 74994 13371 -64602 -87696 -15467 28467 85604 86885 103828 112322 83193 47948
15263 47948 -868 -10553 21454 16366 25317 74793 139826 131657 98967 84586 55803 15851
15251 15851 -50111 -54837 -48361 -54886 -92692 -89107 -61276 -146521 -128807 -45045 -17586 -57561
15239 -57561 2655 53081 12687 -24539 -68867 -58004 -25397 12296 2284 -53374 -34254 -32003
15227 -32003 -44120 -1637 21453 19423 27297 -5760 3567 30927 70547 10589 -63858 -94726
15215 -94726 -101605 -97163 -35211 17590 15675 -37295 -78291 -145835 -159186 -81291 -71252 -82521
15203 -82521 -62196 -37797 -53804 -88009 -73974 -107278 -92868 -34212 -13529 -67257 -99301 -65437
15191 -65437 -76056 -52366 -34575 -40599 -73689 -67406 -113709 -92048 -80563 -51196 -40593 -33946
15179 -33946 -31574 -33978 8443 10931 -54205 -79723 -45546 -13340 -74761 -145611 -44944 25378
15167 25378 59244 36318 40445 79704 84920 17111 17531 40517 64553 70287 8249 -54261 -22842
15154 -22842 69824 126608 83245 45374 77665 80438 58484 62468 52885 49755 58328 37873 22671
15141 22671 67789 39036 16183 -28498 -65019 -65869 -33410 -30166 9385 42526 52489 47469 35581
15128 35581 -1509 -80744 -90144 -79742 -42887 -38880 -26381 640 16841 38333 9390 38135
15116 38135 25421 34865 -60639 -28186 31105 31229 11869 -54673 -137695 -123051 -78927 -65357
15104 -65357 -39600 30490 14618 -21337 -69091 -68519 -101219 -116306 -69003 -21800 14896 -3722
15092 -3722 -23394 -48274 -35798 -32249 -18760 -36601 -72909 -86257 -55486 -31894 22838 8499
15080 8499 7085 -12668 -664 55166 52959 3063 -15670 19898 37557 -1020 -20338 20732
15068 20732 50299 42065 15964 -14549 -62218 -56534 -104636 -47841 -33222 -7973 27577 60470
15056 60470 51630 28799 33212 -56511 -105402 -24102 27602 -32846 -69074 -61066 -22036 -46190
15044 -46190 -56079 -17660 -5413 22722 24014 -1309 -5399 -48014 -19670 28636 4669 -26712
15032 -26712 -49834 -29765 19856 -14811 26615 37146 3372 5579 38975 -9163 -37566 25386
15020 25386 61837 81861 34956 3222 3192 47585 103402 110987 71721 72063 60653 89676 54697
15007 54697 14809 -5009 -70004 -141676 -146518 -78315 -80915 -103414 -146762 -122363 -12537 40121
14995 40121 10944 -66688 -69078 -81598 -119595 -95645 -70962 -88679 -76599 -86098 -86542 -49500
14983 -49500 -70272 -35174 -5428 31283 60019 29877 5644 -8455 -11230 -5686 8415 7649
14971 7649 23433 -2381 -32562 -23654 133 -6499 17842 26274 63827 57157 39055 30019 -29294
14958 -29294 -67869 -34081 19446 22331 33233 35165 -7263 -17659 -39914 -48446 -90521 -137014
14946 -137014 -73700 -46900 -115043 -150784 -160876 -124416 -53367 -25058 -38952 -64690 -84063
14935 -84063 -102554 -159601 -114108 -75512 -111214 -97874 -25260 -5843 -30244 -71432 -46850 -36392
14923 -36392 -82998 -136857 -109041 -37832 815 -18501 -28822 -63610 -112785 -119515 -69413 -79916
14911 -79916 -54877 -62133 -25715 -2069 -39970 -32757 -53166 9587 43543 -8658 -48158 -26918
14899 -26918 29574 36034 73299 44093 25563 22025 78409 16858 -35339 -48353 -1823 43498
14887 43498 74450 79983 80525 102891 36972 8063 4895 -2101 -304 26922 -15365 -30888 -52956
14874 -52956 -111785 -122168 -148953 -118344 -154756 -144835 -102829 -54302 -4907 -2007 -10934 -14464
14862 -14464 28277 -25337 -110565 -123012 -63998 -99252 -89482 -25065 29934 -40991 -116632 -43815
14850 -43815 19338 -17299 -30462 -79329 -119936 -84464 -75313 -7447 81737 58069 26617 21326
14838 21326 74514 45222 1882 -30501 -64450 -51708 29097 16068 -75371 -69658 -25528 11262
14826 11262 -29442 16970 -29096 -17947 -1462 450 -24256 -31938 25568 53819 20168 -11324
14814 -11324 -26324 -61445 -48591 -5643 62022 50913 14671 27413 24957 2271 680 54111
14802 54111 97193 20466 27307 51780 8186 -71782 -105567 -66311 -63889 -115463 -139980 -140803
14790 -140803 -147748 -107085 -42142 -40238 -57293 -47443 -47148 -75891 -47176 -47112 -65000 -93806 -57885
14777 -57885 -95175 -114813 -150061 -152263 -96770 -38752 57592 86143 59153 55504 72503 59361
14765 59361 96369 94752 109651 120080 60989 36734 44286 27526 9506 52800 47402 84079
14753 84079 39992 -13468 10633 318 10764 10592 -57402 -23530 30963 -30575 -52188 -14715
14741 -14715 -32299 -45013 -28275 -23590 -1621 8501 18141 32238 37578 60195 54087 84082
14729 84082 34763 34022 89424 70201 -5871 -33693 -20743 3771 33411 49609 81260 75901
14717 75901 4702 -41191 16405 8889 -17517 23278 13926 -2208 -6750 50134 48244 329
14705 329 -7797 -51326 -97733 -35206 32744 45595 48345 12642 -18911 3712 46838 24438
14693 24438 7815 5747 10198 15560 15062 -6924 -15454 11926 -19992 -28006 -1394 36235 69568
14680 69568 59115 -3574 -26536 -31902 20552 29326 -44582 -89830 -49028 -91716 -32348 32918
14668 32918 66980 108350 50297 -17764 -84682 -92209 -71667 -90352 -92274 -37665 29317 57367
14656 57367 33345 48540 116810 108051 66647 21978 -5471 10974 65606 100090 100926 116934
14644 116934 66379 56507 30449 -4316 -2160 -462 -36563 -58695 -110122 -113992 -91825 661
14632 661 -1292 -21621 -13853 -16845 -33779 -77619 -92252 -88747 -77300 -75929 -93403 -93988 -94097 -75135
14618 -75135 -45051 -61959 5493 90279 93319 95086 60968 67738 67025 45187 30208 2191 -4060
14605 -4060 8403 -17238 -32726 -25510 8306 -2309 36387 51906 30051 50090 95573 71225
14593 71225 1448 3762 6207 40595 30805 -15377 -83504 -49371 -78222 -135906 -135156 -88790 -31558
14580 -31558 -45584 -47646 181 -21056 -51970 -70581 -58943 -49700 -10893 2232 -4316 -25920
14568 -25920 -97846 -132823 -109507 -8140 80930 56946 10269 -47729 -47406 -57615 -76506 -42328
14556 -42328 -16772 -81911 -87764 -20675 -20763 -64123 -72915 -40270 -28984 -38247 -67956 -78683 -97597
14543 -97597 869 107074 121684 82064 -24204 -45982 -16804 -31902 -50932 -80156 -65071
14532 -65071 -53414 -46282 -1928 -28534 -41252 -42485 -14881 33764 39381 -12346 -49484 -37210
14520 -37210 -19581 -47765 -12060 -13745 -25455 -4160 -11656 3103 35396 35743 -44313 -57000
14508 -57000 -25294 -49028 -115056 -93202 -68449 -18369 13795 15675 23735 13253 18713 -17123
14496 -17123 -55057 -73153 -63520 -76441 -74297 -33896 23285 41710 86909 57315 27737 44876
14484 44876 68997 44853 -17716 -33977 -20222 -25735 4746 -16205 8412 -29235 -12578 17359
14472 17359 39300 32425 50363 72775 97660 63618 84514 87278 76883 1921 -21204 11595
14460 11595 -879 -59255 -81037 -80669 -40495 -7021 -5992 1763 16843 57589 110167 64697
14448 64697 16692 41238 51967 -6275 -49565 -17939 17604 46785 95253 83031 39271 46053
14436 46053 67976 100522 113452 101017 91510 40937 51504 88146 58109 41849 27139 40439
14424 40439 31321 43763 48890 38592 367 -518 -29683 -34255 3696 74401 137149 176613 86911
14411 86911 43051 23434 8490 3867 -41224 -49900 -12788 34886 57139 47592 16829 69464
14399 69464 62604 58894 52957 71585 49427 31857 76489 79330 -9797 -70485 -7861 19205
14387 19205 -28163 -29946 -14623 11163 386 -3888 45420 13411 -8820 13651 3735 -11443
14375 -11443 14663 41709 87055 79987 82832 87098 94818 130212 86420 25473 -90012 -81953
14363 -81953 -75729 -116519 -84890 -98698 -75069 -62647 -82603 -84262 -123485 -108605 -75038 -50951
14351 -50951 -46019 -40538 -61333 -107491 -142666 -87701 -29251 48829 102902 67254 14835 28086
14339 28086 48454 -28079 -82810 -49497 12168 18956 12076 36420 26712 -30106 -23284 3274
14327 3274 21713 10212 -40186 -35854 7212 10919 4683 68551 102534 57881 -5945 -39206
14315 -39206 -4169 -7541 -5997 34411 60689 51158 36270 -23534 -82977 -81054 2049 49444
14303 49444 48520 592 -43676 -20980 5233 -7793 -31662 -44506 -22510 8702 -23852 -34148
14291 -34148 -23421 -79424 -30878 -4487 1775 -16089 -46942 -66632 -34793 20005 11126 -12323
14279 -12323 -27475 -51064 -93232 -69877 -41423 -40785 -27382 1463 -4643 -10096 -70327 -88253
14267 -88253 -28579 62614 93551 60672 21128 -5932 19644 44630 68768 59381 33435 -9418
14255 -9418 -23590 -30489 -46012 -13206 53326 -17354 -97523 -67068 -41490 -58321 -73894 -23025
14243 -23025 28201 18405 -20296 15100 -1001 -46306 -17606 15225 32504 -35455 -62246 -20445
14231 -20445 12715 -5223 14822 -36621 -28026 -81 9980 -17281 -21213 -51894 -43783 -21129
14219 -21129 -85893 4985 74505 63654 36908 47352 19517 20329 77229 162877 171637 42877
14207 42877 -24745 -26871 -15609 -44069 -97280 -73082 -5586 50408 15852 -1857 -24211 -64798
14195 -64798 -60666 -25026 134 -30431 11681 35639 63748 -6574 -59990 -62386 -60591 -71532
14183 -71532 -49022 4721 23766 81375 112417 126526 68602 24609 -78871 -123250 -152420
14172 -152420 -68293 -15323 14898 -2106 47073 34383 -34274 -47750 -14527 -31951 -81416
14161 -81416 -58189 -74839 -103046 -70864 -69950 -38012 7080 43689 8079 5917 -7812 -64767
14149 -64767 -131457 -168039 -137389 -40163 5297 5542 63588 83154 37126 -4098 1452 47800
14137 47800 115724 118228 92701 78315 20635 1948 48953 82315 67584 67321 78932 19600
14125 19600 -9761 -43542 -20515 -68420 -119844 -68865 -24414 -41643 -51834 -31893 -14056 -17800
14113 -17800 -2892 3103 13281 13188 34926 18491 -12540 -43670 -43024 33198 37395 94188 40629
14100 40629 -17717 21659 15763 -5314 15765 -204 -9990 -65084 -57167 -19057 32148 67277
14088 67277 6764 -12269 7606 19058 37654 6570 17867 38234 -733 -29999 -48558 -85272
14076 -85272 -55432 -2358 33745 46457 38933 -3073 -13246 -17811 -51158 -89915 -36988 -57732
14064 -57732 -22138 -22865 -6590 -10297 33370 52481 -1347 29204 23437 44902 41878 20086 948
14051 948 -70186 -74728 -80640 -37479 -7375 -33114 -31682 -17372 -35841 29390 79135 81618 50970
14038 50970 17364 26792 83005 86621 2248 -39054 -56857 -58873 -40592 -68032 -74293 -41640
14026 -41640 7800 -15369 -21849 14035 36933 32873 71137 144226 121351 46773 -21287 -7036
14014 -7036 34324 22422 -13226 -6793 -3345 -13727 32456 75990 53461 -660 27220 51784
14002 51784 -14902 -75670 -61798 -35222 -15886 -60196 -92932 -47828 15317 -10022 -19181 -14280
13990 -14280 -16523 16523 35325 61528 -1929 -49380 -15659 -784 41337 -332 2428 8728
13978 8728 2621 465 -36814 -95798 -104470 -49625 46655 33712 35274 57845 95349 14289 -23777
13965 -23777 -99953 -114346 -95135 -109188 -159169 -154397 -36495 19241 4006 41596 -5927 12171
13953 12171 43817 -16117 -27437 27632 82691 64896 41150 -14253 -73942 -25613 60645 12877
13941 12877 -1996 58468 34047 13966 18849 -28505 -56479 15351 84881 97499 61336 30089
13929 30089 8314 -14973 -32682 -13736 23384 53843 42482 19308 15306 28802 23842 48461
13917 48461 54131 13821 -3743 -29491 -54841 -107202 -118883 -123708 -84615 -41893 -23110 -12985
13905 -12985 -27385 -68164 -37913 -9042 56943 93646 81721 31869 -13592 -49185 -40684 -43274
13893 -43274 -25806 10105 50489 80298 33042 10151 -1169 -10097 -1761 -9135 25546 77717
13881 77717 87871 62771 29395 -22029 -2857 58785 32375 6579 -46240 -94287 -45528 -35392
13869 -35392 -48931 1974 11184 6007 -1339 7128 62723 88202 75551 6012 -18755 -23925 2914
13856 2914 34651 125511 127474 5655 -1910 -6784 -25941 -21563 -57388 -14445 18759 4155
13844 4155 -18484 1816 22395 -43063 -36383 9324 -10916 -36270 26994 65187 49432 -23445
13832 -23445 -43314 -109311 -119105 -61780 -56355 -31856 -16011 -5 63684 42329 1452 15600
13820 15600 8691 -22662 50726 91109 56105 74730 95122 118062 58370 23622 9570 9969
13808 9969 28884 -687 -52583 -81631 -101805 -46442 -29313 -25575 24697 16781 5462 -47836
13796 -47836 -67970 -41712 -40167 -23016 -203 64615 103946 102110 54647 30832 78685 76749
13784 76749 -8281 -7228 30239 80421 152318 128946 66040 29329 41143 69147 95870 15523
13772 15523 -51158 -33993 -14555 -31041 -35321 12233 48183 41872 -16498 -69146 -66898 -53981
13760 -53981 -21411 -81727 -115241 -78774 -19875 18806 -3319 -31604 -56393 -42561 -68940 -98180
13748 -98180 -63592 -34267 19934 32409 -6029 -48066 2764 35425 18450 -35130 -58149 -22856
13736 -22856 -18221 38750 26564 -23167 54175 121888 109221 58884 -3045 -2972 -45113 -32705
13724 -32705 25469 16504 -26129 -5577 -64271 -135129 -103391 -66125 4447 -33620 -111738 -112054
13712 -112054 -68200 -105152 -140664 -122566 -100169 -53484 18290 53774 20269 -501 30044
13701 30044 48210 3972 -23758 25618 28234 35368 -25187 -67189 -61612 -27488 29145 36643
13689 36643 31189 35465 -23670 -64985 -137714 -116922 -14287 30338 -926 -66387 -49622 -28802
13677 -28802 3621 193 3337 -8301 -69882 -70527 -87547 -84846 21136 61026 19998 32608
13665 32608 90 12725 31886 35560 -23934 21474 64818 60539 69451 88264 93304 46659
13653 46659 8551 -7132 -30448 -22749 -14643 -14683 -11045 -1446 -6584 -6320 -30340 -16065 32667 68446
13639 68446 67726 50241 37276 -31447 -28339 46980 53672 20803 -15459 -14601 5958 25355 64666
13626 64666 47130 -6765 -15832 -8157 44487 55868 104610 95646 62546 55790 47270 27844 -16474
13613 -16474 21742 65779 105261 92615 83047 4385 -26711 17543 48698 59203 58454 49063
13601 49063 -9095 -3681 -18816 -37503 -41054 -49390 -71250 -72636 6080 -7838 -22643 53544
13589 53544 37396 -36249 -14722 44160 40404 115060 82322 62414 86111 65477 29019 32389
13577 32389 21048 54331 49453 -16234 -27957 22323 40172 -13652 -54239 -32035 -2250 4829
13565 4829 -13641 -25375 -82081 -130936 -77850 -55281 -34081 -42969 -54052 -42152 -60578 -45783
13553 -45783 12684 11810 2190 37771 12355 -33011 -29909 2232 -19261 -25319 5345 95105 92496
13540 92496 34478 3927 -16716 -42593 -33996 -4110 -30282 -32466 -33425 -62121 28157 74126
13528 74126 21484 -40773 -47917 -48748 -58760 -67793 -26782 54305 47961 -49630 -117848 -104852 -108530
13515 -108530 -99556 -130057 -119845 -971 36635 -13279 -2154 5247 -30832 -6050 3943 -37182
13503 -37182 9325 67825 93261 115952 146942 136129 86950 56106 23441 35489 54262 42665
13491 42665 1152 -44302 -48698 -20473 31950 33132 63397 11575 -79493 -140275 -112945 -33230
13479 -33230 -35505 -72232 -18656 52205 60210 -28993 -100039 -119363 -112426 -39232 7192 16372
13467 16372 11292 -10815 -684 32895 7327 22150 64244 76693 46809 58142 12910 8206
13455 8206 15683 36627 28602 14023 36014 42359 -3007 -12574 13010 55930 46121 30414 -21126
13442 -21126 -29889 14261 7448 9000 -10842 -15384 -15729 -21334 -53781 -104783 -101418 -36864 -9198
13429 -9198 -6551 55394 46788 5077 -44159 -30706 112 9806 -32662 38004 73885 56826
13417 56826 -4245 -78565 -93584 -3676 -15074 -59911 -73522 -159461 -135260 -77260 -58381 -42544
13405 -42544 -47786 -3015 -18083 -19533 -34565 -65818 -42652 6434 57931 84821 95707 96817
13393 96817 56301 24813 16246 32412 67534 74957 16584 -64785 -127765 -195978 -110108 -45077
13381 -45077 24257 -17514 -67864 -90437 -96226 -83316 -71551 -29837 -41122 -49227 5358 20126
13369 20126 25263 30073 -20332 -68632 -81193 -56452 -10047 27156 65485 110390 127166 95218
13357 95218 69993 52906 75711 -12157 -16120 28990 38206 48344 64171 125285 130863 54543
13345 54543 12612 -25264 -35205 -79451 1043 19877 29889 19628 18748 -27746 -21089 6113
13333 6113 -28064 -11735 -53707 -52794 -21834 7178 32382 -5265 10374 26882 52801 -3558
13321 -3558 -27659 -3250 45790 69296 56637 58587 54987 22149 -36030 -83614 -52614 -4302
13309 -4302 19264 13489 74811 87469 91296 44980 -5546 -6119 -5963 91 24874 24120 -40976 -50330
13295 -50330 -10748 35795 27428 -27133 -49082 -37034 -58997 -82380 -65279 -69343 -71117 -27010
13283 -27010 -39781 -65732 5014 14726 -5285 -52838 -17944 39456 -25957 -45814 -19496 -47356
13271 -47356 -33462 -27053 34988 41830 1931 9189 35150 60467 67186 4438 -36757 -4694
13259 -4694 43420 29312 57030 48093 -5277 -14340 -24985 -21189 3824 -6260 22327 81956
13247 81956 80301 63395 34163 20066 48104 91335 96731 7726 -37785 -18184 -27733 -61322
13235 -61322 -58450 -46061 -60841 -54419 -36936 -67671 -75884 -62411 37375 134585 157790 91353
13223 91353 71931 70207 89815 66738 50054 46488 26694 28014 42573 -4563 -30854 -63661
13211 -63661 -98792 -108201 -73060 -66276 -62591 -10171 18164 -27621 -44074 3006 11356 19269 -30127
13198 -30127 -74610 -15353 29223 66484 40373 46618 36921 71171 94280 16623 4279 -85013
13186 -85013 -106735 -65519 -40409 -48920 -8864 72706 64257 5088 -4958 -1488 -24420 38136
13174 38136 54358 65723 76694 69519 63632 74855 50933 14175 15952 41216 13367 16395
13162 16395 38214 52773 34230 11775 16791 6631 -19367 -270 42657 -40170 -101541 -82062
13150 -82062 -35404 -24593 18450 40838 14140 23289 42645 -15850 -62045 -83328 -42085 9028
13138 9028 47325 86935 136561 58138 45941 53937 66203 95266 51179 -14054 -71649 -66608
13126 -66608 -8932 47805 93734 59668 73327 56008 -3098 2375 -2904 -7727 47462 30569
13114 30569 -14709 23783 75500 77035 84741 57225 56198 61666 67212 30891 24291 13471 -7117
13101 -7117 -56980 -118393 -89294 -34628 788 -16237 -43691 1735 7780 -55300 -87503 -43602
13089 -43602 -58504 -20922 9941 50778 63634 63695 7557 -2155 101916 191211 198432 173445
13077 173445 120710 62087 77315 72685 98754 113223 136295 131871 155881 106178 63853 55072
13065 55072 32379 48867 64299 58572 28732 7697 8185 -43405 -73328 -69544 20003 81245
13053 81245 83429 94909 64646 53523 96749 137844 85649 84491 81480 68571 47865 47728 91406
13040 91406 61198 64969 56068 71023 96095 143507 121038 107596 10228 -29812 -13815 10029
13028 10029 21670 51730 -29926 -96152 -134724 -102446 -65139 -10106 21827 36154 6901 -10827
13016 -10827 -7024 54702 74536 -56167 -64865 -33781 -10047 -50891 -80736 -66430 -11019 35530
13004 35530 46076 64769 61731 54859 50749 77739 20014 -23507 -3364 -1105 -26876 -41983
12992 -41983 -17060 33732 65288 42649 -6149 -18809 22386 54872 63746 57336 45765 69187
12980 69187 14271 -24763 17125 42845 19377 48816 139969 105761 26911 13504 -65447 -79087
12968 -79087 -39750 12777 18479 56220 28097 -24646 16271 46952 39685 21248 5126 -8710
12956 -8710 -49972 -63370 -68468 -99519 -80689 -54892 -97442 -133304 -113825 -83079 -78343 -43738
12944 -43738 8211 24087 15870 24763 71836 102587 98489 67583 49314 58209 37007 -38445
12932 -38445 -31529 -8488 103030 142283 95131 29427 -18671 -13600 28470 19685 57086 61816
12920 61816 9682 78286 69367 66861 41681 24720 -8919 13309 24783 40830 73935 69568
12908 69568 56248 80188 74908 44446 15426 41866 6788 -3170 646 -18376 -42190 -18108
12896 -18108 -45031 -29253 1592 3024 -60483 -42514 -24617 29956 17885 56537 91169 8697
12884 8697 21779 17923 63079 46066 -15802 -66107 -13832 50717 -4879 -934 26911 39808
12872 39808 46660 26069 257 -49760 -18203 39809 78121 84081 78619 91780 44372 32618
12860 32618 16377 72835 87315 61914 100508 143631 135537 95439 55618 64592 160142 129129
12848 129129 79687 50239 22345 19914 97155 88460 83515 33686 31371 30126 59640 60855 91410
12835 91410 89418 22434 17347 10026 -11043 40999 30407 23189 2666 -20676 -83782 -81673 -43325
12822 -43325 -20888 10801 19586 12897 35123 15734 76952 98558 69414 21570 -31309 -44842
12810 -44842 -79698 -39074 -60593 -58356 19622 42193 -55194 -101136 -50758 15862 44178 29961
12798 29961 62604 20785 2071 18858 -42687 -33509 21668 51822 58499 2392 18100 10254
12786 10254 11230 11729 71702 31078 -9389 -12051 -18504 -35239 -26505 -31848 -9450 -6572 20309
12773 20309 17251 797 1798 -25336 33727 39778 70957 68994 17646 -20115 34538 66227
12761 66227 76806 29621 -37493 -11634 50422 35991 -18158 45383 87228 62369 15646 34979
12749 34979 21402 16476 25801 -2511 -39139 -58598 -34517 -44571 -34849 47100 80774 7516
12737 7516 -15661 45775 16855 25753 2866 18158 44151 17906 49430 74440 27166 39477
12725 39477 77887 71111 66227 70647 67547 40122 8688 -19282 -18627 50655 48314 56742 82099
12712 82099 27737 -9613 4670 29721 2093 20623 69677 103846 85673 96066 136221 67387
12700 67387 -10669 -31051 -21422 -4346 33974 63267 76580 34243 -14763 -109231 -92347 -35071
12688 -35071 13549 19804 22827 34818 53245 12176 -5360 -21962 29554 61552 92837 77596
12676 77596 120199 90695 18837 -47216 -37059 10204 20056 9674 -23408 -101027 -62082 25669
12664 25669 6215 -26371 9986 -5760 -37648 -26785 -47947 10104 42644 6368 -12388 18526
12652 18526 26070 45628 -21333 -73429 -96307 -67401 -26121 43735 110067 61942 -6513 30718
12640 30718 73776 78597 37785 -21155 -67006 -38730 -1860 80517 112134 101418 91936 89403
12628 89403 74231 37535 24061 42596 69575 43621 10575 -19161 -18099 -5907 60996 85476
12616 85476 66403 54562 39807 20667 -31065 -40806 22304 80189 115337 101943 75290 125663
12604 125663 129315 62518 16491 -22468 -10636 67008 51631 -35671 -107722 -64738 -35050 -6505
12592 -6505 -18800 -58319 -1576 -16384 -8432 -23257 36138 99768 59246 19608 69429 77293
12580 77293 38197 21655 68638 61997 32949 9421 5413 13739 25535 83405 143656 124071
12568 124071 51368 60266 75048 104623 105445 77721 76438 77012 127145 121546 61189 30417 4904
12555 4904 2002 31498 35789 60887 43648 -10693 -70962 -21360 23186 41375 77135 133206
12543 133206 133083 85183 106647 116110 126905 126414 23664 36529 64562 15067 -12869 -14147
12531 -14147 -36240 -64530 -12061 26878 33509 33691 38374 27751 -58445 -77931 -12989 64256
12519 64256 26796 51573 81637 32195 57279 71790 98467 41453 -21028 6370 24354 10520
12507 10520 13902 47606 57787 46098 94114 103218 30435 47451 56608 90791 68277 3893
12495 3893 37843 54736 57708 51826 13774 7057 4070 31373 91445 56765 61466 91029 73441
12482 73441 58344 42100 80508 94679 103631 74086 83315 63024 49137 76420 104989 132163
12470 132163 94276 62825 20225 45123 46857 55429 58795 79436 59732 52292 26367 -25856
12458 -25856 -10351 -13319 27475 89712 60515 96159 98283 119676 115000 80440 49786 44143
12446 44143 44733 71326 72625 54027 62437 86571 45149 33035 40169 72928 34929 8928 5104
12433 5104 70353 105853 96003 30945 -40273 -20847 66109 67528 21923 65831 58749 82105
12421 82105 145624 135135 99982 109395 96877 87046 53559 58606 -1877 -60667 -62637 -45820
12409 -45820 -11980 41150 52175 40293 38971 -16982 -14288 -4622 -8000 53653 118404 113982 82112
12396 82112 118368 110423 140940 125322 95580 118322 74834 57496 69254 12991 3837 18403
12384 18403 6469 -22048 -16287 5894 -10439 67791 110459 122532 154373 160648 126406 64257
12372 64257 85404 83997 78086 52669 36703 52097 115539 197847 236280 286170 255187 199275
12360 199275 147748 96500 87591 131406 127905 122329 186142 189830 136827 144557 152220 169170 147054
12347 147054 126202 139365 192940 179207 126997 129968 191580 224582 185018 187163 221921 177109
12335 177109 140622 166350 160558 121606 138230 157417 160734 189197 218956 181598 168534 111254
12323 111254 153341 185124 221044 304052 319072 278092 220602 201034 192920 149111 185698 201851
12311 201851 191747 180707 211758 194937 163674 103547 155422 208325 160196 126205 92531
12300 92531 92082 77576 85540 187626 173361 175229 156606 161081 120519 89233 89941 135923 172845
12287 172845 156701 136639 110052 60549 108983 143783 108090 100140 102251 98715 106023 126929
12275 126929 151617 116527 56048 18323 69282 136662 125884 93402 99283 123662 125082 103702
12263 103702 66961 98912 99022 81107 75622 73846 98661 185169 211163 198777 137001 101153
12251 101153 68276 38185 65864 81584 105882 118814 119645 126451 149029 153729 184458 136384
12239 136384 138531 113593 144897 128989 80131 116660 140024 130542 78601 64699 42184 98869
12227 98869 81226 67162 83168 96371 101798 107613 155151 134776 130536 104402 149715 147843
12215 147843 127642 164542 227010 235800 280969 283496 273122 261745 246566 287385 271825 271910
12203 271910 249385 197997 187892 232254 232599 217507 237405 319102 390093 395253 363787 344520
12191 344520 290853 279913 333206 366924 371181 315641 331826 344366 445573 453582 344625
12180 344625 271026 276939 304321 319175 328527 389369 412971 372542 312941 321216 284506 245817
12168 245817 244050 249999 282446 297625 328402 347359 308664 322412 359787 297545 309402 337494
12156 337494 395846 332273 324743 362760 386511 414762 424676 428665 407609 382373 316661 289403
12144 289403 334404 360735 396862 452370 534200 552504 546453 508467 514525 513916 485767 464240
12132 464240 476104 505195 457890 413482 376276 384123 458552 472735 449963 424461 387435 391878
12120 391878 435314 469373 504957 514166 526961 474871 494521 534774 543885 559662 575438 573818
12108 573818 566354 573053 595511 635619 663031 630261 587528 583583 584869 604625 641221 708189
12096 708189 767035 762347 711862 726265 714730 704402 747234 783257 751259 725130 759514 819318
12084 819318 861103 813438 788419 757770 776833 833387 856248 853521 821715 863327 926667 945670
12072 945670 918804 905437 883149 946968 954251 979579 979685 956092 950301 1030744 1114454 1086657
12060 1086657 1074694 1119359 1135072 1150177 1191564 1303453 1314565 1306126 1251570 1206438 1204620
12049 1204620 1238481 1326287 1419654 1485568 1484513 1478643 1503001 1538143 1540806 1547593 1518267 1522647
12037 1522647 1554274 1611387 1663059 1659435 1681091 1698956 1743870 1821876 1872329 1882372 1910037
12026 1910037 1972065 2003397 1993050 2044211 2132077 2200857 2222651 2255655 2317222 2326324 2357043
12015 2357043 2526941 2619207 2707101 2728098 2791477 2909612 2923039 3037007 3180102 3199062
12005 3199062 3267266 3354792 3466097 3584985 3679577 3765704 3858434 3986515 4165552 4286471
11995 4286471 4433699 4540309 4705632 4903968 5089307 5268673 5440742 5608259 5849126
11986 5849126 6074682 6286858 6536999 6808236 7084615 7353971 7624673 7908819 8303316
11977 8303316 8711707 9117758 9486754 9940351 10429503 10970917 11541806 12060468 12555972
11968 12555972 13222233 13887977 14588955 15356278 16205763 17221078 18265348 19287303 20380423
11959 20380423 21537194 22855325 24255064 25836350 27556679 29317696 31201320 33231853
11951 33231853 35444881 37710812 40108828 42554857 45194906 47864997 50586989 53304216
11943 53304216 55853154 58366713 60691081 62640096 64272753 65578504 66461749 66782462
11935 66782462 66624295 65939486 64791366 63262623 61346712 59241282 56881103 54350373
11927 54350373 51649905 48906257 46219145 43608088 41116820 38698543 36422671 34265052
11919 34265052 32222884 30291606 28460626 26840704 25306235 23850473 22473118 21186372
11911 21186372 20016975 18961089 17995529 17073663 16212210 15345247 14544446 13821495 13113929
11902 13113929 12451202 11849056 11364231 10912898 10493329 10113481 9755896 9370084 8988112
11893 8988112 8552737 8129303 7806059 7529085 7317466 7040129 6843548 6627975 6374163
11884 6374163 6169280 5953932 5718907 5500224 5355458 5234982 5048801 4872930 4714213
11875 4714213 4575631 4428248 4275181 4146699 4065639 3967035 3850668 3737287 3650992 3551328
11865 3551328 3438487 3321146 3246195 3167042 3048195 2993253 2952442 2849165 2807707 2744690
11855 2744690 2662429 2605335 2593052 2568275 2541162 2472262 2404219 2354381 2259759 2225637 2141217
11844 2141217 2049379 2073020 2111039 2044058 1995031 1918443 1854410 1832826 1848206 1820114 1805139
11833 1805139 1751123 1682905 1700053 1684698 1652905 1585887 1507557 1507674 1506263 1433063 1382156 1373945
11821 1373945 1396823 1386470 1320246 1286802 1288574 1323679 1309130 1313710 1277919 1239458 1202599 1147573
11809 1147573 1162742 1152181 1074208 1097783 1075259 1090145 1092697 1066930 1066888 1065232 1032408 1053623
11797 1053623 1094986 1086667 1003471 993201 988567 953444 893923 841521 816367 832424 843306 830426
11785 830426 839452 781045 736425 749867 699538 671145 668635 677824 647617 617485 644541 682641
11773 682641 694214 699609 750415 711468 692566 712950 706345 613578 567082 560023 565459 593751
11761 593751 620895 634877 658787 660797 699226 735043 693181 636379 578696 576200 589207 589177
11749 589177 574541 566978 584547 588998 539387 570882 599170 540043 486772 441012 461914 432263
11737 432263 441598 422636 396363 405606 427030 416943 422126 353715 375308 345089 320376 417358
11725 417358 496369 576967 537269 484780 419855 375940 305274 298189 369364 406916 364660 343042
11713 343042 344317 363631 337452 312780 306064 298144 308351 338098 372721 389832 365530 349098
11701 349098 359447 381164 354984 302196 319010 361983 368301 379187 420951 393531 311385 278394
11689 278394 295030 269010 263008 385769 441934 406104 368405 368853 360588 343347 339884 346119
11677 346119 360188 364604 348577 333062 330820 285101 246895 275054 378831 332561 271047 240670
11665 240670 280178 308292 295224 325435 337541 288349 229467 225443 249144 272869 328053 309393
11653 309393 257173 212090 263822 222315 194287 238103 285161 331307 285752 276800 256600 193232
11641 193232 130556 127303 131441 116378 156292 148079 124973 90345 136193 107787 133253 150333
11629 150333 143145 146878 150135 180439 193426 173386 134415 179537 177743 153335 163031 211667
11617 211667 222736 207934 112992 95296 100326 103751 63404 79261 89981 74577 126306 168709
11605 168709 178725 151334 142725 126101 157800 158218 161051 172294 226107 276825 241806 193830
11593 193830 178532 215196 220547 210435 146923 110225 123631 126849 161370 136879 138914 179873
11581 179873 170921 105077 109834 127579 107509 131585 145724 158031 173814 111082 71819 96432
11569 96432 115609 65529 42505 104791 140651 156727 163747 136141 124732 151371 124239 71524
11557 71524 63367 108553 107923 129264 96428 109919 133366 186765 182841 160665 155852 117362 101310
11544 101310 112381 95361 47922 43688 91052 101486 107866 109959 76807 27611 79992 64192
11532 64192 88306 78618 -4254 -13109 14039 31882 37254 68964 96827 65174 -12928 23258
11520 23258 84179 98320 122252 121602 138633 151971 110120 62842 61888 81862 60935 16449
11508 16449 32669 32737 19291 -5563 18310 22327 70052 93668 133052 92956 56958 58184 106547
11495 106547 113379 80770 64226 52910 53774 63126 74612 33193 15043 25806 25366 55309 150004
11482 150004 170827 182116 186369 178428 147471 151132 149542 88104 42418 26182 54183 21236
11470 21236 24251 93762 80377 71938 79342 135618 120760 115672 99709 44819 1849 6701 49837
11457 49837 112880 116995 114094 73977 50677 53526 31587 4769 38191 30884 32548 67389 89162
11444 89162 77162 67570 47530 32564 -8108 -51480 -104636 -143795 -120480 -3241 10988 34372
11432 34372 79538 46330 -4491 10155 50942 33881 16619 5021 36172 87170 48785 25820
11420 25820 -19399 -14904 12532 75078 78128 117383 197561 143329 91524 86638 79052 73201 53966
11407 53966 40 37137 74967 25813 56966 88926 28187 57161 127391 120669 111891 67455
11395 67455 84446 72831 30607 37023 74280 43950 54915 79581 89263 45381 80278 152760
11383 152760 129653 65778 45673 51265 98159 95655 71548 66756 142105 163427 114450 101307
11371 101307 88375 95936 86302 110504 145009 117285 122178 58105 57987 87645 25681 -32836
11359 -32836 -28024 4266 36994 38384 69753 108003 106733 97960 89283 50860 1502 13704 11872
11346 11872 6491 14304 3746 -17217 -32913 8272 29946 17265 -594 -1915 39992 53864
11334 53864 -2668 -35139 -31206 15340 24955 -3261 -18323 -68165 -32746 10241 25709 70120
11322 70120 51543 -15514 -9982 -14574 31193 67028 65868 25321 33840 53236 46683 12838 12815
11309 12815 51058 56207 -8919 -42850 -88355 -79276 -32855 -26274 35315 39784 35866 103647 143458
11296 143458 62154 2891 -31031 -34855 -54641 -93815 -65282 -20793 27164 43884 36623 9170
11284 9170 1993 16530 95451 134171 86549 57500 50142 23949 2150 82525 132742 94116
11272 94116 98943 91057 52560 51025 44232 65777 73204 67002 96250 91290 78681 100727 49599
11259 49599 21355 53828 51138 12288 -3750 29381 35791 -11111 6204 797 -13827 15383
11247 15383 -47948 -28424 24568 19483 -9628 -19470 34066 89791 83914 103912 100358 124670
11235 124670 82211 74923 63520 23434 -8993 -48713 -22557 994 32744 33679 83495 76297
11223 76297 95262 77247 86236 96205 42540 62233 48398 12811 38725 23443 44736 105947
11211 105947 15046 16508 27934 37573 8906 -12843 13012 84643 87325 58937 46008 12628
11199 12628 -14804 42877 93409 141026 113619 -5198 16188 43161 65476 40309 22375
11188 22375 7258 32479 92481 133634 162605 69444 38059 42120 48760 52138 -34704 -97713
11176 -97713 -115746 -70694 -45872 66055 153551 149614 107904 114239 99459 100768 119461 132858
11164 132858 88885 55030 56968 14941 -42281 -82156 -61198 -39693 10586 -288 -8288 33962
11152 33962 27239 -16940 -91672 -86703 -8725 64826 79353 54509 34537 45166 20881 20436
11140 20436 41144 29352 -46978 -38482 14438 16811 23138 77562 145041 143172 85376 54484
11128 54484 68308 33150 27222 -8491 -2816 36545 71365 22911 -1157 -1586 30877 66894
11116 66894 37817 14300 18607 7520 -25036 9890 18603 25562 48545 46967 39160 20031 -5531
11103 -5531 10586 925 -10122 -40253 -62691 5884 51787 65075 139774 142368 35776 2910
11091 2910 16384 17336 36861 60407 38217 80492 82247 17785 -5070 -22307 -4883 -5461 27591
11078 27591 108956 102256 147849 204509 213311 273450 417637 576108 775005 1097096 1535933
11067 1535933 1795422 1696214 1321359 965104 704581 488958 352392 311049 275863 218070
11057 218070 171112 138944 154021 152159 153152 152045 169203 118220 85372 70656 96288 125299
11045 125299 152019 178020 208517 196078 178396 158083 133683 119927 121132 148233 161040 199259
11033 199259 331411 417252 396826 347769 315922 291621 336634 353804 333843 407794 475889
11022 475889 533542 591658 583639 533027 489334 403884 360974 340236 318331 333271 284487 317893
11010 317893 372790 410042 419036 357021 273998 255222 248391 211518 138819 155475 161527 135800
10998 135800 182970 224789 236223 229753 151825 74444 52373 67632 68443 98998 3074 -35572
10986 -35572 -77627 -78114 -4244 53372 46915 20693 9470 53236 72614 31387 -1673 -3465
10974 -3465 51179 98160 38815 -1987 -32936 49186 58694 54380 52549 70506 79032 67279 52735
10961 52735 47595 69209 62086 59410 29232 -24356 -48047 20247 3966 -32622 -73354 -67668
10949 -67668 17968 27256 32795 -1427 -4130 4464 -17609 -14244 -19488 -3631 23997 12402 27321
10936 27321 43484 28848 -4450 29531 28103 23579 128831 180682 201713 160608 98323 32337
10924 32337 49665 53879 19135 41427 68206 44463 65257 57222 -4039 -62699 -63005 -22129
10912 -22129 55564 88402 104834 69883 51551 91255 137414 98835 86338 88802 33951 21921
10900 21921 18793 -19242 -53067 -33985 -6491 -12360 -5769 28826 17137 -52450 -79784 -73639
10888 -73639 -47352 18214 35873 12364 -55081 -53885 -37925 -18506 27661 88079 84533 124400
10876 124400 176786 81313 9712 15591 -19576 -19941 11395 28660 -1335 -47190 -73841 -27877
10864 -27877 31426 176016 169801 68767 83840 98789 77732 60060 89333 79022 78995 90827
10852 90827 67815 99330 127655 108405 93565 97946 46120 34973 81492 175483 178104 164945
10840 164945 202188 192094 190398 163200 82350 55096 61702 49078 88040 71172 77185 99537
10828 99537 170459 156283 78187 51035 63576 107783 86937 87107 80866 114245 146966 109699
10816 109699 91912 121041 117188 77334 119010 151717 89787 40953 64740 83725 132549 138631
10804 138631 164708 105314 115878 145951 129444 82321 50643 43664 49947 34559 -39541 -39845
10792 -39845 -15239 -6655 -2372 -32692 17282 32941 14756 -15726 69912 82590 14787 -22934
10780 -22934 -3771 27279 11732 48220 45067 47042 37263 13631 3778 65277 124768 109497
10768 109497 58123 51843 -272 -55633 -59784 593 81880 92129 52998 19338 -12078 -6982
10756 -6982 -43135 -19517 35717 32145 20896 8486 -20145 -5088 -428 5413 47811 56668 15678
10743 15678 32205 37769 34344 1092 -39028 15050 74198 131558 79558 73806 71260 30755
10731 30755 -13943 -2209 -9123 -29268 -6481 59377 99883 105927 55722 109523 86518 65094
10719 65094 83850 90681 77382 165027 238142 238676 225848 206695 229113 173651 162104 150755
10707 150755 131133 141030 128827 166487 164337 148787 110035 91791 76860 67588 81932 82963
10695 82963 92219 108564 97260 87233 78408 129446 106473 84103 73913 34393 35155 32567 17930
10682 17930 7478 70857 58239 -21336 -13893 -6028 28797 85159 117302 99321 44608 50002
10670 50002 24819 3942 66239 90596 129526 122792 163030 245872 254677 183130 135417 184591
10658 184591 267007 292287 273294 292911 331641 349221 338335 341610 390833 445174 469444 441125
10646 441125 390079 372622 417147 455690 416484 390298 412102 475602 514453 592887 712854
10635 712854 836683 933179 1096817 1263561 1413396 1551031 1747705 1922955 2069839 2320908
10625 2320908 2675171 3133933 3677114 4363992 5312664 6660327 8515987 11126045 14532607
10616 14532607 18882746 23683714 27695240 29658792 29278504 27573573 25886481 25051487
10608 25051487 25443064 27460666 31463730 37809211 46505402 56421351 64130323 65988354
10600 65988354 61921114 55238024 49260849 45569814 44613232 46535384 51491678 59804136
10592 59804136 71236826 83580431 91764857 90830360 81591594 69356082 58537880 50840808
10584 50840808 46330820 44910627 46497268 50781307 57117800 63637187 66776552 63586317
10576 63586317 55188608 45395974 37179515 31365991 27748818 26025926 25841809 26883331
10568 26883331 28574294 30136592 30095650 27626765 23370460 18683904 14546236 11250943
10560 11250943 8878405 7181697 5937097 4972340 4288589 3706017 3252644 2959697 2664248
10551 2664248 2403507 2183101 2050041 1948345 1770550 1599697 1441323 1368365 1329265 1311011
10541 1311011 1247340 1133145 1056114 1055567 1049082 976967 877363 810759 793027 814115 817125 853392
10529 853392 793780 816227 829131 791919 743359 708142 706739 671947 648482 644469 609708 562808
10517 562808 555318 541349 500179 463688 459226 434884 482541 446593 457074 463240 461878 441655
10505 441655 459605 457753 390790 331479 310109 273244 258738 291361 346344 291803 221517 227627
10493 227627 302468 359238 286984 241611 202237 226632 268578 241944 210797 201234 208834 190568
10481 190568 265588 315474 287168 263971 249421 252885 292073 273394 258880 237462 169345 111052
10469 111052 136271 171095 179619 116588 87939 151427 198586 235318 300357 287207 255366 288199
10457 288199 323413 299775 324396 351694 326821 335238 265074 222982 218716 206834 217657 214901
$$ [...]
##END NTUPLES=NMR SPECTRUM
##END=
