##TITLE=Analysis number 329700
Compound Code cc 12302
Book Reference 513/127/35
Project Code adrs
Chemist Name ronp
##JCAMPDX= 6.0         $$ Bruker NMR JCAMP-DX V2.0
##DATA TYPE= NMR SPECTRUM
##DATA CLASS= NTUPLES
##ORIGIN= Bruker BioSpin GmbH
##OWNER= nmr
$$ XWIN-NMR		Version 3.5
$$ Mon Sep 24 11:04:20 2007 GMT Daylight Time (UT+1h)  MAYBRIDGE\nmr@NMR_250MHZ
##.OBSERVE FREQUENCY= 250.131544655141
##.OBSERVE NUCLEUS= ^1H
##.ACQUISITION MODE= SIMULTANEOUS (DQD)
##.ACQUISITION SCHEME= undefined
##.AVERAGES= 16
##.DIGITISER RES= 18
##SPECTROMETER/DATA SYSTEM= dpx250
##.PULSE SEQUENCE= zg30
##.SOLVENT NAME= CDCl3
##.SHIFT REFERENCE= (INTERNAL, CDCl3, 0, 16.522)
##AUDIT TRAIL= $$ (NUMBER, WHEN, WHO, WHERE, WHAT)
$$ ##TITLE= Audit trail, XWIN-NMR		Version 3.5
$$ ##JCAMPDX= 5.01
$$ ##ORIGIN= Bruker BioSpin GmbH
$$ ##OWNER= nmr
$$ C:\u/data/dgb/nmr/ADRS/2190/pdata/1/auditp.txt
$$ ##AUDIT TRAIL=  $$ (NUMBER, WHEN, WHO, WHERE, WHAT)
(   1,<2007-09-24 11:03:53.47 +100>,<MAYBRIDGE\nmr>,<NMR_250MHZ>,
      <created by zg, POWCHK disabled, PULCHK disabled
       configuration hash MD5:
       76 6E 9A 78 1E 09 19 81 EC 84 63 8F B0 6A 59 2D
       data hash MD5: 64K
       FE D8 9E 29 30 1C 58 09 A7 8D 4D 28 51 90 BE F8>)
(   2,<2007-09-24 11:04:09.85 +100>,<MAYBRIDGE\nmr>,<NMR_250MHZ>,
      <Start of raw data processing
       ef LB = 0.3 FT_mod = 6 PKNL = 1 SI = 32K 
       data hash MD5: 32K
       F3 06 5F 7D 42 2B 8D 81 64 81 BA 4B 14 A7 78 B0>)
(   3,<2007-09-24 11:04:11.94 +100>,<MAYBRIDGE\nmr>,<NMR_250MHZ>,
      <apk 
       data hash MD5: 32K
       5D 89 64 38 07 39 62 63 E3 7D D3 35 3A D6 67 32>)
(   4,<2007-09-24 11:04:12.61 +100>,<MAYBRIDGE\nmr>,<NMR_250MHZ>,
      <abs ABSG = 5 
       data hash MD5: 32K
       13 7E 9F A6 10 39 99 56 06 45 B9 10 B2 FC 6D 14>)
$$ ##END=
$$ 
$$ hash MD5
$$ 7F 5F 17 4E CB 48 7B 8C F3 1C E0 A0 AD 7D F0 90
##$RELAX= 
##$RELAX= 
##$RELAX= 
##$RELAX= 
##$RELAX= 
##$RELAX= 
##$RELAX= 
$$ Bruker specific parameters
$$ --------------------------
##$DU= <C:\u>
##$EXPNO= 2190
##$NAME= <ADRS>
##$PROCNO= 1
##$TYPE= <nmr>
##$USER= <dgb>
##$AMP= (0..31)
100 100 100 100 100 100 100 100 100 100 100 100 100 100 100 100 100 100 
100 100 100 100 100 100 100 100 100 100 100 100 100 100 
##$AQSEQ= 0
##$AQ_mod= 3
##$AUNM= <au_zg>
##$AUTOPOS= <15 >
##$BF1= 250.13
##$BF2= 250.13
##$BF3= 250.13
##$BF4= 250.13
##$BF5= 500.13
##$BF6= 500.13
##$BF7= 500.13
##$BF8= 500.13
##$BYTORDA= 1
##$CFDGTYP= 0
##$CFRGTYP= 5
##$CHEMSTR= <none>
##$CNST= (0..31)
1 1 145 1 1 1 1 1 1 1 1 1 1 1 1 1 1 1 1 1 1 1 1 1 1 1 1 1 1 1 1 1 
##$CPDPRG= <>
##$CPDPRG1= <>
##$CPDPRG2= <>
##$CPDPRG3= <>
##$CPDPRG4= <mlev>
##$CPDPRG5= <mlev>
##$CPDPRG6= <mlev>
##$CPDPRG7= <mlev>
##$CPDPRG8= <mlev>
##$CPDPRGB= <>
##$CPDPRGT= <>
##$D= (0..31)
0 1 0 0 0 0 0 0 0 0.06 0 0 0 0 0 0 0.0002 0 0 0 0 0 0 0 0 0 0 0 0 0 0 
0 
##$DATE= 1190628231
##$DBL= (0..7)
120 120 120 120 120 120 120 120 
##$DBP= (0..7)
150 150 150 150 150 150 150 150 
##$DBP07= 0
##$DBPNAM0= <>
##$DBPNAM1= <>
$$ [...]
##$SUBNAM7= <"">
##$SUBNAM8= <"">
##$SUBNAM9= <"">
##$SW= 20.6930455092707
##$SWIBOX= (0..15)
0 0 3 0 0 0 0 0 0 0 0 0 0 0 0 0 
##$SW_h= 5175.983436853
##$TD= 65536
##$TD0= 1
##$TE= 296.16
##$TE2= 300
##$TE3= 300
##$TEG= 300
##$TL= (0..7)
0 120 120 120 120 120 120 120 
##$TP= (0..7)
150 150 150 150 150 150 150 150 
##$TP07= 0
##$TPNAME0= <>
##$TPNAME1= <>
##$TPNAME2= <>
##$TPNAME3= <>
##$TPNAME4= <>
##$TPNAME5= <>
##$TPNAME6= <>
##$TPNAME7= <>
##$TPOAL= (0..7)
0.5 0.5 0.5 0.5 0.5 0.5 0.5 0.5 
##$TPOFFS= (0..7)
0 0 0 0 0 0 0 0 
##$TUNHIN= 0
##$TUNHOUT= 0
##$TUNXOUT= 0
##$USERA1= <user>
##$USERA2= <user>
##$USERA3= <user>
##$USERA4= <user>
##$USERA5= <user>
##$V9= 5
##$VALIST= <valist>
##$VCLIST= <CCCCCCCCCCCCCCC>
##$VD= 0
##$VDLIST= <DDDDDDDDDDDDDDD>
##$VPLIST= <PPPPPPPPPPPPPPP>
##$VTLIST= <TTTTTTTTTTTTTTT>
##$WBST= 1024
##$WBSW= 4
##$XGAIN= (0..3)
0 0 0 0 
##$XL= 0
##$YL= 0
##$YMAX_a= 279953
##$YMIN_a= -389289
##$ZGOPTNS= <>
##$ZL1= 120
##$ZL2= 120
##$ZL3= 120
##$ZL4= 120
##$ABSF1= 16.522
##$ABSF2= -4.171173
##$ABSG= 5
##$ABSL= 3
##$ALPHA= 0
##$AQORDER= 0
##$ASSFAC= 0
##$ASSFACI= 0
##$ASSFACX= 0
##$ASSWID= 0
##$AUNMP= <proc_1d>
##$AZFE= 0.1
##$AZFW= 0.1
##$BCFW= 0
##$BC_mod= 0
##$BYTORDP= 0
##$COROFFS= 0
##$CY= 12.5
##$DATMOD= 1
##$DC= 0
##$DFILT= <>
##$DTYPP= 0
##$F1P= 14.0000005364418
##$F2P= -0.99999901652339
##$FCOR= 0.5
##$FTSIZE= 32768
##$FT_mod= 6
##$GAMMA= 0
##$GB= 0
##$INTBC= 1
##$INTSCL= 1
##$ISEN= 128
##$LB= 0.3
##$LEV0= 0
##$LPBIN= 0
##$MAXI= 10000
##$MC2= 0
##$MEAN= 0
##$ME_mod= 0
##$MI= 0
##$NCOEF= 0
##$NC_proc= -3
##$NLEV= 6
##$NOISF1= 0
##$NOISF2= 0
##$NSP= 0
##$NTH_PI= 0
##$NZP= 0
##$OFFSET= 16.522
##$PC= 1
##$PHC0= 153.7544
##$PHC1= 19.94292
##$PH_mod= 1
##$PKNL= yes
##$PPARMOD= 0
##$PSCAL= 4
##$PSIGN= 0
##$REVERSE= no
##$SF= 250.13
##$SI= 32768
##$SIGF1= 0
##$SIGF2= 0
##$SINO= 400
##$SIOLD= 32768
##$SREGLST= <1H.CDCl3>
##$SSB= 0
##$STSI= 32768
##$STSR= 0
##$SW_p= 5175.98343685301
##$SYMM= 0
##$S_DEV= 0
##$TDeff= 65536
##$TDoff= 0
##$TI= <Analysis number 999999
Compound Code 99
Book Reference 9
Project Code 9>
##$TILT= no
##$TM1= 0
##$TM2= 0
##$TOPLEV= 0
##$USERP1= <user>
##$USERP2= <user>
##$USERP3= <user>
##$USERP4= <user>
##$USERP5= <user>
##$WDW= 1
##$XDIM= 32768
##$YMAX_p= 280048979
##$YMIN_p= -167676
$$ End of Bruker specific parameters
$$ ---------------------------------
##NTUPLES= NMR SPECTRUM
##VAR_NAME=  FREQUENCY,     SPECTRUM/REAL,   SPECTRUM/IMAG
##SYMBOL=    X,             R,               I
##VAR_TYPE=  INDEPENDENT,   DEPENDENT,       DEPENDENT
##VAR_FORM=  AFFN,          ASDF,            ASDF
##VAR_DIM=   32768,         32768,           32768
##UNITS=     HZ,            ARBITRARY UNITS, ARBITRARY UNITS
##FACTOR=    0.157963299565203, 1,           1
##FIRST=     4132.6476996994, 0,             0
##LAST=      -1043.33573715361, 0,           0
##MIN=       -1043.33573715361, -167676,     0
##MAX=       4132.6476996994, 280048979,     0
$$ Real data points
##PAGE= N=1
##DATA TABLE= (X++(R..R)), XYDATA
$$ [...]
26453a6649n203K4968J1393j5635M5150k7680k8520J7719j9234n5463K0053M7944
26441a157J4586K6907Q992k5322j2475j7661N982p893j8474L495J2008N4961N9620
26428A03569K874l7013k2245j4387K0409O379l2451k217q89j7539k2496P612p234
26415a5628l467K1981O816J8930j72k1448q552M2007k8710l8175J0460K495j0132
26402b3595K1634L0064K079j8747k0710j430m561j2072L0335o272m3363J4604
26390c2034M0862N066Q966L0837K3021m3658n2808K3170J9009J0022k0542m2992
26378c1081J3331k17l235J8292J2863k6648K0256L7708j3941j1913p584J1959
26366A9790j2302l1436M1310J3590R507K9528o633k7765k0574q949k5000m6517
$$ y = [-16649, -21852, 3116, 14509, -1126, 44024, 16344, -12176, 5543, -13691, -69154, -49101, -1157, 13429, 40336, 49328, 24006, 11531, -6130, -148, -8041, -26515, -23020, -11012, 43949, 103569, 106443, 69430, 47185, 32798, 53207, 59586, 27135, 24918, 24029, 6490, -16006, -8394, -15628, -19095, 2886, 9702, 28632, 28460, 7012, -1540, 40467, 11757, -26418, -15958, -13463, -23595, -1961, 28103, 30182, 11435, -9275, -10705, -15266, -27338, 2997, -3275, -46638, -32034, 8828, 13894, 22860, 53697, 76718, 33060, -19748, 3422, 22431, 32453, 11911, -31081, -17750, -17967, -21202, -2910, 9953, -16695, 3561, 41269, 27328, 15415, 7831, 19790, 7488, -23948, 17362, 30952, 40459, 69987, 63354, 35589, 15015, 6066, -18934, -65451]
26354f5451L9005M0154L4333o364l9588q849j2357L2430M4997l8231j4830k5038
26342a9789j0265j2778J3017J370j8693M3593K8773j4415N3921o044m4254k5893
26330a1457j4940j8124K2137j106K868Q042j3319J9983J8485J1988k2249k151
26318A57j1360M689K9522M7449l8813n0303o2914P86L7662j5468L990K7461J9889
26305g253l1507j2601L3924L1557K9968j2743o9899j0698J7934J1749p885P68
26293b6686K0226J1808N23N524m9497J906j8450L7163M4322m1751o9211L0305
26281e3818K6362L3465L4182R424j6355n5217l1570k7714p132k021K6048N2404
26269a1942M3562m271l3779k043l3767J701N5665J9031q866j465M337l3320K7568
$$ y = [-65451, -26446, 13708, 48041, 41677, 2089, -6760, -19117, 13313, 58310, 20079, 5249, -19789, -30054, -42832, -29815, -28445, -47138, -3545, 25228, 10813, 64734, 58690, 14436, -11457, -26397, -44521, -22384, -23490, -20622, -12580, -25899, -5916, 12569, 24557, 2308, 157, -11203, -6514, 23008, 70457, 31644, -18659, -81573, -80787, -43125, -58593, -54603, -27142, -7253, -38760, -51361, -17437, 14120, 44088, 31345, -38554, -49252, -31318, -19569, -27454, -26686, -6460, 5348, 5871, 11395, -38102, -36196, -54646, -17483, 26839, -14912, -84123, -53818, -27456, 6009, 40191, 49615, 33260, -21957, -53527, -81241, -88373, -90394, -64346, -11942, 31620, 27349, -6430, -8473, -42240, -40539, 15126, 34157, 25291, 23826, 28163, -5157, 22411]
26256B2411L6282k8763k8040K5689L3582J0512m2402k7796k1637l0133J6364L2797
26244a134J8321J740K5348j6445L4410k328j3605j0652K1480J0337l9126m5638
26232a7292L5667K0242J2767R182k5253l2940k0911J4572q125p5K1566M8484r257
26219D8627m510K9964l5977l9671r180M1967M1620j3982m8200J1634J4847r846
26207B7293P817n937l306J6004M111l626j1932p2498l9107K0661N0797k5338l1075
26194f6136K6991K9567j153J2073J156K1944K1711J3063l2271j1620L3536J868
26182E0729L6426l133n7765j9528M025J1797J7612n447K2260n487k0661j389P570
26169C7009o48p656k4580j9817l2816p978J9188J0046o396K4116M4028j4128j6497
$$ y = [22411, 58693, 29930, 1890, 27579, 61161, 71673, 29271, 1475, -20162, -50295, -33931, -1134, 17187, 18927, 44275, 27830, 62240, 59912, 46307, 35655, 57135, 67472, 28346, -17292, 18375, 38617, 51384, 60566, 35313, 2373, -18538, -3966, -12091, -12166, 9400, 57884, 48627, 44117, 74081, 38104, -1567, -10747, 31220, 72840, 58858, 10658, 22292, 37139, 27293, 35110, 29173, 25867, 41871, 45982, 42356, 30424, -42074, -81181, -60520, -9723, -35061, -66136, -39145, -9578, -10731, 1342, 2498, 24442, 46153, 59216, 26945, 15325, 48861, 50729, 87155, 84022, 26257, 6729, 10754, 22551, 40163, 34716, 56976, 51489, 30828, 29439, 37009, 36361, 28705, 4125, -15692, -48508, -56486, -37298, -27252, -33648, -9532, 34496, 20368, 3871]
26156C871r835R672k3500j9714M8044j0250l5904K1726N3273j591j1651K4767
26144D8908L9164p903N947j7636k3126m2736n7611o3796n389O3555M0378r904
26132c0149Q702J3238J0898J2619K3486l848k9398J8481L4577m011k1076l8737
26120e218K785k5015l640l788j4241Q295K0003N3883L1267l183m0466o0556L4571
26107e303O1398n499l4976j2300j8032j0973K8842k4773j891K1110M2509L2346
26095G2458n343k1343l5961n2525L0350L4282N605j7611j3325p908j4100P082
26083a8339K8002J9293N2576j2095J6105n378m7238N37K160K7270l3521k1675
26071G697j8507l638N1618L693m5911L2427L189k1587L2807K4975n1231k5078
$$ y = [3871, -5964, 3708, -19792, -39506, 8538, -1712, -37616, -15890, 37383, 35792, 24141, 48908, 88072, 80169, 86116, 68480, 45354, 2618, -54993, -118789, -124178, -60623, -20245, -30149, -21447, -8209, 2689, 15308, 38794, 34946, 5548, 24029, 58606, 54595, 33519, -5218, -2433, -27448, -31088, -34876, -49117, -40822, -20819, 33064, 64331, 61148, 20682, -39874, -5303, 56095, 50596, 15620, 3320, -14712, -25685, 3157, -21616, -23507, -2397, 40112, 72458, 67115, 45772, 9811, -42714, -12364, 21918, 27523, 9912, -3413, -11321, -25421, -18339, 9663, 28956, 81532, 69437, 85542, 80164, 32926, 33463, 35623, 62893, 29372, 7697, -10810, -14448, 37170, 40863, -5048, 27379, 30568, 8981, 41788, 66763, 15532, -9546]
26059i546O188j1098K261M332l988k8590l817K5723J6884j5196J6373k4158k0806
26046d5438L5519L0423J3189l6430l4978J3709K0363j2853r802k2776r047j8959
26034g7080P798M6965K185r845n281J9626k367N31L1368J8768q387j3421K5672
26021C6532Q08j4197l0027K0522l3458j7553N6325r587n1329j6183Q634N4343
26009D830M9661m6956j2029l1980L8359J8768k4951j819j6981r329L7756K2072
25997B7401j3082L822J5422R33k4399j2140R110K3116J9013j5997j9950Q984k3478
25984a245N222O39n4693m0217J4676L3552P689J487L1782L0297J9806k3387j1810
25971A3798j652K0876j2396l500l797n3950M23J5718k340L3983L1121r447J6813
$$ y = [-9546, -3358, -14456, -12195, -7863, -11851, -40441, -44258, -18535, -1651, -16847, -474, -24632, -45438, -9919, 20504, 33693, -2737, -37715, -24006, -3643, -16496, -26298, -49074, -58121, -77080, -69282, -22317, -20132, -29977, -35258, -15632, -17999, -17468, 13900, 32668, 24281, 10860, 36532, 37340, 23143, -6884, 13638, -19820, -37373, 18952, 9365, -41964, -58147, -49513, 4830, 54491, 7535, -4494, -36474, 1885, 20653, -4298, -6117, -23098, -32427, 5329, 27401, 14319, 18141, 33563, 34496, 10097, -2043, 7067, 30183, 49196, 33199, 13249, 22233, -1245, 3977, 4616, -50077, -90294, -75618, -42066, -34377, -32890, -1108, 29189, 48995, 25608, 13798, 12146, 33022, 20626, 17126, 13329, -40621, -40198, -24480, -26820, 7163, 38284, 28837, 45650]
25958D5650R653m7383n5485r165j1805M3932N3896J2324K22l4332j5889k9889
25946c8271L5294J9767L348j3345p345J0981k7553m0922k5788L2430J9659o399
25934c8144k3457r567K517L8101J0286j5329j5453N154j3120N4891L7420l4942
25922a643k8006K1143M4785j3213J671k5401j568J7668L795L462k446K196O329
25909B8772K6257k475n7616o6896J2179K2399K4159k6464j5497K7328L5480J9718
25897B7344J875M736k4619j4375m8595p958J6314J803n211k9213k3802j165j83
25884a03049N7071M7622M5838P843j2733R656K9427k683j2399l7486l4436j5991
25872b1320N8897L9507p237l7287n9978k2744M0314o90k3079j1058L3139M2720
$$ y = [45650, 55303, 7920, -47565, -56730, -68535, -24603, 29293, 41617, 41839, 7507, -8382, -38271, -2977, 16790, 20138, 6793, -552, 10429, -17124, -58046, -83834, -51404, -31745, -38144, -61601, -71168, -68651, -30550, -20264, -35593, -51046, -45892, -59012, -4121, 33299, -1643, -29649, -8506, 36279, 23066, 24737, -664, -2232, 15436, 19231, 22693, 20247, 22443, 28772, 55029, 52554, -5062, -71958, -59779, -37380, -13221, -39685, -55182, -27854, 7626, 27344, 29219, 33955, 9336, -5039, -53634, -61592, -45278, -43475, -48686, -77899, -101701, -102866, -103049, -45978, 1644, 47482, 55325, 42592, 52248, 81675, 78992, 66593, 29107, -5329, -21320, 37577, 77084, 69847, 32560, -27418, -50162, -9848, -10538, -33617, -44675, -11536, 31184]
25860C1184J4525o726j3025J1370q327m1216k0358L014j6735J3392J9204R171
25848d527K3918L9716l8546P783M7493P578q967k3895m2181J496l290j7894r650
25835b0966M0738o319k7887m6997p92M3005O632l5571k5689j2922K5523K0551
25823d0694N0650L0619j2088l1196k2094m283Q884K5129K429K86j2369j5345K1622
25810A550M3579O402l8576n0580m715l6829m147N4033K5130q844K1491k1110J3388
25797G72K6270J7568k7727l1082K7547N251k3603l036k7676Q916j8294J9066J0626
25784a5402K2639K9859l470q578L4240J1596l6868j7619j8478p222p040J391J3706
25771a246l343J3780L0340k795k1068m1073J4645m0786M301j3829o1132L0082
$$ y = [31184, 45709, 38983, 25958, 37328, 29001, -12215, -32573, -29559, -46294, -32902, -13698, -4527, 19391, 59107, 20561, 28344, 75837, 83415, 74448, 50553, 8372, 9868, 6578, -11316, -20966, 19772, 13453, -14434, -61431, -62223, -19218, -12586, -48157, -73846, -86768, -61245, -40694, 9956, 40575, 28487, -2709, -24803, -29086, -20202, 4927, 7356, 7642, -4727, -20072, 1550, 45129, 51531, 12955, -37625, -42340, -79169, -83316, -29283, -4153, -12997, 8494, -12616, 772, 27042, 44610, 16883, -14199, 13348, 18599, -5004, -8040, -35716, -26800, -45094, -26028, -15402, 7237, 37096, 33626, 25048, 59288, 70884, 34016, 16397, -2081, -9303, -16343, -14952, -1246, -4589, 9191, 39531, 36736, 15668, -25405, -10760, -51546, -47245, -61074, -122206, -92124]
25759i2124L0143K050Q406L8860J8252O680K0465P283o946j9208j7997m2272L1038
25746a5370O2076R835l5785j7151j5651J5208o255L019j9012J4041J1632L764
25734A0351j3883J7563K5645l5391j221K8399r38j0126k7030K476l8742J1692
25722c1205K5903M9689L5919N2971o317k4803m4760m4801j8124K2834j7452J176
25710A030m021l1182K2573P9009k1599o2565n5887j6211J1985N3666L7410J6208
25698C0416j1728m669M2672L5273l2374p4250n8279K8824j639o0189K0661K0108
25686f5174Q844M2179J0076j9798k6937K7149J4006o6118r121P5389J4093j596
25674B992j7829p406p071m1813N195N2330K0813j8957K0819j3361k4307l1258
$$ y = [-92124, -61981, -59931, -51525, -12665, 5587, 12267, 32732, 40015, 33069, 13861, -4136, -46408, -15370, 46706, 56541, 20756, 3605, -12046, 3162, -3093, -74, -19086, -5045, 6587, 10351, -3532, 14031, 39676, 4285, 3064, 31463, 30525, 20399, -6631, -4155, -42897, -31205, -5302, 44387, 80306, 133277, 126960, 102157, 57397, 12596, -5528, 17306, -146, 1030, -2991, -34173, -11600, 67409, 45810, -16755, -72642, -88853, -76868, -23202, 14208, 30416, 18688, 14019, 56691, 91964, 59590, -14660, -72939, -44115, -45754, -105943, -85282, -65174, -56330, -14151, -4075, -23873, -50810, -23661, -9655, -75773, -84894, -9505, 4588, 2992, -14837, -22243, -29314, -71127, -65932, -13602, 7211, -11746, 9073, -4288, -28595, -59853]
25662e9853k7975r19K1376K4485M813N438k1374k679M400J3927M0950O117J364
25649A0070l850j2156Q041k0003l2147l0946O853Q497M2805J5925k9668K1062
25637a5517j5020o381L2229p119p086l8871j8248J7273K4799J6452L972l9873
25625e3390k6297K5400J9307M2513P761K2354J0225l1174k9977l5621l1799J6551
25613f4147J4732J9800J7941r002j1759r437j2124J4556M3843L0801q657m0428
25601a3881m4666L1458L3680p131J1072l688j9024j5645K0396q19K2383p095n147
25588A893K4505K5206k1777o4280K429K9211K9526j6178l2184O14M0093rn0493
25575c1444o6489M7574N7853J998J4807j6643n3159j4485M1067j129k5162Q470
$$ y = [-59853, -87828, -88747, -67371, -42886, -38073, -32635, -54009, -56688, -52288, -38361, 2589, 8706, 10070, 6220, -5936, 2105, -17898, -50045, -80991, -74138, -65641, -22836, -6911, -36579, -15517, -30537, -36918, -4689, -11808, -18894, -57765, -76013, -58740, -33941, -17489, -13517, -53390, -79687, -54287, -34980, 7533, 15294, 37648, 47873, 16699, -13278, -48899, -80698, -64147, -49415, -29615, -11674, -20676, -32435, -41872, -53996, -39440, 4403, 35204, 26547, -13881, -58547, -27089, 6591, -540, 10532, 6844, -12180, -27825, -7429, -8248, 14135, 7040, 1893, 26398, 51604, 29827, -34453, -32024, -2813, 26713, 10535, -21649, -21035, 19058, 19049, -31444, -97933, -50359, 7494, 9492, 24299, 7656, -45503, -59988, -18921, -20050, -45212, -36742]
25563c6742J2586M4462J1452j2429J1854K3381N094k5511k4431R786K2810n34
25551D1778k0669J9035J291k5974L7230l7337k3492J0275R88L975M0361j870o5553
25538a9962m7653j2132K338j5017q423K4066L9997K7897J0664J500l6768N646
25526b7847q302M3749M7286O67k9422j0354K9681j2805k1827l596J5588j3027
25514I791j6392j4364j1321O52O674O581P071j1627R110k996J3610l557j4533
25501b1301m1241J2351L0483L3487L6736l4567k4569o6581Q953L3742J6822o225
25489b1910K2846J392J277o000k1303k0603M4283K1617j8341k8108l2818M2925
25477a4743J8460l6434J9475J9198p022J584k8243J5186L6292k993L2855l8694
$$ y = [-36742, -24156, 20306, 31758, 19329, 31183, 54564, 59658, 34147, 9716, 19502, 42312, 41778, 21109, 40144, 41435, 15461, 52691, 15354, -8138, 2137, 3125, 7100, 47461, 45591, -19962, -67615, -79747, -77409, -92426, -100849, -76783, -36786, -8889, 1775, 3275, -33493, -27847, -36149, 7600, 54886, 55553, 26131, 15777, 45458, 32653, 10826, 7230, 22818, 9791, -6601, -20965, -32286, -31634, -24960, -18379, -11308, -22935, -13825, -16821, -3211, -6768, -21301, -62542, -50191, -19708, 13779, 50515, 15948, -8621, -75202, -66249, -32507, -15685, -21910, 936, 2328, 3605, -2395, -23698, -44301, -18, 21599, 3258, -24850, -57668, -14743, 3717, -32717, -13242, 5956, -1066, 518, -27725, -12539, 23753, 20760, 53615, 14921]
25465A4921l5015N1523L7757N4484j7501m5717J150J7333j3280o6404n0754J3268
25453c8235L2878M3216l327m170j5691l5089K3755K6588J3618m9195l4286k2851
25441f2789j089L2352N1946M0975Q587p227k2281k2062K2413r001k3372o942J1841
25428A3351J8078J1889j0823j7159N401R038R27Q040j5697j9866J59L440M7227
25415E4005L747j4862O047K8067M991j0339j0288M608j8136p268l6756L2098K3103
25402E9017o153k1701k0796K961k493k5562N2594J5133k9252m5351p740J1511
25390a7832j1628L3264K1314m7773m0609j1277M1231O1885K0372n227l5172P990
25378A6538K2540j4576k5147j7633J7484N101J8024J5030p094j2227k8207j5708
$$ y = [14921, -20094, 31429, 69186, 123670, 106169, 60452, 61602, 78935, 65655, -749, -51503, -38235, -5357, 37859, 34532, 30362, 14671, -20418, 3337, 29925, 43543, -5652, -39938, -62789, -63878, -31526, 20420, 61395, 69982, 62755, 40474, 18412, 40825, 31824, 8452, 1510, 13351, 31429, 43318, 32495, 15336, 20737, 29775, 30702, 38742, 23045, 3179, 3338, 6778, 54005, 57752, 42890, 48937, 77004, 81995, 71656, 61368, 65976, 47840, 40572, 3816, 35914, 59017, 52864, 31163, 10367, 13328, 10835, -14727, 37867, 53000, 23748, -21603, -29343, -17832, -29460, 3804, 25118, -22655, -63264, -74541, -33310, 28575, 48947, 43720, 8548, 16538, 39078, 24502, -645, -18278, -794, 4307, 22331, 37361, 30267, 18040, -10167, -25875]
25366b5875j3245J013M680n73J6978J2009q780K9380j1736K8136J0378n942k6785
25353I638k737J5913K8455J5814q56k9535l5322M4889n047j481L0361k0063k7966
25340B2063m5424l8128J8303p645L0608j7075J0860N8816M985m1262J8369m3783
25328b9313k2102O4747Q023J2057j6708m5373j7754K1329L959M6188n550n5392
25316c5889r975k4132L8567L1166N1901K6920l3528l4825k2112k8232j422K7950
25304a3611M9870j5103j2989l7186K2210j4648k6019l2006M5729R0154M9170k123
25292A03448k6446k6334J0123m6530j2356r493k9622j029j8090k941N5940J0125
25280F795j5096J4724N0579l7997l8390Q896M754j8298j4939p017N722R353K4865
$$ y = [-25875, -39120, -38107, -33427, -34000, -17022, -5013, -13793, 15587, 3851, 31987, 42365, 36423, 9638, 6901, 22814, 51269, 67083, 66227, 36692, 1370, 46259, 41212, 39731, 70092, 50029, 22063, -23361, -61489, -43186, -50831, -20223, -37298, -26438, 32378, 37363, -3899, 14470, -29313, -51415, 13332, 21355, 33412, 16704, -28669, -46423, -25094, -21135, 25053, 19503, -35889, -45864, -69996, -31429, -263, 51638, 78558, 45030, 10205, -11907, -40139, -41561, -13611, 36259, 21156, 8167, -29019, -6809, -21457, -47476, -79482, -33753, 56401, 105571, 103448, 77002, 50668, 60791, 14261, 1905, -7588, -37210, -38239, -56329, -59270, -3330, 6795, -8301, 6423, 57002, 19005, -19385, -10489, -5735, -24033, -38972, -45989, -40267, -30914, -6049]
25267f049l378P287k3685k0009o518o878j0423K0390J0885l378L5355K3734K2757
25254D0090Q079k3797l0762K0422J867m268L7181P028k5857P537j2043j211L3794
25241E8060J8314J436j9092L861P393K0968K370k3563N099K9887n1634o3394n511
25228a5806J2266J6010L7188K0460p093L2303o237n6040L493j3698j5649j8059
25216a0862j7249K5762M646K797L4991q979k2386q301L312K93k7680K1599j7657
25203a9714m62k8720K4767N8755K6366m0755n1468j2750l850k1587R536m80J6506
25190d3856P940j5420K9212L0365L4224P905J717k7394k7933L75M0870o3816j6289
25177d2100L4504R918j6550L9172O642m0498l2022J8135J6797l092r088m4399
$$ y = [-6049, -9427, -2140, -25825, -45834, -52352, -59230, -69653, -49263, -38378, -41756, -6401, 17333, 40090, 48169, 24372, -6390, 14032, 15899, 11631, 48812, 55840, 29983, 37520, 25477, 24266, 58060, 76374, 77810, 58718, 62579, 69972, 90940, 93310, 69747, 74846, 104733, 53099, -10295, -15806, -3540, 12470, 49658, 70118, 63025, 95328, 89091, 33051, 36544, 22846, 7197, -10862, -28111, -2349, 2297, 5094, 40085, 31106, 8720, 419, 3731, 4024, -23656, -2057, -19714, -20176, -48896, -24129, 34626, 60992, 20237, -31231, -43981, -47831, -69418, -59882, -60362, -43856, -35916, -51336, -22124, 8241, 42465, 50370, 52087, 24693, -3240, -2865, 38005, -25811, -42100, -7596, 2322, -14228, 24944, 31586, -8912, -40934, -22799, -6002, -9094, -18182, -62581]
25165f2581J7171j1914j0416J6087L8547K2947J52J2115m192j3115M7566j4897
25153C7470l7311p375k2958o566P368L4113k6277R33N0117m874J8603k0726q105
25140A4412M9414J2446n6288r374L1292j1336N637j5223m9297k0764m681N2638
25128a124J8888K639o525m336J0030J5739q018k7153r76j4375j704n202k0066
25115d2183J2670K0613J0591n925J2531K7636q09l3092j6933j0898j7457J3299
25103b9957N1893J0885m7893p851J0766J0825N665R418N616k1675k751O879k9922
25090b8102m5151l7791R757J802L8410L4451K3904J2277j6884J3614M8868M54
25078E5609k5918m5740q313o000J5873M075j1705L4370M7164j3827l6445q455
$$ y = [-62581, -45410, -57324, -67740, -51653, -13106, 9841, 9993, 22108, 17916, 4801, 52367, 37470, 159, -7216, -30174, -36740, -29372, 4741, -21536, -20603, 29514, 24640, 43243, 22517, 14412, 63826, 76272, 19984, 10610, 41902, 30566, 36203, 20980, -28317, -49081, -53762, -1124, 17764, 20403, 13878, 9542, 19572, 35311, 27293, 140, -836, -15211, -16915, -22117, -42183, -29513, -8900, 1691, -4234, 8297, 35933, 35124, 2032, -14901, -25799, -43256, -29957, 21936, 32821, -15072, -22923, -12157, -1332, 4333, 13751, 19367, -2308, -5059, 1820, -28102, -73253, -111044, -101287, -99485, -61075, -26624, -2720, 9557, -7327, 6287, 55155, 55609, 29691, -16049, -24362, -30362, -14489, -10414, -22119, 12251, 59415, 45588, 9143, 688]
25066F88J6510K8287j5764l4136k0982m3194N208p15r111N4163K7582k7782j9003
25053c8249K1752K4482L1738j8670n8276k5335M774N1582P1061M091o130L9170
25041A01990j0891l0304l6646J544J536k3044o973J397J1654j5177J6121p753
25029C454J5398j334JK4613m266J3611n7587l4683K3757J8055N1685n2448m569
25016d313j1145l2762L899K9405q24J5161N82K5583K9642P684j3920q362l3785
25003F845j2445L1526j8549j2162j7199k5551l9501L1909m427l3864J8993J7893
24991e6532L9335L7549O599J1453K2716j1837k4822k0940J912M2444M5249l3891
24979E9235m7669k3970K0830J9670J1891j7487m6610j9378J522j1317K6111m61
$$ y = [688, 17198, 45485, 29721, -4415, -25397, -68591, -63383, -64098, -73209, -19046, 8536, -19246, -38249, -16497, 7985, 39723, 21053, -37223, -62558, -57784, -6202, 64859, 68950, 62820, 101990, 91099, 60795, 24149, 25693, 27229, 4185, -2788, -1391, 10263, -4914, 11207, 3454, 18852, 17518, 17519, 42132, 37866, 51477, -6110, -40793, -17036, 1019, 52704, 256, -4313, -15458, -48220, -44321, -14916, -15740, -579, 3, 25586, 55228, 62912, 48992, 40630, 6845, -5600, 25926, 7377, -4785, -21984, -47535, -87036, -55127, -59554, -93418, -74425, -56532, -17197, 20352, 26951, 38404, 61120, 49283, 24461, 3521, 5433, 47877, 93126, 59235, 11566, -12404, 8426, 28096, 39987, 22500, -24110, -43488, -41966, -53283, -27172, -27633]
24967b7633l781j1269K805K0770j3485n8210M4076O1411J2451j5208k4482J6681
24955D126K6437p241l3345j5627p357J5543K131n023K5896J7602P248o723k1852
24942A815M114L9989O618O957P34j661k5277j1388l6715n0530l6470n48Q098J2000
24928h2264N6023k1652L135L9318L5882J0575p414k6950O60l7469L2807N5848
24916E8499o867m2034J1143K5495K0299l0001k7749j1467j1212K489N1172l9742
24904B5l8522L6020N6690p959k2127l6217r810J3521J769k5879J7302o348j3925
24891c5460m611K9286P4058j5340n5714J5011M7940j1656k7955k4438o422L3779
24879A8478L0375J7317p0993l7688l666K8799j3771K6114k6006j7860N7730K6306
$$ y = [-27633, -31414, -42683, -39878, -19108, -32593, -90803, -46727, 14684, 27135, 11927, -12555, 4126, 30563, 23322, -10023, -25650, -33007, -17464, -15333, -20356, 5540, 23142, 30390, 23667, 1815, 5929, 45918, 52536, 59493, 60227, 58566, 33289, 21901, -14814, -65344, -101814, -102362, -94264, -82264, -26241, -47893, -44758, -5440, 30442, 41017, 33603, 6653, 7313, -30156, 2651, 58499, 51632, 9598, 20741, 46236, 66535, 36534, 8785, -2682, -13894, -11405, 39767, 25, -38497, -2477, 54213, 46254, 24127, -12090, -21900, -8379, -6610, -32489, -15187, -21535, -35460, -40071, -10785, 63273, 47933, -7781, 7230, 55170, 43514, 15559, -8879, -15301, 18478, 48853, 66170, -4823, -42511, -46177, -17378, -31149, -5035, -31041, -48901, 8829, 35135]
24867C5135j773J0051j8329l8910j4797M9044j1729k3860J7945q556L997k1129
24855b2911j6252j6586K9719L4191l3601k7983M6756j0439k9918P278J3051K9277
24843B582n178m0849r694K7104K5130L4980K4880k1870K2472K1189j1604p006
24831F2136k5663l8791l335K4474j1274j673J7284J1494j648k5414m431K7444
24819C0603k4038k9612P645J639k1346q968J8499M4294J2676k9459n552k9756
24807c3375K0033N2661j3750R26j1453n1812J1166J6314k376m0851m372L9332
24795a7557L7678j2369l0466L0155L3514k210j3328l0116K3091j7440m492N231
24783A691N0765j4944k040j221k0500j5591l3450l440K1265M6090k2261j5411
$$ y = [35135, 33362, 43413, 25084, -13826, -28623, 20421, 8692, -15168, 2777, -5779, -1782, -22911, -39163, -55749, -26030, 8161, -25440, -53423, -6667, -17106, -47024, -39746, -26695, 2582, -2596, -43445, -53139, -26035, -905, 34075, 58955, 37085, 59557, 80746, 69142, 62136, 36473, -2318, -5653, 18821, 7547, 5874, 23158, 34652, 33004, 7590, 3159, 30603, 6565, -23047, -15402, -13763, -35109, -44077, -25578, 18716, 31392, 1933, -3619, -33375, -13342, 39319, 25569, 26495, 15042, -36770, -25604, -9290, -11666, -52517, -56889, -17557, 20121, 7752, -22714, 7441, 40955, 38745, 25417, -4699, 18392, 952, -3540, 1691, 52456, 37512, 35472, 34251, 13751, -1840, -35290, -38730, -17465, 28625, 6364, -9047]
24771i047K5649j3670Q369k0048o837j0292j2638J1604J302O492l0628j9325L349
24758f5720K8790K4459K8172J1510l8074n6236J0339M5612j4046j5173J3883L0687
24746D203k4243M449L8088k1604l9415R426Q695n270O693m174j1919j5484K6643
24733b3912K5361N167L1186l4238p149k446M0931K467J0521L4727j5435n9085
24721H095l8085K7148L7027J3893l8624o6867m3951k0538M6498K1262N0714N6095
24709E2667K8426j8605l3024o715M907m1094K827k3516j8117M7045J811l8056
24697d1444l278j1528J9205j1502p79J3027J5718Q114K8035K3937K0470J161J5590
24684G6726o0078l2496k4744q757K3573K036J8413j0671r655R868M9313M9336
$$ y = [-9047, 16602, 2932, 11301, -8747, -15584, -25876, -38514, -26910, -25608, -19116, -49744, -69069, -65720, -36930, -12471, 15701, 27211, -10863, -67099, -56760, -11148, -25194, -40367, -26484, 4203, -20040, -15591, 22497, 893, -38522, -29096, -20401, -25671, -18978, -23152, -35071, -50555, -23912, 1449, 6616, 37802, 3564, -3585, -6031, 34900, 37367, 47888, 82615, 67180, 8095, -29990, -2842, 34185, 48078, 9454, -57413, -101364, -121902, -75404, -54142, -3428, 52667, 81093, 62488, 29464, 22749, 27656, -13438, -10611, -34127, -52244, -5199, -3388, -41444, -44722, -56250, -37045, -48547, -49326, -36299, -20581, -12467, 15568, 39505, 59975, 61136, 76726, 16648, -15848, -40592, -49349, -25776, -23740, -5327, -15998, -25653, -15785, 33528, 82864]
24672H2864m3655j5522o995K1558k5959k4278j5348j0384k7218O947K8553N0831
24660B1394l3030K74m5264j4653R5390O2738j3792J1349q21n609j5790j0165j1497
24647D0524p990J6887k1092j9223k1103p055L8393k2095k4173j0876K7119K9827
24635A9143j2460j5001M863J511j7914j2795K7320J6388K3677m849k8710J2568
24623A3741j855J5918n0187l9292L0318N6325m1396k864K2610M0155j285k7635
24611A4553j6577k2413K1487K712n082n354k8033j6169L0803N1444m426K544j108
24598B4381P923j4445l0877k7821N0268J8528M1876K0374j2201K174K9667k6192
24586H3655n0712l0581J4923k3368m0753j4575j824K1201j3947j8483M5982L1172
$$ y = [82864, 39209, 23687, 16692, 38250, 12291, -11987, -27335, -37719, -64937, -57990, -29437, 21394, -11636, -11362, -56626, -71279, 24111, 86849, 73057, 84406, 83585, 77976, 62186, 52021, 40524, 32534, 49421, 28329, 9106, -11997, -19052, 19341, -2754, -26927, -37803, -10684, 19143, 6683, -8318, -3455, -1944, -19858, -32653, -5333, 11055, 34732, 29883, 1173, 13741, 11886, 27804, -22383, -61675, -31357, 24968, -16428, -19292, 3318, 43473, 42188, 14553, -2024, -24437, -2950, -238, -5320, -10674, -38707, -54876, -24073, 27371, 22945, 25489, 24381, 32304, 17859, -13018, -40839, 9429, 27957, 69833, 90207, 78006, 80180, 109847, 83655, 32943, 2362, 17285, -6083, -46836, -61411, -63235, -42034, -55981, -74464, -28482, 2690]
24574B690l9311J6341m488j4060M3307K0262j1214L4171L9416k2603l8326j94
24562B5991o1445L617L5548K2814L1693j2733k2999L7509l4764n8891J6899J0762
24550e999m0691N8052K3402j5765o000J4480k6808N972M7354o858K375l8142m9654
24537c8282O40j1808L9033L8031j7625l8596J3015M0835K1695l2913j0999P31
24525C757O902N252l8185J0116j4806J2262j2283o421J2629n433J34K2403l475
24512g148k4535k4204L0406L5671M797K0028j0346O51K2122r301m334j4468m8269
24499b8930J4541K4283J0592l840J1050q636m922M9843o484k1077n2259K3480
24487G641K4908K495j3929m4860k3350J5108k1338J2084M1365J0556k7448R492
$$ y = [2690, -36621, -20280, -24768, -38828, 4479, 24741, 13527, 47698, 87114, 64511, 26185, 25991, -35454, -31837, 3711, 26525, 58218, 45485, 22486, 59995, 25231, -33660, -16761, -5999, -46690, 11362, 34764, 18999, 12999, 27479, 671, 6643, 53997, 47139, 49514, 11372, -38282, -37642, -49450, -10417, 27614, 9989, -28607, -15592, 25243, 46938, 14025, 3026, 3757, 10659, 15911, -22274, -12158, -26964, -14702, -26985, -33406, -20777, -26210, -26076, -3673, -7148, -31683, -55887, -25481, 10190, 14987, 35015, 24669, 25320, 47442, 38141, 33807, 19339, -28930, -14389, 9894, 20486, 16646, 27696, 19060, 14138, 63981, 57497, 36420, -15839, 7641, 32549, 35044, 21115, -23745, -47095, -31987, -53325, -41241, 124, 10680, -16768, -7276]
24475g276K3902l7311k3123J6517K4630J9445K3574j5222p970o129M839K5152
24463D1028k4029k5169K2866J1162K8354L435j8378l8138k1338j4921L8140M724
24451G736j1065J976j9637j8586K3329K6022K8141K6348J3944m4l3899l5741J701
24438A0225J251j3827k0530J8911M9420p365m5415j2525L6152M4942k0519p8655
24426c7935J3302j474k7947J7836K5686L3279l7890M8O621k6207J2791K6587j338
24413C359J3915j7168n866r620M014K2422j4460l5835j802J8410m6403l4998O126
24400i7906j944L7917J5824P1583M3649k6806k1003l5210J0323L6086J8950L1776
24388H3239J3442j177m2822k5846m5335q840J4362J6857k4594M278K9010l068
$$ y = [-7276, 16626, -20685, -43808, -27291, -2661, 16784, 40358, 25136, 17166, 11037, 15876, 41028, 16999, -8170, 14696, 25858, 54212, 57647, 39269, 1131, -20207, -35128, 3012, 7736, -3329, -1353, -20990, -39576, -16247, 9775, 37916, 64264, 78208, 78164, 44265, 8524, 10225, 11476, -2351, -22881, -3970, 45450, 38085, -7330, -19855, 16297, 61239, 40720, -37935, -24633, -26107, -54054, -36218, -10532, 22747, -15143, -15095, -8474, -34681, -21890, 4697, 3359, 17274, 106, -5760, -15380, -11366, 11056, -3404, -39239, -41041, -22631, -69034, -104032, -97906, -99850, -61933, -46109, 25474, 69123, 42317, 21314, -13896, -3573, 32513, 51463, 83239, 96681, 95504, 52682, 26836, -18499, -27339, -12977, 3880, -20714, -16436, 12574, 9506]
24376I506j9423L491l247l4101Q356J7659L622K6170L7707J8193j5603l7185k5873
24363a0728j7093l795K6598R979j2809l1921K4065N424j2427k932K4621J5744
24351A4726k8607Q173J6781j6168l6632M3557P325J7044o5247k0888J4139M65
24339d5332q703L3456n408m3638N4807J3264k1970m972M6885K1310k2509o6344
24327d9154j704K2444K4057q023j9M0216M411l826l1988o208J0901k0471N340
24314a4024O6171O708m529k3685N747k3719j4908K0177o8752l1542L8919L3887
24302i550P441K3128J0143j7995j4934j2104M0230l511J3440m0552m2472J1577
24290c5159M1129Q618l7137K8064O37k2488K1864N2903P341J300j6979K698k3112
$$ y = [9506, -9917, -6426, -9673, -43774, -35418, -17759, -14137, 12033, 49740, 67933, 52330, 15145, -10728, -27821, -31616, -5018, 4961, -7848, -39769, -15704, -10280, -22707, -25639, -1018, 14726, -13881, -5708, 11073, -5095, -41727, 1830, 9155, 26199, -39048, -59936, -45797, -45332, -54035, -20579, -25987, -69625, -14818, -1554, -23524, -28496, 18389, 39699, 17190, -49154, -50858, -28414, -4357, -12380, -12399, 27817, 32228, 28402, -3586, -9794, 1107, -19364, -14024, 52147, 58855, 54326, 30641, 36388, 12669, -2239, 17938, -50814, -82356, -43437, -9550, -2109, 21019, 31162, 13167, -1767, -13871, 26359, 22848, 36288, -4264, -46736, -35159, 5970, 14588, -22549, 5515, 6152, -16336, 5528, 58431, 65772, 67072, 50093, 52791, 29679]
24277B9679J116l6376k4904j8903N2670j7637L727J9731K2189k7454j3187M3555
24265C4206l8771k9478m5873O479K4784M5009q556J2536K3827Q006q232J2759
24253C6696J0263j1982k2205k1111j3856l191k4595l876o16K2295j617j7017J2147
24240c8665o253j5341J4529m898J7315K9085j3410j2564J9979O1640K221l4628
24228A9010n5329K2260J0017R518m149k6077J1497P28j0636j2694L9755K9390
24216C3290l784q338O681J188k854N280j137J139k1612l4272k451L965j6988j0285
24202e0178J5907M4536r733j8975j1807J5245k5400K8874K7650K2191j5096k3590
24190c76l242M4427J4215l4468l1949j4376o193M6787K0270J8273l977k687l3492
$$ y = [29679, 30795, -5581, -30485, -49388, 3282, -14355, -10628, 9103, 31292, 3838, -9349, 34206, -4565, -34043, -79916, -73437, -48653, -3644, -12200, 336, 24163, 32169, 23937, 36696, 46959, 34977, 12772, -8339, -22195, -25386, -49981, -53857, -54473, -32178, -33795, -50812, -38665, -44918, -60259, -45730, -50628, -33313, -4228, -17638, -30202, -10223, 51417, 53638, 19010, -36319, -14059, -4042, 5476, 1327, -24750, -13253, -12525, -23161, -35855, 3900, 33290, 29506, 21168, 27849, 29037, 26183, 31463, 30326, 31465, 9853, -24419, -26870, -22905, -39893, -50178, -34271, 10265, 532, -18443, -30250, -15005, -40405, -11531, 16119, 38310, 23214, -376, -3618, 40809, 55024, 20556, -11393, -25769, -31962, 14825, 35095, 53368, 49391, 46704, 13212]
24177A3212k2682P997K5147j8171l0926M4749J6676l0605m044J6688J3682l1010
24165G13l3587m0281K2935P719p392P522l328k8386K7468K7959L773r627p246
24152c1758j5055r431K5507J4839j2314K5981J4691l1135j7020L2849K1682J8427
24140C7263K841k2572J2410J6033j8730l6246k116n69q93J4477q35J0877j4421
24127b481l965P835k0530K1560j7462j8854K4274M2050L5772m6586m0199j7873
24115c6459J4601l6656m8577L9664N6820L8722j1767j5360j4086j3477L0918M1850
24103D6193Q579j8158q182k7844j3016K6939M3392O261k6545k5303R260P421j8385
24090A0612j1602J3014J548k9851k5226r411p094L710k3470K0655M1175K8009
$$ y = [13212, -9470, -1473, 23674, 5503, -25423, 19326, 36002, 5397, 1353, 18041, 31723, 713, -32874, -73155, -50220, -42501, -49893, -42371, -45699, -74085, -46617, -18658, -14885, -24512, -31758, -46813, -56244, -30737, -15898, -28212, -2231, 12460, -18675, -35695, -2846, 18836, 37263, 40104, 17532, 29942, 45975, 27245, -9001, -11117, -11686, -12579, 1898, 1063, 11940, -2481, -6446, 1389, -19141, 2419, -15043, -33897, -9623, 32427, 68199, 21613, -18586, -36459, -21858, -58514, -107091, -67427, -10607, 28115, 16348, 988, -13098, -26575, 4343, 46193, 54772, 36614, 28432, 588, -12428, 14511, 57903, 64164, 37619, 12316, 21576, 28997, 10612, -990, 12024, 13572, -16279, -41505, -50916, -58010, -54300, -77770, -57115, -15940, 12069]
24078A2069J6064M224L2706j5040k0899m5858m6016L0402L2571L8943j8917J338
24066B1587l8371l9298j5764L9412j7201k4849R405N06L6538M9290N444O498j1187
24053B2010L4938k5970p5235n1984m946R646N4201N2727J3325l1061o5771j2632
24041h0752K3370j0790J7918M4480M188R03k8419J7225k607N0683o393M81p808
24028B2479m0598j7726J0289J4089M7971L2036j1467L423M622K0025j9648k0533
24016D4962m8133k2262K9001k6338o698m4766J9482J0960N762O969j2293l34m736
24003d8424J9691N2141J6118p495N207l1544m8857p572M1035K481J319O155m3043
23990d2788j4300J6228j2661J6260K4311Q658J4683L522n7094k5067K212j3578
$$ y = [12069, 28133, 32357, 65063, 50023, 29124, -16734, -62750, -32348, 223, 39166, 20249, 21587, -16784, -56082, -71846, -32434, -49635, -74484, -65079, -64573, -28035, 21255, 26699, 33197, 22010, 56948, 30978, -44257, -96241, -101187, -91541, -37340, 15387, 28712, -2349, -68120, -80752, -57382, -68172, -50254, -5774, -1586, -683, -29102, -11877, -14484, 36199, 29806, 30287, 22479, -18119, -35845, -25556, -11467, 36504, 68540, 57073, 60496, 65118, 85143, 65495, 44962, -3171, -25433, 3568, -22770, -29468, -74234, -54752, -43792, -38030, -31061, -43354, -43688, -48424, -28733, 23408, 39526, 32031, 37238, 5694, -43163, -50735, -9700, -7219, -5900, 255, -42788, -57088, -40860, -53521, -37261, -12950, -4292, 10391, 13913, -43181, -68248, -66036, -79614]
23978g9614K9919M9747N567M945m81j4309R82j414o390L6016j4201o1152n829
23965e6214O499L5300J9786j4895p843J8027m890K6490P477k0160k9243M293r009
23952b4382M8047L4728Q588l7249l0056j3119j6784J825j3092J3939k1720K2957
23940b6318O841m2124J5321L9934M2203j9390l9829k6444j0181J5118n188k1602
23928g1659j0259J6694M0612K0036p131M1949J6304r040J342j0568j039R868j0453
23915B6656J3949J6660k7030j0552K1381k3910j5178j8874q74q247K0696P107
23903A784K726n1649k5733M728L1682J3590p952k3314L0682L1438L3804K5955
23891F7741m0169l1870r415j8507J4339k7734K361L0368K2611m537l3154k1748
$$ y = [-79614, -49695, 52, 5619, 10564, 10083, -4226, -3244, -4658, -11048, 24968, 10767, -50385, -56214, -49715, -14415, 5371, -9524, -17367, 660, -4230, 22260, 29737, 9577, -19666, -15373, -24382, 23665, 58393, 66981, 29732, -324, -13443, -30227, -28402, -41494, -27555, -49275, -26318, -19477, -61601, -46280, -6346, 35857, 16467, -23362, -49806, -59987, -44869, -50057, -71659, -81918, -65224, -24612, -4576, -11707, 30242, 46546, 37506, 38848, 28280, 27241, 37109, 26656, 40605, 57265, 30235, 19683, 41064, 17154, 1976, -16898, -17772, -26019, -5323, 1784, 4510, -47139, -72872, -68144, -36462, -22872, -30824, -54138, -23456, 7982, 41786, 67741, 27572, -4298, -13713, -32220, -17881, -45615, -43254, -12886, 9725, 5188, -27966, -49714]
23879d9714N5653L8445l1344m9875j1753M8751o721k3785K3886J6997j7328m698
23867a1486Q8J2589q02J2966N8723k7358n0870l5339K4340K8619q998m3590q478
23854d9596N3568r517P769k0670R988J8276j4576K6463j8978l5274m4975L3212
23842d4310K4770J3250Q796m2637k9062L6312K3032j1685m5891J1322p292K2056
23830d1339K7747K0961J590J626O56q071o071l3924n235K5315O003M2422k190
23817B9490l6416r295J5647K2220P720k7726m0894m6716Q067L1738P315J7122
23805b1728k3178M087o97J5372J8305r927J7789m1642l7360M0656N0400o377m3680
23792c7980j9940L4418J6295O604o651r704k2242o174L6561K6526n382k8417k7410
$$ y = [-49714, 5939, 44384, 13040, -36835, -48588, 163, -6558, -30343, -6457, 10540, -6788, -11486, -11398, 1191, 389, 13355, 72078, 44720, -6150, -41489, -17149, 11470, 2472, -41118, -49596, 3972, -5545, 2224, -18446, -8458, 9818, -4758, 21705, 2727, -32547, -77522, -44310, -19540, -6290, 2506, -40131, -69193, -32881, -9849, -21534, -67425, -56103, -63395, -41339, -13592, 7369, 8959, 10585, 11241, 3170, -2901, -36825, -42060, -16745, -10742, 31680, 29490, -6926, -16221, -574, 21646, 29366, 1640, -39254, -85970, -77903, -46165, -38850, -21728, -44906, -40819, -41516, -26144, -7839, -17766, 23, -41619, -78979, -38323, 12077, 5700, -37980, -57920, -23502, -7207, -603, -7254, -16958, -39200, -45374, -8813, 17713, 12331, -16086, -43496]
23779d3496L9496K7300q313r842P059L1573j2321l4442P045p670Q731j9161R70
23766a3071M3169L1701l4219P49J6928k115m7875l2614l2321K3551J4569j4454
23754d6002J7342L6028q023k9516L5974Q591J5298L8213R202l1137k9510k5645
23742i185k0455R114Q843q905m867j6046k7062k4507J5978P8630K0665J0151K4315
23729E6669J6398J5232n9291m4650j8130j2976K1931j0770l2104o37K9300O0147
23717B1119l8098M841O286L150l8763R758j3040q14J3740O585J1454k2861m3052
23704g9695L8563J2892m6600j1630J7655O0899Q2649j2299k7892M031K5736J643
23692F5952m4177k0042L5902N082O67j1699n0875k1787N0466M4701J0375m8632
$$ y = [-43496, -4000, 23300, 14987, 5145, 12204, 43777, 31456, -2986, 4059, -3611, 5120, -14041, -13071, 30098, 61799, 27580, 28329, 45257, 43142, -4733, -37347, -69668, -46117, -31548, -46002, -28660, 7368, -655, -30171, 5803, 14394, 29692, 67905, 77107, 45970, 16460, -9185, -29640, -20526, -11683, -20588, -25455, -41501, -68563, -93070, -77092, 1538, 22203, 32354, 56669, 73067, 88299, 29008, -15642, -33772, -46748, -24817, -35587, -67691, -68328, -39028, 21119, -16979, -12138, -5852, -2702, -41465, -31707, -44747, -45561, -31821, -25236, -13782, -36643, -79695, -41132, -28240, -74840, -86470, -68815, -7916, 74733, 62434, 34542, 38573, 64309, 65952, 21775, 1733, 37635, 42717, 43384, 31685, -19190, -40977, 9489, 54190, 64565, 15933]
23680A5933k3663J231q919K2682J3246m2279k6555J6492l3972l0417O0024K0014
23668a6183J6264k4246m0425L094M7625N828o1574J2223K1329J707L0482j548
23656e424M77l1596l3552j962N8528M9934j8992K228N013K0283j9846j5261K815
23643A2645j0131R528k2422k5799N120J1008k639J3544j584j7593J3877K8767
23631A4321L024L3158j3409o1359K3086q01P866J055l902J7796o078R059k314
23618B1502r22p738q918j9923n294Q112K4564J0175P956K4299r684l1688k2025
23605i584m1407l8022Q6047Q7017k4859j1199N10l3918j6660l999j240P03M0168
23592C3557M7976k5969p1301K7927M2447l3668m4876r294l456L8300J5510r037
$$ y = [15933, -7730, -6499, -15418, 7264, 20510, -21769, -48324, -31832, -65804, -96221, -36197, -16183, 81, -24165, -64590, -61496, -13871, -8043, -69617, -57394, -36065, -34358, -3876, -5424, -4947, -36543, -70095, -72057, -13529, 36405, 17413, 19641, 24654, 44937, 25091, 9830, 12645, 2514, 12042, -10380, -36179, -31059, -20051, -22690, -9146, -10730, -28323, -14446, 14321, 17345, 50503, 37094, -24265, -1179, -1980, 5886, 6941, 3039, 20835, 14757, 23816, 21502, 20580, 12842, 3924, -15999, -21293, -13181, 11383, 21558, 29514, 53813, 44129, 12441, -9584, -50991, -89013, -2966, 84051, 59192, 47993, 48503, 14585, -2075, -6074, -7314, -6611, 33557, 81533, 55564, -15737, 12190, 54637, 20969, -23907, -33201, -36657, 1643, 17153, 8116]
23580H116L1948L8024j7634j5039L346j9093k6096n3452m4600L0139N7282K6369
23568A9310J0452j1407o436k4127j2004L1011K149l9428L5106O3531m290o1944
23556A923k3144P180K8257K7361k7797j8855M4902K1911l4094l3594l2341K870
23544c5421l621L9056L1478k2745k2054J1394k3539m6408j4408M0708K4180J731
23532a9649J3123l675p0496k5887R969K3477L5240J4139k7283j2205L8829K4930
23520E12J7099k7695k8644k8515Q897L2922J3684J0658L1065K6982l5431m7428
23508b5894R356J2596m409l535K7830j126Q925L5817P975Q052J9274n205k480
23495H7176m3166j7695k7556n1490Q885L2836k730K9879J9055l201k5371k097
$$ y = [8116, 40064, 78088, 60454, 45415, 48761, 29668, 3572, -49880, -94480, -64341, -7059, 19310, 29762, 18355, 11919, -12208, -24212, 6799, 8948, -30480, 4626, 68157, 63867, 1923, -21221, -14041, 14216, 41577, 13780, -5075, 39827, 61738, 27644, -5950, -38291, -35421, -39042, 14, 31492, 8747, -13307, -1913, -25452, -71860, -86268, -45560, -21380, -19649, -6526, -10201, -80697, -106584, -96615, -73138, -37898, -23759, -51042, -63247, -24418, 512, 17611, -10084, -38728, -67243, -58346, -25424, -11740, -1082, 29983, 56965, 21534, -25894, -16538, -3942, -8351, -11886, 15944, 14818, 23743, 59560, 67535, 75587, 94861, 89656, 87176, 44010, 26315, -1241, -52731, -43846, -11010, -13740, 16139, 35194, 31993, 6622, 4525]
23483D525l872j9160K8174N3555N360m0458l3621L388r145q797k3181j618M4531
23470c19q468k3280j7415j2724J9363P870j5871J8547q406L2246p299l1096n853
23457e2705J217M894L3409M1961K3844l0367l9131l8985j3528K3566N171l78J0211
23444c0821K4583r680j4740L9322K6834R821j0084k0220R103L0152k4029o1152
23432c0911j9969p312J9070N2545M2322m1234n6446l0828l236O988K6975N1883
23420I847k4419q985J3613K603J1916Q92k0731j2941J0524L493k2308L4841R861
23407H206J7858J6425k1849k0981l4885j7205j2672J5146K2508J6054N961p40
23395f174j8088J1838L7995m700l6873k616k127L2700J8779j2191J59n462M4125
$$ y = [4525, 653, -18507, 9667, 63222, 68582, 28124, -5497, -2109, -11254, -20051, -43232, -44850, -319, -8787, -32067, -49482, -62206, -42843, -34973, -50844, -32297, -40703, -8457, -15756, -46852, -52705, -51488, -46594, -13185, 28776, 52620, 22253, -16878, -55863, -69391, -45825, -40654, -41032, -30821, -6238, -15918, -30658, 8664, 35498, 45319, 35235, 15015, 24118, 54270, 30241, -30911, -50880, -58192, -39122, 13423, 55745, 14511, -41935, -72763, -75999, -69011, -42036, 9847, -14572, -23557, -9944, -7341, 4575, 5467, -15264, -28205, -17681, -14188, -36496, -1655, 8206, 26064, 42489, 20640, -341, -35226, -52431, -65103, -49957, -27449, -11395, -5434, -6174, -24262, -12424, 25571, 20871, -16002, -18618, -20745, 11955, 30734, 18543, 18702, 13240, 57365]
23382E7365j0131k8624k9701l600K0254j8029M634P549j997l3809k5447l5861
23370i7397K8990k4322J8443L7119j6960k228K6383L5092q442M924O589J933m5082
23357c4958r431k5177K7549N2420R131k4935j5851R908j4304L4314K4731n3383
23345a9986l0355k763P562o614j6497K2629K0732J9905j4200j108R287m4010k3630
23332g9048L3343J3697O484K7927L592L3168L1260j1272l1355k5628k9751P343
23320b0240Q697k646N396K6136j7047l6687J2598K4496L4735j658r769m3166M4122
23307B4967L7886m0799k2923J6691k5534j7186L1274L810Q561l8565Q597L2900
23295A9679M8341J1720j0558k0959o4637k538M738L8448J1420L834n116k8066
$$ y = [57365, 47234, 18610, -11091, -14691, 5563, -12466, -7832, -283, -2280, -36089, -61536, -97397, -68407, -92729, -74286, -37167, -54127, -56355, -29972, 5120, -3322, 1602, 8191, 10124, -34958, -44389, -69566, -42017, 10403, 19534, -5401, -21252, -11344, -25648, 8666, 33397, -19986, -50341, -53104, -45542, -52156, -68653, -46024, -25292, -5387, -19587, -20695, -11408, -55418, -79048, -45705, -32008, -25524, 2403, 5995, 39163, 70423, 59151, 27796, 2168, -27583, -20240, -11543, -14189, -8793, 17343, 296, -36391, -23793, 703, 35438, 33780, 24011, -19155, 24967, 62853, 22054, -869, 15822, -9712, -26898, 4376, 8186, 16747, -21818, -13221, 19679, 68020, 79740, 69182, 48223, -16414, -18952, -14214, 24234, 35654, 39488, 34372, 6306]
23283F306l9366k1430J9726L6512J5698j9898K0858J1196k5792l581L4341l534
23271C1036l5276l5014L7319l223j4262l322J4513J7279L0773j6129l8541l2765
23259d7612l882j7818J803M035K5126K1341j3428l8763J7457J4763Q635m721J1727
23246b1337K0784k048J0838r860q890j299K0040L8693j8185m5445J2155N2936
23234D8382k6730J78K3741O581q779j1296n3301j0851l161j9416L96L3274M2638
23221B1656L9320l2679n815Q751l345l70p3334j8389M1459L5778L0081Q61Q80
23208D4854K189m2714j3341K5698k4158n97K4545q678J1929r859j8276J7451O279
23195A5322j6807R121J4188j4551k3736J465k210o486K880l0396R851k215J4964
$$ y = [6306, -33060, -54490, -34764, 1748, 17446, -2452, 18406, 29602, 3810, 229, 34570, 31036, -4240, -39254, -1935, -5158, -19420, -22742, -8229, 9050, 39823, 23694, -14847, -47612, -51494, -69312, -67509, -63474, -38348, -17007, -30435, -69198, -51741, -36978, -28343, -33064, -21337, -553, -2601, 8237, -1623, -10513, -11812, 8228, 46921, 28736, -16709, -4554, 48382, 21652, 21830, 45571, 52152, 43373, 32077, -21224, -32075, -35236, -54652, -54256, -20982, 21656, 60976, 28297, 22482, 31233, 27888, 27518, -45816, -64205, -22746, 13032, 43113, 43974, 44854, 47043, 4329, -9012, 16686, -7472, -8069, 16476, 7798, 19727, 9868, -8408, 9043, 15322, -1485, 7636, 21824, 7273, -16463, -14998, -17208, -23694, -20814, -51210, -41359, -43574, -28610]
23182b8610L0517N551n2247m7183J652k4387J0250M5962L6989J2946k1950J8531
23170a1979R847o754j4904k4211n211L5980J0787N6770J4327j3337j5250m935
23158C1130M774O630k5634n4658N830K8625L6647J186N898O196p905k8619n4609
23145d4509j574J6884o841K0906K597J7498m186j5911K6288N6182n748k3388P449
23132D5647l6821J2587N229j7674j9423J9293l0048l0401K4836K4813K736j363
23120e89j270L3585O611P283L7168J8359l7501r517N402J1986n8266j3828J0581
23107A0004j0596l5319q925M2400J7820l0196l0298m530N158K687J364J2796L4840
23094G205J0328k7630o738k4321J0675O3486K6229L00n1580n3076j6888J6707
$$ y = [-28610, 1907, 7458, -44789, -91972, -90320, -114707, -104457, -58495, -21506, -8560, -30510, -11979, -2132, -8886, -23790, -48001, -53212, -17232, -6445, 50325, 64652, 51315, 36065, 31130, 35904, 42534, 16900, -37758, -31928, -3303, 33344, 34530, 40428, 46624, 38719, 10100, -44509, -46083, -29199, -36040, -15134, -12537, 4961, 775, -15136, 11152, 67334, 61586, 38198, 45647, 8826, 21413, 26642, 8968, -10455, 8838, -21210, -51611, -26775, -1962, 774, -589, -1859, 31726, 38337, 45620, 82788, 101147, 63646, 54129, 59531, 71517, 13251, -577, 10004, -592, -35911, -44836, -2436, 15384, -14812, -45110, -49640, -44482, -41795, -40431, -27635, 7205, 17533, -10097, -16835, -41156, -30481, 33005, 59234, 59534, 7954, -45122, -62010, -45303]
23082d5303l436N213j126K4222M3837k3120k4180Q947J2836Q13k8167j6809n361
23069e1634l796Q651k2877K9508J7542k033k6366j5891r69K6052k2191q75K5502
23056c9377k1450k862K3425Q914L7603J1181m245m86l5157p017n682j9187K6502
23043b7838j0711L4839o169J3089k1856q989M0934J1153J9541l7715m7984K0771
23031b0935j6070j4596L3938k2767m3409Q43K7463j3558O3686M5906j644k7730
23019A1127j1526o958p47J8869q196L039K3172k3937o54r426q993k711n611J3331
23005i221l119o284Q39N013J9683j9051k2833O4193l37n8722k3628M524J077P977
22991c9889L2934l8767m8340J6460P0769N5878O19k1046l5329k3624N531M2286
$$ y = [-45303, -48739, -43526, -44652, -20430, 23407, 287, -23893, -14946, -2110, -1297, -29464, -46273, -51634, -55430, -46779, -69656, -40148, -22606, -24639, -51005, -66896, -67865, -41813, -64004, -64879, -39377, -60827, -63689, -40264, -31350, 6253, 17434, 13189, 12703, -22454, -29471, -35153, -54340, -27838, -38549, -3710, -9879, 3210, -18646, -27635, 13299, 24452, 43993, 6278, -41706, -20935, -37005, -51601, -17663, -40430, -83839, -82996, -55533, -69091, -5405, 40501, 38857, 11127, -399, -7357, -8104, 10765, 2569, 5608, 28780, 4843, 4189, -5237, -14230, -16941, -22552, -9221, -12340, -18624, -17785, -12772, 6911, -12140, -34973, 29220, 28883, -29839, -53467, -48943, -47866, -39889, -6955, -45722, -94062, -77602, -6833, 49045, 49664, 28618, -6711, -30335, -24804, 17482]
22979A7482q801j9702m0461l9945J7146J5314M7379k86j4526j3361K428L3073
22967d260K7685l9674j7160j609N553J5760K027J9174n504k3385K3207L0727m757
22954B7784l2548L14K9257r368m0320K561j656k9994k499K0487K1867R148J0905
22941E938j9336K6583n372J386j1068k4147q474J894J0956N117k2869K568p990
22928d4814J7912L2622J7035N967J0852j9905l6157k246J9773l5451j1018L0602
22916a4828m332M883j7081r467K5436M613p429O277N2341R58O700k7524l8366
22903a7819P415K0460L3107j6810j3587k8383l0921O651j993q936L1574J6978
22891b264J3854l5256N930J2795M069j2468L427m809L8066l5650J6914J3052j2504
$$ y = [17482, 8681, -11021, -51482, -91427, -74281, -58967, -11588, -11874, -26400, -39761, -37333, -4260, 23425, -16249, -33409, -35018, -29465, -13705, -11678, 7496, 1992, -21393, 1814, 32541, 27784, -4764, -4450, 24807, 15439, -24881, -22320, -23976, -53970, -56469, -35982, -14115, -4967, 5938, -13398, 13185, 7813, 9199, -1869, -26016, -34490, -32596, -21640, -16523, -39392, -36824, -44814, -26902, 5720, 22755, 28722, 39574, 19669, -16488, -18734, 1039, -34412, -45430, -14828, -19160, -14277, -31358, -40825, -15389, -10776, -18205, -11928, 40413, 41371, 48071, 20547, -17819, -10404, 10056, 43163, 26353, 12766, -15617, -46538, -39887, -41880, -50816, -19242, -2264, 11590, -23666, -17736, -4941, -872, -13340, -9913, -14722, 23344, -12306, 4608, 17660, 5156]
22878E156k493n965m0353J579J1102j1648l786K4448j0504K1628J9859J7705j6721
22865A0007j0978K3216N619j2898R090M027l316l0371J1291J9912M2231j8111
22853D9719l5536k6601R144L8415O030J1309j1276n2084J0904N512l8108j0436
22841d3008O3285M2250k118j6513k3720l9642P421N3106j397k4371k152j696K3394
22828C4839m979j0075j5737n345j0147j3176r924J5773K7578J5307J2737n580
22816C1271K434l8852j2079j3134L1655K8909J4163k5974j5056o606l982j4173
22804b1424R353j3352l0381M0170L1760J6183O677j9223l2296R166j9959j8566
22792d1892J2671N143j6575M100J0079K7892k5053r9971j2131L8035J895O951
$$ y = [5156, 2663, -3302, -43655, -42076, -30974, -42622, -46408, -21960, -32464, -10836, 9023, 26728, 10007, -971, 22245, 27864, 14966, 24056, 28083, 24767, -5604, 5687, 25599, 67830, 49719, 14183, -12418, -3274, 35141, 41171, 52480, 41204, -10880, 24, 5536, -32572, -43008, 20277, 62527, 60409, 43896, 20176, -19466, -12045, 41061, 39664, 15293, 13141, 11445, 34839, 29860, 19785, 4048, -1297, -11444, -24620, -34544, -18771, 8807, 24114, 36851, 31271, 33705, -5147, -17226, -30360, 1295, 30204, 44367, 18393, 3337, -3269, -7251, -21424, -12071, -25423, -55804, -15634, 16126, 32309, 38986, 19763, -12533, -3367, -23326, -41892, -29221, -24078, -40653, -36553, -26474, 1418, -23635, -123606, -135737, -97702, -95807, -88856]
22780h8856K6266K5R533M9357L4582R962k0087J1382j4753n4998j5456K2279o373
22767c7137j7946J5707m506j5910J4954P582K548j6490L9728L5225K3796l6626
22755A0925K3779j0667k4396O188J8608k1257k1229M7611J0324m5903J0645K682
22743G310P438k3577j3411l6168K6405O618K5447J4917Q398j2995j9177R861L1592
22730C2658j822k50J86j5336m4000k0968j3591k8798L6709J5943l491q803M0855
22717a0708K1133K4579P257j4465j9352k4127l4047j5665m477M8322N2322n465
22705B5307l8614o3907l577R397M0750J969k1728J4984K4744K6735n349m9738
22693c9027o510j6600n338L3932j3750J688k5607R284O0647L5781J655K1791m408
$$ y = [-88856, -62590, -62565, -53032, -3675, 30907, 40869, 20782, 32164, 17411, -37587, -53043, -30764, -37137, -55083, -39376, -43882, -59792, -44838, -37256, -34708, -51198, -11470, 23755, 47551, 10925, 34704, 24037, -359, 5829, 24437, 3180, -18049, 29562, 39886, -6017, 4628, 7310, 14748, -8829, -22240, -58408, -32003, -25385, 62, 14979, 23377, 10382, -8795, 1066, 32658, 30836, 30586, 30772, 15436, -28564, -49532, -63123, -91921, -55212, -39269, -42760, -51563, -10708, 10425, 35004, 42261, 27796, 8444, -15683, -49730, -65395, -69872, -21550, 30772, 25307, -13307, -77214, -80791, -71394, -30644, -28675, -50403, -35419, -10675, 16060, 10711, -39027, -45537, -62137, -67475, -33543, -47293, -45605, -71212, -61928, -1281, 34500, 36155, 57946, 53538]
22680E3538O741k5255j3559k9187p6118L640K2027J6581J6740M0152K6113k6122
22668A5291n8033j672L2256K5326j0744l600K1711j8347j0623K1202j7606j3685
22656a8524l959n670L812J7537r511k2514k7327P712M6598K2032k4026k6197K3547
22643a6490M514k4665j8851K9094K2497n268j9803M6621M6070l73j9946n3964
22631a0564j7749J0807j361P417l0426j838K9884n800j5490M1014m612k2644N297
22618a6065Q903n049o306J0417o789k1372L0887o559R05J7451J8900j5491j2564
22605b732P517j3869M932K1686R501k7896j3386K1205K6463K2431j148p5935k3620
22592d4851L7692m804n3649m1618J7344M9795J6209K9682l7731l9632K2145L7084
$$ y = [53538, 60279, 35024, 21465, -7722, -83840, -80200, -58173, -41592, -24852, 15300, 41413, 15291, -42742, -44414, -12158, 13168, 2424, -1176, 20535, 2188, -8435, 12767, -4839, -18524, -22483, -28153, -24341, -6804, -16315, -38829, -66156, -58444, -11846, 10186, -13840, -40037, -16490, -11976, -36641, -55492, -26398, -3901, -9169, -28972, 17649, 63719, 63346, 43400, -10564, -28313, -17506, -18867, -11450, -41876, -43714, -13830, -19630, -35120, 5894, 1282, -21362, -16065, -7162, -12211, -18517, -8100, -14889, -36261, -5374, -11933, -11028, 6423, 25323, 9832, -2732, 4785, -9084, -4152, 17534, 27035, -861, -14247, 6958, 33421, 55852, 54704, -21231, -44851, -7159, -11963, -65612, -107230, -89886, -40091, -23882, 5800, -31931, -71563, -49418, -12334]
22580a2334M8667q519k1828m8246l5859L3681J7756L3252K8539R787R011k9396
22568B4511J003o1296j5819L5596M7360K3406k5557n832j2801j1664k928L821
22556b00R323K601k6799j9628K0741r487L211j0543P349J4595K1764M8727l6160
22543B5494l9527J1230P895l8354M0061K0320j5765J51o186j092r224k0369K4843
22530e23K6052j4036Q312J907l1091J9197N7712q844P682m8265l2170k3040L4070
22517c037K1399j5102r178M450k8595N523J9557l1719l29J3087N854K5443J7250
22504B4603q299k0614K8461J9899j5635r688r445r210Q13m752j2060R003j5131
22491b2055l3136l7252J7175K1253N9166J4242k686q0174l030q99J2605J4154
$$ y = [-12334, 36333, 27814, 5986, -42260, -78119, -44438, -26682, 6570, 35109, 44896, 53907, 24511, 25514, -35782, -51601, -16005, 31355, 54761, 29204, 23372, 10571, -1093, -4021, -200, 9123, 11724, -15075, -34703, -13962, -23449, -20238, -30781, -23432, -8837, 12927, 61654, 25494, -14033, -2803, 5092, -33262, 6799, 27119, 11354, 11505, 5319, 4227, -4997, -25366, -523, 25529, 11493, 19805, 21712, -9379, 9818, 67530, 58686, 66368, 18103, -14067, -37107, -3037, 18362, 3260, -5918, -1468, -30063, -24540, -4983, -36702, -37031, -23944, -18090, 7353, 24603, 16304, -4310, 24151, 44050, 28415, 18727, 9282, 72, 885, -3867, -15927, -6924, -22055, -55191, -92443, -75268, -54015, 5151, 19393, 16707, -63467, -66497, -67396, -54791, -40637]
22479d0637J3398K7164J0781j0187l5830M3976O0834l0626k4926K3211o415o2317
22467c1574j6913M1919M2575K1022k22j3073k1343L5058k4645k0130k8933l3491
22455d9750J4585K4556K7935Q507j0233K31L2802O94j8379l3675l9075J7042K9985
22442E225m067j4013J8403O283K2915l0164l0749J0085j035R567L2698K2861J5275
22429F3284k9083j6196P079j5537k4475l2215l2726J0033K9082L1246J7833n6951
22417d8626l9068o915J7281J7119J9711N574p468K0606j3519J0830R484K4920
22405I929K6301p3110m6937L8765K4329K2043K925l595n339q5212k5622L5640
22393g9883O3114J5968K4804L6693j8433k3479M540K0411J1956m3765k3062j4723
$$ y = [-40637, -27239, -75, 10706, 519, -35311, 8665, 69499, 38873, 13947, 37158, 30743, -31574, -48487, -6568, 36007, 57029, 56807, 43734, 22391, 57449, 32804, 12674, -16259, -49750, -35165, -10609, 17326, 25833, 15600, 15831, 48633, 49327, 30948, -2727, -41802, -24760, 5225, 1158, -12855, 5548, 11831, 34746, 4582, -26167, -16082, -17117, -7550, 25148, 48009, 63284, 34201, 18005, 25084, 9547, -14928, -47143, -79869, -69836, -40754, -9508, 8325, -48626, -87694, -94609, -77328, -60209, -40498, -34924, -42392, -21786, -35305, -24475, -14991, 9929, 36230, -36880, -83817, -45052, -20723, 1320, 4245, 650, -4689, -89901, -115523, -79883, -16769, -801, 24003, 60696, 42263, 18784, 23324, 43735, 55691, 11926, -11136, -25859]
22381b5859n0536N0770M0006k6299l7207P787M929k4249M1689K1670K148J2819
22369A7668j7751l6283k753K0113o544k2453p447p290k6381L4398L2638O2851
22357D0766j575m8894l0439K7700M6402k665R547P794l563j6903l1994O100j590
22344F86l2905K9133m704n847l6508P915J6674r902J0466L9095K2149n5225l3810
22331e2783l4958k1650M1689M4301L1172r74r968n978J4770J411l4056K2173M345
22318e06k2178o593L6485j221k1310k5671K5551L0718J2197P868J1648K4532k4392
22305D7128k054p13L0437k3453k7885J675N947l6669j4193K884k199o0559J931
22292g7723J3508K9009L7097j988J939L9608J7572l4003k0684k6167l3992N8977
$$ y = [-25859, -76395, -25625, 14381, -11918, -49125, -41338, -36409, -60658, -18969, 2701, 4849, 17668, -83, -36366, -39119, -19006, -25550, -48003, -55450, -62740, -89121, -54723, -22085, 40766, 39191, -9703, -40142, -12442, 33960, 31295, 40842, 48636, 45073, 28170, -3824, 2276, 686, -32219, -3086, -7790, -13637, -50145, -42230, -25556, -35458, -24992, 14103, 36252, -18973, -52783, -87741, -109391, -67702, -23401, 7771, 6797, -3171, -9149, 5621, 7032, -27024, -4851, -506, -22684, -29277, 7208, 5987, -15323, -40994, -15443, 15275, 27472, 35340, 46988, 71520, 47128, 45074, 44361, 74798, 51345, 23460, 25135, 31082, -5587, -19780, -16896, -19095, -79654, -77723, -64215, -35206, 1891, -97, 1842, 41450, 59022, 25019, 4335, -21832, -55824, 3153]
22280C153K9284m8529k8695J2589K7545K8992K0949K925j4441k9267J6610J2504
22268C3619k7967n9148p756L1828J2756M3131l2118j6616k811Q938L361o725m3364
22255f2872m147M7609K3236j1739K0051J6258J133k4599R5p289j0979M1400k7713
22242D44j1745N915J0148p911L7295P7304n1090m5590k554J1626r083K8496O566
22229D9821q181l5449j7564j514M6477J7333k7723m9091J1122J2789l2082k4132
22217e8194L5979J8830r622m7114j5282M9030O786l3886k5993J2675j6362J3070
22205g0083j8900K1791P5474M0265k0890K1390N072k43j4902K1583o995l2865
22193B0697J2581K887N343J3417k7145k0851j9640R732j5941l1277j4604j5382
$$ y = [3153, 32437, -16092, -44787, -32198, -4653, 24339, 45288, 48213, 33772, 4505, 21115, 33619, 5652, -53496, -61252, -29424, -16668, 26463, -5655, -22271, -25082, -16144, -12783, -19508, -62872, -67019, -19410, 3826, -7913, 12138, 28396, 29529, 4930, 5025, -2264, -13243, 28157, 444, -11301, -5386, 4762, -3149, 34146, 111450, 60360, 14770, 12216, 23842, 14759, 43255, 49821, 41640, 6191, -11373, -12887, 33590, 50923, 23200, -25891, -14769, -1980, -34062, -58194, -22215, -3385, -13007, -60121, -75403, -26373, -19587, -53473, -79466, -66791, -83153, -70083, -88983, -67192, 8282, 48547, 27657, 49047, 54119, 53876, 38974, 60557, 53562, 20697, 33278, 36165, 41508, 54925, 27780, 6929, -12711, -2979, -18920, -50197, -64801, -80183]
22181h0183L6504m874p197J1002Q153J2388K3079J3444J7693k4592k3948K2951
22169D420R774l3843l2730R438K2643L7844N14n1234l0466K1477R366L941M6673
22156A7817J4502J9169J693j1219K0480l4869k1992j5266J6452K8364n2461l4146
22144e1476q356j0275K7862J3385l5700q813O1262j377m1013N777M0294J4049
22132E619K07j4760m8271k8932J6516O1783L3088o0819k4128M23M4183r804k3711
22119d8606K1133L865K8210l710L217J2713k700k596J8460k9173k8380N920Q2756
22106F1109K2859o3460j5655J1853m873R970m919k0325N6593J4472n3817k4298
22094a0491j5983j2647o531K1519L5904J2041k7595N06k9292j4427j746P096J3612
$$ y = [-80183, -43679, -48553, -55750, -44748, -36595, -24207, -1128, 12316, 30009, 5417, -18531, 4420, 14194, -19649, -52379, -42941, -20298, 17546, 18060, -33174, -63640, -42163, -32797, -28856, 17817, 32319, 51488, 53181, 41962, 62442, 27573, 5581, -9685, 6767, 35131, -17330, -51476, -59832, -70107, -42245, -28860, -64560, -73373, -12111, -13488, -54501, -48724, -8430, 5619, 5826, -8934, -57205, -86137, -69621, -7838, 25250, -35569, -59697, -59274, -15091, -24895, -48606, -27473, -23608, 4602, 892, 4109, 16822, 14122, 11526, 29986, 813, -27567, -21647, 61109, 83968, 20508, 4853, 16706, 11833, 21803, 16884, -3441, 53152, 67624, 13807, -10491, -26474, -39121, -45652, -24133, 11771, 23812, -3783, -3277, -32569, -46996, -48742, -41646, -28034]
22081b8034R421J0364m907M5347j1459j9846K3095L2010o711k2754k3653J8007
22069B0880J0011j6263p7376K7789L5365K111k2667K3845J0813l6737J4729K9725
22057B2225k6512q979L9309m0140l0612k190n171o14L4646R844M4191J2958m4010
22044D945P266M9372j7444j0233j4180J3335m547R393k9662l1307k8963k2111
22032g4136J9427J0705L4929L8738j3051Q666j788J445j1847J4469L0151j2757
22020D4951j1172L029m6190j4117j174l594M461J9869L2300L3706k7082l5960
22008i73l6650J3517Q632O041j3700R898L1883K1764k3893m0158P799O3263K2889
21995G0312l1430p478j5599K917n054p711J860l1759m5166k0497J5741L0434K9005
$$ y = [-28034, -18613, -8249, -13156, 32191, 20732, 886, 23981, 55991, 49280, 26526, 2873, 20880, 30891, 14628, -62748, -34959, 406, 2517, -20150, 3695, 14508, -22229, -7500, 22225, -4287, -13266, 26043, -14097, -44709, -46899, -52070, -52684, -18038, -8194, 35997, 48955, 4945, 12211, 61583, 44139, 33906, 19726, 33061, 28514, 37907, 8245, -23062, -52025, -74136, -54709, -44004, -9075, 29663, 16612, 25278, 23490, 24935, 13088, 27557, 57708, 44951, 33779, 36808, -9382, -23499, -24673, -28267, -23806, -3937, 28363, 62069, 34987, -973, -37623, -24106, -15474, -9433, -23133, -13235, 18648, 40412, 16519, -23639, -15840, 47423, 70312, 38882, 31404, 15805, 18722, 13668, 5957, 7817, -23942, -69108, -89605, -73864, -43430, -14425]
21982a4425j4903P60J3536q850J7342k8738l4510L464q90J5895j289J6220J4879
21969b1509M402K7834O986k4533j4706J579J8414L5476J3001n388r859l2375k1570
21956b2248O440N1925j6060j8906R64K6476j9538l1441K0142O774O771K1160J4924
21943D7383j2503j7831j0477o551j5922O379l1645m023j4992J8473N4190k8333
21931a5852m1568M5727O924K0361J6428M696Q281K8081j7299j8855p863k158l849
21918B3054l411L714J600J8340J6411k197k9753J1562l580q078J2940L1123m517
21905F7208m9268k3388k178m92K2364O550j3363j551k1905n518M0937L5963j2264
21892D3095k0076o016l9029j1571J7352K7036j2307n582K2246M1169j2426l3405
$$ y = [-14425, -29328, -28568, -15032, -23882, -6540, -35278, -69788, -66324, -67214, -51319, -52608, -36388, -21509, -17107, 10727, 17713, -6820, -21526, -19947, -1533, 33943, 46944, 41556, 31697, -678, -22248, -15808, 36117, 20057, 1151, 2115, 28591, 9053, -22388, -2246, 4528, 11299, 32459, 47383, 34880, 17049, 6572, 21, -15901, -9522, -41167, -45190, -60182, -41709, 12481, -15852, -57420, -11693, -4769, 15592, 32020, 36716, 44997, 73078, 55779, 36924, 29061, 26903, 23054, 19643, 23357, 24957, 43297, 59708, 57511, 27758, 39320, 35740, 27662, 40602, 71725, 67208, 17940, -5448, -7626, -8118, 14246, 20796, 7433, 5882, -16023, -21541, 19396, 55359, 43095, 23019, 17003, -22026, -33597, -16245, 10791, -1516, -7098, 15148, 56317, 43891, 10486]
21880A0486p084j4064m844K2099J4278Q313J3936l8031r563l6654k178K0027K2333
21867i46j2376p513J3449L3803K7544R561j5942l6832O037J0412L7979J4252j4728
21854F4700j4594j1102o231l438K3527K4991n902m2930l3232K6951J4664l76l1149
21841E879k7069j0590Q954L5923k8089j5279J9358P955j2672q310qj9658K5006
21828a8600L2387M1752N907M34n4381o2962l551M4258o721O148K1361j191K9741
21815C4582l998l5779m0401K9452J4143k320J4844j2720j0478J5934N5963N1173
21803A10395l5825l9647k7761k233J1417m538j1147q637L8877J1382j6579j2940
21791A2764J4482J1123L5891L299n1185j2729J3914m4911j1411Q008J7524m854
$$ y = [10486, 3402, -10662, -15506, 6593, 20871, 29184, 43120, 5089, -4474, -41128, -43306, -23279, -946, -13322, -20835, -7386, 26417, 53961, 63522, 47580, 10748, 16785, 27197, 65176, 79428, 64700, 50106, 39004, 32773, 29335, 52862, 77853, 71951, 29021, -4211, 22740, 37404, 37028, 5879, -21190, -31780, -22826, 13097, -14992, -30271, -10913, -2958, -15630, -23940, -23948, -43606, -18600, 13787, 55539, 61446, 61880, 7499, -55463, -59014, -14756, -21477, -15329, 6032, 4841, 34582, 30584, -5195, -45596, -16144, -2001, -4321, 10523, -2197, -12675, 3259, 59222, 110395, 74570, 34923, 7162, 4929, 16346, 11808, 661, -7976, 30901, 42283, 25704, 12764, 27246, 38369, 74260, 77559, 26374, 13645, 27559, -17352, -28763, -20755, -3231, -8085]
21779h085J2220K3092m1601j1613L4242m334j6539k03J5282k473R173k0869K4823
21766A3115K7647J5075l1446m2165J0416j4793J6452P638q173j2412k070O552
21754a4164m3390j654K4748r726K2401L0876K3906n65k2775N267j5391j2131j1523
21741b4121N2588J6125j6706j3539K836R681k3032J168k8785p680j33o959K2279
21728a6278L9761J737k7004j4598r105J9726Q022M1380l0011k1806J1397j2993
21716i772m2911l2595K0821O3161L8537R659k4824k323j6026l1448o865l5540
21704g0126O735M3850J2796K1096L6693K2930j755n1541m5589l4111J515P3867
21692A6360J3284Q726M18j3467k0077k3231J7332J9941J0014k7855j0188j4422
$$ y = [-8085, 4135, 27227, -14374, -25987, 8255, 3921, -12618, -12821, 2461, -12, 9161, -11708, 13115, 40762, 55837, 24391, -17774, -7358, -22151, -5699, 1939, -6234, -18646, -20716, -14164, -57554, -59208, -34460, -44186, -21785, 9091, 32997, 32432, 9657, 14924, -467, -12598, -24121, 28467, 44592, 27886, 14347, 17183, 26864, 3832, 5000, -23785, -31465, -31598, -38557, -16278, 23483, 25220, -1784, -16382, -25487, -5761, 2261, 43641, 13630, -8176, 3221, -9772, -52683, -85278, -64457, -1296, 37241, 46900, 22076, 19753, 3727, -27721, -34586, -70126, -63391, -19541, -6745, 14351, 51044, 73974, 72219, 20678, -24911, -59022, -57507, 16360, 29644, 38370, 38788, 25321, 5244, -17987, -655, 19286, 29300, 1445, -8743, -23165]
21680b3165l8506j5543K2174L7772k0733j3928j1650J0580M3251L055j5132P912
21668a3913K2203K5710J1521Q300j0201j8198q719K1242K2329j1587Q780O568
21656F4035J5416K012m2430o7269K1872N1941K1828n4702l9600L5515J7413J732
21644B7763J7463j9411r433K4077j2920l3120k1362L739L2731M9905P894j8919
21632D8407k184k1848l4404k2427K0098L5039j4246J9995R989k5361j060p980
21620D018l1055j1496J2297J1142K3156K5135k5933n5815j0639O5959O998j0148
21608C619j9280k9006l060L3689j6345K7789L3956K7265k0544p929k494m360l5471
21595a2171N76j572m6012k064j5186M477q280k9092L0039j7096M834M8699K4787
$$ y = [-23165, -61671, -77214, -55040, -17268, -38001, -51929, -63579, -52999, -9748, -6693, -21825, -13913, 8290, 34000, 45521, 53821, 43620, 25422, 16703, 37945, 60274, 48687, 57467, 64035, 79451, 81463, 39033, -28236, -6364, 45577, 67405, 12703, -26897, 8618, 26031, 27763, 45226, 25815, 16382, 40459, 27539, -5581, -26943, -23204, 9527, 59432, 67326, 48407, 46223, 24375, -10029, -32456, -12358, 22681, 8435, 28430, 38419, 13058, 11998, 4018, -27037, -38533, -26236, -15094, 8062, 33197, 7264, -48551, -59190, 6769, 13767, 3619, -15661, -44667, -47727, -14038, -30383, -2594, 31362, 58627, 38083, 30154, 27660, 23300, -12171, -11595, -13167, -59179, -61243, -76429, -71952, -80232, -109324, -79285, -96381, -91547, -42848, -18061]
21582a8061l3630j3774J505J3525p730J3721J0979K1474K1749J0536k723l4513
21570a6942l3404j8561j576J3046R778J8276m0300L542O1610j8447k7153m829
21558e4960P89K0161J7760J8065J6491K0103l1849k0467n9050k2315L1209L5429
21546b8634j1876L5183O2845K9817J1628o084l2853J850j7549o557k9059k7280
21534a8569j2090J8154K5943j6743m2603K1853K6500K9081J0299N722n564n3348
21522a1365j2312k3303j0972l675Q112L1874J0205K250n068k2356l8822K6420
21510d9012N6661j217q796K1534l3281j0976J5970j580m117J4498j9874j2179
21498c2369j7080J6090K6864J8674L0395r194J3189K1598m1344O31q272K6352
$$ y = [-18061, -51691, -65465, -63960, -50435, -58165, -44444, -33465, -11991, 9758, 20294, 17571, -16942, -50346, -68907, -70483, -57437, -47659, -29383, -69683, -66141, -4531, -22978, -50131, -54960, -54171, -34010, -16250, 1815, 18306, 38409, 6560, -13907, -72957, -95272, -64063, -28634, -40510, -5327, 57518, 87335, 98963, 92879, 60026, 61876, 44327, 37770, 8711, -18569, -30659, -12505, 13438, -3305, -45908, -24055, 2445, 31526, 41825, 47547, 41983, -11365, -23677, -46980, -57952, -61627, -53515, -21641, -11436, -9186, -14254, -36610, -75432, -49012, 7649, 6432, -2364, 19170, -14111, -25087, -9117, -10697, -14814, -316, -20190, -32369, -49449, -33359, -6495, 12179, 42574, 33380, 46569, 68167, 26823, 27454, 19182, 45534]
21486D5534J4j8332P944l0344K4106J1249o1733o172K9879Q064j0338o720j3072
21473a9921L1009J0081K2572L0299M713m2980o42j0999l9928k8239j3870J0814
21461d7091M5088k9106k9420J2216k5631J4370L2563K5086l166R993m5574j6132
21449e6804K3436L3012N383j7304k2150M2739N4781K0293m2062k165j6127j4372
21437H660o112l8764l858M7479M8398k6370n5704r630K8377L7581L4352m3179
21425B1230m2913o289n440l2560m304L0887K3439m833J7601m325J0400R406L957
21412A6256k3255m5000Q582O8458P1700J3627m0874m0142l1474N160m1293N304
21400c2951r13k788K1387n204L6297O6378j2945k9350l389j8743J315P939o657
$$ y = [45534, 45548, 27216, 35160, 4816, 28922, 40171, -21562, -27734, 2145, 10209, -129, -6849, -19921, 11088, 21169, 43741, 74040, 78753, 35773, 35131, 24132, -15796, -44035, -57905, -47091, -2003, -31109, -60529, -48313, -73944, -59574, -27011, -1925, -5091, 4902, -40672, -56804, -33368, -356, 5027, -12277, -34427, 8312, 63093, 83386, 41324, 39159, 23032, 8660, 2548, -36216, -40074, 7405, 55803, 29433, -26271, -35901, -7524, 30057, 64409, 21230, -21683, -27972, -33412, -65972, -70276, -39389, -15950, -20783, -3182, -7507, 2893, 12299, 16256, -6999, -51999, -43417, 25041, 96741, 110368, 69494, 29352, -2122, 3038, -38255, -32951, -33864, -36652, -15265, -20469, 15828, 82206, 69261, 39911, 36522, 17779, 19094, 27033, 20376]
21387B0376O928J9208l5204L505P10k9387k5882j6435m3610j7566K4865L0919
21375f1573j862K0119J7387K1558J0876p460l193L4273j5728j5901m990K0066
21363A3572j4346j5557l4087o235k0131M979L4591L5433M4970l0132l7478J2417
21351a2004J8276J3954j1552j3934k2384m5435l3257j6258L0933J4636M051L123
21339f9851J0194j1691k688J1167K0821J9826m3270j4247P4524L8465l6260m5898
21327d8908J0947J5173L4772J3350k9670q238Q610j1489J6057K9466l741l4716
21315h387k8756M135m352J9803L6142J532q82j4846K4394j2023R025R132J5226
21302E0143j0394J0949j2069j3880J4271M608k9913r460l903J9742k3047k3977
$$ y = [20376, 27304, 46512, 11308, 14813, 15523, -13864, -39746, -56181, -99791, -117357, -92492, -61573, -63435, -43316, -25929, -4371, 6505, -955, -4148, 30125, 14397, -1504, -6494, 13572, -774, -16331, -50418, -56653, -76784, -71805, -37214, -1781, 43189, 13057, -24421, -12004, 6272, 20226, 8674, -5260, -27644, -73079, -106336, -122594, -91661, -77025, -72974, -69851, -59657, -71348, -74036, -62869, -42048, -22222, -65492, -79739, -5215, 33250, -3010, -48908, -37961, -22788, 11984, 25334, -4336, -12574, -3964, -15453, 604, 30070, 26329, -8387, -37143, -33008, -37360, -17557, 18585, 20117, 19235, 4389, 28783, 16760, 25785, 34917, 50143, 39749, 50698, 38629, 24749, 39020, 43628, 13715, 4255, 352, 20094, -2953, -26930]
21290b6930j110K4486J7638J4842J833J5486j498J5633l0370n7412n785K7815
21278e372Q869m1818J4573L7143j1955k3227K1427J0104J2844o16K7723o27j8472
21265C0596o064J3750O125k4982P143J7435L359m78k3029k0008N03J242n2166
21252d6574k2109m206L8394n146j8004k521J1251L6781j3640j3856M078k4328
21240e9880O410N8844N0417j6145k7932p907L3019K5132o4996j8668L9450J5779
21228C3523L1117n811l3786n0200N943J3007K5388J1927k2189J8763j8487k454
21216F741m6803j8402o53J3430J0130L0798J2569R742j5358j7238m129j9327J5539
21203b2961j83j4538j197M4570L2678r237R663k4188p103M5918J2707l1014R914
$$ y = [-26930, -28040, -3554, 14084, 28926, 30759, 46245, 44747, 60380, 30010, -27402, -33187, -5372, 3497, -38321, -23748, 13395, 1440, -21787, -360, 9744, 22588, 21972, 49695, 49068, 30596, 24532, 38282, 44407, 19425, 26568, 44003, 47362, 46884, 23855, 3847, 4350, 5592, -46574, -68683, -72889, -34495, -39641, -57645, -60166, -48915, -12134, -25774, -39630, -35552, -59880, -53470, 5374, 55791, 39646, 11714, 3807, 36826, 61958, -3038, -21706, 17744, 33523, 64640, 58829, 25043, -25157, -19214, -6207, 19181, 31108, 8919, 27682, 9195, 6741, -40062, -58464, -59117, -45687, -35557, -4759, 7810, 17552, 2194, -15044, -19173, -38500, -22961, -23144, -37682, -38879, 5691, 38369, 29132, 38795, 14607, 7504, 53422, 66129, 35115, 45029]
21190D5029j3861J46k3251J2392L4505M682o82j9631k6007n860Q755L5132Q6j9280
21176C2155l3052n3532k4939K0398P5933K3112o830O197l2557J8197L6988J264
21164F3334l8747k1525q431L002j3349J5327j2271j6767K6400L5966R32j3424
21152B0447R609J0678k2548J1150l9055L5588J1403k9442J3025K8950L85j3834
21140C6356j7296K0876K9600K2902j0042p726j7852K2551k3991m7712o9239k9618
21128i1191J6830j4201J0793O6656K9971L1714J222j4790j143n8899o7967J3976
21116g7029N7810J3052j9153r855L9006R26K6609K5867P585r775j6691N656j2884
21103C1124k418M1054L8930k229J3035K4638o352k8865K2205L6196J49452K11079
$$ y = [45029, 31168, 31314, 8063, 20455, 54960, 59642, 58960, 39329, 13322, 7462, 16217, 51349, 51435, 32155, -897, -54429, -79368, -58970, 16963, 40075, 33245, 39442, 6885, 25082, 62070, 63334, 24587, 3062, -5369, -2367, -15716, -389, -12660, -29427, -3027, 32939, 33871, 20447, 30056, 40734, 18186, 29336, -9719, 25869, 37272, 7830, 20855, 49805, 50190, 36356, 19060, 39936, 69536, 92438, 82396, 74670, 56818, 79369, 55378, 7666, -61573, -91191, -74361, -88562, -77769, -11113, 18858, 50572, 51794, 37004, 35861, -23038, -91005, -77029, -19219, -6167, -25320, -35175, 3831, 4757, 31366, 57233, 64818, 55043, 38352, 44008, 31124, 28706, 69760, 108690, 106461, 119496, 144134, 137782, 108917, 131122, 167318, 316770, 527849]
21091E27849K94033L62565K65696J16462j30426l08163k92501k84164j77615q3588
21081B90148m4510l9477l4246n1326n6945O251J4924O146k3127j6967r092J19
21069D1898L1776n578n0065O993K2015k0080r1J6497J0568Q667j6466j2455k433
21056C1246L3600L1695k0206j7357k1830k1450K3123k8232L8998j5464k0462K7083
21044D0744J3863r225l6733l5997L6724L6062p557j136l5782k3499K1528K3995
21032B2987j05j7082M582k5716n868L8138J5267P741n771K3464k8173m1347Q779
21019c104L5147M0172l7690j3757k829j2938N413O0465p784m5821L4254M3489
21007I5017p432o6624m8399j4146L8131l626n3574K4516K9382O2091K5119j8985
$$ y = [527849, 821882, 1184447, 1450143, 1566605, 1436179, 1128016, 835515, 551351, 373736, 290148, 245638, 206161, 171915, 120589, 63644, 69895, 84819, 90965, 67838, 50871, 41779, 41898, 73674, 68096, 18031, 25024, 47039, 26959, 26868, 43365, 53933, 62600, 46134, 33679, 31246, 64846, 96541, 76335, 58978, 37148, 15698, 38821, 10589, 49587, 34123, 13661, 40744, 54607, 45382, 8649, -27348, 9376, 45438, 37881, 36745, 963, -22536, -1008, 22987, 22882, 5800, 10382, -15334, -21202, 16936, 32203, 39944, 34173, 57637, 29464, -11883, -3104, 32043, 72215, 34525, 20768, 17939, 5001, 10414, 70879, 63095, 17274, 51528, 95017, 87585, 20961, -27438, -41584, -3453, -7079, -60653, -36137, -6755, 55336, 80455, 61470]
20995F1470m2678j5908k1810l4080J7286J2029M2420M928k0515J3877N4263K8471
20983I9753p345k3170l7039K7103N906j9623l6446J558j3320k4117L3432L4570
20971D1262P765J0808q49j5933l9501k9023r587j7457j0152K2650N3321K7643
20959D0947j3818m7559k1239k011k3760L8239M3750J7488J4909m8541j539K6459
20947B3325L1019M7594k2749j6676k3079n8M388J2286K7602k5286m4591l2800
20935a9025L944J4447q493K3027J2291k6057M5k11M2215p389m8457J9523R353
20922A5213l3206k309O73J6404j463M0085K3879L2267j8135l9335o05m2016l2535
20909d1083K2946J1108O530R766K3924J8592j4870j4453l1605K7195M731k1350
$$ y = [61470, 18792, 2884, -18926, -53006, -35720, -23691, 18729, 23657, 3142, 17019, 71282, 99753, 92408, 69238, 32199, 59302, 65208, 45585, 9139, 10697, -2623, -26740, 6692, 41262, 49027, 59835, 58986, 43053, 3552, -25471, -35058, -52515, -62667, -40017, 13304, 40947, 27129, -20430, -41669, -43680, -67440, -29201, 14549, 32037, 46946, -1595, -3134, 23325, 54344, 101938, 79189, 62513, 39434, 39376, 43764, 56050, 83652, 58366, 13775, -19025, -15081, -634, -9127, 13900, 26191, 134, 179, -32, 42183, 34794, -13663, 5860, 15213, -17993, -20302, -19629, -3225, -4688, 35397, 59276, 91543, 73408, 34073, 33468, -8548, -41083, -18137, -7029, -499, 9267, 33191, 51783, 36913, 22460, -9145, 18050, 22781, 1431]
20897A431j7587r817O95K5329J8940M009m4213m7544q968M8739N5432L2401j2232
20884D6615J8014L7871N463j2505q411l6608k1065j3721n9770o414N3558J637
20872D664N356J6413m1141J1131J759j9027l7400M295K6709O9854j5776j2245
20860A4592j1928K3464M386m5454k4197K1533J8267P839M0256Q046m6565m713
20848E526L2718L936L8226K79J6179j189j1865j6966k1999j7006J0356N5283J8106
20835A11584j3638k3099o219J5208j2248l75m4266l4389K8202J6801j8864K857
20823B1554j157o968J6649L7018K8735J0545j1037J0287J1417l3041q1461L294
20811E835L288j94r092j292n683R745K4112K6458k7351k6506K886o260J5006L3191
$$ y = [1431, -16156, -25973, -25278, 51, 18991, 23000, -21213, -68757, -77725, -28986, 26446, 58847, 46615, 64629, 102500, 107963, 95458, 87047, 50439, 29374, 15653, -44117, -50531, 3027, 4664, 10020, 26433, -14708, -3577, -1818, -20845, -58245, -53950, -27241, 42613, 26837, 14592, 2664, 26128, 30514, -14940, -39137, -17604, 663, 8502, 48758, 56804, 10239, 5526, 38244, 42180, 80406, 80685, 96864, 95675, 83810, 66844, 44845, 27839, 38195, 93478, 111584, 97946, 74847, 68628, 83836, 71588, 71213, 26947, -7442, 20760, 37561, 18697, 21554, 20397, 13429, 30078, 67096, 95831, 106376, 95339, 105626, 117043, 84002, 2541, 5835, 9123, 8929, -163, -1455, -7138, 2607, 26719, 53177, 25826, -680, 2206, -4054, 10952, 44143]
20797D4143j3149k7678K1943k9570j6144L421K7684j9013j8999J5135K786J7761
20785H320N289K5047M3205J3483l0515j2104R27L6898j0623l9988k1150m7518
20773b8729j1632K5097N1360M8574k4092m0070j2433M0831K9717p964m905J3879
20761G9633N445n002l0258L4698L2883K3128l421j7360l952M0860O3690L1431
20749B51775j3140m4744j6846m2190p4624m6812j4106j9329R317K64O637M0611
20737C6813M4264l2032k3172O045O236j4442k2998L3186j0254l5209j9594L3086
20725A929J8069k3213j8263L2112K0061k6532J3885M7742K3239m9017L920K4742
20713F8674l4770k3190l143N5494N4790l2207n6688k8152K2238j562K2990j9017
$$ y = [44143, 30994, 3316, 25259, -4311, -20455, -17034, 10650, -8363, -27362, -12227, -9441, 8320, 13609, 38656, 81861, 95344, 64829, 52725, 53652, 90550, 79927, 39939, 18789, -28729, -40361, -15264, 36096, 84670, 60578, 20508, 8075, 48906, 78623, 70659, 65754, 79633, 85078, 80076, 49818, 84516, 117399, 140527, 137106, 119746, 115794, 156654, 220344, 251775, 238635, 193891, 177045, 134855, 60231, 13419, -687, -20016, -10699, -10435, -3798, 36813, 81077, 49045, 25873, 31918, 38154, 23712, 714, 33900, 23646, -11563, -31157, 1929, 19998, -3215, -21478, 10634, 30695, 4163, 18048, 65790, 89029, 40012, 43932, 68674, 33904, 10714, 7571, 63065, 117855, 85648, 28960, 808, 23046, 21484, 44474, 25457]
20701B5457m4200k0891J3091J2524k5316J8075n354O168o3140j6027N1700M4637
20689c276J3925l238J0016M731J962Q766L0799O001K411J5921o464J2935K542
20676I7031K7748o682j5429m9089Q339K618K2293L741R876k1267j2904J2466J2966
20663I1707K9359J5504J2426P253l9519r1027m9742J511J2462K7726L0418P2545
20651A20623L1012m5972l7490j3186L4118K7049j5130j5453p830j501j20n419
20639G0701J7440K3189K4804J907k4034n3747R471J8688K6852M5198M3361L1050
20627B34880N752L7935M9041l110o6968n2063l6870r7419m2995L6407K5757m5783
20615D4564j6595L2370K1363q577J1200M0129K8779p261L4812L3212L0159N7102
$$ y = [25457, -18743, -39634, -26543, -14019, -39335, -21260, -26614, -20446, -83586, -99613, -47913, -3276, 10649, 7411, 17427, 22158, 24120, 32886, 63685, 69686, 72097, 88018, 81554, 94489, 97031, 124779, 118097, 102668, 53579, 61918, 64536, 86829, 90570, 100446, 79179, 66275, 78741, 91707, 121066, 136570, 148996, 156249, 116730, 25703, -24039, -22528, -10066, 17660, 48078, 120623, 151635, 105663, 68173, 54987, 89105, 116154, 101024, 85571, 77741, 76240, 76120, 70701, 88141, 111330, 136134, 138041, 114007, 60260, 69731, 88419, 115271, 160469, 203830, 234880, 240632, 278567, 327608, 324498, 257530, 205467, 168597, 71178, 28183, 64590, 90347, 44564, 27969, 60339, 81702, 73125, 84325, 124454, 153233, 145972, 180784, 213996, 244155, 301257]
20603C01257J7656J8245P7367K8395J0994K6459m6437n3799j8242Q347J732M100
20591C76074P0480J20825O1274j8476q8231j18650o3964J0342m6654m5420j8567
20580B39033m28l038K691k9812r244L3706k2760l1138l9054K0530P4279K8839
20568B63604J5508L3077J4397Q0431N3382m5461m4356r911l4939J4971N2195N1045
20556D43943N4147L6865k369l0758n381M518N2708J13317R0704Q886k9837j445
20544G35298P1509M0461L3202k1199k262q300J6164K9627n3381m4145l24L4014
20532H30664N5151N4333Q0974R6854P4862J02043J02698K09205L57199N04116
20522B468099M94933N28381N51590K40185P7695J6721m7824Q559K64585L62593
$$ y = [301257, 318913, 337158, 414525, 442920, 453914, 480373, 433936, 380137, 361895, 370242, 371974, 376074, 446554, 567379, 628653, 610177, 521946, 403296, 339332, 349674, 303020, 257600, 239033, 238605, 235567, 238258, 208446, 199202, 232908, 210148, 179010, 139956, 160486, 234765, 263604, 279112, 312189, 326586, 407017, 460399, 414938, 370582, 360671, 325732, 340703, 392898, 443943, 498090, 534955, 532586, 501828, 496447, 500965, 553673, 666990, 757694, 766580, 736743, 735298, 806807, 847268, 880470, 859271, 857009, 848709, 864873, 894500, 841119, 796974, 796650, 830664, 885815, 940148, 1021122, 1117976, 1192838, 1294881, 1397579, 1606784, 1963983, 2468099, 2963032, 3491413, 4043003, 4283188, 4360883, 4377604, 4329780, 4338339, 4602924, 4965517]
20512D965517M27481N41145N12684M91429O63282J039972J800355K848151M336865
20503A7626881O828080J1706351K2105960M3459012O7727318N8180685L5932801
20496B63567088J6481891k9581073n5805833n9267254m9550248k9561375j5963543
20489D0319653r542175o289422m519448l251180k344969j772543j521249j350890
20481I727777j163842j070657q92154n74935k17718k10R9973j18864l93465n98783
20471D797122q09486q14382o81716m96447k89501k16753j41854j21543r9021r1484
20461A034935l2344p2149j04506j729m3273o2945j09595o6024P006l9758o2226
20450D47392k0547M277J1144l9655n2964l9916k193j8642J4747n795j335O081
$$ y = [4965517, 5392998, 5934143, 6446827, 6938256, 7601538, 8641510, 10441865, 13290016, 17626881, 24454961, 36161312, 58267272, 101726284, 169453602, 227634287, 263567088, 280048979, 250467906, 194662073, 135394819, 85844571, 56283196, 40319653, 30777478, 24488056, 19968608, 16717428, 14372459, 12599916, 11078667, 9727777, 8563935, 7493278, 6601124, 6026189, 5808471, 5808261, 5908234, 5789370, 5395905, 4797122, 3987636, 3173254, 2491538, 1995091, 1705590, 1488837, 1346983, 1225440, 1126419, 1034935, 1002591, 930442, 825936, 824207, 780934, 717989, 608394, 542370, 549376, 509618, 447392, 426845, 431122, 442266, 402611, 349647, 309731, 307538, 288896, 303643, 297848, 296513, 302594]
20438C02594k4347k3343N3241J044n0913O790k906j250m0266k1858j2124J5759
20426B02421m403N201J6737J1391j8017Q809K1968l3767K5345l9652k2764m82
20414A72787k5681j8189K2673o834k5480l0696L651l748l4342k5996k8168M6297
20402D6274k0974o420k0940j5945L2417L4259k966l1550N375M0601l212j2860
20390D4059l825J6167J5216o925K8444k5193k0228K666O109N7503l0547n1569
20378C1877N145n760k3484p05N2198N1224j2260k9900q7352o5040k1064Q814N5395
20365d0912L7822P39p248K3708M1211L9901n500q083J5191N161l2525o8214j7079
20352a5828K1616M0151L9106j7692n7904J7104k3666r365J6274M064o693l5769
$$ y = [302594, 278247, 254904, 308145, 309189, 258276, 265066, 262160, 260910, 220644, 198786, 186662, 202421, 198018, 203219, 219956, 231347, 213330, 222139, 244107, 210340, 235685, 196033, 173269, 172787, 147106, 128917, 151590, 144756, 119276, 88580, 92231, 88483, 54141, 28145, -23, 46274, 25300, 18880, -2060, -18005, 14412, 48671, 45705, 14155, 19530, 60131, 56919, 44059, 40234, 56401, 71617, 64692, 93136, 67943, 47715, 50381, 56490, 113993, 83446, 31877, 37022, 31262, 7778, 7073, 59271, 110495, 98235, 68335, -19017, -84057, -105121, -96307, -40912, -3090, -2351, -9599, 14109, 55320, 95221, 89721, 81638, 96829, 101990, 69465, 1251, -15828, 5788, 45939, 85045, 67353, 9449, 26553, 2887, -6478, 9796, 13860, 7167, -28602]
20340b8602K8038Q6970M1882m8379m2510K8266K410j25J0380k7354J268Q0099
20328A32343l489k7979j2818k1586l0621J6667K2521m3143J5081K6184l4741k7705
20316A0714L3590m4688j0725j8127M0455L769K609J9532J946j1803L1218q490
20304E0000L230N9596J1335k52j8994O396J5213n705P270R888j9244l7820k9066
20291E1847j864k1904k7083m3865J3774N1883L2164N5656L1699q2635m1572l342
20279A4758K8650O031P308K0619k9931L9153M3275k7243k1193l015L9745j4414
20267A03743l5174n7212j9203L800j6727r589L5080J5316l1188R580O0572k2678
20255C6320J3162J3264O285m0933N138n8823k4236J3681L9080L3427L020K0743
$$ y = [-28602, -564, 86406, 128288, 79909, 37399, 65665, 68075, 67950, 78330, 50976, 52244, 132343, 128854, 100875, 88057, 66471, 35850, 52517, 75038, 31895, 46976, 73160, 38419, 10714, 44304, -384, -11109, -29236, 11219, 14988, 17597, 37129, 39075, 27272, 58490, 50000, 53230, 112826, 124161, 123909, 104915, 111311, 126524, 120819, 128089, 137977, 118733, 80913, 51847, 49983, 28079, 996, -42869, -29095, 22788, 54952, 110608, 142307, 59672, 18100, 14758, 43408, 49439, 56747, 77366, 47435, 86588, 129863, 102620, 81427, 78412, 118157, 103743, 68569, 11357, -7846, -4046, -20773, -30362, 4718, 20034, -11154, -1574, 58998, 36320, 49482, 62746, 69031, 28098, 33236, -25587, -49823, -36142, 2938, 36365, 39385, 60128]
20243F0128J1199m078O590j2327l1659j5558J094j3525k2826p681N2065L6224
20231E9646j7198j3977L0504K648m01k6829l7190p596N7500p543l0779r347j2514
20218a3076J6538J4766j5795j8123L573M7263N1540l2410l6165N6522M5625k3797
20206I6461J6974j7076j7937L042l894j1313j4675K1502j2557N5100L7584q19
20194A52392N7503p990n4116q2909k4755j0544J6735J2347k2047L7203J4783j2502
20182G6100K2830K7591k8156r749J6360J7846O44j9603r68k3925n4322N4220L5583
20169A14451k171M118j9902K8793O9528J5061j1106J9241k9200l0340p173j0910
20157A40390k1745n134k2254J1760L1360J7047K2506L928K243r582M546L0544
$$ y = [60128, 71327, 67249, 73839, 61512, 29853, 14295, 15389, 1864, -20962, -28643, 23422, 59646, 42448, 28471, 58975, 61623, 61222, 34393, -2797, -10393, 47107, 39564, 8785, -562, -13076, 3462, 18228, 2433, -15690, -12117, 35146, 86686, 54276, 18111, 74633, 120258, 96461, 113435, 96359, 78422, 81464, 77570, 66257, 51582, 73084, 60527, 115627, 153211, 152392, 209895, 201905, 147789, 64880, 40125, 29581, 46316, 58663, 36616, 73819, 88602, 76100, 98930, 126521, 98365, 88616, 104976, 122822, 123466, 103863, 102895, 78970, 24648, 78868, 114451, 112280, 116398, 96496, 125289, 194817, 209878, 198772, 218013, 188813, 158473, 151300, 140390, 118645, 113511, 91257, 103017, 134377, 151424, 173930, 177858, 180101, 170519, 175065, 205609]
20145B05609K7958L3819P3818J22523J58924Q4196o8384o8166j63269j39790l4367
20134B32871k6684k2515P338j5308j0484J0012q80j576J3708L647J6434K5869
20122B32432K2368j0850m0445M5505P7737J1216m4266J748K5372J4690M7954P4951
20110D58412P595L4289J9318M7382J31123J73552J14212M7081n214L8627J05141
20099A171518J18409N3540K7940k014K3479Q8777J19688J83738J82694K73419
20089B241188K94814L16373M00403M56113P01928J287872K138365L715048O906084
20080A8458188J1903912J2440241M710634q56979n29114M624449M373089k655232
20072E2469188o691570o279765L92979R227774J0371410N525152L490385l309393
$$ y = [205609, 233567, 267386, 341204, 463727, 622651, 706847, 638463, 570297, 407028, 267238, 232871, 206187, 183672, 191010, 175702, 165218, 175230, 174350, 172774, 186482, 190129, 206563, 232432, 254800, 243950, 203505, 249010, 326747, 337963, 293697, 295445, 320817, 335507, 383461, 458412, 466007, 500296, 519614, 566996, 698119, 871671, 985883, 1032964, 1027750, 1066377, 1171518, 1289927, 1343467, 1371407, 1369393, 1392872, 1481649, 1601337, 1785075, 1967769, 2241188, 2536002, 2852375, 3252778, 3708891, 4410819, 5698691, 7837056, 11552104, 18458188, 30362100, 42802341, 47512975, 46655996, 46126882, 50751331, 55124420, 52469188, 45777618, 39497853, 39890832, 49118606, 59490016, 65015168, 68505553, 65196160]
20064F5196160j0867452j3181604j2654305q867533n203466l160025k087768j510336
20056G663671j076030p90115m98953m30741m00973l02221j96351j06990j20005
20047C741292j30711j26848k0569n723k1443L0670J10056K14260K14000K33332
20037D238316K95860M46707Q52981J589413K928165N760029J0867000J3534872
20029D0513343O802905k321411o547963n169057K160214J0705698J0428354K009712
20021E8581795j642377J100782M020339n16943m555647l481141K144874K226792
20013E7878474n615982j0883969j2345719r453967n633314l319656k154747j499649
20005F971471j119170q37997n98467m86493m12755m26908l51596j70997j19555
$$ y = [65196160, 54328708, 41147104, 28492799, 19625266, 14421800, 11261775, 9174007, 7663671, 6587641, 5797526, 5298573, 4867832, 4466859, 4164638, 3968287, 3861297, 3741292, 3610581, 3483733, 3463164, 3457441, 3435998, 3466668, 3576724, 3790984, 4004984, 4238316, 4534176, 4980883, 5833864, 7423277, 10351442, 16111471, 26978471, 40513343, 47316248, 44994837, 38446874, 33277817, 35438031, 46143729, 56572083, 58581795, 56939418, 58040200, 62060539, 61543596, 56987949, 53506808, 55651682, 57878474, 52262492, 41378523, 29032804, 19578837, 13945523, 10625867, 8471120, 6971471, 5852301, 5014304, 4415837, 3929344, 3516589, 3089681, 2738085, 2567088, 2447533]
19996B447533j41114j03401j18495j26455k02232k11898j14657l3037p2809j62701
19986A160734j65621j73320j46656p9479m9813n1510m6433K6268k9971o1421j0441
19975C72337n6553l4943q584j3285O878M963O953k3128K3171o834K0202L7963
19963C29140n476k8086M6731J36881K01635J08680J2866K6450q9588j23953j23040
19952D92240j36865p7787p0682k9850q458k4567J0551J878l3680n7524J2516J9614
19940I7386k4716o21m2341J085J2412P5844O1223l8926n8467K5100K5764k0091
19928A13652n2236J7242L5642l423j8445n3611J6591L9686l6608L5858K0225p666
19916A06907j866O7380L0408K173J0338K6867K0567P369J6150O522o0368l7202
$$ y = [2447533, 2306419, 2203018, 2084523, 1958068, 1755836, 1543938, 1429281, 1396244, 1323435, 1160734, 995113, 821793, 675137, 595658, 545845, 494335, 447902, 474170, 444199, 382778, 372337, 315784, 280841, 272257, 258972, 265850, 270813, 277766, 254638, 277809, 270975, 291177, 329140, 323664, 295578, 342309, 479190, 680825, 789505, 802371, 828821, 739233, 615280, 492240, 355375, 277588, 206906, 177056, 168598, 144031, 154582, 156460, 122780, 65256, 77772, 97386, 72670, 72049, 29708, 30793, 43205, 119049, 180272, 141346, 82879, 107979, 133743, 113652, 61416, 78658, 114300, 110877, 92432, 38821, 55412, 95098, 58490, 94348, 114573, 106907, 105041, 172421, 202829, 205002, 215340, 242207, 262774, 270143, 286293, 292815, 232447, 195245]
19904A95245K2924N8833J10553K46154L46238L23132K55701J04492j75414k98489
19894A189369l00705l12712k06241j25481j00749j9439j0287K8920J2587m0715
19884A14547O9R040L157k9013k0706K2818m5495o5783j0392k739J6764M9576J1187
19871E3030k0157J1883r264j1983n5090l7251J5350L9593N362L9147N7013K8387
19859A16020l3776j5566M430J4091j6761k1209k1133k107P685O172K0143L1776
19847H9765k5291o6099l0135J5272k1919k1411k4664K9128J8798L7365K9653k4121
19835F341l9095o676j1458M2475J7641q151k755m9170L331M2281k0238j0489M5921
19822I958L1019o902j38n887L5570R466k9665P649j3961l6277n966j928p019K9352
$$ y = [195245, 218169, 277002, 387555, 633709, 979947, 1303079, 1558780, 1663272, 1487858, 1189369, 888664, 575952, 369711, 244230, 143481, 124042, 113755, 142675, 155262, 114547, 114616, 123656, 126813, 97800, 77094, 99912, 54417, -11366, -21758, -24497, -7733, 41843, 53030, 32873, 44756, 35492, 23509, -31581, -68832, -53482, -13889, -8527, 30620, 87633, 116020, 82244, 66678, 71108, 85199, 68438, 47229, 26096, 23989, 31674, 37846, 57989, 89765, 64474, -1625, -31760, -16488, -38407, -59818, -84482, -55354, -36556, 809, 30462, 6341, -32754, -39430, -50888, -8413, 9228, 1077, -1678, -50848, -47517, -5236, -25474, -35963, 9958, 40977, 34075, 33937, 28050, 63620, 73086, 43421, 51070, 37109, 832, -5134, -7062, -14081, 15271]
19808A5271L7746J1038n309K718k0027k5720n8247j4877L2548K999j4481k4528
19796f0869J3449K8305L2102L9795L4979o039J1216l4063P365q11j4350j3999
19784C7080k132r417l2392j8017J4721Q7360j0877k5372K5463m7949J626l4500
19772a4406n1801N7042L3158J8785N6349J6550J747K2543J491k5979m40q77L4566
19759A48728k6112l9114LM5382J1221L5568L6746J3908L3512L2688M9176L8319
19747C80025M5087O9331O9103P8695J07771K17697L31545O37022J303484J859401
19737E099161J713413J229877M76986k01916M7244K52025K31898l11829j435728
19728G101131j801672j654117j188008p66024l92419k17768j17136r9844j02954
$$ y = [15271, 53017, 64055, 58746, 61464, 41437, 15717, -42530, -57407, -24859, -21860, -36341, -60869, -47420, -19115, 12987, 52782, 87761, 81722, 92938, 58875, 66240, 65429, 51079, 37080, 34948, 25531, -6861, -24878, -10157, 77203, 66326, 40954, 66417, 18468, 20094, -14406, -66207, -9165, 23993, 42778, 99127, 115677, 117424, 139967, 141458, 115479, 115039, 114162, 148728, 122616, 83502, 83505, 128887, 140108, 175676, 212422, 226330, 259842, 292530, 341706, 380025, 425112, 494443, 563546, 642241, 750012, 967709, 1299254, 1936276, 3239760, 5099161, 6812574, 8042451, 8519437, 8317521, 8364765, 8616790, 8848688, 8536859, 7101131, 5299459, 3645342, 2457334, 1691310, 1298891, 1081123, 963987, 864143, 761189]
19719G61189j07295r0092n1287n1959j01355n5494m1184j1282k6142j4418M875
19708B15556J8478L0288j8047l2718l5219k9798Q634P424K4732J1497n1905o2053
19696H6869k5014l459j6909k0432J2058K5207M9101j7659J0449N245m7994k5836
19684C1626Q825Q264K943L900p843J0115k2174J1088L7731l1325k2672J4648K574
19671D7700N017J58n6978n4575k979R973Q926J9668L943J0700K1870J9861K7621
19658F0905l0780j7293J0226L6713O4620L6412K4459l038J6435O1600M6358O1227
19646C67844O7427K8422l7856o2586m5555m6066L2848M7216l8170p1995q1254
19635A60275p3436L509O774l4253p5541J3701K1411P188J4031J4219O206K8264
$$ y = [761189, 653894, 563802, 512515, 460556, 359201, 303707, 262523, 251241, 225099, 210681, 215556, 234034, 264322, 246275, 213557, 178338, 148540, 157174, 164598, 189330, 200827, 148922, 86869, 61855, 58396, 41487, 21055, 33113, 58320, 107421, 89762, 100211, 105456, 57462, 31626, 40451, 48715, 51658, 55558, 47715, 57830, 35656, 46744, 84475, 53150, 30478, 45126, 47700, 52717, 52875, -4103, -58678, -61657, -51684, -42758, -23090, -19147, -8447, 13423, 33284, 60905, 30125, 12832, 23058, 59771, 124391, 160803, 185262, 182224, 198659, 260259, 306617, 367844, 435271, 463693, 425837, 363251, 317696, 271630, 304478, 351694, 313524, 241529, 160275, 86839, 90348, 97122, 62869, -12672, 1029, 22440, 29628, 43659, 57878, 64084, 92348]
19623I2348J203k0963j3196j0670j3091j6882j9278J1013L4543q486J6092N470
19611E8103j6077K0796N608P828L2248L2510k5558M1547O6026R7223L3691L5465
19599C89410K6525l5151L53j2931j5909K3656J0663m2445k2092R925J1496l290
19587C40210m0267q5703p2767p2707k1764Q819K7943l1215l7167L4609K262l6010
19575A6243m901O468M0702m9728r7144K4734L5757j1215M6252K1876K4551J3908
19563F7503m859N8126j6036j4809K2502P5126K296J3424m9538m0717N559K2565
19551A41142J5950P3681O9791L5943K1311M1839J7459m6305n1105k5656J1423
19540C05473M0044j3972k9747K090j7645J8304l1985n5050q1317n8502j7223J0780
$$ y = [92348, 93551, 72588, 59392, 48722, 35631, 18749, -529, 10484, 45027, 36541, 52633, 58103, 42026, 62822, 68430, 76258, 108506, 141016, 115458, 157005, 223031, 320254, 353945, 389410, 415935, 380784, 381137, 368206, 352297, 375953, 386616, 344171, 322079, 332004, 343500, 340210, 299943, 214240, 141473, 68766, 47002, 55821, 83764, 52549, 15382, 49991, 52253, 16243, 11342, 17810, 58512, 8784, -88360, -63626, -27869, -39084, 7168, 29044, 53595, 67503, 62644, 120770, 104734, 89925, 112427, 187553, 189849, 203273, 153735, 113018, 118577, 141142, 157092, 230773, 300564, 336507, 357818, 399657, 417116, 370811, 319706, 294050, 305473, 345517, 331545, 301798, 303888, 286243, 304547, 272562, 217512, 136195, 77693, 60470, 71250]
19528G1250j0729j2930k1932l1884O662j3835n522O8764K1423j1706m130K889
19516E8320j7432r733o725K8839M3393N154R381j9046O597M8436n78j7758l0258
19503I8590j4839J4206P9701R8854Q2414L6628m0010l5798L56J7867L9231l2205
19491C44995O64N3665L6958o72m4014l1408P1824Q8249J14485N4300m918p142
19479F76986r9688p0473r7710j35129r6008r5661l2646l2925K7787L6634M0738
19468A21905l2241l8315J9595l066l0441K2463k5593j3814K1025L658j2302j5940
19456A6934L9787K4465k6881k6039r185l6209K7815J2314J7437l4402m3817j6598
19444e4379K7042J7791L9002o62k8936L713k4294p520J6355l0092N20L4528j0230
$$ y = [71250, 60521, 47591, 25659, -6225, 437, -13398, -18920, 49844, 71267, 59561, 55431, 58320, 40888, 31155, 24430, 53269, 96662, 101816, 111197, 92151, 98748, 147184, 146606, 128848, 98590, 83751, 97957, 177658, 276512, 358926, 395554, 355544, 319746, 320102, 337969, 377200, 344995, 345659, 399324, 436282, 435610, 391596, 360188, 432012, 520261, 634746, 689046, 684128, 676986, 577298, 506825, 409115, 273986, 177978, 82317, 49671, 16746, 44533, 81167, 121905, 89664, 51349, 70944, 67878, 37437, 59900, 34307, 20493, 41518, 45176, 32874, 16934, 56721, 81186, 54305, 28266, 19081, -17128, 10687, 23001, 40438, 6036, -37781, -54379, -27337, -9546, 29456, 28794, -142, 3571, -20723, -28243, -11888, -41980, -41460, -6932, -17162]
19431a7162M237J1532M872l5370J89M0155K523Q494l4540k8552l9251K3932M9173
19418i768K4625O523m3179r992J076K6421m257k559m4921L7536P6778K5007K3216
19405A06506l464l9887n0638k7470J6960n461l353o898P841j6058k883K402Q124
19392a4279O2623J2917J810J7127l8437k3321k5060q894K7302M0489j2670J0149
19380D9756o152j7925l9085L0923J0984r665j57M73M048n346l2940k2187J0754
19367b6519M4630K6406K6087k2856l6638L0159L2261K609J63K3452P321k5812
19355H1263k9067k1470K19n879m2733j3844R50N0140K0161l7101M8029L38l5962
19342A5044j6072P701R862j6088K1101M2495J6491R190J2736J3173L847J2932
$$ y = [-17162, -12925, -1393, 3479, -31891, -31702, 8453, 10976, 19470, -15070, -43622, -82873, -58941, -9768, 14857, 21380, -21799, -31791, -30715, -4294, -8551, -11110, -56031, -18495, 58283, 83290, 106506, 103042, 63155, 12517, -14953, 2007, -3454, -6807, -13705, -5864, -21922, -24805, -22403, -14279, 48344, 61261, 63071, 80198, 41761, 18440, -6620, -15514, 11788, 52277, 39607, 49756, 43604, 25679, -13406, 17517, 28501, 18836, 18679, 19152, 23200, 17854, -15086, -37273, -26519, 18111, 44517, 70604, 47748, 11110, 41269, 73530, 76139, 76302, 99754, 107075, 81263, 52196, 30726, 30945, 25066, -17667, -31511, -30561, 19579, 39740, 2639, 50668, 51006, 15044, -1028, 6673, 16535, 447, 21548, 64043, 80534, 89724, 102460, 115633, 119480, 132412]
19330A32412j2104N229K6869j0614o327l9027K070k815j9318m8759k185Q4670
19318A10101N2402L7574j4326n9454o390j755l2267O052J8293k596m8581j1878
19306D7175N12k5891j6415n06K5493J5450j5472o938J2560k700J8219r212J6895
19293E9170P231JP000k2014k5075L229r101K7706L0599k6618M952J3501M4433
19280A15014l8269l6007j9243J1557O3687L5052J1521J3706n5720J5945N3799
19269A71042j2928m88M2016K1074L3901l5073L555j5142j9142j6115R377L2332
19257B14409j2847n0294L5904K4157n2383j900K10M3463N2211L7024M4842P3278
19245D08074J40005K95406M58474N04039L87033K30175O5817K05894K83072J83271
$$ y = [132412, 120308, 125537, 152406, 141792, 135465, 96438, 98508, 95693, 76375, 27616, 25431, 110101, 162503, 200077, 185751, 126297, 119907, 118152, 85885, 91937, 110230, 107634, 59053, 47175, 47687, 21796, 5381, 4875, 30368, 45818, 30346, 23408, 35968, 33268, 51487, 42275, 59170, 66401, 66402, 73402, 51388, 26313, 29542, 20441, 48147, 78746, 52128, 57080, 70581, 115014, 76745, 40738, 21495, 33052, 96739, 131791, 143312, 157018, 101298, 117243, 171042, 158114, 157626, 199642, 220716, 254617, 219544, 223099, 207957, 188815, 172700, 182077, 214409, 201562, 151268, 187172, 211329, 158946, 157046, 157256, 200719, 252930, 289954, 334796, 408074, 548079, 843485, 1301959, 1805998, 2193031, 2423206, 2489023, 2694917, 2977989, 3161260]
19235C161260J82196O8712k0545j54524l21009l89184j87629L5851R6068R2819
19225B564015j82750m28080m61275m41151k56304j45546j33852o1010k1708m5921
19215C86418l2477L573R1721L2071j3490l0597n0098J1617N2932J06630J00624
19204F58924j1858j0032L1281O8312Q9248M3404J1045J0468J84785K93903M04878
19193A774358M98397M66865L91064L71114K72296J44230M3341k9732j45568j36346
19183C650019L686M0321J09227k05932p4763J5135k5011o8712m34280o04440o00001
19172A805249m89294l16768k00608p6915l8113l6784k2650J7015Q280J3824M9854
19161G13090R8656Q7559M3934Q5963J96486K82407K01671P8495j0487J4403J46307
$$ y = [3161260, 3343456, 3412168, 3391623, 3237099, 2916090, 2526906, 2339277, 2375128, 2471196, 2564015, 2381265, 1953185, 1491910, 1050759, 794455, 648909, 515057, 454047, 432339, 386418, 353941, 357514, 449235, 481306, 467816, 437219, 387121, 398738, 451670, 558300, 658924, 647066, 637034, 668315, 736627, 825875, 869279, 880324, 890792, 1075577, 1369480, 1774358, 2272755, 2739620, 3130684, 3501798, 3774094, 3918324, 3961665, 3931933, 3786365, 3650019, 3653705, 3694026, 3803253, 3597321, 3522558, 3537693, 3512682, 3443970, 3009690, 2405250, 1805249, 1315955, 999187, 798579, 721664, 683551, 646767, 624117, 641132, 649412, 663236, 713090, 811746, 899305, 943239, 1029202, 1225688, 1508095, 1709766, 1788261, 1777774, 1792177, 1938484]
19150A938484K04756K66821K60048J96017K61033K50856K94313N86592J034510
19141E293430J636356K651321M733132R124988J4023571Q547773L91861j701531
19133D4700901K022253P915824K320699l49779K365963K841182n436979q730665
19125D7649399r822231m314400M503348J0287614K354720o434380j0390288j0359598
19117B3474184o344358l384862k062156j542066j299123j143353q62968o08775
19109F226523n42990n18323n26121l82723k26603j32250m4035j7255K2713L6178
19099C895114L7525K4824R5338J36386K16812L94248O33102J060833J671379K752817
19089A0918378M825897R179432J6081663J6760153Q629648O984801M84324q457799
$$ y = [1938484, 2143240, 2410061, 2670109, 2866126, 3127159, 3378015, 3672328, 4258920, 5293430, 6929786, 9581107, 14314239, 23439227, 37462798, 46010571, 46402432, 44700901, 46723154, 54638978, 56959677, 56609898, 58975861, 61817043, 56380064, 47649399, 37827168, 33512768, 38016116, 48303730, 50658450, 44224070, 33833782, 23474184, 17129826, 13744964, 11682808, 10140742, 8841619, 7698266, 6835298, 6226523, 5683533, 5165210, 4639089, 4256366, 4029763, 3897513, 3853478, 3836223, 3858936, 3895114, 3932639, 3957463, 4052801, 4189187, 4405999, 4800247, 5433349, 6494182, 8165561, 10918378, 15744275, 24923707, 41005370, 57765523, 66395171, 73379972, 73864296, 65406497]
19081F5406497r399975p018682K664941J1208476L594407l718396m810167J154904
19073E9082005N207381m319009j0317478j3406524j0724219o436644l780624k395137
19065A2909751j587531j021810j141820j181189j063962q25963n14285m77892
19057E095299n38846n51487n15188l74832l83023l25210k91100k37274k02089
19048A676250j65934j23331j00521j16761j08994q4928o8571k5115o5981m1020
19038G75094q4555m7349k3589n6835j264r454J373k7479m4742j5280J7488k2743
19026D60665j6102L0023Q8913Q4901M3231k7747j928M8831N3968Q6634O9118q42
19014I19665J9603J01305J83811J06071M9418j33436k24490k31689j94474j40422
$$ y = [65406497, 56006522, 48987840, 51652781, 62861257, 66455664, 62737268, 57927101, 59082005, 64289386, 59970377, 49652899, 36246375, 25522156, 19085512, 15304888, 12909751, 11322220, 10300410, 9158590, 7977401, 6913439, 6087476, 5573191, 5095299, 4556453, 4004966, 3489778, 3114946, 2731923, 2406713, 2115613, 1878339, 1676250, 1510316, 1386985, 1286464, 1169703, 1060709, 975781, 907210, 882095, 816114, 775094, 690539, 643190, 619601, 562766, 561502, 552048, 553421, 525942, 481200, 465920, 483408, 460665, 444563, 474586, 563499, 648400, 691631, 663884, 661956, 710787, 764755, 851389, 920507, 919665, 939268, 1040573, 1224384, 1330455, 1379873, 1246437, 1021947, 790258, 595784, 455362]
19004D55362n0267m3973l4417M015R893k5385J69j4272n6556r865j8234K255K6472
18991B45197Q494l2042j9229n3996l7105J2188L5000R196j7943m249N8008M3739
18979B47258Q122R5259J33054N1762L3721k247n136n9163r128n3391j04J9879
18967D59886N1426M6889L032q2899q5313n8047j6081o804l0254P155n6063o6099
18955A66828J9676J1850n1235j0544k1655l4091k5004N555P389K6364j3871J1430
18943I2692N6664k5408l1388p780J4605l1360m2820K9261K3138j0507J3697k7187
18931E3607q117r667j7732J9328M0142J7065J2164K1924N0663J9331K4491m380
18919B18819l413m6488j4075O327J5379L0375o325k7875O271K951K1708L9183
$$ y = [455362, 405095, 361122, 326705, 330720, 340613, 315228, 315397, 301125, 244569, 234704, 216470, 218725, 245197, 253691, 221649, 202420, 148424, 111319, 123507, 158507, 167703, 149760, 145511, 203519, 247258, 255380, 350639, 483693, 535455, 569176, 566929, 561793, 502630, 493502, 440111, 440007, 459886, 511312, 558201, 561233, 478334, 393021, 334974, 318893, 312089, 281835, 288990, 232927, 166828, 186504, 198354, 147119, 136575, 114920, 80829, 55825, 61380, 68769, 95133, 81262, 92692, 149356, 123948, 92560, 84780, 99385, 68025, 25205, 54466, 77604, 67097, 80794, 53607, 45490, 35823, 18091, 37419, 77561, 94626, 106790, 128714, 179377, 198708, 223199, 218819, 215406, 168918, 154843, 161170, 176549, 206924, 200599, 172724, 178995, 181946, 203654, 242837]
18907B42837j0912k7087K3924L4182j469o9634l3387k1438k844l5056k3639n0635
18895B4842j829p059K3694l685k9175j2701M0874L9565n9595j9470j1489k8019
18883d4047K7772P1792L4413j4860m1536r861K9655M4194P2534L0289K877P464
18871B10686j2198J606n8012K228k1839j9464j9603k5535j905n549j4377K7422
18859F3460J0343P376L3611r120j8701J3662j3841o4449N4L3241J1862k9522K4846
18846F2822L5653k1881R179j297q857j3197m7016q822j7693m521n129J8469l428
18833e718J0597M1927J5931K8092j7573O804J2668K492K6082K7114p0521l6008
18821D1887O0555M1796j4744k2087l8884l8276m1340K8407K0904m906k5005j805
$$ y = [242837, 231925, 204838, 228762, 262944, 261475, 191841, 158454, 137016, 134172, 99116, 75477, 24842, 23013, 15954, 39648, 35963, 6788, -5913, 34961, 74526, 14931, -4539, -16028, -44047, -16275, 55517, 89930, 75070, 33534, 23673, 53328, 97522, 170056, 200345, 203222, 210686, 198488, 200094, 142082, 144310, 122471, 103007, 83404, 57869, 55964, 50415, 36038, 63460, 73803, 81179, 114790, 105670, 86969, 100631, 86790, 22341, 22395, 55636, 67498, 37976, 62822, 98475, 76594, 85773, 84476, 75619, 62422, 15406, 6584, -11109, -15630, -20759, -2290, -5718, 4879, 46806, 62737, 90829, 73256, 80060, 92728, 95220, 121302, 148416, 77895, 41887, 102442, 144238, 129494, 107407, 68523, 30247, -11093, 17314, 38218, 33312, 8307, 6502]
18809F502p398n868k0501R221J2550N846J1723o882j5305j0062m1818l7824K9779
18796g0037L5097L1317J8382p37J0191j5491L6607P9643O5363O0724l324J5467
18784B63202Q701o6287o7115K4528Q1420Q9246M2388j3539m8685k5966l3049q5901
18772A68943j1666K1952P9169J19749J08950K7011o1359j38172j23089n4672l1838
18761A04978k6550K934p159l39L2407L3393l9349J533N5990j662m0256K478O263
18748A24661L1062J9612K2297P4184M4265R6888J08562O1827k5895j06755n7945
18737C92763J2597J9998P0581J2604n3766n4711o9094n5037l2085P0157M8272
18726C62279k2767m5583k5456k8449K936k031l9915k2925j4731r981j6815J0713
$$ y = [6502, -896, -6764, -27265, -18044, -5494, 352, 12075, 5193, -10112, -20174, -61992, -99816, -70037, -34940, -3623, 14759, 14022, 24213, 8722, 45329, 124972, 190335, 251059, 247735, 263202, 271903, 205616, 138501, 163029, 244449, 333695, 376083, 362544, 313859, 287893, 254844, 168943, 157277, 179229, 258398, 378147, 487097, 514108, 452749, 314577, 191488, 136816, 104978, 78428, 81362, 74203, 73864, 106271, 139664, 100315, 101848, 157838, 156176, 115920, 118398, 124661, 155723, 175335, 197632, 271816, 316081, 412969, 521531, 583358, 557463, 450708, 392763, 405360, 425358, 495939, 508543, 454777, 400066, 330972, 275935, 243850, 314007, 362279, 339512, 293929, 268473, 240024, 242960, 240929, 201014, 178089, 163358, 153377, 136562, 147275]
18714A47275l0805J3308M8880L0316K5690m1880l1138l6192k0533q708J4591N1282
18702A62086K6905J16L0570k0241J7323j8942k6855M6413L9712P6781J12762M9396
18690D96026p2315m8138j5894m9598J3504L7363N6461J59464K45510J15431l6720
18679I01094j35453k11549j13501m9457k0200M6849J59556Q2453r3120r8841n9865
18668D07966r3044o6792j4575K9918K3317m612l004k487j8936k8588k4146j9679
18656A85338K3417M1556J0121o804j6437L5861M0775J4464n226P6451R4350R0591
18644E84457j3871l7218l6632k1566M3901R7157J38666J62541J56798L2215r0445
18633A016003p6522K8880P8265J51979K93038K79234K84247M59417Q73156J113300
$$ y = [147275, 116470, 129778, 178658, 208974, 234664, 192784, 161646, 125454, 104921, 96213, 110804, 162086, 188991, 189107, 219677, 199436, 216759, 197817, 170962, 217375, 257087, 333868, 446630, 496026, 423711, 375573, 359679, 310081, 323585, 360948, 417409, 576873, 822383, 937814, 901094, 765641, 554092, 440591, 391134, 370934, 417783, 577339, 659792, 566672, 467831, 407966, 314922, 248130, 233555, 263473, 286790, 282178, 279174, 276687, 257751, 229163, 205017, 185338, 208755, 250311, 260432, 253628, 237191, 273052, 313827, 328291, 323065, 399516, 493866, 584457, 570586, 533368, 496736, 475170, 519071, 616228, 754894, 917435, 1074233, 1106448, 1016003, 939481, 968361, 1046626, 1198605, 1491643, 1770877, 2055124, 2514541, 3387697, 4500997]
18623D500997J189947J649786K983316O079143Q556506L598091k063796m725649
18615B1768341m899382k448304L62879M079268Q838026O885402j680173o159026
18607B6747031q351577o343166l598853k021853j158434o42661l56288l06228
18599C967971l35139l16341l40750k97752q0602O2959N5156K2087m6314n0444
18589B640831r4477k5341J62895K86438L72785M45349N68836O36243R48298J575883
18579G517740K180799K475899L411132O057566J2199795K0330757J5335289j3686
18571F9495291p163317r018235o104170l459117J081459Q725742J2564501R71457
18563F7093611q337529j2370583r013238p32606J720999l377312o209203p538039
$$ y = [4500997, 5690944, 7340730, 10324046, 16403189, 24959695, 28557786, 26493990, 21768341, 16868959, 14420655, 14783534, 18862802, 27700828, 34586230, 32906057, 26747031, 18395454, 12052288, 8453435, 6431582, 5273148, 4630487, 4274199, 3967971, 3632832, 3316491, 2975741, 2677989, 2597387, 2660346, 2715502, 2737589, 2691275, 2640831, 2546354, 2521013, 2683908, 2970346, 3343131, 3788480, 4357316, 4993559, 5941857, 7517740, 9698539, 12174438, 15585570, 21643136, 33842931, 54173688, 69508977, 69495291, 62331974, 53313739, 47209569, 43750452, 44831911, 53557653, 66122154, 67093611, 58756082, 46385499, 37372261, 36639655, 38360654, 34983342, 28774139, 21236100]
18555B1236100n915681l615405k272668j531902j032849o20548l40149j97873
18547E709025k56847m79508n60581m76525l33970r6905Q3842J52648K03079K00393
18537D144651J01212L9763N3878K35142M76230P30404J102887J627214K560415
18528A1071796L733818N786990J0548978J8571514J8834609K860950r363554j5130487
18520D6914614j2855545o458458k090184J279388N771244J3069458J6821184N172807
18512F7624508m842141p841506k801459M474427L193833K926829j535136q568521
18504E2630834r870533r410944n498825o57197M605185J0966365J2177994O977912
18496F1920791M190697n329546j1639598j2510968j0906981o431196l153188k009794
$$ y = [21236100, 15320419, 11705014, 9432346, 7900444, 6867595, 6247047, 5906898, 5709025, 5452178, 4972670, 4412089, 3935564, 3601594, 3504689, 3588531, 3741179, 3944258, 4144651, 4245863, 4285626, 4339504, 4574646, 5050876, 5781280, 6884167, 8511381, 11071796, 14805614, 20592604, 31141582, 49713096, 68547705, 71408655, 62045101, 46914614, 34059069, 27600611, 25510427, 26789815, 32561059, 45630517, 62451701, 67624508, 62782367, 54940861, 52139402, 56613829, 59807662, 62734491, 61199355, 52630834, 42760301, 33349357, 27850532, 27193335, 31798520, 42764885, 54942879, 61920791, 66111488, 60781942, 49142344, 36631376, 25724395, 19293199, 16140011, 14130217]
18488A4130217j697115j571200j412420j016959o25501q6530L72542J67588n11990
18479G748632q74051r72212p23066l87570k08252q4013k3849j5821R3297K32258
18469D785353M15324P27596J237366K251754M166241O365212N425378M672821
18461C0047045N131152M393287O240220L415811J539837J374563l493221m292869
18453D4355825k932635p85526M729774Q284067L631462O03829j948276q269274
18445D7669246r731412r940530q120323m972320k769566j235255n73684o60874
18437I665282p00101q61779q62745n93035k20362J02223j57856o03725q02389
18428D965513p35635n17153l21899j24844j09068j04055q2288K5934J24323K93943
$$ y = [14130217, 12433102, 10861902, 9449482, 8432523, 7807022, 7720492, 8093034, 8260622, 7748632, 6874581, 5902369, 5179303, 4791733, 4583481, 4499468, 4475619, 4459798, 4553095, 4785353, 5200677, 5928273, 7165639, 9417393, 13583634, 19948846, 25374224, 30047045, 35178197, 39571484, 45811704, 49227515, 50767352, 52141915, 48648694, 44355825, 41423190, 40637664, 45367438, 53651505, 57282967, 57886796, 55938520, 47669246, 37937834, 27997304, 19876981, 14904661, 12135095, 10899840, 10326156, 9665282, 8965181, 8103402, 7240657, 6647622, 6427260, 6529483, 6371627, 5767902, 4965513, 4229878, 3712725, 3390826, 3265982, 3156914, 3052859, 2970571, 2996505, 3120828, 3414771]
18418C414771M86699Q32907J504719K918472N015221M979790K760804K215020
18410B4128403q00947l359698l713451k984560l07566K702439L150831J593646
18402B0409097J107907j719026l721112m033912l605115k270153j195917m39252
18394D532517j45168l61337n08906n34906l76591j45968P8616K41800M3065k56147
18384B566975l96751m00286k10948j58717q6379m2851p9075m6685n2684n8941
18374A033658m1059M4159j7952l1551q0831p5040r4257q6712K9168J8898m8843
18363F49638K6028j0028k5420J6140l0293K8308M1339L4735R791j8288r632j0280
18351G02038j2648n0394p954L5062p1477n8571m677J2745j8078j8767j4058q679
$$ y = [3414771, 3901470, 4734377, 6239096, 9157568, 14172789, 19152579, 21913383, 24128403, 23327456, 19967758, 16254307, 13269747, 12962181, 15664620, 18815451, 20409097, 21517004, 19797978, 16076866, 12042954, 8437839, 6167686, 4971769, 4532517, 4387349, 4026012, 3517106, 2982200, 2605609, 2459641, 2538257, 2780057, 2823122, 2566975, 2170224, 1769938, 1558990, 1400273, 1313894, 1271043, 1191968, 1145283, 1092599, 1033658, 992599, 1036758, 1018806, 987255, 906424, 831384, 737127, 650415, 679583, 698481, 649638, 675666, 665638, 640218, 656358, 626065, 654373, 695712, 730447, 740238, 721950, 712318, 702038, 689390, 638996, 631042, 666104, 594627, 536056, 531379, 544124, 526046, 507279, 493221, 484542]
18339D84542p657J8850k6643k4661M6755K1491K6874j0059M1041K9685K5207L1465
18327F56890M3602P2827L9570p8724p5631o433p495N3516P5427P6009N7840K3226
18315I30624n4374l1522K8280L6871N5577K6509P3257J07002J1787n6983k8798
18304A098230j9954Q013O5864M2514O713l9695k9265r9356j30943j17708j15995
18293F68418p3297k8939M6907R5627O5342k0639j5784m7466l0383j3736N5297
18282G01347J42528J61046P1269j05133j39264O538R1995J21183K0332j21086
18272I50755j52075j52480j10798m3907l2855j2212l1090n9435m273N0955L9578
18261D42163k5046m2139k3930k4294j8294m2438j2183J8401O5752R5872J14104
$$ y = [484542, 476885, 495735, 469092, 444431, 491186, 512677, 539551, 529492, 570533, 600218, 625425, 656890, 700492, 773319, 812889, 734165, 658534, 652101, 644606, 698122, 773549, 849558, 907398, 930624, 876250, 844728, 873008, 909879, 965456, 991965, 1065222, 1172224, 1184011, 1127028, 1098230, 1078276, 1086289, 1152153, 1194667, 1201380, 1161685, 1132420, 1033064, 902121, 784413, 668418, 595121, 566182, 613089, 708716, 774058, 753419, 737635, 690169, 659786, 646050, 701347, 843875, 1004921, 1076190, 971057, 831793, 838331, 930326, 1051509, 1071841, 950755, 798680, 646200, 535402, 491495, 458640, 446428, 415338, 355903, 351630, 402585, 442163, 417117, 374978, 351048, 326754, 308460, 266022, 253839, 272240, 337992, 433864, 547968]
18250E47968M9472j9612l284K9934J2076l2729n2709j10843q7740k4595L5896
18239C43834L5333n90P9746J32757M0624k7830q880J8233k0462j6195l8203n0772
18227D87595o0684m3307j2550L5640k4580n4604j5051L5415K3810m0812m1759
18216B89113n5491j0613j673L4839L2966k5983k3317J8818k916M2759L7348m6687
18204B89163k2222k6731K2726M7178O2073K0082j1244l7386o6091N235l3418m7917
18192B01448J581J0953J094J5430J7852M522j9447l0008n1650k9167r910J9650
18180A32348l0540j0250l8678O387J3901r626K6789M3307j1907L6790J3794M035
18168A76350J4632L935n729N0169J7206k6996K4836r275j7100l0262j5009J1236
$$ y = [547968, 597440, 577828, 574544, 604478, 616554, 583825, 531116, 420273, 332533, 307938, 343834, 379167, 378577, 458323, 591080, 631704, 603874, 594994, 613227, 592765, 576570, 538367, 487595, 426911, 383604, 371054, 406694, 382114, 327510, 312459, 347874, 371684, 330872, 289113, 233622, 223009, 221336, 256175, 289141, 263158, 239841, 258659, 255743, 298502, 335850, 289163, 266941, 240210, 262936, 310114, 372187, 392269, 381025, 343639, 277548, 282783, 249365, 201448, 203029, 213982, 215076, 230506, 248358, 252880, 233433, 203425, 151775, 122608, 112698, 132348, 101808, 91558, 52880, 59267, 73168, 63542, 90331, 133638, 121731, 158521, 172315, 176350, 190982, 194917, 189188, 239357, 256563, 229567, 254403, 245128, 228028, 197766, 182757, 193993]
18156A93993r84n247K2126n4858l4070M1454J7578j0856J8537J9867k0980j2883
18144A73677J7184K1988j3294K0343L0803q511j0285J2170K9412Q733J4500j0430
18132B86290k9243L4213P5746P0316J5652M9554R1953J00524J37822J41746J20501
18121A095074J76954K21633K50562L60100N47714Q81637J328204K261002M363572
18112A1486452R019821J9661575L0778362J0265109j0409215j9875545k0905617
18105C0020942j1856314n850511l242975j976018j270188q15031o75116o21751
18097C713038n50566m78543l54875k63444k02178j57422j80912k09183j91638
18088A124277j26254r2272j00803o7068n5260m3830m5110j1097m7402q0292m4970
$$ y = [193993, 193009, 187762, 209888, 155030, 120960, 162414, 179992, 169136, 187673, 207540, 186560, 173677, 190861, 212849, 199555, 219898, 250701, 242190, 231905, 244075, 273487, 282220, 296720, 286290, 257047, 291260, 367006, 437322, 452974, 502528, 594481, 695005, 832827, 974573, 1095074, 1272028, 1493661, 1744223, 2104323, 2652037, 3533674, 4861878, 7122880, 11486452, 20506273, 40167848, 70946210, 81211319, 70802104, 50926559, 30020942, 18164628, 12314117, 9071142, 7095124, 5824936, 5009905, 4334789, 3713038, 3162472, 2683929, 2329054, 2065610, 1863432, 1706010, 1525098, 1315915, 1124277, 998023, 905751, 804948, 737880, 682620, 638790, 593680, 582583, 535181, 454889, 409919]
18077D09919k3354q092l1253o4323j5113j7175K2413j955Q415j087K6335j4513
18065B90217n1283n8370J0844K4382j2590r115J8174j7791J5856M6781Q1949M0105
18053C79159k6358J4301o391J8349O0101J10973J11539r49j42929j33535o0236
18042C24024M8743M5317P495n6108l4938p2366l4465O17n0533k1649J533J1765
18030A69435q461k2951j7414M4378L2890k9125n7243m7799k0899K4850R22m616
18018F3967J9225K6949J6492J1194L5426k1891l2633m817L168J55p267K4198K6793
18005A60959J7720M0010N9756Q7750O7358Q829q535l1869M770M9642O6876J9741
17993E43007o3298r1363j3105J4906O601l6592n7070p9870r8175k8855k1022j0539
$$ y = [409919, 386565, 378473, 347220, 282897, 267784, 250609, 273022, 271067, 279482, 278395, 304730, 290217, 238934, 180564, 191408, 215790, 203200, 194085, 212259, 194468, 210324, 257105, 339054, 379159, 352801, 367102, 360711, 379060, 439161, 550134, 661673, 660724, 517795, 384260, 324024, 372767, 418084, 425579, 369471, 334533, 262167, 227702, 228319, 177786, 156137, 157670, 169435, 160974, 138023, 120609, 164987, 197877, 168752, 111509, 63710, 42811, 67661, 68583, 63967, 83192, 110141, 126633, 137827, 173253, 151362, 118729, 113912, 117080, 117235, 109968, 134166, 160959, 178679, 218689, 278445, 366195, 433553, 442382, 433847, 401978, 406748, 456390, 523266, 543007, 479709, 388346, 375241, 390147, 396748, 360156, 303086, 223216, 125041, 96186, 75164, 64625]
17981F4625q06K6542K2920p73K0904k8376j3431k537J4285j4274L479J5557L4670
17968A42785l145m8210k4822n520p715m0991P442M0501J352j9768l929J451m1323
17955a892M5654K3271K1823P6808O3853j04N0612M1471J1221K0818M9269O2682
17943D65486m1156m6664m1250l0618j0725K1722J8512j1731n1743m9665n2360
17932A69808j7897K3734j0649k0660l5109j4521p928k497k5873m064k9223m3234
17920a8113l880K9844L8622k4018K947L1206j6453J3208j888M5367m544k0249
17908G2049K921q260l2361m8195J4908Q1352P8384L4993J5455J4558j5766j4557
17896A95481J0965k2838J0173K1346o644M073p4907m4498k1778l590O29J0811
$$ y = [64625, 63819, 90361, 113281, 112508, 133412, 105036, 91605, 89068, 103353, 89079, 92558, 108115, 142785, 139640, 91430, 66608, 61088, 53373, 12382, 19824, 60325, 61677, 41909, 37980, 39431, -1892, 43762, 67033, 88856, 165664, 229517, 229413, 280025, 321496, 332717, 353535, 402804, 465486, 424330, 377666, 336416, 305798, 295073, 316795, 335307, 323576, 271833, 222168, 169808, 151911, 175645, 164996, 144336, 109227, 94706, 86778, 84281, 58408, 54344, 25121, -18113, -21993, 7851, 46473, 22455, 25402, 56608, 40155, 53363, 51475, 96842, 92298, 72049, 74970, 66710, 34349, -13846, 1062, 82414, 160798, 195791, 211246, 225804, 210038, 195481, 206446, 183608, 193781, 215127, 208483, 212556, 137649, 93151, 71373, 67783, 68412, 79223]
17884G9223M3078P246l4618p9221l7149O9471M324m7406Q601L8463K9454n076
17872G6390N90K9280J1681k9404r645j7375O023j4258p3919k2122j1525L9102
17860a5182J0659L23j7000l0304N4412N5531K4658o858l1297k4032j7142Q861
17848A2629K4477K7838J2851J9069l4529p5358q101N2301N455Q240k5789r452
17836I631K1846N888J1815M744J8860J4715l4016j3676N349r06K1157l3975l6648
17823e216L0666l3199L56j3072K0100N2821j0008k2999j4635J4340K1885l3641
17811G398k8109j1670K4041R1K2668J6127J9497l344K5948J5440M140k1640l4674
17798C5913k9254J121k7459J646L3808K6474j8261l2685j2760J301K0117J7687
$$ y = [79223, 122301, 129547, 94929, 15708, -21441, 48030, 52354, 4948, 13549, 52012, 81466, 76390, 76980, 106260, 117941, 88537, 78892, 61517, 67540, 53282, -20637, -42759, -54284, -15182, -4523, -4200, -21200, -51504, 2908, 58439, 83097, 76239, 44942, 20910, 3768, 12629, 37106, 64944, 77795, 96864, 62335, -13023, -21124, 31177, 36632, 44872, 19083, 9631, 31477, 37365, 49180, 53924, 72784, 87499, 53483, 39807, 45156, 44250, 65407, 31432, -5216, 25450, -7749, -7393, -20465, -365, 52456, 42448, 19449, 4814, 19154, 41039, 7398, -20711, -32381, -8340, -8249, 14419, 30546, 50043, 46699, 72647, 88087, 92227, 70587, 35913, 6659, 7780, -19679, -18033, 15775, 42249, 23988, -8697, -21457, -20156, -39, 17648]
17786A7648L979j2172j8279M8938L6778K2220l1655N96K3378n7377j472L6600
17774F9182M7778J9064j5647Q396K481m2464m4261l3082K1312L9778J7679k0690
17762F9526j8115p044l0391M7088j624l7262j2868N996Q029J5262L297l6517k0056
17749a4679j9944K1310K2353J8859Q99O177k5340L0918J3618l1527N763m762j2176
17736A1469l098l1043K556r709L3076Q793N037j9785Q147l249j0067M5746J053
17723C8926k2580j2790L0911N700j0711P248j920j5224k6122n0990L1825N8698
17711C2971j0012m8783L4335L6616Q47J0956k6219n9677K1330L3334L4679m7193
17699A3184j7173m6622j392J3555J0353J8659M5896L0864j7743L1170L2543l1537
$$ y = [17648, 21627, 9455, -8824, 40114, 76892, 99112, 67457, 68053, 91431, 34054, 32582, 69182, 116960, 136024, 120377, 128773, 131254, 88790, 44529, 11447, 32759, 72537, 90216, 69526, 51411, 44367, 13976, 61064, 59440, 22178, 9310, 15306, 23335, 38597, 41894, 5377, -14679, -34623, -13313, 9040, 27899, 28798, 34975, 9635, 40553, 54171, 22644, 28407, 23645, 11469, 8371, -22672, -20116, -29825, 3251, 12044, 17081, -2704, 5443, 2194, -7873, 37873, 38926, 16346, 3556, 34467, 40167, 29456, 36704, 34784, 19560, -6562, -57552, -25727, 32971, 22959, -25824, 8511, 45127, 45974, 56930, 30711, -28966, -7636, 25698, 60377, 13184, -3989, -50611, -52003, -38448, -28095, -9436, 36460, 67324, 49581, 80751, 113294, 81757]
17687H1757j2429K460n8211l4559K0658J9482K7804l3579o0067J4009m693K9405
17675g963J9173j5295l6207n75L5653J8198J7570n297L0193K8Q617j4950k2845
17662B6300n4500j8469N1125M9509j4552o815M300K3964j7419m7633n2293l7814
17650i4297P410O6225M0266R279l9959K7075J7638l5150k5886k5797j7039K7692
17638d2543O038j5010N0980K8969K7961j5028J50K5581j1170o9440m8214M3225
17626a8501L9390K8054N097m7987J6299J4933n0246j0837L6988N7172L9020n751
17614A03631M644r428k9768m1508l1492m9312l296L8834J9243K6304j8227j1083
17602a458K3352j2930J7611N069K7184j2411j528L6195O162n93k3873j5568q279
$$ y = [81757, 69328, 71788, 13577, -20982, -324, 19158, 46962, 13383, -46684, -32675, -37368, -7963, 11210, -4085, -40292, -40867, -5214, 12984, 30554, 25257, 55450, 55478, 64095, 49145, 26300, -28200, -46669, 4456, 53965, 39413, 32598, 36898, 60862, 43443, -4190, -56483, -94297, -86887, -20662, 19604, 28883, -11076, 15999, 33637, -1513, -27399, -53196, -70235, -42543, -36505, -51515, -535, 28434, 56395, 41367, 41517, 67098, 55928, -13512, -61726, -18501, 20889, 48943, 54040, 6053, 22352, 37285, -12961, -23798, 13190, 70362, 109382, 103631, 108275, 98847, 69079, 27571, -3921, -53233, -56529, -17695, 1548, 27852, 9625, -1458, 21894, 8964, 26575, 31644, 58828, 46417, 44889, 81084, 87246, 86653, 62780, 47212, 38933]
17589C8933k61P670J8679j4152k9273n4201k8072M5107J5430k841J1508j5705
17577g178K2816N833m2472L2303N60L024K6198l1235l2433j0064j4303j4036M6534
17564a4453K8250J0781m4700J8362R033r382j6177J5218l9297l8459J0024L0700
17552d0100M4968J1720J3021J1538J1782q53J2514K6541j3879m8520l8259q132
17540a7659O4836L2759J1504q231j0976p100l1159p877k9887l4490K4139L3179
17528A9038K797p770J9252m0610j1741o644q858K878P457j3684j2602l583P366
17515d6704R443r292J8866M3483p566k0522m297L7535k3949J8361K5183r710P260
17502C8091j4060m3268o568q439J0775J1245j0513m1027N6692M9746J7846J2410
$$ y = [38933, 38672, 46342, 65021, 50869, 21596, -32605, -60677, -15570, -140, -2981, 8527, -7178, 15638, 21471, -21001, 11302, 11862, 14886, 41084, 9849, -22584, -32648, -46951, -60987, -14453, 13797, 24578, -20122, -1760, 7273, -2109, -18286, -3068, -42365, -80824, -70800, -40100, 4868, 16588, 29609, 41147, 52929, 52076, 64590, 91131, 77252, 28732, -9527, -17659, 47177, 79936, 91440, 83209, 72233, 65133, 33974, 26097, -3790, -38280, -14141, 19038, 21835, 14065, 33317, -7293, -19034, -25678, -34536, -31658, -24201, -37885, -50487, -54070, -46704, -37261, -46553, -27687, 15796, 8230, -12292, -16589, 20946, -3003, 15358, 40541, 30831, 38091, 24031, -19237, -25805, -34244, -23469, -12224, -22737, -63764, -7072, 42674, 60520, 72930]
17490G2930L1893l1348m3034m1017k8311m016m542L3852J5879m432J3329J5623
17478B6806n878k629K8043k5962j093J0686L807J4369j8812j4379J2613m3265
17466a5694l6699n550M5361N7455R477k3428n7236K691L7083k132k432J7337L5707
17453F1940m750k8825m271l5383l0974N4125M5199K3938P8405J46987J27707J8143
17441D52241q6661j45310j29081p5454j3919K8216N502k6461l187j5355j4358
17430b3827q314O612L6694J6456O677k1734K6115J7840J9050k2475K7911k3111
17418E7894n2140j8136J3912j2574l284j863m232m045J9614J1189J2746m666k2630
17405h215r394k2806J4206j278J6113l0585j0365L8601M1342l548p571k3949l8074
$$ y = [72930, 104823, 73475, 30441, -10576, -38887, -42903, -47445, -13593, 2286, -2146, 11183, 26806, 20928, 18299, 46342, 20380, 19287, 29973, 33780, 48149, 29337, 14958, 27571, -15694, -52393, -57943, -12582, 44873, 54350, 30922, -26314, -23623, 13460, 11328, 8896, 26233, 61940, 57190, 28365, 24094, -11289, -42263, 11862, 57061, 80999, 159404, 306391, 434098, 452241, 365580, 220270, 91189, 15735, 1816, 30032, 35534, 9073, 5886, -9469, -23827, -32141, -25529, 11165, 27621, 34298, 12564, 38679, 56519, 75569, 53094, 81005, 57894, 5754, -12382, 1530, -11044, -14328, -16191, -20423, -24468, -4854, 6335, 19081, 14415, -8215, -17609, -40415, -26209, -27487, -11374, -41959, -52324, -13723, 27619, 24071, 16500, -7449, -45523]
17392d5523k5256P944j5624K082J6397P285K6072M4623q161p350j7798n4626j028
17379g0963M7448k5120k8280m286K4042J2064J3187P933L0870L9828m416j4729
17367B7578k0425J408k4895J1727N5716K384k2486M0427j6521p4157L948m315
17355a9611J8333M1667k6753k3244M6609K3689q103m236k8614o4409n0441l074
17343i8187J0268m4587l5170J1776N5100O3832M3630K4201K5542P219k0651n3068
17331a0095J953M583J0743J7022k5826l5734j3609j3373Q538N6405M1941l6854
17319E694n4223M920k3825o20M11N5021M3041l0245m475K853J1752P164K8204
17306D5672N474m9555m042j6988J4797l3925j2472k379K2001K4231J2511Q485
$$ y = [-45523, -70779, -62835, -78459, -76377, -59980, -52695, -26623, 18000, 9839, 2489, -15309, -69935, -70963, -23515, -48635, -76915, -81201, -57159, -45095, -31908, -23975, 6895, 46723, 42307, 27578, 7153, 8561, -16334, -4607, 51109, 53493, 31007, 71434, 54913, -19244, -15296, -19611, -1278, 40389, 13636, -9608, 37001, 60690, 52587, 48351, 19737, -44672, -95113, -98187, -87919, -132506, -167676, -155900, -100800, -36968, 6662, 30863, 56405, 63624, 42973, -10095, -8142, -3559, 7184, 24206, -1620, -37354, -50963, -64336, -55798, 607, 42548, 5694, -48529, -43609, -67434, -68054, -67643, -12622, 30419, 174, -4301, -1448, 10304, 17468, 45672, 51146, 1591, -2451, -19439, -4642, -38567, -51039, -53418, -31417, -7186, 5325, 13810]
17294A3810j6239n3312J1741L8769p232L1589L9580l7083J1543n526m7288k2043
17282d1691J1908p440p704K1262M4260L3297M2664j0214m2892m008J2300m8113
17270C629j6053m200m4350j8166K3070N8658M8322j7735j9278J6025K5094j4404
17258D0612k4308k4062k022j3949O531j697k6515J6822l2908J5927L8020L3L1124
17245B3608Q576L175m8872k3356N517p504J2653M4046L4889j2597R640j9429l971
17232B6375k9076l4612J5315P2408o9675k7483J3714j2979j169L4477L8529p084
17220A8740J0593K7604j4259j4891J5153l6708r654R743K2522O657k7125k1707
17208a3332p617J5180m8566n2196J5001L7616L1428J4212M8096P5165j1556j9823
$$ y = [13810, -2429, -55741, -44000, -5231, -12463, 19126, 58706, 21623, 33166, 27640, -19648, -41691, -29783, -37223, -44927, -23665, 20595, 53892, 96556, 86342, 43450, 39442, 51742, 3629, -12424, -16624, -60974, -79140, -56070, 2588, 50910, 33175, 13897, 29922, 55016, 40612, 16304, -7758, -9780, -23729, -17198, -18895, -45410, -28588, -61496, -45569, -7549, -7516, 23608, 32184, 35359, -13513, -36869, -31352, -38856, -26203, 17843, 52732, 40135, 49775, 30346, 26375, -2701, -37313, -21998, 50410, -19265, -46748, -33034, -46013, -47182, -12705, 25824, 18740, 29333, 56937, 42678, 27787, 42940, 6232, -3422, 6321, 28843, 35500, 8375, -13332, -20949, -5769, -54335, -106531, -91530, -53914, -22486, -8274, 39822, 114987, 103431, 83608]
17196H3608J1388l335r6598l3054o847k466M5367L4856Q327K3100q854M8212p123
17183I6581k2917n0859p9991j9635L6146J5839K5509K5484J0647k0676l2743j3897
17171c0512L244J6806J3086l408K29m052O800R288J7269J630n4383j287j2044
17158c7334l991J618K0741N4614n066K8070N223o2841r456L1751L5442j5691k0759
17145B2321j9285m8237M1933J8583L1696r259p325K3766n952k9382m2900J9335
17133d706Q408M8393J0239l6998k0302K5548r218j6074K822K8146k3186k1444
17121h372M2575J6340j2703k3090n6630k4505L5796J9321K4911P267M2723J5840
17109G9473n9772k1089J615j3511j2386k1245K6566L2805M574j1871K7297J2395
$$ y = [83608, 94996, 91661, -4937, -37991, -44838, -47304, -1937, 32919, 41246, 64346, 55492, 103704, 96581, 73664, 22805, -57186, -76821, -40675, -24836, 673, 26157, 36804, 16128, -16615, -30512, -27268, -10462, 2624, -784, -555, -4607, 2193, 11481, 28750, 30380, -24003, -25290, -37334, -41325, -39707, -18966, 35648, 30582, 58652, 63875, 1034, -8422, 23329, 58771, 43080, 22321, 3036, -45201, -3268, 15315, 47011, 37752, 30427, 54193, 48241, 18859, -24041, -4706, 3702, 52095, 62334, 25336, 5034, 30582, 21364, 5290, 8112, 36258, 13072, -8372, 34203, 50543, 37840, 14750, -41880, -66385, -30589, -11268, 13643, 20910, 63633, 79473, 19701, -1388, 227, -13284, -25670, -46915, -20349, 12456, 17030, 5159, 32456, 44851]
17097D4851K1711l2312j0009j0936m0617j2806L4754K5302J0079j151P1J5500
17085D4437k9569K3496r675m7061m982p138j3653O806K5581K3079R618K3818l1734
17072A3023k8410r870j3924k2200P329K4874K2738K3305O525r223m949K3397L1277
17059F3892O112m1140k0187M315j8124j3695K4636k4145n69j8517j6118L0093
17047b3447R115j0959J4314j497k4747K158M202J3404n6163o0140J3817L6716
17035h3227N3342M1268k5843j4559k6545J3081K3497L3186l2066j29k1035M8744
17023I714J867m3332l287L3113O631r765P098L2137l758J0687l4451k7854J058
17010b0142J3694M2322m5692o9945l4241m332J8742M41L5336K2272r795j8504
$$ y = [44851, 66562, 34250, 24241, 13305, -27312, -40118, -5364, 19938, 30017, 28866, 28937, 44437, 14868, 38364, 28689, -18372, -23354, -30492, -44145, -37339, -11758, 11321, 20939, 44757, 13023, -15387, -25257, -39181, -61381, -54052, -29178, -6440, 16865, 23390, 14167, 9218, 32615, 63892, 70004, 28864, 8677, 12992, -5132, -18827, 5809, -18336, -18905, -37422, -53540, -23447, -14332, -25291, -10977, -12474, -37221, -35063, -30861, -17457, -73620, -133760, -119943, -83227, -29885, 11383, -14460, -29019, -55564, -42483, -18986, 14200, -17866, -17995, -39030, 9714, 11581, -31751, -35038, -1925, 4706, -5059, 2039, 34176, 30418, 41105, 6654, -21200, -20142, -6448, 35874, -9818, -79763, -114004, -118336, -99594, -99153, -63817, -41545, -51340, -69844]
16998f9844N493L5630J9600j7312j3292J3203o708M5881K281m4731m251m539K8363
16985a0226L1438j2146l223K5879R322r536N597O4119j2965j8678k6506l6516
16973F559J523k2675m2715Q269L7260p91k1308k571P794J6632j2183k531L3529
16960F792k548k0949k4567J6203L1972R139l0601k2159j0242j7046P8K2191K4836
16947a6901j3814j0434L0706P7217O4036O792q7177p8174K2628N8453J5416k0566
16935D8182o8147L112O8754n2316p5194L4023j277j4428n849J37J5559J0100M5818
16922H474j3403n339J875K271L1015j7463k4044K6078K2775n4171n4004L9379
16910c6557P1056k6592K568L795r898j2050M232M861K2196n4722r524K1956k8210
$$ y = [-69844, -64351, -28721, -9121, -26433, -39725, -26522, -33230, 12651, 14932, -29799, -34050, -38589, -10226, 21212, 9066, 5843, 31722, 41044, 31508, 37105, 101224, 88259, 69581, 43075, 6559, 8082, -14593, -57308, -49039, -11779, -12570, -33878, -36449, -28655, -12023, -24206, -26737, 6792, 4244, -16705, -41272, -25069, 6903, 16042, -14559, -36718, -46960, -64006, -63928, -41737, -16901, -30715, -41149, -10443, 66774, 130810, 137602, 50425, -27749, -5121, 53332, 68748, 48182, -19965, -16853, 51901, -415, -75609, -41586, -42863, -57291, -63140, -63003, -47444, -37344, 8474, -4929, -10268, -8393, -6122, 24893, 7430, -16614, 9464, 32239, -21932, -75936, -36557, 34499, 7907, 10475, 14270, 4372, -7678, -3446, 1415, 23611, -31111, -40635, -18679, -46889]
16897d6889L200j955n601n257J5252K4704J7067R736J2250k6751m1797J4511K8912
16884b618K4236M361L112j9790k7831J3911K5886N961L4305k8715j6595M4250
16872F0473J8025m569o464O988j7035q379j6408o392m6749L2847J1825P185p746
16859B3601j0436l8983l0114J4687M5500J7523j2967o225N791m0541m524J8313
16847a8375o572j286k5632j2355p999N061M9900J4196j4399J917J4867j7738l6363
16834e4778q300K735J1984j7157k7230L8287L6817L2939m3946j7653L9690k6432
16822c3044m7709O763K1855L3384j0128m366J591j2848J865J6252R350k1101k9426
16809f7562r553J1121M8852Q301j6196j6447M329M0663L1078k5473o1705M4666
$$ y = [-46889, -43689, -45644, -51245, -56502, -41250, -16546, 521, 10257, 22507, -4244, -46041, -31530, -2618, 21618, 25979, 29091, 9301, -18530, -4619, 21267, 27228, 61533, 32818, 16223, 60473, 78498, 73929, 67465, 74453, 57418, 49039, 32631, 26239, -20510, 12337, 24162, 31347, 23601, 13165, -25818, -55932, -41245, 4255, 21778, 8811, 2586, 8377, -32164, -36688, -18375, -24947, -26233, -51865, -64220, -72219, -67158, -17258, -3062, -17461, -15544, -677, -18415, -54778, -63078, -60343, -48359, -65516, -92746, -54459, -17642, 15297, -28649, -46302, -6612, -33044, -80753, -73990, -52135, -18751, -28879, -33245, -31654, -44502, -42637, -26385, -17035, -38136, -67562, -77115, -65994, -17142, -8841, -25037, -41484, -37155, 3508, 34586, 9113, -52592, -7926]
16797g926N9982j372M0j8741q771k6628K718M424n126l5715j0884N0317M3583
16784D5901K816o35j1479k0725L4224j2020m0897j6295o039P13n6749j4755J7023
16771g8917L7708J9290j9875j9485j912L0661J6531j4983l5499L6671K8506k8260
16759b9564J0073J0657p965J4791O045n495N9802k7453j1362J8967J1911o5943
16747a5536n2089J7844L0007l3404l2474L5316M0178J6646r686J1633m721l599
16735A15Q389j6626P035J321J6765k3000j4281K1975r173r591j3383l4234l779
16722f8467P270m915M583j3999K6789L7883k4824M9303J0106l9111k1242j4911
16710e1535M780k24J7822K8180j0433k5852j2202P119J5249M248p65J8313J9243
$$ y = [-7926, 52056, 50684, 50724, 31983, 23212, -3416, -698, 3726, -1400, -37115, -47999, 2318, 45901, 48717, 48082, 36603, 15878, 50102, 38082, -2815, -19110, -25149, -24436, -81185, -95940, -78917, -41209, -21919, -41794, -61279, -63191, -32530, -15999, -30982, -66481, -29810, -1304, -29564, -19491, -8834, -16799, -2008, 4037, -1458, 58344, 30891, 19529, 38496, 50407, -15536, -67625, -49781, -19774, -53178, -85652, -50336, -10158, 6488, -3198, 8435, 3714, 115, 8504, -8122, -1087, 234, 16999, -6001, -20282, 1693, -7480, -17071, -30454, -64688, -68467, -61197, -66112, -61529, -75528, -48739, -10856, -35680, 13623, 23729, -15382, -36624, -51535, -46755, -46979, -29157, -977, -11410, -37262, -49464, -42345, -27096, -22848, -23613, -5300, 13943]
16697A3943j5079k1394k2370m9721K8177N5063L5455P996m6250L657L4077k7588
16685d034m2533j1609K4378Q98j5142J1549K3820m837j5732M198l1828Q413L5521
16672a6938J8419N701k4331m543L8954k4042k7701J2806K5901j1304M6284j1827
16660B7379k3299J6506J2618n5058j1032o005q663R169O0042M8469j5085j4744
16648D0297l712l1319K4102k359m8084j2327m106k2707j5985K0704j1600R889
16636e7207K3931J5429L2374N257l080J973k2986l2121j291L5899M2455J8455
16624E9088N180j5395n1525m5196L0083N0488K9080m1904j6252J8381P36j627
16612B1137J156R635j9383k5119k8015l7023J6355K6429M3697L285j4829L4448
$$ y = [13943, -1136, -22530, -44900, -94621, -66444, -11381, 24074, 32070, -14180, -10523, 23554, -4034, -46567, -58176, -33798, -32900, -48042, -36493, -12673, -17510, -33242, -29044, -60872, -52459, -16938, 1481, 7182, -17149, -21692, 17262, -6780, -34481, -21675, 4226, -7078, 39206, 27379, 4080, 20586, 33204, -21854, -32886, -38891, -47554, -38385, 21657, 70126, 55041, 40297, 36585, 5266, 29368, 27009, -21075, -33402, -37508, -60215, -76200, -55496, -67096, -57207, -33276, -17847, 14527, 19784, 16704, 18677, -4309, -36430, -37721, -1822, 40633, 59088, 64268, 48873, -2652, -47848, -17765, 32723, 61803, 19899, 3647, 22028, 22764, 21137, 22293, 31928, 12545, -12574, -40589, -77612, -61257, -34828, 8869, 12154, -2675, 31773]
16600C1773K9418J504l0750n7973k070k4055K7226L4585k659M895n695l9426J341
16587c1886L6050L5854J4693l3469K7098j401k6061J1961j8327l8715o258K7136
16575c325P173m9550j2718K2919L2885j0310k5924j893P304K6536j0853J365j5969
16562c2360Q483J7074l0846p171K0984K1578r147L0939l506o9136l6925J5979
16550g4054J1153M4887P179M345o267j5181j6628m747L5383R093O986J1506lL665
16536A7317o752L617L491K292k1651n03K4782k2689m6064r753M6235L1408m3347
16523b1617j9625j5803O521q633J9253J4427J6508J5351k0635l6518J5275N0614
16511A5118K3803J2210j0360L0833k6210k2683O208l623k7826m2561L6261k5068
$$ y = [31773, 61191, 62695, 31945, -26028, -28098, -52153, -24927, 9658, 6999, 11894, 6199, -33227, -31886, 4164, 40018, 54711, 21242, 48340, 46939, 20878, 32839, 14512, -24203, -30461, -3325, 3848, -45702, -58420, -35501, -2616, -12926, -38850, -40743, -33439, -6903, -17756, -16391, -32360, -23877, -6803, -37649, -44820, -23836, -2258, -11405, 19534, 16028, -53108, -90033, -74054, -62901, -18014, -10835, -6490, -12757, -27938, -44566, -49313, -13930, -4837, 2149, 13655, 13652, 17317, 10565, 14182, 17673, 19965, -1686, -2189, 22593, -96, -46160, -55913, -9678, 21730, -21617, -41242, -57045, -50524, -59157, -39904, -25477, -8969, 6382, -14253, -50771, -35496, 15118, 38921, 51131, 40771, 71604, 45394, 22711, 28919, 25296, -2530, -45091, -8830, -33898]
16499c3898j0481J174M0148J1240j9022k0252L3731L1723j3706j5783k7396k33
16487b2755m7667K3113L4890r454J737J3873K4036k151J8320J3844J8666R509
16475G5961K8740J2109m7178m9126K9256M7301J6792m585l0672k7062m1006k7761
16463a7231M8987J8075j0873m767j9138k4581j2719J4335K4981J7494k1489J0147
16451B3221j3886k6976j0784j5078k528O450J7135N260k0789k3058l4941M7520
16439d8454M4932K2689r951k9600l5612O286J5797J1914K9475R831l4929j2951
16427c0573j2704J8423N0638K9240J5814K2043K319m9763k7960P494J5545j0943
16415B9573o4766l8316P2173L5920L911j1109m6492K0412l0909n053q008l4743
$$ y = [-33898, -44379, -43205, -3057, 8183, -10839, -31091, 2640, 34363, 20657, 4874, -22522, -22755, -70422, -47309, -12419, -21873, -20136, -6263, 17773, 15622, 33942, 47786, 66452, 75961, 104701, 116810, 69632, 20506, 49762, 97063, 113855, 109270, 78598, 51536, 10530, -17231, 31756, 49831, 38958, 34191, 15053, -9528, -22247, -7912, 17069, 34563, 13074, 23221, 9335, -17641, -28425, -43503, -46031, -39581, -22446, -17186, -37975, -61033, -95974, -48454, -3522, 19167, 9216, -20384, -55996, -49710, -33913, -21999, 7476, 17307, -17622, -30573, -43277, -24854, 25784, 55024, 70838, 92881, 95200, 45437, 17477, 24971, 40516, 29573, -35193, -73509, -1336, 34584, 38495, 27386, -19106, 1306, -29603, -34656, -42664, -77407]
16403g7407j4924L0078K3560O153L8m7129M361n495j976L5093J5119N927K7590
16390I88P759j8683j0354J1270J7992J4844l9455o7949m161j3L5357K4315j5091
16377d3181M455M083J558k4384L889L7511K5100J4855o542k6949j0904j1567n992
16364c8068j2454j5435p738J478M315p250L5442K399k4224K4091q7L6704K114
16351A287j8983J1102j9879R407k8078L614P9262J4453J056j486m1476K92L504
16338A4075m2593N337L5066k7522k5151J3751q735J8190J4136j8761j0477J1357
16326b1327K8647M969J8812j1023k1995j2257L136J3370J8715k1803o5904j9830
16314h6490L9657J3548K2700j4744K543J1840l2678Q063K4599J341Q361J0734
$$ y = [-77407, -92331, -62253, -38693, -32540, -32502, -79631, -75270, -80765, -82741, -47648, -32529, -26602, 988, 8747, -9936, -20290, -9020, 8972, 23816, -15639, -83588, -87749, -87762, -52405, -28090, -43181, -38726, -34643, -33085, -57469, -53580, -16069, 9031, 23886, 17344, -9605, -20509, -32076, -38068, -50522, -65957, -73695, -72217, -67902, -75152, -39710, -37311, -61535, -37444, -37531, -827, 1287, -17696, -6594, -26473, -17066, -45144, -41530, 37732, 52185, 53241, 51755, 10279, 10571, 14075, -28518, -23181, 11885, -15637, -40788, -27037, -35772, -17582, -3446, -22207, -32684, -21327, 7320, 12289, 31101, 20078, -1917, -14174, -11038, 2332, 21047, -756, -66660, -86490, -46833, -33285, -10585, -25329, -22786, -10946, -43624, -35561, -10962, -9621, -1260, 9474]
16302I474j6163J2158P899N106l0771o770p782J9989J8198L3542o622k3393l5200
16289b0335l17m750j5846m7826L527J8246K4758j104j543J6059k0439K8241K3447
16276B118m0938K1497J3016R335J37j3338J4220K0407R182P470p692R263N0440
16263I5117J0585k0852k9188l8098j1084P303K1919J0916L584j8753n061J7232
16251D3620l8827j6496j27K2968L6957l370j4329p669j8020j0189k4137j2004
16239d1623n530l7516J2536N5642N1347M2013k4487K172k2483m1542k2587j6727
16227d8785M2187M6208j0214L940o111j9242k1907l2691M5379K4316l9329k2652
16215c8901J7920P740R5K0755k2193j2671J6898j261J8750M9206J084l7831j4837
$$ y = [9474, -6689, 5469, 13368, 18474, -12297, -19067, -26849, -6860, 11338, 44880, 38258, 14865, -20335, -20652, -25402, -41248, -89074, -85547, -67301, -42543, -43647, -45190, -29131, -49570, -21329, 2118, -38820, -17323, -4307, 5028, 5165, -8173, 6047, 26454, 35636, 43106, 35414, 44677, 95117, 105702, 84850, 55662, 17564, 6480, 13783, 35702, 46618, 50202, 31449, 26388, 43620, 4793, -11703, -11830, 11138, 48095, 44725, 30396, 22727, 4707, -5482, -29619, -41623, -47153, -84669, -72133, -16491, 34856, 76869, 52382, 54554, 32071, -9471, -32058, -48785, -6598, 39610, 29396, 33336, 27225, 7983, -13924, -46615, -1236, 23080, -16249, -38901, -20981, -13241, -13146, 7609, -14584, -27255, -10357, -11618, 7132, 56338, 57422, 19591, 4754]
16202D754L0337K3935n2163n2358M1861M5727j1577l4067j7545N511m732j7240
16190c7557J3643O729M2146R292j5311J1368k4779j5052l7053j9058K5817m410
16178d4225K5880j1819P524J6186J0547J0460k8043m7373O492J7087L4803K2433
16166A9952p898N304R66k0379P310Q889M5417j0286p069R541J683q85l5778J4299
16152C1066j0673k1953J1034k8743J0409J1551o572n0523l6066J7954J8184K0816
16140c3516j5088J3054L6774L4348O689l7299o6025l5446J7336M9835K6634J7077
16128A4373K2929J9516K5042n6443m4939o312j2347j532o188o854k3156K6985
16116d8926K6175j3945j1760J5232K1458J5929K0237j1395R021k991l0331J1573
$$ y = [4754, 35091, 59026, 6863, -45495, -3634, 42093, 30516, -3551, -21096, -15585, -20317, -37557, -23914, -17185, 24961, 34253, 18942, 30310, 5531, -9521, -46574, -65632, -39815, -44225, -18345, -30164, -22640, -6454, 4093, 14553, -13490, -60863, -54371, -37284, -2481, 19952, 12054, 17358, 18324, -2055, 5255, 14144, 59561, 49275, 42206, 51747, 53430, 52545, 16767, 31066, 20393, -1560, 9474, -19269, -8860, 2691, -3881, -54404, -90470, -72516, -54332, -33516, -48604, -35550, 1224, 35572, 42261, 4962, -61063, -96509, -79173, -29338, -2704, 14373, 37302, 56818, 81860, 25417, -19522, -25834, -38181, -39713, -45901, -52755, -75911, -48926, -22751, -36696, -48456, -33224, -11766, 4163, 24400, 13005, 22026, 19035, -11296, 277]
16104B77J567M1965k5097K970K0852j7556j5050m590M2843M166k5635j6174q809
16091A729l7301o721L670n795J388L5358o0544k9135r068j7177M6316K6770k442
16078e2952l6144K4864J7389J674N2439K4044J383j5377j2158j9859j9577K1608
16066a2666K7152L011j657k964J2666k4918p556J3417j4252p397p543J6692k9334
16053c5349P702L807L713L1887K7355K6077m3368l0525J3858J3639Q88K1611J1383
16040E2678k061Q147Q62k8611m174K448N5007K4927l8494l0717k3053m0667J141
16027b2567P267K4983n3356M142K592J0148k080M072o128j9963k701J8903M1292
16014F604R51J1661J2420k0839n707k8370l9103J402M3422m510q09L3451J4470
$$ y = [277, 1844, 43809, 18712, 21682, 42534, 24978, 9928, 5338, 48181, 52347, 26712, 10538, 1729, -35572, -42293, -38623, -44418, -43030, -7672, -68216, -97351, -106419, -123596, -77280, -50510, -52952, -89096, -64232, -46843, -45169, 7270, 31314, 32697, 17320, 5162, -14697, -34274, -12666, 14486, 17497, 15840, 12876, 25542, 624, -6932, 6485, -7767, -15164, -22707, -6015, -35349, -27647, -23840, -20127, 11760, 39115, 65192, 21824, -8701, 5157, 18796, 19684, 41295, 52678, 50617, 58764, 59626, 31015, 26841, 29289, 84296, 109223, 70729, 40012, 16959, -23708, -22567, -15300, 9683, -43673, -39531, -36939, -26791, -28871, -24799, -30927, -50890, -53591, -34688, 6604, 7555, 19216, 31636, 10797, 5090, -23280, -62383, -60981, -17559, -22069, -22878, 10573, 25043]
16001B5043j3143k662m512K5262j2538o3926r642J4161L548q855J3710K0397K1077
15988G920j5485k0234Q804L680k0468k2879K6373K3693K5266j0850r0N3569J2199
15975G1498j0368n0552j5797q300j4020m433K4566L5617J0058j9130j8240p313
15963f414j5050K0537J2083l0728Q40J7194P73l9023J1332o470K5812j261r837
15950b0212j796q340j1490j5791j3470K7609L8587k597P289Q356K5689L247n782
15937C1299N93j0470J667j8272J0274K2162L799Q281q91r579k4958l7354R408
15924a4041M8826L8412j755k0216j6004r614n2385k2544M4832Q848p959k2019
15912b5619O6101L3516m6230k4330n43j756q049L3833L8959l7699o6530k2404
$$ y = [25043, 11900, 9238, 4726, 29988, 17450, -46476, -56118, -41957, -38409, -47264, -33554, -13157, 7920, -7565, -27799, -18995, -15315, -35783, -58662, -32289, -8596, 16670, 5820, 5730, 59299, 71498, 61130, 10578, -5219, -13519, -27539, -31972, -7406, 28211, 38269, 19139, 899, -6414, -21464, -927, 11156, -19572, -18732, -1538, -765, -39788, -28456, -34926, -9114, -10375, -20212, -22008, -30348, -41838, -57629, -71099, -43490, -4903, -7500, -211, 8145, 33834, 37081, 31299, 31892, 21422, 23089, 4817, 15091, 37253, 41052, 49333, 48442, 38863, 13905, -23449, -14041, 34785, 73197, 71442, 51226, 35222, 25608, -26777, -49321, -4489, 4359, -3600, -25619, 40482, 73998, 27768, 3438, 2895, 1139, -6910, 26923, 65882, 28183, -38347, -60751]
15900f0751O1361O311n6990j9420L8418K5267n310k5892J5398K0766k1649m960
15888b7451K4516J3350j0899n0037m6900K6047M8900J1704K0761j1349M11R036
15876H089J8523l4979l6471j6923M457j5777l48J3065j5658P591K5775L2514L4827
15863B4685R804l542P244l3052p503M1822J4823J8055q084k5863j6838J9716o895
15850C4372k7965l8490m708P009r22K6790j2774L167L1792M9744J2840n8758m1158
15837a9061L2154N0509M7705n8674m3702j0618J0324J7346K6843l572j8628R462
15825D0088k1697J377K6698L0066q7446o6040k4939o444j0125O2189N7787o762
15813e248o792N223L3003r5l758J2111j1080l9235k2521M591j2254j102J8491
$$ y = [-60751, 610, 6921, -50069, -69489, -31071, -5804, -11114, -37006, -21608, -842, -22491, -27451, -2935, 10415, -484, -50521, -97421, -71374, -22474, -10770, 9991, -1358, -947, 8089, 26612, -8367, -44838, -61761, -57304, -73081, -73429, -60364, -76022, -68431, -42656, -10142, 24685, 34489, 30947, 38191, 5139, -2364, 39458, 54281, 72336, 64252, 38389, 21551, 41267, 34372, 6407, -32083, -36791, -29782, -30704, -3914, -16688, -13521, 18271, 68015, 80855, 22097, -19061, 13093, 63602, 111307, 52633, 8931, -1687, 8637, 25983, 52826, 49254, 30626, 40088, 18391, 19768, 46466, 76532, -10914, -76954, -101893, -108337, -118462, -56273, 1514, -5248, -12040, -6817, 26186, 26091, 22333, 34444, 23364, -15871, -38392, -33801, -46055, -47157, -28666]
15800b8666L0656N1506j4894j9063L412K4393M946k6969j0169k0347L8940J9322
15788E3067l0091J3703j5729L0605l5217m0990L498J9524K5881R37q979j253Q635
15775B3591N332l7738j2083M3871J9202J6159o574m2323o163p887L0305M1751
15763F7443l9742k2724m521P565k6644n2942K4918L0348J0783J9314j1731j4327
15751a2260L6129M4603M263l2057j0419k3751K345J104K5589k9753j7193r830
15739b1230K8569j0279j5336M8072N779j9888m2518Q032J086J3922O258R313j0440
15726A340j7291L4038O472M632J0848J3104K2042m1137l3857m147n923O091k7677
15713c1465l1688K6685J0242K1027L617m0414k5668j7951J1609M0015M4128M1817
$$ y = [-28666, 1990, 53496, 38602, 19539, 22951, 47344, 52290, 25321, 15152, -5195, 33745, 53067, 22976, 36679, 20950, 51555, 16338, -24652, -21154, -1630, 24251, 25188, 16209, 14956, 23591, 28923, -8815, -20898, 22973, 42175, 58334, 51760, 9437, 3274, -4613, 25692, 67443, 27701, 4977, 456, 8021, -18623, -71565, -46647, -16299, -5516, 13798, 2067, -12260, 23869, 68472, 72735, 40678, 30259, 6508, 8853, 9957, 35546, 5793, -11400, -21230, 7339, -2940, -18276, 29796, 35575, 15687, -26831, -18799, -17713, -3791, 2467, 11780, 1340, -15951, 18087, 24559, 29191, 40039, 53143, 75185, 34048, 191, -3956, -9879, -3788, -31465, -63153, -36468, -26226, -5199, -1582, -41996, -67664, -85615, -74006, -33991, 10137, 51954]
15701E1954j4025k6610k5073K7005L8735J09k8845Q235R523m3141J3325K5860
15689C7052O593k0857j0625j0531k6397M354K8260J5726l8115k5184r589M411
15677d4902K2626K3134Q26J5698L1316M774l6896P71O975k9511N526M8181m290
15664D4228l7418J8173L7045q125l578r20m5217n4366J4845L1818J3206M464p619
15651F536j6262j9011M004l0143J2630j753j9015j2377L4526J7757K2478l4915
15639c5545j8743L1964L5731k6510k203J148J8264Q783o03L8487P950m7138j0957
15626F28L2703n9868l2792k0334J8124K5297J6524J9822m310O101K501m321j2870
15613a2795o870K8290j3222m941L8259Q932k1211K0855l7625n5921k7469M3234
$$ y = [51954, 37929, 11319, -13754, 13251, 51986, 52095, 23250, 31485, 41008, -2133, 11192, 37052, 43645, 22788, 12163, 1632, -24765, -20411, 7849, 23575, -14540, -39724, -49313, -44902, -22276, 858, 1684, 17382, 48698, 53472, 16576, 17347, 24322, -5189, 337, 48518, 44228, 6810, 24983, 62028, 53903, 50325, 49405, 4188, -50178, -35333, -3515, 9691, 14155, 6536, -9726, -28737, -24733, -54876, -42246, -43999, -63014, -75391, -40865, -23108, -630, -35545, -54288, -22324, 13407, -13103, -15306, -14158, 4106, 12889, 12286, 50773, 58723, 11585, 628, 33331, -26537, -59329, -79663, -61539, -36242, -19718, 104, -4206, 1895, 4396, 75, -12795, -19665, 8625, -4597, -9538, 28721, 37653, 16442, 37297, -328, -56249, -83718, -40484]
15601d0484M5691R136J8820O378R750q045k133N391M837n1590J6599M141L218
15588B1709J0151K266o48m477K5514P561p433o516r841j1676n1817m546J8045
15575a1708K8083j2258k043k7514J9403J4648n268j1083J2471O4932K7360l4926
15563F2097l9066j6155l340J9539q502j8682l0635k3908J2951J8238L1368N428
15551I333l6980l3770K2379Q71J0333L2571J5505j5925l5922K0171k252n140j5369
15538c4195p104J5201K697l2908O03J7964J1405j0784K3046K6440J3558k1055
15526D868j2079L4823j4398l6032j0145P704m073J3600l2567j2705L27J7212J3628
15513b9837J5320m253J170j4158K3268l497M4964K5567m7939n0716k6699J5752
$$ y = [-40484, 5207, 14343, 33163, 39541, 49291, 41246, 39113, 44504, 49341, -2249, 14350, 18491, 21709, 31860, 34126, 33478, 29001, 54515, 62076, 54643, 48127, 38286, 26610, -25207, -29753, -11708, 16375, 4117, 2074, -25440, -6037, 8611, 3343, -7740, 4731, 69663, 97023, 62097, 23031, 6876, 3536, 23075, 14573, -4109, -34744, -58652, -45701, -27463, 3905, 9333, -27647, -61417, -39038, -38167, -27834, 4737, 20242, 4317, -31605, -11434, -13686, -18826, -34195, -41299, -26098, -23401, -56309, -55706, -37742, -26337, -37121, -14075, 12365, 25923, 4868, -7211, 27612, 13214, -22818, -32963, -25259, -29332, -15732, -48299, -61004, -60677, -43465, -29837, -14517, -18770, -17600, -31758, -8490, -11987, 32977, 58544, 10605, -40111, -66810, -51058]
15501e1058K8943O190M429r052k208N8787j3763j2101K0640P70j0209m174j1763
15488E431k0169k1639Q000j6549K2146J3008l608M403J0366K7350J531j637Q595
15475C7228J9755j8014P571N178O458o164L7687l4424m0060L8900k955n5940K7671
15462B2891O011K5663Q031j5688n122Q355j3264k0224j1369P312J4235P401R877
15449D4109k4975J2203J4257j2043j8715J927k3599r546L2060J2679n3974j7199
15437d2816L1587P3893J2029k5630l5388l56J5081L0931J462J192j2362j8975
15425C0648k08j2201n126j9813K4764P739j1991j078j5083K0219L984j7056M4969
15412D9767L7516O360j5730j2986K3315j7482n2537j759j6815J590j6768j5210
$$ y = [-51058, -22115, -15925, -11496, -20548, -22756, 36031, 22268, 10167, 30807, 31577, 21368, 17194, 5431, -14738, -36377, -28377, -44926, -22780, -9772, -13380, -8977, 1389, 28739, 30270, 28633, 37228, 56983, 38969, 46540, 51718, 58176, 52012, 89699, 55275, 15215, 54115, 51160, -4780, 22891, 28902, 54565, 62596, 46908, 41786, 50141, 36877, 16653, 5284, 12596, 26831, 34232, 44109, 19134, 31337, 45594, 33551, 14836, 16763, -6836, -16382, 15678, 28357, -25617, -42816, -11229, 62664, 74693, 49063, 13675, 13319, 28400, 59331, 60793, 61985, 49623, 30648, 30440, 18239, 13113, -6700, 18064, 25803, 13812, 12734, -2349, 17870, 21854, 4798, 49767, 87283, 93643, 77913, 64927, 88242, 70760, 18223, 16464, -351, 1239, -15529, -30739]
15400c0739L0099L9140l6573l7522m618M4517Q80N348p265p279k3637P930l4962
15387e4681j9330L4084J6512l7665R253J0739J363j4216K1049K2237j0404l2067
15375e3126Q615P751J0663L5656L3350m2430J1103Q029l3148O777J3815k2145
15363a5090j8598O4175P0563l0260j8386j7976l6624k9519l0891j8252j8423K4589
15351g4692k2047N842N0959R098J8688k4997o86M6285K6625O683L0571K1658j800
15338I2187n3819m8480j4536J2965j3650j9322K0436J43L8731R654M781J6427
15326D5517J6054l7565J7302J1224R247k4215j178K3982L061j4762n5485j361
15314h179K0895O8237J7985p8559o2074j9863K3192M9667j9810K8651J0026J1777
$$ y = [-30739, -640, 38500, 1927, -35595, -40213, 4304, 5184, 10532, 3267, -4012, -27649, -19719, -54681, -74011, -39927, -23415, -61080, -51827, -41088, -39725, -53941, -32892, -10655, -21059, -53126, -44511, -36760, -26097, 9559, 42909, 479, 11582, 19611, -13537, -6760, 7055, -15090, -33688, 30487, 101050, 70790, 52404, 34428, -2196, -31715, -62606, -80858, -99281, -74692, -96739, -90897, -39938, -30840, -12152, -37149, -37835, 8450, 35075, 41758, 72329, 93987, 92187, 38368, -10112, -24648, -11683, -25333, -44655, -24219, -24076, 14655, 24309, 29090, 45517, 61571, 24006, 41308, 52532, 61779, 37564, 36386, 60368, 63429, 48667, -6818, -8179, 12716, 80953, 98938, 20379, -41695, -61558, -38366, 11301, -8509, 20142, 30168, 41945]
15302D1945J4700k3506l7909l3779j1706N3721O2783l1248j5545J727J1733M146
15290C7062j1700k7484l1101J534r48k0463j924K7387j6608l88p05j7594L5517
15277b7415L102j2651j317q283j399j836L3911J7732p386j6672J2754M8263L4047
15264G2850J3030k7640l7698M487O2189N1352j2560l5184m5110k3209K6503J6491
15252F5501j1517j1848k2858J9517j164m0776J21N0985j51O586j8339j2796j246
15239B2015l9250l0982J1313O6383q542k7640L024K7020Q642J4478J1801N294
15227F3556l7864q344K2701r145n951o4819L6J4440R122j3980j6475J1935R925
15214b4863j1515L5079K9139j6238k7301L6005K8598k795K7207P70n3932m2188
$$ y = [41945, 56645, 33139, -4770, -38549, -50255, 3466, 66249, 35001, 19456, 21183, 32916, 37062, 25362, -2122, -33223, -31689, -32637, -53100, -55024, -27637, -44245, -44633, -45338, -62932, -27415, -24313, -36964, -38281, -46564, -47963, -49799, -15888, 1844, -5542, -22214, -9460, 38803, 72850, 85880, 58240, 20542, 25029, 87218, 138570, 126010, 90826, 45716, 22507, 49010, 65501, 53984, 42136, 19278, 38795, 37631, -3145, -3024, 47961, 47810, 54396, 36057, 23261, 22015, -17235, -48217, -36904, 29479, 20937, -6703, -3679, 23341, 31983, 46461, 58262, 63556, 25692, 17348, 40049, 30904, 24953, -39866, -39830, -25390, -16268, -30248, -46723, -34788, -24863, -36378, -1299, 27840, 11602, -15699, 20306, 48904, 46109, 73316, 74086, 20154, -22034]
15202b2034K4445K8634Q025j217m9250N918J054j656m754l4703Q764M0792K698
15189F716k5852k423q896k1877L1444K1318j9850N5736J9154k1519m818j732J5338
15176D2739l1573Q308l115j0392q588j2339r802K9716j6662l2286M0450J6453
15164A2909j9248j0795M3284K3044m891J4991p3888l7352J6169J0709j1352J2773
15152b3647J8693m156p573j7036j7606j2824L3511M0743l7832l2312K2411k6834
15140f4462L6515L6435j4219j9423J6755O698K7486j6813l0916j4304q38r477
15128d6563M8216l602L1462j3117k0404P900L2647N788j9704j3462Q93J5132o318
15115A8868J1955l3242j7481j553n985j4605K993o228L883O6003K6136P895j3845
$$ y = [-22034, 2411, 31045, 39070, 37853, -11397, -5479, -4425, -6081, -10835, -45538, -36774, 4018, 6716, -19136, -21559, -30455, -52332, -20888, 430, -19420, 36316, 55470, 33951, 29133, 27401, 42739, 11166, 19474, 16359, 5967, -2621, -14960, -24762, 4954, -11708, -43994, -3544, 12909, -6339, -17134, 26150, 49194, 44303, 59294, -14594, -51946, -35777, -25068, -36420, -23647, -4954, -9110, -16683, -33719, -51325, -64149, -30638, 10105, -27727, -60039, -37628, -64462, -27947, 8488, -5731, -25154, -8399, -1701, 25785, 8972, -21944, -36248, -37086, -46563, 1653, -1949, 29513, 16396, -4008, 3892, 36539, 42327, 22623, 9161, 10054, 25186, 18868, 30823, -2419, -19900, -21453, -27438, -42043, -39050, -45278, -41395, 24608, 50744, 58639, 44794]
15102D4794j6998n7945l0340L44N538K785L7301R70R614N7493q70j9789l0086
15089B811l5362l5902Q182Q353N0215L9465m3986j9391K8869J1527r327n3641
15077d8187k3512o821J3776L0589M4851L6509n093j7068m8573j7484R767K7291
15065c955J1076o769n992Q097k889j9278J3726K0224j616P356Q857j5004J1637
15052B5470o610K1672M5866o425l3872l1548j5671J9018J3681k581k6776R252
15040A1476Q789o668l3685j4205k7946J5650O766L8649N846O949L0610q683J4548
15027D8096J5376L022j97o288j5029o9157O238M7503J2925Q248L7841l2451j6972
15014C9155k6173M6082q59m2102n0578k090K5685n583K825j6775j8573K7682M4682
$$ y = [44794, 27796, -30149, -60489, -60145, -54607, -51822, -14521, -13551, -3937, 53556, 52686, 32897, 2811, -32551, -68453, -60271, -51918, -1703, 37762, -6224, -25615, 3254, 14781, 5454, -48187, -71699, -78520, -64744, -34155, 10696, 47205, 42112, 25044, -23529, -41013, -31246, -3955, 7121, 352, -5640, 2457, -432, -19710, -5984, 14240, 12624, 19980, 28837, 13833, 25470, 18860, 40532, 86398, 79973, 46101, 14553, -1118, 17900, 31581, 29000, 2224, 11476, 20265, 13597, -20088, -34293, -62239, -46589, -39823, -1174, 4672, 11621, 42231, 33548, 48096, 63472, 66494, 66297, 60009, 44980, -24177, -17939, 29564, 42489, 50737, 88578, 56127, 39155, 12982, 59064, 58205, 16103, -34475, -36565, -10880, -16463, -13638, -30413, -48986, -21304, 23378]
15001B3378l8627j1693J4001r019K8416L1099j243L10k6349j1397r253j9525J933
14988b7969N115J2205l4572j8086j3388M3917K0070j3602J5444O870k2281k005
14976b8282L8569J7184j396J0982k8570J0608j9300K0061L5738j8353N303J0092
14964E2636j3994M112K8015O464j0006J187m4315k6005O549j1128j248J6365l1859
14951b3227l0760K2466L1520K4084k4098J55m873O444j926o655o220L06m908l5211
14937e2903l1678L457K4696J8939K3250J430j3314k7011O405O709j6733o320R988
14924e3085K7002j4433j5148l763K2729J5242J8406j1297j8718p581K9872K3360
14912A2586j5892o8122J4414l6793K7966N3383K6558N1903p937l4420j2507l789
$$ y = [23378, -15249, -26942, -12941, -21960, 6456, 37555, 36312, 36622, 10273, -1124, -10377, -29902, -27969, -22854, -10649, -45221, -63307, -76695, -32778, -12708, -26310, -10866, -3996, -26277, -28282, 10287, 27471, 26075, 37057, 8487, 19095, -205, 19856, 55594, 37241, 42544, 52636, 38642, 42754, 70769, 77233, 67227, 68414, 24099, -1906, 4643, -6485, -7733, 8632, -23227, -53987, -31521, -1, 24083, -15, 140, -4733, 1711, -215, -6870, -13090, -12784, -17692, -52903, -84581, -81124, -56428, -37489, -14239, -12809, -26123, -53134, -46729, -40020, -56753, -63073, -53085, -26083, -40516, -55664, -59427, -36698, -21456, -3050, -14347, -33065, -40646, -10774, 12586, -3306, -71428, -57014, -93807, -65841, -12458, 14100, 66003, 58066, 23646, 11139, 7350]
14900G350k188L1940k2600m8101K4501l2820k1147K8882j507j9782K7536P046
14888b0890o751J3625M2145k8863o6922K0457J3320L1110L8336J2319l5835m9570
14876c7519q861k9080k416N7259k91j0570l1209l8217J3651N7776o608k4309J212
14863e9182n634J1300M2771O940R495k8502k1825K2025J8160r725K4107M3556
14851E3486n477l4097n174K3269J0413J8743r882m6290k8666m939M6921J8545
14839C6852m6645j7241m8087j2773M5580M7462j403k8044m9567K8086J6792P29
$$ y = [7350, 5162, 37102, 14502, -33599, -9098, -41918, -63065, -34183, -35690, -55472, -27936, -20890, -27641, -14016, 28129, -734, -67656, -47199, -33879, -2769, 35567, 47886, 12051, -37519, -46380, -75460, -77876, -20617, -20908, -31478, -62687, -100904, -87253, -29477, -36085, -60394, -59182, -64816, -53516, -10745, -3805, 5690, -22812, -44637, -22612, -4452, -14177, 9930, 53486, 48009, 13912, 8738, 32007, 42420, 61163, 51281, 4991, -23675, -28614, 18307, 36852, -9793, -27034, -75121, -87894, -42314, 5148, 3745, -24299, -73866, -45780, -28988, -28259]
$$ [...]
##END NTUPLES=NMR SPECTRUM
##END=
