##TITLE=XTC-966_2
##JCAMPDX= 6.0         $$ Bruker NMR JCAMP-DX V2.0
##DATA TYPE= nD NMR SPECTRUM
##DATA CLASS= NTUPLES
##NUM DIM= 2
##ORIGIN= BRUKER
##OWNER= patiny
$$ 1.79 TOPSPIN		Version 3.0
$$ 2012-05-19 16:29:53.693 +0200  patiny@icmbsg005
$$ Compression mode = diff/dup
##.OBSERVE FREQUENCY= 400.13188181139
##.OBSERVE NUCLEUS= ^1H
##.ACQUISITION MODE= SIMULTANEOUS (DQD)
##.ACQUISITION SCHEME= Echo-Antiecho
##.AVERAGES= 2
##.DIGITISER RES= 23
##SPECTROMETER/DATA SYSTEM= spect
##.PULSE SEQUENCE= hsqcetgpsisp2.2
##.SOLVENT NAME= D2O
##.SHIFT REFERENCE= INTERNAL, D2O, 1, 11.697
##AUDIT TRAIL= $$ (NUMBER, WHEN, WHO, WHERE, PROCESS, VERSION, WHAT)
$$ ##TITLE= Audit trail, TOPSPIN		Version 3.0
$$ ##JCAMPDX= 5.01
$$ ##ORIGIN= Bruker BioSpin GmbH
$$ ##OWNER= patiny
$$ $$ /opt/data/patiny/nmr/XTC-966_2/13/pdata/1/auditp.txt
$$ ##AUDIT TRAIL=  $$ (NUMBER, WHEN, WHO, WHERE, PROCESS, VERSION, WHAT)
(   1,<2012-05-19 16:29:52.591 +0200>,<patiny>,<icmbsg005>,<go>,<TOPSPIN 3.0>,
      <created by zg
	started at 2012-05-19 16:11:11.388 +0200,
	POWCHK enabled, PULCHK disabled,
       configuration hash MD5:
       77 C7 B7 C4 10 F4 BA 30 64 2E BB 52 82 F2 DA 41
       data hash MD5: 1K * 256
       F8 7E 9B A4 DE AC 1B 25 C9 16 76 F1 06 21 0B B9>)
(   2,<2012-05-19 16:29:52.692 +0200>,<patiny>,<icmbsg005>,<audit>,<TOPSPIN 3.0>,
      <user comment:
       ICON-NMR User ID: patiny
       data hash MD5: 1K * 256
       F8 7E 9B A4 DE AC 1B 25 C9 16 76 F1 06 21 0B B9>)
(   3,<2012-05-19 16:29:53.510 +0200>,<patiny>,<icmbsg005>,<proc2d>,<TOPSPIN 3.0>,
      <Start of raw data processing
       xfb same F2: SI = 1K WDW = 4 SSB = 2 FT_mod = 6 PKNL = 1 PHC0 = 0 PHC1 = 0 F1: SI = 1K ME_mod = 2 NCOEF = 32 WDW = 4 SSB = 2 FT_mod = 6
       data hash MD5: 1K * 1K
       13 F2 CF 57 72 97 44 E9 38 83 15 BA B5 F2 E0 DD>)
(   4,<2012-05-19 16:29:53.596 +0200>,<patiny>,<icmbsg005>,<proc2d>,<TOPSPIN 3.0>,
      <abs2 F2: ABSG = 5 ABSF1 = 11.697 ABSF2 = -2.290992
       data hash MD5: 1K * 1K
       91 5D C2 37 07 D6 17 4D 99 C0 79 52 B4 85 4F E0>)
(   5,<2012-05-19 16:29:53.682 +0200>,<patiny>,<icmbsg005>,<proc2d>,<TOPSPIN 3.0>,
      <abs1 F1: ABSG = 5 ABSF1 = 179.9984 ABSF2 = -40.017
       data hash MD5: 1K * 1K
       5C 6F 2A A2 79 22 63 85 67 4D E0 B6 C0 B3 62 EF>)
$$ ##END=
$$ 
$$ $$ hash MD5
$$ $$ 63 52 6E 09 12 83 47 AE CC 73 52 E9 55 25 69 EF
##$RELAX= 
##$RELAX= 
##$RELAX= 
##$RELAX= 
##$RELAX= 
##$RELAX= 
##$RELAX= 
##$RELAX= 
##$RELAX= 
##$RELAX= 
##$RELAX= 
$$ Bruker specific parameters
$$ --------------------------
##$DATPATH= </opt/data/patiny/nmr>
##$EXPNO= 13
##$NAME= <XTC-966_2>
##$PROCNO= 1
##$ACQT0= 0
##$AMP= (0..31)
100 100 100 100 100 100 100 100 100 100 100 100 100 100 100 100 100 100
100 100 100 100 100 100 100 100 100 100 100 100 100 100
##$ANAVPT= -1
##$AQSEQ= 0
##$AQ_mod= 3
##$AUNM= <au_zg>
##$AUTOPOS= <23 >
##$BF1= 400.13
##$BF2= 100.612769
##$BF3= 400.13
##$BF4= 400.13
##$BF5= 400.13
##$BF6= 400.13
##$BF7= 400.13
##$BF8= 400.13
##$BYTORDA= 0
$$ [...]
##$REVERSE= no
##$SF= 400.13
##$SI= 1024
##$SIGF1= 11.697
##$SIGF2= -2.290992
##$SINO= 0
##$SIOLD= 1024
##$SPECTYP= <>
##$SREGLST= <13C.H2O+D2O>
##$SSB= 2
##$STSI= 1024
##$STSR= 0
##$SW_p= 5597.01492537312
##$SYMM= 0
##$S_DEV= 1700165
##$TDeff= 1024
##$TDoff= 0
##$TI= <>
##$TILT= no
##$TM1= 0
##$TM2= 0
##$TOPLEV= 100
##$USERP1= <>
##$USERP2= <>
##$USERP3= <>
##$USERP4= <>
##$USERP5= <>
##$WDW= 4
##$XDIM= 1024
##$YMAX_p= 80576325
##$YMIN_p= -441625505
##$CURPLOT= <Cups-PDF>
##$CURPRIN= <$Cups-PDF>
##$DFORMAT= <normdp>
##$LAYOUT= <+/2D_inv.xwp>
##$LFORMAT= <normlp>
##$PFORMAT= <normpl>
$$ Bruker specific parameters for F1
$$ ---------------------------------
##$ACQT0= 0
##$BF1= 100.612769
##$FnMODE= 6
##$NUC1= <13C>
##$O1= 7041.95747781
##$SFO1= 100.619810957478
##$SW= 220
##$SW_h= 22136.3584106452
##$TD= 256
##$ABSF1= 179.9984
##$ABSF2= -40.017
##$ABSG= 5
##$ABSL= 0
##$ALPHA= 0
##$AQORDER= 0
##$ASSFAC= 0
##$ASSFACI= 0
##$ASSFACX= 0
##$ASSWID= 0
##$AUNMP= <>
##$AXLEFT= 0
##$AXNAME= <F1>
##$AXNUC= <13C>
##$AXRIGHT= 0
##$AXTYPE= 0
##$AXUNIT= <>
##$AZFE= 0.1
##$AZFW= 0.5
##$BCFW= 0
##$BC_mod= 0
##$BYTORDP= 0
##$COROFFS= 0
##$CY= -3
##$DATMOD= 1
##$DC= 0
##$DFILT= <>
##$DTYPP= 0
##$ERETIC= no
##$F1P= 0
##$F2P= 0
##$FCOR= 0.5
##$FTSIZE= 1024
##$FT_mod= 6
##$GAMMA= 0
##$GB= 0
##$INTBC= 1
##$INTSCL= 1
##$ISEN= 128
##$LB= 0
##$LEV0= 0
##$LPBIN= 512
##$MAXI= 10000
##$MC2= 5
##$MEAN= 0
##$ME_mod= 2
##$MI= 1
##$NCOEF= 32
##$NC_proc= -11
##$NLEV= 6
##$NOISF1= 0
##$NOISF2= 0
##$NSP= 0
##$NTH_PI= 0
##$NZP= 0
##$OFFSET= 179.9984
##$PC= 4
##$PHC0= 0
##$PHC1= 0
##$PH_mod= 0
##$PKNL= no
##$PPARMOD= 1
##$PPDIAG= 0
##$PPIPTYP= 0
##$PPMPNUM= 100
##$PPRESOL= 1
##$PSCAL= 1
##$PSIGN= 0
##$PYNMP= <>
##$REVERSE= no
##$SF= 100.612769
##$SI= 1024
##$SIGF1= 179.9984
##$SIGF2= -40.017
##$SINO= 0
##$SIOLD= 1024
##$SPECTYP= <>
##$SREGLST= <>
##$SSB= 2
##$STSI= 1024
##$STSR= 0
##$SW_p= 22136.3584106452
##$SYMM= 0
##$S_DEV= 1700165
##$TDeff= 512
##$TDoff= 0
##$TI= <>
##$TILT= no
##$TM1= 0
##$TM2= 0
##$TOPLEV= 0
##$USERP1= <>
##$USERP2= <>
##$USERP3= <>
##$USERP4= <>
##$USERP5= <>
##$WDW= 4
##$XDIM= 128
##$YMAX_p= 80576325
##$YMIN_p= -441625505
$$ End of Bruker specific parameters
$$ ---------------------------------
##NTUPLES= nD NMR SPECTRUM
##VAR_NAME=  FREQUENCY1,    FREQUENCY2,      SPECTRUM
##SYMBOL=    F1,            F2,              Y
##.NUCLEUS=  13C,           1H
##VAR_TYPE=  INDEPENDENT,   INDEPENDENT,     DEPENDENT
##VAR_FORM=  AFFN,          AFFN,            ASDF
##VAR_DIM=   1024,          1024,            1024
##UNITS=     HZ,            HZ,              ARBITRARY UNITS
##FACTOR=    21.6175375103957, 5.46583488805969, 1
##FIRST=     18110.137220953, 5591.54909048506, 1530275
##LAST=      -4004.60365218182, 0,           1416926
##MIN=       -4004.60365218182, 0,           -441625505
##MAX=       18110.137220953, 5591.54909048506, 80576325
##PAGE= F1=18110.13722095
##FIRST=     18110.137220953, 5591.54909048506, 1530275
##DATA TABLE= (F2++(Y..Y)), PROFILE
$$ [...]
##PAGE= F1=3107.566188738
##FIRST=     18110.137220953, 5591.54909048506, -1486428
##DATA TABLE= (F2++(Y..Y)), PROFILE
50a422247j80718g27698A530406J073911A159849g14629r53824f55996B88856
40i00337j212487b62570B953133J90520H46625a482132j991270p75567a672665
30A557841R56042C90311a078553j22302j96489N71399A334601J262753A021822
20a06150A94232F8958K38883L45894c81236p99437l06891n55866Q31265a48995
9c23208q98797m53771f09932F54263K16835k69370j34216A09505g67122
$$ plain form
50 -1422247 -1602965 -727698 1530406 2604317 1159849 -714629 -1668453 -655996 288856
40 -900337 -2112824 -262570 2953133 3143653 846625 -1482132 -3473402 -4248969 -1672665
30 1557841 2513883 390311 -1078553 -1200855 -1397344 -825945 1334601 2597354 1021822
20 -106150 194232 68958 307841 653735 -381236 -1180673 -1487564 -2043430 -1212165 -148995
9 -323208 -1222005 -1675776 -609932 654263 871098 601728 467512 109505 -767122
##PAGE= F1=3085.948651228
##FIRST=     18110.137220953, 5591.54909048506, -548514
##DATA TABLE= (F2++(Y..Y)), PROFILE
1023e48514o57742N12735D45832J106153K62507q23219N16974P34710m32673j78104
1013A632180l18717a40188j984127j369603P61631o582o2897N54141F9966J121003
1003A190969g07448k079037n7813j758j410804j079693J291480a534896a15845
993c28823L8815O0171j82736F10697K500740K40313A614527k10768J459686N44168
983C407613j693767a461878j681648a254672C52096b54074j387276l20084N25174
974a436260c61774B56386b17446q00486l34025M29580B402N28842a31958l2092
964a64050m9018k85205j536285N04511C7150J414921K77714K84685J196816J110970
954D322256j90419j89088l26536j531734F42760B39090E8030b77884m13544J87525
$$ plain form
1023 -548514 -1206256 -693521 445832 1551985 1814492 991273 1508247 2242957 1810284 1632180
1013 1632180 1313463 -140188 -2124315 -3493918 -2732287 -2738869 -2801766 -2247625 69966 1190969
1003 1190969 -707448 -2786485 -2844298 -2846056 -4256860 -5336553 -4045073 -1534896 -115845
993 -328823 -290008 -229837 -412573 610697 3111437 3351750 1614527 1403759 2863445 3407613
983 3407613 1713846 -1461878 -3143526 -1254672 352096 -254074 -1641350 -1961434 -1436260
974 -1436260 -361774 256386 -217446 -1017932 -1351957 -922377 2402 531244 -131958 -164050
964 -164050 -213068 -498273 -2034558 -1530047 37150 1452071 1729785 2014470 3211286 4322256
954 4322256 4131837 3942749 3616213 2084479 642760 239090 58030 -277884 -691428 -503903
944e03903B138286K474032k092006a106274N14037B07197g91907K29543b11271
934f64496K85303J20141E84451R81723l19546E68540M1886J36404Q4621K103940
924B935391K030948j26518B014864b008543k19540A081967J520085A238321B28610
914A001681Q51052P51592o0114j220696a087732q43919e90698K66251j052123
905a376570M54221G21225d73521j783775J032743E26158N82029M84267p33692
896H58762l82650J177073K15276p45828l64861f22205p28583j66167J75225F09931
885B412589F68363a647975J77125f53691l18831p90500j030270i27548B879904
875B303764a761064j744369M95850J374851A81263J179661M15264K48187l42063
$$ plain form
944 -503903 2138286 4612318 2520312 -1106274 -592237 207197 -791907 -562364 -211271
934 -664496 -379193 -259052 584451 1566174 1246628 568540 610426 746830 831451 2935391
924 2935391 4966339 4839821 2014864 -2008543 -2228083 1081967 2602052 1238321 228610
914 1001681 1852733 2604325 2544211 1323515 -1087732 -1931651 -590698 -324447 -1376570
905 -1376570 -922349 721225 -473521 -2257296 -1224553 526158 1108187 1592454 858762
896 858762 476112 1653185 1868461 1122633 757772 -622205 -1350788 -1516955 -1341730 609931
885 2412589 668363 -1647975 -1470850 -653691 -972522 -1763022 -2793292 -927548 2879904
875 2303764 -1761064 -3505433 -3009583 -1634732 181263 1360924 1776188 2024375 1682312
866A682312f47353j901865M81986c35647B22639d46572o23654n08102k37037d42399
855A610605J30809H61158L82010F03124b29070p15056q22207O66492A043186Q83409
845A926595D49975a066360M53030A136402Q53592m61276h86333j268659O62768
836a492224L17201M28129I54154O7559a36709H07996K860020K89756A424731D40132
825A715062L26214e0073j445191J10084l677k87103c64758B443121J190999j194951
815B439169G81445a74921m74005K61458a4766j48529k1257b6922G5730a114636
804c308068j087345J231819b06956B355659L59407I19685a643300j241637R93437
795a891500C97326J025768K28300P04935J426097m40915A408935C23637K70477
$$ plain form
866 1682312 -647353 -2549218 -2067232 -335647 222639 -446572 -1070226 -1578328 -1815365 -442399
855 1610605 1741414 861158 1243168 603124 -229070 -944126 -1766333 -1099841 1043186 1926595
845 1926595 449975 -1066360 -613330 1136402 1989994 1528718 -886333 -2154992 -1492224
836 -1492224 -1175023 -746894 954154 1021713 -136709 807996 3668016 3957772 1424731 440132
825 1715062 2041276 -50073 -1495264 -1385180 -1388857 -1675960 -364758 2443121 3634120 2439169
815 2439169 781445 -174921 -648926 -387468 -14766 -163295 -184552 -26922 75730 -1114636
804 -3308068 -4395413 -3163594 -206956 2355659 2715066 919685 -1643300 -2884937 -1891500
795 -1891500 397326 1423094 1651394 2356329 3782426 3341511 1408935 323637 594114
786E94114K52123C17954a496991j026316O32884e91094A61322N49166b86331r44783
776a231114d36167A601593J574120l96851D6986b440784J97737e90594A518890
766B717998G51783b194996o32500J303358b7253I2524h83108L31881A3272c38753
755h82978a93475D09480e5275K6445I33173J58044B69223a024072a43918C26017
744a555231o70201a004681H15077J473495p19570a046380k083082L06346a048100
734a9939B60238J046199L63803G70215c24896m32881r06590d89859B154063O95753
724B849816j321727B40236c89252l96807q1664m93417k61455M62248d10073A80764
713G26480L44536F864b208883M23907D13377J19061A59431J664189J464737H60689
$$ plain form
786 594114 846237 317954 -1496991 -2523307 -1890423 -591094 161322 710488 -286331 -1231114
776 -1231114 -436167 1601593 3175713 2778862 46986 -2440784 -2243047 -590594 1518890
766 2717998 751783 -2194996 -2827496 -1524138 -27253 92524 -883108 -551227 13272 -338753
755 -882978 -193475 409480 -55275 -28830 933173 1091217 269223 -1024072 -143918 326017
744 -1555231 -2225432 -1004681 815077 2288572 1569002 -1046380 -3129462 -2823116 -1048100
734 -19939 260238 1306437 1670240 770215 -324896 -757777 -1664367 -489859 2154063 2849816
724 2849816 1528089 240236 -389252 -786059 -867723 -1361140 -1622595 -1160347 -410073 180764
713 726480 1071016 6864 -2208883 -1784976 413377 532438 159431 1823620 3288357 860689
702b791043r27486a197158A304090Q0406B3448h76270o9382c93808G73406c66677
691b337627Q21763A954250K880062j692806d21203j414928h86251F04898M44933
682A049831c29586r17474J50986c05260n90270k967060r43216a066520B491740
672B583580B54265a610790e36644A060572C78702i17222j326356n42531N97826
663b188283j30649j260481O79323c93943A039635m6900J87165l75709N52503R77761
653B334455j057321f01563j558668o84333M51625e36943B301689P68370A444101
643A437299R82762Q91799p9909m10141k70091j27242n66801c89284r99094e74677
632b65642p51700P1218J96870J18965g2846K607m30000l31194B07808J259009
$$ plain form
702 -2791043 -3718529 -1197158 1304090 1384496 23448 -876270 -945652 -393808 773406 -366677
691 -2337627 -1515864 1954250 4834312 3141506 -421203 -1836131 -886251 604898 1049831
682 1049831 -329586 -1247060 -1096074 -305260 -895530 -3862590 -4805806 -1066520 2491740
672 2583580 254265 -1610790 -536644 1060572 378702 -917222 -2243578 -2786109 -2188283
663 -2188283 -2318932 -3579413 -2900090 -393943 1039635 992735 1179900 804191 1356694 2334455
653 2334455 1277134 -601563 -2160231 -2844564 -2392939 -536943 2301689 3070059 1444101
643 1437299 2420061 3311860 3231951 2821810 2551719 2424477 1857676 -389284 -1388378 -574677
632 -265642 -1017342 -946124 -749254 -630289 -72846 -70239 -500239 -831433 207808 1466817
622A466817P35540l50274b40870n93283A498103J448166A395173g02968q92215
613a595183j686252j610095J487443c89681G19632i05731k275916Q00812G64607
603C848655P97091A888921a616302o68333g06494b2917p11027m99583g3560A445170
592E47183f73969c06042m54660A98003J600070b42306l407461L89281J254589
583b005897j49984b13247B235853k68803A54566H640J276842m85213b82960m93121
573g76081k59308K92931B72119R4565d82020a13845A48330a923045j909397J547771
563b284671d17489J8265J66052I28206B03898a709279O57374H62885L0035L01990
553A194910J417083F68068b603600q6222b93229k76855j244319a30306A651564
$$ plain form
622 1466817 2202357 1852083 -240870 -834153 1498103 2946269 1395173 -702968 -1595183
613 -1595183 -3281435 -4891530 -3404087 -389681 719632 -905731 -3181647 -2380835 764607
603 3848655 4645746 1888921 -1616302 -2284635 -706494 -22917 -733944 -1233527 -73560 1445170
592 547183 -673969 -306042 -760702 198003 1798073 -242306 -3649767 -3260486 -2005897
583 -2005897 -2155881 -213247 2235853 1967050 154566 8640 1285482 800269 -282960 -776081
573 -776081 -1035389 -742458 272119 366684 -482020 -113845 148330 -1923045 -3832442 -2284671
563 -2284671 -417489 -399224 -233172 928206 203898 -1709279 -1051905 862885 892920 1194910
553 1194910 2611993 668068 -2603600 -2689822 -293229 -570084 -1814403 -130306 1651564
543A251039p4913P60569m48398H5520b63992F01709N83023J433207J225211r14092
533B929058A003467n01267Q71930R09988M96566m88109B75833i08797j10334p72994
523a792125k90927M38823L62396a23366B49194a691880j686575J183700a58503
513A171198J054316O27271K01375p21601j120808f95378j534209P76129C52656
503B620493Q87619j666521a257104k352475r09692J825291a63871A086982m80726
494F06256K9269M07746g591j953137J29937a84325A047902k96610A66053P32422
484H98475N06101n66576C78687J60064k2854b19728l72972K90686B14314h12669
473c160540l34794a265124b61880l45309b40057j72427n72821L24063d1183q40164
$$ plain form
543 1251039 1176126 1936695 1488297 85520 -263992 601709 1184732 2617939 3843150 2929058
533 2929058 1003467 502200 1374130 2284118 2780684 2292575 275833 -908797 -1019131 -1792125
523 -1792125 -2083052 -1644229 -1281833 -123366 249194 -1691880 -3378455 -2194755 -158503
513 1171198 2225514 2852785 3054160 2332559 1211751 -695378 -2229587 -1453458 352656
503 2620493 3508112 1841591 -1257104 -3609579 -4519271 -2693980 -163871 1086982 606256
494 606256 635525 1043271 -7591 -1960728 -1830791 -184325 1047902 751292 166053 898475
484 898475 1404576 838000 378687 538751 515897 -219728 -592700 -302014 214314 -812669
473 -3160540 -3495334 -1265124 -261880 -607189 -240057 -412484 -985305 -661242 -41183 -881347
463h81347k553641j925154O65155J624816P42531K04526J035391A7676a31968
453h43467A15334c75498k508042m47598i74847I76449K286161m58875A123945
443D68091N74351J666168J186115r77280j240903J995o81092b61155H27355J774555
433B601910A236112a146093j291657J010105B97192d23619q94475f2200r24808
424i87008k78664A6690g39781R7100k42302j076500k169046P25531B87660L504187
414C791847m36865A447799E11589I2648J644701k88554e32673j29385A032455
404B436699n48831l75701p03945R30683J439474J205534o90634A266065e34121
394a137742q49243J26537M19917f69775l73319p58861h36597A00921c4132q1874
$$ plain form
463 -881347 -3434988 -5360142 -4694987 -3070171 -2327640 -2123114 -1087723 17676 -131968
453 -843467 115334 -375498 -2883540 -3331138 -974847 976449 3262610 2803735 1123945
443 468091 1042442 2708610 3894725 2917445 1676542 1678537 997445 -261155 827355 2601910
433 2601910 1236112 -1146093 -2437750 -1427645 297192 -423619 -1318094 -62200 -987008
424 -987008 -1265672 16690 -739781 -642681 -884983 -1961483 -4130529 -3404998 287660 3791847
414 3791847 3354982 1447799 511589 92648 1737349 1448795 -532673 -662058 1032455
404 2436699 1887868 1512167 808222 1738905 3178379 4383913 3693279 1266065 -534121
394 -1137742 -1986985 -1860448 -1440531 -669775 -1043094 -1801955 -836597 100921 -34132 -116006
384a16006k023499o04074e92830I96183o867A87141c27972n7028m63991m79913
374a328904B62252J853337o98335i39146k242763J4291J538657K98282j17825
365a448504c17926E28347m1184P91484K62096d4731k330020o80502a364126F0040
354h40558m87586k78335j234589J387562A244077J166184r06554m619J124533
345B623621k94724f0552k315493j61524b05670A310210B82133g37586A236390
335C130131j402836f2115A705434K643467O77745k207810C0445b50127C3951a368718
324a219846A617856N77836D4041h10700A208022J903832K286587m72101A246744
314g72569C19104J009153N55135H71656a189647j187942J69993c71543A387909
$$ plain form
384 -116006 -2139505 -2743579 -592830 996183 989316 187141 -327972 -385000 -848991 -1328904
374 -1328904 262252 2115589 1417254 -939146 -3181909 -3167618 -1628961 -1330679 -1448504
365 -1448504 -317926 528347 487163 1278647 1540743 -44731 -2374751 -3055253 -1364126 60040
354 -840558 -1328144 -1606479 -2841068 -1453506 1244077 2410261 1503707 1499088 2623621
345 2623621 2328897 -60552 -2376045 -2537569 -205670 1310210 282133 -737586 1236390
335 3130131 1727295 -62115 1705434 4348901 5026646 2818836 30445 -250127 33951 -1368718
324 -1219846 1617856 2195692 44041 -810700 1208022 3111854 5398441 4926340 1246744
314 -772569 319104 1328257 1883392 871656 -1189647 -2377589 -2207596 -371543 1387909
304A193318l56359k37131A57669g7078j6288l38639M1579l78506j054367n66421
294b389720g21812A627794N08293A011501D44607J538803N45579D40959e74592
284A086273J844197r39066A9348i74524J15639G18285J080864B69804a706002
274b760939J94803a231389N63372k1400A78837J380342J04075n36281Q4584C70914
263a360086n19487h39405a53318p07586m5724B40807O33021J57891N23910l98779
253A156850l48117J598701J1824A024414J7461J95917A782e70525b75166E18449
242G92004a813219j495874a637492f56842J12926E89596R16329J214093J493779
233D213797o55834G55598c98963A91845i91164j878034M19835O52756p11886k06521
$$ plain form
304 1193318 836959 599828 157669 -77078 -93366 -432005 -390426 -768932 -1823299 -2389720
294 -2389720 -721812 1627794 2136087 1011501 444607 1983410 2528989 440959 -574592
284 1086273 2930470 1991404 19348 -974524 -858885 718285 1799149 269804 -1706002
274 -2760939 -2566136 -1231389 -668017 -689417 178837 1559179 1663254 1126973 1211557 370914
263 -1360086 -1879573 -839405 -153318 -860904 -906628 240807 873828 1031719 1555629 1156850
253 1156850 808733 2407434 2419258 1024414 1041875 1237792 1782 -570525 -275166 518449
242 792004 -1813219 -3309093 -1637492 -656842 -543916 589596 1505925 2720018 4213797
233 4213797 3557963 755598 -398963 191845 -991164 -2869198 -2449363 -1796607 -2508493 -2715014
223b715014J40746J179933G71528a11418k908248j243037Q97010J073552e7055
213A466646K56704p55749c19658N7271l92201j405408R34329A160105k59804g29838
202g8178A436936Q3071g24808j839819O97753f83560n00529M0043a9113A09080
191c48067J71178j739687k095629a776538F66968j07864a183188m95962f6782
181A410096F27671d50162A129400J208304j086147C32402J505720J849341O2075
172C749538A380176i57544k92711G56284K691705r96780c97403k986G46762k21729
162E25033m8071P68890R7884E15119h30610q82603N75505N24999o23049n97454
152a833212f20857B144779P37740j383702b49047j525288n99193J133238I39961
$$ plain form
223 -2715014 -2574268 -1394335 771528 -111418 -3019666 -4262703 -3365693 -2292141 -57055
213 1466646 1723350 967601 -319658 -262387 -654588 -2059996 -1125667 1160105 900301 -729838
202 -78178 1436936 1520007 -724808 -2564627 -1866874 -683560 -1184089 -1144046 -19113 109080
191 -348067 -176889 -1916576 -4012205 -1776538 666968 559104 -1183188 -1679150 -66782
181 1410096 627671 -450162 1129400 2337704 1251557 332402 1838122 3687463 3749538
172 3749538 1380176 -957544 -1250255 756284 3447989 2451209 -397403 -400389 746762 525033
162 525033 476962 1245852 1343736 515119 -830610 -1713213 -1137708 -612709 -1235758 -1833212
152 -1833212 -620857 2144779 2882519 1498817 -249047 -1774335 -2373528 -1240290 939961
142A968229q37415D25990j66207R5559P83005J074968F57202b801845j597589
133d399434J280221f88689c23166j67513C01477P24460J54627J467794O80577
124C328935j084202G60693k7667N35898c4725j680827k56109f78192G46743a01159
113a523885l94631d66802H32713a480560j995353J561551B02721N48683R28383
104A679787k8493F18101L78010J262408N15022A198375i37176M12309A903974
94B542326I50237f88043n50786L40052e6499j094642k597999r92912J651674J325858
84a764520P32255B73842J257669a20307k318581l6129A22995M43257a446466r41011
74b387477c54695A879662L61184q15288C6516d52226B18626R91312o191Q21166
$$ plain form
142 1968229 1130814 425990 259783 355342 1138347 2213315 657202 -2801845 -4399434
133 -4399434 -3119213 -688689 -323166 -490679 301477 1025937 1180564 2648358 3328935
124 3328935 2244733 760693 733026 1268924 -34725 -1715552 -1971661 -678192 746743 -101159
113 -1523885 -1918516 -466802 832713 -1480560 -3475913 -1914362 202721 751404 1679787
104 1679787 1651294 618101 996111 2258519 2773541 1198375 -937176 -524867 1903974
94 2542326 950237 -688043 -1238829 -898777 -56499 -1151141 -3749140 -4742052 -3090378 -1764520
84 -1764520 -1032265 273842 1531511 -120307 -2438888 -2475017 122995 566252 -1446466 -2387477
74 -2387477 -354695 1879662 2240846 1425558 36516 -452226 218626 1209938 1203747 2024913
64B024913m60373d44293q31618c85170C20956R87643o36240h48844l4217A186994
53B160536I63126c72254o57771j11628b16061B207200J236528A584964f37768
43h99355H85358N00704c89077j647683g60205B308507O85940A451583b47625j822503
33b070128j125549a212789A584278N75606a85127p34594d23397n06573M62938
24d67032B122178J413275A549236C4838f8722q2812B01853K12738d48721n56648
14a005369n6158l24072N56651b51888l67154j145871p27432a074818H72583O67147
4A539730l72801m77800b8360m35235
0d63595
$$ plain form
64 2024913 1564540 -444293 -1275911 -385170 320956 1308599 672359 -848844 -883061 1186994
53 2160536 963126 -372254 -1030025 -1141653 -216061 2207200 3443728 1584964 -637768
43 -899355 885358 1386062 -389077 -2036760 -760205 2308507 2994447 1451583 -247625 -2070128
33 -2070128 -3195677 -1212789 1584278 2159884 -185127 -919721 -423397 -929970 -467032
24 -467032 2122178 3535453 1549236 34838 -68722 -151534 201853 414591 -448721 -1005369
14 -1005369 -1061527 -1385599 -828948 -251888 -619042 -1764913 -2492345 -1074818 872583 1539730
4 1539730 1166929 689129 -28360 -463595
0 -463595
##PAGE= F1=3064.331113718
##FIRST=     18110.137220953, 5591.54909048506, 9382
##DATA TABLE= (F2++(Y..Y)), PROFILE
1023I382c98317J77211F94148J172081O2380H70933Q55837P17575G75290d06728
1012C94085J86216a040601j567031p911j475400j020973J084100a293427E72410
1002h28254k367345l80086K34172j066940j211918Q27682J886730J358035n1803
993a599727L51370d74832A98456J305019J698483J14079j150835J14099P40452
984C019753N23220j767214h66789j141388a96421A035487H9890a450485q28007
975b278492J02569a071384N17747p95609l65899L21489O33112a37842A03253f65191
964f20438C56143L06898h89068K86325B14268M05154n7950P76067K044504J540148
954D922191p23502o15689k35812A649762b2510k8420P624o98432j10308D55470
$$ plain form
1023 9382 -398317 -221106 694148 1866229 1928609 870933 1726770 2444345 775290 -406728
1012 394085 580301 -1040601 -2607632 -2615543 -4090943 -5111916 -4027816 -1293427 572410
1002 -828254 -3195599 -3575685 -3341513 -4408453 -5620371 -4792689 -2905959 -1547924 -1599727
993 -1599727 -1248357 -474832 198456 1503475 3201958 3316037 2165202 2279301 3019753
984 3019753 3542973 1775759 -866789 -2008177 -196421 1035487 89890 -1450485 -2278492
975 -2278492 -2175923 -1071384 -553637 -1349246 -1715145 -1393656 -760544 -137842 103253 -665191
964 -620438 356143 663041 -889068 -602743 214268 619422 561472 1337539 3382043 4922191
954 4922191 4198689 3583000 3347188 1649762 -22510 -50930 -43306 -741738 -852046 455470
943C591304K223691k151925D35708K759A25850b018656m19269J19489k06544R10155
933a614825N95449a29296A067044L1423m38629n7064e251n61507B062326K283576
923D345902p11295A365213a623367l91943F97023J918416j200195e30636b39631
913A387200J390093J00480j125305e56518j227860L90601J34138m93407M57753
904a295293b58163r16389j164134Q38733b60468A27152M14215l9507K70515J420407
894B192782N49249k84702q33971a075115j613721M12308Q47979C14152J678064
885A992216r95728i17490m7564d22784j39402p06519j455982J248002A678069
875F80647c110997q22042R84894a470420b18866J4944e9740A183850O05069h98401
$$ plain form
943 3591304 5814995 3663070 435708 438467 125850 -2018656 -2437925 -2318436 -2524980 -1614825
933 -1614825 -1019376 -129296 1067044 1098467 659838 602774 -5251 -566758 2062326 4345902
923 4345902 3634607 1365213 -1623367 -2015310 697023 2615439 1415244 -530636 -239631
913 1387200 2777293 2877773 1752468 -556518 -1784378 -1393777 -1259639 -1753046 -1295293
904 -1295293 -258163 -1174552 -2338686 -1499953 -260468 127152 541367 501860 772375 2192782
894 2192782 2742031 2457329 1623358 -1075115 -2688836 -2276528 -1428549 314152 1992216
885 1992216 996488 -917490 -965054 -422784 -562186 -1268705 -2724687 -1476685 1678069
875 680647 -3110997 -3933039 -2948145 -1470420 -218866 -203922 -59740 1183850 1788919 -898401
864c255150Q34359b52021C94324d16332q05968m21661l82820Q80650F21823O39949
854A261772j97611K46316D49099f00085p09361o72966h43495A604944L64886B9660
843a292706d50226A468679J063735j95408b20419j936916O52004b93896C3588
833E45870o5700h837F48890K032322N45128A464727D91652P33420j81480h46196
822a870310J25839J14698Q7316a6800B781003Q49022j034023q37177n85279C2311
811c90798k4398k38632h5035D20173j06620h60688k450871j832397J611886b72568
800B059239N80690j090105h52804j764097K31470g825A808223j50238p69424K84783
790A173344P70852j53465H89539k57186L98739j55632g09754j310959M82486e3712
$$ plain form
864 -3255150 -2420791 -252021 394324 -416332 -1222300 -1643961 -2026781 -1146131 621823 1261772
854 1261772 1064161 1310477 449099 -600085 -1309446 -1982412 -843495 1604944 1969830 29660
843 -1292706 -450226 1468679 2532414 2337006 -220419 -2157335 -1505331 -293896 33588
833 545870 480170 -8837 648890 2681212 3226340 1464727 491652 1225072 1043592 -846196
822 -1870310 -1744471 -1629773 -1542457 -16800 2781003 3630025 2596002 1758825 1173546 32311
811 -390798 -415196 -653828 -85035 420173 313553 -860688 -3311559 -5143956 -3532070 -272568
800 2059239 2639929 1549824 -852804 -2616901 -2385431 -7825 1808223 1657985 888561 1173344
790 1173344 1944196 1790731 889539 632353 1031092 875460 -709754 -2020713 -1538227 -53712
779G34260N08434B88913a322893K94096A294476J615079r95221i55586j862937
770b818523O92293h73892I03127J771998A144581b132428j017577P54027O80862
761a715116P51694K24008d5136B43438c73283q88627b72801F43911a21829q4157
751b05986I93730L0203b95573j600122c47026A030593d81112j246607M74433F37271
740C029316m01347c21550k478901j04941J264900g49309K19049A41412M55910
731E97322J45253C69802g2438j117935c05503B085565K73252A005914A14090O92365
721H06455P34239F34244a421617j113498P50169c75828C58934O14918K22375d56113
710c115827J378067A023520J35145E54622J376263J000067A32616c375401l23617
$$ plain form
779 734260 1242694 288913 -1322893 -1028797 1294476 2909555 1914334 -955586 -2818523
770 -2818523 -2126230 -873892 903127 2675125 1144581 -2132428 -3150005 -2395978 -1715116
761 -1715116 -963422 -739414 -45136 243438 -373283 -1261910 -272801 643911 -121829 -205986
751 -205986 993730 1023933 -295573 -1895695 -347026 1030593 -481112 -1727719 -1253286 637271
740 3029316 2627969 -321550 -2800451 -2905392 -1640492 -749309 -530260 141412 597322
731 597322 742575 369802 -72438 -1190373 -305503 2085565 2358817 1005914 114090 806455
721 806455 1540694 634244 -1421617 -2535115 -1784946 -375828 358934 973852 1196227 -456113
710 -3115827 -1737760 1023520 1158665 554622 1930885 2930952 132616 -3375401 -3699018
701c699018f08167A830735m92051e47420r03121M38814B94486J657561E38051
691a832355N71477B277178L079733j809121c96864j532565g46623I08607O19877
682A528484E02350f28557j13402J27231r89736k361500k94234a78023D032661
672C962898A248161c98791A069925J015148H87964f77701k041118r64740J175466
663b508093K80552j186140P81249F5934J670345J00727M43850m61024o7054P67257
653B520035j040804d05592p73492o39811p43357J215020A580935P62966j036707
644A307194P73042N66153q2470P2036R2163N87308K69192j131299h0891n51479
634f32370B00713a03226j182296M9946e97943b66554B25121M83515J27886l21250
$$ plain form
701 -3699018 -608167 1830735 1338684 -547420 -1450541 -1011727 294486 1952047 538051
691 -1832355 -1260878 2277178 5356911 3547790 -396864 -1929429 -746623 908607 1528484
682 1528484 502350 -628557 -741959 -614728 -1604464 -3965964 -4260198 -178023 4032661
672 3962898 1248161 -398791 1069925 2085073 887964 -677701 -2718819 -3683559 -2508093
663 -2508093 -2227541 -3413681 -2632432 65934 1736279 1837006 2280856 1819832 1752778 2520035
653 2520035 1479231 -405592 -1179084 -1818895 -2562252 -1347232 1580935 2343901 1307194
644 1307194 2080236 2646389 2563919 2635955 2728118 3315426 3584618 2453319 -80891 -632370
634 -632370 200713 -103226 -1285522 -1235576 -597943 -266554 225121 708636 836522 515272
624E15272N05023P37535J13297k80397B46030a31017A385525Q64584A105869h76625
613b185631j645507j656253J241519h66719E29408i86975j715662R06367B35234
603B277772J374849j594296a197205r83653c32804A77028q0903R2212J231286
594A419623J065530H49240i25196a88424c0891C87393Q13388h17896k975601O78179
584c115318J130522m27356d05625B330378J73959G20097B76454J148046l39197
575A085303D89933K81932l24140d43624Q7310m61068j190463N97464d61952p67225
565a229177j615542J58709J171408L11142K94371H68279J12635a271077j77872
556a448949A41885O5740L93261J559629D06817b594153L25763A65549b52823q73768
$$ plain form
624 515272 1020295 1757830 1871127 1590730 246030 -131017 1385525 2250109 1105869 -876625
613 -2185631 -3831138 -5487391 -4245872 -866719 529408 -986975 -2702637 -1796270 235234
603 2277772 3652621 2058325 -1197205 -2180858 -332804 177028 96125 188337 1419623
594 1419623 2485153 849240 -925196 -188424 -30891 387393 1200781 -817896 -3793497 -3115318
584 -3115318 -1984796 -2412152 -405625 2330378 2504337 720097 276454 1424500 1085303
575 1085303 489933 771865 447725 -443624 -356314 -817382 -2007845 -1410381 -461952 -1229177
565 -1229177 -2844719 -2686010 -1514602 -1203460 -909089 868279 980914 -1271077 -1448949
556 -1448949 141885 207625 600886 2160515 406817 -2594153 -2268390 165549 -252823 -1126591
546a126591H05277J188708I50618N9549Q83116o86157e1795r7737c9350q71638
536i10988A13686K040649m45494p24422P32203M02470l86801O7897k1644F29762
525f21848q12528o89033K02942R17242M30920A26549K5279a715751j557871J393654
515a879968b73351J0172D49193J374402P30830q86918G21858g24313j477171M12835
505a788649e25625A731591M95321i111l079958j811287o10826K095678e36543
495A110531O5852J01668n14019a276053j879365M75318i22896E23512o9878c49700
484a80243B78014j30818c26797n26740M4092l55155o04353R2145N87811o07002
474a695999k154824p8522a194339D19676c85342r64610n66776J07292P70600b7506
$$ plain form
546 -1126591 805277 1993985 950618 1010167 1893283 1207126 -51795 -149532 -39350 -910988
536 -910988 113686 2154335 1708841 984419 1716622 2119092 1732291 1800188 1778544 629762
525 -621848 -1434376 -2123409 -1920467 -1003225 -572305 126549 151828 -1715751 -3273622 -1879968
515 -1879968 -273351 -263179 449193 1823595 2554425 1667507 721858 -724313 -2201484 -1788649
505 -1788649 -525625 1731591 2226912 -9111 -3089069 -4900356 -5511182 -3415504 -536543
495 1110531 1176383 1278051 764032 -1276053 -3155418 -2680100 -922896 523512 453634 -349700
484 -180243 278014 147196 -326797 -853537 -809445 -1164600 -1768953 -1676808 -1088997 -1695999
474 -1695999 -3850823 -3929345 -1194339 419676 -385342 -1349952 -1916728 -1809436 -1038836 -27506
463e80960l064363k366448Q59195J847626l8392m16760R85861J041045l69490
454b102686o59456Q75750K80780j461024n04740J401906g42528A071865K75268
445A347133B28288a061900j86961h2712A366581l54226b60740l31733j257792
436a850265j111069a427430b93955j978306k597260o82805J504778R52485j655664
427d750727j458554p49361k893759q97663o76169J893721j8225407n1572057r311931
418h8641907c0936160A1654122K44332j413708j140328l088748o39355k48215
410E368100M42589k119276G40637k62462J901064K427852L04628o27219j765510
401B718990p5849J295221J347916k06435k289132A037840k96483G1471c92439
$$ plain form
463 -580960 -3645323 -6011771 -5152576 -3304950 -3343342 -3760102 -2774241 -1733196 -2102686
454 -2102686 -2762142 -1886392 -1605612 -3066636 -3571376 -2169470 -742528 1071865 1347133
445 1347133 228288 -1061900 -1248861 -82712 1366581 1012355 -260740 -592473 -1850265
436 -1850265 -2961334 -1427430 -293955 -2272261 -4869521 -5552326 -4047548 -3095063 -4750727
427 -4750727 -6209281 -6958642 -9852401 -10750064 -11426233 -9532512 -27757919 -79329976 -88641907
418 -88641907 -30936160 11654122 11898454 10484746 9344418 6255670 5616315 5368100
410 5368100 5810689 3691413 740637 478175 2379239 4807091 5111719 4484500 2718990
401 2718990 2643141 3938362 5286278 5079843 2790711 1037840 741357 71471 -392439
391e05621B42982J181e84861A87620J218144J72909l29761i77500n03079H84800
380C007260P6537j315043o38176L12877m97870A4924J344533K126246o79990I0640
369b265320k77848a155876c59330j60581C29183J012658l28860L96678Q48110
360B257769A077721a232369l29433e803A093144m54419A40555a457295k610186
351d067481J543369A200575J664327j000115m05182Q78217J55853B52466b448093
341b751887d30439A081735J21764m16815J045535J542551o83379I08744J267913
332B176657K658375P83351j982985A137688B32732b12065j039471c56322B702039
322C034732E06290e00311A617036K272436K325299j505351D56394i42970E96016
$$ plain form
391 -505621 242982 244163 -584861 187620 1405764 1578673 1248912 -977500 -1480579 884800
380 3007260 3083797 1768754 1130578 1443455 945585 14924 1359457 3485703 2805713 90640
369 -2265320 -2543168 -1155876 -359330 -519911 329183 1341841 1012981 1409659 2257769
360 2257769 1077721 -1232369 -1561802 -5803 1093144 638725 140555 -1457295 -4067481
351 -4067481 -2524112 1200575 2864902 1864787 1459605 2337822 2493675 252466 -2448093
341 -2751887 -430439 1081735 1203499 786684 1832219 3374770 2691391 908744 2176657
332 2176657 4835032 5618383 3635398 1137688 232732 -212065 -1251536 -356322 2702039
322 3034732 506290 -500311 1617036 3889472 6214771 4709420 456394 -942970 596016
312A397576N24586I19413i45988o37323L23161a16958H53353q1531J81304j48310
302H04816c7846j85742H9925c07446p8791m08426q94133m97221c77210A491294
291H99838d37661g3698A757172N51244F09460c79272H62591J346372n44990C36443
280f67156l36251D74864J063519a05248k008321p49835N45633g89189K92856o57041
270a153374L22853I58449J433358l62669p65884a04906j440967J90153a39973
260B44244e57986k29777B05594P51615L05778M09850m41663k84587J436223l25773
250B057037G67344K55771M83524n56671N33614k03075E69576d9510k290103o59902
240b999515c89861G67033d25160n13675f0886A584248J192565p39642i54180m07039
$$ plain form
312 1397576 1922162 919413 -945988 -1583311 -1260150 -116958 853353 771822 953126 804816
302 804816 -37846 -223588 89925 -307446 -386237 -794663 -1688796 -2186017 -377210 1491294
291 899838 -437661 -73698 1757172 2308416 609460 -379272 862591 2208963 1663973 336443
280 -667156 -1003407 474864 1538383 -105248 -2113569 -2863404 -2317771 -789189 -496333 -1153374
270 -1153374 -830521 958449 2391807 2029138 1263254 -104906 -1545873 -1355720 -139973
260 244244 -557986 -787763 205594 957209 1262987 1672837 1231174 946587 2382810 2057037
250 2057037 767344 1023115 1506639 949968 1483582 1280507 569576 -49510 -2339613 -2999515
240 -2999515 -389861 767033 -425160 -938835 -60886 1584248 2776813 2037171 -954180 -1361219
230a361219g6667j91939j796780n30486j76572o42262M13708M12805a127160A738397
219A167414b023498j641746K26884N00834d23026A470925l9882E83185C7157J75127
209B12284f48269j199113a85985B075258r45521a207594N62936A249726K78151
200A527877f09024k153667J38334J228242p7910L00845G2979J30888e6453J3452
190d3001k224775j612275a197835F31926c40557j983837o61588J225067a50626
180c05583r33700A76009J522177J2782l70615L14163J377891J057859j008484
171C081782C26724a859078g23529B095349m17443g26235f5389A073268C91810
161E83142J337175l78008a26003j608462k31902R39135K32140j503148o02459
$$ plain form
230 -1361219 -76667 -268606 -2065386 -2595872 -2772444 -3414706 -3000998 -2588193 -1127160 1738397
219 1167414 -2023498 -3665244 -3438360 -2937526 -423026 1470925 1431043 583185 37157 212284
209 212284 -648269 -1847382 -185985 2075258 1129737 -1207594 -644658 1249726 1527877
200 1527877 -609024 -2762691 -2624357 -1396115 -1474025 -1173180 72979 203867 -56453 -43001
190 -43001 -2267776 -3880051 -1197835 631926 -340557 -2324394 -2985982 -1760915 -150626
180 -305583 -1239283 176009 1698186 1710968 1340353 1654516 3032407 4090266 3081782
171 3081782 326724 -1859078 -723529 2095349 1677906 -726235 -65389 1073268 391810
161 583142 1920317 1542309 -126003 -1734465 -1966367 -1027232 -795092 -2298240 -2900699
152b900699a078413B612792J080754j445403B39554a699893p24485a016696A592775
142B575343A095083c7113B01226K04788M60629J211880q58607b088995k128403
133d217398P15772g42362C84589J49560K45209K8224l03907J100460P92911p25583
123A671463C62687K0380L40242i16825j741998J59578f84591G19522e68261j064798
113a633059k03139N72081e23262j193335r10511a246902C14638m0371J39391M00986
103H14644n5764M97184J107177N58881A041996a226502M40991A123048L78312
94A501360G34133b82678n40468b41109D87824a179514k711144p05814J629975
85b966497J093394L13947B0915K028265F01603a926443j84348b6189o572k068171
$$ plain form
152 -2900699 -1078413 2612792 3693546 2248143 239554 -1699893 -2424378 -1016696 1592775
142 2575343 1095083 -37113 201226 406014 866643 2078523 1219916 -2088995 -4217398
133 -4217398 -3501626 -742362 384589 534149 779358 807582 503675 1604135 2397046 1671463
123 1671463 362687 383067 723309 -916825 -2658823 -2499245 -684591 719522 -568261 -1633059
113 -1633059 -1836198 -1264117 -523262 -1716597 -2627108 -1246902 314638 274267 413658 814644
103 814644 758880 1256064 2363241 2922122 1041996 -1226502 -785511 1123048 1501360
94 1501360 734133 -282678 -823146 -241109 487824 -1179514 -3890658 -4596472 -2966497
85 -2966497 -1873103 -1559156 20915 2049180 601603 -1926443 -2110791 -26189 -32761 -2100932
75b100932p34987f07979A930157P04343j013383b46572n93399C51694J208640
66A560334o630R1316F05609i09961d12077I29564l95880k56705a87001j236068
56a423069n63216a33308A657569k85101A78151d18303j31221f7944A888415J351450
46C239865j580488e62285b14840B031513J00448A21218a669657O26089A570305
36B613902m91174n99473b02948j591412g22795A186286j25195a120600L42978
27g77622B58746g85206K84107B725165J675334B002014h638n93364J05831c4693
16E6960d79653k93752J8603J37000a97445j54810p29126j071156o47290a318958
5H88305R61923l87859p05287a75276K258
$$ plain form
75 -2100932 -2835919 -607979 1930157 2634500 1621117 -246572 -839971 351694 1560334
66 1560334 1553704 1645020 605609 -909961 -412077 929564 533684 276979 -187001 -1423069
56 -1423069 -1986285 -133308 1657569 1372468 178151 -418303 -549524 -67944 1888415 3239865
46 3239865 1659377 -562285 -214840 2031513 2131961 121218 -1669657 -1043568 1570305
36 2613902 2122728 1523255 -202948 -1794360 -722795 1186286 1061091 -1120600 -777622
27 -777622 258746 -785206 -501099 2725165 4400499 2002014 -8638 -602002 -496171 -34693
16 56960 -479653 -773405 -754802 -617802 -197445 -352255 -1081381 -2152537 -2799827 -1318958
5 888305 1850228 1462369 757082 -175276 -173018
0a73018
$$ plain form
0 -173018
##PAGE= F1=3042.713576207
##FIRST=     18110.137220953, 5591.54909048506, 795628
##DATA TABLE= (F2++(Y..Y)), PROFILE
1023G95628j90104r6442O51010J184263J6485j125729R31376L27793b77875j959676
1013b237551e30754A038012A09349a255257m56814k436076k420311J112878b447873
1003B52789e24083k496192m45045N07181p31610j146064K07717R74348J123748
994b530000L72286P62867F5336R85944Q70883R52769L02871o47220l1420R9177
984B598340O22143A572277a70722l31319A226470Q62512G51376i59088j337141
975b296229m22124Q63562M87180o64120M1679P03646d55451D2552J840h02428
964a048046D61682M44495c7420C45080L53824l31412H3019R80156K568074J621711
954E252960j252383r77141q6460A316360d72089R9443J45605q69395M73059A690747
$$ plain form
1023 795628 605524 509082 1160092 2344355 2360840 1235111 2166487 2494280 -277875 -2237551
1013 -2237551 -530754 1038012 109349 -1255257 -1712071 -4148147 -6568458 -5455580 -2447873
1003 252789 -524083 -3020275 -3465320 -2958139 -3689749 -4835813 -4628096 -3653748 -2530000
994 -2530000 -2157714 -1394847 65336 1051280 1922163 2874932 3177803 2530583 2499163 2598340
984 2598340 3220483 1572277 -170722 -502041 1226470 2088982 751376 -959088 -2296229
975 -2296229 -2718353 -1854791 -1367611 -2031731 -1990052 -1286406 -455451 42552 44392 -802428
964 -1048046 461682 906177 -37420 345080 698904 367492 83019 1063175 3631249 5252960
954 5252960 4000577 3023436 2936976 1316360 -472089 -372646 -227041 -1096436 -623377 1690747
943D876976J613955k097792A912776n37661A34669b688236j162836o24446k70993
934d746511J612607a509766d67518G81098J44850l28721j01040g14812j130128
925a844940A021127K341595j190758F76473h45097l51678E43360J711852r14943
916A340269i06151J18460A152084J715874N16659j065052A75454a335902n14009
907a849911o5315K77673M56040J88471o85640l20895P75589e67386J39676J82475
897b45235A86183P33994J624678Q53546K42032j067175a073658k390469J008062
888b456065i26271D41147J121111m50057c71841k20031i4497B05782a08031j729011
878a837042L05286B86522a062954l061727l8421J522668i56948i8978r73499R229
$$ plain form
943 4876976 6490931 4393139 1912776 1375115 134669 -2688236 -3851072 -4475518 -4746511
934 -4746511 -3133904 -1509766 -467518 781098 925948 597227 496187 -714812 -1844940
925 -1844940 1021127 3362722 2171964 676473 -845097 -1196775 543360 2255212 1340269
916 1340269 -906151 -787691 1152084 2867958 3384617 2319565 175454 -1335902 -1849911
907 -1849911 -1915226 -1637553 -1181513 -993042 -1678682 -1999577 -1223988 -567386 -427710 -245235
897 -245235 186183 920177 2544855 3398401 3640433 2573258 -1073658 -3464127 -2456065
888 -2456065 -926271 441147 1562258 1112201 -371841 -591872 -94497 205782 -108031 -1837042
878 -1837042 -1531756 286522 -1062954 -4124681 -4163102 -2640434 -956948 -98978 -1072477 -1063248
868a063248A045481J168934e96346k669313Q70424e9281F17254b65518q69003
859a134521l41821o00888K54946e54740C81783L47897J14429A16707g65236n05899
849a271135l85671a49699B207293l74083e61026j079523d14676A585261J155099
840B740360P2122D66401a990420M49605D10700L73515A48922a22649c9268B16033
829A111742O21691m22699m45141R0652E5186a287945n94450M3837M08867M11643
819a018048C48806K427688N87512q39008j20180j4739A003483b35384q24755n50434
809a610573f19170D23772j9216e06959k494192k416355J747153c42401A658749
799B640611k12765C73863a982979p42105e66702A888425m89472f51213p70516
$$ plain form
868 -1063248 1045481 2214415 -596346 -3265659 -2395235 -59281 617254 -265518 -1134521
859 -1134521 -1476342 -2077230 -1822284 -554740 381783 729680 844109 116707 -765236 -1271135
849 -1271135 -1656806 -149699 2207293 1833210 -561026 -1640549 -414676 1585261 2740360
840 2740360 2812482 466401 -1990420 -1540815 410700 784215 148922 -122649 -39268 216033
829 1111742 1733433 1310734 865593 956245 55186 -1287945 -1882395 -1838558 -1429691 -1018048
819 -1018048 348806 2776494 3364006 2524998 2404818 2390079 1003483 -235384 -1060139 -1610573
809 -1610573 -619170 423772 404556 -506959 -3001151 -5417506 -3670353 -342401 1658749
799 2640611 2427846 373863 -1982979 -2725084 -566702 1888425 1398953 -651213 -1421729
790a421729C09414J475672l50261n47392N78774K46222E14136h00921K46923F81443
779A080157J69053D14185a536553l1647I12295J333792D89185b359292o19316
770b978608a411857d49020I42653J716047j230703a956734j262044R7132l1161
761c152807J481312b75470F39006Q5936c8557j232526c37137E80966d28930p7340
751e06270G30684k1340f46342j485818d82881A411525E35028a004503m46987C50485
740C355877J83922G88806a745727q08778M36401N51305K19659M31712b07813F64175
729H36536m17852e90513b3905A839287l05016A17982b30438A737028K020976j268782
719B489222e50482j761780N43245c87697D15888R49217K82841d33196l005620
$$ plain form
790 -1421729 309414 1785086 1434825 887433 1466207 1712429 514136 -800921 -553998 681443
779 1080157 1249210 414185 -1536553 -1568200 912295 2246087 489185 -2359292 -2978608
770 -2978608 -1411857 -449020 942653 2658700 1427997 -1956734 -3218778 -3121646 -3152807
761 -3152807 -1671495 -275470 639006 724942 -38557 -1271083 -337137 580966 -428930 -506270
751 -506270 730684 709344 -646342 -2132160 -482881 1411525 535028 -1004503 -1451490 350485
740 3355877 3539799 788806 -1745727 -2554505 -2118104 -1566799 -1347140 -915428 -207813 664175
729 836536 418684 -590513 -23905 1839287 1534271 117982 -230438 1737028 3758004 2489222
719 2489222 -550482 -2312262 -1769017 -387697 415888 1365105 1647946 -433196 -3438816
710c438816a659545A158378L13008m14659J079818L57912b02484l043814P9071
701c167227A87K143405j023334a034709p62635Q92777A132961K009076A542542
691a016336K06962B102180K478336j413936e45729j321503e18160I40524N93598
682A534122n53945b9552k05221m03146j056843j570276K11669G19674M157402
673D877076p7586B124312A031045J803958L06764A499210c38128k644968j294535
664d277631J772245P98204r62139O65548D66068J612271J00370N96246j79814
655B595141m31703O07601r72872b00812m03954n72003j455903P33506I94014P68999
645A763013m24044J359171K6604j194214l4964P20140J693808N96646j888711
$$ plain form
710 -3438816 -1659545 1158378 1471386 1056727 2136545 2494457 -202484 -3246298 -3167227
701 -3167227 187 2143592 1120258 -1034709 -1797344 -904567 1132961 3142037 1542542
691 -1016336 -809374 2102180 4580516 3166580 -545729 -1867232 -518160 940524 1534122
682 1534122 980177 -29552 -234773 -637919 -1694762 -3265038 -3053369 719674 4877076
673 4877076 4799490 2124312 1031045 2835003 3141767 1499210 -338128 -2983096 -4277631
664 -4277631 -2505386 -1707182 -2669321 -2003773 466068 2078339 2178709 2774955 2595141
655 2595141 2163438 2771039 1798167 -200812 -604766 -1176769 -2632672 -1899166 994014 1763013
645 1763013 1338969 2698140 2724744 1530530 1495566 2215706 3909514 4506160 2617449
636B617449c6022p9912F27997b33301j401439o8467g83463c8360C42772P40864
626A083636Q36422m2211l525J92083l11128k92469o16395j25023O23899M43541
616A788830n29895e65820j711111j425702j518565Q25371a213064B74914h41603
606a508752g35889a33935A57036J542448j14768i01594j299759d91374d003F76184
595A430059J086898M64477A004808h51145C29348O10313l26691B19496a801616
585c646739J307952R67885q16074f69740A830537P20593A132100D81945R36119
576A418064j6650k3543Q40190k08220C6130h84339j129192j393156P81896a016874
565c21295j205908j250439L70027P09462P92252A394911N03264i28523j097635
$$ plain form
636 2617449 -36022 -115934 627997 -233301 -1634740 -1703207 -783463 -38360 342772 1083636
626 1083636 1920058 1877847 1874322 2066405 1755277 1462808 846413 721390 1345289 1788830
616 1788830 1258935 -565820 -2276931 -3702633 -5221198 -4395827 -1213064 274914 -841603
606 -1508752 -735889 -133935 157036 1699484 1584716 -901594 -2201353 -491374 -4003 676184
595 1430059 2516957 2981434 1004808 -851145 329348 939661 612970 219496 -1801616
585 -3646739 -2338787 -1370902 -2186976 -669740 1830537 2551130 1132100 481945 1418064
576 1418064 1401414 1377871 2218061 2009841 36130 -884339 -2013531 -3406687 -2624791 -1016874
565 -321295 -1527203 -2777642 -2407615 -1698153 -905901 1394911 1898175 -928523 -2026158
556b026158h75548K89016A23990J326485a41468k163678Q39605D74721h5515j41330
546b26845A740249M27942F80710L36686P53619G47550a77569A23207c00182j987047
536b287229M90919F33998J74419K91481J432564n6808j178930j22623L11885l22831
526A163155b8311j559866n66057P59996d2046F09447L44003C59605a693087j502852
516c195939a473329a40482j065187K76937A060126R48620F84519a77259p32820
507i10079j098336j91749O77396E39124L15181a210649k604012j592632o23342
498f030635K120734h64154A135607O03028m0362A5046b735138j135918R09707
489b961349a423784g7038b0679j178443l89400M63211P1642p81846q47340J96465
$$ plain form
556 -2026158 -875548 -586532 123990 1450475 -141468 -2305146 -1465541 474721 -85515 -226845
546 -226845 1740249 2168191 680710 1017396 1771015 747550 -177569 123207 -300182 -2287229
536 -2287229 -1796310 633998 808417 1099898 2532462 2475654 1296724 1174101 1485986 1163155
526 1163155 -28311 -1588177 -2154234 -1394238 -42046 609447 953450 359605 -1693087 -3195939
516 -3195939 -1473329 -140482 -1205669 -928732 1060126 2008746 684519 -177259 -910079
507 -910079 -2008415 -2200164 -1522768 539124 854305 -1210649 -3814661 -5407293 -6030635
498 -6030635 -3909901 -864154 1135607 1738635 1698273 15046 -2735138 -3871056 -2961349
489 -2961349 -1423784 -77038 -20679 -1199122 -1588522 -1125311 -1053669 -1835515 -2682855 -2486390
479b486390j01276p29545j21867M81241N3070j313997J68799a214207I04685a36320
468b296426j007152Q21143R82359c94331m7164k971142k449092N85137J384444
459c892148m93378n13002Q07049M90177o39686l46539P89681R77747m82400n51495
449c853994K71759P30587J043091f18751k02893j472183q34227K54084J093819
440a780151L72377r81400q52257j635970r34890J399100j66107k716065k293735
431i589098L63980J402135p97294k840763j739748k861212l017836j678694n806612
422b6565142K218051n3947685j39661833k1192952g5675991C7414469o108001
415C1306468j1073501k772193n262961m53170l94506j230088l689836l101653
$$ plain form
479 -2486390 -2587666 -3317211 -3439078 -2957837 -2904767 -4218764 -4049965 -1214207 904685 -136320
468 -2296426 -3303578 -2482435 -1500076 -394331 -441495 -3412637 -5861729 -5276592 -3892148
459 -3892148 -4385526 -4898528 -4091479 -3601302 -4240988 -4587527 -3797846 -2820099 -3302499 -3853994
449 -3853994 -3582235 -2851648 -1808557 -618751 -821644 -2293827 -3128054 -2873970 -1780151
440 -1780151 -1407774 -2389174 -3241431 -4877401 -5812291 -4413191 -4579298 -7295363 -9589098
431 -9589098 -9225118 -7822983 -8620277 -11461040 -13200788 -16062000 -19079836 -20758530 -26565142
422 -26565142 -24347091 -78294776 -217956609 -239149561 -75675991 37414469 31306468
415 31306468 20232967 17460774 12197813 11744643 11350137 10120049 6430213 3328560
407C328560L85684J708308K558049P00534j443337k946732j032250J274834J552262
398F085912N79632j372571j718282q69631p08553j83552o5409K07007m5026r30899
388I78628M43889J422700N16248o13056C59864H1777K454769K547883J90103j718123
378C556409j163738L99988l26589r15384J217052J967568p47697A195372a156102
368a852105e60515I01043l51792O6395J071017k31690K21079J221294o44863E21190
357G98605J032135M41898J42309n38527a044472l557307J486658A132388J934528
348C066916q87465p35078M18597L49890B86711b282153k02209d30372H64051R73466
338A837517O2773K05001J555035K06065j874502M50124K495237R03797j621143
$$ plain form
407 3328560 3714244 5422552 7980601 8681135 7237798 4291066 3258816 4533650 6085912
398 6085912 6665544 5292973 3574691 2705060 1996507 1812955 1747546 1954553 1909527 978628
388 978628 1422517 2845217 3361465 2748409 359864 81777 2536546 5084429 5274532 3556409
378 3556409 2392671 2792659 2466070 1550686 2767738 4735306 3987609 1195372 -1156102
368 -1852105 -560515 901043 549251 615646 1686663 1454973 1676052 2897346 2252483 521190
357 798605 1830740 2272638 2414947 1876420 -1044472 -4601779 -3115121 1132388 3066916
348 3066916 2179451 1444373 1862970 2212860 286711 -2282153 -2484362 -430372 864051 1837517
338 1837517 1900290 2105291 3660326 3866391 1991889 2442013 4937250 5841047 4219904
329D219904B077696E40524c38078l62552D56842K819036L71862A272408C04992
319B345056K172375J693450k324308d59358o28840I87578Q80506N04043j013258
310A358869c15327J03812D56433R8719k54601K2131J063982J8210C997c15054
299A92414b11530k31042n09076o58232j77682E3262J267758b2861j137542a29342
288A320055J44054C86343c28619E71566P97022j58014n46351a89169o25666C24241
277A135459e14427j741790m25542Q33496b79253r3027j331099l50674b15798B201713
266B278403I33419h20831q85418e68421E71165j04622a53133k23242C67583P53771
256A121354L23475j68326o22212P9377J220853l78459E68217K89029M08424j7398
$$ plain form
329 4219904 2077696 540524 -338078 -700630 456842 3275878 3647740 1272408 304992
319 2345056 4517431 6210881 3886573 -459358 -1088198 987578 1868084 2372127 1358869
310 1358869 -315327 -211515 456433 555152 300551 322682 1386664 1404874 3997 -315054
299 192414 -211530 -442572 -951648 -1609880 -1787562 53262 1321020 -22861 -1160403 -129342
288 1320055 1464109 386343 -328619 571566 1368588 1210574 664223 -189169 -814835 324241
277 1135459 -514427 -2256217 -2681759 -1848263 -279253 -372280 -1703379 -2054053 -215798 2201713
266 2278403 933419 -820831 -1706249 -568421 571165 466543 -153133 -376375 367583 1121354
256 1121354 1444829 1276503 654291 733668 1954521 1576062 568217 857246 1265670 1248272
246A248272J338006m01415F16330c60825j596614j27595F82888J109259a89630
236b058902N88586A70109Q04881B30885b163511N0551b98733F88621e21145j471734
226a992879j298701p66006R20717R23432f20877B210675j58566d35413j643482
217b078895m79122M8266b52322A335023l61542B68594K51036K6582d97289p59287
207a256576H01114J845193I64563a666738g98618A408826J41036e49790k281676
198b831466k88240J399596L47542J81224f0465D13115P9105A52358b600712j346489
188c947201a592317A66117a032850j930599p09672O77653J135810J04945m15924
179b170637a000763F07240J266268N11313o27524P28492J682871K46555A672450
$$ plain form
246 1248272 2586278 2184863 616330 -360825 -1957439 -2085034 682888 1792147 -189630
236 -2058902 -1470316 170109 974990 230885 -2163511 -2112960 -298733 688621 -521145 -1992879
226 -1992879 -3291580 -4057586 -3136869 -2213437 -620877 2210675 2052109 -435413 -2078895
217 -2078895 -2558017 -2509751 -252322 1335023 973481 268594 519630 546212 -497289 -1256576
207 -1256576 801114 2646307 964563 -1666738 -798618 1408826 1549862 -549790 -2831466
198 -2831466 -3119706 -1720110 -1372568 -1191344 -60465 413115 492220 152358 -2600712 -3947201
188 -3947201 -1592317 166117 -1032850 -2963449 -3673121 -2995468 -1859658 -1754713 -2170637
179 -2170637 -1000763 607240 1873508 2384821 1757297 2485789 4168660 4415215 1672450
169b000353j79726A45373L78333h07954E03853O89424b07133B64983J865777n83377
159A547383f43022j645890L33257g41517K31200j695635o83418a131045B590730
149C956272j129862H17496a482984r43569f74121B478814P98157A052040d82282
139I5046K77342K33511J221171q4173a172672l030450k47181a119805A310562
129A756917n58332B58368g01166C9755R95604m06686e91301k6844J45922j448223
119a920446j356843N39385g65611E92299f30583o28411k23170l86507J41373K95144
109a432154M28894d9342E72044h827m47554C72218Q59252K59958O91396Q68970
99C051794A249383i83004L34367E60260J9912k07970a45451k64962E68091N73291
$$ plain form
169 -2000353 -2180079 145373 523706 -807954 503853 1193277 -207133 264983 2130760 1547383
159 1547383 -643022 -2288912 -1955655 -741517 -510317 -2205952 -2889370 -1131045 2590730
149 3956272 2826410 817496 -1482984 -2426553 -674121 2478814 3276971 1052040 -482282
139 95046 372388 605899 1827070 1742897 -1172672 -4203122 -4450303 -1119805 1310562
129 1756917 1198585 258368 -701166 39755 1035359 628673 -591301 -618145 -472223 -1920446
119 -1920446 -3277289 -2737904 -765611 592299 -630583 -1258994 -1482164 -1868671 -1727298 -1432154
109 -1432154 -1003260 -49342 572044 -8827 -456381 372218 1231470 1491428 2182824 3051794
99 3051794 1249383 -983004 -648637 560260 580172 372202 -145451 -410413 568091 1141382
89A141382i55484k410336p5258J598144N10025j03027D72129K563708j424000
80A611837a091129o00855c58321r7275j604965m80295f63933A804540J098664
71B903204r60126c98201r72165f5029A286683K71045l64835a27386q27874E94727
60A864855D83183f92050J9607q43022j074848J154613D67264N64992n15710j94076
50C22470I4464a59891I00080J368526q43112d76170C14160K307998j62583F45247
39i27609O404I62875J183525N30865M39808A310772f59174L20157F84620a22724
28a843774e18995G53706i51508M1617B945039J951205B299946e7993r68117L09537
18g16573b10703K1520j59495j53996k12725b3670F09831b60789j221215p17448
$$ plain form
89 1141382 -955484 -3365820 -3441078 -1842934 -1332909 -1435936 472129 3035837 1611837
80 1611837 -1091129 -1691984 -358321 -455596 -2060561 -2540856 -663933 1804540 2903204
71 2903204 1943078 -398201 -1370366 -65029 1286683 1557728 1192893 -127386 -955260 594727
60 1864855 483183 -692050 -672443 -1515465 -2590313 -1435700 467264 1032256 516546 322470
50 322470 94464 -159891 900080 2268606 1425494 -476170 314160 2622158 2459575 645247
39 -927609 -921205 962875 2146400 2677265 3117073 1310772 -659174 -339017 684620 -122724
28 -1843774 -518995 753706 -951508 -909891 2945039 4896244 2299946 -57993 -1026110 -716573
18 -716573 -210703 -189183 -348678 -502674 -715399 -23670 609831 -260789 -1482004 -2199452
8b199452k44875a198998H37416J119840k92016G97197a55516B32070
$$ plain form
8 -2199452 -2444327 -1198998 837416 1957256 1665240 797197 -155516 232070
##PAGE= F1=3021.096038697
##FIRST=     18110.137220953, 5591.54909048506, 1401480
##DATA TABLE= (F2++(Y..Y)), PROFILE
1023A401480j14695k66608L90756J141098J79777j030430P29423k40968a231423
1013c486114a350829I10386j50044a63216n06375k514009l389373O13001b935821
1003B66918a18532k512944k93044O98324m63746p73004l51488o0361P33393R62602
993b178800a037369H07053Q45547j2870M33607O70025l34631n97185l01091N70289
983B080744G66703A00647N45090J700408O06498A378922d23142j679573q45902
974b948617M35346M67570j21263K21109O02247c41503B27918D9221h00133p58265
964a558398b09923A87653q8653N88459L76592n10394A65967R02666K716270J395733
954E180636j643628j254833O111I59151g42402K3065K29530q60065c47965B524677
$$ plain form
1023 1401480 1286785 1020177 1410933 2552031 2731808 1701378 2430801 2189833 -1231423
1013 -3486114 -1350829 910386 760342 -163216 -669591 -3183600 -6572973 -5959972 -2935821
1003 266918 -118532 -2631476 -2924520 -2226196 -2689942 -3462946 -3814434 -3874795 -3141402 -2178800
993 -2178800 -1037369 807053 1652600 1639730 2073337 2743362 2408731 1811546 1510455 2080744
983 2080744 766703 100647 645737 2346145 2952643 1378922 -423142 -2102715 -2948617
974 -2948617 -2513271 -2045701 -2166964 -1945855 -1343608 -341503 227918 49221 -800133 -1558398
964 -1558398 -209923 187653 99000 687459 1064051 553657 165967 1068633 3784903 5180636
954 5180636 3537008 2282175 2288286 959151 -742402 -719337 -489807 -1349872 -347965 2524677
943E416432Q99326j984227j748650p93261A67751b694818j762003j587833n44700
934f589354K222632a557255b34549H84278p3492C34439j12235a228772j481735
925b710507c3098B169879H24396A04506l7742e3828E90719J035136n69686g89630
914d28424A214961J479343R65464j025161F86619i23783j099410j97320J084432
905a136081M08847p08866n02617O40141e06592L5371j17313k2753f2873G82298
894B412983R97599O79396q80640f84720k856899J378526a37456G68033L21691
885A089724k88352c08646k18205A95588Q78077K28349e13799o73013K34065j525715
875b478462j992971L50822J825018b45690F83122f98797K9333A819979J023725
$$ plain form
943 5416432 6315758 4331531 2582881 1789620 167751 -2694818 -4456821 -6044654 -6589354
934 -6589354 -4366722 -1557255 -234549 884278 810786 334439 222204 -1228772 -2710507
925 -2710507 -33098 2169879 824396 104506 66764 -53828 590719 1625855 1056169 -789630
914 -428424 1214961 2694304 3659768 2634607 686619 -923783 -2023193 -2220513 -1136081
905 -1136081 -727234 -1436100 -1938717 -1298576 -506592 -471221 -588534 -611287 -62873 782298
894 2412983 3410582 4089978 3209338 -684720 -3541619 -2163093 -137456 768033 1089724
885 1089724 801372 -308646 -526851 195588 1073665 1302014 -513799 -1186812 -952747 -2478462
875 -2478462 -4471433 -4120611 -2295593 -245690 683122 -698797 -669464 1819979 2843704
866B843704A6157b776185O23023A89125Q25190A57622g52260m46518r03099l56562
856b458439O94743g24260F9720J67545b17693n86716l48549K3425G55721J958078
846B713799j181027a247337q79390e78678A476478J072253K01129H30498a862426
836a667070H07573N62710a81097n89736c29019r3482j29573a4304A048436L68213
826A416649o71242h29346m71611k41080j93885P74295c28243E34820J796983N35657
816B867460o23862L61544N60212j338370a77489j639685q90064J134249F896K46277
806B53173c30095k185968k426149J545096c08288A392854J399029M99277j630646
797A660514a146689j710586a201463A634717n97077a800440j371065a140003A222410
$$ plain form
866 2843704 16157 -2776185 -2153162 189125 1014315 157622 -752260 -1198778 -2101877 -2458439
856 -2458439 -1763696 -724260 69720 237265 -217693 -804409 -1152958 -1129533 755721 2713799
846 2713799 1532772 -1247337 -2126727 -578678 1476478 2548731 2749860 830498 -1862426
836 -1667070 807573 1370283 -181097 -770833 -329019 -422501 -552074 -14304 1048436 1416649
826 1416649 745407 -829346 -1300957 -1542037 -1735922 -961627 -328243 534820 2331803 2867460
816 2867460 2243598 2605142 3165354 1826984 -177489 -1817174 -2707238 -1572989 6896 253173
806 253173 -330095 -2516063 -4942212 -3397116 -308288 1392854 2791883 3291160 1660514
797 1660514 -1146689 -2857275 -1201463 1634717 1037640 -1800440 -3171505 -1140003 1222410
787A695374m10912O32297M70796p10755G05769l6294O79216k15862l84107b8575
776a949011j83502C15457R40601a065335k677312P36628d95438C17989Q83244
767A201233J198957r81723a761396j271966m05517m10703a861757B88525Q84002
758A172527K031E22199h54813c56560A68955i93493L5161A65362J35675e04247
747a540457c91530A499692l33752d04626j133469A6428K957430Q13227A886392
737b33394j672399n85772J25066L37363M87461e40697D94110L95527m30681c90744
726i0003A279496F10613h62214R4115B053688L105016j087479F74195a382424
716a289470e13875B71317J458484N10353C8584b965794J456388H08636N18014
$$ plain form
787 1695374 1284462 1916759 2387555 1676800 705769 669475 1348691 1132829 748722 -28575
776 -1949011 -2132513 315457 1256058 -1065335 -3742647 -3006019 -495438 317989 1201233
767 1201233 2400190 1418467 -1761396 -3033362 -3438879 -3849582 -1861757 288525 1172527
758 1172527 1174558 522199 -854813 -356560 168955 -993493 -958332 165362 301037 -504247
747 -1540457 -391530 1499692 1165940 -404626 -1538095 16428 2973858 3787085 1886392
737 -233394 -1905793 -2491565 -2366499 -2029136 -1541675 -540697 494110 889637 458956 -390744
726 -90003 1279496 610613 -862214 -768099 2053688 5158704 4071225 674195 -1382424
716 -1289470 -513875 271317 1729801 2240154 38584 -2965794 -1509406 808636 1326650
707A326650J20515Q94168k04344g0428k409630K71994E56987J572106G48967a312225
696a955466h53179A766764K164489j618672a40806j23959A494135J169685r25482
687A738338a183783p78587d45834E89911K81004r6787l76142l3558a88707p27954
677i16661r26668K64423A246803L462981K16385k158826m10551J814543m32976
668C738359j860592d8304k977387j499979K106517a152434n71276N21399G95619
658B047880j49581M07330J45148l26067P37190q73167b55959n91078m61486j479738
648b788261N43366D95917Q12932Q4035J638076m29789E68711A28040J187948K589703
638C905691P77631B240634c36156J19127B68471h15447j252253k40667R05767
$$ plain form
707 1326650 1447165 2341333 2136989 -70428 -2480058 -2208064 556987 2129093 748967 -1312225
696 -1955466 -853179 1766764 3931253 2312581 -140806 -264765 1494135 2663820 1738338
687 1738338 -1183783 -1962370 -445834 589911 870915 774128 397986 364428 -188707 -916661
677 -916661 -1843329 -1578906 1246803 4709784 4926169 2767343 2356792 4171335 3738359
668 3738359 1877767 -48304 -3025691 -4525670 -2419153 -1152434 -1723710 -1202311 795619
658 2047880 1898299 2305629 2450777 2124710 2861900 1988733 -255959 -847037 -1308523 -2788261
648 -2788261 -2244895 495917 1308849 1392884 3030960 2601171 568711 128040 1315988 3905691
638 3905691 4683322 2240634 -336156 -217029 268471 -815447 -2067700 -2308367 -1402600
629a402600a92893A08495P10841J510456M58281k74782k02191m83606m68769j54051
619A204674J95378j6744J76552N8057a0085k022009j146329j201504M08971a448947
608f4838n51841a72857D01731b69270j617158f71421E99370i06707j652689J220451
598a338945e18631G71495J313622Q14753j84042H33803e57907A098828P74025
589A872853G46520h68594j943830m93813a365479e44540j088455O74533H19655
579A969947p88608E16700P55528L87510M24923R39315j19765B61044a448259j673628
569c121887j460778Q34067a541314D33910d49196k355026k94593J198592c18638
559B263612L03619h39502j851934N55874N42603c59983E63045i00281r80803f14947
$$ plain form
629 -1402600 -192893 108495 819336 2329792 2788073 2513291 2311100 1827494 1358725 1204674
619 1204674 1400052 1383308 1559860 1617917 -10085 -2032094 -3178423 -4379927 -3970956 -1448947
608 -64838 -616679 -172857 401731 -269270 -1886428 -671421 599370 -906707 -2559396 -1338945
598 -1338945 -518631 771495 2085117 2899870 2715828 833803 -557907 1098828 1872853
589 1872853 746520 -868594 -2812424 -3306237 -1365479 -544540 -1632995 -958462 819655
579 1969947 1181339 516700 1272228 1659738 2084661 3023976 2904211 261044 -1448259 -3121887
569 -3121887 -4582665 -3748598 -1541314 433910 -449196 -2804222 -3098815 -1900223 -318638
559 2263612 2567231 -839502 -2691436 -2135562 -1592959 -359983 563045 -900281 -1881084 -614947
548D03562c00385D20257J893185j69491E19389N24171L87051A05145c99646C99230
537a21025k535385j02921d24519C73375P97248J429845m11133H69066p893N21696
527A382869K92868F79444a429207m52782g24872H18889R80132K06522F62792a835472
516c371150a293599A02915a399657k34507E68778Q61315d83173r68125J01075
507a350223l84265q22677J15077h17532L53316j210180j759090j779016r79536
498f192038J993120a115288A130054R41906l95834a060622k964413n1824J306479
489b770380J059011f98430J45487j505405p59891M67375j33743j353413o66675
480d504695M43811m061o94235l89175J79931P17973o4020L50366a494974I10029
$$ plain form
548 403562 -300385 420257 2313442 2143951 519389 1043560 1430611 105145 -399646 399230
537 -121025 -2656410 -2759331 -424519 373375 1170623 2600468 2189335 869066 861173 1382869
527 1382869 1675737 679444 -1429207 -1881989 -724872 818889 1799021 2005543 662792 -1835472
516 -3371150 -1293599 102915 -1399657 -1634164 568778 1430093 -483173 -1451298 -1350223
507 -1350223 -1734488 -2557165 -2442088 -817532 -464216 -1674396 -3433486 -5212502 -6192038
498 -6192038 -4198918 -1115288 1130054 2071960 1676126 -1060622 -4025035 -4076859 -2770380
489 -2770380 -1711369 -698430 -552943 -2058348 -2818239 -2350864 -2484607 -3838020 -4504695
480 -4504695 -4060884 -4064945 -4759180 -5148355 -4968424 -4250451 -4314471 -3964105 -1494974 910029
469B1410b843013j393004J322324R42233R29930d79466k339360k310450r2071
460e221347L80907m52437K905N71346n10627r86285K78856J007769J274257M1937
450c612719n51180p05609n0516M35491J819027N69340j121786j056374p21013
441d995339K75699J062054l24545j361378j749996q93423P53265j359877l383505
432a1977045j792035J213725N86844k303867l850046k109763l602544j259097
424b5093828k303368j1262671j455269r0842405k21311497k9371161a16563688
416F2310208j1649074k0422922m730087p934400n36614q72854k789766m451143
408H923348k267779K135293J840765J215664l70472k951502l785524j638405J356179
$$ plain form
469 21410 -2843013 -4236017 -2913693 -1971460 -1041530 -479466 -2818826 -5129276 -5221347
460 -5221347 -4840440 -5292877 -5289972 -4718626 -5229253 -6215538 -5936682 -4928913 -3654656 -3612719
450 -3612719 -4163899 -4869508 -4920024 -4484533 -2665506 -2096166 -3217952 -4274326 -4995339
441 -4995339 -4719640 -3657586 -3982131 -5343509 -7093505 -7986928 -7233663 -8593540 -11977045
432 -11977045 -13769080 -12555355 -11968511 -14272378 -18122424 -20232187 -23834731 -25093828
424 -25093828 -27397196 -38659867 -40115136 -130957541 -352269038 -381640199 -116563688
416 62310208 50661134 30238212 25508125 17573725 17037111 16164257 13374491 8923348
408 8923348 6655569 8790862 10631627 11847291 11476819 8525317 4739793 3101388 4457567
399D457567J891780J526510P8716j853461k253410j012916Q70255M72654l98484
390C779211m24781j108393J02253J484740N92250q72036A244877N2489K369580
381C666946K674383L16092j861716j804300K32548l581m38381J193042J402788
372E377821q25855A993236b09513r80536D3788J950780o08523D63015R83300K05476
362A651791L15518J159199k56634p55845R65627L61755l18306N37356o24611g03604
351d496044J168410F70964J971204n31369r30901j05367L39760f5781k021205
342b086986Q9484c76666E45873J186051K21209k39476J936671J064701j919826
333B795203m11543K088579R00683j237748j822719B75877f18717a18876H62402
$$ plain form
399 4457567 6349347 7875857 7954573 6101112 3847702 2834786 3705041 4177695 3779211
390 3779211 3354430 2246037 2348290 3833030 4425280 3553244 1244877 1297366 3666946
381 3666946 6341329 6657421 4795705 2991405 3223953 3220372 2781991 3975033 5377821
372 5377821 4551966 1993236 -209513 -1190049 43788 1994568 1386045 463015 1446315 1651791
362 1651791 1967309 3126508 2869874 2114029 3079656 3441411 3123105 3660461 3035850 -703604
351 -4496044 -3327634 670964 2642168 2110799 1179898 1074531 1414291 -65781 -2086986
342 -2086986 -1997502 -376666 545873 1731924 1953133 1713657 3650328 4715029 2795203
333 2795203 2383660 4472239 5372922 4135174 2312455 275877 -618717 -118876 862402
323C120592O53815j808415p96845J807938J673269O97025B617634a460781k6864
314a487645A022269J197623N97906q87946D79803Q16387J054348j002135b14788
304a57494A836978J47649C3652e28901A1414b47500k70752n26298l28596K25159
294a147987C95266M99501g45648m78841A22195N87908B19406b33116k98643A30514
283D38428J37705K24893A52233f38352H9692N82811g93572j339853k45668J034756
273a344337A85442c32790j996658j066242J495747H79295P43595B40304a577834
263a778190B00332Q49859D85466B04878F4996L92069O75502K94490E19819c85359
252A28577R37794k48116A87161J37933n368K90144J668312j47546F37342h1459
$$ plain form
323 3120592 3774407 1965992 1169147 2977085 4650354 5347379 2617634 -1460781 -1487645
314 -1487645 1022269 2219892 2817798 1929852 479803 1296190 2350538 1348403 -214788
304 -157494 1836978 1984627 33652 -528901 11414 -247500 -518252 -1044550 -1373146 -1147987
294 -1147987 395266 894767 -745648 -1224489 122195 710103 219406 -233116 -531759 130514
283 438428 576133 801026 152233 -638352 89692 672503 -793572 -2133425 -2379093 -1344337
273 -1344337 185442 -332790 -2329448 -3395690 -1899943 879295 1622890 240304 -1577834
263 -1778190 200332 1050191 485466 204878 64996 457065 1132567 1427057 519819 -385359
252 128577 1066371 818255 187161 325094 319726 609870 2278182 2130636 637342 -81459
241i24000k6243A267930P98928a22761k425659J81751J131549M27568o23579j205772
231b636903o306f10794A389687k96271i80380k379179j002555J229315J431087
222a701712b19569A927663L29930r74649g6507j210605k51278A99414Q25942B89581
211a04095G98879k59241c95691k53942A252633J147113C01723b062178f70822
201A666760k18815f99853k172470l89467a576237P02405k41976c64294F16610
191A039296B51269b962818j548443J606786f72958p10962j582648o12413J13066
182c465915Q0087j52901L77959J041044g02845A420882J304953q84558J85386
173B026663J767683J000694k257004a643387j588857J221414i63678J62172A047751
$$ plain form
241 -924000 -950243 1267930 2066858 -122761 -2548420 -2366669 -1235120 -807552 -1431131 -2636903
231 -2636903 -2643209 -610794 1389687 1093416 -980380 -3359559 -4362114 -3132799 -1701712
222 -1701712 -219569 1927663 2257593 1282944 -76507 -1287112 -1538390 199414 1025356 289581
211 -104095 798879 539638 -395691 -649633 1252633 2399746 301723 -2062178 -670822
201 1666760 1447945 -699853 -2872323 -3261790 -1576237 -873832 -1115808 -364294 616610
191 1039296 251269 -2962818 -4511261 -2904475 -672958 -1383920 -2966568 -3578981 -3465915
182 -3465915 -3385828 -3538729 -3160770 -2119726 -702845 1420882 2725835 1841277 2026663
173 2026663 3794346 4795040 2538036 -1643387 -3232244 -2010830 -963678 -801506 1047751
163A063782a022171c49510A798882n08788a027740j514063O06385e59470B2984
153i39596p36916g13645B043126J543183m61148A307564a294572j237983d50781
143C225723N36136I32020h25387a19554B16882J94402J073681N09939c20674l890000
133d210674j361830a826865B049479Q70525j331538e06727j780585N94316c02949
123e00736j360741k45914N9436p54045n87761P97822i13442C00163c97230k27913
113f25143m32944j076530j99586f69006I39395L62249n19907b32116o71771B13532
102A627285k63967J37827J351654j291413d85198N2816A68168b8167j3393k33037
92b74597a07490A137875L72920f81407j742072O85540a91090k75968m26907A297872
$$ plain form
163 1063782 -1022171 -349510 1798882 1290094 -1027740 -2541803 -1935418 -559470 22984
153 -939596 -1676512 -713645 2043126 3586309 3125161 1307564 -1294572 -2532555 -450781
143 3225723 3761859 932020 -825387 -119554 216882 411284 1484965 1994904 -320674 -4210674
133 -4210674 -5572504 -1826865 2049479 2920004 1588466 -506727 -2287312 -1692996 -302949
123 -500736 -1861477 -2107391 -2047955 -2802000 -3389761 -2591939 -913442 300163 -397230 -625143
113 -625143 -1058087 -2134617 -2334203 -669006 939395 1301644 781737 -232116 -903887 213532
102 1627285 1363318 1501145 2852799 1561386 -485198 -432382 168168 -28167 -41560 -274597
92 -274597 -107490 1137875 1510795 -681407 -2423479 -1737939 -191090 -467058 -893965 1297872
81D088715j463253i4865j215862M44396Q1613p72540k90196f99766A456695J523424
71B980119o06217c22588j554785i22393D74247O34262n28671g61387k4824A358964
60B072665C7274a402496O41289m61304j416081J47130J209491a81634D35794M72430
50I08224l19780c89035P3000I77160j3378d52763E49752K031651k51338A083668
39D3794d77155D73281J096786J245176R50142A729556c78357J19321C41975g84555
28b017976b51043H60332a422825k12229B563999K144360B314502A9379a030059
18f69892b50919Q712h5098j92495p09761A42200J207367A9209a686985j72663
8a859648L46502g18537H20145J180105j32904H80272A21391O89547
$$ plain form
81 4088715 2625462 -94865 -1310727 -866331 -784718 -1557258 -1847454 -699766 1456695 2980119
71 2980119 2373902 -322588 -1877373 -922393 474247 1108509 579838 -761387 -786211 1358964
60 2072665 37274 -1402496 -761207 -1222511 -2638592 -2491462 -1281971 -181634 435794 908224
50 908224 588444 -389035 -316035 977160 963782 -452763 549752 2581403 2330065 1083668
39 43794 -477155 473281 1570067 2815243 3765385 1729556 -378357 -259036 341975 -784555
28 -2017976 -251043 860332 -1422825 -1635054 2563999 4708359 2314502 19379 -1030059
18 -669892 -250919 -242207 -85098 -277593 -987354 142200 1349567 19209 -1686985 -1859648
8 -1859648 -1513146 -718537 820145 2000250 1867346 880272 121391 810938
0H10938
$$ plain form
0 810938
##PAGE= F1=2999.478501186
##FIRST=     18110.137220953, 5591.54909048506, 1563333
##DATA TABLE= (F2++(Y..Y)), PROFILE
1023A563333k05406l19629J81386J059477N14275q17169L34396p58538a871811
1013c826993a815753C02319M35687A82716a32016j615565l079737k36538b418044
1003F30623A71315b244876m2634P00790k69459j54180p02451j009716L09131J525461
993a887934e34993A245535N07010H49033J50023R89434k15830E00774C8575J82400
983B20975f59853L20653I32806J749352N29620j494125c6725j765234j032043
974b834002m7926M26326O00170K4644L166f30606A92169h1049p25000j248977
964b055026O08975N17076d09049A77321Q29592p5007m01025O33725K541425J053351
954D759382j780026j458239p4855E11433h70763j05242K74998p46689c04468B462844
$$ plain form
1023 1563333 1357927 1038298 1219684 2279161 2793436 1976267 2310663 1552125 -1871811
1013 -3826993 -1815753 302319 738006 182716 -132016 -1747581 -4827318 -5063856 -2418044
1003 630623 171315 -2244876 -2287510 -1586720 -1856179 -2010359 -2712810 -3722526 -3413395 -1887934
993 -1887934 -534993 1245535 1752545 849033 999056 1988490 1772660 500774 38575 220975
983 220975 -659853 -339200 932806 2682158 3211778 1717653 -36725 -1801959 -2834002
974 -2834002 -2881928 -2455602 -1855432 -1830788 -1827622 -630606 192169 -81049 -806049 -2055026
964 -2055026 -1446051 -928975 -409049 177321 1006913 931906 530881 1164606 3706031 4759382
954 4759382 2979356 1521117 1446262 511433 -870763 -976005 -701007 -1447696 -304468 2462844
943D885519L95506j809928j322170n80937B63319b070283k030009k335033q13834
934g249159K558764a102188E29273Q60932n27902C6517h0488j271998j597304
925b949790h94363A031206d0055j02646I51102K09082l85057J16073k11317b24806
914G02582Q81700O70334J140398r66350G13914g48839j208716j40661c88881a22068
903a550028k87704b89844D52268a41204l38438o4946a97036C99028J366425R05818
893B671271Q74933k63858e1739k899441J391722F66996M73615m86752A06282g04288
882f62739D57558J392136P22294H75774e26584j135206j519839q20045L37525
873c664149J697478E36351J457059I13855K52119K234855J42807G01086a997984
$$ plain form
943 4885519 5281025 3471097 2148927 1567990 263319 -2070283 -4100292 -6435325 -7249159
934 -7249159 -4690395 -1102188 529273 1390205 862303 36517 -80488 -1352486 -2949790
925 -2949790 -894363 1031206 -40055 -142701 951102 1160184 775127 891200 679883 -224806
914 702582 1584282 2254616 3395014 2428664 713914 -748839 -1957555 -2098216 -388881 -122068
903 -1550028 -1837732 -289844 452268 -141204 -479642 -544588 -197036 399028 1765453 2671271
893 2671271 3546204 3282346 -51739 -2951180 -1559458 666996 1140611 653859 106282 -704288
882 -662739 457558 1849694 2571988 875774 -526584 -1661790 -3181629 -4001674 -3664149
873 -3664149 -1966671 536351 1993410 913855 1165974 3400829 3543636 701086 -1997984
863a788321E08193J221941o98078b9024q88698j263431p79359J95240J018707
854a746565e18818e8551k94854m17605m09581M77302A650019J453232A252178
844a741238p98299h49387A218819Q11010J55097G60257a812156L5453A006544
834A846484b85711j037254N25501k58165o76665M15909H75327J099221E20480
824a390726N55431j2366n85745c72580C74340J24552J032141P13367l49177N88407
814B483630R33575j236030c57695k104691j049585J064716e08952b947l70873
805c73820j514820j700353J082967E1427J508239J583499P56950j226323b26113
795b678574R64808A194311l64232b117285j347458J524237C09487J338115J39977
$$ plain form
863 -1788321 508193 1730134 1032056 -29024 -917722 -2181153 -2960512 -2765272 -1746565
854 -1746565 -518818 -58551 -353405 -771010 -1180591 -703289 1650019 3103251 1252178
844 -1741238 -2539537 -849387 1218819 2029829 2184926 760257 -1812156 -1776703 1006544
834 1846484 -285711 -1322965 -797464 -1055629 -1732294 -1316385 875327 1974548 520480
824 -1390726 -835295 -847661 -1433406 -372580 374340 498892 1531033 2244400 1895223 2483630
814 2483630 3417205 2181175 -357695 -2462386 -3511971 -2447255 -508952 -2947 -373820
805 -373820 -1888640 -3588993 -2506026 51427 1559666 3143165 3900115 2673792 -226113
795 -2678574 -1713766 1194311 830079 -2117285 -3464743 -1940506 309487 1647602 1787579
786A787579M67914L46270k50662l25213k93870L4895p85439C3851h09404j654845
776b464249k60558d69040B37985b120881k324761J629863B96013P35767K18223
767A250003N56251o85822a539414j013655n30088m05426a459588G60180N59780
758A319960J7628k18234g4861k01222j60937j161767K06979d62485E1325K46288
748B97613a60691F4941J390937j28735h1319j304395b47260A893347J253080m82328
738B664099j252722a038554j561160k49975M97870P78238c87810C09211L09778
729F18989A22236g73074J24550D86416i5020j418757K52369A748510L643986m85303
719D907193A707529b26943k82840q4359F4584J939648Q10999H64496a682473N66322
$$ plain form
786 1787579 2255493 2601763 2351101 2025888 1732018 1766913 981474 33851 -809404 -2464249
776 -2464249 -2724807 -469040 237985 -2120881 -4445642 -2815779 296013 1031780 1250003
767 1250003 1806254 1120432 -1539414 -2553069 -3083157 -3488583 -1459588 760180 1319960
758 1319960 1337588 1119354 -74861 -276083 -437020 -1598787 -1391808 -462485 51325 297613
748 297613 -160691 64941 1455878 1327143 -81319 -1385714 -247260 1893347 3146427 2664099
738 2664099 1411377 -1038554 -2599714 -2849689 -2351819 -1573581 -387810 309211 618989
729 618989 122236 -773074 -648524 486416 -95020 -1513777 -1261408 1748510 5392496 4907193
719 4907193 1707529 -226943 -509783 -594142 64584 2004232 2815231 864496 -1682473 -1116151
709a116151B64932N82249P83576Q78684m72152D72012a269346L75660A167665
699A915711D34765a193579p03233i17254B045049K143690j436935F93167k86875
690D06292M71634l97465c11731j821377r5334e84039a4909k81496b9419G07687
679A116207k29367j41505G7105a49904A318136K380136P84291j203626J78279
670C457216J329757j097189j759100B23342b739187j583975J993629h13405o1153
661h74558c26170A190052P08250o38724j89131K19423K48890J213867p89407e84391
650a735709l08372r27945O53289A67723Q93179M17594J566670o86244D6334i60770
639C21723K897029P96354A579321g38014j20880M0858q47313p04002l74942N71228
$$ plain form
709 -1116151 264932 847181 1630757 2509441 2037289 472012 -1269346 -893686 1167665
699 1915711 434765 -1193579 -1896812 -917254 2045049 4188739 2751804 693167 406292
690 406292 877926 480461 -311731 -2133108 -2228442 -584039 -14909 -296405 -29419 707687
679 1116207 886840 745335 77105 -149904 1318136 3698272 4482563 3278937 3457216
670 3457216 4786973 3689784 1930684 223342 -2739187 -4323162 -2329533 -813405 -874558
661 -874558 -326170 1190052 1898302 1259578 1070447 1289870 1538760 2752627 1963220 -584391
650 -1735709 -2044081 -2972026 -2318737 167723 1060902 1478496 3045166 2358922 46334 -960770
639 321723 3218752 4015106 1579321 -738014 -858894 -818036 -1665349 -2369351 -2744293 -2173065
629b173065f59417L21502A08263J934743J035519k04751l20317m20190p78201
620A355066o9345N68529k41515l2087M22605F19856a546081r21695p71139J45418
610c093497a427287b89187l5303H29210N47371A5315c092936M76479d10349o38666
600a049015k000784O58313i65810E40496J573669N05563p42311D33973f9049B029239
589B671909H75985a565851j718497N16891e42561B42367g32554j65265a94010
579A033821r6346D63379P14945P62717O03222N48317k19843A18370a995015j911449
569c906464j380347P57484a847337I78562B22077b743483o73905J683483F60596
559C204111l04475g58879k250612j92721O16822h02522b15329j349558K11892
$$ plain form
629 -2173065 -659417 -337915 108263 2043006 3078525 2873774 2553457 2133267 1355066
620 1355066 1285721 1854250 1612735 1580648 2003253 619856 -1546081 -2467776 -3238915 -3093497
610 -3093497 -1427287 -289187 -324490 829210 1376581 15315 -3092936 -2616457 -410349 -1049015
600 -1049015 -3049799 -2391486 -965810 540496 2114165 2619728 1877417 433973 -69049 2029239
589 2671909 875985 -1565851 -3284348 -2767457 -542561 242367 -732554 -897819 -194010
579 1033821 937475 463379 1178324 1941041 2544263 3092580 2872737 118370 -1995015 -3906464
569 -3906464 -5286811 -4529327 -1847337 978562 222077 -2743483 -3417388 -1733905 660596
559 3204111 2899636 -758879 -3009491 -3202212 -2585390 -802522 -215329 -1564887 -1352995
550a352995A03755D3956g67803F93097J847761l57410G18288L93341j55519d85849
539e70097G04371j73306a984278o95201g86727D84057P09460Q47471n99826E16761
528H64356O52059O43074o44817g49891m58973d9853A339821J355718L37377A026790
517b038898j604623a316931D37066g91283o85816D34399N51167a454528j195600
508b650128R30932N95954j192546m96586R17883N21893P686p96958k210787j528710
498e901367J784544a096925A260066J003368q61389a969149k662320R49320J540290
489b141859M31181N53041K34581j551208p63001M57377p16192j969796j07908
480e573784O94119r9700n42337o30753j83242J173117J138356M32560J730549
$$ plain form
550 -1352995 103755 43956 -767803 693097 2540858 2183448 718288 1111629 956110 -485849
539 -570097 704371 531065 -1984278 -2679479 -786727 484057 1193517 2040988 1441162 516761
528 864356 1516415 2159489 1514672 -749891 -1208864 -49853 1339821 2695539 3032916 1026790
517 -2038898 -3643521 -1316931 437066 -791283 -1477099 434399 985566 -1454528 -2650128
508 -2650128 -1719196 -1123242 -2315788 -2812374 -1894491 -1372598 -1364912 -2161870 -4372657 -5901367
498 -5901367 -4116823 -1096925 1260066 2263434 1402045 -1969149 -4631469 -3682149 -2141859
489 -2141859 -1710678 -1157637 -923056 -2474264 -3237265 -2779888 -3496080 -5465876 -5573784
480 -5573784 -4879665 -4979365 -5521702 -6152455 -6335697 -5162580 -4024224 -3591664 -1861115
471a861115E38783B11198b630123j579078J422385O68747N62203d64598j366214
462a830812k066108r81502q01628M9146R84089L60117j721002j362757J107063
453f263394J587200R97443l1951m47961j202977p60181K67798J795981Q74187
444c183855m09434p78190j357757o08700J532846N72103j526273j693619j142759
435h595638r4783j732162l587082j451210J304977m21135k312402m234464k649290
426b3773189k218393N60857k653025j3215559o448933j04909612k44592581k8197789
418d25448224a26789999G2376428j3037454k3328270n769704r594716q69598j543636
410A8233050l683264m138877p97760L279723J572230l86826j561272m350469C938804
$$ plain form
471 -1861115 538783 211198 -2630123 -4209201 -2786816 -2118069 -1555866 -464598 -1830812
462 -1830812 -3896920 -4878422 -5680050 -5630904 -4646815 -4286698 -6007700 -7370457 -6263394
453 -6263394 -4676194 -3678751 -3710702 -4158663 -5361640 -6121821 -5854023 -4058042 -3183855
444 -3183855 -3593289 -4371479 -5729236 -6337936 -4805090 -4232987 -5759260 -7452879 -8595638
435 -8595638 -8690421 -10422583 -14009665 -15460875 -14155898 -14577033 -16889435 -21123899 -23773189
426 -23773189 -25991582 -25430725 -28083750 -41299309 -47748242 -152657854 -397250435 -425448224
418 -425448224 -126789999 72376428 59338974 36010704 30241000 20646284 19776686 18233050
410 18233050 14549786 10410909 9613149 12892872 14465102 14078276 12517004 8166535 3938804
400B287663J431569K270264K270240J494804k193801C642851j506576K132948
392D269223J315825m04308r05121j388180j56423J301858K54176r58241A492792
382A880489K037134K419121N13449j679622k254733r7969L59219L02749J187136
373D666973O62091q17079k068262E59569c65275G81904J973968q32687A87436
363I46245P82089N59476O00909j76513L54946J552702j90643r40220M54315p80333
353C162973e11196l249530O29580a68253A707315K5911G34401A85349K48844e22008
342a798213L95865b42880C15368P21831o0804j84222K525896J747200j809670
333C255599j100847J411848P14826q97346j605502e27324n16943C28324O10866
$$ plain form
400 2287663 3719232 5989496 8259736 9754540 7560739 3642851 2136275 4269223
392 4269223 5585048 5180740 4275619 2887439 2731016 4032874 4287050 3328809 1492792
382 1880489 3917623 6336744 6850193 5170571 2915838 2817869 3177088 3479837 4666973
373 4666973 5329064 4511985 2443723 559569 -365275 781904 2755872 1923185 187436
363 946245 1728334 2287810 2888719 2712206 3067152 4619854 4429211 3488991 3943306 3162973
353 3162973 -511196 -3760726 -3131146 -168253 1707315 1733226 734401 185349 434193 -522008
342 -1798213 -1402348 -242880 315368 1037199 976395 792173 3318069 5065269 3255599
333 3255599 2154752 3566600 4281426 3384080 1778578 -527324 -1044267 328324 939190
324I39190J578463J009328j042002n76144J443372R52699k03011A441627b180727
314a994582F52412J546811Q57901n05068j153587J238242J266984j780202d02340
304d23250B198906J53117B8551g63735b75356J06738q6465l99755Q2514b9235
293G62979B93750a231644N18417F55092B79375g80991q1174P0373b73801k0971
283b94772B5208Q36162C23215e84851a23944D55298f18691r64152k91283g25891
272H02143f9946k612014j750228Q38374a140073B73756e19194j433111M35291
263a517014H87880N19861F33814J2045j34934m2184N31779K54515a62138j117276
253a279414e32086D0002e7793k31973o9575n57996L18908I85526M68067o44315
$$ plain form
324 939190 2517653 3526981 2484979 1908835 3352207 4304906 4101895 1441627 -2180727
314 -1994582 652412 2199223 3057124 2552056 1398469 2636711 3903695 2123493 -402340
304 -423250 2198906 2352023 28551 -763735 -275356 -168618 -255083 -654838 -572324 -29235
293 762979 293750 -1231644 -713227 655092 279375 -780991 -862165 -791792 -273801 -294772
283 -294772 25208 861370 323215 -584851 -123944 455298 -618691 -1582843 -1874126 -725891
272 802143 -69946 -2681960 -4432188 -3593814 -1140073 273756 -519194 -1952305 -1517014
263 -1517014 887880 1407741 633814 645859 510925 468741 1000520 1255035 -162138 -1279414
253 -1279414 -532086 40002 -57793 -289766 -359341 -917337 -598429 985526 1453593 809278
243H09278p164k92909B53494J286644K23102b14801k000968j70326K36964J29851
233b019280l48294M5834m52275h62702A656597N86133A09791b902136j210314
224d112450J321676a070548D0614J114332Q40367Q46533r98331a04460n08600
215f13060F62215K6514d07510K2911I22164C78134c22838J29332A045194L61953
205A407147e61344j614244c25336A900938o21432i64350j800447p1683h43981
195F2286g20478J72836H31465O19856B61380c193539k092332R80695a413455K63962
185a149493j041655m18558l87928j321784q02295J243588J134380R78074D87818
175B185504m43367n4854J369608J079067j406027g79540k699590k73678J344589
$$ plain form
243 809278 802114 509205 253494 1540138 1763240 -214801 -2215769 -2386095 -2149131 -2019280
233 -2019280 -2367574 -2321740 -2774015 -862702 1656597 2242730 109791 -2902136 -4112450
224 -4112450 -2790774 -1070548 40614 1154946 1995313 2841846 1843515 -104460 -613060
215 -613060 662215 688729 -407510 -384599 922164 378134 -322838 -193506 1045194 1407147
205 1407147 -561344 -2175588 -325336 1900938 1279506 -964350 -2764797 -2836480 -843981
195 62286 -720478 -547642 831465 1451321 261380 -3193539 -5285871 -4305176 -1413455 -1149493
185 -1149493 -2191148 -2609706 -2997634 -4319418 -5121713 -3878125 -2743745 -1765671 487818
175 2185504 1742137 1687283 3056891 4135958 2729931 -779540 -3479130 -3752808 -2408219
166b408219g01803A460168o17536a624142O55608A142454j65067a078643j341560
157b420203M71043e59598F41046N56467E94480A86493J029603J575275M40382
148C231753j484581a083610j576845c84369C648645L02275H62509h52189c06095
138D7703L53849Q39001P59347C86721c884345k331757b584885B360240J496161
129C856401j780494a163386k653309P71746a055176j42063j784876o59693J31635
120c510173K42297L97888R01119i74692b3117D3666L3229f64613j238163r6505
110a999281D21486K276022k22967H95679d04902n25906B51718J422682G37397
100C22096J847210m24458A3917c45651g5547j23716j41366j80648G7558J191203
$$ plain form
166 -2408219 -701803 1460168 842632 -1624142 -968534 1142454 977387 -1078643 -2420203
157 -2420203 -1949160 -559598 641046 1197513 594480 186493 1216096 2791371 3231753
148 3231753 1747172 -1083610 -2660455 -384369 3648645 3950920 862509 -852189 -306095
138 47703 401552 1240553 1999900 386721 -3884345 -6216102 -2584885 2360240 3856401
129 3856401 2075907 -1163386 -3816695 -3044949 -1055176 -1197239 -2982115 -3641808 -3510173
120 -3510173 -3267876 -2869988 -1968869 -974692 -23117 43666 76895 -664613 -1902776 -1999281
110 -1999281 421486 2697508 2474541 895679 -404902 -930808 251718 1674400 737397
100 322096 2169306 1744848 13917 -345651 -75547 -199263 -340629 -521277 77558 1268761
90A268761J30317d85635q70138f0337A334510B87777c08498B052623K773435j385232
80C440826I23381i68847m26716L78779J67486k52256K90900I25633J925006k6106
70B824533e190k124455L01951e15064C34650a62283j150049e49017A619495j41630
60A477865g38116r92333f14747j83560j469373q68876p6115J179092a08392A145587
49H62836e39843o93402i1409D91812d76730D71635J596963j90556n03004l44303
39A030735A04443A9762P81686J496893Q12234H47739a148737N65459C25980e56742
28a588510a86697D16844b139599m02408A504062K193339j745420B60182e08417
18c61558J46603J9938A38739b32923j299320b62474A681352B78074a731401M35457
$$ plain form
90 1268761 1399078 -485635 -1355773 -60337 1334510 287777 -308498 2052623 4826058 3440826
80 3440826 923381 -968847 -1395563 -1016784 -849298 -1101554 -810654 925633 2850639 2824533
70 2824533 -5190 -2129645 -1827694 -515064 334650 -162283 -1312332 -549017 1619495 1477865
60 1477865 -738116 -1730449 -614747 -798307 -2267680 -3136556 -3212671 -2033579 -108392 1145587
49 862836 -539843 -1233245 -91409 491812 -476730 471635 2068598 1878042 1375038 1030735
39 1030735 104443 19762 801448 2298341 3110575 847739 -1148737 -583278 325980 -556742
28 -1588510 -186697 416844 -2139599 -2542007 1504062 3697401 1951981 260182 -508417
18 -361558 -214955 -195017 138739 -232923 -1532243 -262474 1681352 278074 -1731401 -1295944
8a295944c64011a10552G71730J185191J395I06489l86085Q79732
0A400136
$$ plain form
8 -1295944 -364011 -110552 771730 1956921 1958316 906489 520404 1400136
0 1400136
##PAGE= F1=2977.860963676
##FIRST=     18110.137220953, 5591.54909048506, 1680945
##DATA TABLE= (F2++(Y..Y)), PROFILE
1023A680945m01489k75848N0362R55430Q84889n53729j08527j065179a628962
1013b787635a317655B29O06973C4521a23078K4951j279086j053452e93606A599815
1002E81169a625381J72653M92143j19543M94208q19443j679432J0090a243914
992E3273J343756K73041B72882n0170J038180j94879e85577n50902n22318n41614
982b200411R59093D30960J836956O29582j079208B58918a327827r56096m72814
973b756737L51042J172545n63167r01606a225354b0914k52446m49038j475204
964b197602l23692R49521N61291J66264E66483P48002l83011K90904K163708Q28538
954D214624j608254I96939l87110B7273h57946j13786L12774o36456e75938A423003
$$ plain form
1023 1680945 1279456 1003608 1053970 2009400 2894289 2340560 2232033 1166854 -1628962
1013 -2787635 -1317655 229 607202 34521 -123078 -98127 -1377213 -2430665 -593606 1599815
1002 581169 -1625381 -1452728 -960585 -1080128 -585920 -1405363 -3084795 -3074705 -1243914
992 53273 1397029 1670070 272882 222712 1260892 1066013 -585577 -1136479 -1658797 -2200411
982 -2200411 -1241318 430960 2267916 2897498 1818290 258918 -1327827 -2283923 -2756737
973 -2756737 -2405695 -1233150 -1796317 -2697923 -1225354 -20914 -273360 -722398 -2197602
964 -2197602 -2521294 -1571773 -1010482 -844218 566483 1314485 931474 1222378 3386086 4214624
954 4214624 2606370 996939 609829 27273 -857946 -971732 -658958 -1295414 -575938 1423003
943C368631L11373j557577H46513M2932l95826a002813j949017k528222q54702
934f334754K513298b76690A521049N71368r92569f6563j35667q18841j567177
925b588248J145316A63547b76153A6229J675925M96938I24240A15451J29081K44537
915D89069J577153K6120m61964Q16897q53677A67134i10053q71191J20511C26886
904C41599a458962N5512H08791M76162A14089c52878P7450l507J06508F96700
893A272057P45004N91015D64123b064703i70881A177100J91263B40039h82718
883a447132N53670F22697J647878J007116j378445B12620a752017j427226J51698
874c027545J17486J162357A128713K159357k88553O80289J471293j170540A110976
$$ plain form
943 3368631 3680004 2122427 846513 889445 493619 -1002813 -2951830 -5480052 -6334754
934 -6334754 -3821456 -276690 1521049 2092417 1099848 -66563 -202230 -1021071 -2588248
925 -2588248 -1442932 163547 -276153 16229 1692154 2189092 924240 115451 244532 489069
915 489069 2066222 2092342 1630378 2447275 1593598 167134 -910053 -1781244 -1660733 326886
904 341599 -1458962 -1403450 808791 1284953 114089 -352878 -275428 -278935 -172427 696700
893 1272057 2017061 2608076 464123 -2064703 -970881 1177100 1368363 240039 -882718
883 -1447132 -893462 622697 2270575 3277691 1899246 212620 -1752017 -3179243 -3027545
874 -3027545 -2910059 -1747702 1128713 3288070 2999517 3679806 5151099 3980559 1110976
864a283240k24281G43698J860474m02565G78893i09404j597175q67320j32320
855c506219R39737h74387A7564c73570n14853o98451g08739B179582J062484A044308
844a908416q90204a270244F99653M52470J6349A86089a947690O3436A029902J117664
834B147566b20741j580194L42538k06161n97034M23737G61220J394828I1440a636423
823a33764e0094j074651A1974P84786A03538K41830J034476M8357O29112R68195
813C025508j283457i73089k024909q98227R60540i23078c20000l45884o20967
804a286851m66419N56382F70369J441613J323799M34641q69723D80776b329654
794b098789E74555J45765a662985q12716M22191g55211A210108R21824J29370
$$ plain form
864 -1283240 -1507521 743698 2604172 2201607 778893 -909404 -2506579 -3373899 -3506219
855 -3506219 -2566482 -874387 17564 -373570 -888423 -1586874 -708739 2179582 3242066 1044308
844 -1908416 -2798620 -1270244 699653 1152123 1168472 186089 -1947690 -1884254 1029902 2147566
834 2147566 -220741 -1800935 -1458397 -1664558 -2261592 -1837855 761220 2156048 91440 -1636423
823 -133764 -50094 -1124745 11974 796760 103538 345368 1379844 1428201 2057313 3025508
813 3025508 1742051 -973089 -2997998 -3896225 -2935685 -923078 -320000 -665884 -1286851
804 -1286851 -1753270 -1196888 670369 2111982 3435781 3870422 3000699 480776 -2329654
794 -2098789 574555 720320 -1662985 -2475701 -2053510 -755211 1210108 2131932 2261302
785B261302j87691J7283M68233m36712m78486E59165g31407r92889j385138l83556
775c492990a475088f37022j736707j760096J706849F29971N93722n41093Q1140
766G63740l04574a463472n30372j89748j47913g97299G71127j507P7902M94826
756A342348F56562b94923q92041r44245L78972P22653b4737A462639r648F39008
745A218927k79653a86144r30097e57542A82380J373749J238721j11741b09611
735b434627m84955N53615J080402a30464B1726P1257d53772j196342k507d93794
724e55493j150544J03855I14356L455405K56197B066304F32158B58547e70917
714a65654A993745J047959j381433i2742m62755K59502A01350J312357J016287
$$ plain form
785 2261302 2073611 2090894 2559127 2122415 1643929 559165 -731407 -1724296 -3109434 -3492990
775 -3492990 -1475088 -637022 -2373729 -4133825 -2426976 629971 1223693 682600 763740
766 763740 459166 -1463472 -1993844 -2183592 -2331505 -797299 771127 769620 847522 1342348
756 1342348 656562 -294923 -1186964 -2131209 -1752237 -1029584 -24737 1462639 1452991 639008
745 1218927 939274 -186144 -1116241 -557542 182380 1556129 2794850 2683109 -209611
735 -2434627 -2919582 -2365967 -1285565 -130464 21726 92983 -453772 -1650114 -1652621 -493794
724 -555493 -1706037 -1602182 914356 4369761 4625958 2066304 632158 258547 -570917
714 -165654 1993745 3041704 1660271 -92742 -555497 -295995 101350 1413707 2429994
705B429994l58414j020342f8071D90315J314972k25909B50351g49710j011298
696a761008N70282A841669K029610j087209A319263k24608n36203a132596j141059
687b273655p40699M32435i78110K05146r23769N29877H82393J030619M79161M52480
677B844653q56472H87546N4131J235166J444000M8529N27450L80233j593412j352579
667A631064D46445b191705j582180J431331h98406d19314D30111J191946J55805
658A777862E41092d88746m6846E29214J863366p72815a145740j692839j42311
649b980890j36445R56624B198R89401N80791J180509p66777a7343j470704e31034
638A943814P06584I30052i99350p48224n01988k42414J06927l87170N571a285169
$$ plain form
705 2429994 2071580 1051238 -68071 490315 1805287 1579378 250351 -749710 -1761008
696 -1761008 -1190726 1841669 3871279 2784070 1319263 1094655 558452 -1132596 -2273655
687 -2273655 -3014354 -2581919 -978110 -772964 -1696733 -1166856 882393 1913012 2392173 2844653
677 2844653 1988181 887546 941677 2176843 3620843 3669372 4196822 4577055 2983643 1631064
667 1631064 446445 -2191705 -3773885 -2342554 -898406 -419314 430111 1622057 1777862
658 1777862 541092 -488746 -535592 529214 2392580 1619765 -1145740 -2838579 -2980890
649 -2980890 -3117335 -2160711 2198 991599 1572390 2752899 1986122 -17343 -1488047 -531034
638 1943814 2650398 930052 -999350 -1747574 -2249562 -2491976 -2385049 -2772219 -2766648 -1285169
627h13636R4254A238222J518534J84869j49589k10409j094404l03184R14079j14527
617A983591k85011M96889j084680i89718p96645l35739R2448R32854b45824d607
606A211728Q16660G54186c068463m40490a000019r8429k216628L70277i75373
596B34647J400745K37213H18928a0120E15076K413727L21200A080041a551676
586b926452Q09730a48548G94444k96337a41330n32276A44341M12116j57393Q49073
576A248137J009689M83068j33080n07699b88179k138508j792019j136517O27162
567d728061a790033A373231E71070b499188p55630a236448A646927K189594r01300
558B935221c72809k238437j020491L65028a163745M69131j211006h12079E52510
$$ plain form
627 -813636 -719382 1238222 2756756 2941625 2792036 2581627 1487223 1184039 2098118 1983591
617 1983591 1698580 2195469 1110789 -989718 -1786363 -2122102 -2029654 -1096800 -245824 -4607
606 1211728 2028388 754186 -3068463 -3508953 -1000019 -1098448 -3315076 -2944799 -975373
596 234647 1635392 1872605 818928 -10120 515076 2928803 3250003 1080041 -1551676
586 -2926452 -2116722 -148548 794444 498107 -141330 -673606 144341 556457 399064 1248137
576 1248137 2257826 2740894 2607814 2100115 -288179 -2426687 -4218706 -5355223 -4728061
567 -4728061 -1790033 1373231 571070 -2499188 -3254818 -1236448 1646927 3836521 2935221
558 2935221 -372809 -2611246 -3631737 -3266709 -1163745 -694614 -1905620 -812079 552510
548d11297q25078F60567J913052p2889j118963j60065D39835h20892L03154A046931
537A445799f67822j183449e03453I64642J95806L8476E92866k95849P75814P41554
527A814385P71635j27463E07107a71490D54694R17640J726786P25583A439886
517b110775j637376a385456G79815B79046f16515F11045J52253a900974j348063
508c249037a613003F8568a023877j254191j0794O68690d98001k2893k552519j995544
498e068957J505402g30178A610343Q31315A161098b295336k006097J557712a221326
488a465836N7284K99561j191281k81485M85983j464689k351869N34491Q19362
479d558479l90878m02770p20625l96261J309173J841208L97056Q21069a153E14396
$$ plain form
548 -411297 -1236375 660567 2573619 2500730 1381767 1221702 439835 -820892 -517738 1046931
537 1445799 -667822 -1851271 -503453 964642 1160448 1198924 592866 297017 1072831 1814385
527 1814385 2586020 2458557 507107 -171490 454694 1372334 3099120 3824703 1439886
517 -2110775 -3748151 -1385456 779815 279046 -616515 611045 763298 -1900974 -3249037
508 -3249037 -1613003 68568 -1023877 -2278068 -2288862 -1620172 -498001 -520894 -3073413 -5068957
498 -5068957 -3563555 -730178 1610343 2441658 1161098 -2295336 -4301433 -2743721 -1221326
488 -1465836 -1408552 -1108991 -2300272 -2581757 -2095774 -3560463 -5912332 -5377841 -4558479
479 -4558479 -4949357 -5352127 -6072752 -6469013 -5159840 -3318632 -2921576 -2100507 -1153 514396
468a542860j444275J088117K01573R1173b49874l31512j754729j834408j739950
459e910473P98667K107525K42090k764449j661529J877501K279112K23554n75312
450c383314j99808j020441j199098M09771J076459P11814L33261j81065j382335
441d834756j127197J607693J425697j081338j617320j733806q08507j135395l049908
432a2354837j357955O55399p23673p64776l829648k942819K01620N32124k712952
423b3297517j0241366p945577q5797572j95007339j9011205i8587092F2519633
415E2211041j8154334m950731q725392j198472k220403l646073l016823N03266
407A0802079J949426j53937m07980j133664m363628B322456j095573J326231K348928
$$ plain form
468 -1542860 -2987135 -1899018 -1697445 -1606272 -249874 -581386 -2336115 -4170523 -5910473
459 -5910473 -5111806 -3004281 -2762191 -5526640 -7188169 -5310668 -3031556 -2808002 -3383314
450 -3383314 -3583122 -4603563 -5802661 -5392890 -4316431 -3604617 -3271356 -3452421 -4834756
441 -4834756 -5961953 -4354260 -2928563 -4009901 -5627221 -7361027 -8169534 -9304929 -12354837
432 -12354837 -13712792 -13057393 -13781066 -14545842 -18375490 -21318309 -21116689 -20584565 -23297517
423 -23297517 -33538883 -41484460 -127282032 -322289371 -341300576 -98587092 62519633
415 52211041 34056707 29105976 20380584 19182112 16961709 13315636 10298813 10802079
407 10802079 12751505 12597568 12189588 11055924 6692296 2322456 1226883 2553114 4902042
398D902042K357179K244910k445191A999648a1897B907381K378956N35022j258022
389D563337j758919l12290Q12065l79056p46552j012480N71198J416858J882106
380E036267Q70953j207249k340700m94597O10157R74443J099179R2919o36491
371D004881j445370A150616m86158R64672J435010r43388F8354M42869J206437
362A717660P27069k96344l60793J341066J920953m70717j262825j24993j006941
353B184135e21226k124041p375a235444E28665O58372B04541f07192J95593m27689
343h39288n77304N01694a25353B49288H7816f55295K45228B671024K173209j537332
333C306901j520890N30054M02362n94018F13433a713260R3346D59630L46258R74163
$$ plain form
398 4902042 7259221 9504131 7058940 1999648 -11897 2907381 5286337 5821359 4563337
389 4563337 2804418 2492128 3304193 2925137 2178585 1166105 1737303 3154161 5036267
380 5036267 5907220 4699971 2359271 1864674 2474831 3449274 4548453 4641372 4004881
371 4004881 2559511 1150616 664458 1629130 3064140 2120752 68354 511223 1717660
362 1717660 2444729 2148385 1787592 3128658 5049611 4578894 3316069 3191076 2184135
353 2184135 -521226 -2645267 -2652642 -1235444 528665 1187037 204541 -607192 -411599 -839288
343 -839288 -1416592 -914898 -125353 249288 87816 -655295 -410067 2671024 4844233 3306901
333 3306901 1786011 2316065 2718427 2124409 613433 -1713260 -1619914 459630 805888 1780051
323A780051J245779k90615l88681R72871K42720o25034G35642b389114k2443b5222
312A654389J223678J30112p79333J183316J132798j935337a94144k31354B259521
302B281622a25903q91650M72069A38377L50312k08620M97175O87274l38903d43569
291a567482A1249J205294A63909a135147j33754K02229M48478j32909c33652H40057
280B16687h04466c18822E14236c1881o93305n16358f4299A578090E16308b607333
269d939958L5897J598847a535612K66156n86718Q69558A290132L51306o14429
260A027009R8817l19859B94545L20531J97012f10677j045940O13918J25351n5785
250i73133J34669j72989r75863R1046e83981E79005M60361Q15641l6722n36159
$$ plain form
323 1780051 3025830 2735215 2346534 3319405 3562125 2937091 735642 -2389114 -2411557 -25222
312 1654389 2878067 3008179 2228846 3412162 4544960 2609623 -194144 -425498 2259521
302 2281622 -125903 -1017553 -545484 138377 488689 280069 777244 1464518 1125615 -443569
291 -1567482 11249 1216543 163909 -1135147 -1268901 -1066672 -618194 -751103 -333652 840057
280 216687 -804466 -318822 514236 -31881 -725186 -1241544 -64299 1578090 516308 -2607333
269 -4939958 -4904061 -3305214 -1535612 -1269456 -1856174 -986616 1290132 1641438 1027009
260 1027009 1125826 805967 294545 615076 812088 -610677 -1656617 -1042699 -917348 -973133
250 -973133 -838464 -1011453 -1987316 -1896270 -583981 579005 1039366 1855007 1818285 1282126
240A282126L76911n93046e44724p95808l29454p86156p7255M4301P83922q81485
230b586659a021319A357066J066254G52987b157762j241127J232590d90012D1007
220A61358J301086K351446p70842D12337d35882F48622B27594a091616N15064
211e76552I37224A70159d21288a49704B06671a00739j318482o47683h8383A799449
200I05105a410191j191858O11660A93543Q92875a40757m38941H56693N57624a3388
189c344030k508536Q36738a734788d51663m77209k25309q12290k698760j529548
180f194779J945454J410939M07578g24444H93864L05743K9638P54957O01745m31225
170B154722B17682c016349j802555J232644f76153A497728D87429a918638L67153
$$ plain form
240 1282126 1659037 1065991 -544724 -1340532 -1669986 -2456142 -2533397 -2489096 -1705174 -2586659
230 -2586659 -1021319 1357066 2423320 752987 -2157762 -3398889 -2166299 -490012 41007
220 161358 1462444 3813890 3043048 412337 -435882 648622 227594 -1091616 -576552
211 -576552 937224 170159 -421288 -149704 206671 -100739 -1419221 -2066904 -88383 1799449
200 905105 -1410191 -2602049 -1990389 193543 1086418 -140757 -579698 856693 1414317 -13388
189 -3344030 -5852566 -5015828 -1734788 -451663 -928872 -1154181 -1966471 -4665231 -6194779
180 -6194779 -4249325 -2838386 -2430808 -724444 893864 1199607 1229245 1984202 2585947 2154722
170 2154722 217682 -3016349 -4818904 -3586260 -676153 1497728 487429 -1918638 -1551485
161a551485B70180L96155h27827j258128m7789i20489I65421K379601j48698A205846
150B36617J433872J357098j034549i40247j896288f05186C502493K06856H00629
140f28595J35690b19212D25510O46367O29553G50595c146415k906963K825488
131c227890A982886K243653j718494a585305l380356J237667a036494k27332k415598
122c679424j223654L23226J251650J376634Q79451J34444c08571D45999P7623
113E23622e08706q05996M24666A398586K274842n82685H29225f07638j43554B89818
102A190410d12954q63352I14293O12604B26757e68486K59650e6555m35091l16248
92h07894F1214P98093j24485e14688k3511I89629J044488D38478a51512B247830
$$ plain form
161 -1551485 270180 666335 -827827 -2085955 -2133744 -920489 965421 3345022 3196324 1205846
150 236617 1670489 3027587 1993038 -940247 -2836535 -605186 3502493 3709349 800629
140 -628595 -492905 -219212 425510 1071877 1701430 750595 -3146415 -6053378 -3227890
131 -3227890 1982886 4226539 2508045 -1585305 -4965661 -3727994 -1036494 -1263826 -3679424
122 -3679424 -4903078 -4579852 -3328202 -1951568 -1072117 -937673 -308571 445999 523622
113 523622 -508706 -1314702 -890036 1398586 3673428 3090743 829225 -607638 -751192 289818
102 1190410 -412954 -1276306 914293 1526897 226757 -568486 -308836 -56555 -491646 -807894
92 -807894 61214 859307 734822 -514688 -538199 989629 2034117 438478 -151512 2247830
81D917442j031722A786613f64565j105206O65375a49001l72841m81974B76900
71B501320O06100D11279b006543l40344J103758d50439m09571q10904c19085A311731
60B98069a589378p5119d72687l8160j194691j581894j504114Q37149i31151A051758
49A053012c06409j081208d75472C26605c79287B62456J220174l2793J61302L18943
39A930082G57076c34691a21267A173201L41701g70371j765105a114291H12174
29G20451e69276K63329q4621k382685m60018A24570K094440p73266o16048j93936
19F35760l07286A3390Q066L61475a95573j755553h86488A656595E61747a434167
8d69918H59313k56011K55362J181637M8804j028906Q3595R40272
$$ plain form
81 4917442 3885720 1786613 -664565 -1769771 -1104396 -149001 -521842 -1003816 276900
71 2501320 3107420 411279 -2006543 -2346887 -1243129 -450439 -860010 -1670914 -319085 1311731
60 298069 -1589378 -1664497 -472687 -510847 -1705538 -3287432 -4791546 -3954397 -931151 1051758
49 1053012 -306409 -1387617 -475472 326605 -379287 262456 1482630 1449837 1611139 1930082
39 1930082 757076 -334691 -121267 1173201 1514902 -770371 -2535476 -1114291 812174
29 720451 -569276 -305947 -390568 -2773253 -3233271 124570 2219010 1445744 829696 635760
19 635760 328474 13390 21456 382931 -195573 -1951126 -886488 1656595 561747 -1434167
8 -469918 859313 603302 858664 2040301 2089105 1060199 1143794 2084066
0B084066
$$ plain form
0 2084066
##PAGE= F1=2956.243426166
##FIRST=     18110.137220953, 5591.54909048506, 1263067
##DATA TABLE= (F2++(Y..Y)), PROFILE
1023A263067n73307j60243K3064Q63368J136466k83955m26061G45443i90051j34815
1013a124866c21849c4403B68638h33472k08785I04547J369624H76033P89223R37894
1003B603150G45825a169870K92885J85349L8715B72057d94969j917537l9808g29351
992B30579Q19923L83167A30556b33399D76731j11121a079306p54729j305760m31163
982c570958J116882g88326A104125Q52900m52776B67520i08766o80640p72574
973b361980K48045g71434j375692j779229J827676d61096q9813k5571j282852
964a859332r71249a293712P2421n98812i3855A433269l81930q829J735351Q77645
954C655506j146531H08801f4859l71833l18218J00637b72373o08486j90695b61573
$$ plain form
1023 1263067 689760 529517 552581 1415949 2552415 2268460 1842399 745443 -990051 -1124866
1013 -1124866 -321849 -34403 268638 -833472 -1042257 904547 2274171 876033 1665256 2603150
1003 2603150 745825 -1169870 -876985 -691636 -652921 272057 -494969 -2412506 -2452314 -729351
992 230579 1050502 1433669 130556 -233399 476731 365610 -1079306 -1834035 -3139795 -3570958
982 -3570958 -2454076 -788326 1104125 1957025 1504249 267520 -908766 -1589406 -2361980
973 -2361980 -2113935 -771434 -2147126 -3926355 -2098679 -461096 -550909 -576480 -1859332
964 -1859332 -2830581 -1293712 -1221291 -1820103 -93855 1433269 1051339 1042510 2777861 3655506
954 3655506 2508975 808801 -64859 -436692 -754910 -654273 -272373 -880859 -1071554 -261573
943A322084O44656G28936g12758A10146Q12440B61771a403577k099804n27776
934d031157a908727G33508J684767L50824j223708C02339A30491b32986j511269
925a744255K17752a66136A68314M92785J732579O07324A018832e26472i3527A132003
914C184472m94692A195446J0482E25379e53766n51945k88855M68145I64716k89825
904F74891a098735e33672A955829n7559C05952a22274B12304h7001m42196b59929
893a80899A40174J362094p19448a078598c90435A528311J42675A40061a671909
883b015212h07929I42291J550441J012824r19660A122151a023072j381989O47888
874a757173n4791M74568A669786K645987N32200J209857N46882k405093A378297
$$ plain form
943 1322084 1966740 728936 -712758 110146 922586 261771 -1403577 -3503381 -4031157
934 -4031157 -1908727 733508 2418275 2769099 1545391 302339 130491 -232986 -1744255
925 -1744255 -1526503 -166136 168314 661099 2393678 3001002 1018832 -526472 -93527 1132003
914 3184472 2689780 1195446 1205928 525379 -553766 -1105711 -1394566 -926421 964716 674891
904 674891 -1098735 -533672 1955829 1898270 305952 -122274 212304 -87001 -529197 -259929
893 -180899 140174 1502268 782820 -1078598 -390435 1528311 1670986 140061 -1671909
883 -2015212 -807929 942291 2492732 3505556 2585896 1122151 -1023072 -2405061 -1757173
874 -1757173 -1811964 -1337396 1669786 4315773 4847973 6057830 6604712 4199619 1378297
864e44360n69453A072248K582651j5704A650440a019185j769663n63727k63457
855c616032Q26252f56119F24004i3565q57150j054635h44510B502901R16526A301183
844a351673j169761J009812A87447J50176n8025c84776j527811K89464A286328
834B591128B67107a856691l3943j3637j7813O70959I68001J064649b83644j036084
824a319728H71302P5473f27048C18890P92040c27432n11608E26686O10920N89402
814A727008O48695H40952a662874j441779m39857R84328g65189b81417m19841
805g01258K59756B97590J43816J230577J472855N68007l74905n26542A097986
795a638055l92700A45601O97407e27382r3100p80234k9353G12197J676878k22078
$$ plain form
864 -544360 -1113813 1072248 3654899 3639195 1650440 -1019185 -2788848 -3352575 -3616032
855 -3616032 -2789780 -656119 624004 -93565 -950715 -2005350 -844510 2502901 3419427 1301183
844 -1351673 -2521434 -1511622 187447 337623 279598 -384776 -1912587 -1623123 1286328
834 2591128 267107 -1856691 -1890634 -1904271 -1922084 -1251125 968001 2032650 -283644 -1319728
824 -1319728 871302 946775 -627048 318890 1110930 -327432 -839040 526686 1137606 1727008
814 1727008 2375703 840952 -1662874 -3104653 -3544510 -2560182 -765189 -281417 -701258
805 -701258 -441502 297590 441406 1671983 3144838 3712845 3337940 2811398 1097986
795 -1638055 -2030755 145601 843008 -527382 -620482 -1400716 -1430069 712197 2389075 2166997
785B166997j036746l4972J197310m00516p34519A32849a122563j114016j311237
776c547816o09124J872603i17422o11068j023161J034809G78401K42911b35108
766c61908J09445j141476O3671N18165J31588f5898C39762c09142J25928A155601
755A174643c58372j382862m92322M99013N57991B62605K471445R1356A158249
745I14230C26280d48427k35479j39173q46509d57452B433109J007906E74679a824132
734b400891L74772h82418A3681b46870j04728m53919j547121j91501J207182O31040
724g05917o40959k06925I166K599340Q14873j594360o94959j78613b63796K2614
714b41182A711415J097702o51785r24318H9321f59590k8884H24376J229748O7324
$$ plain form
785 2166997 1130251 1095279 2292589 1892073 1157554 132849 -1122563 -2236579 -3547816
776 -3547816 -4156940 -2284337 -917422 -1528490 -2551651 -1516842 778401 1021312 -235108
766 -361908 -252463 -1393939 -1330268 -812103 -680515 -65898 339762 -309142 -183214 1155601
755 1174643 -358372 -1741234 -2233556 -1734543 -1176552 262605 2734050 2825406 1158249
745 914230 326280 -448427 -683906 -823079 -1669588 -457452 2433109 3441015 574679 -1824132
734 -2400891 -2026119 -882418 13681 -246870 -351598 -805517 -2352638 -2544139 -1336957 -705917
724 -705917 -1346876 -1553801 9166 2608506 3423379 1829019 1134060 955447 -263796 -241182
714 -241182 1711415 2809117 2157332 1233014 89321 -659590 -688474 824376 2054124 2121448
704B121448p07760n78011R25951P54154j185915C10304g1871j507735J6861A294785
693C215736o71074q17268Q097F91738a681776j643385N1418N54923J267076m113
683a455857j405808P22324I78688J658063J346350Q33511j387279A398459C30589
673F24870J957016J363320O12796p87644j867553p71026n05925a513294j545347
664c058641O00075J072100d33207I27861J047809k61555c4651j787054m95726
655b317431e58071A788946q51239a813099j838742r989N16539J275727e2893A020892
644A650886N80040q13830H9879a481765L46136C26302O02334m38999a009818j516185
634b526003r48232M69338R05865k56974o30517J051747P13241j66583A73229J771911
$$ plain form
704 2121448 1413688 835677 1761628 2515782 1329867 310304 -71871 -1579606 -1562745 1294785
693 3215736 2544662 1727394 1735491 691738 -1681776 -3325161 -3273743 -2718820 -1451744 -1455857
683 -1455857 -2861665 -2139341 978688 2636751 3983101 4816612 3429333 1398459 330589
673 624870 2581886 3945206 4558002 3770358 1902805 1131779 625854 -1513294 -3058641
664 -3058641 -2458566 -1386466 -433207 927861 1975670 1714115 -34651 -1821705 -2317431
655 -2317431 -558071 1788946 937707 -1813099 -3651841 -3661830 -3145291 -1869564 -52893 1020892
644 1650886 2230926 1417096 89879 -1481765 -1135629 326302 928636 489637 -1009818 -2526003
634 -2526003 -3474235 -3004897 -2099032 -2356006 -2986523 -1934776 -1221535 -1388118 173229 1945140
624A945140P68147K03674R698j267852o71586J105924J27388o13521L62283p43059
614A226236f05894p29281j8127J81537N43624A1010K00021P21477J308203n35721
604A704990b030253j247738a061096P4822k147409N53219e09436g6755G20104
594G94072a89307k13792I38024K504555l5701A249218i52705j036061L47343d14329
583H91154R15944n46101d55660l1980G3891J50163J078656J056387J60032p66605
573A752524q10447h61254j924765j410177p41465N26963a523517A539398F44155
563b159969o46870g43235B042361J599337j053264B94167a605943j784052k22655
554c612650a638918N62241r96550e87346D68964i70905p06485B85416K054017
$$ plain form
624 1945140 2713287 2916961 2926659 1658807 987221 2093145 2220533 1607012 1969295 1226236
614 1226236 -605894 -1335175 -1353302 -1171765 -628141 11010 211031 932508 2240711 1704990
604 1704990 -2030253 -3277991 -1061096 -986274 -3133683 -2580464 -509436 -76755 720104
594 794072 -189307 -403099 938024 3442579 3406878 1249218 -952705 -1988766 -1641423 -414329
583 891154 1807098 1260997 -455660 -487640 73891 224054 1302710 2359097 2519129 1752524
573 1752524 942077 -861254 -2786019 -4196196 -4937661 -4410698 -1523517 1539398 644155
563 -2159969 -2806839 -743235 2042361 3641698 2588434 294167 -1605943 -3389995 -3612650
554 -3612650 -1638918 -1076677 -2073227 -587346 468964 -970905 -1677390 285416 2339433
545B339433N44235p31972j042098b71826p54246c53466A173757Q44283D30838
535i93695h6863A237293m20114B46534b05778F021J070657P90881P71342N23152
525C162053j241873H10342l93650K59080K049362J302588A657543b118423j587568
516c705991a550941G71663K37446B52281M29943j88559a916051j215664a035990
506A602863n18752a037784j019195O38513B83167L41093a833268k105722J117604
497b821386c52945A864298N50524H98059b160488j237762J697613d76092q99181
488a375273m19438K78330m92149O65198O44481k089724k333438R68685P52247
479c401081q01570m21150o04922l02897J158950J834936K42356m6710g68497F54555
$$ plain form
545 2339433 2883668 2151696 1109598 -271826 -1026072 -353466 1173757 2018040 430838
535 -993695 -86863 1237293 817179 246534 -205778 6021 1076678 1867559 2638901 3162053
525 3162053 1920180 810342 416692 675772 2725134 4027722 1657543 -2118423 -3705991
516 -3705991 -1550941 771663 1009109 252281 682224 493665 -1916051 -3131715 -1035990
506 1602863 1084111 -1037784 -2056979 -1418466 283167 624260 -1833268 -3938990 -2821386
497 -2821386 -352945 1864298 2414822 898059 -2160488 -3398250 -1700637 -476092 -1375273
488 -1375273 -1794711 -1516381 -2008530 -1343332 -698851 -2788575 -5122013 -4153328 -3401081
479 -3401081 -4202651 -4623801 -5228723 -5531620 -4372670 -2537734 -2295378 -2342088 -768497 654555
468d8753r65913M66810l92336m04830i8073C70977i92811k413701k123107J519943
458d009676a013807K53056l265580j758861K284876h36005p49182j278112J74727
449b688572k02018j213514M19109n113L54363P87048M02225p94062j043537J229325
439b754746h39213p4782j584796k547135j220588j1492j889837j349882j22283
430i640008J55056J046359k863211k508400J518321j389006k419859m452636m049825
421b4603209m7086806j08526698q462017e1003801D0247438o375383r222512k578456
413B2071087n230117j114494k688138k718325j725552J044411M37481j114080
405H962273k4414j896038l000000D08474C9116J007921J831188J616332K029041
$$ plain form
468 -48753 -1014666 -547856 -940192 -1345022 -98073 370977 -992811 -3406512 -5529619 -4009676
458 -4009676 -1013807 -760751 -4026331 -5785192 -3500316 -836005 -1585187 -2863299 -2688572
449 -2688572 -2890590 -4104104 -3684995 -3690108 -3335745 -2548697 -2146472 -2940534 -3984071 -2754746
439 -2754746 -839213 -913995 -2498791 -5045926 -6266514 -6278006 -8167843 -9517725 -9640008
430 -9640008 -9484952 -8438593 -11301804 -13810204 -12291883 -13680889 -16100748 -20553384 -24603209
421 -24603209 -71690015 -180216713 -188678730 -51003801 40247438 33872055 24649543 22071087
413 22071087 16840970 15726476 13038338 10320013 8594461 9638872 10076353 8962273
405 8962273 8937859 7041821 4041821 408474 39116 1047037 2878225 4494557 6523598
396F523598k151958f78739k306519d2400C593490K065468j395785B112521m19727
387A692794Q3055G85827k55217j06991M67738N69110J324720J433349n56809A561177
376F59041O09471J255950Q90908j5981k49854q42528q47784J96069O73497M80826
366B809615q96026A73292R3882J209019O24278I07088C24790K025674K042935
357D393399m83653j257910r37407D72234g39784q05686n83441j59288e92611F03534
346c14503q53949K28563K1710r3369K67687a85088B73353g75637j599079P77133
336a597583A793056K308998j188696A228012l90550J10276k67773h25795k153808
327b979603P03512B08388L77998N84676J270799L15269k99406M41935k48756m53942
$$ plain form
396 6523598 4371640 -678739 -2985258 -42400 3593490 5658958 4263173 2112521 1692794
387 1692794 1775849 785827 530610 423619 891357 1460467 2785187 4218536 3661727 1561177
376 659041 1268512 2524462 3415370 3399389 3149535 2307007 1459223 1655292 2328789 2809615
366 2809615 1913589 173292 267174 1476193 2100471 907088 324790 2350464 4393399
357 4393399 3909746 2651836 1714429 472234 -739784 -1545470 -2128911 -2288199 -592611 603534
346 -314503 -1168452 -939889 -918179 -1011548 -743861 -185088 273353 -775637 -2374716 -1597583
336 -1597583 1793056 4102054 2913358 1228012 837462 947738 679965 -825795 -2979603
327 -2979603 -2276091 208388 586386 1171062 2441861 2757130 2457724 2899659 2650903 2196961
317B196961F62248a990699m89018g01510G42227J531950Q63212l69225O41449
308C409613O25225j385932C60200a99126A922881j72298d29118q01668N78829
299f51957G21296R64863j19611P82580O82339A465671a121239n64656F74755R32012
289A606767D03302f89442o06002J871M50971k6734c91094H03218h3771j092159
279a175930c79956H11411k4219C03083d55655F61735J848528j057273b001864
269d735789o97605N22682J582523J442354N85772b62682A417088M56469j28107
260A745450m0345o96279E9565M6352J06781f86668n74523J51866l65930j40115
250a615370M38004o7920j057246k86756J096268A23585J203621J370184L8964
$$ plain form
317 2196961 662248 -1990699 -2479717 -701510 742227 2274177 3137389 2768164 3409613
308 3409613 4034838 2648906 360200 -199126 1922881 1750583 -429118 -1230786 -651957
299 -651957 721296 1686159 1566548 2349128 3031467 1465671 -1121239 -1685895 674755 1606767
289 1606767 403302 -689442 -1295444 -1293573 -842602 -869336 -391094 803218 -83771 -1175930
279 -1175930 -379956 811411 787192 303083 -455655 661735 2510263 1452990 -2001864
269 -4735789 -5433394 -4910712 -3328189 -1885835 -1300063 -262682 1417088 1873557 1745450
260 1745450 1705105 1008826 59565 105917 212698 -686668 -1261191 -1109325 -1475255 -1615370
250 -1615370 -1177366 -1245286 -2302532 -2589288 -1493020 123585 1327206 2697390 2736354
241B736354n47350k12041D17287h92291a86101k51200j641104k26096M22596P21382
231a160523q44976g97031H43621R31693H58719a204462j002377J037383A49884
221a1610n28210A102835L062151p99308B13679a065602A29456b18994j299026
212a518020d31727A259617B92048e17965J79054l56716p19440m03643K00159B1938
201A420300D84689a795068m35306g62321A381183O42665F09896b51199H30463
191A027682d30478k767411k273346J164535a181416F98656o6963j30679f76526
181d347645k002418K303864J705984j17732Q84086c48858D54516K86703K81611
172A022830p4619L68002j19912a935574k989759Q69965e43490A346177B57881
$$ plain form
241 2736354 2189004 1976963 417287 -892291 -186101 -437301 -2078405 -2304501 -1881905 -1160523
231 -1160523 -2005499 -797031 843621 1775314 858719 -1204462 -2206839 -1169456 149884
221 -11610 -539820 1102835 4164986 3365678 213679 -1065602 129456 -218994 -1518020
212 -1518020 -431727 1259617 292048 -517965 -338911 -695627 -1415067 -1818710 -1618551 21938
201 1420300 484689 -1795068 -2230374 -762321 1381183 2023848 609896 -251199 830463
191 1027682 -430478 -3197889 -5471235 -4306700 -1181416 698656 631693 501014 -676526
181 -4347645 -6350063 -4046199 -2340215 -2457947 -1573861 -348858 454516 741219 1022830
172 1022830 948211 1316213 1196301 -1935574 -4925333 -4055368 -543490 1346177 257881
162a690352j16313c79021F85969i8756j322266p91731Q17535I99734L889718O26270
152E515722B207510d61860F48923K018301m98535f46737k098804h43373C005372
142C318917I72235e6247l84204N9975E72188O04382J97538m67166a861651k957051
132d818702J463961A167263K884716j149884a490221l743771J817319a16615l82408
123d99023l062255j832938N13215J995734g60140D3104e59424b07593H69443j37477
113G31966d88728N1969F88373J359087J695561n42433H22598f39049K68116D35682
102E04378a630184j178235e56530A018077B40483i01836d41353C76782c25561
92h94363d2066A53882a70701m64840e6632A246327M55552a27741m43036A757392
$$ plain form
162 -1690352 -1806665 -379021 685969 -98756 -1421022 -2212753 -1395218 999734 4889452 5515722
152 5515722 2207510 -461860 648923 2667224 2168689 -646737 -2745541 -843373 3005372
142 3318917 972235 -56247 -440451 -380476 572188 1176570 1374108 906942 -1861651 -4818702
132 -4818702 -3354741 1167263 4051979 2902095 -1490221 -5233992 -3416673 -116615 -499023
123 -499023 -3561278 -5394216 -4881001 -2885267 -760140 43104 -559424 -207593 869443 731966
113 731966 -488728 -436759 688373 2047460 3743021 3200588 822598 -639049 -370933 435682
102 504378 -1630184 -2808419 -556530 1018077 240483 -901836 -441353 376782 -325561
92 -894363 -42066 153882 -170701 -635541 -56632 1246327 1701879 -127741 -570777 1757392
81D394247l56767j531838b29150j455380h03197F21128C1892a056841b75884B052712
70C135701G95186a471850o63996Q27968N19021l71065m46843g1764F11778a007530
59b144924Q60034e14430n247o62382j803695k578700K61842a747976G60854N72468
49A333322D77540f64232i3817F03938g0068F7290J037881J62835N21688P76923
39B566617j213204e97265o51930d72180Q7308j973054j616346a746469A598577
29B620195F70900f61687p58547j784735l75168a295246E82345K63704O61435M83853
19A991337q65655B03926p8006K86700b77993j915650O07729A150260n49523a061172
8B03560J410425o65362k02167J193934l978r11574N20787Q52117
$$ plain form
81 4394247 4037480 2505642 -229150 -1684530 -803197 621128 31892 -1056841 -275884 2052712
70 3135701 795186 -1471850 -2135846 -1307878 -788857 -1159922 -1606765 -71764 611778 -1007530
59 -2144924 -1284890 -514430 -519677 -1182059 -2985754 -5564454 -5302612 -1747976 760854 1333322
49 1333322 477540 -664232 -93817 603938 -70068 67290 1105171 1268006 1789694 2566617
39 2566617 1353413 -597265 -1249195 -472180 -384872 -2357926 -3974272 -1746469 1598577
29 2620195 670900 -661687 -1420234 -3204969 -3580137 -1295246 582345 846049 1507484 1991337
19 1991337 1125682 203926 125920 412620 -277993 -2193643 -1585914 1150260 600737 -1061172
8 203560 1613985 948623 746456 1940390 1936412 1024838 1545625 2397742
0B397742
$$ plain form
0 2397742
##PAGE= F1=2934.625888655
##FIRST=     18110.137220953, 5591.54909048506, 587692
##DATA TABLE= (F2++(Y..Y)), PROFILE
1023E87692c4669k9145B4960Q02318J143150n5556n11013D96476h8378F46966
1012I28231D02597B5222a997101m36545A167085L679994j083362j32342k31032
1003C400343G25134i18374L30812m6000K18494E45403a25063j682310J52412d86665
992h8728D42642Q90353E86061c36816M2268a39775o52268j149992j862446n54103
982d358584Q20644J265342d48779F43098J52768d1166o00726l31931r59349J05027
972a828145g90680k125845k315048K142266a078425K00882c91136o93918j028075
963b113129a99276o01135j378693g01656A074735m43953j83314J374255J171885
954B993608m96029H07973e76861l29487J91415b18908B63158d30919j290064m16838
$$ plain form
1023 587692 -34669 -63814 24960 827278 1970428 1914872 1403859 496476 -88378 646966
1012 928231 402597 25222 -1997101 -2433646 1167085 4847079 3763717 3631375 3400343
1003 3400343 725134 -918374 -587562 -633562 -415068 545403 -125063 -1807373 -1654961 -486665
992 -88728 442642 1332995 586061 -336816 -294548 -139775 -792043 -1942035 -3804481 -4358584
982 -4358584 -3537940 -2272598 -448779 643098 795866 -41166 -641892 -973823 -1933172 -1828145
972 -1828145 -790680 -2916525 -5231573 -3089307 -1078425 -877543 -391136 -1085054 -2113129
963 -2113129 -199276 -800411 -2179104 -701656 1074735 630782 447468 1821723 2993608
954 2993608 2497579 807973 -576861 -906348 -714933 -218908 263158 -430919 -1720983 -2137821
944b137821g61552D00236e32793j548738f38989A326436o2088a35748j277007
935a412755J39377B63629J217715J261511K47608j097950r21324k34467j82400
926E54322i52285m32424a12720H61692N55476J441356M50727G68006a211290e45178
915A196369K190058m07564I70883b3169m95630p14646o1119K38426c66572A167747
904F35586g91619C67195K320033p73827A73808A4300O09248B10830f84250k69193
894i53443m61531k67394D6015M69550e63264a40538A568004L32904A82441b212121
883b358106e52770A190377J145761P63626m41925q17393G1380a406737N27515
874h79222k9270k149A914675K625644R29761J638925j40521l075747A320632e5083
$$ plain form
944 -2137821 -761552 400236 -532793 -2081531 -638989 1326436 1264348 -135748 -1412755
935 -1412755 -1273378 263629 1481344 2742855 2990463 1892513 971189 736722 554322
926 554322 -952285 -1384709 -112720 861692 1417168 2858524 3309251 768006 -1211290 -545178
915 1196369 3386427 2978863 970883 -23169 -518799 -1233445 -1294564 -1056138 -366572 1167747
904 635586 -791619 367195 2687228 1913401 173808 14300 623548 210830 -684250 -953443
894 -953443 -1414974 -1682368 46015 515565 -563264 -140538 1568004 1900908 182441 -2212121
883 -2358106 -552770 1190377 2336138 3099764 2657839 1840446 71380 -1406737 -879222
874 -879222 -908492 -910641 1914675 4540319 5470080 7109005 6968484 3892737 1320632 -55083
863h56481A167355L141984L71901B067338a428148j647427N4674k48394O52933
854b616362b00729A276304A63972a130517j233212a041171B473311R86322j631824
845A827809c43148j594583J98360d81505O5982P9052m89231r64529O45046A658930
834B995149H91407a642646m87244J74888P34129i6379A210961J62931g75007k6657
824h01664A782754J7701a99136C34365Q00748h66574j206610d68641H53336N63436
814A416772R3175c60471j987083n96280J91413J180530b06038A9264c62333E50303
803A894652j21082Q38553J542432n14459j386427j42197o72487h52448p88725
794a641173a42976H45684k94149M64996e20783j193852A09783K187289l93883
$$ plain form
863 -856481 1167355 4309339 4681240 2067338 -1428148 -3075575 -3020901 -3269295 -2616362
854 -2616362 -200729 1276304 163972 -1130517 -2363729 -1041171 2473311 3459633 1827809
845 1827809 -343148 -1937731 -1739371 -481505 -415523 -336471 -825702 -1790231 -1145185 1658930
834 2995149 891407 -1642646 -2129890 -1955002 -1220873 -96379 1210961 1373892 -775007 -801664
824 -801664 1782754 1800455 -199136 334365 1135113 -866574 -2073184 -468641 853336 1416772
814 1416772 1509947 -360471 -2347554 -2943834 -2752421 -1571891 -206038 19264 -362333 550303
803 1894652 1773570 2612123 4154555 3640096 2253669 2111472 1438985 -852448 -1641173
794 -1641173 -142976 845684 551535 1016531 -520783 -1714635 109783 2297072 1903189
785A903189f1000m18803A197953j78520B74805c98268q13952j083319j483013
776c778552q78505J908187f17862F886b45026Q9847I27551l92195a254585j63435
766a418020M47149m99018O21616E00419K41736B52835f38819j180946J34639D34228
755A164664f36850j440640J32665N40487M77694G58087K802364k51958A158782
745C89251c56822l82382c16349q53537k158689R61141A741307J790005A124194
735i32408n85447o3752g42516b42875l28891m4067r7036j607409n52665R60444
725a912499g68245L1205m42620N26007G17115R78721m39785Q4923J23925B42328
714b08825A097832R16724L8847l65714E03341h97117n71285a21897A311762O28644
$$ plain form
785 1903189 -61000 -479803 1197953 1019433 274805 -398268 -1212220 -2295539 -3778552
776 -3778552 -4657057 -2748870 -617862 6886 -245026 -155179 927551 535356 -1254585 -1418020
766 -1418020 -970871 -1469889 -848273 500419 742155 252835 -638819 -1819765 -1685126 434228
755 1164664 -636850 -2077490 -1944825 -1404338 -926644 758087 3560451 3308493 1158782
745 389251 -356822 -739204 -316349 -1169886 -3328575 -2367434 1741307 3531312 1124194
735 -932408 -1517855 -1581607 -742516 -242875 -571766 -615833 -712869 -2320278 -2872943 -1912499
725 -1912499 -768245 -737040 -1179660 -653653 717115 1695836 1256051 1340974 1464899 242328
714 -208825 1097832 2014556 2053403 1687689 503341 -897117 -1468402 -121897 1311762 1940406
704A940406n90992j37559J453830N02105A224435E21951N0486a442972n11108
695a954080E59712J885739l15374k57959K70910A029420a361379j714705M64730
686b611354K09227O22309r2417j519693Q70105A009010K089445K116226R25427
677F140108k054567A406334b55140l12680A584164K472589N23382j792663H85543
667F70463R4167h65662j502444k06516N56983g22156A150603R77047m85536c52225
656b465853q20011a285467A046970D6470b361416j420358O5797P84670J437889
647a493418I914J128090O38693q9450F94650F7275a116086k92923K06371N73379
637f29259D05657g11650k093654j059227R96143J385209m1608j155747L15178
$$ plain form
704 1940406 1349414 1211855 2665685 3167790 1224435 521951 572437 -1442972 -1954080
695 -1954080 559712 2445451 2130077 1872118 2143028 1029420 -1361379 -3076084 -2611354
686 -2611354 -2402127 -1779818 -1872235 -3391928 -2521823 1009010 3098455 5214681 6140108
677 6140108 4085541 1406334 -255140 -567820 1584164 4056753 4580135 2787472 885543
667 670463 764630 -865662 -2368106 -2574622 -2017639 -722156 1150603 2127650 1642114 -352225
656 -2465853 -3285864 -1285467 1046970 46470 -2361416 -3781774 -3715977 -2931307 -1493418
647 -1493418 9914 1138004 1776697 1687247 694650 67275 -1116086 -1409009 -1202638 -629259
637 -629259 405657 -711650 -2805304 -3864531 -2868388 -1483179 -1524787 -2680534 -2365356
628b365356R46663j97977g33306A004024J371008N73752J17370j202192I04045
618A935830K27487r34959J96097l84586c61684o21727Q7292K58113i8560E00341
607D19966K3524J801338M68098c95622j714650e56744N893j702809a123913D20586
596b43166q1791P6225m61023K86783A236966K304166k91541A478261H2261g63429
585a344461K79883G23904K386568N8832E37129e40354b02498A19385J231182Q71906
575B222473j85815A007988A24125a168326j653483r45366k52355M94830a019617
565A687167H00790a561207n05073c17596A745613R10772n52045q26588a15276
555b427609j015103J320221P25565o60156f34360D2241a365694m76340a33619
$$ plain form
628 -2365356 -1418693 -1616670 -733306 1004024 2375032 2948784 3066154 1863962 904045
618 1935830 2163317 1228358 1424455 1039869 -361684 -983411 -896119 -638006 -98560 500341
607 419966 443490 2244828 2712926 -395622 -2110272 -556744 -550851 -2253660 -1123913 420586
596 -243166 -324957 -248732 -709755 -422972 1236966 3541132 3249591 1478261 82261 -763429
585 -1344461 -1064578 723904 3110472 3169304 537129 -540354 -202498 119385 1350567 2222473
575 2222473 2036658 1007988 124125 -1168326 -2821809 -3767175 -4019530 -3524700 -1019617
565 1687167 800790 -1561207 -2066280 -317596 1745613 2656385 2104340 1277752 -115276
555 -2427609 -3442712 -2122491 -1396926 -2057082 -634360 42241 -1365694 -1842034 -133619
545A995108J223120m05593H41754i95954J106F0148J108043Q45395H84323d05943
534B30855Q50649B73591c82208j84248b16757H52482P61073P30675J218609l33653
524C229186A607709c3763m12891A823884J953634A806505a849861j457172a545815
514D69761N85279l24901j70816B08315a432739p00649G2298L219444L11871G39116
503a152469L41447G08299K53376g88175j719661N87867d0537A966000K94363G45169
492a629465n49497f66560B3376a466726q45949J26642L05416h034I86192a364135
481c329504J053366N50595j171140o82818l75268Q7802Q75751J261762q009p36820
471b474283R43698F36643Q55369k55987j82307D6160h12445c9241G58298a52646
$$ plain form
545 1995108 3218228 2812635 841754 -995954 -994848 60148 1168191 2013586 884323 -405943
534 230855 1081504 273591 -382208 -566456 -216757 852482 1613555 2344230 3562839 3229186
524 3229186 1607709 -33763 -446654 1823884 3777518 1806505 -1849861 -3307033 -1545815
514 469761 1055040 730139 559323 208315 -1432739 -2133388 72298 3291742 3603613 739116
503 -1152469 -811022 708299 961675 -788175 -2507836 -1919969 -40537 1966000 2260363 745169
492 -1629465 -2178962 -666560 23376 -1466726 -2312675 -2186033 -1880617 -8034 986192 -1364135
481 -3329504 -2276138 -1725543 -2896683 -3579501 -3954769 -3866967 -2991216 -1729454 -1737463 -2474283
471 -2474283 -1530585 636643 1492012 1236025 1053718 46160 -812445 -39241 758298 -152646
460b700337j857532J999772G89631L75442a845728j573393a287167A110508d33906
450b243335N70771g44879q18690q3619r09194J29617P96171O57690R8778m45966
440a320092N66679A094445J046834F21835b693725j363210J050199n69172j294630
431d870538l97655J684728J739618j786052j476560O33188l353308j683160O12597
422h897142K084945j3599358l7370511k080035a2288821A8580948l871901k474047
414A2235000q9805q39921l88059k733112j314299q39004R21959L669454K916738
405A3538951k811253B055424A40555a051127j2820c46287E52760M26711J075850
396B055321G88367c146908k221228K546517B049155L284731j409207A481834n60446
$$ plain form
460 -2700337 -4557869 -2558097 789631 1165073 -1845728 -3419121 -1287167 1110508 -433906
450 -2243335 -1672564 -744879 -1563569 -1647188 -2556382 -2426765 -1630594 -972904 -874126 -1320092
440 -1320092 -753413 1094445 2141279 621835 -2693725 -4056935 -3006736 -3575908 -4870538
431 -4870538 -5268193 -3583465 -1843847 -3629899 -5106459 -4473271 -7826579 -9509739 -8897142
422 -8897142 -6812197 -20411555 -57782066 -59862101 -12288821 18580948 14709047 12235000
414 12235000 12145195 11305274 10917215 8184103 6869804 6030800 6952759 10622213 13538951
405 13538951 10727698 2055424 140555 -1051127 -1063947 -346287 552760 979471 2055321
396 2055321 788367 -3146908 -5368136 -2821619 2049155 5333886 3924679 1481834 921388
387I21388B42962a035819L13837b40808M2114l21154E04418K117313J17848A001389
376c08898a9252I83916O17658L84824K89704l94257l25546Q71768L34691n74119
366B188639o97602E86468k47901O51969K09374e03809n62684A271315J941099
357C212414l55204j027778B36565a126104K07751K62662r72944j281804a264341
347B17921e96713p05759K92190L09080J34070k89643M15764C07208a266202k291857
337c558059J127558I10801K146290q81832E04110f36650j0001J34762j516227
328b028116j880308J093382c08703C70200M70265J148525P47421l45961q5505
319B304945m24783J07328q69224a075745r36577J000397a58081A429311J444072
$$ plain form
387 921388 242962 -1035819 -721982 -240808 -198694 -519848 504418 2621731 2739579 1001389
376 -308898 -19252 983916 1601574 1986398 2276102 1881845 1556299 2428067 2762758 2188639
366 2188639 1491037 586468 338567 990536 1199910 -503809 -1066493 1271315 3212414
357 3212414 2857210 1829432 236565 -1126104 -918353 -655691 -1628635 -2910439 -1264341
347 217921 -596713 -1302472 -1010282 -701202 -567132 -856775 -441011 307208 -1266202 -3558059
337 -3558059 -2430501 910801 3057091 2175259 504110 -636650 -646651 -511889 -2028116
328 -2028116 -3908424 -2815042 -308703 370200 840465 1988990 2736411 2390450 2304945
319 2304945 1880162 1987490 1118266 -1075745 -2012322 -1011925 -158081 1429311 2873383
310B873383q166k03638j06242l24560A065646I9620J097008l11073h19691n52976
300a372667e74509A430135J589079k78032P99328O22665A665353a553409N1318
291a502091A079571N48740G99716B57915a064821m84931N32318K39773b50364
281F82324e07208j024572c18593A069241L32541k06748C77447R47144K002223
272C326814r14855a115368k876339j177506m41764Q63219K321183f19284C54275
262A230186P83190M96769k84374A075002b19533k65932j7083q5109K15900m16943
252g88700q30364k56678O66766K28888p83381o49935J043373B52313J161800J389146
242B803259J55518r7526l87671a8272j176374G40487j6711a385832l50024N89652
$$ plain form
310 2873383 2865217 2661579 2555337 2230777 1065646 99620 1196628 885555 -819691 -1372667
300 -1372667 -574509 1430135 3019214 2741182 3540510 4163175 1665353 -1553409 -1502091
291 -1502091 1079571 1628311 799716 257915 -1064821 -1549752 -1017434 -777661 -250364
281 682324 -507208 -1531780 -318593 1069241 1401782 1195034 377447 1324591 3326814
272 3326814 2411959 -1115368 -3991707 -5169213 -5610977 -4747758 -2426575 -619284 354275
262 1230186 2013376 2510145 2225771 1075002 -219533 -485465 -502548 -587657 -371757 -788700
252 -788700 -1619064 -1875742 -1208976 -980088 -1763469 -2413404 -1370031 252313 1414113 2803259
242 2803259 2958777 2861251 2473580 -18272 -1194646 740487 723776 -1385832 -1735856 -1146204
232a146204L0454j25727a90369C67151K18431j99366c79637n11932e9206G21304
221a42310p38095I31033K850358j075021f86110j660067h77032J11041j025608
212a791599e0399A954992G14261f89652k8641o15874q38482M17946O58625b08805
201F54501i0179k078008L26287C84725J829823K08730A141150B32905M33342B50807
190a079440j816340j175054J677663F5702J766647O1814j91412B16018c770080
180e796953K253016a734654m19228L29349P83120d16022E7616K35595b31807E04598
169A696035h56927l561994N00534d51026I62073F3876a216732o24964g76954I02551
158G99197f83992j530090K13850E29026M615482J533353B740658h77833b44087
$$ plain form
232 -1146204 -1115750 -1241477 -190369 367151 585582 386216 -379637 -891569 -59206 721304
221 -142310 -880405 931033 3781391 2706370 -686110 -2346177 -877032 -765991 -1791599
212 -1791599 -50399 1954992 714261 -689652 -718293 -1334167 -2172649 -1754703 -1096078 -208805
201 654501 -90179 -2168187 -1841900 384725 2214548 2423278 1141150 232905 666247 250807
190 -1079440 -2895780 -4070834 -2393171 65702 1832349 1894163 1702751 216018 -3770080
180 -5796953 -3543937 -1734654 -2153882 -1824533 -1041413 -416022 57616 293211 -231807 504598
169 1696035 -856927 -4418921 -3918387 -451026 962073 63876 -1216732 -1841696 -776954 902551
158 799197 -683992 -2214082 -2000232 529026 5144508 6677861 2740658 -877833 -244087
148A943312N2623c81339k075511a131209B149916O09994A186895D99031c29980
138e84853E79388P29324l95027k48818d98049k496457o8098A1643L145145k72072
128B884716a111585l599557K270535A170137m93513b802963k339923N60179b287795
118A93057P47436d612B20033Q88769E08240g74875B23650J674435O7798Q40822
108B806705n5649H35450f00003f9074E76512a38864k442006j404235J971578B27020
97B7335a305244f28931G62854b5274q59478c79241m18944l64549K86697e4947
86F73594k90530a427446k34696E23669K753420N43993r07270B59521a150662a02452
75A454468F46301i15519J99489A457434J270731H65121h15357n07443O00262K45328
$$ plain form
148 1943312 1995935 -381339 -2456850 -1131209 2149916 2759910 1186895 499031 -329980
138 -584853 579388 1308712 913685 664867 -498049 -2994506 -3062604 11643 3156788 2884716
128 2884716 -1111585 -4711142 -2440607 1170137 676624 -2802963 -5142886 -4582707 -2287795
118 193057 940493 -4612 220033 1108802 508240 -774875 223650 1898085 1965883 2806705
108 2806705 2751056 835450 -600003 -69074 576512 -138864 -2580870 -3985105 -2013527 227020
97 27335 -1305244 -628931 762854 -25274 -884752 -379241 -798185 -1162734 -876037 -54947
86 673594 383064 -1427446 -1662142 523669 3277089 3821082 2913812 259521 -1150662 -102452
75 1454468 646301 -915519 -716030 1457434 2728165 865121 -815357 -1322800 -722538 -477210
65d77210l83553k29142I4014c03824j747501j42226h31860l6168l4248k4033j527887
54b454196k944011k80931b331867D14311J367869n4620F63587J02359M67609D32835
43c1090A027179L65727M86825R60625r85299g08384j798049J71662N10708j319510
33c143573j701260b296011B420927K149581A849241a045879j251714r39373j92586
24c429552J131275f90736D02649J784032J055119j330044C45245I5278K03114
15B98392c08571j721713J01762E04214K6209f03650F37159J158217H58011m06363
5D51648J240792r6095p18840Q07679O34065
0B319249
$$ plain form
65 -477210 -860763 -1089905 94014 -303824 -2051325 -2193551 -831860 -868028 -902276 -926309 -2454196
54 -2454196 -5398207 -5679138 -2331867 414311 1782180 1727560 663587 765946 1233555 432835
43 -31090 1027179 1392906 1879731 2840356 1855057 -708384 -2506433 -2334771 -1824063 -3143573
33 -3143573 -4844833 -2296011 2420927 4570508 1849241 -1045879 -2297593 -3236966 -3429552
24 -3429552 -2298277 -690736 402649 2186681 3241800 1911756 345245 95278 298392
15 298392 -308571 -2030284 -1928522 504214 530423 -603650 637159 1795376 858011 451648
5 451648 1692440 1596345 877505 1685184 2319249
0 2319249
##PAGE= F1=2913.008351145
##FIRST=     18110.137220953, 5591.54909048506, -55694
##DATA TABLE= (F2++(Y..Y)), PROFILE
1023e5694n16876O1249K24761E07225Q97280R2925l45428E50229L04370J120936
1013A975535L6426q38214a6807k979011o06181I57122M648797l30144n41349q71168
1003C863258F55199h40082L60461n4533a44314D48557a80796j048528M59969K89853
993d79502k64165g8058A572390p6643a88804p83499c47182A03034a513776j979049
983c492825p59133K56674N86357J571713f06586h9876m11781O1126l2480j090675
973a563686r8960M09136k502278k330239K227191a647540N71833h4939A3359e09546
962A268117B74597a474448O31410C31777b66423j74823F98358J510970J95287
953B404615I00919h25016l98485N58137B41672N59646e7049k176946j299998J284847
$$ plain form
1023 -55694 -572570 -511321 -286560 507225 1404505 1497430 1152002 550229 854599 1975535
1013 1975535 2011961 1173747 -16807 -2995818 -3601999 957122 5605919 5275775 4734426 3863258
1003 3863258 655199 -840082 -479621 -534154 -144314 448557 -180796 -1229324 -769355 -479502
993 -479502 -743667 -78058 1572390 1495747 -188804 -972303 -347182 103034 -1513776 -3492825
983 -3492825 -4251958 -3995284 -3408927 -1837214 -606586 -89876 -501657 -440531 -473011 -1563686
973 -1563686 -1662646 -1253510 -3755788 -6086027 -3858836 -1647540 -1075707 -84939 13359 -509546
962 1268117 274597 -1474448 -843038 331777 -266423 -441246 698358 2209328 2404615
953 2404615 900919 -825016 -1223501 -665364 241672 801318 -57049 -2233995 -3533993 -2249146
943b249146g31194p63114j408069a187602A611088K28556E36617A16078R53074
934A069152R46381j94242O40750K45886o74200k83653l42061m08381e32750n89442
924a122192B48881J262792N20010J023083L1053A83914a889937P74241E59536
914B545776K83902A074556f78389l87102m13294K20943M47170b16021I03924C15721
903f11113A038078J746475A308353b19804A36704Q49684l48647e37623o06115
894a143738r04314q46823a377126c15123l70438b22541A424383O74463C44998
884b351270q53b17750A302756O02581L50689j08198N7724j038905e42221j53087
874f95308J63545J3768A879724K048279O99666J770193l38092k949000A060263
$$ plain form
943 -2249146 -731194 -1494308 -2902377 -1187602 1611088 1839644 536617 116078 1069152
934 1069152 2015533 1821291 2462041 2707927 2033727 1750074 1408013 999632 -532750 -1122192
924 -1122192 248881 1511673 2031683 3054766 3085819 183914 -1889937 -1115696 559536
914 2545776 2829678 1074556 -678389 -1065491 -1478785 -1257842 -810672 -216021 903924 315721
903 -611113 1038078 2784553 1308353 -219804 136704 986388 637741 -537623 -1143738
894 -1143738 -2048052 -2894875 -1377126 -315123 -685561 -222541 1424383 2098846 344998
884 -2351270 -2352123 -217750 1302756 1905337 2256026 2147828 2205552 1166647 -542221 -695308
874 -695308 -531763 -517995 1879724 3928003 4627669 6397862 6059770 3110770 1060263
864A83947g96434H79932L320985O61919A819326a972455j168757P83455j82156
855b539913L73141B22644J456875C07825a325372j037663i50859B247504J093599
846C341103q76485H41568a218747p34162P28849K83553d61442m30776o26222e03144
835B126156J195088A501400a187045q93070K13848e73042A027898L06240C00479
825a388752c68263B415989k8318H8235K1885Q12466a414634j831758a523818E64347
814A165312m87492a402689j343074J81880P88153c29771E20086o749j6286J247622
804A744673J051016l80278P41030J568955j581764I12608K95131L34962h1678
794i96039b47765E56303M30403O83168A40946a671767e16613A823652k79517a132983
$$ plain form
864 183947 -796434 879932 4200917 4862836 1819326 -1972455 -3141212 -2357757 -2539913
855 -2539913 -2166772 222644 1679519 307825 -1325372 -2363035 -950859 2247504 3341103
846 3341103 2464618 841568 -1218747 -1952909 -1224060 -940507 -461442 -892218 -1518440 -503144
835 2126156 3321244 1501400 -1187045 -2080115 -1866267 -573042 1027898 1334138 300479
825 -1388752 -368263 2415989 2387671 88235 110120 922586 -1414634 -3246392 -1523818 564347
814 1165312 677820 -1402689 -2745763 -2563883 -1775730 -329771 520086 513337 497051 1744673
804 1744673 2795689 2415411 3156441 4725396 3143632 912608 1207739 1542701 -81678
794 -996039 -247765 556303 986706 1669874 140946 -1671767 -516613 1823652 1544135 -1132983
783b136012c08426a47330o48506k14157p0464q33621j770632j048973K102001
774b631682A97430J510601L60105n00800j38913A57559a932864k06549O07308
765a532105j22402f47757A351712J19992c0589j931695j431668J11823f16411
755F60045a080524j057949P81675M95320c55298A362580K317751r89285D28195
745c70769m99198L6333a07994j454509k847869Q69492A093831J993777A377005
735D1823e46430o60650K26216J07379o1005K98573g9158j140477j112866K17321
725b115180i05446b07463m04571k16305J82162H8372P03897P06224K97180H03384
714a34890B40027N67406N25485k02223D75110a126413j060235R34743C24416J125314
$$ plain form
783 -2136012 -308426 -147330 -795836 -1009993 -1080457 -1914078 -3684710 -4733683 -2631682
774 -2631682 197430 1708031 2068136 1567336 1428423 157559 -1932864 -2139413 -1532105
765 -1532105 -1654507 -647757 1351712 1471704 -30589 -1962284 -3393952 -3282129 -616411
755 660045 -1080524 -2138473 -1356798 -861478 -355298 1362580 3680331 2691046 428195
745 -370769 -869967 -833634 -107994 -1562503 -4410372 -3540880 1093831 3087608 1377005
735 41823 -546430 -1207080 -980864 -873485 -934490 -635917 -79158 -1219635 -2332501 -2115180
725 -2115180 -905446 -207463 -612034 -828339 -646177 88372 792269 1498493 1795673 803384
714 -134890 240027 807433 1332918 1130695 475110 -1126413 -2186648 -1251905 324416 1449730
704A449730n27413J56165J982081N50840A263941n32423K20897a362972r00173
695b263145a75125A745617j17301J17795L96610j020660g61005r36449N88003
686a109451m45652j77843j34859j199666R55287I80294K165340K600449Q02028
677F548111k645764A056232f04028o00306G83426L143604L91750B038146C28620
667D39930L85941d11764j443600p07278J29747i57354A158207Q20316n53867d66837
656b282840p59994a417196B48959h98429j741522n56194J07105O25704a126520
646A40305J141512O49632o79047a36583j96529l90223p03055q94910O50255E79246
635b74385k224780o73546J161701f82992J45211j423121n15788J042139L1330
$$ plain form
704 1449730 922317 1078482 3060563 3611403 1263941 731518 952415 -1362972 -2263145
695 -2263145 -175125 1745617 1628316 1746111 2142721 1122061 -761005 -1697454 -1109451
686 -1109451 -1555103 -1732946 -1867805 -3067471 -2112184 980294 3145634 5746083 6548111
677 6548111 3902347 1056232 -604028 -1204334 783426 3927030 4318780 2038146 328620
667 439930 825871 -411764 -1855364 -2562642 -2432895 -957354 1158207 1978523 1424656 -466837
656 -2282840 -3042834 -1417196 248959 -898429 -2639951 -3196145 -3089040 -2463336 -1126520
646 140305 1281817 1931449 1252402 -136583 -333112 -723335 -1426390 -2321300 -1671045 579246
635 -274385 -2499165 -3172711 -2011010 -682992 -537781 -1960902 -2476690 -1434551 -1403221
626a403221J58685A86698J822934Q12687N3087r10459I30730O51033O1260E56244
615G20634m7049a93571l93805n4633J55435B90572P67276m08174A74781K061881
605B236662J259859A161867e95765B24170j03907h12036I76587N11213c58318
595a342481K88557M77628F3697J368408J808764l82926j128313n62986B83416
585a243835n11005D80508L667886Q76407A929456b8592r7973A66730J107691M67929
575A742350l67423F11345C3714a000056j455915n72980K29610N01771d31023A863863
564A173885g37485m62148i6887H32572K89838M57099O82420q60828a072477j808021
554b880498K52366P75747j91263i27110L78225r84144k27535e08326A457932J684848
$$ plain form
626 -1403221 -1244536 186698 2009632 2822319 2875406 1964947 930730 1581763 1643023 556244
615 720634 673585 -193571 -587376 -642009 -486574 290572 1057848 649674 174781 2236662
605 2236662 3496521 1161867 -595765 224170 120263 -812036 976587 1487800 -358318
595 -1342481 -1053924 -576296 63697 1432105 3240869 2857943 1729630 1166644 283416
585 -1243835 -1754840 480508 4148394 5024801 1929456 -28592 -126565 166730 1274421 1742350
575 1742350 1374927 611345 33714 -1000056 -2455971 -3028951 -2799341 -2297570 -431023 1863863
564 1173885 -737485 -1199633 -96887 832572 1122410 1579509 2261929 1401101 -1072477 -2880498
554 -2880498 -2628132 -1852385 -2043648 -927110 -548885 -1533029 -1760564 -508326 1457932 3142780
544C142780j46824D12671a642981h07494F45375L77097K76589E03801b46241B03675
533C33154d39635j22324J42424O6773C60367N99158O98582J825892N15217j999026
523B000190g23236r50495F47620K536225j294863a326352j291636J289820h2421
513B88437J85517I2133a80697m94064J08679A349550L248650J073664B527328
503A24116h0002E61056j37193a08767r09530n5894E591J716137J38146E37036
492a087361l019A56123L1911a785745j191489j39158Q93246G57928J503512A14072
481a367217e30452a42962j305753j167792k36517N92995O62823N37544k97578
472a357240j225289L39790C40861K192259M69287o11761H88291c15702O7737B97873
$$ plain form
544 3142780 2995956 412671 -1642981 -807494 645375 1022472 1299061 503801 -246241 203675
533 333154 -439635 -561959 -419535 -352762 360367 959525 1658107 3483999 3999216 2000190
523 2000190 -723236 -1673731 647620 3183845 1888982 -1326352 -2617988 -1328168 -82421
513 288437 473954 92133 -180697 -674761 -566082 1349550 4598200 5671864 2527328
503 124116 -80002 561056 423863 -108767 -1018297 -1074191 5591 1721728 1859874 537036
492 -1087361 -1090380 156123 188034 -1785745 -2977234 -3116392 -2223146 757928 2261440 114072
481 -1367217 -530452 -142962 -1448715 -2616507 -2853024 -2260029 -1597206 -1059662 -1357240
472 -1357240 -2582529 -2242739 340861 2533120 3002407 2390646 888291 -315702 -247965 297873
461b04498k160093j054837a261177A773806N32614B48457h54386E95576J423456
452B019032A31978a829109Q29773H73281k49500d11661j199732J88652M19458
443a003283M44939B45137L21700Q604J270676J654115j291316a519417j319292
434b838709a068130M34835j253526j23130F86901J204714H99281B07255a228315
424d711135n39345b338079C203337L79027b908914l26474B977819K034421A951812
414A702977J130577K115234O42793k343003m45336o17144K55422Q981093Q972912
405B0395525o617638a406974j446236a026131k85706f32353J76879n22953o4502
396a042929m91548k535859j731361K376219B154470L392634j465606A580764p67646
$$ plain form
461 -204498 -2364591 -3419428 -1261177 1773806 2306420 248457 -854386 595576 2019032
452 2019032 131978 -1829109 -999336 873281 623781 -411661 -1611393 -1422741 -1003283
443 -1003283 -558344 245137 566837 575441 1846117 3500232 2208916 -1519417 -2838709
434 -2838709 -1068130 -633295 -1886821 -2009951 686901 1891615 899281 207255 -1228315
424 -4711135 -5250480 -2338079 3203337 3582364 -2908914 -3235388 2977819 5012240 1951812
414 1702977 2833554 4948788 5591581 3248578 2803242 2186098 2441520 11422613 20395525
405 20395525 13777887 -1406974 -2853210 -1026131 -1311837 -632353 -455474 -978427 -1042929
396 -1042929 -1534477 -4070336 -5801697 -3425478 2154470 5547104 4081498 1580764 813118
387H13118d09909j162803O73340M32757n89805r84385i42363A751082O62329I48673
376g54061k88992L46922c02367G51568Q44245j72678K1086J313620P1555j389371
366A440025m01686J66313n67623B41896a19382j556743j28978D91713J636872
357B128585k31011p34814f22968j229234h04021d9382j125397j656367a281781
347A56336d97164m50773K56648c09462a15509r81984K43480B06560a359092k518598
337c877690J133129A95923J721468o86002c20827j551187J09822O02206j448704
328b608690j572074J144996i04968A23883O23709J069360J047697n24890n33175
319A806584l34057O63922l70158G9968a012059K84633P8254F28329J647360K15044
$$ plain form
387 813118 -409909 -1572712 -899372 -466615 -1056420 -2040805 -942363 1751082 2413411 948673
376 -754061 -1043053 -696131 -302367 751568 1595813 1423135 1444221 2757841 2829396 1440025
366 1440025 1038339 1204652 637029 241896 -119382 -1676125 -1805103 491713 2128585
357 2128585 1897574 1162760 -622968 -1852202 -804021 -49382 -1174779 -2831146 -1281781
347 156336 -497164 -947937 -691289 -309462 -115509 -1097493 -854013 206560 -1359092 -3877690
337 -3877690 -2744561 195923 1917391 1231389 -320827 -1872014 -1762192 -1159986 -2608690
328 -2608690 -4180764 -3035768 -904968 123883 747592 1816952 2864649 2339759 1806584
319 1806584 1472527 2136449 1766291 79968 -1012059 -727426 -649172 628329 2275689 2490733
309B490733j033645F69953Q60051J54439B92861n7020d5686j100339k48427c71505
298B026480K023337o92668M82807N95893A633140a557715O52730A237663K3214
289A260877j38445R3295g98752j081554O92539N72831f0820D37588h88760p26115
279a614875a44649A039683M23807K79266n46134O45382J903732p49588b96944
269b999839j300240j041620j06179K603091a09570F82447J87289J138780J011876
260C020392m42847A081234d23649n64472j46671d85058E72307b29506j168052
251a397558k57874h23990b34208l12423q32598b98823H73232L02285Q29123M97868
241B502508P85519k33166g4789j186257A197152J93973g34530m30225L92149p56935
$$ plain form
309 2490733 1457088 669953 1530004 1684443 292861 235841 -45686 -1146025 -1394452 -371505
298 2026480 4049817 3357149 3839956 4435849 1633140 -1557715 -904985 1237663 1260877
289 1260877 1122432 1215727 -798752 -1880306 -1187767 -614936 -60820 437588 -888760 -1614875
279 -1614875 -144649 1039683 1463490 1742756 1196622 1842004 3745736 2996148 -296944
269 -2999839 -4300079 -5341699 -5447878 -2844787 -109570 682447 869736 2008516 3020392
260 3020392 2577545 1081234 -423649 -988121 -1134792 -485058 572307 -229506 -1397558
251 -1397558 -1655432 -823990 -234208 -546631 -1379229 -298823 873232 1175517 2004640 2502508
241 2502508 3288027 3054861 -74789 -1261046 1197152 1391125 -734530 -1164755 -772606 -1529541
231a529541d08907G87240B49742e54736K18713A63630R4879P14274K48175b68915
220i19539H67734J985910A391175a874695j766140J707520O05178o08297E15362
210C023046A371434h54479j82616l76115p32089Q59894O30921n5132c20470m04412
200g24882j697011R31974A149531J307680k72372q62954n26402k68088f30060
190a781479o63183N07864A30214J555492R57170j26957l97652D15943c186504
180d799265J856396a366289l84048M48182N18394l03838L83310a695m53208I9531
169A579688a99009l423849L11559c70696E52328F023f30004r89530P92792A236572
158A635913C7093b008716n24174c24981D106899K246267B676001i45672P4335
$$ plain form
231 -1529541 -408907 787240 249742 -554736 -336023 163630 258509 972783 1220958 -268915
220 -919539 867734 2853644 1391175 -1874695 -3640835 -1933315 -1328137 -1936434 515362
210 3023046 1371434 -854479 -1037095 -1413210 -2145299 -1285405 -654484 -709616 -320470 -724882
200 -724882 -2421893 -1489919 1149531 2457211 2184839 1321885 795483 527395 -630060
190 -1781479 -2444662 -1936798 130214 1685706 2642876 2515919 2118267 415943 -3186504
180 -4799265 -2942869 -1366289 -1750337 -1302155 -783761 -1087599 -704289 -1695 -454903 99531
169 1579688 -199009 -3622858 -3311299 -370696 552328 6023 -630004 -1619534 -826742 1236572
158 1635913 37093 -2008716 -2532890 -324981 4106899 6353166 2676001 -945672 -871337
149h71337H84469N03426a88964j750591O12418A170841J013813p96285n54958
140H33411b19397n54575D32439R15901C51203E1812M74648a144812j301195a116492
129A729602O04150f36245k962926a209449B290423m48127a615627k594901L74405
120c836123a730632F48150P48531F33294K98055K42673f1879j260198C35355J820082
110B155437j001140R6513P49791I49116d64902A00237O95543c07810k484371j621988
100d414169J371480e61569a87119j374994P04545I32649C00750h19892j15769
91i35661q88636j45010Q96118c39420M1927j013816j721810p1600a117662A847942
80C300496l19623G51021b47580I72179J460943r64268e13911m77122G58262J170307
$$ plain form
149 -871337 884469 1387895 -188964 -1939555 -1327137 1170841 2184654 1388369 833411
140 833411 -219397 -773972 432439 1348340 351203 51812 526460 -1144812 -2446007 -1116492
129 1729602 2333752 -636245 -3599171 -1209449 2290423 1842296 -1615627 -4210528 -3836123
120 -3836123 -1730632 648150 1396681 633294 931349 1174022 -61879 -1322077 335355 2155437
110 2155437 1154297 1250810 2000601 949116 -464902 100237 795780 -307810 -2792181 -4414169
100 -4414169 -3042689 -561569 -187119 -1562113 -857568 932649 300750 -819892 -935661
91 -935661 -1824297 -1969307 -1073189 -339420 -297493 -1311309 -3033119 -3104719 -1117662 1847942
80 3300496 2980873 751021 -247580 972179 2433122 1468854 -513911 -991033 758262 1928569
70A928569E57043b95015N7255B94864K11469A40004a82651A37980a164065j328092
60b492157Q71327d44957r71190q3569N29577r33293k529948n72661K484410A55022
49B368403P78418j061477m51868L17126r61093e7478A103894N58441J21370R17122
39B700827m67524f56650l099287k97255J694671m51031k055973K162076B913285
29E939220B706248a257471j493170j30205l813K29695a302037B21653K434473
20B656126J368727j550600C54539a33062E5177b45385j242657k57149d91D20746
9b15876F52650O47369B39486a13096A197998j48563n14684Q58480L36918
0A730149
$$ plain form
70 1928569 557043 -295015 -237760 294864 506333 140004 -182651 137980 -1164065 -2492157
60 -2492157 -1620830 -444957 -1416147 -1499716 -970139 -1903432 -4433380 -5006041 -2521631 155022
49 2368403 3146821 2085344 1633476 1950602 989509 -57478 1103894 1662335 1783705 2700827
39 2700827 2233303 -656650 -3755937 -4053192 -2358521 -2809552 -4865525 -2703449 2913285
29 5939220 2706248 -1257471 -2750641 -2880846 -2884659 -2654964 -1302037 221653 2656126
20 2656126 4024853 2474253 354539 -133062 55177 -245385 -1488042 -1745191 -491 420746
9 -215876 652650 1300019 239486 -113096 1197998 1049435 534751 1393231 1730149
0 1730149
##PAGE= F1=2891.390813634
##FIRST=     18110.137220953, 5591.54909048506, -714442
##DATA TABLE= (F2++(Y..Y)), PROFILE
1023g14442l05085P4088M05491C16372N23680J36021k147k85394O91832Q81229
1013B261593R193o45497b04847l530006m39151D86890M040491L62967k54440q14456
1003C821452D81910a026247M56215J84591A03123j4427e77028j95071f7175o76773
993g43948q76863d60036A924022L35015a75122j506182d73370I91161i16436j647991
983b564427q20179l03661j79106J138251J183527N37487l149b95903J41124j228935
973a383714l79703k50024k300327j839210J932823b060832R55118B69291P93584
964A062875J87417J114277p66966A73396c79416k73417q45765N0771d26026A195765
953A969226H96955h43696m74856e51565E76240N19094G8486b431324j605817J208133
$$ plain form
1023 -714442 -1019527 -945439 -539948 316372 840052 976073 973926 688532 1380364 2261593
1013 2261593 2270786 1625289 -204847 -3734853 -4174004 486890 4527381 4890348 4635908 3821452
1003 3821452 481910 -1026247 -570032 -385441 103123 88696 -577028 -772099 -67175 -743948
993 -743948 -1620811 -460036 1924022 2259037 -175122 -1681304 -473370 991161 -916436 -2564427
983 -2564427 -3384606 -3688267 -3867373 -2729122 -1545595 -1008108 -1011257 -295903 -154779 -1383714
973 -1383714 -1763417 -2013441 -4313768 -6152978 -4220155 -2060832 -1105714 269291 1062875
964 1062875 1250292 2364569 1597603 173396 -379416 -652833 -1498598 -1447827 -426026 1195765
953 1969226 896955 -843696 -1318552 -551565 576240 1095334 78486 -2431324 -4037141 -2829008
943b829008a396054q10094j042812a573498A653886L02081E85769J77983J622000
934B385752M86222j114728M1320K81593j70396L82220n20884H19093f64137j99678
924h63815G54417J127310L87748O31602n40213f09691j860278O93780f65315I05900
913B215831p58102d27332m42435k63579K08334K32674J36749B83352a13367m49792
903e63159A259666Q95436B08398g50589C12038J072092k18937a30662o69574j121986
893a922222j269546P92621R40033J11809e39061A222313J007734E45501b085181
883b030391B3735J185590J34814j13036o3556R18758j67242d4357j153765L52670
873h45452b82075A617675J119308j1849J540103n6547B061520G50686B06923i93344
$$ plain form
943 -2829008 -1396054 -2206148 -3248960 -1573498 1653886 1955967 585769 763752 2385752
934 2385752 2871974 1757246 1798566 2080159 1909763 2291983 1771099 819093 -664137 -863815
924 -863815 754417 1881727 2269475 2901077 2360864 -609691 -2469969 -1776189 -665315 905900
913 2215831 1457729 -427332 -869767 -1133346 -925012 -692338 -555589 283352 -113367 -563159
903 -563159 1259666 2155102 208398 -750589 312038 1384130 1165193 -130662 -800236 -1922222
893 -1922222 -3191768 -2399147 -1459114 -1347305 -539061 1222313 2230047 545501 -2085181
883 -2030391 23735 1209325 1344139 1231103 1167547 2086305 1919063 -44357 -1198122 -845452
873 -845452 -282075 1617675 2736983 2725134 4265237 4208690 2061520 750686 206923 -993344
862A05869L035695P97319I29674b385988m00833J353129j58445l4820C56373J321916
852A678289C30903a397626m32197c41948A998161J004851o4664j102583e84212
842b149019K45616P47932a00015m32440n83370A69155K421237R25435j563824
833A952003e77827j154457K1224b93021A567024l71402i41442j199751b93147
823B649283j1784A80580b63841E37857a915027k345164J758242B56215P04508
814I60723I6889a901327p93343O16775i15804F79323L67118m4191P60832J333187
804C096269L984q38824P94412J466858k256798c29721C94708J063633E37143b72098
793b13778f7403D63849O20920B65566a514055M02121A022667P0901a851124j555556
$$ plain form
862 105869 3141564 3938883 929674 -2385988 -2786821 -1433692 -1592137 -1626957 356373 1678289
852 1678289 330903 -1397626 -1829823 -341948 1998161 3003012 2938348 1835765 -584212
842 -2149019 -1903403 -1155471 -100015 -532455 -1115825 169155 2590392 3515827 1952003
833 1952003 -577827 -1732284 -1711060 -293021 1567024 1195622 -941442 -2141193 -293147
823 2649283 2637499 180580 -263841 537857 -1915027 -4260191 -2501949 256215 960723
814 960723 96889 -1901327 -2694670 -2077895 -915804 679323 1046441 1002250 1763082 3096269
804 3096269 3100253 2261429 3055841 4522699 2265901 -329721 394708 1458341 537143 -272098
793 -213778 -67403 463849 1084769 265566 -1514055 -1111934 1022667 1093568 -1851124 -3406680
783c406680a699814M97949o42217J40890P92775l79745j933239r83551a888042
$$ plain form
783 -3406680 -1699814 -1201865 -1844082 -1703192 -910417 -1290162 -3223401 -4206952 -1888042
$$ [...]
##END NTUPLES=nD NMR SPECTRUM
##END=
