##TITLE=XTC-z189_3
##JCAMPDX= 6.0         $$ Bruker NMR JCAMP-DX V2.0
##DATA TYPE= nD NMR SPECTRUM
##DATA CLASS= NTUPLES
##NUM DIM= 2
##ORIGIN= BRUKER
##OWNER= patiny
$$ 1.79 TOPSPIN		Version 3.0
$$ 2012-05-21 05:09:28.164 +0200  patiny@icmbsg005
$$ Compression mode = diff/dup
##.OBSERVE FREQUENCY= 400.131594543151
##.OBSERVE NUCLEUS= ^1H
##.ACQUISITION MODE= SIMULTANEOUS (DQD)
##.ACQUISITION SCHEME= NOT PHASE SENSITIVE
##.AVERAGES= 2
##.DIGITISER RES= 23
##SPECTROMETER/DATA SYSTEM= spect
##.PULSE SEQUENCE= cosygpppqf
##.SOLVENT NAME= D2O
##.SHIFT REFERENCE= INTERNAL, D2O, 1, 7.256251
##AUDIT TRAIL= $$ (NUMBER, WHEN, WHO, WHERE, PROCESS, VERSION, WHAT)
$$ ##TITLE= Audit trail, TOPSPIN		Version 3.0
$$ ##JCAMPDX= 5.01
$$ ##ORIGIN= Bruker BioSpin GmbH
$$ ##OWNER= patiny
$$ $$ /opt/data/patiny/nmr/XTC-z189_3/12/pdata/1/auditp.txt
$$ ##AUDIT TRAIL=  $$ (NUMBER, WHEN, WHO, WHERE, PROCESS, VERSION, WHAT)
(   1,<2012-05-21 05:09:26.067 +0200>,<patiny>,<icmbsg005>,<go>,<TOPSPIN 3.0>,
      <created by zg
	started at 2012-05-21 04:49:38.110 +0200,
	POWCHK enabled, PULCHK disabled,
       configuration hash MD5:
       77 C7 B7 C4 10 F4 BA 30 64 2E BB 52 82 F2 DA 41
       data hash MD5: 2K * 256
       CA 5F B4 BD 07 CD A2 A2 CC 42 0A 47 8D 15 E1 25>)
(   2,<2012-05-21 05:09:26.127 +0200>,<patiny>,<icmbsg005>,<audit>,<TOPSPIN 3.0>,
      <user comment:
       ICON-NMR User ID: patiny
       data hash MD5: 2K * 256
       CA 5F B4 BD 07 CD A2 A2 CC 42 0A 47 8D 15 E1 25>)
(   3,<2012-05-21 05:09:26.793 +0200>,<patiny>,<icmbsg005>,<proc2d>,<TOPSPIN 3.0>,
      <Start of raw data processing
       xfb same F2: SI = 1K WDW = 4 SSB = 0 FT_mod = 6 PKNL = 1 F1: SI = 1K ME_mod = 2 NCOEF = 32 WDW = 4 SSB = 0 FT_mod = 6 PH_mod = 2
       data hash MD5: 1K * 1K
       FF 19 7F F6 CC 8B B3 31 46 50 11 86 C2 A3 0F D6>)
(   4,<2012-05-21 05:09:28.015 +0200>,<patiny>,<icmbsg005>,<proc2d>,<TOPSPIN 3.0>,
      <abs2 F2: ABSG = 5 ABSF1 = 7.256251 ABSF2 = 0.7138745
       data hash MD5: 1K * 1K
       E1 1A 08 A4 E1 7F CA 0F A6 E3 AE 9B 02 A2 B0 79>)
(   5,<2012-05-21 05:09:28.107 +0200>,<patiny>,<icmbsg005>,<proc2d>,<TOPSPIN 3.0>,
      <abs1 F1: ABSG = 5 ABSF1 = 7.256251 ABSF2 = 0.7138745
       data hash MD5: 1K * 1K
       30 91 79 42 35 88 9B 6A 84 AE 5E 95 C5 CB 98 1A>)
(   6,<2012-05-21 05:09:28.144 +0200>,<patiny>,<icmbsg005>,<proc2d>,<TOPSPIN 3.0>,
      <sym
       data hash MD5: 1K * 1K
       B8 97 89 84 28 3E BA F7 53 01 1E 67 21 F2 5D F9>)
$$ ##END=
$$ 
$$ $$ hash MD5
$$ $$ 5F 1D 0A D7 0E 07 BE 96 89 78 26 C4 BA 54 EA DB
##$RELAX= 
##$RELAX= 
##$RELAX= 
##$RELAX= 
##$RELAX= 
##$RELAX= 
##$RELAX= 
##$RELAX= 
##$RELAX= 
$$ Bruker specific parameters
$$ --------------------------
##$DATPATH= </opt/data/patiny/nmr>
##$EXPNO= 12
##$NAME= <XTC-z189_3>
##$PROCNO= 1
##$ACQT0= 1000000
##$AMP= (0..31)
100 100 100 100 100 100 100 100 100 100 100 100 100 100 100 100 100 100
100 100 100 100 100 100 100 100 100 100 100 100 100 100
##$ANAVPT= -1
##$AQSEQ= 0
##$AQ_mod= 3
$$ [...]
##$PYNMP= <proc.py>
##$REVERSE= no
##$SF= 400.13
##$SI= 1024
##$SIGF1= 7.256251
##$SIGF2= 0.7138745
##$SINO= 0
##$SIOLD= 1024
##$SPECTYP= <>
##$SREGLST= <1H.MeOD>
##$SSB= 0
##$STSI= 1024
##$STSR= 0
##$SW_p= 2617.80104712042
##$SYMM= 1
##$S_DEV= 3511
##$TDeff= 2048
##$TDoff= 0
##$TI= <>
##$TILT= no
##$TM1= 0
##$TM2= 0
##$TOPLEV= 100
##$USERP1= <>
##$USERP2= <>
##$USERP3= <>
##$USERP4= <>
##$USERP5= <>
##$WDW= 4
##$XDIM= 1024
##$YMAX_p= 302665102
##$YMIN_p= 0
##$CURPLOT= <Cups-PDF>
##$CURPRIN= <$Cups-PDF>
##$DFORMAT= <normdp>
##$LAYOUT= <+/2D_hom.xwp>
##$LFORMAT= <normlp>
##$PFORMAT= <normpl>
$$ Bruker specific parameters for F1
$$ ---------------------------------
##$ACQT0= 0
##$BF1= 400.13
##$FnMODE= 1
##$NUC1= <1H>
##$O1= 1594.54315053512
##$SFO1= 400.131594543151
##$SW= 6.54235027381251
##$SW_h= 2617.80104712042
##$TD= 256
##$ABSF1= 7.256251
##$ABSF2= 0.7138745
##$ABSG= 5
##$ABSL= 0
##$ALPHA= 0
##$AQORDER= 0
##$ASSFAC= 0
##$ASSFACI= 0
##$ASSFACX= 0
##$ASSWID= 0
##$AUNMP= <>
##$AXLEFT= 0
##$AXNAME= <F1>
##$AXNUC= <1H>
##$AXRIGHT= 0
##$AXTYPE= 0
##$AXUNIT= <>
##$AZFE= 0.1
##$AZFW= 0.5
##$BCFW= 0
##$BC_mod= 0
##$BYTORDP= 0
##$COROFFS= 0
##$CY= 15
##$DATMOD= 1
##$DC= 0
##$DFILT= <>
##$DTYPP= 0
##$ERETIC= no
##$F1P= 0
##$F2P= 0
##$FCOR= 0.5
##$FTSIZE= 1024
##$FT_mod= 6
##$GAMMA= 0
##$GB= 0
##$INTBC= 1
##$INTSCL= 1
##$ISEN= 128
##$LB= 0
##$LEV0= 0
##$LPBIN= 512
##$MAXI= 10000
##$MC2= 0
##$MEAN= 0
##$ME_mod= 2
##$MI= 0
##$NCOEF= 32
##$NC_proc= -4
##$NLEV= 6
##$NOISF1= 0
##$NOISF2= 0
##$NSP= 0
##$NTH_PI= 0
##$NZP= 0
##$OFFSET= 7.256251
##$PC= 4
##$PHC0= 0
##$PHC1= 0
##$PH_mod= 2
##$PKNL= no
##$PPARMOD= 1
##$PPDIAG= 0
##$PPIPTYP= 0
##$PPMPNUM= 2147483647
##$PPRESOL= 1
##$PSCAL= 1
##$PSIGN= 0
##$PYNMP= <proc.py>
##$REVERSE= no
##$SF= 400.13
##$SI= 1024
##$SIGF1= 7.256251
##$SIGF2= 0.7138745
##$SINO= 0
##$SIOLD= 1024
##$SPECTYP= <>
##$SREGLST= <>
##$SSB= 0
##$STSI= 1024
##$STSR= 0
##$SW_p= 2617.80104712042
##$SYMM= 1
##$S_DEV= 3511
##$TDeff= 512
##$TDoff= 0
##$TI= <>
##$TILT= no
##$TM1= 0
##$TM2= 0
##$TOPLEV= 0
##$USERP1= <>
##$USERP2= <>
##$USERP3= <>
##$USERP4= <>
##$USERP5= <>
##$WDW= 4
##$XDIM= 128
##$YMAX_p= 302665102
##$YMIN_p= 0
$$ End of Bruker specific parameters
$$ ---------------------------------
##NTUPLES= nD NMR SPECTRUM
##VAR_NAME=  FREQUENCY1,    FREQUENCY2,      SPECTRUM
##SYMBOL=    F1,            F2,              Y
##.NUCLEUS=  1H,            1H
##VAR_TYPE=  INDEPENDENT,   INDEPENDENT,     DEPENDENT
##VAR_FORM=  AFFN,          AFFN,            ASDF
##VAR_DIM=   1024,          1024,            1024
##UNITS=     HZ,            HZ,              ARBITRARY UNITS
##FACTOR=    2.55644633507854, 2.55644633507854, 1
##FIRST=     2903.44365593433, 2615.24460078534, 21289
##LAST=      288.199055148992, 0,            18106
##MIN=       288.199055148992, 0,            0
##MAX=       2903.44365593433, 2615.24460078534, 302665102
##PAGE= F1=2903.443655934
##FIRST=     2903.44365593433, 2615.24460078534, 21289
##DATA TABLE= (F2++(Y..Y)), PROFILE
$$ [...]
##PAGE= F1=1898.760246249
##FIRST=     2903.44365593433, 2615.24460078534, -3483
##DATA TABLE= (F2++(Y..Y)), PROFILE
822e440b280h6D265j900b548k92o67b48m345J297b1A284E59d803n27k63J576L72
804c645j026j557Q28J195K21N75a019l267e90j460A22i14k74j683A068M480A690
786d247a512F37Q74E92c681G6K28a55H84J618B04b385O43C815j720F52F8d428
767f66k15M14C78M61c531J460n05A35J280n30h01m53j391j530j855j045L051a196
748G46h14j185c61j567j303q09l99n78n95J51P35N65j96r85j596M55J205O92K95
729d291J23J83r33J720J071d81A512i41k552h57m415N9E399k114I81a298k116
712c414j786j731R76K053J090C72J547b697J347p73j148P21l225a421n62j572
696c555j509j182m03J288J130n12c69r60G93N30e89k515j357J361a140j586l153
$$ plain form
822 -5440 -2280 -86 4265 2365 -2548 -2840 -3507 -248 -4593 -3296 -21 1284 559 -4803 -5330 -5593 -4017 -3645
804 -3645 -4671 -6228 -5400 -4205 -3984 -3409 -1019 -4286 -590 -2050 122 -914 -1188 -2871 1068 5548 1690
786 -4247 -1512 637 1511 592 -3681 76 304 -155 884 2502 204 -2385 -1742 3815 2095 652 68 -4428
767 -666 -881 -467 378 839 -3531 -2071 -2576 135 1415 885 -801 -1254 -2645 -4175 -6030 -7075 -4024 -1196
748 746 -814 -1999 -361 -1928 -3231 -4040 -4439 -5017 -5612 -5461 -4726 -4161 -4357 -5342 -6938 -6483 -5278 -4586 -4291
729 -4291 -4168 -3985 -4918 -3198 -2127 -481 1512 -941 -3493 -857 -5272 -5213 5399 3285 981 -1298 -3414
712 -3414 -5200 -6931 -5955 -3902 -2812 372 1919 -2697 -1350 -2123 -3271 -2550 -5775 -1421 -1983 -3555
696 -3555 -5064 -6246 -6649 -5361 -4231 -4743 -369 -1329 793 1323 -589 -3104 -4461 -3100 -1140 -2726 -5879
679e879K222H92c498N1M01Q29B232n42a29k518j267a091K95j116m013K292m67
662d100m69l48J87L31J50l21q97r33J44Q53J353J128Q18M70m99R0k06N6q27N26
642b494j275j851j117K158J978J189N4q75j437j119O28a862j036R80P96B5725
625G6402N8008L4265r970a346F868A409h26A055a282k660e29C064o85K842f19
609A662f461l68B191d25l982j490A028j69c165A629K32k67L63J500J694c66F794
591E568k167G11b261k881j071K203J972e56K63m83r01j403g11J61A010l51c92
573a077d59q170b147j846D579m26j206I41a340j764j076P33P11l21E90J938b972
555e561J026I4a137B01a458D642A241c124o58l0J399j54J049K7j108l265J355
$$ plain form
679 -5879 -3657 892 -3498 -3447 -3046 -2217 2232 1690 -129 -2647 -3914 -1091 -796 -1912 -5925 -3633 -4100
662 -4100 -4569 -4917 -4730 -4399 -4249 -4570 -5467 -6400 -6256 -5403 -4050 -2922 -2104 -1634 -2133 -2043 -2249 -2193 -3020 -2494
642 -2494 -3769 -5620 -6737 -4579 -2601 -1412 -1358 -2233 -3670 -4789 -4161 -1862 -2898 -1918 -1122 25725
625 76402 134410 168675 158705 -1346 6868 1409 -826 1055 -1282 -3942 -529 3064 2379 5221 -619
609 1662 -6461 -6829 2191 -425 -4407 -5897 1028 859 -3165 1629 1861 1594 1957 3457 5151 -366 6794
591 5568 3401 711 -2261 -5142 -6213 -4010 -2038 -556 -293 -776 -1677 -3080 -711 -550 1010 659 -392
573 -1077 -459 -8629 -2147 -3993 4579 4153 2947 941 -1340 -3104 -4180 -3447 -2736 -3057 590 2528 -2972
555 -5561 -4535 94 -1137 201 -1458 4642 1241 -3124 -3782 -3812 -2413 -2567 -1518 -1491 -2599 -5864 -4509
538d509a692N68L79l154h81L54k812B876A118b828j066J239J8q0j510O4J523j194
520c834h70K46k762L48a108k620j098b323l87a275l261A386C91f92b83l355A179
502B587a761j548j304J481a39j441B294a087A0898j928k32k441B780a690l946
487e636j150K260J046J210k338J974G09Ka303j988N16J097J55B126F24a685l272
470d957A463L710K501j117B651e064j577K499k18q53M12b237j118j826g71G05
453B672b093m457a372C958G65e534J876J637A59b66o93j823A444a25l384f89C125
435E549j365c275l320J308D036P69k288d529f47B49c250k91a089j657k846a394
418b198r75R71j470A353l14c585a714l76k31k55n80q17j035L70N17L80l08r30
$$ plain form
538 -4509 -1692 -1124 -745 -3899 -881 -527 -3339 2876 1118 -2828 -3894 -2655 -2637 -2717 -4227 -4163 -2640 -3834
520 -3834 -870 -624 -3386 -3038 -1108 -3728 -4826 -2323 -2710 -1275 -4536 1386 391 -692 -283 -3638 1179
502 2587 -1761 -3309 -4613 -3132 -139 -1580 2294 -1087 10898 8970 8738 6297 2780 -1690 -5636
487 -5636 -6786 -4526 -3480 -2270 -4608 -2634 709 711 -1303 -3291 -2775 -1678 -1523 2126 624 -1685 -4957
470 -4957 1463 5173 7674 6557 2651 -5064 -6641 -4142 -4360 -5213 -4801 -2237 -3355 -5181 -771 705
453 2672 -2093 -6550 -1372 3958 765 -5534 -3658 -2021 159 -266 -959 -2782 1444 -125 -3509 -689 3125
435 5549 4184 -3275 -6595 -5287 4036 4805 2517 -4529 -647 249 -3250 -3541 -1089 -2746 -5592 -1394
418 -2198 -3173 -2202 -3672 1353 1039 -3585 -1714 -2090 -2321 -2576 -3156 -3973 -5008 -4638 -4121 -3741 -4049 -4979
400d979j020r28m78M56M73O37N82N03J91l0l70k99J35P96J56J629Q00Q15c41h1
379H13P59j50e138a205j823K43R3k569j543K393a121r73p64l572e37m53n66p91
361b347e79k960a089B304k21J030o64h46k300H5J131a416k589A976I27M8b342
343b325n34M5j293a944l223J706k07E77R20a029j364Q36g66B184b40j420k089
326c749j751j309L81Q20n7n99M4J888K108e50D13A02a929k330l29j414pR74p00
307e735b113f77A14K95f8q50k760O52r02j128j094p94L23J211J607J815b45A311
288b161F69a02o07k395n74q11J609R63j271Q06k335j028b648K93D596J658F06
270d489a084A135a077J53j125B106j56I31e600b322A235J207c269l39d38H81d07
$$ plain form
400 -4979 -5999 -6927 -7405 -6949 -6476 -5839 -5257 -4754 -4563 -4593 -4963 -5262 -5127 -4331 -4175 -2546 -1746 -931 -341 -81
379 813 1572 1422 -5138 -1205 -3028 -2785 -2692 -5261 -6804 -4411 -1121 -2094 -2858 -6430 -537 -990 -1556 -2347
361 -2347 -579 -3539 -1089 2304 2083 3113 2449 -846 -3146 85 1216 -1416 -4005 1976 927 975 -2342
343 -2325 -2859 -2814 -4107 -1944 -5167 -3461 -3668 577 1497 -1029 -2393 -1557 -766 2184 -240 -1660 -3749
326 -3749 -5500 -6809 -6428 -5608 -5665 -6264 -6220 -4332 -2224 -550 413 102 -1929 -4259 -4588 -6002 -6009 -5035 -5735
307 -5735 -2113 -677 114 409 -68 -918 -3678 -3026 -3928 -5056 -6150 -6944 -6621 -5410 -3803 -1988 -245 1311
288 -2161 669 -102 -709 -3104 -3678 -4489 -2880 -1917 -3188 -2382 -4717 -5745 -2648 -2355 4596 6254 606
270 -4489 -1084 1135 -1077 -924 -2049 2106 1950 931 -5600 -2322 1235 2442 -3269 -3608 -438 881 -407
252a486j368k149j555P78J847a931b06A044K38d238c56j809k021j625N9J783J897
235b072j809f87I83a071M72n89j067j285j10j260F1b26k501k963j505J752J670
218c773M35l39j08P69J084L51k474g53k157j196J982r18N06a11A542N80b260D11
199A587e73l110a525C184LA492a049l761j589b548J119C62J371N512k488a645
182D631j587P61c636e69m979C007J721b511D71c60j796k946g20m351c05j110C219
164E010B253a98A006L279j505d78l245k87k025b958B0J746K333J798B317b399
147b324K4o57j149J161A05L402j751a4l568r95P66j782j633l16J733J812J850
130b147d48k854F76c25k303k859k258J295J482R12M09M6m6r7k37m44l35l89o13
$$ plain form
252 -1486 -2854 -5003 -6558 -5780 -3933 -1931 -206 1044 1282 -4238 -356 -2165 -4186 -5811 -5752 -3969 -2072
235 -2072 -3881 -687 983 -1071 -599 -1188 -2255 -3540 -3650 -4910 61 -226 -2727 -5690 -7195 -5443 -3773
218 -3773 -3338 -3677 -3785 -3016 -1932 -1581 -4055 -753 -2910 -4106 -2124 -3042 -2536 -111 1542 2122 -2260 411
199 1587 -573 -3683 -1525 3184 3187 1492 -1049 -4810 -6399 -2548 -1429 362 1733 7245 4757 -1645
182 4631 3044 3805 -3636 -569 -5548 3007 4728 -2511 471 -360 -2156 -5102 -720 -5071 -305 -1415 3219
164 5010 2253 -198 1006 4285 2780 -478 -3723 -4010 -6035 -2958 20 1766 4099 5897 2317 -2399
147 -2324 -2300 -2957 -4106 -2945 105 3507 1756 -14 -3582 -4577 -3811 -5593 -7226 -7542 -5809 -3997 -2147
130 -2147 -448 -3302 676 -325 -2628 -5487 -7745 -6450 -4968 -4056 -3647 -3601 -3647 -3744 -3981 -4425 -4760 -5149 -5762
111e762p74J441K470l88M26k355b209k904b024k058a074l249B153i58k883j402
95e243k73J889j782b381J135L85q44A612K799p03a648f73B248o57G06b54n59F53
76C88i82k573k538J496a321A885K366b578n6k374g6l421j804R71l12Q67r00m28
58e103N40j192J373J180A314N03b8p186A282E92a93k32m577B10O49b498q74e24
39A249J063D76a706P94N5l05e35B61a597k596k131a660p72P0j166a704m39l29
21b472P71e2A207A93b652L50l508J354d72r31n07j87a17C469A608a481k116R48
3b649j537j44L84
0c946
$$ plain form
111 -5762 -6536 -5095 -2625 -3013 -2587 -4942 -2209 -5113 -2024 -4082 -1074 -4323 2153 -958 -3841 -5243
95 -5243 -5516 -3627 -5409 -2381 -1246 -861 -1705 1612 4411 3708 -1648 -673 2248 1591 706 -254 -813 653
76 388 -982 -3555 -6093 -4597 -1321 1885 4251 -2578 -2634 -5008 -76 -3497 -5301 -4330 -4642 -3775 -4675 -5103
58 -5103 -4563 -5755 -4382 -3202 1314 1817 -28 -7214 1282 592 -193 -425 -5002 210 859 -2498 -3372 -524
39 1249 2312 476 -1706 -912 -857 -1162 -535 261 -1597 -4193 -6324 -1660 -2432 -2362 -3528 -1704 -2143 -2472
21 -2472 -1701 -52 1207 193 -2652 -2302 -5810 -4456 -472 -1403 -1910 -2097 -117 3469 1608 -1481 -3597 -2649
3 -2649 -4186 -4330 -3946
0 -3946
##PAGE= F1=1896.203799913
##FIRST=     2903.44365593433, 2615.24460078534, -4545
##DATA TABLE= (F2++(Y..Y)), PROFILE
1023d545k98J43J084P43M90m70l72J521F44a545B310m25p66ej202j233j132q99
1005d471m12l4L43O67Q93L0a162L94j141J18j658j841j072K268J970J049j387
988b462F62c057j059k351K006b076j01e12J29k163P62j609J20E9i31B29J855J082
970C166N39L43D93c488I76K508a38q37q77A338a975f43I317j009B392M31c47j488
952a835m499J910J024j72n60P27N51j606a574o06k37O90k89k45r88l40i60L38
934f22j469k029a524n24b73C59f2p58L70o94E12K536R3F45c34k508a291C842K69
915D111j362c1l205l022k48M54k25O04K058a744j437A60f14k880A17P77K25L439
897D558A913K366J821d455B252a540L72q64l06p18A645J9C92e653J312j38a438
$$ plain form
1023 -4545 -4843 -4700 -3616 -2873 -2383 -2853 -3225 -1704 644 -1545 2310 1885 1119 -5 -1207 -2440 -3572 -4471
1005 -4471 -4883 -4917 -4574 -3907 -3014 -2984 -1162 -768 -1909 -1791 -3449 -5290 -6362 -4094 -2124 -1075 -2462
988 -2462 662 -3057 -4116 -6467 -4461 -2076 -2177 -512 -383 -2546 -1784 -3393 -3273 59 -931 229 2084 3166
970 3166 3705 4048 493 -3488 976 3484 -138 -975 -1852 1338 -1975 -643 9317 8308 2392 2823 -347 -1835
952 -1835 -6334 -4424 -3400 -3572 -4132 -3405 -2854 -4460 -1574 -2180 -2417 -1727 -2016 -2261 -3249 -3589 -960 -622
934 -622 -2091 -4120 -1524 -2048 -273 359 -62 -820 -450 -1144 512 3048 3141 645 -334 -2842 -1291 3842 4111
915 4111 2749 -31 -3236 -6258 -6506 -6052 -6277 -5673 -3615 -1744 -3181 160 -614 -3494 117 894 1119 4558
897 4558 1913 4279 6100 -4455 2252 -1540 -1168 -2032 -2338 -3056 1645 1664 392 -5653 -4341 -4479 -1438
879a738k267k648q94J822J748J392a242h0A047Q17a18l28A920l11P35P12i13l25
861a238j632d00I94c088j651J3r33b796p30k106k263K584K633a074j281N2p74
844c077k700q68K697P96m0B6f5m54a97j298j982P71r32N65a505C311Q02K06A788
824B755A193d483b009a90B372m91b545K40n13A493d34k491k086M29K001l905g28
806a044m19L2l09k405N59J295D32K963J087b228g82a34C30C9g42l20B552i60k846
787c806j193L07L37l21n38l99j74J53M58J209J349a139c82j129A605m43B45g62
768e241K532K87J088c65A18c039o91A33J474K222j186a385C235c08k119B066a021
750e113J39d70q23K40B787c47L6M0j094l026J665j351j207P08J826J352j582Q23
$$ plain form
879 -1738 -4005 -6653 -7547 -5725 -3977 -2585 -1242 -80 1047 1864 -118 -446 1920 1609 2344 3056 -913 -1238
861 -1238 -2870 -400 994 -3088 -4739 -4726 -5659 -2796 -3526 -5632 -7895 -5311 -2678 -1074 -2355 -2303 -3077
844 -3077 -5777 -6645 -3948 -3152 -3192 26 -65 -519 -197 -1495 -3477 -2706 -3638 -3073 -1505 3311 4113 4319 1788
824 2755 1193 -4483 -2009 -190 2372 1881 -2545 -2305 -2818 1493 -434 -2925 -5011 -4582 -2581 -6486 -728
806 -1044 -1463 -1431 -1740 -4145 -3586 -2291 432 3395 4482 -2228 -782 -134 330 39 -742 -1062 2552 -960 -3806
787 -3806 -4999 -4692 -4355 -4676 -5214 -5613 -5787 -5634 -5176 -3967 -2618 -1139 -382 -1511 1605 1162 245 -762
768 -5241 -2709 -2422 -1334 -365 118 -3039 -3730 133 1607 3829 2643 -1385 3235 -308 -2427 2066 -1021
750 -5113 -4974 -470 -1293 -1053 2787 -347 -311 -271 -1365 -4391 -2726 -4077 -5284 -4576 -2750 -1398 -2980 -2157
732b157j615j317J02J126J113k241b061j58n81r33o78j22J085j642l39B43M21
715F64R6k09G2e87m202J305j997j885J08P25M19J231K114J058k211l88R15B978
696C252c68l908J625j008a24m327j802b905b05E96d15G23A18b411i58J96l870
679d632m4I8c122J430J27j773f78j10k57p18j752j71n53l43j06N69L71l5k24M22
659c585J173Q22i5B588k5J33A204a864A364J177p40a449H8e83q19r00p02k01Q67
640b338R20l472b255J108j932k002j447c187j12M01j289J927A1150Q4628J39187
625B34965J27914L6064I3935j6757C0043e004O57C50K22D5b51j41bG27M18a4o74
608f88m812D79R43c174j597A151K351d567h53j697j079L07J474a05j996B995P24
$$ plain form
732 -2157 -3772 -5089 -4987 -3861 -2748 -4989 -2061 -2219 -2800 -3733 -4411 -4533 -3448 -5090 -5429 243 664
715 664 760 551 72 -587 -4789 -3484 -5481 -7366 -7258 -6533 -6114 -4883 -2769 -1711 -3922 -4310 -3395 2978
696 3252 -368 -4276 -2651 -3659 -124 -4451 -6253 -2905 -205 596 -415 723 118 -2411 -958 -762 -4632
679 -4632 -4676 98 -3122 -1692 -1565 -3338 -678 -788 -1045 -1763 -3515 -3686 -4239 -4582 -4688 -4119 -3748 -3783 -4007 -3585
659 -3585 -2412 -1590 -95 2588 2563 2696 1204 -1864 1364 2541 1801 -1449 88 -583 -1402 -2302 -3004 -3205 -2338
640 -2338 -1418 -4890 -2255 -1147 -3079 -5081 -6528 -3187 -3299 -2898 -4187 -2260 11150 95778 234965
625 234965 362879 398943 93935 77178 30043 -5004 -4347 350 572 45 -251 -392 -2 727 1145 -14 -688
608 -688 -5500 479 1422 -3174 -4771 1151 3502 -4567 -853 -2550 -3629 -3322 -1848 -105 -2101 2995 3719
591C719C94j36J566e73l008k898J230b579a046J75j104j766j593r56L10J417K024
574b539M88I60g726E97e947E626k63j06A940b00q27k720J106g61j309B826K844
557E670d32l643J87a539p07r15n40A722l91b882j494j298K079Q45C76a629l521
540e150Ok07a884N43O44k967c50l07j485B582D58c842J555N99n85C42R16R21P21
521B900i62j319e55k767K45k464j750K209J995J293h95j273a004M99n39B334c074
503I53R68a713j590Ln1O36k274b457M13G17P8l13c54m18m97N25A36J075K8k65
483I74d990J577J027j676k115k12K052J438K30j435j140b408L92B761N605J045
467I411k031A328e200J13l57j782j562c401B628a187m229A97J246K52a357j396
$$ plain form
591 3719 394 258 1824 -573 -3581 -6479 -5249 -2579 -1046 -871 -1975 -3741 -5334 -6290 -5980 -4563 -2539
574 -2539 -2051 960 -7726 597 -5947 5626 5363 5257 1940 -200 -1027 -3747 -2641 -761 -2070 2826 5670
557 5670 -432 -4075 -3888 -1539 -2246 -3161 -3701 1722 1331 -2882 -4376 -5674 -3595 -2750 376 -1629 -5150
540 -5150 -5144 -5351 -1884 -1341 -697 -3664 -350 -657 -2142 2582 458 -3842 -2287 -1688 -2273 342 1258 2179 2900
521 2900 -962 -2281 -555 -3322 -3077 -5541 -7291 -5082 -3087 -1794 -895 -2168 -1004 -505 -1044 2334 -3074
503 953 1921 -1713 -3303 -3300 -3351 -2715 -4989 -2457 -2044 717 795 482 -354 -772 -1269 -744 136 1211 1239 974
483 974 -4990 -3413 -2386 -4062 -6177 -6389 -4337 -2899 -2669 -4104 -5244 -2408 -2016 2761 8366 9411
467 9411 7380 1328 -5200 -5087 -5444 -7226 -8788 -3401 2628 -1187 -5416 197 1443 1695 -1357 -2753
451b753A271C99e20o027K288J578k045J56g85B334K470g7n506b585B148J349j80
434C317e211R75r51B375L675j83c279b7B22c031p87J716l197J688O52k336j6N28
416d783a143B230I90c650i99k99j46J26J33k675N47g50L33m136b79k05b30p18
398i48l627e93q13j524j583j066o8R19J220J510m492b768j192A519o23A74f90
380a662o24j13J048k342e98m040A4J900b25k099o60a112j713l70j365J695f0k624
362b684l393b734K48R07C406j550J971j831a208l083i87D39b327j734a144L70
346g74L72j428L3k66o13n11m9j308J307m13A202J037b012k374R61P70R7n25l6
327c119M15P62J56q94j838k029Q74J393Q72j01p28q72j129n93Q20J000N94j21
$$ plain form
451 -2753 1271 399 -520 -6547 -4259 -2681 -4726 -4570 -785 2334 4804 -77 -5583 -2585 2148 3497 3317
434 3317 -5211 -4236 -5187 2375 6050 5867 -3279 -27 222 -3031 -3818 -2102 -5299 -3611 -2959 -5295 -5311 -4783
416 -4783 -1143 2230 990 -3650 -999 -1298 -1444 -1318 -1185 -3860 -3313 -750 -417 -4553 -279 -484 -230 -948
398 -948 -4575 -593 -1406 -2930 -4513 -5579 -5647 -4728 -3508 -1998 -6490 -2768 -3960 1519 896 174 -690
380 -1662 -2286 -2399 -1351 -3693 -598 -4638 14 1914 -225 -2324 -2984 -1112 -2825 -3195 -4560 -2865 -60 -2684
362 -2684 -6077 -2734 -2486 -1579 3406 1856 3827 1996 -1208 -4291 -987 439 -2327 -4061 -1144 -774
346 -774 -402 -1830 -1797 -2063 -2676 -3187 -3236 -4544 -3237 -3650 1202 2239 -2012 -4386 -3425 -2655 -2558 -3083 -3119
327 -3119 -2704 -1942 -1786 -2680 -4518 -6547 -5673 -4280 -3408 -3509 -4237 -5109 -6238 -6831 -6011 -5011 -4417 -4538
309d538r14L19K094e76I05c94J69k077j923m7J204l322c005j248j674r4b718B44
290B125O19c076B01a094j610j926K292A58J166c741g49A13a139j289B547a933
273D981p24H44a650M00k935j082p41j718L132e04A359b345J41D688A149d106J524
256b582A206E47a673p6m52l81p07j85j476a518d84l60m96m465b379q33o99o37
238d548p08l86l3J33L02j59o55j129o47K214R78J08Q99D49M186A33d075j069J45
219d999j92J465Q90J1o67j198n57R47a871l166P8a35j340A68L379K52A199d629
200A281O996k456c954O14B378J758A057b780o7k469q52J371J465J573A02J689
184A791a840B570j037C67c988e04m814C009O85I98a454D22k06d950e45l583c93
$$ plain form
309 -4538 -5452 -5133 -3039 -576 905 -394 -225 -2302 -4225 -4272 -3068 -6390 -3005 -4253 -5927 -6021 -2718 244
290 2125 2744 -3076 201 -1094 -2704 -4630 -2338 158 1324 -3741 -749 113 -1139 -2428 2547 -1933
273 4981 4257 844 -1650 -1250 -4185 -5267 -6008 -7726 -4594 -504 1359 -2345 -2204 4688 1149 -4106 -2582
256 -2582 1206 547 -1673 -1749 -2201 -2582 -3289 -3474 -4950 -1518 -484 -844 -1340 -5805 -2379 -3212 -3911 -4548
238 -4548 -5256 -5642 -5675 -5542 -5240 -5399 -6054 -7183 -7830 -5616 -4638 -4530 -3631 449 4635 133 -4075 -5144 -4999
219 -4999 -5191 -3726 -2836 -2825 -3492 -4690 -5247 -4300 -1871 -5037 -4959 -135 -1475 168 3547 3799 1199 -4629
200 1281 8277 5821 -3954 -3340 2378 4136 1057 -2780 -2847 -5316 -6168 -4797 -3332 -1759 102 1791
184 1791 -1840 2570 1533 367 -3988 -504 -5318 3009 3694 998 -1454 422 216 -4950 -545 -4128 -393
166c562J010b51D64a78PC685n28B75b385n19j477a336A94J251J13J580A092b328
147c988J912j099j215j77H5M046L338B920a740m75O92k465L78K97i31B130J425
130C555J041a049F309e1A567c041a164B309B31a079o96l39N4M79P20c46R8p23
112i71j426k045j150P68J322J52r31K088k500b308j736a777k395E55a752j299
96c051L39j188D36e784B911b49r71k075f55B943j005a604B20L051R26J154A110
78a866A083M000N45K994l290a5l070k45d2k023l978K222a732F364k860b850k490
61e340J332j620K215J06k570b626l38a411P5l36l640J734j084J40J391k328e74
43C94d334M95A73J440E80a627k212l31a989E94J617k71c59j723l072n3J046a080
$$ plain form
166 -3562 -2552 -251 464 -178 -171 3685 3157 275 -2385 -2904 -4381 -1336 194 1445 1558 3138 1092 -2328
147 -3988 -2076 -3175 -4390 -4567 85 4131 7469 2920 -1740 -2215 -1523 -3988 -3610 -3313 -931 2130 3555
130 3555 4596 -1049 6309 -51 1567 -3041 -1164 2309 231 -1079 -1775 -2114 -2060 -1581 -861 -346 -248 -971
112 -971 -2397 -4442 -5592 -4824 -3502 -3350 -4281 -2193 -4693 -2308 -4044 -1777 -4172 555 -1752 -3051
96 -3051 -2712 -3900 436 -5784 2911 -249 -1220 -3295 -655 2943 1938 -1604 220 3271 4197 5351 1110
78 -1866 1083 5083 5628 8622 5332 -15 -3085 -3330 -42 -2065 -6043 -3821 -1732 6364 3504 -2850 -5340
61 -5340 -4008 -5628 -3413 -3307 -5877 -2626 -2964 -1411 -1336 -1672 -5312 -3578 -4662 -4522 -3131 -5459 -574
43 394 -4334 -3839 173 1613 580 -1627 -3839 -4170 -1989 594 2211 1940 -359 -2082 -5154 -5207 -4161 -1080
24d812J685I24d89j637N90B93J466d97j676n10r80J200Q82P89j706A68L90a012
5b837j815J028P66L55m46
0b949
$$ plain form
24 -4812 -3127 924 -489 -2126 -1536 293 1759 -497 -2173 -2683 -3663 -2463 -1581 -792 -2498 168 558 -1012
5 -2837 -4652 -3624 -2858 -2503 -2949
0 -2949
##PAGE= F1=1893.647353578
##FIRST=     2903.44365593433, 2615.24460078534, -332
##DATA TABLE= (F2++(Y..Y)), PROFILE
1023c32k56J99d5k995h02j5o24n80H05a333C533A304a160b09G07Q18K53m44a069
1003a872B136j01c000f32k435k174r41P37J803a520e41p24k338l202j256L048
987e013J229A868I03b669i69k182j554r97K32M6j067k210q16L934e07D509L989
970H498J709l146E25a517g05B207a420n181k390a387j084H86P611o52l516A333
953f59j458L74n00o67n44r86r24l82N8R70J469J462c54k66il523o76a857N28k106
933c435h40A01a677B192a119j701M6K73M1J62R75d20f3l87k837J329l1K08k03
914a984p53q47j061p19m35n7j55l54K04J732a971L60k346d61B448a218C433e30
895d895J022N13A076a691q82j803a019k332F273J600f68j975j472k479L097J286
$$ plain form
1023 -332 -588 -389 -45 -3040 -802 -817 -1441 -2021 805 -1333 3533 1304 -1160 -209 707 1525 1778 1334 -1069
1003 -1872 2136 2035 -3000 -632 -3067 -5241 -6182 -5445 -3642 -1520 -541 -1265 -3603 -6805 -8061 -5013
987 -5013 -3784 1868 903 -2669 -969 -3151 -4705 -5702 -5470 -5424 -6491 -8701 -9517 -5583 -507 4509 8498
970 8498 10207 7061 525 -1517 -705 2207 -1420 -6601 -8991 -1387 -2471 886 8497 7845 4329 1333
953 -659 -2117 -1743 -2243 -2910 -3454 -4440 -5364 -5746 -5688 -4718 -3249 -1787 -354 -620 -9 -3532 -4208 -1857 -1329 -3435
933 -3435 -840 101 -1677 2192 -1119 -2820 -2774 -2501 -2460 -2298 -1323 -420 -63 -450 -3287 -1958 -1989 -1781 -1984
914 -1984 -2737 -3584 -4645 -5364 -5799 -5856 -6011 -6365 -6161 -4429 -1971 -1611 -3957 -461 2448 -1218 3433 -530
895 -4895 -3873 -3360 1076 -1691 -2573 -4376 -1019 -3351 6273 7873 -668 -2643 -4115 -6594 -3497 -2211
879b211j044k450j777J549K476a456G0P33M5A13g87m79A12K729L239B272c225
861a568p94P32B128c569k159j438J384L32k21J193K29M24H19Q65c115J033C456
843C867J580H33c514n94a779N65d45A403D57d055R87k351j62c27A90O43N3a20
824b129k380j717j062l49K546a273r04J23K10P69E197B35O662j731j815f381c7
806C91J688J396p4b085L91k968k159K314R97k57p54n05n99j617J725b567F50K163
788B813L33a587o25Q67M23o42n07C28d15i3k133j363R26A39a177L99B425J810
770D235a269k434f15j37l90K45j889k478Q13a620d8B18e47j539j682j677m20J460
752d405K106N09f68A258b236h06I66a952g21q53j904j546J228J455P62k68j228
$$ plain form
879 -2211 -3255 -5705 -7482 -5933 -3457 -1456 70 803 848 113 -787 -1266 112 2841 6080 2272 -3225
861 -1568 -2362 -1630 2128 -3569 -5728 -7166 -5782 -5450 -5671 -4478 -4249 -3825 819 1684 -3115 -2082 3456
843 3867 5447 833 -3514 -4108 -1779 -1214 -445 1403 457 -4055 -3068 -5419 -5581 -327 190 833 886 -120
824 -2129 -4509 -6226 -7288 -7637 -5091 -1273 -2177 -2054 -1844 -1075 5197 235 6897 5166 3351 -6381 -37
806 391 2079 3475 3401 -2085 -1694 -4662 -6821 -4507 -3510 -3767 -4521 -5026 -5625 -7242 -5517 -2567 650 2813
788 2813 3146 -1587 -2212 -1345 -922 -1564 -2071 328 -415 -93 -2226 -3589 -2663 139 -1177 -778 2425 4235
770 4235 -1269 -3703 -615 -752 -1142 -897 -2786 -5264 -4451 -1620 -48 218 -547 -2086 -3768 -5445 -5865 -4405
752 -4405 -2299 -1790 -668 1258 -2236 -806 966 -1952 -721 -1574 -3478 -5024 -3796 -2341 -1579 -1847 -3075
735c075j143o95b398Q21k09j051j288l42m2J975L32R74m60j795J227Q30l218L55
717d289B221M1a795C55J912a32m998J721k036j152O50J318J360J547a00q67l008
700c975a390k633a06C489c152a350a24n027E92b693i55l851a417L05n19b1j105
683a126r24M46j720j886j911q43M20j70j93K061K192J818f93O0k751J338o63j138
665c847j429o58R38J084Q63a332A695b214A017L509j641L77A628a286B423M886
649G309j159h80B284a714m447K476h8m645B207J958e403a121D915a175b16n164
633e380n83h51j067l42A4480B221J30236K52993K49867Q7989j33404k83317A03530
619a826B692a938C793j210r40m14M2D59e45l286B145e429D41J688c665r18A011
$$ plain form
735 -3075 -4218 -4913 -2398 -1577 -1786 -2837 -4125 -4467 -4509 -2534 -2202 -1228 -1688 -3483 -2256 -1426 -4644 -4289
717 -4289 2221 2262 -1795 355 2267 -132 -5130 -3409 -5445 -6597 -5947 -4629 -3269 -1722 -100 -967 -3975
700 -3975 -1390 -4023 -106 3489 -3152 -1350 -124 -5151 592 -2693 -955 -4806 -1417 -1112 -1631 -21 -1126
683 -1126 -2050 -1604 -3324 -5210 -7121 -7964 -7544 -7714 -7907 -5846 -3654 -1836 -693 -633 -3384 -2046 -2709 -3847
665 -3847 -5276 -5934 -4996 -3912 -3049 -1332 1695 -2214 1017 4526 2885 3262 1628 -1286 2423 7309
649 7309 6150 -880 2284 -1714 -6161 -3685 -88 -4733 2207 4165 -5403 -1121 4915 -1175 -216 -5380
633 -5380 -5963 -851 -1918 -2260 14480 2221 132457 385450 635317 723306 589902 306585 103530
619 -1826 2692 -1938 3793 2583 1643 1229 1271 459 -545 -3831 2145 -5429 441 2129 -3665 -4583 1011
601C814e535A493M16M08j97K223j263b802l129k089c966a156B63J58i97q13j542
584c352l75Q72a393f54j825a177A024r3a257l155k176J674l826A266e092D431
567D401n62A759D65f83l521a171A614i58D034M295B356b411m9j340A229C90b438
549a505A019b984j672M67J346j205j078J561J33a625l153h67m23k674k785L16
533f433c010i67C077a77l019d60o64j396r53O74J097P22P7j273j674k611j094
516g555J255R03n95j502M36L019a384A204f04k325B604b147Ea62l681l052L124
499c771Q38l47J449q48M43D823k384a94l828l207L251a323b38D482o54A263c653
481d669J39j66r42j205j02J575K011a396H96k23e81B977O009J52k309g5n102J646
$$ plain form
601 3814 -5535 1493 1909 2317 2120 4343 3080 -2802 -5931 -8020 -3966 -1156 263 421 -997 -1810 -3352
584 -3352 -3727 -2855 -1393 -654 -2479 -1177 1024 931 -1257 -4412 -6588 -4914 -8740 1266 -5092 4431
567 4401 3839 1759 465 -683 -4204 -1171 1614 -958 4034 8329 2356 -2411 -2460 -3800 1229 390 -2438
549 -1505 1019 -2984 -4656 -4189 -2843 -4048 -5126 -3565 -3432 -1625 -4778 -867 -1290 -3964 -6749 -6433
533 -6433 -3010 -967 3077 -177 -3196 -460 -1124 -2520 -3473 -2799 -1702 -980 -903 -2176 -3850 -6461 -7555
516 -7555 -6300 -5397 -5992 -7494 -7058 -4039 -1384 1204 -604 -2929 2604 -2147 5 -162 -3843 -6895 -3771
499 -3771 -2933 -3280 -1831 -2679 -2236 4823 2439 -194 -4022 -7229 -3978 -1323 -238 4482 3828 1263 -3653
481 -4669 -4530 -4696 -5638 -6843 -6945 -5370 -3359 -1396 896 673 -581 2977 8986 9138 6829 -75 -5177 -3531
463c531k406m438j851a893D109D4e002a347k926k042j8M74n81j385j332J989J786
446e382J212J032J303E11J946J316f0n623J471C53b64j543m213J816j191K031
430c364L54J79K4j68j5j86p7L10j933a647k800j426J02J762d5j893j091l65M30
411b964a358j474B671c15m504f80C429j661b832R53a31A617m57b923B37K450e68
393b410h94m89N56B15a138l086a897j049I26a710k368j118m35r78j487K652b172
375C0d079B116a1k643k112j153M03J515P08J170k742a379m48N41a49j679n10C00
356d56j234j466j010J84J136Q72n25k017j994J001b676J248L0k133k788K062B63
338d73j69k835A351b313l620p02R31J063a395c75m291a745p27B192R93g24M0E720
$$ plain form
463 -3531 -5937 -10375 -12226 -1893 4109 44 -5002 -1347 -4273 -6315 -6333 -5859 -6440 -7825 -9157 -7168 -5382
446 -5382 -4170 -3138 -1835 511 2457 3773 -60 -5683 -4212 353 -264 -1807 -6020 -4204 -5395 -3364
430 -3364 -3010 -2831 -2807 -2975 -2990 -3176 -3253 -2943 -4876 -1647 -4447 -5873 -5771 -4009 -45 -1938 -3029 -3394 -2964
411 -2964 -1358 -2832 2671 -315 -4819 -680 3429 1768 -2832 -1879 -131 1617 1160 -2923 237 2687 -568
393 -2410 -894 -1383 -827 215 -1138 -4224 -1897 -2946 926 -1710 -4078 -5196 -5631 -6609 -8096 -5444 -2172
375 30 -4079 2116 -11 -2654 -4766 -5919 -5516 -4001 -3293 -2123 -4865 -1379 -1827 -1286 -149 -1828 -2338 300
356 -456 -1690 -3156 -4166 -3982 -2846 -1974 -2499 -4516 -6510 -5509 -2676 -1428 -1398 -3531 -6319 -4257 263
338 -473 -642 -3477 1351 -2313 -5933 -6635 -5704 -4641 -1395 -375 -4666 -1745 -2472 2192 3185 -724 -684 5720
319C164E25K886b966n105J754L55l89c142A004a781k037a128l773o98b188n3J040
302a201j881j802j15j239o604N129L311l049L012A418K993L881l139c130g58q30
286a588j819m456L880I20b23m017I19R42i46o63B488a613C990j930J76m42b883
268f631j82K478g91o44B620A269F22A99L963f94l511a299B162E60c064gE805B281
249I31g71k797J242i3j730k014j654j037o39k19K46L19N06R00J252J081R57J09
231b016K50M86c40l999P23a544A333B84a692k159r40J618c42A643L54E71b159
213e157N09J464i53m803J637a162j836a041E828q10b07m506B552P005D568d591
196d146A718J245q64d406b162j086L73l33e14A094L326r51b208C973D17b031o45
$$ plain form
319 3164 525 3411 -2966 -8071 -6317 -5962 -6351 -3142 1004 -1781 -3818 -1128 -4901 -5599 -2188 -2241 -1201
302 -1201 -3082 -4884 -4999 -6238 -12842 -7713 -4402 -7451 -4439 1418 4411 8292 5153 -3130 -758 -1588
286 -1588 -3407 -7863 -3983 920 -223 -4240 919 1861 -946 -1609 2488 -1613 3990 2060 2236 1794 -2883
268 -6631 -6813 -4335 -791 -1435 2620 1269 622 199 4162 -694 -4205 -1299 2162 560 -3064 -7 5805 2281
249 931 -771 -3568 -2326 -93 -1823 -3837 -5491 -6528 -7167 -7386 -7140 -6821 -6315 -5415 -4163 -3082 -2125 -2016
231 -2016 -1766 -1280 -340 -4339 -3616 -1544 1333 284 -1692 -3851 -4791 -3173 -342 1643 1997 571 -2159
213 -5157 -4648 -3184 -953 -5756 -4119 -1162 -2998 -1041 5828 5018 -207 -4713 2552 9557 4568 -4591
196 -4146 1718 2963 2099 -4406 -2162 -3248 -2875 -3208 -514 1094 4420 3469 -2208 3973 417 -2031 -2676
179b676a92m545B469K294r33b936G79K703b240P46j768J18K26M38m1p13j115r30
161e279J359e96A311a283o90J24B029a990j181b82A490f43j705l234b130k35O48
144a717j410A480a416l841l697K534J152l79j389J392K496a040F6M18L78l11J992
127B543a936C22c566A498J906r61p94k86O2B19a275c27j748j493n42L62j77r77
109d902k023j223K592J936J162j358J120j689N37p51m48J95R40P55O03K04l478
92e828a263K26m38k848M98r96N5P17Q11N66N91c01A430c079a283D083n19L154
74F718p21b094D520L810o9c75j854a10j886D856A635a322m422L74j028r9K28O09
56e660P98J152Q03r07Jp62J620C62J311m83e813B161c27n154Q58A119p5e06k488
$$ plain form
179 -2676 -192 -4737 2469 4763 3830 -2936 779 3482 -2240 -1494 -3262 -3144 -2918 -2480 -2521 -3234 -4349 -5279
161 -5279 -3920 -596 1311 -1283 -1973 -1849 2029 -1990 -3171 -282 1490 -643 -2348 -5582 -2130 -2365 -1717
144 -1717 -3127 1480 -1416 -5257 -8954 -6420 -5268 -5647 -7036 -5644 -3148 -1040 66 484 862 551 2543
127 2543 -1936 322 -3566 1498 3404 2443 1649 1363 1425 219 -1275 -327 -2075 -3568 -4110 -3748 -3925 -4902
109 -4902 -6925 -8148 -5556 -3620 -2458 -3816 -2696 -4385 -3848 -4599 -5047 -4852 -3912 -3157 -2554 -2350 -5828
92 -5828 -1263 -1037 -1475 -4323 -3825 -4821 -4766 -4049 -3238 -2672 -2081 -301 1430 -3079 -1283 4083 3564 6718
74 6718 5997 -2094 4520 8330 8261 -375 -2229 -110 -1996 4856 1635 -1322 -5744 -5370 -6398 -6497 -6269 -5660
56 -5660 -4862 -3710 -2907 -3814 -3813 -4575 -2955 362 1673 1190 -5813 2161 -327 -5481 -4623 1119 1044 -506 -2994
37b994j972l35J274J824g41a1A88a73j888p8B64a618J74r54N10D26a046m786k250
18h082L620g24j624j542J763A586O6D47b998J336m21ql05j172g28C032G86a194
$$ plain form
37 -2994 -4966 -5301 -4027 -2203 -741 -11 188 -173 -2061 -2139 264 -1618 -1444 -2398 -1888 426 -1046 -5832 -8082
18 -8082 -4462 -724 -2348 -3890 -2127 1586 1652 447 -2998 -1662 -2083 -2091 -2396 -3568 -728 3032 786 -1194
##PAGE= F1=1891.090907243
##FIRST=     2903.44365593433, 2615.24460078534, 1637
##DATA TABLE= (F2++(Y..Y)), PROFILE
1023A637J269Q65j654b518D09b113k311l25R53M80j516l092r2a182N9A78M93N83
1005A254a109m51H28d05m05A382A06f41j684L72k426K60J397l12j249J190c45
987d72l001C199A368c246o989m843m73p9j782jM896N857h94C931L339j259K513
970H524k397A738c602m801l083p66K034M457b99A580b018B371M251B893a749m533
954f282l441j743m21M24J332K761L280M17r84b235G09k76oJ941D37J587c583o80
936d263h94M19p22B726j135a581C632d71o610n207K253M649a952D38J006e55A666
918b754J100P16I531r92j415j610c356e36m720n069m104L13L46j888J587M750
902i321d625h50A185h83c98k967l461l169k571k284QL968N217b711p13E406J844
$$ plain form
1023 1637 2906 3771 2117 -2518 409 -2113 -4424 -4749 -3796 -3316 -4832 -7924 -8016 -1182 -1123 178 671 1254
1005 1254 -1109 -1560 828 -405 -810 1382 106 -641 -2325 -1953 -4379 -4119 -2722 -3034 -4283 -3093 -345
987 -472 -3473 3199 1368 -3246 -10235 -15078 -15551 -15630 -17412 -17413 -12517 -6660 -894 3931 7270 6011 8524
970 8524 6127 1738 -3602 -8403 -11486 -12252 -10218 -5761 -299 1580 -2018 2371 6622 2893 -1749 -6282
954 -6282 -9723 -11466 -11887 -11463 -10131 -7370 -4090 -3673 -4657 -2235 709 433 427 2368 437 2024 -3583 -4263
936 -4263 -894 -475 -1197 2726 1591 -1581 3632 -471 -7081 -12288 -10035 -5386 -1952 438 1444 -555 1666
918 -2754 -1654 -938 9531 8539 7124 5514 -3356 -536 -5256 -10325 -14429 -14116 -13770 -15658 -14071 -9321
902 -9321 -4625 -850 1185 -883 -398 -3365 -6826 -9995 -12566 -14850 -14842 -10874 -5657 -2711 -3424 5406 7250
885G250a028k385o872L750f93B174C1c195m787n118M051d214h89E25j43i37j037
868a974O84A803L611K868B994d714a761p26m21N46k794k162j236J2J361J876J795
851c510o33M59a276F90c065a241A582L52K095j918d222Q39j274J533g04A832j22
834A710d923b101k091l71e5B103R28G12J388A020d027m715r27L082b460A613a138
816a973b53m898B275j135L876H44c502m316k460J002J48j571m76M376L006h07
799A354J051M16D64d11D455A153L896k145I90N095A060e064k375c167P22a99A837
781G16k65a205j812l570j401L372A84a47l775a118A343c319N09k968k479j330
765i587J265L298K139L29B794n09B17b547k431q30K21N62M52J75k71r77j445o19
$$ plain form
885 7250 -1028 -3413 -10285 -6535 -693 2174 31 -3195 -7982 -13100 -9049 -4214 -889 525 382 -937 -1974
868 -1974 -1290 1803 5414 8282 2994 -4714 -1761 -2487 -2908 -2362 -5156 -7318 -8554 -8542 -7181 -5305 -3510
851 -3510 -4143 -3684 -1276 690 -3065 -1241 1582 1934 4029 2111 -4222 -3383 -4657 -3124 -704 1832 1710
834 1710 -4923 -2101 -4192 -4563 -55 2103 3031 712 2100 1020 -4027 -8742 -9669 -6587 -2460 1613 -1138
816 -1973 -253 -5151 2275 1140 5016 844 -3502 -7818 -10278 -9276 -9128 -10699 -11175 -6799 -3793 -807
799 1354 2405 2821 464 -411 4455 1153 5049 2904 990 6085 1060 -5064 -7439 -3167 -2445 -199 1837
781 716 451 -1205 -3017 -6587 -7988 -4616 184 -147 -3922 -1118 1343 -3319 -2810 -5778 -8257 -9587
765 -9587 -8322 -5024 -2885 -2556 2794 2285 217 -2547 -4978 -5808 -5587 -5025 -4573 -4398 -4669 -5646 -7091 -7710
747g710N36M78m67j566k093J671L508b015A537D89J145F92J81e440G35J150q06
730A079P83A19c439j747b325o82A246n28e006f79A484c956K87A956r74c494O4
713c430j649j737k461j131L022K789J911R15J70l63j063j793k334k370J15J814
697g595J194M93L55P16k341b276p87R57j582k81p35n88j024j746j883K80J522
680h143R92l7o23k16K168b055k111G15d19G09M57b939N39Q59M31r77M43k000l070
661f714j566K993g85j821C94K481j211J708j482c09C722O500m106f13A527K191
645C718i54O4j757k529A858J510b681A020M273e16l861b105B281H24a122A1150
628B221J9874L56857O64466O18146J70896l94817A63401k0109B8496j0361H606
$$ plain form
747 -7710 -7174 -6696 -7163 -8729 -10822 -9151 -5643 -2015 1537 489 1634 692 873 -5440 735 1885 1079
730 1079 1862 119 -3439 -5186 -2325 -3007 1246 718 -5006 -679 1484 -3956 -3669 1956 982 -3494 -3430
713 -3430 -5079 -6816 -9277 -10408 -7386 -4597 -2686 -1771 -1601 -1964 -3027 -4820 -7154 -9524 -9409 -7595
697 -7595 -6401 -5908 -5553 -4837 -7178 -2276 -3063 -2106 -3688 -3969 -4704 -5292 -6316 -8062 -9945 -9665 -8143
680 -8143 -7151 -7188 -7811 -8027 -5859 -2055 -4166 715 -419 709 1166 -2939 -2400 -1541 -1110 -2087 -1644 -3644 -6714
661 -6714 -8280 -5287 -785 -2606 394 2875 1664 3372 1890 -309 3722 10222 6116 -613 1527 3718
645 3718 -954 -890 -2647 -5176 1858 3368 -2681 1020 5293 -516 -4377 -2105 2281 824 -1122 11150
628 2221 22095 378952 1043418 1661564 1832460 1437643 163401 143292 28496 18135 8606
616E037O430K098j520D0R934m526f100B853A157K047b67m741L85F10J933c526
599A139M572F99B96J250K636a660f76n368l648K217b549B314E93K696N459r19
583G829l696c402m7a344j26B24J493B46K319e085b18j0013M075J947e0B594m95
566B099H89a685r93j495a137q1j69O73A459K084a110m93l272a567G85bl901A10
547c518j332b306R66j599l372r02L343d1k176D53f54A30c500k415K198e16C271
529g68j571B04a638l465k117J370K346a693N23j844l329m416M425b597e60E08
512E48a825k441j329J642a537j143A338a810j363m068j79c496a639j413k731K217
496c566j369a907C043k14b05l602k630l51K129J543J07j162o13O98J79d82A00
$$ plain form
616 5037 11467 13565 12045 40 9974 5448 -6100 2853 1157 3204 -267 -5008 -4623 610 2543 -3526
599 1139 5711 699 296 1546 4182 -1660 -676 -6044 -9692 -7475 -2549 2314 593 3289 8748 7829
583 7829 4133 -3402 -3449 -1344 -1470 224 1717 246 2565 -5085 -218 -10231 -6156 -4209 -50 2594 2099
566 2099 889 -1685 -2678 -4173 -1137 -1218 -1387 -714 1459 3543 -1110 -1603 -4875 -1567 785 -2 -3903 110
547 -3518 -4850 -2306 -1340 -2939 -6311 -7213 -3870 -41 -2217 453 -654 130 -3500 -5915 -3717 -516 3271
529 -768 -2339 204 -1638 -5103 -7220 -5850 -3504 -1693 -1170 -3014 -6343 -10759 -6334 -2597 -560 508
512 548 -1825 -4266 -5595 -3953 -1537 -2680 1338 -1810 -3173 -7241 -7420 -3496 -1639 -3052 -5783 -3566
496 -3566 -4935 -1907 3043 2829 -205 -3807 -6437 -6788 -4659 -3116 -3009 -4171 -4784 -4086 -3907 -482 100
478f32j536j910j384L51J622a292e24o40A860N484K84k865a925m152L024j478
462d531k646j536L591K085J079k598J144j249p66n39p85j562j529K88K074K304
446e176K237a423F99L033J528Q81e44l446L29g79R2J4m833b383l225K745j32j448
428d443k707k788J461K583O93o85q37J679r97J527q45a582f12k200j980j280j11
411f183J503b111I44o7d263A249K289A476f02l126m503l89c996J715A5J166a827
393c738a312E390L349J747A423b159o1k41E879A277d277k556L132f35B79a396
376a824g7l225B76c365m806l436L343J613K18o2N37Q16K79n38j281j761j051J715
358g779K477K266a017e07j468q72A910J380a073j148j507F75J257a887h72a2l063
$$ plain form
478 -632 -2168 -4078 -5462 -5111 -3489 -1292 -524 -1164 1860 7344 7628 4763 -1925 -6077 -3053 -4531
462 -4531 -7177 -8713 -5122 -3037 -1958 -4556 -3412 -4661 -5427 -5966 -6751 -8313 -9842 -9554 -7480 -5176
446 -5176 -2939 -1423 699 3732 5260 6141 -544 -3990 -3661 -779 -687 -673 -5506 -2383 -5608 -2863 -2995 -4443
428 -4443 -7150 -9938 -8477 -5894 -5201 -5886 -6723 -5044 -6041 -4514 -5359 -1582 -612 -2812 -4792 -6072 -6183
411 -6183 -4680 -2111 944 877 -4263 1249 3538 1476 -602 -3728 -8231 -8620 -3996 -2281 15 1181 -1827
393 -3738 -1312 5390 8739 10486 1423 -2159 -2220 -2461 5879 1277 -4277 -6833 -3701 -635 279 -1396
376 -1824 -77 -3302 276 -3365 -8171 -11607 -8264 -6651 -6433 -6495 -5958 -5142 -4863 -5401 -6682 -8443 -9494 -7779
358 -7779 -5302 -3036 -1017 -507 -1975 -2847 1910 3290 -1073 -2221 -3728 675 1932 -1887 -872 -12 -3075
341c075O95F67P26C5c488j268m235L480K129L08Q4a227j360P7h2k429J006C39
322a327E09O856l361b25B273F24c766l160j168J194K915e82k082j286f22l954
306d576l575m62J232K60j57k67n21k051p756P821L195r91k932K513L789K187K39
289b052j142j731r40J391J711j702E71b011j891A207P72a649K37A530a868B089
272e13A433i23m73c0j984m48d80l126F38k28J782J17O00b905j325e27B233l83
254A850b826A262L950r45j155F15a967j973a158k001k362j694p02m09m52m00l09
237i487K70J045J430J302L17R4J597d60B40c473J617D64J679L05G17b54k691g3
218C071K747O75B537c381J100j178J638m87j977J478J200k371N97E502r04b096
$$ plain form
341 -3075 -2380 667 1393 35 -3488 -4756 -8991 -5511 -3382 -3074 -2990 -1227 -2587 -2510 -82 -2511 -1505 339
322 -1327 509 7365 4004 -225 2273 624 -3766 -6926 -8094 -6900 -3985 -582 -2664 -3950 -622 -4576
306 -4576 -8151 -8613 -7381 -7121 -7278 -7545 -8066 -10117 -17873 -10052 -6857 -7848 -10780 -8267 -4478 -2291 -2052
289 -2052 -3194 -4925 -5865 -4474 -2763 -4465 571 -2011 -3902 1207 1979 -1649 -1412 1530 -1868 2089
272 -513 1433 -923 -1396 -30 -2014 -2462 -480 -3606 638 410 2192 2309 2909 -2905 -4230 -527 2233 1850
254 1850 -2826 1262 5212 4267 3112 615 -1967 -3940 -1158 -3159 -5521 -7215 -7917 -8326 -8778 -9178 -9487
237 -9487 -9217 -8172 -6742 -5440 -5123 -5029 -3432 -460 240 -3473 -1856 464 2143 2448 717 -254 -2945 -73
218 3071 5818 6493 2537 -3381 -2281 -3459 -1821 -2308 -4285 -2807 -1607 -3978 -3381 5502 4598 -2096
201c250C173J227j785e679J803g63k79j023j025k04n20j056m238O32i68A018J30
184A148b918B307a472k758a014a87m062A130O928k707b095A45N652A29c192m420
168g612j508K572K901a303p78c23j826r55A73K151e66q15B11J1353l382k200a286
150a215j820K7j857b429a030F10g13C840J712A580c676n197l168L489K714K063
134c775R01p3j054j238k44R33R58j538P6k579k852j754J96j07l44K567L077K679
116d171J677K11j139k307k497q74J853K223J804L55O56J12o33o84j071q3l185
99g753K29L316d68B470r33K983e679C631j284i68k670p77a237A139a635A778O895
82H673k408A991c586n215J088b439B81J781J867c687B149L756q6A324r6p1a988
$$ plain form
201 -3250 3173 4400 2615 -5679 -3876 -763 -1042 -2065 -3090 -3294 -3814 -4870 -9108 -8476 -968 1018 1148
184 1148 -2918 2307 -1472 -4230 -1014 -187 -4249 1130 8058 5351 -2095 145 5797 129 -3192 -7612
168 -7612 -9120 -6548 -3647 -1303 -2081 -323 -2149 -3104 173 2324 -566 -1381 211 11564 8182 5982 -1286
150 -1215 -3035 -3008 -4865 -2429 -1030 610 -713 3840 5552 1580 -3676 -8873 -12041 -8552 -5838 -3775
134 -3775 -2874 -2947 -4001 -5239 -5483 -4550 -3592 -5130 -5054 -7633 -10485 -12239 -12043 -12150 -12494 -9927 -6850 -4171
116 -4171 -2494 -2283 -3422 -5729 -8226 -9100 -7247 -5024 -3220 -2865 -2209 -2097 -2730 -3414 -4485 -4568 -7753
99 -7753 -7524 -4208 -468 2470 1537 4520 -5679 3631 2347 -968 -3638 -4415 -1237 1139 -1635 1778 8673
82 8673 6265 1991 -3586 -8801 -7713 -2439 281 2062 3929 -3687 2149 5905 5819 1324 1228 1157 -1988
64e111k302j195q75l00L8j38r37q12J935L804b334k451J590R21c50Da135B8f138
44B726b87l331k073B002c87n851j957L654a304a96p73j748j74B53J292E31e365
26H72a092G93i74k809J298j834k652l404j555L480c335O16a008A548J570j399
10A719c221a113n20k16n39J072J31B923A130a211
$$ plain form
64 -5111 -7413 -8608 -9483 -9783 -9745 -9883 -10820 -11632 -9697 -5893 -2334 -4785 -3195 -2274 -350 4 -1135 28 -6138
44 2726 -287 -3618 -5691 2002 -387 -6238 -8195 -4541 -1304 -196 -969 -2717 -2891 253 1545 531 -5365
26 872 -1092 793 -974 -3783 -2485 -4319 -6971 -10375 -11930 -8450 -3335 -2719 -1008 1548 3118 1719
10 1719 -3221 -1113 -1633 -1849 -2388 -1316 -1185 2923 1130 -1211
##PAGE= F1=1888.534460908
##FIRST=     2903.44365593433, 2615.24460078534, -791
##DATA TABLE= (F2++(Y..Y)), PROFILE
1023g91A533M46d95m425l899K607h92L96a29r17j136R96j306A31c359a206N02
1006g04A168a30o38j01k314b00A693a853A051h61L24j062l799j659j773j038L369
989f499a171j363g51A677a702k281N21j705d30r25j675a148L29k581B846J580
973D426I17b799k337J354d14I1a167j806J449F06c32F94R99f79q00p469o810O272
955i486M297J869k35j858k527j790M45K073J909J907H0J168h58m08A639p22e42
937c390j370b125F25L88L928B082b218C165E76c261n043n332K700N413b469I5
920b124B040a417r96jF584K386O33m07b601O82k260L76a310b43j647l843m887
903a0620m609J351K205J228J140J178L80r58k190k775j786J459K340L888L332
$$ plain form
1023 -791 1533 1979 -495 -4920 -8819 -6212 -892 -496 -129 -1046 -2182 -1186 -2492 131 -3359 -1206 -704
1006 -704 1168 -130 -768 -869 -3183 -200 1693 -1853 1051 -861 -537 -1599 -5398 -7057 -8830 -9868 -6499
989 -6499 -1171 -2534 -751 1677 -1702 -3983 -3462 -5167 -430 -1355 -3030 -1148 -819 -3400 2846 4426
973 4426 917 -2799 -5136 -3782 -414 91 -1167 -2973 -1524 606 -332 694 1693 -679 -1479 -8948 -15758 -9486
955 -9486 -5189 -3320 -3555 -5413 -7940 -9730 -9285 -7212 -5303 -3396 80 1248 -858 -1266 1639 917 -542
937 -3390 -4760 -2125 625 1013 4941 2082 -2218 3165 576 -3261 -8304 -13636 -10936 -5523 -2469 95
920 -2124 2040 -1417 -2413 -2414 6584 8970 9603 9196 -2601 -1919 -4179 -3803 -1310 -243 -1890 -5733 -10620
903 -10620 -15229 -13878 -11673 -10445 -9305 -8127 -7747 -8705 -10895 -13670 -15456 -13997 -11657 -7769 -4437
888d437J193C785q43a082o650n810f352c54B384A014c923m541j851M770e63B406
871A330J441C85a980q88a216A014J197p99e153O47l342k576j302n07J1O97J476
854a0049K348K533J875j91O44k10A97b038I3i14n657n006R17K601J454J611J45
837d849a371I47R35e896d41j190j568C900K736A214a537H43N270j480c317q791
821a2108L432h76B250C09b293A720c192e78A819p87e561m404L482a901A662L493
805E155J866M65A485d607K071F5e35A679G99f66F185A087O259k560A406d708n332
788a0040L001b503j421a762E4a487j400j118q92o13N20J267a853B71J498a125
771c632J560j326N47d35q97k840i6j945j895A13N110A82d924l985k243k90J356
$$ plain form
888 -4437 -3244 3785 2942 -1082 -7732 -13542 -6352 -354 2384 1014 -3923 -8464 -10315 -5545 -563 2406
871 1330 2771 385 -1980 -2868 -1216 1014 2211 1412 -5153 -4506 -7848 -10424 -11726 -12233 -12222 -11525 -10049
854 -10049 -7701 -5168 -3293 -3484 -2840 -3050 197 -2038 93 -914 -6571 -11577 -10660 -8059 -6605 -4994 -4849
837 -4849 -1371 947 1882 -5896 -441 -1631 -3199 3900 6636 1214 -1537 843 6113 4633 -3317 -12108
821 -12108 -8676 -876 2250 309 -2293 1720 -3192 -578 1819 1032 -5561 -9965 -6483 -1901 1662 5155
805 5155 7021 7486 1485 -4607 -2536 65 -535 1679 799 -666 6185 1087 7346 4786 1406 -4708 -10040
788 -10040 -7039 -2503 -3924 -1762 54 -1487 -2887 -4005 -4897 -5510 -4990 -3723 -1853 271 1769 -1125
771 -3632 -2072 -3398 -2851 -435 -1332 -4172 -96 -2041 -3936 113 5223 182 -4924 -8909 -11152 -11442 -10086
754a0086L254b391a017j349j837J231R43K89B20f16j368G28a117k780B499g52
737c811l156J61K607J852B790K635k570H55J177e090d36k45o92c53k812R36A440
719B409c128j98B036r14b167l866n214P74e207J509J790B168p38c88k296k160
703d844k087k134j901j237M01J662K078K475b686A50g997D3c554G19a791k078
687c869J764k144j609j547j312j038j072j71J693L147b701A155J237d521G24a035
670A455J248b045n13I35M6e74q21J24l032k335O8J335J150K15K69h03B806p53
652B053j012M404M211m081e29p78B545a892C120d882a46j423P36l813C763N724
636I487f311C250N682L368C320K2405P0053L6679K46495K808111L974396L218262
$$ plain form
754 -10086 -6832 -2391 -1017 -2366 -4203 -2972 -2029 -1740 220 -616 -1984 728 -1117 -3897 2499 -752
737 -3811 -6967 -6806 -4199 -2347 2790 5425 2855 855 2032 -5090 -436 -681 -1373 -353 -3165 -2229 1440
719 2409 -3128 -3326 2036 1122 -2167 -6033 -11247 -10473 -5207 -3698 -1908 2168 1430 -388 -2684 -4844
703 -4844 -6931 -9065 -10966 -12203 -11802 -10140 -8062 -5587 -2686 150 -7997 43 -3554 719 -1791 -3869
687 -3869 -2105 -4249 -5858 -7405 -8717 -9755 -10827 -10998 -9305 -6158 -2701 1155 2392 -4521 724 -1035
670 1455 2703 -2045 -2558 935 981 -574 -1395 -1271 -4303 -6638 -6570 -5235 -4085 -3870 -3601 -803 2806 2053
652 2053 1041 5445 9656 5575 -529 -1307 2545 -1892 3120 -4882 -146 -1569 -833 -4646 3763 9487
636 9487 -6311 3250 8932 12300 3320 25725 95778 132457 378952 3187063 7161459 10379721
624A0379721L46197k775895A218527C44604j69058E6471j3976A9212H993l107
614E886M073b020C340K563f404C2a807q54B05c434R31k594j586L257f71C406f59
596d21n40j94n060l121j523L310g41C975j182j208L039J0619j720D178d598P17
580c881F50a270k2b87j93j767l183k843j235a665r97H98M07D66a38m042n86J603
562c163J098n90j277n59J537c22d3j246k074K23J186G35c734i22l038n96d05B22
543c641J670K90L25k6j24n38j159k192k727p90L071b484d31m27j147k611k631
526g247K50K963i65B171J150j153b106n553M88J440K032J506C59J480K85a974
509d640j846J638b325B77a960j719a370f78j761R87k185l619J824J977j826l937
$$ plain form
624 10379721 10725918 7950023 1218527 344604 175546 56471 42495 19212 8993 5886
614 5886 9959 -2020 3340 5903 -6404 32 -1807 -2661 205 -3434 -2503 -5097 -6683 -3426 -671 3406 -659
596 -421 -961 -1155 -6215 -9336 -10859 -7549 -741 3975 2793 1585 4624 15243 13523 4178 -4598 -3881
580 -3881 650 -1270 -1292 -287 -480 -2247 -5430 -8273 -9508 -1665 -2662 898 1305 466 -138 -4180 -4766 -3163
562 -3163 -2065 -2655 -3932 -4491 -2954 -322 -43 -1289 -3363 -3140 -1954 735 -3734 -922 -3960 -4556 -405 222
543 -3641 -1971 -1681 -1356 -1382 -1506 -2044 -3203 -5395 -8122 -8912 -5841 -2484 -431 -858 -2005 -4616 -7247
526 -7247 -6997 -4034 -965 2171 3321 2168 -2106 -7659 -7171 -5731 -3699 -2193 359 1839 2124 -1974
509 -4640 -6486 -4848 -2325 277 -1960 -3679 -1370 -678 -2439 -1452 -3637 -7256 -5432 -3455 -5281 -9218
493i218j464J041L31M23N20J671J175R83q37j208m48K117b440a077n33j987k870
476f467k608l76K43j228j11L242L417a684L50j489k008k877L081L28j276k691
460h266j665K870L249j32C46J147J78g762a854k405j90J518a298l283A860f75
443a207F141N190j83i20j686M74F79e81j703k461d3m448J245A504g3l834l10p83
425e000J68a708k586Qq98k563J618J217P39j722k003l95J627J883Q35L41q26j817
407f250k970k783N794D01P39a367B468M405B834b247e70j901q887d972i35D042
390H896J722D547A92a183j670E723A225d948n879K363c422E77a112r97d59k916
374c375a616n551m299L294K529K78j389j025J717b816e9D868J017p37b285k729
$$ plain form
493 -9218 -10682 -9641 -9310 -8887 -8367 -6696 -5521 -4538 -5375 -6583 -7031 -4914 -2440 -1077 -1610 -3597 -6467
476 -6467 -9075 -9451 -9208 -10436 -10547 -7305 -3888 -1684 -1334 -2823 -4831 -7708 -4627 -4299 -5575 -8266
460 -8266 -9931 -7061 -3812 -3944 346 1493 1671 -7762 -1854 -4259 -4449 -2931 -1298 -4581 1860 -675
443 -1207 6141 11331 11148 -920 -2606 -2132 679 -581 -2284 -4745 -43 -4491 -3246 1504 -73 -3907 -4217 -5000
425 -5000 -4832 -1708 -4294 -4286 -5184 -7747 -6129 -4912 -4173 -5895 -7898 -8293 -6666 -4783 -3948 -3607 -4433 -6250
407 -6250 -9220 -12003 -6209 401 1140 -1367 2468 6873 2834 -2247 -570 -2471 -11358 -4972 -935 4042
390 8896 10618 4547 192 -1183 -2853 5723 1225 -4948 -10827 -8464 -3422 577 -1112 -2109 -459 -3375
374 -3375 -1616 -7167 -11466 -8172 -5643 -5365 -6754 -7779 -6062 -2816 -59 4868 5885 5148 -2285 -5014
358e014h83m157b172l50n86J243D144J080G20d372m661K990h75j816N67Q02k522
341c844J353H89K184C79b966j356j566b645J212E05J68kJ71h8A368a636k889a401
322a891B82l4b212j508m46J99L64Q5N64R91H27J882b883m85A208a290k335k281
304e906k246k281j161N26R73l952p310a0003A20d923A029a147l111l338k720j270
288a1586P44K290L208b257k780b66k461j136F08N93b702J202N72k553k136j751
272g368j180J149L310c28k833e01o68m395a405O73B459J210j458d042o23a28A952
254D232e67B115N395j522A373d52o89m608E00b106l996J021e69l103C039K728
238E767B410B88a688A252c237A802p36c051n347L575K007f02B106P61j235J17
$$ plain form
358 -5014 -883 -5040 -2172 -2522 -3108 -1865 4144 5224 720 -4372 -9033 -6043 -875 -2691 -2124 -1322 -3844
341 -3844 -2491 889 3073 379 -2966 -4322 -5888 -2645 -1433 505 673 671 842 -88 1368 -1636 -4525 -1401
322 -1891 282 248 -2212 -3720 -4166 -3967 -3603 -3518 -2954 -1963 827 2709 -2883 -3368 1208 -1290 -3625 -5906
304 -5906 -8152 -10433 -11594 -11068 -10095 -14047 -21357 -10003 120 -4923 1029 -1147 -4258 -7596 -10316 -11586
288 -11586 -10842 -8552 -5344 -2257 -5037 -266 -2727 -3863 608 1201 -2702 -1500 -928 -3481 -5617 -7368
272 -7368 -8548 -7399 -4089 -328 -3161 -501 -1169 -5564 -1405 -732 2459 3669 2211 -4042 -4665 -128 1952
254 4232 -567 2115 7510 5988 1373 -452 -1141 -5749 500 -2106 -6102 -5081 -569 -3672 3039 5767
238 5767 2410 288 -1688 1252 -3237 1802 1066 -3051 -8398 -4823 -2816 -602 2106 2867 1632 1749
222A749e7k556Q75l4c4F88f52m133N87Q78g80k887M47n50k607L95M64J881m04
203d041j003n22M37J143J242l533b957a430j763j458K101j761l7c2l248J306K04
186a770q565J466c715a6l137j47C35c16l438f62G179j600b53j133B746c300l652
169f952j480m91m13k28j27l48n79j338k273K147M929a521N32A659L737j481j71
152C744a465k202j576P07L05J398b9B067I67J526b287p059k802c852B636A097
135A574k19d677o239j933L816L222b604E94b730l67j097D627N44o74A439a309
118f400m563M56J980k15k495q78N933B75c69o33k136J411L90q66N06k562R51o629
100i937l548M072K199J096L50L09J9J98j59n66l40J660a554l031a171o33B032
$$ plain form
222 1749 -57 -2613 -1738 -1772 -34 688 -652 -4785 -4198 -3320 -780 -3667 -3220 -3770 -6377 -5982 -5518 -3637 -4041
203 -4041 -5044 -5566 -5129 -3986 -2744 -6277 -2957 -1430 -3193 -4651 -2550 -4311 -4348 -32 -3280 -1974 -1770
186 -1770 -10335 -8869 -3715 -16 -3153 -3300 335 -316 -3754 -662 7179 5579 -253 -1386 2746 -3300 -6952
169 -6952 -8432 -8923 -9336 -9564 -9691 -10039 -10618 -11956 -14229 -12082 -7153 -1521 -989 1659 5396 3915 3744
152 3744 -1465 -3667 -5243 -4536 -4231 -2833 -29 2067 967 2493 -2287 -9346 -12148 -3852 2636 1097
135 1574 1355 -4677 -10916 -12849 -9033 -5811 -2604 594 -2730 -3097 -4194 4627 5171 4497 1439 -1309
118 -6400 -10963 -10507 -8527 -8742 -11237 -12115 -6182 275 -369 -1002 -3138 -1727 -1337 -2203 -1697 -4259 -3308 -9937
100 -9937 -13485 -9413 -7214 -6118 -5768 -5459 -5440 -5242 -5401 -5967 -6307 -4647 -1554 -4585 -1171 -1804 2032
82A0195J184B254g89m083J627j778l261j932O16K286L137b85C622j064R63P44
66D265a654D061A934G90e684K427k978m533n46N527g70C191J951c790l98a558
49A515a033l278k064l65K375J955a052l709E44c890o398R69b525K96B622K159
33D781j610A27b6C264n37b410d81B26J513f4m063M04A966p86a595m404m205M543
15e661a275N75F72L537j389b566J123j27k835j757p87J56Q07J931a381
$$ plain form
82 10195 11379 2254 -789 -4872 -3245 -5023 -8284 -10216 -9600 -7314 -4177 -285 3622 2558 3521 4265
66 4265 -1654 4061 1934 790 -5684 -3257 -6235 -10768 -11314 -5787 -770 3191 5142 -3790 -4188 -1558
49 1515 -1033 -4311 -6375 -6740 -4365 -2410 -1052 -4761 544 -3890 -10288 -9319 -2525 -2229 2622 4781
33 4781 3171 127 -26 3264 2727 -2410 -481 226 1739 -64 -4127 -3723 1966 1180 -1595 -5999 -10204 -5661
15 -5661 -1275 -700 672 4209 2820 -2566 -1443 -1570 -4405 -6162 -6949 -6793 -5986 -4055 -1381
##PAGE= F1=1885.978014573
##FIRST=     2903.44365593433, 2615.24460078534, -7454
##DATA TABLE= (F2++(Y..Y)), PROFILE
1023g454l449m712l532M704c246B145j19D47F9g22j608A008d12E58c688a447K0
1006a427A447j90a0401j6298a0774e71H68c477C542H67c103j5325m697Q664O157
991h304M151A90J189a118C117J22g89m247K409j456f81k221j423a458C50a685
974c827n702p027p212j96O481M594J147j575k573k054j122m23J566M762O228a532
957A760N43a41n359p694q789o861O357K393j180p00O652f014A229P83e99k605
941c204o734o027l297l77L390O392c405A24b60m197n307l223J63L196c781i33
924A67b342r31a465k702B069A14d068j655b128F574L607R73f89l004R82e9B967
906d05j5630j0466Q141M518M09n29J248K137N16k164l671j846K823N964c308J444
$$ plain form
1023 -7454 -10903 -15615 -19147 -14443 -3246 2145 2026 447 69 -722 -2330 1008 -412 558 -3688 -1447 -1427
1006 -1427 1447 1257 -10401 -26699 -10774 -571 868 -3477 3542 867 -3103 -18428 -23125 -14461 -8304
991 -8304 -4153 190 1379 -1118 3117 3239 -789 -5036 -2627 -4083 -681 -2902 -4325 -1458 350 -1685
974 -3827 -9529 -16556 -23768 -23964 -17483 -12889 -11742 -13317 -15890 -17944 -19066 -19489 -17923 -13161 -6933 -1532
957 1760 2303 -141 -5500 -13194 -21983 -28844 -22487 -20094 -21274 -21974 -15322 -6014 1229 2012 -599 -3204
941 -3204 -9938 -15965 -19262 -19639 -16249 -9857 -3405 124 -260 -4457 -9764 -12987 -12824 -9628 -3781 -933
924 167 -2342 -3273 -1465 -4167 2069 114 -4068 -5723 -2128 6574 10181 11154 -689 -3693 -2711 -59 2967
906 -405 -16035 -26501 -18360 -13842 -13433 -13962 -12714 -10577 -10061 -12225 -15896 -17742 -14919 -8955 -3308 -1864
890a864m02j389M30A802N195a022q924j686M040c777P74k934o341q529O23f852
873E172k257I9Q138k727K889k571d062r230n226J592L481J534m54j041m4K06N6
856a3188K641c656A974L639f06k504R31j793b54n94A199L669A434a2288j2203
841b4491n2M571K850M195N288L197j695o945o018Q728b481C829K188c54l138a573
824d560m242c120m22J735B89K492i477j4946N843h208b502J233j501r93a39n75
808g14j896a18F799L117q38A721d403J88a044k236f8j09j161B748g771q392k350
791a8513N768e023H54L035p7d321a251D508L781l849A6b143J68C38J91J802L253
774E584j956j6a155l135K048k071J963j141J527G80b604k376B553Q034L95B196
$$ plain form
890 -1864 -2266 -3655 -3225 1802 6997 -1022 -9946 -11632 -7592 -3777 -3003 -5937 -12278 -20807 -20184 -6852
873 5172 2915 99 8237 5510 8399 5828 -4062 -13292 -18518 -16926 -13445 -11911 -12365 -13406 -13450 -13244 -13188
856 -13188 -10547 -3656 1974 5613 -606 -3110 -2179 -3972 -254 -848 1199 4868 1434 -12288 -24491
841 -24491 -24543 -19972 -17122 -12927 -7639 -4442 -6137 -13082 -19100 -10372 -2481 3829 6017 -354 -3492 -1573
824 -4560 -8802 -3120 -3542 -1807 289 2781 -9477 -24423 -18580 -8208 -2502 -1269 -2770 -3763 -139 -714
808 -714 -2610 -118 6799 9916 9078 1721 -4403 -4215 -1044 -3280 -68 -177 -1338 2748 -7771 -16163 -18513
791 -18513 -12745 -5023 854 3889 3812 -4321 -1251 4508 8289 4440 16 -2143 -1975 338 529 2331 5584
774 5584 3628 3612 -1155 -4290 -2242 -4313 -2350 -3491 -1964 780 -2604 -4980 2553 10587 10982 2196
757f760p199n007J165O100N783b584j342K43k29a356j649c57A177i19I10b446
740c934F80c430A515J615C22c374l241c68E325k148d73a71n535A044n05O8g58
722a411r62j1159r060m722N741L720K709K745M300b271B79c651O00N91K98j370
706c532a473A072d82G31d974p015k504M184c952Q72j113B759c77n667a573l239
690d812k317j378k413j614j335l016m073l746O880f857A045K102K168k176N29
675C668n66e181D25b813p889l562R62K607K112L391J224n081l201L481L807Q55
659d107H62c016k006Q36j87r577o984i119b940j1805K916j4847g066l15p081D663
642f184K835B301a9761E215B542J9287D634P037K63J0703K5483K8282J58563J50485
$$ plain form
757 -6760 -13959 -18966 -17801 -11701 -5918 -2584 -3926 -3683 -3912 -1356 -3005 -357 1177 -919 910 -2446
740 -3934 680 -3430 1515 3130 322 -3374 -6615 -368 5325 3177 -473 -171 -5706 1044 539 607 -758
722 -1411 -2373 -13532 -22592 -27314 -21573 -17853 -15144 -12399 -8099 -2271 279 -3651 -3051 -2460 -2162 -3532
706 -3532 -1473 1072 -482 731 -4974 -11989 -14493 -10309 -3952 -3080 -4193 2759 -377 -6044 -1573 -4812
690 -4812 -7129 -8507 -10920 -12534 -13869 -16885 -20958 -24704 -17824 -6857 1045 3147 5315 3139 3668
675 3668 3102 -5181 425 -2813 -10702 -14264 -13302 -10695 -8583 -5192 -3968 -9049 -12250 -8769 -4962 -4107
659 -4107 862 -3016 -5022 -4186 -4373 -13950 -20934 -9119 -2940 -14745 -11829 -26676 -7066 -7381 -14462 4663
642 -6184 -3349 2301 -19761 5215 2542 21829 4634 11671 11934 22637 48120 76402 234965 385450
628C85450O57968O118041L7101832K2014555M460474j6225297C772069A004403
619D06945A31974j1832D9388j7882Q56Q527F862f582A0867a774A4246B018a39
605b649n034L440J358k2187a1710r549j180d037c68k703I03C63M802J431B475
589F13j07K32M86L385P518N62C163b949h95B876g80k487M77j264Q32n36p01l997
571h456d159J821R19k627l767p75J001J923K809J282n02l40k261k260j707k653
555a1296j907j254j948j390k026k244j748M71K704K528J354j697l547m052j077
540b7129K669K380M176O810c788J640A503b068p59q462n374N181b309r62a004
524b206R37D040K744B865a701l62i89k829j364K448E00K600N84b006i7C448A46
$$ plain form
628 385450 1043418 7161459 44263291 66277846 70738320 54513023 3772069 1004403
619 406945 131974 120142 49388 31506 32362 40889 6862 -6582 10867 -1774 14246 2018 -139
605 -2649 -7683 -4243 -2885 -25072 -11710 -21259 -22439 -4037 -368 -3071 903 363 5165 6596 2475
589 613 506 738 1224 4609 12127 12689 3163 -2949 -895 2876 -780 -3267 -2790 -4054 -3222 -3758 -4459 -8456
571 -8456 -4159 -2338 -1419 -4046 -7813 -8588 -7587 -5664 -2855 -1573 -2075 -2415 -4676 -6936 -8643 -11296
555 -11296 -13203 -14457 -16405 -17795 -19821 -22065 -23813 -23342 -20638 -18110 -16756 -18453 -22000 -26052 -27129
540 -27129 -24460 -22080 -17904 -11094 -3788 -2148 1503 -2068 -2827 -11289 -16663 -11482 -2309 -3271 -1004
524 -2206 -1269 4040 6784 2865 -1701 -2063 -989 -3818 -5182 -2734 500 3100 3684 -2006 -97 3448 146
506b803C502b632j753k711r530o576m522L436N154L576J427J335K742M288f11
490D858b372j129j820J191p77A753d17A956l3B36J909a355k732o80f46o11A483
472G5f227J251a119G205k210a77l309n513n052n800j386R18j199l560l438K690
456b5826K327K489O500P116F221L855B862d32A243c632F349D94b809D555N525
441A0080l50a173p27l86j4929r877a3324d495a77k225j522f41n98k602a598A880
424c693a568j523r55a701m177K787q52A860i50r936r193n684J168K133J025Q35
408b0602M68j54o9O94J71l004m809J2587B223J098b428a011C982F94a1024j0523
392b1547D4P287K834l120B721f005n572k874n876j776f260l58b106A89f7k135
$$ plain form
506 -2803 3502 -2632 -4385 -7096 -16626 -23202 -27724 -24288 -19134 -15558 -14131 -12796 -10054 -5766 -611
490 4858 -2372 -3501 -5321 -4130 -4907 1753 -417 1956 1923 236 2145 -1355 -4087 -4767 -646 -1257 1483
472 75 -6227 -4976 -1119 7205 4995 -177 -3486 -8999 -14051 -19851 -21237 -20319 -21518 -25078 -28516 -25826
456 -25826 -23499 -21010 -14510 -7394 6221 10076 2862 -432 1243 -3632 6349 494 -2809 4555 10080
441 10080 9730 -1173 -1900 -2286 -17215 -27092 -13324 -4495 -177 -2402 -3924 -641 -1239 -3841 -1598 1880
424 -3693 -1568 -3091 -4046 -1701 -5878 -3091 -3943 1860 -950 -10886 -20079 -25763 -24595 -22462 -21437 -20602
408 -20602 -20134 -20288 -20357 -19663 -19492 -22496 -27305 -14718 2223 3321 -2428 -1011 3982 694 -11024 -21547
392 -21547 44 7331 10165 7045 2721 -6005 -11577 -14451 -20327 -22103 -6260 -6618 -2106 189 -67 -2202
376b202f98l453E291K864c373j1687j0589N585R636d500B821a190J36C725J35
361C860k70b300l329b295j877b045k409o113m912j042K481K425L01j878l882l648
345b0722j432J094J985L267M433M882a510F92a786B294J088D52r6L717L86k175
329B284j134O74J4a309k534a804j209f91F795A544g242n787k860r11k69J672N083
312a0314c807A669b350O84A428M143a653E90J984e101n614q57L691r356o556i275
295c969r04k47K262A806K836j423a773l424e35j718J84j316a329j103j757b57
278b35l155a564d58q2r07l073B39J804L46a93k554A386a852l099K083a283N87
261f96k612k219j481J213i61A339M943A710K04c86q795m395K224L212O91j514
$$ plain form
376 -2202 -698 -4151 5291 8155 -3373 -15060 -25649 -20064 -10428 -4500 2821 -1190 -1054 3725 3860
361 3860 3590 -2300 -5629 -2295 -4172 -2045 -4454 -10567 -15479 -16521 -14040 -11615 -11314 -13192 -17074 -20722
345 -20722 -22154 -21060 -19075 -15808 -11375 -6493 -1510 692 -1786 2294 3382 452 356 4073 4459 2284
329 2284 1150 1824 1838 -1309 -3843 -1804 -3013 -691 6795 1544 -7242 -13029 -15889 -16800 -17069 -15397 -10314
312 -10314 -3807 1669 -2350 -1666 1428 5571 -1653 590 2574 -5101 -10715 -11572 -7881 -17237 -23793 -9275
295 -3969 -4873 -5120 -2858 1806 4642 3219 -1773 -5197 -535 -2253 -2069 -3385 -1329 -2432 -4189 -257
278 -235 -3390 -1564 -458 -540 -1447 -4520 239 2043 2389 -193 -2747 1386 -1852 -4951 -2868 -1283 -696
261 -696 -3308 -5527 -7008 -5795 -961 1339 6282 1710 1914 -386 -9181 -13576 -11352 -8140 -7449 -8963
245h963n54L288K781a243l143A708K973A558a805j2772N987c147A224o7J85B80
228a5887j305a595C012K93A154J030g30j044g53j2714j3160O521R906c081n43
213c624J510K38n680q032r005L545R817b582E5h9l498K40A193P997m518e755b072
195B499p95b387n164l7L605A709a956G16a377k710J348j929K71j669l549k7a889
177c484R42E603r90e274j4173K00Q426L785j091j487K597a932A368m93b845n034
161g879k935J212L843h66j13B185M40c319o717l52M580b530k099O58M56n043K64
144h294c859d06l4l618o622q118p810j567L503K255K978M851M871L018K24k338
128h813l573l008j707Q06M245e148B150b150A016b061A431a60j003k186a082A128
$$ plain form
245 -8963 -9517 -6229 -3448 -1243 -4386 1708 4681 1558 -1805 -14577 -8590 -3147 1224 1157 1342 280
228 -15887 -17192 -1595 3012 3305 1154 2184 -730 -1774 -753 -13467 -26627 -20106 -10200 -3081 -3624
213 -3624 -2114 -1876 -7556 -15588 -24593 -21048 -11231 -2582 55 -89 -3587 -3347 1193 9190 4672 -5755 -2072
195 2499 1704 -2387 -7551 -7588 -3983 1709 -1956 716 -1377 -4087 -2739 -4668 -4397 -6066 -9615 -9642 -1889
177 -3484 -2542 5603 4613 -5274 -19447 -19247 -10821 -7036 -8127 -9614 -7017 -1932 1368 875 -2845 -7879
161 -7879 -10814 -9602 -5759 -866 -979 2185 2625 -3319 -10036 -10388 -5808 -2530 -4629 -3971 -3515 -8558 -8294
144 -8294 -3859 -406 -440 -4058 -10680 -18798 -26608 -28175 -24672 -22417 -19439 -14588 -9717 -6699 -6475 -8813
128 -8813 -12386 -15394 -17101 -16295 -12050 -5148 2150 -2150 1016 -2061 1431 -160 -1163 -3349 -1082 1128
111F337L05A16c45j630R86l48j604a370l470b120N85n015k411J97K227K618a887
93a624k013n13n33J812c78A012a035k013M86A410D74g452p832o395l751q74K020
76b4284L691L481J603j791m249J489i419B767J677Q76b405B186N691I78e537a700
59b647k484N51J182C519N998l902c567j499a842B959M9e691J760n191j4441l255
43b6818J0259N905K931L535J589M33k755n06e79C497J438k30k049J754j98E00
26e024j1960j910g660L664j353D056N313C451f728j3273k799h126a540L89D345
10C059a518j586j0668o778K315O334N164K260j06j996
0f579
$$ plain form
111 6337 6642 116 -345 -1975 -989 -1337 -2941 -1370 -4840 -2120 -1535 -6550 -8961 -8764 -6537 -3919 -1887
93 -1624 -3637 -4150 -4683 -2871 -378 1012 -1035 -3048 -2562 1410 474 -7452 -15284 -21679 -25430 -26304 -24284
76 -24284 -20593 -17112 -15509 -17300 -21549 -20060 -9419 2767 4444 5320 -2405 2186 7877 978 -5537 -1700
59 -2647 -5131 -4580 -3398 3519 9517 5615 -3567 -5066 -1842 2959 3008 -5691 -3931 -9122 -23563 -26818
43 -26818 -16559 -10654 -7723 -4188 -2599 -2166 -4921 -5427 -579 3497 4935 4705 2656 4410 4212 500
26 -5024 -16984 -18894 -7660 -3996 -5349 4056 9369 3451 -6728 -20001 -22800 -8126 -1540 -1151 4345
10 3059 -1518 -3104 -13772 -20550 -18235 -11901 -6737 -4477 -4583 -6579
0 -6579
##PAGE= F1=1883.421568238
##FIRST=     2903.44365593433, 2615.24460078534, -10229
##DATA TABLE= (F2++(Y..Y)), PROFILE
1023a0229l270r564j5328j3318P542a7012A713E46o3e28k145j3973f93E54b358
1007a115q98A330O20d2373l0978b8712a906O87k227E669B156a3696l7113q49K2107
992b9551J4770O751b335A439J356M079C107b661j615o2J634i31l614N51a337A154
975a31k126j5172j8805k0505j8351l086J1791J2723J2753J1723Q788O119O574
962g705H20P52P67J746A429d82j0951j4411j1233q048m537j377j230k439R52J1764
946d1992J8406g892h36l998j3301j6477j1550l254m00k109j858J584K746O23k263
931e1093j749L127J0776J9247A846a167j43q25L23j088k559A860m37e573j3420
916a8993g069C953N784K332A416e420J864g46k169l4538k8505K365J4310R235
$$ plain form
1023 -10229 -13499 -23063 -38391 -51709 -44167 -17012 1713 546 483 -528 -2673 -16646 -693 554 -2358
1007 -1115 -2013 1330 1950 -42373 -73351 -28712 -1906 -1219 -3446 5669 2156 -13696 -50809 -51658 -29551
992 -29551 -14781 -8030 -2335 1439 2795 6874 3107 -2661 -4276 -4338 -2704 -931 -4545 -3994 -1337 1154
975 -131 -2257 -17429 -36234 -56739 -75090 -78176 -66385 -53662 -40909 -29186 -20398 -14279 -7705
962 -7705 820 1572 2339 4085 1429 -482 -11433 -25844 -37077 -45125 -49662 -51039 -52269 -54708 -53756 -41992
946 -41992 -23586 -7892 -836 -4834 -18135 -34612 -46162 -49416 -49816 -51925 -53783 -52199 -49453 -48830 -51093
931 -51093 -52842 -49715 -38939 -19692 1846 -1167 -1310 -2135 -1812 -2900 -5459 1860 1423 -5573 -18993
916 -18993 -7069 3953 9737 12069 1416 -5420 -3556 -746 -2915 -37453 -65958 -63593 -49283 -40048
902d0048P311Q214O100q03r737j6468j3602R603b3132b277j175a677K85m81j539
887c412g18E622B065M685k594e271r698j3620j9148k4532L458c3032C725L337
873G062C301a097E729n18O007L205c521l5509l1149N21J4124N322O43J500J932
858d6137k231k403J3783i683B323N712A045c135a567k031f79C73J798J364a2752
842d6642l1648J2913J2996L760J186K535k005j4204j3628c5923B929a299B566
828D562a102k150o95A171R567l289c693i76G71K687f915k3771j036J1214P348
813a3160j016n978k8a634B3b783Q77G598L678j411A170d738N6a143k678a764K03
796a561L13j6813j2891N473L540k072j986M72k39j941M047f258E122L831D367
$$ plain form
902 -40048 -32737 -24523 -18423 -19226 -28963 -45431 -59033 -49430 -23132 -2277 -3452 -1677 -1392 -1873 -3412
887 -3412 -718 5622 2065 6750 4156 -5271 -14969 -28589 -47737 -72269 -68811 -33032 3725 7062
873 7062 3301 -1097 5729 5211 11218 14423 -3521 -39030 -70179 -69658 -55534 -50212 -49569 -48069 -46137
858 -46137 -48368 -50771 -36988 -9683 2323 8035 1045 -3135 -1567 -3598 -679 373 2171 3535 -12752
842 -46642 -78290 -65377 -52381 -48621 -47435 -44900 -46905 -61109 -74737 -35923 2929 -1299 2566
828 4562 -1102 -3252 -3947 1171 10738 7449 -3693 -976 771 3458 -6915 -30686 -31722 -20508 -13160
813 -13160 -14176 -20154 -20182 -1634 23 -2783 -1906 7598 11276 9865 1170 -4738 -4682 -1143 -3821 -1764 -1561
796 -1561 -1248 -18061 -30952 -25479 -21939 -24011 -25997 -25525 -25764 -27705 -23658 -6258 5122 8953 4367
780d18j784q02N64f86B202K838K87K591B455b495J172m852a048j89A29R93b921
762b767D910O956n6E094a4164k3938j6413r365l298k588l935Q168J7323J9512
748b8698h748c837a90B366F24b54l273j092a251k037B206K70i55l593k0135k4334
732d9017O585J0906a5303a487k845A935k26M32E53K494K81a3782j8889k812J2609
717b2874f169C234b946e56E786c047j3405j0286n864K65P653J1138f072K053m696
702h715j3652j3440o895J114Q077L972J143n09o815q602p580j1729r638j235N484
687f9020N867J49N887Q149J0941a5728A283M95K376J978j267P4j074d496E50e74
670i45j26k90p756j4999k473j1685k2913q988J8144J8982J745a2133N168o174
$$ plain form
780 -418 -2202 -3004 -2440 -686 2202 5040 5327 7918 2455 -2495 -1323 -6175 -1048 -1237 129 1122 -2921
762 -2767 4910 11866 11810 5094 -14164 -38102 -54515 -63880 -67178 -69766 -73701 -65533 -48210 -28698
748 -28698 -8748 -3837 -190 2366 624 -254 -3527 -4619 -1251 -3288 2206 2476 -955 -4548 -24683 -49017
732 -49017 -42432 -31526 -15303 -1487 -4332 1935 1709 2141 553 3047 3328 -13782 -32671 -35483 -22874
717 -22874 -6169 3234 -2946 -556 5786 -3047 -16452 -26738 -32602 -32337 -24684 -13546 -6072 -4019 -8715
702 -8715 -22367 -35807 -42702 -41588 -33511 -29539 -28396 -28905 -35720 -44322 -51902 -63631 -73269 -74504 -69020
687 -69020 -63153 -63004 -57117 -48968 -38027 -15728 1283 1778 4154 6132 4865 4939 3865 -4496 550 -574
670 -945 -1071 -1361 -9117 -24116 -26589 -38274 -61187 -70175 -52031 -33049 -31304 -12133 -6965 -13139
656a3139d193J188m018k505k337j1329e750D090b4103b752h60m1017F087e785
641a199C270a4931H917d855B1766E173R762j278J7666K8194P4893K28469K72438
628F35317J026247Q718157N5898125J84312297K2665302H6938082F383780A736333
619E98962B12788l5008H8445j7856k2758j772A8025p299L141c520A4302a9149
606A512d172j050a374O3j7924A137f267j9713b901B45d314e16C20e074G701l769
590C932b8326j1630j2870j4068n252J5546K3799J2100c187A847C51c098j173p27
576d998b49E330k230e503k679J867b148j459Q76j2555m389m748p128j297k965
561c5813n453k683r058j0362n476Q02R154M665M402L924j953l995o922n461J0512
$$ plain form
656 -13139 -4193 -3005 -7023 -9528 -11865 -23194 -5750 4090 -24103 -2752 -860 -41877 6087 -5785
641 -1199 3270 -14931 8917 -4855 21766 5173 14935 13657 31323 59517 134410 362879 635317
628 635317 1661564 10379721 66277846 250590143 273255445 86938082 6383780 1736333
619 598962 212788 177780 88445 70589 47831 46059 18025 10726 13867 -3520 14302 -19149
606 1512 -4172 -5222 -1374 -1311 -19235 1137 -6267 -25980 -2901 245 -4314 -516 320 -5074 7701 3932
590 3932 -28326 -39956 -52826 -66894 -72146 -56600 -32801 -20701 -3187 1847 351 -3098 -4271 -4998
576 -4998 -249 5330 3100 -5503 -8182 -6315 -2148 -3607 -2731 -15286 -19675 -24423 -31551 -32848 -35813
561 -35813 -41266 -43949 -53007 -63369 -68845 -68043 -58889 -54224 -49822 -45898 -47851 -51846 -58768 -64229 -53717
546e3717J2273J2166Q112J955J35j086k753O9P218a807A97a548A698b374c16l573
530c889k3601o884J5128c235a607k688F93K854k30D55b813J47a8j903l121K406
514b636F43L973J116a103K87C396j461c747B529c609P6B99Q75G3a6210k7889k6969
497g1068J295J5744J0589O927N998Q858f034k328L686J263b29n435b344m32B866
481E094A351M209P79q86K500A833h69H92f79o267K46b465F326B642b855K25m383
464g013j1570j7289q430j863l900p044j226Q240P781J054J913J8633A1473j817
450I656F57a062C476b113F411A953c630I78N999L93a698l77k1449j6664L869R923
434b6396P002N040e727K780a267M64j555M93D008a938i8j364j534a440m235b044
$$ plain form
546 -53717 -41444 -29278 -21166 -19211 -19076 -20162 -22915 -22846 -15628 -1807 197 -1548 1698 -2374 -316 -3889
530 -3889 -27490 -34374 -19246 -3235 -1607 -4295 693 3547 3317 455 -2813 -2666 -18 -1921 -5042 -2636
514 -2636 643 4616 5732 -1103 -816 3396 1935 -3747 2529 -3609 -3533 299 1174 73 -16210 -44099 -71068
497 -71068 -69773 -54029 -43440 -36513 -30515 -21657 -6034 -8362 -4676 -3413 -229 -5664 -2344 -2776 2866
481 5094 1351 5560 6339 5453 7953 1833 -869 892 -679 -6946 -6700 -2465 6326 2642 -2855 -2630 -7013
464 -7013 -18583 -35872 -44302 -46165 -50065 -57109 -58335 -50095 -42314 -41260 -39347 -20714 11473 9656
450 9656 657 -1062 3476 -2113 6411 1953 -3630 978 6977 7370 -1698 -2075 -23524 -40188 -36319 -26396
434 -26396 -19394 -14354 -5727 -2947 -1267 -803 -2358 -1865 4008 -1938 -98 -1462 -2996 -1440 -5675 -2044
417b290B777L5b9432l9235j282J5259N371J259J067l616j3441r16b5358A822O87
402B509A123R48M567k868b796J297C524m09L144b1719k7398k403J0034R92o450
387d6944l148J800m378j7745j869b9905e961J421b52A152a608f92n014C756M811
372H567a9167l5882k4120K4805K4006a1876B416b83j896C303r81q00b598l616
358f214b940Q05P54m808k4322k4540J249J8766J6221O971l406j2248j5704j4171
344e7373r178Q36J5838K3777e97E376F69f65D164O49k359r86a068G295C458A048
327B812A385a757r53N81l210a201E246a6961k1962j3282m490j99j851l800L24
312f2221P454Q613M956K698P338J4174b076B67N981e118j7061j6434r759k973
$$ plain form
417 -2290 2777 2812 -29432 -68667 -69949 -54690 -49319 -48060 -46993 -50609 -64050 -64966 -25358 1822 2509
402 2509 1123 2071 6638 3770 -2796 -1499 3524 3115 6259 -21719 -49117 -51520 -41486 -40494 -46944
387 -46944 -50092 -48292 -52670 -70415 -72284 -29905 -5961 -4540 -252 1152 -1608 -692 -5706 3756 8567
372 8567 -19167 -55049 -79169 -54364 -30358 -11876 2416 -283 -2179 3303 2322 1522 -2598 -6214
358 -6214 -2940 -2135 -1381 -6189 -30511 -55051 -53802 -35036 -18815 -11844 -15250 -27498 -43202 -57373
344 -57373 -66551 -65715 -49877 -26100 -597 5376 669 -665 4164 4813 2454 1468 -1068 7295 3458 1048
327 2812 1385 -1757 -2710 -2129 -5339 -1201 5246 -16961 -38923 -52205 -56695 -56894 -58745 -62545 -62221
312 -62221 -54767 -46154 -41198 -38500 -31162 -16988 -2076 267 6248 -5118 -22179 -38613 -48372 -51345
298e1345k21J859M559O828Q803J2213b303C732r91a111m218e2m326K48M94m401
282h037j0406j4096j2749n032N594J1705J2880i046a681m131C817O708B869a527
267a681B782b595j247M17g60A179K649g087j0539n467j021m048j4632k7632rc1089
250A710L222h94k081k0606l4467O88a8628c292N04k735I1K766E2a4510q361e46
233c563A74L60J387c0122k9996R992b2150e2C140C94J284a766j0301j8886k1050
218e2003j5578J0120K2161a4341h51N2K33o417k0756k2096k869K1061h554c544
203c495K87j774f72C132a8932k2175m914J1880Q537Q97N930e276K007B941a164
187D189C19b892J378m204j1692j8191k7384K587a7858c578O5C898p21b262m3332
$$ plain form
298 -51345 -51566 -49707 -45148 -38320 -29517 -17304 -2303 3732 2741 -1111 -5329 -52 -4378 -4130 -3636 -8037
282 -8037 -18443 -32539 -45288 -50320 -44726 -33021 -20141 -9046 -1681 -5812 3817 10525 2869 -1527
267 -1681 2782 -2595 -3842 -3425 -760 1179 3828 -7087 -17626 -23093 -24114 -28162 -42794 -70426 -70435 -31089
250 1710 4932 -894 -2975 -23581 -58048 -57360 -18628 -3292 -2788 -5523 91 2857 52 -14510 -22871 -546
233 -3563 174 534 1921 -30122 -60118 -50126 -22150 -52 3140 394 1678 -1766 -12067 -30953 -52003
218 -52003 -67581 -57461 -35300 -14341 -851 -799 -566 -6983 -27739 -49835 -52704 -31643 -8554 -3544
203 -3495 -3208 -4982 -672 3132 -18932 -41107 -46021 -34141 -25604 -24707 -18777 -5276 -3269 2941 -1164
187 4189 319 -2892 -1514 -5718 -17410 -35601 -62985 -60398 -17858 -3578 -3513 3898 3177 -2262 -45594
172d5594l7129K2844J7625N329K328J0435e830B861J558L472q33g12E3K707a055
156a233A925a1587k3720k5077j4220J2835J4510P690J354r11L097J0087a1892
142A226K730a409C575r92d638r917q207k802M034J0023a132o90G89c03B967L091
126F058A6a194B320K468K980a647m17k567A399m48b298j118J406g91C709J468
110E177i46G97d76j85j523j533a580l051a274ap14F049k794d065C762J040q60
93C942c143I50J519a333E64K195m09b696r07C62L924A994h594j4268j0964n202
77c9028N7J198j767p161j3834j4234J5537K9334a865D860J850a802K30E889H45
61e046A03c95r922j5800k685P510M001q405j9918q391b4440C298R39b975k99k467
$$ plain form
172 -45594 -82723 -59879 -42254 -36925 -34597 -24162 -5830 2861 4419 7891 7058 -712 53 2760 -1055
156 -1233 1925 -11587 -35307 -60384 -74604 -61769 -47259 -39569 -38215 -39126 -36029 -25942 -11892
142 1226 3956 -1409 3575 2583 -4638 -14555 -22762 -25564 -21530 -11507 -1132 -1822 789 -303 2967 6058
126 6058 16 -1194 2320 4788 7768 -1647 -2064 -4631 1399 951 -2298 -3416 -2010 -791 3709 5177
110 5177 -946 797 -476 -661 -2184 -3717 -1580 -4631 -1274 -1 -715 6049 3255 -4065 3762 4802 3942
93 3942 -3143 950 2469 -1333 564 2759 2350 -2696 -3603 362 4286 1994 -8594 -22862 -33826 -39028
77 -39028 -38971 -37773 -39540 -46701 -60535 -74769 -59232 -29898 -1865 4860 6710 -1802 -1572 5889 845
61 -5046 103 -395 -10317 -26117 -28802 -21292 -17291 -25696 -45614 -54005 -24440 3298 4237 -2975 -3274 -5741
45e741m4874l1156L8799a6797b140C862H33l82f654N37J958B178K050j39q99J748
29D938r64a4463k7496j0880b4975a203k755j190D03M710B052f719l0151k0933
15e7803J4650a7549c258C636j172c874j7370j9323j2505K662J1674J1979R103
2a7654O626M003
0g025
$$ plain form
45 -5741 -50615 -81771 -42972 -16797 -2140 3862 833 451 -6654 -6117 -4159 2178 4228 4089 3190 4938
29 4938 3974 -14463 -41959 -52839 -24975 -1203 -3958 -5148 403 5113 2052 -6719 -36870 -57803
15 -57803 -43153 -17549 -3258 3636 2464 -3874 -21244 -40567 -53072 -50410 -38736 -26757 -17654
2 -17654 -11028 -7025
0 -7025
##PAGE= F1=1880.865121903
##FIRST=     2903.44365593433, 2615.24460078534, 648
##DATA TABLE= (F2++(Y..Y)), PROFILE
1023F48k89i484k2480k7944o165c2765H13F7J133D16a3681j9279a0944A88a126
1007b33k046A120J138c1751l8395K6085b927n27a276G474C284b1791m2918l283
993f7992K9162a9127h515a94A469N675K805B900c965a252j139i48M65k784O96
978b571a14A784p57e163n582j6578j7860j6309q548N855J6597J9983i521M042
964e479J435a643C98R14K155M12a756k284m021j6276j0148o391n090l888l105
949e2959l047j074P513J5743J5468Q234k351j1667j4760r601j966o10m605p400
935f3082m851l3K115K362N519J1312J7056g410C40b47k5m30J93k871m05A590P86
918B376c794q970N984B158O301L520C465e176J014a442j7299l0376k5060l310
$$ plain form
1023 648 359 -9484 -31964 -59908 -66073 -32765 813 67 1200 416 -13681 -32960 -10944 188 -1126
1007 -233 -2279 1120 2258 -31751 -70146 -44061 -2927 -3454 -1276 7474 3284 -21791 -64709 -67992
993 -67992 -38830 -19127 -8515 -194 1469 7144 9949 2900 -3965 -1252 -2391 -948 -483 -3267 -2571
978 -2571 -114 1784 1027 -5163 -10745 -27323 -45183 -61492 -70040 -64185 -47588 -27605 -9521 -5479
964 -5479 -4044 -1643 398 1312 3467 3879 -1756 -4040 -8061 -24337 -34485 -40876 -45966 -49854 -52959
949 -52959 -56006 -57080 -49567 -33824 -18356 -10122 -12473 -24140 -38900 -48501 -50467 -51077 -55682 -63082
935 -63082 -67933 -67966 -65851 -63489 -57970 -46658 -29602 -7410 340 -247 -272 -702 -509 -3380 -3785 1590 2376
918 2376 -3794 -12764 -6780 2158 8459 11979 3465 -5176 -4162 -1442 -18741 -49117 -74177 -77487
904g7487J2179J2182J1913J1107O084l148j3424k0003j0794K0347a7231b700m10
891c110a122c83Q2l597J022C751j6L982N760i15j2754k2254k7716j9699K6006
876e7332a8705E915K846C316a479B773J453Q834L388e786m4351l6900Q602J4690
862f3745M379J746N025L774m741r258J2109a7268A969P353A619c776h54j231P83
847a302A096J598I85a9130l2806l1488o990J3152L091q64k13m968j6062K8077
833f8201b7580D332D98j0J702a320l74j587J093A0560r73c970A91J206K372j191
817B578i743j8274r160m711n268l328J0594a0647E82b236j685G750L708k117a32
801f012J236a043j960k13P60h11l3933o117Q326N86q466q268j752o23m426J773
$$ plain form
904 -77487 -65308 -53126 -41213 -30106 -24022 -27170 -40594 -60597 -71391 -51044 -17231 -2700 -3110
891 -3110 -1122 -383 -301 -3898 -2876 3751 3735 7717 13477 -915 -13669 -35923 -63639 -83338 -57332
876 -57332 -18705 5915 8761 3316 -1479 2773 4226 13060 16448 -5786 -50137 -87037 -78435 -63745
862 -63745 -59366 -57620 -52595 -48821 -53562 -62820 -50711 -17268 1969 9322 1619 -3776 -854 -2085 -1302
847 -1302 1096 2694 985 -19130 -51936 -83424 -90414 -77262 -74171 -75035 -75248 -80216 -96278 -68201
833 -68201 -27580 4332 498 488 2190 -1320 -1694 -3281 -2188 10560 9587 -3970 191 1397 3769 2578
817 2578 -9743 -28017 -37177 -41888 -47156 -50484 -39890 -10647 582 -2236 -3921 7750 11458 9341 -132
801 -6012 -4776 -1043 -3003 -3216 -2456 -811 -34744 -40861 -32535 -31949 -40415 -48683 -50435 -51058 -55484 -53711
785e3711J9941e215G370B738a101j519j245j341b237A567J855K455O57c835M46
770c389a559l021A828m58o4m73c269a75F197N198p38n016a0866k4694j5799q870
754f0229l749r92J226O786J2281J4759a4186d367h67B010q24a068l614j729b192
738a803A480C48c137k48m0987k0082O582Q377J9549a878k410A456O03K42q47M359
722E813j435B014b3880j0975J2389a059B163c191B91L830a5405j8387r775r68
708d4535L434O714Q157L559j903o591j3398j0188j648L239O752O82l184m720j1048
693f4678j1939r173K925J3519Q450R406O479j67M510N804O933i998b45A635K752
678D387J893n48l08j617c779E67b835j0141LN451j0902j1122J463j2023j4810
$$ plain form
785 -53711 -33770 -5215 7370 2738 -1101 -2620 -3865 -5206 -2237 1567 3422 5877 6534 -3835 -3389
770 -3389 -1559 -4580 1828 1370 1306 833 -3269 -175 6197 11395 10657 5641 -10866 -35560 -51359 -60229
754 -60229 -63978 -64970 -63744 -56958 -44677 -29918 -14186 -4367 -867 2010 1186 -1068 -4682 -6411 -2192
738 -1803 1480 348 -3137 -3385 -44372 -64454 -57872 -49495 -29946 -1878 -4288 1456 2059 2301 1454 5813
722 5813 4378 2014 -23880 -34855 -22466 -1059 2163 -3191 291 4121 -15405 -33792 -43567 -44535
708 -44535 -41101 -34387 -26230 -22671 -24574 -31165 -44563 -54751 -56399 -53160 -46408 -45726 -48910 -53630 -64678
693 -64678 -76617 -85790 -82865 -69346 -60896 -51490 -45011 -45178 -40668 -34864 -27931 -9998 -245 1635 4387
678 4387 6280 5732 5424 3807 -3779 567 -2835 -12976 -12973 -7522 -18424 -29546 -28083 -40106 -54916
663e4916n359j7966J7689J1730a9213L589l397a431B50e061a175k897k7831b513
648B801b1646a22k634m6600F432e856I642C857a7989A1315a5861A9962C502J2711
634A6213l043K1809K6175J07521K30268L24363J109154Q893458O0012402K02517125
624B73255445K9409657I7807536G399274B055474F16659B44887n4825p5782e6976
614F1877j7733j6875b1502A5673e244B2717g222A005K876B98d248J572g22A407
599a846k0841c760C79f970b283n099j8888c355e03k2410L605k0000k1697L500
585e7505k080L16J5643a1462B909L786H71c732j329D84L815p93c687m186k7a998
568c259r50k570j4563j3675j5929o965n925o285j288p079M129R598J2328J1742
$$ plain form
663 -54916 -60275 -78241 -60552 -48822 -19213 -15624 -19021 -1431 250 -5061 -1175 -4072 -31903 -2513
648 2801 -21646 -122 -2756 -49356 6432 -5856 9642 3857 -17989 11315 -15861 19962 3502 16213
634 16213 13170 34979 61154 168675 398943 723306 1832460 10725918 70738320 273255445
624 273255445 302665102 97807536 7399274 2055474 616659 244887 190062 114280 -56976
614 61877 44144 27269 -21502 15673 -5244 22717 -7222 1005 3881 298 -4248 -2676 -722 1407
599 -1846 -22687 -3760 379 -6970 -2283 -7382 -26270 -3355 -503 -22913 -19308 -39308 -61005 -57505
585 -57505 -59585 -59269 -43626 -11462 2909 6695 871 -3732 -5061 484 4299 3506 -3687 -7873 -7900 -1998
568 -3259 -4209 -6779 -21342 -35017 -50946 -57911 -63836 -70121 -71409 -78488 -74359 -64761 -52433 -40691
554d0691M450L185J047n211o001p676k765J3958J6053h164c005q24G05c347l913
539g260J991B951a5m40r82H05c429i08k428k3920r714J0602g159c028o67B321
522B183a186k053L91N83b43r75k917R10A0N692J585e22j204C146c1527c461E03
504d774K060F96J150m84a060k9646l0680j2507J3331J0453O022N433R449a1231
489a1699d482a463C104a375r6l526B777M883A778J856R46J82J952A173a315E35
472D89c317m286L683C771h56n745a598k429j942j1524j4623o557m825o180l445
457e3123K770M584K086Q197a0079A2162m164b300KD731g72E270j674c204q60B834
440D583b797k38j2983j6722O944J1943N191k845m487P060a249F71i64q72E413
$$ plain form
554 -40691 -36241 -33056 -32009 -37220 -43221 -50897 -53662 -39704 -23651 -8164 -3005 -3829 705 -3347 -7260
539 -7260 -5269 2951 -15 -455 -1437 805 -3429 -908 -3336 -27256 -36970 -26368 -7159 -3028 -3695 2321
522 2183 -1186 -3239 -2848 -2265 -243 -1218 -4135 -3225 10 5702 7287 -522 -1726 3146 -31527 -3461 503
504 -4774 -2714 696 1846 1362 -1060 -30706 -61386 -73893 -60562 -50109 -44087 -38654 -29205 -11231
489 -11699 -4482 -1463 3104 -1375 -1471 -4997 2777 7660 1778 3634 4580 4762 6714 1173 -1315 535
472 489 -3317 -7603 -3920 3771 -856 -6601 -1598 -4027 -5969 -17493 -32116 -38673 -43498 -49678 -53123
457 -53123 -50353 -45769 -43683 -35486 -10079 12162 7998 -2300 -2298 4731 -772 5270 3596 -3204 -4064 2834
440 4583 -2797 -3035 -16018 -32740 -25796 -13853 -8662 -11507 -15994 -8934 -1249 671 -964 -1836 5413
424e35E2d68j405P85n091i97L39B685A120b3692l1842J4069J7739P484K670J767
408a1805m646j7840j4541d409A457K58n99O67M232j968c267J039B739L292K707
393H738a0753l2459j4223M524J199k767P29O57q592j9358J5925b5876e670k39
379e909e00B074c95A21c934A287g438l9069l0343R972K1249J5433J0286Q394a053
363c257D021j867g21k761k939b246e27o85o514l1283k3023M8J6288J3882N169
348b6645m176j1200j1863q363o553l761J4845K8652B228K811C19F1N863K73j732
333D465A778a1203C574L97H03K264F48a960l3q3l457a2o100l4606k3571o040O713
316f3616P627K599k792k685M123Q454O062L553Q612a0921b286H06O724b867j3671
$$ plain form
424 -535 52 -468 -1873 -1088 -6179 -997 -658 2685 1120 -23692 -55534 -41465 -23726 -16242 -13572 -11805
408 -11805 -16451 -34291 -48832 -4409 1457 1715 1116 1783 6015 4047 -3267 -2228 2739 6031 8738
393 8738 -10753 -43212 -57435 -52911 -51712 -54479 -53750 -53093 -61685 -81043 -65118 -25876 -5670 -5909
379 -5909 -500 2074 -395 121 -3934 1287 -7438 -46507 -76850 -66878 -45629 -30196 -19910 -11516 -1053
363 -3257 4021 2154 -721 -3482 -6421 -2246 -527 -1212 -7726 -39009 -62032 -61984 -45696 -31814 -26645
348 -26645 -30821 -42021 -53884 -62247 -68800 -72561 -57716 -29064 2228 5039 319 61 5924 6197 4465
333 4465 1778 -11203 3574 3971 803 3067 648 -1960 -1993 -2076 -5533 -12 -6112 -40718 -64289 -70329 -63616
316 -63616 -55989 -53390 -56182 -58867 -54744 -46290 -40228 -36675 -28063 -10921 -2286 806 7530 -2867 -16538
301a6538k4491j7370n872N42L783P736J0777J1991J3469a399C091j031h99l918
287d817j795r288l410k046n979j1379j5256j5954j0409P468J6577J7347J5227
274b3714a1092e313C145P356C832b598c97C756c009q7L2G08P81J447b421j2747
258a5168q054k110m375j3510j3488J8055g66C459N63a340l537o873m7585r010
244f8345a6791b473j793j293a334H82a544n437p090b224j275a045c42C578b4769
228d8446L135J8289a1496c525Q20m615q432j1156j3335j4076r489N765J8116a9128
213a806D28g04l208k1649k3710l359K3105c389k08k766b812l489f28p051l0585
198c8264k1131J5521a9286e897R03e59m275K317C881h69G253B241a832a25n879
$$ plain form
301 -16538 -41029 -58399 -64271 -63729 -59946 -52210 -41433 -29442 -15973 -1399 3091 2060 -899 -4817
287 -4817 -6612 -15900 -19310 -21356 -27335 -38714 -53970 -69924 -80333 -72865 -56288 -38941 -23714
274 -23714 -11092 -5313 3145 10501 3832 -2598 -397 3756 -3009 -3096 -3064 708 1489 2936 -2421 -15168
258 -15168 -23222 -25332 -29707 -43217 -56705 -38650 -766 3459 4022 -1340 -4877 -11750 -59335 -68345
244 -68345 -16791 -2473 -4266 -5559 -1334 882 -1544 -6981 -14071 -2224 -3499 -1045 -342 3578 -24769
228 -48446 -45311 -27022 -11496 -3525 -2705 -7320 -15752 -26908 -40243 -54319 -63808 -58043 -39927 -19128
213 -1806 428 -704 -3912 -25561 -49271 -52630 -29525 -3389 -3597 -6363 -2812 -6301 -628 -7679 -38264
198 -38264 -59395 -43874 -19286 -5897 -4994 -559 -4834 -2517 3881 -869 7253 2241 -1832 -125 -6004
183f004j1026k1761l5437j198b4279c734Q82C021m82b009m6558l3832K3248K0988
169c8163P130L99N736h711C639K182L460j107b0j05A615b039P22A432a7308k7917
153d5225k8855j7859J8213J5671R496M628K731N007J0225a1109B248A000c715
139B530A155J071C73g491m263M135C396A63d325i95B335P255l12A903F66J35Q83
122A684O801A669d842j964A648K44b992f83A02g06A090J420c155A853I18d62l061
105c523L04J480k573f79A037i65D575j152b927C420Q15j178b941d95A347b308
88i764k990L256b284k006c73H00b353k131r482j3182q067l05K855q41q458j7002
72e8966j8191J3468L0409e093E447L142E08e478C435H49c960A874n9e840j5085
$$ plain form
183 -6004 -17030 -38791 -74228 -75426 -24279 -3734 -2852 3021 2539 -2009 -48567 -82399 -59151 -38163
169 -38163 -31033 -30634 -24898 -8711 3639 5821 9281 8174 -20 -125 1615 -2039 -1317 1432 -17308 -45225
153 -45225 -74080 -91939 -73726 -58055 -48559 -43931 -41200 -36193 -25968 -11109 2248 1000 -3715
139 2530 1155 2226 373 -7491 -11754 -7619 3396 163 -4325 -995 2335 9590 9278 1903 666 801 1684
122 1684 8485 1669 -4842 -6806 1648 1892 -2992 -683 102 -706 1090 2510 -3155 1853 918 -462 -3523
105 -3523 -3219 -1739 -4312 -679 1037 -965 4575 3423 -2927 3420 4235 3057 -2941 -495 1347 -2308
88 -9764 -12754 -9498 -2284 -4290 -373 800 -2353 -4484 -13966 -27148 -35215 -35520 -32665 -33506 -41964 -58966
72 -58966 -77157 -63689 -33280 -5093 5447 8589 508 -5478 3435 849 -3960 1874 1815 -5840 -20925
57b0925j7460p380l101j0899k1845J6835b3185B456K553d63K3p546m5513k1877
43g5376L3715a6831c442C820M7K20c472N44m126H96K341k47a1039r176p678j4609
27d2502r719J8834b283j31j622j87a962A141i22p91k6977k0935N512K1717d900
11B065A032c142j7852k1484j3873P354J8266a3094i38A669c093
$$ plain form
57 -20925 -38385 -45765 -48866 -59765 -81610 -64775 -23185 2456 5009 -463 -440 -7986 -53499 -75376
43 -75376 -41661 -16831 -3442 3820 3867 4087 -3472 -2928 -7054 896 3237 2990 -11039 -20215 -27893 -42502
27 -42502 -52221 -33387 -2283 -2414 -4036 -4223 -1962 1141 -922 -1713 -28690 -49625 -44113 -22396 -4900
11 2065 1032 -3142 -20994 -42478 -56351 -48997 -30731 -13094 -938 1669 -3093
##PAGE= F1=1878.308675568
##FIRST=     2903.44365593433, 2615.24460078534, 1323
##DATA TABLE= (F2++(Y..Y)), PROFILE
1023A323A3g67j1136j4676M216a0027a749P03j717q613j2550q221J5195c252d78
1007G09b587F84J460c804n726j0156j008R429a845C201p43c998j0087p945J623
992b0407O890O252a951B142P744J544B306b830A442CP24j64i70q83A582O01q92
975A291b056j934n45j193j857j893n35L780F38b699k637K01b037A69J177K953
959D299q24d572J610N4k148n967k005j5N98k13k463n750m004N868i184a926A66
941b258l190l88J874Q06k647n613n976m193j767p59J062M048O623c581a267A202
924A521a17r1k722K85A100J665b220J008B152k26M843M316E038c899m51K40o966
907a1076n956m058j691j136k478l843l156m68P95J273M360Q279h567d020a927
$$ plain form
1023 1323 13 -767 -11903 -26579 -22363 -10027 -1749 -1046 -2763 -11376 -23926 -32147 -16952 -3252 -478
1007 709 -2587 684 2144 -3804 -9530 -19686 -20694 -11265 -1845 3201 2458 -3998 -14085 -22030 -20407
992 -20407 -13517 -7265 -1951 2142 9886 11430 2306 -2830 1442 3 727 563 -970 -1853 1582 2183 1291
975 1291 -2056 -3990 -4535 -5728 -7585 -9478 -10013 -6233 638 -2699 -5336 -5135 -2037 169 1346 4299
959 4299 3475 -4572 -2962 -2908 -5056 -11023 -13028 -13043 -12445 -12658 -15121 -20871 -24875 -19007 -9184 -1926 166
941 -2258 -5448 -5836 -3962 -3156 -5803 -11416 -17392 -21585 -23352 -24111 -23049 -19001 -12378 -3581 -1267 1202
924 1521 -117 -208 -2930 -2645 1100 2765 -2220 -1212 2152 1926 6769 11085 5038 -3899 -4350 -4110 -11076
907 -11076 -17032 -21090 -22781 -23917 -26395 -30238 -33394 -33862 -33067 -31794 -27434 -19155 -8567 -4020 -1927
891b584c56C26L90d779b176A162L754L347R43d61n918j0935r578K337J1243h45
874G524K245B839g87C17K469J0887k699h889j9861o085R838L529n43J732N811
859a4468M848n84o384m844Q287G83Q509I44c980C08o5a757A023M50e052p592o979
842a9623m331j556r95j980k615j740j683k77Q334J2719e36B648c12A4g39a67p67
825i34l784I071J793d435A272N00J777j574c037D665H25a2576j3591o454J5201
810a7420E07J273e61m605G254L359k728a116l590m38a366j106n27a357q459r896
794a9712j311J108k819o977o204M926M110K477N756h497B179J960A56a976j530
779c506r06r21J229A26R82L993N81d302m789J240c122C680p85r53q32b978B382
$$ plain form
891 -2584 -356 326 716 -4779 -2176 1162 4916 8263 9206 -461 -6379 -17314 -26892 -24555 -13312 -845
874 7524 9769 2839 -787 317 2786 13673 10974 -8889 -28750 -34835 -24997 -21468 -22011 -20279 -14468
859 -14468 -9620 -10204 -16588 -21432 -13145 783 9292 944 -3980 308 243 -1757 1023 1473 -5052 -12644 -19623
842 -19623 -23954 -25510 -26505 -28485 -31100 -32840 -34523 -34800 -26466 -13747 -536 2648 -312 14 -739 -167 -934
825 -934 -4718 9071 10864 -4435 1272 1772 3549 1975 -3037 4665 825 -12576 -26167 -32621 -17420
810 -17420 507 1780 -561 -5166 7254 10613 7885 -1116 -4706 -5144 -1366 -2472 -2999 -1357 -9816 -19712
794 -19712 -21023 -19915 -22734 -29711 -35915 -30989 -26879 -24402 -18646 -8497 2179 4139 156 -1976 -3506
779 -3506 -4412 -5333 -4104 126 1108 5101 5682 -4302 -9091 -7851 -3122 3680 2895 1942 1110 -2978 2382
761F125K832j372j729J206A080a737l860k566k521l641m599l864M81N643O335
746a0329e056F8M92a287m290o42a156J71L71k027j2651j7132J0262R331L121J115
730h595c599a487m036b84A685j45k84M879k370Q76a867j2932K18c523A518i40
713A660H08a0133r202k006K871K019O82N43n61k896m766n947j571M662M104K193
697b0008j041j013N15K661N594M344L509J768j170J367j910l700j526r02m75L670
681h317c230F1L409J848k104j512i32o820m896k882l240J801N051J990M510B088
664B943O96l71e055p187N981i17m386A210A57K525d193M18l882j7683Q225P950
648i165J171A701d463a264E730e715H670C891m06R032b5071A6949C59J5064G619
$$ plain form
761 6125 8957 7585 5856 7062 1080 -1737 -5597 -8163 -10684 -14325 -18924 -22788 -22307 -16664 -10329
746 -10329 -5056 68 560 -1287 -5577 -6219 -1156 -985 -614 -2641 -15292 -32424 -22162 -12831 -9710 -8595
730 -8595 -3599 -1487 -5523 -284 1685 1540 1256 6135 3765 4641 -1867 -14799 -14581 -3523 1518 -940
713 1660 808 -10133 -19335 -21341 -18470 -16451 -15769 -15226 -15787 -18683 -23449 -29396 -30967 -26305 -22201 -20008
697 -20008 -21049 -22062 -21547 -18886 -13292 -8948 -5439 -3671 -4841 -3474 -5384 -9084 -10610 -11512 -11987 -8317
681 -8317 -3230 61 3470 5318 3214 1702 -932 -7752 -12648 -15530 -18770 -16969 -11918 -9928 -5418 2088
664 2943 3639 3268 -5055 -12242 -6261 -917 -5303 1210 157 2682 -4193 -3775 -7657 -25340 -17115 -9165
648 -9165 -7994 1701 -4463 -1264 5730 -5715 8670 3891 3485 12517 -25071 16949 359 15423 7619
632C2711J9561J06433o4770M95967Q47741O512380M6563000L2425059J0869454
623I7807536j7943350F116247A729874C48841j47473n2764l6777k7888j6162l2475
613C5302l027a0566A3215d359B7371E097j418K473Q93b041k318l736G58b779n928
598h707d186l252r908M464l677m307g960c393a673c6n196q775J60K237J250e163
581B86K026L963A190b661k03A265J647R25a359m502l555i27c58k979j1345j1897
565b6579n177Q270M397J522J073p98p80K543K982M583c407r04h02j110l832l902
549i646m485k149N123d331A802b120L52C018B92d16C311k44A10a044m10O56m061
532d859K11j0835q324n88N423P310d729a723C201E62e174j311i57O0l61k38k429
$$ plain form
632 32711 52272 158705 93935 589902 1437643 7950023 54513023 86938082 97807536
623 97807536 79864186 6116247 1729874 348841 201368 148604 111827 83939 67777 35302
613 35302 32275 -10566 13215 -4359 27371 5097 3679 6152 7045 -2041 -4359 -8095 758 -2779 -8707
598 -8707 -4186 -7438 -17346 -12882 -16559 -20866 -7960 -3393 -1673 -36 -5232 -14007 -13847 -11610 -10360 -5163
581 286 2312 6275 1190 -2661 -2864 1265 2912 3837 -1359 -5861 -9416 -927 -358 -3337 -14682 -26579
565 -26579 -31756 -23486 -19089 -17567 -16494 -17292 -18072 -15529 -12547 -7964 -3407 -4311 -802 -1912 -5744 -9646
549 -9646 -14131 -16280 -11157 -4331 1802 -2120 -1768 3018 292 -416 3311 3067 110 -1044 -1454 -798 -4859
532 -4859 -4648 -15483 -23807 -24395 -18972 -11662 -4729 -1723 3201 562 -5174 -6485 -957 -897 -1258 -1496 -3925
515c925m55a085F386J816c14j873n720h63o41K01l115b164F27J892L54b000m481
498f481j633o72l044o202p365L06P330Q344J321c668A61N519B312Q21c795B236
481I560A634n32K576J022j040i21j334H88J967Gg304K360I68b196o383f08n70
464a178k283C259j475a045j898l376n784q062o226P391d762E139O210E392e437
448c964D953A89L438J842a581m317b24B312d035N2m02k79K141m079J950o573j1441
431b2666K551c830B558a47r31F203D98a03j64o82L25o092b15D46J180i69q080
414i049j3a922h62D423A344A61l6d365o307A809F54j84L62R65L584j136c622P37
396b885B528P053D543d209q152l822j758k462k085j60p85l546r24Q595h066K269
$$ plain form
515 -3925 -4380 -1085 6386 8202 -314 -2187 -7907 -863 -1504 -1303 -4418 -2164 627 2519 2873 -2000 -6481
498 -6481 -8114 -8786 -11830 -18032 -25397 -25091 -17761 -9417 -8096 -3668 161 5680 2312 3133 -3795 2236
481 9560 1634 1102 3678 4700 3660 -921 -2255 888 2855 7 -7304 -4944 968 -2196 -8579 -608 -1178
464 -1178 -3461 3259 1784 -1045 -2943 -6319 -12103 -20165 -26391 -19000 -4762 5139 11349 5392 -5437
448 -3964 4953 189 3627 5469 -1581 -5898 -224 2312 -4035 -3983 -4385 -4664 -2523 -6602 -4652 -11225 -22666
431 -22666 -20115 -3830 2558 -147 -1078 6203 498 -103 -267 -949 -624 -6716 -215 446 1626 -969 -9049
414 -9049 -9062 -1922 -862 4423 1344 161 125 -4365 -10672 1809 654 470 832 1797 5381 4245 -3622 -2885
396 -2885 2528 9581 4543 -4209 -12361 -16183 -17941 -20403 -22488 -22648 -23433 -26979 -27903 -19308 -8066 -5797
380e797P24a33B704A078J133a539M18p648o373L215e239b220l473L70q395r559
364b3277L87J1057a026j378k278m68g13o199p820o557m456j722J220J845k37l258
348b7897n355J025N499K216n76J897R529a048B122J539a89C20O942K75j287B49
331a2562J922C931G56K192B88a249K30L10j561k337j6126l181N907L128K256M017
315h606L509R22o69K10K155d76C49g94m69j076B126N775b613h76j5038j0032p28
298b6674q89K918O775g171C280A451a805B767A313a233k850m159k997r15j309
283a3463k063j256k73j150l423m254J57N221N243M137M379a018E859p44b876F77
266D134b878j939o612M514B084r3P19f65k536J78k387k540o289O938D035E66K130
$$ plain form
380 -5797 -5073 -133 2704 1078 2211 -1539 -1121 -8769 -15142 -11927 -5239 -2220 -5693 -5323 -13718 -23277
364 -23277 -22890 -11833 -1026 -2404 -4682 -5150 -713 -6912 -14732 -21289 -25745 -27467 -26247 -24402 -24639 -27897
348 -27897 -33252 -32227 -26728 -24512 -25088 -23191 -13662 -1048 2122 3661 -189 320 7262 7537 6250 249
331 -12562 -10640 3931 756 2948 288 -1249 -1019 -709 -2270 -4607 -20733 -23914 -18007 -14879 -12623 -8606
315 -8606 -5097 -4175 -4844 -4634 -2479 -476 349 -794 -1263 -2339 2126 7901 -2613 -876 -15914 -25946 -26674
298 -26674 -27563 -24645 -17870 -7171 3280 1451 -1805 2767 1313 -1233 -4083 -8242 -11239 -12154 -13463
283 -13463 -15526 -16782 -17055 -18205 -21628 -25882 -25725 -20504 -15261 -11124 -6745 -1018 5859 5115 -2876 677
266 4134 -2878 -4817 -11429 -6915 2084 1991 2710 -665 -3201 -3023 -5410 -7950 -14239 -7301 4035 566 2696
249B696a26k813A343a6830j4669f578i13k611j1J100g34j951j538R91k24O92M28
232b336a044E770A200f893l544R52K489J756M87p00j692k520l634m634m347N88
216b1692O796e696B692A145c89k067l107j2148k961i757A763h92m559b432k561
201d993E89i805j1445L2i851a04D244a246H63d427b044D431a287H881C525a778
184D01e384b446p007j3184j2372a3588d141a735B924k29b881j0979L602c372J540
169a832A169M26L119J474k347K596L674j493B44c01a15l337a487o772j2230j1380
153c1869k67N548J949j401l268j576K525M842O548h399i93j324j371A586p53J594
137B427D64d989o563p16f074F57e881K626D987O164n177E72c596k164J641B557
$$ plain form
249 2696 -126 -2939 1343 -16830 -31499 -6578 -913 -3524 -3535 -2435 -734 -2685 -4223 -3232 -3456 -2764 -2336
232 -2336 -1044 5770 1200 -6893 -10437 -9485 -6996 -5240 -4753 -5453 -7145 -9665 -13299 -17933 -22280 -21692
216 -21692 -14896 -5696 2692 1145 -389 -2456 -5563 -17711 -20672 -9757 1763 -892 -5451 -2432 -4993
201 -4993 589 -9805 -21250 -21218 -9851 -104 4244 -1246 863 -4427 -2044 4431 -1287 8881 3525 -1778
184 401 -5384 -2446 -9453 -22637 -35009 -13588 -4141 -1735 2924 2695 -2881 -13860 -10258 -3372 -1832
169 -1832 1169 1595 4714 6188 3841 6437 10111 8618 244 -301 -115 -3452 -1487 -8259 -20489 -31869
153 -31869 -32136 -26588 -24639 -26040 -29308 -30884 -28359 -23517 -16969 -8399 -993 -2317 -3688 1586 833 2427
137 2427 464 -4989 -11552 -12268 -6074 657 -5881 -3255 4987 11151 5974 572 -3596 -5760 -4119 2557
120D280f239Q71B010J115c07B435L39E77g56K06n722A986n17g34m640a648l1k657
102d336g56A108a479B388N43g56B918K2j168c262J149a59p456p015n994l635K928
85b1331Q469c267R20k629J689e62n738p506j408L673K690j234n773q618l916Q461
69a9931i238f42D400j497d712h29J66k049B813L81d961h26j786p568n028m446
53a9654n324J730a1368A186L378I46J042e856q560K345e567K425k587k705d037
37F039B15a74l465g30j0233j3452L260R192e502A86K650A139g4l792m50L12i67
19a257j727E77b206p969p484k440M913O843c599P73l888p909n341P393D09e79
2d44A894c118
$$ plain form
120 4280 -6239 -5368 2010 3125 -307 2435 2774 577 -756 -550 -6272 1986 1469 -734 -5374 -1648 -1679 -4336
102 -4336 -756 1108 -1479 2388 2931 -756 2918 2940 1772 -3262 -2113 -159 -7615 -14630 -20624 -24259 -21331
85 -21331 -12862 -3267 -2347 -4976 -3287 -562 -6300 -13806 -15214 -11541 -8851 -10085 -15858 -24476 -28392 -19931
69 -19931 -9238 -642 4400 2903 -4712 -829 -663 -2712 2813 3194 -4961 -826 -2612 -10180 -15208 -19654
53 -19654 -24978 -23248 -11368 1186 4564 946 1988 -5856 -14416 -12071 -5567 -3142 -5729 -8434 -4037
37 6039 215 -174 -3639 -730 -10963 -24415 -21155 -11963 -5502 186 2836 1139 -74 -3866 -4316 -4004 -967
19 -1257 -2984 577 -2206 -10175 -17659 -20099 -15186 -8343 -3599 -2826 -6714 -14623 -19964 -12571 409 -579
2 -444 1894 -3118
##PAGE= F1=1875.752229233
##FIRST=     2903.44365593433, 2615.24460078534, 1940
##DATA TABLE= (F2++(Y..Y)), PROFILE
1023A940b51r15l892r000M235b476l68O56A064a417j105g79j768M24d79E9b955
1005c410a29k626A798b04l037r26D12d29B019K467o33a623r15C21Q26d04q34l31
987a569r7k55p10j418k283l150k621L301L601b116a65B43h63k134j212L36N67
970c306H08O15B61K05b711l175J062b410B85a050j811k47j56k13j209l12P05M28
952c865J07J614H79K603A44d311d80o22K09j165k222J392d57j050g0B75b845J158
934a687j514l043j862J302J246k15j004j217m11N62n5m43Q28K710b038b14j007
917a221r2B72h86j866k379l196k38K883K447a476b27G76d269a582b56A936D05
899h16c72j268D15a225l364k323k272K833a066E01N52f007E86a792C374g17m386
$$ plain form
1023 1940 -251 -1166 -5058 -14058 -9823 -2476 -2844 -2188 1064 -1417 -2522 -779 -2547 -2123 -479 59 -2955
1005 -3410 -129 -2755 1798 -204 -3241 -4167 412 -429 2019 4486 3853 -1623 -2538 321 1147 -404 -1238 -1569
987 -1569 -1666 -1921 -2631 -4049 -6332 -9482 -12103 -8802 -5201 -2116 -165 243 -863 -2997 -4209 -3873 -3306
970 -3306 808 1423 261 466 -2711 -5886 -4824 -2410 285 -1050 -2861 -3108 -3264 -3477 -4686 -4998 -4293 -3865
952 -3865 -3758 -2144 879 3482 144 -4311 -480 -1102 -893 -2058 -4280 -2888 -457 -1507 -70 275 -2845 -1687
934 -1687 -3201 -6244 -8106 -6804 -5558 -5773 -6777 -7994 -8405 -7843 -7898 -8341 -7513 -4803 -2038 -214 -1221
917 -1221 -1313 272 -886 -2752 -5131 -8327 -8565 -5682 -3235 -1476 -227 776 -4269 -1582 -256 1936 405
899 -816 -372 -1640 415 -1225 -4589 -6912 -9184 -6351 -1066 501 1053 -6007 586 -1792 3374 -717 -5103
882e103k688L707a411K66j933k436O70a559H97P46A71g51q43Q4O7J32O4L4p47
863a960j570k000q71O44J285r76b263J27n4i00A851c65k186A844O90a600A14L21
845D35d562R64l704r62b606J170B977n91C05h92m560r07b160Ha358m06l09j56
827b229J074H90d468D528j112d987B042k52J109F96a049D189q63i9Dh450l097
810a1547E528j652A781d106F380K889k820b57k292k800b190j98a154k824l493
795g471n16L786e47B110p01D66Q86h56j120K25D97N54m93b165n96j780k742j596
777h879R13Q86K31J06J115J421O18o78k063l084Q43K758J996J821D01L320J147
760D868j433K696p2A184c780k598I65M02c384J396G91e189b367j222j392K444
$$ plain form
882 -5103 -7791 -4084 -1411 -1145 -3078 -5514 -4844 -1559 897 1643 171 -751 -1594 -1510 -1443 -1311 -1247 -1213 -1960
863 -1960 -3530 -5530 -6401 -5757 -4472 -5448 -2263 -2136 -2190 -900 1851 -365 -2551 1844 2534 -1600 114 435
845 435 -4562 -3598 -7302 -8264 -2606 -1436 2977 2386 305 -892 -5452 -6359 -2160 8 -1358 -1764 -2073 -2229
827 -2229 -1155 890 -4468 4528 3416 -4987 2042 1790 2899 696 -1049 4189 3326 -99 4 -8450 -11547
810 -11547 5528 3876 1781 -4106 6380 9269 6449 -257 -2549 -5349 -2190 -2388 -1154 -3978 -7471
795 -7471 -7987 -4201 -547 2110 1409 466 1352 -856 -1976 -1751 497 1051 558 -2165 -2761 -4541 -7283 -8879
777 -8879 -7966 -7080 -6849 -6743 -5628 -4207 -3589 -4267 -6330 -9414 -8571 -5813 -3817 -1996 401 3721 4868
760 4868 3435 6131 6059 1184 -3780 -6378 965 1367 -3384 -1988 791 -5189 -2367 -3589 -4981 -2537
744b537i36n7m570J509P51J015j059j535k258a994G760j859k857b07l136k576
728e919j612q23o79j364L44L138L415a134O0m86l333m379K04M346a551e21r93
711a514k681l599l029M84K538L429K9K101j06Q4R49k022R31C274k6A573J580b358
692c930b41j169o08m043l046P0b813a13j317n077o168e858B73L413M37j568j134
675A421J87b894I37N98K370j488b407m29a333A517N18L160J47J880N83A228a290
657e076l141l764J136M661k66A069a968B588hk792j409j253a266M13l993a197
640b508o199a704A249J1831b937A1909l598J7483l07a346G7178K29407j43184
627A63401J055126K553542K611711J015494j283027k678060I84801A83915p6480
$$ plain form
744 -2537 -936 -993 -5563 -4054 -3303 -2288 -3347 -4882 -7140 -1994 7760 5901 3044 -207 -3343 -5919
728 -5919 -7531 -8354 -9033 -10397 -10053 -6915 -3500 -1134 -1074 -1560 -4893 -9272 -9068 -4722 -1551 -521 -1514
711 -1514 -4195 -7794 -10823 -10339 -7801 -4372 -4343 -2242 -2348 -2264 -1315 -3337 -2406 3274 3248 1573 3153 -2358
692 -3930 -241 -1410 -2018 -6061 -9107 -9037 -2813 -113 -1430 -6507 -12675 -5858 273 3686 4123 2555 1421
675 1421 1608 -2894 937 1535 3905 2417 -2407 -2836 -1333 1517 2035 5195 5342 7222 7805 1228 -1290
657 -5076 -8217 -11981 -10845 -6184 -6450 1069 -1968 2588 -8 -2800 -4209 -5462 -1266 -853 -4846 -1197
640 -2508 -8707 -1704 1249 13080 -2937 11909 8311 25794 25487 -1346 77178 306585 163401
627 163401 1218527 3772069 6383780 7399274 6116247 3438187 984801 183915 107435
618A07435D9205C679K9508J1415F548a1444A220Q724a305E386f182C143J235A194
603C317e486K696e60k876J021j650F60b950k431a436j400O70A21J479n03J941
587C038d44o139o324e211a211I55m59O176A135d700j084f4A546K135I22b914o767
570i681L960K311a695j718C33g05L27D99A41c86k296l783j952Q44K371K201k249
553e250g10m46r90n01l235J850n73r18q41q96O2J735K501g62E74k85a928m138
535f066n073j843M568L763R47k06j149j034J808k036a303j011p63o49K75A207
518E98b139J69j969k421l72d02F166a81j589B671M120D84a305j613J005c34B304
500D848g65k277a039o595k560d315A1J324a88k812k439K338A174O016k482K276
$$ plain form
618 107435 49205 3679 33187 44602 6548 -11444 1220 9944 -1305 5386 -6182 3143 4378 1194
603 3317 -5486 -2790 -560 -3436 -2415 -4065 660 -2950 -5381 -1436 -2836 -2166 121 1600 1097 3038
587 3038 -444 -6583 -12907 -5211 -1211 955 496 6672 1135 -4700 -5784 -64 1546 3681 922 -2914 -9681
570 -9681 -5721 -3410 -1695 -3413 333 -705 -378 499 141 -386 -2682 -6465 -8417 -7573 -5202 -3001 -5250
553 -5250 -710 -1156 -2146 -2647 -5882 -4032 -4605 -5523 -6364 -7260 -7198 -5463 -2962 -762 574 289 -1928 -6066
535 -6066 -11139 -12982 -8414 -4651 -3704 -3910 -5059 -6093 -4285 -6321 -1303 -2314 -3077 -3726 -3451 1207
518 598 -2139 -1970 -3939 -6360 -6732 -402 6166 -181 -1770 2671 6791 484 -1305 -2918 -1913 -334 2304
500 4848 -765 -3042 -1039 -7634 -10194 -4315 11 1335 -188 -3000 -5439 -3101 1174 7190 4708 6984
484F984a076A507Q871A149a663C674l66C58c759N55d63j87j274m756j022l818
468a1520l208J296K179J587J256Q74J06j378l588j233O196a153l314D126K550
453F676N30J3B306g966K019D193D94J412k9c029m294k568L20J422K442J138h98
435B533g274c399m294B652J627f37C999c33k477p284q39d264a006b76F7e692b21
417c2k754j989L29J296K53j784l378k913J206K637J238r40k950l229K253L189
401g568J869Q29J44j55L9j23r8k71k72l38k68l37j24K22P85J146J300j13b56A77
380e626R03n07j697k18j5j825l955M153a128m02k401J120k301A418i09G01e319
362E382j212c005k660J984E22K1h74j949n305r17J914J277J185J997j571P44J528
$$ plain form
484 6984 -1076 1507 10378 1149 -1663 3674 3308 358 -3759 -3204 -463 -650 -1924 -6680 -7702 -11520
468 -11520 -14728 -13432 -11253 -9666 -8410 -7536 -7430 -8808 -12396 -13629 -7433 -1153 -4467 4126 6676
453 6676 7206 7219 2306 -7966 -5947 4193 494 1906 1877 -3029 -7323 -9891 -9571 -8149 -5707 -4569 -898
435 2533 -7274 -3399 -7693 2652 4279 -637 3999 -333 -2810 -10094 -10933 -4264 -1006 -276 67 -5692 -221
417 -32 -2786 -4775 -4446 -3150 -2897 -4681 -8059 -10972 -9766 -7129 -5891 -6831 -9781 -13010 -10757 -7568
401 -7568 -5699 -4870 -4726 -4881 -4842 -4965 -5063 -5334 -5606 -5944 -6212 -6549 -6673 -6451 -5666 -4520 -3220 -3333 -256 177
380 -5626 -4723 -5230 -6927 -7145 -7160 -8985 -12940 -8787 -1128 -1530 -3931 -2811 -5112 1418 -909 701 -5319
362 5382 4170 -3005 -5665 -3681 522 543 -874 -2823 -8128 -9045 -7131 -5854 -4669 -2672 -4243 -3499 -1971
345a971j053j160K77J650b29A313b833j415g62D057K936o4B12b26j340A594G65
327B416A12e70i3n27C57K406J771b571k519J021M56c36B480a023H3a02n831m921
309a0854J006M438J721J118C301L978d019D05e270k118o969j1725J0047a990k260
294d250F35i95j514D39h844Nc416a095l830a632l06j172P36A181J895B70h003
276a0366d167A863C42b802E949P521E854b281A006K231b357n873l684e894a572
260F02k99a730k120j415j608j725K576h4C580b186A348P29F27a155n456k409J755
243g265J086q20j606J593b637r5c90j682j939J816j578m76L89l02o64k02P03J411
225b914a373l740b66j623C73a380l165m523J623f09E779k424I02D09a379j916
$$ plain form
345 -1971 -3024 -4184 -3907 -2257 -229 1313 -2833 -4248 -762 4057 6993 6929 212 -226 -1566 1594 765
327 2416 112 -570 -93 -620 357 2763 4534 -2571 -5090 -4069 -3613 -336 2480 -1023 83 -102 -5933 -10854
309 -10854 -9848 -5410 -3689 -2571 3301 7279 -4019 405 -5270 -7388 -14357 -26082 -16035 -1990 -4250
294 -4250 635 -995 -2509 439 -8844 -8839 -3416 -1095 -4925 -1632 -1938 -3110 -2374 1181 3076 270 -8003
276 -10366 -4167 1863 342 -2802 5949 13470 5854 -2281 1006 3237 -2357 -8230 -11914 -5894 -1572
260 602 303 -1730 -3850 -5265 -6873 -8598 -6022 -84 3580 -2186 1348 2077 627 -1155 -6611 -9020 -7265
243 -7265 -6179 -6999 -8605 -7012 -2637 -2732 -390 -2072 -4011 -2195 -3773 -4249 -3860 -4162 -4826 -5028 -4325 -2914
225 -2914 -1373 -5113 -266 -1889 373 -1380 -4545 -9068 -7445 -609 5779 3355 902 409 -1379 -3295
209c295J645q565L762a694D31d381b045j827a543E52J947b019j247B470A8c280
192f935k032K820b143k46B593J37b862a057l696j947m70O73J438J261j044a065
175B993k81c245k99j106j810c186A022J300J403e32j755I25N221K237b27n22j487
158b236l189b008f08D71c107j049o43J776F155J408m55B878c537j243p3J079k302
141f076j265n73k04J96R61J356K180a219G92I9c470k140D34f72o43j018j993l382
123g708j835d485B128d850O89B496K735q23L82J1A706a526q21m20f36j731k653
106e020k561J62J881J066M91m87q27o06k05O95J199J225j54j699l475k904L090
89h129L454J145j313k522J319e37l343L33R67G32b029m628J143b513C388C25b173
$$ plain form
209 -3295 -1650 -10215 -6453 -1694 431 -4381 -2045 -3872 -1543 552 2499 -2019 -3266 2470 18 -3280
192 -6935 -8967 -6147 -2143 -2389 2593 2730 -2862 -1057 -4753 -6700 -7170 -6497 -5059 -3798 -4842 -1065
175 2993 2712 -3245 -3544 -4650 -6460 -3186 1022 2322 3725 -532 -2287 925 6146 8383 -227 -749 -2236
158 -2236 -5425 -2008 -608 471 -3107 -4156 -4799 -3023 6155 7563 7108 2878 -3537 -4780 -4853 -3774 -6076
141 -6076 -7341 -7914 -8118 -7922 -6961 -5605 -3425 -1219 792 99 -3470 -5610 434 -672 -1315 -2333 -4326 -7708
123 -7708 -9543 -4485 2128 -4850 -4161 2496 5231 4408 4790 4801 1706 -1526 -2347 -2767 -636 -2367 -5020
106 -5020 -7581 -7419 -5538 -4472 -3981 -4468 -5295 -5901 -6106 -5411 -4212 -2987 -3141 -4840 -8315 -11219 -8129
89 -8129 -4675 -3530 -4843 -7365 -6046 -537 -3880 -3547 -2580 732 -2029 -6657 -5514 -2513 3388 325 -2173
71c137m245k952p88J483L099L248a473m15k209l364K39c493k86f6B52a866j706
54c572k19j15O35k567b22C077A167K068d000A371A09a405k603m213m482N756D13
36C687j503h02j673A11h77A874k79J798j220a232m644m493k710PK823M773a296
18a866A060b16k813a057A076b159j103O20A500n81e301o934m97d932g66A56J911
1B067b140
$$ plain form
71 -3137 -7382 -10334 -11122 -9639 -6540 -3292 -1473 -1888 -4097 -7461 -7222 -3493 -3779 -66 252 -1866 -3572
54 -3572 -3791 -3906 -3271 -5838 -222 3077 1167 3235 -4000 1371 109 -1405 -4008 -8221 -12703 -6947 413
36 3687 2184 -802 -2475 111 -877 1874 1595 3393 2173 -1232 -5876 -10369 -13079 -13072 -10249 -5476 -1296
18 -1866 1060 -216 -3029 -1057 1076 -2159 -3262 -2642 1500 919 -5301 -12235 -12732 -4932 -766 156 2067
1 2067 -2140
##PAGE= F1=1873.195782898
##FIRST=     2903.44365593433, 2615.24460078534, 2310
##DATA TABLE= (F2++(Y..Y)), PROFILE
1023B310b9j310r30A286j75c149l626j134P60K92o19m21R57J378O66o64j573m32
1005g565K660i58A837a380k535r25f11E564B375J540q92a253r04K89H77L85J858
988C120J10Ke16A187E86h93j402j523j972k238J25L601a211F43b726m53j581j89
970d949C14K270A070a92k222l137K86m793L375J931n26k418n92K694K217a404
953H42J886c266f93n923J46i86m384F66e69A4a28j136m090j758a784d50m08k993
935c851J728k819n5J635R61A399M73e767J357B999%a735n22k19l05h59j708k310
917d877j604r8J301J114R43R18p35j097J884A335C25a581k573L07J85J124J039
900a499k698J711o04c14F347k037c983a163L61n16j448k023k161j189R44J487
$$ plain form
1023 2310 -29 -1339 -2269 1286 1111 -3149 -6775 -7909 -7149 -6857 -7476 -7897 -6940 -5562 -4896 -5560 -7133 -7565
1005 -7565 -4905 -958 1837 -1380 -3915 -4840 -611 5564 2375 3915 3023 -1253 -2157 -1868 877 1262 3120
988 3120 3230 3232 -516 1187 586 -893 -2295 -3818 -5790 -8028 -7903 -4302 -1211 643 -2726 -3179 -4760 -4949
970 -4949 314 2584 1070 -192 -2414 -5551 -5265 -10058 -6683 -4752 -5278 -7696 -8288 -5594 -3377 -1404
953 842 2728 -3266 -693 -6616 -6470 -986 -5370 666 -569 14 -128 -1264 -5354 -7112 -1784 -450 -858 -3851
935 -3851 -2123 -4942 -4997 -3362 -2401 1399 1872 -5767 -4410 2999 2999 -1735 -2257 -2476 -2781 -859 -2567 -4877
917 -4877 -6481 -6579 -5278 -4164 -3221 -2303 -3038 -4135 -2251 1335 325 -1581 -4154 -3847 -3662 -2538 -1499
900 -1499 -4197 -2486 -3090 -314 6347 4310 -3983 -1163 -802 -1318 -2766 -4789 -6950 -8139 -7195 -5708
884e708J299R12j41p78j528k172m27K223K274J649L50o48j83d89A213L874r9k010
866B978C12a064j103k677m519d244a655p62l389J583m50b170n08F356a220e55
849C251O40a066l99O28k525F489P57E49a597O43C64K35Q68b85n648o07c063f45
830B882K877B681J33I07N70c341Q73l600k622L102b167b42q82k731m736K942J800
813c849I81c403q088D790J244k345c018E250K478k050H84b830j664J235P04D04
796G47a782l309b303L27p49n59n32j309j914j159N72l4j782J625L569J199k307
779e356P79K151j318O71Ka268J99q91k035k188l1K337a631e08j05p50p67j18l60
760b608j343k145j555J204J784r07D90N47d168K048J02k059j025p25j086p59R65
$$ plain form
884 -5708 -4409 -3497 -3638 -4416 -5944 -8116 -8543 -6320 -4046 -2397 -2047 -2695 -2878 -489 1213 5087 4988 2978
866 2978 312 -1064 -2167 -4844 -9363 -4244 -1655 -2417 -5806 -4223 -4673 -2170 -2678 6356 -1220 -555
849 3251 3891 -1066 -1465 -837 -3362 6489 7246 549 -1597 -954 364 599 1467 -285 -5933 -6540 -3063 -645
830 2882 5759 2681 2814 907 1477 -3341 -2468 -6068 -8690 -5588 -2167 -242 -1124 -3855 -8591 -5649 -3849
813 -3849 981 -3403 -11491 4790 6034 3689 -3018 5250 7728 5678 884 -2830 -4494 -3259 -2555 404
796 747 -1782 -5091 -2303 -1976 -2725 -3284 -3816 -5125 -7039 -8198 -7626 -7660 -9442 -7817 -4248 -3049 -5356
779 -5356 -4577 -2426 -3744 -3073 -3071 -1268 -1069 -1960 -3995 -6183 -6214 -3877 -1631 -508 -613 -1363 -2130 -2248 -2608
760 -2608 -3951 -6096 -7651 -6447 -4663 -5570 490 1037 -4168 -2120 -2018 -4077 -5102 -5827 -6913 -7672 -6707
743f707J570M2p69l097m62M042R14j087b244E818Q97j932l75A445d03m074j663
726f140h95q5j081j799j94J921O10j89K52l585m177K113b411A287C58a990n70
709b560i90j621m588l327M464a408o91K56k0j023K12E425j088o04N91a740l676
692e416K414P95O95l741J00a354I39R04c000l193b505i80B54K492h56k862a440
674c83k443H05M22M24j81c11l700m629k625L394J666l98j708m38K490K793j81
657c647G85gD767c68l036B468B89R25d546k793K735j297d53A882d267A182P15
640A897e194E720G97Q986c834A0204m908J0125j650F868K3175P3487L9762K01312
626C44604O59799P31930L19141l25600p45073C01747D2885A7602L802I304R292
$$ plain form
743 -6707 -5137 -5095 -5864 -8961 -9423 -5381 -4467 -5554 -2244 5818 6715 4783 4408 1445 -403 -4477 -6140
726 -6140 -895 -980 -2061 -3860 -4054 -2133 -1523 -1712 -1460 -5045 -9222 -7109 -2411 1287 358 -1990 -2560
709 -2560 -990 -2611 -7199 -10526 -6062 -1408 -2099 -1843 -1863 -2886 -2674 5425 4337 3733 4324 -1740 -5416
692 -5416 -3002 -2207 -1512 -5253 -5153 -1354 939 1843 -3000 -6193 -2505 -980 254 2746 -856 -3718 -1440
674 -383 -2826 805 1227 1651 1470 -311 -4011 -8640 -11265 -7871 -6205 -6603 -8311 -8749 -6259 -3466 -3647
657 -3647 785 -7 4767 -368 -3404 2468 289 1214 -4546 -7339 -4604 -5901 -453 1882 -4267 1182 1897
640 1897 -5194 5720 797 9783 -3834 10204 5296 15421 13771 6868 30043 103530 143292 344604
626 344604 1004403 1736333 2055474 1729874 984801 301747 42885 17602 21404 9304 18596
615A8596K808G885A94B3O73a618j062j4j411r02l5p95m8Q36K116j626J028p61
597d292I70a106l843D38K265e955A452k13k84K780d03n104n823L448a511C144
580b272E576a0k486D71a297r93c71J06j601p181d436O40a091j167e11l762N07
563c766l252j656J804J312o67l14K361B01K938d440i45H7J179n3e471a822g77
545a343j519r00N21a316F38L11j84a769l672l242M04K460Q75p26RM77J126j436
527e494M07j415J427m06q93k83K051a273A312a931J19j313k215J257i49A8a78
509i63A631R71j285b54l034n275n148N681c359i46j267h45q59j617d56r50k800
492d206m753l870e517J955I89O079k023L359I88B25L486D40c594J560l556k184
$$ plain form
615 18596 21404 7885 194 23 696 -1618 -2680 -2694 -4105 -5007 -5042 -5837 -5885 -5049 -2933 -4559 -3531 -4292
597 -4292 970 -1106 -4949 438 2703 -5955 1452 1239 955 3735 -403 -5507 -11330 -7882 -1511 3144
580 -2272 5576 -10 -2496 471 -1297 -2290 -371 -265 -1866 -9047 -4436 -3796 -1091 -2258 -511 -4273 -3766
563 -3766 -7018 -8674 -6870 -5558 -6225 -6539 -4178 201 3139 -4440 -945 87 1266 1213 -5471 -1822 -777
545 -1343 -2862 -3762 -3241 -1316 638 949 765 -1769 -5441 -8683 -8279 -5819 -4944 -5670 -5661 -5184 -4058 -5494
527 -5494 -5087 -6502 -5075 -5481 -6374 -6657 -4606 -1273 1312 -1931 -1812 -3125 -5340 -4083 -949 18 -178
509 -963 1631 2602 1317 -254 -3288 -8563 -13711 -8030 -3359 -946 -2213 -845 -1704 -3321 -456 -1406 -4206
492 -4206 -8959 -12829 -5517 -3562 989 7068 5045 8404 988 225 3711 440 -3594 -2034 -5590 -7774
476g774R86K865J147q68k507l355l222m0K419K613L008b015c46g2p72j170q01
459b815k242b001b04p081A743M884m88k767c68n957j904J475j270p26K909a214
442C95f76J06n598J085J639j438f4o245b511l166B357L212f21C922a491E63L055
425C618F96a898p86C64Q97c585a333J81l013n62J892b96j524J85C729A664a298
407a176D738L46E5b329o52p96n87o98l55o36b441c66A208O32j33p49@a146j009
388b155o76j0N12P87k919E90K78d498o04b044n65k0J33o77k300l752k054M294
370f985J456J954J585m64m819m991L662L936J801j69k307n6n86r32j794j449R69
353i189K023J741J509j601b673o69k349l014j054K943J198K702j361l264j430
$$ plain form
476 -7774 -6788 -3923 -2776 -3644 -6151 -9506 -12728 -12768 -10349 -7736 -4728 -2015 -346 -72 -844 -2014 -2815
459 -2815 -5057 -2001 -204 -7285 1743 6627 6139 3372 -368 -6325 -8229 -6754 -8024 -8750 -5841 -1214
442 395 -676 -570 -6168 -5083 -3444 -4882 -64 -6309 -2511 -5677 2357 5569 -621 3922 -1491 563 3618
425 3618 696 -1898 -2684 364 1261 -3585 -1333 -1152 -4165 -4727 -2835 -296 -1820 -1635 3729 1664 -1298
407 -1176 4738 5084 55 -2329 -2981 -3777 -4364 -5062 -5417 -6053 -2441 -366 1208 1840 1707 958 0 -1146 -2155
388 -2155 -2831 -2841 -2329 -1542 -4461 590 868 -4498 -5102 -2044 -2609 -2629 -2496 -3173 -5473 -9225 -11279 -6985
370 -6985 -5529 -3575 -1990 -2454 -7273 -12264 -8602 -4666 -2865 -3034 -5341 -5397 -5983 -6915 -8709 -10158 -9189
353 -9189 -7166 -5425 -3916 -5517 -2673 -3342 -5691 -8705 -9759 -6816 -5618 -2916 -4277 -7541 -8971
338h971d479a428D350J729m59a573E81a136o9N13c29R7m36A86K248p49N24K825
320E034a19l799Q54j351a257B796B41P09J431i08k635r28J235j675K044C773K122
303E895e886f44m434k925k464j0051N035d318j17J753o48L64B348D0c506Q37P61
286a908k606d50r4j806o70l553k564K611a987A038c584B80J36a809B081a338k628
269c966k18a844A380a454k625a769C885J452A384a343C95c123M15R90j433O88
253b463D440N6b145A139L173n19A347l48K638n77J65j512m55c614a525P9a03j250
235a353k451k85m681R97b298B049J984C68c571R22O56l129a058o07c23k69m946
218e538a938A23K696J488A685F4J784d20l299h20n205K780A126Q52c680a332j698
$$ plain form
338 -8971 -4479 -1428 4350 6079 5620 -1573 581 -1136 -1205 -692 -329 -232 -668 186 2434 1685 2209 5034
320 5034 -119 -3918 -3064 -4415 -1257 2796 241 950 2381 -908 -3543 -4471 -3236 -4911 -2867 3773 5895
303 5895 -5886 -644 -5078 -8003 -10467 -20518 -15483 -4318 -4435 -2682 -3330 -2966 2348 40 -3506 -2669 -1908
286 -1908 -4514 -450 -544 -2350 -3020 -6573 -9137 -6526 -1987 1038 -3584 280 416 -1809 2081 -1338 -3966
269 -3966 -4184 -1844 1380 -1454 -4079 -1769 3885 5337 1384 -1343 395 -3123 -2708 -1718 -3151 -2463
253 -2463 4440 4496 -2145 1139 4312 3793 1347 999 3637 3060 3225 1713 1258 -3614 -1525 -1446 -103 -1353
235 -1353 -3804 -4089 -8770 -7773 -2298 2049 4033 368 -3571 -2649 -1993 -5122 -1058 -1665 -323 -592 -5538
218 -5538 -1938 123 2819 4307 1685 64 1848 -420 -3719 -820 -6025 -3245 1126 1978 -3680 -1332 -3030
201c030j587J409F78a023l683B434A38d428j052J736J825D503c033F408B992d193
184a0150L174g01l523j607J249K86o28f63C108r07b196k415O65r88J58K171l72
167b977j836k816j923K499c463d75m70k80k136l449b488P56c23k215k195k196
151f929j810j195L26J940K262K002J284o22j54k406J747J14J668H63rd472B199
133C622K22a027e07j344H45a93k180l518k798J836L314a149a97l216o9k343k318
116h143o40J09J47J551L379a717F92b90m31k065o24E08c160l626l319j232J317
99a0020J470J508J390L34p64j635O47L164J051p79C62K396L730A714gA506b480
81a678r39A397a483l888J769Q44B041I9N0K28q5c879a198p26j908l155l763J186
$$ plain form
201 -3030 -4617 -3208 678 -1023 -4706 2434 138 -4428 -5480 -3744 -1919 4503 -3033 6408 2992 -4193
184 -10150 -6976 -701 -4224 -5831 -4582 -4296 -4924 -663 3108 2201 -2196 -4611 -3946 -4934 -4776 -2605 -2977
167 -2977 -4813 -7629 -9552 -7053 -3463 -475 -945 -1225 -3361 -6810 -2488 -1732 -323 -2538 -4733 -6929
151 -6929 -8739 -9934 -9608 -7668 -5406 -3404 -2120 -2742 -2896 -5302 -3555 -3441 -1773 863 854 -4472 2199
133 3622 3844 -1027 -507 -1851 845 -193 -2373 -5891 -8689 -6853 -3539 -1149 -197 -3413 -3482 -5825 -8143
116 -8143 -8783 -8674 -8527 -6976 -3597 -1717 692 -290 -721 -2786 -3410 508 -3160 -6786 -10105 -11337 -10020
99 -10020 -8550 -7042 -5652 -5318 -6082 -7717 -7070 -3906 -2855 -3634 362 2758 6488 1714 -7 1506 -2480
81 -1678 -2617 1397 -1483 -5371 -3602 -2758 2041 99 149 377 292 -3879 -1198 -1924 -3832 -6987 -10750 -9564
63i564L388J833O02Q9P31a385C42h31l67d11j106q96l618h50A344C95K802d709
44C698N321D396D94c275I29P089C536Eb273j651j948k829j851K010J068n03R86
27f991c205A115M78d906O49k91A736e82E29J743a563j551q2G58a395j898a463
9a867n877k513J958K053K756a243B37J820a366
$$ plain form
63 -9564 -6176 -4343 -3741 -3652 -2921 -1385 342 -831 -1198 -411 -1517 -2413 -6031 -850 1344 395 3197 -4709
44 3698 9019 4396 494 -3275 929 8018 3536 5 -2273 -3924 -5872 -8701 -10552 -8542 -7474 -7977 -6991
27 -6991 -3205 1115 1593 -4906 -4257 -4548 1736 -582 529 2272 -1563 -3114 -3196 758 -1395 -3293 -1463
9 -1867 -7744 -10257 -8299 -6246 -3490 -1243 237 2057 -1366
##PAGE= F1=1870.639336563
##FIRST=     2903.44365593433, 2615.24460078534, 2741
##DATA TABLE= (F2++(Y..Y)), PROFILE
1023B741H20a456n28A034Q96b083O88l247p74K625a070k061M12J276k17l98j071
1006c129j947k204K057a337l62k641j620b542B778H80K578j314b53o53k963m08
990d277n33l92p88n63R00J502J453J259c66C56L17d110E61j76b635I2c444j084
972d528j150j174a019B688j058f18r62k958O59q2m48k75j092k07K043J826O74
955a440l74m20K99k428J419j831L68J863l697F25M9b579l3K21L38c58l985J538
937b805N93j734a878l523l53K769M49A665J791f182O24C123m22b983m22N23q48
920c730J642A422h19l093J77j63P71J176P48k321k68a347r81q85k08o7r01N20
902c869a114k156j834J791j158f74C915A915a702O6n66j17k7m75j692j030q26
$$ plain form
1023 2741 820 -1456 -1984 1034 1930 -2083 -1395 -4642 -5416 -2791 -1070 -3131 -2719 -1443 -1660 -2058 -3129
1006 -3129 -5076 -7280 -5223 -1337 -1699 -4340 -5960 -2542 2778 880 3458 2144 -253 -906 -3869 -4277
990 -4277 -4810 -5202 -5990 -6553 -5653 -4151 -2698 -1439 -366 356 673 -4110 561 385 -2635 92 -3444 -4528
972 -4528 -5678 -6852 -1019 2688 1630 -618 -1580 -4538 -3879 -3961 -4409 -4684 -5776 -5983 -3940 -2114 -1440
955 -1440 -1814 -2234 -1935 -4363 -2944 -4775 -4407 -2544 -6241 625 674 -2579 -2612 -2391 -2053 -358 -4343 -2805
937 -2805 -2212 -3946 -1878 -5401 -5754 -2985 -2536 1665 3456 -6182 -5558 3123 2701 -2983 -3405 -2882 -3730
920 -3730 -2088 1422 -819 -3912 -3735 -3898 -3127 -1951 -1203 -3524 -3792 -1347 -2328 -3213 -3421 -3488 -4389 -3869
902 -3869 -1114 -3270 -5104 -3313 -4471 -674 3915 1915 -1702 -1636 -2202 -2319 -2346 -2821 -4513 -5543 -6369
885f369K130a378I23e68l420N25P99J313M64j26C049n43B53b956k121J664i54
867a77r94k507k674j136K119b424A45a124l72l227n46K215L81j138A728a123N25
850e98j597j170J655j807e96j817F714k27d91o39e12j918L38A97b377l411o68
833f456J447b202B259M658k036m33B22K51b545e22m817l070K100J282k29j07K236
816c127i9r64n906I33i82r813A802L752j166b513C328f75l551K80a027j486r75
799c488J039C187Q86b898j101O65j011k940k43J624R78l6j103j754O77L124a309
781b116Q3l016K65K342K9j797j301p81j029j255J337K314K041J195K00p99j362
764c650q66K61R40j713J119p79J049a617j990m88A751B69e029K491a11j363l063
$$ plain form
885 -6369 -4239 -1378 923 -568 -3988 -3463 -2664 -1351 -887 -1013 3049 2506 253 -2956 -5077 -3413 -954
867 -177 -1171 -3678 -6352 -7488 -5369 -2424 145 -1124 -1496 -4723 -5269 -3054 -2673 -3811 1728 -1123 -598
850 -598 -2195 -3365 -1710 -3517 -596 -2413 6714 6487 -491 -1130 -512 -2430 -2092 197 -2377 -5788 -6456
833 -6456 -5009 -2202 2259 6917 4881 4448 222 473 -2545 -522 -5339 -8409 -6309 -5027 -5256 -5363 -3127
816 -3127 -99 -1063 -6969 933 -982 -10795 1802 5554 4388 -2513 3328 -675 -4226 -3946 -1027 -2513 -3488
799 -3488 -2449 3187 4073 -2898 -3999 -3334 -4345 -7285 -7528 -5904 -4926 -4962 -6065 -7819 -7142 -4018 -1309
781 -2116 -2033 -5049 -4784 -2442 -2413 -4210 -5511 -6292 -7321 -8576 -7239 -4925 -2884 -1689 -1489 -2288 -3650
764 -3650 -4516 -4255 -3315 -5028 -3909 -4688 -3639 -1617 -3607 -4095 1751 269 -5029 -2538 -111 -1474 -4537
747d537b267j392L56j750i10l727b247g32l478M11m417J782b958B163J344J33
731C640J934B557c70j505l994b822N43j304n51o89b032N97n42O54r44C09a071
713i84A193d82l288J573d48k096k639P7l632L755b122L80q08Q64j127D405A781
695D50L470h08o531J810K716O77j762k144a823E81c59k224M02hl79J06A793f63
676d442m248J357c041C48K51a062A833d5k238j092J25P24J028h1B77J421p72b029
657c365a526P54D990e64K45D908A893g50j674a072K10m591b331h43l108D87b3
639e422C164l32q66a397A371a330l618O86A409e004a826B8496J47050K31399J92017
624E98962J7697k67818j64926D2885L3329A5074A628J5115H304l237b975j280
$$ plain form
747 -4537 -2267 -3659 -3303 -5053 -910 -4637 -2247 -732 -4210 -3799 -8216 -6434 -2958 2163 3507 3640
731 3640 5574 2557 -370 -1875 -5869 -2822 -2279 -3583 -4134 -4823 -2032 -1435 -1977 -1323 -2267 309 -1071
713 -984 1193 -482 -3770 -2197 -448 -2544 -5183 -5106 -8738 -4983 -2122 -1742 -2550 -1686 -2813 4405 1781
695 450 3920 -808 -7339 -5529 -2813 -2136 -3898 -6042 -1823 581 -359 -2583 -2181 -8 -387 -281 1793 -663
676 -4442 -8690 -7333 -3041 348 599 -1062 1833 -45 -2283 -3375 -3250 -2526 -1498 -81 277 1698 926 -2029
657 -3365 -1526 -772 4990 -564 -319 4908 1893 -750 -2424 -1072 -862 -5453 -2331 -843 -3951 487 -23
639 -5422 3164 2832 1966 -1397 1371 -1330 -4948 -4262 1409 -5004 -1826 28496 175546 406945 598962
624 598962 616659 348841 183915 42885 76214 15074 1628 16743 8304 5067 -2975 -4255
612d255B11L741L04J374j471c855a755j423k58j733b080j832j624J315n01A602
595G66c292D10L648c835a167a2k67B473L866j323A903h26q47E98c332C279a782
577c842B029F90f836b852i21r08p012C513J127a298L50P0n594c123a150A270b069
559d626d49a8C70K016J397b939k95a52C60J532d428g9A94L757p08a085e5j347
541a402k95j181K81k272l077J140L174O23o13l248Q65J70b738r80j190l04b581
523b297j38n82r63j365k32J29Q67J002p54j449i42L69l71j703j572lJ354R02k87
504b253j692l469p70L944a213n40B257a293j678B750j014m27N445B96f563K002
488d561B27N766k175L665B420a253B426E48b309C434O15A676g016K715o03J346
$$ plain form
612 -4255 211 3952 4256 5630 4159 -3855 -1755 -3178 -3436 -5169 -2080 -3912 -5536 -4221 -4722 1602
595 766 -3292 410 4058 -3835 -1167 -12 -279 2473 6339 5016 1903 -826 -1673 598 -3332 3279 -1782
577 -3842 2029 690 -6836 -2852 -921 -1829 -8841 3513 4640 -1298 -948 -878 -6472 -3123 -1150 1270 -2069
559 -4626 -449 -18 370 2386 3783 -2939 -3234 -152 360 1892 -4428 -79 194 3951 3243 -1085 -55 -1402
541 -1402 -1697 -2878 -2597 -4869 -7946 -6806 -3632 -3009 -3622 -6870 -6005 -5835 -2738 -3718 -4908 -5212 -2581
523 -2297 -2435 -3017 -3980 -5345 -5577 -5448 -4581 -3579 -4333 -5782 -942 -573 -944 -2647 -4219 -4222 -2868 -1966 -2253
504 -2253 -3945 -7414 -8184 -4240 -1213 -1753 2257 -1293 -2971 2750 1736 1309 6754 296 -6563 -4561
488 -4561 227 5993 3818 7483 2420 -1253 2426 548 -2309 3434 4049 1676 -7016 -4301 -4904 -3558
472c558J095k558l842b567j023j651k021n47K298J383L42p53j937j716J010J116
456f066o27Q89n33K08N95q8m48k892K991O54j25n07J159a470j31j01m776K569
438c909a387o981b523k281a817j439B016L996g80A159b320k517k040j79c393q97
422d290A703J697a040j729n38k459K853O67H64h10j465B177h18l333a884E595
405E310g04l094k95J939O67j577k235j218K374a328A038J456P58L27L71K33l1
388D152n85j087G61a513k612j487j493r08K40J274K186a961C79J983b754F41J767
371B408A109c536p65A410J368j049f58n308L66n9R0q91r80k34J84l66o17k53K86
352h440J151J978J29b231L88k009k14q25P42k892b738M29L6j069R11n72B599n67
$$ plain form
472 -3558 -2463 -5021 -8863 -2567 -3590 -5241 -7262 -7809 -5511 -4128 -3786 -4539 -6476 -8192 -7182 -6066
456 -6066 -6693 -5804 -6337 -6129 -5534 -5622 -6070 -8962 -5971 -5317 -5442 -5949 -4790 -1470 -1601 -1702 -6478 -3909
438 -3909 -1387 -8368 -2523 -4804 -1817 -3256 2016 6012 -780 1159 -2320 -4837 -6877 -7056 -3393 -4290
422 -4290 1703 3400 -1040 -2769 -3307 -5766 -2913 -2246 864 -810 -2275 2177 -818 -4151 -1884 5595
405 5310 -704 -3798 -4093 -2154 -1487 -3064 -5299 -6517 -4143 -1328 1038 2494 3252 3579 3950 4183 4152
388 4152 3567 2480 761 -1513 -4125 -5612 -7105 -8013 -7773 -6499 -4313 -1961 379 2362 -2754 641 2408
371 2408 1109 -3536 -4301 1410 2778 1729 -658 -5966 -5600 -5659 -5569 -6460 -7440 -7674 -7490 -7856 -8473 -8726 -8440
352 -8440 -7289 -5311 -5182 -2231 -1843 -3852 -4066 -4891 -4149 -7041 -2738 -2309 -2273 -3342 -2431 -3003 2599 2032
334B032C81c644L01q2K84p26j720m54K443a087B15f7j758j751O91J095M32k025
316c383J454A664E58K99f58j146g74A29D7f043K952n2a255l316a271k673n5j232
298e231p351M030b826j339j033l17K051B318B7d121b014m36k117K82l923c542
281A95L229J828k57k441p50a233j28C36a025A280J496J362c60G68J135g23k694
264c417a637C462J274a28m843L31e80B599A5c999K81E343p33C41d20m464j366
247f250a199A029K283R7J899j568n87c145a274N45c55r84k004P34j450g47A696
229C858k03a448l165O40L18o79J561a184a57A87c774E51J480O78m80a443J64C158
210E1d339g39l085J030O93M72j532l01k458k826L134K704a418m658K477k104K095
$$ plain form
334 2032 381 -3644 -3343 -3425 -3141 -3867 -5587 -6041 -3598 -1087 215 -67 -1825 -3576 -2885 -1790 -1358 -3383
316 -3383 -1929 1664 558 857 -658 -1804 -774 129 47 -6043 -3091 -3143 -1255 -4571 -1271 -3944 -3999 -5231
298 -5231 -12582 -8552 -2826 -4165 -5198 -5515 -3464 2318 27 -4121 -2014 -2450 -4567 -4285 -8208 -3542
281 195 3424 5252 4995 2554 1804 -1233 -1361 336 -1025 1280 2776 4138 -360 768 1903 -723 -3417
264 -3417 -1637 3462 4736 -128 -4971 -4640 -580 2599 15 -3999 -3718 5343 4610 341 -420 -4884 -6250
247 -6250 -1199 1029 3312 3409 5308 3740 3153 -3145 -1274 -729 -355 -1339 -3343 -2609 -4059 -747 1696
229 3858 3655 -1448 -4613 -3973 -3655 -4334 -2773 -1184 -157 187 -3774 551 2031 2709 2229 -1443 -1279 3158
210 51 -4339 -739 -3824 -2794 -2101 -1629 -3161 -3462 -5920 -8746 -5612 -2908 -1418 -6076 -3599 -5703 -3608
193c608A292c151R22D013b706C139A447d516J380p08d41k951k825c060N0j316
177d326h28B661E64c040l211j010K57O4n9J007J397R87J63q77j793k076K370b294
158b696k096J671J81a389j181m30l231K162R11Q20K7q27j392j419n79mk19k38
140f989M71J721K272c68l516D66J376k30b797B006j07G55b133l745k619L204J556
123c737J747N48j071j342r94m92n06o10J68J302Q96n31k724k88b594o32j314a564
104B158I51c291l31P84p02Q94i28a64p93l90N73q30j357k27J489C24R18k10C20
84A919R24a079L82l171I44a760l639K274J159G53a244A733a47q93j886j736k205
67f867r73K461K586R23N5k772l881K179a154I87K278b222j245a22A31b071j735
$$ plain form
193 -3608 1292 -3151 -2229 4013 -2706 3139 1447 -4516 -3136 -3844 -441 -3392 -6217 -3060 -3010 -4326
177 -4326 -828 2661 564 -3040 -6251 -7261 -7004 -6940 -6999 -5992 -4595 -3608 -3445 -4322 -6115 -8191 -5821 -2294
158 -2696 -4792 -3121 -2940 -1389 -2570 -3000 -6231 -4069 -3158 -2338 -2311 -3138 -4530 -5949 -6528 -6532 -6751 -6989
140 -6989 -6518 -4797 -2525 -368 -3884 466 1842 1612 -2797 2006 1899 755 -2133 -5878 -8497 -5293 -3737
123 -3737 -1990 -1442 -2513 -3855 -4849 -5341 -5847 -6457 -6289 -4987 -4091 -4622 -7346 -7634 -2594 -3226 -4540 -1564
104 2158 951 -3291 -3622 -2838 -3540 -2646 -928 -164 -957 -1347 -774 -1604 -2961 -3188 -1699 324 1242 1032 320
84 1919 2843 -1079 -697 -3868 944 -1760 -5399 -3125 -1966 753 -1244 1733 -147 -1040 -2926 -4662 -6867
67 -6867 -7840 -5379 -2793 -1870 -1815 -4587 -8468 -6289 -1154 987 3265 -2222 -3467 -122 131 -2071 -3806
50c806C02L0a450A823f172D409L989B802D64d126A427R301O74l937j890B331d127
32b520j397p69m27J21R30J079Q00K37k290o4L20I0c17B192J011a235J74j8l562
13d641l290j218J709J806J445M75k8k79M06a607d80A670a310
$$ plain form
50 -3806 302 332 -1450 1823 -6172 4409 8398 2802 464 -4126 1427 10728 11402 7465 5575 2331 -4127
32 -2520 -3917 -4686 -5113 -4992 -4062 -2983 -2183 -1946 -4236 -4300 -3980 90 -317 2192 3203 -1235 -1061 -1079 -4641
13 -4641 -7931 -9149 -7440 -5634 -4189 -3714 -3742 -4021 -3615 -1607 -480 1670 -1310
##PAGE= F1=1868.082890228
##FIRST=     2903.44365593433, 2615.24460078534, 2485
##DATA TABLE= (F2++(Y..Y)), PROFILE
1023B485A210b407j50f4A0c217a396M78l527j621a596N89r65A011b8B982c7l944
1005c981k201J872J720Q04k784m68J773J139Q47B472F38C12L224b204g63G78C68
987a242q90j211P16j53k11k78l60j63K60M75L82o12J546l241J403R28p63M74A518
967i4k000j513J02N5J023d82l09o82o41p4O17e58J11H61%e569a034j208m06m67
947c115k637J598K69Rj398K413K06g2F04h37k303j36a243l340L65J625m53A068
928I58f112K87b130a18m037K50J32j334J605A701P57e765a167k052j433l28k63
911e243K18P57R97N85j57j168j767j265J539J507L63J224K40k326a564J07k49
894a706o73r58j104q88L22J471J41c76a75r21j911j354J552j524l07K234A345
$$ plain form
1023 2485 1210 -2407 -2557 -64 10 -3217 -1396 -918 -4445 -6066 -1596 -1007 -1972 1011 -28 2982 -37 -3981
1005 -3981 -6182 -4310 -2590 -1786 -4570 -5038 -3265 -2126 -1279 2472 638 312 3536 -2204 -763 778 368
987 -1242 -2132 -3343 -2627 -2780 -2991 -3269 -3629 -3792 -3532 -3057 -2675 -3287 -1741 -4982 -3579 -2651 -3414 -2940 1518
967 -94 -2094 -3607 -3505 -3450 -2427 -482 -791 -1473 -2114 -2188 -1571 -558 -447 861 861 -5569 -1034 -2242 -2648 -3115
947 -3115 -5752 -4154 -3885 -3876 -5274 -2861 -2655 -72 604 -837 -3140 -3276 -1243 -4583 -4218 -2593 -3046 1068
928 958 -6112 -5825 -2130 -118 -4155 -3905 -3773 -5107 -3502 1701 2458 -5765 -1167 -3219 -4652 -4980 -5243
911 -5243 -5025 -4268 -3271 -2686 -2843 -4011 -5778 -7043 -5504 -3997 -3634 -2410 -2170 -4496 -1564 -1457 -1706
894 -1706 -2379 -3337 -4441 -5329 -5007 -3536 -3395 -376 -175 -1096 -3007 -4361 -2809 -4333 -4640 -2406 1345
876a308n44F260j90e37k139l493a472A568N72G17b255l212r87J800J007L10m55
859c792o34o10l39L09J080N58F35d53A907J984j844a471m090b380l49D722m51
842D271a749O07A44b938j772D17b58m714j136K265D17O22R04M15j74B64a786r
824a795j604P41k478G33c42l307q00D231o88a19k879F070N20g775c189G462l668
807C794b361B769A198d106k12c4D0b045L49D839l93c437N73k635a043A456B74
789c43l81k79p1l152a561N57C11b37fm446m93r74j4J068Q40M17R8k37k74J21L98
768c502N34O34M38q2p68j606j542L37O52jM68R31R78n90H27a059m563b402A838
748i93l881Q44p78q4J138a035l330J580L12l109a825L71k562p06a032g8B194J905
$$ plain form
876 -1308 -1852 6260 6070 -537 -2676 -6169 -1472 1568 2140 717 -2255 -5467 -6454 -4654 -3647 -3337 -3792
859 -3792 -4426 -5036 -5375 -5066 -3986 -3428 635 -453 1907 3891 2047 -1471 -5561 -2380 -2729 4722 4271
842 4271 -1749 -1142 144 -2938 -4710 417 -258 -4972 -6108 -3843 417 1039 1943 2358 2184 264 -1786 -1795
824 -1795 -3399 -2658 -5136 733 -342 -3649 -4449 4231 3543 -119 -2998 6070 6590 -7775 -3189 7462 3794
807 3794 -2361 2769 1198 -4106 -4318 -34 40 -2045 -1696 4839 4446 -3437 -2864 -5499 -1043 1456 274
789 -343 -724 -1003 -1074 -4226 -1561 -1004 311 -237 -6 -4452 -4945 -5919 -5933 -4865 -4025 -3608 -3510 -3747 -4021 -3900 -3502
768 -3502 -2968 -2334 -1896 -1978 -2746 -4352 -5894 -5557 -4905 -4906 -4438 -3507 -2529 -3119 827 -1059 -5622 -2402 1838
748 -993 -4874 -4030 -4808 -4892 -3754 -1035 -4365 -2785 -2473 -5582 -1825 -1454 -4016 -4722 -1032 -78 2194 4099
730D099j160d65D20b487k318J141O90J190k063J718R88j112O85j322A01N12P0
713F83k55a343l838a397e16r58j844k067b501J205j139N02j302e85k250B953j079
696A874f81j389b40r113L071c116m84R63l316b174D84f87j966j450n47L71R77
679c302P40K19o09n87J9J229F9a0l490A097f48j714j099j89p24a216j331J056
661a491C726A668b147j100k3J279m176M42K396J104n23j513q96J333J225k007
645d606a885n17j487L58k55j110K296R48P92j05p08q29N30l130h26l521B692J5443
627A8135L8336P5503Q0814L2099m3519r3933A7602k528P446I304M39f7F913a242
612H543K29B141M981K520j449k527B701b06k200k094P08Q89k195O49r58B264P0
$$ plain form
730 4099 2939 -465 420 -2487 -4805 -3664 -2974 -1784 -3847 -2129 -1141 -2253 -1568 -2890 101 613 683
713 683 428 -1343 -5181 -1397 -516 -1474 -3318 -5385 -2501 -1296 -2435 -1933 -3235 -585 -2835 2953 1874
696 1874 -681 -2070 -240 -9353 -6282 -3116 -3600 -2637 -5953 -2174 484 -687 -2653 -4103 -4650 -4279 -3302
679 -3302 -2562 -2343 -2952 -3539 -3520 -2291 69 -10 -3500 1097 -648 -2362 -3461 -3650 -4374 -1216 -2547 -1491
661 -1491 3726 1668 -2147 -3247 -3270 -1991 -6167 -5725 -3329 -2225 -2748 -4261 -5157 -3824 -2599 -4606
645 -4606 -1885 -2402 -3889 -3531 -3786 -4896 -2600 -1652 -860 -965 -1673 -2502 -1972 -5102 -826 -4347 2692 18135
627 18135 56471 131974 212788 244887 201368 107435 17602 15074 22520 9304 9743 -67 6913 -1242
612 8543 8772 2141 7122 9642 8193 5666 2701 -206 -2406 -4500 -3792 -2903 -5098 -4449 -5407 2264 2334
595B334a475d57E095h12l543b069l55D61N412L597l484F12L742q50a606E44c872
577e744F70e73p925c516a199j09o981C608j09b544A00g59k531C44J212B49a645
559f548b769j680j868J336J532Q59j801J17j762J190J423N30j92o68M22J096J035
542a200e34J29l157c46k98j095k172j763J993J037l391R15p07a944j409j421q70
525e644L17Q03Q38N74K10o40m53j203p98P75J635l835a338N16K39k60n38e8C35
505A00a195l179J436L8L04R44k9A883a104r50B806l61a965B792c191n875L626
488e440e65D379A649K478j005b931G28C04l8K910K364j526f173a036n65m6c95
470b159k103c54j520r17j391A968n9f0D864K011B82a678j912k05j300a27k10j401
$$ plain form
595 2334 -1475 -457 5095 -812 -4355 -2069 -2424 461 5873 9470 5986 612 4354 3504 -1606 544 -3872
577 -5744 670 -573 -8498 -3516 -1199 -1308 -8289 3608 3499 -2544 100 -759 -3290 344 1556 249 -1645
559 -6548 -2769 -4449 -6317 -4981 -3449 -2590 -4391 -4274 -6036 -4846 -3423 -2893 -3085 -3753 -3331 -2235 -1200
542 -1200 -534 -405 -3562 -346 -644 -1739 -3911 -5674 -3681 -2644 -6035 -5120 -5827 -1944 -3353 -4774 -5644
525 -5644 -5327 -4524 -3686 -3112 -2902 -3542 -3995 -5198 -5996 -5221 -3586 -7421 -1338 -822 -583 -843 -1381 -58 335
505 100 -1195 -4374 -2938 -2900 -2596 -1652 -1681 1883 -1104 -2054 2806 2445 -1965 2792 -3191 -9066 -5440
488 -5440 -565 4379 1649 4127 3122 -2931 728 304 266 3176 5540 4014 -6173 -1036 -1601 -1647 -395
470 -2159 -4262 -354 -1874 -2791 -4182 1968 1909 -60 4864 6875 282 -1678 -3590 -3795 -5095 -127 -337 -1738
452a738j716j456k47k865L185R32k20a294e12E06c705Q59l218a479P27o597K873
435d476j034j42J647J580h88o13O40k77c0A242g97m117K46g59j404q78n31j057
417d629K250n16K91C38K78b886B55c484l468b277C278j412a172l519m98R48i22
399b316r72N56B88R91P95K24n4J80J024J355J064J75B080i76A190b708L31o39
381c016J19q46c5H00NN928B434c196G98O582j485a412l165D135k29p74A530d216
362a637m18m17k769b079O58j476B896m5J173a32m371K166k477r1m61K19M53O4
344d630K12m78K072J338q02j81j1j711C705J117k336e683b244h64K39g1j01k304
326b476o13m23q8P72M48j25j019j105p71N01J013L35r3L05Q23J189d63k29j083
$$ plain form
452 -1738 -3454 -4910 -5157 -8022 -4837 -3905 -4125 -1294 -512 506 -3705 -2846 -6064 -1479 -752 -7349 -4476
435 -4476 -5510 -5652 -4005 -2425 -888 -1501 -861 -1138 -30 1242 -797 -4914 -4668 -759 -2163 -3041 -3572 -4629
417 -4629 -2379 -2895 -2604 338 616 -2886 255 -3484 -6952 -2277 3278 1866 -1172 -4691 -5189 -4241 -922
399 -2316 -3288 -2732 288 1279 2074 2298 2244 2424 3448 4803 5867 6042 2080 -976 1190 -2708 -2377 -3016
381 -3016 -2897 -3743 -35 800 805 6733 2434 -3196 798 7380 5895 -1412 -4577 4135 3906 3132 1530 -4216
362 -1637 -2055 -2472 -5241 -2079 -1421 -2897 2896 2851 4024 -132 -4503 -2337 -4814 -4905 -5366 -5147 -4694 -4630
344 -4630 -4418 -4896 -2824 -1486 -2288 -2469 -2480 -4191 3705 4822 2486 -5683 -2244 -864 -625 -71 -172 -2476
326 -2476 -3089 -3512 -3600 -2828 -2380 -2505 -3524 -4629 -5400 -4899 -3886 -3551 -3644 -3339 -2516 -1327 -463 -692 -1775
307a775m428N53J266K033K26g92j305k263J772k745K526E84c614k140j15K065
291c804B420C36c728a556r13k805A60h33j767i71A876J677k99A041b214k18Q80
274a552D79b1E601N522A562a17A290O13d36j440L52o99r39C84e604A769m41a495
255d243J91P25A645J808m58N1j135i06k677Q04D28K509J392Q7j280a858J36j360
237c082a038o41p39j130N8c70B600C02a877j629k538Q50k75j60m25p85J0J357
219e472J474J009O03M33N83k714J903D88A84d792e57k647p61j802j51O02k08n06
201f030J837a367A516a429m574J605j387B732K676b152r32G10a925a65k35k567
185b967j374L19a290j254m254a855i11k522a186J26l312K006a127B416q6b87k379
$$ plain form
307 -1775 -6203 -5650 -4384 -2351 -2125 -792 -2097 -4360 -2588 -5333 -2807 584 -3614 -5754 -5869 -3804
291 -3804 2420 336 -3728 -1556 -2469 -5274 160 -833 -2600 -971 1876 3553 3254 1041 -2214 -2432 -1552
274 -1552 479 -21 5601 11123 1562 -117 1290 1903 -436 -1876 -1524 -2223 -3162 384 -5604 1769 1328 -1495
255 -4243 -4052 -3327 1645 3453 2995 3046 1911 -906 -3583 -2779 428 2937 4329 4416 3136 -1858 -1722 -3082
237 -3082 -1038 -1679 -2418 -3548 -3490 -370 2600 302 -1877 -3506 -6044 -5194 -5469 -5629 -6054 -6839 -6829 -5472
219 -5472 -3998 -2989 -2386 -1953 -1370 -4084 -2181 488 184 -4792 -557 -3204 -3965 -5767 -5918 -5316 -5524 -6030
201 -6030 -4193 -1367 1516 -1429 -6003 -4398 -5785 2732 5408 -2152 -3084 710 -1925 -165 -400 -2967
185 -2967 -4341 -4022 -1290 -2544 -6798 -1855 -911 -3433 -1186 -1060 -4372 -2366 -1127 2416 2330 -287 -2666
168b666j410J953a85G18j03C9g06r88k148a225j701m89m46a368j638k269j221
151f496N62M87N9K88L35q7m16N98J600a372H8P25L1D00b63j196r57j113j076j150
131e755Q5J858a467I50J081K87a386l348J291a131L69j679j530c23j872l6h12
113H89J315c694f95B650a21l620k597f12J5p60j402q28j140Q92a631d33k0k053
95b506J42b64D6a660r16a281j3M01M29j695J25k141k461J552r28a332q91m448
77f671K673a568A91b544P39k634k031P86K062a534F12J851Q81d75C47K02c712
59B435e89H90J120b921O64D44a27j835P54B532j230c522C37d987A924F53a04m9
41a53k047A541J060O23K88m37r36c372k08q35a103j507A412M310K540r5A553c637
$$ plain form
168 -2666 -4076 -2123 -185 718 615 39 -706 -1694 -3842 -1225 -2926 -3415 -3861 -1368 -3006 -5275 -6496
151 -6496 -5934 -5447 -5388 -5100 -4765 -4852 -5268 -4670 -3070 -1372 88 813 844 400 -263 -1459 -2416 -3529 -4605 -5755
131 -5755 -5670 -3812 -1467 950 2031 2318 -1386 -4734 -3443 -1131 -762 -2441 -3971 -323 -2195 -2231 -812
113 889 2204 -3694 -695 2650 -121 -3741 -6338 -612 -597 -1357 -2759 -3587 -4727 -3835 -1631 -433 -453 -2506
95 -2506 -2364 -264 46 -1660 -2576 -1281 -1294 -893 -464 -2159 -2034 -4175 -6636 -5084 -6012 -1332 -2223 -6671
77 -6671 -3998 -1568 191 -2544 -1805 -4439 -6470 -5684 -3622 -1534 612 2463 3344 -475 347 549 -3712
59 2435 -589 890 2010 -2921 -2257 444 -127 -1962 -1208 2532 1302 -3522 337 -4987 1924 653 -104 -153
41 -153 -2200 1541 2601 3224 3512 3075 2139 -3372 -3580 -4415 -1103 -2610 1412 5722 8262 8167 1553 -3637
22d464J481i65b46q70k198j413J04Q51K93n08j098j068Q46J609Q13N66O01j195
4b913a081n24A088a607
$$ plain form
22 -4464 -2983 -965 -246 -1116 -3314 -4727 -4623 -3772 -3479 -3987 -5085 -6153 -5307 -3698 -2885 -2319 -1718 -2913
4 -2913 -1081 -1605 1088 -1607
##PAGE= F1=1865.526443893
##FIRST=     2903.44365593433, 2615.24460078534, -4221
##DATA TABLE= (F2++(Y..Y)), PROFILE
1023d221P36%l44a830p74j094J543N74j157k083J758D70a727B199a38C528A616
1005c191k393a802A194a544k136o09m92N73L99A110a328G47M235H4c15E09e82
987b238q81j675K70o69m36J40P27J150J760C94K270c025j665j22a574I65a59m559
969d718e65p68j56L51j629m35K7J23j043R86f85A977R1B82a713E734k071f352
950A889k23J56pd859F87i76k254k394K342Q69b2B282c82k959P24h10k982L27O08
931b857j199n65j976J150R81H90L12e143J371j162j136R76G88J821e153K375j159
914c937j775N23J281r79J162J655o39j205j712j554Q93J254N57K142a105K47k634
897c492a411j041p6R30f37b01F2Qc53k065C709j498g64k643J614P27l570k88a358
$$ plain form
1023 -4221 -3485 -3485 -3829 -1830 -2604 -3698 -2155 -1581 -2738 -4821 -3063 470 -1727 2199 -138 3528 1616
1005 -3191 -5584 -1802 1194 -1544 -3680 -4289 -4781 -4208 -3809 1110 -1328 747 4982 84 -315 509 -582
987 -2238 -3119 -4794 -4524 -5193 -5629 -5489 -4762 -3612 -1852 394 2664 -3025 -4690 -4812 -1574 965 -159 -4718
969 -4718 -565 -1333 -1489 -1138 -2767 -3202 -3175 -3052 -4095 -3109 -685 1977 2068 282 -1713 5734 3663 -6352
950 1889 1666 1822 1815 -4859 687 -976 -3230 -5624 -3282 -2413 -22 2282 -382 -3341 -2617 -810 -3792 -3465 -2857
931 -2857 -4056 -4621 -6597 -5447 -4466 890 1202 -5143 -3772 -4934 -6070 -5094 788 2609 -5153 -2778 -3937
914 -3937 -5712 -5189 -3908 -4887 -3725 -2070 -2709 -3914 -5626 -7180 -6287 -5033 -4476 -2334 -1105 -858 -3492
897 -3492 -1411 -2452 -2528 -1598 -637 -201 62 70 -353 -2418 3709 2211 -764 -3407 -1793 -1066 -4636 -4924 -1358
877I54b511l67D617r49a322l347l38a758E46P78l77d64j513j288r50j165j335
860f715J235K696N13C12i95j699N40A30J9J939J551D81b729l499K314M7A176k62
842I14c286a389F85a394l515m83p62N48j87J684J161N3n96j314j002J149J042
825c616O38o6j97n68j224j441J682J715F52J459K58r54A94c22j155o395F571B264
806b141A347J036K320E8d870a099B19f04E963K109c034K44l135K720A091N96J143
789B830N67j219D20d370J047L18K88a086A233d208m33n62a627A446b91j921k028
772d240k160J842K253i0A175a84E301N35a71B954F3a802l26i81F59c939a852j002
754b854i43j908k883a615D588A181d519b054J69n99j772k776K948J073M41k408
$$ plain form
877 954 -2511 -2878 4617 3668 -1322 -4669 -5007 -1758 546 1324 947 -464 -1977 -3265 -4215 -5380 -6715
860 -6715 -5480 -2784 -2271 312 -995 -2694 -2154 130 149 2088 3639 481 -2729 -6228 -3914 -3867 1176 914
842 914 -3286 -1389 685 -1394 -4909 -5392 -6154 -5606 -5793 -4109 -2948 -2895 -3491 -4805 -5807 -4658 -3616
825 -3616 -2978 -3044 -3241 -3809 -5033 -6474 -4792 -3077 652 2111 2369 1415 194 -322 -1477 -7872 6571 2264
806 -2141 1347 2383 4703 58 -4870 -1099 219 -604 5963 8072 -3034 -2790 -5925 -3205 1091 1687 2830
789 2830 3397 2178 420 -4370 -3323 -3005 -2717 -1086 1233 -4208 -4641 -5203 -1627 1446 -291 -2212 -4240
772 -4240 -6400 -4558 -2305 -90 1175 -184 5301 5836 -171 2954 63 -1802 -2128 -981 659 -3939 -1852 -2854
754 -2854 -943 -2851 -5734 -1615 4588 1181 -4519 -2054 -1885 -2484 -4256 -7032 -4084 -3011 -2570 -4978
738d978e20J43k900j274P31P76G25L789j999d95B067E95d466J250L27k573J242
721d220P05g01j815N94r86a255e12j507j718j543N75J712J260M12o42k670q69
704e502m65J821J215o65a415j242E36J57d40k405l141k029L046J536j497a514
687e063b359H51K049a588A985K647a116j048A752b87B501q65c982a501o21j308
671c430j582n82Q0J092J626O33l383b228k134a753B243j064b108r54j567G30L748
654D478b558e0j616q50O11l021A643p14c550i30k247p12I96b952k796J681j360
637e427m00k0N32Q62J156l754A055C50a938H606L3889P7647N7638J2282m1458
622A48604D9205B1404A628P676L584k958a662G393B659J939j015e229B695l9n94
$$ plain form
738 -4978 -520 -377 -3277 -4551 -3820 -3044 725 4514 2515 -495 2067 595 -4466 -3216 -2889 -5462 -4220
721 -4220 -3515 -701 -2516 -1922 -2908 -1255 -512 -2019 -3737 -5280 -4705 -2993 -1733 -1321 -1963 -4633 -5502
704 -5502 -5967 -4146 -2931 -3596 -1415 -2657 536 693 -440 -2845 -5986 -8015 -4969 -3433 -4930 -1514
687 -5063 -2359 851 2900 -1588 1985 4632 -1116 -2164 1752 -287 2501 1636 -3982 -1501 -2122 -3430
671 -3430 -5012 -5594 -5514 -4422 -2796 -2163 -5546 -2228 -4362 -1753 2243 1179 -2108 -3062 -4629 730 4478
654 4478 -2558 -50 -1666 -2516 -1905 -4926 1643 929 -3550 -930 -3177 -3889 996 -2952 -5748 -4067 -5427
637 -5427 -5827 -5847 -5315 -4453 -3297 -7051 1055 350 -1938 8606 42495 120142 177780 190062 148604
622 148604 49205 21404 1628 9304 12888 9930 -1662 7393 2659 4598 3583 -5229 2695 2656 2062
607B062E85a318j795q87L41N86J80l93q77j947b574a183B69a924B672A334f876
589d253J31e98E108J558m64I13L443j600C38b053l405j984B65O52d703J377I56
571b039n424B340j078d559G84c96k94I44i25j909j876j571j9J458J514a574A83
553e34k631f14C980J884E00J610C49J470J428i45k854a580A273h96E575j033J072
536E614h47a50j566p00l000R26j030g51L9l679J732J049j822j821j543R36L65
519e495M6j324J128K288j7m534a464A616p84a274k357j533J132J271P40k981R47
502d055N08p83l29Q2R77J621f97F11Q35d844a960n194l385e026a146p86r94j323
484d249m44J55J974M77m82j336l07J949l655F39J518J6H21a018k009j290J368
$$ plain form
607 2062 585 -1318 -3113 -4000 -3659 -3073 -2893 -3286 -4163 -6110 -2574 -1183 269 -1924 2672 1334 -6876
589 -4253 -4122 -598 5108 6666 6202 913 4356 2756 338 -2053 -5458 -7442 265 917 -4703 -3326 956
571 -2039 -7463 2340 1262 -4559 784 -396 -690 944 -925 -2834 -4710 -6281 -6300 -4842 -3328 -1574 183
553 -534 -3165 -614 3980 5864 500 2110 349 1819 3247 -945 -3799 -1580 1273 -896 5575 4542 5614
536 5614 -847 -150 -1716 -2416 -5416 -4490 -5520 -751 -712 -4391 -2659 -1610 -3432 -5253 -6796 -5860 -5495
519 -5495 -5449 -6773 -5645 -3357 -3374 -7908 -1464 1616 832 -1274 -3631 -5164 -4032 -2761 -2021 -5002 -4055
502 -4055 -3547 -4330 -4659 -4577 -3600 -1979 -697 611 1446 -4844 -1960 -7154 -10539 -5026 -1146 -1932 -2926 -4249
484 -4249 -4693 -4538 -2564 -2087 -2569 -3905 -4212 -2263 -5918 639 2157 2173 821 -1018 -3027 -4317 -2949
467b949c08l623A005P97A29J648f08k335l03J338R35l361h48j024j283r42o67
450d764j12k742K370m47m94J541J156J020k694J181j399K358b28m055j612K460
434c435J562d80D69h15j539j985h1j221E04a692m466K524G62l65el291o96d22
415e31C86J631J2c225J441l879M07b616H22J233a360l772k7j328b631k261j440
398f332F51k73b36q02j260j233R3J472h13c80k26l420M90a102o19g08a35p40j550
379b425A901d05k80F116B226c481A978O503j130a08m239a98l085q0e07j630l464
362e601g4k182m157b527p44J321C502j009J354B9c477J504l139D61a38n99l857
345d594a331d63k658E09P68c475a139j177j754B116J170g56n531K568c52l75O5
$$ plain form
467 -2949 -308 -3931 1005 1802 129 1777 -608 -2943 -3246 -1908 -973 -4334 -848 -1872 -3155 -4097 -4764
450 -4764 -4876 -7618 -5248 -5695 -6189 -4648 -3492 -2472 -5166 -3985 -5384 -3026 -228 -4283 -5895 -3435
434 -3435 -1873 -480 469 -815 -2354 -4339 -81 -1302 504 -1692 -6158 -3634 762 397 -5 -3296 -3992 -422
415 -531 386 2017 2029 -3225 -1784 -5663 -5256 -2616 822 2055 -1360 -5132 -5159 -6487 -2631 -4892 -6332
398 -6332 651 378 -236 -1038 -2298 -3531 -3438 -1966 -813 -380 -606 -4026 -3536 -1102 -1721 -708 -135 -875 -2425
379 -2425 1901 -405 -685 6116 2226 -3481 1978 8481 7351 -108 -4347 -198 -3283 -3363 -507 -2137 -5601
362 -5601 -74 -2256 -6413 -2527 -3271 -1950 3502 2493 3847 29 -3477 -1973 -5112 461 -138 -737 -4594
345 -4594 -1331 -463 -3121 509 1277 -3475 -1139 -2316 -4070 2116 3286 -756 -6287 -3719 -352 -727 -662
328f62K72l774O00j016J761j362r25L89M34N64M50O26J031r44a199j238j371A162
309A111l63k25c187N87d76p85c61D78@e980J432r34b652d96k737j928J546L30
291c285A084m12c163a470o69m181i58o4G56L0K140K14k76A022N50J056c45I57
272A460K597M252a378e15B424K09g79j617r24J111Q37f86n548g76n37j87J82k866
254d184K034kl53OK79K06N40d36F87J015N40L40j6p86a25j774j328J316M7P67
234a097k909J094J437p52o36k81K45k440J955J111K28j010j614j676J004J931
218c410J058M22M87b82r68n78B842A33d530a275k429k106J173P45K7n94N0J542
200b867h78F0b353k826l02J139E74J950e72m027j117a882m02L08Q07k375r29K169
$$ plain form
328 -662 -390 -4164 -3564 -4580 -2819 -4181 -5106 -4717 -4283 -3719 -3269 -2643 -1612 -2556 -1199 -2437 -3808 1162
309 1111 748 523 -3187 -2600 -476 -1261 -361 478 0 -5980 -4548 -5482 -2652 -496 -3233 -5161 -3615 -3285
291 -3285 1084 672 -3163 -1470 -2139 -6320 -958 -1022 756 786 2926 3140 2864 1022 1572 2628 -345 957
272 1460 4057 8309 -1378 -515 2424 2633 -779 -2396 -3320 -2209 -1372 -686 -6234 -776 -1313 -1500 -1318 -4184
254 -4184 -2150 -2152 -2505 -2499 -2220 -2014 -1474 -436 687 1702 2242 2582 2566 1780 -125 -1899 -3227 -1911 -1864 -1097
234 -1097 -4006 -2912 -1475 -2227 -2863 -3144 -2899 -5339 -3384 -2273 -2045 -3055 -4669 -6345 -5341 -3410
218 -3410 -2352 -1930 -1443 -282 -1250 -1828 2842 133 -4530 -1275 -3704 -5810 -4637 -3892 -3865 -4459 -4409 -2867
200 -2867 -878 60 -2353 -5179 -5481 -4342 574 2524 -572 -4599 -5716 -1882 -2284 -1976 -1169 -3544 -4473 -2304
182b304N87l420i91A101b775a349C47c374N90E62L832K365C033c95E462m42j784
165C236A055l77d61j452j071k023J801k13o71k19N89R21L93j788j75j658R86J752
147c289R99p1j250j922l67J761J393N44k68r21j341p97K242f54k356o20E055K284
129G339c107F125D50J243c756J810k078a808j833a780j338A629L177l75A843l04
113A539d50l078J5m99k97R0p20b039f50D07b405M2j848J191I96Q1B22b196j196
94c392C14N83e10j668j272M49O05P45l055B583o45A49a311k693a970L24m061m8
76e755b264a94k615A116l10B72h64k80K92h8F26M72m56A76R0c430B830g81B37
56A41b966i87l095r63J971h57A393J811d146B84c144B919A290b59r62k77Om00
$$ plain form
182 -2304 -1717 -5137 -991 1101 -2775 -1349 347 -3374 -2784 562 4394 6759 3033 -395 5462 5020 3236
165 3236 1055 678 -461 -1913 -2984 -5007 -3206 -3419 -4090 -4309 -3720 -2799 -2406 -4194 -4369 -6027 -5041 -3289
147 -3289 -2290 -2361 -3611 -5533 -5900 -4139 -2746 -2202 -2470 -3391 -4732 -5529 -3287 -654 -3010 -3630 5055 7339
129 7339 -3107 6125 450 1693 -3756 -1946 -4024 -1808 -3641 -1780 -3118 1629 4806 4431 1843 1539
113 1539 -450 -3528 -3513 -4012 -4309 -4219 -4939 -2039 -650 407 -2405 -2363 -4211 -3020 996 1077 222 -2196 -3392
94 -3392 314 897 -510 -2178 -3450 -3001 -2396 -1651 -4706 2583 1938 149 -1311 -4004 -1970 -1646 -5707 -5755
76 -5755 -2264 -194 -2809 1116 806 272 -864 -1144 -852 -88 626 1098 642 176 266 -3430 2830 -781 237
56 141 -2966 -987 -4082 -5045 -3074 -857 1393 3204 -4146 284 -3144 2919 1290 -259 -1221 -1498 -1492 -1892
38a892j102j355r60J012J234j118M5b015j053R94d25A950K547D52c315j468K386
21b397r46d45k402j823N87J628i13k10j485A934M28d140B018I63cj326j520J28
3b721r71n91m70
0d753
$$ plain form
38 -1892 -2994 -4349 -5309 -4297 -3063 -4181 -4136 -2015 -3068 -2074 -425 1950 4497 452 -3315 -4783 -2397
21 -2397 -3343 -445 -2847 -4670 -4083 -2455 -913 -1123 -2608 1934 2362 -4140 2018 963 -3 -1329 -2849 -2721
3 -2721 -3692 -4283 -4753
0 -4753
##PAGE= F1=1862.969997557
##FIRST=     2903.44365593433, 2615.24460078534, -1063
##DATA TABLE= (F2++(Y..Y)), PROFILE
1023a063M98k429j328R85p56R47N27O50k842j942K792a434k00B23d54j156q51
1006b461m6P10h34Ga720O44k535j510O78j126c58k375A752K572B068n34A17L410
988C527m68a442m279I63a00l591K0j531K319D72L954k101b717l379K858a9C862
970B158e296A885e69j197h74j307o41j498A254K587j211I99h2C34b27m162C399
952B868f096A754J098J811r85d323C410I84a819l271m35b461d43A62e95k661k470
935e726l83J483M53J02j495a966G60d478K188B662G00d690J152j057L73k76h90
917B594c894j589K116k210Q68J933j930M15J678o56k51m35j38m22r8P26J507h13
898d24k646J432M97k007k062p26J094J104Q31K27n55j084k52b163H88K589a491
$$ plain form
1023 -1063 -565 -2994 -4322 -3337 -4093 -3146 -2619 -1969 -4811 -6753 -3961 -1434 -1634 223 -454 -1610 -2461
1006 -2461 -2507 -1797 -834 7 -1720 -1076 -3611 -5121 -4443 -5569 -358 -2733 1752 4324 2068 1534 117 3527
988 3527 3059 -1442 -5721 963 -100 -3691 -3671 -5202 -2883 472 4426 2325 -2717 -6096 -3238 -19 3862
970 2158 -5296 1885 -569 -1766 -874 -2181 -2822 -4320 1254 3841 2630 999 -82 334 -227 -4389 3399
952 2868 -6096 1754 2852 4663 3678 -4323 3410 984 -1819 -5090 -5525 -2461 -443 162 -595 -3256 -5726
935 -5726 -6109 -4626 -4173 -4071 -5566 -1966 760 -4478 -2290 2662 700 -4690 -3538 -4595 -4222 -4498 -890
917 2594 -3894 -5483 -3367 -5577 -4709 -2776 -4706 -4291 -2613 -3269 -3520 -3955 -4093 -4515 -4613 -3887 -2380 -813
898 -424 -3070 -1638 -1141 -3148 -5210 -5936 -4842 -3738 -2907 -2680 -3235 -4319 -4571 -2163 888 3477 -1491
880e043Q42b38l54m087P37B192c90k663j779J106a834b92A67c56j643j922j546
863e467m49k69J9J852a037k1B461j69B56a278N00C01J311J133B20c393j397N50
845d240M88R76m68k117a575k137k088K35K321f73j542l856J127a78r64k947j564
828e653J835J182l93j487k50K012R22h1B07a899h39a4o40r26q89n98n01l90p41
809d699g93A79a851g94K59B939J83a717m445C94HO116K614b442j720J931j250
792c481d6A062J337r22a504k596j055K04J064a213B549O23d749R33o19a768A226
774I69a767k155M66J550d97E31c137e32B620k04a565c34j435m50P74B73K66b422
755a888j692M37j259j174a234B010a199l323k361J528J127O07R2k69o33j99P14
$$ plain form
880 -5043 -4201 -238 -592 -4679 -3942 2192 -390 -3053 -4832 -3726 -1834 -292 167 -356 -1999 -3921 -5467
863 -5467 -5916 -6185 -6166 -4314 -1037 -1058 2461 2292 256 -1278 -778 301 1612 2745 220 -3393 -4790 -4240
845 -4240 -3752 -2776 -3244 -5361 -1575 -3712 -5800 -5565 -3244 -673 -2215 -6071 -4944 -178 -1142 -4089 -5653
828 -5653 -3818 -2636 -3029 -4516 -4766 -2754 -1832 -81 207 -1899 -839 -14 -654 -1580 -2469 -3067 -3568 -3958 -4699
809 -4699 -793 179 -1851 -794 -535 2939 3122 -1717 -6162 394 8 6124 8738 -2442 -4162 -2231 -3481
792 -3481 -46 1062 2399 1477 -1504 -4100 -5155 -4951 -3887 -1213 2549 3172 -4749 -3816 -4435 -1768 1226
774 969 -1767 -3922 -3456 -1906 -497 531 -3137 -532 2620 2416 -1565 -334 -1769 -2219 -1445 273 539 -2422
755 -1888 -3580 -3143 -4402 -5576 -1234 2010 -1199 -4522 -6883 -5355 -4228 -3621 -3529 -3798 -4431 -4630 -3916
738c916i85E11b971j586j056J268h29B597A115f92B624J54a716k068J588A46b464
720e552O03J797R80m78p93I01O00e99k075n17J148K45m01j227m43J503i2l534
702c626R10r02F32b332i7B482p64f65l116l196J270J395O57f15l395J517A516
684C755a790C2M858a294k168f63l210a220m96k513K060l29m80k739K056K82R84
667b395a143j139j710N01j123b053j77h28j314l53k076B349J887b104A438c51
650a437f64m500B620B75b498J146k031n51b37k462l373b370l9N49h27E94J192
633A786P51b778a282E72L221J244J4175L0176L9057K5835k453C679N625P439p000
618I743J87m42b954D033A098a488k272j383K49R00J42m20R0O88P66N99K32K24
$$ plain form
738 -3916 -985 511 -2971 -4557 -5613 -4345 -829 2597 1115 -692 2624 2778 -1716 -3784 -2196 146 -2464
720 -5552 -4949 -3152 -2172 -2650 -3443 901 1501 -599 -2674 -3191 -2043 -1798 -2199 -3426 -3869 -2366 -92 -3626
702 -3626 -2716 -3618 632 -2332 -97 2482 1718 -665 -3781 -6977 -5707 -4312 -3655 -615 -4010 -2493 1516
684 3755 -1790 32 4890 -1294 -3462 -663 -3873 -1220 -1716 -4229 -2169 -2498 -2978 -5717 -3661 -3379 -2395
667 -2395 -1143 -2282 -3992 -3491 -4614 -2053 -2230 -828 -2142 -2495 -4571 2349 4236 -2104 1438 -351
650 -1437 -664 -5164 2620 275 -2498 -1352 -3383 -3934 -237 -2699 -6072 -2370 -2409 -1860 -827 594 1786
633 1786 2537 -2778 -1282 572 3793 5037 19212 49388 88445 114280 111827 3679 9304 16743 9743
618 9743 9930 9488 -2954 4033 1098 -1488 -3760 -5143 -4894 -3994 -3852 -4272 -4182 -3494 -2728 -2129 -1897 -1673
600a673L84k088k792c82n28k38k227D25K46b766j015L44j044J305a256e7F04k86
582C18f90j257j687j191l93C264j172b496j617c92l840l009b205j712k094J429
566d582K204f81g0o91j395q37k056a490k025H59K675M10E00f80f7C968L441C575
547B278e30l3F89c015l016Q48K209f65B215L087J727c31pj377m05k910J309j007
529d728g46E32c073a200M30k643J84A540c6j989j196j344j83J601j81k705K821
512c212A663n85J00b809k503i55L94r02k862J74J337j545J055a536G3f30A221
494A420g29n012J86m519J515b887n86r39K082r96C10e190K565j454o96J725a258
476D07d839B397k94F35a880k157J051d29k872a386k12A13J238B30c38k101k181
$$ plain form
600 -1673 -1289 -3377 -6169 -382 -910 -1148 -3375 425 671 -2766 -3781 -3437 -4481 -3176 -1256 -57 604 318
582 318 -690 -1947 -3634 -4825 -5218 3264 2092 -2496 -4113 -392 -4232 -7241 -2205 -3917 -6011 -4582
566 -4582 -2378 -681 -70 -761 -2156 -2993 -5049 -1490 -3515 859 3534 3944 500 -680 -67 3968 7409 3575
547 2278 -530 -563 689 -3015 -6031 -5183 -2974 -665 2215 5302 7029 -331 -338 -1715 -2120 -5030 -3721 -4728
529 -4728 -746 532 -3073 -1200 -770 -3413 -3229 1540 -36 -2025 -3221 -4565 -4748 -3147 -3328 -6033 -3212
512 -3212 1663 1078 1178 -2809 -5312 -955 -561 -1463 -4325 -4151 -2814 -4359 -3304 -1536 73 -630 1221
494 1420 -729 -5741 -5555 -10074 -8559 -2887 -3473 -4412 -2330 -3326 310 -5190 -2625 -4079 -4775 -3050 -1258
476 407 -4839 2397 2103 635 -1880 -4037 -2986 -429 -3301 -1386 -1598 113 1351 230 -338 -2439 -4620
459d620k09J307P53j141J509j70J03J78L92m1o141d001j716m59J964J910Q26j322
441b798j691J458C188K344h17n331c030R54i8n19l27j836j970C02b708K60j822
424d270k278Q73J144J155O80K62K2n59r57o43p0N23Q19m4j422K152j19j0l05a333
403e187J443j072J398j453J902G68g81j384o40j7L61J07l45j028j064O11J592
386b588J055e56r22c06A666f22o44H69a068j513j212J186L89A34O10L75D99c933
367E85J87O78j63E49e339a786k66l731b054k514B8L705A676J701D8c013P96l290
349e507A000N183A567d917a779D92a913A741L0d159e22j670n84b8m50k197j819
332d494Q16a020L02c59o08l451K046l611H14N35l38a14j676j554j558k60J674
$$ plain form
459 -4620 -4829 -3522 -2769 -3910 -2401 -2571 -2468 -2290 -1898 -1939 -8080 -4001 -5717 -6176 -4212 -2302 -1476 -2798
441 -2798 -4489 -3031 3188 5532 -817 -6148 -3030 -2076 -98 -617 -944 -2780 -4750 302 -2708 -2448 -4270
424 -4270 -6548 -5675 -4531 -3376 -2696 -2434 -2412 -2971 -3928 -4571 -4641 -4118 -3299 -3343 -4765 -2613 -2732 -2742 -3047 -1333
403 -5187 -3744 -4816 -3418 -4871 -2969 768 -781 -2165 -2805 -2822 -2461 -2354 -2699 -3727 -4791 -4180 -2588
386 -2588 -1533 -556 -1478 -306 1666 -622 -1266 869 -1068 -2581 -3793 -2607 -2218 134 744 1119 499 -3933
367 585 772 1450 1287 549 -5339 -1786 -2052 -5783 -2054 -4568 28 3733 1676 3377 48 -3013 -2217 -5507
349 -5507 1000 6183 1567 -4917 -1779 492 -1913 1741 1771 -4159 -522 -2192 -2776 -28 -478 -2675 -4494
332 -4494 -3678 -1020 -718 -359 -967 -4418 -2372 -5983 814 1349 1011 -114 -1790 -3344 -4902 -5162 -3488
315c488J359a006l842o8A184j8j78K52A87a919K69m25E26J171Q5h474d169L04
297c865h73H46c466j289a051n81B472H22b973J077N2l883b457B652K75A56J832
280A988F36A40d59A272D53A55P53J328P14j91c379a613f48K10j482D26a164o47
262a811k60q45k286b511P39P25M83k481a256r91j150j122m22J35K15L38K35J66
244c852j46j75k86m02M40J516a322l27j70i2l628R05g40A681G22f54j317k097
$$ plain form
315 -3488 -2129 -1006 -4848 -4916 1184 1166 988 1240 187 -1919 -1650 -2075 526 1697 1782 -8474 -4169 -3865
297 -3865 -873 846 -3466 -4755 -1051 -1632 2472 822 -2973 -1896 -1844 -5727 -2457 2652 2927 156 1988
280 1988 636 140 -459 1272 453 155 908 2236 2950 2759 -3379 -1613 -648 -438 -1920 426 -1164 -1811
262 -1811 -2071 -2916 -5202 -2511 -1772 -1047 -564 -3045 -1256 -2247 -3397 -4519 -4941 -4806 -4591 -4253 -4018 -3852
244 -3852 -3998 -4173 -4459 -4861 -4421 -2905 -1322 -1649 -1819 -92 -3720 -2815 -740 1681 722 -654 -1971 -4068
$$ [...]
##END NTUPLES=nD NMR SPECTRUM
##END=
