##TITLE=Analysis number 328913
Compound Code cc 12601
Book Reference lab3
Project Code adrs
Chemist Name stores
##JCAMPDX= 6.0         $$ Bruker NMR JCAMP-DX V2.0
##DATA TYPE= NMR SPECTRUM
##DATA CLASS= NTUPLES
##ORIGIN= Bruker BioSpin GmbH
##OWNER= nmr
$$ XWIN-NMR		Version 3.5
$$ Mon Jul 16 10:15:50 2007 GMT Daylight Time (UT+1h)  MAYBRIDGE\nmr@NMR_250MHZ
##.OBSERVE FREQUENCY= 250.131544655141
##.OBSERVE NUCLEUS= ^1H
##.ACQUISITION MODE= SIMULTANEOUS (DQD)
##.ACQUISITION SCHEME= undefined
##.AVERAGES= 16
##.DIGITISER RES= 18
##SPECTROMETER/DATA SYSTEM= dpx250
##.PULSE SEQUENCE= zg30
##.SOLVENT NAME= DMSO
##.SHIFT REFERENCE= (INTERNAL, DMSO, 0, 16.522)
##AUDIT TRAIL= $$ (NUMBER, WHEN, WHO, WHERE, WHAT)
$$ ##TITLE= Audit trail, XWIN-NMR		Version 3.5
$$ ##JCAMPDX= 5.01
$$ ##ORIGIN= Bruker BioSpin GmbH
$$ ##OWNER= nmr
$$ C:\u/data/dgb/nmr/ADRS/1010/pdata/1/auditp.txt
$$ ##AUDIT TRAIL=  $$ (NUMBER, WHEN, WHO, WHERE, WHAT)
(   1,<2007-07-16 10:15:25.01 +100>,<MAYBRIDGE\nmr>,<NMR_250MHZ>,
      <created by zg, POWCHK disabled, PULCHK disabled
       configuration hash MD5:
       76 6E 9A 78 1E 09 19 81 EC 84 63 8F B0 6A 59 2D
       data hash MD5: 64K
       21 EB 90 A9 2D 7F 59 23 FB A7 10 C5 CF 1C D4 01>)
(   2,<2007-07-16 10:15:42.53 +100>,<MAYBRIDGE\nmr>,<NMR_250MHZ>,
      <Start of raw data processing
       ef LB = 0.3 FT_mod = 6 PKNL = 1 SI = 32K 
       data hash MD5: 32K
       98 62 02 9C 11 77 33 70 E9 84 C6 BA 8E 14 F2 72>)
(   3,<2007-07-16 10:15:44.89 +100>,<MAYBRIDGE\nmr>,<NMR_250MHZ>,
      <apk 
       data hash MD5: 32K
       C7 13 A8 7D 0C 94 9A 47 C8 07 BA 30 0B DE 26 3C>)
(   4,<2007-07-16 10:15:45.67 +100>,<MAYBRIDGE\nmr>,<NMR_250MHZ>,
      <abs ABSG = 5 
       data hash MD5: 32K
       41 F8 58 DC 66 DB 15 D0 D7 7F C8 34 E2 18 76 78>)
$$ ##END=
$$ 
$$ hash MD5
$$ 0A 7A B9 84 D9 36 6D CD D0 26 E1 E6 FA B6 25 4D
##$RELAX= 
##$RELAX= 
##$RELAX= 
##$RELAX= 
##$RELAX= 
##$RELAX= 
##$RELAX= 
$$ Bruker specific parameters
$$ --------------------------
##$DU= <C:\u>
##$EXPNO= 1010
##$NAME= <ADRS>
##$PROCNO= 1
##$TYPE= <nmr>
##$USER= <dgb>
##$AMP= (0..31)
100 100 100 100 100 100 100 100 100 100 100 100 100 100 100 100 100 100 
100 100 100 100 100 100 100 100 100 100 100 100 100 100 
##$AQSEQ= 0
##$AQ_mod= 3
##$AUNM= <au_zg>
##$AUTOPOS= <9 >
##$BF1= 250.13
##$BF2= 250.13
##$BF3= 250.13
##$BF4= 250.13
##$BF5= 500.13
##$BF6= 500.13
##$BF7= 500.13
##$BF8= 500.13
##$BYTORDA= 1
##$CFDGTYP= 0
##$CFRGTYP= 5
##$CHEMSTR= <none>
##$CNST= (0..31)
1 1 145 1 1 1 1 1 1 1 1 1 1 1 1 1 1 1 1 1 1 1 1 1 1 1 1 1 1 1 1 1 
##$CPDPRG= <>
##$CPDPRG1= <>
##$CPDPRG2= <>
##$CPDPRG3= <>
##$CPDPRG4= <mlev>
##$CPDPRG5= <mlev>
##$CPDPRG6= <mlev>
##$CPDPRG7= <mlev>
##$CPDPRG8= <mlev>
##$CPDPRGB= <>
##$CPDPRGT= <>
##$D= (0..31)
0 1 0 0 0 0 0 0 0 0.06 0 0 0 0 0 0 0.0002 0 0 0 0 0 0 0 0 0 0 0 0 0 0 
0 
##$DATE= 1184577324
##$DBL= (0..7)
120 120 120 120 120 120 120 120 
##$DBP= (0..7)
150 150 150 150 150 150 150 150 
##$DBP07= 0
##$DBPNAM0= <>
##$DBPNAM1= <>
$$ [...]
##$SUBNAM6= <"">
##$SUBNAM7= <"">
##$SUBNAM8= <"">
##$SUBNAM9= <"">
##$SW= 20.6930455092707
##$SWIBOX= (0..15)
0 0 3 0 0 0 0 0 0 0 0 0 0 0 0 0 
##$SW_h= 5175.983436853
##$TD= 65536
##$TD0= 1
##$TE= 296.16
##$TE2= 300
##$TE3= 300
##$TEG= 300
##$TL= (0..7)
0 120 120 120 120 120 120 120 
##$TP= (0..7)
150 150 150 150 150 150 150 150 
##$TP07= 0
##$TPNAME0= <>
##$TPNAME1= <>
##$TPNAME2= <>
##$TPNAME3= <>
##$TPNAME4= <>
##$TPNAME5= <>
##$TPNAME6= <>
##$TPNAME7= <>
##$TPOAL= (0..7)
0.5 0.5 0.5 0.5 0.5 0.5 0.5 0.5 
##$TPOFFS= (0..7)
0 0 0 0 0 0 0 0 
##$TUNHIN= 0
##$TUNHOUT= 0
##$TUNXOUT= 0
##$USERA1= <user>
##$USERA2= <user>
##$USERA3= <user>
##$USERA4= <user>
##$USERA5= <user>
##$V9= 5
##$VALIST= <valist>
##$VCLIST= <CCCCCCCCCCCCCCC>
##$VD= 0
##$VDLIST= <DDDDDDDDDDDDDDD>
##$VPLIST= <PPPPPPPPPPPPPPP>
##$VTLIST= <TTTTTTTTTTTTTTT>
##$WBST= 1024
##$WBSW= 4
##$XGAIN= (0..3)
0 0 0 0 
##$XL= 0
##$YL= 0
##$YMAX_a= 512143
##$YMIN_a= -542198
##$ZGOPTNS= <>
##$ZL1= 120
##$ZL2= 120
##$ZL3= 120
##$ZL4= 120
##$ABSF1= 16.522
##$ABSF2= -4.171173
##$ABSG= 5
##$ABSL= 3
##$ALPHA= 0
##$AQORDER= 0
##$ASSFAC= 0
##$ASSFACI= 0
##$ASSFACX= 0
##$ASSWID= 0
##$AUNMP= <proc_1d>
##$AZFE= 0.1
##$AZFW= 0.1
##$BCFW= 0
##$BC_mod= 0
##$BYTORDP= 0
##$COROFFS= 0
##$CY= 12.5
##$DATMOD= 1
##$DC= 0
##$DFILT= <>
##$DTYPP= 0
##$F1P= 14.0000005364418
##$F2P= -0.99999901652339
##$FCOR= 0.5
##$FTSIZE= 32768
##$FT_mod= 6
##$GAMMA= 0
##$GB= 0
##$INTBC= 1
##$INTSCL= 1
##$ISEN= 128
##$LB= 0.3
##$LEV0= 0
##$LPBIN= 0
##$MAXI= 10000
##$MC2= 0
##$MEAN= 0
##$ME_mod= 0
##$MI= 0
##$NCOEF= 0
##$NC_proc= -2
##$NLEV= 6
##$NOISF1= 0
##$NOISF2= 0
##$NSP= 0
##$NTH_PI= 0
##$NZP= 0
##$OFFSET= 16.522
##$PC= 1
##$PHC0= 146.8001
##$PHC1= 5.290899
##$PH_mod= 1
##$PKNL= yes
##$PPARMOD= 0
##$PSCAL= 4
##$PSIGN= 0
##$REVERSE= no
##$SF= 250.13
##$SI= 32768
##$SIGF1= 0
##$SIGF2= 0
##$SINO= 400
##$SIOLD= 32768
##$SREGLST= <1H.DMSO>
##$SSB= 0
##$STSI= 32768
##$STSR= 0
##$SW_p= 5175.98343685301
##$SYMM= 0
##$S_DEV= 0
##$TDeff= 65536
##$TDoff= 0
##$TI= <Analysis number 999999
Compound Code 99
Book Reference 9
Project Code 9>
##$TILT= no
##$TM1= 0
##$TM2= 0
##$TOPLEV= 0
##$USERP1= <user>
##$USERP2= <user>
##$USERP3= <user>
##$USERP4= <user>
##$USERP5= <user>
##$WDW= 1
##$XDIM= 32768
##$YMAX_p= 342235433
##$YMIN_p= -21724
$$ End of Bruker specific parameters
$$ ---------------------------------
##NTUPLES= NMR SPECTRUM
##VAR_NAME=  FREQUENCY,     SPECTRUM/REAL,   SPECTRUM/IMAG
##SYMBOL=    X,             R,               I
##VAR_TYPE=  INDEPENDENT,   DEPENDENT,       DEPENDENT
##VAR_FORM=  AFFN,          ASDF,            ASDF
##VAR_DIM=   32768,         32768,           32768
##UNITS=     HZ,            ARBITRARY UNITS, ARBITRARY UNITS
##FACTOR=    0.157963299565203, 1,           1
##FIRST=     4132.6476996994, 0,             0
##LAST=      -1043.33573715361, 0,           0
##MIN=       -1043.33573715361, -21724,      0
##MAX=       4132.6476996994, 342235433,     0
$$ Real data points
##PAGE= N=1
##DATA TABLE= (X++(R..R)), XYDATA
$$ [...]
16692D497n839k558M556M223j719r98L054K239J062k417m903J431J905k299k590
16677c56j795l20K315P368J7j995k635L687J814m408l479P36q03l624k89K396
16661a371m088j330r31l861L921K313j777k9L46n21O090L704P80K56k000m028
16645b526p4R58m274L880L039q32K545P30L928L524M18m035l385l516j773j672
16629c065j611j646J45k141K429k524m092L032L472L758J305m190k68J098J116
16614c182o48P81O14k633J631n13j170J147r25n089L033K755R40L249L402O67
16598D059k199k221J838k097p908k750J129j3r15J572L577Q98j472R51r96L458
16582c089N46n70J659k212l182j862J388j82O99M07l249J977P175K940R78L6J560
$$ plain form
16692 4497 -1342 -3900 656 4879 3160 2162 5216 7455 8517 6100 1197 2628 4533 2234 -356
16677 -356 -2151 -2471 -156 7212 7229 5234 2599 6286 8100 3692 213 949 146 -3478 -3767 -1371
16661 -1371 -5459 -6789 -7720 -11581 -7660 -5347 -7124 -7153 -6807 -7328 -1238 2466 3246 3502 1502 -2526
16645 -2526 -2600 -1642 -5916 -2036 1003 171 2716 3446 7374 10898 11316 7281 3896 380 -1393 -3065
16629 -3065 -4676 -6322 -6177 -8318 -5889 -8413 -12505 -9473 -6001 -2243 -938 -5128 -5396 -4298 -3182
16614 -3182 -3830 -3049 -2435 -5068 -3437 -3950 -5120 -3973 -4898 -9987 -6954 -4199 -3259 -10 3392 4059
16598 4059 1860 -361 1477 -620 -8528 -11278 -10149 -10162 -11077 -9505 -5928 -5030 -6502 -5551 -6547 -3089
16582 -3089 -2543 -3113 -1454 -3666 -6848 -8710 -7322 -7504 -6805 -6398 -9647 -7670 -495 2445 3423 3459 5019
16565E019L06m804k581o207j133K728K290r88j976K248K522K78j101j030l422
16550g851j467l382M580J751k658J269M155K755k293J600M468K205j907r20j878
16535D27K310m222j036N627j651n413K691M192j869K946j518n955l36J889K299
16520C81L507L100l859l504m51Q14J362n70k081K059M679J381m321l271J465O969
16504G660J046j395j512R78O347j869n689k063M063N446k950K813K246n164j492
16489H465J940J510L4l09K60L434J710L658M176J882P573N600P880J1635J6871
16474G6319K1447L2672L8906N0083N6704O0857M3158J4299j178j523j6248m4754
16462C30742n5057n1320m5280l9039l2639k5855k0150j2098p906n587n161q121
$$ plain form
16565 5019 5325 521 -2060 -8267 -9400 -6672 -4382 -5370 -7346 -5098 -2576 -2298 -3399 -4429 -7851
16550 -7851 -9318 -12700 -8120 -6369 -9027 -7758 -3603 -848 -3141 -1541 2927 5132 3225 2305 427
16535 427 2737 -1485 -2521 3106 1455 -3958 -1267 2925 1056 4002 2484 -3471 -3807 -1918 381
16520 381 3888 6988 3129 -375 -826 -12 1350 780 -1301 758 5437 6818 2497 -774 691 7660
16504 7660 8706 7311 5799 6777 13124 11255 5566 3503 7566 13012 10062 12875 15121 9957 8465
16489 8465 10405 11915 11949 11640 11900 15334 17044 20702 24878 26760 34333 39933 47813 59448 76319
16474 76319 97766 130438 169344 219427 276131 336988 380146 394445 393267 391744 375496 330742
16462 330742 275685 224365 179085 140046 107407 81552 61402 49304 41398 35811 30650 22529
16450B2529m758k315m362k143J315m516J49J900L960J63M47K083k127l319k661
16435F345j903k332K393j441m304K343J236k946n005m84L615l45j471J860M53
16420a986k215j038J183JK196N626J035L92o556l676j426J324K568q94n49L09
16404c706n17K036J279M022N90k084p638m328l45K732l809k063J965M547Q971
16389A652M132l766j986L40n146l213J932K441J661J866j497l157J006k649l40
16374f724M113P63K55r76J832l336k616p71M779L40j158N148Q495L066m977m491
16358C742l59r37m574k372J95k738m636K336K631J837k390o53q75J871r39J884
16342e977M825l92l94M180J661j836j563j14K331k004J035J589j487k758L756
$$ plain form
16450 22529 17771 15456 11094 8951 10266 5750 5899 7799 11759 11922 12369 14452 12325 9006 6345
16435 6345 4442 2110 4503 3062 -1242 1101 2337 -609 -5614 -6098 -2483 -2828 -4299 -2439 -1986
16420 -1986 -4201 -5239 -4056 -4055 -1859 3767 4802 5194 -1362 -5038 -6464 -5140 -2572 -3466 -4015 -3706
16404 -3706 -4223 -2187 -908 3114 3704 1620 -6018 -10346 -10691 -7959 -11768 -13831 -11866 -7319 1652
16389 1652 5784 2018 32 372 -4774 -7987 -6055 -3614 -1953 -87 -1584 -4741 -3735 -6384 -6724
16374 -6724 -2611 -1848 -1593 -2569 -737 -4073 -6689 -7460 -2681 -2341 -3499 1649 10144 13210 8233 3742
16358 3742 3383 2446 -2128 -4500 -4305 -7043 -11679 -9343 -6712 -4875 -7265 -7918 -8793 -6922 -7861 -5977
16342 -5977 -1152 -1544 -1938 2242 3903 2067 504 390 2721 717 1752 3341 1854 -904 2852
16327B852j129l035l362J54J203K765K169q45l283j372J771L048J965k978k77
16312c54l845j418m576M88K250q77Q259M690K747j823n150j592q76k855M91O230
16296A789J989o17J182o68K855j885j689j668m750l747N99L032j112J653j787
16281d824l505K705N219N975n43m573J400K726k543j28P23k041k295P98k313J65
16265c054l503Q09L973O800j256r94j97k063k214m97k215M810K804j739J075J947
16249D486n32O68k185n137N93J969N06K725K729k862n51k543J493K799M475R64
16233I597o36j016m405L800k841j362k712j555L795O2J931o148k39M116m93n665
16217c771n65j322k99k64j137J178M61L490K609L22J893j848k340J084M448l694
$$ plain form
16327 2852 1723 -1312 -4674 -4520 -3317 -552 1617 772 -2511 -3883 -2112 936 2901 -77 -354
16312 -354 -4199 -5617 -10193 -9705 -7455 -8332 -73 4617 7364 5541 391 -1201 -2077 -4932 -4441 1789
16296 1789 3778 3161 4343 3675 6530 4645 2956 1288 -3462 -7209 -6610 -3578 -4690 -3037 -4824
16281 -4824 -8329 -5624 -405 5570 5027 454 1854 4580 2037 1909 2632 591 -1704 -906 -3219 -3054
16265 -3054 -6557 -5748 -1775 5025 3769 2775 2578 515 -1699 -2196 -4411 399 3203 1464 2539 4486
16249 4486 3954 4622 2437 -2700 -2107 -138 368 3093 5822 2960 2409 -134 1359 4158 8633 9597
16233 9597 8961 7945 3540 7340 4499 3137 425 -1130 2665 2727 4658 -1490 -1729 2387 1894 -3771
16217 -3771 -4336 -5658 -5957 -6221 -7358 -6180 -5719 -2229 380 702 2595 747 -1593 -509 3939 245
16201B45k161J024J272J944M101k285J046J362l971o772M997N422k397k216J024
16186B635m834q08k249k815L695N246l46j338L82L904J307M70j233j218p644J174
16170c672J092q95J517m7k181j373J467K500L245k623l595J423m0O18j81P82L847
16153A884J957J567P65l403o867J182k66l238k06M581M652L002Q86P388k820m309
16137F755k012j119k111J951j154k719j799k712k29J261L138M284Q1o8K383p41
16121E189r41j31n201N74N267m095o384j037J124K005J232m41M515M310q52M7
16105E181K897k803J248K270o502m153o86K724j243q98j781p00K19n58J189J304
16089b292K899M407P61k412k448j644j538K41K78k76k342o25L0R79q22j437M140
$$ plain form
16201 245 -1916 -892 380 2324 6425 4140 5186 6548 2577 -4195 802 6224 3827 1611 2635
16186 2635 -2199 -3007 -5256 -8071 -4376 870 524 -814 -432 3472 4779 5249 4016 2798 -4846 -3672
16170 -3672 -2580 -3475 -1958 -2005 -4186 -5559 -4092 -1592 1653 -970 -4565 -3142 -3182 -2564 -2745 -1963 1884
16153 1884 3841 5408 6173 2770 -4097 -2915 -3181 -6419 -6625 -2044 2608 5610 6496 13884 11064 6755
16137 6755 4743 3624 1513 3464 2310 -409 -2208 -4920 -5149 -3888 -750 3534 3615 3547 5930 5189
16121 5189 4248 4117 -1084 -510 4757 662 -5722 -6759 -5635 -3630 -2398 -2839 1676 5986 5134 5181
16105 5181 8078 5275 6523 8793 2291 -1862 -2548 176 -1067 -1965 -3746 -4446 -4227 -4785 -3596 -2292
16089 -2292 607 5014 5775 3363 915 -729 -2267 -2026 -1748 -2024 -4366 -4991 -4961 -3982 -4804 -6241 -2101
16072b101K897R70q23j258l188J253K676L2n378J957L882Q36p40K858k89p049
16056c465k86j693j540L349l29N455J441k56m695k877N101J740K066L344J72n751
16040A776l761L769P439P28j743j746j477j564K23l165n456J807J108J856K550
16025B344R02m453j066M359K114K46J899j02J24o274n473j963j502L485N621N271
16009E532J456k855p941j62N417k8j777l171O97J82k636N439J526r03k368n36
15993b128N0j819M82l336k785L285k605P918K396k318L130J607N271L999n082
15978H065k570k581k345k858j242l9Q45L085J032l695p70K849k400Q77P56l8k972
15961d001k895K501K884l310k553o36M18k444K822L954M128O44J834Q30l969K008
$$ plain form
16072 -2101 796 1766 943 -315 -3503 -2250 426 458 -4920 -2963 919 1755 1015 3873 3584 -3465
16056 -3465 -3751 -5444 -6984 -3635 -3964 1491 2932 2676 -2019 -4896 205 1945 4011 7355 7527 1776
16040 1776 -1985 1784 9223 9951 8208 6462 4985 3421 3644 479 -4977 -3170 -2062 -206 2344
16025 2344 3246 -1207 -2273 2086 4200 4446 6345 6243 6367 93 -5380 -7343 -8845 -5360 261 5532
16009 5532 6988 4133 -3808 -3970 1447 1419 -358 -3529 -2832 -2650 -5286 153 1679 776 -1592 -2128
15993 -2128 -2078 -3897 -3415 -6751 -9536 -6251 -8856 -938 1458 -860 2270 3877 9148 13147 8065
15978 8065 5495 2914 569 -2289 -3531 -3570 -2725 360 1392 -2303 -3073 -224 -2624 -1747 -991 -1029 -4001
15961 -4001 -6896 -4395 -1511 -4821 -7374 -8010 -7592 -10036 -7214 -3260 868 1512 3346 4176 207 2215
15945B215J494L402n95J784j771k621n702L26N029J356o9R05j372j540p13l528
15929a400k883l233K475K718j72L309l115Q75L297M5j062l672l172K032L261L654
15913B957%n397p43L095K412J110J164J579N040L45o509P37N893m425m504j078
15897A676o46L459j909l885L227k714j325P652K258j713k927L399K862n61q95
15882G958m67l055l977N90P266p10m062j220J249Q15k182k59J455j440o46J396
15866B711k699K027r71m692K216O312J479j009K922J042m885m403J674k923j676
15851b875k049K319L582k886k165P601R00l206j67K338J869K027j754m271m886
15836c623j680P258J4780J4509N943K9k087m444j1667j2688j1660n761K277O643
$$ plain form
15945 2215 3709 7111 6516 8300 6529 3908 -1794 -1468 3561 4917 4848 5753 4381 2841 2128 -1400
15929 -1400 -4283 -7516 -5041 -2323 -2495 814 -2301 -1426 1871 1916 854 -2818 -5990 -3958 -697 2957
15913 2957 2957 -2440 -3183 -88 2324 3434 4598 6177 11217 11562 5053 5790 11683 7258 2754 1676
15897 1676 1030 4489 2580 -1305 1922 -792 -2117 5535 7793 6080 3153 6552 9414 8853 7958
15882 7958 7491 4436 459 1049 8315 7605 3543 2323 3572 4387 2205 1946 3401 1961 1315 2711
15866 2711 12 2039 1068 -3624 -1408 4904 6383 5374 8296 9338 4453 50 1724 -1199 -2875
15851 -2875 -4924 -2605 977 -1909 -4074 3527 4427 1221 1054 3392 5261 7288 5534 1263 -3623
15836 -3623 -5303 1955 16735 31244 37187 37216 35129 30685 19018 6330 -5330 -11091 -8814 -2171
15822b171L621N395k149p208j532J70J637k562J863L205k77R41J71r7j127m48
15806e68N002M36l601N14n72p23j325M756j397k96j712P11n28J600Q37j033P03
15789B804r96j869J006K033K435m81n864k503R15J646J783j334p241N86Q422J065
15773B407o375o312N476M896K907J060l2J062l837Q52K372j896k076j357j999
15758b852j423K908K599K223K962K04k080k218n292J624L603l066k617k0K912
15743e33K195L397k02q78l20j272m006n214k05L829K39k073J251L610K271k750
15727f61N95K846K809K83J816n272k268K633N9n89j814m84K249K32l070j116k914
15710d666J372K898j92n30N206k770k898J340K742K773m03n320j984j115k677
$$ plain form
15822 -2171 1450 6845 4696 -2512 -4044 -3874 -2237 -4799 -2936 269 -8 933 1104 1007 -120 -568
15806 -568 4434 4870 1269 1783 1211 488 -837 3919 2522 2226 514 1225 697 2297 3134 2101 2804
15789 2804 1808 -61 945 2978 5413 4932 -932 -3435 -2520 -874 909 -425 -7666 -7080 1342 2407
15773 2407 -3968 -10280 -4804 92 2999 4059 4027 5089 1252 2104 4476 2580 504 -853 -2852
15758 -2852 -4275 -1367 1232 3455 6417 6621 4541 2323 -2969 -1345 2258 -808 -3425 -3445 -533
15743 -533 1662 5059 4857 3979 3659 2387 -1619 -6833 -7038 -3209 -2970 -5043 -3792 -182 2089 -661
15727 -661 -66 2780 5589 5872 7688 2416 148 2781 2840 2251 437 -47 2202 2434 -636 -1752 -4666
15710 -4666 -3294 -396 -588 -1118 4088 1318 -1580 -240 2502 5275 4872 -448 -2432 -3547 -6224
15695f224M916O959k208k962r57K042M607r86j098k876j431K975K426p581J125
15680a273N251k70K55J03m066n072J990O600j144j457l65J999j124m530P31L950
15664A578L09l03k70k060L52J170j693N19M738K433P87l396k359k584M431K727
15648F379l939k900J113K056l52J209j2K689M022m30j567n44k854l535j903M055
15632C487L341J795p12k667j117p676j17N020K201j577m08o50R38j46K393p98
15616C307J885k491o10K502N131j166m730k572J035K726k033n874R78P109J010
15601F207P29m00n094K24L38k99o39N30L631M243o48J143j929n229k100J602q82
15584A427K648P469O060J932j98j803n909l825LJ986Q10m575k531r47L710K387
$$ plain form
15695 -6224 -1308 5651 3443 481 -476 1566 6173 5187 4089 1213 -218 2757 5183 -2398 -1273
15680 -1273 3978 3708 3963 4066 0 -5072 -3082 3518 2374 917 552 2551 1427 -3103 -2372 1578
15664 1578 1887 1584 1314 -746 -394 776 -917 -398 4340 6773 7560 4164 1805 -779 3652 6379
15648 6379 2440 -460 653 2709 2357 3566 3554 6243 10265 9835 8268 7724 4870 1335 -568 3487
15632 3487 6828 8623 7911 5244 4127 -3549 -3666 1354 3555 1978 1570 920 1858 1712 4105 3307
15616 3307 5192 2701 2091 4593 9724 8558 3828 1256 2291 5017 2984 -2890 -1912 5197 6207
15601 6207 6936 6536 1442 1666 2004 1705 1066 1596 5227 9470 8822 9965 8036 2807 707 2309 1427
15584 1427 4075 11544 17604 19536 19338 17535 11626 7801 7804 9790 10600 6025 3494 2547 6257 8644
15568H644K097j044k846l233k416l401K152l907N37R603L395p056p807K289Q767
15553E774M35j929j308O79n29J235j211k738m567o1k691j746J340K664J12L610
15537i31N89P34K394j320L252K351n89o96K967j103l791k421k16k276k53j438
15521b747L575K423j372N179j850l342k561L445R31j041K215j184J983K950O84
15506I288n473n2K663J339o90k977o003p80N446K423M78j691j022j091N048M12
15490G318m627l256j403J647oJ836K233j068P06o7m672K070M938J241j208m920
15474G62l46K516L922O79k61J815M404Q59o467K0k561j633k990K789K993K094
15458H595j839l986j153Q78l374n401L695Q144L499J521k690l735k523k855K722
$$ plain form
15568 8644 10741 9697 6851 3618 1202 -2199 -47 -3954 -3417 6186 9581 2525 -5282 -2993 5774
15553 5774 6209 4280 2972 3651 3122 4357 3146 408 -4159 -4220 -6911 -8657 -7317 -4653 -4541 -931
15537 -931 -342 392 2786 1466 4718 7069 6480 5784 8751 7648 3857 1436 1220 -1056 -1309 -2747
15521 -2747 828 3251 1879 7058 5208 1866 -695 2750 3681 2640 4855 3671 5654 8604 9288
15506 9288 3815 3763 6426 7765 7075 4098 -1905 -2685 2761 5184 5662 3971 2949 1858 6906 7318
15490 7318 2691 -565 -1968 -321 -327 1509 3742 2674 3380 3313 -1359 711 5649 6890 5682 762
15474 762 416 2932 6854 7533 7272 9087 13491 14350 7883 7903 5342 3709 719 3508 6501 8595
15458 8595 6756 2770 1617 2495 -879 -6280 -2585 5559 9058 10579 7889 4154 1631 -1224 1498
15443A498j394J352K755K708J994j694J064k168l762l907n660K167O680j973k603
15428b943j696k176K88j736M146p0L051K39M057j385M01j789N42m65L298L72L38
15411D472J527O62l115j358J230p79l44K500K74k328L897o4j295L487m73n852
15395B441k320J521l349O34q06J919M61R53j460j479L066M602K290j828m987m023
15379b365M869N236m880m732k061l93M178J679J172j548l093k50K290K508j29
15364B481k023K543k454q45m29l14M194j587k182L878K222j940k791Q37J215J828
15348D633m190K924j274j464J69l48J549m794L3M096N95k734j338J462K029j329
15332A9L500j943P08M311L020k44l000J670J378l863n85K97j423j892J569j50
$$ plain form
15443 1498 104 1456 4211 6919 8913 7219 8283 6115 2353 -1554 -7214 -5047 1633 -340 -2943
15428 -2943 -4639 -6815 -6527 -8263 -4117 -4187 -1136 -897 3160 1775 2176 387 929 464 3762 4134 4472
15411 4472 5999 6661 3546 2188 3418 2639 2295 4795 5069 2741 6638 6574 5279 8766 8293 2441
15395 2441 121 1642 -1707 -1073 -1879 40 501 1454 -6 -1485 1581 6183 8473 6645 1658 -2365
15379 -2365 2504 7740 2860 -1872 -3933 -4326 -148 1531 2703 1155 -1938 -2188 102 2610 2481
15364 2481 458 3001 547 -298 -727 -1041 3153 1566 -616 3262 5484 3544 753 1590 2805 4633
15348 4633 443 3367 2093 629 798 450 1999 -2795 -2762 1334 1929 -805 -2143 -681 1348 19
15332 19 3519 1576 2284 6595 9615 9371 6371 8041 9419 5556 4971 5268 3845 1953 3522 3372
15316C372j995k956p99J649L537m280k674r33K015J28j24J286J254k29j997J613
15300a133J0215K132l155j908Q11k745P19Q23k85j372l516j909L103N910L358
15285A1048N02k04q220m669L309N056O473J357n199o055K55J645K910m355n288
15270a435n99N624R104J575q378r411n449M603J359M438K072k915j774Q167L139
15255A0120l010l596k870l288J291M722L35q09J214J981K443m809k57J599k94
15240D772k628m489k498k29L092M498M523K544l053n107j373P043J003n399n73
15225B126O40J729l55l746j301K21J51M07P5m851L531O009O17K467J03l003p69
15208D051L626m250k303O16J091j391R59J616j691n07l908l088Q98j558k359M265
$$ plain form
15316 3372 1377 -1579 -2378 -729 2808 -1472 -4146 -5079 -3064 -2936 -3060 -1774 -520 -749 -2746 -1133
15300 -1133 9082 11214 8059 6151 6962 4217 4936 5759 5474 4102 586 -1323 1780 7690 11048
15285 11048 11550 11346 3126 -1543 1766 6822 13295 14652 9453 3398 3653 5298 8208 3853 -1435
15270 -1435 -2034 3590 12694 14269 5891 -3520 -8969 -4366 -3007 1431 3503 588 -1186 6981 10120
15255 10120 7110 3514 644 -2644 -1353 3369 3704 2895 4109 6090 8533 3724 3467 5066 4772
15240 4772 2144 -2345 -4843 -5072 -1980 2518 7041 9585 6532 1425 52 7095 8098 2699 2126
15225 2126 2766 4495 4140 394 -907 -686 -535 -128 -53 -4904 -1373 4636 5253 7720 7823 4820 4051
15208 4051 7677 3427 1124 1740 2831 1440 2399 4015 2324 1817 -2091 -5179 -4281 -5839 -8198 -3933
15192c933j418K881M180m080k011J040N141j260L382J958o655R36L574l180q74
15177c19l0N894K675j582k643Q48R58n652J406J981K126Q68k723L468k935l770
15161E70k43l127j744J305L958J077N791J584l876l36L75L131L062k49K62m784
15145F756J044N293k275m297k585P24K433j737J86o39j808l844J861L687K422
15130G221j107j460o56J479K699k139l518k26L893N995K313m522o102l718K023
15115B175J900o181k468N161N466j161l489l676j541n004J83K792k382M10L390
15100d425M907J698J572K209K580n15j241O69j283l090j921J123K900J212K233
15085H628M09j052j710j368m402J491j053n57J022p008j983L442R40K135L506
$$ plain form
15192 -3933 -5351 -2470 1710 -2370 -4381 -3341 1800 540 3922 5880 -775 161 3735 555 -319
15177 -319 -349 5545 8220 6638 3995 4843 5801 149 1555 3536 5662 6530 3807 7275 4340 570
15161 570 327 -2800 -4544 -3239 719 1796 7587 9171 5295 4959 5334 8465 11527 11278 11540 6756
15145 6756 7800 13093 10818 6521 3936 4660 7093 5356 5542 4903 3095 -749 1112 4799 7221
15130 7221 6114 4654 3998 5477 8176 6037 2519 2293 6186 12181 14494 9972 3870 152 2175
15115 2175 4075 -2106 -4574 587 6053 4892 1403 -2273 -3814 -8818 -8635 -5843 -8225 -7815 -4425
15100 -4425 482 2180 3752 5961 8541 8026 6785 7454 6171 3081 1160 2283 5183 6395 8628
15085 8628 9037 7985 6275 4907 505 1996 943 386 1408 -5600 -7583 -4141 -3201 -1066 2440
15070B440L382j824l808k857L259K430k964K850j206n819J003J716M442j431j944
15055c31J237L329j200j619j757K002o67k291L236K510P42R5k335K028Q57k838
15039B998j771M618J102l451k776k056J4J144L647J673K98r86O27l18K399l383
15023C779j019j796j829j641M841l68j749k471J321K599N023K917m890n526k264
15008c073K126K910L723p72p00J135j761N69j860p072m119L063L474J414j421
14993b364J942P641p82l058K090K208n599n850R56L893J617L968l312l905J739
14978A184m66K688j565m889Q98J558J311r62J163L728n91J193j386K311K516K805
14962A1496m761l668l01L546K28j843j203k510j78L325L064L329k819k437K792
$$ plain form
15070 2440 5822 3998 190 -2667 592 3022 58 2908 1702 -4117 -3114 -1398 3044 1613 -331
15055 -331 906 4235 3035 1416 -341 1661 994 -1297 1939 4449 5191 5286 2951 4979 5836 2998
15039 2998 1227 5845 6947 3496 720 -1336 -1322 -178 3469 5142 5440 4454 5081 4763 7162 3779
15023 3779 2760 964 -865 -2506 2335 1967 218 -2253 -932 1667 6690 9607 4717 -809 -3073
15008 -3073 -947 1963 5686 4914 4214 5349 3588 4157 2297 -4775 -8894 -5831 -2357 -943 -2364
14993 -2364 -422 7219 6437 3379 5469 7677 2078 -3772 -2816 1077 2694 6662 3350 -555 1184
14978 1184 718 3406 1841 -3048 -2150 -592 719 -243 920 4648 4057 5250 3864 6175 8691 11496
14962 11496 6735 3067 2766 6312 6540 4697 3494 984 806 4131 7195 10524 7705 5268 8060
14947H060L91n310k950J099O008r77j830L21L18J669J651r86p41K118J751j982
14931H610k694J205j906j862k649k146k702j219N495J466p33l660L85k49Q056
14916E397P597n009n998n681N65r60N402O409L012P57m443j797k807m60l38m043
14900b397J756M107J761K532J584J092j00k370k183k524k134P48J032j274q24
14885H06k496L797N902J54l520n33Q6L67m16L000K661L549l71j260l88J562m443
14868H457m21R43j840o8j955K246M284l687l350k017m89K511m851k65K228k143
14852d17P91J118K378N119J232j899K775o32j839o59m894k616N657L193o178k767
14836C62P142J097p696l97P418R19Q05L840n85J070K231m072k028m916m52P47
$$ plain form
14947 8060 8451 3141 191 1290 7298 6321 4491 4812 5130 6799 8450 7464 6723 8841 10592 8610
14931 8610 5916 7121 5215 3353 704 -1442 -4144 -5363 132 1598 865 -2795 -2410 -2659 5397
14916 5397 12994 7985 1987 -3694 -3129 -4089 1313 7722 10734 11491 7048 5251 2444 1984 1646 -2397
14900 -2397 -641 3466 5227 7759 9343 10435 10335 7965 5782 3258 1124 1872 2904 1630 806
14885 806 -1690 2107 8009 8163 4643 4110 4196 4563 4147 7147 9808 13357 12986 11726 11338 12900 8457
14868 8457 8036 8979 7139 7071 5116 7362 11646 7959 4609 2592 2103 4614 -237 -502 1726 -417
14852 -417 374 1492 3870 8989 10221 8322 11097 10465 8626 7967 3073 457 6114 9307 3129 362
14836 362 7504 8601 905 508 7926 8845 9650 13490 12905 13975 16206 12134 10106 5190 4738 5485
14820E485j437j915O20k021K573O53K986K703J529m25m013j2K942m41k379l703
14804C145K088K036k28j352l339k58J493m264m392N946k316N264J784j842k074
14789A691l105n429K194P975N25n065j402L052K735K073j65k088m865K24K25j303
14773b728K056L329J662k830r55K730j116j764J019O23O92L350RM656M181J621
14757A6535o505l377k492j212m498l905L848M604O75Q25M767J716L85l424k323
14742E619Q09L09j925L44K127N713j456m949n243o71j994O207L359j920l33N311
14726A1307J961j022p12J48j129o735j232M35L952O84m609k679k913j391j069
14711e004N15L163N092K668M404K903K69L269M134l271J99l608m124j714k669
$$ plain form
14820 5485 4048 2133 2753 732 3305 3958 6944 9647 11176 10751 6738 6726 9668 9227 6848 3145
14804 3145 5233 7269 7041 5689 2350 2092 3585 -679 -5071 875 -1441 3823 5607 3765 1691
14789 1691 -1414 -6843 -4649 3326 3851 -1214 -2616 436 3171 5244 5079 2991 -1874 -1650 -1425 -2728
14773 -2728 -672 2657 4319 1489 534 3264 2148 384 1403 2026 2718 6068 6077 10733 14914 16535
14757 16535 10030 6653 4161 2949 -1549 -5454 -1606 2998 3673 4498 9265 10981 11366 7942 5619
14742 5619 6428 6737 4812 5156 7283 12996 11540 6591 1348 677 -1317 4890 8249 6329 5996 11307
14726 11307 13268 12246 11534 11682 10553 3818 2586 3021 6973 7657 3048 369 -2544 -3935 -5004
14711 -5004 -4489 -1326 3766 6434 10838 13741 14010 17279 21413 18142 18341 14733 10609 8895 6226
14696F226l44J587j621j120J192N33k514pm210m66K68M273q12O59K709j243j435
14679C675K888M118l758k735o17P89L017M801n171o783L418k402k374Q273O158
14664A3297m528j597J314l85l418N80L9j137j044o18q48p86J874j541l657J908
14648e47P86K40L425M314o305l287k1N88O706J108k34l29J362K683l78L50J311
14631A1772N12l494k13L251P97k212m57l550J161Q46o34m49n61J185k471n347
14615A36k88L248L594N003J161k085o313j278L602M202r6k218m236k172l406k549
14599c695L034O490L170K956J794J795k21k432m769K095M873l818l429p11l459
14584C673N536L070J165J98l344R8M12l23l266j209J379R57o50K964j444L801
$$ plain form
14696 6226 5882 7469 5848 4728 5920 6453 3939 3932 -278 -744 -476 3797 2985 3644 6353 5110 3675
14679 3675 6563 10681 6923 4188 3571 4360 7377 12178 7007 224 3642 1240 -1134 7139 13297
14664 13297 8769 7172 8486 8101 4683 5263 5302 4165 3121 2503 1655 869 2743 1202 -2455 -547
14648 -547 239 479 3904 8218 1913 -1374 -1395 -807 5899 7007 6773 6444 7806 10489 10111 10461 11772
14631 11772 12284 8790 8577 11828 12625 10413 9956 6406 7567 8413 7779 7330 6769 7954 5483 136
14615 136 -152 3096 6690 11693 12854 10769 4456 3178 6780 10982 10886 8668 4432 2260 -1146 -3695
14599 -3695 -661 5829 8999 11955 13749 15544 15323 12891 8122 10217 15090 11272 7843 7132 3673
14584 3673 9209 12279 13444 13642 10298 10396 10808 10485 7219 6010 7389 8346 7696 10660 9216 13017
14568A3017J125J289N76n680L179M661l270l080M65j872j03k071j810j064o04
14553D758R73k93J27M160M049r45n736q03L242P06o349p51j056m07J139K118P41
14536E673K739O108j565m664n729k387L538M805j676j061O71m170n750K949O580
14521F061J275L238k9k647j421K429N368J532j906k057m334J339J128o566l750
14506c40N096L419q66K036k51k82m652N35J478J586M738j978J611k320j0797l672
14490d659J722Q145N599J752o1l901k459Q54lm030l557K902M297K837L218M981
14474A7637p28R92j53j439j324k801k823o72Q08m249j296R45j899j695L789J464
14458F556J48l0K639R08k343l815l725N314R492J688o888m342K524J652n04r49
$$ plain form
14568 13017 14142 15431 16007 10327 13506 18167 14897 11817 12282 10410 10307 8236 6426 5362 4758
14553 4758 5731 5438 5565 9725 13774 12829 7093 6290 9532 10238 3889 3138 2082 1675 2814 4932 5673
14536 5673 8412 14520 12955 8291 2562 175 3713 8518 6842 5781 6452 2282 -3468 -519 6061
14521 6061 7336 10574 10545 7898 6477 8906 14274 15806 13900 11843 7509 8848 9976 3410 -340
14506 -340 4756 8175 7309 9345 9094 8812 4160 4695 6173 7759 12497 10519 12130 9810 -987 -4659
14490 -4659 -2937 5208 10807 12559 12498 8597 6138 6992 6989 2959 -598 2304 6601 9438 12656 17637
14474 17637 16909 17901 17748 16309 14985 12184 9361 8689 9497 5248 3952 4897 2998 1303 5092 6556
14458 6556 6704 6674 9313 10221 7878 4063 338 5652 15144 16832 9944 5602 8126 9778 9274 8325
14442H325m412R36M070L988p323j732K386j99j548J153j438M00N772O24m230J473
14426H245K078k661J015J90M622J337l631J932j33J306k963j909Q93K269K752
14411A5342m845r9O222j851l43M329k719k828m77o10k94J072k562o122j776M643
14395G082k715n79J060K24J545L370J144J660j768k863k300M4K729K119L79N94
14379A1725Q00N64n390k312J796L65J13r08K19l15j642K668L927Q7j922k558k388
14362D829k866k173K289L397J571j039k801K563K791L116P99p5m371m088N430
14347I372K657m24k109N81m081N99M146K307K695J91k083m586J168R894M987m504
14331B0810m623n473l902J874O020j64j742o255l19M141M951n113n697J24L127
$$ plain form
14442 8325 3913 4849 8919 12907 5584 3852 6238 6039 4491 5644 4206 4606 10378 11002 6772 8245
14426 8245 10323 7662 8677 8867 13489 14826 11195 13127 12994 14300 11337 9428 10321 12590 15342
14411 15342 10497 10398 16620 14769 14426 18755 16036 13208 12731 12121 11827 12899 10337 4215 2439 7082
14395 7082 4367 3788 4848 5072 6617 9987 11131 12791 11023 8160 5860 5904 8633 10752 11131 11725
14379 11725 12525 13089 7699 5387 7183 7548 7661 6753 6972 6657 5015 7683 11610 11697 9775 7217 4829
14362 4829 1963 -210 2079 5476 7047 6008 3207 5770 8561 11677 12476 12401 8030 3942 9372
14347 9372 12029 11605 9496 10077 5996 6595 10741 13048 15743 15934 13851 9265 10433 20327 25314 20810
14331 20810 16187 10714 6812 8686 14706 14542 12800 6545 6226 10367 15318 10205 4508 4632 7759
14316G759j187J658n004K118J691l772j533J267K852P94q48Q02M73j106K18N62
14300F744N90L110L859j334J819j13p09K583j458J309K854k109l111k40J585k393
14284A2986L897Q85o004j332J027l341P02R40j518K21j360j568K501J630L352
14269A3018q71q67J623K672J183n786J181j450l311j374O52P05M62J546J852j442
14253I793J325J364j53N222k369n211o04p527k278O106r82J22N067r91M03K138
14237A1425j919m300J898o68J24L582M748M69J280k11l987l307q28K747r79P46
14221A0820k298J953k70J355J110N115J773L59m92m377j471J331j076l261l208
14206G363K336O97K430L100k415k680L696L762J53n124j497k313j905L116K24
$$ plain form
14316 7759 6572 8230 3226 5344 7035 3263 1730 2997 5849 6643 5795 6597 7070 5964 6182 6744
14300 6744 7334 10444 14303 12969 14788 14675 13966 16549 15091 16400 19254 17145 14034 13794 15379 12986
14284 12986 16883 17768 11764 10432 11459 8118 8820 9760 8242 8463 7103 5535 8036 9666 13018
14269 13018 12147 11280 12903 15575 16758 10972 12153 10703 7392 6018 6670 7375 7837 9383 11235 9793
14253 9793 11118 12482 12329 17551 15182 9971 9367 1840 -438 5668 4686 4808 9875 8884 9287 11425
14237 11425 9506 5206 7104 6436 6560 10142 14890 15359 16639 16428 12441 9134 8306 11053 10074 10820
14221 10820 8522 10475 10205 11560 12670 17785 19558 19917 19425 15048 13577 14908 13832 10571 7363
14206 7363 9699 10396 12826 15926 13511 10831 14527 18289 18442 13318 11821 9508 7603 10719 10943
14191A0943L092K698j588n333j838L254M324J268R25l534o0q25R93j329j252L98
14175A2136o3l238M289L928M27j215l80m374n056K068N247J078k500q34j971M781
14159A4323J911l767j239J907L748o46j524k652j559K405J531J091k900j035J492
14144A3086O74J07j059j177l453k888o76L170J964K585L067o42q28J466N483M163
14128B5042J238K423q76N38m277j827j829m04j362m444L53j283k778M136l26L585
14112A7909J473k500j092L353K916L923r73k223j122J197k577m608k906k003p239
14097C528M76J314N3k482n13M254O382L134m429k583N39o69K94l03J211M05j31
14080A0480J446L295J935O54m781K77l377j314L990O443J656M228l54m478j647
$$ plain form
14191 10943 14035 16733 15145 9812 7974 11228 15552 16820 17745 14211 14151 13326 14319 12990 11738 12136
14175 12136 12073 8835 13124 17052 17479 16264 15884 11510 6454 8522 13769 14847 12347 11513 9542 14323
14159 14323 16234 12467 11228 13135 16883 16237 14713 12061 10502 12907 14438 15529 12629 11594 13086
14144 13086 13760 13867 12808 11631 8178 5290 4614 7784 9748 12333 15400 14758 13930 15396 20879 25042
14128 25042 26280 28703 27827 28365 24088 22261 20432 20028 18666 14222 14575 13292 10514 14650 14324 17909
14112 17909 19382 16882 15790 19143 22059 25982 25009 22786 21664 22861 20284 15676 12770 10767 3528
14097 3528 4004 5318 5371 2889 2376 6630 13012 16146 11717 9134 9673 9004 9298 8995 10206 10611 10480
14080 10480 11926 15221 17156 17810 13029 13306 9929 8615 12605 19048 20704 24932 24578 20100 18453
14065A8453j132n42j83j828k648J28L768N632L939k428k464P41j571O12L458k438
14049B1497k320n329k229J676K77J402j215O81j050k986j575J457n55K507J593
14034A3831K51M039q55q31m29N90K015j621j995M258K274J603j168m338m427L009
14018A6206j243L767J694j22n4j429Q51K432L6j374q69k765k447O69l675j991
14002I686j449M748L965K046J106L857J633m297n015m228q21M278J668j158l095
13987A2924k856J120K863N779L9L238p7j741K37J391K81j020k140K723J580J31
13971B4472j345p69J35L3M57l998p909K842O252j139k81n70L979l69m578p304
13955I908R07j361l852j97L334O952m861k728K21J904K08L506L398m715m837J476
$$ plain form
14065 18453 17321 16779 16596 14768 12120 12248 16016 21648 25587 23159 20695 21436 19865 20477 23935 21497
14049 21497 19177 13848 11619 13295 13572 14974 13759 14440 13390 10404 8829 10286 9731 12238 13831
14034 13831 14082 18121 17266 16435 16006 16596 18611 16990 14995 19253 21527 23130 21962 17624 13197 16206
14018 16206 14963 18730 20424 20302 20248 18819 19670 22102 22138 20764 19895 17130 14683 15352 11677 9686
14002 9686 8237 12985 16950 18996 20102 23959 25592 21295 16280 12052 11231 15509 17177 16019 12924
13987 12924 10068 11188 14051 19830 19869 23107 23030 21289 21526 22917 23198 22178 20038 22761 24341 24472
13971 24472 23127 22358 22493 22526 22983 18985 11076 13918 20170 19031 18750 18180 22159 21790 17212 9908
13955 9908 10815 9454 5602 5405 8739 15691 10830 8102 8323 10227 10435 13941 17339 12624 7787 9263
13939I263L689k92K343N767K481M125k560k883k868j462N908P53k732l442k441
13924A5649J130l331J53K769M244n073L385M041k61k745L984l336m925k678J50
13909A3156N431M408N457j090o763l033K492j211j481J394r35L229J677k711o47
13894A9373K264J171J610k573k648k09J909L130j41J089J059m780k706K010L197
13879B3755P77m90K142l172q203j036K302j070J273K327J083J228J398R76J260
13864B4550k470k391l257P12M027J344k970j133j201j931J509N384N34l850p54
13849A8103J317J919J679J510J286L58j706l093r95O965L707n763k225m87J195
13834B3770L450l259L639K412k283L200l775o788j050J299K903J679k96q87L348
$$ plain form
13939 9263 12952 12660 15003 20770 23251 27376 24816 21933 19065 17603 23511 24264 21532 18090 15649
13924 15649 16779 13448 13601 16370 20614 15541 18926 22967 22706 19961 23945 20609 15684 13006 13156
13909 13156 18587 22995 28452 27362 20599 17566 20058 18847 17366 18760 17825 21054 22731 20020 19373
13894 19373 21637 22808 24418 21845 19197 18988 20897 24027 23886 24975 26034 21254 18548 20558 23755
13879 23755 24532 24042 26184 23012 14809 13773 16075 15005 16278 18605 19688 20916 22314 23290 24550
13864 24550 22080 19689 16432 17144 21171 22515 19545 18412 17211 15280 16789 22173 22707 18857 18103
13849 18103 19420 21339 23018 24528 25814 26172 24466 21373 20378 27343 31050 25287 23062 22575 23770
13834 23770 27220 23961 27600 30012 27729 30929 27154 20366 19316 20615 23518 25197 24901 24014 27362
13819B7362J232J78N94j962m939j422M50K603J806K895P79p501l872J008j814
13804A7397Q22L82O925L462L82N8m576m440P94j619K2L047j31l987j6n46L197
13787B1173J394K180J02L09K65K768j701l766l124l305N043L661j8j451J192r22
13771B3800k380K558j357j470j776J471L36k362l704K21j062L573Q41O32J681
13756B1002K421K700k003J919J85J696K976k054m08l034l318L930M33J091L43
13741B7879m655J086O084p98o328o599K47K852k1K592n30K659L000J208j713j283
13725B5680N140l621k779j347K537N909o50J479K318k291m869l785O33O800O47
13710C1801l256j887p814k440J204j470K327K31L173j299K328M651n122L18k42
$$ plain form
13819 27362 28594 28772 29366 27404 22465 21043 21493 24096 25902 28797 29576 22075 18203 19211 17397
13804 17397 18219 18601 25526 28988 29370 29428 24852 20412 21206 19587 19609 22656 22525 18538 18522 17976 21173
13787 21173 22567 24747 24849 25158 25423 28191 26490 22724 19600 16295 21338 24999 24981 23530 24722 23800
13771 23800 21420 23978 22621 21151 19375 20846 21182 18820 15116 15337 14275 17848 18689 19321 21002
13756 21002 23423 26123 24120 26039 26224 27920 30896 28842 28434 25400 22082 26012 26445 27536 27879
13741 27879 23224 24310 30394 29596 23268 16669 16916 19768 19747 22339 21809 24468 27468 28676 26963 25680
13725 25680 30820 27199 24420 23073 25610 31519 30869 32348 34666 32375 27506 23721 24354 31154 31801
13710 31801 28545 26658 18844 16404 17608 16138 18465 18696 21869 20570 22898 27549 22427 22745 22503
13695B2503P44N651N159K428m224m412L185J333k404k761K024j164j557n02R12
13680B6915L673L651k654n452M24L504N37J680j926l145j614j384k148R79j328
13665B1712k230L276R89o00j372k078l9J987o69O206K207m327J384L681J436m51
13649C1112k359L262K657k473L516O24l254o577P43n26M54m37L271K540M28n052
13633B7929o23J738N097q00p146j502K603N158j165k772l3J409K867m635o48L996
13617C1473Q43L260K650k400o281j862K402K118K726n8j909m749R80M036L02J642
13601C5173j606N54l552K367J144M82J03j969M933L017K020N67J035l944l511
13586C6813M16M865L528o691K57K764k450P33K156j44l778p580k553l205q53K320
$$ plain form
13695 22503 23247 28898 34057 36485 32261 27849 31034 32367 29963 27202 29226 28062 26505 26003 26915
13680 26915 30588 34239 31585 26133 26557 30061 30598 32278 30352 27207 25593 24209 22061 23040 21712
13665 21712 19482 22758 23747 23147 21775 19697 19658 21645 20976 27182 29389 25062 26446 30127 31563 31112
13649 31112 28753 32015 34672 32199 35715 36339 33085 26508 27251 26725 27179 26742 30013 32553 32981 27929
13633 27929 27306 29044 34141 33341 26195 24693 27296 32454 31289 28517 28484 29893 32760 28125 27477 31473
13617 31473 32316 35576 38226 35826 29545 27683 30085 32203 34929 34871 32962 28213 29193 33229 33531 35173
13601 35173 33567 34121 30569 32936 34080 34562 34665 32696 37629 40646 42666 43233 44268 40324 36813
13586 36813 37229 42094 45622 38931 39188 41952 39502 40235 42391 42247 38469 30889 28336 25131 24278 26598
13570B6598L652L240O2j113j536o21L288L368l954o77N005L306q90K451m313n657
13554C2209J130K013j117k969K699L990j049n22k823j798l540n68L118L732M914
13539C9419K873r115M1J237L749j706l607j398L397L774k166l483m70k352p11
13524B9482J583l555j392Q10P407J093K444Q33k239l21K077n869n244k486O608
13509C1231R214j169k552M177N139j042J441r28j13J670J51l298l326J433K427
13494D4455K794L38K143P89n52p897m155n089k67L534o5J835Q2j110J253N219
13478D3307m260k848L077L202k166J118j456q90K0j20M311R11n649pj041k563
13462C4946J258N538J464k761K581N60m826p505m331R225L166j012M233J065l113
$$ plain form
13570 26598 30250 33490 33552 32439 30903 30282 33570 36938 32984 32307 37312 40618 39728 42179 37866 32209
13554 32209 33339 35352 34235 31266 33965 37955 36906 36384 33561 31763 28223 27655 30773 34505 39419
13539 39419 42292 33177 33218 34455 38204 36498 32891 31493 34890 38664 36498 33015 32545 30193 29482
13524 29482 31065 27510 26118 26928 34335 35428 37872 38705 36466 36145 38222 32353 27109 24623 31231
13509 31231 40445 39276 36724 40901 46040 44998 46439 45511 45398 47068 47219 43921 40595 42028 44455
13494 44455 47249 47587 49730 50519 49967 42070 37915 32826 32559 36093 36028 37863 37945 36835 38088 43307
13478 43307 39047 36199 39276 42478 40312 41430 39974 39084 39104 38984 43295 44206 38557 38550 37509 34946
13462 34946 36204 41742 43206 40445 43026 43586 38760 31255 26924 36149 39315 38303 42536 43601 40488
13447D0488l999K892L47j475k239M363l516K083K706O524L999J889L10L645l72
13432E7645k744k818l464k258L8o07j698O135K478m952j0488P5O080M780J065
13417D9267j144k872k09J661M816L656k726l333L049K231j769L869K404l267J225
13402E6858P708L79P19J86k41K387K863K842N444N174L691R53K821J334K812O604
13386A02534N759P093J6047J5043K0444K5656L5506N4692P0082J02966J66306
13375F22128K43905L32099L83171K82720K1045k38241l64467l38813k52678j77154
13365E13715j24506q5952n6291l9171l3723k5432j5017j1005j2044q638m867o669
13353I0400q93r32m079l680m090k33K891L276p124p477m309j410j792j937j691
$$ plain form
13447 40488 36489 39381 39728 38253 36014 40377 36861 38944 41650 48174 52173 54062 54372 58017 57645
13432 57645 54901 52083 48619 46361 46399 45792 44094 50229 52707 47755 37267 37342 43422 48202 49267
13417 49267 48123 45251 45042 46703 51519 55175 52449 49116 52165 54396 52627 56496 58900 55633 56858
13402 56858 64566 64945 65664 65850 65609 67996 70859 73701 79145 84319 88010 88963 91784 93118 95930 102534
13386 102534 108293 115386 131433 146476 166920 192576 228082 282774 352856 455822 622128
13375 622128 866033 1198132 1581303 1864023 1885068 1646827 1282360 943547 690869 513715
13365 513715 389209 303257 246966 207795 174072 148640 133623 122618 110574 101936 97069 90400
13353 90400 89507 88575 84496 80816 76726 76493 79384 82660 75536 68059 63750 62340 60548 58611 56920
13338E6920n42j229J362j6L278L89k228m114M955J328m617O62k104k25j109l528
13322D9182j63O199j462k338K528L956k892l567k248j84r10L210J831J720L486
13307E8348l24O44K897M132J912r39J30m057l15P244r68j1956k311j469k726K672
13291E2914K996J908k45m239l63k070N642P38m196o70K082N771J849J075j953
13276F1239q85K00Q98M505J930k468K525L599L404o1P08r65m677k814l271l404
13260F0463N290L517N840M506k300m113m492O35j868J011R13l302j970j544o542
13245E6044j743L319J381L332O594J029M529n150P78L716o89k146k373K255K816
13230G3692j690J121J643l274j277K677k988l403M15K535N947O411K069K742j362
$$ plain form
13338 56920 56378 55149 56511 56495 59773 60162 57934 53820 58775 60103 55486 56148 54044 53819 52710 49182
13322 49182 49019 55218 53756 51418 53946 57902 55010 51443 49195 49011 48101 51311 53142 54862 58348
13307 58348 58024 58668 61565 65697 67609 66670 66800 62743 62428 69672 68704 56748 54437 52968 50242 52914
13291 52914 55910 57818 57573 53334 52971 50901 56543 57281 53085 52415 54497 60268 62117 63192 61239
13276 61239 60354 60554 61452 65957 67887 65419 67944 71543 74947 74886 75594 74629 69952 67138 63867 60463
13260 60463 65753 69270 75110 79616 77316 73203 68711 69346 67478 68489 69402 66100 64130 62586 56044
13245 56044 54301 57620 59001 62333 68927 69956 74485 69335 70113 73829 73140 70994 68621 70876 73692
13230 73692 72002 73123 74766 71492 70215 72892 69904 66501 66916 69451 75398 81809 83878 86620 85258
13215H5258l876k80L473J826J949N65k093j547j211M288L573N233j530j404J230
13200I5454K514O021N484K522j21P93K035M823M700J0004Q255N875M985J5689
13186A69033K2971L4247N4905N5405L0790j0444m2925n0319m5709m1037k8845
13175A48072j8291j1011j0179o340m442k901l46L733k270m959m144j139L957P893
13161I7633P103P130j215j343l581p46j7J782j375J977L773j611k151K955K772
13146A13086O58j474M111L49j929n14J735j025q53K941N081M449O697N101K569
13131A40982L525M344L446M229J0862P166J30n867n557J557O26R36N20k037o112
13116A58750o935m326j1562q197j537m212P549P789O449J2287J4219Q683L016
$$ plain form
13215 85258 81382 81102 84575 86401 88350 88915 86822 85275 84064 88352 91925 97158 95628 94224 95454
13200 95454 97968 103989 109473 111995 111874 112667 114702 119525 124225 134229 142484 148359 153344 169033
13186 169033 192004 226251 281156 336561 367351 356907 313982 263663 217954 176917 148072
13175 148072 129781 118770 108591 102251 97809 94908 94562 98295 96025 91066 86922 85783 89740 97633
13161 97633 104736 111866 110651 109308 105727 104981 104964 106746 105371 107348 111121 109510 107359 110314 113086
13146 113086 113744 112270 116381 116730 114801 114287 116022 114997 114144 117085 122166 126615 133312 138413 140982
13131 140982 144507 148851 152297 156526 167388 174554 174684 168817 163260 164817 165443 166379 166899 164862 158750
13116 158750 151815 147489 135927 127730 126193 121981 129530 137319 143768 156055 170274 178957 181973
13103A81973k157p107l646j062o309o310l875j123o339k881l430n422m743l059
13089A24510j108M020M191R33k774p3P686P253L790N097M397Q592P373R431J0710
13074A94028Q231j058L829J647K714J3002J3386O172J0267J1657J5056J5236J7200
13061C11367L0654M6523O1993R1485J19674R7249M965q8305j18162r5207o8356
13050C93880m8735l2433k5537j6067j4519j2337l987M917R768Q397Q491R581J0501
13037B91920L940P269K309q281j8273j6233j2285n720j316M879J6126J5778K1411
13024C01524J1007P256j120j549N513P216Q438J8699K0152J6387R514l128p478
13011C92431j254P895J3340J7609J8536J1906J3768K1526K3560J6290O040J416
$$ plain form
13103 181973 179816 172709 169063 168001 161692 155382 151507 150384 144045 141164 137734 132312 127569 124510
13089 124510 123402 127422 131613 132546 129772 129699 137385 144638 148428 153525 157922 166514 173887 183318 194028
13074 194028 202259 201201 205030 206677 209391 222393 235779 241951 252218 263875 278931 294167 311367
13061 311367 342021 388544 450537 542022 661696 758945 763910 675605 557443 462236 393880
13050 393880 345145 312712 287175 271108 256589 244252 240265 245182 254950 263347 271838 281419 291920
13037 291920 295860 303129 305438 297157 278884 262651 250366 244646 243330 248209 264335 280113 301524
13024 301524 312531 319787 318667 317118 322631 329847 338285 356984 377136 393523 403037 399909 392431
13011 392431 391177 399072 412412 430021 448557 460463 474231 495757 519317 535607 541647 543063
12999E43063N639N150k320q48j4919j1891j0387n236J1539J0480J7003K8795L9319
12986F15387M6554M3903L9848L5047M8750N4111N6215M9241M2260L2506L1580
12975A095402M6760N4561N9237O0401O8186O3284O0538O3454P6783Q0620Q3406
12964A812632Q9226Q7012Q3010Q7463R8571J21468J33853J55998J80412K01702
12954C051347K29073K63561L04802L62866M25244M95433N65053O33566P28160
12945G059105Q58325J033440J268035J572711J982916K563264L396041M609570
12937B4343407O407164R109386J3236333J9666590K9725108M4332558O1555192
12930B08375738P1157855N3947088Q754752l9244508o5572390o3487189m9417122
$$ plain form
12999 543063 548702 553852 551532 550684 535765 523874 513487 508251 519790 530270 547273 576068 615387
12986 615387 661941 705844 745692 780739 829489 883600 939815 989056 1031316 1063822 1095402
12975 1095402 1142162 1196723 1255960 1316361 1384547 1447831 1508369 1571823 1648606 1729226 1812632
12964 1812632 1901858 1988870 2071880 2159343 2257914 2379382 2513235 2669233 2849645 3051347
12954 3051347 3280420 3543981 3848783 4211649 4636893 5132326 5697379 6330945 7059105
12945 7059105 7917430 8950870 10218905 11791616 13774532 16337796 19733837 24343407
12937 24343407 30750571 39859957 53096290 72762880 102487988 146820546 208375738
12930 208375738 279533593 333480681 342235433 302990925 237418535 173931346 124514224
12923A24514224l4780708k3684843j6248091j1397204q181811n971268m433972
12916A9816327l355068k584508k019164j597805j291550j065277q94975p49140
12908F258840o14971n08930m30897l84562l51703l14496k80551k47173k28125
12899B897432k15465j93867j82791j69770j59941j35912j23059j00768p7884p1525
12889A466450o7186p0704p1242o7459o1466n7026m6654m0432n1207n1943l9852
12878H41279k9317j8938j1353j2321j1433q344p131k260l890R55o623j3904j7099
12865F99621k6838l3010m0575m7166m0222k9838k7406k8270k5388k0076j2368
12854C68464l665m465p750j594M91m456L038m62n304j0242p557o438j0660m725
$$ plain form
12923 124514224 89733516 66048673 49800582 38403378 30221567 24250299 19816327
12916 19816327 16461259 13876751 11857587 10259782 8968232 7902955 7007980 6258840
12908 6258840 5643869 5134939 4704042 4319480 3967777 3653281 3372730 3125557 2897432
12899 2897432 2681967 2488100 2305309 2135539 1975598 1839686 1716627 1615859 1537975 1466450
12889 1466450 1399264 1328560 1257318 1189859 1128393 1071367 1024713 984281 933074 881131 841279
12878 841279 811962 793024 781671 769350 757917 749573 742442 740182 736292 737247 730624 716720 699621
12865 699621 672783 639773 599198 552032 511810 481972 454566 426296 400908 380832 368464
12854 368464 364799 360334 352584 350990 351481 347025 350063 349601 344297 334055 326498 320060 309400 304675
12840C04675o292m444m552n775q226r293j1262p162J053M873J3272P315L227n638
12826B71771j3248p009j3333q629j1035j1505m738j347J0l906J476Q02K280N698
12812B07287M286R75o3n162o852n648k943N818J4880K0514R218j6649k5953j6136
12798A83572j2615r036j1995j4763p180k686m248m868o782p352m996J667P961
12785A06679K457l064k566R21J384N916O001J0211O901M827r88m261K764M109
12771A41291l000n115n15l102r697p590l324m378l400p259n529p230o037p308
12757F7807o657r885j0054l409l954R6J2607N635J0410R493K580L276N603R5n100
12742G8543q844l518j0284p472l723P60l274M43p613j1731n891P93J358N012N944
$$ plain form
12840 304675 298383 293939 289387 283612 275386 266093 254831 247669 248722 253595 266867 274182 277409 271771
12826 271771 258523 251514 238181 229552 218517 207012 202274 200927 200937 197031 198507 199309 201589 207287
12812 207287 211573 212548 212485 207323 200471 194823 191880 197698 212578 233092 242310 225661 199708 183572
12798 183572 170957 161921 149926 135163 127983 125297 121049 116181 109399 102047 97051 98718 106679
12785 106679 109136 106072 103506 104427 105811 111727 117728 127939 134840 139667 138679 134418 137182 141291
12771 141291 138291 133176 132661 129559 119862 112272 108948 104570 101170 93911 88382 81152 75115 67807
12757 67807 61150 51265 41211 37802 33848 33944 46551 52186 62596 72089 74669 77945 83548 83643 78543
12742 78543 69699 66181 55897 48425 44702 45462 42188 42631 35018 23287 17396 18189 19547 24559 30503
12727C0503O254N7L408L987J1285L156K241L230k653k736J072J339k303J956K014
12712F2810M041J445k956n987o700K323L432l13j857L124O682J747m244m724n706
12697E3117o665M278R227M455P896L721K766j393l064j750J295N838J666J711
12683H3098L689P678M450j848k746J459J965k021l421j635m254l887j0586q789
12669F3152p192n232J56O86M675K648p003j102j919J288J01J464k364j039L792
12654E2111L262Q85N1K218P497L3K852k401n035J411L824J498Q97M575k53p00
12638G2725K064L236K778j819N67L412m329l569L579K739j409J814K891K781l151
12623H4309J918M334M142M997M821O363Q437N664R385J3381P505N923R734J5401
$$ plain form
12727 30503 36757 36814 40222 44209 55494 58650 60891 64121 61468 58732 59804 61143 58840 60796 62810
12712 62810 66851 68296 65340 59353 52653 54976 58408 58095 56238 59362 66044 67791 63547 58823 53117
12697 53117 46452 50730 59957 64412 72308 76029 78795 77402 74338 72588 73883 79721 81387 83098
12683 83098 86787 94465 98915 97067 94321 95780 97745 95724 92303 90668 86414 82527 71941 63152
12669 63152 55960 50728 50884 51570 56245 58893 51890 50788 48869 50157 50258 51722 49358 48319 52111
12654 52111 55373 56258 56309 58527 66024 66057 68909 66508 61473 62884 66708 68206 69103 73678 73425 72725
12638 72725 74789 78025 80803 78984 79551 82963 78634 75065 78644 81383 79974 81788 84679 87460 84309
12623 84309 86227 90561 94703 99700 104521 110884 119321 124985 134370 147751 155256 161179 170913 186314
12609A86314J8315J4548K2401L5360N0676O5554Q9373J26200J83366K79646M39588
12598A511341O87042R90848J174494Q44697o9490q91146j113026r21116o52265
12589A561379m27985k74328j89169j32309r6307p0994n4414m3542l0897k3256
12579B18178j9362k2208j8314j3125p896p467n594m339l406L3L420m279o341k043
12565A07257O21m904k620J95q531n379k028o8J371q35L025l214m242J312M122
12550H6082L617K436k50J901m171j967j653J251l026M42O4j185Q90J183K49M446
12534I0309L651n252p826K421N53m628L757J165j63K064K973m374k613L074k757
12519H2354m651m612k87j271O11J898L661m26L088K306K294L80K084N075k700
$$ plain form
12609 186314 204629 219177 241578 276938 327614 393168 482541 608741 792107 1071753 1511341
12598 1511341 2198383 3189231 4363725 5208422 5138932 4247786 3134760 2213644 1561379
12589 1561379 1133394 859066 669897 537588 441281 370287 315873 272331 241434 218178
12579 218178 198816 176608 158294 145169 137273 129806 124212 119873 116467 116500 119920 115641 109300 107257
12565 107257 107878 102974 100354 100549 92018 86639 84611 84543 85914 85079 88104 84890 80648 81960 86082
12550 86082 89699 92135 91885 93786 89615 87648 85995 87246 84220 84662 84726 83541 84431 85614 85863 90309
12534 90309 93960 88708 80882 83303 83856 79228 82985 84150 83987 86051 89024 84650 82037 85111 82354
12519 82354 77703 73091 72804 71533 72144 74042 77703 77277 80365 82671 84965 85345 87429 92504 89804
12504H9804P587K822l745K201N476K616K410L492J925N507P693O199Q261R936
12490A52184Q163J5539J8956K5897M7103O8250R1434J36087K08844L03358L75310
12479A451125L38179J21134j63491l41315l51195k77764j96444j31336q8789o1746
12469B98358m7263m0665k5428j6421j1151o260j1020j5311n985j974K198k792
12457A16286j1451l916K857J210L851K593p545K74L653k661n838k197J603l38
12443I8381K092N332M56M747K726n713J111k497q005o498m697J093M327Q91j951
12428I1795K198N843J177m469l598L302O24n26K18J692P54J959L64O036K783J422
12412A11574r42k7n569j474k664L42K869j296q79j230k30J84K232m630q10L450
$$ plain form
12504 89804 97391 100213 96468 98669 104145 106761 109171 112663 114588 120095 127788 133987 142248 152184
12490 152184 160347 175886 194842 220739 267842 336092 427526 563613 772457 1075815 1451125
12479 1451125 1789304 1910438 1746947 1405632 1054437 776673 580229 448893 360104 298358
12469 298358 251095 210430 185002 168581 157430 151170 140150 124839 118854 116880 119078 116286
12457 116286 104835 100919 103776 104986 108837 111430 103885 104159 107812 105151 99313 97116 98719 98381
12443 98381 100473 105805 106261 111008 113734 108021 109132 106635 98630 92132 87435 88528 92855 93746 91795
12428 91795 93993 99836 101013 96544 92946 96248 96872 96346 96564 98256 99010 100969 101333 107369 110152 111574
12412 111574 110632 110605 105036 103562 100898 101240 104109 102813 101934 100704 100474 100658 102890 98260 97450 100900
12396A00900O183P390p15r01l84j655J594L124j153k47o39K847J079P21J723n578
12380A14289k393M363L742j599j357P33m98l283P00L498J72K175L088k056j422
12365A20152k296K902R69k060m3L457k51l005k425j481j488L138N78K443K087
12350A22677n54j514n11Q1M78l910m541R46M606O106L382o419n009k04M521N485
12334A25620L874p06K928n78M819J210O50O883P92j317m605l753J121K11M726
12319A41875R455Q189J0515N784k778q303j0962o590l022l406k639m796M043M089
12305A41454j279l26J821J41J343R20M579M770k625m460O2j360J314P292j16o83
12289A52847M047P380N01o67k321p12j776j750l025m624j263K240K131L655M11
$$ plain form
12396 100900 107083 114473 113758 112857 112473 110818 112412 115536 114383 114136 113497 116344 117423 118144 119867 114289
12380 114289 111896 116259 120001 118402 117045 117778 117280 113997 114697 118195 118367 120542 123630 121574 120152
12365 120152 117856 120758 121727 119667 119624 123081 122830 119825 117400 115919 114431 117569 118147 120590 122677
12350 122677 122123 120609 120098 120179 120657 116747 112206 113152 117758 123864 127246 120827 115818 115614 120135 125620
12334 125620 129494 128788 131716 131138 135957 137167 137817 144700 145492 144175 139570 135817 136938 137149 141875
12319 141875 151330 159519 170034 175818 173040 164737 153775 147185 144163 140757 138118 133322 137365 141454
12305 141454 140175 139849 141670 141811 143154 144074 148653 153423 150798 146338 146400 145040 146354 153646 153530 152847
12289 152847 156894 164274 164775 164108 161787 161075 159299 157549 154524 149900 148637 150877 153008 156663 157074
12274A57074R44j763l42k199M15P42K017K945M970M455K394k323m184O638N725
12259A77508p24o24j458p85l115J210J942k985N628N674k428r05N876M187j7K721
12243A91705L950m710j903J319j65J563l897k100M36k994o005J632P395j362M381
12228A89245R585N254j831p5K201J923j361j592K987J833J432n35j301j747J9
12213B06037j693L522J031J98P332K011j011o83q85o01K274j895K440j628K180
12198B18629K333k49K126J96L138K460j850m061J48L871M849N344r81k897j197
12183B31859K642J677K621L528l727m172L636M659J194J280k182K17K098K920
12169B48250RK553L27k970j797o71j88N481M738L752K084J43K861K312k96k470
$$ plain form
12274 157074 158018 156255 155913 153714 154129 154871 156888 159833 164803 169258 171652 169329 165145 171783 177508
12259 177508 176784 176160 174702 173917 170802 172012 173954 170969 176597 182271 179843 178938 184814 189001 188984 191705
12243 191705 195655 190945 189042 190361 190196 191759 187862 185762 186198 183204 177199 178831 186226 184864 189245
12228 189245 198830 204084 202253 202178 204379 206302 204941 203349 206336 208169 209601 209066 207765 206018 206037
12213 206037 204344 207866 208897 209095 216427 218438 217427 216744 215859 215258 217532 215637 218077 216449 218629
12198 218629 220962 220713 222839 223035 226173 228633 226783 222722 222870 226741 231590 236934 235953 233056 231859
12183 231859 234501 236178 238799 242327 238600 234428 238064 242723 243917 245197 243015 243232 245330 248250
12169 248250 248259 250812 251139 248169 246372 245701 245513 250994 255732 259484 261568 261711 264572 266884 266588 264118
12153B64118N256O789O425L521O277O159R13n680n09M188m078n542K165l351k919
12138B83732k219J396N100J246l089l770J186J690L516M455j235j408k675L939
12124B91864M292j176L319K460N15l303k19R05M163N492L201l393l718p212k252
12109B94938K818K575L736J917K931K960J447P179O801L723O387M532L490j775
12095C43659k291j284k334o145l442j705R42K037k811n24O691J985k235P9N81
12080C33203K02J493K817K255j18O95k80k99N183J619k102m79M804P566L993l242
12064C57310n217k336m45M178N288J87k210N221L824M078K531N228M841j973k470
12049C78035k262k675m768m582k408m987m934P54J350Q126k02m635n620l296J791
$$ plain form
12153 264118 269374 276163 282588 286109 292386 298545 299458 293778 293269 297457 293379 287837 290002 286651 283732
12138 283732 281513 282909 288009 289255 286166 282396 283582 285272 288788 293243 292008 290600 287925 291864
12124 291864 296156 294980 298299 300759 301274 297971 297752 298657 302820 308312 311513 308120 304402 297190 294938
12109 294938 297756 300331 304067 305984 308915 311875 313322 320501 327302 331025 337412 341944 345434 343659
12095 343659 341368 340084 337750 331605 328163 326458 327400 329437 326626 326102 332793 334778 332543 332622 333203
12080 333203 333405 334898 337715 339970 339852 340547 340267 339968 345151 346770 344668 344189 348993 356559 360552 357310
12064 357310 352093 349757 349312 353490 358778 358965 356755 361976 365800 369878 372409 377637 382478 380505 378035
12049 378035 375773 373098 368330 363748 361340 356353 351419 352173 353523 361649 361447 356812 351192 347896 349687
12034C49687J1517Q417j14j329n15j574L119j264j769k13M19k660j099M589O05
12019C67816k034K528M723K864R61j565l447l584q65K816N440J791K39j398q09
12004C75476n393l888j566L25J288J993K797R72l295p66K071j684R66k196K420
11989C69520L229o20m636l567L47K920M878J805m963Q39m761p259n56J342k61
11974C58257P2j653j204J540L722L425l681J878m750r06L121k450k710O30R17
11959C56208k729j526m1K518l137o791O03J149J066K936J217r58p3L278m9k661
11943C51010ol274m678L1j166R74l847J71K765K704l086j111L43j615k565J568
11927C38218j723k316L775P87r634j851K486N140K705o461n111J090k188J105
$$ plain form
12034 349687 361204 369621 369507 368178 367663 366089 369208 367944 366175 365962 366381 363721 362622 367211 367816
12019 367816 365782 368310 373033 375897 376858 375293 371846 368262 367397 370213 375653 377444 377683 376285 375476
12004 375476 370083 366195 364629 364954 366242 368235 371032 372004 368709 367943 370014 368330 369296 367100 369520
11989 369520 372749 372129 367493 363926 364273 367193 372071 373876 368913 369752 364991 357732 357176 358518 358257
11974 358257 358329 356676 355472 357012 360734 364159 360478 362356 357606 356700 359821 357371 354661 355291 356208
11959 356208 353479 351953 351912 354430 351293 344502 345105 346254 347320 350256 351473 350515 350442 353720 353671 351010
11943 351010 351004 347730 343052 343083 341917 342891 339044 339215 341980 344684 341598 340487 340830 339215 336650 338218
11927 338218 336495 334179 337954 338741 329107 327256 329742 334882 337587 331126 326015 327105 324917 326022
11913C26022l49K203k905l934k215N250P56n547j545K22o105n495m038m316J560
11898B99564R02N056j387k438K597L325j584n233J815N51l292l139m59l450r35
11883B91893j122N63K185k804j723M50J185m672o99k287k617k994p52j807J368
11868B76167n49l136o43O21M22M93j336j538L89n499l889j113k66j461Q54N893
11852B65409P71P72K783l289k571n056l793j499l895j299L54m90K157Q07l303
11837B47858n38J983k083l61q402Q83m95M945N37n725l264J48q7L137K355P68
11821B41659k188o088k534k812l54Q60p53j348l089k667J233k131k572J778k612
11806B16382r18K165J375k537l158o18k279J13j865K515N7J896%n49P12m439n458
$$ plain form
11913 326022 325673 327876 324971 321037 318822 324072 324828 319281 317736 317958 311853 306358 302320 298004 299564
11898 299564 300466 305522 304135 301697 304294 307619 306035 300802 302617 303168 299876 296737 296278 292828 291893
11883 291893 290771 291334 293519 290715 288992 289442 290627 285955 285256 282969 280352 277358 276606 274799 276167
11868 276167 275618 272482 271839 272460 272882 273375 272039 270501 270890 265391 261502 260389 260123 258662 259516 265409
11852 265409 266180 266952 269735 266446 263875 258819 255026 253527 249632 248333 248687 248197 250354 251161 247858
11837 247858 247320 249303 247220 246859 238457 239340 238845 243790 244327 238602 235338 235486 235399 238536 240891 241659
11821 241659 239471 233383 230849 228037 227683 228543 227790 226442 223353 220686 221919 219788 217216 218994 216382
11806 216382 215464 217629 219004 216467 213309 212691 210412 210525 208660 211175 211232 213128 213128 212579 213291 208852 203394
11789B03394j787k973j612k750p01J499J002m185j947J631l666m891K029K838
11775A87881n97k962r02J397M73m787j631K071j217L038K249j886k356L008J496
11760A85275l272O43q90l031l963j719K028P51j933J796j154k961K702j641j529
11745A71102L005L33l389p74k241j103j433O61j598l996l056j183j20k293l547
11730A50368j953J827O033j991J8M519M031J33n628l221o55J215n84j886J502
11715A53728o281q18j10J653K292k78p46q28l32n86J377m012n025k312J501J252
11699A40475J230j568J252J625j038l379K89k166o540j447L969L435QR18l306
11684A33757m95K790l384o35L082M06J687k492j929p350L478Q28m901k694k765
$$ plain form
11789 203394 201607 198634 197022 194272 193571 195070 196072 191887 189940 191571 187905 183014 185043 187881
11775 187881 187284 184322 183420 184817 185290 180503 178872 180943 179726 182764 185013 183127 180771 183779 185275
11760 185275 182003 182646 181756 178725 174762 173043 175071 175822 173889 175685 174531 171570 174272 172631 171102
11745 171102 174107 174440 171051 170277 168036 166933 165500 166161 164563 160567 157511 156328 156208 153915 150368
11730 150368 148415 150242 156275 154284 154302 158821 162852 162985 157357 154136 153481 154696 154112 152226 153728
11715 153728 147447 146629 146519 148172 150464 150186 149440 148612 148280 147694 149071 145059 140034 137722 139223 140475
11699 140475 141705 140137 141389 143014 141976 138597 138886 136720 130180 128733 132702 136137 136145 137063 133757
11684 133757 133262 136052 132668 132033 135115 135521 137208 134716 132787 125437 128915 129743 124842 122148 119383
11669A19383K236j494j528j137J536k84L387m466n936J273M295Q0j031J974L686
11654A21974k460p144k586L519L646N324j291k334r33k480j019j14K613J794J845
11639A20354P23o215p120j160O126k28J252O03k251l562m325l918l550M917K890
11624A04536J153O63l263q42M492K171l116k232j162k683j167j071j93j356j339
11609I4591K866r40k518m077K237K564l31j690k601l44m313l4N856J64m16P96
11593I1810J595L599R03m076l960J628L263J882L859L777k663n191n556j60K279
11578I2989L941L534m267l80N907n965j4996j81N665M796L031j52o571m662j638
11563H1051K961K520j291j261J268J381K471j816L770O242n47n116R9j636l924
$$ plain form
11669 119383 121619 120125 118597 117460 118996 118712 122099 117633 111697 112970 117265 117345 116314 118288 121974
11654 121974 119514 112370 109784 113303 116949 122273 120982 118648 117715 115235 114216 114102 116715 118509 120354
11639 120354 121077 114862 107742 106582 112708 112480 113732 114335 112084 108522 104197 100279 96729 101646 104536
11624 104536 105689 106352 103089 102247 106739 108910 105794 103562 102400 99717 98550 97479 97286 95930 94591
11609 94591 97457 96517 93999 89922 92159 94723 94392 92702 90101 89757 85444 85410 91266 91430 91014 91810
11593 91810 93405 97004 97907 93831 89871 91499 94762 96644 100503 104280 101617 96426 90870 90710 92989
11578 92989 96930 100464 96197 95817 101724 95759 80763 80582 86247 91043 94074 93922 87351 82689 81051
11563 81051 84012 86532 85241 83980 85248 86629 89100 87284 91054 97296 96749 91633 91732 90096 86172
11548H6172m764k484K597R61R39j812N152K923k412k628j959K281n321l341k85
11533G6019M120M356q42l202j853k484m08j682k172n63m705j385M547J414J26
11518G1286N671P02k751K57M289L58k303j416k400l450k159k050Q5J034J712J311
11502G0176K573m729K153N289P73l125k50k19j416k647J376r86o94L707R79p99
11486G2161N91n652N45O798m369k035O56N924j281r064l479J684N621M030k192
11471F9938j695q29n85j49o96k590k019L154r01j492O3N8N154L20L17q99j665
11454F5484j761q70n3l650m311k95K366J55J913J226m477J180K105O135l9j453
11438F3655k066k909K773J52J76M45Q42m414n569L118M835j171j954J793j556
$$ plain form
11548 86172 81408 78924 81521 82482 83421 81609 86761 89684 87272 84644 82685 84966 79645 76304 76019
11533 76019 80139 84495 83653 80451 78598 76114 75706 74024 71852 71289 66584 65199 69746 71160 71286
11518 71286 76957 77659 74908 75165 79454 79812 77509 76093 73693 70243 68084 66034 66119 67153 68865 70176
11502 70176 72749 68020 70173 75462 76235 73110 72860 72641 71225 68578 69954 68968 68274 71981 72960 72161
11486 72161 72752 67100 67645 74443 70074 68039 68695 74619 73338 64274 60795 62479 68100 72130 69938
11471 69938 68243 67414 66829 66680 65984 63394 61375 64529 63628 62136 62199 62257 67411 67731 68048 67149 65484
11454 65484 63723 62853 62800 59150 54839 54544 56910 57065 58978 60204 55727 56907 59012 65147 65108 63655
11438 63655 61589 58680 61453 61605 61781 62226 63068 58654 53085 56203 61038 59867 57913 59706 58150
11423E8150p704J584K125O77L360N68o01J906k010j608k171M182m012k485K610
11408E4571J588K640l50j868L150p88J936j345K840K941n79j567m021k105M716
11393F1759L440j494k366Q97J685J365j096n517k647M13Q86L38J535J091k808
11378E7481K205K173J288o788o813k101j170M807L395o88O01j838J608J101J154
11363E6415K086j252o023o935j014L686K370L08J316l62m103N21K249J401N940
11348E6603L745l790l674J47L029J433k805j727o66K463O78m034k914k496J814
11333D7806j787k800n41M93J673j21N35J803M088K351l364j923J045J647k555
11318D8350m323j911J90r94J857M653k584o63N72q77J317j45K97k057l563L072
$$ plain form
11423 58150 50446 52030 54155 54832 58192 58760 58159 60065 58055 56447 54276 58458 54446 51961 54571
11408 54571 56159 58799 58449 56581 59731 58943 60879 59534 62374 65315 64736 63169 59148 57043 61759
11393 61759 65199 63705 61339 62236 63921 65286 64190 58673 56026 56439 57325 57663 59198 60289 57481
11378 57481 59686 61859 63147 56359 49546 47445 46275 51082 54477 53789 54390 52552 54160 55261 56415
11363 56415 58501 57249 51226 44291 43277 46963 49333 49641 50957 50595 46492 47013 49262 50663 56603
11348 56603 60348 56558 52884 53031 56060 57493 54688 52961 52295 54758 55436 51402 48488 45992 47806
11333 47806 46019 43219 42678 43171 44844 44723 45258 47061 51149 53500 50136 48213 49258 50905 48350
11318 48350 44027 42116 42306 41312 43169 47822 45238 44575 45147 44270 45587 45442 45739 43682 40119 43191
11302D3191L423L181j507J611K26j88n06L667k424j673L3k30J21L67N135J584
11286E6011r91k256n536o55L72m90O5M840J282k766K533K939k016k700K304q56
11270E2080k731j977M97l182j212L413m0M171O75J085l331l543J125L045K171
11255E2246j410j591k063k212K339O978Q64m754k216O08M41L557J189j794j950
11240E0232k30L214P9k502q92L75k366m207q33L17l898J208O52q98l77L788M446
11223D8108R8m072K8J872R28k18J058N148L921K40j868p15l458j744m380j559
11207D3387J126k248j130P08r22M665m14k681J779M549J381L83k679K268k215
11192D7957l840j917j781K306L83K937l446j108L546p82n17L426O34M52k050p15
$$ plain form
11302 43191 46614 49795 48288 49899 50125 49937 49431 53098 50674 49001 49034 48804 48925 49292 54427 56011
11286 56011 55020 52764 47228 46573 46945 46455 46520 51360 52642 49876 52409 55348 53332 50632 52936 52080
11270 52080 49349 47372 47869 44687 43475 46888 46848 51019 51694 52779 49448 45905 47030 50075 52246
11255 52246 50836 49245 47182 44970 47309 54287 55151 50397 48181 48789 49230 52787 53976 52182 50232
11240 50232 50002 53216 53295 50793 49901 50276 47910 43703 42870 43187 39289 40497 41149 40251 39874 43662 48108
11223 48108 48206 44134 44162 46034 46962 46744 47802 52950 56871 57111 55243 54528 51070 49326 44946 43387
11207 43387 44513 42265 41135 41843 40921 45586 45172 42491 44270 48819 50200 50583 47904 50172 47957
11192 47957 44117 42200 40419 42725 43108 46045 42599 41491 45037 44255 43738 47164 47798 48250 46200 45485
11176D5485l800o538J105P462K443p32m031k577k90j123L624N919L63K210K917
11161E2437N263j316j511q45l559k491K085K63j376J835j391n485m696j02J867
11146D0978M374n340o725l689J488N827J974l907l318N504J693J898O541P58k564
11131D5492L77P40l933j037l7n06j205L880K426J531j022l219j518J697l800j263
11115C8603l196J520J033P704L388j161J084k26J313N60l084j559K283N320J546
11100E5128l032j869l79m38J557k634n133j259k009p47M249J043L56K885K072
11085D9790nj666n054P43L678L023K26k967l376k350J023K181L917J924l984j926
11069D5177K236J219N246m59k054M731P070L600N949K194q064n329K492l265K303
$$ plain form
11176 45485 41685 35147 36252 43714 46157 45425 41394 38817 38527 37404 41028 46947 47310 49520 52437
11161 52437 57700 56384 54873 54028 50469 47978 50063 50326 48950 50785 49394 43909 39213 39111 40978
11146 40978 45352 40012 33287 29598 31086 36913 38887 34980 31662 37166 38859 40757 47298 48056 45492
11131 45492 45869 46609 42676 41639 41602 41096 39891 43771 46197 47728 46706 43487 41969 43666 39866 38603
11115 38603 35407 36927 37960 45664 49052 47891 48975 48749 50062 50622 47538 45979 48262 53582 55128
11100 55128 52096 50227 49848 49410 50967 48333 43200 41941 39932 39185 43434 44477 44833 47718 49790
11085 49790 49785 48119 43065 43808 47486 50509 50735 47768 44392 42042 43065 45246 49163 51087 47103 45177
11069 45177 47413 48632 53878 53419 51365 56096 63166 66766 72715 74909 66845 61516 64008 60743 63046
11054F3046Q940P51K693Q162J0071R341R892J0120J5015J6896J6028Q754P75j878
11040A78606q701j873P713J3039K1800K4517L0392L7083K8269n240k0248k3456
11028B81901k8386j3859Q744J7604K3780L2843M4656M5719K3863j1360m2397m4244
11016C38864l8635k9592j2982o505P259J6690K6019K1558O715k0872l5930l2322
11004B40267l2754k5753j6948j0364L53O431J1087R777q48j1997j8796k3425j7838
10991A09192j3957j2034n863m202m022o651r57l60J418L095R74m15k711o190j945
10976E5372J746q2m591K403k269m329j855L973J234J417K33M346N098j172p003
10961E4521n824K226o22k096K0J510L883r43k191J720J954J524l447k255J9r99
$$ plain form
11054 63046 71986 72737 75430 83592 93663 103004 112896 123016 138031 154927 170955 179709 180484 178606
11040 178606 169905 168032 175745 188784 210584 235101 265493 302576 330845 325605 305357 281901
11028 281901 253515 239656 248400 266004 289784 322627 367283 413002 436865 425505 383108 338864
11016 338864 300229 270637 257655 251150 258409 275099 301118 322676 329391 308519 272589 240267
11004 240267 207513 181760 164812 154448 154801 161232 172319 182096 181248 169251 150455 127030 109192
10991 109192 95235 83201 77338 73136 69114 62463 61506 61146 62564 65659 66633 66218 63507 57317 55372
10976 55372 57118 57036 52445 54848 52579 48250 46395 50368 51602 53019 53252 57598 62696 61524 54521
10961 54521 48697 50923 50301 48205 48225 49735 53618 52675 50484 52204 54158 55682 52235 49980 49999 49000
10945D9000K60K17J273L050K949l642m743k010j556J860O490L845k364m559m293
10930D5777O8J948M897j307N117L806K222m203k507n59m823P294J851m753M55
10915E5283M661N09j341J462J003o60l106l115L376J495N457k044l610M081L110
10900F6561m637J005M54p109K695K288l878Q37M272J701n28j951R57M608L282
10885G0557k872j737o60j866j722O41j090j036K549R40L107L829K064M891n76
10870G7019r18L45k0N224K099l207k26N48J688q85M81P743L298J827O098L012
10854A04126n0J759j155q07j403j983K472J012J007P837Q928n073m001j870o206
10839A04593p24J590l977m783o174j67K476P295O878k711p991n259m175m66J236
$$ plain form
10945 49000 49260 49477 50750 53800 56749 53107 48364 46354 44798 46658 53148 56993 54629 50070 45777
10930 45777 45845 47793 52690 51383 56500 60306 62528 58325 55818 55259 50436 57730 59581 54828 55283
10915 55283 59944 60453 59112 60574 61577 60917 57811 54696 58072 59567 65024 62980 59370 63451 66561
10900 66561 61924 62929 63383 56274 58969 61257 57379 58216 62488 64189 63661 61710 62667 67275 70557
10885 70557 67685 65948 65288 63422 61700 62341 61251 60215 62764 63704 66811 70640 72704 77595 77019
10870 77019 76101 76446 76426 81650 83749 80542 80316 80864 82552 81667 82148 89891 93189 95016 101114 104126
10854 104126 104076 105835 104680 103873 102470 100487 102959 103971 104978 112815 121743 116670 112669 110799 104593
10839 104593 103869 105459 101482 96699 90525 90358 92834 100129 107007 104296 96305 91046 86871 86405 87641
10824H7641j219L690P044N86L68l5m738m166k585l484K796K243L359k523l744
10809H5233Q72j472J098j408o75N93k981q54N938J131M639O590l939p462j159
10794H6144J857N636M927o94j779l061J377L177M845m42J087m078k740M725K412
10779A03393K222K38J98K880K376n075n054L08l84M22J445J370J28m17K746l806
10763A02990n320k881k866p117N31P313P096k762k70P217L400N25j729J227N427
10748A12781j066j683M523Q166P578L240K607J927J513j700O231M346l531L362
10734A48294j034O755Q300J0128J1709R647j824k035q98l545m99K257R41K482
10720A90678M504Q752J6333J3748L235n969j2213j2463o636k745N12j137M050
$$ plain form
10824 87641 86422 90112 97156 97742 98110 98075 93337 89171 86586 83102 85898 88141 91500 88977 85233
10809 85233 86105 84633 85731 84323 83648 84241 81260 80406 86344 87475 92114 98704 94765 87303 86144
10794 86144 88001 93637 98564 97870 96091 93030 94407 97584 102429 101987 103074 98996 96256 100981 103393
10779 103393 105615 105853 106051 108931 111307 106232 101178 101486 101102 101524 102969 104339 104467 104050 106796 102990
10763 102990 97670 94789 91923 84806 85337 92650 99746 96984 96714 103931 107331 107856 106127 107354 112781
10748 112781 111715 110032 114555 122721 130299 133539 136146 138073 139586 137886 144117 148463 144932 148294
10734 148294 147260 154015 162315 172443 184152 193799 191975 189940 189042 185497 184998 187255 188196 190678
10720 190678 195182 203934 220267 234015 237250 231281 219068 206605 199969 197224 197736 196599 200649
10707B00649P787P249L279j621o362p222p035j875k246l734P33o37k830j996J548
10692A85687L008l027r65L564N560K361n30j692L217Q350K323j486J854p53O720
10677B14191O124L570P611M954J674J191l06P980Q598L665J503N944P081J0870
10663B84650J2492J0398L519J2094J3108J0963J0315J1489J4849J0923K0011K6663
10651D41474L2892L1363L8706N3688O2457K6239M9P091J5509K6259M1773N9718
10639H37218Q2433R2563J23237J73944K52010L57260M89603O35805O98275M96868
10629D239216N4288k49370k65731j38887L2292K30830M73845P67860J144828J610242
10619G899413K093165K303387K258074K491686K753908K345025J111359k58360
$$ plain form
10707 200649 208436 215685 218964 217343 210981 203759 196724 194849 192603 188869 189602 188965 186135 184139 185687
10692 185687 188695 185668 184703 188267 193827 196188 195658 193966 197183 205533 207856 206370 208224 207471 214191
10677 214191 220315 223885 231496 236450 238124 239315 239009 246989 255587 259252 260755 266699 273780 284650
10663 284650 297142 307540 311059 323153 336261 347224 357539 369028 383877 394800 414811 441474
10651 441474 474366 505729 544435 598123 660580 686819 686868 693959 709468 735727 777500 837218
10639 837218 919651 1012214 1135451 1309395 1561405 1918665 2408268 3044073 3742348 4239216
10629 4239216 4293504 4044134 3778403 3639516 3671808 3902638 4376483 5144343 6289171 7899413
10619 7899413 9992578 12295965 14554039 17045725 19799633 22144658 23256017 22997657
10611B2997657r62700q49435j52443Q82603K070695L225339M379024N602444O102131
10602D3295315M549179Q30712k825858m416773m042004k585507o59329J489051
10594C5634786L790936O076311P848097P966083M929239r32745o110002q048718
10586E1153987p360506n462344l233884j020288J080848K925996M162113M036652
10578D6282574J698526k301282n549443o502614n734536m269117k731298j364959
10570A9527851k37997O20387J062835Q46509k03289j743553k930374l266020k957668
10561A0718681k393383j822099j344399r88036p25083n48226m14288l15891k56616
10552A910660k15875j79960j63048j41610j22676j01195q3826p4702o2190n5229
$$ plain form
10611 22997657 22034957 21185522 21033079 21915682 23986377 27211716 31590740 37193184 43295315
10602 43295315 47844494 48675206 45849348 41432575 37390571 34805064 34145735 35634786
10594 35634786 39425722 45502033 53350130 61316213 66245452 65312707 59202705 51153987
10586 51153987 43793481 38331137 35097253 34076965 35157813 38083809 42245922 46282574
10578 46282574 47981100 45679818 40130375 33627761 27893225 23624108 20892810 19527851
10570 19527851 19289854 19910241 20973076 21819585 21616296 19872743 16942369 13676349 10718681
10561 10718681 8325298 6503199 5158800 4170764 3445681 2897455 2483167 2167276 1910660
10552 1910660 1694785 1514825 1351777 1210167 1087491 986296 902470 827768 765578 710349
10542G10349m9537m1759l8073l5494k8054k2625k5137k5265k1341j5793j7461
10531C89810j8058j2098j1603j2309j0349q392j0615j4753r109j2054j1782o012
10519B52676l841m753r739p119k535m084j0731n934l940o631n809j497o326p432
10505A72305n299k40J085J070K236l179n136p460n683J379L010n585n787k57N706
10490A48165J448j193k976j588k216N15l979j807O84j885k765j080K499N658K489
10475A41969l204j851M11m95j34l458j659p11m197j767J832k354k694j757l078
10460A16853m278l781k33n123J921M534J194P819L049k291J014K611L517j186
10446A25620J26P014M616K985M261K483R526R749J3941K0092L0789L3286M3028
$$ plain form
10542 710349 660812 619053 580980 545486 517432 494807 469670 444405 423064 407271 389810
10531 389810 371752 359654 348051 335742 325393 317001 306386 291633 282524 270470 258688 252676
10519 252676 248835 244082 234343 227224 224689 220605 209874 203940 200000 193369 187560 186063 179737 172305
10505 172305 167006 166766 167851 168921 171157 167978 162842 155382 149699 151078 154088 148503 142716 142459 148165
10490 148165 149613 148420 145444 143856 141640 142155 138176 136369 137053 135168 132403 131323 133822 139480 141969
10475 141969 138765 136914 137325 136830 136696 133238 131579 130868 126671 124904 126736 124382 121688 119931 116853
10460 116853 112575 108794 108561 103438 105359 109893 111087 118906 121955 119664 120678 123289 126806 125620
10446 125620 125746 132760 137376 140361 144622 147105 156631 166380 180321 200413 231202 264488 307516
10433C07516O7089R9492J45001J85903K19208J94291J31199O2071l869q1217j65205
10422A161479k11118k01161j70094j32675r5874o9528m8552l3464k4683j7369
10412A56961j5568j4834q462m665j1729m574o655q700j631J189j181k248k125
10399G5778m820j396O43n964n633o33k226o922J602P929M503k775k139K215l046
10384E7116j604k824K772j628j086L255N037J640j906J212k019K885%K5J0L146
10368F6031P260L397j86k049O72J412j23k150l142p24J947J948j305l805q64L052
10352G1371K513l797o767m110j806J735M888K471n307o18K036r16P628l014K754
10337F9061O164J504L419m63k119M08R27k65l009l043K448J335k554p475M21q5
$$ plain form
10433 307516 374605 474097 619098 805001 1024209 1218500 1349699 1411770 1407901 1326684 1161479
10422 1161479 950361 749200 579106 446431 350557 281029 232477 199013 174330 156961
10412 156961 141393 126559 118097 113432 101703 97129 90474 81774 80143 81332 80151 77903 75778
10399 75778 70958 69562 70205 64241 58608 57975 55749 48827 50429 58358 62861 60086 57947 60162 57116
10384 57116 55512 52688 55460 53832 52746 56001 61038 62678 60772 61984 59965 62850 62850 62875 62885 66031
10368 66031 73291 76688 76502 74453 75125 76537 76414 74264 71122 70398 72345 74293 72988 69183 68319 71371
10352 71371 73884 70087 63320 59210 57404 59139 64027 66498 61191 60573 62609 61693 69321 66307 69061
10337 69061 75225 76729 80148 79685 77566 77974 78901 78636 75627 72584 75032 76367 73813 66338 66759 66674
10321F6674k306K776K004O473l69r49j47J991M036j701j477l064M83M769q68k116
10305G6209M78M49M277K315R665N067O409L204n301k711o49l50j814L88R147R177
10289A15960M270Q415P594J3966J9302K5217L1602K7681K2066J3130j155p241
10277B80807j7539l2142l3397k9733k2200j4759p875m058n779n893p505m981l693
10264I1253J275K282J616R57O552K940K287M51K699L394n015j963p8K165N863
10249A16678L873j469k041j702j684K127n13L95N309P25k457o56M524M656M915
10234A32680O956L871Q238Q19n610N353Q874P159Q818O709P131N498K420N128
10220B04044J324L913J356P343O016K559N80L698N666R023R913J3829J6612K2724
$$ plain form
10321 66674 64368 67144 69148 75621 75252 74303 74156 76147 80183 78482 77005 73941 74424 79193 78325 76209
10305 76209 76687 77136 81413 83728 93393 98460 104869 108073 102772 100061 99412 99062 97248 97636 106783 115960
10289 115960 120230 128645 136239 150205 169507 194724 226326 254007 276073 289203 288048 280807
10277 280807 263268 231126 197729 167996 145796 131037 123162 119104 113325 107432 99927 94946 91253
10264 91253 92528 94810 96426 97383 103935 106875 109162 109613 112312 115706 110691 108728 108650 110815 116678
10249 116678 120551 119082 117041 115339 113655 115782 115269 115664 120973 121698 119241 118585 123109 127765 132680
10234 132680 139636 143507 151745 152564 146954 152307 161181 168340 177158 183867 190998 196496 198916 204044
10220 204044 205368 209281 210637 217980 223996 226555 227135 230833 236499 245522 255435 269264 285876 308600
10206C08600L4437M1360N0308O2164P8597J11788J55133K24345L30477M60246
10196A857455N70648N26542K81829J2413m1146M9148L1446k16843m86305n62075
10186B023112m82409l66228k51565j70285j08982p0767m6424k5008j1635j2214
10176D77595j5966j6774j6533j4795p384P617J5022K2004K6883L6531L5508K5913
10164E75621P526r997k0883j1902M866K5493N0748Q3593J10534R9846O9497K4121
10152A009063k5696p5074r8820j10264q3588n5406l5398j3663N994J4174J4345
10141E45667N95j7266l3755l9193l1946j6800j0517m418M820N558L821j072j1157
10128C94337j1137j6088j1358o952m603j011J376Q846O070M858L561k96P99K627
$$ plain form
10206 308600 343037 384397 434705 496869 575466 687254 842387 1066732 1397209 1857455
10196 1857455 2428103 2954645 3236474 3248887 3207741 3256889 3288335 3071492 2585187 2023112
10186 2023112 1540703 1174475 922910 752625 643643 572876 526452 501444 489809 477595
10176 477595 461629 444855 428322 413527 406143 413760 428782 450786 477669 514200 549708 575621
10164 575621 583147 573150 552267 540365 545231 570724 621472 705065 815599 915445 984942 1009063
10152 1009063 983367 908293 809473 699209 615621 560215 524817 511154 517148 531322 545667
10141 545667 546262 528996 495241 456048 424102 407302 396785 392367 397187 402745 406566 405494 394337
10128 394337 383200 367112 355754 348802 344199 343188 344564 353410 359480 364338 367899 367603 368402 371029
10114C71029Q272J0318J1423P677J2212R190J0920P423J1978J4824K0014J5032
10102E10312J7383J6707J4307J4565J0864R664O499K347k659n001L028M529k810
10089E99735N683J5301K6188L2644L4122L3044L5258M0797N0994N3652M8472N2199
10077A028089N6220M8443M8745N2974N1665N0693N3661N8961O5788O8992P1080
10066A655311Q1312R1328J03540J10618J15604J18652J27472J46854J59207J71057
10056B880955J97237K26976K66211L16320L83552M76955N75705O55590O72025
10047F651526O64526O73411P19269P79237Q85806J080180J413731J848428K362928
10038A7079042K991002L836022N075016O990504R964650J4502796K1067611K9573427
$$ plain form
10114 371029 379301 389619 401042 408719 420931 430121 441041 448464 460442 475266 495280 510312
10102 510312 527695 544402 558709 573274 584138 593802 600301 602648 599989 594988 598016 602545 599735
10089 599735 605418 620719 646907 679551 713673 746717 781975 822772 873766 927418 975890 1028089
10077 1028089 1084309 1132752 1181497 1234471 1286136 1336829 1390490 1449451 1515239 1584231 1655311
10066 1655311 1736623 1827951 1931491 2042109 2157713 2276365 2403837 2550691 2709898 2880955
10056 2880955 3078192 3305168 3571379 3887699 4271251 4748206 5323911 5979501 6651526
10047 6651526 7316052 7989463 8708732 9487969 10373775 11453955 12867686 14716114 17079042
10038 17079042 20070044 23906066 28981082 35971586 45936236 60439032 81506643 111080070
10030A11080070L8088930M1292467L3679522J9705104O452411l922127j7036617
10023B29339760l1138458l9766765l7927939l0494847k2415194j5857782j1140901
10016D0597874p928094n802366m396412l458290k784084k244102j775011j370337
10008A0839178j028761p82577o56271n95747n69766n47129n65704n93848n82974
9999D916401n21786m49381l74853l15927k77002k39387k10927j81075j62608j44423
9989B039032j23828j02193r3912r5135q4365p5017p6811p7967o5311n8416n5609
9978A130468n2085m1486l8423l5389k8872k2658j4606j3735j8212j8127j3562
9967H33313j7114j4470j4803k5389k9084l0281l0939l4918l6371l7700k7893k6949
$$ plain form
10030 111080070 149169000 190461467 224140989 243846093 250298504 246376377 229339760
10023 229339760 198201302 158434537 120506598 90011751 67596557 51738775 40597874
10016 40597874 32669780 26867414 22471002 19012712 16228628 13984526 12209515 10839178
10008 10839178 9810417 9027840 8371569 7775822 7206056 6658927 6093223 5499375 4916401
9999 4916401 4394615 3945234 3570381 3254454 2977452 2738065 2527138 2346063 2183455 2039032
9989 2039032 1915204 1813011 1719099 1623964 1539599 1464582 1387771 1309804 1244493 1186077 1130468
9978 1130468 1078383 1036897 998474 963085 934213 911555 896949 883214 865002 846875 833313
9967 833313 816199 801729 786926 761537 732453 702172 671233 636315 599944 562244 534351 507402
9955E07402k6603k3582j4161j7414j1097n283p665n892j886m961o612n911p991
9942C68344q439r020o338n471q914j3144q163p133p630l276n575j291O92m025
9928B80617j562L360k030q961r478o660p617m813o482p779k461j982J540J2074
9914B37766L04q691n479n856j0860m375J58m676o141k508R506M641N68l945p92
9899A99620m657n730j1493j0642j1944j1772j1716j1171j789k489p013o819j698
9886A00687k649j508N771j407j808J138n13K404L356L174K988j472l588K041Q003
9871A16617J700o317k655l891K498k760m936p284o699p626p888m727k275j059
9857F2698j062n388q146q145r582m345N010j900J243M549Q240J3506J402J0k446
$$ plain form
9955 507402 480799 457217 443056 425642 414545 409262 401597 395705 393819 388858 382246 376335 368344
9942 368344 359905 350885 344547 339076 330162 317018 308855 301722 294092 290816 285241 283950 284642 280617
9928 280617 279055 282415 280385 271424 261946 255286 247669 242856 236374 228595 226134 224152 225692 237766
9914 237766 238070 229379 223900 218044 207184 202809 202967 198291 192150 189642 199148 203789 204357 200412 199620
9899 199620 194963 189233 177740 167098 155154 143382 131666 120495 118706 116217 109204 102385 100687
9886 100687 98038 96530 102301 100894 99086 100224 99711 102115 105471 108645 111633 110161 106573 108614 116617
9871 116617 118317 112000 109345 105454 107952 105192 100256 92972 86273 78647 70759 66032 63757 62698
9857 62698 61636 56248 48102 39957 30375 26030 31040 29140 30383 34932 43172 56678 58080 58090 55644
9842E5644q794q826o405j48K961l186o296j1093r893n11j762n982n223k03J158
9827h559L345P000R495K025K755K113J135l937p58L873O855K177M141L472n812
9812B9320j578k754Q05n044j080J838j198j385M61L377K541k409O81K779n01j307
9796B4546k944m310P65N297N842P054L327N667K269K303M179L151K153k528j140
9781E5631J144K841L217j684M5J192j656o627p197o742j0858q063m273j61l103
9766A3706j174j682m635l596K555Q99m577n175k967n5m94K903J459l805n5K798
9750c895L885J0007p68K60O34K3j240k092k312J627J089l00J402N710P701j224
9734B0507l369K488K140l026k55j296j691n06p491o437J507L473j288k673J017
$$ plain form
9842 55644 46850 38024 31619 31471 34432 31246 24950 13857 3964 3453 1691 -4291 -9514 -9717 -8559
9827 -8559 -5214 1786 11281 13306 16061 18174 19309 15372 14614 18487 25342 27519 31660 35132 29320
9812 29320 27742 24988 25793 20749 19669 21507 20309 18924 19385 22762 25303 22894 23575 26354 25853 24546
9796 24546 21602 17292 18057 23354 29196 36250 39577 45244 47513 49816 53995 57146 59299 56771 55631
9781 55631 56775 59616 62833 61149 61194 62386 60730 54103 46906 40164 29306 21243 16970 16809 13706
9766 13706 12532 10850 6215 2619 5174 6073 1496 -3679 -6646 -6701 -7195 -4292 -2833 -6638 -6693 -3895
9750 -3895 -10 9997 9229 9489 10123 10146 8906 6814 4502 6129 7218 6918 8320 14030 21731 20507
9734 20507 17138 19626 21766 18740 18485 17189 15498 14992 7501 1064 2571 6044 4756 2083 3100
9719C100K671J85m974P34M748J446m32L863M628K438J540n76l959k920m890j310
9703F292q95k060J963O075L252k063m69K157m64k500o36K650K075n940l731K398
9687H104J610n382K305L535N05J715R91P4p401k263J658J322k091M97L987j18
9671I048k437k128N139L343j860lR45N714j677l027n587j392K665L120j882l170
9655F811O99L167m264o19O88P324J460J0558J0118R964J1098N469l850n421j156
9640E2046l58K758M196R567Q037K873P349J7288J7878K4143L3279M5466O9208
9627B93730R7180J33953J85264K11036K05531J53157O9146l534o6576j41366k01573
9616I35948k12802j79521j42814r3797o7222m9721l3843k9097k3198j7071j8159
$$ plain form
9719 3100 5771 5956 982 1716 6464 7910 7478 11341 15969 18407 19947 19371 15412 12492 7602 6292
9703 6292 5397 3337 5300 11375 14627 12564 12095 14252 13788 11288 10652 13302 15377 9437 5706 8104
9687 8104 9714 4332 6637 10172 10677 12392 13383 13457 6056 3793 5451 6773 4682 5179 9166 9048
9671 9048 6611 4483 9622 12965 11105 11102 12047 17761 16084 13057 7470 6078 8743 11863 9981 6811
9655 6811 7510 10677 6413 5794 6482 13806 15266 25824 35942 45906 57004 62473 58623 53202 52046
9640 52046 51688 54446 58642 68209 76246 79119 86468 103756 121634 145777 179056 224522 293730
9627 293730 390910 524863 710127 921163 1126694 1279851 1348997 1345463 1278887 1137521 935948
9616 935948 723146 543625 400811 307014 239792 190071 156228 127131 103933 86862 68703
9605F8703j3966o180K32k467o407o94j157m427o1m705o126l643o970l611k95k504
9589E722L31J334p12n045m452j365K711n171r038j063N520M562J360L779M54k963
9573d036k69J449J673L5J024j672K306j550P38J376L245M216k390k990J782j637
9557C300m482K273L982k120M71J918j976l930M050J780k879O52k401k023k423
9542c808K594J547K118L399M15K036j835o7l213k354k604o826l20K528J948l004
9526g446K052L401Q19N35K726L909k534l812k716J960L414k149r303K467L585
9511c092k982n548j449M384L019M530J556j834l20k013k27J479Q1k002K697K598
9495H77J012l686l415L259j296P528Q15k357k062L408L900n942r71j826j360j530
$$ plain form
9605 68703 54737 48557 48789 46322 39915 39221 38064 33637 33576 28871 22745 19102 12132 8521 8226 5722
9589 5722 6053 7387 6675 1630 -2822 -4187 -1476 -6647 -15685 -16748 -11228 -6666 -5306 -1527 -1073 -4036
9573 -4036 -4305 -2856 -1183 -1148 -124 -1796 510 -1040 -302 1074 4319 8535 6145 3155 4937 3300
9557 3300 -1182 1091 5073 2953 3424 5342 3366 -564 3486 5266 2387 3039 638 -1385 -3808
9542 -3808 -1214 333 2451 5850 6265 8301 6466 6399 3186 832 -1772 -8598 -8918 -6390 -4442 -7446
9526 -7446 -5394 -1993 -1174 -639 2087 5996 3462 -350 -3066 -1106 2308 159 -9144 -6677 -3092
9511 -3092 -6074 -11622 -13071 -8687 -5668 -1138 418 -1416 -1736 -3749 -3976 -2497 -2416 -4418 -1721 877
9495 877 1889 -1797 -5212 -1953 -3249 4279 5094 2737 675 4083 7983 2041 1070 -756 -2116 -3646
9479c646M689o81j162j235l544l068j24r14L491M029r51j050J740L161L905n100
9463d60n25k182j465n79P766k175q727l095k357J395L844J042o12m4l275p76N751
9446f474j514n632J442L179M699J272n956R46M67K159j191n53R0k715O206K444
9430a131R98L215k635R3l888j2102l305K138L425P134L703K22k833r448J41R222
9414e051K381p320j903K430J334O88l728j808l41k920m09M87J940n35k622j182
9398a8559j286K120j80K899N767m44j464m981k812N132J031O638j098L518r85
9383d704l530j328K093j015J023j15K836J187L205m417k086j865k77J849l323
9368a0467L720l038m220N02j362m40j28K427J380K314J009L416j939J746J500
$$ plain form
9479 -3646 1043 362 -800 -2035 -5579 -8647 -8771 -9685 -6194 -2165 -3116 -4166 -2426 735 4640 -460
9463 -460 -985 -3167 -4632 -5211 2555 380 -8347 -11442 -13799 -12404 -8560 -7518 -8130 -8174 -11449 -12225 -6474
9446 -6474 -7988 -13620 -12178 -8999 -4300 -3028 -8984 -8038 -7571 -5412 -6603 -7156 -7066 -9781 -3575 -1131
9430 -1131 -133 3082 447 540 -3348 -15450 -18755 -16617 -13192 -6058 -2355 -2133 -4966 -14414 -14273 -5051
9414 -5051 -2670 -9990 -11893 -9463 -8129 -7441 -11169 -12977 -13318 -16238 -16647 -16160 -14220 -14755 -17377 -18559
9398 -18559 -19845 -17725 -17905 -15006 -9239 -9683 -11147 -16128 -18940 -13808 -12777 -6139 -7237 -3719 -4704
9383 -4704 -8234 -9562 -7469 -8484 -7461 -7576 -4740 -3553 -348 -4765 -6851 -8716 -8993 -7144 -10467
9368 -10467 -6747 -9785 -14005 -13503 -14865 -15305 -15433 -13006 -11626 -9312 -8303 -4887 -6826 -5080 -3580
9353c580r33K800O37k34j366J676J053k994j015K280l15m679k689j48K206J492
9337e809P259J439k292n144j282J548j502J306k089k289P553l82m147l565J819
9322g577j262l081L209K100j987k201L672l965k542K663J34j304R00j324N389
9307g176M429M660j578n442p77k751m481J363k060J050k242R97M669J774k7K394
9291e198j98J195j019J632j57M200k930o681K920K732m12K141N81k526k931j096
9275g747o565J783K955k482J204J550L725J35j283m886o396j577K383L017O876
9260g308L85o78R99M20m098J793Q018p01m240p17K213M047l874r53j371j052K49
9243f868M408J316l450j847n09k008n043J563l06k950K357O953J674n561l114
$$ plain form
9353 -3580 -4513 -1713 -1076 -1310 -2676 -1000 53 -2941 -3956 -1676 -1991 -6670 -9359 -9507 -7301 -5809
9337 -5809 1450 2889 597 -4547 -5829 -4281 -5783 -4477 -6566 -8855 -1302 -1684 -5831 -9396 -7577
9322 -7577 -8839 -11920 -8711 -6611 -8598 -10799 -7127 -11092 -13634 -10971 -10837 -12141 -11241 -12565 -7176
9307 -7176 -2747 1913 335 -5107 -5884 -8635 -13116 -11753 -13813 -12763 -15005 -14008 -9339 -7565 -7592 -5198
9291 -5198 -5396 -4201 -5220 -3588 -3745 455 -2475 -9156 -6236 -3504 -3916 -1775 -1194 -3720 -6651 -7747
9275 -7747 -14312 -12529 -9574 -12056 -10852 -9302 -5577 -5442 -6725 -11611 -18007 -19584 -17201 -14184 -7308
9260 -7308 -6923 -7601 -6602 -6182 -10280 -8487 -469 -1170 -5410 -6127 -3914 133 -3741 -4694 -6065 -7117 -6868
9243 -6868 -2460 -1144 -4594 -6441 -6950 -8958 -14001 -12438 -12744 -15694 -13337 -6384 -4710 -10271 -13385
9228a3385R55K894J047M4J467j100P84j754m891N221J059L674M270M60k301k733
9212d289J059J548l105l907q77j17j523K48p08k678J706M773L687k480p148J032
9196a2779M855L066K459J049j622J048j798k555k987k947J787J495Q1n11q39k278
9180a2476m37M892k70j455J335j387L744K360j32l891l897N48J593M88M446m520
9164i059o468q30K334N077Pk737n03M610K040k583K307n06P3J494n05j235k11
9147f695o78o609J738J0481J34l94M427r92q023j022J995L11j273J925M050m89
9131a114n235j426OQ08m833o4N32L60K182J163K80O06K479m473k333R45K184j384
9113i317L85j421K562M545J787J266m644l610l6j96j191K673k469l957L502J303
$$ plain form
9228 -13385 -12430 -9536 -8489 -8445 -6978 -8078 -7294 -9048 -13939 -8718 -7659 -3985 285 745 -1556 -4289
9212 -4289 -3230 -1682 -4787 -8694 -9571 -9688 -11211 -10963 -11671 -14349 -12643 -7870 -4183 -6663 -13811 -12779
9196 -12779 -7924 -4858 -2399 -1350 -2972 -1924 -3722 -6277 -9264 -12211 -10424 -8929 -8848 -9359 -10198 -12476
9180 -12476 -12913 -8021 -8291 -9746 -8411 -9798 -6054 -3694 -3826 -7717 -11614 -11066 -9473 -8985 -4539 -9059
9164 -9059 -15527 -16357 -14023 -8946 -8939 -11676 -12179 -7569 -5529 -8112 -5805 -6311 -6238 -4744 -5249 -6484 -6695
9147 -6695 -7373 -13982 -12244 -1763 -1629 -2023 2404 1412 -6611 -7633 -5638 -5327 -6600 -4675 -625 -1114
9131 -1114 -6349 -7775 -7769 -6961 -11794 -11858 -11326 -10966 -8784 -7621 -7341 -6735 -4256 -8729 -11062 -10117 -7933 -9317
9113 -9317 -8932 -10353 -7791 -3246 -1459 -193 -4837 -8447 -8483 -8679 -9870 -7197 -9666 -13623 -10121 -8818
9097h818P13l579k751l009N427O522J810j517J781m599m408j303L618L573L277
9082c263k382k062l929p28M135l279m978K073K444J370K736L823n530l202l111
9067a5883k416l425L569N397N39j729j158K125J01J28N242J406m72L70p01k904
9051i811j07k088j908J720J571K580k478j612K405O95j392J417j143O73o33K034
9035h077j095K283j426K130M77l475N93k194J516J361n619r83L959k21q12P92
9019a0791O83K988Q721J160N59m260k571k1J438L590R09k310km166N372L406l527
9002A178n563K75K454j968o341R53L34J876K235J394P84n212m50J570M299j462
8986c644o43r34j839L67j465k538j447K845N142K881J34l411l369J168N38q95
$$ plain form
9097 -8818 -8105 -11684 -14435 -17444 -12017 -5495 -3685 -5202 -3421 -8020 -12428 -13731 -10113 -6540 -3263
9082 -3263 -5645 -7707 -11636 -12364 -8229 -11508 -16486 -14413 -11969 -10599 -7863 -4040 -9570 -12772 -15883
9067 -15883 -18299 -21724 -18155 -12758 -12219 -13948 -15106 -12981 -12880 -12752 -7510 -6104 -6576 -6206 -6907 -9811
9051 -9811 -9918 -12006 -13914 -12194 -10623 -8043 -10521 -12133 -9728 -9033 -10425 -9008 -10151 -9478 -10111 -8077
9035 -8077 -9172 -6889 -8315 -6185 -5708 -9183 -8590 -10784 -9268 -7907 -13526 -14509 -10550 -10771 -11583 -10791
9019 -10791 -10108 -7120 1601 2761 3320 -940 -3511 -3532 -2094 1496 2405 95 93 -4073 1299 4705 1178
9002 1178 -4385 -4110 -1656 -3624 -9965 -9012 -8678 -6802 -4567 -3173 -2389 -7601 -8051 -6481 -2182 -3644
8986 -3644 -4287 -5221 -7060 -6693 -8158 -10696 -12143 -9298 -4156 -1275 -1141 -4552 -7921 -6753 -6215 -7110
8970g110j298j571J547N497O29m369j862K564r39j767n389K063L617J557k645
8955i476K357L446n55l206J944k04o446j057N363M564l929l138O17M315J205k442
8939f642O99K883j134O86N430m282l554K102O18K185l164J651n055m208M94j272
8923a2563R4J060j192K608M635J367l229m573K126Q21R1L260j02r06l256L313
8907f446J421j093k326k232j158J411j591k163j312M328K428j477J46O668M659
8892A263q54l47m67J68q81P30j163k998K66M053J428p730o88k704l056L741K831
8875f408M781L54K235J286J661j218P95l521l223l425k03l560l40L895j309n01
8859h701M529j903j73K529q52M1Q03j368r41O8K366l556k805j701M162O464K023
$$ plain form
8970 -7110 -8408 -9979 -8432 -2935 -2306 -6675 -8537 -5973 -6912 -8679 -14068 -12005 -8388 -6831 -9476
8955 -9476 -7119 -3673 -4228 -7434 -5490 -5694 -12140 -13197 -7834 -3270 -7199 -10337 -9720 -5405 -4200 -6642
8939 -6642 -5943 -3060 -4194 -3508 1922 -2360 -5914 -3812 -3194 -1009 -4173 -2522 -7577 -11785 -11291 -12563
8923 -12563 -12469 -11409 -12601 -9993 -5358 -3991 -7220 -11793 -9667 -8846 -8755 -5495 -5597 -6503 -9759 -6446
8907 -6446 -5025 -6118 -8444 -10676 -11834 -10423 -12014 -14177 -15489 -11161 -8733 -10210 -10064 -3396 1263
8892 1263 409 62 -405 -237 -1118 -388 -1551 -4549 -4283 -230 1198 -6532 -7220 -9924 -12980 -9239 -6408
8875 -6408 -1627 -1273 962 2248 3909 2691 3486 -35 -3258 -6683 -6886 -10446 -10786 -6891 -8200 -8701
8859 -8701 -4172 -6075 -6248 -3719 -4571 -4530 -3727 -5095 -6036 -5968 -3602 -7158 -9963 -11664 -7502 -1038 985
8842I85k145N60o7L39k000j720L1J393l704j353o289K404N434L055J585j524K254
8825g62J977k044j5m228q111n146O340M536N028m39M618k572k341P09K150l999
8809d299l253j566j342J419K820p20o97J124K035k71n051J332J49l14L21o18O305
8792b626p53l157k490L95J796K367l999J581M455M70m773M519J280M21l224k04
8776c942k339J206J542q43l71O75J591j366N277O307J576m105l70j678J651O4
8760D875n336m896n253K023Rq40N71J16K774L671j137l472L71J109J723j242k38
8743e172K659m39m615M412P169k268n804k03j534J247L74L217M337p85l814l161
8727d380k16M472r60l403j283J00J380P79j34q69k547l750q62j214l89J887K876
$$ plain form
8842 985 -1160 -600 -667 -328 -2328 -4048 -4017 -2624 -6328 -7681 -13970 -11566 -6132 -3077 -1492 -3016 -762
8825 -762 1215 -829 -844 -5072 -13183 -18329 -11989 -7453 -2425 -2864 1754 -818 -3159 -2450 -300 -4299
8809 -4299 -7552 -9118 -10460 -9041 -6221 -6941 -7638 -6514 -4479 -4750 -9801 -8469 -8320 -8634 -8313 -8931 -2626
8792 -2626 -3379 -6536 -9026 -8631 -6835 -4468 -8467 -6886 -2431 -1961 -6734 -2215 -935 -514 -3738 -3942
8776 -3942 -6281 -5075 -3533 -4376 -4747 -4072 -2481 -3847 1430 7737 9313 5208 4838 3160 4811 4875
8760 4875 -461 -5357 -10610 -8587 -8578 -9418 -8847 -8731 -5957 -2286 -3423 -6895 -6524 -5415 -3692 -4934 -5172
8743 -5172 -2513 -2952 -7567 -3155 4014 1746 -4058 -4261 -5795 -4548 -4174 -957 3380 2595 -1219 -4380
8727 -4380 -4596 -124 -1084 -4487 -5770 -5670 -4290 -3511 -3645 -4514 -7061 -10811 -11673 -12887 -13276 -11389 -8513
8710h513L946L128O205L333m983n120k497l293J323M930M897k462m360j260q10
8695e536k703j414M269m404j473J02K868N698L102J73L16K232k286k294J132N075
8679D857k69p12J878o139m969k5k62K982k136j750J492J121O42l015l350K632
8663g023J974o165j779L629J007M305Q88j062N075M93J087m20M081K741j176m227
8647C428m765r75J934j323L585j993l293M25j04m265M41L71k46l495p82J821L297
8630e939k747Q98L666L227p654m643K190N391K551J875k755J807O68O14K203N9
8614A411O17L782k41k004j832L69M514q1j731o714l410L474N097K059j961m262
8598i13J891L91N17r97l277J169L468q73N37J618q46M90j352l298j151j605K691
$$ plain form
8710 -8513 -4567 -1439 4766 8099 3116 -2004 -4501 -7794 -6471 -1541 3356 894 -3466 -4726 -5536
8695 -5536 -8239 -9653 -5384 -9788 -11261 -11159 -8291 -2593 509 682 998 3230 944 -1350 -218 4857
8679 4857 4588 3876 5754 -385 -5354 -5379 -5641 -2659 -4795 -6545 -5053 -3932 -3290 -6305 -9655 -7023
8663 -7023 -5049 -11214 -12993 -9364 -8357 -4052 -3164 -4226 849 1342 2429 2009 6090 8831 7655 3428
8647 3428 -1337 -2312 -378 -1701 1884 -109 -3402 -2977 -3081 -7346 -6905 -6534 -6780 -10275 -11057 -9236 -5939
8630 -5939 -8686 -7788 -4122 -895 -8549 -13192 -11002 -5611 -3060 -1185 -3940 -2133 -1465 -851 1352 1411
8614 1411 2028 5810 5569 3565 1733 2102 6616 6535 4804 -1910 -5320 -1846 3251 5310 3349 -913
8598 -913 978 1369 1886 889 -2388 -1219 2249 1376 1913 3531 2685 3175 1823 -1475 -2626 -4231 -1540
8581a540k725m586K287J462k823Q112J231k050q07m25P83k943p01J45j613M2l7
8564f188K369P85J543K337J982L605N475l293k373J119l107o250j970N258P306
8549H598M503L811J368p796o895j026r23l909p37j602L534P527P808k34r345k943
8533A739L881J916n124j357M292K985J488j627k308k236j273k381n647o4r25m095
8517a0736m177q65L505P441M054k77j022K333k51k156o478o39L131N81l103R43
8501g716N115K796k394k220J245J75j193l469j85L131M83m75O63J803L138K385
8485C282P33O45m352l935j680j306R3J355K61k093l853P60K025M677N70j071l86
8468d275l770k785n14M317J762J856N11l436l500J430J71l389J10L914J145J404
$$ plain form
8581 -1540 -4265 -8851 -6564 -5102 -7925 187 1418 -632 -1439 -1864 -1081 -4024 -4725 -4580 -6193 -6151 -6188
8564 -6188 -3819 -3034 -1491 846 2828 6433 11908 8615 6242 7361 4254 -1996 -3966 1292 8598
8549 8598 13101 16912 18280 10484 3589 2563 1640 -2269 -3006 -4608 -1074 6453 14261 14027 4682 1739
8533 1739 5620 7536 2412 1055 5347 8332 9820 8193 5885 3649 2376 -5 -5652 -5716 -6641 -10736
8517 -10736 -14913 -15778 -12273 -4832 -778 -1055 -2077 256 5 -2151 -8629 -9268 -6137 -5556 -8659 -7716
8501 -7716 -2601 195 -2199 -4419 -3174 -2999 -4192 -7661 -7846 -4715 -4232 -4707 -4044 -2241 897 3282
8485 3282 4015 4660 308 -3627 -5307 -6613 -6520 -5165 -4904 -6997 -10850 -10090 -8065 -3388 -2818 -3889 -4275
8468 -4275 -8045 -10830 -11344 -7027 -5265 -3409 -2898 -6334 -9834 -8404 -8233 -11622 -11512 -7598 -6453 -5049
8452e049L091J147L054J391M848M421o716k322L510L795j256K628K4l382J574
8437A0758K385K500j203j468k662J283j056k462m386k042Q81J118J91n8j088l592
8421i01k567K351j11R99n33n774m22K214L784j721O76k695P14L20j692J447J255
8404b656K293M585L01k654k446n537M63L163l806k415q62K397j694j023K216J509
8388f166K19K066P55n896M09j068K478o26j402J955k589k276k710m75L031L528
8372h767J020L39M655m104J028J600O554M041k421m674j802j686K04R458O651
8357A2096l364j77K106o466m502k494K812l913k990R89K151l324l63L315J858
8342b266K804J347Q62L098P774J1543N797o223k856j537p169k038k979k407r99
$$ plain form
8452 -5049 -1958 -811 2243 3634 8482 12903 6187 3865 7375 11170 9914 12542 12566 9184 10758
8437 10758 13143 15643 14440 12972 10310 11593 10537 8075 3689 1647 2528 3646 3837 3779 2691 -901
8421 -901 -3468 -1117 -1228 -229 -762 -6536 -6958 -4744 -960 -2681 -2005 -4700 -3986 -3666 -5358 -3911 -2656
8404 -2656 -363 4222 4523 1869 -577 -6114 -5651 -2488 -6294 -8709 -9571 -7174 -8868 -9891 -7675 -6166
8388 -6166 -5947 -3881 -3126 -9022 -8613 -9681 -7203 -7829 -9231 -7276 -9865 -12141 -14851 -15326 -12295 -8767
8372 -8767 -7747 -7408 -2753 -6857 -5829 -4229 2325 6366 3945 -729 -2531 -4217 -4013 5445 12096
8357 12096 8732 8555 10661 4195 -307 -2801 11 -3902 -6892 -5903 -3752 -7076 -7439 -4124 -2266
8342 -2266 538 1885 2747 5845 13619 25162 30959 24736 21880 20343 13174 11136 8157 5750 4751
8327D751J053k829k332k430K395M326N83J93k249n41K293L32j622l34L332O71
8311G592j609j50K317n83j814k983n736j188q30O50K801K342L806P361J158M34
8295A3568L106R643K1989K4094q038k3175j7591q386o419q857J838M03k995q86
8281a706j403O161J566k489Q54k970K424K00k393l103m204m712Q01r2j266R58
8265a1374N693N264j831R08n02J646K176N83m230l054K555N53K463L556N190K437
8249A2033O902J2638M98q447o938o610n152P5l729l359L05q82o37j214J683J964
8233h70J527J240m550r47M911j608m34K061K050k785K065L147j913l148q40j398
8217a492j667n67j518k358K913O33J979K274K05l686J921J091K002k894m310n12
$$ plain form
8327 4751 5804 2975 643 -1787 608 4934 5517 5710 3461 2920 5213 5545 3923 3589 6921 7592
8311 7592 5983 5833 8150 7567 5753 2770 -2966 -4154 -4984 -4334 -1533 809 4615 11976 13134 13568
8295 13568 16674 26317 48306 72400 64362 41187 23596 15210 8791 -66 1772 2175 -820 -1706
8281 -1706 -3109 3052 4618 2129 2983 13 2437 2637 244 -2859 -7063 -11775 -10974 -11066 -12332 -11374
8265 -11374 -5681 -417 -2248 -1340 -1842 -196 1980 2563 -1667 -4721 -2166 -1613 850 4406 9596 12033
8249 12033 18935 31573 32071 23624 16686 10076 4924 4999 1270 -2089 -1784 -2666 -3303 -4517 -2834 -870
8233 -870 657 1897 -2653 -3600 1311 -297 -731 1330 3380 595 2660 5807 3894 746 -94 -1492
8217 -1492 -3159 -3726 -5244 -7602 -4689 -4056 -2077 197 402 -3284 -1363 -272 1730 -1164 -5474 -5986
8201e986J777k279J40L10K810K524j481L775k13l092L98j971l222j929o62M800
8185d301Q91L408L01o219j091M887o73o164L470N895k55k344O06m401n272L055
8169h207K982L692N419K59J616k284m305j350Q45n35M847N68k7P359o61n624j638
8152B956k462j363q371l233N706O767K64l999L080p37r84k31K302n678m982L423
8136g542M608J962q86J98J557n395n218j970M61K182k026J050L509M123K805J465
8120H83k270j259J244J278j186n401k31j321M65Q986O41j903K088L299m073k706
8104a466l864J517L09J728J22O45k650l577o09J192J413J014K93J308j447l202
8088g274q55J207m79Q90K173K072N874k311n557k604L73K872q21J969K8K149J580
$$ plain form
8201 -5986 -4209 -6488 -6348 -6038 -3228 -704 -2185 1590 1377 -1715 -1317 -3288 -6510 -8439 -9101 -4301
8185 -4301 -3410 -2 299 -5920 -7011 -2124 -2797 -8961 -5491 404 149 -2195 -1589 -5990 -11262 -8207
8169 -8207 -5225 -1533 3886 4145 5761 3477 -828 -2178 -1333 -1868 2979 3547 3520 10879 10218 4594 2956
8152 2956 494 -869 -9240 -12473 -6767 0 264 -3735 -655 -1392 -2376 -2607 -305 -5983 -10965 -7542
8136 -7542 -2934 -972 -1858 -1660 -103 -5498 -10716 -12686 -12225 -10043 -12069 -11019 -7510 -3387 -582 883
8120 883 -1387 -2646 -1402 -124 -1310 -6711 -6942 -8263 -7798 1188 1829 -74 2014 5313 1240 -1466
8104 -1466 -5330 -3813 -3504 -1776 -1654 -1009 -3659 -7236 -7845 -6653 -5240 -4226 -3933 -2625 -4072 -7274
8088 -7274 -8129 -6922 -7401 -6511 -4338 -2266 3608 1297 -4260 -6864 -6491 -3619 -4440 -2471 -2443 -294 1286
8071A286l046p061k618J869N62j650r63Q014M133l887j77n46l72M962Q08r79m474
8054d139k288K900J06j10P99o90j534m871L839K144P66R65p65j5l60O898Q518
8037A2163n943n915p408j351K499K881J073k26j261K03J142J181K53j611O70M115
8021B465q1n521l241j144o29P255R5k025l241K44K665K048k514n692J308K746
8005e262j851K661O153L344M4l478j795J870l331l120J561J776j654j267J710
7990b639R73Q93l700k125j26k484J215O19L448J882l819k290J427P672O086j240
7974E792l458j854j664k817n536J004L343J526k798M342P154K191n537m060J486
7959h86L39l517l259K319Q211L23k541n517J531m67J2n45k458j934J862L082o71
$$ plain form
8071 1286 -1760 -8821 -11439 -9570 -9008 -10658 -11621 -3607 526 -3361 -3538 -4084 -4456 506 1314 335 -4139
8054 -4139 -6427 -3527 -3421 -3531 -2732 -3422 -4956 -9827 -5988 -3844 -3078 -2113 -2878 -2893 -3253 3645 12163
8037 12163 6220 305 -7103 -8454 -5955 -3074 -2001 -2227 -3488 -3285 -2143 -962 -709 -2320 -1650 2465
8021 2465 2384 -3137 -6378 -7522 -8151 -896 -801 -2826 -6067 -5823 -3158 -1110 -3624 -9316 -8008 -5262
8005 -5262 -7113 -4452 1701 5045 5089 1611 -184 1686 -1645 -4765 -3204 -1428 -3082 -4349 -2639
7990 -2639 -1666 -773 -4473 -6598 -6724 -9208 -7993 -7374 -3926 -2044 -5863 -8153 -6726 946 7032 5792
7974 5792 2334 480 -1184 -4001 -9537 -8533 -5190 -3664 -6462 -2120 5034 7225 1688 -2372 -886
7959 -886 -547 -4064 -7323 -5004 3207 3530 989 -4528 -2997 -3464 -3452 -3997 -6455 -8389 -6527 -3445 -4116
7942d116k536K631K869l038k209j062j557J584O073K211l854p794r80P760J022
7927b996K077J355j927K757J45R65l649k023O260P034L663o99Q9m076J363m961
7911E377k341l750J982J66m08m78m89m418N35K048r59j683K832J429n34j207r44
7894b842K670J059j642o612j452L273N314j371k879L05L987N77K49K078J866j200
7878C380o441o325j74N616J858J043j977o66J612j181l520K682N937n88J19J811
7862C186M158k695l902N7l82m333j415K309K355m199L8r45K544J91j560r72k060
7845g625J534N4j96L046J463K930l163k418J075O785k896M9l035R6M50n310Q01
7828f360O87L671k18L44m951m830K116K195n08k733L361M97O04K349M14j486k858
$$ plain form
7942 -4116 -6652 -4021 -1152 -4190 -6399 -7461 -9018 -7434 -1361 850 -3004 -10798 -11778 -4018 -2996
7927 -2996 -919 436 -1491 1266 1411 2376 -1273 -3296 2964 9998 13661 12962 13051 8975 10338 5377
7911 5377 3036 -714 1268 1434 1026 548 59 -4359 -3824 -1776 -2735 -4418 -1586 -157 -691 -1898 -2842
7894 -2842 -172 887 -755 -7367 -8819 -5546 -232 -1603 -4482 -4177 -190 387 636 2714 4580 3380
7878 3380 -3061 -9386 -9560 -3944 -2086 -1043 -3020 -3686 -2074 -3255 -6775 -4093 1844 1256 1375 3186
7862 3186 7344 4649 747 804 422 -3911 -5326 -3017 -662 -4861 -4823 -5768 -3224 -3033 -4593 -5565 -7625
7845 -7625 -6091 -6037 -6233 -3187 -1724 1206 -1957 -4375 -3300 3485 589 638 -2397 -2301 -1851 -7161 -6360
7828 -6360 -5673 -2002 -2220 -1876 -6827 -11657 -9541 -7346 -7854 -10587 -7226 -6729 -6125 -3776 -3362 -4848 -7706
7811g706k277L672L861J300K147l42k563qm574K25L527L074l79l32j612J76J758
7794e3m725q55M42k642K033K277k994Q87K100n73M488M450n778k724n944q23J765
7777h669j121j110L267J095P48L188M050l930j398J255L097k754l356L75J018
7762d245P542M01l713J217k728k737l745L004M146L896l932n733j660R26N540
7747a821K190l585K984k002l282j892j28K527k916O97r30L465Q99j401P245j59
7731A891k477l157l637O318K610m705K004m184l194n86P57R83K608Q56L164q21
7715a570O58L137j145J848K152K048k351J73L13l148m041l822N185L725k64M222
7699G120P99j427j707m26n141o53n09L616M39O7j313j294K952M872K625n37l599
$$ plain form
7811 -7706 -9983 -6311 -2450 -1150 997 655 -1908 -1916 -6490 -6265 -2738 336 -43 -375 -1987 -1811 -53
7794 -53 -4778 -5633 -5191 -7833 -5800 -3523 -6517 -5630 -3530 -4103 385 4835 -943 -3667 -9611 -10434 -8669
7777 -8669 -9790 -10900 -7633 -6538 -5790 -2602 1448 -2482 -3880 -2625 472 -2282 -5638 -5263 -4245
7762 -4245 3297 3698 -15 1202 -1526 -4263 -8008 -5004 -858 3038 -894 -6627 -8287 -7361 -1821
7747 -1821 369 -3216 -232 -2234 -5516 -7408 -7536 -5009 -7925 -7228 -8158 -4693 -3794 -5195 2050 1891
7731 1891 -586 -3743 -7380 -1062 1548 -3157 -1153 -5337 -8531 -9117 -8360 -7377 -4769 -3913 -749 -1570
7715 -1570 -912 2225 1080 2928 5080 7128 4777 4950 5263 2115 -1926 -5748 -563 3162 2898 7120
7699 7120 7919 6492 4785 4359 -782 -1435 -1944 1672 2111 2178 865 -429 2523 7395 10020 9483 5884
7682E884j515j709k537k965j172j001K943K579J178r07n753R78L180j746K292
7667b71R144K644j080l51K38n726o097l548J040J082m051l884j46J246j1N73M269
7650d929J767k189J531l455L096L070j53m011o31K206J116k446K036O048j231
7635A825k058m838o624k565K045L903Q030Q10l370J790q75n45j380k126m367L564
7619f781j021j033M413M285k674O22K098P58k14l847j043J312J970R41j037j347
7603b598j786J230J031N86m29J218J685J3p94N52n10n276n049k615N707L307k723
7586f451K052J058r9j980K669Q668J788K88m87r09l213n983p31k710J720j262
7570e582O556J397l900j889n45j519k562K69j672K635N962M466K191k637J603
$$ plain form
7682 5884 4369 2660 123 -2842 -4014 -5015 -2072 507 1685 778 -4975 -3997 -817 -2563 -271
7667 -271 8873 11517 10437 10086 10324 4598 -1499 -5047 -4007 -2925 -6976 -10860 -11006 -9760 -9771 -9198 -4929
7650 -4929 -3162 -5351 -3820 -7275 -4179 -1109 -1262 -5273 -5904 -3698 -2582 -5028 -2992 3056 1825
7635 1825 -233 -5071 -11695 -14260 -12215 -8312 -282 528 -2842 -1052 -1927 -2472 -3852 -5978 -10345 -6781
7619 -6781 -7802 -8835 -4422 -137 -2811 -2189 -91 667 453 -3394 -4437 -3125 -1155 -214 -1251 -2598
7603 -2598 -4384 -3154 -2123 -1537 -1966 -748 937 950 156 708 198 -5078 -10127 -12742 -7035 -3728 -6451
7586 -6451 -4399 -3341 -3440 -5420 -2751 5917 7705 7993 7506 6597 3384 -2599 -3330 -6040 -4320 -5582
7570 -5582 974 2371 -1529 -3418 -3963 -5482 -8044 -7775 -9447 -6812 -850 3616 5807 3170 4773
7555D773l217n795j049L058K624K746j695j275J243J600K753k864m085l587J319
7540c451k086j951K605N399m807l416K721M961l094j880n20J752m030j537K26
7525i108L730Q47K076l588n193K225L143K941L214K007m329l652J72M89l591P32
7509g885O096K782L980kl342J99n218q138k194M679O155K601L381L583J027k306
7493E398k691k592L128j83m599k988J634n443J533N272K033K373j087o644n599
7478a0455k466J087Q550M225J93p596k750L423L035P83k109K85M387q39o402k932
7462i581K303M802M000n254R84l010J849K031p21j657l397M373O660o17j425k252
7446i12J017J850j313n654k394N992J770L4Q91k60m222R10J496R06J595J433p20
$$ plain form
7555 4773 1556 -4239 -5288 -2230 394 3140 1445 170 1413 3013 5766 2902 -1183 -4770 -3451
7540 -3451 -5537 -7488 -4883 516 -4291 -7707 -4986 -25 -3119 -4999 -5519 -3767 -7797 -9334 -9108
7525 -9108 -5378 -4531 -2455 -6043 -11236 -9011 -5868 -2927 287 2294 -2035 -5687 -5515 -5026 -8617 -7885
7509 -7885 -1789 993 4973 4971 1629 1828 -3390 -11528 -13722 -9043 -2888 -287 3094 6677 7704 5398
7493 5398 2707 115 3243 3060 -1539 -4527 -2893 -8336 -6803 -1531 502 2875 1788 -4856 -10455
7478 -10455 -12921 -11834 -3284 941 1134 -6462 -9212 -5789 -2754 -1971 -4080 -3795 592 -247 -6649 -9581
7462 -9581 -7278 -2476 1524 -3730 -2746 -5756 -3907 -1876 -2597 -4254 -7651 -3278 3382 2765 1340 -912
7446 -912 105 1955 642 -5012 -7406 -1414 356 390 1281 1021 -3201 -2291 -795 111 1706 3139 2419
7429B419J898J820m512l311K075k888m201L899N730J918j457J764l0m304n166
7414d346p19N794L570l117n897K522J176K707k268l370L174L275O066k42m162
7399D163k483k280j250K642J462O22m570n564L36J492L208K614l192k330O83J890
7383b557m520Q3J168K873j5K786K519l424l782j894l134m18L224J972k038J006
7367f151p28l64M224J735P26J964k555j611L955N218k793m391l027j698j07J724
7351c879k566j677J824M296J556j795l483J739j185l167K656L02j091M00M396
7336a674K729j473K60q230n139j36M049N016K852k391j568n54j85N008J924R40
7320A428K055m294l552K886K248n232N79J967J866n51k857M13K796K025l373j699
$$ plain form
7429 2419 4317 6137 1625 -1686 389 -2499 -6700 -2801 2929 4847 3390 5154 5124 820 -4346
7414 -4346 -5065 729 4299 1182 -4715 -2193 -1017 1690 -578 -3948 -774 2501 8567 8325 4163
7399 4163 1680 -600 -1850 792 2254 2876 -1694 -7258 -6922 -5430 -2222 392 -2800 -5130 -4447 -2557
7383 -2557 -7077 -6994 -5826 -2953 -2968 -182 2337 -1087 -4869 -6763 -9897 -10315 -7091 -5119 -7157 -6151
7367 -6151 -6879 -7243 -3019 -1284 -558 1406 -1149 -2760 1195 6413 3620 -771 -3798 -5496 -5603 -3879
7351 -3879 -6445 -8122 -6298 -2002 -446 -2241 -5724 -3985 -5170 -8337 -5681 -5379 -6470 -6070 -1674
7336 -1674 1055 -418 -158 -8388 -13527 -13663 -9614 -4598 -1746 -4137 -5705 -6259 -6444 -1436 488 1428
7320 1428 3483 -811 -4363 -1477 771 -4461 -3882 -1915 -49 -600 -3457 -3044 -248 1777 -1596 -3295
7304c295L81j97k041r05J487p71K146j905n310m74J178j519j774K998M868L962
7288a171k066n303m013K355J494L329N505K758l977N33J615J52j046k654j56p84
7272c429k182j751K398j10J883l512m393Q81j85Q55N732N32L587J728l33l086
7256a385n36M01J645J651k879J038J82r77K661J718j372l431J362M34q91K043
7240A664K969k734n360l526k08K214j007k712K593n45K021J004L333J640O82j698
7224C30l723k9q2K44O50J272j699k21l581J118M705K756l106m291J524r34K744
7207b323p89q28J747l496R66J887o622j708M793K504K831J79r54k476l4J410p15
7190c628n001l898J058L033M364Q805j475o210l733m2L978J683l28j21m405j068
$$ plain form
7304 -3295 -2914 -3111 -5152 -6057 -4570 -5341 -3195 -5100 -10410 -10884 -9706 -11225 -12999 -10001 -5133 -1171
7288 -1171 -3237 -8540 -12553 -10198 -8704 -5375 130 2888 -1089 -556 1059 1211 165 -2489 -2645 -3429
7272 -3429 -5611 -7362 -4964 -5074 -3191 -6703 -11096 -10215 -10400 -9545 -3813 -3281 306 2034 1701 -1385
7256 -1385 -1921 -1520 125 1776 -1103 -65 117 -860 1801 3519 2147 -1284 78 512 -379 1664
7240 1664 4633 1899 -3461 -6987 -7195 -4981 -5988 -8700 -6107 -6652 -4631 -3627 -294 1346 2028 330
7224 330 -3393 -3422 -3504 -3260 -2610 -1338 -3037 -3258 -6839 -5721 -1016 1740 -1366 -5657 -4133 -5067 -2323
7207 -2323 -3112 -3940 -2193 -5689 -4723 -2836 -9458 -11166 -6373 -3869 -1038 -859 -1813 -4289 -4323 -2913 -3628
7190 -3628 -8629 -12527 -11469 -8436 -4072 4733 3258 -2952 -6685 -6727 -2749 -1066 -1394 -1515 -5920 -6988
7174f988N265L070j171l53K37k898K851q92j599n193M756K208O21R13P19P37J098
7157C381q43j829k383n218J130K95K344L03l542q18J934K800N209k294o001j047
7141f579K558K184N00o72K38J071K270J335J307j586r23K888o07k76L081j872
7125D917K971L509K332m308J330l931l78m200l003J692m185l814n93k93L068k62
7109e148j711j756K48L494M046j393J88L84J671J645k102n19J087n107k844j500
7093i317J442o4J036j320K755N320L81J225M074l330j0297j556M862J547k064
7078e306m789M12j295k894K402M136J850P13J297K687L29j978j069j612o751K271
7062i597K380K054M94k126L23l91K489J784L328J947j722q3m081q07j632O40K146
$$ plain form
7174 -6988 -1723 1347 176 -177 60 -2838 13 -879 -2478 -7671 -2915 -707 -86 827 1546 2283 3381
7157 3381 2538 709 -1674 -6892 -5762 -5467 -3123 -2820 -6362 -7180 -5246 -2446 2763 469 -5532 -6579
7141 -6579 -4021 -1837 -1337 -2009 -1771 -700 1570 2905 4212 2626 1703 4591 3984 3708 6789 4917
7125 4917 7888 11397 13729 9421 10751 6820 6442 2242 -761 931 -3254 -7068 -7661 -7954 -4886 -5148
7109 -5148 -6859 -8615 -8367 -4873 -827 -2220 -2032 -1648 23 1668 -434 -953 134 -4973 -7817 -9317
7093 -9317 -7875 -7939 -6903 -8223 -5468 -148 233 1458 5532 2202 -8095 -9651 -4789 -3242 -5306
7078 -5306 -10095 -9683 -10978 -13872 -11470 -7334 -5484 -4771 -3474 -787 -458 -2436 -3505 -5117 -11868 -9597
7062 -9597 -7217 -5163 -4669 -6795 -6472 -6863 -4374 -2590 738 2685 963 880 -3201 -4008 -5640 -5000 -2854
7045b854k43L582L158M98m056Q0o211R63K839k2O921K958n03m959j812Q55K148
7028C342O201l333p400J125p02k998L659N414O222J316m98k365r222o554l193
7013h986m99M844P822m33m209J506m53P06m266k317O14l532n19k329K658M182
6997e211l139L889O07j515K22N032L632N79n250j07M325L917j094l282l137J982
6981A450o7j286P07K238K996r43n218J77o14j183n178l794k581m94L583Q06j431
6964a0832M99P155J674K648n56M05J399r50K800J015n124n065m09M164k550m723
6948h450P57M654K011j221l403O00L566q88J842L842K189n304l417l376k145L143
6932e600J117m02L908j667j60J300k004m885K344M978j982R34j273l793M145K138
$$ plain form
7045 -2854 -3097 485 3643 4141 85 165 -6046 -5083 -2244 -2266 4655 7613 7110 2151 339 1194 3342
7028 3342 9543 6210 -1190 -65 -767 -3765 -106 5308 11530 12846 12348 9983 761 -5793 -8986
7013 -8986 -9485 -4641 3181 2748 -1461 45 -408 298 -3968 -6285 -5671 -9203 -9722 -12051 -9393 -5211
6997 -5211 -8350 -4461 -3854 -5369 -5147 -115 3517 4096 -1154 -1261 3064 6981 5887 2605 -532 1450
6981 1450 1383 97 804 3042 6038 5095 -123 54 -560 -1743 -6921 -10715 -13296 -13790 -10207 -9401 -10832
6964 -10832 -10333 -3178 -1504 1144 588 993 2392 1442 4242 5257 133 -4932 -5341 -1177 -3727 -8450
6948 -8450 -7693 -3039 -1028 -2249 -5652 -5052 -1486 -2374 -532 3310 5499 195 -3222 -6598 -8743 -5600
6932 -5600 -4483 -4885 -977 -2644 -2804 -1504 -3508 -8393 -6049 -1071 -3053 -2119 -3392 -7185 -3040 -902
6916i02k505J935k419q282M285O785N77K225k698K092k946k054J049K424k0p92
6900a246j360r88M73L504l116l953J674P920L196l105m741L587M178k699l935
6885f11R22n15L022K15N22l065r498o82K034J71j046j073J158P485M697p74j879
6868A083l674L269K072k162j471k212n50j064m47j72k603o99L338J00K213o91
6852c670j104j447R56J081k583j025M625K410j490M033K364j728J817j794o090
6837c645k533K707J265l3K502q14k3k353J140K660J167L774j069M87k531p164
6821d463o287N157M379K932N283M088m270m020j896j0569p59N085M052J06M806
6806C624n16J900m498m498j203J496O117n16k288k61J330k8m310k394m046R55
$$ plain form
6916 -902 -3407 -1472 -3891 -12173 -7888 -1103 -526 1699 -999 1093 -1853 -3907 -2858 -434 -454 -1246
6900 -1246 -2606 -3594 -3121 383 -2733 -6686 -5012 2908 6104 2999 -1742 1845 6023 3324 -611
6885 -611 311 -204 2818 3033 3555 490 -9008 -9690 -7656 -7485 -8531 -9604 -8446 -961 3736 2962 1083
6868 1083 -2591 678 2750 588 -883 -3095 -3645 -4709 -5156 -5328 -7931 -8630 -5292 -5192 -2979 -3670
6852 -3670 -4774 -6221 -5265 -4184 -6767 -7792 -3167 -757 -2247 1786 4150 2422 4239 2445 -3645
6837 -3645 -6178 -3471 -2206 -2239 263 -551 -574 -2927 -1787 873 2040 5814 4745 5232 2701 -4463
6821 -4463 -10750 -5593 -1214 1718 7001 11089 6819 2799 903 -9666 -10425 -5340 -1288 -1182 3624
6806 3624 3108 5008 510 -3988 -5191 -3695 2422 1906 -382 -643 687 659 -3651 -6045 -10091 -9136
6790i136O81K558J145M700j114l981QK805L627L460j255N16k718o29K551k582
6774F36q42k96M131K088k775l586K466p51j461q28P82o412j27R26k77K966K096
6757a264M14J937R67q18J21q02Q87j682l681L821K699j99l200m126M299M22J216
6740A011j237M45k139N15R65r50K675K229L50k58l792m321l514o83M256j171j957
6723g576M598J149Q6m220q57K592j50k008M523J643k454K625M2K461O741K098
6707A1293j934k586l508j726M063K531k63l809k798r53K81J286R07n943m748N648
6691b259K959m010k234N124J256k84n668n34p94k484J681N850j65q1l047k28K645
6674b273L088l852p692J880Q022N271l190l817j542M135K108J879k081n23j462
$$ plain form
6790 -9136 -8455 -5897 -4752 -52 -1166 -5147 -5139 -2334 1293 4753 3498 4014 1296 667 3218 636
6774 636 -206 -502 3629 5717 2942 -644 1822 1071 -390 -1218 -436 -6848 -6975 -6049 -6326 -3360 -1264
6757 -1264 -850 1087 2054 1236 1357 555 1442 -240 -3921 -100 2599 2400 -800 -4926 -627 -205 1011
6740 1011 -226 219 -1920 -1405 -440 -1390 1285 3514 3864 3606 -186 -4507 -8021 -8704 -4448 -5619 -7576
6723 -7576 -2978 -1829 -1743 -5963 -6820 -4228 -4378 -6386 -1863 -220 -2674 -49 -7 2454 9195 11293
6707 11293 9359 6773 3265 1539 5602 8133 7870 4061 1263 310 591 1877 2784 -3159 -7907 -2259
6691 -2259 700 -3310 -5544 -420 836 552 -5116 -5650 -6444 -8928 -7247 -1397 -1562 -1643 -4690 -4918 -2273
6674 -2273 815 -3037 -10729 -8849 -827 4444 1254 -2563 -4105 30 2138 4017 1936 1413 -49
6659d9j249K133l490j935K482p10j455j147K013N591O81k730M013J037m06l10
6643D469n885j028l62l37K167O352M425l280k777j804j979m618j412j949o34L653
6627d999O903L916o175j046K053J594M7m60n857o181M90M262l509Q88N648k571
6611d997j071L141M12k426K414j54j08m800j188O492M149P07l541p24r36K013
6595f17L234p24r71r42J444l572L66J127o61K007K664O61L84J105m642j193r97
6578a327J039k24O17L039j530O97k95l348o354r48L028K211M452P29k297o966
6562g477j726M998L346M21k193k347k165M620N107l36j074K393r09m244KL977
6546B393K27j240n612l99L514Q02n91k232J242J762L193j4J208l495l145J434
$$ plain form
6659 -49 -1298 835 -2655 -4590 -2108 -2818 -4273 -5420 -3407 2184 2865 135 4148 5185 4779 4469
6643 4469 -1416 -2444 -2806 -3143 -976 5376 9801 6521 3744 1940 -39 -4657 -6069 -8018 -8652 -4999
6627 -4999 1904 5820 -355 -1401 652 2246 2293 1833 -4024 -10205 -9715 -5453 -8962 -8074 -2426 -4997
6611 -4997 -6068 -2927 -2515 -4941 -2527 -2681 -2789 -7589 -8777 -2285 1864 2571 -970 -1694 -2630 -617
6595 -617 2617 1893 922 -20 1424 -2148 -1782 -655 -1316 691 3355 4016 4400 5505 863 -330 -1327
6578 -1327 -288 -512 105 3144 1614 2311 2016 -1332 -7686 -8634 -5606 -3395 1057 1786 -511 -7477
6562 -7477 -9203 -4205 -859 -438 -2631 -4978 -7143 -2523 2584 2248 1174 3567 2658 -1586 -1584 2393
6546 2393 2620 1380 -4232 -4631 -1117 -315 -906 -3138 -1896 -134 3059 3045 4253 758 -2387 -953
6530i53n30q89O42O66K510J273K190k231k154j636k943k475P045K023l785N91
6514f56l524K799R6j271J798k256j20N38M481m570r294j313M847L738O82J008
6498c017k538J606R9n345J245R21M745J006k537M35J702J662K058m55k101k661
6482c175Q17l50k634m39K437N25m075J082m66M416L406l567n410L115M481j834
6466a671n184L73M91J199l618K477P723J617n375k814l005l9K915K437J534n12
6450a452M456R18k579L919K562j949m533O90K297j342k725r7k776l896k373K07
6434h673L692M559L028n27J65l262J992J202L032j391m578k041k559k98n75Q77
6418e357r41O55J483m098O02N314K318m115j465M526K071l503K482k273k539j660
$$ plain form
6530 -953 -1483 -2372 -1730 -1064 1446 2719 4909 2678 524 -1112 -4055 -6530 515 2538 -1247 -656
6514 -656 -4180 -1381 -1285 -2556 -758 -3014 -3134 -2596 1885 -2685 -11979 -13292 -8445 -4707 -4025 -3017
6498 -3017 -5555 -3949 -3850 -9195 -7950 -7029 -2284 -1278 -3815 -3380 -1678 -16 2042 1587 -514 -3175
6482 -3175 -2358 -2708 -5342 -5781 -3344 -2819 -6894 -5812 -6278 -1862 1544 -2023 -7433 -4318 163 -1671
6466 -1671 -6855 -6482 -5991 -4792 -8410 -5933 1790 3407 -1968 -4782 -7787 -7826 -4911 -2474 -940 -1452
6450 -1452 3004 3922 1343 5262 7824 5875 1342 2032 4329 2987 262 165 -2611 -6507 -8880 -8673
6434 -8673 -4981 -422 2606 2079 2244 -1018 974 2176 5208 3817 -761 -2802 -5361 -5659 -6234 -5357
6418 -5357 -6298 -5643 -4160 -8258 -7656 -2342 -24 -4139 -5604 -1078 993 -2510 -28 -2301 -4840 -6500
6402f500J042L024K789K203j025j123k583J427q9j898l517j627k65J590N209L155
6386A812J959N147Q23m111p227l524K108M708N680j52Q18j351n732p096p388j206
6370a4732L894k98K793K833L653j413j112O68N538J758n690n05k778R20K25N518
6354A272J33p612n15l30K014J948N901J772l083L48L375l340m718j09J010k694
6338d628J287J93K48J519m17l357l365M337L055k97M747L130k168k365j170j507
6322g58K741m01k95j824k232n95K525k321o123L186n35k876M346N221j5k669p17
6305c342j452M435j31k453K220N84K171K487k904l93N201o55l749n56L566l339
6289A690j080r15l707M62J916j385l351M802O62l425L72m944Q80L694j732K551
$$ plain form
6402 -6500 -5458 -2434 355 2558 1533 410 -2173 -746 -835 -2733 -6250 -7877 -8142 -6552 -1343 1812
6386 1812 3771 8918 9741 5630 -1597 -5121 -3013 1695 7375 7223 8041 6690 958 -6138 -13526 -14732
6370 -14732 -10838 -11136 -8343 -5510 -1857 -3270 -4382 -3714 1824 3582 -2108 -2613 -5391 -4471 -4246 1272
6354 1272 1405 -6207 -6722 -7052 -5038 -3090 2811 4583 1500 1848 5223 1883 -2835 -2944 -1934 -4628
6338 -4628 -3341 -3148 -2900 -1381 -1798 -5155 -8520 -4183 -1128 -1425 3322 6452 4284 1919 749 -758
6322 -758 1983 1582 1287 -537 -2769 -3364 -839 -3160 -9283 -6097 -6632 -9508 -5162 59 44 -2625 -3342
6305 -3342 -4794 -359 -490 -2943 -723 -139 2032 4519 1615 1222 6423 5768 2019 1463 5029 1690
6289 1690 610 -305 -4012 -3550 -1634 -3019 -6370 -1568 -906 -4331 -3959 -8903 -8023 -4329 -6061 -3510
6273c510N581k56o57p36n91j859L688m550k708o33o60l82M01j733Q54k098q90
6256a0739o06K245N31J967L547M284L471k194o965m865M235M023K626j34j683
6241b57l347J217J743J361j943J121m436J108j376k246j472L543M435L638m924
6226a835o150J510Q693J931M80k864k61j728L398O18o423l285k203j013N157M707
6210G32n246k367M23K192N038K00M23K153L690l938l893K027M007P09l886j747
6194E17J896l137k541k724m29J115K369n629J903Q946L760k408j142K23j994p85
6178f0k572M820P26j71K565J136P92m809n145J798j471k089L304p2p89O82j377
6161b732K133J097n118l385R41L159l065j939k027j54L12N79K891P72K191j337
$$ plain form
6273 -3510 2071 1815 1158 422 -169 -2028 1660 -2890 -5598 -6231 -6891 -7273 -6872 -8605 -7751 -9849 -10739
6256 -10739 -11345 -9100 -8569 -6602 -3055 1229 4700 2506 -4459 -9324 -5089 -1066 1560 1426 -257
6241 -257 -3604 -2387 -644 717 -1226 -105 -4541 -3433 -4809 -7055 -8527 -4984 -549 3089 -1835
6226 -1835 -7985 -6475 2218 4149 4629 1765 1504 -224 3174 3792 -2631 -5916 -8119 -9132 -3975 732
6210 732 -4514 -6881 -6458 -4266 772 972 1395 3548 7238 3300 -593 1434 5441 6150 2264 517
6194 517 2413 -724 -3265 -5989 -6418 -5303 -2934 -8563 -6660 2286 6046 3638 2496 2719 725 -60
6178 -60 -2632 2188 2914 2743 5308 6444 7236 2427 -2718 -920 -2391 -4480 -1176 -1248 -2037 -1355 -2732
6161 -2732 -599 498 -4620 -8005 -7064 -3905 -6970 -8909 -10936 -11090 -10778 -10199 -7308 -6536 -4345 -5682
6145e682K323J13l19j180j279j636L152R26m08n98k747L022n49n19M588J666k043
6128a170l459j117j862n4Q601M381j522m372K32k205j485L850k778K026M034K945
6112F045l43L536O27j182j478l252o11l030K053K503K951k022k7L405k764l576
6096B835j183Q37k151l268Q84N205J705K698r02k764j567m675j274q97N59L625
6080c33j998k023k883L020M109k084N68l49K255o62L12q54J610j019p633k74M476
6063c762J280M428J980K667j689p38n059j281OP41K259J45j366P17l848N39L419
6046D38j466K253K99O393M012p535l673J18J459j881k580L188J943k535M2n20
6030d5J780r97k624p55J261M337l282Np95j190K778j156J773M80Q64k249k806
$$ plain form
6145 -5682 -3359 -3246 -3565 -4745 -6024 -7660 -4508 -3582 -3990 -4588 -7335 -4313 -4862 -5381 -793 873 -1170
6128 -1170 -4629 -5746 -7608 -7662 939 5320 3798 -574 -342 -2547 -4032 -182 -2960 -934 3100 6045
6112 6045 5702 9238 9865 8683 7205 3953 3342 312 2365 4868 7819 5797 5770 9175 6411 2835
6096 2835 1652 2489 338 -2930 -2046 3159 4864 7562 6660 3896 2329 -2346 -3620 -4517 -3958 -333
6080 -333 -2331 -4354 -7237 -4217 -108 -2192 -1624 -1973 282 -380 -68 -922 688 -331 -7964 -8238 -3762
6063 -3762 -2482 1946 3926 6593 4904 4166 -893 -2174 -2168 -1427 832 977 -389 328 -3520 -2981 438
6046 438 -1028 1225 1524 7917 11929 4394 721 839 2298 417 -2163 1025 2968 433 475 -45
6030 -45 1735 738 -1886 -2641 -1380 2957 -325 -320 -1115 -2305 473 -683 1090 1570 2434 185 -2621
6013b621R55M08n9L122j848k201L229J28J176M330L1m178r247J536M138J039r79
5996a041l074O274j23l986j415J480j063J240M013J466l89O63l715k218p992K821
5980g059M192R14J106j601N405J688n361k156L05J838j467k100k049q62N032K274
5964I9o926L098N749j992n277j677L452P474K218j060o6J290k011j176K004m37
5948D762n306M58k357J604O0K596L258O67K00m371l837R47K338M385M443k446
5932G401l746K499O599j557k159L150K509n343l599k459k738k667O756j58j998
5917B490l43j534Q1j513k19k438m47l165qN477L110L35p92J599n63L79k931P08
5899B26k753k675Q94Q84K276K329J780j219j729M729k31J27J23j446j095l07k676
$$ plain form
6013 -2621 -1666 -1258 -1317 1805 -43 -2244 985 1113 2289 6619 6650 2472 -6775 -5239 -1101 -62 -1041
5996 -1041 -4115 2159 2036 -1950 -3365 -1885 -2948 -1708 2305 3771 3382 4045 330 -1888 -9880 -7059
5980 -7059 -2867 -1953 -847 -2448 2957 4645 -716 -2872 -2567 -729 -2196 -4296 -6345 -7207 -2175 99
5964 99 -6827 -3729 2020 28 -5249 -6926 -3474 4000 6218 5158 5092 6382 4371 3195 5199 4762
5948 4762 -544 -86 -2443 -839 -779 1817 5075 5742 5942 1571 -2266 -1319 1019 5404 9847 7401
5932 7401 3655 6154 12753 11196 9037 12187 14696 9353 5754 3295 557 -2110 4646 4488 2490
5917 2490 2147 613 694 -819 -1038 -3476 -3923 -7088 -7096 -1619 1491 1826 1034 2633 2070 2449 -482 226
5899 226 -2527 -5202 -4308 -3424 -1148 1181 2961 1742 13 4742 4511 4638 4761 3315 2220 1913 -763
5882g63n87m205j235O967K261J930l317m673J481K573J427K162j407m830j318
5867c534k400J6K875M337K980R5j026j40j382j757J385p40m228m975K345M513
5851a636O14Q02K236P64j202K214R9l060j198k185L20L714J943J28j423m839N23
5834b186K594O608j329n913k400j415J248J799J439m998k146O65L758K107m02
5819e71r3l113l369L711K751J86N06K853K524j307J96j977k639k468l456N54K221
5802c491n73K418J175K631J098n700k764J147k159J809J745K63q67K585N263k822
5786A758m91j895N686J555o569k098L650j926l457K495L122j461j058M171J414
5771D896l518J498K837j70k916k91K123J271m391k255J9P9K961o18J634K613K879
$$ plain form
5882 -763 -1350 -5555 -6790 177 2438 4368 1051 -3622 -2141 432 1859 4021 2614 -2216 -3534
5867 -3534 -5934 -5918 -3043 1294 4274 4369 3343 3203 1821 64 1449 709 -3519 -8494 -6149 -1636
5851 -1636 -1022 -220 2016 2780 1578 3792 3891 831 -367 -2552 -2232 1482 3425 3553 2130 -2709 -2186
5834 -2186 408 7016 5687 -226 -2626 -4041 -2793 -994 445 -4553 -6699 -6034 -2276 -169 -571
5819 -571 -664 -3777 -7146 -3435 -684 -498 8 2861 5385 4078 4274 2297 -342 -2810 -6266 -5712 -3491
5802 -3491 -4064 -1646 -471 2160 3258 -2442 -5206 -4059 -6218 -4409 -2664 -2401 -3268 -683 4580 1758
5786 1758 1267 -628 5058 6613 44 -2054 1596 -330 -3787 -1292 1830 369 -689 3482 4896
5771 4896 1378 2876 5713 5543 2627 2336 4459 5730 1339 -916 -897 -818 2143 1525 3159 5772 8651
5754H651J364l843n918J583p64p89j63k619j351L370j514m139L281M693j077L360
5738D125O319k509k684l282k442J468j890p692p61R055J430j585k19R61P97J202
5722B293K435J096o10M88l405o072J826K369K129j629l27m97k573L278L170J893
5706E864k290k905p09J156L168p72j640l458j013m380K519M917J249k54j238P49
5690I63K602L74j460K840Oj293n235j939L543L092K382p735l782M664K781k376
5674e73j734j065J423J880k990k311Q14K505K559L58k502m97p74N450J264j456
5658B351J720J339l18K892J88Q32L27m034l054L353P08j716n943k782M359P551
5642G773m782j266J450J342n206l828n2r94J56K902O455j969m299P24K224p691
$$ plain form
5754 8651 10015 6172 254 1837 1073 284 121 -2498 -3849 -479 -1993 -6132 -2851 1842 765 4125
5738 4125 10444 7935 5251 1969 -473 995 -895 -8587 -9348 -293 1137 -448 -667 294 1091 2293
5722 2293 4728 5824 5214 5702 2297 -3775 -1949 420 2549 920 593 96 -2477 801 3971 5864
5706 5864 3574 669 -40 1116 4284 3512 1872 -1586 -2599 -6979 -4460 457 1706 1452 214 963
5690 963 3565 3939 2479 5319 5325 4032 -1203 -3142 401 3493 5875 -1860 -5642 -978 1803 -573
5674 -573 -2307 -3372 -1949 -69 -3059 -5370 -4556 -2051 508 866 -1636 -2133 -2907 2543 3807 2351
5658 2351 4071 5410 5092 7984 8172 9004 9331 5297 2243 5596 6304 4588 -1355 -4137 222 7773
5642 7773 2991 1725 3175 4517 -689 -4517 -4569 -5563 -5407 -2505 3950 1981 -2318 -1594 630 -7061
5626g061m753m55K408L747j221L761K352l067k164M900K395j109n90J531O972
5611G646K027o942j432L146k643j270p008J187K274j665L170L434J941K489k109
5596D245k022l609J029N341k05m869m384J834K240L390J048l425R27L443j12M047
5580H918n560p439m464L57L576R99P4l2K676r45j120J012K056O12j140R18L748
5563D246k154l481o58m436J062J100l905n40K839O068R99K023J101p711n82M254
5547B25j543K988M180l562n758J97L899L903L437n152j135k320j406L478L332
5532D763K953n326k480L235j174o51k236M918J460l81J082q32rn325L148L581
5516F726K427J201j979k492N99j129j909O42J367n009l912k347K299K17j151j63
$$ plain form
5626 -7061 -11814 -12269 -9861 -6114 -7335 -3574 -1222 -4289 -6453 -1553 842 -267 -857 674 7646
5611 7646 9673 2731 1299 4445 1802 532 -6476 -5289 -3015 -4680 -1510 1924 3865 6354 4245
5596 4245 2223 -1386 -357 4984 4779 -90 -4474 -2640 -400 2990 4038 613 1540 4983 4871 8918
5580 8918 3358 -4081 -8545 -8188 -4612 -3613 -3539 -3571 -895 -1840 -2960 -1948 108 720 -420 498 4246
5563 4246 2092 -1389 -2047 -6483 -5421 -4321 -8226 -8766 -5927 141 1140 3163 4264 -3447 -4029 225
5547 225 -1318 1670 5850 2288 -3470 -3273 626 4529 7966 2814 1679 -641 -2047 1431 4763
5532 4763 7716 2390 -90 3145 1971 1320 -916 4002 5462 5081 6163 5331 5322 -3 3145 6726
5516 6726 9153 10354 8375 5883 6482 5353 3444 4086 5453 444 -3468 -5815 -3516 -3299 -4450 -4613
5500d613N907O078j827k223k7M694J053k523O67l309kJ162l605J579L89Q56K167
5483F423P18n534m116J44M125p92j749M65N175l835o617J944O100K18L27J390
5467D386p65n93N920K281q311l57k049j783J831N265N291N12m300k142O5K80j296
5450D235l257K096j907k927j33k6L048J362k54K620L26K891k614J131l924k386
5434B81j666K037K539M678J746O26j159k962k971j343P19jL633r12n592n61K474
5417A566k001j809K488O05N461K687L339j507K81m967l821L73k201m832k16M706
5401A52M360m011k792K91k075j793M51L80P20L090l71r98K184k595M019j55k395
5384a538N188J716m754o944k616N721O112k149j1870m795N672P948L875K389n135
$$ plain form
5500 -4613 1294 7372 5545 3322 3295 7989 9042 6519 7186 3877 3875 5037 1432 3011 3400 4256 6423
5483 6423 7141 1607 -2509 -2365 1760 968 -781 -316 4859 1024 -5593 -3649 2451 2669 2996 4386
5467 4386 3621 3028 8948 11229 2918 2561 512 -1271 560 5825 11116 11628 7328 5186 5251 5531 4235
5450 4235 978 3074 1167 -1760 -1893 -1919 1129 2491 2237 4857 5183 8074 5460 6591 2667 281
5434 281 -1385 652 3191 7869 9615 10241 9082 6120 3149 1806 2525 2524 6157 5245 -347 -908 1566
5417 1566 -435 -2244 244 849 6310 8997 12336 10829 11110 6143 2322 2695 494 -4338 -4554 152
5401 152 4512 501 -2291 -2000 -4075 -5868 -5417 -5037 -4317 -1227 -1598 -2596 -412 -3007 1012 857 -1538
5384 -1538 3650 5366 612 -6332 -8948 -3227 2885 736 -11134 -15929 -10257 -2309 1566 3955 -1180
5369a180q359j359L106P08K789K941J801L050r68m433k239K526N141K499K72j264
5353E031j818j672L242J627K82k800n320K847K749m350k292K515N5k194J907M925
5337D734Q76K35k622K525L649k367j254P57j305j407r60k503k180n78j963K712
5321a651P746L113m253p79n5o341j216J413k62P65q24P03J579l357n32M005r09
5304h55l949M104M082l962n396K53N85j324r16j149J80q66K814L443m30j207M487
5287a06l19J264L551K825o56J223J488j209p389k139q22m389j25j298L733Q68
5271c500O99M131R093J037o339m523O25q73L80o50j869l761N56M816O804K845
5255I471o906q506n01M530P185K433K982L13m614j671J198L816L977m790k593
$$ plain form
5369 -1180 -9539 -10898 -7792 -7084 -4295 -1354 447 3497 2529 -1904 -4143 -1617 3524 6023 6295 5031
5353 5031 3213 1541 4783 6410 6692 3892 -1428 1419 4168 -182 -2474 41 96 -2098 -191 4734
5337 4734 5610 5845 3223 5748 9397 7030 5776 6533 5228 3821 2861 358 -1822 -2400 -4363 -1651
5321 -1651 6095 9208 4955 4176 4121 -2220 -3436 -2023 -2285 -1520 -2344 -1641 -62 -3419 -3951 54 -855
5304 -855 -4804 -700 3382 -580 -5976 -5723 -5138 -6462 -7378 -8527 -8347 -9213 -6399 -2956 -3386 -4593 -106
5287 -106 -425 839 4390 7215 6559 7782 9270 8061 672 -1467 -2289 -6678 -6803 -8101 -4368 -3500
5271 -3500 -2801 1330 10423 11460 5121 598 1223 350 730 80 -1789 -5550 -4994 -178 6626 9471
5255 9471 2565 -5941 -6442 -1912 5273 7706 10688 11001 6387 4716 5914 9730 13707 8917 6324
5240F324M1J478k317L234k73k42j945q79J967J081k248L103k920j887M172j056
5224G633j88j678j322m752Q42L623o71j580K677j349M0o86l945k42j460q7p21
5207c866J919J280j511J53r66P90M027M526J40l277m439l391k344j504J955n66
5191g074Q86J770N241j250q70J069R07J704P66M3n50J679L987o63R83k47m211
5174D170o52Q95l149k365K968rl697K281N334j436J277m982p039O63J340N635
5158A234O209l162r08k099k499K458M358l320J43k768j975J516k8k355K905J44
5142a47l012l35J899J299J877m224J036r4Q23L670qr16L228K180k645k085K066
5125D612J097k642J691k199l895k089M841J475J228m001m561K426M304N648L488
$$ plain form
5240 6324 6365 7843 5526 8760 8487 8245 6300 5421 7388 8469 6221 9324 6404 4517 8689 7633
5224 7633 7445 5767 4445 -307 535 4158 3487 1907 4584 3235 3275 2589 -1356 -1598 -3058 -3145 -3866
5207 -3866 -1947 -667 -2178 -2025 -2991 -2201 1826 6352 6492 3215 -1224 -4615 -6959 -8463 -6508 -7074
5191 -7074 -6188 -4418 823 -427 -1297 -228 679 2383 3149 3192 2642 4321 8308 7645 8628 8381 4170
5174 4170 3518 4413 1264 -1101 1867 1858 -1839 442 5776 4340 5617 635 -6404 -5741 -4401 1234
5158 1234 7443 4281 3373 1274 -1225 1233 5591 2271 2414 -354 -2329 -813 -841 -3196 -291 -147
5142 -147 -3159 -3494 -1595 -296 1581 -2643 -1607 -1701 -878 2792 2784 1868 5096 7276 4631 2546 4612
5125 4612 5709 3067 4758 2559 -1336 -3425 1416 2891 4119 118 -4443 -2017 2287 7935 11423
5110A1423o7k470k546j515m596j440R37L124L99K012m59j241k89l026l879P984
5094D351M73J211L007k794m643N82j264m242J383L888J947j41l255j819K829K306
5078C819L581j410o971l816R89M110K084N45l81L717j103m877l811k988j402L268
5062d646M897n39M529k407k009M370J217n034k639o67k40K580L420K455l014O55
5046B928J428l88P83o75J948P2m698L12o553o199N90M827L333O306M042j237m19
5029F400o779n227N708k535L601Q971O92J461j290m540k000n84k925K20L697j008
5013C862k549L532p68j044n33l107J451L143p49L59J146j511j051M275J300J301
4997I057J499J540k521m547m397m137j98L771K801K934j370j496R71l573l632
$$ plain form
5110 11423 11356 8886 6340 4825 229 -1211 -274 2850 3249 5261 4802 3561 3272 246 -3633 4351
5094 4351 4824 6035 9042 6248 1605 2187 923 -3319 -1936 1952 3899 3758 503 -1316 1513 3819
5078 3819 7400 5990 -981 -4797 -3808 302 2386 2931 2550 6267 5164 287 -3524 -6512 -7914 -4646
5062 -4646 251 -288 4241 1834 -175 4195 5412 378 -2261 -2928 -3168 -588 2832 5287 2273 2928
5046 2928 4356 3968 4751 4076 6024 6096 1398 1710 -4843 -11042 -10452 -5625 -2292 4014 8056 6819 6400
5029 6400 -379 -5606 102 -2433 1168 10139 10831 12292 11002 6462 4462 3878 953 1173 4870 3862
5013 3862 1313 4845 4077 3033 2500 -607 844 3987 3238 3597 4743 3232 2181 6456 7756 9057
4997 9057 10556 12096 9575 5028 631 -3506 -3704 67 2868 5802 4432 2936 3907 334 -3298
4982c298j818K297K424K19k054j172K560J079N98L093j426K18J559N606q69m529
4966D487R1j512j583j778k702q0J941N388k72o350j865J595O48j782l229L874
4950c129L666L828j370m57k61k831K351M120L986m255l524j45l17n223Q58Q31
4934a872J131L091K092j484J694J332n75r66N469n258p173n62M268K253p429K18
4918c771R00J646o74L271R81J574K168j298l127K818j11l233n769p43L875L842
4902B349M52m285j266k764M577J003J275m84K42q03o376J530L430j49K584L242
4886D557P1M555J686o620j583L754l121K947J254j092j39k513k182j049l747J894
4870a328K957J134k10m972J362M334Q94l86J38m343j050j134m76m78j988L044
$$ plain form
4982 -3298 -5116 -2819 -395 -176 -2230 -3402 -842 237 835 3928 2502 2720 4279 9885 9016 4487
4966 4487 4578 3066 1483 -295 -2997 -3077 -1136 4252 3980 -2370 -4235 -2640 -1992 -3774 -7003 -3129
4950 -3129 537 4365 2995 2538 2277 -554 1797 5917 9903 5648 2124 1979 1662 -3561 -2703 -1872
4934 -1872 -741 2350 4442 2958 4652 5984 5409 4443 9912 4654 -2519 -3081 1187 3440 -3989 -3771
4918 -3771 -2871 -1225 -1899 1372 2353 3927 6095 4797 1670 4488 4377 1144 -4625 -5368 -1493 2349
4902 2349 2801 -1484 -2750 -5514 -937 66 1341 857 1099 296 -6080 -4550 -1120 -1269 1315 4557
4886 4557 4628 9183 10869 4249 2666 6420 3299 6246 7500 6408 6269 3756 1574 525 -3222 -1328
4870 -1328 1629 2763 2553 -2419 -1057 3277 4171 3785 3923 -420 -1470 -2604 -3080 -3558 -5546 -2502
4854b502Q073L89m489q10j366N35l121J842j966K686M504K02n254k356j409m340
4838i382o63P539N60J142J677O914L065k87r319o163j537j504O178j018J949J556
4822G07m82L96J955j790M65K582K582J235p51j468J34Q31M23j332m143m830L640
4805A54j339L61J636K974L213N73k289m471m874L790K896q04J322K350o40l523
4789A329k655n623L613N3L04j497j666K911K448k89R73n28K002K866K663L235
4773A0139l113n304j774k257k015K161O028L477L299K76k038m87k949l358K442
4758D527m61o354m51j395J013N589L846M73k813J316o546m67K271O12M643J331
4742G134k348k605P07R8j084J047j621J339P09J97m38l679J71k471j561J698K576
$$ plain form
4854 -2502 5571 5960 1471 661 -705 -170 -3291 -1449 -3415 -729 3775 3977 -1277 -3633 -5042 -9382
4838 -9382 -10045 -2506 -1946 -804 873 7787 10852 10565 1246 -4917 -6454 -7958 -1780 -2798 -849 707
4822 707 225 621 2576 786 1251 3833 6415 7650 6899 5431 5565 6396 6819 5487 1344 -3486 154
4805 154 -1185 -824 812 3786 6999 7572 5283 812 -4062 -272 2624 1820 3142 5492 4852 1329
4789 1329 -1326 -6949 -3336 -3283 -2979 -4476 -6142 -3231 -783 -1072 -99 -627 1375 4241 6904 10139
4773 10139 7026 1722 -52 -2309 -4324 -2163 3865 7342 10641 10917 8879 8392 5443 2085 4527
4758 4527 4066 -2288 -2739 -4134 -3121 2468 6314 6787 3974 5290 -1256 -1723 548 1160 5803 7134
4742 7134 4786 2181 2888 2986 1902 2949 1328 2667 3376 3573 3135 -544 -373 -2844 -4405 -2707 -131
4725a31N198K172k45j222M531M049o921p191J742J300J858K828k081k377l860
4710c50pJ76j900j82K699J999P94K467L119l866k186J173J270m996l786J483O375
4693D282L634Nn116k618L707L380r65l085L315k582k860J320O838K560l032j371
4677G412k715l47j39l618k042J170K314j712k656J255O91j098M97j966j236N91
4661c599L632M725K89o815p59P421L856k354l961K841J804J480k45p28l58m401
4645B828l381j704k458K512K404P06J962m754K819J5L034N07M022j248l773m138
4629f47n21K268K192lJ742J621k706m162J571K189m199l889N95J071L173N7K90
4612F42J176P82K3k709k282N480R66m86K72l328L25l920m666K652J793M920l39
$$ plain form
4725 -131 5067 7239 6994 5772 10303 14352 7431 240 1982 3282 5140 7968 5887 3510 -350
4710 -350 -357 -181 -2081 -2263 436 2435 3229 5696 8815 4949 2763 3936 5206 210 -3576 -2093 4282
4693 4282 7916 7921 2805 187 3894 7274 6309 3224 6539 3957 1097 2417 9255 11815 8783 7412
4677 7412 4697 4350 4211 593 -1449 -279 2035 323 -2333 -1078 -387 -1485 -988 -2954 -4190 -3599
4661 -3599 33 4758 5047 -1768 -2527 4894 8750 6396 2435 5276 7080 8560 8315 7587 7229 2828
4645 2828 -553 -2257 -4715 -2203 201 907 2869 -1885 934 949 3983 4490 8512 7264 3491 -647
4629 -647 -1168 1100 3292 3289 5031 6652 3946 -216 1355 3544 -655 -4544 -3949 -2878 295 352 642
4612 642 1818 2600 2623 -86 -2368 3112 4078 3592 3864 536 861 -3059 -7725 -5073 -3280 1640 1301
4595A301L83k95J336K862j611k176J422p60J109N1k72L08l683r04M00K535L382
4578E388l085m034k272M156P957J312k423J098p64J13n806j500n269J725K387
4563a017K142N197M574k178Q62M67o162p968l358K604L059r39l762L476O417J340
4547D754L58n80l803l792l334J5J988o1n20M087M206n243m86J370K400j910L844
4530C293J645n011l843J792K401l103j722J344L803M063N59j263j449j75j535
4515G99o804K15K941k24j04j401J462L577K078r33j843q29k481j388K357N585
4499C007j175p66J382j510k361K670N98J236j77j558m043j520j77N136L845j195
4483C392j2l392j944m48K953q90j979L286K865j718p74m715k825j981P19N84K558
$$ plain form
4595 1301 1684 1389 2725 5587 3976 1800 3222 2462 3571 3622 3350 3658 -25 -929 -529 2006 5388
4578 5388 2303 -1731 -4003 153 8110 9422 6999 8097 7333 7446 1640 140 -5129 -3404 -1017
4563 -1017 1125 6322 10896 8718 9580 10047 3885 -4083 -7441 -4837 -1778 -2717 -6479 -3003 3414 4754
4547 4754 5112 4532 729 -3063 -6397 -6382 -4394 -4455 -4975 -888 3318 -1925 -2411 -1041 1359 -551 3293
4530 3293 4938 -73 -3916 -2124 277 -2826 -4548 -3204 599 4662 5221 3958 2509 2334 799
4515 799 -6005 -5790 -2849 -3073 -3177 -4578 -3116 461 2539 1606 -237 -1066 -3547 -4935 -2578 3007
4499 3007 1832 1066 2448 938 -1423 1247 1845 3081 2904 1346 -2697 -4217 -4394 742 4587 3392
4483 3392 3380 -12 -1956 -2404 549 -341 -2320 966 3831 2113 1339 -3376 -6201 -8182 -7463 -6879 -4321
4466d321J552N160M23l88N098L022k41n399n90L76J448K182o08l117j00N509K652
4449A2658l95o365k508k010n85M881L326J28k000l266K48o95k980J641M397q4
4433F391k237ql555j51M82k242m43J728n756l602M896M660k156P3l4j134j206
4416d294J1K220r72L32L513M928Q88o519Q38l418m213K592J462O57J55k755J483
4399c092K745K269K25k642j62k916J256r94j648K939O565j530k399j183J551P523
4383H507L636r22l405j681l792l869j645J190q04K391M860j386l454K70m16o173
4367f693l442M406M193K887L576m760n744J910J104l75q42k174K308K249J010
4352c87O33K436o20J919j387l722j5K623K561L5n45K168J32l62L251j809N42l375
$$ plain form
4466 -4321 -2769 2391 2814 2426 7524 10546 10305 4906 4316 4692 6140 8322 7714 4597 4497 10006 12658
4449 12658 12263 5898 3390 1380 795 5676 9002 9130 7130 3864 4112 3417 437 2078 6475 6391
4433 6391 4154 4146 591 440 922 -1320 -1763 -35 -5791 -9393 -4497 163 -1993 -1920 -1954 -3088 -4294
4416 -4294 -4283 -2063 -3035 -2703 810 5738 6626 107 945 -2473 -6686 -4094 -2632 -1975 -1820 -4575 -3092
4399 -3092 -347 1922 2147 -495 -657 -3573 -2317 -3311 -4959 -2020 4545 3015 616 -567 984 8507
4383 8507 12143 11221 7816 6135 2343 -1526 -3171 -1981 -2785 -394 4466 3080 -374 -104 -520 -6693
4367 -6693 -10135 -5729 -1536 1351 4927 167 -5577 -3667 -2563 -2938 -3780 -5954 -3646 -1397 -387
4352 -387 246 2682 2062 3981 2594 -1128 -1143 1480 4041 4076 3531 5699 5831 5469 8720 6911 7453 4078
4334D078j308j329J057J104l734L78K956O44o528j871P785M386j480p047L335
4319B426K322L310q15q152o648M634L142J260K566M311j990N70j155q49m249L719
4303D402L588q229m095K505Q21N64J642M203K14M055r69K843K552j880n377m866
4287A973j798Q9K394O43j72j169O202L170p8l98j130o986n680j232Q03L501K354
4270B486Q69q16o04n691j688Q26J899M196K167j625R96l261l357P584k7m1J874
4253E787J98k715q84l061l896m23M914N102L362M259K493k363m565N362m614n839
4237C117Q76K380Q74K42j982J239j987k842K822J74p057j799K79k627k38j468
4221g997j473K817P81m39L034m035j311j136k724K687N236J877L420J312m985
$$ plain form
4334 4078 2770 1441 2498 3602 -132 246 3202 3846 -2682 -4553 3232 7618 6138 -909 2426
4319 2426 4748 8058 7243 -909 -7557 -2923 219 1479 4045 8356 6366 6936 5781 4932 683 4402
4303 4402 7990 -239 -4334 -1829 -1008 -444 1198 5401 5615 9670 8701 11544 14096 12216 6839 1973
4287 1973 175 264 2658 3301 3129 1960 8162 11332 11254 10856 9726 2740 -2940 -4172 -3369 132 2486
4270 2486 3355 2539 1935 -3756 -5444 -4618 -2719 1477 3644 2019 3015 -246 -3603 3981 3954 3913 5787
4253 5787 5985 3270 2386 -675 -4571 -4994 -80 5022 8384 12643 15136 12773 8208 13570 8956 3117
4237 3117 3993 6373 7247 7489 5507 6746 4759 1917 4739 4913 -2144 -3943 -3664 -6291 -6529 -7997
4221 -7997 -9470 -6653 -5872 -6311 -3277 -7312 -8623 -9759 -12483 -9796 -4560 -2683 737 2049 -2936
4206b936j756L246P645K526l072N161O66L11J687m895n779J706R58p340L56J991
4190D75L52O636m67o540l766n87L362J891P39l88l05j900P16m176L103M128m00
4173B873K425n10R95N224p22j955M69m885j457m188l437J27L064j220M152L898
4157D853Q22L845l202k984J307O007q68o40M993N15n770m974Q41N247m491k788
4141B713k693N14M144n40l23k651k793k244J950j000K784l08N101P915j396M00
4125A1573o684m126r96J428O2r10j995J113j0l564l444N150J144O24K919J835
4109D119l849k432l399j661R0K530R74N205m476L20O228J709j573K080r08q343
4093c386n05O145N473j330j755J013l085l200L250j708j165L318J090k84Q36j991
$$ plain form
4206 -2936 -4692 -1446 6199 8725 5653 10814 11480 11791 13478 8583 2804 4510 5468 -1872 -1516 475
4190 475 827 7463 6996 456 -3310 -3897 -535 1356 2095 1707 1402 -498 218 -3958 -855 3273 2873
4173 2873 5298 4788 5783 11007 10285 8330 8799 3914 2457 -1731 -5168 -5041 -1977 -3197 955 4853
4157 4853 5675 9520 6318 3334 4641 10648 9780 9140 14133 14648 8878 3904 4745 9992 5501 2713
4141 2713 20 534 4678 4138 3815 1164 -1629 -3873 -1923 -2923 -139 -447 4654 12569 11173 11573
4125 11573 4889 763 -233 1195 1257 347 -1648 -535 -545 -4109 -7553 -2403 -1259 -635 2284 4119
4109 4119 270 -2162 -5561 -7222 -7132 -4602 -3628 1577 -2899 -2579 3649 5358 3785 5865 4957 -3386
4093 -3386 -3891 2254 7727 6397 4642 5655 2570 -630 2620 912 -253 3065 4155 3871 4707 2716
4077B716j494R07K42k694O982l77l836M047k211k254J087L624k794l619L387L960
4061G673J228k096k90j601k379m61L771J280k175k765J771N630L492j868k150
4046I060j080k948n615J051K148J358M55l028J365J865m289j419j574L322j410
4031g39J4J084K007j099n135k094K170O005K220J440J239m751OK111j900m342
4015a764m916m635K512J585j593P58L721K426K398o61q56K676N657N91q10j018
3999F071k123J218o16J514L17k074M212L893o823m927O256J632l47J16l119R60
3983F160J428j537l404k886L160J665r21m105m36L24K772k708n956p03P056N430
3967E339l831j548L072l436o701o917O88O492N702N878n561K097O764p524n675
$$ plain form
4077 2716 1222 2129 2371 -323 6659 6282 2446 6493 4282 2028 3115 6739 3945 326 3713 7673
4061 7673 8901 6805 6515 4914 2535 2074 5845 7125 4950 2185 3956 9586 13078 11210 9060
4046 9060 7980 5032 -583 468 2616 3974 4429 1401 2766 4631 342 -1077 -2651 671 -739
4031 -739 -725 359 2366 1267 -3868 -5962 -3792 2213 4433 5873 7112 2361 2367 4478 2578 -1764
4015 -1764 -6680 -11315 -8803 -7218 -8811 -8053 -4332 -1906 492 -169 -1025 1651 7308 7899 7089 6071
3999 6071 3948 5166 4550 6064 6381 4307 8519 12412 5589 662 6918 8550 8203 8319 5200 6160
3983 6160 7588 6051 2647 -239 2921 4586 3665 -440 -876 -552 2220 -488 -6444 -7147 -91 5339
3967 5339 1508 -40 3032 -404 -7105 -14022 -13334 -6842 -1140 4738 -823 1274 8038 514 -5161
3952e161K489K278j419J487L283J688k01l890k654j931j947l5J324J290J46Q16
3936b437k773r76k569K5M756j451j475J763L232J804Q22j184R32j959m638M862
3920a266K263J443J90j725L407K392j096J152Q14k143J04R08k886l1J182J730
3904F438k99k620m475k442j344M858M745j715l961k470J880k910J989j115R76
3889b465M423J751l01l831m756J55M061j304j984k60k123K299l54M048M315k194
3873A480N28L294j971l723l345J548M114K365m189J461J874o711K04R676Q26l005
3857D426j077Q99r93p18o23m96l494k435J185o6K70N105K156l573k455M037K44
3840B392k648o48l26q04L66p56k974N16N761K313j828M787j768n191Q91j267p76
$$ plain form
3952 -5161 -2672 -394 -1813 -326 2957 4645 4444 554 -2100 -4031 -5978 -6013 -4689 -3399 -3253 -2437
3936 -2437 -5210 -6186 -8755 -8730 -3974 -5425 -6900 -5137 -1905 -101 721 -463 469 -1490 -6128 -1266
3920 -1266 997 2440 2630 905 4312 6704 5608 6760 7574 5431 5535 6443 3557 3526 4708 6438
3904 6438 6139 3519 -956 -3398 -4742 116 4861 3146 -815 -3285 -1405 -4315 -2326 -3441 -2465
3889 -2465 1958 3709 3408 -423 -5179 -5024 -963 -2267 -4251 -4511 -6634 -4335 -4689 -641 3674 1480
3873 1480 2008 5302 3331 -392 -3737 -2189 1925 4290 101 1562 3436 -3275 -3071 6605 7431 4426
3857 4426 3349 4248 3255 2537 1914 1418 -2076 -4511 -3326 -3392 -3122 1983 4139 566 -1889 2148 2392
3840 2392 -256 -904 -1230 -2034 -1668 -2424 -5398 -4882 879 3192 1364 6151 4383 -808 83 -1184 -1960
3823a960K348j046m169J523K11N877J877l235l486n53K331K636L340J949J73k583
3807E233j07l733n525O82K448M161L277j787k796l89L812j383l065m118m721o7
3791h078Q205O908n759m599Q49J970J804N43K158j9J602l157p613o22N520Q392
3775H104K881l533K377k684n91k311m721k309K349J524j471l500M70K165J21p17
3759a846Q65M63j264O35O73N4k253L36J1n49J474K459K190l003j091r26l169O378
3741A437J11k797j003j012L842O87j15j17n02K398J78r26p28J489K942j744k144
3724A996l036p13J999O13j628M14k505k130M822M614k38m147m018O84K749j060
3708a584L80j790M427L091k681l719l674n159J267O421N559K626j567j033K539
$$ plain form
3823 -1960 388 -658 -4827 -3304 -3093 2784 4661 1426 -2060 -2613 -282 2354 5694 7643 7816 5233
3807 5233 5126 1393 -4132 -3450 -1002 3159 6436 4649 1853 1464 5276 3893 828 -3290 -8011 -8078
3791 -8078 127 7035 1276 -3323 -2474 -504 1300 1843 4001 3982 5584 2427 -5186 -5808 -288 8104
3775 8104 10985 7452 9829 7145 6554 4243 -478 -2787 -438 1086 -385 -3885 -3415 -1250 -1129 -1846
3759 -1846 -981 -518 -1782 -1147 -474 -420 -2673 -2337 -2326 -2875 -1401 1058 3248 245 -846 -1772 -4941 1437
3741 1437 1548 -1249 -2252 -3264 578 1265 1150 1033 531 2929 3107 2181 1453 2942 5884 4140 1996
3724 1996 -1040 -1753 246 859 -769 -355 -2860 -4990 -168 4446 4208 61 -3957 -3273 -524 -1584
3708 -1584 -1204 -2994 1433 4524 1843 -1876 -5550 -10709 -9442 -3021 2538 5164 3597 2564 5103
3693E103R74j329J668J088n37m3r35J345l386L75R06o48j864p99n47o074M29O63
3675c611o46k791L021K351j887k966m241J708O957N418j520L878K141j643j519
3660D650j597j93l48j087r49J730N734K86j000K232L69k894J509J6j883o19K045
3643H001k999m994m156N706J260k296j085P38K372p87j16L879M293J68l014k613
3627D357l132n500m96K535m382J68R862J400n97K650K476k645k669j580Nj160
3611A292m64O647L806o714m701j818j294L192K981j356o95j272l544P41l91M256
3595F66L696J83J811J942m542n245j304q79L534N159j455k869o2L282L806j525
3579F198j188l857R18m411L99K764N57J964q15J832J238J310l316n247o310J861
$$ plain form
3693 5103 6077 4748 6416 7504 6967 6924 5989 7334 3948 4323 5229 4581 2717 1918 1371 -4703 -4274 -3611
3675 -3611 -4257 -7048 -4027 -1676 -3563 -6529 -10770 -9062 -2105 3313 1793 5671 7812 6169 4650
3660 4650 3053 2860 2512 1425 476 2206 7940 8226 7226 9458 9827 6933 8442 8458 6575 5956 8001
3643 8001 5002 8 -4148 1558 2818 522 -563 175 2547 1760 1644 5523 9816 9984 6970 4357
3627 4357 1225 -4275 -4771 -2236 -6618 -6450 3412 4812 4215 6865 9341 6696 4027 2447 2452 1292
3611 1292 828 7475 11281 4567 -134 -1952 -3246 -54 2927 1571 876 -396 -3940 -3199 -3590 666
3595 666 4362 4545 6356 8298 3756 -1489 -2793 -3672 -138 5021 3566 697 635 3917 7723 6198
3579 6198 5010 1153 2071 -2340 -1941 823 1380 3344 2529 4361 5599 6909 3593 -1654 -7964 -6103
3563f103P320K166k546o86J467O6K894J662K173n805o028l083J670O351N81j6
3547B083K738P730m328n745k735q01l662K785K985k121l865n42M177N985j525
3532C159n783J918K222l772Q96j813K573M065P43J24j166j019n61n83m47q04L139
3515B891K277l142j293J866J0l396m293l322j46O153N11m20K752N89j876K57K030
3498A448k113j351L257P01m5m363P88j969L21l170j251P144N424q8j868J025K03
3481D093j402J763m795m279L057j666L375J037J334n9m420K22Q83N077k70m467
3465e17L8N725o20k420K024m977K690k127N99N898j106l473l861J855N30L103
3449C361o58J746K510K29R40j61j926N57m84j538j860J408q94j774p25N570M08
$$ plain form
3563 -6103 1217 3383 837 151 1618 1684 4578 6240 8413 2608 -3420 -6503 -4833 1518 2099 2083
3547 2083 4821 12551 8223 2478 -257 -1058 -4720 -1935 1050 -1071 -4936 -5478 -1301 4684 3159
3532 3159 -2624 -706 1516 -2256 -1360 -3173 -600 3465 4208 4332 3166 2147 1586 1003 556 -248 2891
3515 2891 5168 2026 733 2599 2609 -787 -5080 -8402 -8548 -2395 -1884 -2304 448 1037 -839 -582 1448
3498 1448 -665 -2016 1241 1942 1897 -2466 -1678 -3647 -3326 -6496 -7747 -603 4821 4733 2865 3890 4093
3481 4093 2691 4454 -341 -4620 -1563 -3229 146 1183 2517 2458 -1962 -1740 -857 4220 3950 -517
3465 -517 -479 5246 4626 2206 4230 -747 1943 -184 415 6313 5207 1734 -2127 -272 258 3361
3449 3361 2703 4449 6959 7188 8128 7967 6041 6598 6114 4576 2716 4124 3230 1456 731 6301 6709
3432F709r41N504J854l026l580j341l52j052J672k900m481o41l987k064L073K13
3416e340L886k236k235o2L876N731L057k163l779j106j225M99Q25J573N79J222
3400C102l226k128J934J230L415k46l390m831k432n53L03L703L56N393K780K285
3384G695O50q067n61L616L069K269K435k453l414L80k25K842j141k151j795P874
3368A1023j816l197J050j612L1k96O17j927l930l395n180m4k05L357L696r72j886
3351d686L453K587m919k792N419K594j127j087L834M019k338J148l811j076J062
3336B280j670J06j061r17O27j52O32M59j846P09L495K276n68n24k083L80l680
3319a537l578R32o71N89J272L787J73j125l632J73N171J365j190l017R94M650
$$ plain form
3432 6709 5768 11272 13126 10100 6520 5179 4827 3775 5447 2547 -1934 -2575 -6562 -8626 -5553 -5340
3416 -5340 -1454 -3690 -5925 -5987 -2111 3620 6677 4514 735 -371 -1596 -1097 -272 1301 1880 3102
3400 3102 -124 -2252 -318 912 4327 4081 691 -4140 -6572 -7125 -6822 -3119 -2763 2630 5410 7695
3384 7695 8345 278 -283 3333 6402 8671 11106 8653 5239 5619 5394 8236 7095 4944 3149 11023
3368 11023 9207 6010 7060 5448 5479 5183 5800 3873 -57 -3452 -8632 -8676 -8881 -5524 -1828 -2800 -4686
3351 -4686 -1233 1354 -3565 -6357 -938 1656 529 -558 3276 7295 4957 6105 2294 1218 2280
3336 2280 610 716 -345 -1262 -635 -787 -155 304 -1542 -833 2662 4938 4370 3846 1763 2143 -1537
3319 -1537 -5115 -4183 -4854 -4265 -2993 794 967 -158 -3790 -3617 1554 2919 1729 -1288 -294 4356
3303D356l233k871N200M75j453K34o677l78L794Q8j118k69j712r85L613J363k972
3286b545l127Q23j347k44L214J767k129q26J385J525R082j351l575n665k179p49
3270e941K837K620K299j005n35j16j896p17m82j118k718k949J374P607N38n71
3254g73q22J559M351L69j316J583p11M188l221n881o52q37K023j76m000p84J739
3237c361j393o39J644J331N983N476o54l729l281J167l622l473J372J910k958
3222d227m497K004K746L098j994K56k2j989n68J627K345O81j011K351N154J056
3206G010o72r09M99k090J372J893r54n68j728R85j781j040J514k174m30k515j463
3189c051J118j021j000j754N462O911m32l980M275K425k707p31n40l00l662J233
$$ plain form
3303 4356 1123 -1748 3452 3927 2474 2708 -3969 -4347 -553 -465 -1583 -1852 -3564 -4549 -936 427 -2545
3286 -2545 -5672 -4849 -6196 -6440 -3226 -1459 -3588 -4414 -3029 -1504 7578 6227 2652 -3013 -5192 -5941
3270 -5941 -3104 -484 1815 810 275 159 -1737 -2454 -2936 -4054 -6772 -9721 -8347 -740 -202 -773
3254 -773 -1595 -36 4315 4684 3368 4951 4240 8428 5207 -674 -1326 -2163 -140 -316 -4316 -5100 -3361
3237 -3361 -4754 -5393 -3749 -2418 3565 9041 8387 4658 1377 2544 -1078 -4551 -3179 -1269 -4227
3222 -4227 -8724 -6720 -3974 -876 -2870 -2614 -2636 -4625 -5193 -3566 -1221 -540 -1551 800 5954 7010
3206 7010 6338 5429 5928 3838 5210 7103 6149 5581 3853 4838 3057 2017 3531 1357 927 -1588 -3051
3189 -3051 -1933 -2954 -3954 -5708 -246 6665 6233 2253 6528 8953 6246 5515 4975 4675 1013 2246
3173B246N692M323k626k218k437l869k594j899K768K520K057J350L124j930M91
3158F998N21j305o2K56p39p42l040k235J078O3J180K647K7k737l02k084m251L637
3140a090K08j614l10j844K537O09l1K846j338j808j077L833K201J173o669K46
3124b128J014n672L119N213J711j542j662r82L492K804m217j381N371J737k839
3109D038n307k436J231j131J112J640m131Q74K748k020J609J703P63k221j8L402
3093A856M049J489j178m177n000j365N233K020J221Mj185l623l55j46N379L042
3077G264j195j907j868j629J696N119J111p26l33J258J311n922o221P172K356
3062G486k640n502k740L860j359k962j046n1j798L038k02M32N748k00j737L404
$$ plain form
3173 2246 7938 12261 9635 7417 4980 1111 -1483 -3382 -614 1906 3963 5313 8437 6507 6998
3158 6998 7519 6214 6152 6408 5669 4927 1887 -348 730 793 1973 4620 4647 1910 1608 -476 -4727 -1090
3140 -1090 -882 -2496 -2806 -4650 -2113 -1504 -1535 1311 -27 -1835 -2912 921 3122 4295 -2374 -2128
3124 -2128 -1114 -6786 -3667 1546 3257 1715 53 -929 2563 5367 1150 -231 5140 6877 4038
3109 4038 -1269 -3705 -2474 -3605 -2493 -853 -4984 -4110 -1362 -3382 -1773 -70 693 -1528 -1546 1856
3093 1856 5905 7394 6216 2039 -2961 -4326 907 2927 4148 4152 2967 -656 -1011 -1157 4222 7264
3077 7264 6069 4162 2294 665 2361 7480 8591 7865 7532 8790 10101 4179 -2042 5130 7486
3062 7486 4846 -656 -3396 464 -895 -3857 -4903 -4954 -6752 -3714 -3916 -3484 2264 2064 327 3731
3046C731J576j023L377J69k388k510R61K843J949m399k403k78M081m013R96M990
3030G659Q40n42l132l600j385J58L218r59k863O130J764l330l43k694l238k579
3014d896k819K503o4J577K024q30k653J005K579l7J838m93L155L284j286o15k3
2997D249k993j57L316N01n653J729N589K982l586q429n27M66k521K275J953J037
2981B31q39q2M626J207l086l907l54N986M699j207p20l371J992O18m343J685o08
2964B527n13r30j148j767j399M110O295O51k286j823O735j835m871K23l316j104
2948d51L793N255k377k947j649L00J448R87k629R26j299n405j987J323j321j173
2932g206K202J844l562k26M476K72j568P3P66J300P61J498k125l459j281J929
$$ plain form
3046 3731 5307 4284 7661 7830 5442 2932 3893 6736 8685 4286 1883 1605 5686 1673 2669 7659
3030 7659 8499 7957 4825 1225 -160 -2 3216 2257 -606 5524 7288 3958 3615 921 -2317 -4896
3014 -4896 -7715 -5212 -5276 -3699 -1675 -2505 -5158 -4153 -1574 -1611 227 -266 2889 6173 4887 4272 4249
2997 4249 1256 1099 4415 4916 -737 992 6581 9563 5977 -2452 -2979 -2513 -5034 -2759 -806 231
2981 231 -608 -690 3936 5143 2057 -1850 -2204 3782 8481 7274 6554 3183 5175 5793 1450 3135 2527
2964 2527 2014 1084 -64 -1831 -3230 880 7175 7826 5540 3717 10452 8617 3746 3969 653 -451
2948 -451 3342 8597 6220 3273 1624 1924 3372 4359 1730 2656 1357 -4048 -6035 -4712 -6033 -7206
2932 -7206 -5004 -3160 -6722 -6948 -2472 -2200 -3768 -3695 -2929 -1629 -868 630 -1495 -4954 -6235 -4306
2916d306O072M056o1L33j895p71J115j437J536j861p740q8M062K407K40o715l263
2899h316M522N024J967R3r17j168p06J362m99j398K931K497k026n731o3L266j2
2882H26K499M605L392j598k293q28j172l35j283k329k430K934N985L955m147j938
2866E843k860p83K590J548o05K413n630r537J588O293k541l874L947L967N9l637
2850a219m662M487O576L294J226J092l351n360j125R88K803J149k545j274p71
2835A308j503k111l123k26M911K125K679K534j737k656k317O040K58K72L48m988
2819A814o310K23m57k332N791j51J373r38m965k375O408N892j197j381j017J198
2803A576J950k115k460N51k04J576K559M713j140p546o148O967K939J414k262
$$ plain form
2916 -4306 1766 5822 5761 6094 4199 3428 4543 3106 4642 2781 -4959 -5047 -985 1422 1662 -5053 -8316
2899 -8316 -3794 1230 3197 3290 2373 1205 499 1861 1362 -36 2895 5392 3366 -2365 -2428 838 826
2882 826 3325 7930 11322 9724 7431 6603 5431 5096 3813 1484 -946 1988 7973 11928 7781 5843
2866 5843 2983 2200 4790 6338 5733 8146 2516 -7021 -5433 860 -1681 -5555 -1608 2359 2418 -1219
2850 -1219 -5881 -1394 5182 8476 9702 10794 7443 2083 958 1946 4749 5898 3353 2079 1308
2835 1308 -195 -2306 -5429 -5655 -744 1381 4060 6594 4857 2201 -116 5924 6182 6454 6802 1814
2819 1814 -4496 -4273 -4730 -7062 -1271 -1422 -49 -987 -5952 -8327 -1919 3973 2776 1395 378 1576
2803 1576 3526 1411 -1049 -498 -702 874 3433 8146 7006 -540 -6688 279 3218 4632 2370
2788B370k691K35k184j53J434r17N004J272j892l040R23m58q65l16J433l111n49
2771c505L625L994j865m27M23L1J727K252k021m780L380m445n568L47M031p52
2755c553M283j64o79km01l120O73r52J144L537r59O75m010K432j339N85M545M40
$$ plain form
2788 2370 -321 -86 -2270 -2423 -989 -1906 3098 4370 2478 -562 361 -97 -962 -1278 155 -2956 -3505
2771 -3505 120 4114 2249 1822 2245 2276 4003 6255 4234 -546 2834 -1611 -7179 -6832 -2801 -3553
2755 -3553 730 566 -113 -115 -516 -3636 -2963 -3915 -2771 766 -193 482 -3528 -1096 -2435 -1850 2695 3135
$$ [...]
##END NTUPLES=NMR SPECTRUM
##END=
