##TITLE=Analysis number 329224
Compound Code cc 13546
Book Reference 544/46/14
Project Code adrs
Chemist Name stuartg
##JCAMPDX= 6.0         $$ Bruker NMR JCAMP-DX V2.0
##DATA TYPE= NMR SPECTRUM
##DATA CLASS= NTUPLES
##ORIGIN= Bruker BioSpin GmbH
##OWNER= nmr
$$ XWIN-NMR		Version 3.5
$$ Mon Aug 13 11:42:30 2007 GMT Daylight Time (UT+1h)  MAYBRIDGE\nmr@NMR_250MHZ
##.OBSERVE FREQUENCY= 250.131544655141
##.OBSERVE NUCLEUS= ^1H
##.ACQUISITION MODE= SIMULTANEOUS (DQD)
##.ACQUISITION SCHEME= undefined
##.AVERAGES= 16
##.DIGITISER RES= 18
##SPECTROMETER/DATA SYSTEM= dpx250
##.PULSE SEQUENCE= zg30
##.SOLVENT NAME= CDCl3
##.SHIFT REFERENCE= (INTERNAL, CDCl3, 0, 16.522)
##AUDIT TRAIL= $$ (NUMBER, WHEN, WHO, WHERE, WHAT)
$$ ##TITLE= Audit trail, XWIN-NMR		Version 3.5
$$ ##JCAMPDX= 5.01
$$ ##ORIGIN= Bruker BioSpin GmbH
$$ ##OWNER= nmr
$$ C:\u/data/dgb/nmr/ADRS/510/pdata/1/auditp.txt
$$ ##AUDIT TRAIL=  $$ (NUMBER, WHEN, WHO, WHERE, WHAT)
(   1,<2007-08-13 11:42:02.29 +100>,<MAYBRIDGE\nmr>,<NMR_250MHZ>,
      <created by zg, POWCHK disabled, PULCHK disabled
       configuration hash MD5:
       76 6E 9A 78 1E 09 19 81 EC 84 63 8F B0 6A 59 2D
       data hash MD5: 64K
       9C A5 23 2F 35 B4 85 A1 10 22 34 AF B9 CA A5 E8>)
(   2,<2007-08-13 11:42:19.36 +100>,<MAYBRIDGE\nmr>,<NMR_250MHZ>,
      <Start of raw data processing
       ef LB = 0.3 FT_mod = 6 PKNL = 1 SI = 32K 
       data hash MD5: 32K
       A5 81 1D 53 95 42 DD E4 C0 B1 64 AA 36 8D 72 C3>)
(   3,<2007-08-13 11:42:21.26 +100>,<MAYBRIDGE\nmr>,<NMR_250MHZ>,
      <apk 
       data hash MD5: 32K
       93 7F 13 2D 77 50 F0 18 E6 FB F3 E9 B2 32 BB 7F>)
(   4,<2007-08-13 11:42:21.98 +100>,<MAYBRIDGE\nmr>,<NMR_250MHZ>,
      <abs ABSG = 5 
       data hash MD5: 32K
       5D D0 C0 F9 27 03 5E B1 5B 2D 7C A6 3C 80 F6 7F>)
$$ ##END=
$$ 
$$ hash MD5
$$ B9 3E B8 91 16 B7 FC 7D 37 EF 73 EA CD 7C 6C 4E
##$RELAX= 
##$RELAX= 
##$RELAX= 
##$RELAX= 
##$RELAX= 
##$RELAX= 
##$RELAX= 
$$ Bruker specific parameters
$$ --------------------------
##$DU= <C:\u>
##$EXPNO= 510
##$NAME= <ADRS>
##$PROCNO= 1
##$TYPE= <nmr>
##$USER= <dgb>
##$AMP= (0..31)
100 100 100 100 100 100 100 100 100 100 100 100 100 100 100 100 100 100 
100 100 100 100 100 100 100 100 100 100 100 100 100 100 
##$AQSEQ= 0
##$AQ_mod= 3
##$AUNM= <au_zg>
##$AUTOPOS= <17 >
##$BF1= 250.13
##$BF2= 250.13
##$BF3= 250.13
##$BF4= 250.13
##$BF5= 500.13
##$BF6= 500.13
##$BF7= 500.13
##$BF8= 500.13
##$BYTORDA= 1
##$CFDGTYP= 0
##$CFRGTYP= 5
##$CHEMSTR= <none>
##$CNST= (0..31)
1 1 145 1 1 1 1 1 1 1 1 1 1 1 1 1 1 1 1 1 1 1 1 1 1 1 1 1 1 1 1 1 
##$CPDPRG= <>
##$CPDPRG1= <>
##$CPDPRG2= <>
##$CPDPRG3= <>
##$CPDPRG4= <mlev>
##$CPDPRG5= <mlev>
##$CPDPRG6= <mlev>
##$CPDPRG7= <mlev>
##$CPDPRG8= <mlev>
##$CPDPRGB= <>
##$CPDPRGT= <>
##$D= (0..31)
0 1 0 0 0 0 0 0 0 0.06 0 0 0 0 0 0 0.0002 0 0 0 0 0 0 0 0 0 0 0 0 0 0 
0 
##$DATE= 1187001720
##$DBL= (0..7)
120 120 120 120 120 120 120 120 
##$DBP= (0..7)
150 150 150 150 150 150 150 150 
##$DBP07= 0
##$DBPNAM0= <>
##$DBPNAM1= <>
$$ [...]
##$SUBNAM6= <"">
##$SUBNAM7= <"">
##$SUBNAM8= <"">
##$SUBNAM9= <"">
##$SW= 20.6930455092707
##$SWIBOX= (0..15)
0 0 3 0 0 0 0 0 0 0 0 0 0 0 0 0 
##$SW_h= 5175.983436853
##$TD= 65536
##$TD0= 1
##$TE= 296.16
##$TE2= 300
##$TE3= 300
##$TEG= 300
##$TL= (0..7)
0 120 120 120 120 120 120 120 
##$TP= (0..7)
150 150 150 150 150 150 150 150 
##$TP07= 0
##$TPNAME0= <>
##$TPNAME1= <>
##$TPNAME2= <>
##$TPNAME3= <>
##$TPNAME4= <>
##$TPNAME5= <>
##$TPNAME6= <>
##$TPNAME7= <>
##$TPOAL= (0..7)
0.5 0.5 0.5 0.5 0.5 0.5 0.5 0.5 
##$TPOFFS= (0..7)
0 0 0 0 0 0 0 0 
##$TUNHIN= 0
##$TUNHOUT= 0
##$TUNXOUT= 0
##$USERA1= <user>
##$USERA2= <user>
##$USERA3= <user>
##$USERA4= <user>
##$USERA5= <user>
##$V9= 5
##$VALIST= <valist>
##$VCLIST= <CCCCCCCCCCCCCCC>
##$VD= 0
##$VDLIST= <DDDDDDDDDDDDDDD>
##$VPLIST= <PPPPPPPPPPPPPPP>
##$VTLIST= <TTTTTTTTTTTTTTT>
##$WBST= 1024
##$WBSW= 4
##$XGAIN= (0..3)
0 0 0 0 
##$XL= 0
##$YL= 0
##$YMAX_a= 353473
##$YMIN_a= -344417
##$ZGOPTNS= <>
##$ZL1= 120
##$ZL2= 120
##$ZL3= 120
##$ZL4= 120
##$ABSF1= 16.522
##$ABSF2= -4.171173
##$ABSG= 5
##$ABSL= 3
##$ALPHA= 0
##$AQORDER= 0
##$ASSFAC= 0
##$ASSFACI= 0
##$ASSFACX= 0
##$ASSWID= 0
##$AUNMP= <proc_1d>
##$AZFE= 0.1
##$AZFW= 0.1
##$BCFW= 0
##$BC_mod= 0
##$BYTORDP= 0
##$COROFFS= 0
##$CY= 12.5
##$DATMOD= 1
##$DC= 0
##$DFILT= <>
##$DTYPP= 0
##$F1P= 14.0000005364418
##$F2P= -0.99999901652339
##$FCOR= 0.5
##$FTSIZE= 32768
##$FT_mod= 6
##$GAMMA= 0
##$GB= 0
##$INTBC= 1
##$INTSCL= 1
##$ISEN= 128
##$LB= 0.3
##$LEV0= 0
##$LPBIN= 0
##$MAXI= 10000
##$MC2= 0
##$MEAN= 0
##$ME_mod= 0
##$MI= 0
##$NCOEF= 0
##$NC_proc= -3
##$NLEV= 6
##$NOISF1= 0
##$NOISF2= 0
##$NSP= 0
##$NTH_PI= 0
##$NZP= 0
##$OFFSET= 16.522
##$PC= 1
##$PHC0= -44.0937
##$PHC1= 4.51806
##$PH_mod= 1
##$PKNL= yes
##$PPARMOD= 0
##$PSCAL= 4
##$PSIGN= 0
##$REVERSE= no
##$SF= 250.13
##$SI= 32768
##$SIGF1= 0
##$SIGF2= 0
##$SINO= 400
##$SIOLD= 32768
##$SREGLST= <1H.CDCl3>
##$SSB= 0
##$STSI= 32768
##$STSR= 0
##$SW_p= 5175.98343685301
##$SYMM= 0
##$S_DEV= 0
##$TDeff= 65536
##$TDoff= 0
##$TI= <Analysis number 999999
Compound Code 99
Book Reference 9
Project Code 9>
##$TILT= no
##$TM1= 0
##$TM2= 0
##$TOPLEV= 0
##$USERP1= <user>
##$USERP2= <user>
##$USERP3= <user>
##$USERP4= <user>
##$USERP5= <user>
##$WDW= 1
##$XDIM= 32768
##$YMAX_p= 376339754
##$YMIN_p= -51278
$$ End of Bruker specific parameters
$$ ---------------------------------
##NTUPLES= NMR SPECTRUM
##VAR_NAME=  FREQUENCY,     SPECTRUM/REAL,   SPECTRUM/IMAG
##SYMBOL=    X,             R,               I
##VAR_TYPE=  INDEPENDENT,   DEPENDENT,       DEPENDENT
##VAR_FORM=  AFFN,          ASDF,            ASDF
##VAR_DIM=   32768,         32768,           32768
##UNITS=     HZ,            ARBITRARY UNITS, ARBITRARY UNITS
##FACTOR=    0.157963299565203, 1,           1
##FIRST=     4132.6476996994, 0,             0
##LAST=      -1043.33573715361, 0,           0
##MIN=       -1043.33573715361, -51278,      0
##MAX=       4132.6476996994, 376339754,     0
$$ Real data points
##PAGE= N=1
##DATA TABLE= (X++(R..R)), XYDATA
$$ [...]
16461A5110l254N232j1867n569k365J405n590N06j1460o890K774Q002r060q026
$$ 15110 11856 17088 5221 -348 -2713 -1308 -6898 -6392 -17852 -24742 -21968 -13966 -23026 -31052
16447c1052J1075P60k662P035J2088J689R299k145P927J1725J2793m709l751o498
$$ -31052 -19977 -19217 -21879 -14844 -2756 -1067 8232 6087 14014 25739 38532 33823 30072 23574
16433B3574j4638j0733L365J0627o259k3231j7285r816P328K5874O456O223M017
$$ 23574 8936 -1797 1568 12195 5936 -17295 -34580 -44396 -37068 -11194 -4738 1485 5502
16420E502o807l080j3507q028J508N786J2432j4076J65P959N579P238M504O975
$$ 5502 -1305 -4385 -17892 -25920 -24412 -18626 -6194 -20270 -20105 -12146 -6567 671 5175 12150
16406A2150o47n676N78o136k963l16R508R069N428l702q093L669m424j1274n957
$$ 12150 11503 5827 6405 269 -2694 -3010 6498 15567 20995 17293 9200 12869 8445 -2829 -8786
16391h786o303L634o11N564R749M937L692J940l503j4945P298O192N265r775k322
$$ -8786 -15089 -11455 -12066 -6502 3247 8184 11876 13816 10313 -4632 2666 8858 14123 4348 2026
16376B026L359j749k261j4320j0064N890J373N891L262k453j2308r864J310K614
$$ 2026 5385 3636 1375 -12945 -23009 -17119 -15746 -9855 -6593 -9046 -21354 -31218 -29908 -27294
16362b7294J2396J2900K995p648q011N420N517o373l711J3313n332o374J2208
$$ -27294 -14898 -1998 997 -6651 -14662 -9242 -3725 -10098 -13809 -496 -5828 -12202 6
16349FJ530j5115L052O879l653K416K273J017L089L09o412m311R491J3992j737
$$ 6 1536 -13579 -10527 -3648 -7301 -4885 -2612 -1595 1494 1803 -4609 -8920 571 14563 12826
16334A2826j04o943n911M129l488j0197O613N970j3887o005J2018R840k914M353
$$ 12826 12722 5779 -132 3997 509 -9688 -3075 2895 -10992 -16997 -4979 4861 1947 6300
16320F300j014k2035j7255J3027k5J2319K2767o732j1554k771P460j2171q065
$$ 6300 5286 -16749 -34004 -20977 -21002 -8683 14084 7352 -4202 -6973 487 -11684 -19749
16307a9749m048J833K567Q343M605O907R053j2496j5782Q584J1553m361P511j485
$$ -19749 -23797 -21964 -19397 -11054 -6449 458 9511 -2985 -18767 -10183 1370 -2991 4520 3035
16293C035m155j4447M012P579P598o53L320j2081L247M581O264o043j2916L372
$$ 3035 -1120 -15567 -11555 -3976 3622 2969 6289 -5792 -2545 2036 8300 2257 -10659 -7287
16279g287k21R453J0876l032j3833q958l50L403o089O594J1340n170j1798K039
$$ -7287 -7508 1945 12821 9789 -4044 -13002 -13352 -9949 -16038 -9444 1896 -3274 -15072 -13033
16265a3033J0756N461o839m506N977J6366J2059j5507j5174Q08M626m07q916r940
$$ -13033 -2277 3184 -3655 -8161 -2184 14182 26241 10734 -4440 -3632 994 587 -8329 -18269
16251a8269k392r083m428J8183J9883Q951k684j5704M141j033K6n914k55P479
$$ -18269 -20661 -29744 -34172 -15989 3894 12845 10161 -5543 -1402 -2435 -2409 -8323 -8578 -1099
16237a099r65r926m60K6273J3440j5589r939r303Q021O501Q200n530M842r997
$$ -1099 -2064 -11990 -12450 13823 27263 11674 1735 -7568 453 6954 15154 9624 14466 4469
16223D469o160q161o477L352P464K815K132m31J2048k512j4507p923j0963O882
$$ 4469 -1691 -9852 -16329 -12977 -5513 -2698 -566 -997 11051 8539 -5968 -13891 -24854 -17972
16209a7972J1510L770r719j0688M957j317K0964K2491m768k1679K998P601n566
$$ -17972 -6462 -2692 -12411 -23099 -18142 -19459 1505 23996 19228 -2451 547 8148 2582
16196B582j800j1940K244J211k62P500J3195r609l438j0098n361P997J0317J416
$$ 2582 782 -11158 -8914 -7703 -7965 -465 12730 3121 -317 -10415 -15776 -7779 2538 3954
16182C954p484m031P283J7761J779p101q057m552j709j1563l409J960M137M84
$$ 3954 -3530 -7561 -278 17483 19262 12161 4104 -448 -2157 -13720 -17129 -15169 -11032 -10548
16168a0548j0308P120K3291n366j8272P664J8062m184q195P718j1853j6478N539
$$ -10548 -20856 -13736 9555 4189 -14083 -6419 11643 7459 -736 6982 -4871 -21349 -15810
16155a5810O549M060L01j333R127K639o405j2832K807o937L676N783K618k674
$$ -15810 -9261 -5201 -4900 -6233 2894 5533 -872 -13704 -10897 -17834 -14158 -8375 -5757 -8431
16141h431R884j040K373m076o742o207J4018O434n927j234j4151o45L747J0844
$$ -8431 1453 413 2786 -1290 -8032 -14239 -221 6213 286 -948 -15099 -15744 -11997 -1153
16127a153k188n847n543n204j344J5654J0782m174L660n050l443l235o729j6955
$$ -1153 -3341 -9188 -14731 -19935 -21279 -5625 5157 983 4643 -407 -3850 -7085 -13814 -30769
16113c0769L692J6396o15p783j1531l125Q957O888N216o572q154k620J4940R2
$$ -30769 -27077 -10681 -11296 -19079 -30610 -33735 -24778 -17890 -12674 -19246 -27400 -30020 -15080 -14988
16099a4988M620j0181R663M18J865L203J0463k425J516Q497q973j1660j403P277
$$ -14988 -10368 -20549 -10886 -10468 -8603 -5400 5063 2638 4154 12651 3678 -7982 -9385 -2108
16085b108j1192n526Q071L599m394j8482r458N439J0381m034n81N346J3888J3498
$$ -2108 -13300 -18826 -10755 -7156 -11550 -30032 -39490 -34051 -23670 -27704 -28285 -22939 -9051 4447
16071D447L673o022k634J1407K997L371k558j0973J220k411M990l934j341l193
$$ 4447 8120 2098 -536 10871 13868 17239 14681 3708 4928 2517 7507 3573 2232 -961
16057i61O198k458o915o547K539M460n15n47J1332M268j1101J102j903L552J1927
$$ -961 5237 2779 -4136 -10683 -8144 -3684 -4199 -4746 6586 10854 -247 855 -1048 2504 14431
16042A4431n680n540N821j6224j3944J1754N356R968P363N627P499n936J362J7658
$$ 14431 8751 3211 9032 -7192 -21136 -9382 -4026 5942 13305 18932 26431 20495 21857 39515
16028C9515O387j842j8978j9398k1251o099J4580P155J7582L67K996j0990m4n177
$$ 39515 45902 44060 25082 5684 -15567 -21666 -7086 69 17651 18018 21014 10024 9980 4803
16014D803r930j3486j1015n866K167J752J3026R20M907N95k990j2783M715O106
$$ 4803 -5127 -18613 -29628 -35494 -33327 -31575 -18549 -17629 -12722 -12127 -15117 -27900 -23185 -17079
16000a7079J6210N77q474l488m762j969l066J2940J6109N403Q18j1536p001j1294
$$ -17079 -869 -292 -8766 -12254 -17016 -18985 -22051 -9111 6998 12401 13219 1683 -5318 -16612
15986a6612J8804N479l553k588M543Q81k687j4630n836K471q364q427R682J8681
$$ -16612 2192 7671 4118 1530 6073 6954 4267 -10363 -16199 -13728 -22092 -30519 -20837 -2156
15972b156Q460o498j0717L113M240J1905R943n113k3546j3120J911J6925P846
$$ -2156 6304 -194 -10911 -7798 -3558 8347 18290 13177 -10369 -23489 -21578 -4653 3193
15959C193K080o771R399k034m192j210k809j0721m030k119M07N303J3009R21o675
$$ 3193 5273 -1498 7901 5867 1675 465 -2344 -13065 -17095 -19214 -18807 -13504 -495 426 -6249
15944f249P090P282N266p557j5771o31J8995m27j7218M592J2423j2961M214q281
$$ -6249 841 8123 13389 5832 -9939 -10570 8425 7998 -9220 -4628 7795 -5166 -952 -9233
15930i233j6494n41j436N322P516K97O460O222M655l705M819l934K891J2892p231
$$ -9233 -25727 -26268 -27704 -22382 -14866 -14569 -8109 -1887 2768 -937 3882 -52 2839 15731 8500
15915H500m085n526j5229O044J3462q95n091n519M423M992n122M767K246J0600
$$ 8500 4415 -1111 -16340 -10296 3166 2271 -2820 -8339 -3916 1076 -4046 721 2967 13567
15901A3567J3788j0920j8941j2554L068L023q958J592J746o054N837J5709R504
$$ 13567 27355 16435 -2506 -15060 -11992 -8969 -17927 -16335 -14589 -20643 -14806 903 10407
15888A0407K968M087q435q744l979k236j407k588J1001P142o526p495N661m603
$$ 10407 13375 17462 9027 283 -3696 -5932 -7339 -9927 1074 8216 1690 -5805 -144 -4747
15874d747M047K820L614M067O602p009j8652j0379o520j309j628J123P683J0270
$$ -4747 -700 2120 5734 9801 16403 9394 -9258 -19637 -26157 -27466 -29094 -27971 -20288 -10018
15860a0018k043m448N315M035j9477j137K4997O542l753m160j814R481J0584n114
$$ -10018 -12061 -16509 -11194 -7159 -26636 -27773 -2776 3766 13 -4147 -5961 3520 14104 8990
15846H990o546p486K6n283P646J3521l438m468r309k11o51R000O550j326N673
$$ 8990 2444 -5042 -5016 -10299 -2653 10868 7430 2962 -6347 -6558 -7209 1791 8341 7015 12688
15831A2688j6393m641j605J0132K281P176R803q109q275P198O543j2452n420N076
$$ 12688 -3705 -8346 -9951 181 2462 9638 19441 11332 3057 10255 16798 4346 -1074 4002
15817D002P940j5335l91J3154j726R913k2j5413j0482j1276j1355l008K0249K2333
$$ 4002 11942 -3393 -3784 9370 7644 17557 17535 2122 -8360 -19636 -30991 -33999 -13750 8583
15803H583O964p250m662o386o598l913J06J546R454m098j4323m316Q309J5467
$$ 8583 15547 8297 3635 -2751 -9349 -13262 -13156 -11610 -2156 -6254 -20577 -24893 -16584 -1117
15789a117l086j4224K023J5875Q247j0311p120o549m604L795J8047P816j7865
$$ -1117 -4203 -18427 -16404 -529 7718 -2593 -9713 -16262 -20866 -17071 976 8792 -9073
15776i073p342R166O095K012m14j1138K862J8762J0628k942M065m353m739N52
$$ -9073 -16415 -7249 -1154 858 444 -10694 -7832 10930 21558 18616 22681 18328 13589 14141
15762A4141M956J1784j5807j3906j2436j5279l907Q142M307l149l629O622M118
$$ 14141 19097 30881 15074 1168 -11268 -26547 -30454 -22312 -18005 -21154 -24783 -18161 -14043
15749a4043l334k352j347l63L516N245N365N037r576r31o371M807P994P588J517
$$ -14043 -17377 -19729 -21076 -21439 -17923 -12678 -7313 -2276 -11852 -12783 -19154 -14347 -6353 1235 2752
15734B752m509j1645r600K742R782Q318J1154n084p436m381k213P071J781Q40
$$ 2752 -1757 -13402 -23002 -20260 -10478 -2160 8994 3910 -3526 -7907 -10120 -3049 -1268 -428
15720d28J655l700n170l83J94O722q212o310R755L199p41N408J480n281n8j0580
$$ -428 1227 -2473 -7643 -8026 -7832 -1110 -9322 -15632 -5877 -2678 -3419 1989 3469 -1812 -1870 -12450
15704a2450R079J8890J6965j5098J344J808M728j1574j6713j2059M778Q404m339
$$ -12450 -3371 15519 32484 17386 18730 20538 25266 13692 -3021 -15080 -10302 -1898 -6237
15691f237l980p597r799O996J7680J3096L129k350q817p394J5282J5238M58k695
$$ -6237 -10217 -17814 -27613 -20617 -2937 10159 13288 10938 2121 -5273 10009 25247 25705 23010
15677B3010j2912l032n809r765R779N160k928J0720J4819j4881M587o923j0520
$$ 23010 10098 7066 1257 -8508 1271 6431 3503 14223 29042 14161 18748 11825 1305
15664A305J1503j451j689J3843j5173k0688k085K221P26p807M247k040P836k412
$$ 1305 12808 11357 9668 23511 8338 -12350 -14435 -12214 -11488 -19295 -15048 -17088 -9252 -11664
15650a1664M325Q659O255O557M557k0421l132j163M021Q688J0786n653p054R335
$$ -11664 -7339 1320 7575 14132 18689 -1732 -4864 -6027 -2006 6682 17468 11815 4761 14096
15636A4096j0856M303N18j5356j364j536N633j652K894K060M078m998K86J0565
$$ 14096 3240 7543 8061 -7295 -8659 -10195 -4562 -6214 -3320 -1260 2818 -2180 -1894 8671
15622H671J520l499J651J656O293Q770j579m329l904p496O44K200r088M09j187
$$ 8671 10191 6692 8343 9999 16292 25062 23483 19154 15250 7754 8398 10598 1510 1919 732
15607G32k476j673m365R077k702J485J0394L172k1769n622L050Q724J3810n462
$$ 732 -1744 -3417 -7782 1295 -1407 78 10472 13644 -8125 -13747 -10697 -1973 11837 6375
15593F375q40l235r679Q638N358m772L540j831l71R1j499J758Q280L159O409j06
$$ 6375 5535 2300 -7379 1259 6617 1845 5385 3554 3183 3274 1775 3533 11813 14972 21381 21275
15577B1275O544q253j4185k380O034j892J652j0746p38J0377K743o516L797j795
$$ 21275 27819 19566 5381 3001 9035 7143 8795 -1951 -2689 7688 10431 3915 7712 5917
15563E917n233r666k738P057O667L018K038m42o59j1615N562N759L757j1176j3803
$$ 5917 684 -8982 -11720 -4663 2004 5022 7060 6618 5959 -5656 -94 5665 9422 -1754 -15557
15548a5557P34R743m841L48J742R718m694j1089n154m424O567q598l435J1981
$$ -15557 -14823 -5080 -9921 -9573 -7831 1887 -2807 -13896 -19050 -23474 -16907 -25505 -28940 -16959
15534a6959J1519N119P109j5338o659P783J984J771P953M969r341k720l479m716
$$ -16959 -5440 -321 6788 -8550 -15209 -7426 -5442 -3671 4282 9251 -90 -2810 -6289 -11005
15520a1005l219q592J6673R04j722K15J5708Q30L337k487L189k395q438j158R325
$$ -11005 -14224 -22816 -6143 -5239 -6961 -6746 8962 9792 13129 10642 13831 11436 2998 1840 11165
15505A1165J1939Q01j8931k3448K473K0382J2981oo684L787L201m136q292k940
$$ 11165 23104 23905 4974 -18474 -16001 4381 17362 17356 10672 14459 17660 13524 5232 2292
15491B292K193n23m36r102l997k782K897J3049J1802J1026Q371p381r903j0557
$$ 2292 4485 3962 3526 -5576 -9573 -12355 -9458 3591 15393 26419 34790 27409 17506 6949
15477F949q075J1093j4494j1894j995Q277J6513P362N814o006j4023O101J1793
$$ 6949 -1126 9967 -4527 -16421 -18416 -10139 6374 13736 19550 13544 -479 5622 17415
15464A7415j3918r387p480J3445N399j459n41J1566n318o146P409l931r209j871
$$ 17415 3497 -5890 -13370 75 5474 4015 3474 15040 9722 3576 10985 7054 -2155 -4026
15450d026j06J1873N638P801n311k1595p73R406J3274K495j4344j0983O292J3011
$$ -4026 -4132 7741 13379 21180 15869 -5726 -6499 2907 16181 18676 4332 -6651 -359 12652
15436A2652O305L575q578k0377k193R71K624J2819r673k671j743l175P1k2316
$$ 12652 18957 22532 13954 -6423 -8616 -7645 -5021 7798 -1875 -4546 -6289 -9464 -9393 -31709
15422c1709K473J8640R477m952j8162j1063L109J5669R502R115J4239r819l772
$$ -31709 -29236 -10596 -1119 -6071 -24233 -35296 -32187 -16518 -7016 2099 16338 6519 2747
15409B747J082j8275j3259k147J3836L730L901R872N521J4569Q186l421n584M828
$$ 2747 3829 -14446 -27705 -29852 -16016 -12286 -8385 1487 7008 21577 29763 26342 20758 25586
15395B5586l935N580o214j2776j0952L046k800j374O148L318M052j0242j21j4263
$$ 25586 21651 27231 21017 8241 -2711 335 -2465 -3839 2309 5627 9679 -563 -684 -14947
15381a4947M962o716J2248P593j830p204k646P162J4053J455k2925j9891J4629
$$ -14947 -9985 -16701 -4453 3140 1310 -5894 -8540 -1378 12675 14130 -8795 -28686 -14057
15368a4057J3160N482p94j260m521j0371P527o511k176k307o596J2107Q917k663
$$ -14057 -897 4585 3791 2531 -1990 -12361 -4834 -11345 -13521 -15828 -22424 -10317 -1400 -4063
15354d063K72p898o99J1329J1550J4015O275p279q474j3463J445J40P320J805
$$ -4063 -3791 -11689 -12388 -1059 10491 24506 30781 23502 15028 1565 3010 3150 10470 12275
15340A2275r615j8766o95J2257J0459l560l518k253j3113J1733P842O335o02j4270
$$ 12275 2660 -16106 -16801 -4544 5915 2355 -1163 -3416 -16529 -4796 3046 9381 8779 -5491
15326e491j4461k061J2813J1874R829L335j1029k154J291j6923m751J399N9m208
$$ -5491 -19952 -22013 -9200 2674 12503 15838 4809 2655 3946 -12977 -17728 -16329 -16270 -20478
15312b0478n159J2911J3619j751n936l474j419m262J2927O772l849j2701J8015
$$ -20478 -25637 -12726 893 -858 -6794 -10268 -11687 -15949 -3022 3750 -99 -12800 5215
15299E215J2324n787o564n280n938o51P572R419j2143rJ130L758m03j316L256
$$ 5215 17539 11752 5188 -92 -6030 -6681 891 10310 -1833 -1842 -712 3046 2643 1327 4583
15284D583j967M863m185l050l620P982M836M945J1681J451r934n661j8535k0674
$$ 4583 2616 7479 3294 244 -3376 4606 9442 14387 26068 27519 17585 11924 -6611 -27285
15270b7285m1J6121L054j6785P889J8399r99J161j0888j1138K20Q288J2547J1174
$$ -27285 -27326 -11205 -8151 -24936 -17047 1352 353 1514 -9374 -20512 -20292 -12004 543 11717
15256A1717p097p652M419m710J0865N944Q69L163n073Ol26j4894p313j404P049
$$ 11717 4620 -3032 1387 -3323 7542 13486 14355 17518 12445 12451 12125 -2769 -10082 -11486 -4437
15241d437O322Q344o086p020J313r88n957J5220N953q236M777J752m653j0386
$$ -4437 1885 10229 4143 -2877 -1564 -2552 -8509 6711 12664 4428 9205 10957 6304 -4082
15227d082P48M146r105j4456M646Q227R235J964P240j4556j3132j59L796O188
$$ -4082 -3334 812 -8293 -22749 -18103 -9876 -641 1323 8563 -5993 -19125 -19284 -15488 -9300
15213i300o521m18K513L064Q038L389L449J2551r517j3785O606J4094j059q786
$$ -9300 -15821 -16239 -13726 -10662 -2624 765 4214 16765 7248 -6537 69 14163 13104 4318
15199D318m798L988o486M19q71L845p193j648P796N562n684k419Q00R229m723
$$ 4318 -480 3508 -2978 -2559 -3430 415 -6778 -8426 -630 4932 -752 -3171 -2371 6858 2135
15184B135j0073Q704J7455O993l340j8240k170j7215j3854J587M607J9414R98
$$ 2135 -7938 766 18221 25214 21874 3634 1464 -15751 -29605 -28018 -23411 -3997 -2999
15171b999j1199n533k871J0674J0760n279R067J2517p389p919j5824k247J7612
$$ -2999 -14198 -19731 -22602 -11928 -1168 -6447 2620 15137 7748 -171 -15995 -18242 -630
15158f30o12n945J4720j05r716j1515K154o901j3578J8304N33p559O677M440M271
$$ -630 -1242 -7187 7533 7428 -2288 -13803 -11649 -18550 -32128 -13824 -13291 -20850 -14173 -9733 -5462
15143e462M66O624N961O608N186r756J1188J1384o371l14j1948m531q018j995
$$ -5462 -4996 1628 7589 14197 19383 9627 20815 32199 25828 25514 13566 9035 1017 -978
15129i78o24N301k059l276n563k508L358j438P178Q057r255j0084J190p128l679
$$ -978 -1602 3699 1640 -1636 -7199 -9707 -6349 -7787 -609 7448 -1807 -11891 -10701 -17829 -21508
15114b1508P088R064O780K641L935M840l268Q977K3633N118o888j2128j3975o968
$$ -21508 -14420 -5356 1424 4065 8000 12840 9572 18549 42182 47300 40412 28284 14309 7341
15100G341N897j1913O27J5505l057m15O742L485j0428l046j6065q967J4526L074
$$ 7341 13238 1325 1952 17457 14400 13985 20727 24212 13784 10738 -5327 -14294 232 3306
15086C306r439l799R880n103M134R569Q506j766j338k14n941j5222p539J1755
$$ 3306 -6133 -9932 -52 -5155 -1021 8548 17054 15288 13950 13736 7795 -7427 -14966 -3211
15072c211O428J1022k812j9643q077J44K876N155J5572Q569L650p081m271o186
$$ -3211 3217 14239 11427 -8216 -16293 -16149 -13273 -8118 7454 16023 19673 12592 8321 2135
15058B135o444l587k117K474k800r029O504K792R601J0123J4525m807j1287l596
$$ 2135 -4309 -7896 -10013 -7539 -10339 -19368 -12864 -10072 -471 9652 24177 19370 8083 4487
15044D487o044K603k664n222l119O699M18k914p20M681P50k790p352K395R836
$$ 4487 -1557 1046 -1618 -6840 -9959 -3260 -2842 -5756 -6476 -1795 -1045 -3835 -11187 -8792 1044
15029A044M22o426P506q24k4714p14J3571J2683K0480r705j0860K746L824l599
$$ 1044 1466 -4960 2546 1722 -22992 -23706 -10135 2548 23028 13323 2463 5209 9033 5434
15015E434O098j955q441q824q010J3569Nl078k776J6927Q099L853j9653j0725
$$ 5434 11532 9577 1136 -7688 -15698 -2129 -2124 -5202 -7978 8949 17048 20901 1248 -9477
15001i477j0791L228j749n033J0609Q269Q257J174O631n769k485r777J3117J4397
$$ -9477 -20268 -17040 -18789 -23822 -13213 -4944 3313 4487 11118 5349 2864 -6913 6204 20601
14987B0601n74J417L896l599j405L291l562P21K1P794j0972j9952r661O994N103
$$ 20601 20027 21444 25340 21741 20336 23627 20065 20786 20807 28601 17629 -2323 -11984 -4990 113
14972A13O361Q160m10j2615N087L663j0559q902P582j302n089J3167Q205j4045
$$ 113 6474 14634 14224 1609 6696 10359 -200 -9102 -1520 -2822 -7911 5256 13461 -584
14958e84j0755R586Q694k4653o184P180O915j155l873M418J0228J375m08M14p479
$$ -584 -11339 -1753 6941 -17712 -23896 -16716 -9801 -10956 -14829 -10411 -183 1192 784 1198 -6281
14943f281R005o300o954M751J1941O702j7164j0114R455J6648r257K938j245J478
$$ -6281 2724 -3576 -10530 -5779 6162 12864 -4300 -14414 -4959 11689 2432 5370 4125 5603
14929E603Q887l514p020O462j6258o130O183J6319P415j2354O590J4935R27j2930
$$ 5603 14490 10976 3956 10418 -5840 -11970 -5787 10532 17947 5593 12183 27118 28045 15115
14915A5115j032N284m085O81n312k706k442q421P780j252n48r158M470P809Q120
$$ 15115 14083 19367 15282 15963 10651 7945 5503 -2918 4862 3610 3062 -6096 -1626 6183 14303
14900A4303n886j6661m876K833R580m569M718l004q610m707M895l627j09J42J2669
$$ 14303 8417 -8244 -13120 -10287 -707 -5276 -558 -3562 -12172 -16879 -11984 -15611 -15720 -15578 -2909
14885b909o78j1021J0254J8649J935J3518n566j0756j7478q059j68L540r480M660
$$ -2909 -3587 -14608 -4354 14295 16230 29748 24182 13426 -4052 -12111 -12279 -8739 -18219 -13559
14871a3559R233M134k883j6389Q751K589j996J9224k592M347q304o926L492P265
$$ -13559 -4326 -192 -3075 -19464 -10713 -8124 -10120 9104 6512 10859 2555 -4371 -879 6386
14857F386l718o78r370q618R776M725M575l665R879Q538r490J983O529J535L374
$$ 6386 2668 1990 -7380 -15998 -6222 -1497 3078 -587 9292 17830 8340 10323 16852 18387 21761
14842B1761j2132L528m610l085k623l379K32P196r056j302l434J1554N17n392
$$ 21761 9629 13157 8547 5462 2839 -540 -308 6888 -2168 -3470 -6904 4650 5167 -225
14828b25Q257p375L42O355n075j3178m391J5798P666m714l159J0921k958mn011
$$ -225 8032 657 999 7354 2279 -10899 -15290 508 8174 3460 301 11222 8264 8260 3249
14813C249r769N764O021o438L585Q703K676j8627j172o44k77j1123j6336n948
$$ 3249 -6520 -756 5265 -1173 2412 11115 13791 -4836 -6008 -6652 -6929 -18052 -34388 -40336
14799d0336J3596J3501J6547l691q395O165k663Q751J6233k38N8M388M14j9055
$$ -40336 -26740 -13239 3308 -383 -8778 -2613 -5276 3475 19708 19470 19528 23916 24330 5275
14785E275j1485L440O887J261k113j6022J183o169J5070J5947k0235j5165j677
$$ 5275 -6210 -2770 4117 5378 3265 -12757 -11574 -17743 -2673 13274 -6961 -22126 -23803
14772b3803J490J0187J5417N909J359N363n531j3244K801L580j21o750j5278l681
$$ -23803 -22313 -12126 3291 9200 10559 15922 10391 -2853 -52 3528 3407 -3343 -18621 -22302
14758b2302J4805O877n656M957m634J6483J3j6211L182p96k601q177J303k253
$$ -22302 -7497 -620 -6276 -1319 -5953 10530 10543 -5668 -2486 -3282 -5883 -14060 -12757 -15010
14744a5010N358J6887l805j1417j5246N546K2465J7369rj4139o385O783J3599
$$ -15010 -9652 7235 3430 -7987 -23233 -17687 4778 22147 22138 7999 1614 8397 21996
14731B1996m760k3858o018P086K794m394j0461J1041K3776p437j6342K827M722
$$ 21996 17236 -6622 -12640 -5554 -2760 -7154 -17615 -6574 17202 9765 -6577 -3750 972
14718I72P736J2468R65o019j3049L835l365J901M125O31p79Q116J7094l41p371
$$ 972 8708 21176 22141 16122 3073 6908 3543 5444 9569 10200 9421 17537 34631 34290 26919
14703B6919q773k218j3940M068J1645L178K296J303j0216k7494j5237J2510P100
$$ 26919 18146 15928 1988 6056 17701 20879 23175 24478 14262 -13232 -28469 -15959 -8859
14690h859J7054O571p176q88l97o524j499J998p246q56J1584o082j7855L333K742
$$ -8859 8195 14766 7590 6702 6305 -219 -1718 280 -6966 -7822 3762 -2320 -20175 -16842 -14100
14675a4100J3650P991p705j2121n353M655J1202Q947K1566N493j6429j5758J0929
$$ -14100 -450 7541 -164 -12285 -17638 -12983 -1781 7166 28732 34225 17796 2038 12967
14662A2967j324p187N971J1320j091m419q265l068m690r365Q206L716j0761L971
$$ 12967 11643 4456 10427 21747 20656 16237 7972 4904 214 -9151 -945 2771 -7990 -4019
14648d019P056j233m838L495J1794P930k153M565J68J1001j2541j3648R028l26
$$ -4019 3037 1804 -3034 461 12255 20185 18032 22597 22765 33766 21225 7577 16605 16279
14634A6279l364K090m256j1922L479K901q685p012j3184R847K3092J6146q204
$$ 16279 12915 15005 10749 -1173 2306 5207 -3478 -10490 -23674 -13827 9265 25411 17207
14621A7207m379k7303j0889J785J5103k347K043m112k133J9378J2369L388R991
$$ 17207 12828 -14475 -25364 -23579 -8476 -10823 -8780 -12892 -15025 4353 16722 20110 30101
14608C0101q808m968o218j2317N317l596p608j7936K75J2838J9368O391K750o078
$$ 30101 21293 16325 10107 -2210 3107 -489 -8097 -26033 -25758 -12920 6448 12839 15589 9511
14594I511q90L923M873N223m012q722M384o066m354N934L378q312M951O951n580
$$ 9511 8621 12544 17417 22640 18628 9906 14290 8224 3870 9804 13182 4870 9821 16772 11192
14579A1192j0749r548P483K053p359m550L620m970n359l462M145J507n676O53
$$ 11192 443 -9105 -1622 431 -6928 -11478 -7858 -12828 -18187 -21649 -17504 -15997 -21673 -21020
14565b1020J1787J9714m746j2305O158k780k466L844M861J88l723j2851j0314
$$ -21020 -9233 10481 5735 -6570 -412 -3192 -5658 -1814 3047 3235 -488 -13339 -23653
14552b3653J261M512N725M062J9656J4736M473k018j1483k2259O532J4275n343
$$ -23653 -22392 -17880 -12155 -8093 11563 26299 30772 28754 17271 -4988 1544 15819 10476
14539A0476L759Q129k461p600M55m477j6218k561L171j327n26M602p212r045J2677
$$ 10476 14235 22364 19903 12303 12758 8281 -7937 -10498 -7327 -8654 -9180 -4578 -11790 -20835 -8158
14524h158J1727N816L585j2947Q969M207n156o56j087J6745j008j5391O400J1907
$$ -8158 3569 9385 12970 23 8992 13199 8043 7387 6300 23045 22037 6646 13046 24953
14510B4953M448j140j2063j3548n93n949N919J560o28M036o112j483j0580j1097
$$ 24953 29401 28261 16198 2650 2057 -3892 2027 3587 2959 6995 883 -600 -11180 -22277
14496b2277J154P083N997N570J656M413L438k835o256l231J8052Q059M312L78
$$ -22277 -21123 -14040 -8043 -2473 -817 3596 7034 4199 -2057 -5288 12764 20823 25135 25513
14482B5513p455j5568j16N742j1635j1301O282N961l161J0492k14m68j815L903
$$ 25513 18058 2490 2374 8116 -3519 -14820 -8538 -2577 -5738 4754 4540 4072 2257 6160
14468F160P823J0347M945k867j0358m361L375p215p579k0334J5310J1325J0785
$$ 6160 13983 24330 29275 26408 16050 11689 15064 7849 270 -20064 -4754 6571 17356
14455A7356P063k556o86j133m821n650M375j0631j0117k821O292O669o024j433
$$ 17356 24419 21863 21177 20044 15223 9573 13948 3317 -6800 -9621 -3329 3340 -2684 -4117
14441d117M85j616r032m584l51K848R076n93j6507J2890Q152j120l091Q278R475
$$ -4117 -3632 -5248 -14280 -18864 -19215 -16367 -7291 -7884 -24391 -11501 -3349 -4469 -7560 718 10193
14426A0193J8962O920j1475q756l525O467R470j1709j1491j2842j251N396p957
$$ 10193 29155 36075 24600 15844 12319 18786 28256 16547 5056 -7786 -9037 -3641 -11598
14413a1598J0633l351j3423K934Q591R501Q750R339N31k0754p064R156R081O117
$$ -11598 -965 -4316 -17739 -14805 -6214 3287 12037 21376 21907 1153 -5911 3245 12326 18443
14399A8443j256q675l468q030J9297J0109k1368J445L880J0697m137m555J521
$$ 18443 17187 8512 5044 -2986 16311 26420 5052 6497 10377 21074 16937 12382 13903
14386A3903m554M605P21j717K585N708j4077j5803P424L322J1979j1882r275k304
$$ 13903 9349 13954 14675 12958 15543 21251 7174 -8629 -1205 2117 14096 2214 -7061 -9365
14372i365r05k025J1690l684n209J0141J497O616J53j2084j6928J992j033L075
$$ -9365 -10270 -12295 -605 -4289 -9498 643 2140 8756 8909 -3175 -20103 -18111 -19144 -16069
14358a6069J0590J1765J2425j198j2084n536j599J1761J3598R96q831j1177Q009
$$ -16069 -5479 6286 18711 17513 5429 -107 -1706 10055 23653 24649 15818 4641 12650
14345A2650Q752n189O223q392j7085j8019m08O009R291J3609L269K769q132r537
$$ 12650 21402 16213 22436 14044 -3041 -21060 -21468 -15459 -6168 7441 10710 13479 5347 -4190
14331d190Q967m117P674O122J48P994J3801o942j2491j7308j4292Q243J3784O768
$$ -4190 4777 660 8334 14456 14604 22598 36399 29457 16966 -342 -14634 -6391 7393 14161
14317A4161m105J250J561m282J204M757p028J641N596o563p886O416L758L877
$$ 14161 10056 11306 12867 8585 9789 14546 7518 9159 14755 8192 306 6722 10480 14357
14303A4357q681j6858J259M487M365J707Q001l884J1281Q79j0739N697j282J5025
$$ 14357 5676 -11182 -9923 -5436 -1071 636 8637 4753 16034 16913 6174 11871 10589 25614
14289B5614J8129n102j0727q611r021j1691J2947R477k420O52j708n975k305j705
$$ 25614 43743 38641 27914 19303 10282 -1409 11538 21015 18595 19247 17539 11564 9259 7554
14275G554M33r15Q478Q61J460q826j2583q343M074J3718q043j3223l838J3275
$$ 7554 7987 7072 15550 16411 17871 9045 -3538 -11881 -7807 5911 -2132 -15355 -19193 -5918
14261e918O199j0337Q525M805l966J813l45J0338J1176l970L80j347J369n688
$$ -5918 281 -10056 -1531 3274 -692 1121 776 11114 22290 18320 18700 17353 18722 13034
14247A3034j2012k392l966P994Q654J4030P758j5929J4016n417j282j4658j071
$$ 13034 1022 -1370 -5336 2658 11312 25342 33100 17171 31187 25770 24488 9830 8759
14234H759j159M648j447R853K97j0770k78J362O960l934j8437l629N109j1832
$$ 8759 7600 12248 10801 20654 20951 10181 9903 11265 18225 14291 -4146 -7775 -2666 -14498
14220a4498j3633O753J8868J6106Q669L792L807j831r293N654m601p627o303J76
$$ -14498 -28131 -21378 -2510 13596 22265 26057 29864 28033 18740 24394 19793 12166 5863 6039
14206F039R446M167m142O18m308n655K5214K8394K7177J5686P160J7616N955j566
$$ 6039 15485 19652 15510 16128 11820 6165 31379 59773 86950 102636 109796 127412 133367 131801
14192A31801j8481j3557O91k2233l3040k2029j4124m27N044N795L614j5188o032
$$ 131801 113320 99763 100454 78221 45181 23152 9028 8601 13645 19440 23054 7866 1834
14179A834Q660J0474J1205J1145N312j8510o827N119n04l082j0826o921k101R656
$$ 1834 10494 20968 32173 43318 48630 30120 23293 28412 27908 24826 14000 7079 4978 14634
14165A4634K400p176j1941L963K56r65r05J5476R606j1776j0558M546J4946J3486
$$ 14634 17034 9858 -2083 1880 2136 1171 266 15742 25348 13572 3014 7560 22506 35992
14151C5992n593k1654j3030K0142N186P288J440j7796Q263K895j812n065j594
$$ 35992 30399 8745 -4285 15857 21043 28331 29771 11975 20238 23133 21321 16256 14662
14138A4662N433J216p851q67o131K140J4049J4426r071q209j0181q061n713J3268
$$ 14662 20095 21311 13460 12593 6462 8602 22651 37077 28006 19797 9616 1555 -4158 9110
14124I110Q186j8331k9651m294J1032K0524J2804J3590n201q891O900m635J4626
$$ 9110 17296 -1035 -30686 -34980 -23948 -3424 9380 22970 17769 8878 15778 11143 25769
14111B5769J0583q999q311l777j066R108L694Q629J2878k002j8344n320k327n035
$$ 25769 36352 27353 19042 15265 14199 23307 27001 35630 48508 46506 28162 22842 20515 15480
14097A5480N584N290P780l955j7678rJ4545M263p656p257P242J374q343j0259
$$ 15480 21064 26354 34134 30179 12501 12492 27037 31300 23644 16387 23629 25003 16660 6401
14083F401N73N117J719q67j0783l238K7348Q577k050R216j113j6700o745k369
$$ 6401 6974 12091 13810 12943 2160 -1078 26270 34847 32797 42013 40900 24200 17455 15086
14069A5086K571K14j1976j4925L52M879M28m214j0174K790l658J4272k369Q96
$$ 15086 17657 17871 5895 -9030 -8678 -3799 -3371 -7585 -17759 -14969 -18627 -4355 -6724 -5828
14055e828m713K943k017j8514j537K627J0082R649K0486q387j2397M982P264l776
$$ -5828 -10541 -7598 -9615 -28129 -29666 -27039 -16957 -7308 13178 4791 -7606 -2624 4640 864
14041H64o313J06O83J3985O712J599J975j1390n369k356J438N730R782M048j8440
$$ 864 -5449 -5343 -4660 9325 16037 17636 19611 8221 2852 496 1934 7664 17446 21494 3054
14026C054k526N650l514o298q033r05Q945m031M080O648N411J9231j013j1656
$$ 3054 528 6178 2664 -3634 -11667 -12572 -3627 -7658 -3578 3070 8481 27712 26699 15043
14012A5043J032M46N07k35Q230O9J799k972j180k768j903q081O886j787M399q40
$$ 15043 16075 16521 17028 16793 25023 25092 26891 23919 22739 19971 18068 9987 16873 15086 19485 18645
13996A8645j2393R74J452L846K322J3415Q625K953n1K119m097j2064j191k480
$$ 18645 6252 7226 8678 12524 14846 28261 36886 39839 39788 41907 37810 25746 24555 22075
13982B2075q424M632J1211r46m731l577R495J7822j6816j5802p97J58q804q780
$$ 22075 13651 18283 29494 28548 23817 20240 29735 47557 30741 14939 14142 14300 5496 -3284
13968c284J759P435N740L001J778J529j4803j0375o173O949J9624Q488q593j641
$$ -3284 -1525 5910 11650 14651 16429 17958 3155 -7220 -13393 -6444 13180 21668 13075 11434
13954A1434k15j1150j7143J0630J7803J2632K09k982J2471n311k0859k037L951
$$ 11434 11219 69 -17074 -6444 11359 23991 24200 21218 33689 28378 7519 5482 9433
13941I433k058J075P578R720j296O581P531m353j3639N898n450j2359O099M043
$$ 9433 7375 8450 16028 25748 24452 31033 38564 34211 20572 26470 21020 8661 14760 18803
13927A8803l919Q767M540j2065N297J3297k202L033n439J314Q932p768n184Q596
$$ 18803 14884 23651 28191 16126 21423 34720 32518 35551 30112 31426 40358 32590 27406 36002
13913C6002k606O975n807q967J6290l430O406j007M717J9182J4967J1265K6341
$$ 36002 33396 40371 34564 25597 41887 38457 44863 43856 48573 67755 82722 93987 120328
13900A20328M5278N3962M3379J5019m2477n3163l3627k5268j9915k4154j5070
$$ 120328 165606 219568 262947 277966 235489 182326 148699 123431 103516 79362 64292
13889F4292M451J6665J3405L460R019Q914J381j1485J372N620K6137M0159J2664
$$ 64292 68743 85408 98813 102273 111292 120206 121587 110102 111474 117094 143231 183390 196054
13876A96054l0025k8233m733K6983L7765M0974M1708K1533j3547n4177m6759k4468
$$ 196054 166029 137796 133063 160046 197811 238785 280493 302026 288479 234302 187543 163075
13864A63075j2911J516J4507L194j1430k1363j7968P36K462r447j5801j0276J870
$$ 163075 150164 151680 166187 169381 157951 136588 118620 119356 121818 112371 96570 86294 88164
13851H8164m310q284P901K976J8553K5845K5911M4338O7350O3562m356o1852n5895
$$ 88164 83854 75570 83471 86447 105000 130845 156756 201094 268444 332006 327650 265798 209903
13838B09903l7297l9182j6243j0457M6R493K0689R367L697J8645r193k4030n059
$$ 209903 172606 133424 117181 106724 106770 116263 136952 146319 150016 168661 159468 135438 130379
13825A30379L614j2634r178j1070j3264j1275N288q45k8359k341q67j3405j7097
$$ 130379 133993 121359 112181 101111 87847 76572 81860 81015 52656 50315 49448 36043 18946
13812A8946K848J3354l116n632L418j1826k2095J9124R239J4651J995J770k672
$$ 18946 21794 35148 32032 26400 29818 17992 -4103 15021 24260 38911 40906 42676 40004
13799D0004J89K447l148n307o998j0593k156p29K009R165n717J506Q865M194j3821
$$ 40004 40193 42640 39492 34185 27187 16594 14438 13709 15718 24883 19166 20672 29537 33731 19910
13784A9910j3649m086N959j3798J3925J3053P915J8201J482p269J839K937j5682
$$ 19910 6261 2175 8134 -5664 8261 21314 29229 47430 48912 41643 43482 46419 30737
13771C0737j0998L084J0237P427O243j5099n832J510J5447j894j5867o67O681
$$ 30737 19739 22823 33060 40487 46730 31631 25799 27309 42756 40862 24995 24328 31009
13758C1009M085l944p035j202J073K220M451p263l265n752J489M539k209m469
$$ 31009 35094 31150 24115 22913 23986 26206 30657 23394 20129 14377 15866 20405 18196 13727
13744A3727J3101N213j6768j25j0924p16J0648K693O046J3302J0388n942q904
$$ 13727 26828 32041 15273 15148 4224 3508 14156 16849 22895 36197 46585 40643 31739
13731C1739k0459k826J3783m663O302Q340J107O871K272j845r221j37r89K44J1323
$$ 31739 11280 8454 22237 17574 23876 32216 33323 40194 42466 40621 31400 31263 30274 30518 41841
13716D1841l478p346n957Q036j0908K762L062j0034j0663n77R261p196j2877P420
$$ 41841 38363 31017 25060 33096 22188 24950 28012 17978 7315 6738 15999 8803 -4074 3346
13702C346J7288J0922Q406J2478J5552P68p110R99q61L84k027m904m551L394N113
$$ 3346 20634 31556 39962 52440 67992 68760 61650 62649 61788 62172 60145 55241 50690 54084 59197
13687E9197N279q961P702O908o684K952j8203j2994J1034q879r798O233J3086
$$ 59197 64476 55515 63217 70125 63441 66393 48190 35196 46230 37351 27553 33786 46872
13674D6872Q710o920k923Q469j736o158J0399j696J0820L878q239k903O69M165
$$ 46872 55582 48662 45739 54208 52472 46314 56713 55017 65837 69715 61476 58573 59242 63407
13660F3407J6202O517J614K511j0528k491j2093r016l689o155N942M900p713Q222
$$ 63407 79609 86126 87740 90251 79723 77232 65139 56123 52434 46279 52221 57121 49408 57630
13646E7630n361p798j906n145J487J6663Q662Q546r685k990J652l63O810m845
$$ 57630 52269 44471 42565 37420 38907 55570 64232 72778 63093 60103 61755 61392 68202 63357
13632F3357m178k299J2655P636j330j118j7838j1232n046j819q441K598K940J0373
$$ 63357 59179 56880 69535 77171 75841 74723 56885 45653 40607 38788 30347 32945 35885 46258
13618D6258J6194L406n773M965o00R162P520J5k852j6765K413j666M708k0595
$$ 46258 62452 65858 60085 65050 64450 73612 81132 81147 78295 61530 63943 62277 66985 46390
13604D6390j6219J3626J7582J5411R637L073R899n487j4758p094O078n135j9777
$$ 46390 30171 43797 61379 76790 86427 89500 99399 93912 79154 72060 78138 73003 53226
13591E3226q115L082l055J7009p34L793J4106r73l620Q653R033J1322J025q71
$$ 53226 45111 48193 45138 62147 61413 65206 79312 78339 74719 83372 92405 103727 104752 103881
13577A03881L015M774p356k794m026q962J1709J8052M778J410q992L501q051m77
$$ 103881 106896 111670 104314 101520 97494 88532 100241 118293 123071 124481 115489 118990 110939 110462
13563A10462O417P344J1048P479q71Q308n534k320o569L676K2000K4459M4823
$$ 110462 116879 124223 135271 142750 141879 150187 144653 142333 135764 139440 161440 185899 230722
13550B30722M1622j757l4247k6223l3090k2450o903L095L302K1307R784j3947
$$ 230722 272344 270587 236340 210117 177027 154577 147674 150769 154071 175378 185162 171215
13538A71215j0333j354M010k22m346N201P923J0001L034j1204j9964j0244r291
$$ 171215 160882 159528 163538 163316 158970 164171 172094 182095 185129 173925 153961 143717 134426
13525A34426N231O800j1651N529M029Q91P188j632N279m127J380K3880K0596L651
$$ 134426 139657 146457 134806 140335 144364 145255 152443 150811 156090 151963 153343 177223 197819 201470
13511B01470j3430j2004N804N094j431O395M319j016n395J7451L942M156Q62j682
$$ 201470 188040 176036 181840 186934 185503 191898 196217 195201 189806 207257 211199 215355 216217 214535
13497B14535m926n860l218j9974J3297J6094K2815J3900M38n707J6549J2712L678
$$ 214535 209609 203749 200531 180557 193854 209948 232763 246663 247101 241394 257943 270655 274333
13484B74333J7563J8427J2618P509J2135Q450O950R608p949J7151L5761J4435
$$ 274333 291896 310323 322941 330450 342585 351035 357985 367593 359644 376795 412556 426991
13472D26991N117K9776L1890L2751K4331K3416K7353M2469M5073L0458M1473K8183
$$ 426991 432108 461884 493774 526525 550856 574272 601625 644094 689167 719625 761098 789281
13460G89281K0684M2015N2344N8746Q2488R4379J22006J20588J54064J94833K44804
$$ 789281 809965 851980 904324 963070 1045558 1139937 1261943 1382531 1536595 1731428 1976232
13449A976232L05951L78192M49797M46515M81958O17302Q82834J302883J907426
$$ 1976232 2282183 2660375 3110172 3556687 4038645 4655947 5538781 6841664 8749090
13440H749090K800341M290422O855950J0575177J3477559R742031k539112j1955994
$$ 8749090 11549431 15839853 22695803 33270980 46748539 56490570 53951458 41995464
13432D1995464j2033082q348548n203956l199590j923932j056511m38481J90010
$$ 41995464 29962382 21613834 16409878 13210288 11286356 10229845 9791364 9981374
13424I981374J063333K262341L411420K958993Q1470j520327j4352K780246N256733
$$ 9981374 11044707 13307048 16718468 19677461 19758931 18238604 18224252 21004498 26261231
13415B6261231M271163j196284l903067j599032K064151N842654R202151R714349
$$ 26261231 30532394 29336110 25433043 23834011 25898162 31740816 40942967 50657316
13407E0657316N120542k384860q621442j0138643p649341m281822j157180J934610
$$ 50657316 55777858 53392998 44771556 34632913 26983572 22701750 21544570 23479180
13399B3479180M347148K750698l108686n515094l274980l08601J582319O96535
$$ 23479180 27826328 30577026 27468340 21953246 18678266 18369665 19951984 20648519
13391B0648519k423076l596573k572809j294821k99795M85494J261589K226390
$$ 20648519 18225443 14628870 12056061 10761240 10461445 10946939 12208528 14434918
13383A4434918L713859O168376R824090J3454621J1774315J09608j2133947j4179813
$$ 14434918 18148777 24317153 34141243 47595864 59370179 59479787 47345840 33166027
13375C3166027j0310643o533383m147844k749772j902514j382951j012922p30741
$$ 33166027 22855384 16322001 12174157 9424385 7521871 6138920 5125998 4395257
13367D395257n18047m44981m46673l90418l14658k57024j91292j36887j33830
$$ 4395257 3877210 3432229 2985556 2595138 2280480 2023456 1832164 1695277 1561447
13358A561447j36423j33924j14608r9315q7475o8311o4205n9223m5215k8639m2448
$$ 1561447 1425024 1291100 1176492 1077177 989702 921391 857186 797963 752748 724109 681661
13347F81661m4023l1577j9987j9102k5607k3509j2306l560j6061j7734k5359r088
$$ 681661 637638 606061 586074 566972 541365 517856 505550 501990 485929 468195 442836 433748
13335D33748o490j0559j6880j4443q706j1219k1170k6120k63O459l198n75k9425
$$ 433748 427258 416699 399819 385376 376670 365451 344281 318161 317898 324357 321159 320584 291159
13322B91159j3744j700j5035O457N856p487K441O170J4754r304k7442j9683k4040
$$ 291159 277415 275715 260680 267137 272993 265506 267947 274117 288871 279567 252125 232442 208402
13309B08402k613L1251J6777r063k001J0250o578k8557k2338l101P968j2282j2319
$$ 208402 205789 237040 253817 244754 242753 253003 246425 217868 195530 192429 200397 188115 175796
13296A75796j2787r648L950m216P663J4809O943o275R813Q696p808r657j1777
$$ 175796 163009 153361 157311 153095 160758 175567 182510 176235 186048 194744 186936 177279 165502
13283A65502m606O562K336o006J3074k894j3149j181j0382j5459n444K177M152
$$ 165502 160896 167458 169794 163788 176862 173968 160819 159638 149256 133797 128353 130530 134682
13270A34682j012l165J6386K1630L8188P8643M8070l1460p5115n5797j4216p509
$$ 134682 133670 130505 146891 168521 206709 285352 333422 301962 226847 171050 156834 149325
13258A49325J3538J7489r911k0499j2548l776N720J2409o587m851k570r51q395
$$ 149325 162863 180352 170441 149942 137394 133618 139338 151747 145160 140309 137739 136788 128393
13245A28393p656J8327K0645J9350K277J4403L0889L2604N6923N9789N8771O378
$$ 128393 120737 139064 159709 179059 181336 195739 226628 259232 316155 375944 434715 441093
13233D41093m3193p2021o7920m6254k6646l5926k2372n905j3359J8737J5749j999
$$ 441093 397900 325879 257959 211705 185059 149133 126761 120856 107497 126234 141983 139984
13221A39984N643n202J6922J1071J2444L1967M4770N3388M8430K9731K344j0755
$$ 139984 145627 140425 157347 168418 180862 212829 257599 310987 359417 389148 391492 380737
13209C80737K5374M1889J8446m356k7192l5707m5398k2578Q398k113k4532n5473
$$ 380737 406111 448000 466446 462090 434898 399191 353793 331215 339613 337500 312968 257495
13197B57495n3767k7736r045k5291k0838n274n224K508R326N997L145J8492L6026
$$ 257495 203728 175992 166947 141656 120818 115544 110320 112828 122154 128151 131296 149788 185814
13184A85814K0179J5957J7118M5969P1290P9609N5736p570n7192r5458p4761m4002
$$ 185814 205993 221950 239068 285037 356327 435936 491672 484102 426910 331452 256691 212689
13172B12689l2021j3421k5122j2594j5948j8389n734j3137p221k212K686K765
$$ 212689 180668 167247 142125 129531 113583 95194 89460 76323 69102 66890 69576 72341
13160G2341j4873k0827n903K299J3817j725O411K205j0187j296L975j5763o80
$$ 72341 57468 36641 30738 33037 46854 45129 51540 53745 43558 42262 46237 30474 29794
13147B9794k338j674J0358M366M84l146M446J905r039j4380q903R81K0969K2278
$$ 29794 27456 25782 36140 40506 40990 37844 42290 44195 35156 20776 11873 12854 33823 56101
13133E6101j786o037L785P371j4731j1327Q652j540P540m376j3693j8902M82q588
$$ 56101 54315 48278 52063 59434 44703 33376 42028 40488 48028 43652 29959 11057 11539 2951
13119B951K619J5556J4160n496Q08J4029K641J578J253n937j2668k964k918n468
$$ 2951 5570 21126 35286 29790 30598 44627 47268 48846 50099 44162 31494 28530 25612 20144
13105B0144K672J864J231O420J6152J033L99k954K308O506j4711q200M969J0377
$$ 20144 22816 24680 25911 32331 48483 49516 49915 46961 49269 55775 41064 32864 37833 48210
13091D8210k69m419m275o79n303l465j6567K129j330J3165Q70O546K581p509l104
$$ 48210 47941 43522 39247 38568 33265 29800 13233 15362 14032 27197 28067 34613 37194 29685 26581
13076B6581k958j016r013l792r925J5363J5358K640j9963j0227J6018J0186j0314
$$ 26581 23623 22607 13594 9802 -123 15240 30598 33238 13275 3048 19066 29252 18938
13063A8938J775P676M643j852P368L817k7141j1142J3163J7475k518l867j702
$$ 18938 20713 28389 33032 31180 38548 42365 15224 4082 17245 34720 32202 28335 26633
13050B6633J3810j6072n99q208j7256K329R106l010R942J293O997P738p773p063
$$ 26633 40443 24371 23772 15564 -1692 637 9743 6733 16675 17968 24965 32703 24930 17867
13036A7867R108N630p080p015j5051q156Q404L750R357N80J0483J1472R49j9766
$$ 17867 26975 32605 25525 18510 3459 -4697 3707 7457 16814 17394 27877 39349 40298 20532
13022B0532j1387k765p093J0350J712o650M579J5004K3169J7730j291j4786K797
$$ 20532 9145 6380 -713 9637 11349 4699 9278 24282 47451 65181 63890 49104 51901
13009E1901L425p019o704l1760k0302O86K2549J5365r343j8042Q653M270o84M382
$$ 51901 55326 48307 41603 9843 -10459 -9773 12776 28141 18798 756 9409 13679 12995 17377
12995A7377J550J999j3748j1193j769K0759K1245N695p421l529O862n635j3799
$$ 17377 18927 20926 7178 -4015 -5784 14975 36220 41915 34494 30965 37827 32192 18393
12982A8393k857N59J0292J902J1257o211M573n528Q42J3671R506J1955L5093K6209
$$ 18393 15536 16095 26387 28289 39546 33335 37908 32380 33222 46893 56399 68354 103447 129656
12968A29656L7083M6809N4613K9242l1984o8125m9940l0319m753k2650j2043j358
$$ 129656 166739 213548 268161 297403 265419 197294 147354 117035 112282 89632 77589 76231
12956G6231J2307K136j600J1808J3777J4967R490mp687R433J1897k534L13m900
$$ 76231 88538 90674 89074 100882 114659 129626 139116 139112 131425 140858 152755 150221 150534 145634
12942A45634J8494K7361K4897M5111L1203o165l1967l0985l9191m0552r553N191
$$ 145634 164128 191489 216386 261497 292700 286535 254568 223583 184392 143840 134287 139478
12930A39478K6220J8677q611k6178j7774M299M646l95p228j8546n840N958p752
$$ 139478 165698 184375 175764 149586 131812 136111 140757 140362 133134 114588 108748 114706 106954
12917A06954m600m192n255J1104K7450L8676M2726O7256M8057k1796p0080m9064
$$ 106954 102354 98162 92907 104011 131461 170137 212863 280119 328176 306380 236300 187236
12905A87236m7305l6950l0542j2864j0810r100P093P705o610j3806q658r561j3209
$$ 187236 139931 102981 72439 59575 48765 39665 46758 54463 47853 34047 25389 15828 2619
12892B619Q453J7319K186j3327o734j0805L673J0700R126N815n896P205N898j3228
$$ 2619 11072 28391 30577 17250 10516 -289 3384 14084 23210 29025 23129 30334 36232 23004
12878B3004j7411j3310j6746n812J7549J3155j685K929R702p906j3149k04J3077
$$ 23004 5593 -7717 -24463 -30275 -12726 429 -1256 1673 11375 3469 -9680 -9884 3193
12865C193L1055J4972q286j458j4341o556j367Q300Q689j234k322l977j7552q703
$$ 3193 34248 49220 40934 39476 25135 18579 17212 25512 34201 32967 30645 26668 9116 413
12851D13J6148L926L731M146L040J116o004L553M158Q493Q54q684n62J4336j0466
$$ 413 16561 20487 24218 28364 31404 32520 26516 30069 34227 42720 43574 34890 34328 48664 38198
12836C8198j7872j3945J6885J7950J5541p474r514M144N048q046k893m790J0255
$$ 38198 20326 6381 23266 41216 56757 49283 39769 43913 48961 40915 38022 33232 43487
12823D3487R159q905L589l033n2o854o817j2196o376Q002J6951N311J971j30j193
$$ 43487 52646 43741 47330 44297 44245 37391 30574 18378 12002 20004 36955 42266 44237 44107 42914
12808D2914N587r305K185p635p534j0696O44Q266K0274Q248J719l131j1732J620
$$ 42914 48501 39196 41381 33746 26212 15516 16160 24426 44700 52948 54667 51536 39804 41424
12794D1424L145R476l67q311K43n911j7893J0821Q003N538k587n43r227m098k738
$$ 41424 44569 54045 53678 45367 45610 39699 21806 32627 40630 46168 43581 43038 33811 29713 26975
12779B6975l335j238J833n56l701j820K181k093J903k144O692O913j6437j0756
$$ 26975 23640 22402 24235 23679 19978 18158 20339 18246 20149 18005 24697 31610 15173 4417
12765D417J3095Q680j166p94J8934J2210k1958l221J6503Q346n767j1005l499
$$ 4417 17512 26192 25026 24232 43166 55376 33418 30197 46700 55046 49279 38274 34775
12752C4775J9469J1357M902n067M784J6046N288J979J6776K1460L1340M6975P7709
$$ 34775 54244 65601 70503 65436 70220 86266 91554 93533 110309 131769 163109 210084 287793
12739B87793R6034R8433Q2866Q5005P8003N3861l055m7124o6847r8287j05342
$$ 287793 383827 482260 565126 650131 728134 781995 778940 731816 664969 566682 461340
12728D61340q6145q2878p5124n4630k0403k5282k8761p772O451N447n564j7841
$$ 461340 375195 292317 217193 162563 142160 116878 88117 80345 86796 92243 86679 68838
12716F8838L630J030r754M553J0668P992q173k9668j9601m822N161j410L102K4403
$$ 68838 72468 73498 63744 68297 78965 86957 78784 49116 29515 24693 29854 28444 31546 55949
12702E5949J4928j4537l431r345k001L210j0234n914O535N176K814p252q905N022
$$ 55949 70877 56340 52909 43564 41563 44773 34539 28625 35160 40336 43150 35898 26993 32015
12688C2015q979m489L692J1678P693M381j2024p905L108j385J9291J656j1003
$$ 32015 23036 18547 22239 33917 41610 45991 33967 26062 29170 27785 47076 48732 37729
12675C7729k050J1301j6053n374m589Q309J0963m069k313j0007K161K505k143
$$ 37729 35679 46980 30927 25553 20964 29273 40236 36167 33854 23847 26008 28513 26370
12662B6370J063M272J5161M420l122R90k053K711r132l021l229L15O062N418j6377
$$ 26370 27433 31705 46866 51286 48164 49154 47101 49812 40680 37659 34430 34745 40807 46225 29848
12647B9848L078J9412k815Q029l123q277P153k322Q205K147j4400j1636R348J0617
$$ 29848 32926 52338 49523 57552 54429 46152 53305 50983 59188 61335 46935 35299 44647 55264
12633E5264J0636O841n051K131M573M37N608N338Q969J910N12r903M051J4320
$$ 55264 65900 72741 67690 69821 74394 74831 80439 85777 94746 96656 97168 87265 91316 105636
12619A05636J3179J1680K0449L6163K8918K4545L2601L4636K9913K0338J9951
$$ 105636 118815 130495 150944 187107 216025 240570 273171 307807 337720 358058 378009
12608C78009O2795Q1361J05182J55547J68750J30629R8157M5858k2595r0133j35297
$$ 378009 440804 522165 627347 782894 951644 1082273 1180430 1226288 1203693 1113560 978263
12597I78263j46190j66340j64054j12784q1487n5466l4694k4832l4488j4915m543
$$ 978263 832073 665733 501679 388895 307408 251942 217248 192416 157928 143013 138470
12586A38470p274k2458m599j4761j7236K826J2210Q829L283J1157L291J729P516
$$ 138470 131196 108738 104139 89378 72142 74968 87178 96007 99290 110447 113738 115467 122983
12573A22983M209q792m488J0083K149J755o475j7837j1673Q644J3614N138j975
$$ 122983 127192 118400 113912 123995 126144 127899 121424 103587 91914 100558 114172 119310 117335
12560A17335j0368K61J829m725k0136k1433k387R935n289J586n377j327r642m562
$$ 117335 106967 107228 109057 104332 84196 62763 60376 70311 65022 66608 61231 59904 50262 45700
12546D5700j0165n854o725k731J2452K2545K7092N553r414k0947j2937O286J9449
$$ 45700 35535 29681 22956 20225 32677 55222 82314 87867 78453 57506 44569 50855 70304
12533G0304K0126Q571M944n398l9P373r358o763K015o558j983J2958j2758j4569
$$ 70304 90430 99001 103945 98547 98508 105881 96523 89760 91775 85217 83234 96192 83434 68865
12519F8865K679n343P60N689r541j326j1835k710O361P804N66R632O799n712r776
$$ 68865 71544 66201 66961 72650 63109 61783 49948 47238 53599 61403 61969 71601 78400 72688 62912
12504F2912j2548N971K0906o710q712j0300l357N687K0325J3926R195K929O023
$$ 62912 50364 56335 77241 70531 61819 51519 48162 53849 74174 88100 97295 100224 106247
12491A06247N455J6264P326j3366J750O432J335k241p416l082L948M985j0072
$$ 106247 111702 127966 135292 121926 123676 130108 131443 129202 121786 118704 122652 127637 117565
12478A17565L336m289N608k111L089j311L261N201j1606p785O641K668j630K921
$$ 117565 120901 116612 122220 120109 123198 121887 125148 130349 118743 110958 117599 120267 118637 121558
12464A21558K189k183r690N777Q75k385Q955R750R793O830M582M486K075O977
$$ 121558 123747 121564 111874 117651 118526 116141 125096 134846 144639 151469 156051 160537 162612 169589
12450A69589L922j3636J6777K8810J3870n712J5377K4009J6585m570l801k2336
$$ 169589 173511 159875 176652 205462 219332 213620 228997 253006 269591 265021 261220 238884
12438B38884o764j9114j8560m799r299j8644j6366k3777n617J4960K442L06J2117
$$ 238884 232120 213006 194446 189647 180348 161704 145338 121561 115944 130904 133346 133652 145769
12425A45769N377q357M232n082m498q69N869J0072r23P382J7093J5488m398P126
$$ 145769 151146 142789 147021 141939 137441 136572 142441 152513 151590 158972 176065 191553 187155 194281
12411A94281J6627K277J0138J1562M136M315m061r999j239P30n148J1566J3133
$$ 194281 210908 213185 223323 234885 239021 243336 239275 229276 228037 228767 223619 235185 248318
12398B48318J7563K6307O761o527p035o504n35J5011K8504K4016K0108J1142J6152
$$ 248318 265881 292188 298949 292422 285387 278883 278348 293359 321863 345879 365987 377129 393281
12385C93281R827K6951M2130J2445L6306N0393O9192J12337J47279J75704J93326
$$ 393281 403108 430059 472189 484634 520940 571333 640525 752862 900141 1075845 1269171
12374A269171J59529J41761J11422M0719p0528j04067j08544j16331j43355j24587
$$ 1269171 1428700 1570461 1681883 1722602 1652074 1548007 1439463 1323132 1179777 1055190
12364A055190j06881m9933j4252r68J169R929L041J4333L5694K8613L8217M0852
$$ 1055190 948309 898376 884124 883156 884325 894254 897295 911628 947322 975935 1014152 1055004
12352A055004M1581N2832N9776P2091P7340Q6927J01066J04941J13068J24253
$$ 1055004 1096585 1149417 1209193 1281284 1358624 1445551 1546617 1651558 1764626 1888879
12342A888879J22790J50869J71455K06327K36917K99551M05698N25940O83806
$$ 1888879 2011669 2162538 2333993 2540320 2777237 3076788 3482486 4008426 4692232
12333D692232Q50497R29109R98724J056054J090043J083739J139664J407247J934237
$$ 4692232 5542729 6471838 7470562 8526616 9616659 10700398 11840062 13247309 15181546
12324A5181546K791578M248302O681668J0524718J5694498K0475439K1835055
$$ 15181546 17973124 22221426 28903094 39427812 55122310 75597749 97432804
12317I7432804J9832530J7690101J4329955N095554p306612j5079640j7751222
$$ 97432804 117265334 134955435 149285390 154380944 147074332 131994692 114243470
12310A14243470k0186787k1912246j9732218j4589859r657964o218801m027031
$$ 114243470 94056683 72144437 52412219 37822360 28164396 21945595 17918564
12303A7918564k661120j843159j310840r90959r27558r96283j016571r66572r38731
$$ 17918564 15257444 13414285 12103445 11112486 10184928 9188645 8172074 7205502 6266771
12294F266771r11631q06520o44169n09214m01780l35143k54914k06108j86968
$$ 6266771 5355140 4548620 3904451 3395237 2993457 2658314 2403400 2197292 2010324
12285B010324j67083j45523j30345r8045q5305q9101r6473p4376o0333n3370m6969
$$ 2010324 1843241 1697718 1567373 1469328 1384023 1294922 1198449 1124073 1063740 1010370 963401
12274I63401n9077m7203m9276m6316l2346k9795k1624j7725m0078k9538l9648
$$ 963401 904324 857121 807845 761529 729183 699388 677764 660039 619961 590423 550775
12263E50775j3432j7904j2560j1349k2417j9378O399L071o654j5365j5533j7174
$$ 550775 537343 519439 506879 495530 473113 453735 460134 463205 456551 441186 425653 408479
12251D08479q438j5469k4087r438r285j5452q791J826L714O406N92j2807o524
$$ 408479 400041 384572 360485 351047 341762 326310 317519 319345 323059 329465 330057 317250 310726
12238C10726j4330j1194p191n234r436j1865o205m210q177j3853j459p183N914
$$ 310726 296396 285202 278011 272777 263341 251476 245271 241061 232884 219031 217572 210389 216303
12225B16303N638O038p351p326j9826j1200j5927j4657L433N056O892k817n585
$$ 216303 221941 227979 220628 213302 193476 182276 166349 151692 155125 160181 167073 164256 158671
12212A58671l48R982P479K730Q792n054j568r100J4463R18p201j518J0804K0964
$$ 158671 158323 168305 175784 178514 187306 182252 180684 171584 186047 186965 179764 178246 189050 210014
12198B10014L969K075J3577K729K7365L8870K0695J6944M5049M4063M0153N959
$$ 210014 213983 216058 229635 232364 259729 298599 319294 336238 381287 425350 465503 471462
12186D71462n3208p6832m6657l4115l9253j4774j3440j8387k3944L526K3978K3694
$$ 471462 418254 341422 294765 260650 221397 206623 193183 174796 150852 154378 178356 202050
12174B02050k49j8747l014R819J5169L298k4134j0283j2100K193K5514K2187K9463
$$ 202050 201801 183054 180040 189859 205028 208326 184192 173909 161809 164002 189516 211703 241166
12161B41166M6220L4113J3098j2827n0766l7347k4209k4209m221O244Q044O72
$$ 241166 287386 321499 334597 321770 271004 233657 209448 185239 181018 187262 195306 195978
12149A95978k680q946j1734k514j7724k3324k337J357q749j2151R538M723j1948
$$ 195978 193298 184352 172618 170104 152380 129056 126719 128076 119327 107176 116714 121437 109489
12136A09489R232M9098N7726N6710M9501K607m1116n1742n0583k9194j0814j2385
$$ 109489 118721 167819 225545 282255 331756 334363 293247 241505 190922 161728 150914 138529
12124A38529j1629o251N992r195j3254q23j8437r038o288l98K555M828M643oM27
$$ 138529 126900 120649 126641 117446 104192 103369 84932 75894 69606 69208 71763 76591 81234 81228 81655
12109H1655j0419j255K039K496J7677q703k2995J019j3665n693n389n364r332
$$ 81655 71236 69981 72020 74516 92193 83490 60495 61514 47849 42156 36767 31403 22071
12096B2071L348Q475J2236J28O505K0313l538j6113Q738J8381J2053m047p091
$$ 22071 25419 33894 46130 46258 52763 73076 69538 53425 62163 80544 92597 88550 81459
12083H1459R994J5662Q707j8248j9957P258N08j2041j2689N449R627l71K2Q980
$$ 81459 91453 107115 115822 97574 77617 84875 85383 73342 60653 66102 75729 75358 75380 84360
12069H4360M120J80M27j4228m213k744K616O31j2169O156K659m57l192L683m365
$$ 84360 88480 88660 89087 74859 70646 67902 70518 71149 58980 65136 67795 67338 64146 67829 63464
12054F3464l679J0985n58l241J6902J8903q314j5972o332m118r044k288J021J1789
$$ 63464 59785 70770 70212 66971 83873 102776 94462 78490 72158 68040 58996 56708 57729 69518
12040F9518O026q889l947m832L404J237k255n121M031O070O740J665r814j0515
$$ 69518 75544 66655 62708 57876 61280 62517 60262 55141 59172 65242 71982 73647 63833 53318
12026E3318K657j0667j1189N777M954j2812M825N298j1125n577J7773J0500j6336
$$ 53318 55975 45308 34119 39896 44850 32038 36863 42161 31036 25459 43232 53732 37396
12013C7396N914M457R888J1539K952J215l996M625M346k595L417J3857R173j2814
$$ 37396 43310 47767 57655 69194 72146 73361 69365 73990 78336 75741 79158 93015 102188 89374
11999H9374m035p584j0075L154l411L917K0477J3566l363j7568j1496R242j0281
$$ 89374 85339 77755 67680 70834 67423 71340 91817 105383 102020 84452 72956 82198 71917
11986G1917j0473K151J453P005j72J445L512P850K693o709N335K001M924k477
$$ 71917 61444 63595 65048 72053 71881 73326 76838 84688 87381 80672 86007 88008 92932 90455
11972I0455J341j615j0431j7748J4518L950j3083n698J1769R463Q054J1149n072
$$ 90455 91796 90181 79750 62002 76520 80470 67387 61689 73458 82921 90975 102124 97052
11959I7052r977j8959Q93P302K694J4143J3932J8028J3786o654J790j5173o839
$$ 97052 87075 68116 69009 76311 79005 93148 107080 125108 138894 132240 134030 118857 112018
11946A12018J001P570p492j4643p902p25k15k194Q643J1710q689M75K052k339
$$ 112018 113019 120589 113097 98454 90552 89827 89612 87418 96061 107771 99082 99557 101609 99270
11932I9270n354p257m329N206J2939r854o941K1143K3632K589j1385j1241R292
$$ 99270 93916 86659 82330 87536 100475 90621 83680 104823 128455 131044 119659 108418 117710
11919A17710K4361L1455j1533l2102o933r90o216l235Q652J1480J1510J2492K8279
$$ 117710 142071 173526 161993 129891 122958 121968 115752 112517 121169 132649 144159 156651 184930
11906A84930J5761J1700N370j1315J1516L506r278M883K5036L5738K8947M7925
$$ 184930 200691 212391 217761 206446 217962 221468 212190 217073 242109 277847 306794 354719
11894C54719P5818R7593J13051J03215J04874N8941j233m6193p3931r0366r0302
$$ 354719 430537 528130 641181 744396 849270 908211 906978 860785 786854 696488 606186
11883F06186p9780q4486o7700m3293l7415k2517j8100j2646J2654K7237L5174
$$ 606186 526406 441920 374220 330927 293512 270995 252895 240249 252903 280140 315314
11872C15314M6450N7302q551o6473n2380m2361j6325l689n586K01K3383K0246
$$ 315314 361764 419066 410515 344042 291662 249301 232976 229287 223701 223902 247285 267531
11860B67531l925j118J3205r892m942o120k2326j5q387j3560r631n218j2476J1437
$$ 267531 263606 262488 275693 265801 260859 254739 232413 232398 224011 210451 200820 195602 183126 194563
11846A94563N613Q927l688j039K1641L0331K3334O950j3869l3135k6499k505l593
$$ 194563 200176 209103 205415 204376 226017 256348 279682 286632 272763 239628 213129 210624 207031
11833B07031n660J6017j697q426J4333K7659P856J2242J1618J936j9156j7990
$$ 207031 201371 217388 215691 207265 221598 249257 257113 269355 280973 282909 263753 245763
11821B45763l857P293N238J6179K2591K0701J2442J4883J8185K0600L0698N7798
$$ 245763 241906 249199 254437 270616 293207 313908 326350 341233 359418 380018 410716 468514
11809D68514N1178M2393J2306K3235K9439J9018j470k8125m2794k2277j3539m767
$$ 468514 519692 562085 574391 597626 627065 646083 644613 616488 573694 551417 537878 533111
11797E33111m154J5224J6555p264J0805J4846J5658J7169J9654K1946L2610M7088
$$ 533111 528957 544181 560736 553472 564277 579123 594781 611950 631604 653550 686160 733248
11785G33248L3013M5047O5151N3345N4501N2639L7652P1223R4162J04124J23407
$$ 733248 766261 811308 876459 929804 984305 1036944 1074596 1145819 1239981 1344105 1467512
11774A467512J55710J94829K33218K68309L44289M36157N37861O64334P33621
$$ 1467512 1623222 1818051 2051269 2319578 2663867 3100024 3637885 4302219 5035840
11765E035840Q38825J138152J677781K556670L881003O058977R534572J3376857
$$ 5035840 5874665 7012817 8690598 11247268 15128271 21187248 30721820 44098677
11757D4098677J3041133K941376r937071j3677258j0494655o672126m109961k530944
$$ 44098677 57139810 60081186 50144115 36466857 25972202 19300076 15190115 12659171
11749A2659171j467743n95367J50667R77826K084949L380796L147329J96417j672703
$$ 12659171 11191428 10596061 10746728 11724554 13809503 17190299 20337628 20534045 18861342
11740A8861342j63314K690983M816238L326316j753543m123178k264144P17220
$$ 18861342 18698028 21389011 26205249 29531565 27778022 23654844 21390700 22107920
11732B2107920L761139P040470R751301R095874L655125l610558q903201r424264
$$ 22107920 25869059 32909529 42660830 51756704 55411829 51801271 42898070 33473806
11724C3473806o495342k841828O03802L118997K142236k628673n054938l283068
$$ 33473806 26978464 24136636 24740438 27859435 30001671 27372998 22318060 19034992
11716A9034992m37659J398421L11650k768770l608632k374475j166896l93688
$$ 19034992 18597333 19995754 20307404 17538634 13930002 11555527 10388631 9994943
11708I994943J72714Q18848J690287K917049M778063P632716J1151598J2185957
$$ 9994943 10167657 10986505 12676792 15593841 20371904 28004620 39156218 51342175
11700E1342175N206946p183496j3202436j1224176p418938m665939l044905k079150
$$ 51342175 56549121 49365625 36163189 24939013 17520075 12854136 9809231 7730081
11692G730081j404705r81732p28400o08932n56129n00194m04387l06574k43839
$$ 7730081 6325376 5343644 4615244 4006312 3450183 2949989 2545602 2239028 1995189
11683A995189j95259j72601j59016j33618j11680r1564r9224q8406p2583n6199
$$ 1995189 1799930 1627329 1468313 1334695 1223015 1131451 1032227 943821 871238 815039
11673H15039m8254m1849l9822k8723k6231l5472l1446j8598k8038l7931k2658
$$ 815039 766785 724936 685114 656391 630160 594688 563242 544644 516606 478675 456017
11662D56017k3760k1066j1214J3121L719j6277j8338j9601j5771l373q36j6760
$$ 456017 432257 411191 399977 413098 416817 400540 382202 362601 346830 343457 342621 325861
11650C25861k2409k1229N820L748q175o184l38j4259k900J730J0115M69L269j0361
$$ 325861 303452 282223 288043 291791 283616 277432 277094 262835 259935 261665 271780 272249 275518 265157
11636B65157j3730j028j8432l0312R3J807K449O936l330k590p462o287J4154J2898
$$ 265157 251427 250399 231967 201655 201748 203555 206004 212940 209610 207020 199558 193271 207425 220323
11622B20323p041P556l822r649N273j555k2421j9668L962L452q730p513m760O253
$$ 220323 213282 220838 217016 207367 212640 211085 188664 168996 172958 176410 167680 160167 155407 161660
11608A61660j7777k1456m307l154J3393K203k2791j1380J6156R253M258m446R630
$$ 161660 143883 122427 118120 114966 128359 130562 107771 96391 112547 121800 126058 121612 131242
11595A31242m686L898L591J2321Q790R65K606J9469N1384N6947J1777l4770l2408
$$ 131242 126556 130454 134045 146366 155156 156121 158727 178196 229580 286527 298304 263534 231126
11582B31126k2874k89R028j497L184L080K7580N9724R3397J75727K61395L92683
$$ 231126 208252 207963 216991 215494 218678 221758 249338 309062 402459 578186 839581 1232264
11570A232264M52362K69238o8685l60158m77965l50571k18032j35829q4430n4991
$$ 1232264 1684626 1953864 1885179 1525021 1047056 696485 478453 342624 258194 203203
11560B03203l6976j5002j644j0717p712l148l925r559L284n76p934R368n978o166
$$ 203203 166227 151225 149581 138864 131152 128004 124079 114520 117804 117228 109294 118662 112684 106518
11546A06518m792o561n27L086j7377j7126L716J1137K3403J643o490J777L202
$$ 106518 101726 95165 94638 97724 80347 63221 66937 78074 101477 103120 96630 98407 101609
11533A01609O420O078Q378K3339m75n207j1438m688J5083J2367J3638J0411J0372
$$ 101609 108029 114107 122485 145824 145349 140142 128704 124016 139099 151466 165104 175515 185887
11520A85887L1167K2410L2250L4723M1307N1133L7886L8432K1758k7611n6461
$$ 185887 217054 239464 271714 306437 347744 398877 436763 475195 496953 469342 412881
11509D12881o2201m7623m1674k9059k0787j7727j372P629o963j1515m190J2194
$$ 412881 350680 303057 261383 232324 211537 193810 192438 200067 193104 181589 177399 189593
11497A89593K1634J0165J3268K0255M0306M2786L2469K5237L4663K5820M330J1312
$$ 189593 211227 221392 234660 254915 295221 338007 370476 395713 430376 456196 460526 471838
11485D71838K1858P242j4434j9146p598j4273k8128k7031l0816m7037l7248m2078
$$ 471838 493696 500938 486504 467358 459760 445487 417359 390328 359512 312475 275227 233149
11473B33149m4331j0755l127k3728j2991q10J0598P295J0346N754L7549M5833
$$ 233149 188818 178063 174936 151208 138217 137407 148005 155300 165646 171400 208949 254782
11461B54782K3858O839J5747L6348M5101J3465L136j5577m4791n3945m6168l6573
$$ 254782 278640 285479 301226 337574 382675 396140 399276 383699 338908 284963 238795 202222
11449B02222l7113l3433j4498k0615p843l222q802o649O853j1499R99L242k530
$$ 202222 165109 131676 117178 96563 88720 85498 76696 70047 76900 65401 66400 69642 67112
11436F7112l037O103K345P214M5m223r977K718j064o085k125Q552L817K226o6
$$ 67112 64075 70178 72523 79737 79782 75559 65582 68300 67236 61151 59026 67578 71395 73621 73555
11421G3555j0845J0591J8682M440M188L515j0676k3180K136l695n908K0063K2561
$$ 73555 62710 73301 91983 96423 100611 104126 93450 70270 72406 68711 62803 82866 105427
11408A05427J8290K887M548J1025P090j0237K54j1729J430J0270R717o270J0961
$$ 105427 123717 126604 131152 142177 149267 139030 139284 127555 128985 139255 148972 142702 153663
11395A53663R771R851K3856K5584J1790q435j1963k5406l6241l6446j1061j3193
$$ 153663 163434 173285 197141 222725 234515 226080 214117 188711 152470 116024 104963 91770
11383I1770n611N076r384j8054j5707P979N044j9622m775j3136J504J4490K1084
$$ 91770 86159 91235 81851 63797 48090 56069 61113 41491 36716 23580 25084 39574 60658
11370F0658Q770J325j427K2016K0814j2296j5838M524P520J1014J1656q136l95
$$ 60658 69428 70753 69326 91342 112156 99860 84022 88546 96066 107080 118736 110600 110205
11357A10205J3099q005l975j8772j3403J285j480Q564O951K1950M093o507j3470
$$ 110205 123304 115299 111324 92552 79149 80434 78954 87518 94469 116419 120512 114005 100535
11344A00535q351j60K1813Q55j7570k17O448l01j044O344O899R38j5684j1933
$$ 100535 92184 92024 113837 114692 97122 96905 103353 103052 102008 108352 115251 116189 100505 88572
11330H8572J25j1680L310K7812K3713M5141N3407K5320M0644P3677P6154M4244
$$ 88572 88697 77017 80327 108139 131852 176993 230400 255720 296364 370041 446195 490439
11318D90439j6212n4907p9678o4428m6521l1455q330L849M246Q889J3344J1881
$$ 490439 474227 419320 339642 275214 228693 197238 188908 192757 197003 205892 219236 231117
11306B31117J9117J6044K772l512J5852K3682J1642m26j4660j9174l23Q015L6550
$$ 231117 250234 266278 269050 265538 281390 305072 316714 316288 301628 282454 282131 290146 326696
11293C26696M7091L9058M433j5547l2187l9882k3724k2925j468K774K9317J9164
$$ 326696 373787 412845 417278 401731 369544 329662 305938 283013 281545 284319 313636 332800
11281C32800N62k616K5694K1668K5584K1751j8683j8157k0489J1240M3686N4959
$$ 332800 333362 330746 356440 378108 403692 425443 406760 388603 368114 379354 423040 477999
11269D77999K4701j893j5895l4632m2596l11J6968j8413m1618o1221m0719o714
$$ 477999 502700 500807 484912 450280 407684 407373 424341 405928 364310 303089 262370 255656
11257B55656J831m109m545L554j309j2320k2565j7124q17J0851Q06N074K7780
$$ 255656 257487 253378 248833 252387 251078 238758 216193 199069 198252 209103 209909 214983 242763
11244B42763Q248n223R70J0660J6283o923j2676R230J3516o456j1390j494J6080
$$ 242763 251011 245788 246758 257418 273701 266778 254102 263332 276848 270392 259002 257508 273588
11231B73588K9345J9189J4428O416o559j3390l767O420K4455J6714n723O116p500
$$ 273588 302933 322122 336550 342966 336407 323017 319250 325670 350125 366839 361116 367232 359732
11218C59732P120M916J4455J6283J0645m610K0144K3642J5583P742L595J1849
$$ 359732 366852 371768 386223 402506 413151 408541 428685 452327 467910 475652 479247 491096
11206D91096R692O008J264J7911L1354L5274L2087J0345K6507M9553N5231M8927
$$ 491096 500788 506796 508060 525971 557325 592599 624686 635031 661538 711091 766322 815249
11194H15249M5508L0721M5418L5715J8002J7042R477K9154M8975M4932N2446O9637
$$ 815249 860757 891478 936896 972611 990613 1007655 1017132 1046286 1095261 1140193 1192639 1262276
11182A262276P4432Q7792Q5592Q3190R0594J01202J04222J18958J35163J52860
$$ 1262276 1336708 1424500 1510092 1593282 1683876 1785078 1889300 2008258 2143421 2296281
11172B296281J72506J75365J78885J92040J85649J93346K22117K95509L99921
$$ 2296281 2468787 2644152 2823037 3015077 3200726 3394072 3616189 3911698 4311619
11163D311619N39087O50682Q17274J075323J452354J868150K185533K317486K204182
$$ 4311619 4850706 5501388 6318662 7393985 8846339 10714489 12900022 15217508 17421690
11154A7421690K185214K734377M118149O535182J0266828J6467430K7462409M6898741
$$ 17421690 19606904 22341281 26459430 32994612 43261440 59728870 87191279 134090020
11146A34090020P5214685R1966300N8886544n473216o6860331r2030404p0209128
$$ 134090020 209304705 301271005 360157549 354684333 287824002 195793598 125584470
11139A25584470m2140015k4783939j5301119r862828o486834m301729k988853
$$ 125584470 83444455 58660516 43359397 33496569 27009735 22708006 19719153
11132A9719153k338965k063643k009110j856147j637847j366451j092456q58203
$$ 19719153 17380188 15316545 13307435 11451288 9813441 8446990 7354534 6496331
11124F496331p13292n98237n46698n01582m60253l91715l04701k46714k17117
$$ 6496331 5783039 5184802 4638104 4136522 3676269 3284554 2979853 2733139 2516022
11115B516022j77399j58366j37096j19575j17225j06586j00935r0977q1525q0588
$$ 2516022 2338623 2180257 2043161 1923586 1806361 1699775 1598840 1507863 1426338 1345750
11105A345750o9509m2714l6127k9475n0594q0418p9309r0128o9920m1259k1691
$$ 1345750 1276241 1233527 1197400 1167925 1117331 1036913 957604 867476 797556 756297 734606
11094G34606j7051k0072k5960k3214M823j509j3439j2558k747M720m140k6991
$$ 734606 717555 697483 671523 648309 653132 651623 638184 625626 622879 627599 623459 596468
11082E96468m7062m3955k6621n692k1454k8596j467N793o32j0497q826k11r106
$$ 596468 549406 505451 478830 473138 451684 423088 421621 427414 426782 416285 407459 407248 398142
11069C98142p959j7012j6862Q31j0276r532j768j4624K457J853k6609k2507j2936
$$ 398142 390183 373171 356309 357140 346864 337332 335564 320940 323397 325250 298641 276134 263198
11056B63198O761p731j9888n603m693r546q783l41n539m081L536Q773R704J3112
$$ 263198 269959 262228 242340 236737 232044 222498 213715 213374 207835 203754 207290 216063 225767 238879
11042B38879J8096L556O33K487j1816k8566m29J1994n945j6686j3257p974K2807
$$ 238879 256975 260531 261164 263651 251835 223269 222840 234834 228889 212203 198946 190972 213779
11029B13779K0851O190M629J8843L5122K2146L690n804l1071j7208l893q363m749
$$ 213779 234630 240820 245449 264292 299414 321560 325250 319446 288375 271167 267274 258911 254162
11016B54162J8575J3792J0983k7492m8325k0281J8458L9710N6437M7537J4575
$$ 254162 272737 286529 297512 270020 221695 201414 219872 259582 316019 363556 378131
11005C78131k3277l4417n2965m5324k2430O406O096j8070j1532j6885j7649M743
$$ 378131 354854 320437 267472 222148 199718 206124 212220 194150 182618 165733 148084 152827
10993A52827J288p545j2041k5255j787q376p584K2711J4659m984J217O270J0694
$$ 152827 154115 146570 134529 109274 107487 99111 91527 114238 128897 123913 125130 131400 142094
10980A42094K7263K7945K9138K7578K6523M9816P6949J05584J38948J71037K50354
$$ 142094 169357 197302 226440 254018 280541 330357 407306 512890 651838 822875 1073229
10969A073229L29846M15729M52133L29366k3868l68781n21254m49241l05374k12382
$$ 1073229 1403075 1818804 2270937 2600303 2576435 2207654 1686400 1237159 931785 719403
10959G19403j47960j18494j01047o6468l8723k6383j9844k0842j1174j3395k3793
$$ 719403 571443 452949 351902 285434 246711 220328 200484 179642 168468 155073 131280
10948A31280j5989O3j0201j0587L885n458j6885j2511j9675J029M957J6711Q458
$$ 131280 115291 115354 105153 94566 98451 92993 76108 63597 43922 44951 49908 66619 75077
10935G5077J2332J3075r432j3367k034l829j2047k212k541j3104Q346Q49m822
$$ 75077 87409 100484 91052 77685 75651 71822 59775 57563 55022 41918 50264 51113 46291
10922D6291j0557k506q81N735K3280K4965J4583Q639m619q685J934J1665n167
$$ 46291 35734 33228 32347 38082 61362 86327 100910 109549 104930 96245 98179 109844 104677
10909A04677j2779J470k383m513j0282J67Q281L459J1468R78j6284j2901j3443
$$ 104677 91898 93368 90985 86472 76190 76357 84638 88097 99565 100543 84259 71358 57915
10896E7915n496M52K012m673M107J1423J4441R562l741L860o064K214q533m169
$$ 57915 52419 52871 54883 50210 54317 65740 80181 89743 86002 89862 83798 86012 77479 73310
10882G3310L226J1626K378K1451K8825K9801L460J1317L8652M0391N4325P8062
$$ 73310 76536 88162 90540 111991 140816 170617 174077 185394 224046 264437 318762 396824
10870C96824J31969K11789L61585M88827L81397p3612m55282m69059l17544j86597
$$ 396824 528793 740582 1102167 1590994 1972391 1898779 1443497 974438 656894 470297
10860D70297p6910p3150o1078l6429k5313j3702M677j7303k4505j9214r793j134
$$ 470297 393387 320237 259159 222730 197417 183715 188392 171089 146584 127370 117577 116443
10848A16443j304j1257j2134l562m839M967J570o159q345j1008P522o003J2136
$$ 116443 115139 103882 91748 88186 83347 88314 89884 83725 75380 64372 71894 65891 78027
10835G8027J4630j073j0019L727l877j0245j3349j568p282k2635p947M381P140
$$ 78027 92657 91584 81565 85292 81415 71170 57821 56253 48971 26336 18389 22770 29910
10822B9910J5464J0323J292K400Q017n401Q667M75r423q628k0232K778R581J555
$$ 29910 45374 55697 56989 59389 67406 62005 70672 71147 61724 53096 32864 35642 45223 46778
10808D6778L819Q725J0644p551j6726o821M259N060J3364l173n428J4985j39k827
$$ 46778 50597 59322 69966 62415 45689 38868 43127 48187 61551 58378 52950 67935 67796 64969
10794F4969m872j2134j0216q992k400K540N982J2030n077n224J953j323l559m803
$$ 64969 60097 47963 37747 28755 26355 28895 34877 46907 41830 36606 38559 37236 33677 28874
10780B8874N753M695J3903j776n868Q505J6351o726p393J4982Q593o105j6314
$$ 28874 34627 39322 53225 51449 45581 54086 70437 63711 56318 71300 79893 73788 57474
10767E7474q39M497l409j3561j3351n155N472m52j7388m014J6618J7016M46L65
$$ 57474 56635 61132 57723 44162 30811 25656 31128 30676 13288 9274 25892 42908 43354 43719
10753D3719J0311O859J589q620K278O982n082j99m185J3301J1490n891j4889K699
$$ 43719 54030 60889 62478 53858 56136 63118 58036 57837 53652 66953 78443 72552 57663 60362
10739F0362j2171m913J2191O336J4147J4374K192j0248M953j0079k813J8257K1991
$$ 60362 48191 43278 55469 61805 75952 90326 92518 82270 87223 77144 74331 92588 114579
10726A14579L409L115J8108L784P686K2256L3120L4753N0796J03715J66291K71383
$$ 114579 117988 121103 139211 142995 150681 172937 206057 240810 291606 395321 561612 832995
10714H32995M22221M71056K51077q6118l69258m49657l23434j99973j10915p4956
$$ 832995 1255216 1726272 1977349 1891231 1521973 1072316 748882 548909 437994 363038
10704C63038n1210k7923o149o404j2787j3582m508P673l78k2281k4995l3973k1343
$$ 363038 311828 283905 277756 271352 258565 244983 240475 248148 247770 225489 200494 166521 145178
10691A45178n292o966k0528q736l873j3393q154j0062k141K035K995j2437o860
$$ 145178 139886 132920 112392 103656 99783 86390 78236 68174 66033 68068 71063 58626 51766
10678E1766O755J6232N971K354M591q185J335j302l448J2260J2950L515o273o254
$$ 51766 58521 74753 80724 83078 87669 79484 80819 79517 76069 88329 101279 104794 98521 92267
10664I2267J3813J4413N656n634m950j8533k166n682o50N845J7560J6534J637
$$ 92267 106080 120493 126149 120515 115565 97032 94866 89184 88534 94379 111939 128473 130110
10651A30110N199o460k0913j2385Q505Q464J8576p37p596j6443k1620n224R457
$$ 130110 135309 128849 107936 95551 104056 112520 131096 130359 122763 106320 84700 79476 88933
10638H8933J9493K905m299n065k3889l9883j0263J7044L2714L6393K9171J5066
$$ 88933 108426 111331 107032 101967 78078 38195 27932 44976 77690 114083 143254 158320
10626A58320P618M094m29L363n65r60L354m361q674N056J0146p648p831p333k99
$$ 158320 165938 170032 169603 172966 172401 171441 174795 170434 161760 166816 176962 169314 161483 154150 153851
10611A53851J3663O301j196k361l488P166R485O054r382J0496Q613o336m356j2346
$$ 153851 167514 173815 172619 170258 166770 173936 183421 189475 180093 190589 199202 192866 188510 176164
10597A76164p200k431p575j3022k284O042m53P311J4134J8264J8530N52O164K0335
$$ 176164 168964 166533 158958 145936 143652 149694 149241 156552 170686 188950 207480 208032 214196 234531
10583B34531J8895K4472L0438J8793k652j3429J7052M4551M7456M8430L4228k6358
$$ 234531 253426 277898 308336 327129 324477 311048 328100 372651 420107 468537 502765 476407
10571D76407o7573q9780p3280m0148j6399K170o0J041R470P456K7494J7455m285
$$ 476407 408834 319054 245774 205626 189227 191397 191337 192378 201848 209304 236798 254253 249968
10558B49968j436L412o172j1595j0284N613L807N409P273R652K0591Q020J4198
$$ 249968 248532 251944 245772 234177 223893 229506 233313 238722 245995 255647 276238 284258 298456
10545B98456J1236J8345J9297J130j848m093l892K933J1666K2561M658L2357L1726
$$ 298456 309692 328037 347334 348464 346616 342523 338631 341564 353230 375791 380449 412806 444532
10532D44532J3258K026J4689L1142M0714L8914P1420Q3949J20020J98322L36170
$$ 444532 457790 459816 474505 505647 546361 585275 656695 740644 860664 1058986 1395156
10521A395156M99909O58522P26954L98659m04829q07891o48679l97956k24629
$$ 1395156 1895065 2553587 3280541 3679200 3274371 2466480 1817801 1419845 1195216
10512A195216j37740r9525r1161p2449m1772j2780J6774K6149R586J7640K1154
$$ 1195216 1057476 957951 866790 794341 752569 739789 756563 782712 792298 809938 831092
10501H31092M7484N9918L5307K9021L8944L2309M6878M8620J8989Q028K8996M1449
$$ 831092 878576 938494 973801 1002822 1041766 1074075 1120953 1169573 1188562 1196590 1225586 1267035
10489A267035P1016O3783O6931N6720O8520R8006J12879J04092J18018J23265
$$ 1267035 1338051 1401834 1468765 1525485 1594005 1692011 1804890 1908982 2027000 2150265
10479B150265J35406J64275J81896J87076K05140K28146K58519K59597K74829
$$ 2150265 2285671 2449946 2631842 2818918 3024058 3252204 3510723 3770320 4045149
10470D045149L30218M52021O50908Q93547J106487J074290P53845O75873J051415
$$ 4045149 4375367 4827388 5478296 6371843 7478330 8552620 9306465 9982338 11033753
10461A1033753J578161K150280K871084L629471M102170M589863O363071R882241
$$ 11033753 12611914 14762194 17633278 21262749 25364919 29954782 36317853 46200094
10453D6200094J5524355K4974221M1337794O7782606R6587649Q3933035r082913
$$ 46200094 61724449 86698670 128036464 195819070 292406719 376339754 367256841
10446C67256841r3258443r3548507o1109639l6726383k2907500j4960171j0078169
$$ 367256841 273998398 180449891 119340252 82613869 59706369 44746198 34668029
10439C4668029p068865n198681l874715k870717k169003j609308j097837p26256
$$ 34668029 27599164 22400483 18525768 15655051 13486048 11876740 10778903 10052647
10431A0052647m69943m70116q46653j074700r65584q00970o67187n74446m74744
$$ 10052647 9582704 9112588 8265935 7191235 6225651 5424681 4757494 4183048 3708304
10422C708304l74613k89640k22486j84875j87309j90335j55793j50973j29856
$$ 3708304 3333691 3044051 2821565 2636690 2449381 2259046 2103253 1952280 1822424
10413A822424q7119j01320r3047o7965n5430n8095m3690n2279o7352p5393p2878
$$ 1822424 1735305 1633985 1540938 1472973 1417543 1359448 1315758 1263479 1196127 1120734 1047856
10402A047856q6700p3519n5398l2177l8342k4935k1080j496n176J0890j3906l9358
$$ 1047856 961156 887637 832239 800062 761720 736785 715705 714209 709033 719923 706017 666659
10390F66659j0880k966j6128l0615l1602l7058k1932l977j0127j9673k5545n118
$$ 666659 655779 652813 636685 606070 574468 537410 515478 511501 501374 481701 456156 451038
10378D51038P489j4406k1222j4597q179N271J709j2865k3870j8909q828j4176
$$ 451038 458527 444121 422899 408302 400123 405394 407103 394238 370368 351459 342631 328455
10366C28455j8648r120l2275k36J2996n976l906n956l889K550k4880k1272j1950
$$ 328455 309807 300687 268412 268176 281172 275196 271290 265334 261445 263995 239115 217843 205893
10353B05893j5261q544N168N796J1770N067K868r719J3908J6134P950j4318m732
$$ 205893 190632 182088 187256 193052 204822 209889 212757 203038 216946 233080 241030 226712 221980
10340B21980o906j7872j36m793q199J9522J0790K548J4221J4213J9563R247J0783
$$ 221980 215074 197202 197066 192273 184074 203596 214386 216934 231155 245368 264931 274178 284961
10327B84961J2357k4143j9545j7319p964K087j4759Q330J1604N823m0052o1812
$$ 284961 297318 273175 253630 236311 228347 230434 215675 224005 235609 241432 201380 139568
10315A39568m5814o968R742O889l776j1356j8230m302R483K3515j414j670m134
$$ 139568 93754 86786 96528 103417 99641 88285 70055 65753 75236 98751 97337 95667 91533
10302I1533M43L712o539k2365j4756q225P586J362o609p813k285m447l211j5026
$$ 91533 91976 95688 89149 66784 52028 43803 51389 52751 46142 38329 36044 31597 28386 13360
10288A3360j1712l894N344N964N822J9273J7415J1662P926l147r302p582j5797
$$ 13360 1648 -2246 3098 9062 14884 34157 51572 63234 71160 68013 58711 51129 35332
10275C5332q786l695m446q191m30r784k678N564K3480K4315L4622L3305N373k1319
$$ 35332 26546 22851 18405 10214 9784 0 -2678 2886 26366 50681 85303 118608 123981 102662
10261A02662q623r863j4656j3988o411N434J1831P402k1374j8089M664Q210N675
$$ 102662 94039 84176 69520 55532 49121 54555 66386 73788 52414 34325 38989 47199 52874
10248E2874n599m859j2175j5148j5360j0758Q911O363Q541J6202K0656j7144k1849
$$ 52874 47275 42416 30241 15093 -267 -11025 -2114 4249 12790 28992 49648 32504 10655
10235A0655m498k230n426j279m637J8079J8249P651J4028P337j6251q206J7303
$$ 10655 6157 3927 -1499 -2778 -7415 10664 28913 36564 50592 57929 41678 33472 50775
10222E0775O841N675L678J601M728p504O14q491l111k49Q594O39o491J585l174
$$ 50775 57616 63291 66969 68570 73298 65794 66408 57917 54806 54557 63151 63790 57299 58884 55710
10207E5710j090N891J246k898n18j2379l45o925l366J2729k99L521K493J1063
$$ 55710 54620 60511 61757 58859 58341 45962 45617 38692 35326 48055 47756 51277 53770 64833
10193F4833M538k967j0005j6249k1076j1269K57N957J0286L561J330J8347J870
$$ 64833 69371 66404 56399 40150 19074 7805 8062 14019 24305 27866 29196 47543 49413
10180D9413r477o217K739Q31k928j3097j0805Q156P855r441L017J0811J2260N214
$$ 49413 39936 33719 36458 37289 34361 21264 10459 18615 26470 17029 20046 30857 43117 48331
10166D8331o077n157k685j0660m253q378o592J496m46O622O90N357J2822l064
$$ 48331 42254 37097 34412 23752 19499 11121 4529 6025 5579 12201 12891 18248 31070 28006
10152B8006p432r245R013O496j461K96J77r598l797K447r239J212J3021J5315
$$ 28006 20574 11329 20342 26838 25377 25673 25850 16252 12455 14902 5663 6875 19896 35211
10138C5211J2929l86q941P32n917k543k73O747l770R2J6847N828N130L788Q256
$$ 35211 48140 47754 38813 39545 33628 31085 30812 37559 33789 33881 50728 56556 61686 65474 73730
10123G3730J3977M398k588J3420J2474J4311L5141N6814P5345J28752J87293K54243
$$ 73730 87707 92105 89517 102937 115411 129722 164863 221677 297022 425774 613067 867310
10111H67310K43931R1938j64390k63514k27425j66239j10377o4004n6536m3263
$$ 867310 1111241 1203179 1038789 775275 547850 381611 271234 207230 150694 107431
10101A07431k5829j163k666J734J0994l344q903j5107q859K033j2593P150J0497
$$ 107431 81602 80439 77773 79507 90501 87157 78254 63147 54288 56321 43728 50878 61375
10088F1375M271k1150j5866O602R118p63j8488o999o69J134J2576K2655l092j9829
$$ 61375 65646 44496 28630 35232 44350 43587 25099 18100 17431 18565 31141 53796 50704 30875
10074C0875m144l664P820O444l84L582n417K464O33j1949m902N118J9613j905
$$ 30875 26731 23067 30887 37331 36947 40529 35112 37576 38209 26260 21358 26476 46089 44184
10060D4184M790K512k653j6776k499K252M603L0859J9626J0486R99J3393L3614
$$ 44184 48974 51486 48833 32057 29558 31810 36413 67272 86898 97384 98383 111776 145390
10047A45390O6030J24980J53716n1215j69073r8061m5018j5278j4028L036J4626
$$ 145390 211420 336400 490116 438901 269828 171767 126749 111471 97443 100479 115105
10036A15105M168l265J4496J8525K4475K2615L9386P0339J20104J79904L02321
$$ 115105 119273 116008 130504 149029 173504 196119 235505 305844 425948 605852 908173
10025I08173M27331M62581J59284l36123m81931l68008k28457j51881r1860o1626
$$ 908173 1335504 1798085 1957369 1621246 1139315 771307 542850 390969 299109 237483
10015B37483m1510l5683l2792j7445j8938j9731p135p954l294p726m490o814K511
$$ 237483 195973 160290 127498 110053 91115 71384 64249 56295 53001 45275 40785 33971 36482
10002C6482O2j156K268J2805R604j0365l0847p312R003q93N109R289j3018p0K4085
$$ 36482 36544 35388 37656 50461 60065 49700 18853 11541 20544 19651 24760 34049 21031 20961 45046
9987D5046R20m171n921n979j0042o802Q122o837k313R04L337j615N310r029j9503
$$ 45046 45966 41795 35874 29895 19853 13051 21173 14336 12023 12927 16264 14649 19959 10930 -8573
9972h573J291l214j244O040O151n994j659O258L436L902J8378J1662j0073j7048
$$ -8573 -7282 -10496 -11740 -5700 451 -5543 -7202 -944 2492 6394 24772 36434 26361 9313
9958I313l754n877J5139M714j1693j5250o768L394R473o4k656Q653M777l374j1603
$$ 9313 5559 -318 14821 19535 7842 -7408 -14176 -10782 -1309 -1373 -4029 4624 9401 6027 -5576
9943e576J327K3930N069r902j9452q844Q48K591N558J4776L553j3988l176j3509
$$ -5576 -4249 19681 24750 14848 -4604 -13448 -12600 -10009 -4451 10325 13878 -110 -3286 -16795
9929a6795K820L762o16K211O472p598r346J0249J2915q03l300Q523k42n865K310
$$ -16795 -13975 -10213 -10829 -8618 -2146 -9744 -19090 -8841 4074 3271 -29 8494 8252 2387 4697
9914D697P354N437l155M478N312o366r958K994R371N618N943Q256N575r360o558
$$ 4697 12051 17488 14333 18811 24123 17757 7799 10793 20164 25782 31725 39981 45556 36196 29638
9899B9638k626p550K025R280j328k674l916K0648O362k450p768k1429j240p68
$$ 29638 27012 19462 21487 30767 29439 26765 22849 43497 49859 47409 39641 18212 16972 16204
9885A6204j4139l59M214l48M103p21m718K163R398j2128m927N649K626q236j761
$$ 16204 2065 1706 5920 5572 9675 8954 4236 6399 15797 3669 -1258 4391 7017 -1219 -2980
9870b980l272P11K450M171J0908J3331Q216n926M664J0815j5695k3020L638k312
$$ -2980 -6252 -5541 -3091 1080 11988 25319 33535 27609 32273 43088 27393 4373 8011 5699
9856E699J2946J829j1532l873L520J1353J6569k839j1011p733k85j910j0230N083
$$ 5699 18645 20474 8942 5069 8589 19942 36511 33672 22661 14928 14643 12733 2503 7586
9842G586p23p914j894l666J6774J4074P003k304k0688q573j2327q949L109M701
$$ 7586 6863 -1051 -2945 -6611 10163 24237 31240 28936 8248 -325 -12652 -21601 -18492 -13791
9828a3791J5526Q378j6048R253L755m650L543l132o145N229q253o36P791l112
$$ -13791 1735 10113 -5935 3318 7073 2423 5966 2834 -3311 1918 -6335 -6971 820 -2292
9814b292j025J0852J757o947j5495K917J3244N368L14J316r839j2632o02J2813
$$ -2292 -3317 7535 9292 2345 -13150 -10233 3011 8379 8693 10009 170 -12462 -13064 -251
9800b51L228L263j4619n230l199r29J2702j83k903P045J6597Q315n195K429J7243
$$ -251 2977 6240 -8379 -13609 -16808 -17737 -5035 -5218 -8121 -1076 15521 23836 18641 21070 38313
9785C8313J9587M4759O8196Q0208K9392n5272n7509n3135l7258k8971n590l269
$$ 38313 57900 102659 170855 251063 280455 225183 167674 114539 77281 48310 42720 39451
9773C9451j2292j1330j038q038l922K608N81L104J4851p013l504L182K67k3862
$$ 39451 27159 15829 14791 6753 2831 5439 6020 9124 23975 16962 13458 16640 16907 -6955
9759f955p980R550R62j0190R381L2775M1711K8392k2145n4778l2752P954J7129
$$ -6955 -14935 -5385 -4423 -14613 -5232 27543 69254 97646 75501 20723 -12029 -4075 13054
9746A3054R285p644j6374l795J1157M806o275L829O484p172q878O345R175J0911
$$ 13054 22339 14695 -1679 -5474 5683 10489 4214 8043 14527 7355 -1523 4822 13997 24908
9732B4908K604r291n418R286R029n710m026N079n885n023J746K481L530j264j4304
$$ 24908 27512 18221 12803 22089 31118 25408 21382 26461 20576 15553 17299 19780 23310 22046 7742
9717G742j5021k356q983K91J1007m121l653k771J0310R086J2002J5623j546j2579
$$ 7742 -7279 -9635 -18618 -18327 -7320 -11441 -15094 -17865 -7555 1531 13533 29156 27610 15031
9703A5031k381j0986K766l110L621m041j383l115J2216N523j6798R0l894M518
$$ 15031 12650 1664 4430 1320 4941 900 -483 -3598 8618 14141 -2657 -2567 -6461 -1943
9689a943O541J6962Q990M919j2414o967J342P106q74m390j7418j722R459l301
$$ -1943 4598 21560 30550 35469 23055 16088 17430 24536 23662 19272 1854 132 9591 6290
9675F290q352O238L05J662J2133O42o374o905j110j1834l457M522q486N175J0053
$$ 6290 -2062 4176 4481 6143 18276 18918 12544 5639 4529 -7305 -10762 -6240 -14726 -9551 502
9660E02q099p376J267j682o365J1670J7272J5185j1754o760j233Q138Q745Q476
$$ 502 -7597 -14973 -13706 -15388 -21753 -10083 7189 22374 10620 3860 2627 10765 19510 27986
9646B7986j232L015M674J63P123J536j3485q565k294j5099r479Q6L139m257l76
$$ 27986 26754 29769 34443 34606 41729 43265 29780 21215 18921 3822 -5657 -5571 -2432 -6689 -7065
9631g065N541j109q986J7350L689m32M179N270O629j4491j0193J9649K047j7191
$$ -7065 -1524 -2633 -11619 5731 9420 8988 13167 18437 25066 10575 382 20031 22078 4887
9617D887M268M10N053k26r888L243J5504k070m73o150n114k455l533j2673j168
$$ 4887 9155 9565 14618 14392 4504 7747 23251 21181 20708 14558 9444 6989 3456 -9217 -10385
9602a0385n694J0463n54Q701j744m939J2306R065j3869k1540J8601J674M225J7699
$$ -10385 -16079 -5616 -6170 2531 787 -4152 8154 17219 3350 -18190 411 2085 6310 24009
9588B4009k428j1755J721Q890M103r565O11n043j0207P369N25L372J925n347k689
$$ 24009 21581 9826 11547 20437 24540 14975 15586 10543 336 7705 8230 11602 13527 8180 5491
9573E491k2401O606J3815R745Q725k198l856r139P210r9o903k0177j6189J4672
$$ 5491 -16910 -10304 3511 13256 21981 19783 15927 6788 13998 13899 6996 -13181 -29370 -14698
9559a4698K0234m953q980k880K029J420o37N473L150q148K976J5069J6874j249
$$ -14698 5536 583 -8397 -11277 -9248 -7828 -8465 -2992 158 -7990 -5014 10055 26929 25680
9545B5680J2905K057l255r483j311m558M06N628k040j4807o269J7798J5902J707
$$ 25680 38585 40642 37387 27904 26593 22035 22441 28069 26029 11222 4953 22751 38653 40360
9531D0360l0644o820R153p967k663R920M964o849J510j3619J3208N352l254l557
$$ 40360 9716 2896 12049 4082 1419 11339 16303 9454 10964 -2655 10553 15905 12651 9094
9517I094L348J2106M445l000k94K485j2001o414J841O812r189K841O661m194o
$$ 9094 12442 24548 28993 25993 25699 28184 16183 9769 11610 18422 9233 12074 18735 14541 14535
9502A4535L065R506n892L286K063J688M334j0043L08P35q737r554n658o267j176
$$ 14535 17600 27106 21214 24500 26563 28251 32585 22542 22850 23585 14848 5294 -364 -6631 -7807
9487g807j250N195M224J0514P511J049l027N126p384N447o234n618n265n508K715
$$ -7807 -9057 -3862 362 10876 18387 19436 16409 21535 14151 19598 13364 7746 2481 -3027 -312
9472c12N769K556m354p604j677J5843k36o331k220j937R937J4347J6060j437J1873
$$ -312 5457 8013 3659 -3945 -5622 10221 9985 3654 1434 -503 9434 23781 39841 38404 50277
9457E0277r459j0630r592m399j084J6526n693j7795n308J0192M995j0094p420
$$ 50277 40818 30188 20596 16197 15113 31639 25946 8151 2843 13035 18030 7936 516
9444E16m121Q356Q067q057r785R746N127K073L13j665K662L149n008j229N892
$$ 516 -3605 4751 12818 4761 -5024 4722 9849 11922 12235 10570 13232 16381 11373 10144 16036
9429A6036M162j9l40r527m941k301J3799J3934l091m780k218L194k932J828n422
$$ 16036 20198 20179 19839 10312 5371 3070 16869 30803 27712 22932 20714 23908 20976 22804 17382
9414A7382O541j726J3627J1054r805l632n176k129m385n020o039r9O880R640j0491
$$ 17382 23923 22197 35824 46878 37073 33441 28265 26136 21751 16731 10692 10593 17473 27113 16622
9399A6622j458J2127P585l861K375j0066K244N208l63N66J0919L373r072j3559
$$ 16622 15164 27291 34876 31015 33390 23324 25568 30776 30413 30979 41898 45271 36199 22640
9385B2640n590J99J1471m45j1176K641L647n085n467J0183J0896p713J576r380
$$ 22640 17050 17249 28720 28275 17099 19740 23387 18302 12835 23018 33914 26201 27777 18397
9371A8397R010R038j1554O56l51M894r565o030j9721j916K2892j917N13M014J4691
$$ 18397 27407 36445 24891 25547 25196 30090 20525 14495 -5226 -7142 15750 13833 14346 18360 33051
9356C3051n233j0944J076J3353J2035Q17j5714p779J7520q991j5212k981N524
$$ 33051 27818 16874 17950 31303 43338 44155 28441 20662 38182 29191 13979 10998 16522
9343A6522R257L216p996j1315o864M825J8763O955q823j5963J797O635n037J1838
$$ 16522 25779 28995 20999 9684 2820 7645 26408 33363 24540 8577 10374 17009 11972 23810
9329B3810j81q831k73k293q339R623n274o229J2648p098k788N341j865Q734M597
$$ 23810 23629 14798 14525 12232 3893 13516 8242 2013 14661 7563 4775 10116 8251 16985 21582
9314B1582Q308l785k318r781m681N734n375p260J1166J8745N912L490M063P96
$$ 21582 29890 26105 23787 14006 9325 15059 9684 2424 13590 32335 38247 41737 45800 46596
9300D6596O41M19M56j8265j2133j0045J693j01m877N717m372K370j331L542K079
$$ 46596 47237 47656 48112 29847 17714 7669 9362 9261 4384 10101 5729 8099 6768 10310 12389
9285A2389O62P283J9679J3276r199L065o404K3534K0322p640r110o797j9592j1756
$$ 12389 13051 20334 40013 53289 44090 47155 40751 64285 84607 76967 67857 61060 41468 29712
9271B9712j3871j8282j3649P512P289M73K0025J4657N295J326j80r291j6009q065
$$ 29712 15841 -2441 -16090 -8578 -1289 -816 19209 33866 39161 40487 40307 31016 15007 6942
9257F942R108Q372j723M521N515j3417q018M665J9115J7992Q148j4761j0076k790
$$ 6942 16050 24422 22699 27220 32735 19318 11300 15965 35080 53072 61220 46459 36383 33593
9243C3593k556N417m443k978J2314N292N15N042q735n151M468q591n084m264n998
$$ 33593 31037 36454 32011 29033 41347 46639 47154 52196 43461 38310 42778 34187 29103 24839 18841
9228A8841J0478O460M219N488j4002j1147o998R778K3427L271q810L853P37K471
$$ 18841 29319 35779 39998 45486 31484 20337 13339 23117 46544 49815 41005 44858 45595 48066
9214D8066j4055K103O44J163n621N312Q870J2010K000m05p487J82P209L701m25
$$ 48066 34011 36114 36758 37921 32300 37612 46482 58492 60492 60087 52600 52782 59991 63692 63267
9199F3267L235o359O044j2181L88L691k3825n474J8346J1076o440l946N811q228
$$ 63267 66502 60143 66187 54006 54394 58085 34260 28786 47132 58208 51768 47822 53633 45405
9185D5405q813m794J0177J1984l468M101L516o567k258q569M534l289K829J0556
$$ 45405 36592 31798 41975 53959 50491 54592 58108 51541 49283 40714 45248 41959 44788 55344
9171E5344J344l426j0954m037O377M16l914j2458p731l550J4473O520L072k010
$$ 55344 56688 53262 42308 38271 44648 45064 41150 28692 20961 17411 31884 38404 41476 39466
9157C9466P092R322J568J3943o018j4309j0202r714j558P844L991p587J197Q708
$$ 39466 46558 55880 57448 71391 65373 51064 40862 31148 29590 37434 41425 33838 35035 43743
9143D3743M990J156j4983j1558M616J5649J0151J0200o847K111k963P719O247
$$ 43743 48733 49889 34906 23348 27964 43613 53764 63964 57117 59228 56265 63984 70231
9130G0231j463j1909l830l781j930n42K0247J8276O247M317r635l615j181O285
$$ 70231 68768 56859 53029 49248 47318 46776 67023 85299 91546 95863 86228 82613 81432 87717
9116H7717m024k1646N458L747k055j3351m08J0934p81R34K1478n752m896j954
$$ 87717 83693 62047 67505 71252 69197 55846 55438 66372 65591 66525 88003 82251 77355 75401
9102G5401j0898r47M363P338K437j011R524r208j3379j3158p116J307m488K876
$$ 75401 64503 63556 67919 75257 77694 76683 86207 76999 63620 50462 43346 44653 40165 43041
9088D3041k29J5459J4562n985q005n1M221J2532q124l971j562N543K8M375R180
$$ 43041 42812 58271 72833 66848 58843 58792 63013 75545 67421 63450 61888 67431 67459 71834 81014
9073H1014M590Q541M957p223K891j497j663j985k437k489m043J463J73n822o962
$$ 81014 85604 94145 99102 91879 94770 93273 91610 89625 87188 84699 80656 82119 82292 76470 69508
9058F9508j1715p245J844r26l643Q425K6686R212j3417r965J0735R894L532N340
$$ 69508 57793 50548 52392 51466 47823 56248 82934 92146 78729 68764 79499 89393 92925 98265
9044I8265j3470j7010j593J9980L59J2809k484r512r648m25K760J2762J3686L468
$$ 98265 84795 67785 66192 86172 86531 99340 96856 87344 77696 77271 80031 92793 106479 109947
9030A09947q018p439K321O019o233O87l13P931N242r490n976O515N730J6710L084
$$ 109947 101929 94490 96811 102830 96597 97284 96971 104902 110144 100654 94678 101193 106923 123633 126717
9015A26717r918N893m122l412j955k404M883O71J5223j95j219M933Q237l311n428
$$ 126717 116799 122692 118570 115158 113203 110799 115682 116353 131576 131381 130162 135095 143332 140021 134593
9000A34593j0108N860R0N612J5828J629r078m426R469J0617j2384m951n211M687
$$ 134593 124485 130345 130435 136047 151875 153504 144426 140000 149469 160086 147702 142751 137540 142227
8986A42227R953k851k877J3113R065M892k831p195J3917K80q35J840p069j615
$$ 142227 152180 149329 146452 159565 168630 173522 170691 163496 177413 177693 176858 178698 171629 170014
8972A70014L947N812N717j4302L03O179M634n796J0634O201K208n420K011N241
$$ 170014 173961 179773 185490 171188 171491 177670 182304 176508 187142 193343 195551 190131 192142 197383
8958A97383l812K668L739P33j6328n666R044j475n306J189Q361L30O831r82n62
$$ 197383 193571 196239 199978 200711 184383 178717 187761 186286 180980 182169 190530 190860 197691 196709 196147
8943A96147m711J0738K907J2442P0K0076J5429q40q8P919j1326j5683j8632M297
$$ 196147 191436 202174 205081 217523 217593 237669 253098 252258 252170 260089 248763 233080 214448 218745
8929B18745J6458r68J8J0367J5885r316k3178J172K689J3005K235l161n174L248
$$ 218745 235203 234235 234253 244620 260505 251189 228011 229183 231872 244877 247112 243951 238777 242025
8915B42025J4549J1269j771K522O130J5020P646q886p330L848M257K002j060O454
$$ 242025 256574 267843 266072 268594 274724 289744 297390 288504 281174 285022 289279 291281 290221 296675
8901B96675N246R341L547k022r376o96J1521J0777n107r509J6223K5010L197m981
$$ 296675 301921 311262 314809 312787 303411 302715 314236 325013 319906 310397 326620 351630 354827 349846
8887C49846O066J4612M122o760j00J682P020J1978m687J551N460O187J407J142
$$ 349846 355912 370524 374646 367886 367786 369468 376488 388466 383779 385330 390790 396977 398384 399526
8873C99526J3805J5651J569m988J0722J6997J5082R206J4379J4882R646K812K290
$$ 399526 413331 428982 430551 425563 436285 453282 468364 477570 491949 506831 516477 519289 521579
8860E21579K022J4191l33r495P129J5710J2783l849L92Q491R908K3292J7508N590
$$ 521579 523601 537792 537459 527964 535093 550803 563586 559737 560129 568620 578528 601820 619328 624918
8846F24918N076J0664J2391J6366p530o073J1442J3872K4778J3672m559J7452
$$ 624918 629994 640658 653049 669415 661885 655812 667254 681126 705904 719576 715017 732469
8834G32469J7938K839L746P699J3782M892N920J5912J9470J9419J5373J3836K3471
$$ 732469 750407 753246 756992 764691 778473 783365 789285 805197 824667 844086 859459 873295 896766
8821H96766L6258L0958J6173n114J2138K8492K2621L4616L2588J3838K3641J9579
$$ 896766 933024 963982 980155 975041 987179 1015671 1038292 1072908 1105496 1119334 1142975 1162554
8809A162554K6992M4896K6963P054K4580K9543K1028K9868K9159M7338L1071L2351
$$ 1162554 1189546 1234442 1261405 1268459 1293039 1322582 1343610 1373478 1402637 1449975 1481046 1513397
8797A513397K6543L0844L4504M8817M3219N4091N5041M6971M1755M9214N1471
$$ 1513397 1539940 1570784 1605288 1654105 1697324 1751415 1806456 1853427 1895182 1944396 1995867
8786A995867N6280P3300O5726N6395O6157N9255O0338P2060P9686R5419Q4919
$$ 1995867 2052147 2125447 2191173 2247568 2313725 2372980 2433318 2505378 2585064 2680483 2765402
8775B765402P8917Q0281R7287R5956J11790J20280J11881J10055J16045J26159
$$ 2765402 2844319 2924600 3021887 3117843 3229633 3349913 3461794 3571849 3687894 3814053
8765C814053J31848J40685J44061J58146J65365J83193K03126K00535J95570K02513
$$ 3814053 3945901 4086586 4230647 4388793 4554158 4737351 4940477 5141012 5336582 5539095
8755E539095K10890K36936K39965K53772K81262K87663K96908L09215L22486L50221
$$ 5539095 5749985 5986921 6226886 6480658 6761920 7049583 7346491 7655706 7978192 8328413
8745H328413L36843L68273L90332L91592M04601M29257M15262M19917M29079M45298
$$ 8328413 8665256 9033529 9423861 9815453 10220054 10649311 11064573 11484490 11913569 12358867
8735A2358867M30575M36721M19992M00375M03118L66360L37049L13296K59524
$$ 12358867 12789442 13226163 13646155 14046530 14449648 14816008 15153057 15466353 15725877
8726A5725877K02119J40798R9402M9090m745n9842j13470j73601k16687k51242
$$ 15725877 15927996 16068794 16168196 16217286 16212541 16152699 16039229 15865628 15648941 15397699
8716A5397699l02717l35560l61730l96075m11955m18322m17980m36319m51213
$$ 15397699 15094982 14759422 14397692 14001617 13589662 13171340 12753360 12317041 11865828
8707A1865828m38315m22167m13637m18628m13036l96146l79718l62015l29967
$$ 11865828 11427513 11005346 10591709 10173081 9760045 9363899 8984181 8622166 8292199
8698H292199l37263l39347l13422k90807k80384k63597k64066k56169k32859k23376
$$ 8292199 7954936 7615589 7302167 7011360 6730976 6467379 6203313 5947144 5714285 5490909
8688E490909k16200j96377j95216j71898j64127j69628j50893j46161j41288j43193
$$ 5490909 5274709 5078332 4883116 4711218 4547091 4377463 4226570 4080409 3939121 3795928
8678C795928j31542j24247j23483j18114j13430j03965r4479j02926r7692p4664
$$ 3795928 3664386 3540139 3416656 3298542 3185112 3081147 2986668 2883742 2786050 2711386
8668B711386q0059p6334p3539o6522r3644p1345n0722n5611o2291n1834n1125
$$ 2711386 2631327 2554993 2481454 2414932 2321288 2249943 2199221 2143610 2081319 2029485 1978360
8657A978360m8329n9499n9602m8619n7962m7765l0376k5354m0841n0077l7076
$$ 1978360 1930031 1870532 1810930 1762311 1704349 1656584 1626208 1600854 1560013 1509936 1472860
8646A472860l0862l4307k4958j5034k3988l3624l5727k7136l9753k2945k9172
$$ 1472860 1441998 1407691 1382733 1367699 1343711 1310087 1274360 1247224 1207471 1184526 1155354
8635A155354k6810l1247k3631k8235l3511p982r782l6933l0509j8278K975p428
$$ 1155354 1128544 1097297 1073666 1045431 1011920 1003938 994156 957223 926714 908436 911411 903983
8623I03983q634j6703p709o273j4439j6794j8882l0585o189j4898o66r230j5927
$$ 903983 895349 878646 870937 864664 850225 833431 814549 783964 777775 762877 762211 752981 737054
8610G37054k0163j7896j3524q714l086m898L543r599j5153m248N576o900o880
$$ 737054 716891 698995 685471 676757 673671 668773 672316 662717 647564 643316 648892 641992 635112
8597F35112p91j6103j3155m177k2834j4331q729j4672j4003l948k11j8677j1055
$$ 635112 634321 618218 605063 600886 578052 563721 554992 540320 526317 522369 522158 503481 492426
8584D92426j1707k221j3399r405J511r392q251p297m011J765k3660j259R258k5006
$$ 492426 480719 478498 465099 455694 457205 447813 439562 432265 428254 430019 406359 405100 414358 389352
8570C89352j1498k457r08O874q633j1774q525o222q27Q789k678j0788q774k089
$$ 389352 377854 375397 374489 381363 372730 360956 352431 346209 345382 354171 351493 340705 331931 329842
8556C29842P87j6988j4128Q303O671p561r436o321p783k0045L085o162k0286J011
$$ 329842 330629 313641 299513 307816 314487 306926 297490 291169 283386 263341 266426 260264 239978 240989
8542B40989J5625J7395m738j3642q73J110R616M311r463q085j0042q552q041N2
$$ 240989 256614 274009 269271 255629 254756 255866 265482 269793 260330 252245 242203 233651 225610 225662
8528B25662J2315Q406r312o554L193n319m098N053m858j361N743n618J860O970
$$ 225662 237977 246383 237071 230517 233710 228391 224293 229346 224488 223127 228870 223252 225112 232082
8514B32082j301r573l749J830q48j2731q873l664m342K356L61J0075Q67K816k208
$$ 232082 230781 221208 217459 219289 218441 205710 196837 193173 188831 191187 191548 201623 202490 205306 203098
8499B03098l072r180j4225L634r904j2218O656Q918K420l987q994j2542n110O089
$$ 203098 200026 190846 176621 180255 170351 158133 164789 173707 176127 172140 163146 150604 145494 151583
8485A51583J4120J184k770j1902k1891q533p403J2072J3677O525N186j388r478
$$ 151583 165703 166887 164117 152215 130324 121791 114388 126460 140137 146662 151848 150460 140982
8472A40982M364Q375l147J3222M067k1276p716J749l394O525J1881J6320P468
$$ 140982 145346 153721 150574 163796 167863 146587 138871 140620 137226 143751 155632 171952 179420
8459A79420j039R855K3983K821j9880j0224j7302j5112J439j1139r744o781j3002
$$ 179420 178381 188236 212219 215040 195160 184936 167634 152522 153961 142822 133078 126297 113295
8446A13295O636O012N116n609j064n953k0948J818K0921p050n608O922j238p775
$$ 113295 119931 125943 131059 125450 124386 118433 97485 99303 120224 113174 107566 114488 113250 105475
8432A05475q483N560j264j742L714K0330l647M697J4598j0298q294j245p166N494
$$ 105475 96992 102552 101288 99546 103260 123590 119943 124640 139238 128940 120646 119401 112235 117729
8418A17729J8539o903M00J2479K4954N9056N6199q211o6687l7432l7628j7131
$$ 117729 136268 129365 129765 142244 167198 226254 282453 274242 207555 170123 132495 115364
8406A15364p199r944k863J1649P824j0560j3494j0932l296J4168J633l02j7960
$$ 115364 108165 98221 95358 107007 114831 104271 90777 79845 76549 90717 92350 92048 74088
8393G4088r257L183j294j151J4996j483m245q51q191O659j271p923J598K678M579
$$ 74088 64831 68014 66720 65569 80565 79082 74837 73986 65795 72454 71183 63260 64858 67536 72115
8378G2115n200Q309L795J013P087J8796J1369O128l119k223K3805M102k3587m727
$$ 72115 66915 75224 79019 80032 87119 105915 117284 123412 120293 118070 141875 145977 122390 117663
8364A17663j2638l426j1878n124N898j0287j0930p140l03n710j0127j1544m456
$$ 117663 105025 101599 89721 84597 90495 80208 69278 62138 61835 56125 45998 34454 29998
8351B9998J5743J5789P855k894Q53Q70J196r855j956k050K801l226l343O290j0582
$$ 29998 45741 61530 69385 66491 67344 68214 69410 59555 57599 55549 58350 55124 51781 58071 47489
8336D7489M908N969j2548O969K794j6688m51J6831M648j127K298J28l283j2498
$$ 47489 52397 58366 45818 52787 55581 38893 38442 55273 59921 58794 61092 61220 57937 45439
8322D5439l996J176J3272J346j271p090J176j1065L674J7458l490K055M157p950
$$ 45439 41443 42619 55891 57237 55966 48876 50052 38987 42661 60119 56629 58684 62841 54891
8308E4891o214m619R493K794j2144k186r742J0348O770Q01k250m264j465k772
$$ 54891 48677 44058 53551 56345 44201 42015 32273 42621 49391 50192 47942 43678 42213 39441
8294C9441n50O967j941j379k783n139L730O601J276j2932m87J2431l766j4565
$$ 39441 38891 45858 43917 42538 39755 34616 38346 44947 46223 33291 32804 45235 41469 26904
8280B6904J2909j502l166J5066P275r718n0k915j8389o078L399j12N051M451O444
$$ 26904 39813 38311 35145 50211 57486 47768 47718 44803 26414 20336 23735 23623 28674 33125 39569
8265C9569l689r52M59J555J0678l475l075j1101o832O738Q43r498m801N928P259
$$ 39569 35880 34928 35387 36942 47620 44145 41070 29969 23137 29875 30718 21220 16419 22347 29606
8250B9606m402o269j6K1981n581j2177k025Q065J3778j0828j318L50J6299j3137
$$ 29606 25204 18935 18919 40900 35319 23142 21117 29182 42960 32132 30814 31164 47463 34326
8236C4326j7768n486K1005J1183j1234P296K335K444j8519l736k062j4692K929
$$ 34326 16558 11072 32077 43260 32026 39322 41657 44101 25582 21846 19784 5092 8021
8223H021J2822Q481o43K05K585Q097L082l540O140J3369o24q24j4124j2498q797
$$ 8021 20843 29324 28681 28886 31471 39568 42650 39110 45250 58619 57995 57171 43047 30549 21752
8208B1752J2910P501p584j6658J8091K011n150J945j1737J414M353l866j2307
$$ 21752 34662 42163 34579 17921 36012 38023 32873 34818 23081 24495 28848 24982 12675
8195A2675J3115O844q6l964R970K5398m284k4845j0386K484O498j748R011l155
$$ 12675 25790 32634 32548 28584 38554 63952 59668 34823 24437 26921 33419 31671 40682 37527
8181C7527n935K672O503P437m205n560p933j0073p742J009K304m090L763P747
$$ 37527 31592 34264 40767 48204 43999 38439 30506 20433 12691 13700 16004 11914 15677 23424
8167B3424j894J5917k239K236n467p750n72m912N726J1397M690N522j1337j663
$$ 23424 21530 37447 35208 37444 31977 24227 23655 18743 24469 35866 40556 46078 34741 33078
8153C3078n067j1283r22M912k071M510j376j2351m600J135L383Q892l971j44J3990
$$ 33078 28011 16728 15806 20718 18647 23157 21781 9430 4830 5965 9348 18240 14269 14125 28115
8138B8115n828q737m228J2483p551k56J3236R786l786n710m332m434m638q223
$$ 28115 22287 13550 9322 21805 14254 13998 27234 37020 33234 27524 23192 18758 14120 5897
8124E897m79J1521K1693p511m22O16J5645r380j0420j0998Q881P205N25n603n959
$$ 5897 5418 16939 38632 31121 30699 31315 46960 37580 27160 16162 25043 32248 32773 27170 21211
8109B1211M705P256J2738q703o162m811O026j325N312J544j3468l886k982J890
$$ 21211 25916 33172 45910 37207 31045 26234 32260 30935 36247 37791 24323 20437 17455 19345
8095A9345R364K669q546j4738j767l1N298Q176j287N586L52J4O087J424o29K982
$$ 19345 28709 31378 22832 8094 6327 6296 11594 19770 18483 24069 24421 24435 30522 31946 31317 34299
8079C4299m620r55q391r233m748p01L394m572m698O30K12P938N24m02k131K120
$$ 34299 29679 28724 20333 11100 6352 5651 9045 4473 -225 405 617 8555 9079 8677 6546 8666
8063H666K740O299r8r159n183r161k690J064J656l474R208J9576J6588J1158j040
$$ 8666 11406 17705 17607 8448 3265 -5896 -8586 -7522 -5866 -9340 -132 19444 36032 47190 46150
8048D6150N953j0086j0062r116N861q026J2006J6146r011j1838m42l7N022Q486
$$ 46150 52103 42017 31955 22839 28700 20674 32680 48826 39815 27977 27535 27498 32520 41006
8034D1006j8703j5318k100J0794O630j0981J840o034q475J7242j0400j5765l511
$$ 41006 22303 6985 4885 15679 22309 11328 13168 7134 -1341 15901 5501 -10264 -13775
8021a3775R799J3854Q584j2367n991M422M364K1128J683o164n280O67L570o951
$$ -13775 -3976 9878 18462 6095 104 4526 8890 30018 31701 25537 20257 20924 24494 17543
8007A7543j6331Q32P698K00J4914J268k897M230Q143j1885P365J6107l562j3794
$$ 17543 1212 2044 9742 9942 24856 26124 23227 27457 35600 23715 31080 47187 43625 29831
7993B9831l209p543m437o683K403Q400P092M987j1726k1066J769Q22m359M573
$$ 29831 26622 19079 14642 7959 10362 18762 25854 30841 19115 -1951 -182 640 -3719 854
7979H54J1411Q38j3598j2432N491J7405N767j1985K793m12P742J0013K401o470
$$ 854 12265 13103 -495 -12927 -7436 9969 15736 3751 6544 6132 13874 23887 26288 19818
7965A9818l680J562j212J3218l570j1744J920k666R198M442k943L810r516j450
$$ 19818 16138 17700 16488 29706 26136 14392 16312 13646 22844 27286 24343 28153 18637 17187
7951A7187N762j1630P605o663R03q850J584M835K827J5115k690l673L477Q440
$$ 17187 22949 11319 18924 12261 13164 4314 5898 10733 13560 28675 25985 22312 25789 34229
7937C4229r103k165M12p510m779K423l08M821J0060l522p2N26j057j608j2225
$$ 34229 25126 22961 23373 15863 11084 13507 13199 18020 28080 24558 24486 25012 23955 22347 10122
7922A0122r035j242M710P022N439L140j196m455J838J0597K288l521k316j0549
$$ 10122 1087 -155 4555 11577 17016 20156 18960 14505 16343 26940 29228 25707 23391 12842
7908A2842j364k404j489j65K1217J4206p025K360K17r394p39R465r526j0599j109
$$ 12842 11478 9074 7585 7420 28637 42843 35818 38178 38395 29001 28262 37727 28201 17602 16493
7893A6493j1961l334O038N831l50j3514r658p98n03M492R862P617M159P647q951
$$ 16493 4532 1198 7236 13067 12717 -797 -10455 -11253 -11756 -7264 2598 10215 14374 22021 13070
7878A3070j1864r21K501K903J508J057L875p492J608J327L802N07P916J848j274
$$ 13070 1206 285 2786 5689 7197 8254 12129 4637 6245 7572 11374 11881 19797 21645 20371
7863B0371J0448p312q026m246K694n624o245N603n85J6678J0504o201k0642j7208
$$ 20371 30819 23507 15481 11235 13929 8305 2060 7663 7078 23756 34260 28059 7417 -9791
7849i791r305M556J6115J0587o942J750J973n861n35O119J547P333K877M82m789
$$ -9791 -19096 -14540 1575 12162 5220 6970 8943 3082 2547 8666 10213 17546 20423 20905 16116
7834A6116o938n977P873k6j862k379j372j757M296j542J5855M4l939j5366m413
$$ 16116 9178 3201 11074 11048 9186 6807 5435 3678 7974 6432 22287 22331 18392 3026 -1387
7819a387j656r376n632N870J2528L960L671J1696n386l200o299k653l456j005
$$ -1387 -3043 -12419 -18051 -12181 347 4307 7978 19674 14288 11088 4789 2136 -1320 -2325
7805b325Q738K697R233M344M039q924j6743o870j2202J5987J4642o567N463K501
$$ -2325 6413 9110 18343 22687 26726 17802 1059 -5811 -18013 -2026 12616 6049 11512 14013
7791A4013j0887k033J0255j199j1181J4712L810k416n741N757j6980n45J0146
$$ 14013 3126 1093 11348 10149 -1032 13680 17490 15074 9333 15090 -1890 -2435 7711
7778G711N389p229o842O152J6673P985p617j4094n228M990p389l497O42o628K92
$$ 7711 13100 5871 -971 5181 21854 29839 22222 8128 2900 7890 501 -2996 -2354 -8982 -8690
7763h690R757O487p317p338M233l454L188J5179N468p730o005o103M387K143j229
$$ -8690 1067 7554 237 -7101 -2868 -6322 -3134 12045 17513 9783 3778 -2325 2062 4205 2976
7748B976J1220N716j7593m518K371P646M703K1457j430r226q541j4792q471k193
$$ 2976 14196 19912 2319 -2199 172 7818 12521 33978 32548 23322 14781 -11 -8482 -10675
7734a0675k543l596P068m733J2015J0116J231m351j0722P551J4762P85j550o439
$$ -10675 -13218 -16814 -9746 -14479 -2464 7652 8883 4532 -6190 1361 16123 16908 15358 8919
7720H919l94K562n307J5537N271p264Q475j2773n398M537l940m151p775K034J0251
$$ 8919 8525 11087 5780 21317 26588 19324 27799 15026 9628 14165 10225 6074 -1701 333 10584
7705A0584q173j0653j41J223J144Q278J3900K962J5326L974m049j8531j3281k999
$$ 10584 2411 -8242 -8383 -7160 -6016 2262 16162 19124 34450 38424 34375 15844 2563 -436
7691d36J0509J2723P04j2403j3589M518J5241J019O31k152j016n012j2524j305
$$ -436 10073 22796 23500 11097 -2492 2026 17267 18286 18917 16765 15749 10737 -1787 -3092
7677c092L310L214l606K016k838J0252P943j5964J4410k081j6888p6Q70R008M215
$$ -3092 218 3432 -174 1842 -996 9256 17199 1235 15645 13564 -3324 -3400 -2530 6478 10693
7662A0693P28l409r3M484R392O80j9042k795k0125m34P460P092R842o621j525
$$ 10693 11421 8012 7919 12403 21795 22475 3433 638 -19487 -19921 -12461 -5369 4473 -2148 -3673
7647c673N028l903J423L481j0906O03J7310m708q656k504j5142p742R726K8919
$$ -3673 1355 -2548 -1125 2356 -8550 -7947 9363 4655 -4001 -6505 -21647 -29389 -19663 9256
7633I256q57j9150K503M625p771p80m360K165R363L599j0660K363K2155l516j6616
$$ 9256 8399 -10751 -8248 -3623 -11394 -12174 -16534 -14369 -5006 -1407 -12067 -9704 12451 8935 -7681
7618g681j779n332M602L202o060O933M247O494P292P70r431n740m550k526J3728
$$ -7681 -9460 -14792 -10190 -6988 -13048 -6115 -1868 4626 11918 12688 3257 -2483 -7033 -9559 4169
7603D169j2974K602J3323n0J77j1910J742J5067M458k887N228o822J325J6111
$$ 4169 -8805 -6203 7120 7070 7247 -4663 -2921 12146 16604 13717 18945 12123 13448 29559
7589B9559o912j5487q257m823J5431J812j8455J948q15j5555k190L537O658J3326
$$ 29559 22647 7160 -1097 -5920 9511 11323 -7132 -5184 -5999 -21554 -23744 -20207 -13549 -223
7575b23M126p241q740L963J0281j318m483l308P473N509o556n583j111J8005Q
$$ -223 3903 -3338 -12078 -8115 2166 848 -3635 -6943 530 6039 -517 -6100 -7211 10794 10802
7560A0802j9273m94J6856J0590j1345n846O489M280j2469O434N684M242J5522
$$ 10802 -8471 -8965 7891 18481 7136 1290 7779 12059 -410 6024 11708 15950 31472
7547C1472p022Q49j717k0961K113Q771K1380k621q633o908K951L876K93j3990
$$ 31472 24450 25299 23582 2621 4734 13505 34885 32264 23631 16723 19674 23550 23843 9853
7533I853J1083L227j3451o983k100K967k94j41k1953K773K767J2581J76o149R929
$$ 9853 20936 24163 10712 3729 1629 4596 4302 4161 -17792 -15019 -12252 329 505 -5644 4285
7518D285Q552j841N59j0708p400L853j3302K986Q348L556J2139O02P66N852p321
$$ 4285 12837 10996 11555 847 -6553 -2700 -16002 -13016 -4668 -1112 11027 11629 12395 18247 10926
7503A0926j1416j0983j790N271L543O768O587k060j0563P262n032Q281O736p446
$$ 10926 -490 -11473 -13263 -7992 -4449 2319 8906 6846 -3717 3545 -1487 6794 13530 6084
7489F084j557J2751j774k87j4441o275R21L89m358M115J2609M838r871l369j0611
$$ 6084 4527 17278 15504 15217 776 -5499 -4578 -4189 -8547 -4432 8177 13015 3144 -225 -10836
7474a0836l648k327N90L501j588J027M096L284P091O153o190j3011l336N178j4355
$$ -10836 -14484 -16811 -16221 -12720 -14308 -13281 -9185 -5901 1190 7343 1153 -11858 -15194 -10016 -24371
7459b4371N473J4241J2084l803j0497K382J6991l749r770j1321L823O374k840
$$ -24371 -18898 -4657 7427 3624 -6873 -4491 12500 8751 -1019 -12340 -8517 -2143 -4983
7446d983M317M306k666l279k751O108j55m862J3531M145m822Q191P314o113j5923
$$ -4983 -666 3640 974 -2305 -5056 1052 897 -3965 9566 13711 8889 17080 24394 18281 2358
7431B358j784J956P883j058j1394j5107p522N340N658K0592J5678P47j2112p678
$$ 2358 574 2530 10413 9355 -2039 -17146 -24668 -19328 -13670 6922 22600 23347 11235 3557
7417C557k708O028n377j0899n399o10m484K289L287q08l274J0224O462N415l25
$$ 3557 849 6877 1500 -9399 -14798 -15408 -19892 -17603 -14316 -15124 -18398 -8174 -1712 3703 3378
7402C378n936m826j552K0628J0480o164j2322r604k385J0539L267k319j2332m014
$$ 3378 -2558 -7384 -8936 11692 22172 16008 3686 -5918 -8303 2236 5503 3184 -9148 -13162
7388a3162j844P389m73R644J6782j1340j8913J2744J332k990j173k02m066n34
$$ -13162 -15006 -7617 -8090 1554 18336 6996 -11917 827 2159 -831 -2004 -2206 -6272 -6806
7374f806p472j094K343q440j3422O748J3310J0328n930J5542l736N478L526o674
$$ -6806 -14278 -15372 -13029 -21469 -34891 -28143 -14833 -4505 -10435 5107 1371 6849 10375 3701
7360C701O313R085l010j3694n05N243j2020o878Q944J5530J8320P81r027q335
$$ 3701 10014 19099 16089 2395 1890 7133 -4887 -11765 -2821 12709 31029 31810 22783 14448
7346A4448p293Q55q088j4759O622j71J550k821m512j1865p886J4345J4090L222
$$ 14448 7155 8010 -78 -14837 -8215 -8386 -6836 -9657 -14169 -26034 -33920 -19575 -5485 -2263
7332b263L114Q020o30O097j3000k4994J1102J3306N666R176l799j0396k166j386
$$ -2263 851 8871 8241 14338 1338 -23656 -12554 752 6418 15594 11795 1399 -767 -2153
7318b153l353Q16N913m162j2896MQ923r89J848n63J4972N944J2721J2261L149
$$ -2153 -5506 -4690 1223 -2939 -15835 -15831 -6908 -7897 -6049 -6612 8360 14304 27025 39286 42435
7303D2435n567j0867o273m113l422n61O907j8309j8241j1278R090K5780R799J908
$$ 42435 36868 26001 19728 15615 12193 11632 18539 230 -18011 -29289 -20199 5581 15380 17288
7289A7288l474j7620J0152L054j3195j1622m953M938N894J777N501P930m817J582
$$ 17288 13814 -3806 6346 9400 -3795 -15417 -20370 -15432 -9538 -7761 -2260 5670 853 2435
7275B435J0641J2450L978q702j5903j1092m872J0423J529j7679m681N569J3007
$$ 2435 13076 25526 29504 20802 4899 -6193 -11065 -642 887 -16792 -21473 -15904 -2897
7262b897K877M813l133J022L061j30L036l51j1829j1007L876J5722Q966k863r276
$$ -2897 -20 4793 1660 2682 5743 5613 8649 8298 -3531 -14538 -10662 5060 14026 11163 1887
7247A887n281K775J5043j7900n815L706j3324q339o187P242J9072m873q350m796
$$ 1887 -3394 -619 14424 -3476 -9291 -5585 -18909 -27248 -33435 -26193 -7121 -11994 -20344 -25140
7233b5140J1901J0816M161K0217M158l024j0707L658o90p336p58J082p07P368
$$ -25140 -13239 -2423 1738 21955 26113 23089 12382 16040 15350 8014 7256 8338 7631 14999
7219A4999L176j3095q055K259l472R722J626p204j43J3718K694l573r14O215j207
$$ 14999 18175 5080 -2975 -716 -4188 5534 7160 -44 -187 13531 16225 12652 11738 17953 16746
7204A6746r696o435P906P990P634j070q714j0497l995n334r744N680J1064J188
$$ 16746 7050 615 8521 16511 24145 23075 14361 3864 -131 -5465 -15209 -9529 1535 2723
7190B723j891O893o49j600j3191j2410R430J8321j2835p600j4777n23J2631L516
$$ 2723 832 7725 7076 5476 -7715 -20125 -10695 7626 -5209 -12809 -27586 -28109 -15478 -11962
7176a1962l069n843L442J8967J1133O324p544j3040J0901p830k798j966M467n05
$$ -11962 -15031 -20874 -17432 1535 12668 18992 11448 -1592 9309 1479 -1319 -3285 1182 677
7162F77j5817q791P726J0752K098o783L064O9L95j469P25m169M464Q256Q765k833
$$ 677 -15140 -23931 -16205 -5453 -3355 -10138 -7074 -7005 -6610 -8079 -7354 -11523 -7059 1197 9962 7129
7146G129r397q139o004K0369l298n826K510j061J1254N591Q799j2448N083l274
$$ 7129 -2268 -10407 -16411 3958 660 -5166 -2656 -3717 7537 13128 21927 9479 14562 11288
7132A1288n157j4290p30J1526m471j3253L530J2803J331l09Q400l559M767N748
$$ 11288 6131 -8159 -8889 2637 -1834 -15087 -11557 1246 2577 2268 10668 7109 11876 17624
7118A7624q259n917j1082R91k577J939J3963N603L02J626m247o655n447N189k828
$$ 17624 9365 3448 -7634 -6643 -9220 -7281 6682 12285 12587 14213 9966 3311 -2136 3053 225
7103B25O095q821j0094O07L502M540n870j4828n965M39P039J3535J458J2654l609
$$ 225 6320 -2501 -12595 -11988 -8486 -3946 -9816 -24644 -30609 -30170 -23131 -9596 -8138 4516 907
7088I07j0308p486j0348n699j0009P074J8318K6353O343M540m402o666Q144J2329
$$ 907 -9401 -16887 -27235 -32934 -42943 -35869 -17551 8802 15145 19685 15283 8617 16761 29090
7074B9090j0076j1310j2292K142J1Q544N745n349K059p386q574L50M692R603K792
$$ 29090 19014 7704 -4588 -2446 -2435 6109 11854 6505 8564 1178 -7396 -7046 -2354 7249 10041
7059A0041J5068K199j9957j5391J3624P534o772P7j1269L391L266N697j2584j7301
$$ 10041 25109 27308 7351 -8040 5584 13118 6346 6423 -4846 -1455 1811 7508 -5076 -22377
7045b2377j092R444M435r420J798J1078p39J782j0965k740J3677K453j484l56
$$ -22377 -23469 -14025 -9590 -19010 -17212 -6134 -6873 -5091 -16056 -18796 -5119 -2666 -4150 -4506
7031d506q454r973l19R927P731J1030K195j1160q625K412j1603Q690K3929K467
$$ -4506 -12960 -22933 -23252 -13325 -5594 5436 7631 -3529 -12154 -9742 -21345 -12655 11274 13741
7017A3741j2673p865q645N416k195j181m686N04J0508j768R010K0987K056L447
$$ 13741 1068 -6797 -15442 -10026 -12221 -13402 -18088 -17584 -7076 -8844 166 21153 23209 26656
7003B6656j0413n895K135r010j4643J888J7613j3683P396J4871P682j2667j1066
$$ 26656 16243 10348 12483 3473 -11170 -9282 8331 -5352 2044 16915 24597 11930 864
6990H64L84n984q242K933L946K18P658n203O150K316O307J2977k1975j4141M267
$$ 864 1248 -4736 -12978 -10045 -6099 -5881 1777 -3426 2724 5040 11347 24324 2349 -11792 -7525
6975g525P089q75k378J1475J2281p755j846N909J4270J00n633j0193j7246q908
$$ -7525 -436 -1311 -3689 7786 20067 12312 10466 16375 30645 30745 25112 14919 -2327 -11235
6961a1235j3497K982P624l301Q3l001o54m541J0464K5767l331j1758p770n196
$$ -11235 -24732 -21750 -14126 -17427 -17344 -20345 -20999 -25540 -15076 10691 7360 -4398 -12168 -17364
6947a7364M973J538l968J5285J8454j660m328j4076j1220p311J0155M426M385
$$ -17364 -12391 -10853 -14821 464 18918 17258 12930 -1146 -12366 -19677 -9522 -5096 -711
6934g11J858m347j1948j1988k380Q509J4247J0856q061o738j2315L671N737K2496
$$ -711 1147 -3200 -15148 -27136 -29516 -21007 -6760 4096 -3965 -10703 -23018 -19347 -13610 8886
6920H886j0470m911L238n680K299P417J4576n490j0156j0892N053J449k339l119
$$ 8886 -1584 -6495 -3257 -8937 -6638 779 15355 9865 -291 -11183 -6130 -4681 -7020 -10139
6906a0139m071P768J400P659r33L549n60q318j814J424n154R154L161J540p171
$$ -10139 -14210 -6442 -5042 2617 1684 5233 4673 -3645 -5459 -4035 -9189 -35 3126 4666 -2505
6891b505l735L737J909k748J1329J876j257j219j8404q814O315M169J070n780
$$ -2505 -6240 -2503 -594 -3342 7987 9863 8606 7387 -11017 -19831 -13516 -9347 -8277 -14057
6877a4057m055K215N179J162k204M26K392N546K316j3629j5241L592J3921J0301
$$ -14057 -18112 -15897 -10718 -9556 -11760 -11334 -8942 -3396 -1080 -14709 -29950 -26358 -12437 -2136
6863b136N400n360j0659j3029J3726P336L850j9574J374N770n871M173r504Q263
$$ -2136 3264 -2096 -12755 -25784 -12058 -4722 -872 -20446 -19072 -13302 -19173 -15000 -24504 -16241
6849a6241J3145k801j0117m761Q906K1375j236j2762j084j1945p103J3837K060
$$ -16241 -3096 -5897 -16014 -20775 -11869 9506 8270 -4492 -5576 -17521 -24624 -10787 -8727
6836h727N237O693P338p821j6324K0189K0616q669j5551r948P223J1234k954o069
$$ -8727 -3490 3203 10541 2720 -13604 6585 27201 18532 2981 -6967 256 11490 8536 2467
6822B467j5353q289l448J8201Q591j3674j3476R167J0921J2810R427o593j0427
$$ 2467 -12886 -21175 -24623 -6422 2169 -11505 -24981 -15814 -4893 7917 17344 10751 324
6809C24j939K738r79j1114M709J3378L905l679j4118L68Q052p064n335O37q655
$$ 324 -1615 1123 144 -10970 -6261 7117 11022 7343 -6775 -6407 1645 -5419 -10754 -10117 -18772
6794a8772L962J5769K615O651M622o952l696n68k202q793p07L884q057O576N265
$$ -18772 -14810 959 3574 10225 14847 7895 4199 3631 1429 -7364 -8071 -4187 -12244 -5668 -403
6779d03j0420J23J2993J253m972r79k379N388J331l529q311R308J570J6073k826
$$ -403 -10823 -10700 2293 3546 -1426 -2405 -4784 604 1935 -1594 -9905 -597 973 17046 14220
6764A4220j6716r439j1084o496N71J7490P982K653J0599r406j8241l023J5735
$$ 14220 -2496 -11935 -23019 -29515 -28944 -11454 -3472 -819 9780 374 -17867 -20890 -5155
6751e155j55J109k448m756P884J8987R48q051m838L689j1017j5391q718Q215M240
$$ -5155 -5310 -4201 -6649 -11405 -3521 15466 16414 8363 3525 7214 -3803 -19194 -27912 -19697 -15457
6736a5457q711R692J4367J1098P565p39q887p372K0225q97j7963j3844m820M812
$$ -15457 -24168 -14476 -109 10989 18554 17815 8928 1556 21781 20884 2921 -10923 -15743 -10931
6722a0931K511J1026J525N936j0729k0773J54l552J5582j572n556m642R289J2344
$$ -10931 -8420 2606 4131 10067 -662 -21435 -21281 -24833 -9251 -10823 -16379 -21021 -11732 612
6708F12J461q64m904r741j697K468l961q460m588k982j697Q898J166m961N384
$$ 612 2073 1209 -3695 -13436 -15133 -12665 -16626 -25086 -29674 -32656 -34353 -25455 -24289 -29250 -23866
6693b3866J133M278J763o851r72K096J4638k673p351L247K0585L114j2392j4007
$$ -23866 -22733 -18455 -16692 -23543 -24515 -22419 -7781 -10454 -17805 -14558 6027 9141 -3251 -17258
6679a7258j810N868K34j4508L912J0599M701L682N926j0338j608j0459o443O278
$$ -17258 -19068 -13200 -12966 -27474 -23562 -12963 -8262 -4580 1346 -8992 -10600 -21059 -27502 -21224
6665b1224r42L280J0414Q177M225P618m473k041N83j0233j119Q584J375p659J4221
$$ -21224 -22166 -18886 -8472 -295 3930 11548 7075 5034 5617 -4616 -5735 2849 4224 -3435 10786
6650A0786K595j636j5259k1695L093J784l18J2656J245L027R0k209J2113J420
$$ 10786 13381 11745 -3514 -25209 -22116 -20332 -20650 -7994 -6749 -3722 -3632 -5841 6272 7692
6636G692q899K777r57j4043j2846n051R412k179j428K3522M731n600K095P79O637
$$ 7692 -1207 1570 613 -13430 -26276 -31327 -21915 -24094 -25522 -2000 2731 -2869 -774 5 6642
6621F642P843M295l143j1344n821J876J9054M065l699j0042k327j242R140p911
$$ 6642 14485 18780 15637 4293 -1528 348 19402 23467 19768 9726 7399 6157 15297 7386
6607G386j3867M26M295N893m357J2045P62o265O5O914q505M104J7865n722p130
$$ 7386 -6481 -6055 -1760 4133 -224 11821 12583 6318 6383 13297 4792 8896 26761 21039 13909
6592A3909l779P218J663N962k6N12j434q034o441N779M309l99k1292j1189l432
$$ 13909 10130 17348 19011 24973 24947 25459 24025 15991 9550 15329 19638 19239 -2053 -13242 -16674
6577a6674J1615q26P223m659j1746j7355M494J5535Q72L697M341n828J30J0498
$$ -16674 -5059 -5885 1338 -3321 -15067 -32422 -27928 -12393 -11521 -7824 -3483 -9311 -9181 1317
6563A317P434L63P93j4026k081J556L439m094J3349m518j4124p100o032R868J5113
$$ 1317 8751 9114 9907 -4119 -6200 -4644 -1205 -5299 8050 3532 -10592 -17692 -23724 -13856 1257
6548A257K0096q372p689p181r05N806P564J519p796P66N970Q553K010j074m428
$$ 1257 21353 12981 5292 -1889 -2794 3012 10576 12095 4299 5065 11035 19588 21598 20524 16096
6533A6096p127j0038K437l112m630N143J961j6488k914J2936J6028o839M949M059
$$ 16096 8969 -1069 1368 -1744 -6374 -1231 730 -15758 -18672 -5736 10292 3453 8402 12461
6519A2461j767O807r923j869O511o693q866l976r906M306M3q605M072P514O037
$$ 12461 10694 17501 7578 5709 12220 5527 -3339 -7315 -17221 -12915 -12872 -21477 -17405 -9891 -3854
6504c854K547q714J0777j81o97R826O77j0115j0328P854M512P330Q555j0200j7225
$$ -3854 -1307 -10021 756 575 -122 9704 10381 266 -10062 -2208 2304 9634 18189 7989 -9236
6489i236L275j1690P734J4571R955p253J062Q32k430j7828m609L527k642p158
$$ -9236 -5961 -17651 -9917 4654 14609 7356 8418 9250 6820 -11008 -15617 -12090 -14732 -21890
6475b1890K442o920Q876q927j3447J2509K2689J803j3516l689L853J1291N508
$$ -21890 -19448 -26368 -17492 -26419 -39866 -27357 -4668 -2865 -16381 -20070 -16217 -4926 582
6462E82j0388q096O723j136o293K651N261N923l429O15M617O062l012j3912P9
$$ 582 -9806 -17902 -11179 -12315 -18608 -15957 -10696 -4773 -8202 -7587 -2970 3092 80 -13832 -13753
6447a3753n396k629J789R97NR906J5425K574J2424j2388j3396j4664o529r06P966
$$ -13753 -19149 -21778 -19989 -18992 -18987 -9081 6344 8918 21342 8954 -4442 -19106 -25635 -26541 -18575
6432a8575J3225J1187n00o39O445j3470j5742N216K259l20L31l453O418J313J344
$$ -18575 -5350 5837 5337 4698 11143 -2327 -18069 -12853 -10594 -10914 -10583 -14036 -7618 -6305 -4961
6417d961J628J4282J4817j0408p336L901j0384j1801k780n666j0142J1080J5972
$$ -4961 -3333 10949 25766 15358 8022 11923 1539 -10262 -13042 -18708 -28850 -17770 -1798
6404a798k362o622o94L464j829J2688j1873o381N278O661M501p286P905P319K232
$$ -1798 -4160 -10782 -11476 -8012 -9841 2847 -9026 -15407 -10129 -3468 1033 -6253 1652 8971 11203
6389A1203q398l651J4888P901p468l118m334J80j3924J0409L420k0774q27J2257
$$ 11203 2805 -846 14042 21943 14475 11357 7023 7203 -6721 3688 7108 -13666 -14493 -2236
6375b236K843m811j2530j516R923j087j5872R544J8390O883J786q837p871%n68
$$ -2236 607 -4204 -16734 -18250 -8327 -9414 -25286 -15742 2648 9531 11317 2480 -5391 -5391 -5959
6360e959Q275Q683J1513p803j2594o018j0540L634q926K140J4982k27O98Q560
$$ -5959 2316 10999 22512 14709 2115 -3903 -14443 -10809 -19735 -17595 -2613 -2840 -2142 6418
6346F418n403j1633j0173j5178K2628K1246p242q532Q402Q27J1616L934K621o809
$$ 6418 1015 -10618 -20791 -35969 -13341 7905 663 -7869 533 1360 12976 16910 19531 12722
6332A2722r756j2712m453m212L167m577o244m470j497n981Q281L1463J2670j1937
$$ 12722 2966 -9746 -14199 -18411 -15244 -19821 -26065 -30535 -32032 -38013 -29732 1731 14401 2464
6318B464j6448j0548m739M472m360n306K0647M653m154P120J340L230p564k0676
$$ 2464 -13984 -24532 -29271 -24799 -29159 -34465 -13818 -9165 -13319 -6199 -4859 -1629 -9193 -29869
6304b9869k832M782K016p739J3177J4183R146p208r221m425J4666J31J2327N8
$$ -29869 -32701 -27919 -25903 -33642 -20465 -6282 2864 -4344 -13565 -17990 -3324 -3193 9134 9192
6290I192o189K654J6098k449j0832J0631j4068j3918o241j179n380k400p019P841
$$ 9192 3003 5657 21755 19306 8474 19105 5037 -8881 -15122 -16301 -21681 -24081 -31100 -23259
6276b3259K0271Q22n561P182k923l175R740j4063m198P52O23M968L272L002J6601
$$ -23259 -2988 -2166 -7727 -545 -3468 -6643 3097 -10966 -15164 -14412 -13789 -8821 -5549 -2547 14054
6261A4054j7326l032K972R74l204j0314p873m34P329Q280k366K417M554M970j4633
$$ 14054 -3272 -6304 -3332 -2358 -5562 -15876 -23749 -24183 -16854 -8574 -10940 -8523 -3969 1001 -13632
6246a3632k1002K459J1924J206J5063j407j1571J763o069J315P474R653Q936K329
$$ -13632 -34634 -32175 -20251 -19045 -3982 -5389 -16960 -15197 -21266 -19951 -12477 -2824 6112 8441
6232H441j1679j1365M412Q288J5130j0002l609j68m107n787j115l777q761o059
$$ 8441 -3238 -14603 -10191 -1903 13227 3225 -384 -552 -4659 -10446 -11561 -15338 -24099 -30158
6218c0158K282J1001j356j7667J0950J8481J6495j484j588J3046J2449j9984l227
$$ -30158 -27876 -16875 -18231 -35898 -24948 -6467 10028 8544 6956 20002 32451 12467 9240
6205I240k848j1818j0573k696M787r348M538L152R04J787J0914M700p49l192q152
$$ 9240 6392 -5426 -15999 -18695 -13908 -23256 -18718 -15566 -14662 -12875 -1961 2739 1990 -1202 -9354
6190i354j0834M003P219P937L988J977n166M592L19m559p596r790K88Q090j129
$$ -9354 -20188 -16185 -8966 -1029 2959 4936 -230 4362 4681 122 -7474 -17264 -16976 -8886 -10015
6175a0015P947O383K682o376M334O102l34o832j728K929q835j6762n527L084k540
$$ -10015 -2068 4315 6997 621 4955 11057 10723 3891 2163 5092 -3743 -20505 -26032 -22948 -25488
6160b5488R900l569L75k868R228k563L371r888m309K302m167N773J3443p482k364
$$ -25488 -15588 -19157 -18782 -21650 -12422 -14985 -11614 -21502 -25811 -23509 -27676 -21903 -8460 -15942 -18306
6145a8306K315o716j903R394L333P845k333O153J2849J715J126j5485m307j1636
$$ -18306 -15991 -22707 -24610 -15216 -11883 -4038 -6371 -218 12631 14346 15472 -13 -4320 -15956
6131a5956J0473K418o087n115R101M508R524J87r059N327M08m574M310j1977j6145
$$ -15956 -5483 -3065 -9152 -14267 -5166 -658 8866 9053 -6 5321 5729 1155 5465 -6512 -22657
6116b2657j3413N804J3188J170K150m773k255O943M271M477j582R694R088O629
$$ -22657 -36070 -30266 -17078 -15908 -13758 -18531 -20786 -13843 -9572 -5095 -6677 3017 12105 18734
6102A8734N759J0218j3357r500P717P731r935q351L021kj0677k0700L093M548
$$ 18734 24493 34711 21354 11854 19571 27302 17367 9016 12037 12035 1358 -19342 -16249 -11701
6088a1701N016l352J3144J5753q883p530j4615l657J0640J807M776L748J2693
$$ -11701 -6685 -10037 3107 18860 9977 2447 -12168 -15825 -5185 -3378 1398 5146 17839
6075A7839M185r435j0756q170R081Q062m723j0115q278J2567P227J291L32j295
$$ 17839 22024 12589 1833 -6337 2744 10806 6083 -4032 -12310 257 7484 8775 9107 7812
6061G812l531N291p821j59R584l533j5874p060l677l605R52j964n786J3870J3392
$$ 7812 4281 9572 1751 1592 11176 7643 -8231 -15291 -18968 -22573 -21621 -23585 -29371 -15501 -2109
6046b109L930Q614K463j5167j8893N187O468r942j443N366K636L170j32K211P92
$$ -2109 1821 10435 12898 -2269 -21162 -15975 -9507 -19449 -20892 -15526 -12890 -9720 -9852 -7641 -6849
6031f849j162k144K127J2554J418K658O229j225j2920J08K221o314o450j670J6694
$$ -6849 -8011 -10155 -8028 4526 5944 8602 14831 13606 686 794 3015 -3299 -9749 -11419 5275
6016E275r952l262J0029J1873l258j4057o861l307O751J913k1587j2613P113J8046
$$ 5275 -4677 -7939 2090 13963 10705 -3352 -10213 -13520 -6769 -4856 -26443 -39056 -31943 -13897
6002a3897J0218L823J790k3125P072J9646O931j714n710q86j0883l299r117J558
$$ -13897 -3679 144 1934 -21191 -14119 5527 12458 10744 5034 4148 -6735 -10034 -19151 -17593
5988a7593J305L315K851o128K366J1336K0230n144j3554r911o361P014O719K033
$$ -17593 -16288 -12973 -10122 -16250 -13884 -2548 17682 12538 -1016 -10927 -17288 -10274 -3555 -1522
5974a522N611k056n126j2218M064J8811j0668j3611K15J9265K298k881J33N028
$$ -1522 4089 2033 -3093 -15311 -11247 7564 -3104 -16715 -16500 2765 5063 2182 2315 7343
5960G343r306r26l802o128k141q711m879L27J2685J466J6779Q000o48n731O66
$$ 7343 -1963 -2889 -6691 -12819 -14960 -23671 -28550 -28223 -15538 -14072 2707 10707 10059 4328 4994
5945D994m025m231j8672p313P674P350J2897L793r00p712m518R303R101j3917
$$ 4994 969 -3262 -21934 -29247 -21573 -14223 -1326 2467 1567 -6145 -10663 -1360 7741 -6176
5931f176o70Q378L640j052O097q763j8566J6893P249r497n876J0757o442Q720
$$ -6176 -6846 1532 5172 4120 10217 1454 -17112 -219 7030 -2467 -8343 2414 -4028 4692
5917D692m249j9376m07K272j2382J98k720J1138K4092k429N535o173M113J5276
$$ 4692 443 -18933 -19340 -17068 -29450 -29252 -31972 -20834 3258 829 6364 191 4304 19580
5903A9580q814k672j1167M785J9309l547k2060R782M520L715R2l617j3910q50
$$ 19580 10766 8094 -3073 1712 21021 17474 -4586 5196 9716 13431 13523 9906 -4004 -4854
5889d854Q434Q218N470j2202j5433Q360J0231J2964j0493n024j6445k2246J3768
$$ -4854 3580 11798 17268 5066 -10367 -2007 8224 21188 10695 5671 -10774 -33020 -19252
5876a9252K5413L230J253M507r735o079J5187L40j4384j0676K360Q747M497q086
$$ -19252 6161 9391 10644 15151 5416 -663 14524 14864 480 -10196 -7836 911 5408 -2678
5862b678j469q581O43O223o089q506m098q996K860J0001P764n931p555j706j006
$$ -2678 -4147 -12728 -12085 -5862 -11951 -20457 -24555 -33551 -30691 -20690 -12926 -18857 -26412 -28118 -29124
5847b9124Q551Q462N738N110J4017n38o113p258j692j4263J200M510N989r19N416
$$ -29124 -20573 -12111 -6373 -1263 12754 12216 6103 -1155 -2847 -17110 -15910 -11400 -5411 -6330 -914
5832i14N929j0466j38Q436J4252K1k889n922j0933k37l49J0892L442L80j5948
$$ -914 5015 -5451 -5589 2847 17099 17120 14231 8309 -2624 -2861 -3210 7682 11124 11504 -4444
5817d444L833O989J39O995q962j3057K029j3052l955Q234J4465M045l333J638
$$ -4444 -611 6378 6517 13512 4550 -8507 -6478 -19530 -23485 -15251 -786 3259 -74 1564
5803A564p007Q249P220k332m158N893m731k0986O255L119n444l051M954Q753J379
$$ 1564 -5443 2806 10026 7694 3536 9429 4698 -16288 -10033 -6914 -12358 -15409 -10455 -1702 -323
5788c23p42Q63P12r96j0202J838L614m3l195K423K1931J623k280j2077o025l689
$$ -323 -1065 -202 510 -486 -10688 -8850 -5236 -5279 -8474 -6051 15880 17503 15223 3146 -2879 -6568
5772f568J53m366M304q17N023J6063p995j4661o416P586Q428j078J4907P393L073
$$ -6568 -6415 -10781 -6477 -7294 -2271 13792 5797 -8864 -15280 -7694 734 -344 14563 21956 25029
5757B5029p592n93Q669p902j8268m410O682Q73N495P119p787L108m99n103N419
$$ 25029 17437 16844 25513 17611 -657 -5067 1615 2488 7983 15102 7315 10423 9924 4821 10240
5742A0240O806j0315j0443p213k986m808p899J1387J7627O555j757o023r095n613
$$ 10240 17046 6731 -3712 -10925 -13911 -18719 -26618 -15231 2396 8951 7194 1171 -7924 -13537
5728a3537m742j206k94J3637p120l742J319J294o113K506J6257l437p426L900
$$ -13537 -18279 -19485 -19779 -6142 -13262 -17004 -15685 -14391 -20504 -17998 -1741 -5178 -12604 -8704
5714h704Q81r238N47Q509J306Q597q314j3250L006J0668m297P87J3936m432o731
$$ -8704 -7823 -17061 -16514 -8005 -6699 1898 -6416 -19666 -16660 -5992 -10289 -9502 4434 2 -6729
5699f729O536P201M282K19j5326j9161o64J0302M841n190P501n587Q646k848j701
$$ -6729 -193 7008 11290 11509 -3817 -22978 -23642 -13340 -8499 -13689 -6188 -11775 -3129 -5977 -7678
5684g678M000M534j25j0078J0275P026j8961j5179m397r006J3419J0301K1496
$$ -7678 -3678 856 731 -9347 928 7954 -11007 -26186 -30583 -39589 -26170 -15869 5627
5671E627Q394q352j5908n340j2443j344M901K88O705j2514L828K1204Q699l753
$$ 5627 14021 5669 -10239 -15579 -28022 -29366 -24465 -24177 -17472 -29986 -26158 -4954 3745 -8
5657hp027k103j745m299J2300j390n233K402l044l808m48P234P803P432j3037
$$ -8 -7035 -9138 -10883 -15182 -2882 -4272 -9505 -7103 -10147 -13955 -14403 -7169 634 8066 -4971
5642d971j2800m521M780l266R083O023l602m967K807Q205p129n129K630K05J775
$$ -4971 -17771 -22292 -17512 -20778 -11695 -5672 -9274 -14241 -11434 -3229 -10358 -15487 -12857 -12652 -10877
5627a0877M909M210q540J7078R721M605J335N424j5683k3463l502K3948J5585
$$ -10877 -5968 -1758 -10298 6780 16501 21106 22441 27865 12182 -11281 -14783 9165 24750
5614B4750J3833q693j4627P88j4323q835m830M80J4292J6504q308L314K96n194
$$ 24750 38583 29890 15263 16051 1728 -7107 -11937 -11457 2835 19339 11031 14345 14641 9447
5600I447j8377m232O418K192k570L63L464J2443J852j9074j0219R494J8329R94
$$ 9447 -8930 -13162 -6744 -4552 -7122 -6759 -3295 9148 11000 -8074 -18293 -8799 9530 10524
5586A0524m801L06l05L815k637j636j4648q362q1M295J3048Q178Q688R447o439
$$ 10524 5723 6029 5724 9539 6902 5266 -9382 -17744 -17825 -13530 -482 7696 16384 25831 19392
5571A9392j1255k3407n73K0970J1736r231q775o264j7002k750O375J1080q165
$$ 19392 8137 -15270 -15843 5127 16863 7632 -1143 -7407 -24409 -27159 -20784 -9704 -17869
5558a7869p894J529k499L361R615O765J860n843k85J3175J6960n988k6460j7230
$$ -17869 -25763 -24234 -26733 -23372 -13757 -6992 -5132 -10975 -11260 1915 18875 12887 -13573 -30803
5544c0803J6644J4940M438J056j3211j388M782O240j1269j900J007Q238J714j0316
$$ -30803 -14159 781 5219 6275 -6936 -8324 -3542 2698 -8571 -10471 -9464 -1226 488 -9828
5530i828l702l576l784o27k858l336J0579J1063O085K149j256M79P936M793P229
$$ -9828 -13530 -17106 -20890 -21517 -24375 -27711 -17132 -6069 16 2165 909 1388 9324 14117 21346
5515B1346P09j0134J5149M7j0642k5089k047Q224K014o360k197k395K313J382
$$ 21346 22055 11921 27070 27117 16475 -8614 -10661 -2437 -423 -6783 -8980 -11375 -9062 -7680
5501g680J869M459q681k986k947J3554Q303k953j3408l030O228J805j0797j557
$$ -7680 -5811 -1352 -10033 -13019 -15966 -2412 5891 2938 -10470 -13500 -7272 -5467 -16264 -17821
5487a7821j449j1572L099N912r786j859P137J2259q581J8566N411j37j0022j5247
$$ -17821 -19270 -30842 -27743 -21831 -31617 -33476 -26339 -14080 -22661 -4095 1316 1179 -8843 -24090
5473b4090M746R760Q416O305j1123k325j428R214l922J0548l820m22J4387K986
$$ -24090 -19344 -9584 -1168 5137 -5986 -8311 -9739 -525 -4447 6101 2281 1859 16246 19232
5459A9232m723j4321k782J701j7135p399l162K3063L969j3707L768K4690J5039
$$ 19232 14509 188 -2594 -893 -18028 -25427 -28589 -5526 -1557 -15264 -11496 13194 28233
5446B8233o127j3759k479K11l3p699j2420L159N299J244J5904P092n257j7237
$$ 28233 22106 8347 5868 6079 6046 -1653 -14073 -10914 -5615 -4371 11533 18625 13368 -3869
5432c869N142J2825k532q175o026k869J961M616r299j2882L696J0657n178j7952
$$ -3869 1273 14098 11566 3391 -2635 -5504 -3543 1073 -8226 -21108 -17412 -6755 -11933 -29885
5418b9885m016P643J8179M666R396O684j1834K646k575r450r66n137K322J790
$$ -29885 -33901 -26258 -8079 -3413 5983 12667 833 3479 904 -8546 -9512 -14649 -12327 -10537
5404a0537Q621j356n581k9036J1463o78O376J4015J654Q8j048j105P6J1240l31
$$ -10537 -1916 -3272 -8853 -37889 -26426 -27104 -20728 -6713 -5059 -4971 -6019 -7124 -7048 4192 3861
5389C861J985J7192R756j5814k3517m908n030M701O293K448j738Q67j711m613
$$ 3861 5846 23038 32794 16980 -6537 -11445 -16475 -11774 -5481 -3033 -4771 -3904 -5615 -10228
5375a0228j453q563m585J3491K2480J1398J761k829O256j0732q759k454k749M599
$$ -10228 -11681 -20244 -24829 -11338 11142 22540 24301 21472 27728 16996 8237 5783 3034 7633
5361G633J3644J2904l066J0960j340j2890p193q972K900O62m758m196k924r114
$$ 7633 21277 34181 31115 42075 40735 27845 20652 11680 14580 15242 10484 6288 3364 -5750
5347e750J846k381N271N699m140j5271J177N201J2282O356r394j4924J5503J5137
$$ -5750 -3904 -6285 -1014 4685 545 -14726 -13549 -8348 3934 10290 896 -14028 1475 16612
5333A6612J045p205q123p780k68K669O308Q739R000j779r020m075O422p181k635
$$ 16612 17657 10452 2329 -5451 -5719 -3050 3258 11997 20997 19218 10198 6123 12545 5364 2729
5318B729j162o515N09m567m914M644o983Q990Q844L098J5236k0031j7306Q430
$$ 2729 1567 -4948 -4439 -9006 -13920 -9276 -16259 -7269 1575 4673 19909 -122 -17428 -8998
5304h998J2860N697k413r07K302K447j168j4270r034k021l724l573n643L155J170
$$ -8998 3862 9559 7146 6239 8541 10988 9820 -4450 -13484 -15505 -19229 -22802 -28445 -25290 -24120
5289b4120P767R729l119J2637O824j0824r59p484j0437j892n247Q504J5649Q655
$$ -24120 -16353 -6624 -9743 2894 9718 -1106 -2065 -9549 -19986 -21878 -27125 -18621 -2972 5683
5275E683k172J2806p168m564k288L855q323j3476l814o542J6489J1341r794P262
$$ 5683 3511 16317 9149 4585 2297 6152 -2171 -15647 -19461 -26003 -9514 1827 -7967 -705
5261g05J3220O925L52j5288n163r73J09P675J2113K510j2023l649j1289L781J921
$$ -705 12515 19440 19792 4504 -659 -1632 -1523 6152 18265 20775 8752 5103 -6186 -2405 -484
5246d84j1939j0989N594J4519L547Q405k380j8071o836P583J3517O094j2234j1420
$$ -484 -12423 -23412 -17818 -3299 248 8653 6273 -11798 -18634 -11051 2466 8560 -3674 -15094
5232a5094J2495N146q456L585J5443M074j5048l841j78J0781P362r023k1461r310
$$ -15094 -2599 2547 -5909 -2324 13119 17193 2145 -1696 -1874 8907 16269 7246 -14215 -23525
5218b3525J656Q710q37N486J4699P839m965r561K427J4994j0817j3502k658Q446
$$ -23525 -21869 -13159 -13996 -8510 6189 14028 9063 -498 1929 16923 6106 -7396 -10054 -1608
5204a608Q748o052L590J0712k1122j4543N704j559J229J2127j148r083N362J0526
$$ -1608 7140 1088 4678 15390 -5732 -20275 -14571 -16130 -14901 -2774 -3922 -13005 -7643 2883
5190B883R558J0629o66p461m119j6943J0495L269P133K452k854O90p91l455j0427
$$ 2883 12441 23070 22404 14943 10824 -6119 4376 7645 14778 17230 14376 15066 14275 10820 393
5175C93J2311R446p961o037L606j1985j2899j520J5459p407m150j921r752N646
$$ 393 12704 22150 14189 8152 11758 -227 -13126 -14646 813 -6594 -10744 -12665 -22417 -16771
5161a6771J0006O700J1785L09R101j2477j0743j633n027q555P607M240q946l111
$$ -16771 -6765 -65 11720 12029 21130 8653 -2090 -3723 -8750 -17305 -9698 -5458 -14404 -17515
5147a7515N754L634m513o966j154K501O938R679q657j468j2685k308J9765K097
$$ -17515 -11761 -8127 -12640 -19606 -20760 -18259 -11321 -1642 -10299 -11767 -24452 -26760 -6995 -4898
5133d898r290R153j436o338J8058k87n621k323m596L252M750K282R071P03o716
$$ -4898 -14188 -5035 -6471 -12809 5249 4962 -659 -2982 -7578 -4326 424 2706 11777 12480 5764
5118E764j487K992J2251L466j5278j1714j2062K081J0950m279J1235n593j979
$$ 5764 4277 7269 19520 22986 7708 -4006 -16068 -13987 -3037 -7316 3919 -1674 -3653
5105c653L144Q427J0179J850J092p70j2836p966l598J0529J804j4350q084n271
$$ -3653 -509 7918 18097 19947 21039 20269 7433 -533 -4131 6398 8202 -6148 -14232 -19503
5091a9503R307J3848j3215m114J1123K422M36j7775j0740l525K0082J2162Q76
$$ -19503 -10196 3652 -9563 -13677 -2554 -132 304 -17471 -28211 -31736 -11654 508 1384
5078A384l600j541l651J4388K762o389L003J399l124N20J1232j686q462K818N563
$$ 1384 -2216 -3757 -7408 6980 9742 3353 6356 7755 4631 5151 16383 14697 6235 9053 14616
5063A4616K0091n018j2896r343n799m893l392R771M28P629k429r502Q392J0306
$$ 14616 34707 29689 16793 7450 1651 -3242 -6634 3137 3565 11194 8765 -737 7655 17961
5049A7961L013j5454l1706L138r90K427J6011J771J615N889M069r846l574l041
$$ 17961 20974 5520 -26186 -23048 -24038 -21611 -5600 -3829 -2214 3675 7744 -2102 -5676 -8717
5035h717K377q53j3197n62J5725K0281j369o230O43J2080m335j7455l63J140j777
$$ -8717 -6340 -7193 -20390 -20952 -5227 15054 13685 7455 8098 20178 15843 -1612 -1975 -835 -2612
5020b612K354n850j3585k1488Q540J6558K559K052J4285L551j798j1054j654R202
$$ -2612 -258 -6108 -19693 -41181 -32641 -16083 -13524 -11472 2813 6364 4566 -6488 -8142 1060
5006A060P408j3451l422J4069O101q396n721L504J060m197M61J6763O134p895
$$ 1060 8468 -4983 -8405 5664 11765 3369 -2352 1152 2212 -1985 -1524 15239 21373 13478
4992A3478o891N232P63m7p933r683m238j597L454o183l231J2040O937R209p768
$$ 13478 6587 11819 12582 12535 4602 -5081 -9319 -10916 -7462 -13645 -16876 -4836 2101 11310 3542
4977C542o981o179J2494n350n589q040J891j741P427J6632n677m880j7534l582
$$ 3542 -3439 -9618 2876 -2474 -8063 -16103 -14212 -15953 -8526 8106 2429 -2451 -19985 -23567
4963b3567K076M058n434o119J886L77K580J5184J9046N087O836j1121r133m747
$$ -23567 -21491 -17433 -22867 -28986 -27100 -26723 -24143 -8959 10087 15174 22010 10889 1756 -2991
4949b991o317q438J412J544o954j727j891J6876J2785o148P924r139j1784o352
$$ -2991 -9308 -17746 -16334 -14790 -21744 -23471 -25362 -8486 4299 -1849 6075 -3064 -14848 -21200
4935b1200Q037J4124n717r922K678Q894J760n208o195M378R314l769r527o484
$$ -21200 -13163 961 -4756 -14678 -12000 -3106 -1346 -6554 -12749 -8371 943 -2826 -12353 -18837
4921a8837J3468K02j92N6k608Q157J4090M296p34r036n746p744J0559J1819j7652
$$ -18837 -5369 -5167 -5359 -5303 -7911 246 14336 18632 17898 8862 3116 -4628 5931 17750 98
4906I8j7547k899M524O236J878r26J579J5235j0932j5019R356P219M190Q478K880
$$ 98 -17449 -20348 -15824 -9588 -7710 -8636 -7057 8178 -2754 -17773 -8417 -1198 2992 11470 14350
4891A4350j5595m329J1379k668K087P375j0018j0560L043O356P422J1671J5574
$$ 14350 -1245 -5574 5805 3137 5224 12599 2581 -7979 -4936 1420 8842 20513 36087
4878C6087M842q667k6184j3455L792J2965M204j3365P343L38l990J652k778O595
$$ 36087 40929 32262 6078 -7377 -3585 9380 13584 219 7562 7900 3910 5562 2784 9379
4864I379nj1160j2003j523J344P460O588l961j9173N435R671q58K408l2j635J1221
$$ 9379 9374 -1786 -13789 -15312 -13968 -6508 80 -3881 -23054 -17619 -7948 -8806 -6398 -6430 -8065 3156
4848C156j096p866j1538J842Q427Q848N752M044o86Q986n19l349j522j3513l740
$$ 3156 2060 -5806 -17344 -15502 -7075 1773 7525 11569 10883 19869 19350 16001 14479 966 -2774
4833b774J4224J667K768M108N54l098K27m244J798K701j3917r699q114m120Q438
$$ -2774 11450 13117 15885 19993 20547 17449 17676 13432 15230 17931 4014 -5685 -13799 -17919 -9481
4818i481N092o379n226j267K40N149Q389q002n435K809O586r98MJ55P8M504M362
$$ -9481 -4389 -10768 -15994 -17261 -17021 -11872 -3483 -11485 -16920 -14111 -7525 -8523 -8519 -8364 -8286 -3782 580
4801E80Q833j2264r448o736n60J7411r070j2590k861m039J2497p88R615N593p203
$$ 580 9413 -2851 -12299 -19035 -19595 -2184 -11254 -23844 -26705 -30744 -18247 -19035 -9420 -3827 -11030
4786a1030n892L796J8077K921q098O9q140j3809l031L171M574L357j703j465P778
$$ -11030 -16922 -13126 4951 7872 -226 -157 -8297 -22106 -25137 -21966 -17392 -14035 -15738 -17203 -9425
4771i425M651K409j451o011J901R76R481P386k547j5889R02k5949p490K2933o078
$$ -9425 -4774 -2365 -3816 -9827 -7926 -6950 2531 9917 7370 -8519 -7617 -33566 -41056 -18123 -24201
4756b4201J126K0482R454k793L08j4785j0542j698k165q583L541P414Q310J6946
$$ -24201 -23075 -2593 6861 4068 4376 -10409 -20951 -22649 -24814 -33397 -29856 -22442 -14132 2814
4742B814N3m271p879M635J6365K1407p472j7484j9361J415L948k125q680L624
$$ 2814 2867 -1404 -9283 -4648 11717 33124 25652 8168 -11193 -9778 -5830 -7955 -16635 -13011
4728a3011O78P46J0259J686p6j1064L55L058O147K0K2674O805j2948K860o046
$$ -13011 -12333 -11587 -1328 358 282 -10782 -10427 -7369 -1222 -1202 21472 28277 15329 18189 12143
4713A2143j7809k777R480M371K476l572j713k242J0755Q297p265j1034p21O833
$$ 12143 -5666 -8443 1037 5408 7884 4312 2599 357 11112 19409 12144 1110 389 7222
4699G222n428p690O572R216k924k0339k88m986P990J2895q972j3158k162J1398
$$ 7222 1794 -5896 676 9892 6968 -13371 -13659 -18645 -10655 2240 -6732 -19890 -22052 -10654
4685a0654m740J813J3651P78j586K073J1716l81q477N260K182j2578Q61k768R935
$$ -10654 -15394 -13581 70 848 -738 1335 13051 12670 4193 9453 11635 -943 -82 -2850 7085
4670G085Q483j8781k1764N813K8019j0754j7298Q601J2476K84l266J357m053M64
$$ 7085 15568 -3213 -24977 -19164 8855 -1899 -19197 -10596 1880 2164 -1102 255 -3798 -3334
4656c334J50L02j725j297L23L403m954L2n603O760j252J2924j804P798m851r749
$$ -3334 -3184 -2882 -4607 -5904 -5581 -2178 -7132 -7100 -12703 -5943 -7195 5729 3925 11723 6872 -2877
4640b877P57k996r53m514Q6p77j4297j340l876M390O760N095P90k283M465J0420
$$ -2877 -2120 -5116 -6069 -10583 -10497 -11274 -25571 -26911 -30787 -26397 -19637 -14542 -13752 -16035 -11570 -1150
4624a150L927L446j2591j909K5512J1637j7835j8730J441J3352j1946r362N355
$$ -1150 2777 6223 -6368 -8277 17235 28872 11037 -7693 -6252 7100 -4846 -14208 -8853
4611h853L112r172R581Q105m666J0291O196j7117l499N033K967Q658P005l326
$$ -8853 -5741 -14913 -5332 2773 -1893 8398 14594 -2523 -6022 -989 1978 10636 17641 14315
4597A4315j4672j1143q580k674J6741J3927M69j830j3226m66l878P710K083k360
$$ 14315 -357 -11500 -20080 -22754 -6013 7914 8383 6553 -6673 -7139 -11017 -3307 -1224 -3584
4583c584K000K824j0059j0115l067P137M741o47r974Q439R617j1222k102N516
$$ -3584 -1584 1240 -8819 -18934 -22001 -14864 -10123 -10770 -20744 -12305 -2688 -13910 -16012 -10496
4569a0496J5631j128q370N68l123j4808q784J0468J6965m524k767M129j349j2254
$$ -10496 5135 4007 -4363 -3795 -6918 -21726 -30510 -20042 -3077 -7601 -10368 -6239 -7588 -19842
4555a9842k211J7097j118O679n149m327P388M833O322O471R655K190J773k859
$$ -19842 -22053 -4956 -6074 605 -4544 -8871 -1483 3350 9672 16143 25798 27988 29761 26902
4541B6902j6617k2072l386o775O19M655K333R376J1501O311m17l167j0067l342
$$ 26902 10285 -11787 -15173 -21948 -21329 -16674 -14341 -4965 6536 12847 12430 9263 -804 -4146
4527d146L174j33J746J657l531K363N862l392j2549l34j423Q475m516l818J5986
$$ -4146 -972 -1105 641 2298 -1233 1130 6992 3600 -8949 -9283 -10706 -2231 -6747 -10565 5421
4512E421P642M289P054J520m606r171M018Q705j2773k1574O713O444n127M360
$$ 5421 13063 17352 24406 25926 21320 12149 16167 24872 12099 -9475 -2762 3682 -1445 2915
4498B915n70j3028j1713l204R35J0524J1316J3918P377j1598L453N679p797O869
$$ 2915 2345 -10683 -22396 -25600 -24665 -14141 -2825 11093 18470 6872 10325 16004 8207 15076
4484A5076K103r892j13L358l403P978K701P11n977k134K085m984l224p623o674
$$ 15076 17179 7287 7174 10532 7129 15107 17808 18519 12542 10408 12493 7509 4285 -3338 -10012
4469a0012Q322N684j885m692q452N353O107N385J8075n544p811r219J920j4449
$$ -10012 -1690 3994 2109 -2583 -11035 -5682 425 5810 23885 18341 10530 1311 3231 -11218
4455a1218j3966J3704J3539K83r997l393l15m226J3196j216J0747O649P330j808
$$ -11218 -25184 -11480 2059 2342 -7655 -11048 -11363 -15589 -2393 -3609 7138 13787 21117 19309
4441A9309j9826R432M253K12j333j7570j5811L677M106q942N777P413k446R603
$$ 19309 -517 8915 13168 13380 12047 -5523 -21334 -17657 -13551 -22493 -16716 -9303 -11749 -2146
4427b146M289o944j2643K926J549n748j492j606J328O170L123Q632J5747k084
$$ -2146 2143 -4801 -17444 -14518 -12969 -18717 -20209 -21815 -20487 -14317 -11194 -2562 13185 11101
4413A1101J030M571q602p336M628M343R517p060j658p31n939j0438Q07o582L071
$$ 11101 12131 16702 8100 764 5392 9735 19252 12192 10534 9803 3864 -6574 -5767 -12349 -9278
4398i278j341P837J7131j0263j7073R135j0983q78Q411o625N759N501R412J0890
$$ -9278 -10619 -2782 14349 4086 -12987 -3852 -14835 -15713 -7302 -13927 -8168 -2667 6745 17635
4384A7635J883q702j1207l361R743n520j205J840J7114k35j0659R15j391q764
$$ 17635 19518 10816 -391 -3752 5991 471 -734 1106 18220 17985 7326 8241 6850 -1914
4370a914j2517M173N177j997L382R940J8938p209p963o625M373M198q90l526l046
$$ -1914 -14431 -10258 -5081 -7078 -3696 6244 25182 17973 10010 3385 7758 11956 11066 7540 4494
4355D494K493J528M919r874p78j582p203R198J3602jj2628o308R979M596j0797
$$ 4494 6987 8515 13434 3560 2782 1200 -6003 3195 16797 16796 4168 -2140 7839 12435 1638
4340A638j077n336j2653O560J2025J4397R391L03P455r312j5559L677K209M784
$$ 1638 561 -4775 -17428 -10868 1157 15554 24945 25248 32703 23391 7832 11509 13718 18502
4326A8502J553m249o288q70K873m160m258o059n440l553m235R035j406k550J4590
$$ 18502 20055 15806 9518 8648 11521 7361 3103 -2956 -8396 -11949 -16184 -7149 -8555 -11105 3485
4311C485m155m319k290p988k41j4758j3434L931M278J9102J0343L270O137m681
$$ 3485 -670 -4989 -7279 -15267 -15508 -30266 -43700 -39769 -35491 -16389 -6046 -2776 3361 -1320
4297a320k245M102J1628K56m364j0020k734l423O566J2347p610L543J2752l344
$$ -1320 -3565 537 12165 12421 8057 -1963 -4697 -8120 -1554 10793 3183 6726 19478 16134
4283A6134r185j0273j14R265J267o129N862r384j2170m908J8419J9230n543r742
$$ 16134 6949 -3324 -3438 5827 7094 965 6827 -2557 -14727 -19635 -1216 18014 12471 2729
4269B729j20j4381n454q748l842P420J534L000K0290J0211L827j2171j3739K454
$$ 2729 2609 -11772 -17226 -25974 -29816 -22396 -20862 -17862 2428 12639 16466 4295 -9444 -6990
4255f990J1763P693n099Q295L53n030l165r82q548o857k985k516n034n749o087
$$ -6990 4773 12466 7367 15662 16015 10985 7820 6838 -1710 -8567 -11552 -14068 -19102 -24851 -30938
4240c0938J928Q016P166j263N695J705j5798M153R419o159L517J0479K2328m612
$$ -30938 -29010 -20994 -13828 -15091 -9396 -7691 -23489 -19336 -9917 -16076 -12559 -2080 20248 15636
4226A5636l979j1444l929Q183M097P931r735K320o473j0680J4484N760J444p092
$$ 15636 11657 213 -3716 4467 8564 16495 6760 9080 2607 -8073 6411 12171 13615 6523
4212F523j628M740O717N451j412n341q488p112K967Q089k908m221K696J638j0509
$$ 6523 4895 9635 16352 21803 20391 15050 6562 -550 2417 10506 7598 3377 6073 7711 -2798
4197b798m272M312r196j1528j1183j1580O405J0768J5311O970M666L119m379j6614
$$ -2798 -7070 -2758 -11954 -23482 -34665 -46245 -39840 -29072 -13761 -6791 -2125 994 -3385 -19999
4183a9999p40l414p51J0127J3972J2842J4336p275o987n916M84K609k829L417
$$ -19999 -20739 -24153 -24904 -14777 -805 12037 26373 19098 12111 6195 6679 9288 6459 9876
4169I876m724j2817j6749n080Q112J0975J2449J1305n575j4164L418J5846J2109
$$ 9876 5152 -7665 -24414 -29494 -21382 -10407 2042 13347 7772 -6392 -2974 12872 24981
4156B4981N853k5191q350K473P027J59K898J873k500o80J4041N166p714r44L335
$$ 24981 30834 5643 -2707 -234 6793 6952 9850 11723 9223 8543 22584 27750 20036 19092 22427
4141B2427l290L47o982o299r264l380r456r20K331n58K399J4401m660o11N601
$$ 22427 19137 19484 12502 6203 -3061 -6441 -15897 -16817 -14486 -15044 -12645 1756 -2904 -3515 2086
4126B086l349r033j832l305J923k716P459L909j4912j1588J0555J9409n793K697
$$ 2086 -1263 -10296 -12128 -15433 -13510 -16226 -8767 -4858 -19770 -31358 -20803 -1394 -7187 -4490
4112d490j6815j0707J0699L371N065J6496Q331J0770J463n112k687K243m340j6985
$$ -4490 -21305 -32012 -21313 -17942 -12877 3619 11950 22720 24183 19071 16384 18627 14287 -2698
4098b698j7090K1751J0235j1717q361j6286Q12Q195Q293n098j204k894l561J5561
$$ -2698 -19788 1963 12198 481 -7880 -24166 -23354 -15159 -6866 -11964 -13168 -16062 -19623 -4062
4084d062N170K545k202j1396M106p195O58J460J7043J3548K950j6685j0615O151
$$ -4062 1108 3653 1451 -9945 -5839 -13034 -12376 -10916 6127 19675 22625 5940 -4675 1476
4070A476P177N210p121k0830n350M440J5003l976n437Q499j2395N601J5739N623
$$ 1476 8653 13863 6742 -14088 -19438 -14998 5 -3971 -9408 -909 -13304 -7703 8036 13659
4056A3659n395j1928j0369R571Q236j418m35r563M040o98L903O493K741L841j6256
$$ 13659 8264 -3664 -14033 -4462 3774 2356 1921 -7642 -3602 -4300 -397 6096 8837 12678 -3578
4041c578j0386N381r602o358K994P724o356o223j6510J2953P923P020J480R421
$$ -3578 -13964 -8583 -18185 -24543 -21549 -13825 -20181 -26404 -42914 -29961 -22038 -15018 -13538 -4117
4027d117J088O30M008j119P673J812l560q484n518r109o881l533L677k175J8678
$$ -4117 -3029 -2399 1609 490 8163 9975 6415 -2069 -7587 -16696 -23577 -27110 -23433 -25608 -6930
4012f930j632m821P591P165M697j0690k464J2563j1077n472P944j099o867Q800
$$ -6930 -8562 -13383 -5792 1373 6070 -4620 -7084 5479 -5598 -11070 -3126 -4225 -11092 -2292
3998b292m17J809j0234k690N859K074N159q072K916Q92j2919O993M188L591K647
$$ -2292 -2709 -900 -11134 -13824 -7965 -5891 -732 -8804 -5888 -4996 -17915 -10922 -6734 -3143 -496
3983d96J1600Q533L797K096j5505j9825k774J2458J3235p364j6884K80j0264J28
$$ -496 11104 19637 23434 25530 10025 -9800 -12574 -116 13119 5755 -11129 -10849 -21113 -20985
3969b0985Q653k683l368K036J0570Q320n079q724M30J080N291M799L069n296k545
$$ -20985 -12332 -15015 -18383 -16347 -5777 2543 -2536 -11260 -10830 -9750 -4459 340 3409 -1887 -4432
3954d432J0188M545p139j3706M774J0812J843l706R0P292k408l825l85J4662Q043
$$ -4432 5756 10301 3162 -10544 -5770 5042 6885 3179 3269 10561 8153 4328 3943 18605 26648
3939B6648p24m300j8821M401J570p326j3467r363m484K10L116J5159Q672K861
$$ 26648 25924 21624 2803 7204 8774 1448 -12019 -21382 -25866 -25656 -22540 -7381 1291 4152
3925D152L217j1152M401J8339L054J806O544p261m991q587r077l6M691k466l996
$$ 4152 7369 -3783 618 18957 22011 23817 30361 23100 18109 9522 445 409 5100 2634 -1362
$$ [...]
##END NTUPLES=NMR SPECTRUM
##END=
