##TITLE=Analysis number 328596
Compound Code cc 13601
Book Reference 521/69
Project Code adrs
Chemist Name evam
##JCAMPDX= 6.0         $$ Bruker NMR JCAMP-DX V2.0
##DATA TYPE= NMR SPECTRUM
##DATA CLASS= NTUPLES
##ORIGIN= Bruker BioSpin GmbH
##OWNER= nmr
$$ XWIN-NMR		Version 3.5
$$ Thu Jun 21 08:53:24 2007 GMT Daylight Time (UT+1h)  MAYBRIDGE\nmr@NMR_250MHZ
##.OBSERVE FREQUENCY= 250.131544655141
##.OBSERVE NUCLEUS= ^1H
##.ACQUISITION MODE= SIMULTANEOUS (DQD)
##.ACQUISITION SCHEME= undefined
##.AVERAGES= 16
##.DIGITISER RES= 18
##SPECTROMETER/DATA SYSTEM= dpx250
##.PULSE SEQUENCE= zg30
##.SOLVENT NAME= DMSO
##.SHIFT REFERENCE= (INTERNAL, DMSO, 0, 16.5121)
##AUDIT TRAIL= $$ (NUMBER, WHEN, WHO, WHERE, WHAT)
$$ ##TITLE= Audit trail, XWIN-NMR		Version 3.5
$$ ##JCAMPDX= 5.01
$$ ##ORIGIN= Bruker BioSpin GmbH
$$ ##OWNER= nmr
$$ C:\u/data/dgb/nmr/ADRS/1760/pdata/1/auditp.txt
$$ ##AUDIT TRAIL=  $$ (NUMBER, WHEN, WHO, WHERE, WHAT)
(   1,<2007-06-21 08:53:02.96 +100>,<MAYBRIDGE\nmr>,<NMR_250MHZ>,
      <created by zg, POWCHK disabled, PULCHK disabled
       configuration hash MD5:
       76 6E 9A 78 1E 09 19 81 EC 84 63 8F B0 6A 59 2D
       data hash MD5: 64K
       78 55 12 87 31 B7 87 BC C3 F0 F1 81 29 7C AF E4>)
(   2,<2007-06-21 08:53:14.87 +100>,<MAYBRIDGE\nmr>,<NMR_250MHZ>,
      <Start of raw data processing
       ef LB = 0.3 FT_mod = 6 PKNL = 1 SI = 32K 
       data hash MD5: 32K
       45 C1 BB 53 F6 6F 4D B5 0F 60 E6 98 9C 20 B8 74>)
(   3,<2007-06-21 08:53:16.45 +100>,<MAYBRIDGE\nmr>,<NMR_250MHZ>,
      <apk 
       data hash MD5: 32K
       19 6C 5C 1B 6E 9F CB 1E A0 7E 01 AE D9 D9 B3 9C>)
(   4,<2007-06-21 08:53:17.18 +100>,<MAYBRIDGE\nmr>,<NMR_250MHZ>,
      <abs ABSG = 5 
       data hash MD5: 32K
       2B 31 39 F5 37 E8 11 08 1A 3F 1C 49 F3 C2 DE FF>)
$$ ##END=
$$ 
$$ hash MD5
$$ 77 3F CC 1A AF A4 E7 E9 4B 36 9C 28 6D A5 72 C7
##$RELAX= 
##$RELAX= 
##$RELAX= 
##$RELAX= 
##$RELAX= 
##$RELAX= 
##$RELAX= 
$$ Bruker specific parameters
$$ --------------------------
##$DU= <C:\u>
##$EXPNO= 1760
##$NAME= <ADRS>
##$PROCNO= 1
##$TYPE= <nmr>
##$USER= <dgb>
##$AMP= (0..31)
100 100 100 100 100 100 100 100 100 100 100 100 100 100 100 100 100 100 
100 100 100 100 100 100 100 100 100 100 100 100 100 100 
##$AQSEQ= 0
##$AQ_mod= 3
##$AUNM= <au_zg>
##$AUTOPOS= <2 >
##$BF1= 250.13
##$BF2= 250.13
##$BF3= 250.13
##$BF4= 250.13
##$BF5= 500.13
##$BF6= 500.13
##$BF7= 500.13
##$BF8= 500.13
##$BYTORDA= 1
##$CFDGTYP= 0
##$CFRGTYP= 5
##$CHEMSTR= <none>
##$CNST= (0..31)
1 1 145 1 1 1 1 1 1 1 1 1 1 1 1 1 1 1 1 1 1 1 1 1 1 1 1 1 1 1 1 1 
##$CPDPRG= <>
##$CPDPRG1= <>
##$CPDPRG2= <>
##$CPDPRG3= <>
##$CPDPRG4= <mlev>
##$CPDPRG5= <mlev>
##$CPDPRG6= <mlev>
##$CPDPRG7= <mlev>
##$CPDPRG8= <mlev>
##$CPDPRGB= <>
##$CPDPRGT= <>
##$D= (0..31)
0 1 0 0 0 0 0 0 0 0.06 0 0 0 0 0 0 0.0002 0 0 0 0 0 0 0 0 0 0 0 0 0 0 
0 
##$DATE= 1182412381
##$DBL= (0..7)
120 120 120 120 120 120 120 120 
##$DBP= (0..7)
150 150 150 150 150 150 150 150 
##$DBP07= 0
##$DBPNAM0= <>
##$DBPNAM1= <>
$$ [...]
##$SUBNAM7= <"">
##$SUBNAM8= <"">
##$SUBNAM9= <"">
##$SW= 20.6930455092707
##$SWIBOX= (0..15)
0 0 3 0 0 0 0 0 0 0 0 0 0 0 0 0 
##$SW_h= 5175.983436853
##$TD= 65536
##$TD0= 1
##$TE= 296.16
##$TE2= 300
##$TE3= 300
##$TEG= 300
##$TL= (0..7)
0 120 120 120 120 120 120 120 
##$TP= (0..7)
150 150 150 150 150 150 150 150 
##$TP07= 0
##$TPNAME0= <>
##$TPNAME1= <>
##$TPNAME2= <>
##$TPNAME3= <>
##$TPNAME4= <>
##$TPNAME5= <>
##$TPNAME6= <>
##$TPNAME7= <>
##$TPOAL= (0..7)
0.5 0.5 0.5 0.5 0.5 0.5 0.5 0.5 
##$TPOFFS= (0..7)
0 0 0 0 0 0 0 0 
##$TUNHIN= 0
##$TUNHOUT= 0
##$TUNXOUT= 0
##$USERA1= <user>
##$USERA2= <user>
##$USERA3= <user>
##$USERA4= <user>
##$USERA5= <user>
##$V9= 5
##$VALIST= <valist>
##$VCLIST= <CCCCCCCCCCCCCCC>
##$VD= 0
##$VDLIST= <DDDDDDDDDDDDDDD>
##$VPLIST= <PPPPPPPPPPPPPPP>
##$VTLIST= <TTTTTTTTTTTTTTT>
##$WBST= 1024
##$WBSW= 4
##$XGAIN= (0..3)
0 0 0 0 
##$XL= 0
##$YL= 0
##$YMAX_a= 219461
##$YMIN_a= -193052
##$ZGOPTNS= <>
##$ZL1= 120
##$ZL2= 120
##$ZL3= 120
##$ZL4= 120
##$ABSF1= 16.51206
##$ABSF2= -4.181112
##$ABSG= 5
##$ABSL= 3
##$ALPHA= 0
##$AQORDER= 0
##$ASSFAC= 0
##$ASSFACI= 0
##$ASSFACX= 0
##$ASSWID= 0
##$AUNMP= <proc_1d>
##$AZFE= 0.1
##$AZFW= 0.1
##$BCFW= 0
##$BC_mod= 0
##$BYTORDP= 0
##$COROFFS= 0
##$CY= 12.5
##$DATMOD= 1
##$DC= 0
##$DFILT= <>
##$DTYPP= 0
##$F1P= 14.0000005364418
##$F2P= -0.99999901652339
##$FCOR= 0.5
##$FTSIZE= 32768
##$FT_mod= 6
##$GAMMA= 0
##$GB= 0
##$INTBC= 1
##$INTSCL= 1
##$ISEN= 128
##$LB= 0.3
##$LEV0= 0
##$LPBIN= 0
##$MAXI= 10000
##$MC2= 0
##$MEAN= 0
##$ME_mod= 0
##$MI= 0
##$NCOEF= 0
##$NC_proc= -4
##$NLEV= 6
##$NOISF1= 0
##$NOISF2= 0
##$NSP= 0
##$NTH_PI= 0
##$NZP= 0
##$OFFSET= 16.51206
##$PC= 1
##$PHC0= -65.59857
##$PHC1= 8.976347
##$PH_mod= 1
##$PKNL= yes
##$PPARMOD= 0
##$PSCAL= 4
##$PSIGN= 0
##$REVERSE= no
##$SF= 250.130002485419
##$SI= 32768
##$SIGF1= 0
##$SIGF2= 0
##$SINO= 400
##$SIOLD= 32768
##$SREGLST= <1H.DMSO>
##$SSB= 0
##$STSI= 32768
##$STSR= 0
##$SW_p= 5175.98343685301
##$SYMM= 0
##$S_DEV= 0
##$TDeff= 65536
##$TDoff= 0
##$TI= <Analysis number 999999
Compound Code 99
Book Reference 9
Project Code 9>
##$TILT= no
##$TM1= 0
##$TM2= 0
##$TOPLEV= 0
##$USERP1= <user>
##$USERP2= <user>
##$USERP3= <user>
##$USERP4= <user>
##$USERP5= <user>
##$WDW= 1
##$XDIM= 32768
##$YMAX_p= 522972083
##$YMIN_p= -237293
$$ End of Bruker specific parameters
$$ ---------------------------------
##NTUPLES= NMR SPECTRUM
##VAR_NAME=  FREQUENCY,     SPECTRUM/REAL,   SPECTRUM/IMAG
##SYMBOL=    X,             R,               I
##VAR_TYPE=  INDEPENDENT,   DEPENDENT,       DEPENDENT
##VAR_FORM=  AFFN,          ASDF,            ASDF
##VAR_DIM=   32768,         32768,           32768
##UNITS=     HZ,            ARBITRARY UNITS, ARBITRARY UNITS
##FACTOR=    0.157963299565203, 1,           1
##FIRST=     4130.16165021221, 0,            0
##LAST=      -1045.8217866408, 0,            0
##MIN=       -1045.8217866408, -237293,      0
##MAX=       4130.16165021221, 522972083,    0
$$ Real data points
##PAGE= N=1
##DATA TABLE= (X++(R..R)), XYDATA
$$ [...]
18516i0709L0308j8709j6376M333j9583j5772k0313J7535M9059L8218K0441O180
$$ -90709 -60401 -79110 -95486 -91153 -110736 -126508 -146821 -129286 -80227 -42009 -21568 -15388
18504a5388M0153K9753n0764p588k27j6105l7277p202M4393L775o644L9143K3687
$$ -15388 24765 54518 3754 -3834 -4061 -20166 -57443 -64645 -20252 -16477 -23121 16022 39709
18491C9709Q843j343o9033k3704n785J4284p088l6337L9127P791l3891N418k3390
$$ 39709 48552 47209 -21824 -45528 -51313 -37029 -44117 -80454 -41327 -33536 -67427 -62009 -85399
18478h5399k273O9736L2529p4353j8261k9091j8005O6355J2579j8513L1053j4118
$$ -85399 -87672 -17936 14593 -59760 -78021 -107112 -125117 -58762 -46183 -64696 -33643 -47761
18466d7761k2925L676L584J289l1612r48J0015L0197Q313j1784M5280M7473J2325
$$ -47761 -70686 -67010 -63426 -62137 -93749 -94697 -84682 -54485 -46172 -57956 -12676 34797 47122
18453D7122m0512L3182j8750k2665j0286O38L343j4046k3593J9157j3176K8496
$$ 47122 6610 39792 21042 -1623 -11909 -11271 -7928 -21974 -45567 -26410 -39586 -11090
18441a1090j3585J0746J7089l6039n0063m410L2216J2359N2704o9329j4856O1532
$$ -11090 -24675 -13929 3160 -32879 -82942 -87352 -55136 -42777 9927 -59402 -74258 -12726
18429a2726K6360m8397l8760n2920M492R3561M4580K7536l4395k71R943n9958
$$ -12726 13634 -34763 -73523 -126443 -121951 -28390 16190 43726 9331 9060 19003 -40955
18417d0955k3688m8828N0602L075k8020M3947n1k466J983M189l4577o1521j2802
$$ -40955 -64643 -113471 -62869 -59794 -87814 -43867 -43918 -46384 -44401 -40212 -74789 -136310 -149112
18404a49112J8291j6886j1752p7834J6060O6206O9318K7968M4558j2069J4597
$$ -149112 -130821 -147707 -159459 -237293 -221233 -155027 -85709 -57741 -13183 -25252 -10655
18393a0655J7111l6153m7557k6042M874l321j4410O2411L6388k5741m613M4525
$$ -10655 6456 -29697 -77254 -103296 -98422 -101743 -116153 -53742 -17354 -43095 -47708 -3183
18381c183N7456l4945l4217p161K8405o0156n0651l6739j5400r171k697M4196
$$ -3183 54273 19328 -14889 -22050 6355 -53801 -104452 -141191 -156591 -165762 -168459 -124263
18369a24263N3125L0655j1836n3746k3417J2959j2056L390j3184K9861K6903K6613
$$ -124263 -71138 -40483 -52319 -106065 -129482 -116523 -128579 -125189 -138373 -108512 -81609 -54996
18357e4996L3348k2445o131J2343j8376O358L2990L1026k1082j6831L961k100
$$ -54996 -21648 -44093 -50224 -37881 -56257 -49899 -16909 14117 -6965 -23796 -19835 -21935
18345b1935M1351N52n5968m1327j3884K9071P8907j541q7440j5019J0556L5736
$$ -21935 19416 19968 -36000 -77327 -91211 -62140 16767 15226 -72214 -87233 -76677 -40941
18333d0941K6547M7650o1984q1688n1589n076N5135P9956K2259l1861p01k537
$$ -40941 -14394 33256 -28728 -110416 -162005 -167081 -111946 -31990 -9731 -41592 -42293 -44830
18321d4830L9941j2501J8246k3408k262K6980L915R331L7529n8260p8566k3430
$$ -44830 -4889 -17390 856 -22552 -24814 2166 6081 15412 52941 -5319 -83885 -107315
18309a07315M099O3637N4021k2930j02372n341O8093o081L1946j6112k7606l1572
$$ -107315 -103216 -39579 14442 -8488 -110860 -116201 -48108 -54189 -22243 -38355 -65961 -97533
18297i7533J7041K3357P006l7861n1510P6651N0128L4336N1157r107L313o905
$$ -97533 -80492 -57135 -50129 -87990 -139500 -62849 -12721 21615 72772 63665 66978 60073
18285F0073q9369M5567k0378l2637k4206R153k3788N83K4489O486N075K548k8234
$$ 60073 -29296 16271 -4107 -36744 -60950 -51797 -75585 -75002 -50513 -44027 -38952 -36404 -64638
18272f4638P2261L6563m1352J6090j985j7090J3142j324k1115l5014J02330J7534
$$ -64638 7623 44186 2834 18924 16939 -151 12991 11667 -9448 -44462 57868 75402
18260G5402j031L5074j9125k0275l7198N0549M0319M0139k7261N6137N3301K3553
$$ 75402 74371 109445 90320 70045 32847 83396 123715 163854 136593 192730 246031 269584
18248B69584n056p6321p040J6728m2166r1982l6490k1082R28K8985l0530p3750
$$ 269584 264528 188207 181167 197895 155729 63747 27257 6175 7103 36088 5558 -68192
18236f8192j6932K1426j1165J9472K9452N256l4140J7143j6440J0108K7051m260
$$ -68192 -85124 -63698 -74863 -55391 -25939 -20683 -54823 -37680 -54120 -44012 -16961 -21221
18224b1221N8464M863j8905o2406J8682K7039m6693n9147L0851M8067j2941q63
$$ -21221 37243 42106 23201 -39205 -20523 6516 -40177 -99324 -68473 -20406 -33347 -34210
18212c4210N9413k3494j5679r79J948K359k6N655L1371N7155N31l6152J7850M1047
$$ -34210 25203 1709 -13970 -14949 -13001 -10642 -10668 -5013 26358 83513 84044 47892 65742 106789
18198A06789R4459P1756O1270M417L5549M678n0777j04684o4369o2934j48152
$$ 106789 201248 273004 334274 338691 374240 378918 328141 223457 159088 96154 -51998
18187e1998k052J3651N2160L1816p59l8631k6234k4840l9771K8588K014k9589
$$ -51998 -54050 -40399 11761 43577 42818 4187 -22047 -46887 -86658 -58070 -56056 -85645
18175h5645K9587R347l2386j5973j3859R8428P5773q995p2006l8420m2674j7271
$$ -85645 -56058 -46711 -79097 -95070 -108929 -10501 65272 56277 -15729 -54149 -96823 -114094
18163a14094L8666L7312l1777l6722n448L9526N102l7698O428l3534J8450R570
$$ -114094 -75428 -38116 -69893 -106615 -112063 -72537 -67435 -105133 -98705 -132239 -113789 -104219
18151a04219J1727J6714K732K5028M193l130M9023J4625j7685o7931m761l1593
$$ -104219 -92492 -75778 -73046 -48018 -43825 -46955 2068 16693 -992 -68923 -73684 -105277
18139a05277k2199M7829M3898J2607p9462k9839L6574J8300J4688o956J5906J9934
$$ -105277 -127476 -79647 -35749 -23142 -102604 -132443 -95869 -77569 -62881 -69837 -53931 -33997
18127c3997M0176p971K4459L2065l6819m3132J5484M7761O4588M2567q668l1190
$$ -33997 6179 -1792 22667 54732 17913 -25219 -9735 38026 102614 145181 136513 105323
18115A05323m276n1662r2350m8044K5697J858O4213K4568j8527O454m7442m0979
$$ 105323 101047 49385 -42965 -91009 -65312 -63454 759 25327 6800 13254 -34188 -75167
18103g5167N624K0498n3849m1126N52L9205o64O9833K8619L09M426K3072j6489
$$ -75167 -69543 -49045 -102894 -144020 -143468 -104263 -104927 -35094 -6475 -6166 -1740 21332 4843
18090D843l9171R191J0899Q665K5000m1510o4042O8038M7848m098k1789q689n3378
$$ 4843 -34328 -25137 -14238 -5573 19427 -22083 -86125 -18087 29761 25663 3874 -4815 -58193
18077e8193N636m898j2803p424J9436R478K2079j6972k2922Q7n6331L6952R2187
$$ -58193 -52557 -57455 -70258 -77682 -58246 -48768 -26689 -43661 -66583 -66496 -122827 -85875 6312
18064F312P6869j2169m8217n1699l2977q5392M7401K1986k3322j3125K0966N0691
$$ 6312 83181 71012 22795 -28904 -61881 -147273 -99872 -77886 -101208 -114333 -93367 -42676
18052d2676O240M0664K2607j2542J8576k512o02K1841K044j4934K1080j4893l080
$$ -42676 -36436 4228 26835 14293 32869 30357 29755 51596 53640 38706 59786 44893 41813
18039D1813j6586m7634M4998J7227K609j0819O600j4301M2042J9125j3195l9628
$$ 41813 25227 -22407 22591 39818 42427 31608 38208 23907 65949 85074 71879 32251
18027C2251J3313K6466k2187n253m44r34m697n585O687K044l5818P2K364M8891
$$ 32251 45564 72030 49843 44590 44146 43212 38515 32930 39617 41661 5843 5915 8279 57170
18013E7170j3015m9656K2218L733n1087p661j526j3684k7550j4750j9606j5012
$$ 57170 44155 -5501 16717 20450 -30637 -38298 -39824 -53508 -81058 -95808 -115414 -130426
18001a30426N6385M0515K6670M1251L2843k8683J35n5118J5950r798K2242N9638
$$ -130426 -74041 -33526 -6856 34395 67238 38555 38690 -16428 -478 -10276 11966 71604
17989G1604O771L192J0515j9268m5274n302J633n5889n4700J0268m101o9612M4901
$$ 71604 78375 81567 92082 72814 27540 22238 23871 -32018 -86718 -76450 -80551 -150163 -105262
17976a05262k9511l671M9537J8586K7647L7309l1174k167l0755j0405M7941K1419
$$ -105262 -134773 -138444 -88907 -70321 -42674 -5365 -36539 -38706 -69461 -79866 -31925 -10506
17964a0506j8262O838K3706m5027n343O7388m2531p3686J7721o271N4413k7222
$$ -10506 -28768 -21930 1776 -43251 -48594 18794 -23737 -97423 -79702 -85973 -31560 -58782
17952e8782r257m9549j9844N7477N8072L7228m3975q1035l135p884J5026k3317
$$ -58782 -68039 -117588 -137432 -79955 -21883 15345 -28630 -109665 -112800 -120684 -105658 -128975
17940a28975p728K3254O2371L81N453l90k027L4852k4584j6398n6172K7000l467
$$ -128975 -136703 -113449 -51078 -50697 -45244 -45634 -47661 -12809 -37393 -53791 -109963 -82963 -86430
17927h6430O819Q1256K9506M0698K9527n6811k5076O160Q037m7322O5589O1443
$$ -86430 -79611 1645 31151 71849 101376 44565 19489 25649 33686 -13636 51953 113396
17915A13396p5508o8126l9478n894J9654K0917l1055L7517r051k0914K8388p817
$$ 113396 37888 -30238 -69716 -75610 -55956 -35039 -66094 -28577 -37628 -58542 -30154 -37971
17903c7971n5086j7352J2004K2762K6107K9382Q766J6367J7767k6687Q127j5560
$$ -37971 -93057 -110409 -98405 -75643 -49536 -20154 -11388 4979 22746 -3941 4186 -11374
17891a1374k8108K1116J2151J1223k4352N291J9047k0674J312l1000o7434m284
$$ -11374 -39482 -18366 -6215 5008 -19344 -14053 4994 -15680 -14368 -45368 -112802 -117086
17879a17086N9466N2973K8000m3658l7678j9682k9681L3374J6258M3193J7914
$$ -117086 -57620 -4647 23353 -20305 -57983 -77665 -107346 -73972 -57714 -14521 3393
17868C393K220n4273M153l7125J3090N6745N0265k0834m837L2073l1026n8382
$$ 3393 5613 -48660 -44507 -81632 -68542 -11797 38468 17634 12797 44870 13844 -44538
17856d4538q4616j1221L8669K9686o505R839k2692j9864k28k4399O2346Q9048
$$ -44538 -129154 -140375 -101706 -72020 -78525 -68686 -91378 -111242 -111470 -135869 -73523 15525
17844A5525k9415p3034k462m201l7196J6023L6963n364L6629J2374l1066j8112
$$ 15525 -13890 -86924 -89386 -93587 -130783 -114760 -77797 -83161 -46532 -34158 -65224 -83336
17832h3336k3000L3382R4405L0240k4607n5461L0298J72p786l9116K29J7599n7821
$$ -83336 -106336 -72954 21451 51691 27084 -28377 1921 2093 -5693 -44809 -44580 -26981 -84802
17819h4802K1321M6182m3914K9598K2280k2322m3815K0907l8738k6223P0105N6911
$$ -84802 -63481 -17299 -61213 -31615 -9335 -31657 -75472 -54565 -93303 -119526 -49421 7490
17807G490Q1530L1182j6224j18573r3602K9964K8832j4125m9767j6486j3929O5439
$$ 7490 89020 120202 103978 -14595 -108197 -78233 -49401 -63526 -113293 -129779 -143708 -78269
17795g8269K2446j7834J5115j3832l1650l0547L9234N088L5791O357j3321M4174
$$ -78269 -55823 -73657 -58542 -72374 -104024 -134571 -95337 -90249 -54458 -48101 -61422 -17248
17783a7248K2213l7080m4890N653O3753K068l9447l7269l1707Q910J7309J0384
$$ -17248 4965 -32115 -77005 -71352 -7599 -5531 -44978 -82247 -113954 -105044 -87735 -77351
17771g7351O0739K4248Q284n2775j2387J7708l2539L424Q1415j1193m2495l985
$$ -77351 -16612 7636 15920 -36855 -49242 -31534 -64073 -60649 20766 9573 -32922 -36907
17759c6907K1758K2909j5812n594n6032l2397L69k4724O2785M7921l7312J5709
$$ -36907 -15149 7760 -8052 -13646 -69678 -102075 -101706 -126430 -63645 -15724 -53036 -37327
17747c7327n9913l339N436k4768l2361N499J7919M7105O6792j5230K3750k3051
$$ -37327 -97240 -100579 -95143 -119911 -152272 -146773 -128854 -81749 -14957 -30187 -6437 -29488
17735b9488l9131k9185j9354m7929j5410M5022n361J5910K9220K3329l3922K7365
$$ -29488 -68619 -97804 -117158 -165087 -180497 -135475 -140836 -124926 -95706 -72377 -106299 -78934
17723g8934P4131M759K7370o662p9218L3357M6377M5700J487o7551J1242m0570
$$ -78934 -4803 -44 27326 20664 -58554 -25197 21180 66880 68367 816 12058 -28512
17711b8512K104m908M3769l9876k3025n3820K5949N0452K1105l7429m1530L8474
$$ -28512 -26408 -31316 12453 -27423 -50448 -104268 -78319 -27867 -6762 -44191 -85721 -47247
17699d7247O5554J8435l1903K4327p666J406K9928K3023m3194j3583j1984m0124
$$ -47247 18307 36742 4839 29166 21500 22906 52834 75857 32663 19080 7096 -33028
17687c3028k9233m0579K6611N2915J9940l5052l3985l569k3212N715k947M5719
$$ -33028 -62261 -102840 -76229 -23314 -3374 -38426 -72411 -75980 -99192 -93477 -96424 -50705
17675e0705J4443K5317M2039K4517k2606n6448n1279K1793M6427J0017l7169l5372
$$ -50705 -36262 -10945 31094 55611 33005 -23443 -74722 -52929 -6502 3515 -33654 -69026
17663f9026l530J0939O2853k8823j2860j7688j5890P594L3452m3440L2570L8852
$$ -69026 -72556 -61617 1236 -27587 -40447 -58135 -74025 -66431 -32979 -76419 -43849 -4997
17651d997j6096k765M3470j0160m9507k8227p162J4911k797L5386J01408J0524
$$ -4997 -21093 -23858 19612 9452 -40055 -68282 -75444 -60533 -63330 -27944 73464 83988
17639H3988p8105l3651M4432k3251l8889j9733k833l716J1919j5526q360N7631
$$ 83988 5883 -27768 16664 -6587 -45476 -65209 -68042 -71758 -59839 -75365 -83725 -26094
17627b6094M4291l8708l2885K1318j963J3538j1519L6456k3121k6860k3399R399
$$ -26094 18197 -20511 -53396 -32078 -34041 -20503 -32022 4434 -18687 -45547 -68946 -59547
17615e9547k3550j18J230J6973l432n550K684N7670J0997j226Q4900j9409o9553
$$ -59547 -83097 -83215 -81985 -65012 -68444 -73994 -71310 -13640 -2643 -3869 81031 61622 -7931
17602g931k1017P216M8675J1205K0828n3348j7548L6358K7196M2479k4081k9444
$$ -7931 -28948 -21732 26943 38148 58976 5628 -11920 24438 51634 94113 70032 40588
17590D0588l9604L9701k0050l0269p7942q2408N3466M0595O4309K5809l8445J6682
$$ 40588 984 40685 20635 -9634 -87576 -169984 -116518 -75923 -11614 14195 -24250 -7568
17578g568l8119k4001o607L563J3155J1630M8440K1618j11580J9707L4810l324
$$ -7568 -45687 -69688 -76295 -72732 -59577 -47947 493 22111 -89469 -69762 -34952 -38276
17566c8276J5878j8602l5021J7616L0558r236m7609J8657Q3850K2647k5280k3829
$$ -38276 -22398 -41000 -76021 -58405 -27847 -37083 -84692 -66035 17815 40462 15182 -8647
17554h647r399j8670j8666k2396r542K3584L2398j1461k0897O077K9470J7629
$$ -8647 -18046 -36716 -55382 -77778 -87320 -63736 -31338 -42799 -63696 -57619 -28149 -10520
17542a0520j9113l3619j9591L8323M0305j8010r270K1315j3581j7730n886k1780
$$ -10520 -29633 -63252 -82843 -44520 -4215 -22225 -31495 -10180 -23761 -41491 -47377 -69157
17530f9157l4881O39O6190O7850O003l9042l3275J0158N599m7912l2076L4914
$$ -69157 -104038 -103399 -37209 30641 36644 -2398 -35673 -25515 -19916 -67828 -99904 -64990
17518f4990k522L9945k3856k7928j1423M1135O3570K0228l1391j7806K5739j8085
$$ -64990 -67512 -27567 -51423 -79351 -90774 -49639 13931 34159 2768 -15038 10701 -7384
17506g384k7988m7485J7948K9753J9760K3074K8402M2894m4747j4670k1370J8792
$$ -7384 -35372 -82857 -64909 -35156 -15396 7678 36080 78974 34227 19557 -1813 16979
17494A6979L2694J1218k5679m4834R090j0791K7081L9473k8875m6308M3621K930
$$ 16979 49673 60891 35212 -9622 -532 -11323 15758 55231 26356 -19952 23669 26599
17482B6599J5921k8485k4242N7901m086k4421P252l6629l0796k39N3340n858j8389
$$ 26599 42520 14035 -10207 47694 43608 19187 26439 -10190 -40986 -41225 12115 6257 -12132
17469a2132K3993r3168k383L4548O7445N4064k7716r5266k6765m4491P878L8673
$$ -12132 11861 -81307 -83690 -49142 18303 72367 44651 -50615 -77380 -121871 -113993 -75320
17457g5320j168q736j7071k3964l3742K2102k5628O4037Q5574J4196j0009J2766
$$ -75320 -76488 -85224 -102295 -126259 -160001 -137899 -163527 -99490 -13916 280 -9729 3037
17445C037Q382q8687l0714M3338M1820R7686N443r0926l7382P592l2432k562K5868
$$ 3037 11419 -77268 -107982 -64644 -22824 74862 80305 -10621 -48003 -40411 -72843 -75405 -49537
17432d9537K5930J01652l3756n8953n950l5609J3625j515l2881k407M4371k3155
$$ -49537 -23607 78045 44289 -14664 -20614 -56223 -42598 -44113 -76994 -79401 -35030 -58185
17420e8185J9422p2238q853M114r801L4572K7177J7619J7655j6801l0171M5771
$$ -58185 -38763 -111001 -119854 -115740 -125541 -90969 -63792 -46173 -28518 -45319 -75490 -29719
17408b9719J2937J8706L246M2711m650L5614K3718l0496o8354k8290K2963K6730
$$ -29719 -16782 1924 5170 47881 43231 78845 102563 72067 3713 -24577 -1614 25116
17396B5116k9917p440J7589M9215m34r5444n4745r624J2521K9217j2742K7426
$$ 25116 -4801 -12241 5348 54563 54129 -41315 -96060 -105684 -93163 -63946 -76688 -49262
17384d9262k7481O6290M8053k9261l4589J2098m5476J5844M5096j0229o503J1196
$$ -49262 -76743 -10453 37600 8339 -26250 -14152 -59628 -43784 1312 -8917 -15420 -4224
17372d224k291l262L203o624M758l3268m125j1741N2101J851m0186n340J1192
$$ -4224 -6515 -9777 -6574 -13198 -8440 -41708 -45833 -57574 -5473 -3622 -43808 -49148 -37956
17359c7956j8862L577N3559k7250m7620K1929L2649j8367r758N4183M7393J9437
$$ -37956 -56818 -53241 318 -26932 -74552 -52623 -19974 -38341 -48099 6084 53477 72914
17347G2914o9061j4180K2851K8455j5789J2151P572p8112n2934N5294j3520k194
$$ 72914 3853 -10327 12524 40979 25190 37341 44913 -33199 -86133 -30839 -44359 -46553
17335d6553k2433P106k7426l4149J5087M8336N8867K7412J3784K7127m5103K1738
$$ -46553 -68986 -61880 -89306 -123455 -108368 -60032 -1165 26247 40031 67158 22055 43793
17323D3793P63n173n658J040n725m1242j5641K6132M2572j2279m1337n6090l3950
$$ 43793 44556 39383 33725 34765 29040 -12202 -27843 -1711 40861 28582 -12755 -68845 -102795
17310a02795L5271L9938Q3124J5403p0804K5015m906l5855j0676j7441K1829j834
$$ -102795 -67524 -27586 55538 70941 137 25152 20246 -15609 -26285 -43726 -21897 -23731
17298b3731J4895j9845o2212N5872K7583M6957j3217J05m1312o6590J1031Q638
$$ -23731 -8836 -28681 -90893 -35021 -7438 39519 26302 26407 -14905 -81495 -70464 -61826
17286f1826L0348j4808O850k1862l7606M5707L2111r922l1646l35j5744M9136
$$ -61826 -31478 -46286 -39436 -61298 -98904 -53197 -21086 -31008 -62654 -62989 -78733 -29597
17274b9597L6688m1112J521L9895M125k8939o0023J3370j980l2291j6408N8815
$$ -29597 7091 -34021 -32500 7395 11520 -17419 -77442 -64072 -66052 -98343 -114751 -55936
17262e5936N5551k6686m635j7931K6713j7548M322J0305K2273l9720k6454n5361
$$ -55936 -385 -27071 -31706 -49637 -22924 -40472 -36150 -25845 -3572 -43292 -69746 -125107
17250a25107k385p666Q8512N1202m5876Q644Q7658O2334k3693l8998m8014m1989
$$ -125107 -127492 -135158 -46646 4556 -41320 -32676 54982 117316 93623 54625 6611 -35378
17238c5378l4781J173k549o797N5193j2153j9643m268l1277j5604N7355P3237
$$ -35378 -70159 -68986 -71535 -78332 -23139 -35292 -54935 -59203 -90480 -106084 -48729 24508
17226B4508j0832k1506l1926j3190L922O677k2152r026j2690O363J2958R4955
$$ 24508 13676 -7830 -39756 -52946 -49024 -42347 -64499 -73525 -86215 -79852 -66894 28061
17214B8061K2727k5698O713n045k7027K7684J6121J8480l4173n3617K086M2108
$$ 28061 50788 25090 31803 26758 -269 27415 43536 62016 27843 -25774 -23688 18420
17202A8420K2241o5950L7317J0824l8189K9174L8038M8065k62p9075m6280l4541
$$ 18420 40661 -25289 12028 22852 -15337 13837 51875 99940 99678 20603 -25677 -60218
17190f0218L9317K3595O0738M5950j3538n6923n9362m2604p0959L9909P4836L0292
$$ -60218 -20901 2694 63432 109382 95844 38921 -20441 -63045 -134004 -94095 -19259 11033
17178A1033m4625N62J4445k319l6058O193M5642j4794J072j9538l4043K2746j063
$$ 11033 -33592 -33030 -18585 -20904 -56962 -50769 -5127 -19921 -18849 -38387 -72430 -49684 -50747
17165e0747J5044j0095L1603m46o3001n254M080L9175M2074J5832p0629n0880
$$ -50747 -35703 -45798 -14195 -14641 -77642 -82896 -78816 -39641 2433 18265 -52364 -103244
17153a03244j670n323n1976K7631J01728N9190k8049l6759J5491J23K0643M1618
$$ -103244 -104914 -110237 -162213 -134582 -32854 26336 -1713 -38472 -22981 -22858 -2215 39403
17141C9403l4650p9837k9712o0576j1007J01919K3047k2053L9944K6854k2013
$$ 39403 4753 -75084 -104796 -165372 -176379 -74460 -51413 -73466 -33522 -6668 -28681
17130b8681k4595k8175o453J1837l6770r8832j706R8927P3370m9642M029j5100
$$ -28681 -53276 -81451 -87904 -76067 -112837 -211669 -213375 -114448 -41078 -90720 -86691 -101791
17118a01791L9987J4409k0245n7721J5055N5363R1109R748m4258p3668l8771R228
$$ -101791 -61804 -47395 -67640 -125361 -110306 -54943 36166 45914 1656 -72012 -110783 -101555
17106a01555K2578l348k0159O5379L4307L349k855L7928M895l0991j5062k3827
$$ -101555 -78977 -82325 -102484 -37105 -2798 551 -2304 35624 40519 9528 -5534 -29361
17094b9361l3998l5268J4064j9066k624J1445m1262K608O4557k5413l9246J3727
$$ -29361 -63359 -98627 -84563 -103629 -106253 -94808 -136070 -133462 -68905 -94318 -133564 -119837
17082a19837L6816k0363J928M0978N3279P2936k9682r8079L4247M9914o497k7955
$$ -119837 -83021 -103384 -101456 -60478 -7199 65737 36055 -62024 -27777 22137 15640 -12315
17070a2315l1956n6335K6464P4814N0763l1457m064N715O147j8183n3461J6111
$$ -12315 -44271 -100606 -74142 672 51435 19978 15914 21629 27776 9593 -43868 -27757
17058b7757j3408m935L800k2776K2394J9501n7990M3196R5106K1149l5503m8142
$$ -27757 -41165 -46100 -42300 -65076 -42682 -23181 -81171 -37975 57131 78280 42777 -5365
17046e365N513L5672K0747P052k9439j1799k0872q272j6242j5574N5538M3454
$$ -5365 148 35820 56567 63619 34180 22381 1509 -6763 -23005 -38579 16959 60413
17034F0413r337o659k3426l8194J8333J0999l2101l193k0855o599j5471j8199
$$ 60413 51076 44417 20991 -17203 1130 12129 -19972 -23165 -44020 -50619 -66090 -84289
17022h4289N0544L4840K3293o7008j1827M2485O3782m546k5357J616p8087n2078
$$ -84289 -33745 1095 24388 -42620 -54447 -11962 51820 47274 21917 23533 -54554 -106632
17010a06632J3336M6272K9465L7818k3538J5055M2983J9348L2049m6095m5255
$$ -106632 -93296 -47024 -17559 20259 -3279 11776 54759 74107 106156 60061 14806
16999A4806K8832m0281j7223l7904k7404j0089J3356O288M3824O1409J707K123
$$ 14806 43638 3357 -13866 -51770 -79174 -89263 -75907 -69619 -25795 35614 37321 39444
16987C9444r893n9201o0122j1012L6352l8665k0900K7056m3024j4090N2895L1237
$$ 39444 29551 -29650 -89772 -100784 -64432 -103097 -123997 -96941 -139965 -154055 -101160 -69923
16975f9923l9041k1866K3821O0517N0414k574j1034k5624P617j6684j3938j908
$$ -69923 -108964 -130830 -107009 -46492 3922 1348 -9686 -35310 -27693 -44377 -58315 -60223
16963f0223K0144L899P3303j9733p4946k9656j0756R0964m058l2199L4480Q795
$$ -60223 -40079 -36180 37123 17390 -57556 -87212 -97968 -7004 -11062 -43261 -8781 14
16951A4m9032J3114R6291k9821l6776L2195J3659q0025j253O9724O704k9527n7122
$$ 14 -49018 -35904 60387 30566 -6210 25985 39644 -40381 -41634 28090 34794 5267 -51855
16938e1855q272J7482R097j9736r6602l4051R0734M3122O5368K1131k5251k4358
$$ -51855 -60127 -42645 -33548 -53284 -149886 -183937 -93203 -50081 15287 36418 11167 -13191
16926a3191n4253j3878M628J1413k049k5556K4125l1424K3119K0528m0642o2767
$$ -13191 -67444 -81322 -76694 -65281 -67330 -92886 -68761 -100185 -77066 -56538 -97180 -159947
16914a59947M3291K120j7515M8520L6069K8507M0706K3692p6182j6669j8780j5459
$$ -159947 -116656 -114536 -132051 -83531 -47462 -18955 21751 45443 -30739 -47408 -66188 -81647
16902h1647j0912M7899J9142L4064J1650J9659J1676J4661q0306p163K3960J6251
$$ -81647 -92559 -44660 -25518 8546 20196 39855 51531 66192 -14114 -21277 2683 18934
16890A8934p3025n0838L7621P1721k5186n5841k8616O6988K9633O3795n005m5949
$$ 18934 -54091 -104929 -67308 4413 -20773 -76614 -105230 -38242 -8609 55186 50181 4232
16878D232Q012j4736o8183P0628M2314n601L5803M3078L7094j2330q216l8875
$$ 4232 12244 -2492 -70675 -47 42267 36666 72469 115547 152641 140311 132095 93220
16866I3220k1381j6844K6639J5074O910p2519m5847o5668l115M5636P8675K9254
$$ 93220 71839 54995 81634 96708 103618 31099 -14748 -80416 -83531 -37895 40780 70034
16854G0034l4680m1725k9317O491j5190j0953Q976R09L4351P0319K1408K0205
$$ 70034 35354 -6371 -35688 -29197 -44387 -55340 -46364 -45455 -11104 59215 80623 100828
16842A00828p0113l4135K8862q341k0190j336n263o1630j2655K715N3870L7487
$$ 100828 30715 -3420 25442 17101 -3089 -4425 -9688 -71318 -83973 -81258 -27388 10099
16830A0099L452N4648L0898m9062l1325K7183m8819m0252o8829o903M3549K644
$$ 10099 13551 68199 99097 50035 18710 45893 -2926 -43178 -112007 -118910 -75361 -72717
16818g2717K2689o510j2245O463J4124N614J773J2012L9226j0436K5612j9829
$$ -72717 -50028 -56538 -68783 -62320 -48196 -42582 -40809 -28797 10429 -7 25605 5776
16806E776J8116J126k2595K3k9091n0272L9041O336k4358j1940J1699L1787l501
$$ 5776 23892 25018 2423 2446 -26645 -76917 -37876 -31540 -55898 -67838 -56139 -24352 -27853
16793b7853k1868J5578l2468l4866L2290K5366J408l8520P955P0372j7907L3685
$$ -27853 -49721 -34143 -66611 -101477 -69187 -43821 -42413 -80933 -72978 -2606 -20513 13172
16781A3172K3824l9623n1490j3391l6420j9514J7382J00882L9662m1210L1256
$$ 13172 36996 -2627 -54117 -67508 -103928 -123442 -106060 -5178 34484 -6726 24530
16770B4530k2671p767n9320K0392J9782K5337m0461m5181n074J7781L5924n95
$$ 24530 1859 -5908 -65228 -44836 -25054 283 -40178 -85359 -90433 -72652 -36728 -37323
16758c7323m764J5991L0519L1858J1097k1040P819l6708n6967k5091L0141J7661
$$ -37323 -42087 -26096 4423 36281 47378 26338 34157 -2551 -59518 -84609 -54468 -36807
16746c6807J9681L792m7206l3781O0256Q0109J7290l8116K8700j1499k2890m3294
$$ -36807 -17126 -13334 -60540 -94321 -34065 46044 63334 25218 53918 42419 19529 -23765
16734b3765n649M4666M5164m2902m6886n6085l3199N1039P3482m7501k7980J2207
$$ -23765 -29414 15252 60416 17514 -29372 -85457 -118656 -67617 5865 -41636 -69616 -57409
16722e7409k1451K4037J9175Q810j5790n1547m6014o102L8945K7518P606j0272
$$ -57409 -78860 -54823 -35648 -26838 -42628 -94175 -140189 -146291 -107346 -79828 -72222 -82494
16710h2494k9012k5012l7565L9337K8620L239k4564r55P8938M7022L821J9474
$$ -82494 -111506 -136518 -174083 -134746 -106126 -102887 -127451 -128406 -49468 -2446 1375 20849
16698B0849K3352k3730o9710k4669J6139L2894K7969J0280L3908m6828l4911L8613
$$ 20849 44201 20471 -49239 -73908 -57769 -24875 3094 13374 47282 454 -34457 4156
16686D156j2218l5623M3510O5860k9118l8201m0638m3226R756J9679N3396M3499
$$ 4156 -8062 -43685 -175 65685 36567 -1634 -42272 -85498 -75742 -56063 -2667 40832
16674D0832M2008j8739m2306m8732j6111R093K4119j3049j6583j0485K0721L6516
$$ 40832 82840 64101 21795 -26937 -43048 -33955 -9836 -22885 -39468 -49953 -29232 7284
16662G284k4839j599K550K3322K2131j1057m7984k580K5551l8195O663j0488M3164
$$ 7284 -17555 -19154 -16604 6718 28849 17792 -30192 -32772 -7221 -45416 -38753 -49241 -6077
16649f077j303o8439r886N7844K892J8709R459J9306J8412k1699l2716K4178Q728
$$ -6077 -7380 -75819 -85705 -27861 -24969 -6260 3199 22505 40917 19218 -13498 10680 19408
16636A9408K657L7720p854j4969Q116n1078m8843M0396K9690l3010k5202k6973
$$ 19408 22065 59785 51931 36962 45078 -6000 -54843 -14447 15243 -17767 -42969 -69942
16624f9942L7983J0425l2351K2580K6071L3795J3655L984N404j9646k7337L8770
$$ -69942 -31959 -21534 -53885 -31305 -5234 28561 42216 46200 51604 31958 4621 43391
16612D3391L2708L3389k29r6770n8150J7584L7620q274j6546J1301k9096l3937
$$ 43391 76099 109488 109259 12489 -45661 -28077 9543 1269 -15277 -3976 -33072 -67009
16600f7009K6055k8596P1653J6190m1528l7335L309j8441K3056L0101L1114K0056
$$ -67009 -40954 -69550 2103 18293 -23235 -60570 -57261 -75702 -52646 -22545 8569 28625
16588B8625o115l0620l8731O735j6622L9277R670m8392k9038M768p063K4670J1661
$$ 28625 22510 -8110 -46841 -40106 -56728 -17451 -7781 -56173 -85211 -80443 -87506 -62836 -51175
16575e1175L6892m446j7365r866N8896N4477o3716m0267k1935K9822J158n0326
$$ -51175 -14283 -18729 -36094 -45960 12936 67413 3697 -36570 -58505 -28683 -27525 -77851
16563g7851m5236l7854M1484J0376J2151k5952P2156M7272Q5462K3396p325L5622
$$ -77851 -123087 -160941 -119457 -109081 -96930 -122882 -50726 -3454 82008 105404 98079 133701
16551A33701l6839n4158m3384l4466N5571J0498k1475n1620M0587l5049R413k9568
$$ 133701 96862 42704 -680 -35146 20425 30923 9448 -42172 -1585 -36634 -27221 -56789
16539e6789L5299K8608J2827r510n8106p918J9805k4509J2461N560k7601N60l262
$$ -56789 -21490 7118 19945 10435 -47671 -55589 -35784 -60293 -47832 -42272 -69873 -69313 -72575
16526g2575M1269L8982M9596Q134K7465o2574k7798J3557J3432k00m6821J9605
$$ -72575 -31306 7676 57272 65406 92871 30297 2499 16056 29488 29288 -17533 2072
16514B072j4413l8766O035j21535l1936K5533R1564K3176L6133l060k0001m0325
$$ 2072 -12341 -51107 -45072 -166607 -198543 -173010 -81446 -58270 -22137 -25197 -45198 -85523
16502h5523l253L3951J9905k1454m6755p314k7633L796O2655O737l5629o434R4980
$$ -85523 -88776 -54825 -34920 -56374 -103129 -110443 -138076 -134280 -71625 -64888 -100517 -106951 -11971
16489a1971L4317n6467k5044N9931K2295m0331p077L8511j1191J8264k0403j4141
$$ -11971 22346 -34121 -59165 766 23061 -17270 -24347 14164 2973 21237 834 -13307
16477a3307n743N367M7211J3195j4835n4467N5108P0248m7811o3818m9452J3253
$$ -13307 -19050 -13683 33528 46723 31888 -22579 32529 102777 54966 -8852 -58304 -45051
16465d5051M7675m2853m1659N0102K6524j9176m8667q789N3017L0654j5616P121
$$ -45051 2624 -40229 -81888 -31786 -5262 -24438 -73105 -81894 -28877 1777 -13839 -6718
16453f718J2730j5296j1289K0934j0709j1400j3838K1637j1880j2529K3500M5290
$$ -6718 6012 -9284 -20573 361 -10348 -21748 -35586 -13949 -25829 -38358 -14858 30432
16441C0432m3783K907O9531R401m7533L1134n3046q5896K4229J0492j2027j9321
$$ 30432 -13351 -10444 59087 68488 20955 52089 -957 -86853 -62624 -52132 -64159 -83480
16429h3480J3466O2702j2351o7469k7735N0928O3403k8074n1813m4306K6097M1571
$$ -83480 -70014 -7312 -19663 -87132 -114867 -63939 -536 -28610 -80423 -124729 -98632 -57061
16417e7061l4498q377J4620J1582k1232o464k5012P208J0484m799O6671O2804
$$ -57061 -91559 -99936 -85316 -73734 -94966 -101430 -126442 -119234 -108750 -113549 -46878 15926
16405A5926j9667l0642N0556J2077M9444k5206p272k5531n4962J9883J0861L0112
$$ 15926 -3741 -34383 16173 28250 77694 52488 45216 19685 -35277 -15394 -4533 25579
16393B5579l2610k6082N1069M4849k0743q2031J9400m593J4226m2052m5649k3686
$$ 25579 -7031 -33113 17956 62805 42062 -39969 -20569 -25162 -10936 -52988 -98637 -122323
16381a22323L8295K5952p906N7303K4337J8748k0148j26512m9713O5612J38443
$$ -122323 -84028 -58076 -65982 -8679 15658 34406 14258 -112254 -161967 -96355 42088
16370D2088N8180N1504M0718k3614o9212r4658j5169Q24j7110j9124L8543P4469
$$ 42088 100268 151772 192490 168876 99664 5006 -10163 -9339 -26449 -45573 -7030 67439
16358F7439l511q292L433Q530r323n4709L8758K2743K936k1518J1179J9555p6028
$$ 67439 63928 55636 59069 67599 58276 3567 42325 65068 68004 46486 57665 77220 1192
16345A192n7511n3826l7290M1891M7255M2602j1215l454k453L863L0750k1909
$$ 1192 -56319 -110145 -147435 -105544 -58289 -15687 -26902 -30356 -32809 -28946 1804 -20105
16333b0105m6707k8033J3780K6490L307j4008K4590O155N371O938M5146l1094
$$ -20105 -66812 -94845 -81065 -54575 -51268 -65276 -40686 -34531 -29160 -22222 22924 -8170
16321h170p752m165R959K3983k0781k0442l9908L230q880J6711k2933j3001k7539
$$ -8170 -15922 -20087 -10128 13855 -6926 -27368 -67276 -64046 -72926 -56215 -79148 -92149 -119688
16308a19688J2990O1266L6802m1125m0733Q443L7998j3159N840m8523r776O7894
$$ -119688 -106698 -45432 -8630 -49755 -90488 -82045 -44047 -57206 -51366 -99889 -109665 -41771
16296d1771N1206j0247m2680l0762j0220L0601L0673j922j1012l5114N1353N9858
$$ -41771 9435 -812 -43492 -74254 -84474 -53873 -23200 -25122 -36134 -71248 -19895 39963
16284C9963l3538l7077J2814k66l2760L8273M0998Q32j7415J4070l7607o9749
$$ 39963 6425 -30652 -17838 -18104 -50864 -12591 28407 29239 11824 25894 -11713 -81462
16272h1462K7510m833l5372M8133M0531k2431l564m6626k2696N8698K7183K6206
$$ -81462 -53952 -58785 -94157 -46024 -5493 -27924 -31488 -78114 -100810 -42112 -14929 11277
16260A1277k5380o0238j7726l4414L4138J50827l0138q0150n5566K2159M2324
$$ 11277 -14103 -74341 -92067 -126481 -92343 58484 28346 -51804 -107370 -85211 -42887
16249d2887M1385K5565J2049k0313k4097m6819k1815L2547N0489K9919L1183k5254
$$ -42887 -1502 24063 36112 15799 -8298 -55117 -76932 -44385 6104 36023 67206 41952
16237D1952k3278m0279k428M302O1389k9331O305K5813J4010j3498j8574k0225
$$ 41952 18674 -21605 -24033 -19731 41658 12327 18632 44445 58455 44957 26383 6158
16225F158m5174P946N4263m562l8402k9701j0683J0592m8617j8226q553M1175
$$ 6158 -39016 -31070 23193 18631 -19771 -49472 -60155 -49563 -98180 -116406 -124959 -83784
16213h3784k2830j7997L8117P5990n1786J5882N7824M3126l7406l0076k5107R715
$$ -83784 -106614 -124611 -86494 -10504 -62290 -46408 11416 54542 17136 -12940 -38047 -28332
16201b8332J3172J9745l3208k4638K4864K5838K5180o498j4102j6618j4738L0597
$$ -28332 -15160 4585 -28623 -53261 -28397 -2559 22621 16123 2021 -14597 -29335 1262
16189A262J2011r868k7387L2193R189O3978k4760p8353k6267J4637j9177K3168
$$ 1262 13273 3405 -23982 8211 17400 81378 56618 -21735 -48002 -33365 -52542 -29374
16177b9374J1430j0361l7996L1214j2438n2023L532L2231N958J4674Q718N618
$$ -29374 -17944 -28305 -66301 -35087 -47525 -99548 -96016 -63785 -57827 -43153 -34435 -28817
16165b8817J7835O5881r105o852l5666N0205l7887j2979K2462J2060k6091o0880
$$ -28817 -10982 54899 45794 38942 3276 53481 15594 2615 25077 37137 11046 -49834
16153d9834m508J9420n6962m2959N2272N2676N0184R332m6537r516m728L5069
$$ -49834 -54342 -34922 -91884 -134843 -82571 -29895 20289 29621 -16916 -26432 -31160 3909
16141C909n222o2247N4371N3477m3020k8765j6822K6297m855K3225J7400J2868
$$ 3909 -1313 -63560 -9189 44288 1268 -27497 -44319 -18022 -22877 348 17748 30616
16129C0616M6310k3747j7391L1392l2809l9004o5622n8640m0124j0103L096M7083
$$ 30616 76926 53179 35788 67180 34371 -4633 -70255 -128895 -169019 -179122 -176026 -128943
16117a28943N0721L9635j5251K7269M1561k1194o099K5705n570J9986L0344p8738
$$ -128943 -78222 -38587 -53838 -26569 14992 -6202 -12301 13404 7834 27820 58164 -20574
16105b0574l3577J3350n1871n637p105L6995M9805K3753k982k5467m118l0462
$$ -20574 -54151 -40801 -92672 -98309 -105414 -68419 -18614 5139 2157 -23310 -27428 -57890
16093e7890K5403L2028L6637N6177l2486k4693K4644J809L4916J8455k1253k0595
$$ -57890 -32487 -459 36178 92355 59869 35176 59820 61629 96545 115000 93747 73152
16081G3152J4463j4269j9312m3008P268N2293j7421j4104M8724m7821m6985K0336
$$ 73152 87615 73346 54034 11026 18294 70587 53166 39062 87786 39965 -7020 13316
16069A3316l3273q5916K1728L4527M176M5084o114M737m153j0079j7619j7077
$$ 13316 -19957 -105873 -84145 -49618 -45442 -358 -6472 -1735 -5888 -15967 -33586 -50663
16057e0663K1952P7398J2962k4814J6618k5964j9966K966L3965M0100k6897m165
$$ -50663 -28711 48687 61649 36835 53453 27489 7523 10489 44454 84554 57657 53492
16045E3492J2119j04408p8742J0985P9914K2890j1619J9810q384n2113j1971J1643
$$ 53492 65611 -38797 -117539 -106554 -26640 -3750 -15369 4441 -3943 -56056 -68027 -56384
16033e6384j525k7044l8528Q564K4326m047Q3494k2420O890P838O438l3693q555
$$ -56384 -57909 -84953 -123481 -114917 -90591 -94638 -11144 -33564 -26674 -18836 -12398 -46091 -54646
16020e4646M725K8638L2063O0627n8451k1384L8481j2679k1355j2787m5669j8251
$$ -54646 -49921 -21283 10780 71407 12956 -8428 30053 17374 -3981 -16768 -62437 -80688
16008h0688L440R591M6523J9449k0404m8245k9419L5029N5187N7899k4843q267
$$ -80688 -77248 -67657 -21134 -1685 -22089 -70334 -99753 -64724 -9537 48362 23519 15252
15996A5252j5466n167k6570o6825K1068L3381R65N4648N117K2298K6370P674J2637
$$ 15252 -214 -5381 -31951 -98776 -77708 -44327 -43362 11286 16403 38701 65071 72745 85382
15983H5382m1737n2846K3126n254m5607L0140K0887L9903O59n3491R243p248j3642
$$ 85382 43645 -9201 13925 8671 -36936 -6796 14091 53994 54653 1162 10405 3157 -10485
15970a0485k378L9341J7686M563j5415J1767k3099l8422l3006J4058K7014J822
$$ -10485 -12863 26478 44164 48727 33312 45079 21980 -16442 -49448 -35390 -8376 -6554
15958f554n5571k847K578K8545k202K4657J3168j2088l1043K8686j2521m1768
$$ -6554 -62125 -64972 -62394 -33849 -36051 -11394 1774 -10314 -41357 -12671 -25192 -66960
15946f6960K1333N6647K5493O5699J134q0443k8513K2155K975K406k7326l4945
$$ -66960 -45627 11020 36513 102212 103346 22903 -5610 16545 19520 21926 -5400 -40345
15934d0345j5104k3432j06N8705K2836j6391l591L4622L6202m8202k0355l5596
$$ -40345 -55449 -78881 -78987 -20282 2554 -13837 -17428 17194 53396 5194 -15161 -50757
15922e0757P545O7730N8915m4816j33217q7037j2503L9715M7842J9397J3357l8423
$$ -50757 -43212 24518 83433 38617 -94600 -181637 -194140 -154425 -106583 -87186 -73829 -112252
15910a12252k5867N1731O4852N5580N3119k0480j2471n2505m4157N5191k4616
$$ -112252 -138119 -86388 -21536 34044 87163 66683 54212 1707 -42450 12741 -11875
15899a1875q4194j7148p641L3506P0741L9194j8039J9048r475r359J5740K0935
$$ -11875 -96069 -113217 -120858 -87352 -16611 22583 4544 23592 14117 4758 20498 41433
15887D1433K8279m0004m3172k4383k9835n4155J7632O4308k2632k8113k3947J9593
$$ 41433 69712 29708 -13464 -37847 -67682 -121837 -104205 -39897 -62529 -90642 -114589 -94996
15875i4996K1201O9178J6862j7686k15N8262K855n1724J4226J0687M31J9323j3088
$$ -94996 -73795 -4617 12245 -5441 -5656 52606 55461 3737 17963 28650 29081 48404 35316
15862C5316j5022p5278R075N3475N5325m7813k4606j1355p7231p860L4760L5047
$$ 35316 20294 -54984 -45909 7566 62891 15078 -9528 -20883 -98114 -105974 -71214 -36167
15850c6167K5801j2191o4123k2870J3877P88j1789K2858K1328J3808l0061o616
$$ -36167 -10366 -22557 -86680 -109550 -95673 -94885 -106674 -83816 -62488 -48680 -78741 -85357
15838h5357n74k1894K2804K6648P700M9429K2513l8328j0974J6314N886j3284
$$ -85357 -85931 -107825 -85021 -58373 -50673 -1244 21269 -17059 -28033 -11719 -5833 -19117
15826a9117R368M7746j4821L8306n8189P268M1527K1074j9941j8296j4261k8135
$$ -19117 -9749 37997 23176 61482 3293 10561 52088 73162 53221 34925 20664 -7471
15814g471l2882k1916P7281K6341m7475o2222M5773M2478j2148l854j6957j9365
$$ -7471 -40353 -62269 15012 41353 -6122 -68344 -22571 19907 7759 3905 -13052 -32417
15802c2417j8617n366L7711O3628m5586K6353O978l5849L2498K7367N6122n4991
$$ -32417 -51034 -56400 -18689 44939 -647 25706 32684 -3165 29333 56700 112822 57831
15790E7831n7964q668J982N3341J1519m3162j7483O3298K1650K707M011q2695
$$ 57831 -133 -8801 -6819 46522 58041 14879 -2604 60694 82344 85051 89062 6367
15778F367k4684L0734K589l092K3494K2807J2490K1008l0414R725j5549p2316
$$ 6367 -18317 12417 15006 11914 35408 58215 70705 91713 61299 71024 55475 -16841
15766a6841r499k4163m162l337k3251K9549M1082o442j2612K6729K8975m5823
$$ -16841 -26340 -50503 -54665 -58002 -81253 -51704 -10622 -17064 -29676 -2947 26028 -19795
15754a9795o3490k3739N8032L5460k2912j3684O428J5678M1811k9027k6954N381
$$ -19795 -83285 -107024 -48992 -13532 -36444 -50128 -43700 -28022 13789 -15238 -42192 -36811
15742c6811l5273L5335J9751Q893J805K3176j7002K8545K8087K3446l0377q7048
$$ -36811 -72084 -36749 -16998 -8105 -6300 16876 -126 28419 56506 79952 49575 -37473
15730c7473Q935K9071K6031J3397J7763M157n0413P35J2508r254l8703j8722m1391
$$ -37473 -28538 533 26564 39961 57724 61881 11468 12203 24711 15457 -23246 -41968 -83359
15717h3359l1658K2903Q1453M5821j582o6212M423M0915q544n0920m9N0891M8685
$$ -83359 -115017 -92114 -10661 35160 33578 -32634 -28211 12704 4160 -46760 -46809 4082 52767
15704E2767o252n1604n0007m56J2700j4912K8953m0777j9811N2998j0936O04J7066
$$ 52767 46515 -5089 -55096 -55552 -42852 -57764 -28811 -69588 -89399 -36401 -47337 -46733 -29667
15691b9667R659L0529M564l6636j8252N140l1755K877P545k5014K3362L4542K2016
$$ -29667 -20008 10521 15085 -21551 -39803 -34663 -66418 -63541 -55996 -81010 -57648 -23106 -1090
15678a090m4011j3789n3592j6286M9282K5437P319M8069L776l8828l3073q6275
$$ -1090 -45101 -58890 -112482 -128768 -79486 -54049 -46730 1339 5115 -33713 -66786 -153061
15666a53061O1184M7141P0854K2744q4474L4043M098k7237Q126K8954k5994L447
$$ -153061 -91877 -44736 26118 48862 -35612 -1569 2529 -24708 -16582 12372 -13622 -10175
15654a0175N626k7773j5387K6450L0420j4595o307O990O866L1670l4751q1204
$$ -10175 -4549 -32322 -47709 -21259 9161 -5434 -11741 -4751 2115 33785 -966 -82170
15642h2170M183M3236j9344L1884J1368J0088j8324J0639Q61M3077O626p892j1012
$$ -82170 -77987 -34751 -54095 -22211 -10843 -755 -19079 -8440 -7579 35498 42124 34232 23220
15629B3220j5148k8480j3223j6662Q913L6041M5096M3789j8244m4895M40m9797
$$ 23220 8072 -20408 -33631 -50293 -41380 -5339 39757 83546 65302 20407 20847 -28950
15617b8950l3242j1583L7356N7374L2828j9547n3095N7056L5845l9496k8168K7976
$$ -28950 -62192 -73775 -36419 20955 53783 34236 -18859 38197 74042 34546 6378 34354
15605C4354L6448m1769j4239L8195j4000j844j8407j178K569l6839J4128j671
$$ 34354 70802 29033 14794 52989 38989 37145 18738 17560 20129 -16710 -2582 -4253
15593d253k9975P039r836L2001N7854l1970l4308N797J5158L61l4529K6271K6987
$$ -4253 -34228 -27189 -37025 -5024 52830 20860 -13448 -7651 7507 7868 -26661 -390 26597
15580B6597L6855K6124J4122j4046n2089o8930K1452j5032j9767J6738J699j0078
$$ 26597 63452 89576 103698 89652 37563 -31367 -9915 -24947 -44714 -27976 -26277 -36355
15568c6355N84O861k1717k9650O775J3481M4751j5841n2415j0721R1408M7190
$$ -36355 -35771 -28910 -50627 -80277 -73502 -60021 -15270 -31111 -83526 -94247 -2839 44351
15556D4351j1782j2658j2029k0364j5981R166L3407J5048j4335n0343k759K192
$$ 44351 32569 19911 7882 -12482 -28463 -19297 14110 29158 14823 -35520 -38279 -36087
15544c6087j4816p7701k1669Q1516P4741M7620J0674J0473p6991m5944J7848J5638
$$ -36087 -50903 -128604 -150273 -68757 5984 53604 64278 74751 -2240 -48184 -30336 -14698
15532a4698L3039M137L0129M221m1304l7918p5976N402M583j8299N6560M7736
$$ -14698 18341 22478 52607 56828 15524 -22394 -98370 -92968 -88385 -106684 -50124 -2388
15520b388O1786J5148r660j3180j8590m6391k3041k8949J4490N464R032K0683
$$ -2388 59398 74546 64886 51706 33116 -13275 -36316 -65265 -50775 -45311 -36279 -15596
15508a5596L0242m8330k8064K1863M1405k1671o100J8456M263K5055j7489l844
$$ -15596 14646 -33684 -61748 -39885 1520 -20151 -26251 -7795 -3532 21523 4034 190
15496A90K5550K3481J0662j4088p3517m5462L8524K2866P7943j0653l3557k5626
$$ 190 25740 49221 59883 45795 -27722 -73184 -34660 -11794 66149 55496 21939 -3687
15484c687M4886J7846L2743K482k8526n6793K5009M744o354P2350N2397n4392
$$ -3687 41199 59045 91788 94270 65744 8951 33960 38704 32350 104700 157097 102705
15472A02705k8593n2916n7139J2821j8601m13P038Q8867l2697j4313j8646k4281
$$ 102705 74112 21196 -35943 -23122 -41723 -42136 -35098 53769 21072 6759 -11887 -36168
15460c6168n0494L3678J3297L8172K6140N9142j1820j9238p8j8660l5230K0284
$$ -36168 -86662 -52984 -39687 -1515 24625 83767 71947 52709 52631 33971 -1259 19025
15448A9025L4671o904k0003J4449K7360p1588k4588L686o526j83R252j1859k3733
$$ 19025 53696 46792 26789 41238 68598 -2990 -27578 -23892 -30418 -30601 -21349 -33208 -56941
15435e6941j0676O6266q955o8736L1146K2638J8417l0756l8973r601M7128r84
$$ -56941 -67617 -1351 -10306 -79042 -47896 -25258 -6841 -37597 -76570 -86171 -39043 -40027
15423d0027J1550J9317K981J8186j8144K5662Q759l0383J896Q145l799o8031K0438
$$ -40027 -28477 -9160 -6179 12007 -6137 19525 28284 -2099 -203 7942 4143 -63888 -43450
15410d3450J7641M5005L0310L702o4771p411K0963K9597n5504R804k414k9954
$$ -43450 -25809 19196 49506 53208 -11563 -18974 1989 31586 -23918 -14114 -16528 -46482
15398d6482o0701l8996N4381N7932N8429j5688j2063K9159J8526m0984p072m3490
$$ -46482 -107183 -146179 -91798 -33866 24563 8875 -3188 25971 44497 3513 -3559 -47049
15386d7049k8554M0232L9780L9024L1397J7912j1118l0834L996Q303k1379n3633
$$ -47049 -75603 -35371 4409 43433 74830 92742 81624 50790 54786 63089 41710 -11923
15374a1923O991O6584L6669k8724o6422m0182J0940l0228O756l644K8374M5307
$$ -11923 -4932 61652 98321 69597 3175 -37007 -26067 -56295 -49539 -53183 -24809 20498
15362B0498J457M8337l0761o1801P323j6858O250P924K1966l8749m4547P0228
$$ 20498 21955 70292 39531 -22270 -14947 -31805 -25555 -17631 4335 -34414 -78961 -8733
15350h733J1420K1793K1419j6416o5875l7956m0620k74L8105L4218M606K6073
$$ -8733 2687 24480 45899 29483 -36392 -74348 -114968 -115242 -77137 -42919 -38313 -12240
15338a2240J1026P056L1721l981o111m3036N6581J0740p3253m3747j8862J9736
$$ -12240 -1214 5842 37563 33582 27471 -15565 41016 51756 -21497 -65244 -84106 -64370
15326f4370m831k7371L11N922n807k7924o69k8579P2644O5003j4685l0226R556
$$ -64370 -69201 -96572 -96261 -90339 -96146 -124070 -124739 -153318 -80674 -15671 -30356 -60582 -51026
15313e1026L0170m8119l7684j6634L0941K122O4340K8186K5864j9965q4632M6841
$$ -51026 -20856 -68975 -106659 -123293 -92352 -90230 -25890 2296 28160 8195 -76437 -29596
15301b9596L8817j0071J4077K606l656j9862m5461j1211k6586K568J07225M0408
$$ -29596 9221 -850 13227 15833 12177 -7685 -53146 -64357 -90943 -88375 18850 59258
15289E9258Q763K5418j1204p8090l7226k8194j7061P6184M1184J5162m0682k7711
$$ 59258 68021 93439 82235 4145 -33081 -61275 -78336 -2152 39032 54194 13512 -14199
15277a4199K5458K6135l7821r6304K6188P1427K3801p163j5335M603j9222O9175
$$ -14199 11259 37394 -427 -96731 -70543 884 24685 17522 2187 6790 -12432 56743
15265E6743L6651j4115p1024r996L2268J2754M6M7404K8396o5061m4516R011L7774
$$ 56743 93394 79279 8255 -1741 30527 43281 43327 90731 119127 54066 9550 18561 56335
15252E6335J2037j2349R998j566K586k6787K5982J5812l9126O79K0244l1166K593
$$ 56335 68372 56023 66021 64455 67041 40254 66236 82048 42922 43601 63845 32679 35272
15239C5272K3802L4413m4079j16867K5614L7221l269J3264K7141J5723l110k5430
$$ 35272 59074 93487 49408 -67459 -41845 -4624 -7893 5371 32512 48235 45125 19695
15227A9695N8919n985n1010m511r181k4257j6336M3554K6470l5998j3148j4894
$$ 19695 78614 72629 21619 17108 7927 -16330 -32666 10888 37358 1360 -11788 -26682
15215b6682N242l5830j8050P7972N0661o486p9852q1614Q944J4378m403L7825
$$ -26682 -21440 -57270 -75320 2652 53313 46827 -33025 -114639 -105695 -91317 -95720 -57895
15203e7895L6539L8222l250l8140M553L1093k3356k1122N3064l5878k2543J5431
$$ -57895 -21356 16866 13616 -24524 -19971 11122 -12234 -33356 19708 -16170 -38713 -23282
15191b3282k948q643m2504N968N0494Q9078J9695o2942j12078m0429N4360P8992
$$ -23282 -26230 -34873 -77377 -71409 -20915 68163 87858 24916 -87162 -127591 -73231 5761
15179E761P3084R726k8333m8634o1612M0392K1303M9194k6601o0035q853L4181
$$ 5761 78845 88571 60238 11604 -50008 -9616 11687 60881 34280 -25755 -34608 -427
15167d27J0942j8274p2178k2882l786L4496K1154o001m155O7169M7153q207q3780
$$ -427 10515 -7759 -79937 -102819 -106605 -72109 -50955 -56956 -61111 6058 53211 45004 -38776
15154c8776K6823p858J5414P1991pk1890j4459K7892L7823J6262P2l1817l8046
$$ -38776 -11953 -19811 -4397 67594 67587 45697 31238 59130 96953 113215 113287 81470 43424
15141D3424l4926O7739M2714J7449R368l3335l3431m9939j5324l4939j4740M793
$$ 43424 8498 76237 118951 136400 145768 112433 79002 29063 13739 -21200 -35940 -31147
15129c1147L4587j1989n084N1120k8649l174J6414q388l4040k6175P2568J05613
$$ -31147 3440 -8549 -13633 37487 8838 5664 22078 13690 -20350 -46525 26043 131656
15117A31656L746n0973K594M1164k5191O756l4464j8246K0106k1707k5856l8503
$$ 131656 135402 84429 87023 128187 102996 109752 75288 57042 77148 55441 29585 -8918
15105h918K050O9556n399k1778m3670j4561k9545K2777Q3489O96k5000j4300l3226
$$ -8918 -6868 62688 57289 35511 -8159 -22720 -52265 -29488 54001 54697 29697 15397 -17829
15092a7829K0118M0660L6963k0668q0670p985M7626K3573o755K2206J6783k3680
$$ -17829 2289 42949 79912 59244 -21426 -29411 18215 41788 35033 57239 74022 50342
15080E0342O844p0382l3005J0035K705k1272K7099K1081n2306o513N3091L2508
$$ 50342 57186 -13196 -46201 -36166 -33461 -54733 -27634 -6553 -58859 -65372 -12281 20227
15068B0227l7634l5630l5511K0489K8298J5245O0436K9597m7651r2103L428J6545
$$ 20227 -17407 -53037 -88548 -68059 -39761 -24516 35920 65517 17866 -74237 -70809 -54264
15056e4264M7641J7390m6421J182K8004N083m0330m0177J0295K8497J299J364
$$ -54264 -6623 10767 -35654 -34472 -6468 -1385 -41715 -81892 -71597 -43100 -41801 -40437
15044d0437N9606j1132j8104L7384j6328J4848r148J577L8783j0496J0111l6734
$$ -40437 19169 8037 -10067 27317 10989 25837 16689 18266 57049 46553 56664 19930
15032A9930L9786m3409l8038P651J0162J6530o38k761K9326M5833l6285J8092
$$ 19930 59716 16307 -21731 -14080 -3918 12612 11974 9213 38539 84372 48087 66179
15020F6179o182K5230j0312l604K6925m9170m6152J1866j7207J2860K3022n9807
$$ 66179 59997 85227 74915 71311 98236 49066 2914 14780 -2427 10433 33455 -26352
15008b6352K8460M814J3556l6586n8966J1702l1403K3834M9969O2995J2552k3738
$$ -26352 2108 6922 20478 -16108 -75074 -63372 -94775 -70941 -20972 42023 54575 30837
14996C0837k9687m670L1846N5726M3895M6215M2672l8885p5917o740m962m908
$$ 30837 1150 -3520 28326 84052 127947 174162 216834 177949 102032 95292 90330 85422
14984H5422m1790m4166r401o1905j8852L3175L0814j8811p957m9857K1014M0878
$$ 85422 43632 -534 -9935 -71840 -90692 -57517 -26703 -45514 -53471 -103328 -82314 -41436
14972d1436J954m6830M9663l442j8981k6202L2460L6630j3613K7763K1428J4504
$$ -41436 -39482 -86312 -36649 -40091 -59072 -85274 -52814 -16184 -29797 -2034 19394 33898
14960C3898p4188l1252M1553N4425P448J9528K6841o248K9788N689j17684j03232
$$ 33898 -40290 -71542 -29989 24436 31884 51412 78253 72005 101793 107482 -10202 -113434
14948a13434L1888M9215m555j7389l807K0303l159L2369q020N7521J4018l4099
$$ -113434 -81546 -32331 -36886 -54275 -58082 -37779 -40938 -8569 -16589 40932 54950 20851
14936B0851n5673l4553k7728Q9748K7959l0465l2087j9508K9719l1182M0805Q2000
$$ 20851 -34822 -69375 -97103 -7355 20604 -9861 -41948 -61456 -31737 -62919 -22114 59886
14924E9886m4848k2125j5682L6877L911J6325k4964L8397Q5969j3477o8409Q579
$$ 59886 15038 -7087 -22769 14108 18019 34344 9380 47777 133746 120269 51860 60439
14912F0439l4148r553q879k9340k2570j0948l7409j7815J0299J8375R016m2600
$$ 60439 26291 16738 7859 -21481 -44051 -54999 -92408 -110223 -99924 -81549 -72533 -115133
14900a15133N8197l9584m7048N3450M4159N9207j1412o4603k0146M3574j0918
$$ -115133 -56936 -96520 -143568 -90118 -45959 13248 1836 -62767 -82913 -39339 -50257
14889e0257K5047L5766j6510j823N3083J206k4151j9865n996N4903L4285q819
$$ -50257 -25210 10556 -5954 -7777 45306 46512 22361 2496 -3500 51403 85688 76869
14877G6869j5961J3554l05J7552K545K1825l1121l3536m207j3044J0122K8890
$$ 76869 60908 74462 74157 91709 94254 116079 84958 51422 47215 34171 44293 73183
14865G3183n003O497J3909q171n4680l8819l5489N3571K7271L8257L7617l8225
$$ 73183 68180 74677 88586 80415 25735 -13084 -48573 4998 32269 70526 108143 69918
14853F9918o4182K2567L054o3618L7731L4286o824J8112L3190n384o8766j4652
$$ 69918 5736 28303 31357 -32261 5470 39756 32932 51044 84234 78850 10084 -4568
14841d568J1885J436K0794k593m0220J6157K1308j4679j2264O3875L3292L1361
$$ -4568 7317 8753 29547 26954 -13266 2891 24199 9520 -2744 61131 94423 125784
14829A25784k8849m5978n3219r002M4840l1443o6637o416J9051L5216L5950n546
$$ 125784 96935 50957 -2262 -11264 33576 2133 -64504 -70920 -51869 -16653 19297 13751
14817A3751j0520J0638k5222R172n4527j8590J0068m719j6050l8465N663L8481
$$ 13751 3231 13869 -11353 -2181 -56708 -75298 -65230 -69949 -85999 -124464 -118801 -80320
14805h0320K3407n465M2945m1985l364M9714k942q448K4639K4440n399k1076N1044
$$ -80320 -56913 -62378 -19433 -61418 -64782 -15068 -18010 -26458 -1819 22621 17222 -3854 47190
14792D7190l9760m0242j7250K2677K0939K3249M7175J7232j99J7560k2858k8295
$$ 47190 7430 -32812 -50062 -27385 -6446 16803 63978 81210 81011 98571 75713 47418
14780D7418k5058l1147K2575L0732j7566k0361M2526N2496M6912J2339o3001j03320
$$ 47418 22360 -8787 13788 44520 26954 6593 49119 101615 148527 160866 97865 -5455
14768e455M281N332K9350j8586j4487n1944j7695n250j8332K7283K2042l9464
$$ -5455 -1174 4158 33508 14922 435 -51509 -69204 -74454 -92786 -65503 -43461 -82925
14756h2925L910Q4723k7017j9746J7147J7892N047J8740M2016L8163o3161l1581
$$ -82925 -79015 5708 -21309 -41055 -23908 -6016 -969 17771 59787 97950 34789 3208
14744C208k020m1736m8200K4540N6511K5593n4623J459K1181O553o4587l2042
$$ 3208 1188 -40548 -88748 -64208 -7697 17896 -36727 -35268 -14087 -7534 -72121 -104163
14732a04163M3496N250J0620r004L9865O0405L2168p5102p4040k2343N2830P7712
$$ -104163 -60667 -55417 -44797 -53801 -13936 46469 78637 3535 -70505 -92848 -40018 37694
14720C7694J9622k6370r398k2458M096k8341j0903k2441N020N8873K4932M6392
$$ 37694 57316 30946 21548 -910 3186 -25155 -36058 -58499 -53479 5394 30326 76718
14708G6718K7053k8999n209o2342J7077q679m5035m626P1074M2673M1844M2776
$$ 76718 103771 74772 69563 7221 24298 15619 -29416 -34042 37032 79705 121549 164325
14696A64325j9148p5067p7917o2188k510O412L375L3004L4600J1051K130o19J4486
$$ 164325 145177 70110 -7807 -69995 -72505 -66093 -62718 -29714 4886 15937 18067 17448 31934
14683C1934J2523L2243J3026m1478l3625k7386J5597j7177n2632J5919K2171J150
$$ 31934 44457 76700 89726 48248 14623 -12763 2834 -14343 -66975 -51056 -28885 -27735
14671b7735m9287k786L3636l572L9783k2710M1751J7919m2652k6860l6463Q7791
$$ -27735 -77022 -79808 -46172 -49744 -9961 -32671 9080 26999 -15653 -42513 -78976 8815
14659H815N7809k242o3337m1618Q473l9845L2983K4914M4580L4042J401O152m2389
$$ 8815 66624 64382 1045 -40573 -32100 -71945 -38962 -14048 30532 64574 65975 72127 29738
14646B9738j1951l7826o767K677m7922P2659K6025q925K8392L9922j7602j9376
$$ 29738 17787 -20039 -26806 -24129 -72051 608 26633 17708 46100 86022 68420 49044
14634D9044k0816q838K604K0336j6999K3681P021j7427k7143j6221J3283k9654
$$ 49044 28228 19390 21994 42330 25331 49012 56033 38606 11463 -4758 8525 -21129
14622b1129m5875k5243O0742P6691l616n8470m123R2828J0230J6986P310l8778
$$ -21129 -67004 -92247 -31505 45186 41570 -16900 -21023 71805 82035 99021 106331 67553
14610F7553l8754n37m6569J8828P6685K4492M5441K1470k9942l3840l3971J7973
$$ 67553 28799 28262 -18307 521 77206 101698 147139 168609 138667 104827 70856 88829
14598H8829J7984m0433o0641j6622M9875l745m3811p011m705j3840J09884M4578
$$ 88829 106813 66380 5739 -10883 38992 35247 -8564 -15575 -20280 -34120 75764 120342
14586A20342N5183j5990j03833N58K1967o316p4012m7507M787N2208k8185k1598
$$ 120342 175525 159535 55702 56260 78227 71911 -2101 -49608 -44821 7387 -20798 -42396
14574d2396K1515j270n0593N6596O1531k8467q829j550O759M6439N2376P154r2012
$$ -42396 -20881 -22151 -72744 -16148 45383 16916 8087 6537 13296 59735 112111 119265 27253
14561B7253o0596p164M7464J9694k3278k9064j6521K2044K0353K3398P9605K7132
$$ 27253 -33343 -40507 6957 26651 3373 -25691 -42212 -20168 185 23583 103188 130320
14549A30320o3206o9497n3112Q331k4834k2055n935Q1439K0671M6261j8404P507
$$ 130320 67114 -2383 -55495 -47164 -71998 -94053 -99988 -18549 2122 48383 29979 37486
14537C7486l7527m7723L7635O483j8264r916O9422j5353o5137j9350O62N2754
$$ 37486 -41 -47764 -10129 -3646 -21910 -31826 37596 22243 -42894 -62244 -61582 -8828
14525h828L1689Q050n9082K9062M6099k0458J8472J0698j3772m8411n7492K2154
$$ -8828 22861 30911 -28171 891 46990 26532 45004 55702 41930 -6481 -63973 -41819
14513d1819M2900m9001L416R4677M1862J2123n3560j6935p552N8226j4376l3654
$$ -41819 1081 -47920 -44504 50173 92035 104158 50598 33663 26111 84337 69961 36307
14501C6307q0632k5307j422K2676L8148m594k921L5589k8705k0335j346k3613
$$ 36307 -44325 -69632 -71054 -48378 -10230 -14824 -17745 17844 -10861 -31196 -32542 -56155
14489e6155L8862L092L1679l2160n6237L7946M1328o378J7179j579m9570M3256
$$ -56155 -17293 -14201 17478 -14682 -70919 -32973 8355 1977 19156 17577 -31993 11263
14477A1263N3775J9320O4288j9718m2372l3585n6915K7092P5719K5583k9202j7363
$$ 11263 65038 84358 148646 128928 86556 52971 -3944 23148 98867 124450 95248 77885
14465G7885Q798J8386n2872j7213j071j7560k6588l7415M8041O2979K2456k2197
$$ 77885 86683 105069 52197 34984 33913 16353 -10235 -47650 391 63370 85826 63629
14453F3629K4069j4311j8048K2437K7013m4422k7321L253j6510p1705l1697M3177
$$ 63629 87698 73387 55339 77776 104789 60367 33046 36299 19789 -51916 -83613 -40436
14441d0436l9616l9176j0893j1699j5912L2079M7931P0021K9301J1377L3007J3691
$$ -40436 -80052 -119228 -130121 -141820 -157732 -125653 -77722 -7701 21600 32977 65984 79675
14429G9675L8983o4748q8637L1582L2942l0213k8520k8828J1444K9400O9967K4438
$$ 79675 118658 53910 -34727 -3145 29797 -416 -28936 -57764 -46320 -16920 53047 77485
14417G7485j8196l6500j1415l345m9892K5927L2734k9156J998J5268k31N5327
$$ 77485 59289 22789 11374 8029 -41863 -15936 16798 -12358 -10360 4908 4677 60004
14405F0004l6977l9443o4326K8493K3546K0657K9748J3492L0177l4511j2406j3327
$$ 60004 23027 -16416 -80742 -52249 -28703 -8046 21702 35194 65371 30860 18454 5127
14393E127p1741o1616p631O0233O7207O2108L3808p2363p5594L1532P4414J1175
$$ 5127 -66614 -128230 -135861 -75628 -8421 53687 87495 15132 -60462 -28930 45484 56659
14381E6659p992k094k3577o1369m4913K2875k968J7867r980l5048N1997N4450
$$ 56659 48667 46573 22996 -38373 -83286 -60411 -63379 -45512 -55492 -90540 -38543 15907
14369A5907r880K835K1482K8737J4613k5841l2074k7533J3335L5166J340J1106
$$ 15907 6027 8862 30344 59081 73694 47853 15779 -11754 1581 36747 38087 49193
14357D9193J496N0947J7270k9482m7749k7252k474L4701J8216p1883l266K0983
$$ 49193 50689 101636 118906 89424 41675 14423 11949 46650 64866 -7017 -10283 10700
14345A0700J6396k4324p964M7060J5050j5891m0967p0573k4157L0798Q503Q6299
$$ 10700 27096 2772 -5192 41868 56918 41027 60 -70513 -94670 -63872 -55369 30930
14333C0930k9639o5N5584K7861m7048Q4545O1223N149n6791l5992l1665j0029
$$ 30930 1291 1226 56810 84671 37623 122168 183391 188540 131749 95757 64092 54063
14321E4063j9058K5063N1617j7270l0587K8293K7359k2458o732l1823m3351l8729
$$ 54063 35005 60068 111685 94415 63828 92121 119480 97022 90290 58467 15116 -23613
14309b3613j1326O8437L1869L0563l3228n4449J0200K6635l6243Q054L5207j6651
$$ -23613 -34939 33498 65367 95930 62702 8253 18453 45088 8845 16899 52106 35455
14297C5455k7505r6484k0305R9575P2101K0540J2109l1208k4941l2764r287J2741
$$ 35455 7950 -88534 -108839 -9264 62837 83377 95486 64278 39337 6573 -2714 10027
14285A0027k2768J0076M128L3759L666J4461m1608K3741l2240J6246K2273q6128
$$ 10027 -12741 -2665 1463 35222 38888 53349 11741 35482 3242 19488 41761 -44367
14273d4367l2293J8753J3070Q524M4347J5930J5936k3686K7518R27M1398j9787
$$ -44367 -76660 -57907 -44837 -36313 8034 23964 39900 16214 43732 44659 86057 66270
14261F6270j6290J8505j6322k1152l850k245L942n2354j1351N0308J2966K3586
$$ 66270 49980 68485 52163 31011 27161 24916 28858 -23496 -34847 15461 28427 52013
14249E2013J8388p791j8860Q423K7061J1257k7552K4828j1447k2786O720l5957
$$ 52013 70401 62610 43750 52173 79234 90491 62939 87767 76320 53534 60254 24297
14237B4297K1509Q6473J3245l1538m7211n5761J0065J5865o2012n1895J2130K7416
$$ 24297 45806 132279 145524 113986 66775 11014 21079 36944 -25068 -76963 -64833 -37417
14225c7417R749j4050J1328O206m8154K8627R8048L1889j59K0561J5769k8005
$$ -37417 -27668 -41718 -30390 -24184 -72338 -43711 54337 86226 86067 106628 122397 94392
14213I4392n6318K029n95J9260N8313k9033n4990k179j7004L5325Q98n4540m0990
$$ 94392 38074 40103 39508 58768 117081 88048 33058 30879 13875 49200 50098 -4442 -45432
14200d5432j8445j2153j8888K8820N2106J5719l3183L3398M6951M723K1246Q377
$$ -45432 -63877 -76030 -94918 -66098 -13992 1727 -31456 1942 48893 53616 74862 83239
14188H3239n1288k510L541L5512L8978m2727n9875m8719K5065N2027n1445k4225
$$ 83239 31951 29441 32982 68494 107472 64745 4870 -43849 -18784 33243 -18202 -42427
14176d2427J5860J9123J8230N85l883p331k282L9491k439j2336J4690r596L5L413
$$ -42427 -26567 -7444 10786 11371 7488 157 -2125 37366 34927 22591 37281 27685 27720 31133
14162C1133l6957O7334M159l4352P590K4225P969n3021j5099J5909J4175n619
$$ 31133 -5824 61510 65669 31317 38907 63132 71101 18080 2981 18890 33065 27446
14150B7446N9513J3365p020m4754K0485L0781N3783l2853o9589l3568K6238O7145
$$ 27446 86959 100324 93304 48550 69035 99816 153599 120746 51157 17589 43827 110972
14138A10972J4058o6826n5612J1645N9179J5983j1144l6629k0806k3899O2518
$$ 110972 125030 58204 2592 14237 73416 89399 78255 41626 20820 -3079 59439
14127E9439L6276K0623l128m7730l6229O976L5193K655k0446j7724j8459n294
$$ 59439 95715 116338 113210 65480 29251 36227 71420 74075 53629 35905 17446 12152
14115A2152J292k6656O4733l3479J4122J7599K0699J3347L5146Q258k6872j05143
$$ 12152 13444 -13212 51521 18042 32164 49763 70462 83809 118955 127213 100341 -4802
14103d802j0641L0666N8965p837k1657m2043m6487O501J2313K6709J5376R6342
$$ -4802 -15443 15223 74188 66351 44694 2651 -43836 -37335 -25022 1687 17063 113405
14091A13405R542m1112j10364J481O0810j0666j099L8280P7069K7103M68q4678
$$ 113405 122947 81835 -28529 -27048 33762 23096 21997 60277 137346 164449 164917 80239
14079H0239o2740K2761k154J8301m0188r3368o658P8956M1864r306J2566P634
$$ 80239 17499 40260 38106 56407 16219 -77149 -83807 -4851 37013 27707 40273 47907
14067D7907k4222K905R20o28m3354N731j0712M1934K5916M0987P475m1413n312
$$ 47907 23685 26590 27510 26882 -16472 -10741 -21453 20481 46397 87384 94859 53446 48134
14054D8134M537n71k6989m2793K8519M5792k908J9117j6379l8499k8402J0563
$$ 48134 52671 52100 25111 -17682 10837 56629 53721 72838 56459 17960 -10442 121
14042A21N7825j0223r522J9496J2855L791o4122R340j8621q8918j1828m3602J744
$$ 121 57946 47723 38201 57697 70552 74343 10221 19561 940 -87978 -99806 -143408 -141664
14029a41664Q9090J7159j8555J0702L6098o2175l0589K6918P3130P197J5560m6238
$$ -141664 -52574 -35415 -53970 -43268 -7170 -69345 -99934 -73016 114 7311 22871 -23367
14017b3367m8603K550R613N0959L1528K9059j7304n8359j03708K561M8218L0854
$$ -23367 -71970 -69420 -59807 -8848 22680 51739 34435 -23924 -127632 -125071 -76853 -45999
14005d5999K4945M6752L6817K5101p1453m5675l7025n235L2980M4624Q049k0737
$$ -45999 -21054 25698 62515 87616 16163 -29512 -66537 -71772 -38792 5832 13881 -6856
13993f856N8252n190j5684l887J7208l8079m6580M7835J4811N344n1871m5453
$$ -6856 51396 46206 30522 26635 43843 5764 -40816 7019 21830 27174 -24697 -70150
13981g0150J4699K8949l5222L3948O508J278n129j506L9892J935J2156L5618m1620
$$ -70150 -55451 -26502 -61724 -27776 -21268 -19990 -25119 -26625 13267 15202 27358 62976 21356
13968B1356l6970K1311P3585L7174j0520J0450m2937R320n727J0711m631K0439
$$ 21356 -15614 5697 79282 116456 105936 116386 73449 82769 77042 87753 83122 103561
13956A03561K1644o885k9511o7909l1154J3812j9357j8241K0985R942k811N7176
$$ 103561 125205 118320 88809 20900 -10254 3558 -15799 -34040 -13055 -3113 -5924 51252
13944E1252K3269l5523k693O321N5165M7184k896k8475p5455n2987L4294l5062
$$ 51252 74521 38998 36305 42626 97791 144975 142079 113604 38149 -14838 19456 -15606
13932a5606k4053R681j37j741k8286O3133o6302J8022L7571M5438N3889j4816
$$ -15606 -39659 -29978 -30115 -31856 -60142 2991 -63311 -45289 -7718 37720 91609 76793
13920G6793n2727j4825L3284K6812k472J3038j8889n2308n4515M1860l0070o1248
$$ 76793 24066 9241 42525 69337 66865 79903 61014 8706 -45809 -3949 -34019 -95267
13908i5267O7103Q6291J9725K155M1115O922j5526p196L1363L1503j0421n0907
$$ -95267 -28164 58127 77852 80007 121122 128044 112518 105322 136685 168188 157767 106860
13896A06860l7325n0744J7113j4840J1644o830j1836N845K0859M4710k1871p9452
$$ 106860 69535 18791 35904 21064 32708 25878 14042 19887 40746 85456 63585 -15867
13884a5867Q960N2164k6229J6167M2408r346k2041L8806r732N728P317r0853q5168
$$ -15867 -6907 45257 19028 35195 77603 68257 46216 85022 75290 81018 88335 -2518 -87686
13871h7686N997M4011l9203j4770J8350J0587K3327P6829L8175k9961o3277J125
$$ -87686 -81689 -37678 -76881 -91651 -73301 -62714 -39387 37442 75617 45656 -17621 -16496
13859a6496L5289L8766M9345J0561q955N973l6616m6578j4980m2193l8290k1086
$$ -16496 18793 57559 106904 117465 108510 114483 77867 31289 16309 -25884 -64174 -85260
13847h5260J4614O2572J7309n641L4231k3672n6547j843K0289K7688M3285J687
$$ -85260 -70646 -8074 9235 3594 37825 14153 -42394 -44237 -23948 3740 47025 48712
13835D8712N7K2199j465o0403L1170M3436K7690j3978r583l8849m2691o060K0104
$$ 48712 48769 70968 69503 9100 40270 83706 111396 97418 87835 48986 6295 235 20339
13822B0339n54j601l1279L0953j2020O732O3446k4213l1667j5181o585K5542k8790
$$ 20339 19785 18184 -13095 17858 5838 12570 76016 51803 20136 4955 -1630 23912 -4878
13809d878k623L4471J5786k418o1106M1375O2618J3836j2616o1648j8864K8681
$$ -4878 -7501 26970 42756 40338 -20768 20607 83225 97061 84445 22797 3933 32614
13797C2614N8611k6628l3738J1961O132O16j0239k1559n300l543l2961K2683l1189
$$ 32614 91225 64597 30859 42820 48952 49568 39329 17770 12470 8927 -24034 -1351 -32540
13784c2540k8378q280J6920L0847N899l3560J08644j491r5457k170k4144M4763
$$ -32540 -60918 -69198 -52278 -21431 -15532 -49092 59552 58061 -37396 -39566 -63710 -18947
13772a8947P2288O974K706q0464j390M4455L3940M889k0971m1210p4661J5394
$$ -18947 53341 60315 63021 -17443 -18833 25622 59562 64451 43480 2270 -72391 -56997
13760e6997P6177M745K4147l8550K6297J9527k4384J5181m2180K9704L5239m402
$$ -56997 19180 23925 48072 9522 35819 55346 30962 46143 3963 33667 68906 64504
13748F4504k3965m6286o053K0593k3442O178K373l4295K4645K4676N7685K5907
$$ 64504 40539 -5747 -11800 8793 -14649 -8471 -6098 -40393 -15748 8928 66613 92520
13736I2520o9613k833J562k5275m1365J0802J9881J3472m2236n316L4633M3037
$$ 92520 22907 20074 21636 -3639 -45004 -34202 -14321 -849 -43085 -48401 -13768 29269
13724B9269k1595j1888j4000j7171k1769K2821N3764L1950N1394J4630k86j3301
$$ 29269 7674 -4214 -18214 -35385 -57154 -34333 19431 51381 102775 117405 117119 103818
13712A03818K1658j4163j7858l9383K0135J6926k1509j3648j1160J5912k1168
$$ 103818 125476 111313 93455 54072 74207 91133 69624 55976 44816 60728 39560
13701C9560l6507L4091M7711j694N205n5071p8647N8816P6197J6041p2483j1311
$$ 39560 3053 37144 84855 83161 88366 33295 -45352 13464 89661 105702 33219 21908
13689B1908k1302k3391j626q034J8125N6899l518J0676N6571L802O433J1223o5299
$$ 21908 606 -22785 -24411 -32445 -14320 42579 39061 49737 106308 110110 116543 127766 62467
13676F2467l6623J1212O4211o641k0377L6463L2913n2557k0842j9830m8312p547
$$ 62467 25844 37056 101267 94626 74249 110712 143625 91068 70226 50396 2084 -5463
13664e463J7597J3870r253j4329k0813P5182J3749q4035O0028k0531j2074r539
$$ -5463 12134 26004 16751 2422 -18391 56791 70540 -13495 46533 26002 13928 4389
13652D389k8535M35k280M7766Q114N302N4523l1277o9747l2852J2901K5961P3322
$$ 4389 -24146 -23711 -25991 21775 29889 35191 89714 58437 -11310 -44162 -31261 -5300 68022
13639F8022M1413L1604N05j8624R677k213n603k7378m2324J5735J9388k2934j5129
$$ 68022 109435 141039 141544 122920 132597 130384 124781 97403 55079 70814 90202 67268 52139
13626E2139l468L6762O210j7735O230K2228n8993r5401k8973P140J07928O7248
$$ 52139 48671 85433 91643 73908 80138 102366 43373 -52028 -81001 -73861 34067 101315
13614A01315J0693p3747l6060N1489K7419l0379l0791l680k2179M3066L5604l0820
$$ 101315 112008 38261 2201 53690 81109 50730 19939 16259 -5920 37146 72750 41930
13602D1930p3444J3868O1487Q8205J941n7718l3062j7509J9088L2526j0146l0077
$$ 41930 -31514 -17646 43841 132046 133987 76269 43207 25698 44786 77312 67166 37089
13590C7089L0576K6750l6767o6943K0051L6341L6423j3269p0431J5028O0833L0742
$$ 37089 67665 94415 57648 -9295 10756 47097 83520 70251 -180 14848 75681 106423
13578A06423p4571l4601N9934L5860j0020j1473L0678j222k1035K9421k9601m1026
$$ 106423 31852 -2749 57185 93045 83025 71552 102230 101008 79973 109394 79793 38767
13566C8767J4812P2277K8577n4797j04163J4304J6782Q2L6119j4632l1048l568
$$ 38767 53579 125856 154433 99636 -4527 9777 26559 26641 62760 48128 17080 13512
13554A3512L2205l4274m1354L6086K0364M805M3861l4252n7835j4787J8846O51
$$ 13512 45717 11443 -29911 6175 26539 31344 75205 40953 -16882 -31669 -12823 -12172
13542a2172Q7063L4105L225L1977J6504J3949n628k3410n7719p950j5623k9542
$$ -12172 74891 108996 112221 144198 160702 174651 169023 145613 87894 79944 64321 34779
13530C4779j2326k3459j7084P568J659N6378L4546r5j1791O805M6303J2607j9414
$$ 34779 22453 -1006 -18090 -10522 -8863 47515 82061 81966 70175 76980 123283 135890 116476
13517A16476j1634j6649o3294j6085N1605N4882K3262m2410k9194j5596l5028
$$ 116476 104842 88193 24899 8814 60419 115301 138563 96153 66959 51363 16335
13506A6335K7227M3906K8476l477O668n6121o8995l0672M5079J2209Q5232K9908
$$ 16335 43562 87468 115944 112467 119135 63014 -5981 -36653 8426 20635 105867 135775
13494A35775q519N1758l404k1788j8682J7241k3998l9461o6980K1470L5042k4240
$$ 135775 127256 179014 175610 153822 135140 152381 128383 88922 21942 43412 78454 54214
13482E4214l3897K0559K59n594L0754j7430K651L1306J4603j4177l8457r186L8818
$$ 54214 20317 40876 41135 35541 66295 48865 51516 82822 97425 83248 44791 35605 74423
13469G4423q003m416O4703o86L7230O1326l9500p3994q337q259J7464J547l903
$$ 74423 66420 62004 126707 126021 163251 224577 185077 111083 102746 94487 111951 113498 109595
13456A09595M9032n152P239K3013l4465j8285r821J2135k6731k7826m1332q724
$$ 109595 158627 153475 160714 183727 149262 130977 121156 133291 106560 78734 37402 28678
13444B8678M801R7455K3517m6631L4039o4638j2793R831j3957J525R224k4524
$$ 28678 33479 130934 154451 107820 141859 77221 64428 74259 60302 61827 71051 46527
13432D6527j2349J443l825r647L9843j0879j6929n5360q2758M1890O3274N6603
$$ 46527 34178 35621 31796 22149 61992 51113 34184 -21176 -103934 -62044 1230 57833
13420E7833M3996m4756K3225N5727O60m6063m7176Q244J0109J0825L0909L4075
$$ 57833 101829 57073 80298 136025 136685 90622 43446 51690 61799 72624 103533 137608
13408A37608J7775l4389o3286l3300K2348K2424j2275l7262J7480J9332J0846
$$ 137608 155383 120994 57708 24408 46756 69180 56905 19643 37123 56455 67301
13397F7301l4909l1708M4849K2758l7702l64M2582M5883p590m0184k007R411j068
$$ 67301 32392 684 45533 68291 30589 30225 72807 118690 111100 70916 68909 78320 77252
13384G7252j6828K1459L8763L888j3283L6094J7728j0213K5117K7101l1469l2590
$$ 77252 60424 81883 120646 124534 111251 147345 165073 154860 179977 207078 175609 143019
13372A43019j8904o1568m4335j1273J1529L5341N3277l2711k7213m1849L71M7352
$$ 143019 124115 62547 18212 6939 18468 53809 107086 74375 47162 5313 5684 53036
13360E3036N7882Q798p901K7662K9435l2766l924K4872L4599j8081O757K8085
$$ 53036 110918 119716 111815 139477 168912 136146 132222 157094 191693 173612 180369 208454
13348B08454M6797j9372j9786j4672m6752L5181J226j6423o7270j0983n996K2260
$$ 208454 255251 235879 216093 201421 154669 189850 191076 174653 107383 96400 90404 112664
13336A12664j4877p723k9639j8026K5043j2629N5775J9427k7372p973L0671N3118
$$ 112664 97787 90064 60425 42399 67442 54813 110588 130015 102643 94670 125341 178459
13324A78459o8650p240J6618J7799n2188n2217l6037r286K8866J1787M7210J0473
$$ 178459 109809 102569 119187 136986 84798 32581 -3456 -12742 16124 27911 75121 85594
13312H5594L2293K4772k8592r539L1646l353L7625J4646l0811P092L826k8465
$$ 85594 117887 142659 114067 104528 136174 132821 170446 185092 154281 161373 165199 136734
13300A36734n3677r01O0520n861n2925K6034J9400j9641o3017J8985L5732k6573
$$ 136734 83057 82156 142676 136815 83890 109924 129324 109683 46666 65651 101383 74810
13288G4810j8164M1419L2029l027m7414K0006J5556j5132K09J4014J4827J4685
$$ 74810 56646 98065 130094 127067 79653 99659 115215 100083 100292 114306 129133 143818
13276A43818m1392K257j5456N879J08632M3548p2727o3920r25Q1518j9757l4442
$$ 143818 102426 104683 89227 95106 203738 247286 174559 110639 109714 191232 171475 137033
13264A37033l5242m0357K774J9890L1145N196N50J1966o3244n0607K1324j374
$$ 137033 101791 61434 64208 84098 115243 120439 120989 132955 69711 19104 40428 39054
13252C9054k759M2749K3438J8201K8239r4459k7155O8178J9092k729q153R645
$$ 39054 36295 79044 102482 120683 148922 54463 27308 95486 114578 111849 103696 113341
13240A13341K1957n85j6803J8160j3355m5260k7313o224j564M2975O275m3113
$$ 113341 135298 134713 117910 136070 122715 77455 50142 43918 42354 85329 91604 48491
13228D8491R967j1805K0268J03388L0547J9980O0794j5205j5480J0177k0734M5174
$$ 48491 58458 46653 66921 170309 200856 220836 281630 266425 250945 261122 240388 285562
13216B85562j2258J13681J03280R5542J80816L20533L40027L98484M22913L22552
$$ 285562 273304 386985 490265 585807 766623 1087156 1427183 1825667 2248580 2571132
13206B571132J12975j06207l21041l66045l97876l88707k55734j07066j15470
$$ 2571132 2684107 2577900 2256859 1890814 1492938 1104231 848497 741431 625961
13197F25961o2751j70013o6428O9987p284l1516m4365j0309m0831M50j4888j0172
$$ 625961 563210 393197 326769 396756 389472 357956 313591 303282 262451 262901 248013 237841
13185B37841l1343l2497L8782M6301K3547k2769k3632j6365m4838M4633J4307
$$ 237841 206498 174001 212783 259084 282631 259862 236230 219865 175027 219660 233967
13174B33967r421l003l3525N9342m2778m6677J8745p364r6671l797K7593K2727
$$ 233967 224546 221543 188018 247360 204582 157905 176650 169286 72615 68818 96411 119138
13162A19138O4630M9825K011l1413o5160j7873p810r328m790L810L8468J8499
$$ 119138 183768 233593 235604 204191 139031 121158 113348 104020 99230 103040 141508 160007
13150A60007N2090j4652M112N6409J6694l3378k6898M157R930R194L0054m0763
$$ 160007 212097 197445 201557 257966 274660 241282 214384 218541 228471 237665 267719 226956
13138B26956n0032m1583m329p963k7584k2739q005m820Q460J9562L8654j903M6076
$$ 226956 176924 135341 131012 123049 95465 72726 64721 59901 68361 87923 126577 124674 170750
13125A70750L2427k0480p660J5994n087k5385k1592k6817j5903j5116j06K3885
$$ 170750 203177 182697 175037 191031 185944 160559 138967 112150 96247 81131 81025 104910
13113A04910j0805K1685l776J1600R766j9328p429O3919K4274p958m48l7944j7983
$$ 104910 94105 115790 112014 123614 133380 114052 106623 170542 194816 186858 186410 148466 130483
13100A30483p767L0623J8468R050j6141m1629m838K7853m7189k840m7941K0102
$$ 130483 122716 153339 171807 180857 164716 123087 118249 146102 98913 96073 48132 68234
13088F8234j3419j7458O8143J00589M4434l3963J3573j976m2211L8750M6854m561
$$ 68234 54815 37357 105500 206089 250523 216560 230133 228157 185946 224696 271550 266989
13076B66989J7336L742o225K6953Q2007N8789N17j09300n8078o026l5837n5513
$$ 266989 284325 288067 281842 308795 390802 449591 450108 340808 282730 276704 240867 185354
13064A85354J351L0428L9393k0586j846n6096m0486j0938Q749J0172l2592N8428
$$ 185354 186705 217133 256526 235940 234094 177998 137512 126574 135323 145495 112903 171331
13052A71331j2994l8453m1922P5155P4621k7523j5851r239m1205J2514k8493M1444
$$ 171331 158337 119884 77962 153117 227738 200215 184364 175125 133920 146434 117941 159385
13040A59385K3796O4081Q420m462k9595L5880M1102j7639j3214J7451M7406J27347
$$ 159385 183181 247262 255682 251220 221625 257505 298607 280968 267754 285205 332611 459958
13028D59958J36622K27552J97383p69p9277n0512j03777q1988m0463k0766j4411
$$ 459958 596580 824132 1021515 1020746 941469 890957 787180 705192 664729 643963 629552
13017F29552k5039o2726n5437k2995k6645k2808o5132m5701m9531J2353l8561
$$ 629552 604513 541787 486350 463355 436710 413902 348770 303069 253538 265891 227330
13006B27330m1087j381O0010K1643l8098K6275l4960o0734K2481k0123j9462M5126
$$ 227330 186243 184862 244872 266515 228417 254692 219732 158998 181479 161356 141894 187020
12994A87020j4727M1028J7871L003N5441N6984P9529N2438K1319O931L1390J23593
$$ 187020 172293 213321 231192 234195 289636 346620 426149 478587 499906 506837 538227 661820
12982F61820J60688J53126N8135o5386j79465k10674q2129o7509n1169k5760J3658
$$ 661820 822508 975634 1033769 968383 788918 578244 496115 428606 377437 351677 365335
12971C65335J4860k3312l8562l333K9836M1710N2734l8350o8379o207J47J0616
$$ 365335 380195 356883 318321 314988 344824 386534 439268 400918 332539 326332 326479 337095
12959C37095r3075n2170l676l2538M8754L8321J05297K7682o4030O520J2555j8459
$$ 337095 244020 191850 188174 155636 204390 242711 348008 375690 311660 318180 330735 312276
12947C12276n4081O6156L5005k8066n948N3545m010m7550L5464M8712J04428J00697
$$ 312276 258195 324351 359356 331290 325342 378887 374877 327327 362791 411503 515931 616628
12935F16628M6642o4332o3428j15785p7154L7209M2231m1624l5266l167N030L44
$$ 616628 663270 598938 535510 419725 342571 379780 422011 380387 345121 341954 346984 347328
12923C47328K0515J9710K1641o0859l4324L0535L9589q191k7861N752N5803p434
$$ 347328 367843 387553 409194 348335 314011 344546 384135 375944 348083 353835 409638 402204
12911D02204J8480L8896p006o9122l4731j7742K201K1738L2582M7857l826m1172
$$ 402204 420684 459580 452574 383452 348721 330979 333180 354918 387500 435357 431531 390359
12899C90359M7329l0800P838M7439Q0378L8420R2439N2526r003M2243L7194o786
$$ 390359 437688 406888 414726 462165 542543 580963 673402 725928 716925 759168 796362 789576
12887G89576J8624J2306n2724n2764n952l3627p1027J3574P3933P5155j6586j3949
$$ 789576 808200 820506 767782 715018 709066 675439 604412 617986 691919 767074 750488 736539
12875G36539L2339j8211j0494j1462j7711o7631l2053L2667J00623Q8500k3313
$$ 736539 768878 750667 740173 728711 711000 643369 611316 643983 744606 833106 809793
12864H09793p3876m3494n4131M4187O228j1080k2821n7132J4679P8910L9838J1570
$$ 809793 735917 692423 638292 682479 688707 677627 654806 597674 612353 691263 731101 742671
12852G42671Q970J4664J0737J2082L9303j960r312R6292P0069k6740n0118L425
$$ 742671 751641 766305 777042 789124 828427 826467 817155 913447 983516 956776 906658 910083
12840I10083K5779L7297O3449j4090k1946M1648Q7267P4636N966N061L1985K4022
$$ 910083 935862 973159 1036608 1022518 1000572 1042220 1129487 1204123 1210089 1215150 1247135 1271157
12828A271157N4699J06060L3884j3524L202r480P7303Q8835O8420L8267L3448
$$ 1271157 1325856 1431916 1465800 1452276 1455478 1445998 1523301 1612136 1680556 1718823 1752271
12817A752271O0821P0928L6690Q5000Q6857N0951Q9005J54163N0205R4784J15725
$$ 1752271 1813092 1884020 1920710 2005710 2092567 2143518 2232523 2386686 2436891 2531675 2647400
12806B647400J16772J02983J70710J63767R7331R8609K13715K55272K51073L19899
$$ 2647400 2764172 2867155 3037865 3201632 3298963 3397572 3611287 3866559 4117632 4437531
12796D437531K22572K44118K77156L39457M13537N20479N02369N62274O55374
$$ 4437531 4660103 4904221 5181377 5520834 5934371 6454850 6957219 7519493 8174867
12787H174867O53008P30025Q90912J073740J288387J599925J914088K374777L040688
$$ 8174867 8827875 9557900 10448812 11522552 12810939 14410864 16324952 18699729 21740417
12778B1740417L768587M657357N665118O985232Q831006J1728207J6362384K4158242
$$ 21740417 25509004 30166361 35831479 42816711 51647717 63375924 79738308 103896550
12770A03896550L6942629N6627588Q2897939J03745656R0143141M8718580n18369
$$ 103896550 140839179 197466767 280364706 384110362 474253503 522972083 522453714
12763E22453714o1058574r1038340r0751245p4457965n3240466l6318475k4923263
$$ 522453714 461395140 370356800 279605555 205147590 151907124 115588649 90665386
12756I0665386j7529673j2736993r720572p759171o258054n069494m125691l414079
$$ 90665386 73135713 60398720 50678148 42918977 36660923 31591429 27465738 24051659
12748B4051659k725861k357875k050008j778769j540760j374978j203675j044022
$$ 24051659 21325798 18967923 16917915 15139146 13598386 12223408 11019733 9975711
12740I975711r36413q26006o61915o22062n97869n46515m18936l96982l70357
$$ 9975711 9039298 8213292 7551377 6929315 6331446 5784931 5365995 4969013 4598656
12731D598656k68108k44505k14685k74638j91833j93445k25700j79187k09312
$$ 4598656 4330548 4086043 3871358 3596720 3404887 3211442 2985742 2806555 2597243
12722B597243j15833r1806n5209r3368j08490n5366j10837j00990j08384q3573
$$ 2597243 2481410 2389604 2334395 2241027 2132537 2077171 1966334 1865344 1756960 1673387
12712A673387q0306p3766o5305k7218n403J0248m8968p3129l3901j029j18k527
$$ 1673387 1593081 1519315 1454010 1426792 1421389 1431637 1382669 1309540 1275639 1274610 1274492 1271965
12700A271965l4695p2953m0061m7370j4069l0677J1510M521k2088q114L3631N5470
$$ 1271965 1237270 1164317 1124256 1076886 1062817 1032140 1043650 1048171 1026083 1017969 1051600 1107070
12688A107070L2J5093k4977m4264n7885n9022j04768l9542j1743Q07K034l1832
$$ 1107070 1107102 1122195 1097218 1052954 995069 936047 831279 791737 779994 780801 782835 751003
12676G51003n9578q0172M4989R5352l2695m6571J7286J2429n5717m6057k6772
$$ 751003 691425 611253 656242 751594 718899 672328 689614 702043 646326 600269 573497
12665E73497o8850R180K7535J2534m2202K8409Q886l793k8052n917l1151m1338
$$ 573497 504647 513827 541362 553896 511694 540103 548989 545196 517144 511227 480076 438738
12653D38738n3539k9132j3022j623n1250J9264k1779L9Q5542P3303j6858J9438
$$ 438738 385199 356067 343045 341422 290172 309436 287657 287696 373238 446541 429683 449121
12641D49121N6572N9212M1477L8929M5892K136j8196N551o8232n3594o906p5694
$$ 449121 505693 564905 606382 645311 691203 693339 675143 680694 612462 558868 551962 476268
12629D76268o347M9274N5416l0821q5462n7036n5638k076l2778o3810l2472M4049
$$ 476268 469921 519195 574611 543790 458328 401292 345654 343578 310800 246990 214518 258567
12617B58567J5569L3003q889k8366k6384O7396R0962L8429J1989l5662p3615m9229
$$ 258567 274136 307139 298250 269884 243500 310896 401858 440287 452276 416614 342999 293770
12605B93770L1711P4400k4701k8892k7502k7774L301J6200m085l152k0601q4930
$$ 293770 325481 399881 375180 346288 318786 291012 294313 310513 306428 303276 282675 197745
12593A97745j0404Q0985K1014k017r264k2710M3184K0730M8984k3691j2835M038
$$ 197745 187341 268326 289340 287323 278059 255349 298533 319263 368247 344556 331721 335759
12581C35759j2566q54k4484J8238m9782n6530J9439K7905J7692o7434p2253k4507
$$ 335759 323193 322339 297855 316093 266311 209781 229220 257125 274817 207383 135130 110623
12569A10623M2450j459o0684q588O2056K7897l8551N326k7578m048M7428N0702
$$ 110623 153073 151614 90930 82342 144398 172295 133744 139070 111492 107444 154872 205574
12557B05574N9202N6073p68l675n0714k3007K3969N322K0473m1242m0227n2438
$$ 205574 264776 320849 320081 316406 265692 242685 266654 271976 292449 251207 210980 158542
12545A58542k2732L7265J4204j0086N638J6064K1551L864k122r559J2460P962
$$ 158542 135810 173075 187279 177193 182831 198895 220446 224310 222188 212629 225089 233051
12533B33051m5829k0103L0539N2713j8528n6068L21q683j2748k608Q0414l8972
$$ 233051 187222 167119 197658 250371 231843 175775 176096 167413 154665 152057 232471 193499
12521A93499m2098O6816O7068j037m6026k0032m073l6393M0668J7055L8883K8864
$$ 193499 151401 218217 285285 284248 238222 218190 214117 177724 218392 235447 274330 303194
12509C03194r0224j0412P9310M3229n4727k4942l2990m0859Q198K6620l2367j9252
$$ 303194 212970 202558 281868 325097 270370 245428 212438 171579 179777 206397 174030 154778
12497A54778N3570K0862K544j8603j0877L285m533J099M187o9118L6353M12p577
$$ 154778 208348 229210 231754 213151 202274 205559 201026 202125 206312 137194 173547 173959 166382
12484A66382M3354N1335o1380j7222P382K8885O173n4264m2913l364j1645L3867
$$ 166382 209736 261071 199691 182469 189851 218736 224909 170645 127732 124368 112723 146590
12472A46590L3441L784N7825N7962k9992J5655l692m586l7140J5024J1317j0894
$$ 146590 180031 183815 241640 299602 269610 285265 281573 276987 239847 254871 266188 255294
12460B55294j0315K491L2385R340n0910o7664L8686R1066P400j2082j27737q1816
$$ 255294 244979 247470 279855 289195 238285 170621 209307 300373 307773 295691 167954 86138
12448H6138Q998l0204L9555R878j2956Q440J6520L2019K3856L6439j0320M6902
$$ 86138 95136 64932 104487 114365 101409 109849 126369 158388 182244 218683 208363 255265
12436B55265M7447K878m0250m6899j00702m3849L2105P0998L7520n0685l5685
$$ 255265 302712 305590 265340 218441 117739 73890 105995 176993 214513 163828 128143
12425A28143l0194P2348N2279j6247j708n4894l6097k071N7356M0927N4087m566
$$ 128143 97949 170297 222576 206329 204621 149727 113630 111559 168915 209842 263929 259363
12413B59363J8839j1173J2762k1000K683k3264O5538p268o4884n0989J0289J1949
$$ 259363 278202 267029 279791 258791 261474 238210 303748 296480 231596 180607 190896 202845
12401B02845M7072N838M974j4136l5688k9207K298L3931J6011j3307l5393K1230
$$ 202845 249917 255755 260729 246593 210905 181698 183996 217927 233938 220631 185238 206468
12389B06468L7694L5682n9375p406L1363M3850k6553L9620o0842p583Q0776M3285
$$ 206468 244162 279844 220469 213063 244426 288276 261723 301343 240501 232918 313694 356979
12377C56979r8173j7426J4271J0071J2102N1505R330q6688k1592k2584k8249K2072
$$ 356979 258806 241380 255651 265722 277824 329329 338659 251971 230379 207795 179546 201618
12365B01618N783J751m742N3096p242M7929j1980p5490k7635L1080O4516N373
$$ 201618 207401 209152 204410 257506 250264 298193 286213 210723 183088 214168 278684 284057
12353B84057j1612o468j6201N181m783j7050M2856M0591M4902L3336l1007J1502
$$ 284057 272445 265977 249776 254957 250174 233124 275980 316571 361473 394809 363802 375304
12341C75304m680l3264n5228k5299k7826L8648P2857j945j0247K6612J654P6262
$$ 375304 370624 337360 282132 256833 229007 267655 340512 338567 328320 354932 356586 432848
12329D32848L4140j9280n957l1982P9881J54107Q7651J39159L18273M42644M58145
$$ 432848 466988 447708 441751 409769 489650 643757 731408 870567 1188840 1631484 2089629
12318B089629M74461L34161M4190j94298l35453l69921m36198l78466k41706j52376
$$ 2089629 2564090 2898251 2942441 2748143 2412690 2042769 1606571 1228105 986399 834023
12308H34023j35387r5774m3319m4907O67k1507o833j654l515j6553m3095p064
$$ 834023 698636 602862 559543 514636 515303 493796 486963 485309 481794 465241 422146 415082
12296D15082O4779O1908O0357m1896o7758l2711J07444J2094o2412j8716L6022
$$ 415082 479861 541769 602126 560230 492472 459761 567205 579299 516887 498171 534193
12285E34193J1168k4000K4655l389j2617k1081l3630n3152J1379P4881j334l3932
$$ 534193 545361 521361 546016 542627 530010 508929 475299 422147 433526 508407 507073 473141
12273D73141j4275L5304k0923o5207q2410k4383P2384j3822r640L279L6819O994
$$ 473141 458866 494170 473247 408040 325630 301247 373631 359809 350169 353448 390267 397261
12261C97261N147l108o433M1481L2099p5109m8929P9m7072k6651m919M5476M9467
$$ 397261 402408 399300 392867 434348 466447 391338 342409 342488 295416 268765 263846 309322 358789
12248C58789n232o1833m6683j7894q281P3362Q2292O514r70m510k4396k5615n133
$$ 358789 353557 291724 245041 227147 218866 292228 374520 381034 380064 375554 351158 325543 320410
12235C20410J2243j8547j9562K2790M6133P8200L7366k4207o2533O4421J3279
$$ 320410 332653 314106 294544 317334 363467 441667 479033 454826 392293 456714 469993
12224D69993K8304N8274o6457p5054k8800Q923K899J4165k2530j842K2390O1233
$$ 469993 498297 556571 490114 415060 386260 395183 398082 412247 389717 387875 410265 471498
12212D71498M2390m422o4621K6151k3149k435j9384j8313k48R154k998m175K8769
$$ 471498 513888 509466 444845 470996 447847 445412 426028 407715 407467 416621 413623 409448 438217
12199D38217L8575m7995K7713L8267J6664O821k7350j5630j2298l301M4347R080
$$ 438217 476792 428797 456510 494777 511441 518262 490912 475282 462984 459683 504030 513110
12187E13110J93l026K8840j24L9772o2753m5231N6286J7574L7913Q673L6284m0273
$$ 513110 513303 510277 539117 538993 578765 516012 470781 527067 544641 582554 591227 627511 587238
12174E87238j2427j8576j3148m705J3167n820J2753k8393J6240J20720P0852p0107
$$ 587238 574811 556235 543087 538382 551549 545729 558482 530089 546329 667049 737901 667794
12162F67794j7968P860k9453j895l6450J8516M938K8304O905R726n0185k8735
$$ 667794 649826 657686 628233 626338 589888 608404 613342 641646 648551 658277 608092 579357
12150E79357O8526L7259L3086J9495m2247l1735J9246J9820J7921N202j4837L3589
$$ 579357 647883 685142 718228 737723 695476 663741 682987 702807 720728 725930 711093 744682
12138G44682N2458L9233J9197M8155K8182o1307o5273l7205O007Q3521l9469J9771
$$ 744682 797140 836373 855570 903725 931907 870600 805327 768122 774129 857650 818181 837952
12126H37952L2005p731Q803p251j6469p234J1409J5564l1016P2778R8601J6949
$$ 837952 869957 862226 871029 863778 847309 840075 851484 867048 836032 908810 1007411 1024360
12114A024360M8384L7012m2778k250l8584k6039M3304L587j2285L1054N2356M0464
$$ 1024360 1072744 1109756 1066978 1064728 1026144 1000105 1043409 1046996 1034711 1065765 1118121 1158585
12102A158585m7979J3338K553n3521O0958P8444L2953R3750L0503l5557o924o4085
$$ 1158585 1110606 1123944 1126497 1072976 1133934 1212378 1245331 1339081 1369584 1334027 1327103 1263018
12090A263018o7123M9619j855j6026p0123m3940k5863O0956R9052M9591P5503
$$ 1263018 1195895 1245514 1243659 1227633 1157510 1113570 1087707 1148663 1247715 1297306 1372809
12079A372809K6430K1058O9479j9075j9879L1234M0454N71m9308O855O5182P1441
$$ 1372809 1399239 1420297 1489776 1470701 1450822 1482056 1522510 1523081 1473773 1480628 1545810 1617251
12067A617251L3107O8074J8844l0731l0854Q1571Q0464o681j5605N9218P4904
$$ 1617251 1650358 1718432 1737276 1706545 1675691 1757262 1837726 1831045 1815440 1874658 1949562
12056A949562M3920M3233N240P13P2907N547j9832K172k0192m3344k0179K0246
$$ 1949562 1993482 2036715 2041955 2042668 2115575 2121122 2101290 2103462 2083270 2039926 2019747 2039993
12044B039993N3312K8394j935M4852R6362J7505K5298J27523K9874O544L9189
$$ 2039993 2093305 2121699 2119764 2164616 2260978 2278483 2303781 2431304 2461178 2467722 2506911
12033B506911k041L0127P9296K1309N261R1860J35933M0903O207K1909j5020l010
$$ 2506911 2504870 2534997 2614293 2635602 2640863 2732723 2868656 2909559 2915766 2937675 2922655 2919645
12021B919645M8527P9784O3132R6137O0693Q7055M6421N5187K6935J09463M7714
$$ 2919645 2968172 3047956 3111088 3207225 3267918 3354973 3401394 3456581 3483516 3592979 3640693
12010C640693P2207J14520R9004O5449R5106L2480J3393O5569J76769K33647J38511
$$ 3640693 3712900 3827420 3926424 3991873 4086979 4119459 4132852 4198421 4375190 4608837 4747348
11999D747348J53579J31651Q0412P6057K5015L6321O9995J45395J60344P1236
$$ 4747348 4900927 5032578 5112990 5189047 5214062 5250383 5320378 5465773 5626117 5697353
11989E697353J15689R4445R7415J49170K06336R8929O5239J43084J99179J99468
$$ 5697353 5813042 5907487 6004902 6154072 6360408 6459337 6524576 6667660 6866839 7066307
11979G066307K51128J80672J62774J71528J60769K10706K30905K29943K79848
$$ 7066307 7317435 7498107 7660881 7832409 7993178 8203884 8434789 8664732 8944580
11970H944580J83944J61850K47989L39648K22567K13899L28363K55467K62879
$$ 8944580 9128524 9290374 9538363 9878011 10100578 10314477 10642840 10898307 11161186
11961A1161186K71508L19905L31961L67282L24066K88341L69173L97515L16265
$$ 11161186 11432694 11752599 12084560 12451842 12775908 13064249 13433422 13830937 14147202
11952A4147202L02029L69930M18302L78316L60575L52472L40041L60763M01986
$$ 14147202 14449231 14819161 15237463 15615779 15976354 16328826 16668867 17029630 17431616
11943A7431616L97942L71083L29682L70817L81053L92460L24242K36449K65353
$$ 17431616 17829558 18200641 18530323 18901140 19282193 19674653 19998895 20235344 20500697
11934B0500697K87087K99782K37090K02246J99206J30542J08833N8977K5781L2687
$$ 20500697 20787784 21087566 21324656 21526902 21726108 21856650 21965483 22024460 22050241 22082928
11924B2082928M4115j9763r6618k26066j25879l0659j46235j66355k75452k84157
$$ 22082928 22127043 22107280 22010662 21784596 21658717 21628058 21481823 21315468 21040016 20755859
11914B0755859k77374k29194l07803l06868l40351l47567l25336l00984l01346
$$ 20755859 20478485 20249291 19941488 19634620 19294269 18946702 18621366 18320382 18019036
11905A8019036l79851m34548m17966m02956m75995l92323l57722l72157m35623
$$ 18019036 17639185 17204637 16786671 16383715 15907720 15515397 15157675 14785518 14349895
11896A4349895l33973l28587l52428k90747m10419l58590l51776k66698l02056
$$ 14349895 14015922 13687335 13334907 13044160 12633741 12275151 11923375 11656677 11354621
11887A1354621l09177k74023k01432k36417k85173k85544l08325k91736k30183
$$ 11354621 11045444 10771421 10569989 10333572 10048399 9762855 9454530 9162794 8932611
11878H932611j99331j26294j66011j88304k42491k50093k43826j84290j24780
$$ 8932611 8733280 8606986 8440975 8252671 8010180 7760087 7516261 7331971 7207191
11869G207191j57429j98549j69786j74316j07872j30417j36464j17096k29776
$$ 7207191 7049762 6851213 6681427 6507111 6399239 6268822 6132358 6015262 5785486
11860E785486k36248j16682r1803p4922j53456j51953q4255n4801q2235j26500
$$ 5785486 5549238 5432556 5340753 5265831 5112375 4960422 4876167 4821366 4739131 4612631
11850D612631j69499j01338n0405o4546p6207j17680n6258j12747j09178j34457
$$ 4612631 4443132 4341794 4291389 4226843 4150636 4032956 3976698 3863951 3754773 3620316
11840C620316r6915l5329K8404q0460n6459q8362n3339p1777r0534j01516J8773
$$ 3620316 3523401 3488072 3516476 3436016 3379557 3291195 3237856 3166079 3075545 2974029 2992802
11829B992802j3862q1386m1710k7346l2627o030n9046p8508r9376o9020J7149
$$ 2992802 2978940 2897554 2855844 2828498 2795871 2789841 2730795 2652287 2552911 2483891 2501040
11818B501040k9476p7007n6812j5227p643n5011n2925l1726m3813m7437J6541
$$ 2501040 2471564 2394557 2337745 2322518 2314875 2259864 2206939 2175213 2131400 2083963 2100504
11807B100504l0357l4128k2776k0941j8826r1216l1818r2423p3251M677J9265
$$ 2100504 2070147 2036019 2013243 1992302 1973476 1882260 1850442 1758019 1684768 1689445 1708710
11796A708710j2729N5572K671q2583o7215m3440m1907m8787k9250K8772j763l3232
$$ 1708710 1695981 1751553 1754224 1671641 1604426 1560986 1519079 1470292 1441042 1469814 1468051 1434819
11784A434819K1106o7991j02069K318L8480M9266n403L6236r691l5308q500k1950
$$ 1434819 1455925 1387934 1285865 1288183 1326663 1375929 1370526 1406762 1397071 1361763 1353263 1331313
11772A331313o1678o7441m7589m4035o291J2782j6266M0153J5927J047k3564k393
$$ 1331313 1269635 1202194 1154605 1110570 1104279 1117061 1100795 1140948 1156875 1157922 1134358 1131965
11760A131965m7363N874l9565p7630N074P141k3944l664J732n6440J3241K5985
$$ 1131965 1084602 1090476 1050911 973281 978355 985496 961552 957888 959620 903180 916421 942406
11748I42406k6732q099J9164l0289k9596O563l4811r4495l385P0531O0743l8947
$$ 942406 915674 907575 926739 896450 866854 873417 838606 744111 740726 811257 872000 833053
11736H33053n6385j6284j8709L3146J4532j288K3758J6345k1925m7488O9617K373
$$ 833053 776668 760384 741675 774821 789353 788065 811823 828168 806243 758755 828372 830745
11724H30745k7861O956l0493m9518l1813N4018k3655l9592j2131j5389j6045k0554
$$ 830745 802884 809840 779347 729829 698016 752034 728379 688787 676656 661267 645222 624668
11712F24668j9932L1283J17018M3105K1537l4194p5360k2292j1664j5567k7036
$$ 624668 604736 636019 753037 796142 817679 783485 708125 685833 674169 658602 631566
11701F31566o4421L723N3473n512n679P34O716k6667j9345j8550j105J0J3000
$$ 631566 567145 570868 624341 618829 613150 613884 620600 593933 574588 556038 554933 554943 567943
11688E67943K7057l2516q627K9077L0362l9550p2407j0603J5595j3078r09M7436
$$ 567943 595000 562484 553857 582934 613296 573746 501339 490736 506331 493253 492344 539780
11676E39780k1892m6532j0893q111M9910K9247j1871O5776N0519j7566r4058m736
$$ 539780 517888 471356 460463 452352 502262 531509 519638 585414 635933 618367 524309 519573
11664E19573J849l0550k528N3070P6702K8489l572j0736L4124L4502k8242j9731
$$ 519573 521422 490872 488344 541414 618116 646605 643033 632297 666421 700923 672681 652950
11652F52950P0525J18587J19112J35488J43278P8771K4809k9782k3q770j11207
$$ 652950 723475 842062 961174 1096662 1239940 1318711 1343520 1313738 1313715 1304945 1193738
11641A193738j63886j34054j42914j3854n2669n8757k6680l1110m2461m4457k9026
$$ 1193738 1029852 895798 752884 739030 686361 627604 600924 569814 527353 482896 453870
11630D53870K472j2160K2487m8188l976O493m4212p375J633l7829J4830L0167
$$ 453870 456342 444182 466669 418481 414505 420998 376786 369411 371044 333215 348045 378212
11618C78212j6590K2970o767J4834q649m9084j6835K3275K9796n768K0685q62
$$ 378212 361622 384592 377825 392659 384010 334926 318091 341366 371162 365394 386079 385217
11606C85217p7308n5382k5121O3105L3438J2952M8096K1829m9551K6928j5586
$$ 385217 307909 252527 227406 290511 323949 336901 384997 406826 357275 384203 368617
11595C68617p8583o0620K0683K3981L215P8139L9482k9013k9928j8860l7103m3947
$$ 368617 290034 229414 250097 274078 277293 355432 394914 365901 335973 317113 280010 236063
11583B36063L4517k2315l0125p782l4243q5971L301j7249J9660M7239l0578j2020
$$ 236063 270580 248265 218140 210358 176115 90144 93445 76196 95856 143095 112517 100497
11571A00497L9422N8338K4719j1090L6924M1611k0577n9264q23N9641J6930k4104
$$ 100497 139919 198257 222976 211886 248810 290421 269844 210580 209757 269398 286328 262224
11559B62224J9106K0552j7429n8669l5852k4675J8933Q7134j664m7794j8265O594
$$ 262224 281330 301882 284453 225784 189932 165257 184190 271324 269660 221866 203601 210195
11547B10195L1370K282N1980l0340L9767M4057q3787j8188k5593k4018L858L1712
$$ 210195 241565 243847 295827 265487 305254 349311 265524 247336 221743 197725 201583 233295
11535B33295M1473l7735j7363k1158j3647M0273j1624J9314n6491m2130O3903
$$ 233295 274768 237033 219670 198512 184865 225138 213514 232828 176337 134207 198110
11524A98110M6179j1513n379j335j8974q368N4089L1536L1279K758j4893k7281
$$ 198110 244289 232776 227397 226062 207088 198720 252809 284345 315624 318382 303489 276208
11512B76208m1945L177l8837l1856j559k4626K8957p851M731j1588J7544j2588
$$ 276208 234263 237440 198603 166747 165188 140562 169519 161668 166399 154811 172355 159767
11500A59767J512P4001L8855j0334k6725l3259l1255m804L6020j3797O814K3709
$$ 159767 161279 235280 274135 263801 237076 203817 172562 167758 203778 189981 196795 220504
11488B20504j3661j4767j122M5494J850n447O3867n0358m7820L272R962L5480
$$ 220504 206843 192076 190954 236448 238298 232851 296718 246360 198540 201812 211774 247254
11476B47254j3980q3004j9743J4896j8860k5293J5293R6410L9441k4695j3711
$$ 247254 233274 150270 130527 145423 126563 101270 116563 212973 252414 227719 214008
11465B14008l0512l1766l4155J7636j1663K4453N3323K2763n2512o9946M8755
$$ 214008 183496 151730 117575 135211 123548 148001 201324 224087 171575 101629 150384
11454A50384k7790k7450L7202J1300j2521J9539P3636L7295l560n3886L4839K8791
$$ 150384 122594 95144 132346 143646 131125 150664 224300 261595 258035 204149 238988 267779
11442B67779k8189j9995Q0261J4448j01177K1097O656l378J803j9282o9011m0749
$$ 267779 239590 219595 299856 314304 213127 234224 240880 237502 239305 220023 151012 110263
11430A10263j1432J8091J1979k9834M2800k8102n2761J0510M6146K0311J7867
$$ 110263 98831 116922 128901 99067 141867 113765 61004 71514 117660 137971 155838
11419A55838J1303j7685q4802N451l4999R04N216l2746j66M0632R208O8481M5497
$$ 155838 167141 149456 64654 70105 35106 36010 41226 8480 8314 48946 58154 126635 172132
11406A72132n4571M0204K5583j2913k4637K4631M9719K4557o3304m4036n0335
$$ 172132 117561 157765 183348 170435 145798 170429 220148 244705 181401 137365 87030
11395H7030R07n2012j9232N6004K3389J214J2732o816K1124J7967p1155k4446
$$ 87030 87937 35925 16693 72697 96086 97300 110032 103216 124340 142307 71152 46706
11383D6706L4045K7444K752L070L5844j8716k6893J294M26N0529M8127o729l4614
$$ 46706 80751 108195 110947 114017 149861 131145 104252 105546 105972 156501 204628 197899 163285
11370A63285l2688l4734k8427n5033M268N5196L7834p868r44r734k0886J4499
$$ 163285 130597 95863 67436 12403 16671 71867 109701 101833 100889 91155 70269 84768
11358H4768J9598M2262j020p1503l8183n840J5400J2426N4889N888J754j2900
$$ 84768 104366 146628 145608 74105 35922 30082 45482 57908 112797 118685 120439 107539
11346A07539l2065j2178K1172L224l5775L7796K1909k3112J8291j7241m6391M1251
$$ 107539 75474 63296 84468 87692 51917 89713 111622 88510 106801 89560 43169 84420
11334H4420j6013K2881J892J3669m0753J1989o430m9543j1509O4805j6336j0427
$$ 84420 68407 91288 93180 106849 66096 78085 71655 22112 10603 75408 59072 48645
11322D8645L6264o4066L8127O3787N052n7581k5111K5548J23J5609J6115o3716
$$ 48645 84909 20843 58970 122757 127809 70228 45117 70665 70788 86397 102512 38796
11310C8796L3696O0508K983J1153M580n8280o7964k7710K6581N2545J4846j3624
$$ 38796 72492 133000 135983 147136 151716 93436 25472 -2238 24343 76888 91734 78110
11298G8110K7457L9348r561l2150q414L3615n977m6579m327j5704M3269J9861
$$ 78110 105567 144915 135354 103204 94790 128405 122428 75849 71522 55818 99087 118948
11286A18948n084j2197j0633j8468j6136k6029m9925J0899O9385M7763L9253J7794
$$ 118948 113864 101667 91034 72566 56430 30401 -19524 -8625 60760 108523 147776 165570
11274A65570l9092m1571l0948k1377J2601k3104l3361K5825O9726l1012n908K116
$$ 165570 126478 84907 53959 32582 45183 22079 -11282 14543 84269 53257 47349 49465
11262D9465j0203N0828K5571K5465N6134m9422k4519k8279K1976M7735p4947j3757
$$ 49465 39262 90090 115661 141126 197260 147838 123319 95040 117016 164751 89804 76047
11250G6047p042N5612l0432l2504k8822l8427j7774P4871L1187l2418J0215m3988
$$ 76047 69005 124617 94185 61681 32859 -5568 -23342 51529 82716 50298 60513 16525
11238A6525K2884M3951n422j8285k8888m202Q8404L4419r1658O1932R9026l033
$$ 16525 39409 83360 77938 59653 30765 26563 114967 149386 57728 119660 218686 215653
11226B15653o4381m7456N6946l6817j4217l2982n2416L6771n300K0338K8835k1710
$$ 215653 151272 103816 160762 123945 109728 76746 24330 61101 55801 76139 104974 83264
11214H3264p4397m0418P0451L1659J2936K8575j8732J040K458j5599j2511K6692
$$ 83264 8867 -31551 38900 70559 83495 112070 93338 94378 96836 81237 68726 95418
11202I5418N026l9745j8008O3650R6189m2557p0140M4097K0389k7364n7157k0482
$$ 95418 100444 60699 42691 106341 202530 159973 89833 133930 154319 126955 69798 49316
11190D9316P0616J7208m3628k2218L9931K2477m90p43l9387k3456j9413m7031
$$ 49316 119932 137140 93512 71294 111225 133702 133212 132469 93082 69626 50213 3182
11178C182P059O8725j1454j4808O7760L2338J5529k1948O81K6231p35o4674M375
$$ 3182 10241 78966 67512 52704 120464 152802 168331 146383 147064 173295 172560 107886 112261
11165A12261K5102j3666M4777O827j2172m68l5632q8178o503K0835L064J2566
$$ 112261 137363 123697 168474 175301 163129 162661 127029 38851 32348 53183 56247 68813
11153F8813k7587K2662K2468m400l0661L341n410K1747O986L1498O910j4745l725
$$ 68813 41226 63888 86356 81956 51295 54636 49226 70973 77959 109457 116367 101622 97897
11140I7897K8736J6998J9636n8352n4933l3648K9240j876j0673M4080Q0815m1310
$$ 97897 126633 143631 163267 104915 49982 16334 45574 43698 33025 77105 157920 116610
11128A16610l1110J0066K1891M546m675j6108J9410J7470K864j3921N7100N5449
$$ 116610 85500 95566 117457 122003 117328 101220 120630 138100 140964 127043 184143 239592
11116B39592k0113O952J4275q2923k6964l041R65M9721P742K8241L2240l0498
$$ 239592 219479 226431 240706 157783 130819 127778 128743 178464 186206 214447 246687 216189
11104B16189m122O2731J5714o6027l1935j3807k0608l4433m7515Q193L1863O0694
$$ 216189 212067 274798 290512 224485 192550 178743 158135 123702 76187 84380 116243 176937
11092A76937j0899K2007K1116n6547l4951L233L96k9298L6129Q6720K3069j4351
$$ 176937 166038 188045 209161 152614 117663 120896 121292 91994 128123 214843 237912 223561
11080B23561N4243j3952m9687N619L9569K4852P548m5309j4251K3786j3899J1231
$$ 223561 277804 263852 214165 219784 259353 284205 291753 246444 232193 255979 242080 253311
11068B53311L4519n9208m7505p607j7680o418m917M9188k2230n7463K4979K8837
$$ 253311 287830 228622 181117 173510 155830 149412 144495 193683 171453 113990 138969 167806
11056A67806j3443k2765R046j2549N015r121J02533P1228M975J7784N7214N6491
$$ 167806 154363 131598 140644 128095 133110 123989 226522 297750 302725 320509 377723 434214
11044D34214k3118m3771j678L9066M474M507K5893l0548M5876O1397P3428J01385
$$ 434214 411096 367325 365647 404713 409187 413694 439587 409039 454915 516312 589740 691125
11032F91125k3149m6912o2354l2979m6158j6600M5032k6312K9222R6201R6996
$$ 691125 667976 621064 558710 525731 479573 462973 508005 481693 510915 607116 704112
11021G04112Q2865N4790J9288m3384j01423j33799p1594J5145M0869M24L8845
$$ 704112 786977 841767 861055 817671 716248 582449 510855 526000 566869 567293 606138
11010F06138M0837L2342j2144n1057j7700j06271n3281R065o4917o7160K5447
$$ 606138 646975 679317 667173 616116 598416 492145 438864 447929 383012 315852 341299
10999C41299O3950Q238n9496n2844o8060k1907k5161k9072m7118j0900J8478m6259
$$ 341299 405249 413487 353991 301147 233087 211180 186019 156947 109829 98929 117407 71148
10987G1148q8099n2K8693M5453m752k7201O2884N5009O112K7317j2523M2645l2395
$$ 71148 -16951 -17003 11690 57143 52391 25190 88074 143083 149195 176512 163989 206634 174239
10974A74239l5990k7872J2577j4380j3714p5350J8909J047j1942p232o9815P367
$$ 174239 138249 110377 122954 108574 94860 19510 38419 39466 27524 20292 -49523 -42156
10962d2156L8914K4185M9008L7713K3116l9566j2782l7057K1912L6659j170L3871
$$ -42156 -3242 20943 69951 107664 130780 91214 78432 41375 63287 99946 98776 132647
10950A32647q960n2553j3449K247l5092k9079K5722K5459O6633K5817m6820l1522
$$ 132647 123687 71134 57685 59932 24840 -4239 21483 46942 113575 139392 92572 61050
10938F1050M586O6065K6457k7868l1115l0610j0125j5069p842j2473l6692J2509
$$ 61050 65636 131701 158158 130290 99175 68565 58440 43371 35529 23056 -13636 -1127
10926a127K5342L4843L206n9921J6098K6279J8383L8413n500O5198o612m9637
$$ -1127 24215 59058 62264 2343 18441 44720 63103 101516 96016 161214 154602 104965
10914A04965L439M7561j9151j7260L2343K5550o4153n501J0417K3362n6761m3907
$$ 104965 108404 155965 136814 119554 151897 177447 113294 107793 118210 141572 84811 40904
10902D0904l2871N9555O077k3372l099J1796k3799j9298n0859m8184L9458J8249
$$ 40904 8033 67588 73665 50293 47194 58990 35191 15893 -34966 -83150 -43692 -25443
10890b5443N0805j7030n608O3064Q759J726J3621J3061L653K2678J9391m2756
$$ -25443 25362 8332 2724 65788 74547 76273 89894 102955 106608 129286 148677 105921
10878A05921k3783J3275l7438j3549m280m9083j6351m311R7506M1136l3527q3529
$$ 105921 82138 95413 57975 44426 40146 -8937 -25288 -29599 67907 109043 75516 -8013
10866h013l9878N0906M0962L7223Q8313O74k781l5394k2115j0119l149m061L6221
$$ -8013 -47891 3015 43977 81200 169513 170187 167406 132012 109897 99778 96629 92568 128789
10853A28789p036m2087l5791P246N5378N1607j5555K7128M347r5772l3775l255
$$ 128789 121753 79666 43875 51121 106499 158106 142551 169679 174026 78254 44479 41224
10841D1224J3209N076j0952M1806M0442L433K0835n5971n3940m7104J744k0486
$$ 41224 54433 59509 48557 90363 130805 134238 155073 99102 45162 -1942 -198 -20684
10829b0684K2946M5090J5612O005m543l8671n797R3321M7634n2317j12697Q95
$$ -20684 2262 47352 62964 68969 64426 25755 19958 113279 160913 108596 -4101 -3206
10817c206M837Q5079L586p9713J5512n8159p7141K185J24430j5438J7800J0328
$$ -3206 1631 86710 90296 10583 26095 -32064 -109205 -107020 17410 1972 19772 30100
10805C0100L4382L9611O671r071P347o77N3639K9904Q710r0574m9945K0099k0918
$$ 30100 64482 104093 110764 101693 109040 108363 162002 191906 200616 110042 60097 80196 59278
10792E9278N8052K3787O636j5405k5952J5053N8804J6970k5922j4444L4713K1105
$$ 59278 117330 141117 147753 132348 106396 121449 180253 197223 171301 156857 191570 212675
10780B12675k9839l156n5182J6126K2081P209J5977J8183R525l6944j25644l7460
$$ 212675 182836 179680 124498 140624 162705 169914 185891 204074 213599 176655 51011 13551
10768A3551K3062N8671M5863K9494J7226m127l6308m7495L7516k8449L4550L3602
$$ 13551 36613 95284 141147 170641 187867 183740 147432 99937 137453 109004 143554 177156
10756A77156n9333l3891N2763K4401m2810p9279j3419K6185M172J4067J2162j9572
$$ 177156 117823 83932 136695 161096 118286 39007 25588 51773 55945 70012 82174 62602
10744F2602l210j2661k4277M2058Q3634m679j6759l8357m0744K6515j2334J6144
$$ 62602 59392 46731 22454 64512 148146 143467 126708 88351 47607 74122 61788 77932
10732G7932K1783M5148Q6542o335K4072j2772j4057k4482m0830l5653l2112j4438
$$ 77932 99715 144863 231405 225070 249142 236370 222313 197831 157001 121348 89236 74798
10720G4798j89J7484M0117J11002O5900l2312j378M3526N351O639l3325l3360
$$ 74798 74609 92093 132210 243212 309112 276800 275422 318948 324299 330938 297613 264253
10708B64253J5804M5855k7174m3407o1267l509M4027M4845m0753m32j1071j2381
$$ 264253 280057 325912 298738 255331 194064 190555 234582 279427 238674 238242 227171 214790
10696B14790j6625o2980N3034Q3792L7248k7180q002j6591l1312m5318K076J5452
$$ 214790 198165 135185 188219 272011 309259 282079 274077 257486 226174 180856 182932 198384
10684A98384k4218J9804O6934J2831m1705M30N6245L2046Q9862J9571m7475k7439
$$ 198384 174166 193970 260904 273735 232030 232460 288705 320751 410613 430184 382709 355270
10672C55270l9922L9241M2687K3154P9870M8337J7653l1265l5645n4585K1114
$$ 355270 315348 354589 397276 420430 500300 548637 566290 535025 499380 444795 465909
10661D65909J1901o6940p3435L5919K5782K2023j7729R971L5657K4377j0744J5534
$$ 465909 477810 410870 337435 373354 399136 421159 403430 413401 449058 473435 462691 478225
10649D78225P6020J12455K0708P1734N4592K6177j8111N7911O6894j3485K8868
$$ 478225 554245 666700 687408 759142 813734 839911 821800 879711 946605 933120 961988
10638I61988Q2644J29393J63968J38892J53376J83344K15266K54816K09108J59950
$$ 961988 1044632 1174025 1337993 1476885 1630261 1813605 2028871 2283687 2492795 2652745
10628B652745K11977K79299L81485M35532N18338O83708R30098J373964K060801
$$ 2652745 2864722 3144021 3525506 3961038 4479376 5163084 6093182 7467146 9527947
10619I527947K852199L827801N003593O188965O423210M787015J919668p42681
$$ 9527947 12380146 16207947 21211540 27400505 33823715 38610730 40530398 39787717
10611C9787717k021550k009833q89096R47688L255183O092968R525379J2586864
$$ 39787717 37766167 35756334 34867238 35814926 39070109 45163077 54688456 67275320
10603F7275320J2905638Q250962P36994n355318q129816p395587m634685j043140
$$ 67275320 80180958 88431920 89168914 83813596 75683780 68288193 63653508 62610368
10595F2610368L143972P875619J2698860J6398091J5648606P670643l764868j2102988
$$ 62610368 65754340 73629959 86328819 102726910 118375516 126046159 122281291 110178303
10587A10178303j5157812j3796437j0078127n781393j532561K624754O433790
$$ 110178303 95020491 81224054 71145927 65364534 63831973 66456727 72890517
10580G2890517Q811119P736623J869571n727631j0728494j2130531j0618435p879180
$$ 72890517 81701636 89438259 91307830 85580199 74851705 62721174 52102739 44223559
10572D4223559m910840k278030j17949J606586K248814J453192r56653l854044
$$ 44223559 39312719 37034689 36916740 38523326 40772140 42225332 41268679 37414635
10564C7414635n685221o085744n366015m368231l355724k433225j841079j444699
$$ 37414635 31729414 25643670 20277655 15909424 12553700 10120475 8279396 6834697
10556F834697j037246q23047o05674m64470m29157l56276l44679k50817k11236
$$ 6834697 5797451 4974404 4368730 3904260 3475103 3118827 2774148 2523331 2312095
10547B312095k11007k15796j71385j07024j43320j16285r2550o1603j47881j04942
$$ 2312095 2101088 1885292 1713907 1606883 1463563 1347278 1254728 1193125 1045244 940302
10537I40302j44371o2018L2202k0312r311m2857n1206m5352j1318J793P0219l7041
$$ 940302 795931 733913 766115 745803 736492 693635 642429 597077 585759 587552 657771 620730
10525F20730q4182P536k6899K0531k7065k8819p582k6289J0551L8753j9097k7215
$$ 620730 536548 544084 517185 537716 510651 481832 474250 447961 458512 497265 478168 450953
10513D50953j0355p5974k3928k3978q067K4434l5244k9758J8330o8915n5293J3936
$$ 450953 440598 364624 340696 316718 308651 333085 297841 268083 286413 217498 162205 176141
10501A76141K6451L3004P38J1101m2291l3148M9105o4275Q017J369M0325q407
$$ 176141 202592 235596 236334 247435 205144 171996 221101 156826 164843 166212 206537 198130
10489A98130K683o371J6206j4535n5049M3809O4475l6713l0342J7028J7311p4525
$$ 198130 200813 194442 210648 196113 141064 184873 249348 212635 182293 199321 216632 142107
10477A42107M945N7961k7153Q936L8313Q08k9551j4577M1391K013l7856J2799
$$ 142107 147052 205013 177860 186796 225109 225917 196366 181789 223180 225193 187337 200136
10465B00136K399j3207J9053K0379o776J5492n211n8548n6620l2068N1578L7364
$$ 200136 202535 189328 208381 228760 221984 237476 232265 173717 117097 85029 136607 173971
10453A73971j7832K0188K4126N971m039k3026l1761k3373O2782J1784j4496o231
$$ 173971 156139 176327 200453 206424 202385 179359 147598 124225 187007 198791 184295 178064
10441A78064m0744j8069K1943k1860l5076k9342j4J7176k153P235j1581K9245
$$ 178064 137320 119251 141194 119334 84258 54916 54902 72078 69925 77160 65579 94824
10429I4824Q394j849j5021m5766j2420J0431L9529q309k6920q756L0286J9097
$$ 94824 103218 101369 86348 40582 28162 38593 78122 69813 42893 34137 64423 83520
10417H3520k4648o4405j7081l4206O7684Q9245P020n6993o3344p849m9186L0768
$$ 83520 58872 -5533 -22614 -56820 10864 100109 107129 50136 -13208 -21057 -70243 -39475
10405c9475M5693O4127M54K8782K9898l2290n379O1590J8056k6813l3028J5555
$$ -39475 6218 70345 70799 99581 129479 97189 91810 153400 171456 144643 111615 127170
10393A27170l1280j0906J2925o7259m6168J4851N8591K7378k5850n972l6869j994
$$ 127170 95890 84984 97909 30650 -15518 -667 57924 85302 59452 53480 16611 14617
10381A4617k0594n4211Q645M082K0238L5415O7705P283l527Q107l6653m370l2608
$$ 14617 -5977 -60188 -51543 -47461 -27223 8192 75897 83180 79653 87760 51107 46737 14129
10368A4129j4424m3175n7512k3774N0197L7061j8481M6470L4992M390N0615n9969
$$ 14129 -295 -43470 -100982 -124756 -74559 -37498 -55979 -9509 25483 29873 80488 20519
10356B0519k6552J1302K6297j6737J4983j0813K5926L8582Q993r4776k7620J8942
$$ 20519 -6033 5269 31566 14829 29812 18999 44925 83507 92500 -2276 -29896 -10954
10344a0954L386k3395J2315N7352J8598l0119k6405j1261J2094L5109m5212J2185
$$ -10954 -7568 -30963 -18648 38704 57302 27183 778 -10483 1611 36720 -8492 3693
10332C693n505l5784K1310O715q748L5946R654l0136N115j2980J0886O5598J8544
$$ 3693 -1812 -37596 -16286 -9571 -18319 17627 27281 -2855 2260 -10720 166 65764 84308
10319H4308k1443j61K2160o8797j9285K2904K4272k2392l5819N172L0539K411
$$ 84308 62865 62704 84864 16067 -3218 19686 43958 21566 -14253 -9081 21458 23869
10307B3869k7355l4046J7437J9542J7750K8373k1411j8053k5033n7628m5993L6832
$$ 23869 -3486 -37532 -20095 -553 17197 45570 24159 6106 -18927 -76555 -122548 -85716
10295h5716L3351J268l578O5589M5399Q6373K8097m1244k9095l380l5435p3447
$$ -85716 -52365 -51097 -54675 10914 56313 142686 170783 129539 100444 97064 61629 -11818
10283a1818o9159k3723j2038p452n77Q9084R941j8706l5125k8261M6625o426N1534
$$ -11818 -80977 -104700 -116738 -124190 -124767 -35683 -25742 -44448 -79573 -107834 -61209 -67635 -16101
10270a6101M4072k5612K6302n2987k622n464J2855M7169p303o9201K2768L6067
$$ -16101 27971 2359 28661 -24326 -26948 -32412 -19557 27612 20309 -48892 -26124 9943
10258I943M5457J33O4442J070m3623o8737o7273k780L5481P8045p61n6654k5034
$$ 9943 55400 55533 119975 121045 77422 8685 -58588 -61368 -25887 52158 51397 -5257 -30291
10245c0291o201K2811O2098M183p41L7354k5289j0760k5949j5605J6534K5475
$$ -30291 -36492 -13681 48417 52600 51859 89213 63924 53164 27215 11610 28144 53619
10233E3619o501o9416p3967n409Q9053K7527M4584K3516l6777k0283o9005n945
$$ 53619 47118 -22298 -96265 -101674 -12621 14906 59490 83006 46229 25946 -43059 -49004
10221d9004M7873o44o290j8690q184M5642N1213J6047J6078n4508k2683M2720
$$ -49004 -1131 -1775 -8065 -26755 -34939 10703 61916 77963 94041 39533 16850 59570
10209E9570J02l5692K4523M1245K3188L2145m1444l784R909j9404o9111j0570
$$ 59570 59672 23980 48503 89748 112936 145081 103637 99853 109762 90358 21247 10677
10197A0677K2581N5456m3527j8821M5973r747o828m3K1964j3805j4600K284k2370
$$ 10677 33258 88714 45187 26366 72339 62592 55764 55721 77685 63880 49280 51564 29194
10184B9194O3757L0405k485N9113K9736j9433k4227J1767O2373k8372k0385K6054
$$ 29194 92951 123356 120871 179984 209720 190287 166060 177827 240200 211828 191443 217497
10172B17497r2j3085J9455N1885J6952J23092J52700J0672m0386m2639M739l8524
$$ 217497 217405 204320 223775 275660 292612 415704 568404 579076 538690 496051 500790 462266
10160D62266l2422j4579j9110P1067J15221J27428M7851J4720o2144p4601l5102
$$ 462266 429844 415265 396155 467222 582443 709871 757722 772442 710298 635697 600595
10149F00595l0663j16019q2461o7141O24J2523O6670N4219M5620k3456m2100o9300
$$ 600595 569932 453913 371452 304311 304935 317458 384128 438347 483967 460511 418411 349111
10137C49111n5829k6388j3653r399r508j0843n1467k9002N488k7462o5201k2325
$$ 349111 293282 266894 253241 243842 234334 223491 172024 143022 148510 121048 55847 33522
10125C3522O7508m1216k3832L8315J0923j7936k8284j4184m8498m889O889P7318
$$ 33522 101030 59814 35982 74297 85220 67284 39000 24816 -23682 -28571 -21682 55636
10113E5636P817j3997l5217j9716l7872J6839Q5497K9538R121o9094R617r014
$$ 55636 63453 49456 14239 -5477 -43349 -26510 58987 88525 97646 28552 38169 29155
10101B9155k0219L8097J3653m4717o3628j6501J9429J9180K4179K3696j3296k3729
$$ 29155 8936 47033 60686 15969 -47659 -64160 -44731 -25551 -1372 22324 9028 -14701
10089a4701K1872K3937k7666l1155j9140j6902J7698N827j8885J3576J7069l6127
$$ -14701 7171 31108 3442 -27713 -46853 -63755 -46057 -40230 -59115 -45539 -28470 -64597
10077f4597O4R023J542J3232L4753O41J7251L2085J9128k0188k2537k2111J7053
$$ -64597 -64533 -55510 -53968 -40736 -5983 -5342 11909 43994 63122 42934 20397 -1714 15339
10064A5339L199l1174n368M4030Q082P023k7013K3611J6831K7523l187l1491m4032
$$ 15339 18538 -12636 -18004 26026 34108 41131 14118 37729 54560 82083 78896 47405 3373
10051C373j6774j2587K8456P521M3399J2647L642M9237p665J9542L3613q5010
$$ 3373 -13401 -25988 2468 9989 53388 66035 69677 118914 111249 130791 164404 79394
10039G9394j00378Q822J7940N0008K8669l0218r5971J1993J0624L5706q669j3573
$$ 79394 -20984 -12162 5778 55786 84455 54237 -41734 -29741 -19117 16589 7920 -5653
10027e653k0134N2355M0136r262m9759K1395K6249N107m7450n5489M4289J1258
$$ -5653 -25787 26568 66704 57442 7683 29078 55327 60434 12984 -42505 1784 13042
10015A3042m3740l1360m0233M3046L9723L6072m021n7409n9232L9542Q9158o412
$$ 13042 -30698 -62058 -102291 -59245 -19522 16550 12529 -44880 -104112 -64570 24588 18176
10003A8176j7962K2778J6176k31J2189l6784k8017P890K4025J0433P589M2903
$$ 18176 214 22992 39168 38937 51126 14342 -13675 -5785 18240 28673 36262 79165
9991G9165L8439n288o1810l5431J1027l1584p329P182j4703j2334O2365J2389
$$ 79165 117604 112316 50506 15075 26102 -5482 -12811 -5629 -20332 -32666 29699 42088
9979D2088k5589j8229K4519m337j6143k1983p2l8842p897J9891Q7912l4258o0609
$$ 42088 16499 -1730 22789 18452 2309 -19674 -19746 -58588 -66485 -46594 41318 7060 -53549
9966e3549l8703Q511L5472j8715l5043J2258J1046n841j2480k3794m166M2374
$$ -53549 -92252 -83741 -48269 -66984 -102027 -89769 -78723 -84564 -97044 -120838 -125004 -82630
9954h2630M8688L0923L1213N4870M178k8960k0006k2019J8853N8941p7527m0860
$$ -82630 -33942 -3019 28194 83064 87242 58282 38276 16257 35110 94051 16524 -24336
9942b4336Q0486j8389m7974M820m093m4760j8875L8091K5042R471k9141k0775
$$ -24336 56150 37761 -10213 -5393 -9486 -54246 -73121 -35030 -9988 -517 -29658 -50433
9930e0433J1771J1882J8839j9966j0940N644k4283j5625J0638q141N7662j0143
$$ -50433 -38662 -26780 -7941 -27907 -38847 -33203 -57486 -73111 -62473 -70614 -12952 -23095
9918b3095J2818L3893J3352L449j5251L3323k0019l4652N168m7114j3648k140
$$ -23095 -10277 23616 36968 40417 25166 58489 38470 3818 8986 -38128 -51776 -53916
9906e3916R34j9111j7457j6208l3380K5363O7889O4733o4227k383L4691j0900
$$ -53916 -52982 -72093 -89550 -105758 -139138 -113775 -45886 18847 -45380 -47763 -13072 -23972
9894b3972k1051n8433N5623N4236j8603n1316P6654K3173P505O320J6429n0826
$$ -23972 -45023 -103456 -47833 6403 -12200 -63516 13138 36311 43816 50136 66565 15739
9882A5739j3062K0908j9380j5261J1253m3817k4940J8209J9966m412m5782n900
$$ 15739 2677 23585 4205 -11056 197 -43620 -68560 -50351 -30385 -34797 -80579 -86479
9870h6479o033L1495j9368k0899M3715j5598M3835K2020j1220m5454L2000L0373
$$ -86479 -92512 -61017 -80385 -101284 -57569 -73167 -29332 -7312 -18532 -63986 -31986 -1613
9858a613j0506m3555K1362k180J0846K3095M4789N0347q5679n3851j0225O949
$$ -1613 -12119 -55674 -34312 -36492 -25646 -2551 42238 92585 6906 -46945 -57170 -50221
9846e0221O198k1306o976J6007l599J2619m8622L2633M7903q131m4438j6008n749
$$ -50221 -44023 -65329 -72305 -56298 -59897 -47278 -95900 -63267 -15364 -23495 -67933 -83941 -89690
9833h9690K6344L44Q7M658O407R461K0429k4067k2210N4192L0702k8798j0377
$$ -89690 -63346 -63002 -62915 -58257 -51850 -42389 -21960 -46027 -68237 -14045 16657 -12141 -22518
9820b2518J3404l545j7673K7897l2466P483Q9037M9581o8581p7860J2321P7896
$$ -22518 -9114 -12659 -30332 -2435 -34901 -27418 61619 111200 42619 -35241 -22920 54976
9808E4976K0296l4676p664K5692J6919j2348k2830K3158J4551q952M3509o607
$$ 54976 75272 40596 32932 58624 75543 63195 40365 63523 78074 69122 112631 106024
9796A06024j1671k9102L777K2832n0469k6502r311L037O5350l9648m6871J2283
$$ 106024 94353 65251 69028 91860 41391 14889 5578 8615 73965 34317 -12554 -271
9784b71O5195O2594K4567Q1443K60380L52584O14344R57056J006836L53629m62957
$$ -271 64924 127518 152085 233528 493908 846492 1460836 2417892 3424728 3778357 3315400
9773C315400q39889q51877n99925l49501k67267j32036p9204n5383j7608J8963
$$ 3315400 2475511 1623634 1023709 674208 406941 274905 195701 140318 122710 141673
9763A41673J6310o7313K9884j0116l4909l8029l4447l6420k2846l487N5651K2342
$$ 141673 157983 90670 120554 110438 75529 37500 3053 -33367 -56213 -59700 -4049 18293
9751A8293J1932k0040j2438n1038j4046J7636J8069L0715O4033J4930N3124l7466
$$ 18293 30225 10185 -2253 -53291 -67337 -49701 -31632 -917 63116 78046 131170 93704
9739I3704j3734j9738l5408J4559o2065q6932O4766O0352J2261m3370Q716M5103
$$ 93704 79970 60232 24824 39383 -22682 -109614 -44848 15504 27765 -15605 -6889 38214
9727C8214m4920J2205M0294L1764n4925R1J0061L1972q104n1821M640J3006P63
$$ 38214 -6706 5499 45793 77557 22632 22723 32784 64756 56652 4831 9471 22477 23240
9714B3240j0662K2143K2229n233m3038l9223l2712K5222M6844O3278j3984k7443
$$ 23240 12578 34721 56950 51717 8679 -30544 -63256 -38034 8810 72088 58104 30661
9702C0661k5228M9104l8065o9184k6445J6277N2984L7000J4047p7303k5809j1679
$$ 30661 5433 54537 16472 -52712 -79157 -62880 -9896 27104 41151 -36152 -61961 -73640
9690g3640N0911J2992k7018l6788N8787R2806J6415L0602K6421n3639l4286N219
$$ -73640 -22729 -9737 -36755 -73543 -14756 78050 94465 125067 151488 97849 63563 68782
9678F8782m9705j7073K0053K2514K6956M2410m9634m9756Q229N3516L8605m0165
$$ 68782 19077 2004 22057 44571 71527 113937 64303 14547 22776 76292 114897 74732
9666G4732l500K9431m2303j6422Q845K9707N4963P3575J15697K04341L24651N82586
$$ 74732 71232 100663 58360 41938 50783 80490 135453 209028 324725 529066 853717 1436303
9654A436303R81179J615225J356342m18659j018598j186089j013433o65560l43449
$$ 1436303 2417482 4032707 5389049 4970390 3951792 2765703 1752270 1086710 743261
9645G43261k08209j35869p1872j5072p8785o7885L9988j9083l5420J7616j5529
$$ 743261 535052 399183 327311 312239 233454 165569 205557 186474 151054 168670 153141
9634A53141j5166l7371m6320j6091l4678L5790n497k6186K7291K1601l2602j5263
$$ 153141 137975 100604 54284 38193 3515 39305 33808 7622 34913 56514 23912 8649
9622H649R674o1613P100R035M0716o4733j4596K5676M9687L9395M8489M5404J9628
$$ 8649 18323 -43290 -36190 -27155 13561 -51172 -65768 -40092 9595 48990 97479 142883 162511
9609A62511R628k6330m8630o4745l4446k2434J0594j2961L7995N4517k5694k0179
$$ 162511 172139 145809 97179 32434 -2012 -24446 -13852 -26813 11182 65699 40005 19826
9597A9826o4189k0131k2666R6165J942m3393Q6753K7277l8652k4075n2062l0624
$$ 19826 -44363 -64494 -87160 9005 10947 -32446 54307 81584 42932 18857 -33205 -63829
9585f3829M1675j9521R571P235L2935L2929l7912j4432O3620l3453n62O1752k4569
$$ -63829 -22154 -41675 -32104 -24869 8066 40995 3083 -11349 52271 18818 18256 80008 55439
9572E5439m848L5088k3101m5874k7784n9914n1824P216N0539K7547Q411P500j0719
$$ 55439 50591 85679 62578 16704 -11080 -70994 -122818 -115602 -65063 -37516 -29105 -21605 -32324
9559c2324K6668J5272l4080L0216L9895Q541q122K0611L2980m7036o6239k2962
$$ -32324 -5656 9616 -24464 5752 45647 54188 46066 66677 99657 52621 -13618 -36580
9547c6580J2480k1951L5778l3087N4628j5755o2513k9362o6N4070L3856K4795
$$ -36580 -24100 -46051 -10273 -43360 11268 -4487 -67000 -96362 -96428 -42358 -8502 16293
9535A6293K2973l3458o0138l3757P2874J3473j2661j3590p1768m4682L7717Q4333
$$ 16293 39266 5808 -54330 -88087 -15213 -1740 -14401 -27991 -99759 -144441 -106724 -22391
9523b2391J4506l1383j8344N4463K8914j0210m8805j0936N6790k8892m7354L4323
$$ -22391 -7885 -39268 -57612 -3149 25765 15555 -33250 -44186 12604 -16288 -63642 -29319
9511b9319m3493M2399J4324o1431k0619j1897j7347P090L1579l2450J4562J741
$$ -29319 -72812 -30413 -16089 -77520 -98139 -110036 -127383 -120293 -88714 -121164 -106602 -104861
9499a04861M6441N0658L5042L4770q6037l9122M847L761L0126J7546k6281j5414
$$ -104861 -58420 -7762 27280 62050 -23987 -63109 -58262 -54501 -24375 -6829 -33110 -48524
9487d8524J8167J8361r450O8046p490n3184l1005Q5812J2409m4382k3194L8567
$$ -48524 -30357 -11996 -21446 46600 39110 -14074 -45079 40733 53142 8760 -14434 24133
9475B4133J6239l8906R570o968p6691j1277N4279l4013k1948K7759P0774N896
$$ 24133 40372 1466 11036 4068 -72623 -83900 -29621 -63634 -85582 -57823 12951 18847
9463A8847m7083n0468J5541J5459k1088j5857J5310K5919Q572J1100n8971k2676
$$ 18847 -28236 -78704 -63163 -47704 -68792 -84649 -69339 -43420 -34848 -23748 -82719 -105395
9451a05395L4246L3007P933R351N451j3434m1658j9369K8732K3561j2257j7983
$$ -105395 -71149 -38142 -30209 -20858 -15407 -28841 -70499 -89868 -61136 -37575 -49832 -67815
9439f7815L160K6147J5369J9255M8965l0452J5705j5608k5874j5596M1783l3576
$$ -67815 -64655 -38508 -23139 -3884 45081 14629 30334 14726 -11148 -26744 15039 -18537
9427a8537M091j138l702K0620N6703n495j5630q5306k1830K242L3747J9407o3103
$$ -18537 -14446 -15584 -19286 1334 58037 52542 36912 -48394 -70224 -67982 -34235 -14828 -77931
9414g7931J1437J6723J279k5994M3995N871o76o505K6916J8845l3314k9772j4440
$$ -77931 -66494 -49771 -48492 -74486 -30491 -24620 -25296 -31801 -4885 13960 -19354 -49126 -63566
9401f3566l3942L8279K1882k2412M181j9808j13648o709J8184N0663N3996M4314
$$ -63566 -97508 -59229 -37347 -59759 -55578 -75386 -189034 -195743 -177559 -126896 -72900 -28586
9389b8586L9448L8730L7218m6475p2146m2140L1696O8540k631k034J204j9846
$$ -28586 10862 49592 86810 40335 -31811 -73951 -42255 26285 23654 21620 22824 2978
9377B978l0603m7344L3753M3849m407j6259l723N7019j2284q2105J5898K6447
$$ 2978 -27625 -74969 -41216 2633 -1774 -18033 -21756 35263 22979 -59126 -43228 -16781
9365a6781o280K1273j1372j4982M2903n647k5677k6667n85K6288K8l8517M0986
$$ -16781 -23061 -1788 -13160 -28142 14761 9114 -16563 -43230 -43815 -17527 -17499 -56016 -15030
9352a5030M0096j013L0994m657J3501J4335j5693k5121J8148m3909l3410J3921
$$ -15030 25066 24053 55047 50390 63891 78226 62533 37412 55560 11651 -21759 -7838
9340g838m6068m4303N45P0634L6678o6387J0639Q40J5442l5814n208K3784J2266
$$ -7838 -53906 -98209 -97664 -27030 9648 -56739 -46100 -45260 -29818 -65632 -70840 -47056 -34790
9327c4790M0436l923q172Q946k4536n7972J0185L6619m268L9662M0745K733K9045
$$ -34790 5646 1723 -6449 2497 -22039 -80011 -69826 -33207 -37475 2187 42932 45665 74710
9314G4710l3350Q117k4302m6797p3451k6752L1346N5898P926l3156m6073n3327
$$ 74710 41360 49477 25175 -21622 -95073 -121825 -90479 -34581 -26655 -59811 -105884 -159211
9302a59211N774L7607N6380R459O0729K539o8202p377k4828p194K6903J1807m0233
$$ -159211 -153437 -115830 -59450 -49991 10738 13277 -54925 -62302 -87130 -94324 -67421 -55614 -95847
9289i5847M9769N4035N4691R188p4431m5771K2284l658k1651m2915L9351L2734
$$ -95847 -46078 7957 62648 71836 -2595 -48366 -26082 -29740 -51391 -94306 -54955 -22221
9277b2221p2845l0605N5054O1852M0456k118k4379P825R365l1046L5413j3989
$$ -22221 -95066 -125671 -70617 -8765 31691 29573 5194 13019 22384 -8662 26751 12762
9265A2762L8676N6655o3913m5803J3719n2139p7066q0744k9886N9296M1275j9640
$$ 12762 51438 108093 44180 -1623 12096 -40043 -117109 -197853 -227739 -168443 -127168 -146808
9253a46808l193L2325L2220o066R478J9603L5487J5412q590M6839K3163l5851
$$ -146808 -150001 -117676 -85456 -91522 -82044 -62441 -26954 -11542 -20132 26707 49870 14019
9241A4019q3896M974N3410j0732o0793k5165L6770P8942m361k9800k4178L5918
$$ 14019 -69877 -64903 -11493 -22225 -83018 -108183 -71413 7529 3168 -26632 -50810 -14892
9229a4892K1307M895L520J0625l0924M1584l2253n9803K2923j0971r211j6856
$$ -14892 6415 11310 14830 25455 -5469 36115 3862 -55941 -33018 -43989 -53200 -70056
9217g0056j9012j9205N3422R090r148k0775L4121M2178M8344O973L4315L4372
$$ -70056 -89068 -108273 -54851 -45761 -54909 -75684 -41563 615 48959 55932 90247 124619
9205A24619o3899r194Q821K672J6257m3424n1126j0413P710k6767J4274J4755
$$ 124619 60720 51526 60347 63019 79276 35852 -15274 -25687 -17977 -44744 -30470 -15715
9193a5715N053j3198n490M9533J496k0743K2273N1340l0498n6658p346M6477J9377
$$ -15715 -10662 -23860 -29350 20183 21679 936 23209 74549 44051 -12607 -19953 26524 45901
9180D5901m3410M4442M152o5717R826Q3324J1889m09j9801k7652j2724J6774j408
$$ 45901 2491 46933 51085 -14632 -4806 78518 90407 89998 70197 42545 29821 46595 45187
9167D5187N228R41o0594r956j116j9516J8367L6671l6028l0496N873j4922L3254
$$ 45187 50415 51356 -9238 -19194 -20310 -39826 -21459 15212 -20816 -51312 -45439 -60361 -27107
9154b7107J846k6858J8744J6588L6137k8120Q529k5386M9543O215K0077J9219
$$ -27107 -25261 -52119 -33375 -16787 19350 -8770 -241 -25627 23916 30131 50208 69427
9142F9427j03346l2443Q7393M3549J7846L1522q215o7653l398k3515l303J1031
$$ 69427 -33919 -66362 21031 64580 82426 113948 105733 38080 34682 11167 7864 18895
9130A8895J5614Q703L0200J8547n8524m2050k2508j6534l726M8628J8209k2904
$$ 18895 34509 43212 73412 91959 33435 -8615 -31123 -47657 -51383 -2755 15454 -7450
9118g450j1080r293p4872J4662L4155L0601k9741o5099j0448K8048l101K8140
$$ -7450 -18530 -27823 -102695 -88033 -53878 -23277 -53018 -118117 -128565 -100517 -103618 -75478
9106g5478K4303P53k8264k9376L8263Q5368M8821k5369n8431l0743j9103j737
$$ -75478 -51175 -50422 -78686 -108062 -69799 15569 64390 39021 -19410 -50153 -69256 -70993
9094g0993n5341l2985M7480O7949k9361k1404J84K6129J1719k2328l1124l631
$$ -70993 -126334 -159319 -111839 -43890 -73251 -94655 -94471 -68342 -56623 -78951 -110075 -113706
9082a13706J1241L1633L0743n2774r776J3448P659N4237j5972M4786K3930m7004
$$ -113706 -102465 -70832 -40089 -92863 -102639 -89191 -81532 -27295 -43267 1519 25449 -21555
9070b1555J1667K1894j9244J1281K3790j5341J2427P348n8569k0495j991o414
$$ -21555 -9888 12006 -7238 4043 27833 12492 24919 32267 -26302 -46797 -48788 -55202
9058e5202m5969N776K2511J8818j2400p695N1755O7307J0105l1425j4268J7763
$$ -55202 -101171 -95395 -72884 -54066 -66466 -74161 -22406 44901 55006 23581 9313 27076
9046B7076k1749l199k5015k0018K400n5427K753K3585k0407P3043K6777m9627
$$ 27076 5327 2128 -22887 -42905 -40505 -95932 -93179 -69594 -90001 -16958 9819 -39808
9034c9808m5231J8109K2988J0851P626j8352l6783k492k7367j1839J6693M7739
$$ -39808 -85039 -66930 -43942 -33091 -25465 -43817 -80600 -83092 -110459 -122298 -105605 -57866
9022e7866K4476l5723L6951P3200K0584k9240o7585J4708P464k9127K2131L7791
$$ -57866 -33390 -69113 -32162 41038 61622 32382 -35203 -20495 -13031 -42158 -20027 17764
9010A7764k0574J6377j3882J9801J9800k0656p6344k3952J9479Q937J5415k9747
$$ 17764 -2810 13567 -315 19486 39286 18630 -57714 -81666 -62187 -53250 -37835 -67582
8998f7582p7049q799L8164K7598M5167O0548j9703j6571M7126k9938o4767J1359
$$ -67582 -144631 -153430 -115266 -87668 -42501 18047 -1656 -18227 28899 -1039 -65806 -54447
8986e4447L4967J3315N1392j1836k6835j6509l3010l234L5395O848K5237N1639
$$ -54447 -19480 -6165 45227 33391 6556 -9953 -42963 -46197 -10802 -3954 21283 72922
8974G2922L6504r1854o5438m783L1318L8452N4920m8725p2774l4396L4710O2197
$$ 72922 109426 17572 -47866 -52649 -21331 17121 72041 23316 -49458 -83854 -49144 13053
8962A3053J158m3994j3065j8181L6063l7559L9739O2783N499m4645R186J7757
$$ 13053 14211 -29783 -42848 -61029 -24966 -62525 -22786 39997 45496 851 10037 27794
8950B7794J7719l4988r3341L8121O3487M6896N9488k68l7180m6122J551l3371
$$ 27794 45513 10525 -82816 -44695 18792 65688 125176 124908 87728 41606 43157 9786
8938I786o5311J7235M47M5950J6286j6767k4898p4726N053M8055j578K690K8597
$$ 9786 -55525 -38290 -37843 8107 24393 7626 -17272 -91998 -86945 -38890 -40468 -37778 -9181
8925i181l1524j0491K6058N21M2137O8246K2442q9672j3903P221k5949j8763j7309
$$ -9181 -40705 -51196 -25138 -24617 17520 85766 108208 18536 4633 11854 -14095 -32858 -50167
8912e0167J8032L0968l0122N90L3852M0371K2181N432j2077j8952K8086k5235
$$ -50167 -32135 -1167 -31289 -30699 3153 43524 65705 71137 59060 40108 68194 42959
8900D2959q6194k6302j1343J7544P4342O1768j0038j1590L0085J9014k6092p3086
$$ 42959 -43235 -69537 -80880 -63336 11006 72774 62736 51146 81231 100245 74153 1067
8888A067m156j9711J4872L0351k4993k1448L3965M8716m5541l3531j6904l9123
$$ 1067 -3089 -22800 -7928 22423 -2570 -24018 9947 58663 13122 -20409 -37313 -76436
8876g6436K5801o2220J2571P0319p487L9072P0438o3837K3067K2453M079j18799
$$ -76436 -50635 -112855 -100284 -29965 -37452 1620 72058 8221 31288 53741 57820 -60979
8864f0979j198M2529J8783J8128L2199N373N3160m990l9745K2813k5244l9200
$$ -60979 -62177 -19648 -865 17263 49462 54835 107995 103005 63260 86073 60829 21629
8852B1629j1146M3125j5864j36q1734o2562l8071n951P2578N6213m2789j8342
$$ 21629 10483 53608 37744 37608 -44126 -106688 -144759 -150710 -78132 -21919 -64708 -83050
8840h3050M9859K0711q305Q667K6926M2552K4413n0534k921l4064R925m8795m8115
$$ -83050 -33191 -12480 -20785 -12118 14808 57360 81773 31239 28318 -5746 4179 -44616 -92731
8827i2731L5098j970l2742K2713l632N2540L7529j0714o7234q5054M7089L9535
$$ -92731 -57633 -59603 -92345 -69632 -73264 -20724 16805 6091 -61143 -146197 -99108 -59573
8815e9573N088M9661M9343j2220m8885J1774m160P465J5462j1837Q523l6345k8855
$$ -59573 -54485 -4824 44519 32299 -16586 -4812 -8972 -1507 13955 2118 10641 -25704 -54559
8802e4559L8470L9758j3128j1658l8080n809L7391M883m8462l7926R988j2961
$$ -54559 -16089 23669 10541 -1117 -39197 -45006 -7615 -2732 -51194 -89120 -79132 -92093
8790i2093l4742L2346N9821o162R7244J6502Q492L1481j062L5539L3510m2634
$$ -92093 -126835 -94489 -34668 -40830 56414 72916 81408 112889 111827 147366 180876 138242
8778A38242k1741J4481k8571k2842l8621l2305O7715L0506j4886p1401m333L2696
$$ 138242 116501 130982 102411 79569 40948 8643 76358 106864 91978 20577 16244 48940
8766D8940l9453l5976n5179k046Q3566N3883K7474m5999p2463m4375K6922M8812
$$ 48940 9487 -26489 -81668 -83714 -148 53735 81209 35210 -37253 -81628 -54706 -5894
8754e894M6752q749o8538l4505M3256N8826L0083Q150J2103q5253k5888l6185
$$ -5894 40858 32109 -36429 -70934 -27678 31148 61231 69381 81484 -3769 -29657 -65842
8742f5842M3448O2646P4730Q0037O2062p01j2261j9724k2072l1226n8276k0340
$$ -65842 -22394 40252 114982 195019 257081 256380 244119 224395 202323 171097 112821 92481
8730I2481j6894R816P3997j1422k7766k7609l6766m4394k5341k1101N0182J2047
$$ 92481 75587 85403 159400 147978 120212 92603 55837 11443 -13898 -34999 15183 27230
8718B7230K2348m442J2323q351l932J4744j5002k8285n2947o0479J4910L0527
$$ 27230 49578 45136 57459 49108 45176 59920 44918 16633 -36314 -96793 -81883 -51356
8706e1356L1461N8728J5775k4073k5958l823R570j2665J6949L9338M2233J5152
$$ -51356 -19895 38833 54608 30535 4577 754 10324 -2341 14608 53946 96179 111331
8694A11331l036k0683p514N7741O6360q1663q4362L203Q980o6806o2224K6224
$$ 111331 108295 87612 80098 137839 204199 122536 38174 41377 50357 -16449 -78673 -52449
8682e2449l7603l0297J7812P6337J288l8669J3949P9856N9307k2591q136o4259
$$ -52449 -90052 -120349 -102537 -26200 -24912 -63581 -49632 30224 89531 66940 58804 -5455
8670e455k0822J649j491K1937K5978M8871L571q4363k9282q326N1754K7928k5137
$$ -5455 -26277 -24628 -26119 -4182 21796 70667 74238 -10125 -39407 -47733 4021 31949 6812
8657F812J6976L1415o973n8070J5361j1853L0517M5114n1972j03012o964L8209
$$ 6812 23788 55203 48230 -9840 5521 -6332 24185 69299 17327 -85685 -92649 -54440
8645e4440J7260o330K6073L184P649l214M8498K8907q158j4460p9382J913P7945
$$ -54440 -37180 -43510 -17437 -14253 -6604 -9818 38680 67587 59429 44969 -34413 -32500 45445
8632D5445L8776l2980k9277N7396l0691m1879K1979l9963p964L617n812L000N022
$$ 45445 84221 51241 21964 79360 48669 6790 28769 -11194 -19158 -15541 -21353 -18353 -13331
8619a3331n8613R691P8273J4650L5440O9543l9949j9633m6740J1901Q266j8196
$$ -13331 -71944 -62253 16020 30670 66110 135653 95704 76071 29331 41232 49498 31302
8607C1302k8326j8484m8173M3766o549o0118k5950N2759O2985K0780k4001j2591
$$ 31302 2976 -15508 -63681 -19915 -26464 -86582 -112532 -59773 3212 23992 -9 -12600
8595a2600L9010K0017O673p6024j04609M5573O0506J84K5999K7587l8116l7204
$$ -12600 26410 46427 53100 -22924 -127533 -81960 -21454 -21270 4729 32316 -5800 -43004
8583d3004k0681j1342k6231L3905K3098K1931j4167K1604K4242J628R744j6189
$$ -43004 -63685 -75027 -101258 -67353 -44255 -22324 -36491 -14887 9355 10983 20727 4538
8571D538k0965n575P4780J0286j5433l7711j6239K449m4076K5723L7996J8672
$$ 4538 -16427 -22002 52778 63064 47631 9920 -6319 -3870 -47946 -22223 15773 34445
8559C4445r0087k2678N177k6503L348K0863N1332K1852p1645m9641Q046J8123
$$ 34445 -55642 -78320 -73143 -99646 -96298 -75435 -24103 -2251 -73896 -123537 -115491 -97368
8547i7368K0355M1374n503j3126l657J19957J0584p0988p0736O192k3672J0098
$$ -97368 -77013 -35639 -41142 -54268 -57925 62032 72616 1628 -69108 -62916 -86588 -76490
8535g6490M4149M3366O4748K6866J37689J80857K45847K43435j3976k52789k23934
$$ -76490 -32341 11025 75773 102639 240328 421185 667032 910467 896491 643702 419768
8524D19768j38079q7048j5225l6862j08368l9275l112k7613L879j2871k2605K0526
$$ 419768 281689 194641 179416 142554 34186 -5089 -8201 -35814 -31935 -44806 -67411 -46885
8512d6885K2460R14j5052M1483L2457k3277q1051L1870O7920J2119J4417r93j9449
$$ -46885 -24425 -23511 -38563 2920 35377 12100 -68951 -37081 30839 42958 57375 56382 36933
8499C6933K9044j9523n163j7149l4200k8596J6193K9573L053M9634Q2075J33916
$$ 36933 65977 46454 41291 24142 -10058 -38654 -22461 7112 10165 59799 141874 275790
8487B75790J60835J85006L20986N21399N84960p0567m96537m59594l66754k21978
$$ 275790 436625 621631 942617 1464016 2048976 1978409 1481872 1022278 655524 433546
8477D33546q4316m7260m5906r089m9431j3136p5622q5212j1271J7202P9712l3044
$$ 433546 349230 301970 256064 246975 197544 184408 108786 23574 12303 29505 109217 76173
8465G6173m5876k6072O246K3288j6895j6334O9401j6258l5290l872j1238k0883
$$ 76173 30297 4225 10471 33759 16864 530 69931 53673 18383 14511 3273 -17610
8453a7610J5708J6358J4026M3683l264j01515K1191q971o974R4893O8001M8099
$$ -17610 -1902 14456 28482 72165 68901 -32614 -11423 -20394 -27368 67525 135526 183625
8441A83625Q8382J53984K73558L54547k8686k48788k52670j92377j04625q4458
$$ 183625 272007 425991 699549 1054096 1025410 776622 523952 331575 226950 142492
8431A42492j14431p473j0744L0480l70j5824Q016M6874r824j0289j65k4978J5294
$$ 142492 28061 20588 9844 40324 39954 24130 32146 79020 69196 58907 58742 33764 49058
8418D9058K2137m527l3233r293p512r306J565j375M7232j0517l465k9586o5345
$$ 49058 71195 66668 33435 24142 16630 7324 8889 7514 54746 44229 40764 11178 -54167
8405e4167o6545R479P4211j4403q131J8719R081n4923k7305J3203O2224O6509
$$ -54167 -120712 -111233 -37022 -51425 -59556 -40837 -31756 -86679 -113984 -100781 -38557 27952
8393B7952N4754r024J2468k7093m1343p4776K0034K0217l87R0063P126n515p0078
$$ 27952 82706 73682 86150 59057 17714 -57062 -37028 -16811 -17198 72865 79991 74476 4398
8380D398p3875Q118R2483q552n7225N220N3530l8458n275J7980j0336m392Q961
$$ 4398 -69477 -61359 31124 22572 -34653 -29433 24097 -14361 -19636 -1656 -11992 -16384 -7423
8367g423l6822L2421M6453l1606n2161J9624M6816L2179l9004n2517m512J8612
$$ -7423 -44245 -11824 34629 3023 -49138 -29514 17302 49481 10477 -42040 -46552 -27940
8355b7940l0135O8269n514j7052k2854K369k6626j3461M099O9311O7058N6427
$$ -27940 -58075 10194 4680 -12372 -35226 -32857 -59483 -72944 -68845 466 67524 123951
8343A23951J16339J39695L4187o9328j25170m2355j5134M630K1460j8698m9344
$$ 123951 240290 379985 414172 344844 219674 177319 162185 166815 188275 169577 120233
8332A20233l2680k0499l1275L6003L5403p1531o1673O2006j1005n1431M735R7767
$$ 120233 87553 67054 35779 71782 107185 35654 -26019 35987 24982 -26449 -21714 76053
8320G6053J1181J4498j0820n5413J537l6326M8147M3118j3477p414l3181l5907
$$ 76053 87234 101732 90912 35499 37036 710 48857 91975 78498 71084 37903 1996
8308A996j5527N6729J3258j7896j0816J1145O7772J56900J16762K11186K90709
$$ 1996 -13531 43198 56456 38560 27744 38889 106661 263561 380323 591509 882218
8297H82218o427k03612j86108j67177r4231j4765m5678l4557k8330q6638j965
$$ 882218 875791 672179 486071 318894 224663 209898 164220 129663 101333 14695 12730
8286A2730P9886R7508L0662m8791m0864m3710K338O859k0915r873q8584R035K1306
$$ 12730 92616 190124 220786 171995 131131 87421 89759 96618 75703 65830 -22754 -13719 7587
8273G587j4859L189O598J552K7301J7780K868j12686j6486N9055Q0429j7830m6789
$$ 7587 -7272 -4083 2515 4067 31368 49148 52016 -60670 -77156 -18101 62328 44498 -2291
8260b291l0922L1016M5025O5666P9727P8806J98328R0043p1545o9091j79689j65250
$$ -2291 -33213 -2197 42828 108494 188221 267027 465355 555398 483853 414762 235073 69823
8248F9823m1137L7192P433J4552j9732j5689m3067K838O9077J6967n4704o3696
$$ 69823 28686 65878 73311 87863 68131 52442 9375 12213 81290 98257 43553 -20143
8236b0143j1564q569K1563M1054L5878J2789o8383m9521J9186L0404M8081N697
$$ -20143 -31707 -40276 -18713 22341 58219 71008 2625 -46896 -27710 2694 50775 56472
8224E6472l619k5329j7607j1067l4842k0366j5618n1946M754j3417M5772L0263
$$ 56472 52853 27524 9917 -1150 -35992 -56358 -71976 -123922 -119168 -132585 -86813 -56550
8212e6550O7657M0809M9541k2283l0939n185k7819j6211N6420K3010n8122l7244
$$ -56550 11107 51916 101457 79174 48235 43050 15231 -980 55440 78450 20328 -16916
8200a6916j8349o977K0669K0405M4366k9994J5591l8552n7250Q59O603j2463N4756
$$ -16916 -35265 -42242 -21573 -1168 43198 13204 28795 -9757 -67007 -66148 -59545 -72008 -17252
8187a7252r991j6495M9959K5924j01155p6829R0335J514k3946J3754K4131m8166
$$ -17252 -27243 -43738 6221 32145 -69010 -145839 -55504 -53990 -77936 -64182 -40051 -88217
8175h8217k0630r117J1785J716N0887P9303J5127j8331J2711j5622j5991N388
$$ -88217 -108847 -117964 -106179 -104463 -53576 25727 40854 22523 35234 19612 3621 9009
8163I009j2818J1957k4955J7783R134K4614J2549m4536m3156m1707M4617O5669
$$ 9009 -3809 8148 -16807 976 10110 34724 47273 2737 -40419 -82126 -37509 28160
8151B8160m8175o3313j4864L2203q155J5137K7821R270K9516N9816k707j2290
$$ 28160 -20015 -83328 -98192 -65989 -74144 -59007 -31186 -21916 7600 67416 64709 52419
8139E2419l1981r5942l2489J3598P1898j3769J3209O326m924l0801j1022m111
$$ 52419 20438 -75504 -107993 -94395 -22497 -36266 -23057 -16731 -21655 -52456 -63478 -67589
8127f7589N0899J2233k7826r82k0286M2862L3859r370l7811j0355r30K6012O1903
$$ -67589 -16690 -4457 -32283 -33265 -53551 -10689 23170 13800 -24011 -34366 -35296 -9284 52619
8114E2619J561J9921P168k7048N270k5504n1782j5347J9466k9650Q559K2761J3880
$$ 52619 54180 74101 81269 54221 59491 33987 -17795 -33142 -13676 -43326 -34767 -12006 1874
8101A874J7756k407l7091K5803K2015K0012n1694K7056M1483Q77J1348l3010p5004
$$ 1874 19630 17223 -19868 5935 27950 47962 -3732 23324 64807 65684 77032 44022 -30982
8088c0982k0362k1550N2j185j5797M2498K6411O931j0415L4976O564j16325l0749
$$ -30982 -51344 -72894 -72842 -74027 -89824 -47326 -20915 -13984 -24399 10577 17141 -99184 -129933
8075a29933R0703K8628j5228m1211M7289K1229j4223J3390N1286K6481p405j6341
$$ -129933 -39230 -10602 -25830 -67041 -19752 1477 -12746 644 51930 78411 71006 54665
8063E4665j8876Q220M3958m8995k1789N3655k8034k4963j4387K959k5088K2695
$$ 54665 35789 44009 87967 38972 17183 70838 42804 17841 3454 6413 -18675 4020
8051D020Q772j1251k1007m5889l1150J4130j9668L5747N736K8520J6018J8741
$$ 4020 12792 1541 -19466 -65355 -96505 -82375 -102043 -66296 -60560 -32040 -16022 2719
8039B719o238K1770j439q676m4645J8189K4976K5033n8657j6130m2053K6161K6136
$$ 2719 -3519 18251 16812 8136 -36509 -18320 6656 31689 -26968 -43098 -85151 -58990 -32854
8026c2854n802m0769o8691J9983L3158n632N8191P80k1156J2726M7895q799J2543
$$ -32854 -38656 -79425 -148116 -128133 -94975 -100607 -42416 -41636 -62792 -50066 -2171 -10970 1573
8013A573K874p4513m0025P7717O328m2453J5101J87L0862r330p1247j9977N6874
$$ 1573 4447 -70066 -110091 -32374 -26046 -68499 -53398 -53211 -22349 -31679 -102926 -122903 -66029
8000f6029L6432J3326j4116m1091K5438M6844K218n260k508J6760K2906l4419
$$ -66029 -29597 -16271 -30387 -71478 -46040 804 3022 -2238 -4746 12014 34920 501
7988E01m4720l3307O8742k4000m7733Q998O805M8568J1648j906o0508l1960M4954
$$ 501 -44219 -77526 -8784 -32784 -80517 -71519 -64714 -16146 -4498 -6404 -66912 -98872 -53918
7975e3918J0565M0969N4052m7607m3662p122k8155r422P0332m4721o8636P6513
$$ -53918 -43353 -2384 51668 4061 -39601 -46723 -74878 -84300 -13968 -58689 -127325 -50812
7963e0812N5270k7496o0297k081Q2210Q125J0131K3604m5202L8627l3238k3785
$$ -50812 4458 -23038 -83335 -85416 -3206 4919 15050 38654 -6548 32079 -1159 -24944
7951b4944L3619j1535L1816K7395l0270L9623j0336r592j3723m9651J5845j6050
$$ -24944 8675 -2860 28956 56351 26081 65704 55368 45776 32053 -17598 -1753 -17803
7939a7803K5976K3143L1658J1794k6683o8775j858J5781j3493p4354k0827L6878
$$ -17803 8173 31316 62974 74768 48085 -20690 -22548 -6767 -20260 -94614 -115441 -78563
7927g8563O7578O3584M3412o1044r1915j541L9686r161J1335L4474K0079j1739
$$ -78563 -10985 52599 96011 34967 -56948 -58489 -18803 -27964 -16629 17845 37924 26185
7915B6185L3566k9968n9408K0529j5830l4657n1089Q035N0473L404l0857J9709
$$ 26185 59751 29783 -29625 -9096 -24926 -59583 -110672 -102637 -52164 -48760 -79617 -59908
7903e9908K9122K5044M6364M5730j677N5442m0440k6511j4453m997J406k5900
$$ -59908 -30786 -5742 40622 86352 84675 140117 99677 73166 58713 53716 55122 29222
7891B9222n5959m8721k2768K104j0881k3250J02452M0616j8292m7894J4018J0167
$$ 29222 -26737 -75458 -98226 -96122 -107003 -130253 -27801 12815 -5477 -53371 -39353 -29186
7879b9186O65j3669m377q661j4664k2515K0572J8071j5546P2710j4798r8063j3452
$$ -29186 -28521 -42190 -46567 -55228 -69892 -92407 -71835 -53764 -69310 3400 -11398 -109461 -122913
7866a22913O1645N6214R939j4777m8638p563L455N915J8537m7462M2247Q1470
$$ -122913 -61268 -5054 4885 -9892 -58530 -66093 -62638 -56723 -38186 -85648 -43401 38069
7854C8069j3295m3970m80L2624K7088j1508J8062l0697n3661m1293L5387o845
$$ 38069 24774 -19196 -19676 12948 40036 28528 46590 15893 -37768 -79061 -43674 -50519
7842e0519O5313M5386J5180l7056l0879L3112j0013m8219j0371j9024K504l1920
$$ -50519 14794 60180 75360 38304 7425 40537 30524 -17695 -28066 -47090 -44586 -76506
7830g6506J222J4009J8851o8512J5007K7024j0807o6581R1757J9266N1749J3862
$$ -76506 -75284 -61275 -42424 -110936 -95929 -68905 -79712 -146293 -54536 -35270 16479 30341
7818C0341o1854j5897O340K0011J6985j1485k8045j80M1997o776J8676K9506J683
$$ 30341 -31513 -47410 -41070 -21059 -4074 -15559 -43604 -43784 -1787 -8563 10113 39619 41302
7805D1302n4533J3022J2529j5349m4457j1148K8645O6913m9134j6896O653k0727
$$ 41302 -13231 -209 12320 -3029 -47486 -58634 -29989 36924 -12210 -29106 -22453 -43180
7793d3180n730j4296m509N1183K1601j9491M740L7688L6062n5643j0386L4698
$$ -43180 -48910 -63206 -67715 -16532 5069 -14422 -9682 28006 64068 8425 -1961 32737
7781C2737Q914k889K0931k6936j3901k4152j656j668j0739k8476j1209l7520K4019
$$ 32737 41651 38762 59693 32757 18856 -5296 -6952 -8620 -19359 -47835 -59044 -96564 -72545
7768g2545K7724K1599j7275l7594R11j3287k1924K571P4086N9213m2486p2446
$$ -72545 -44821 -23222 -40497 -78091 -77180 -90467 -112391 -109820 -35734 23479 -19007 -91453
7756i1453J6632q7077K6768M6686K6404O723r807k6344J0270j9357k8916l1917
$$ -91453 -74821 -161898 -135130 -88444 -62040 -55317 -65124 -91468 -81198 -100555 -129471 -161388
7744a61388K2418J9334K6428J6898J3512J09819l802o6377j9548k8424J2354l9103
$$ -161388 -138970 -119636 -93208 -76310 -62798 47021 43219 -23158 -42706 -71130 -58776 -97879
7732i7879l7588O824M1229L4505N2096N7627j8193L0282k0208k7139o2913l1659
$$ -97879 -135467 -128643 -87414 -52909 -813 56814 38621 68903 48695 21556 -41357 -73016
7720g3016M8751l4922k478K187J0520P1889P069r162j9512n132j5097l4587M7887
$$ -73016 -24265 -59187 -61665 -59478 -48958 22931 30000 20838 1326 -3806 -18903 -53490 -5603
7707e603j185l4418M3599J5445K677J7554k2124r319M5291n8391n1666j0047l7814
$$ -5603 -6788 -41206 2393 17838 20515 38069 15945 6626 51917 -6474 -58140 -68187 -106001
7694a06001K7836K9763L8351K9971p4944l4023N756M2730M5320K6988l581j2258
$$ -106001 -78165 -48402 -10051 19920 -55024 -89047 -83291 -40561 4759 31747 28166 15908
7682A5908m4226k5475K7433L6611l7754j9147O8728Q222q3179m3572o828Q76N6961
$$ 15908 -28318 -53793 -26360 10251 -27503 -46650 22078 30300 -52879 -96451 -103279 -102403 -45442
7669d5442K8983K3821O951j6862J0261M897K6008l3262k4464J4533P049m4411
$$ -45442 -16459 7362 14313 -2549 7712 12609 38617 5355 -19109 -4576 2473 -41938
7657d1938m1856P332J2339O2052M7521l5410m4262o14j0234k0460M886k1629l5357
$$ -41938 -83794 -76462 -64123 -2071 45450 10040 -34222 -34836 -45070 -65530 -60644 -82273 -117630
7644a17630J4464j1698J1560j6966L0391K9563J7425K3330J2887O617O4185L163
$$ -117630 -103166 -114864 -103304 -120270 -89879 -60316 -42891 -19561 -6674 -57 64128 67291
7632F7291o2979p454l0908k0862L8804m8719q4850M2498N7089j6607j0262Q861
$$ 67291 4312 -3142 -34050 -54912 -16108 -64827 -149677 -107179 -50090 -66697 -76959 -68098
7620f8098R148O2400m9755j9419L2281J1662J2068K023p2356j3698N2690N8039
$$ -68098 -58950 3450 -46305 -65724 -33443 -21781 -9713 -7690 -80046 -93744 -41054 16985
7608A6985M424j8563l9016L6958R3k8728j2719k7032N6024L7560l9265m3626J1086
$$ 16985 21409 2846 -36170 788 881 -27847 -40566 -67598 -11574 25986 -13279 -56905 -45819
7595d5819l4477j0128N2951M3228j4538K5590l3505j9386J935l3093K6180J6961
$$ -45819 -80296 -90424 -37473 5755 -8783 16807 -16698 -36084 -34149 -67242 -41062 -24101
7583b4101K7692K5788k3554N420k4950Q444l2496j5364R933j5137j3741O3707
$$ -24101 3591 29379 5825 11245 -13705 -5261 -37757 -53121 -43188 -58325 -72066 -8359
7571h359J6791k4185j184J8607l9060n0850J7714O0169K6804j8811J1906m7050
$$ -8359 8432 -15753 -16937 1670 -37390 -88240 -70526 -10357 16447 -2364 9542 -37508
7559c7508m8782J0864q719n1439j6972O4232P7631O3400L5480j3252m5720n9489
$$ -37508 -86290 -75426 -84145 -135584 -152556 -88324 -10693 52707 88187 74935 29215 -30274
7547c0274p4174j9085j3220M4952Q3291J9637o5238l1148j6171R666n2703M6566
$$ -30274 -104448 -123533 -136753 -91801 -8510 11127 -54111 -85259 -101430 -91764 -144467 -97901
7535i7901K5592l5387N1707K1804L2998M8140j0486k9057L686O20M693J0225J5009
$$ -97901 -72309 -107696 -55989 -34185 -1187 46953 36467 7410 11096 11716 16409 26634 41643
7522D1643n736M372L5241L3167J0079r8917j0481K0716l171P220k149r7544l4660
$$ 41643 35907 40279 75520 108687 118766 19849 9368 30084 26913 34133 31984 -65560 -100220
7509a00220k486J2325J9599j8681J0588K0649O0527J0751j8997m3476j3152j87
$$ -100220 -102706 -90381 -70782 -89463 -78875 -58226 2301 13052 -5945 -49421 -62573 -62760
7497f2760M9791J6182M170r3l2095J5024J7205k6668j030L7405j1623J3264J9411
$$ -62760 -12969 3213 7383 7290 -24805 -9781 7424 -19244 -20274 17131 5508 18772 38183
7484C8183k2594L0317L5073k9452j2654J7587L1022l3710k6132l0497L722m3439
$$ 38183 15589 45906 80979 51527 38873 56460 87482 53772 27640 -2857 865 -42574
7472d2574N160K4101k58K2741J378k5799j7672L7307N832k5492k832j9464M2162
$$ -42574 -37414 -13313 -13571 9170 10548 -15251 -32923 4384 10216 -15276 -18108 -37572 4590
7459D590K7511R605R44N1473m9714j07845O460N1236O7315n9900m1002k6169j4243
$$ 4590 32101 41706 42650 94123 44409 -63436 -56976 -5740 61575 1675 -39327 -65496 -79739
7446g9739J1376m0004K8233M9418N7495J0626m3672m9510J8450N9172j6371k2397
$$ -79739 -68363 -108367 -80134 -30716 26779 37405 -6267 -55777 -37327 21845 5474 -16923
7434a6923L8839M6099m6652k8702J2506J6868l0466j3285J6446r744j7445l2541
$$ -16923 21916 68015 21363 -7339 5167 22035 -8431 -21716 -5270 -15014 -32459 -65000
7422f5000J6136k1041P9307N7347k3315m2015K3470K5416J942k2919O237n4233
$$ -65000 -48864 -69905 9402 66749 43434 1419 24889 50305 52247 29328 35565 -18668
7410a8668m794L0427q3057J0811L0081n7636j9884K1918j2359j6510N6344M2666
$$ -18668 -23462 6965 -76092 -65281 -35200 -92836 -112720 -90802 -103161 -119671 -63327 -20661
7398b0661J4102L2478K5667l507o3273m1613o5720J4015M9291J2941J1711L101
$$ -20661 -6559 25919 51586 48079 -15194 -56807 -122527 -108512 -59221 -46280 -34569 -31468
7386c1468M103J8355O415M9777j9467k1578o8454k2865J6390L8600J0146l3708
$$ -31468 -27365 -9010 -2595 47182 27715 6137 -62317 -85182 -68792 -30192 -20046 -53754
7374e3754L5546J2605m1468j0669j8803j8708n9398l3996O2313M3759L1895J7052
$$ -53754 -18208 -5603 -47071 -57740 -76543 -95251 -154649 -188645 -126332 -82573 -50678 -33626
7362c3626r405J7904l4107O9629L848n7497J8678M816j29N272M0534k1086J0004
$$ -33626 -43031 -25127 -59234 10395 14243 -43254 -24576 -19760 -19889 -14617 25917 4831 14835
7349A4835j5115m9118k9365k2966L3554J3019J6528j0318m156K9404k2316n0076
$$ 14835 -280 -49398 -78763 -101729 -68175 -55156 -38628 -48946 -53102 -23698 -46014 -96090
7337i6090Q590l5720l0794M7677L2764P2071K6336K1199M0109k6524J6149o455
$$ -96090 -87500 -123220 -154014 -106337 -73573 -1502 24834 46033 86142 59618 75767 69312
7325F9312j9155K5980m9813k5564l3140j9479r249J6943J188P410r841J3209J9892
$$ 69312 50157 76137 26324 760 -32380 -51859 -61108 -44165 -42977 -35567 -45408 -32199 -12307
7312a2307m436O3302J2085Q65Q876j1171P632j5033k5085J7552n5345k7675K082
$$ -12307 -16743 46559 58644 59509 68385 57214 64846 49813 24728 42280 -13065 -40740 -38658
7299c8658L0347L0613L2633N1031m477p4011j3752n0605l9968M7110k6027k6220
$$ -38658 -8311 22302 54935 105966 101489 27478 13726 -36879 -76847 -29737 -55764 -81984
7287h1984N2031o68p405k4839K6369N5221j5569m5633Q28J9642O1478J5015m5737
$$ -81984 -29953 -30621 -38026 -62865 -36496 18725 3156 -42477 -41649 -22007 39471 54486 8749
7274H749N7082j5495m3365j9145m2365k3506o755K9620O601m212L766N095K3591
$$ 8749 65831 50336 6971 -12174 -54539 -78045 -84800 -55180 -48579 -52791 -49025 -43930 -20339
7261b0339l6914J4941J3612Q8267K0988n0776n2000L8053l3809m4518k6713k6280
$$ -20339 -57253 -42312 -28700 59567 80555 29779 -22221 15832 -17977 -62495 -89208 -115488
7249a15488j2912J5701L8824L5328k7266k7180J2048p019N3304n0983l5421L848
$$ -115488 -128400 -112699 -73875 -38547 -65813 -92993 -80945 -87964 -34660 -85643 -121064 -117216
7237a17216K0735O6532M2408j5001m8534L6199p7002p1671L8694K1511O5017L4902
$$ -117216 -96481 -29949 12459 -2542 -51076 -14877 -91879 -163550 -124856 -103345 -38328 -3426
7225c426J3190M710O1320K6825n9853m4869m188k3187j9730N1018J6430N08o1467
$$ -3426 9764 14474 75794 102619 42766 -2103 -6291 -29478 -49208 1810 18240 18748 -42719
7212d2719M534M1427M4523L3773n6930o3740K8996K3682N0800j7026j7025L8379
$$ -42719 -38185 3242 47765 81538 24608 -39132 -10136 13546 64346 47320 30295 68674
7200F8674J7046p5364n4059k8966N8974Q106k9212m0883N1518j2521Q08J8720
$$ 68674 85720 10356 -43703 -72669 -13695 -5589 -34801 -75684 -24166 -36687 -35879 -17159
7188a7159J7591k1142n6185J2137N6012K8338N317K578K2559j6663l2062m2004
$$ -17159 432 -20710 -76895 -64758 -8746 19592 24909 27487 50046 33383 1321 -40683
7176d0683n1731o998K3088R2906L4449q799L3101j7605n8672j9252K8253j503
$$ -40683 -92414 -99412 -76324 16582 51031 42232 75333 57728 -944 -20196 8057 6554
7164F554k2279k5162n519J604k0329M989k6634m9541J0970O9701K1580L631l2212
$$ 6554 -15725 -40887 -46406 -44802 -65131 -60142 -86776 -136317 -125347 -55646 -34066 -30435 -62647
7151f2647k7189R019M4959K7494m5907J8013k1834K3359j1776l0595j7932M7829
$$ -62647 -89836 -80817 -35858 -8364 -54271 -36258 -58092 -34733 -46509 -77104 -95036 -47207
7139d7207O6155J2328j8154N6432L960k0129j0987m0801J011l684k6062J2708
$$ -47207 18948 31276 13122 69554 73514 53385 42398 1597 2608 -1076 -27138 -14430
7127a4430N4101j3779j3914j0763M7695J7153p4332o2282Q483K7478J9729k0892
$$ -14430 39671 25892 11978 1215 48910 66063 -8269 -70551 -62068 -34590 -14861 -35753
7115c5753K6394j1924k6218K5759j3850L3539J8718m0721l0433M4930N0840K8741
$$ -35753 -9359 -21283 -47501 -21742 -35592 -2053 16665 -24056 -54489 -9559 41281 70022
7103G0022k036P805k2477N0089L7026K8397m5300l1121m6909l9617K3537L6336
$$ 70022 67986 75791 53314 103403 140429 168826 123526 92405 45496 5879 29416 65752
$$ [...]
##END NTUPLES=NMR SPECTRUM
##END=
