##TITLE=XTC-1731a_2
##JCAMPDX= 6.0         $$ Bruker NMR JCAMP-DX V2.0
##DATA TYPE= nD NMR SPECTRUM
##DATA CLASS= NTUPLES
##NUM DIM= 2
##ORIGIN= BRUKER
##OWNER= patiny
$$ 1.79 TOPSPIN		Version 3.0
$$ 2012-05-20 21:51:42.456 +0200  patiny@icmbsg005
$$ Compression mode = diff/dup
##.OBSERVE FREQUENCY= 400.131578657915
##.OBSERVE NUCLEUS= ^1H
##.ACQUISITION MODE= SIMULTANEOUS (DQD)
##.ACQUISITION SCHEME= Echo-Antiecho
##.AVERAGES= 4
##.DIGITISER RES= 23
##SPECTROMETER/DATA SYSTEM= spect
##.PULSE SEQUENCE= hmbcetgpl3nd
##.SOLVENT NAME= D2O
##.SHIFT REFERENCE= INTERNAL, D2O, 1, 7.286523
##AUDIT TRAIL= $$ (NUMBER, WHEN, WHO, WHERE, PROCESS, VERSION, WHAT)
$$ ##TITLE= Audit trail, TOPSPIN		Version 3.0
$$ ##JCAMPDX= 5.01
$$ ##ORIGIN= Bruker BioSpin GmbH
$$ ##OWNER= patiny
$$ $$ /opt/data/patiny/nmr/XTC-1731a_2/14/pdata/1/auditp.txt
$$ ##AUDIT TRAIL=  $$ (NUMBER, WHEN, WHO, WHERE, PROCESS, VERSION, WHAT)
(   1,<2012-05-20 21:51:40.518 +0200>,<patiny>,<icmbsg005>,<go>,<TOPSPIN 3.0>,
      <created by zg
	started at 2012-05-20 21:29:33.427 +0200,
	POWCHK enabled, PULCHK disabled,
       configuration hash MD5:
       77 C7 B7 C4 10 F4 BA 30 64 2E BB 52 82 F2 DA 41
       data hash MD5: 4K * 128
       84 69 18 A4 00 DF 7E 77 64 45 B8 A8 3B 15 98 85>)
(   2,<2012-05-20 21:51:40.579 +0200>,<patiny>,<icmbsg005>,<audit>,<TOPSPIN 3.0>,
      <user comment:
       ICON-NMR User ID: patiny
       data hash MD5: 4K * 128
       84 69 18 A4 00 DF 7E 77 64 45 B8 A8 3B 15 98 85>)
(   3,<2012-05-20 21:51:41.498 +0200>,<patiny>,<icmbsg005>,<proc2d>,<TOPSPIN 3.0>,
      <Start of raw data processing
       xfb same F2: SI = 2K WDW = 3 SSB = 4 FT_mod = 6 PKNL = 1 F1: SI = 1K ME_mod = 2 NCOEF = 32 WDW = 4 SSB = 2 FT_mod = 6 PHC0 = 0 PHC1 = 0
       data hash MD5: 2K * 1K
       F1 D5 06 F2 A1 25 E3 85 5F 30 F3 5E BF 26 1C 93>)
(   4,<2012-05-20 21:51:41.610 +0200>,<patiny>,<icmbsg005>,<proc2d>,<TOPSPIN 3.0>,
      <abs2 F2: ABSG = 5 ABSF1 = 7.286523 ABSF2 = 0.6042026
       data hash MD5: 2K * 1K
       7E 75 0D A6 5E 43 24 66 78 3B 84 CF 5F 16 07 1A>)
(   5,<2012-05-20 21:51:41.786 +0200>,<patiny>,<icmbsg005>,<proc2d>,<TOPSPIN 3.0>,
      <abs1 F1: ABSG = 5 ABSF1 = 210.754 ABSF2 = -11.10083
       data hash MD5: 2K * 1K
       04 24 08 52 B1 07 F8 07 55 9E 87 8C 9C 8C 4F 9D>)
$$ ##END=
$$ 
$$ $$ hash MD5
$$ $$ 25 25 71 7B B2 4C 81 00 4F DA D2 C8 82 03 C7 15
##$RELAX= 
##$RELAX= 
##$RELAX= 
##$RELAX= 
##$RELAX= 
##$RELAX= 
##$RELAX= 
##$RELAX= 
##$RELAX= 
##$RELAX= 
##$RELAX= 
$$ Bruker specific parameters
$$ --------------------------
##$DATPATH= </opt/data/patiny/nmr>
##$EXPNO= 14
##$NAME= <XTC-1731a_2>
##$PROCNO= 1
##$ACQT0= 1000000
##$AMP= (0..31)
100 100 100 100 100 100 100 100 100 100 100 100 100 100 100 100 100 100
100 100 100 100 100 100 100 100 100 100 100 100 100 100
##$ANAVPT= -1
##$AQSEQ= 0
##$AQ_mod= 3
##$AUNM= <au_getlinv>
##$AUTOPOS= <49 >
##$BF1= 400.13
##$BF2= 100.612769
##$BF3= 400.13
##$BF4= 400.13
##$BF5= 400.13
##$BF6= 400.13
##$BF7= 400.13
$$ [...]
##$SIGF1= 7.286523
##$SIGF2= 0.6042026
##$SINO= 0
##$SIOLD= 2048
##$SPECTYP= <>
##$SREGLST= <1H.DMSO>
##$SSB= 4
##$STSI= 2048
##$STSR= 0
##$SW_p= 2673.79679144385
##$SYMM= 0
##$S_DEV= 2376901
##$TDeff= 4096
##$TDoff= 0
##$TI= <>
##$TILT= no
##$TM1= 0
##$TM2= 0
##$TOPLEV= 100
##$USERP1= <>
##$USERP2= <>
##$USERP3= <>
##$USERP4= <>
##$USERP5= <>
##$WDW= 3
##$XDIM= 2048
##$YMAX_p= 225465534
##$YMIN_p= -285661149
##$CURPLOT= <Cups-PDF>
##$CURPRIN= <$Cups-PDF>
##$DFORMAT= <normdp>
##$LAYOUT= <+/2D_inv.xwp>
##$LFORMAT= <normlp>
##$PFORMAT= <normpl>
$$ Bruker specific parameters for F1
$$ ---------------------------------
##$ACQT0= 0
##$BF1= 100.612769
##$FnMODE= 6
##$NUC1= <13C>
##$O1= 10043.8343986724
##$SFO1= 100.622812834399
##$SW= 221.832681201688
##$SW_h= 22321.4283611104
##$TD= 128
##$ABSF1= 210.754
##$ABSF2= -11.10083
##$ABSG= 5
##$ABSL= 0
##$ALPHA= 0
##$AQORDER= 0
##$ASSFAC= 0
##$ASSFACI= 0
##$ASSFACX= 0
##$ASSWID= 0
##$AUNMP= <>
##$AXLEFT= 0
##$AXNAME= <F1>
##$AXNUC= <13C>
##$AXRIGHT= 0
##$AXTYPE= 0
##$AXUNIT= <>
##$AZFE= 0.1
##$AZFW= 0.5
##$BCFW= 0
##$BC_mod= 0
##$BYTORDP= 0
##$COROFFS= 0
##$CY= -3
##$DATMOD= 1
##$DC= 0
##$DFILT= <>
##$DTYPP= 0
##$ERETIC= no
##$F1P= 210.76350402832
##$F2P= -11.0913240743493
##$FCOR= 0.5
##$FTSIZE= 1024
##$FT_mod= 6
##$GAMMA= 0
##$GB= 0
##$INTBC= 1
##$INTSCL= 1
##$ISEN= 128
##$LB= 0
##$LEV0= 0
##$LPBIN= 256
##$MAXI= 10000
##$MC2= 5
##$MEAN= 0
##$ME_mod= 2
##$MI= 1
##$NCOEF= 32
##$NC_proc= -11
##$NLEV= 6
##$NOISF1= 0
##$NOISF2= 0
##$NSP= 0
##$NTH_PI= 0
##$NZP= 0
##$OFFSET= 210.754
##$PC= 4
##$PHC0= 0
##$PHC1= 0
##$PH_mod= 1
##$PKNL= no
##$PPARMOD= 1
##$PPDIAG= 0
##$PPIPTYP= 0
##$PPMPNUM= 2147483647
##$PPRESOL= 1
##$PSCAL= 1
##$PSIGN= 0
##$PYNMP= <>
##$REVERSE= no
##$SF= 100.612769
##$SI= 1024
##$SIGF1= 210.754
##$SIGF2= -11.10083
##$SINO= 0
##$SIOLD= 1024
##$SPECTYP= <>
##$SREGLST= <>
##$SSB= 2
##$STSI= 1024
##$STSR= 0
##$SW_p= 22321.42836111
##$SYMM= 0
##$S_DEV= 2376901
##$TDeff= 256
##$TDoff= 0
##$TI= <>
##$TILT= no
##$TM1= 0
##$TM2= 0
##$TOPLEV= 0
##$USERP1= <>
##$USERP2= <>
##$USERP3= <>
##$USERP4= <>
##$USERP5= <>
##$WDW= 4
##$XDIM= 128
##$YMAX_p= 225465534
##$YMIN_p= -285661149
$$ End of Bruker specific parameters
$$ ---------------------------------
##NTUPLES= nD NMR SPECTRUM
##VAR_NAME=  FREQUENCY1,    FREQUENCY2,      SPECTRUM
##SYMBOL=    F1,            F2,              Y
##.NUCLEUS=  13C,           1H
##VAR_TYPE=  INDEPENDENT,   INDEPENDENT,     DEPENDENT
##VAR_FORM=  AFFN,          AFFN,            ASDF
##VAR_DIM=   1024,          2048,            2048
##UNITS=     HZ,            HZ,              ARBITRARY UNITS
##FACTOR=    21.7982698838965, 1.30556483957219, 1
##FIRST=     21204.543296753, 2672.49122660428, 262388
##LAST=      -1095.08679447308, 0,           1514885
##MIN=       -1095.08679447308, 0,           -285661149
##MAX=       21204.543296753, 2672.49122660428, 225465534
##PAGE= F1=21204.54329675
##FIRST=     21204.543296753, 2672.49122660428, 262388
##DATA TABLE= (F2++(Y..Y)), PROFILE
$$ [...]
##PAGE= F1=5793.166488838
##FIRST=     21204.543296753, 2672.49122660428, 561052
##DATA TABLE= (F2++(Y..Y)), PROFILE
992 519160 -1162911 -1799700 2728487 -1393680 3369998 2053652 5943989 -442741 4020972
982 -2033063 1793911 945195 1860170 643292 -5281118 5368689 1542821 -6278101 -1163536
972 2244135 2175424 -833260 3080458 881113 1245330 -251930 2687682 5464552 -101832
962 -190694 3668774 -5666337 987864 1537785 -5698688 -2169339 -1224008 -2499399 -893764
952 2174128 741516 -1816814 1674842 1957479 693787 299968 -3287959 354561 -2696405
942 926311 -6608520 4582366 -460487 1294847 1469999 -3241197 3339570 -1717099 84774
932 2147618 -4616835 1538253 3833970 -3548835 54095 407882 -1467743 1387424 -1591672
922 -1724481 -1478742 5055602 1406155 -1527965 -1963522 -873182 -264604 2544700 -4594092
912 830286 369735 1389989 -3817299 -1937536 -528857 -4669901 -1125816 -1895387 -4041527
903 -4041527 1016842 -1977888 1947260 4172812 -15994 -1985591 -1903002 -4267888 2094699
893 -1906707 -171883 3544564 2370942 -1763574 1180087 -2777619 3312930 448959 -4547990
883 -3594062 4923953 -2069136 -1083601 1053423 703923 51162 2263471 -1771599 1057535
873 -576231 2580681 446558 -3111589 -476516 -1698997 -217814 -5310831 329526 491219
864 491219 -671629 5640509 3843550 -532386 1105304 2611354 5399522 -3672142 4471052
854 1952090 2015129 -3924437 2466897 -2437145 403848 1304044 1682227 -2431601 3107317
844 4386523 -8859690 -1511834 -841318 -734456 1691114 -3278248 6603384 -19026 -2187241
835 -2187241 -3016527 -2231453 -1403796 674720 -2466200 -1064919 4514005 -7933940 -2617368
825 -1470136 2818620 -1118487 -613283 -446677 -714727 1716781 -729868 -4125512 751333
815 361504 394433 -7316229 -713132 -5240407 -113611 -80768 6541815 -307299 -1176624 2508860
804 139216 -1163016 -233157 1028539 -1295405 -702128 867437 848615 5604889 -5593695
794 2039635 -1768428 -1102050 -985223 2443495 3676218 -1748156 1470901 431134 3305757
785 3305757 -3264577 -1307294 3368053 -343174 1543002 -745283 2113321 -1715685 2128958
775 -3648526 881740 -3906025 4328054 3049520 -4266312 1784839 -273288 3252035 2818475
766 2818475 -1633351 -694739 -3421862 -1879222 2503875 -3814367 2705850 -154748 -2138740
757 -2138740 -472215 -1180531 -4064591 3845796 -1228403 218513 -3018627 -286175 -3726751
748 -3726751 -2110006 1190228 -492774 517768 -1845345 2769337 -495253 2923072 1238590
738 -3031846 3195684 2951816 -3165243 2593138 1126686 -1919306 -18724 -6148026 -8108422
729 -8108422 3680368 -1474703 1142185 -1109947 -201522 -586771 -2723929 2256580 -826976
719 1470051 2826395 6112382 486292 2243260 -3013122 -288593 -8382965 -2938355 -4761391
710 -4761391 249046 3503764 12755879 2814793 1078356 5263561 991218 -8232620 -6703680
701 -6703680 -7720715 -14285045 -8649936 1509184 12606717 5171769 12596752 10487721
693 10487721 -1357734 -2633578 -2567372 -2341885 -6494771 2085593 -1726844 2565533 -4966081
683 4686700 1898410 5993908 -2810545 903108 -1572648 1498966 -314600 903901 -1888284
673 861327 5590079 3990738 324605 -7429348 -10852653 46204 -12184866 -3356376 6977493
663 5392137 13118001 3112782 6549667 2377949 202247 -7539113 -3014419 -1965020 -16031670
654 -16031670 1241506 -598758 -1779321 3334857 -1962923 1777173 -3779571 503436 -142625
644 -857056 -5292302 -1445920 -300768 2063079 2072443 3888104 -6228332 1482414 3162182
635 3162182 -126738 2234218 2490029 1680663 1275928 -5416447 3408825 1179487 -4962590
625 7591235 959107 2355013 2605975 6714599 7432680 11155095 19042498 -48697543 -71528236
616 -71528236 -29727455 55147276 17858110 2580811 2563123 6273791 4126965 2633993
608 2633993 11026945 -1109719 -5876570 2970032 -225065 -2304113 3906482 -1706663 -4038061
599 -4038061 8121322 406151 -1445584 862572 -732828 1107369 2119221 -2841716 3837878
589 819511 -2894579 -64740 -1172041 1322836 240823 1132376 1400888 -2611854 -1748208
580 -1748208 -600986 1482176 2505076 -372771 -350733 -1061124 813147 830864 479301 -3234364
569 -790286 -2683218 -1654952 -1230272 -3165650 -3382007 -2094873 -3532240 663234 4030174
560 4030174 -4336863 3402763 -3839028 3664184 2155170 -2306428 1335031 2775925
552 2775925 1324466 -1325406 2258892 -3905491 -2391498 2153358 -4485157 -713555 -1126576
543 -1126576 1051106 5297863 -2948617 682564 1210764 1545128 -7748012 1925239 -5409801
533 -1196125 4845553 -3738012 1159482 1931249 -4726578 6763531 2554511 -1894659 1051999
523 -885503 -1487892 -1185389 -3067439 747624 499029 158013 1956606 331995 2307350
514 2307350 -2446933 688529 -1371715 3592864 -2308278 1209268 -895059 -692566 76508
504 -268484 -1910403 -2099721 3596346 -1187821 1691166 -2471500 7554427 218125 1380373
495 1380373 -565144 1855002 -4372867 342914 1449040 2703420 2401411 -304123 -1692473
486 -1692473 4341813 -502857 2754708 -2376989 -1974662 4427385 3334321 1258423 7007001
477 7007001 1556934 -1691836 1734086 -1832841 1102041 989966 -820508 1834872 -1683183
467 -1035456 3399980 1739805 -1801451 -3021121 -84234 604858 -1064914 -4053854 3071478
457 5451519 1876859 -4107523 -1115277 2242566 -2231553 -1454289 5220428 722770 677191
448 677191 -2280969 -601194 -3233485 -939002 -1261979 3366149 1683590 -3292821 2902015
438 -3915253 2703453 651586 713059 3378318 -2830458 1867034 5307386 -354859 -111620
428 -593236 -6393155 -2751660 3670523 2989224 63508 -190490 801958 -313631 3224747
418 -1114925 2330686 3065480 -1697191 580365 -986720 1253664 -4270982 2613551 254760
408 4072140 3597484 -3248433 3169771 4196031 -1466395 4396867 -1571850 -4139889 2270243
398 -720489 3394035 -10172 886273 2696967 -4727878 3185982 232588 -6140604 -431830
388 2460851 -2825008 1980133 4371611 5953062 -1628127 827910 -4752929 1630089 -1189114
378 399715 -864937 1214972 2096291 -547783 1631939 2609846 -4399190 4478923 -1629742
368 -1782774 -1276026 1377039 2846431 2374063 -421776 -1846975 1098914 -6209575 -1301161
358 -1302861 3006158 505087 693265 2030164 718408 1656592 -316227 -2032619 -258229
348 2543695 -1597027 -222787 225075 -1625644 -2033211 -2612081 -1375811 3519070 -3430245
338 1557785 -1634274 2156069 -3016077 1213578 3383963 -621954 -1866128 -4382862 17745
328 3427080 374813 -3426804 -673427 -1851947 -1001845 5115475 -1338049 4782547 -1886447
318 -2018894 2070911 1734125 -1635657 -529498 -2998517 -468385 2263606 -2282623 2885698
308 -3027396 3696691 1867019 -448550 -582350 1959178 -1924605 2516177 3076479 -117378
298 3516108 -5376805 6546027 -1286504 1236351 4252371 1669904 -2643226 -2051823 -414581
288 2461796 176394 -1417683 -3732529 -2087419 1906322 180307 3784105 -1355451 2193796
278 1998817 -5501357 2667346 234859 2437777 -3993203 -396366 786414 -2987264 -2588892
269 -2588892 -2264042 -1157947 6188126 -4853610 -1707261 95877 1984774 -1599990 -4224762
260 -4224762 3791422 -3190352 -3968380 930097 -1852654 4743624 -512788 -1148329 -631205
251 -631205 -2366761 855271 -412519 1451568 3551056 -1139662 -1158418 169631 1678986
242 1678986 1743434 -3659761 2289328 2629803 -2362172 676343 -3176564 -93483 -2180307
233 -2180307 -3571452 -3869899 1785645 259842 -4112531 -1714823 -629717 -4186642 2556686
223 -1213964 1118026 -1751472 -2264671 3051095 1801389 -3546463 745340 -1128811 -670840
214 -670840 -3933235 -387737 -1374697 5278166 -1817271 3034208 542094 875897 -156548
204 794727 -4234382 3122300 181611 -1040588 -4993539 -2243736 -3894699 4236801 -4007116
194 983600 -1064572 -2946115 212786 4317808 -4720241 1740455 -4090496 -13196240 -36576886
185 -36576886 2161310 12350699 33413318 39312812 36258249 3190409 -20979092 -33554770
177 -33554770 -34308103 4953360 799603 4226622 1368816 -2952716 2016697 3269951 -593425
167 -4899088 4521626 2113964 -6335167 -1191610 -399570 -1517269 805535 3588670 5846947
158 5846947 1565297 -834647 3632453 -1988977 -2877899 -411852 1654679 -777187 1885301
148 1723155 -5992492 5139924 -1798542 2037684 2180789 -1814913 252133 -1909182 1908638
138 1309100 -4489503 2858718 -2153362 315418 1344815 57376 1197639 238412 -1954052
128 -3703122 2954170 -5136071 2272321 -1217273 -1982054 -1986721 -596091 4715918 1333779
118 -905247 293834 -2792407 4574821 -2651198 -2015611 1608879 784891 282463 2269991
109 2269991 2756510 1242729 623798 -1348500 1858244 1468013 -4350439 1288056 -1421405
99 -1542200 -782235 2263023 -2042013 3211150 754452 -2965976 -717320 2216034 2799748
90 2799748 870012 1116686 -1456430 -2295361 -4590753 -2025133 -1249489 -1824502 6471758
80 -1499855 1862834 -3197285 641708 -816265 7786193 -3708494 1823807 -3768079 7036822
70 -4762853 -1210020 1639740 -187721 -922496 -3198026 2794173 7884889 -2067996 -3970512
61 -3970512 2588695 -1934797 414828 2138986 -248468 -5130396 712134 -1416086 -3309747
52 -3309747 6969047 946050 -3982231 3520998 862125 -4284143 4095931 -6490426 1696222
42 3800200 3326165 5962540 1537859 -1089986 3249424 -627134 -3323040 3338584 4105455
33 4105455 3841758 -7130983 -2918974 4956099 4278128 -220725 -2838596 211691 2738913
24 2738913 3258571 146097 -2246667 3580068 2622807 547177 -4270290 1529959 -1414606
14 -748800 -799113 -5153652 -515142 -34073 1138311 1681531 1150391 -277479 -1338391 191785
3 4224155 -811393 -413428 606460
##PAGE= F1=5771.368218954
##FIRST=     21204.543296753, 2672.49122660428, 1057161
##DATA TABLE= (F2++(Y..Y)), PROFILE
2047 1057161 515720 -28551 -191816 4186733 -2251221 -494189 -43668 -1409235 1702690
2037 440930 3455366 -748939 1413372 -1482240 3427194 -4455794 2996757 -1742672 -704034
2027 -5265150 1136311 2055201 1202554 -2906580 572784 906530 105736 2891052 -1673981
2017 1887761 2554712 -4423647 2377371 -732039 2990909 -5440667 -33429 -2128588 -4824087
2008 -4824087 1646467 1923915 -400479 -346212 2131503 -5120492 3500442 530995 -135397
1998 2453644 2560141 1367928 -3111612 -1261478 -4028642 -312472 -1045920 4643068 -2384567
1988 2319502 -931401 2560393 -1551133 -3329052 4718169 -3325866 4058369 863934 2017504
1979 2017504 -1960954 -1476341 -5343716 3913792 3983065 -2309111 -3439997 322373 -2719284
1969 -456350 -2672061 -2218566 -1705812 1840410 702289 1655065 3559019 -7025505 4382363
1959 -2881358 2036005 -1653222 -515599 4501804 5645156 -1155124 -260049 268509 -4062479
1949 224675 -265561 4274781 3323749 -2379831 -72346 -29832 318825 3832834 -3512429
1939 1507770 -710150 -2569485 6564748 404020 3211501 -844484 2360489 -2189247 -2348403
1930 -2348403 2392998 1916852 -956859 705316 -5313112 7869050 -2149324 -1643981 425744
1920 215741 -2128433 964243 1279414 1014461 934856 -1732951 -1594865 -3192635 1052276
1910 -826355 324087 -2907072 2715047 -3757901 3830475 -2020786 -481319 901816 -998550
1900 726643 -1138093 -1373986 -2319029 1989002 1912884 72030 -3176766 2916723 843048
1890 3362804 -2231521 -981637 -460426 4792940 2136633 -1750920 1063210 -551294 -6585403
1881 -6585403 6062460 -683535 -2706507 -3701131 870189 -4023385 -1305192 5917063 -2040777
1871 68483 -1151288 -1674285 5738228 3391697 591668 -2420232 1165818 2187895 884317
1861 2500758 -1173753 -2815089 -3612426 -608177 577834 827554 1366175 -3070084 4290566
1851 -2104202 1404437 -706171 2999106 2578359 217432 3916246 -656536 -3385670 2085703
1841 3031401 -1152587 2153357 1222489 -1856992 -692246 -2953244 -1981145 4589979 952684
1831 1255697 -1474778 -4162793 -562479 -2438425 -206393 1123550 -1078873 1514068 -2466122
1821 2185758 -3469885 875992 -2993575 6349390 -6027701 -1387485 6220023 -1787391
1812 61320 -4678140 -1056283 830257 -1509480 4581387 2174361 -4479465 -2323101 554469
1802 6831759 -3302261 1247088 606079 1591822 277356 1267996 -4672062 3238720 -2957222
1792 939044 1954915 -304558 -314023 3172296 -1835751 5760907 -2464570 4194954 -4706705
1782 3178007 -4550494 2124379 1730465 126749 7497647 -5708770 638214 -1524032 -2703685
1773 -2703685 764979 4489865 -158435 -1029635 -532035 -1299741 2380298 2296614 -306507
1763 3301653 5838679 -747496 -3206628 -783006 -1435221 2092310 -2251344 727197 435251
1754 435251 4518034 3361258 3207257 -1396075 2163250 4386831 974594 -724648 1063651
1744 4340261 -625071 105819 3754542 -1070590 -2202469 -126579 -839342 864415 -265015
1734 -2426603 -4622052 5300147 -42699 -900547 -828055 -1146343 2759501 -127165 -2767857
1725 -2767857 -2662697 1616920 1019216 1270669 2379092 -478990 -857334 -1441863 551503
1715 -1578928 3873501 -4013630 -5593376 -1805933 716337 -4021627 -1961411 1483557
1706 -4439438 -1650394 -1022380 -1257670 -1782650 -1745753 321612 353699 -2426526 1889630
1696 -190795 101843 3758015 -3237253 363152 2183807 4036513 -2785510 -7106618 -46983
1686 917545 -397705 976403 328803 -2407769 -273145 1587715 2768198 1924702 -398888
1676 1565953 -3133891 168696 1946376 2082170 -3244867 4637224 -3614743 1106402 4806149
1667 4806149 -552848 -212711 -433477 -1919286 -46686 -610817 -6613844 1127452 -743020
1657 -1136963 4624483 -1227027 -1124609 2013849 -2159090 420735 2203172 -574008 26513
1647 -886676 3767483 -7248734 3402095 -3333479 -1885972 286121 1850453 155076 4132414
1638 4132414 -1519809 7635621 -1471698 -3481832 -1054041 -3940559 987116 -1704137
1629 3793179 -2694508 1157363 -1064120 2419484 -1407958 -3394123 2336512 2439254
1621 2439254 691859 2858727 -4190754 -2768708 -3432108 -2692794 -111986 -573443 72576
1611 665679 3287759 3402422 -6592345 3323181 -3843896 -293551 2513654 -260805 2535307
1601 989765 -2707998 4793819 -1368197 825809 347281 3717112 -3702404 4542981 -5063688
1591 -112554 643864 2418916 4765994 488475 -407616 500198 915639 1971403 356089
1581 -2487537 -126947 -896888 -2475103 -4638884 -1963648 265868 141519 4864554 3456282
1572 3456282 -302053 -1762302 -1608456 -2912414 2407408 1197515 -3268960 -851981 3250477
1562 -58865 -7605383 1272146 1943303 454186 -1545535 4507690 144741 -4047917 -1816107
1552 3426786 -2938417 2827743 2445330 -1437565 -1853614 2530610 -1731160 -443841 675967
1542 -700923 3303032 294683 402817 912429 -535662 3237520 -873269 3108145 -520490
1532 -1408723 -2248044 -1379279 -128884 -426226 -3025072 3768631 383782 1130746 2555694
1523 2555694 1989009 -3208588 1742674 -299454 -869143 1443154 -1551704 -1685419 657230
1513 4679981 -95180 -409973 -2455645 882056 656468 -1831019 756939 -3509084 631300
1503 -1057298 4186429 -525525 -2785457 1348461 -2741490 1641321 -4226432 3285256
1494 -2969357 4540554 7004816 -1613741 1138561 1286237 -393194 815179 -3169049 -3944462
1485 -3944462 3326432 -5853781 1988821 -247694 -2693852 -1571234 3370805 -4608062
1476 934398 -1455159 -837723 54504 6634301 599439 -129101 3977846 622440 1290619
1467 1290619 -7611228 1051128 156407 -3194875 -526581 -799202 1791246 185227 -4766283
1457 473355 -2258825 2935985 -3466194 9473488 -1461507 541340 -1822782 2285362 1310391
1448 1310391 -2852292 2999355 -550984 -618472 943031 55487 479038 -2944803 5210130
1438 -1890775 624151 2459123 -3067133 768949 -751211 2118283 -2940108 -71287 1227355
1428 3046239 286729 -1992336 533136 2717690 1347174 2745027 819973 -27158 1242519
1418 -98269 -239210 -91952 -2038014 1903868 -2074775 309254 4181228 499406 1790059
1409 1790059 -701330 4790710 -2629656 -1914604 -1710075 -985222 -2084468 3209659 -5883621
1399 5411933 1606667 -7358995 2289816 1657283 -463698 2882731 1065111 5845586 754655
1389 -2729325 -2775019 312527 341526 1394597 -2990681 -3330228 2323634 935606 -4348088
1379 -4517425 2054247 297538 -487952 871083 -1559422 -2514480 -1271479 4756915 250683
1369 1856897 -1853080 -1490427 -2800858 951560 -1190058 2952258 463114 1376896 501782
1359 -4064254 2833158 -1782384 -1251785 2532730 -226782 2657173 6472840 -6008725 -275374
1349 -7571328 4085060 -1054805 -1082470 1535970 1303555 -1384139 5618375 -3136778 -3717715
1340 -3717715 8258900 -1544930 75567 -1551528 2317129 479569 4610424 -376019 259361
1330 229178 -461837 4119572 -244990 902355 -2368080 -4022909 -2777597 4968311 871013
1320 -3759938 359258 -1858501 2529527 -2317587 2091679 -5189008 -4301076 -70335 -1258763
1311 -1258763 340064 1869287 -3804405 -1241448 3202723 -3474802 -468623 -424487 -636215
1302 -636215 -3654671 1525140 -183207 433938 -2649594 1265478 741664 -851523 -2764572
1293 -2764572 -28423 2767406 754450 -1580517 3494112 -7625870 1759328 3927030 -1024535
1283 438851 -5325137 1120656 35129 1238639 -2902441 10544 969178 2329870 2426363
1274 2426363 -4549674 4044055 -3367073 3469706 1076339 -3930861 -2108055 1717452
1265 -3209344 327705 452812 402 -1225481 -3553163 2583866 -2742998 3072292 -388483
1255 -405547 -1784854 4019591 -157220 3826658 197981 -703006 2684049 -625450 -645544
1246 -645544 -4361461 2261623 2820900 -3891641 3630356 -515008 2452820 -1505759 261622
1236 -3249548 -58474 -1696327 264440 49866 -4063326 2345186 -4919705 5909138 -3595545
1226 2744783 1285379 -1720581 2382115 3696018 586363 -3821474 -2867208 674691 -1934096
1216 -993624 -588967 1271836 2899527 -1266034 -798425 912930 2135056 2040985 -3409810
1206 -314334 3023977 -690922 1682404 593977 -3202490 -141432 -2109927 1083484 2903395
1197 2903395 2175621 -4081109 2566321 1442748 -3184530 -2062625 -1487686 1109991 -108418
1187 -145295 67697 -288528 526977 202088 -700320 1172603 -205600 -1282772 971975 573791
1177 573791 -1306932 1352330 2176385 2953687 740816 299690 1404328 -833027 -1683653
1168 -1683653 333741 -462330 -843086 -4728567 3249301 -4316336 2977415 4224966 260381
1158 -388816 3269392 -6339845 2076831 -2422567 766521 1093705 1410578 5018191 -593022
1148 3111515 4117936 1175983 -979441 -3339398 -2134201 2291648 -1425404 2111522
1139 -378632 4438125 1867372 1454697 2095753 -930299 1331394 2613308 640692 3078541
1130 3078541 -310655 4373877 -4994668 698964 -3449325 1486 -1102555 -3210655 -1454170
1120 -2614089 1007957 -2400737 3208947 186592 -4647314 343348 1709019 -5001625 2066393
1110 -1202356 -2625569 2549720 -4229865 846497 4643555 -1177020 -154814 3724570 4771117
1101 4771117 -4554525 754675 1001061 -4777185 8165554 -1631335 3317017 571219 -3088863
1091 -2612399 -3312016 -105975 -3972962 1071118 -174898 149939 -3163408 2289227 -1532463
1081 -1392258 -602528 -1690583 4052507 -2861399 2114032 3363305 -2822450 -1119745
1072 2515325 -779496 507996 -303526 -2947118 2243401 -2184469 1286973 1239514 -4116883
1062 198249 329664 4358930 -1883397 375764 -2639190 1311864 -5425840 -5837336 108714
1052 -73457 2633394 3456292 4451725 -1723635 -626486 -1198003 -1635172 -4479885 618808
1042 -682609 -2666176 -210913 1961935 -162208 2488424 -2735077 2506986 4080916 -2946089
1032 494678 1053645 981911 -3705538 1938791 2858690 -1170785 -3734448 -497379 1105654
1022 -30870 1507067 2181743 -510811 -4800263 -372928 1396705 -2499313 -1150804 1582436
1012 3214357 -3095112 1118663 -3018029 -3219066 630633 279229 -1061650 2797295 482112
1002 -3430166 -2505208 -3776320 -3312276 2870798 -4863843 430594 -822773 1657544 373753
992 291433 -1839911 -1860832 2280623 -1812460 4069762 2393935 6659652 -469454 4781374
982 -1816028 1163684 162464 1923647 562023 -5175822 5800966 1960640 -6287804 -1119551
972 2558628 2880336 -50581 2601716 731168 1525252 -189533 2945694 5272978 69321 -90419
961 3766223 -4975978 507581 1486589 -4914506 -2932421 466961 -2013565 -1407127 2665821
951 702529 -1511287 2258912 1826106 980486 -278634 -3769942 159757 -2584837 570434
941 -6736707 4061262 -219712 659918 1275121 -2753165 3119073 -1385491 434771 1976952
932 1976952 -4793000 1938100 3975301 -3003653 -260432 486754 -1738207 1250878 -1217150
922 -2685117 -995960 4559858 1497249 -1345932 -2670836 -1148098 16774 2599451 -4659294
912 271240 -122378 1583629 -3502888 -2230213 -620685 -3743287 -1407353 -2515790 -3514771
903 -3514771 951883 -2125861 937461 4215724 33994 -2254751 -2591913 -4156316 1963621
893 -2140368 -732167 3933373 1974889 -819949 232031 -2541804 3389313 1026666 -3660799
883 -3826023 5477902 -2710253 -891884 959543 704294 371893 2261670 -2399120 1236225
873 -722531 2448122 598889 -3617652 -217882 -1463165 194898 -5107581 1086996 982092
864 982092 -996483 4795571 3936189 -685672 1121622 2116034 5685009 -3864523 3814805
854 2426323 1912740 -4033637 2660047 -2276207 1103878 1215862 1440262 -2924984 3328776
844 4838784 -8585121 -1846896 -1255889 -1345343 1300957 -3280050 6158705 -86059 -2171647
835 -2171647 -3121762 -1786630 -1926844 155798 -1424434 -1989455 4662566 -7935696 -3056009
825 -807333 2727951 -1099591 -726491 -273822 -1590751 1503915 -621470 -3755333 481473
815 -178561 854409 -7286088 -918902 -5152578 486357 78327 7493801 -1533993 -266314
805 2161067 423290 -14639 -471282 1321802 -219187 -2011024 1825276 1323317 4796327
796 4796327 -5298659 1894837 -2249793 -88552 -1127359 2093875 4195672 -1872851 1572488
786 851361 3351024 -3327693 -1095141 3530321 -783341 2079705 -564085 2495097 -1047234
776 2203971 -4119249 1243486 -4542145 4872390 2751101 -4064382 1164916 -162745 3104845
766 3250816 -173845 -547305 -3228360 -2295028 3310160 -4639331 2688937 154740 -2193310
756 -427803 -1744663 -4388075 4319617 -1307275 -107795 -3737937 -601955 -2537696 -2655640
747 -2655640 1605120 -894867 346300 92795 2739106 -595068 3299471 1696749 -2979723
737 3573606 3001134 -3385433 2557516 1105544 -1710269 -320710 -5744601 -7947290 3177986
727 -1344131 919244 -557329 327220 -547831 -2604845 2476891 -1242700 1238019 2771825
718 2771825 6125838 -44960 2910355 -2660738 -1950078 -14569175 -4152391 -6418468 -995617
708 8281032 17346080 5730291 3254854 5741846 1117908 -9689815 -12933083 -12025485 -17175978
699 -17175978 -14238959 2548565 19765814 8955364 17173798 14134485 -3130528 -6278772
691 -6278772 -2889101 -2300100 -6224628 1795217 -820909 2630206 -6166553 4991787 1650068
681 7096113 -2863360 1117099 -1389332 1115426 -153223 1465276 -1140680 1588173 9978350
672 9978350 6138506 -2042810 -9256570 -16533849 -1238045 -16700219 -6310391 7849368
663 9752148 19177909 6166104 7326522 2475060 -1414027 -10980266 -3190944 -2848768 -18649804
654 -18649804 1523401 -1956078 335620 5554932 -2046328 1722195 -3965609 738515 -879363
644 260976 -4786311 -1250338 -79763 2280390 2208228 3617360 -6997368 1904707 3204478
635 3204478 -59163 3683985 965627 2107240 864584 -4633744 3392290 1218898 -4201771
625 6628852 438807 2805171 3726302 7807267 12455945 18027135 30072460 -82088215
616 -122232865 -51041862 95233494 31758192 6221470 5167494 7190019 4836338 2953932
608 2953932 11634133 -1026165 -5578389 3001993 -202913 -2128592 4140586 -1527504 -3105553
599 -3105553 7995666 842690 -1791094 759704 -983650 1865185 2731527 -3208052 3395313
589 1323309 -3165562 277030 -1197631 1268060 910368 321458 1436925 -3320343 -1035611
579 31231 2295245 2189364 11046 -711676 -1044745 346042 261264 352853 -3069760 -671415
568 -875347 -2489063 -1006801 -3628680 -3171569 -2015681 -2776670 956765 4714969 -4067726
558 3986986 -3287255 3765532 1731714 -1321261 1038518 2300186 913052 -118647 2542248
548 -3982729 -3169256 3430859 -4314113 -504087 -1634500 1099042 4029230 -2608047 425657
538 2304410 1587534 -8478186 980726 -5165200 -348096 4637078 -3601787 851869 3119666
529 3119666 -3966500 6597414 2102029 -1142236 396181 -571306 -1856025 325245 -3047296
519 253323 351390 -17338 1574774 78175 2491422 -2517636 984294 -2371671 3585239 -2347382
508 906887 -1210047 -184928 289233 9789 -2376996 -1562593 3856634 -1178079 1468116
498 -2554509 7965333 -119552 1936197 -677354 2945612 -4551278 255309 1714791 2627191
489 2627191 1674926 134065 -2501765 4391028 -281372 2766619 -1675749 -1528091 4352289
479 3220203 497948 5781711 1706588 -1525168 296284 -1237704 887493 1126453 -920286
469 997764 -1716614 -832857 3208406 3074492 -1696775 -3057073 507044 766130 -859081
459 -4664623 3631199 4754681 1557542 -3702012 -1120026 2077707 -3123435 -1840758
451 -1840758 4974240 952976 315999 -2443031 -548230 -2814470 -2131940 -1298064 3040714
441 877438 -3936233 3791732 -3037911 2309257 658867 645060 3657840 -3360495 1404385
431 4696700 -344730 -843281 -267636 -6920002 -2742381 4713306 2633161 606212 -28046
421 446851 36898 2874911 -1311741 1681895 2982140 -1501808 340534 -541580 1291089
411 -4792462 2063051 -199654 4635863 3258721 -3912105 2912389 3679086 -1771347 5369179
401 -1524621 -3825668 2134132 -714654 3688915 244124 1317362 1721238 -4739772 3024163
391 106795 -5184080 -1011809 2702088 -2855763 1367755 4177226 7069736 -2562710 774586
381 -4544597 1613382 -1576838 456570 -832621 792631 2774458 -120424 1235567 2786833
372 2786833 -4825805 5117702 -1830176 -1397574 -928783 939483 3909198 2399768 -563765
362 -2407875 1118834 -6136674 -1233950 -1364149 2131265 1239429 336338 1471188 1409455
353 1409455 1380313 -415963 -1817061 121216 1936750 -1818229 758609 103791 -1724049
343 -2330058 -1471803 -2371992 3778169 -3190724 2382720 -1873029 1992064 -3648929 796708
333 4473670 -1636660 -1558572 -5144246 500356 2814938 314601 -3209328 -953977 -1419859
324 -1419859 -1466127 4982360 -1652937 4702763 -1724011 -2223428 2847948 1625001 -2114001
314 163925 -3490646 -661587 1523878 -1946792 3165027 -3313369 3741369 1954649 -1299467
304 -693563 2757938 -2977965 3166337 3383634 -34886 3610885 -5225138 5845920 -831711
294 1319411 3850147 1804357 -2240570 -2072952 -614726 2823953 401398 -1520834 -3589171
285 -3589171 -1895495 2106803 4937 3970047 -2056402 2933921 1906855 -5274193 2032641
275 744461 1927674 -4369535 -676795 428854 -3476745 -2221222 -2455436 -907770 5613918
265 -6092532 -2073101 545466 1882091 -1521809 -5499902 3867186 -3492500 -2713641 -1282476
255 -1774041 5195987 -355372 -1492095 -1514717 -2602198 712206 -621043 575451 4258764
246 4258764 -889092 -506136 -185520 2638089 2075191 -3679620 2252650 2392779 -2284484
236 1177981 -2415254 -325178 -1545633 -3147704 -3840192 1780530 -440619 -5102150 -1808675
226 -478860 -4939399 2031815 -1422612 257894 -235681 -2387474 2535278 1998206 -3758640
216 428579 -1895821 -767468 -4267883 -1396359 -1053197 4648646 -1596020 3427342 -295075
206 685739 -704696 586992 -3614552 3065599 238243 -1072274 -5268061 -2426638 -3881575
197 -3881575 4008658 -3990370 926474 220360 -2117712 702125 3928977 -3882766 1179086
187 -6065525 -24505290 -63703521 3284185 22599907 59786048 62469845 57433351 6730203
178 -31993174 -55524338 -55209703 8740258 1289682 3589500 1264948 -2917628 1486056
169 4268706 -908791 -5482175 3733650 1840209 -6110265 -1298061 -701543 -1697949 975617
159 3255369 5901885 2439359 -2380494 3923853 -1745751 -2546626 -574907 3104178 -1658715
149 1959223 2259697 -6273053 4086523 -1569758 1912279 2352105 -1946384 -934103 -1254922
140 -1254922 935561 1261763 -4065943 2056465 -851944 225259 1633736 -442354 1511798
130 -333963 -2561553 -3197233 3036539 -6265042 2707141 -939092 -2379580 -1354060 -360934
120 3999726 1930105 -1852280 65800 -2454801 4935193 -2719754 -1899820 1536369 1942084
111 1942084 -472236 3251117 3153409 630572 790007 -2091798 1122451 1832896 -4598972
101 1468273 -1824518 -1509262 -1301558 2952250 -2167012 3719869 438271 -3386991 -442308
91 1796300 2802090 1192481 827964 -1394964 -1803092 -4023722 -2983331 -920193 -2237725
82 -2237725 5927334 -1254403 1492587 -2511296 1075759 -618721 7430651 -4220009 2107791
72 -4353892 6882632 -4645353 -1873488 1393563 333755 -2244862 -3107697 3363050 7815082
63 7815082 -1644176 -3704412 2241180 -1518259 559150 1944782 -86685 -4470779 952573
53 -1590943 -3855390 6756210 1125259 -3811735 4057965 545473 -3603245 4171515 -7156055
43 1452480 3747423 3845720 5610384 992866 -1755559 4239145 -1077802 -2252056 2063608
33 4520357 4068276 -7443664 -2848994 5599737 4877935 -682979 -2509020 471561 2665877
24 2665877 3105298 423929 -2241041 2845332 2348217 762722 -4266340 -27606 -1064094
15 -1064094 -1626474 -163163 -4087798 -765842 573330 310250 1586885 869834 -118841 -1462342
5 -1462342 -150075 4771731 -530577 -256356 372815
##PAGE= F1=5749.56994907
##FIRST=     21204.543296753, 2672.49122660428, 1431686
##DATA TABLE= (F2++(Y..Y)), PROFILE
2047 1431686 642904 -39756 -18830 5190312 -2095870 -134577 -48951 -829003 1147110 1005675
2037 1005675 3710041 -1141108 1573114 -623856 4057294 -5143217 1955186 -1655464
2028 -343019 -4896564 -118191 1919081 1661889 -2837907 519423 1469616 -554526 3511301
2018 -1253912 1714677 2918092 -4224951 1968464 -388450 3412456 -5959934 337632 -2490368
2008 -4672743 1067309 2911982 -1475479 -740368 2350802 -4811390 3453054 -74120 2018
1998 1379654 3071560 1868800 -2907467 -3499772 -3595410 -61222 -897423 5118374 -2875699
1988 1678663 282905 1739191 -1891629 -2492922 3513894 -1421211 4410025 862799 1246835
1979 1246835 -1459146 -1542833 -7367798 4145383 2819003 -2295738 -2769529 116018 -2269252
1969 -1695126 -2928586 -2317581 -2002518 1889596 390624 276149 4097410 -5832201 3631859
1959 -3033122 1054357 -911639 -1504797 4551644 5610867 -863854 -568828 -201964 -3650583
1950 -3650583 218453 -294886 3808157 3312055 -2371775 -489418 117946 639091 4146965
1941 4146965 -4603853 1157841 -237316 -2596086 6291227 1017103 3879712 -1457059
1932 2453083 -2611578 -1126570 2147014 1709747 -1617630 281252 -4286417 6801874 -2907210
1922 -961859 1190441 -78677 -2561745 1128691 1280985 1436884 843014 -2345063 -2166932
1913 -2166932 -3099165 645380 -1145644 641166 -3077237 2294924 -3664653 2926860 -1933033
1903 -391804 545748 -680274 1036219 -681880 -1768255 -1020645 1638987 1193551 -651485
1893 -2431666 2931310 1605640 2482520 -2366437 -1246731 -740391 4500936 3118612 -1754776
1883 69755 -825032 -6565534 5846997 -1734464 -1939193 -3728700 1739490 -4409518 -917602
1873 7194176 -2407620 -798415 -1228062 -1737085 4361277 4057723 210413 -1834676 1675850
1863 1712980 1404601 2156905 -183863 -3256310 -3743528 -1003292 859449 143929 1474020
1854 1474020 -2467681 3974165 -1699959 1404822 -1455656 3091161 2764232 1045062
1845 4218148 -1014247 -3158861 2509105 2050823 -1040707 1810760 1930783 -2230440 -427217
1835 -3484988 -1519970 4211571 956045 924841 -2012282 -3520400 43792 -2869982 -421432
1825 1577080 -711605 759263 -1864813 1226506 -2261373 948226 -3062765 4925605 -5799878
1815 -359361 4640117 -906432 608334 -4335357 -1496411 1009131 -1725255 4476285 1978386
1805 -3948339 -1951045 949789 6473369 -4247892 908148 386832 1497741 -674619 1255487
1795 -5236678 3458864 -2809836 1008947 1767983 -263458 334415 3513739 -1297389 6447798
1785 -3373483 4347022 -4824851 2492225 -4969488 1976187 1492003 -373463 8313764 -5979393
1775 1247624 -1757387 -3413982 1189230 4048755 -798004 -675789 -384723 -1944982 316409
1765 2722606 -51207 3361197 5660431 -1146382 -3129557 -859220 -1568771 1823254 -1686148
1755 171446 465653 3764984 2679322 2786136 -1047756 2593684 4400993 1312733 -361390
1745 1592429 4910186 -918759 220840 3599682 -1310135 -1545011 -511551 -1403031 1704510
1735 85759 -2734986 -4659250 4779448 -568113 -921434 -1410731 -257672 3281705 -224684
1725 -2844977 -2280721 790426 1469630 1621050 2729172 -750367 -975674 -1763931 545246
1715 -1826148 3547717 -4043408 -6761676 -1613727 956857 -4531456 -2284091 1581933
1706 -4103725 -1844637 -563658 -805428 -2113136 -1588307 533844 362397 -3468391 2350671
1696 80444 -40593 4186444 -3304816 1129228 1896276 3485111 -3056758 -6321367 -225295
1686 -343846 -550813 686911 309245 -2363685 -276892 1644064 2606218 1758563 -565823
1676 1156920 -2971011 311406 2549606 1429928 -2729545 3816079 -3847645 352434 5296431
1667 5296431 -208820 -1470586 276376 -1727564 215477 -1225761 -6454336 2229643 -2025095
1657 -850003 4005912 -1176580 -1411976 2027782 -1810194 183814 2711974 -422938 -163360
1647 -1341840 4279735 -7597389 3646001 -2930863 -2841995 1650670 1852424 452889 3790085
1638 3790085 -1388176 7391461 -1541973 -2933016 -919305 -3767262 742703 -1263504 2574242
1628 -2265912 544848 -710405 2008194 -1333160 -3649760 1673096 1983837 677777 3161912
1619 3161912 -3249940 -3020056 -3795657 -2962687 196938 -617443 -284486 451537 3410761
1610 3410761 3919085 -5959799 2508142 -3724092 -265964 2396394 -522674 1984977 645185
1600 -2539807 4473642 -945360 749353 192502 3661229 -3763907 4238178 -4405673 -50755
1590 854089 2724624 5077336 -176221 -1177258 817783 519646 2474745 -580180 -1550561
1581 -1550561 -443379 -575306 -2060874 -4827671 -1551311 748474 -179593 4580325 3370053
1572 3370053 -644015 -1393246 -976210 -3010598 2931190 1192364 -3377327 -385547 2702721
1562 -114081 -7626639 972776 1871012 525714 -1535776 3524108 608595 -4023172 -1546666
1552 2999238 -3112447 3498596 1968926 -2378047 -1225515 1421498 -1750838 -320171
1543 1398652 -1684063 3284648 295376 1154922 1088881 -261933 3631133 -452679 3053336
1533 384981 -1174066 -2660224 -1008912 -83768 55928 -3036283 3914591 817912 877684
1524 877684 3325529 1826624 -2754088 1008484 -129861 -636806 1725090 -1431333 -2234442
1515 -2234442 1054064 4631463 -441251 -357840 -2862589 1034766 -936012 -1369127 591457
1505 -4111022 1239011 -793534 5361457 -570453 -2412360 1146048 -1497917 1586562 -4817336
1495 2944982 -2839083 4332821 7388348 -1575962 877072 1244812 -323980 696117 -2591046
1485 -3208983 3862034 -6140160 2686040 -61547 -2639646 -1825129 3251185 -5391471 968589
1475 -2217597 -707111 245845 7044134 -548270 32942 3404337 321454 1244625 -7579937
1465 1093653 -8656 -3300586 -1009584 -301642 3013675 -286971 -4326603 721766 -1534063
1455 3048501 -4081444 8966092 -2024089 837843 -1802744 1721733 2108548 -2622797 2741759
1445 -280288 -1384897 656442 638801 773352 -2734516 5593460 -1471667 1706773 2181352
1436 2181352 -2845032 678896 -226626 1580932 -2228911 -1196130 1975644 2881373 533019
1426 -2374968 1011671 1974465 1532474 3142536 583997 -142072 381959 -372409 -305696
1417 -305696 -152927 -2022074 1734354 -1502364 468740 4099248 25324 2425063 -45111
1407 5818349 -3217488 -2353236 -1866090 -840392 -1457314 2940258 -6221866 5756377 1563797
1397 -7749207 2764135 1907231 1032773 2719612 1075794 5004270 278143 -2160262 -2136558
1388 -2136558 158975 880171 1009222 -2798913 -3044258 2154292 363339 -4072210 -4986111
1379 -4986111 2614549 390467 120487 586024 -1113499 -2610646 -1096048 4622775 645789
1369 964060 -1462718 -1653620 -2353659 1144505 -950882 2887926 -313220 1680032 538861
1359 -4016462 2434924 -1784508 -629023 1589475 326435 1981358 6055362 -5682120 74082
1349 -7253255 3882442 -1215110 -1138636 1232665 1596361 -1527243 4995797 -3621427 -3507499
1340 -3507499 8255410 -1558669 -227498 -2255601 3139254 909754 2566324 -233178 620126
1330 535271 -995501 3653649 -230322 1265529 -1765247 -3302534 -2656741 5521200 -406734
1320 -3457677 150099 -2360918 2460202 -1445748 2364252 -5665863 -3885844 790849 -854204
1310 381618 2250846 -3458524 -1041476 3126507 -3602566 -617535 657276 -1595812 -3654647
1301 -3654647 914531 -672829 548204 -2834895 997888 1161141 -1548900 -2552776 -698620
1291 3100719 851606 -1379286 3482362 -7936592 912920 3881558 -965773 478362 -4952038
1281 1130514 -17068 868067 -555010 111852 588384 2613370 2021027 -4800206 3813487
1271 -2577200 2604060 1063790 -3933255 -3472999 2361327 -3214755 -120654 1052758 138845
1261 -1068693 -3136327 2055907 -2936706 3767013 -709051 -546826 -2807001 4485163 -680099
1251 4540208 -569215 -939358 2442852 224276 -1104044 -3934063 2103052 2726732 -3804515
1241 3925308 -50599 1691160 -2011829 399027 -3308513 129855 -2104167 -207912 -56676
1231 -5005040 2686403 -3722076 5010800 -3381867 3265256 799017 -1259352 2638831
1222 3344600 117620 -3482344 -2759347 1003593 -2918208 -890201 -1057860 1150162 2019223
1213 2019223 -760772 -1028885 417810 2636375 2312238 -3371404 374869 2541514 -1191681
1203 1065369 1108647 -2709425 425938 -2644803 803427 3395206 2002378 -4396716 2336104
1193 662132 -3841801 -1557955 -991166 1367424 392949 -963537 269159 53037 521935
1184 521935 280904 -205899 1147704 193499 -1292130 1146092 -52526 -715760 988642
1174 1855303 3099776 1492059 -200404 2657714 -1055805 -1644608 173793 -401561 -920147
1165 -920147 -4219286 3803049 -4033317 3033452 4705048 -524820 -1192788 2385468 -5504457
1155 1935627 -2942746 1040707 518520 1812650 5298700 -443950 2304624 4011654 1354085
1145 -900267 -3048107 -2375769 1741092 -980169 2385105 -215032 3420435 1546761 727548
1135 2106266 -2723715 1510547 3089708 1043541 2836796 191921 3590300 -3942912
1126 998052 -3374809 402341 -1549045 -3641282 -2080913 -2691053 1334920 -2381098 2445726
1116 1102587 -4636965 -89964 1937261 -5068887 2355872 -1028933 -2043913 2357363 -1831371
1106 522446 3863880 -530133 560406 3306615 4557709 -4571803 1711549 1901958 -5167908
1096 9136182 -1105480 2083223 983662 -3098309 -1847216 -3128801 -1092201 -2777906
1088 -2777906 782832 -245392 1039936 -3155320 1648033 -1041363 -1140236 -406912 -2176481
1079 -2176481 5036408 -2325854 2420068 3577633 -3007138 -612681 2739769 10911 199986
1070 199986 -172901 -3017211 2554222 -1875970 510120 1343903 -3944118 382873 791807
1061 791807 4298847 -1539819 31925 -2074892 1064441 -5418452 -6335525 -51829 522478
1051 2717368 3497741 3363700 -1560813 -607016 -1213554 -1425413 -4627496 1976252 -1895428
1041 -3067960 -46834 2406607 530804 1877695 -2567009 2496708 3415041 -2326900 650802
1031 -462357 -257339 -2991271 2653691 3342013 -2812930 -2730161 -473113 1715722 -274496
1021 852886 2760005 -928630 -5373656 393580 2197375 -3901374 -1165595 3241521 3065095
1012 3065095 -3619777 2050671 -3013388 -2827571 -422751 1040026 -368060 2367200 -33994
1002 -3751534 -1756914 -3827587 -3227640 2783875 -4524924 390490 -1076925 2265225 1069812
992 93733 -2449400 -1786702 1841222 -2087735 4706240 2675499 7032948 -348746 5363178
982 -1314132 587300 -558560 2020678 588782 -4836815 5997441 2343298 -6084917 -910081
972 2844671 3535896 985319 2103790 484518 1843080 -87571 3090809 5062472 211807
962 127731 3564571 -4025274 -46508 1335630 -3832372 -3538822 2545681 -1393270 -1814286
953 -1814286 3056654 563923 -1185663 2968949 1654360 1330443 -814170 -4134238 -44570
943 -2286660 26960 -6131704 3430103 147734 59558 1302188 -2125999 2848817 -1012292
933 915471 1642642 -4613944 2240298 4111616 -2415335 -467413 612554 -1906859 1219333
923 -685647 -3450383 -403310 4028961 1574806 -978444 -3256865 -1314474 327224 2516799
914 2516799 -4498863 -231646 -582321 1753218 -2988289 -2441082 -579362 -2699615 -1648362
905 -1648362 -2893059 -2856733 887327 -2163952 -93492 4240348 73926 -2222235 -3118096 -3848014
895 -3848014 1892980 -2224048 -1194260 4107592 1590770 216006 -711205 -2132925 3642261
885 1600109 -2449223 -3864262 5655294 -3088477 -629322 855654 722673 655042 2301480
876 2301480 -2812433 1492689 -690246 2405407 786121 -3844142 42515 -1197142 613872
866 -4537109 1831940 1543686 -1304955 3909520 4035541 -849252 1311162 1527508 5813899
857 5813899 -4024817 3066116 2932369 1767808 -3905384 2793416 -2066430 1833323 1166478
848 1166478 1241870 -3142685 3460162 5208021 -7751135 -1999870 -1714936 -1946377 1148776
838 -3105872 5469031 48288 -2079509 -2891919 -1413752 -2334994 -428548 -128410 -2905160
829 -2905160 4457401 -7479041 -3316035 -323040 2733874 -1043652 -772057 104948 -2395268
819 1386900 -514849 -3255945 278891 -447130 1449901 -7119286 -987460 -4763073 1098195
809 184122 8238088 -2508790 544445 1791804 714157 1190375 -597211 1648842 861865
800 861865 -3295510 3009652 1845954 3924298 -4524259 1714859 -2515172 1035000 -1295641
790 1698945 4669443 -1763644 1629097 1330369 3327147 -3074884 -802006 3639697 -1000594
780 2561077 -262271 2915988 -334833 2245670 -4475217 1809255 -5117336 5427653 2491348
770 -3593963 437421 -50515 2941050 3635329 1173841 -348843 -2896575 -2534581 3929746
760 -5137081 2593296 452586 -2079336 -254388 -2193368 -4605830 4902644 -1290756 -452915
750 -4400249 -803429 -1391181 -2994824 2021273 -1142716 228867 2196324 2703534 -597848
740 3571069 2110222 -2858146 3858296 2975247 -3240029 2488301 1151208 -1619013 -450993
730 -5113547 -7463472 2648310 -1131447 729469 18873 793126 -377011 -2491462 2679744
720 -1521401 865050 2783364 5783586 -464246 3843778 -2183975 -3659507 -20404176 -5425089
710 -8314482 -2201717 13451839 22252609 8737535 5557427 6128029 1248193 -10824223
701 -19610671 -17147201 -19748649 -20094978 3799244 27580004 13471305 21309306 17711691
693 17711691 -4832009 -10312794 -2978310 -1929706 -5591988 1507854 185446 2277815
685 2277815 -6799199 5137243 1430109 7908496 -2917936 1384653 -1098886 914899 35225
675 2094363 -203583 2517161 14778782 8017686 -4922063 -10890680 -23203520 -2860248
666 -20919934 -9608177 8545583 13953341 25489551 9961511 7798058 2379307 -2905639
657 -14389561 -3208934 -3767576 -21071387 1931888 -3518217 3193460 7692419 -2150017
648 1623629 -3903111 948405 -1448049 1357315 -4160830 -1054354 298737 2366143 2398260
639 2398260 3203880 -7396382 2403109 3234678 73503 5400424 -490321 2460338 519287
629 -3521319 3309236 1370795 -3292477 5589012 172340 2915581 4946289 8897724 17869105
620 17869105 25671627 40717260 -117919386 -177172030 -72026924 139029441 47561767
612 10237765 7938964 7971101 5438021 3293336 11769202 -955975 -5090297 3022704 -89961
602 -1677975 4231312 -1421107 -2058167 7779634 1383695 -2191155 638220 -1136406 2459033
592 3351306 -3373322 2827211 1948389 -3191999 577089 -1088665 1345318 1366987 -516242
582 1515809 -3699605 62647 555740 2923205 1932558 391002 -992478 -1061174 -19533 -349932
572 -349932 244849 -2819753 -468228 1004863 -3199952 -680222 -3981379 -2754049 -1801128
563 -1801128 -1983058 1269567 5171070 -3560494 4439071 -2680524 3805174 1210070 -253555
553 773101 1773462 507849 1071477 2842100 -3933100 -3928251 4698301 -4283119 -268675
543 -2091421 1224710 2833511 -1978219 137035 3401950 1701943 -9069480 64227 -4692825
533 578749 4204864 -3221218 497774 4317116 -2907467 5928042 1681453 -340495 -231317
524 -231317 -80928 -2184035 1935326 -2851868 -314291 182142 -93318 1084178 -1523 2553245
513 -2388701 1210953 -3226793 3601045 -2209656 590051 -1641045 254782 599824 413265
504 413265 -2752043 -994192 3833899 -1088003 1337697 -2607914 7848976 -344501 2377488
494 -614946 3933899 -4424480 94179 1994846 2597589 947062 567019 -3312189 4335678
484 -40956 2787975 -861205 -1104690 4101325 2970308 -207398 4477610 1666104 -1260393
474 -1062831 -765006 945665 1217531 -1010276 44422 -1697355 -395015 2684840 4472184
465 4472184 -1623064 -3009069 1195741 948696 -565918 -5380808 4181568 3845134 1187341
455 -3139054 -903505 1904108 -4059994 -2021957 4578117 1148387 -36550 -2501606 -541581
445 -2118080 -3210610 -1225968 2607864 85993 -4625585 4646973 -2143511 1975160 700794
435 503296 3882902 -3709505 869775 4100934 -373559 -1469142 73996 -7056249 -2603290
425 5702510 2128934 977362 157469 45901 480273 2325305 -1518125 990182 2705550
416 2705550 -1159099 273429 -149752 1306260 -5031751 1465210 -410438 5023597 2795334
407 2795334 -4170412 2547356 3221584 -1974581 6201082 -1279826 -3446381 2066425 -734608
397 3969810 472420 1856854 532899 -4431335 2668444 -63782 -4012148 -1521028 2778579
387 -2690529 541363 3913914 7814591 -3309235 701014 -3987501 1597641 -1863171 614953
377 -766333 357477 3398789 125682 815361 2938091 -5112010 5527691 -1944790 -985426
368 -985426 -569555 408122 4901681 2303203 -722165 -2816028 1054172 -5812249 -1052376
358 -1426673 1461819 2045792 -137325 966319 2011811 1090117 -584349 -1388647 510967
348 1307649 -1892147 1619520 -20158 -1593182 -2497379 -177157 -3493071 3873075 -2817662
338 3197629 -2010994 1976146 -4195390 377141 5296563 -2719618 -1133018 -5668740 971959
328 2143361 328181 -2888269 -1167114 -933814 -1875945 4743272 -1833852 4492157 -1412506
318 -2333305 3443680 1571254 -2592102 817436 -3833481 -816125 672373 -1493555 3326888
308 -3422899 3707908 2063502 -2125671 -781922 3512097 -4012751 3696610 3668920 33433
298 3714380 -4920617 5043920 -418473 1249499 3413283 1791117 -1618478 -1997534 -840845
288 3235464 492498 -1450085 -3387235 -1700449 2262617 -101988 4039795 -2683438 3477758
278 1886853 -4955830 1440438 1252074 1189444 -4534581 -866308 205446 -3724836 -1766315
268 -2666521 -592854 4962494 -6919293 -2428412 936485 1790602 -1239852 -6677312 3767149
258 -3851044 -1043984 -3314274 -1767793 5407581 -83477 -1741843 -2193484 -2805694 685629
248 -983764 -218783 5006816 -610999 238075 -499565 3587268 2331845 -3499383 2108077
238 2283516 -2446722 1651910 -1357998 -442689 -924601 -2655061 -3614142 1926804 -1195485
228 -5704181 -1839128 -294772 -5500451 1547320 -1540235 -447991 1341252 -2435480 1931363
218 2108877 -3604278 161959 -2436623 -730866 -4440345 -2326302 -613725 3987924 -1367534
208 3832393 -1138908 514444 -1213256 442142 -2933716 2979124 228516 -1077053 -5427533
199 -5427533 -2561829 -3784591 3687936 -3883100 765787 1633441 -953295 1272768 3409995
190 3409995 -3055362 499550 -8174432 -36671131 -94328379 4443028 34238732 89685556
182 89685556 88367144 81359171 11210168 -43441665 -79545548 -78111581 12499933 1826035
173 2909069 1178448 -2859929 1051070 5076583 -1101399 -6009910 2841332 1623896
165 1623896 -5940111 -1330601 -994193 -1803253 1447878 2758866 5738275 3277819 -3842857
155 4065921 -1463286 -2122750 -601792 4483680 -2692220 2119948 2818898 -6214414 2913191
145 -1265299 1711280 2690501 -1843525 -2009217 -471487 -186694 1253896 -3555946 1257809
135 370482 82741 1854711 -932233 1791234 -870221 -3040304 -2646386 2971480 -7267657
125 3185584 -682342 -2658349 -710789 -72475 3339337 2374663 -2670309 -286876 -2086706
116 -2086706 5074146 -2555185 -1659042 1338713 3166671 -1257623 4231876 3264246 -46354
106 1008834 -2759885 442541 2167938 -4750462 1874859 -2204077 -1295329 -1694685 3493332
96 -2160557 4326501 16259 -3596004 -183931 1303792 2780215 1405869 496465 -1045583
86 -1180712 -3186211 -3821753 -436780 -2529510 5239921 -997086 1136981 -1634958 1822410
76 -644971 6908147 -4401832 2458340 -4710285 6586674 -4384510 -2460583 1209623 928678
67 928678 -3437080 -2787215 3699741 7678122 -1275195 -3151670 1802783 -904261 711752
57 1732808 27804 -3386904 997559 -1811547 -4158983 6496946 1226767 -3148299 4546334
47 177207 -2633493 4189924 -7454790 1066455 3664417 4189719 5244544 356350 -2052732
37 5040817 -1265257 -933477 944933 4788166 4225538 -7220677 -2520518 5863214 5383663
28 5383663 -932774 -2149640 726768 2570961 2934713 748794 -2136455 2079022 2259501
19 2259501 968905 -4115907 -1127904 -619274 -2441947 670583 -2993419 -877984 1179313
9 -482720 1424523 571470 174319 -1479036 -344452 5069690 -150327 -56369 141777
##PAGE= F1=5727.771679186
##FIRST=     21204.543296753, 2672.49122660428, 1726550
##DATA TABLE= (F2++(Y..Y)), PROFILE
2047 1726550 797110 -77429 117396 6117162 -1881582 252978 -60386 -301450 732513 1351313
2037 1351313 3971864 -1416768 1664555 465437 4495093 -5346570 766970 -1532563 52345
2027 -4353607 -1129483 1813752 1977199 -2750489 715177 2088695 -1343388 4131029 -785972
2017 1496329 3285035 -3790892 1516646 -43894 3815783 -6230388 725906 -2633907 -4357308
2008 -4357308 560072 3928893 -2394072 -1016988 2439006 -4246281 3397246 -705734 79674
1998 414183 3424331 2283765 -2601502 -5426964 -2994757 189547 -681668 5677405 -3315835
1988 908693 1425788 1001442 -1976042 -1579298 2516434 536499 4787233 776468 470633
1979 470633 -843192 -1603958 -8790244 4114092 1624021 -2208697 -1973826 -192110 -1696918
1970 -1696918 -2486307 -3127483 -2396257 -2089730 1972555 -29005 -819977 4538110 -4395517
1960 2967272 -3086253 91449 -146474 -2264315 4549560 5405196 -717724 -755967 -573761
1951 -573761 -3158539 227783 -148746 3108357 3273873 -2216791 -819926 433736 898209
1942 898209 4519132 -5596877 810615 219362 -2471597 5750767 1772180 4546225 -1919113
1932 2456025 -2951900 184256 1871429 1761254 -1957937 -293612 -3124188 5606829 -3397020
1922 -236171 1944132 -265735 -3086215 1341324 1340555 1836258 808299 -2803942 -2541861 -2851907
1912 -2851907 316647 -1357266 985394 -3051501 2035384 -3356153 2019707 -1613647 -154890
1902 297786 -349692 1284478 -80667 -2113576 293455 1124525 814936 -1368283 -1385606 2769361
1891 2401565 1535023 -2157935 -1577888 -982289 4040799 3888120 -1468761 -863428 -1130895
1882 -1130895 -6038946 5526851 -2893259 -881258 -3594597 2541278 -4550399 -627907 8116074
1872 -2558445 -1791313 -1144360 -1660771 2981169 4565395 28557 -1140766 2148076 1201221
1863 1201221 1974585 1881103 948289 -3423291 -3638478 -1286339 1291892 -589597 1628742
1853 -1732139 3590397 -1213434 994498 -2075439 3232083 2879203 1985772 4420959 -1360902
1843 -2757410 2927245 1002237 -837004 1444588 2606963 -2403350 -106686 -3842019 -955528
1833 3612227 997179 533115 -2334461 -2743458 718064 -3164733 -644969 2059357 -128388
1823 111002 -1234244 468858 -1059970 1021859 -2885144 3355528 -5312821 645738 2816458
1814 2816458 454408 1234158 -3929997 -1713422 1263083 -1833928 4281509 1810389 -3088647
1804 -1609806 1346598 5976731 -4998727 453530 265613 1379077 -1501210 1297681 -5597692
1794 3534086 -2525715 1092981 1667274 -193922 1143477 3832445 -591145 6819139 -3951238
1784 4431564 -4646694 1625383 -4985444 1714653 1321397 -796950 8692791 -5720536 1706862
1774 -1944815 -3874550 1644381 3593799 -1387756 -163489 -181859 -2595205 -2068163 3291870
1764 344990 3465162 5452373 -1573638 -2784455 -894746 -1533352 1629973 -1018019 -211532
1754 388632 3124463 2020691 2149840 -475000 2926656 4322192 1569001 31624 2211871
1745 2211871 5467681 -1057555 409065 3357112 -1459373 -631784 -726188 -1912426 2602054
1735 512372 -3064447 -4541647 3945606 -1011000 -984208 -1752405 834372 3730390 -218250
1725 -2721805 -1756377 152991 1806610 2108349 2996126 -908747 -869800 -2055259 520200
1715 -1998946 3347104 -3884188 -7669017 -1311924 1282993 -4954985 -2434194 1493774
1706 -3262069 -1970175 79290 -413765 -2148421 -1181231 832953 288064 -4360377 2786455
1696 583609 -235826 4391042 -3295359 1886372 1603945 3033484 -3128834 -5327969 -401793
1686 -1552699 -626810 392935 287338 -1935719 -202047 1761777 2352068 1615998 -589429
1676 678544 -2617004 506242 3194559 687243 -2212776 2776619 -3869359 -446281 5775777
1666 302378 -2397862 845854 -1439046 374748 -1543526 -6099964 3700901 -3109227 -513767
1656 3443659 -1254579 -1570375 1789130 -1202112 -14554 3197894 -252905 -317133 -1744352
1647 -1744352 4733946 -7595545 3667474 -2361952 -3609450 2931568 1955213 801190 3333563
1638 3333563 -1197496 6569800 -1612422 -2216099 -823793 -3341059 526835 -858237 1433285
1628 -1754614 51673 -89801 1638486 -1168896 -3738306 1057732 1493917 788931 3487962
1619 3487962 -1760375 -3295321 -4005075 -3138621 539403 -597184 -573190 206482 3501370
1610 3501370 4308688 -5084197 1696930 -3542749 -165934 2231881 -609341 1319047 436682
1600 -2304297 4117170 -530785 683143 3395 3398744 -3683202 3963881 -3740585 -154087
1590 1072530 2988075 5003900 -715528 -1817484 1109034 36940 3067461 -1769944 -393959
1580 -622997 -232613 -1651216 -4994152 -1171759 1175775 -533876 4356924 3139716 -967816
1570 -1016844 -169813 -3021317 3295175 1115667 -3439280 136833 1957313 -40156 -7585623
1561 -7585623 670803 1831196 596196 -1438633 2550530 1054073 -3837247 -1081051 2550438
1551 -3158347 4231856 1413691 -3159239 -499417 340897 -1741778 -161385 2161711 -2535616
1541 2980361 473239 1865473 1159207 43296 3918176 65693 2940399 1277714 -691590
1531 -3101237 -720840 -162470 924983 -2963095 3831443 1235826 623932 3817220 1612661
1521 -2197211 188922 -36136 -451713 2010639 -1324375 -2603537 1350002 4438752 -770294
1511 30490 -3268671 1076341 -2160222 -802579 526815 -4845742 1713464 -518404 6392730
1501 -655343 -1986284 927888 -321518 1518476 -5057700 2397188 -2554772 3974608 7526090
1492 7526090 -1427623 533759 1323652 -309961 475218 -1733301 -2286613 4228099 -6184295
1482 3272052 181205 -2449754 -1910408 3002036 -5879787 965501 -2706189 -607146 324652
1472 7239324 -1682141 132342 2684769 -8176 1210224 -7325050 948882 -68210 -3361226
1463 -3361226 -1468052 303872 3931182 -770426 -3783754 1012824 -910039 3091570 -4598697
1453 8125061 -2459219 1118857 -1782325 1257359 2666257 -2169202 2479693 18673 -2231202
1443 124337 1132670 1077484 -2318114 5638127 -996728 2675738 1800778 -2560253 579929
1433 106428 964844 -1560518 -2329524 2797339 2642279 692925 -2701573 1447710 1169679
1424 1169679 1609094 3418989 257421 -358894 -443583 -648878 -364708 -532164 -2075794
1415 -2075794 1437551 -865431 692614 3896909 -276446 2929034 468276 6528887 -3735024
1405 -2710396 -2008170 -909028 -834667 2584529 -6324001 5595654 1525016 -8093679 3317535
1395 1988128 2572600 2462949 968053 4081069 -165694 -1502119 -1418566 -134593 1403355
1385 599701 -2622429 -2666192 1647290 -243963 -3584720 -5482431 3096870 259347 761417
1376 761417 88819 -674304 -2667065 -1054830 4326484 914963 78533 -1120889 -1704340
1367 -1704340 -1922869 1254865 -883169 2794718 -1219101 1831249 592195 -3901171 1905025
1357 -1760059 86888 615795 783935 1358564 5501792 -5405563 323958 -6763389 3432153
1347 -1329125 -1281316 860738 1702789 -1674644 3954853 -3914688 -3250393 7999778 -1508768
1337 -662073 -3002675 3793166 1215633 639520 -252073 1138885 754770 -1439039 3095605
1327 -214158 1520713 -1238099 -2796799 -2468319 5885036 -1627680 -3140076 -134954 -2756964
1318 -2756964 2226247 -285940 2593530 -5927843 -3418017 1598170 -564659 456894 2541254
1309 2541254 -2887982 -867915 2945896 -3604704 -814821 1685053 -2370325 -3590328 231867
1299 -1119952 663224 -3102397 614413 1450482 -2202550 -2362643 -1403887 3213451 697905
1289 -1136670 3170248 -7503977 -290238 3686462 -949947 355061 -4272862 1125338 -186252
1279 302103 1559493 130440 271769 2701221 1320573 -4892687 3380906 -1591821 1788509
1269 847711 -3834886 -5004070 2874333 -3131006 -660848 1622578 204780 -1036364 -2470934
1260 -2470934 1371351 -3084713 4454179 -1024054 -674397 -3924460 4828204 -1290115
1251 5147774 -1316722 -1182557 2078872 872823 -1411167 -3457453 1863122 2614661 -3550220
1241 3970411 403890 867398 -2425663 458394 -3296305 265309 -2525258 -563260 -270597
1231 -5899603 2916370 -2492449 3647591 -2916073 3677944 219503 -918841 2750223 2932459
1222 2932459 -475122 -3133436 -2706733 1055738 -3679246 -839313 -1401831 975372 1205111
1213 1205111 -199129 -1286582 -18938 3154516 2245072 -3222713 1082949 1789047 -1578131
1203 410391 1492016 -2355217 882410 -2985470 479887 3656228 1679983 -4511401 2026847
1193 -230382 -4563730 -1109045 -524621 1597391 835641 -1761227 352225 293346 557235
1184 557235 366347 127897 1041380 614291 -1362279 1231898 -642931 -260814 474205
1174 1414784 3069265 2160041 -850972 3710021 -1397805 -1547586 -3355 -314054 -969601
1165 -969601 -3586416 4097844 -3571448 2926079 4902602 -1245368 -1876936 1223094 -4668253
1155 1663008 -3339515 1086073 -96873 2034861 5407231 -311095 1432705 3778178 1304966
1145 -519935 -2763050 -2496948 1107046 -682275 2574459 -90408 2361697 1167230 70997
1135 2147742 -4719455 1513837 3339750 1361692 2482264 524394 2528082 -2768430
1126 1117959 -3137209 580566 -1816703 -3874234 -2917677 -2908252 1595210 -2247924 1526982
1116 1863623 -4538993 -613417 2079409 -5197935 2601336 -839780 -1507681 2177856 511354
1106 172338 2823553 5571 1238403 2627601 4112421 -4525243 2625587 2303914 -5398798
1096 9560342 -588293 693459 1150031 -2972568 -1070426 -2905582 -2235931 -1593453 368018
1086 -220402 1818996 -3289566 984795 -835918 -721773 -324415 -2676735 5713705 -1725284
1076 2316569 3747515 -3056180 -192491 2773013 733095 -183920 -105647 -3054372 2837666
1066 -1653205 -223122 1135320 -3680719 595217 1115099 4044882 -1316208 -108272 -1521421
1057 -1521421 811061 -5338820 -6530249 -233679 900765 2661837 3265791 1998546 -1434774
1047 -596336 -1242046 -1296196 -4645745 3387513 -3242914 -3317291 57903 2673556 1076839
1037 1020603 -2297477 2498661 2449317 -1738969 780780 -2044053 -1611818 -2245582 3277300
1027 3448621 -4674812 -1521191 -512300 2364641 -700936 -14914 3094673 -1495760 -5910246
1018 -5910246 1013871 3049664 -5221428 -1025997 4977967 2583195 -4042666 2814541
1009 -2922432 -2477388 -1331951 1787300 187484 1781251 -708066 -4056121 -927957 -3922443
1000 -3922443 -2958560 2590762 -4136198 408149 -1287350 2777559 1692338 -179262 -3068052
991 -3068052 -1681179 1328165 -2348995 5108249 2744011 6958735 -215395 5545654 -681067
981 -51640 -1270995 2097719 596151 -4418564 5833728 2530045 -5821078 -658192 2957001
971 3998182 2055527 1487732 71175 2076710 -72151 3027040 4727219 181063 329059
962 329059 2945615 -2985103 -773421 976502 -2651438 -4082537 4655579 -780822 -2221961
953 -2221961 3187130 203936 -947452 3565262 1343206 1638854 -1395530 -4482298 -357819
943 -1938093 -816006 -4920394 2626976 490635 -581029 1329943 -1463526 2419117 -735220
933 1406193 1054733 -4195098 2312244 4114291 -1954341 -665601 656484 -2074901 1127756
923 -122928 -4067531 171985 3340220 1541034 -583193 -3744554 -1486778 510681 2191795
914 2191795 -4258203 -756697 -1069126 1779683 -2420420 -2670035 -511357 -1724495 -1960739
905 -1960739 -3090581 -2266424 763918 -2199793 -1198028 4144727 -45891 -2006264 -3520629
896 -3520629 -3485021 1772216 -2279365 -1624989 3961104 1136395 1112416 -1694360 -1561693
887 -1561693 3934041 2033301 -1160159 -3781224 5396531 -3286575 -428138 639285 661277
878 661277 777519 2278678 -3094397 1659171 -583607 2293306 915614 -3976503 197909
868 -1100640 898719 -3773711 2446763 2042880 -1705471 2981591 4007809 -1119202 1575039
858 790150 5677735 -4212308 2222983 3315101 1532410 -3682594 2753676 -1905041 2444552
848 1066905 983351 -3170476 3366799 5371700 -6543048 -2060502 -2330646 -2605256 1202743
838 -2867802 4494599 283371 -2023667 -2469296 -1232037 -2687262 -1115964 1206347 -3838183
828 3890116 -6711422 -3497037 -184415 2753976 -1045512 -841376 586125 -3160460 1275711
818 -514662 -2755501 45838 -547225 2080311 -6895014 -1009765 -4183255 1596801 119451
808 8606397 -3263283 1096779 1329430 908492 2262409 -709039 1889696 1785672 -4511828
798 4204950 2310759 2951310 -3442405 1456891 -2636086 2083413 -1544792 1215070 4933254
789 4933254 -1515693 1563072 1742622 3160114 -2592918 -554037 3601847 -1054479 2837949
779 43216 3241714 260331 2205051 -4791232 2442390 -5651535 5887008 2191809 -2980494
769 -365356 -16683 2688849 3875422 2217769 -213288 -2512843 -2674597 4274298 -5334585
759 2383512 631311 -1883903 -42988 -2549810 -4759054 5451190 -1230061 -880584 -5040895
750 -5040895 -953330 -423071 -3173052 2353715 -1309778 103170 4098229 2571881 -555258
740 3670347 2388964 -2726353 3916113 2795938 -2783320 2305093 1217432 -1754558
731 -459854 -4372984 -6782367 2054272 -914412 495406 519230 1073320 -135451 -2439836
722 -2439836 2802086 -1692618 283914 2777961 5066084 -807693 4988469 -1708009 -5261647
713 -5261647 -24999468 -6723095 -10295812 -3328878 18221559 26786489 11571137 7705350
705 7705350 6296884 1330926 -11582193 -25792063 -22487355 -21762681 -25512174 5071274
696 34869945 18136740 24417484 20785046 -6421371 -14300842 -2881420 -1292504 -4727260
688 -4727260 1201547 1119720 1497826 -6916478 5059630 1193051 8277820 -3021432 1634415
678 -763124 839840 186942 2687524 760929 3556295 19413057 9384942 -8227709 -12221241
669 -12221241 -30081906 -4805696 -24270761 -12876810 8929789 17353764 31258976 14109617
660 7915606 2062485 -4200858 -17346150 -3108805 -4669706 -23095738 2397979 -5154977
651 6432824 9492375 -2305583 1444245 -3638511 1063866 -1853102 2325810 -3501355
642 -921612 782205 2257973 2595647 2648887 -7430678 2923880 3223815 213266 7224554
633 7224554 -1820079 2665154 238611 -2223304 3143821 1607304 -2371514 4537207 112215
623 2596104 6148724 9837567 22916775 33103180 49358257 -150959845 -228121306 -89490129
614 179810596 63243879 14085309 10519941 8554955 5844349 3602107 11464944 -950528
605 -4499420 2996774 102301 -1032482 4149348 -1407971 -1045275 7455247 1927078 -2646946
595 464508 -1205531 2821772 3963659 -3389465 2178808 2589304 -2966214 811353 -868687
585 1521371 1552099 -1329604 1623056 -3754083 1442863 947654 3277699 1736327 706223
575 -1187985 -1129719 -273294 -936073 149953 -2505877 -266584 2813804 -3757829 -292492
565 -4155593 -2205424 -1464065 -1239787 1596983 5261300 -2890687 4732657 -2123821 3763863
555 610226 785614 540983 1218175 117323 2152262 3107063 -3760309 -4605121 5828214
545 -4408237 -15140 -2485974 1406381 1795137 -1138983 -156438 4425411 1887253 -9376960
535 -782248 -4025874 1510135 3545604 -2640337 119994 5402469 -1602947 4742762 1302127
525 460589 -789664 554033 -2467591 3528701 -2462352 -910094 17207 -80818 521967 81397
514 2480387 -2068372 1376502 -3871955 3645802 -1907299 285873 -2163940 592257 998309
505 998309 923944 -3001062 -455082 3528520 -924115 1293262 -2612641 7195459 -417913
495 2657102 -419329 4770328 -4010648 -117051 2272285 2621619 301790 960097 -4068329
485 4197169 229633 2822806 18407 -731281 3726992 2602870 -797027 3223922 1430653
475 -912225 -2248398 -460443 1252185 1271956 -1062231 -983155 -1608945 270855 1838091 5829820
465 5829820 -1555677 -2883054 1897484 1137669 -196789 -6071206 4742322 2825686 821493
455 -2455078 -496704 1759448 -4949136 -2015469 4094160 1321896 -335197 -2455879 -559236
445 -1189790 -4058817 -1035163 2115356 -528916 -5278058 5381832 -1304220 1734883 784092
435 341431 4073083 -3838797 335668 3612658 -427791 -1928877 420045 -6803874 -2330562
425 6592927 1506973 1191756 369476 -386627 1024105 1629034 -1689172 345871 2305649
416 2305649 -708037 365231 156269 1323820 -4952844 873680 -316640 5251647 2238218
406 -3992191 2098177 2875484 -2034192 6839855 -827266 -3028829 2119735 -757935 4234505
396 683783 2472464 -759309 -3804332 2179711 -235986 -2750945 -1932652 2651625 -2333817
386 -414990 3627026 8185735 -3849815 638971 -3054601 1614220 -2001279 856546 -632623
376 -35560 3961761 175850 432709 3059657 -5196910 5678439 -1950302 -555089 -251755
366 -152721 5820626 2095699 -852376 -3022170 931094 -5245507 -731882 -1459003 1104089
356 2886319 -702125 562461 2514998 821379 -798036 -765299 925817 727562 -1765286 2343818
345 -124617 -1224191 -2511456 1171058 -4616827 3807371 -2326602 3959570 -1996272 2120976
335 -4589287 20652 5819890 -3787343 -554608 -5935454 1402793 1479181 459600 -2474419
325 -1270667 -385386 -2194620 4444653 -1842732 4170122 -933598 -2319824 3820888 1596520
315 -3043170 1418727 -3989791 -903260 -190785 -923397 3360463 -3316723 3623132 2203041
306 2203041 -2857612 -803470 4172539 -4947998 4063959 3956495 93596 3833357 -4462228
296 4229006 -44553 1047558 2995716 1663872 -838333 -1803667 -1063749 3702374 463142
286 -1209503 -3151498 -1493277 2384478 -117070 3989604 -3164133 3822993 1949802 -4559244
276 909751 1730236 296778 -4454867 -961126 130719 -3628697 -1241416 -2897162 -207874
266 4275835 -7159471 -2750249 1264126 1700530 -783134 -7610399 3575747 -4304677 965303
256 -4909802 -1806477 5349844 293738 -1866049 -2564814 -2960914 762353 -1504060 -842317
247 -842317 5697543 -321010 1032423 -838484 4437472 2494035 -3095602 1872180 2334779
238 2334779 -2860860 2055237 -96580 -426684 -351142 -2121286 -3188969 2221665 -1950039
228 -5859854 -1794067 -71685 -5835824 1196438 -1562681 -982682 2812710 -2414285 1283825
218 2120228 -3067473 -64805 -2712084 -566274 -4430972 -3142257 -102205 3348495 -1137106
208 4204498 -1944943 362847 -1674328 369503 -2269109 2865209 162897 -1080086 -5482707
199 -5482707 -2681399 -3632916 3357696 -3723397 495904 3000586 463710 1870595 2754912
190 2754912 -2312690 -256196 -10223602 -47881009 -124286257 5504462 45571326 118914912
182 118914912 113245481 104667985 15962284 -53677625 -102167434 -99741468 15641861 2353539
173 2198978 1081751 -2814085 734829 5606743 -1180596 -6506795 1862499 1434337 -5871787
163 -1321942 -1302886 -1876317 2115632 2076353 5316195 3976174 -5118435 4010737 -1193062
153 -1672857 -535380 5619440 -3891670 2318138 3308044 -5936382 1681576 -961913 1397495
143 3078887 -1536902 -2954353 345322 -1458216 1221448 -3062886 454526 1381645 -160058
133 1932612 -1444882 1944356 -1387858 -3457490 -2184706 2707053 -8074240 3615893
124 -518633 -2878589 -178817 178631 2705451 2544759 -3384031 -806533 -1765755 4879520
114 -2253175 -1379697 984143 4261668 -2082290 5013442 3006991 -819633 1171660 -3417449
104 -210493 2365035 -4889665 2361267 -2609347 -981445 -2023506 3726868 -2076961 4852427
94 -573656 -3679658 -55432 683207 2628846 1360418 26491 -579059 -595794 -2252140 -4606761
84 -4606761 16195 -2786088 4339477 -879399 703999 -729665 2693216 -1082292 6139618
74 -4369582 2707515 -4946254 6016304 -4100568 -3077091 981951 1413431 -4488991 -2455617
65 -2455617 3687858 7338698 -1125059 -2503205 1145707 -286417 723734 1353179 -28012
55 -2117135 671143 -2182131 -4352621 6046723 1085901 -2316888 4833783 -376597 -1599969
46 -1599969 3984413 -7552093 388919 3429632 4146963 4762216 -552939 -2151306 5419796
36 -1351161 351628 -132339 4734421 4129781 -6582771 -2153267 5529712 5562449 -1150136
26 -1964889 783043 2279565 2558701 865827 -2136468 1161775 2166242 958979 -4046689
16 -1895470 -328572 -3347929 1427536 -2142594 -1067708 1535667 -1358276 981293 38502
6 354297 -1641222 -581147 4838716 60720 -71049 -261790
0 -261790
##PAGE= F1=5705.973409302
##FIRST=     21204.543296753, 2672.49122660428, 1726567
##DATA TABLE= (F2++(Y..Y)), PROFILE
2047 1726567 774074 -313255 13192 6653566 -1826407 450335 -264867 -91478 322384 1241725
2037 1241725 4029589 -1810790 1483076 1519285 4510625 -5236199 -619328 -1576850 278891
2027 -3878667 -2042163 1561980 1965666 -2842954 965328 2494699 -2334113 4517619 -479097
2017 1058004 3459202 -3342690 865480 101561 3991525 -6389964 920043 -2783228 -4098805
2008 -4098805 -44107 4711228 -3273559 -1337483 2243819 -3641203 3145020 -1516461 -78088
1998 -531552 3409869 2405490 -2401790 -7017030 -2455646 238553 -588723 6088786 -3878411
1988 -99771 2225769 213796 -2000752 -842609 1644301 2148892 4990424 450552 -392371
1978 -333438 -1843718 -9438365 3610926 317708 -2247447 -1247296 -784937 -1188200 -3000680
1969 -3000680 -3380861 -2633117 -2126483 1912839 -685977 -1738019 4673929 -3062060 2302254
1959 -3237160 -942405 460913 -2923659 4318402 4881182 -884740 -979624 -1006294 -2792225
1950 -2792225 68743 -36873 2039300 3042461 -2101874 -1203316 726329 916565 4778410
1941 4778410 -6575241 314654 484414 -2398685 4907938 2442755 4953418 -2347738 2196360
1931 -3364651 1297211 1435784 1925778 -2146716 -1101899 -2089368 4218999 -3710325 291663
1921 2439019 -515643 -3739817 1416342 1314752 2008382 678690 -3192206 -2816620 -2634395
1912 -2634395 -87897 -1605120 1192574 -2992032 1825039 -3017591 994226 -1242723 64204
1902 -9619 -184909 1310564 463057 -2558855 1372509 327815 634579 -2179087 -285708
1892 2259865 3022717 418955 -1772939 -2113618 -1334019 3269679 4274976 -1116465 -1812137
1883 -1812137 -1568366 -5212867 4955953 -4211454 261750 -3444646 3070369 -4517666 -564603
1873 8443866 -2620310 -2948950 -1015943 -1602749 1579970 4625104 -115504 -509004 2418733
1863 545427 2432943 1523240 1962839 -3419186 -3450338 -1543361 1722849 -1452278 1673361
1853 -1065578 3053970 -830740 106518 -2670888 3291017 2750747 2819544 4435740 -1833334
1843 -2356397 3173662 -161745 -688477 933949 3089158 -2513964 135363 -4136076 -450296
1833 2674633 918393 -67958 -2559795 -2014056 1284105 -3426856 -979458 2413756 518652
1823 -532036 -732917 -133639 -179402 967359 -2598835 1670416 -4696455 1404409 816344
1814 816344 2008115 1776489 -3640717 -1838731 1457449 -1956148 3874048 1573368 -2083029
1804 -1446712 1573125 5271094 -5641171 -184377 122805 1132909 -2308737 1256307 -5817377
1794 3347677 -2251951 1066169 1519271 -219715 1938234 3935597 122877 6749009 -4279473
1784 4312354 -4293694 527017 -4658243 1279098 1145156 -1222730 8364746 -5080678 1893795
1774 -2206843 -4168970 1988920 3072568 -2010611 397392 -58484 -3313622 -4679821 3884480
1764 734417 3510233 5112686 -2100061 -2324697 -998382 -1426007 1426819 -398062 -520496
1755 -520496 91868 2524330 1322210 1223582 197784 3036880 4051874 1642478 301659
1745 2755321 5878416 -1141485 566166 2967599 -1632466 347592 -853614 -2388197 3314233
1735 886147 -3471998 -4387787 2827581 -1439381 -1177382 -1918141 1959919 3990212 -210916
1725 -2523428 -1218768 -340830 1899478 2608825 3058034 -1029217 -659362 -2385560 413072
1715 -2175421 3201771 -3673668 -8288659 -998675 1645889 -5369095 -2469319 1124289
1706 -2053941 -2084428 771655 -157591 -2002560 -676181 1113529 22445 -5057999 3092592
1696 1174216 -586011 4280090 -3285902 2522957 1248437 2668948 -3086002 -4388417
1688 -4388417 -642838 -2657321 -714810 71796 201492 -1183847 -144509 1842214 1930511
1679 1930511 1417656 -549514 107282 -2167020 665901 3769773 -148037 -1796325 1562470
1669 -3729344 -1314558 6129876 886175 -2978880 1152649 -1126543 295115 -1554200 -5609877
1660 -5609877 5316252 -3965099 -178211 2854692 -1508389 -1647706 1284660 -415546 -247121
1651 -247121 3571989 -144710 -453260 -2158134 5030067 -7330498 3431310 -1737148 -4204079
1642 -4204079 3937227 2081982 1097172 2714975 -994477 5169988 -1735250 -1451985 -835523
1633 -835523 -2749439 294976 -565956 410864 -1255364 -363988 681830 1265875 -970365
1623 -3724239 555421 949335 959646 3784379 176059 -3654633 -4119151 -3289692 818874
1613 -571285 -826437 -93852 3491937 4510215 -4062859 871597 -3348838 -35153 2001104
1603 -562669 498735 335233 -2064016 3723369 -263142 595299 -254829 2933746 -3499121
1593 3722213 -3186933 -442535 1233935 3179469 4508604 -1128896 -2305401 1305490
1584 -541986 3681568 -3082846 851584 -709195 96487 -1325595 -5148868 -890908 1475772
1574 -930685 4173285 2715834 -1286128 -695795 745073 -2954258 3431137 923211 -3483328
1564 642293 1080226 112415 -7546295 367357 1765864 661406 -1290379 1585553 1377175
1555 1377175 -3493120 -485775 2081969 -3051591 4928803 773522 -3726899 244723 -671074
1545 -1700278 3928 2866555 -3267034 2402607 775447 2419743 1118164 328107 4046225
1536 4046225 650857 2723602 1997538 15746 -3588793 -483104 -389063 2093148 -2808694
1526 3506049 1607423 355128 4007516 1363749 -1598981 -674078 -34616 -348947 2274777
1516 -1268823 -2772051 1504139 4102672 -1076524 604029 -3671587 1012097 -3006195
1507 -185087 531068 -5668373 2031977 -245105 7146506 -790093 -1544946 689952 669822
1498 669822 1414773 -4878701 1670715 -2167410 3555885 7319434 -1191813 108402 1507617
1489 1507617 -377199 143119 -660216 -1310527 4406146 -6016451 3701285 438953 -2134497
1479 -1826682 2642319 -6135695 933634 -2877324 -526617 290937 7205102 -2715681 147142
1469 1879616 -390184 1191499 -6879177 666266 -46565 -3382122 -1860269 961876 4495768
1460 4495768 -1246566 -3188421 1326230 -416921 3044346 -4995654 7098734 -2754877
1451 1379869 -1756216 933230 2951812 -1522250 2233074 324187 -3086240 -592458 1484108
1441 1380718 -1717872 5315984 -483679 3492312 1318665 -2226909 481266 230637 312750
1432 312750 -951383 -3360772 3628950 2350696 747016 -2876271 1754162 374730 1581964
1423 1581964 3579325 -135908 -627704 -1177134 -891463 -402139 -1200596 -2202350 1042065
1413 -199779 986366 3605941 -410283 3277493 812092 6871359 -4129588 -2951702 -2111926
1404 -2111926 -1177839 -246573 2184849 -6180520 4908312 1579445 -8378492 3915853 1915068
1394 3997464 2135340 785073 3163148 -531550 -815967 -676606 -523048 1870434 208841
1384 -2453725 -2199734 819153 -803952 -2898742 -5971708 3490734 -106976 1393952 -587632
1374 -240596 -2652738 -1118631 3882728 1079849 -729767 -847683 -1643631 -1508992 1286513
1364 -953274 2679577 -2170851 1836366 670180 -3711617 1289054 -1699669 889125 -280526
1354 1153800 842617 4915968 -5242459 490898 -6114923 2770326 -1354084 -1485545 476689
1344 1639614 -1780519 2612879 -3987039 -2942541 7584460 -1385675 -1180782 -3690657
1336 -3690657 4267100 1382026 -950090 -408717 1751599 906546 -1733201 2510665 -185759
1326 1690757 -810836 -2425876 -2241622 6081594 -2670897 -2825922 -470046 -2959461 1871910
1316 1084246 2801419 -5874658 -2920434 2257532 -382079 615925 2732043 -2105769 -693528
1306 2687984 -3451090 -1011133 2555951 -2848978 -3420317 -487054 -1471901 805496 -3405294
1296 189357 1629729 -2737798 -2128213 -2078569 3147284 338975 -824326 2640075 -6274177
1286 -1744129 3398314 -967926 108470 -3341616 1137665 -441673 -351640 3278557 94582
1276 81556 2609878 365240 -4794941 2797185 -463726 1130837 472641 -3593559 -6497985
1267 -6497985 3219897 -2900521 -1203898 2167281 237902 -1107939 -1582373 642808 -3163483
1257 5111156 -1282291 -720551 -4991112 5033964 -1912979 5582720 -1934084 -1404569 1646306
1247 1302197 -1519004 -2901684 1597522 2519072 -3088130 3794781 870481 126170 -2675980
1237 459101 -3171296 396905 -2870068 -744285 -550026 -6647571 3048079 -1276104 2003823
1227 -2256249 3987672 -383262 -686797 2753661 2539446 -1122455 -2778575 -2678409 843040
1217 -4075370 -808210 -1561768 799865 517810 431996 -1525660 -320394 3654027 1890161
1208 1890161 -2948648 1848700 826090 -1772756 -230064 1748474 -2115989 1218426 -3067747
1198 184431 3698020 1291453 -4456530 1698449 -1129366 -5261305 -703912 -73400 1817926
1188 1239485 -2473667 333553 450654 662465 520432 324820 918041 1085428 -1472421
1178 1274232 -1132036 78682 -129951 942151 2905168 2715917 -1559342 4498959 -1821769
1168 -1401083 -142460 -190421 -951102 -2867080 4146482 -2895165 2653087 4811808 -1833142
1158 -2344139 -88187 -3961452 1320255 -3546345 933794 -664632 2105957 5380398 -138395
1148 568402 3469054 1057606 186748 -2493087 -2500070 471813 -523973 2720049 28031 1350330
1138 1350330 796202 -437208 2242606 -6640593 1352779 3368315 1603895 2127453 722827
1128 1303807 -1546346 1079678 -2798823 597696 -1844136 -3853802 -3857602 -3152952 1781717
1118 -1965699 550825 2445352 -4332494 -1109137 2157578 -5401733 2809647 -619346 -994488
1109 -994488 2063929 2554506 -147480 1644871 412437 1853289 1772877 3517763 -4362080
1099 3446924 2259613 -5451485 9393681 -65759 -659895 1075912 -2695411 -322693 -2612203
1090 -2612203 -3431248 -476944 -116196 -121338 2489294 -3510006 374882 -895631 -168259 -316900
1080 -316900 -3130298 6073262 -1075053 1860581 3873704 -2937472 105546 2602038 1369642
1071 1369642 -595439 -91639 -3027827 3077079 -1487927 -841909 673172 -3323157 842228
1061 1321733 3647462 -1228596 -53398 -964597 606025 -5224611 -6310626 -412996 1081784
1051 2479391 2813594 497022 -1303407 -566978 -1250290 -1214798 -4512881 4749297 -4570324
1041 -3414166 123561 2789714 1471259 -22131 -1941222 2599590 1258756 -1194848 901236
1031 -3556586 -2923455 -1500597 3792878 3219615 -6463696 -297885 -597170 3017551 -1212255
1021 -981363 3182057 -2162089 -6351180 1449931 3886980 -6328483 -752982 6638625 1810639
1011 -4264041 3383148 -2772630 -2138428 -2010638 2513825 587842 1099624 -1493739 -4313362
1002 -4313362 -69451 -3990569 -2533869 2324679 -3731674 521825 -1417968 3163667 2225453
993 2225453 -491251 -3632160 -1518203 809256 -2597776 5257651 2596042 6514122 -70588
983 5290211 49044 -731000 -1889254 2223569 591727 -3949771 5352563 2511894 -5511385
973 -359517 2886066 4268823 3070757 791608 -434837 2239046 -133802 2799529 4291128
964 4291128 -29977 507883 1962320 -1916079 -1632255 448599 -1456542 -4539440 6538393
954 -194785 -2611918 3044541 -360820 -769903 3939413 926775 1921430 -1985093 -4788289
945 -4788289 -749429 -1556310 -1915162 -3203019 1723092 775135 -1214941 1239254 -743227
935 1852034 -559753 1905899 262543 -3560813 2155857 3972592 -1660701 -837621 612421
925 -2224587 928712 461376 -4486717 715161 2487353 1426743 -211213 -4055586 -1668130
915 535750 1652976 -3976041 -1270686 -1518231 1664316 -1840493 -2905342 -415491 -877388
906 -877388 -2351706 -3076060 -1822681 627953 -2233453 -2318584 3931788 -356499 -1638888
897 -1638888 -3743705 -3112805 1595317 -2332725 -1992740 3522641 634830 1768047 -2667915
887 -762240 4221627 2302102 54959 -3557587 4788660 -3299631 -318344 317212 522752
878 522752 728824 2186283 -3244626 1669023 -423135 2048939 993776 -4101122 241652
868 -1249980 1012097 -2915178 2916878 2433813 -2204168 2093560 3817689 -1496773 1891029
858 -48573 5285468 -4384485 1363301 3516413 1251071 -3423898 2524232 -1796950 2884328
848 910918 645535 -3031781 3016140 5303300 -5109109 -2047949 -3119892 -3303286 1488500
838 -2598438 3305537 581449 -2028334 -1948866 -1259879 -2969464 -1863777 2441479 -4735423
828 3051192 -5732613 -3632700 -440647 2774770 -1124511 -952522 1113586 -3850972 1145162
818 -647364 -2308606 -249056 -536808 2703832 -6631260 -1011511 -3479089 1930426 -158373
808 8532836 -3790736 1326508 765488 972654 3086632 -843678 1986768 2470345 -5557265
798 5227769 2665610 1900122 -2203238 1133715 -2647863 2933419 -1866817 656777 4885888
789 4885888 -1182647 1352685 2026275 2840268 -1940698 -429270 3378523 -971051 2826144
779 281962 3393163 639226 2091040 -5102764 3043858 -6118252 6185926 1822891 -2323236
769 -1169776 -91146 2322800 3923845 2842683 -211424 -2117547 -2775969 4317569 -5249340
759 2064368 625898 -1667307 145531 -2811460 -4860485 5838919 -1154504 -1411503 -5664716
750 -5664716 -1089636 307807 -3229014 2557655 -1456694 -63932 5497392 2285099 -496346
740 3567109 2478805 -2621767 3664517 2417350 -2086005 1964743 1271837 -2170275 -394659
730 -3628501 -6024244 1390952 -751662 154456 868933 1073228 124295 -2481088 2799118
720 -1779886 -537970 2682641 4007958 -1109626 6258476 -1351713 -6603131 -27633849
712 -27633849 -7971906 -12148296 -4331993 21782172 30232108 13968591 9407394 6145357
704 6145357 1321486 -11940000 -30519739 -27242352 -23027036 -29731628 6159643 40333061
696 40333061 22250606 26024511 22934933 -7863505 -17750650 -2664061 -483625 -3799823
688 -3799823 849169 1828386 333420 -6638997 4700597 889265 8074176 -3215094 1786387
678 -459516 809446 229147 3131442 1575463 4557025 23249421 10059427 -11757506
669 -13159587 -36160368 -7003485 -26260495 -15698946 8877814 19393574 35649517 18007728
661 18007728 7644538 1494278 -5276795 -19449932 -2966915 -5518087 -24541749 2814214
652 -6729280 9553929 10692712 -2564548 1125521 -3260180 996231 -2142416 3042063 -2924513
642 -943469 1273209 1880052 2715329 1932358 -7178990 3367483 3107092 268501 8907416
633 8907416 -3003780 2617108 -25810 -943657 2846232 1852649 -1618830 3469119 148058
623 1758538 7166483 10428592 26743215 39164061 54555256 -175838326 -266593489 -100777237
614 210471916 76362684 17124511 12508102 8839275 5937452 3780873 10739456 -1109055
605 -3947863 2837205 310155 -347770 3824286 -1544121 -256282 6948359 2306443 -3203851
595 150390 -1268845 2844523 4490505 -3370154 1436171 3067966 -2566981 903573 -637199
585 1687429 1385516 -2139201 1679996 -3590159 2905622 1129683 3249266 1525466 837104
576 837104 -1374355 -1327410 -480834 -1506072 -4115 -2230674 -216957 4341482 -4218325 35488
565 -4166323 -1678027 -1100155 -695097 1853154 4805920 -2220908 4781880 -1779809 3535910
555 -125540 1619880 263020 586041 -331301 2970540 3202112 -3553990 -5215984 6626453
545 -4739996 163101 -2895078 1534361 877142 -270891 -512804 5210897 2043773 -9377462
535 -1608653 -3300323 2287861 2591017 -2004311 -345886 6171121 -223942 3014098 874547
525 1123790 -1337896 1196683 -2793231 4900332 -1968189 -1564755 -205780 -87696 -167647
516 -167647 205354 2177247 -1677807 1399275 -4352592 3623750 -1563823 -75323 -2833800
507 -2833800 712444 1360826 1410062 -3193700 -96928 2887536 -797388 1222489 -2653701
497 5966497 -417080 2644675 -241719 5314960 -3468383 -451573 2428915 2592845 -306698
487 1181859 -4821071 3901679 434664 2763348 807228 -536606 3185076 2043054 -1329541
477 2011331 911714 -604522 -3293266 -454072 1650653 1190070 -1156252 -2137389 -1547754
468 -1547754 1021407 607572 6930441 -1572071 -2797598 2402065 1213834 120042 -6702501
458 5233925 1693906 399544 -1805229 -57195 1565479 -5815125 -1966442 3484937 1370756
448 -650626 -2427110 -692667 -208602 -4693225 -844262 1497387 -949820 -5917650 5802625
438 -689719 1492823 796694 102904 4132257 -3844223 -242627 3177467 -609599 -2294976
429 -2294976 645292 -6323271 -2047503 7230830 698390 1174247 489618 -956792 1548875
419 741991 -1897659 -283745 1749214 -305081 457526 243691 1243669 -4664363 215437
409 -4637 5225679 1514898 -3507601 1478024 2556148 -2036239 7126628 -299994 -2709402
400 -2709402 2211513 -880177 4357866 771249 2999174 -2151624 -3009282 1513568 -489373
390 -1632063 -2341642 2172829 -1918596 -1520316 3237838 8104903 -4307076 499442 -1875622
380 1572176 -2075525 1047992 -522244 -454130 4343464 -79685 29758 3032409 -5156735
370 5452593 -1948444 -231477 -143414 -794766 6547485 1680894 -1025325 -3108144 669798
360 -4577910 -374560 -1545314 997738 3598666 -1438828 183698 2804028 491684 -1144926
350 -89442 1266951 151386 -1522709 2819811 -301486 -740362 -2466210 2347983 -5720423
340 3487454 -1852365 4516534 -1903563 2311917 -4883200 -320420 5947914 -4859581 89439
330 -6051867 1655272 790393 631505 -2092662 -1336009 121610 -2488407 4030795 -1755483
320 3660127 -384383 -2265529 3861884 1614678 -3534958 1856423 -4035057 -997133 -1057925
311 -1057925 -354266 3159517 -3067118 3413291 2280356 -3525072 -820665 4597471 -5805680
301 4144133 4166216 56158 3873837 -3954500 3388931 204771 656929 2553345 1380107
292 1380107 -63672 -1565278 -1343399 4132451 248594 -906832 -2973604 -1347246 2400993
282 -109318 3731864 -3525783 3907523 2016416 -4181527 368240 2074674 -741639 -4188571
273 -4188571 -1040955 122219 -3201774 -741236 -3225006 172303 3519793 -6791096 -3087447
263 1452803 1531908 -264313 -8209534 3317891 -4951704 3129518 -5953507 -1916219 4954134
253 698209 -1907800 -2622022 -3114837 865374 -2222603 -1283526 6191040 -94567 1778222
243 -1312267 5040291 2492957 -2515687 1514209 2513977 -3557287 2303664 1211749 -316595
233 100411 -1620349 -2618238 2600076 -2684695 -5593419 -1703842 153186 -5958949 1001194
223 -1528959 -1370677 3991379 -2363194 605429 1999252 -2198786 -300995 -2742432 -313050
213 -4259404 -3845428 410797 2759967 -933137 4477461 -2691860 219969 -2100519 357824
203 -1690728 2715434 45589 -1118068 -5450364 -2821839 -3461936 3076575 -3557011 121010
193 4154060 2025003 2439138 1969138 -1712446 -1032376 -11990359 -56312154 -148793022
185 -148793022 6354149 54727894 142720027 132915942 123439280 20168342 -61025576 -119609260
177 -119609260 -116488671 17630725 2843964 1487535 976216 -2779363 572347 5829284
169 5829284 -1136081 -6946365 853476 1278531 -5887686 -1265055 -1608410 -1916312 2894019
159 1258360 4671431 4497839 -6058332 3782788 -933002 -1204878 -368043 6437330 -5150053
149 2560724 3703093 -5513669 524061 -661337 1020728 3467195 -999526 -3683588 1174974
139 -2776220 1190329 -2604497 -273926 2176101 -446903 1897654 -1911957 1982125 -1805938
129 -3769407 -1831074 2307320 -8512090 4018400 -401822 -2988117 252412 422408 2182416
120 2182416 2456021 -3896931 -1388987 -1439996 4403211 -1790075 -1018361 589414 5178664
111 5178664 -2809638 5549618 2481175 -1565437 1322022 -3977139 -717270 2482350 -4945014
101 2934077 -2925320 -491675 -2188553 3690724 -1806450 5292873 -1198034 -3554424 22508
91 71566 2440047 1115162 -473725 27697 -16367 -1214849 -5207249 453239 -2898251 3381422
80 -828332 313638 249254 3684223 -1840876 5285698 -4037021 2921930 -4950073 5289424
70 -3675774 -3585645 846216 1857037 -5162883 -2077890 3485251 6926694 -1073838 -1693005
61 -1693005 421613 402826 727344 935965 -95593 -652535 119815 -2513767 -4293986 5561620
50 845552 -1342159 5065958 -935508 -424638 3704452 -7324214 -393778 3245633 3847258
41 3847258 4365400 -1569370 -1925349 5508777 -1188733 1657656 -982303 4546314 3947617
32 3947617 -5375553 -1617922 4795836 5560844 -1161287 -1786605 823709 1995926 2169595
23 2169595 910022 -2059761 355731 2250784 930684 -3884470 -2125727 -27457 -4084562
14 -4084562 2234257 -1369810 -1133941 1826693 -2024100 487881 -504724 602832 -1766076
4 -621829 4297621 288889 -98107 -554871
0 -554871
##PAGE= F1=5684.175139418
##FIRST=     21204.543296753, 2672.49122660428, 1632216
##DATA TABLE= (F2++(Y..Y)), PROFILE
2047 1632216 771861 -513014 -128578 6909141 -1753851 642674 -449288 -40050 152034
2037 873206 4070628 -2159437 1225580 2643913 4291984 -4654253 -1862549 -1598534 522684
2027 -3326014 -2642278 1370503 1849824 -2938485 1440765 2803355 -3196130 4821117 -162302
2017 608710 3628080 -2733427 237802 228901 4112121 -6223083 1085863 -2799709 -3743956
2008 -3743956 -544883 5368252 -3880260 -1507441 1998716 -2864465 2876192 -2292253
1999 -268605 -1209335 3200555 2398250 -2155892 -7944407 -1849948 248766 -450073 6468058
1989 -4382597 -1092621 2791779 -415440 -1823174 -181093 1122856 3402054 5162628 83876
1979 -1085980 193055 -2093949 -8912084 2809818 -848250 -2263662 -454272 -1477478 -597941
1969 -3120183 -3460813 -2867629 -1969494 1870346 -1360827 -2299909 4653166 -1847983 1863953
1959 -3347758 -1814356 1066732 -3300734 4005340 4240982 -1182852 -1079913 -1339164 -2424386
1950 -2424386 -118271 151180 816163 2771528 -1903660 -1465536 1114184 844779 5065495
1941 5065495 -7315453 -164291 704606 -2276921 4052866 3108441 5175128 -2559505 1810267
1931 -3690251 2240943 1025497 2328199 -2074298 -1891115 -1128174 2874931 -3661075 694336
1921 2731478 -700785 -4246160 1466532 1355376 2060547 596634 -3313547 -2816779 -2339803
1912 -2339803 -430024 -1746442 1394073 -2784218 1828168 -2554320 25505 -723338 375887
1902 -268170 -69693 1249616 1026365 -2967563 2266693 -562018 734882 -2890717 887110
1892 1527121 3542417 -681313 -1121295 -2699196 -1666771 2345488 4398350 -662088 -2581236
1883 -2581236 -1963724 -4067319 4273700 -5469075 1537139 -3164672 3403944 -4158928
1874 -576416 8262290 -2467222 -4028307 -708942 -1462363 363647 4250625 -138295 145634
1864 2592444 -101288 2880567 1185885 2856489 -3123678 -3093526 -1630333 2245290 -2273868
1854 1707193 -417319 2531897 -484889 -1036464 -3110475 3379694 2456997 3563352 4429883
1845 4429883 -2321932 -1897424 3328391 -1258327 -497142 399547 3470410 -2470073 400128
1835 -4255999 65388 1547770 797997 -791288 -2592521 -1285841 1800637 -3534121 -1290679
1825 2712498 1289504 -1049016 -289993 -421199 327979 884618 -2134417 115214 -3877644
1815 1949116 -1063690 3656058 2292259 -3418251 -1795541 1669020 -2000718 3353608
1806 1377035 -914321 -1380663 1684500 4516492 -6062055 -843556 44163 868126 -3001274
1796 1202664 -5761545 3011070 -1933096 1014679 1395342 -255539 2738399 3837866 872083
1786 6362239 -4264220 4062475 -3705749 -637064 -3885497 807845 1077571 -1536737 7315284
1776 -4059496 1896866 -2467557 -4207386 2278627 2612883 -2560372 1077640 43210 -3975540
1766 -7168084 4559222 1150950 3559114 4724902 -2606567 -1728330 -1093154 -1172894 1301232
1756 205436 -686080 -336983 2062499 694038 141298 1008774 2989716 3681767 1618613
1746 485060 3239075 6190690 -1106267 760212 2545951 -1768697 1368545 -817514 -2698876
1737 -2698876 3801833 1246560 -3834145 -4153981 1653721 -1759654 -1413842 -1831774 3102724
1727 4125512 -148099 -2217111 -639449 -596500 1793693 3158495 2965187 -1034690 -316869
1717 -2665238 317420 -2278254 3182215 -3397976 -8474189 -619599 2152981 -5691977 -2306088
1707 554462 -512632 -2095737 1518809 46660 -1654164 -89174 1416593 -379038 -5384843
1698 -5384843 3318283 1840823 -1041087 3923359 -3208392 3082998 909947 2499456
1690 2499456 -2882227 -3594570 -872975 -3487332 -765675 -146649 128957 -74347 -63398 1924304
1679 1416417 1219685 -397057 -437195 -1592133 839546 4295700 -939979 -1430922 365726
1669 -3358792 -2132567 6372183 1567296 -3116778 1221237 -739046 -22891 -1148600 -4932110
1660 -4932110 6905369 -4472836 229708 2275576 -1842911 -1574260 649652 562405 -461736
1650 3870621 -51556 -477371 -2528898 5201752 -6790214 3041640 -1053866 -4549497 4619289
1640 2262799 1354963 2013555 -711919 3373856 -1849424 -643693 -904175 -1960486 113797
1630 -344533 -374932 -746633 -643906 1587259 948368 -686110 -3568697 322416 436872 1217308
1620 1217308 4105374 2470664 -4045940 -4098758 -3370508 1038927 -491846 -977059 -373058
1610 3425366 4578327 -2903927 109875 -3086743 178721 1787294 -341423 -395795 402827
1600 -1786823 3381569 -169370 547651 -518577 2380474 -3161386 3598301 -2747761 -822325
1590 1367821 3361424 3699919 -1340412 -2545888 1446300 -1129562 4329675 -4306560
1581 2125340 -663852 463136 -1062216 -5207670 -680490 1678624 -1290845 4089284 2157478
1572 2157478 -1525328 -398384 1774283 -2742044 3378446 664640 -3457979 1147393 216110
1562 371100 -7474499 140673 1692422 786883 -1044689 698906 1574710 -2932651 236255
1552 1669893 -2715345 5566758 123639 -3979116 1002537 -1508681 -1548146 222394 3493935
1543 3493935 -3827065 1666052 1206133 2797347 1033810 615628 4051476 1332030 2419680
1534 2419680 2472611 966305 -4063193 -189832 -705319 3489952 -2510280 3019096 1971536
1525 1971536 125723 3977225 1162676 -955871 -1467805 -63585 -293488 2560614 -1227766
1515 -2675691 1551676 3700090 -1292566 1259589 -3999429 919308 -3453834 494915 628170
1506 628170 -6463991 2247048 81898 7568824 -914945 -1061243 490531 1440122 1314109
1497 1314109 -4197710 866930 -1666286 3213696 6761002 -841324 -333076 1827083 -486730
1487 -240351 606630 -368484 4445504 -5621157 3989885 727753 -1658316 -1532671 2251423
1477 -6197913 938117 -2674633 -399841 206694 6998393 -3512921 119110 1110381 -793973
1467 1237321 -6237353 359214 75632 -3315564 -2099143 1664033 4748703 -1647118 -2540397
1458 -2540397 1689094 -23346 2940585 -5206396 6069037 -2858413 1664883 -1669230 825536
1448 2996973 -678291 2067534 660208 -3831513 -1374986 1703120 1717301 -922094 4683338
1438 93489 4182846 788964 -1815487 435943 202980 -281021 -366434 -4145465 4448459
1428 2074613 726642 -2775510 1902886 -295174 1505208 3675705 -523113 -848685 -1728538
1419 -1728538 -1022549 -363798 -2051218 -2346445 626749 497982 1390602 3302165 -364205
1409 3510288 1013624 6871260 -4319576 -3011773 -2113871 -1559893 316744 1827039 -5758997
1399 3778399 1844631 -8544433 4566121 1749944 5194194 1805230 617751 2370057
1391 2370057 -743083 -119591 71942 -907425 2286495 -86421 -2250794 -1621760 -231101 -1194868
1381 -1194868 -2003590 -6374876 3828212 -656214 2010024 -1358567 225599 -2500926 -1214797
1371 3346514 1205352 -1366048 -622272 -1436222 -1078631 1286516 -1079788 2579316 -3035428
1361 1749570 813273 -3412974 674680 -1561097 1790934 -970145 1485240 504435 4442666
1352 4442666 -5200623 634743 -5291173 1987035 -1218176 -1690621 173032 1469715 -1772499
1342 1157533 -3800270 -2549292 7138913 -1153907 -1691489 -4188698 4598400 1442558
1333 -2001028 -638251 2403234 1045059 -1797680 1993458 -111384 1835450 -458905 -2044180
1324 -2044180 -1972684 6176300 -3411667 -2495817 -792412 -2864245 1482681 2573514 3041974
1315 3041974 -5404603 -2382353 2740378 -254053 934248 2855194 -1122466 -458575 2417541
1305 -3088403 -1125315 3222745 -2911091 -3081998 -1171220 -1651241 1033475 -3662920 -162019
1295 1758509 -3059305 -1757634 -2624483 2992283 -130439 -387467 2027001 -4284353 -3264799
1286 -3264799 3113917 -971784 -179360 -2195388 1229932 -712242 -942084 4538270 68440
1276 95764 2400697 -731088 -4456269 2160383 755599 754555 31510 -3145484 -7702482 3403155
1265 -2446124 -1623678 2724325 310508 -1220719 -481930 17652 -3117006 5736333 -1405049
1255 -584548 -5842959 5129442 -2436300 5816491 -2290873 -1546102 1232011 1549952 -1370035
1245 -2204847 1390811 2506456 -2364199 3475761 1400284 -352000 -2678514 467401 -2867402
1235 611747 -3028100 -689735 -814155 -7116468 3131148 -85271 331705 -1440170 4238808
1225 -898913 -509027 2728976 2276675 -1714060 -2386843 -2602968 456475 -3971322 -724734
1215 -1468422 712102 36687 1173381 -1666242 -388869 4113542 1370471 -2509800 2732263
1205 -226201 -1679831 -770969 1933815 -1918452 1473115 -2813016 20180 3582681 961676
1195 -4233739 1449844 -1885070 -5805091 -291983 415120 2086733 1670956 -3014091 274820
1185 588246 889547 843317 457141 883293 1667494 -1560099 1365379 -1420168 376877
1175 -712800 556526 2700681 3178463 -2184623 5033961 -2242639 -1181995 -152587 16727
1165 -789291 -2058818 4029245 -1948751 2271264 4501724 -2190285 -2485219 -1354517 -3431828
1156 -3431828 1018116 -3468616 676781 -1057637 2108620 5306562 174161 -171869 3185048
1146 704976 1244914 -2183253 -2343354 -38182 -435326 2906698 217151 498004 549950 -687845
1135 2427902 -8172701 1100622 3249351 1828290 1943608 878634 92135 -307081 965739
1125 -2374624 574097 -1558596 -3489671 -4731767 -3256880 1951321 -1464599 -334087 2897974
1115 -3951721 -1423954 2250763 -5622249 3040611 -302926 -434091 2104628 4187602 -334154
1105 523797 736596 2424083 899096 2924087 -3987183 4189826 1931391 -5270584 8711393
1095 535469 -1721692 850800 -2214238 410256 -2165837 -4505250 587772 -552355 84076
1085 3119303 -3692950 -56229 -1109253 532421 -282358 -3420654 6206098 -339258 1201184
1075 4016947 -2577902 320815 2295162 1967783 -932113 -50113 -2851287 3322687 -1285553
1065 -1238537 102133 -2831120 1189286 1508009 3229471 -1220569 238732 -323212 552356
1055 -5038735 -5547676 -503095 1174156 2256074 2274124 -913588 -1054748 -425731 -1144919
1046 -1144919 -1081252 -4150376 6018383 -5655500 -3298080 239764 2863015 1798858 -1104155
1036 -1446210 2950618 16715 -631747 1096710 -4806105 -3976412 -714040 4265008 2792112
1027 2792112 -7835147 833431 -634549 3709025 -1641910 -1842851 3114321 -2793057 -6566055
1018 -6566055 1758248 4721998 -7042518 -301442 8135137 896519 -4129071 3819199 -2528075
1008 -1698329 -2322557 3279437 917894 465370 -2257826 -4413838 844362 -3883240 -1918347
998 2101789 -3263923 837209 -1358144 3487433 2735869 -722512 -3996616 -1198327 443674
988 -2758880 5239279 2327635 5891201 166668 4700380 914873 -1338652 -2249128 2529925
978 670337 -3376529 4711110 2387114 -5072343 73139 2716851 4451099 4036794 145673
968 -867106 2435048 -168708 2549510 3867119 -328162 749755 800088 -797719 -2480471
959 -2480471 -99824 -241794 -4802467 8044450 437263 -2872960 2734846 -1006708 -526584
950 -526584 4100856 539351 2284558 -2451286 -4928975 -1088117 -1064389 -3096542 -1072189
940 893661 1065032 -1699946 1014434 155375 1279188 -379656 2512397 -567876 -2660551
931 -2660551 1890075 3779308 -1455473 -866818 582271 -2235445 687534 1160159 -4576952
921 1312012 1576031 1377656 188933 -4029579 -1758099 491431 1053161 -3585566 -1636518
911 -1754842 1524690 -1183412 -3026723 -185127 -90346 -2724142 -2725894 -1472874 626122
901 -2155011 -3289198 3712359 -762236 -1055243 -3636414 -2668468 1469833 -2304669 -2162215
892 -2162215 2960356 223614 2235715 -3477777 398443 4574634 2510056 1173947 -3069881
882 4063268 -3018250 -206443 23335 429929 632009 2136516 -3156034 1587559 -120584
872 1740550 1149150 -4165070 294189 -1558717 1051707 -1943553 3359796 2792121 -2672433
862 1431346 3564261 -1854392 2349237 -807883 4795898 -4369200 675072 3618805 1092739
852 -3054534 2227834 -1612857 3239668 818327 340650 -2639918 2527362 5121573 -3493461
842 -1861272 -3948706 -3887645 2130183 -2198049 2125998 1023568 -1972206 -1311988 -1357455
833 -1357455 -3039678 -2495992 3590041 -5412248 2170653 -4522748 -3623050 -953249 2914156
823 -1159010 -983997 1747203 -4302673 1104378 -790978 -1822268 -497287 -348108 3407636
813 -6209963 -878222 -2593776 2198618 -538218 8137284 -3968275 1342558 235005 1024305
804 1024305 3716035 -892760 2032047 3006892 -6198224 6039291 3001886 938374 -827271
794 899852 -2458944 3625700 -2102180 187812 4593919 -679246 1127630 2280551 2518502
785 2518502 -1048199 -351075 3088781 -640858 2615672 537631 3456411 878104 2072049
776 2072049 -5297897 3666960 -6345906 6413505 1514415 -1574351 -1761992 -141308 1977651
766 3897966 3132858 -250617 -1588233 -2763326 4211992 -4772402 1795643 538265 -1338370
756 406755 -2830348 -4772967 6092945 -945730 -1896094 -6120880 -1097154 940909 -3060970
746 2760844 -1493873 -143313 6342344 1954315 -292130 3403570 2500800 -2421037 3217571
736 1968089 -1088476 1606921 1437992 -2715255 -155536 -2820011 -5148843 829551 -533354
726 -185129 1170843 883972 509220 -2469699 2797865 -1648239 -1441010 2594508 2841325
717 2841325 -1243187 7690745 -1060395 -7409283 -27771947 -8911115 -13479608 -5005411
708 23644601 32161356 15863378 10573406 5770010 1350354 -11746603 -32879794 -30417588
700 -30417588 -23276600 -31940438 7038417 43010157 25298334 26030318 23999150 -8956079
691 -20042867 -2228863 555014 -2819962 598504 2368306 -947241 -5955271 4195813 652317
681 7394933 -3349014 1944320 -87994 915999 273121 3501889 2255269 5518791 25903159
672 25903159 10127707 -15019342 -13466578 -40228810 -9133156 -26399303 -17505529 8491422
663 19907158 38155779 21130989 7162267 845198 -5959853 -20214562 -2683791 -6093362
655 -6093362 -25084124 3250415 -7911525 12205715 11271904 -2785306 803158 -2680372
646 857040 -2191110 3586116 -2354411 -1015692 1852762 1366820 2859306 1232070 -6574143
636 3815476 3009364 342426 10360224 -3838963 2413438 -141257 303134 2561683 2214616
627 2214616 -1013691 2546290 345386 560281 8030139 10677793 28804988 42998427
619 42998427 55606770 -188103639 -285661149 -104165481 225465534 84826703 18978211
611 13758629 8926543 5817737 3930521 9822905 -1328926 -3376055 2655748 664878
602 403456 3394862 -1673465 342148 6384858 2555495 -3699564 -190559 -1212450 2636678
592 5044269 -3229216 777364 3402261 -1901636 984263 -307787 1923397 1024555 -2779469
582 1806900 -3149776 4434319 1234541 2975120 1414624 876541 -1441825 -1521742 -516242
572 -1882349 -88103 -1905863 -254528 5596960 -4452942 380839 -3849656 -1118763 -613560
563 -613560 -275487 2145952 3878740 -1514336 4717680 -1582503 3212670 -854717 2293891
553 58993 36760 -710882 3600069 3196691 -3207184 -5580291 7135214 -5092505 373123
543 -3198610 1699113 211361 644249 -790654 5803095 2262994 -8902831 -2271194 -2458885
534 -2458885 2965116 1499129 -1262164 -761785 6647594 1240805 991496 504920 1721888
525 1721888 -1741801 1902745 -3041905 6063138 -1277203 -2095025 -341823 -19923 -839596
516 -839596 439881 1763675 -1149241 1405435 -4528796 3636728 -1111182 -360731 -3485986
507 -3485986 722304 1753058 1931855 -3203441 146295 2095871 -618389 1213235 -2616869
497 4394986 -232768 2436049 -29537 5648352 -2784537 -774668 2554227 2601055 -747716
487 1315681 -5424825 3585094 678938 2700584 1555462 -439463 2637182 1429895 -1677175
477 993122 244778 -258818 -4051059 -642289 2169999 1075010 -1171204 -3257040 -1411872
467 1891303 -825505 7776363 -1545645 -2669452 2700856 1267084 454251 -7051758 5785887
457 640611 54500 -1145246 450015 1439524 -6495085 -1827163 2917839 1390084 -858822
447 -2343387 -833945 833659 -4961157 -584340 885811 -1007835 -6370640 5931880 -249001
437 1338245 822288 -71434 4160421 -3645249 -719115 2901449 -823071 -2461841 825175
427 -5608057 -1689560 7669712 -151778 1067492 592238 -1577909 2121490 -171824 -2025298
418 -2025298 -749228 1202661 92588 568393 195670 1152618 -4109594 -398824 600033 5048350
408 5048350 758365 -2693081 797567 2352106 -1887678 7109750 336293 -2422132 2428014
398 -1007720 4402190 819599 3453462 -3450118 -2032020 819625 -725447 -670279 -2659766
389 -2659766 1401401 -1399423 -2598669 2846675 7713040 -4634661 373785 -433682 1558432
379 -2001715 1242518 -352211 -791620 4611238 -544935 -276495 2922406 -4911011 4945636
369 -1869658 41488 -221709 -1394308 7141088 1148474 -1135573 -2995733 373898 -3788012
359 81091 -1597665 1201667 4189398 -2245110 -83584 2946818 185323 -1539509 659928
349 1606338 -304098 -1106475 3121080 -475988 -113216 -2294463 3302688 -6617020 3001023
339 -1368180 4889817 -1661410 2585978 -4978757 -539445 5786491 -5794529 856048 -5978084
329 1756930 211041 909629 -1713336 -1287834 635176 -2668403 3602953 -1503439 3048905
319 281063 -2106849 3629963 1685951 -3975017 2175737 -3905570 -1023601 -1773489 229999
309 2777178 -2612307 3151192 2345873 -4018955 -761809 4801945 -6475158 3977381 4350157
300 4350157 -25399 3878407 -3369979 2636982 389122 174195 2171518 1046818 676980
291 676980 -1226623 -1604189 4560073 -71843 -529599 -2794433 -1199427 2375738 -23176
281 3314515 -3686911 3819018 2128532 -3791639 -137015 2313858 -1786288 -3683388 -1065217
271 201713 -2387066 -239515 -3604695 587404 2775043 -5766258 -3371905 1545714 1324623
262 1324623 311907 -8282292 3126049 -5758218 5340478 -6328005 -2004471 4286168 1156989
252 -1815406 -2296155 -3211765 1022492 -3052244 -1455114 6475094 93985 2481494 -1901943
242 5355810 2360713 -1730861 1102051 2866393 -4441003 2417215 2496949 -73156 454023
232 -1134648 -1879106 3067016 -3291418 -4889118 -1517800 420937 -5812134 1022006 -1404489
222 -1564879 4806288 -2243865 -18119 1799390 -1013109 -532750 -2506083 52624 -3890187
212 -4377741 924365 2312919 -720334 4651565 -3301557 142303 -2448108 449269 -1186290
202 2580430 -60184 -1171532 -5288344 -2959054 -3251439 2922852 -3377785 -293339 5000841
192 3652923 2967705 1111154 -1250444 -1728325 -13227953 -60539040 -163526929 6937904
183 60126282 156918599 143766387 134122054 23053592 -64166224 -128645620 -125256933 18112188
174 3298322 814520 888458 -2726452 594184 5762909 -951306 -7271114 -115701 1178080
164 -5940908 -1142102 -1878566 -1912740 3696505 386994 3868822 4831866 -6533894 3425676
154 -679104 -724667 -101218 6911802 -6319185 2842236 3979724 -5035227 -452142 -370154
145 -370154 629533 3793500 -241105 -4145010 1978868 -4042170 1171827 -2216465 -876114
135 2760293 -736695 1764775 -2291806 1891549 -2078174 -3957392 -1618911 1809918 -8474905
125 4379219 -320102 -2978954 569530 650346 1799646 2098544 -4168298 -1964333 -1107520
116 -1107520 3675753 -1207295 -591138 217670 5834654 -3369184 5755136 1752157 -2222605
106 1441339 -4419939 -1038318 2517603 -4919949 3524689 -3115967 162209 -2178608 3372523
96 -1333815 5569214 -1797789 -3233340 51209 -481146 2224421 661395 -979613 704849
86 499351 -174454 -5602011 790441 -2872622 2423555 -863325 -28159 1229232 4656459
77 4656459 -2883233 4399442 -3457997 3057021 -4741832 4419243 -3119748 -3973786 805966
67 2209072 -5394442 -1737737 3128899 6440886 -1114974 -795106 -347132 1086879 717660
58 717660 471212 -163001 842909 -622625 -2769352 -4011794 5048075 503526 -380425 5220298
47 -1474588 805619 3337929 -6835321 -1251964 3140473 3268757 4052266 -2682976 -1456394
38 -1456394 5295791 -844395 2861988 -1645451 4231520 3653940 -3724260 -985124 3708708
28 5347038 -1006474 -1647316 829430 1716930 1751523 818107 -1938891 -307776 2457400 869871
17 -3672248 -1904748 232339 -4624587 2983072 -723566 -1112004 2011302 -2452949 -54225
7 -1068731 851966 -1917126 -495703 3468372 473639 -183240 -723104
0 -723104
##PAGE= F1=5662.376869535
##FIRST=     21204.543296753, 2672.49122660428, 1670188
##DATA TABLE= (F2++(Y..Y)), PROFILE
2047 1670188 1000836 -429994 -88901 7042385 -1478449 1030428 -390819 52369 435382
2038 435382 485837 4295684 -2280477 1104039 3939899 4061900 -3492789 -2634785 -1400415
2029 -1400415 973949 -2542803 -2738600 1444743 1867926 -2865135 2296274 3143113 -3596033
2019 5194983 335314 356949 3981669 -1825324 -147273 520381 4352972 -5546412 1388909
2009 -2553647 -3139066 -750734 6010998 -4008481 -1355247 1939038 -1808318 2763730 -2829081
1999 -292512 -1414828 2976203 2427331 -1722008 -7979546 -1062190 376705 -110129 6914230
1989 -4662649 -1832110 3248994 -708026 -1326897 500461 1110091 4324688 5423452 -141916
1979 -1393382 840566 -2201161 -7014809 1904091 -1662324 -2124012 510648 -2082711 187537
1969 -2788538 -3172985 -2960317 -1529504 1979931 -1852058 -2392569 4618269 -771895 1825829
1959 -3301449 -2334633 1803021 -3259330 3726168 3674940 -1439587 -936196 -1446156 -1947023
1950 -1947023 -220687 496640 -347516 2583543 -1537944 -1472967 1676058 812204 5484154
1941 5484154 -7643447 -492838 998767 -2047219 3429618 3813880 5277966 -2420612 1396320
1931 -3802960 3025500 791758 3024925 -1689691 -2434444 -203568 1760585 -3138924 1023763
1921 2855932 -734274 -4378715 1565945 1568761 2076084 660171 -3039816 -2439993 -1905184
1912 -1905184 -615238 -1687645 1681470 -2370819 2145050 -1922722 -757658 -10981 835687
1902 -420214 76262 1200136 1639792 -3247792 3004936 -1382926 1101684 -3348704 2103671
1892 666034 3993629 -1626629 -179017 -3215815 -1899476 1399732 4342486 -121471 -3035234
1883 -3035234 -2200203 -2659730 3583751 -6504818 2930111 -2699660 3586134 -3424990 -555489
1873 7658870 -2038160 -4844707 -159804 -1195818 -557380 3467073 -19874 850268 2729439
1864 2729439 -641707 3368573 914646 3582939 -2504329 -2550875 -1486490 2888889 -2949883
1854 1778123 212509 2129623 -159965 -2249873 -3332597 3546879 2026498 4176150 4508860
1845 4508860 -2774299 -1386903 3418190 -2182061 -222619 -97585 3797500 -2247916 722864
1835 -4165677 597036 350726 656415 -1606070 -2418688 -574913 2269077 -3434762 -1506019
1825 2965483 2164724 -1390202 102383 -327287 406939 811933 -1503708 -1158976 -2868226
1816 -2868226 2286141 -2620578 5231825 2772102 -3264109 -1584027 1901446 -1951304
1807 2757997 1253568 357438 -1385926 1683910 3814238 -6232274 -1425721 39791 624015
1798 624015 -3556581 1139901 -5386537 2582134 -1586310 957721 1297882 -283368 3489160
1788 3497959 1600344 5750356 -3909392 3690945 -2913239 -1766840 -2683969 361340 1145523
1779 1145523 -1705766 5550646 -2763635 1742341 -2721650 -3995187 2500097 2250726
1771 2250726 -3009319 1859620 109453 -4537947 -9227677 5287966 1549800 3578662
1763 3578662 4293995 -3050993 -1054124 -1178489 -791897 1250954 750642 -728936 -872731
1754 -872731 1745762 159496 -1016272 1902731 2784400 3234264 1510318 554284 3611357
1745 3611357 6384101 -976179 977490 2123530 -1884942 2328919 -634450 -2817382 3990139
1735 1552594 -4102663 -3880768 578124 -1967968 -1682690 -1525115 4161977 4132962 -62627
1725 -1853148 -75364 -626601 1468417 3709889 2697879 -941339 93661 -2890612 238398
1715 -2317661 3260023 -3125699 -8212010 -208831 2808537 -5922056 -1961694 -198266 1205754
1705 -2004146 2234884 199767 -1179153 472117 1695373 -929472 -5283216 3431558 2479556
1696 2479556 -1629716 3316681 -3083493 3532197 572481 2515681 -2571345 -3074035 -1106200
1686 -3995516 -820216 -217194 54640 1285127 -7707 1958861 807238 987989 -179692 -924429
1676 -924429 -962758 988943 4704261 -1649412 -1143169 -714967 -2796689 -2864484 6428158
1666 2269585 -2858002 1005288 -322957 -651170 -350693 -4123825 8162354 -4647407 681931
1656 1654387 -2244328 -1381310 -60543 1622668 -696502 4040451 -13690 -402188 -2898462
1647 -2898462 5204991 -6071001 2518098 -405907 -4690299 4875403 2425616 1497343 1222627
1638 1222627 -382150 1315634 -1991430 116670 -1071387 -1034431 -49443 -241462 -938294
1629 -938294 -297255 -837416 2507022 638183 -365215 -3334560 379361 -58594 1478947
1619 4404594 4846881 -4507218 -4009304 -3420896 1104749 -407517 -1061628 -659496 3252671
1609 4479394 -1723619 -616287 -2799982 419703 1572405 -21783 -1365480 591061 -1543945
1599 3068009 -351016 496786 -825283 1757325 -2729186 3558985 -2503586 -1289287 1403343
1589 3490458 2622238 -1396610 -2571616 1483580 -1739661 4913214 -5360549 3256574
1580 -559304 810274 -929763 -5188954 -608383 1724119 -1640384 4052105 1438931 -1719413
1570 -188933 2806405 -2433047 3092816 293900 -3422759 1570978 -609880 654202 -7420104
1560 -45185 1520699 917826 -759512 -151839 1559463 -2225292 963221 1275140 -2211193
1550 6021136 -566832 -3958580 1664099 -2188855 -1321700 430819 3926200 -4282527 793228
1540 1648171 2895820 863621 822765 3884442 2016680 1931931 2554233 2038695 -4569787
1530 142620 -1152862 4891571 -2122966 2360911 2254851 -121642 3719475 973667 -375557
1520 -2195314 -164183 -358847 2800715 -1266091 -2385859 1426449 3202243 -1468861 1789196
1510 -4289837 764652 -3629627 1138170 723415 -7232656 2308487 406871 7528109 -1077877
1500 -618099 273438 1871118 1142159 -3102875 -20066 -1149557 2947127 5773080 -470844
1490 -834016 2185116 -707781 -719349 1919938 342185 4287886 -5105293 4044746 950035
1480 -1112283 -1118644 1793526 -6230261 925616 -2198266 -281894 22254 6575131 -4069511
1470 -18128 379804 -1299443 1269861 -5525435 26472 195099 -3229593 -2227263 2284144
1460 4647182 -2026052 -1955549 2006993 194734 2700415 -5292639 5064529 -2846562 1895872
1450 -1587212 873690 2729066 234958 1923359 928390 -4476614 -2223619 1698633 1997432
1441 1997432 -51868 3712179 637698 4668482 150714 -1420056 372196 -15999 -840677
1432 -840677 112484 -4684894 5113998 1757784 548200 -2428554 1771454 -855092 1314270
1422 3639449 -952158 -1045304 -2147098 -1093232 -323423 -3072301 -2563022 151729 1108471
1413 1108471 1813326 2936150 -272691 3563453 989179 6466093 -4364939 -2963117 -2079417
1404 -2079417 -2067541 741518 1469574 -5166886 2230543 2287042 -8653273 5153545 1433493
1394 5953529 1418177 432858 1682308 -862672 452194 688092 -1308176 2538960 -343947
1384 -2103700 -1046313 -1495539 -1433710 -1027920 -6739376 4017872 -1434987 2474474 -2256541
1374 632718 -2279371 -1395990 2644825 1230185 -1879160 -546169 -1176319 -730897 1178173
1364 -1303852 2395806 -3803647 1505656 927828 -3107156 21232 -1435527 2659793 -1477300
1354 1699712 265028 4083398 -5389201 688325 -4410006 1052796 -991075 -1968628 -92897
1344 1132823 -1721532 -339723 -3471842 -2172171 6650510 -919020 -2228710 -4515265 4705237
1334 1312404 -2518302 -1004679 2895157 1090473 -1701987 1496198 -102236 1882035
1325 -278715 -1628939 -1788042 6106069 -3897176 -2257257 -1172308 -2528580 1012904 3930449
1316 3930449 3230534 -4593377 -1926138 2919031 -255009 1338656 2814352 -109865 -242834
1307 -242834 2064803 -2611490 -1219129 3534102 -2608057 -2665493 -1883117 -1729703 1264159
1297 -3933504 -461715 1762208 -3227286 -1312066 -3090042 2707913 -741775 80557 1337007
1288 1337007 -1826821 -4780388 2790491 -1047848 -560837 -1015264 1318985 -1062186 -1460876
1279 -1460876 5208644 -23824 233870 2004404 -1959348 -3982130 1435909 1851845 615756
1269 -514223 -2585007 -8521075 3301285 -1851799 -1940603 3186432 347164 -1447377 662609
1259 -511481 -3033390 6175684 -1466848 -317388 -6489713 5011611 -2893550 5693917 -2424107
1249 -1696237 774306 1530662 -1074624 -1456250 1173662 2493598 -1494740 2956714 1892941
1240 1892941 -551048 -2519916 411951 -2477187 847675 -3055231 -511381 -1127765 -7334726
1231 -7334726 3071776 923491 -1262750 -654307 4332796 -1363455 -474140 2610934 2095387
1222 2095387 -2288286 -2074572 -2555690 -131268 -3435553 -664899 -1225836 647486 -325932
1212 1906712 -1783718 -296811 4347977 686767 -2027904 3622007 -1377263 -1377960 -1285499
1203 -1285499 1964596 -1831561 1546185 -2319664 -73890 3233016 659007 -3993003 1224124
1193 -2503645 -6223560 25022 839538 2308596 2049213 -3468671 91616 620793 1119460
1184 1119460 1273467 449640 883807 2256535 -1715005 1444890 -1571608 563970 -1313160
1174 209082 2397601 3421883 -2740744 5204921 -2727244 -1028246 -106998 195593 -573255
1164 -1312106 3694222 -857564 1698781 3917566 -2391266 -2385448 -2534202 -3229564 710795
1154 -3188276 264396 -1317967 1974967 5119290 558150 -834822 2868796 198013 2476300
1145 2476300 -1915900 -2140527 -463207 -491104 3056209 390523 -266120 381873 -752405
1135 2563798 -9212955 686828 2915721 1935430 1937667 924582 -1093656 766403 708574 -2031670
1124 471276 -1082291 -2872288 -5531765 -3221005 2012533 -853800 -1148589 3134047 -3499179
1114 -1591268 2279295 -5938665 3193868 8737 77095 2208440 5235392 -456699 -501006
1105 -501006 873688 2804944 9594 2321361 -3484768 4721869 1353232 -4976027 7492449
1095 1126106 -2424343 426362 -1657021 982021 -1655115 -5451021 1470554 -988988 265742
1085 3621098 -3878481 -362161 -1502266 1219662 -283332 -3603747 6071724 347839 344680
1076 344680 4072601 -2089694 344509 1779293 2414361 -1267248 -57114 -2613035 3465683
1066 -1117339 -1496103 -586076 -2356185 1530321 1609759 2748898 -1392899 635356 316115
1056 565278 -4895600 -4343249 -588676 1136599 1916522 1619522 -2173653 -745886 -252181
1046 -1009720 -966264 -3659889 6989347 -6464649 -3083598 325722 2839505 1993245 -2239026
1036 -930450 3510877 -1251982 -151813 1278556 -5794044 -4757430 -7006 4596014 2150590
1026 -8678457 1639636 -701293 4302422 -2008031 -2564960 2831570 -3419202 -6604020 1844460
1016 5407287 -7391864 197504 9222846 -155023 -3686912 4026687 -2331332 -1218782 -2337849
1007 -2337849 3964805 1110944 -150865 -3036124 -4424672 1669665 -3637028 -1260160
998 1864215 -2853502 1270190 -1180198 3652615 3118608 -928937 -4195993 -806823 219027
988 -2934852 4983411 1875083 5119874 399958 3761952 1772625 -1933073 -2379970 2942534
978 751850 -2820006 3909216 2097422 -4579771 546900 2368164 4484288 4797179 -495095
968 -1241340 2594201 -245665 2242878 3389814 -785203 964298 -496197 213199 -3345011
958 -685787 831406 -4950784 8907053 1009027 -3071385 2212634 -1775195 -267650 3918178
948 138825 2651922 -2846367 -4960503 -1418870 -564569 -4333444 1136259 136343 1249923
939 1249923 -2078215 490599 1166374 661961 -256677 3142445 -1437443 -1642337 1469760
929 3453869 -1418266 -819031 494756 -2167909 307920 1885418 -4410037 1866620 546107
919 1365643 492864 -3716307 -1837212 303353 379178 -3195909 -1901762 -1790885 1306488
909 -561507 -3094180 103133 542871 -3162430 -2118698 -1315947 710474 -2035378 -4130424
900 -4130424 3414265 -1330200 -379649 -3250242 -2268044 1324833 -2299742 -2191064 2279458
890 -141409 2431382 -4160586 1811082 4883412 2592113 2022501 -2390401 3278400 -2526706
880 -171264 -281956 326613 443047 2061763 -2912740 1318100 223039 1274704 1328732
871 1328732 -4269681 300489 -2076449 949905 -1018205 3720267 3015151 -3151762 973144
861 3177408 -2241156 2848498 -1486225 4204743 -4182601 144451 3541361 1035729 -2667153
851 1818443 -1399109 3430744 725293 4741 -2103513 1861966 4780181 -1924430 -1589034
842 -1589034 -4840563 -4387012 3031377 -1746815 1009293 1500319 -1901819 -726276 -1543542
833 -1543542 -2945074 -3022992 4513187 -5875143 1285900 -3246980 -3546607 -1713822 3103517
823 -1203434 -992067 2350304 -4546244 1079999 -993790 -1372132 -767560 -98168 4086740
813 -5695594 -675676 -1663716 2331955 -1075120 7402731 -3876717 1101011 -305941 1009222
803 4055664 -925358 1946275 3340101 -6407984 6450270 3232779 49985 488937 722829
794 722829 -2174522 4046535 -2270503 -208280 3973254 -105914 840628 2437071 2175025
785 2175025 -40489 -409840 2680146 -146149 2145498 722015 3356976 902485 2139064
776 2139064 -5445712 4192802 -6358323 6483698 1223193 -859461 -2131380 -206551 1614757
766 3746461 3039445 -405173 -975909 -2752694 3949767 -4003068 1551519 304102 -987165
756 660156 -2652384 -4548178 6070357 -673698 -2353427 -6443161 -1045621 1460735 -2760102
746 2923762 -1514280 -183193 6520327 1523802 4220 3151857 2411118 -2179837 2546799
736 1410957 68631 1213388 1653879 -3377658 164073 -2055921 -4288963 368661 -323350
726 -581371 1363861 444016 941928 -2430119 2752780 -1349780 -2418186 2439969 1633098
717 1633098 -1263261 9105743 -943318 -7656775 -25501966 -9464932 -14116328 -5337104
708 23436106 32215323 17063670 11008218 5125353 1374849 -11078285 -32532896 -31388327
700 -31388327 -22549392 -31779481 7533627 42215381 26740202 24407775 23778104 -9684490
691 -20890124 -1662335 1692689 -1969420 419672 2659210 -2221977 -5051551 3525707
682 447782 6222941 -3438313 2046794 280798 1078551 263482 3716633 2669077 6257004
673 6257004 26982415 9585303 -17642950 -13127914 -41490232 -11000988 -24641099 -18025246
665 -18025246 7748898 18831390 38399558 22813160 6494069 128486 -6282374 -19507606
657 -19507606 -2333988 -6360301 -24649929 3605688 -8563996 13923808 11120906 -2989164
648 452489 -1986924 604973 -2056047 3890548 -1873322 -1190367 2429414 708028 2964733
639 2964733 563755 -5756290 4179066 2890278 379442 11333682 -4303355 2000210 -149456
629 1356302 2272873 2629798 -679306 1746772 596630 -949117 8626010 10460802 28679565
620 28679565 43925194 52391553 -185663647 -282025040 -99567248 221885099 87077731
612 19287382 14077896 8769040 5449262 3999972 8783504 -1659130 -2870412 2409070
603 1134007 1085854 2851803 -1789708 657460 5738147 2564476 -4123499 -596967 -1086069
594 -1086069 2172860 5571018 -3033149 211550 3462279 -1059752 1033717 39408 2147224
585 2147224 499898 -3256792 1967990 -2558568 5856594 1246670 2477758 1355191 778371
576 778371 -1447778 -1726734 -417254 -2060298 -127129 -1603648 -446662 6465498 -4503936
566 669445 -3225813 -616108 -69783 -35606 2424246 2467927 -878575 4531876 -1586408 2736829
555 -1587472 2725066 -104462 -417396 -1046287 3990785 3019003 -2768108 -5679619 7294141
545 -5413698 572817 -3429896 1842756 -243572 1485224 -1002264 6112517 2480509 -7998541
535 -2784646 -1594158 3461285 302388 -509671 -1137779 6753656 2647455 -1161577 149261
525 2192301 -2021897 2577565 -3235334 6910191 -467351 -2460247 -387318 73692 -1497362
515 704423 1228474 -566529 1381904 -4422364 3639221 -630628 -580584 -4084901 606385
505 2090944 2403403 -3052280 219941 1217518 -437722 1213691 -2530567 2626397 89337
495 2014304 139818 5734658 -2102024 -1085369 2607831 2596792 -1049514 1324367 -5879815
485 3251619 930049 2590094 2187113 -482652 2107872 777082 -1863101 149907 -550007
475 72364 -4531401 -1020120 2699003 900133 -1119042 -4305529 -1233212 2767743 -2377078
465 8277413 -1483210 -2541726 2673966 1267016 746832 -7058560 6398481 -289821 -217801
456 -217801 -553821 932263 1366882 -6972318 -1675965 2429683 1348705 -968077 -2261093
447 -2261093 -999748 1817374 -4870927 -317727 286192 -713794 -6597501 5696748 -28676
437 1227593 822322 -168136 4134291 -3303223 -1079332 2735788 -1089987 -2461839 921101
427 -4785317 -1316174 7857685 -1001159 910120 634092 -2280585 2685864 -1059700 -2076200
418 -2076200 -1034516 712935 421654 595303 5856 1018736 -3371423 -980198 1428313
408 4711610 -823 -1666297 59004 2224243 -1620079 6746313 986962 -2197890 2722348
398 -1158054 4321278 807365 3744303 -4579725 -981185 137901 -964884 49898 -2909772
388 322132 -842608 -3578370 2441145 7067582 -4899018 243236 1151707 1548597 -1815005
378 1393276 -153742 -1055257 4734181 -1203389 -481928 2698220 -4505514 4182046 -1753785
368 221402 -544468 -1935016 7558155 495409 -1180019 -2723274 51081 -2961939 586101
358 -1632060 1626436 4567684 -3106710 -263112 2923509 -117417 -1992672 1402487 1919375
349 1919375 -631576 -579718 3238162 -671547 578429 -2031729 3914046 -7232831 2355773
339 -941471 5020183 -1311392 2880265 -4886464 -635699 5374453 -6550253 1690513 -5773643
329 1652962 -215223 1251916 -1398737 -1157640 1107721 -2742473 3169837 -1120892 2339661
319 1007835 -1877538 3127416 1776107 -4353651 2339648 -3637745 -999271 -2282938 747246
309 2195824 -1992535 2822841 2360826 -4328732 -653837 4734107 -6947429 3543295 4464655
300 4464655 -180632 3801925 -2771288 1983215 489652 -375470 1841950 694825 1279779
291 1279779 -821561 -1853494 4931355 -491801 -156209 -2623847 -1064614 2294565 111558
281 2715387 -3668273 3581561 2243497 -3433876 -640872 2407184 -2779948 -2979341 -1072424
271 297876 -1260668 213770 -4057253 996222 2040671 -4203425 -3612941 1514079 1050182
262 1050182 865333 -7753880 3038842 -6735105 7395351 -6110041 -2048599 3361082 1622568
252 -1622593 -1639696 -3272309 1191583 -3956050 -1374915 6495414 201334 3085672 -2619371
242 5298829 2061410 -803250 634840 3349120 -5459225 2360293 3626870 261724 674537
233 674537 -709945 -1028116 3545792 -3733864 -3842876 -1257360 699356 -5418060 1208626
223 -1227621 -1594073 5175934 -2082901 -573820 1518372 373859 -819350 -2072217 481573
213 -3367533 -4753333 1377377 2022744 -529263 4668398 -3768503 125603 -2742349 614833
203 -785399 2447475 -155327 -1281756 -5012957 -3121891 -3037831 2876363 -3234667 -732895
193 5428436 5203379 3388231 185887 -961504 -2307518 -13805724 -59972268 -165797230
185 -165797230 7175537 60776932 158861043 143593328 134353305 23989259 -62544921
177 -127508622 -124334861 16923867 3664288 150764 790357 -2676789 746237 5399960
169 5399960 -675252 -7470712 -1036329 1099239 -6033116 -991487 -2133813 -1909286 4386873
159 -489419 2936622 4936104 -6508763 2943937 -476621 -287211 205946 7019275 -7281903
149 3101013 4072639 -4629058 -1218869 -138025 227341 3956585 657093 -4358939 2673383
139 -5201632 1132645 -1976089 -1358690 3121698 -1029333 1511470 -2593157 1618468 -2211897
129 -4046095 -1604469 1212450 -7956581 4642863 -304265 -2894640 731187 814757 1528747
120 1528747 1442107 -4215092 -2499546 -810718 2708705 -598652 -161572 -117073 6136990
110 -3749696 5534337 860784 -2777679 1472983 -4771343 -1191685 2435482 -4863187 4026535
100 -3195318 914177 -2036683 2747171 -701680 5580192 -2354139 -2780888 -704 -968880 1959470
89 -21568 -1498921 1348134 863998 733818 -5823051 917473 -2766057 1483839 -1027552
79 -361334 2097595 5426587 -4152279 3496024 -2742296 3040196 -4389294 3400485 -2486674
69 -4267917 820173 2393732 -5213372 -1534670 2625747 5844259 -1256837 83803 -1165719
59 1658037 658326 -80611 -255223 2160445 -1523888 -2951012 -3585957 4481791 36038 420493
49 420493 5233634 -1997714 1974094 2844103 -6195662 -2181694 3099790 2382131 3759493
40 3759493 -3893423 -875186 4773896 -442383 3832152 -2222216 3770842 3192074 -1861739
30 -358907 2319625 4880928 -769439 -1609117 749622 1404992 1258204 512536 -1838008 -849553
19 2680229 736589 -3479430 -1400420 378183 -4985706 3538102 -271039 -1071094 2027606
9 -2681521 -667760 -1688763 1000197 -2183052 -282996 2388851 530747 -394977 -804659
0 -804659
##PAGE= F1=5640.578599651
##FIRST=     21204.543296753, 2672.49122660428, 1431338
##DATA TABLE= (F2++(Y..Y)), PROFILE
2047 1431338 1025825 -463137 -284793 6621693 -1445661 1189012 -495717 -207960 734158
2037 -268711 4296324 -2589121 728837 4899488 3467215 -2282124 -3241073 -1377554 1231200
2027 -1958754 -2746988 1401952 1684396 -3030170 3097317 3092046 -3789009 5232712 623421
2017 -51576 4155165 -1039106 -626868 612292 4348876 -4751684 1458318 -2451873 -2658367
2008 -2658367 -1007121 6234115 -4002199 -1250531 1777439 -894514 2465476 -3440003
1999 -463581 -1488990 2426077 2166953 -1457804 -7483000 -471344 291480 95041 7043373
1990 7043373 -5039171 -2575710 3273632 -980095 -878459 837774 1244986 4552589 5422432
1981 5422432 -511723 -1587491 1258955 -2465618 -4216885 669941 -2386823 -2136249 1302737
1971 -2838825 833832 -2411050 -2779934 -3200985 -1169632 1946992 -2385175 -2352644 4305765
1961 -226589 1911600 -3390393 -2747534 2390336 -3088791 3189620 2978810 -1870762 -837912
1951 -1601779 -1636046 -514324 695172 -1601511 2215847 -1308275 -1483608 2106425 580254
1941 5760745 -7779259 -907363 1120882 -2018901 2886856 4247796 5000054 -2171777 696251
1931 -3931195 3336564 532921 3702818 -1301020 -2857089 406785 703586 -2414929 1018552
1921 2545485 -860136 -4273082 1464898 1729712 1833132 642001 -2595210 -1934383 -1582549
1912 -1582549 -863794 -1653213 1839273 -2014730 2546120 -1387089 -1533603 634416 1193463
1903 1193463 -703992 47587 974221 2046592 -3595789 3357178 -2246646 1404167 -3680041
1893 3067088 -487366 4144862 -2554958 791111 -3808781 -2219029 312567 3939943 234957
1883 -3318093 -2434696 -1312815 2745204 -7427978 4168051 -2252753 3431783 -2564426
1874 -637778 6521551 -1527448 -5483158 436589 -999950 -1347648 2142213 23150 1397930
1865 1397930 2669655 -1211156 3726306 531064 3894935 -1778680 -2032950 -1296366 3460713
1855 -3604733 1725327 620814 1731563 -40754 -3557018 -3493463 3632502 1298287 4426224
1846 4426224 4560963 -3335248 -1028413 3282965 -3041181 -16270 -687464 3938947 -2018077
1836 946004 -4024665 966145 -950361 340536 -2647440 -2219303 -68869 2523445 -3259711
1826 -1727841 3015476 2943003 -1681208 286383 15568 -84104 627608 -892765 -2200199 -1854456
1816 -1854456 2302742 -3863243 6442330 3055416 -3311031 -1363468 2004944 -1948038
1807 1984143 1080841 1525979 -1568821 1450838 3125074 -6277914 -1978984 -23010 303169
1797 -4085859 940815 -4807239 1999656 -1357409 788967 1106305 -407483 4014959 2777041
1788 2777041 2123603 4907093 -3362089 3095796 -2079453 -2882227 -1236244 -122257 1246404
1778 -1818463 3081251 -1425065 1356347 -3066232 -3663465 2540843 1898920 -3436392 2609950
1768 30561 -5066911 -10671448 5933960 1791238 3426958 3728553 -3488788 -452300 -1344935
1759 -1344935 -405452 1172000 1115298 -766241 -1565440 1482226 -351486 -2233795 2730776
1749 2351105 2657689 1255185 420123 3757374 6374867 -857322 1128369 1652214 -2067195
1739 3066805 -402610 -2810825 3784514 1698705 -4296513 -3673567 -328118 -2133577 -2033430
1730 -2033430 -1115693 4983129 3962124 -49194 -1534933 359991 -523361 865277 4161794
1721 4161794 2197095 -828427 453582 -3113126 124775 -2357111 3347236 -2964534 -7587830
1712 -7587830 149595 3530583 -6097782 -1513156 -1140530 2880596 -1858969 2794961 262321
1702 -698790 866662 1866602 -1658643 -4775198 3371334 2956482 -2402542 2434346 -2965308
1692 3812049 180339 2648093 -2245095 -2917781 -1385002 -4201711 -944271 -125774 -65235
1683 -65235 2712812 -47905 1878093 89864 668973 30320 -1348626 -373152 1062367 4916831
1673 4916831 -2268679 -964900 -1615751 -2114034 -3487809 6221794 2898435 -2308153 470903
1663 60274 -1637598 758243 -3265244 8777462 -4551529 1131920 947502 -2698743 -1112207
1653 -793351 2631706 -987444 4032001 -65117 -256605 -3309991 5014377 -5274868 1883018
1643 118263 -4689883 4658584 2500125 1459832 348535 -36843 -843104 -2191488 754103
1633 -1366220 -23301 -221640 -287779 -1314679 42672 -991014 3335600 292500 -46307 -3073195
1623 -3073195 709878 -543247 1668929 4647464 6982539 -5048745 -3901990 -3448293 946558
1613 -345230 -1101837 -968675 2952557 4209187 -619605 -1318360 -2511774 646242 1358369
1604 1358369 329070 -2370175 866007 -1381890 2770871 -848864 422264 -1185754 1108338
1594 -2241868 3581624 -2479833 -1805112 1302807 3548205 1371963 -1332135 -2410553
1586 -2410553 1415601 -2355765 5362712 -6171315 4117665 -438384 1110783 -948755 -5079478
1577 -5079478 -697224 1600692 -1971073 4036983 587716 -1870045 -85119 3760017 -2048599
1567 2588113 -186108 -3403333 1881608 -1350291 919717 -7367518 -194073 1207173 1028115
1558 1028115 -447127 -966551 1311843 -1416412 1611715 893920 -1586625 6226576 -1282966
1548 -3699706 2172245 -2697834 -1020233 611805 4109426 -4657985 -140228 2027702 2691758
1539 2691758 613267 920755 3575894 2652821 1219865 2191594 3138575 -5098414 525961
1529 -1712344 6102900 -1658736 1589357 2436239 -391555 3291749 804322 92977 -2815801
1519 -316079 -559493 2984914 -1381633 -1939854 1129841 2639953 -1605007 2070012 -4522080
1509 569753 -3614598 1706839 778144 -7924352 2233701 732081 7004265 -1262923 -233979
1499 41399 1942493 888315 -1678485 -932680 -644929 2788155 4392414 -116562 -1371088
1490 -1371088 2538081 -1039351 -1263570 3191727 712752 3944650 -4513648 3846323 1076875
1480 -531844 -623426 1296637 -6317710 904377 -1513957 -167915 -242297 5971145 -4337110
1470 -256377 -251667 -1906191 1270712 -4810614 -269928 276897 -3120173 -2233364 2770506
1460 4244154 -2373048 -1474957 2253648 242631 2320491 -5255375 4142362 -2735360 2062143
1450 -1508084 1069793 2162339 1153839 1805403 1100974 -4972667 -3073514 1473695 2200212
1441 2200212 834441 2478705 1124035 4955209 -577989 -1062612 287979 -373801 -1316256
1432 -1316256 481088 -4938553 5565971 1413335 210969 -1829719 1349959 -1258869 1022469
1422 3478576 -1396731 -1172358 -2426679 -1087283 -284511 -4158368 -2821862 -344630 1593831
1412 2230297 2531220 -209067 3466237 745547 5704307 -4267939 -2815335 -2002331 -2620922
1403 -2620922 996155 1141821 -4444132 422624 2914927 -8685845 5646779 987584 6194688
1394 6194688 998351 271138 1142231 -888941 856853 1122128 -1668049 2605011 -552312
1384 -2028052 -515096 -2864247 -1480809 -29235 -7036093 4051931 -2381143 2738856 -3226796
1374 967779 -1985768 -1634459 1783978 1172517 -2253728 -631724 -879168 -487225 969648
1364 -1583698 2108643 -4388534 1128077 997342 -2819875 -633193 -1335994 3431636 -1773922
1354 1800230 109415 3890848 -5801247 666127 -3509482 24272 -673844 -2312622 -289880
1344 656109 -1629900 -1733168 -3055505 -1834419 6169594 -712269 -2743713 -4632187 4598847
1334 1001799 -2505664 -1487815 3117991 1042475 -1451074 1041676 -196507 1839868
1325 -273803 -1087171 -1724961 5891609 -4130567 -2125012 -1597304 -1960507 499242 4989377
1316 4989377 3359831 -3481396 -1587365 2782660 -370812 1821751 2603245 827502 -48985
1306 1641776 -2044867 -1282494 3458859 -1952409 -2196238 -2598579 -1710924 1490536 -4196403
1296 -656928 1648976 -3240964 -790493 -3456559 2336459 -1436712 557022 657156 803107
1287 803107 -6134641 2458391 -1196702 -1006169 104386 1395382 -1472676 -1833562 5310560
1277 -178434 478803 1440529 -3205414 -3411319 672293 2686236 719892 -1118014 -1945762
1268 -1945762 -8820973 2891116 -1143213 -2106637 3523551 343860 -1774932 1757039 -895133
1258 -2922056 6352172 -1474705 92798 -6898665 4672875 -3246432 5169164 -2321180 -1869323
1249 -1869323 284789 1257808 -683311 -675529 944749 2469835 -543385 2268337 2321104 -414622
1238 -2233684 303401 -2028029 1111728 -2951641 -262642 -1479195 -7278433 2859810 1679413
1229 1679413 -2624713 2665 4253664 -1738426 -590063 2410518 2006040 -2812371 -1877660
1220 -1877660 -2536011 -855147 -2519020 -629956 -880661 610818 -597422 2580777 -1885439
1210 -63037 4249978 -68083 -1556841 4458253 -2548652 -896128 -1780562 1840987 -1844323
1200 1423710 -1636939 -101485 2657951 413952 -3797847 1030603 -2931054 -6483940 220227
1190 1170504 2460835 2369618 -3870017 -218661 539715 1291464 1808130 303441 928023
1181 928023 2809573 -1951989 1519226 -1590836 649614 -1898097 -92741 2007481 3405553
1172 3405553 -3176475 5009237 -3270310 -1006396 -17682 302979 -330376 -698771 3180171
1162 299865 941580 3103297 -2457053 -2099430 -3528380 -3375807 417680 -2738951 -275760
1152 -1435652 1710276 4820105 992521 -1406878 2527507 -431759 3734268 -1686135 -1931985
1143 -1931985 -788730 -687460 3153115 523734 -964403 303455 -659489 2576962 -9674825
1133 124058 2381139 1896245 2162882 856251 -2184975 1575268 314270 -1854608 311118
1123 -498409 -2049887 -6194435 -3001198 1949497 -194250 -1862989 3152181 -3018911 -1609178
1114 -1609178 2228894 -6339958 3235743 275885 502733 2330341 5679228 -531227 -1337935
1105 -1337935 795878 2920188 -828732 1754579 -2894536 4994198 634063 -4630607 5838600
1095 1677181 -2693747 -162920 -1100982 1316414 -1116659 -6214612 2120090 -1419195 361664
1085 3974984 -4052211 -554756 -2018626 1793872 -325686 -3685407 5711355 911193 -631486
1075 3996591 -1542996 146109 1066223 2662439 -1625472 -121165 -2351872 3464833 -998359
1065 -1659947 -1337185 -2007417 1813256 1622576 2216954 -1777822 1058262 920611 595177
1056 595177 -4833836 -2812449 -702088 995626 1446940 878739 -3187200 -382876 -77451
1046 -882252 -888812 -3098958 7534426 -6945257 -2834886 351967 2721675 2055738 -3384265
1036 -456638 4251837 -2457817 200768 1407878 -6503276 -5245555 561912 4747248 1342020
1026 -8923380 2004139 -823505 4716006 -2296622 -3074043 2339438 -4018833 -6476552 1684080
1016 5861577 -7396544 662316 9750091 -1271352 -2975601 3971656 -2273199 -720329 -2113591
1007 -2113591 4497325 1163907 -735244 -3817185 -4371972 2318315 -3262300 -663621 1597108
997 -2565086 1765995 -921596 3621575 3317966 -1125414 -4229975 -394589 163764 -3183139
987 4483002 1231426 4269272 573770 2550589 2519939 -2526429 -2296335 3396196 797768
977 -2354839 2995763 1641861 -4050576 1006856 1812267 4358123 5255664 -1136731 -1546263
968 -1546263 2685296 -390750 1882043 2831895 -1419065 1101553 -1815479 1008832 -4209503
958 -1282441 1659709 -5032779 8992730 1451933 -3235830 1494206 -2659279 -9215 3342166
948 -282417 2979277 -3195562 -4907304 -1751732 -122896 -5540280 3096760 -521364 1262841
938 -2365758 -413520 2244257 1522 -210594 3742745 -2307377 -631795 894924 2957494
929 2957494 -1574940 -731558 316676 -2053907 -251832 2577989 -4048438 2314055 -613902
919 1393424 616873 -3169075 -1956128 -56266 -344382 -2878596 -2090571 -1625474 991257
909 -51713 -3139944 398159 973265 -3717335 -1329459 -1391464 844437 -1918535 -4844360
900 -4844360 2991933 -2081623 287817 -2635363 -1994114 1118733 -2394450 -2124406 1519124
890 -481182 2336948 -4736330 3329160 5068620 2519201 2490130 -1583366 2505277 -1897598
880 -257591 -609760 181647 152353 1919350 -2583426 810173 524958 604870 1499334 -4465502
869 232154 -2790380 677489 -264158 3971091 3028566 -3653774 688488 2619625 -2681783
859 3300852 -2067043 3537486 -3839057 -245844 3241903 1062190 -2317233 1280213 -1179793
849 3411395 583674 -401420 -1521283 1021095 4264918 -593675 -1308310 -5778833 -4817510
840 -4817510 4072182 -1307001 21945 1914758 -1836275 -333349 -1804676 -2726951 -3449358
831 -3449358 5123168 -6131521 427162 -2049001 -3462151 -2657489 3282873 -1293306 -1015870
822 -1015870 2792789 -4616420 1012624 -1281010 -1007252 -1110092 113048 4638491 -5140397
812 -456921 -817817 2284809 -1797243 6360876 -3603617 592236 -887894 892133 4056949
803 4056949 -996113 1672418 3460012 -6187175 6338368 3287263 -777465 1580643 571096
793 -1901850 4122222 -2385257 -541728 2984016 443257 455258 2446739 1803492 956417
784 956417 -668900 2116011 429755 1391822 764994 3048854 673911 2284498 -5606842
774 4521652 -6195437 6324504 917185 -281114 -2293271 -316223 1205378 3432845 2559561
765 2559561 -729845 -325071 -2857806 3540129 -3062637 1299057 -123352 -699633 834668
755 -2336985 -4245811 5654227 -412920 -2793359 -6671294 -1008892 1860612 -2424363 3016236
745 -1607566 -230631 6037765 951207 335805 2789492 2177912 -1954192 1655919 719953
735 1234974 782292 1849666 -4116126 457218 -1429390 -3566725 2008 -183598 -1079345
726 -1079345 1398045 -283010 1335657 -2386687 2619043 -950428 -3444809 2151487 439800
716 -1231412 10297215 -1093853 -7412124 -21342091 -9596419 -13977185 -5344047 21150216
707 30346271 17442148 10609865 4194984 1347904 -10068396 -29631615 -29908829 -21018588
699 -21018588 -29275832 7511136 37886438 26287865 21368084 22232477 -10060025 -20249425
691 -20249425 -1065180 2785067 -1415955 268806 2647559 -3373835 -4124296 2679755 236588
681 4590647 -3504953 2032384 571945 1210692 141785 3701122 2711120 6591606 26316229
672 26316229 8480768 -19300361 -12207307 -39622777 -12417811 -21253348 -17197900 6660082
663 16361946 36372944 22554988 5659656 -646700 -6322745 -17439885 -2004251 -6321046
655 -6321046 -23288837 3772185 -8613183 14375083 10211563 -3206319 43380 -1284575
646 201120 -1819284 3896304 -1563960 -1519672 2898182 -99958 2960239 -70889 -4910109
637 -4910109 4356617 2697250 318249 11608903 -4410001 1325148 -114628 2076347 1948494
628 1948494 3015508 -723549 1021966 778258 -2684895 8857510 9686303 26317965 41740326
619 41740326 45530036 -169176796 -256709431 -88348314 200357303 82630509 17935506
611 13398514 8315480 4804119 3934012 7658915 -2153819 -2512771 2044674 1661518 1555765
602 1555765 2178839 -1900870 617179 4973642 2233871 -4479913 -1116484 -960763 1434667
592 5991986 -2858692 -284237 3122833 -168510 1019493 301112 2259609 -159030 -3612007
583 -3612007 2109830 -1977165 6998385 1135999 1789300 1274804 495531 -1477096 -1968861
574 -1968861 -249359 -2075225 -166907 -1417448 -854229 6850024 -4448957 814625 -2370749
564 -261659 439364 -24906 2612602 613157 -425583 4204863 -1835491 2041359 -2355155
554 2836439 -282726 -785450 -1383838 4095997 2591524 -2310509 -5535056 7072179 -5676212
544 700689 -3646767 1889068 -564699 2129353 -1188840 6049931 2606561 -6792003 -3197787
534 -817084 3690338 -973083 141160 -1509111 6441388 3834411 -3271042 -260148 2461846
524 -2230027 3104174 -3413291 7343330 333625 -2652249 -362213 123883 -2174719 894558
514 547603 -39060 1294073 -4097840 3558194 -229395 -770657 -4612683 342275 2264799
505 2264799 2716107 -2794568 67901 295478 -327608 1150607 -2449548 807924 465555
496 465555 1363754 178983 5537291 -1588670 -1404460 2534285 2508725 -1279779 1164781
486 -6221872 2882779 1131001 2367828 2615712 -719257 1590330 80381 -1949753 -592191
476 -1463258 317137 -4788730 -1576170 3104699 619176 -1037077 -5269804 -1068498 3508545
466 -3966355 8371916 -1423884 -2474816 2213800 1169302 919424 -6735223 7035393 -1100306
456 -454796 -122756 1281129 1305427 -7275168 -1606812 2021477 1194571 -1017230 -2258053
447 -2258053 -1228021 2606922 -4491225 -131109 -321254 -156251 -6601708 5037526 -71963
437 1089076 738696 -205524 4007734 -2918581 -1343563 2584944 -1449214 -2363467 880402
427 -4001449 -1008589 7736584 -1818210 724314 555034 -3111293 3163558 -1891168 -2081590
418 -2081590 -1163546 295626 611334 423397 -325783 790299 -2571469 -1563981 2368201
408 4190276 -744154 -579060 -751575 2104255 -1295262 5998764 1530170 -2070782 3009544
398 -1366551 4057032 700418 3775425 -5501806 14579 -515765 -1253955 466497 -3132964
388 -1055367 -331412 -4407810 1988182 6220263 -5179351 69997 2725845 1497997 -1577887
378 1444545 17990 -1276987 4672735 -2031336 -608191 2320120 -4019691 3198509 -1659441
368 257574 -1155645 -2422424 7742444 -287042 -1171210 -2356081 -302609 -2200130 1070261
358 -1682429 2134947 4640649 -4010789 -401629 2712405 -453667 -2525652 2046806 2171374
349 2171374 -850144 -35660 3160408 -923753 1239969 -1730560 4090198 -7535226 1562843
339 -644475 4856930 -921764 3123670 -4642385 -632069 4752973 -7106645 2511549 -5507847
329 1295255 -458571 1594454 -1215574 -1002799 1481526 -2734725 2728763 -662022 1533243
319 1725039 -1624625 2375237 1841490 -4664411 2312778 -3284157 -949006 -2560394 1106155
309 1413806 -1267411 2410811 2280997 -4463409 -539667 4362604 -7235751 2843903 4454841
300 4454841 -438769 3596278 -2225350 1415273 490697 -959834 1544568 354496 1655845
291 1655845 -391451 -2100498 5189039 -997496 130981 -2465723 -954701 2146801 262987
281 1927703 -3509568 3230547 2318391 -3143723 -1173711 2328505 -3674764 -2126311 -1096246
272 -1096246 333897 55603 575889 -4578442 1360065 1316124 -2288958 -3815978 1340900
262 696328 1328901 -6616876 3074484 -7849667 9101124 -5471716 -2018788 2221786 2057635
253 2057635 -1363741 -740377 -3310116 1345575 -4869159 -1083800 6238246 201696 3558735
244 3558735 -3422560 4836173 1575815 201246 126426 3916148 -6524005 2127911 4502765
235 4502765 651690 753934 -368007 -113868 3969660 -3967222 -2569248 -930427 969444
225 -4794407 1494300 -1021342 -1476229 5103463 -1883139 -1036114 1184282 1842934 -1199787
215 -1504653 941099 -2724603 -4967570 1739952 1915022 -365743 4504501 -4070720 192525
205 -2986334 845142 -472615 2330610 -216117 -1457016 -4608185 -3298566 -2819521 2914925
195 -3134390 -1144587 5408340 6571971 3673083 -762592 -823841 -2708274 -13642356 -54900299
186 -54900299 -155154623 7063936 56624223 148212911 132281672 123696083 22742502
178 -56419907 -116275338 -113766415 14236723 3936426 -497482 699989 -2602473 993462
169 4806178 -316680 -7486403 -1860288 1056537 -6117684 -803240 -2342656 -1898237 4898081
159 -1256992 1965634 4843048 -5942750 2406612 -310355 112709 548320 6839925 -7872696
149 3332798 3989898 -4334518 -1720987 55681 -122259 3937480 1660085 -4305481 3250001
139 -6140292 1109482 -1882408 -1672394 3336214 -1251600 1194566 -2759953 1188343 -2150332
129 -3986795 -1743866 592043 -6945327 4835901 -305740 -2707737 790451 954252 1408186
120 1408186 565416 -3989000 -2879418 -508647 1616175 23167 290592 -326300 6119637
110 -3874142 4920984 -54245 -3136854 1457582 -4966928 -1119539 2302629 -4731112 4437690
100 -3092237 1783048 -1721562 1913601 129204 5351192 -2755353 -2168851 -55564 -1289845
91 -1289845 1732153 -819325 -1928062 1969598 1112068 1500575 -5808453 856535 -2531823
81 685145 -1235781 -618342 2862240 5941728 -5428593 2702938 -1890729 2931029 -3846271
71 2370156 -1717020 -4373445 964665 2474936 -4582734 -1415548 2113291 5227611 -1359948
61 976762 -1900801 2154169 650388 -616558 -262775 3238261 -2386343 -2928573 -2968781 3981693
50 -424616 1103844 5186142 -2358856 3120035 2337233 -5369749 -3025229 3247281 1339556
40 3556448 -5022883 -159006 4129227 36571 4631476 -2662556 3310589 2673271 98458
30 326546 869589 4316315 -371544 -1559103 706559 1192825 821365 113183 -1641808 -1133072
20 -1133072 2981081 676789 -3186408 -623413 534271 -5019268 3962944 118582 -891486
10 2015819 -2585718 -1177652 -2198531 1145116 -2441588 118044 1329498 587313 -588469
0 -659869
##PAGE= F1=5618.780329767
##FIRST=     21204.543296753, 2672.49122660428, 983139
##DATA TABLE= (F2++(Y..Y)), PROFILE
2047 983139 876091 -555303 -670316 5721928 -1636539 1155238 -718834 -735383 1034912
2037 -1267843 4118572 -3038039 162983 5468445 2620143 -1125442 -3592660 -1484714
2028 1330138 -1559581 -2664584 1286597 1394302 -3406665 3827071 2683652 -3646167
2019 4960694 738146 -554161 4205164 -376651 -1127206 559217 4154415 -3845434 1340276
2009 -2483771 -2259001 -1256465 6058222 -3821242 -1173810 1618551 -145541 2041246 -4043144
1999 -705852 -1410291 1646918 1697190 -1325849 -6505913 -62676 56139 215143 6871893 -5448071
1988 -3217485 2952711 -1182385 -468485 861830 1506179 4176861 5182622 -943133 -1601157
1979 -1601157 1477392 -2817476 -815070 -725583 -2944648 -2239022 1938138 -3614675 1361017
1969 -2041588 -2215989 -3517886 -908600 1829695 -2841414 -2178643 3812955 -197090 2158944
1959 -3554350 -2976035 2888627 -2751331 2447942 2288335 -2347262 -746734 -1746543 -1422260
1950 -1422260 -934779 783156 -2748695 1738378 -1188103 -1437326 2425754 243172 5946285
1941 5946285 -7642545 -1320335 1148086 -2175955 2549980 4429964 4428035 -1754423 -230454
1931 -3991780 3207842 351356 4349829 -911344 -3003397 761543 -183456 -1498097 745674
1921 1880576 -1017758 -3812434 1220360 1906287 1426639 608596 -1941388 -1283385 -1325865
1912 -1325865 -1102686 -1580425 1946260 -1696791 3067316 -922844 -2199951 1239781 1481674
1903 1481674 -1065674 -69648 670588 2279953 -3926505 3401015 -2983994 1580109 -3745234
1893 3780331 -1803112 4054341 -3338943 1789722 -4351742 -2540545 -759354 3305333
1884 423006 -3330387 -2575323 -71351 1888914 -8105100 5243620 -1770156 3037280 -1604073
1874 -703672 5027983 -883243 -5817011 1123359 -818248 -1947456 472592 28716 1832119
1865 1832119 2511453 -1702324 4035892 108388 3822028 -938432 -1506548 -1022584 4007759
1855 -4135299 1634223 856943 1447470 -62636 -4758278 -3521714 3710557 365484 4338143
1846 4338143 4681559 -3915011 -786911 3005533 -3731164 200440 -1270696 3999457 -1726947
1836 1133270 -3770642 1222991 -2142315 -67800 -3804245 -1964555 276872 2628747 -2928479
1826 -1844862 2930976 3634625 -1836240 323036 656719 -991455 427206 -281066 -2885305
1817 -2885305 -819572 2128810 -4661482 7255815 3196302 -3460294 -1090173 2036735
1808 -1931642 1142490 935894 2595550 -1822826 1086068 2601480 -6137767 -2370687
1799 -80631 6673 -4494949 680558 -3969743 1405438 -1191480 600054 900474 -534140 4345282
1788 1762958 2453355 4024237 -2596671 2373087 -1188282 -3826621 416457 -526063 1448693
1778 -1787811 216160 -87970 855557 -3407885 -3175562 2477990 1634738 -3741766 3364853
1768 -116585 -5459543 -11205249 6530059 1919600 3136052 3113331 -3806467 107495 -1507920
1758 26396 1123789 1361532 -747752 -2287356 1339243 -746915 -3318242 3507282 1799956
1749 1799956 2071432 960303 176884 3744794 6258342 -693956 1287523 1240770 -2233673
1739 3602240 -66143 -2606537 3295893 1746327 -4281343 -3473199 -874702 -2175787 -2357083
1730 -2357083 -581318 5585270 3729672 -45908 -1199659 713251 -243554 98389 4569191
1721 4569191 1572006 -631312 799633 -3237205 70603 -2312618 3499871 -2858136 -6586201
1712 -6586201 517701 4326416 -6106765 -905205 -2118340 4434006 -1572505 3227712 336564
1702 -191106 1111987 1993648 -2433887 -3791278 3224619 3292439 -3254854 1399909 -2769333
1692 4007865 -191446 2938778 -1862112 -3016084 -1615343 -4029084 -1064112 260201 -142930
1682 4123548 -115822 1754327 -606456 345771 292286 -1582338 214871 1145646 4997152
1673 4997152 -2680319 -791500 -2175687 -1268405 -3857400 5825666 3486158 -1481521 -263897
1663 473650 -2855880 2174721 -2320943 8626593 -4155667 1644775 256842 -3069182 -692644
1653 -1383294 3570644 -1241942 3926416 -109813 36704 -3685208 4742749 -4382996 1273370
1643 558051 -4506187 4096759 2537837 1308606 -478542 404699 -2831920 -2361664 1322108
1633 -1695968 1131234 -316704 -392321 -1448568 346769 -1041894 4090454 -22287 344162
1623 -2722357 1356294 -916638 1822562 4906848 8653846 -5556504 -3716312 -3337286 618559
1613 -218121 -1012741 -1213291 2620334 3878168 422921 -1903063 -2141313 917899 1250232
1604 1250232 741498 -3250579 1291367 -1238011 2572338 -1560067 407284 -1505616 575078
1594 -1641188 3732073 -2571519 -2229613 1137907 3615175 153705 -1093873 -2012777 1354455
1584 -2863376 5713150 -6607195 4707953 -243812 1435325 -1026182 -4773481 -858296 1407932
1574 -2177487 4111074 -257920 -1886589 2481 4649924 -1522777 1992036 -665657 -3332932
1565 -3332932 2155805 -1879590 1223675 -7183642 -222922 815349 1176596 -20603 -1645529
1556 -1645529 932387 -472459 2195098 608844 -820169 6234062 -1916148 -3175168 2574196
1546 -2943493 -561725 840530 4103950 -4886807 -972006 2366204 2283944 380997 979566
1537 979566 3280900 3275136 351273 1481873 4249235 -5544370 1033134 -2266501 7022135
1527 -1049249 860123 2585124 -598467 2840914 739942 498849 -3214515 -405579 -815911
1518 -815911 3194629 -1471963 -1304223 763059 2132016 -1618057 2108362 -4588997 437492
1508 -3397772 2255138 842412 -8415066 2133406 1142911 6125210 -1365092 164186 -118010
1498 1757449 633184 29023 -1729500 -83143 2824870 2795061 271271 -1832943 2922570
1488 -1387882 -1747040 4421862 760979 3515888 -3804408 3472000 1169998 125495 -11591
1478 870167 -6431006 961756 -622792 24112 -480845 5315612 -4211917 -498021 -655786
1469 -655786 -2512880 1299363 -4080226 -396048 374564 -2895634 -2038797 3165340 3692170
1460 3692170 -2599572 -1048308 2486509 219576 1888258 -5021625 3403075 -2466238
1451 2232873 -1350531 1471238 1409353 2095224 1793759 1233413 -5205189 -3789731 1136328
1441 2384889 1754359 1164763 1611130 5138680 -1291562 -682425 260249 -726233 -1578154
1432 -1578154 820029 -4819719 5840505 1129651 -194417 -934085 751290 -1396149 727010
1422 3285040 -1752008 -1115011 -2500167 -916713 -174456 -5116739 -3007235 -742958 2006984
1412 2691928 2187021 -170663 3340894 384347 4743828 -3968451 -2509696 -1801177 -3056560
1403 -3056560 1138885 944491 -3554239 -1371306 3776829 -8541260 6101905 517505 5980418
1394 5980418 649262 244228 854973 -754594 1149638 1420917 -1857698 2555459 -628772
1384 -1960956 9061 -4139744 -1245991 1012587 -7160101 4008365 -3325637 2849074 -4128116
1374 1298806 -1548308 -1822531 852065 1129341 -2408178 -798792 -480964 -288093 754407
1364 -1797273 1780318 -4633631 727573 1085143 -2496503 -1173417 -1195081 4117539 -1780137
1354 1871008 92229 3956875 -6312417 662625 -2544891 -960254 -198759 -2635535 -314747
1344 152946 -1429584 -2824142 -2532206 -1478393 5805914 -486995 -3107385 -4448326 4381710
1334 615253 -1957367 -1983338 3070094 981325 -982778 723830 -353060 1801349 -355538
1324 -275036 -1727008 5635923 -4063961 -2017110 -1970940 -1118559 59572 5701056 3501945
1315 3501945 -2070283 -1310386 2433449 -498991 2443020 2308279 1667932 199267 1243365
1306 1243365 -1338463 -1233114 3089483 -917214 -1631090 -3204138 -1527534 1784075 -4349955
1296 -623505 1511169 -3035872 -127314 -3638333 2001617 -2067803 1093957 150470 3360229
1287 3360229 -7108315 2217998 -1329488 -1402331 1167428 1527615 -1839629 -1924643 5006138
1277 -307742 883913 820488 -4262208 -2707703 1176 3221661 1126394 -1647462 -1195560
1268 -1195560 -8451874 2259912 -280995 -2004694 3790461 372909 -2099412 2796106 -1027839
1258 -2706670 6282373 -1360985 720306 -6986668 4208196 -3381178 4323369 -1914152
1249 -1995821 -143616 849268 -171821 195391 779851 2505834 491283 1535588 2741644
1240 2741644 148940 -1786756 239965 -1470153 1486341 -2649874 80162 -1771090 -6868218
1231 -6868218 2582471 2214511 -3560989 540161 4081013 -1903134 -772859 2224514 2087519
1222 2087519 -3174026 -1735933 -2456506 -1557664 -1236992 -534610 -400778 688406 -727202
1212 3228171 -1897170 363122 3825356 -707501 -1062768 5251381 -3567706 -196652 -2180491
1203 -2180491 1659827 -1853164 1193938 -745338 6026 1968789 331290 -3603517 959624
1193 -3044397 -6479813 361437 1469785 2611705 2719644 -4174491 -555967 431982 1428806
1184 1428806 2519004 114063 1102294 3366203 -2189666 1675605 -1403028 740761 -2346088
1174 -263917 1629442 3198408 -3358964 4570121 -3773656 -1082199 188235 389631 -1985
1164 -184310 2634457 1521196 115861 2218088 -2329354 -1622306 -4171178 -3743021 244905
1154 -2079625 -816872 -1325721 1416767 4502479 1521323 -1788976 2257224 -1049531 4947682
1144 -1380073 -1656511 -920286 -917187 3274206 683172 -1533976 409081 -364603 2504459
1134 -9471973 -462452 1764982 1784937 2735535 759803 -3033964 2143960 -108103 -1807851
1125 -1807851 202625 191584 -996602 -6577841 -2483679 1852424 538638 -2367029 3066600
1115 -2460599 -1405453 2183980 -6693258 3235350 556440 903812 2511746 5672095 -483750
1105 -1819783 589105 2811730 -1457277 1353089 -2172985 5081133 -24523 -4194966 3997673
1095 2257199 -2435125 -767318 -525133 1453148 -494871 -6665149 2603443 -1742348 423194
1085 4270082 -4108208 -563879 -2487478 2267682 -318576 -3579475 5278883 1383394 -1546229
1075 3851304 -916377 -182317 295788 2778106 -1935391 -138910 -2010244 3393992 -842544
1065 -1685148 -1995611 -1786067 2089388 1645986 1741174 -2289310 1536901 1558606 678978
1055 -4767192 -1028045 -772853 888465 944738 182907 -3787658 127554 165972 -700933 -764619
1045 -764619 -2426659 7671725 -6984745 -2510258 392929 2617605 2103371 -4394057 24294
1035 5195602 -3403709 495173 1551686 -6845750 -5359874 1055058 4794739 524916 -8494030
1025 1990445 -919760 4985055 -2405210 -3211561 1762426 -4463893 -6101608 1379530 6131554
1016 6131554 -7007319 1124699 9741494 -2261804 -1961834 3742492 -2321692 -124571 -1627850
1007 -1627850 4918430 1192908 -1172636 -4483067 -4179330 2825143 -2684359 -117211 1390909
997 -2339774 2365844 -520510 3479010 3394841 -1221962 -4001328 89590 406382 -3444831
987 3857593 510733 3502564 741861 1281611 3170343 -3017789 -1934997 3906682 879235
977 -1936145 2127522 1141621 -3376664 1507838 1147230 4180652 5451334 -1676738 -1676800
968 -1676800 2787117 -516029 1575104 2277646 -2118445 1225786 -2920241 1613319 -4943307
958 -1751782 2279758 -4988751 8393866 1812330 -3281777 728702 -3529659 339815 2484727
949 2484727 -623383 3332549 -3421224 -4687005 -1986296 310594 -6506457 4620675 -948867
939 1163330 -2474756 -1605037 3439823 -584158 -142218 4369293 -3024507 359416 288164
930 288164 2377513 -1817827 -531218 134779 -1815947 -894366 3289259 -3458690 2706629
920 -1781998 1572472 607842 -2359120 -2049914 -485060 -976872 -2579317 -2118726 -1166987
911 -1166987 680704 394010 -3082598 761464 1280578 -4309960 -342027 -1593230 1091666
901 -1733195 -5327758 2518331 -2902981 966284 -1752462 -1801647 930032 -2540209 -1903676
892 -1903676 833634 -703558 2082449 -5114872 4874155 5176531 2388476 2627389 -611901
882 1907817 -1097464 -382115 -851923 82291 -124944 1786509 -2123841 156256 820192
873 820192 -172044 1741605 -4660043 182062 -3540075 339666 331835 4208304 2887655
864 2887655 -4066084 637611 1982838 -3079412 3733826 -2426881 2939406 -3260128 -417216
854 2816209 1254232 -1922551 725275 -858958 3269275 461854 -790582 -874347 142729
844 3692003 463545 -979668 -6610180 -5083947 5218375 -820233 -666605 2292012 -1667732
834 -131090 -1999831 -2317595 -3672964 5488744 -6088941 -281775 -937244 -3302354 -3572854
825 -3572854 3507346 -1339889 -971607 3068093 -4447143 965671 -1549567 -643576 -1448091
816 -1448091 316730 5074137 -4475655 -154446 -59122 2143154 -2597716 5189807 -3127668
806 -55200 -1417878 765259 3825678 -1034643 1287645 3507612 -5460238 5776531 3224726
797 3224726 -1443220 2439966 525144 -1630840 3933009 -2344689 -706459 1745938 997164
788 997164 58662 2391303 1520088 1936644 -1045765 1489391 1120949 480367 731224 2629386
778 2629386 301559 2610094 -5714441 4692396 -5799782 5997920 690070 206529 -2175827
768 -376088 845961 3051260 1844144 -1140952 439590 -3060007 3120454 -1970062 1114175
758 -654611 -436214 990947 -1837682 -3813686 4886653 -119258 -3101063 -6732356 -943727
748 2249336 -2031778 3133351 -1733719 -211698 5117250 328702 763201 2417641 1900239
739 1900239 -1678210 695654 508 2385843 444324 2071850 -4750737 731444 -889478 -2964564
729 -2964564 -166861 -51126 -1586355 1356709 -1184232 1719447 -2244774 2475544 -405456
719 -4360766 1794509 -583040 -1089352 11182546 -1458437 -6699087 -15989045 -9202944 -12975522
710 -12975522 -4951216 17262567 26936898 17070623 9504035 3114168 1343218 -8771877
701 -24659917 -26074664 -18838133 -24728427 7017767 30739033 24081556 17434846 19609206
693 19609206 -9996631 -18219871 -421463 3810981 -1169517 214426 2429455 -4187409 -3231646
684 -3231646 1782100 101395 2698610 -3454894 1968519 837206 1352539 -24525 3518314
674 2435254 6502900 24100999 7021018 -19660152 -10719261 -34766523 -13115838 -16649578
666 -16649578 -15074882 5384161 13016825 32559649 20277034 4791193 -1351294 -6069771
658 -6069771 -14229685 -1659989 -5892672 -21048365 3771844 -7942036 13549122 8722177
650 8722177 -3347716 -330922 -561333 -262015 -1454756 3682646 -1376840 -1924485 3276623
640 -928112 2899030 -558662 -4116157 4369942 2496943 222970 11162845 -4081549 469058
630 9157 2486894 1672296 3403114 -1101267 433617 889650 -4410601 8784264 8436284
621 8436284 22186875 36881839 36341092 -141751296 -214646391 -72801383 164990949
613 72329783 15201816 11912441 7643068 3990419 3805528 6580031 -2740181 -2246043
605 -2246043 1633296 2295109 1802456 1480757 -1905813 299438 4180084 1614417 -4662834
595 -1673910 -796663 539913 6336951 -2661201 -635798 2406076 745517 1024820 486669
585 2280740 -808738 -3788897 2291999 -1457051 7828313 984881 1066284 1211008 110022
575 -1507306 -2159178 25197 -1872172 -144959 -1326910 -1400834 6802896 -4268185 851179
565 -1286447 -17512 928287 -160678 2743883 -1471677 -136575 3830061 -2238141 1185020
555 -3080437 2685570 -423558 -973811 -1661921 3995698 1964698 -1804330 -5083602 6589155
545 -5764607 805476 -3802234 1873540 -728253 2588083 -1294190 5661129 2658355 -5348082
535 -3466039 -124829 3689607 -2188947 693700 -1810746 5818143 4762083 -5061675 -685270
525 2573231 -2322458 3474866 -3508561 7401738 1077307 -2581351 -189479 166676 -2812392
515 1012637 -194629 428920 1207824 -3537608 3418237 87527 -870076 -4954797 19148 2269586
505 2269586 2867247 -2395304 -245484 -540367 -258372 1052433 -2332919 -821247 898207
495 586137 114344 5137535 -1298485 -1657083 2382519 2366280 -1419251 906322 -6404584
485 2552504 1319047 2071661 2864658 -1093931 1159434 -569232 -1918977 -1232501 -2386489
476 -2386489 501824 -4803413 -2186964 3356701 282386 -874078 -6053929 -884047 4068396
466 -5420855 8144318 -1330782 -2432212 1350622 1027189 989180 -6061389 7721940 -1730778
456 -616534 157477 1489127 1296212 -7366642 -1614972 1760537 965725 -968216 -2321389
447 -2321389 -1469550 3166829 -3840146 -23489 -875640 613719 -6332032 4017175 -315730
437 932006 600372 -132925 3816566 -2521686 -1465054 2422417 -1853127 -2164786 738865
427 -3307398 -764891 7342581 -2491507 605393 380532 -4028314 3556362 -2566807 -2002254
418 -2002254 -1103727 25894 681014 33111 -700308 495362 -1766717 -2111917 3367555 3535684
408 3535684 -1376902 489812 -1573042 1992527 -911596 4928078 1917882 -1988910 3261877
398 -1595998 3632404 541747 3542609 -6133296 904603 -1067547 -1573730 620852 -3301998
388 -2610329 122635 -4977842 1520076 5288214 -5476651 -118601 4194826 1425364 -1295426
378 1414176 166145 -1432725 4458197 -2923924 -624839 1817925 -3482519 2112212 -1584702
368 168697 -2007317 -2811027 7702013 -1140815 -1065248 -1910255 -633484 -1539413 1516318
358 -1730069 2631003 4392993 -4878723 -498401 2356961 -809378 -3102919 2560844 2383666
349 2383666 -941257 474461 2935783 -1216020 1830262 -1397181 3837483 -7480725 694360
339 -490388 4419450 -525228 3301331 -4250414 -518569 4008238 -7415027 3269613 -5201226
329 700610 -459484 1907834 -1179541 -855434 1741744 -2637076 2313022 -151393 673521
319 2395603 -1360387 1451645 1876712 -4864364 2105622 -2868487 -863700 -2574967 1255062
309 486716 -475151 1933620 2096390 -4415764 -439865 3714443 -7341388 1935733 4292619
300 4292619 -794771 3245493 -1768344 930643 408316 -1515488 1276824 76402 1764266
291 1764266 41476 -2331828 5300333 -1546388 273908 -2302616 -859294 1944599 417684
281 980552 -3247661 2821628 2328675 -2931339 -1742725 2080052 -4426525 -1170857 -1153039
272 -1153039 245496 1417585 821048 -5123509 1650839 607224 -245116 -3979568 1024987
$$ [...]
##END NTUPLES=nD NMR SPECTRUM
##END=
