##TITLE=XTC-814d_3
##JCAMPDX= 6.0         $$ Bruker NMR JCAMP-DX V2.0
##DATA TYPE= nD NMR SPECTRUM
##DATA CLASS= NTUPLES
##NUM DIM= 2
##ORIGIN= BRUKER
##OWNER= patiny
$$ 1.79 TOPSPIN		Version 3.0
$$ 2012-05-19 11:04:27.631 +0200  patiny@icmbsg005
$$ Compression mode = diff/dup
##.OBSERVE FREQUENCY= 400.131577889462
##.OBSERVE NUCLEUS= ^1H
##.ACQUISITION MODE= SIMULTANEOUS (DQD)
##.ACQUISITION SCHEME= Echo-Antiecho
##.AVERAGES= 4
##.DIGITISER RES= 23
##SPECTROMETER/DATA SYSTEM= spect
##.PULSE SEQUENCE= hmbcetgpl3nd
##.SOLVENT NAME= D2O
##.SHIFT REFERENCE= INTERNAL, D2O, 1, 7.302566
##AUDIT TRAIL= $$ (NUMBER, WHEN, WHO, WHERE, PROCESS, VERSION, WHAT)
$$ ##TITLE= Audit trail, TOPSPIN		Version 3.0
$$ ##JCAMPDX= 5.01
$$ ##ORIGIN= Bruker BioSpin GmbH
$$ ##OWNER= patiny
$$ $$ /opt/data/patiny/nmr/XTC-814d_3/14/pdata/1/auditp.txt
$$ ##AUDIT TRAIL=  $$ (NUMBER, WHEN, WHO, WHERE, PROCESS, VERSION, WHAT)
(   1,<2012-05-19 11:04:25.729 +0200>,<patiny>,<icmbsg005>,<go>,<TOPSPIN 3.0>,
      <created by zg
	started at 2012-05-19 10:42:18.636 +0200,
	POWCHK enabled, PULCHK disabled,
       configuration hash MD5:
       77 C7 B7 C4 10 F4 BA 30 64 2E BB 52 82 F2 DA 41
       data hash MD5: 4K * 128
       E5 F9 B6 64 3E AD 7C D8 BC 95 AB 4A DB 68 B1 9C>)
(   2,<2012-05-19 11:04:25.789 +0200>,<patiny>,<icmbsg005>,<audit>,<TOPSPIN 3.0>,
      <user comment:
       ICON-NMR User ID: patiny
       data hash MD5: 4K * 128
       E5 F9 B6 64 3E AD 7C D8 BC 95 AB 4A DB 68 B1 9C>)
(   3,<2012-05-19 11:04:26.720 +0200>,<patiny>,<icmbsg005>,<proc2d>,<TOPSPIN 3.0>,
      <Start of raw data processing
       xfb same F2: SI = 2K WDW = 3 SSB = 4 FT_mod = 6 PKNL = 1 F1: SI = 1K ME_mod = 2 NCOEF = 32 WDW = 4 SSB = 2 FT_mod = 6 PHC0 = 0 PHC1 = 0
       data hash MD5: 2K * 1K
       9B 23 E5 7A E7 AE DD 69 C5 5A BB 81 D4 2D 59 43>)
(   4,<2012-05-19 11:04:26.841 +0200>,<patiny>,<icmbsg005>,<proc2d>,<TOPSPIN 3.0>,
      <abs2 F2: ABSG = 5 ABSF1 = 7.302566 ABSF2 = 0.5843194
       data hash MD5: 2K * 1K
       EB 16 66 63 B9 39 9D 21 B8 59 73 6E 30 C3 FA 2F>)
(   5,<2012-05-19 11:04:27.013 +0200>,<patiny>,<icmbsg005>,<proc2d>,<TOPSPIN 3.0>,
      <abs1 F1: ABSG = 5 ABSF1 = 210.754 ABSF2 = -11.10083
       data hash MD5: 2K * 1K
       91 9B 84 E6 D6 F5 F6 42 08 FE DA 3A A9 BE BA AE>)
$$ ##END=
$$ 
$$ $$ hash MD5
$$ $$ 10 EA BF B9 CB B4 8A BF 12 DA E7 91 5B 01 6A DA
##$RELAX= 
##$RELAX= 
##$RELAX= 
##$RELAX= 
##$RELAX= 
##$RELAX= 
##$RELAX= 
##$RELAX= 
##$RELAX= 
##$RELAX= 
##$RELAX= 
$$ Bruker specific parameters
$$ --------------------------
##$DATPATH= </opt/data/patiny/nmr>
##$EXPNO= 14
##$NAME= <XTC-814d_3>
##$PROCNO= 1
##$ACQT0= 1000000
##$AMP= (0..31)
100 100 100 100 100 100 100 100 100 100 100 100 100 100 100 100 100 100
100 100 100 100 100 100 100 100 100 100 100 100 100 100
##$ANAVPT= -1
##$AQSEQ= 0
##$AQ_mod= 3
##$AUNM= <au_getlinv>
##$AUTOPOS= <18 >
##$BF1= 400.13
##$BF2= 100.612769
##$BF3= 400.13
##$BF4= 400.13
##$BF5= 400.13
##$BF6= 400.13
##$BF7= 400.13
$$ [...]
##$SIGF1= 7.302566
##$SIGF2= 0.5843194
##$SINO= 0
##$SIOLD= 2048
##$SPECTYP= <>
##$SREGLST= <1H.DMSO>
##$SSB= 4
##$STSI= 2048
##$STSR= 0
##$SW_p= 2688.17204301075
##$SYMM= 0
##$S_DEV= 2403281
##$TDeff= 4096
##$TDoff= 0
##$TI= <>
##$TILT= no
##$TM1= 0
##$TM2= 0
##$TOPLEV= 100
##$USERP1= <>
##$USERP2= <>
##$USERP3= <>
##$USERP4= <>
##$USERP5= <>
##$WDW= 3
##$XDIM= 2048
##$YMAX_p= 259640249
##$YMIN_p= -324091452
##$CURPLOT= <Cups-PDF>
##$CURPRIN= <$Cups-PDF>
##$DFORMAT= <normdp>
##$LAYOUT= <+/2D_inv.xwp>
##$LFORMAT= <normlp>
##$PFORMAT= <normpl>
$$ Bruker specific parameters for F1
$$ ---------------------------------
##$ACQT0= 0
##$BF1= 100.612769
##$FnMODE= 6
##$NUC1= <13C>
##$O1= 10043.8343986724
##$SFO1= 100.622812834399
##$SW= 221.832681201688
##$SW_h= 22321.4283611104
##$TD= 128
##$ABSF1= 210.754
##$ABSF2= -11.10083
##$ABSG= 5
##$ABSL= 0
##$ALPHA= 0
##$AQORDER= 0
##$ASSFAC= 0
##$ASSFACI= 0
##$ASSFACX= 0
##$ASSWID= 0
##$AUNMP= <>
##$AXLEFT= 0
##$AXNAME= <F1>
##$AXNUC= <13C>
##$AXRIGHT= 0
##$AXTYPE= 0
##$AXUNIT= <>
##$AZFE= 0.1
##$AZFW= 0.5
##$BCFW= 0
##$BC_mod= 0
##$BYTORDP= 0
##$COROFFS= 0
##$CY= -3
##$DATMOD= 1
##$DC= 0
##$DFILT= <>
##$DTYPP= 0
##$ERETIC= no
##$F1P= 210.76350402832
##$F2P= -11.0913240743493
##$FCOR= 0.5
##$FTSIZE= 1024
##$FT_mod= 6
##$GAMMA= 0
##$GB= 0
##$INTBC= 1
##$INTSCL= 1
##$ISEN= 128
##$LB= 0
##$LEV0= 0
##$LPBIN= 256
##$MAXI= 10000
##$MC2= 5
##$MEAN= 0
##$ME_mod= 2
##$MI= 1
##$NCOEF= 32
##$NC_proc= -11
##$NLEV= 6
##$NOISF1= 0
##$NOISF2= 0
##$NSP= 0
##$NTH_PI= 0
##$NZP= 0
##$OFFSET= 210.754
##$PC= 4
##$PHC0= 0
##$PHC1= 0
##$PH_mod= 1
##$PKNL= no
##$PPARMOD= 1
##$PPDIAG= 0
##$PPIPTYP= 0
##$PPMPNUM= 2147483647
##$PPRESOL= 1
##$PSCAL= 1
##$PSIGN= 0
##$PYNMP= <>
##$REVERSE= no
##$SF= 100.612769
##$SI= 1024
##$SIGF1= 210.754
##$SIGF2= -11.10083
##$SINO= 0
##$SIOLD= 1024
##$SPECTYP= <>
##$SREGLST= <>
##$SSB= 2
##$STSI= 1024
##$STSR= 0
##$SW_p= 22321.42836111
##$SYMM= 0
##$S_DEV= 2403281
##$TDeff= 256
##$TDoff= 0
##$TI= <>
##$TILT= no
##$TM1= 0
##$TM2= 0
##$TOPLEV= 0
##$USERP1= <>
##$USERP2= <>
##$USERP3= <>
##$USERP4= <>
##$USERP5= <>
##$WDW= 4
##$XDIM= 128
##$YMAX_p= 259640249
##$YMIN_p= -324091452
$$ End of Bruker specific parameters
$$ ---------------------------------
##NTUPLES= nD NMR SPECTRUM
##VAR_NAME=  FREQUENCY1,    FREQUENCY2,      SPECTRUM
##SYMBOL=    F1,            F2,              Y
##.NUCLEUS=  13C,           1H
##VAR_TYPE=  INDEPENDENT,   INDEPENDENT,     DEPENDENT
##VAR_FORM=  AFFN,          AFFN,            ASDF
##VAR_DIM=   1024,          2048,            2048
##UNITS=     HZ,            HZ,              ARBITRARY UNITS
##FACTOR=    21.7982698838965, 1.31258400537634, 1
##FIRST=     21204.543296753, 2686.85945900537, 2362141
##LAST=      -1095.08679447308, 0,           -975506
##MIN=       -1095.08679447308, 0,           -324091452
##MAX=       21204.543296753, 2686.85945900537, 259640249
##PAGE= F1=21204.54329675
##FIRST=     21204.543296753, 2686.85945900537, 2362141
##DATA TABLE= (F2++(Y..Y)), PROFILE
$$ [...]
##PAGE= F1=5727.771679186
##FIRST=     21204.543296753, 2686.85945900537, -2319880
##DATA TABLE= (F2++(Y..Y)), PROFILE
1212b40127B423820d84529A076058g37920A323986a480375A22192M559050a032657
1202b995002a340209B950242e595757b759736L49191E970069a687348D60722J806091
1193B266813P215028c180396N85197R34965E315813b840650C543902K695427a549681
1183A539476d583140c6349A25175K662585H59399f900072C919731j514978a996865
1173c891580D589014a767226L97444j731215B403476f171679B964704q91303L90952
1164B464353c708769J521829E359993f3897n57587A378512J120360c321539D4205
1154E29378P54897c231595P738D423954c390374D84366K223136b432046E79325
1144c261498C1618J97190f14186B983977a027049p77294H98189R06082J848628
$$ y = [-240127, 2423820, -484529, 1076058, -737920, 1323986, -1480375, 122192, 4681242, -1032657, -2995002, -1340209, 2950242, -5595757, -2759736, -2410545, 5970069, -1687348, 460722, 2266813, 9481841, -3180396, -2595199, -1660234, 5315813, -2840650, 3543902, 6239329, -1549681, 1539476, -4583140, -36349, 125175, 2787760, 859399, -6900072, 3919731, 2404753, -1996865, -3891580, 4589014, -1767226, -1369782, -3100997, 2403476, -6171679, 2964704, 2073401, 2464353, -3708769, -2186940, 5359993, -63897, -621484, 1378512, 2498872, -3321539, 44205, 529378, 1284275, -3231595, -3223857, 4423954, -3390374, 484366, 2707502, -2432046, 579325, -3261498, 31618, 228808, -614186, 2983977, -1027049, -1804343, 898189, 1804271, 3652899]
1135C652899c997576a066591D285324e188088B206002f05452A537209a1314A219385
1125A409383a126160a91341A98440K845198d357889a315546B710223A96235N97530
1116G93765k66164N14846e859801I17207g39357k001971A369069M795345A483920
1106c677341B896767a783525j030095D607839a244723A274763L561190f910052
1097A230629e458316D01186M002181b216314B118783a240468G22088J922534Q30202
1088C474824c627993i75734E780039A036492b076545G62414e8784A638024A19075
1078A784424a188436A135884K442034A614048a113704B282642c822461k512103
1070f334564d05397k102733k045799b128340O50488A632160c02690A079240K963532
$$ y = [3652899, -3997576, -1066591, 4285324, -5188088, 2206002, -605452, 1537209, -11314, 1219385, 1409383, -1126160, -191341, 198440, 3043638, -4357889, -1315546, 2710223, 196235, 793765, 527601, 1042447, -5859801, 917207, -739357, -2741328, 1369069, 6164414, 1483920, -3677341, 2896767, -1783525, -2813620, 4607839, -1244723, 1274763, 4835953, -6910052, 1230629, -5458316, 401186, 4403367, -2216314, 2118783, -1240468, 722088, 2644622, 3474824, -3627993, -975734, 5780039, 1036492, -2076545, 762414, -58784, 1638024, 119075, 1784424, -1188436, 1135884, 3577918, 1614048, -1113704, 2282642, -3822461, -6334564, -405397, -2508130, -4553929, -2128340, -1477852, 1632160, -302690, 1079240, 4042772]
1061D042772f02622k180142D301554b542385D143883a627768q88105H60646e958370
1051d611992B050843b613277A619193c156245E262868A135476a520269c15243
1042a697483A26966f10427A220893k21124K403471H62910f132851C086808B72700
1032A347805h46305E92918a687715k538251D86696L531899c217841J340609B749009
1022d505755A656866b19880D42343j2234K315987D52877J740191a773082k51342
1013b024424C439850J151c265624J138905g47036p39257A207476b888587q94777
1004c783364i20097p8519I99402j97663J764263c467224F52710d59067A2962a612126
993E510924f34567j692819m979259C554476i35267m914724K091211J055904C787746
$$ y = [4042772, -602622, -2782764, 4301554, -2542385, 4143883, -1627768, -2515873, 860646, -5958370, -4611992, 2050843, -2613277, 1619193, -3156245, 5262868, 1135476, -1520269, -315243, -1697483, 126966, -610427, 1220893, 999769, 3403240, 862910, -6132851, 3086808, 272700, 1347805, -846305, 592918, -1687715, -4225966, 486696, 4018595, -3217841, -1877232, 2749009, -4505755, 1656866, -219880, 442343, 430109, 2746096, 452877, 2193068, -1773082, -2024424, 3439850, 3441001, -3265624, -2126719, -747036, -1486293, 1207476, -2888587, -3783364, -920097, -998616, 999402, 801739, 2566002, -3467224, 652710, -459067, 12962, -1612126, 5510924, -634567, -2327386, -7306645, 3554476, -935267, -5849991, -3758780, -2702876, 3787746]
983a329294B792821r91207q80306J208662a027435b26930A844416a880922F28126
973H85014J517056A038619J771555e746879a008013F01465a036881A318677N66650
964A885327b062249a65619A793781b792660A606117m95789c785081A440281j40788
955A299493N634995d473047a78808C826237A476288p24662b541685m952057D049352
945g73692D767204d185943a492930A127932i78418j749106Q16562A882318P7634
936A959952d156181J160665A008415K41960C82692K413276C94441b186544j662169
927c848713D874973A418537a101939B024058G5655J193932J431303a737906B426402
917a281247a73756j844354C02018d23272k536708o8745l08758F6006b167401P21456
$$ y = [-1329294, 2792821, 1801614, 921308, 2129970, -1027435, -226930, 1844416, -1880922, 628126, 885014, 2402070, 1038619, 2810174, -5746879, -1008013, 601465, -1036881, 1318677, 1885327, -2062249, -165619, 1793781, -2792660, 1606117, 1110328, -3785081, 1440281, 1299493, 6934488, -4473047, -178808, 3826237, 1476288, 751626, -2541685, -7493742, 4049352, -773692, 4767204, -4185943, -1492930, 1127932, -978418, -2727524, -1910962, 1882318, 1959952, -4156181, -2995516, 1008415, 1250375, 382692, 2795968, 394441, -2186544, -3848713, 4874973, 1418537, -1101939, 2024058, 75655, 1269587, 2700890, -1737906, 2426402, -1281247, -173756, -2018110, 302018, -423272, -2959980, -3028725, -3337483, 66006, -2167401, -1445945]
907a445945B175951p24914p16017J046332J07028M76735c377018a177926B409222
897a378370j113391C723202j025605a740963j016611B337986r05426N72338a499763
887B147737a087560m28612B703979a391925B63117b584877E46066O43623d363877
877f57838a60758k51825e0928B578275K979253b085288E813903D91920K018960
868B510880c139163c36433A04700b143031A782869g68466o40369C563260D81262
858C107242a092684L3021C226337a111000k579220j058059C243298G68704a298820
848b320600p07839J414746F143959b086782h21774n49213A087174a587770r00499
839b488269C690059g20403B051779J119528d385766J876277b48992A173432c719128
$$ y = [-1445945, 2175951, 1451037, 735020, 1781352, 1888380, 2365115, -3377018, -1177926, 2409222, -1378370, -2491761, 3723202, 2697597, -1740963, -2757574, 2337986, 1432560, 2004898, -1499763, 2147737, -1087560, -1516172, 2703979, -1391925, 263117, -2584877, 546066, 1189689, -4363877, -657838, -160758, -412583, -50928, 2578275, 5557528, -2085288, 5813903, 491920, 2510880, -3139163, -336433, 104700, -2143031, 1782869, -768466, -1408835, 3563260, 481262, 3107242, -1092684, -1059663, 3226337, -1111000, -3690220, -4748279, 3243298, 768704, -1298820, -2320600, -3028439, -1613693, 6143959, -2086782, -821774, -1370987, 1087174, -1587770, -2488269, 3690059, -720403, 2051779, 3171307, -4385766, -2509489, -248992, 1173432, -3719128]
829g04990n1412I267K238290f91908l422614k08896A547702e437489G07792j58450
819E49342J405344L600068d137986F04074a252079l177357H37883a769705H91493
809e206262A531828b608922A392480M358620f38743q410569C444511c208856g82202
799d314379C187516c05320E52893c23455j42298A506758d066427I06706K189978
790C096684d970528D164020h78447C011063i00483C186193D49318b514853B770216
780A343736J183257b168346E092166A158242a859882B29133P49825N03059b814159
770h74382G8976J274420a851565C176712b067297E06146K142966j221347b732124
760A911571K6349N07132g255070D525476A710956l82616a046226j801771E590595
$$ y = [-704990, -756402, 9267, 2247557, -691908, -4114522, -4323418, 1547702, -5437489, 707792, 549342, 1954686, 5554754, -4137986, 604074, -1252079, -4429436, 837883, -1769705, 891493, -5206262, 1531828, -2608922, 1392480, 5751100, -638743, -9049312, 3444511, -3208856, -782202, -4314379, 3187516, -305320, 552893, -323455, -465753, 1506758, -4066427, 906706, 3096684, -4970528, 4164020, -878447, 3011063, -900483, 3186193, 449318, -2514853, 2770216, 1343736, 2526993, -2168346, 5092166, 1158242, -1859882, 229133, 978958, 1482017, -2814159, -874382, 78976, 1353396, -1851565, 3176712, -2067297, 506146, 2649112, 1427765, -2732124, 1911571, 1937920, 2445052, -7255070, 4525476, 1710956, 1328340, -1046226, -2847997, 5590595]
750d367797d69319l497919F202851e199875a301500E988384f95143E018063c691752
740A462432C8821b750237C48005K195737J481828j740545a061460A61307L259245
731C420552C69574J035829f40708C674569i01507r49046E335199c894888c93322
721b683894I87467J876177L592192M347914E334103a6478215k338547O032088
713a2784674j3167135J2039316C5032539j7491502n786575J1071529p866015o947840
705H012136a8970442l563144o102925j8919691N476550B2872313n355219j060721
697A6456373K5171128A1199405d427297J551807a392405M08945n862746A237497
688b804075D343111c151060G46137J4226K55823c177495A450013L404982a264937
$$ y = [-4367797, -469319, -3967238, 6202851, -5199875, -1301500, 5988384, -695143, 5018063, -3691752, 1462432, 38821, -2750237, 348005, 2543742, 4025570, 2285025, -1061460, 161307, 3420552, 369574, 1405403, -640708, 3674569, -901507, -1850553, 5335199, -3894888, -393322, -2683894, 987467, 2863644, 6455836, 10803750, 5334103, -16478215, -18816762, -12784674, -25951809, -13912493, 35032539, 17541037, 11754462, 22825991, 14959976, 8012136, -18970442, -22533586, -28636511, -47556202, -42079652, 22872313, 17517094, 16456373, 41627501, 11199405, -4427297, -2875490, -1392405, -983460, -6846206, 1237497, -2804075, 4343111, -3151060, 746137, 760363, 1016186, -3177495, 1450013, 4854995, -1264937]
678a57640q98263G656851Q655647J8311233G14737b905232k4216645J1199949
670a5921928N143668l0936948h952808k755088B7124304P769878j0697712E399000
661G148897a4084024c821187J830156j8596951Q002440p00997C423428R115416
653A2538844C506200A411631a615403H135916d043949B560270r21394J354108
645B992984L895215b729900a206180B496391a022879C453828g18478I207558B698383
635G93814d78374l522210G24151k26653M118157j009056g27123A922100Q724216
626A0646316D768622J0371194J4770685N6702976J18502219b53063538K7276116
619b25787422J0236421A83517374C3830362j1426242A0350510k335491p75945
$$ y = [-157640, -1055903, 7656851, 16312498, 34623731, 714737, -2905232, -27121877, -15921928, -10778260, -41715208, -8952808, -11707896, 27124304, 34894182, 24196470, 5399000, 7148897, -14084024, -3821187, -1991031, -20587982, -12585542, -13286539, 3423428, 12538844, 3506200, 1411631, -1615403, 8135916, -4043949, 2560270, 1638876, 2992984, 6888199, -2729900, -1206180, 2496391, -1022879, 3453828, -718478, 9207558, 2698383, 793814, -478374, -4000584, 724151, 497498, 4615655, 3606599, -727123, 1922100, 10646316, 4768622, 15139816, 29910501, 86613477, 205115696, -253063538, -225787422, -215551001, 183517374, 33830362, 22404120, 10350510, 8015019, 7239074]
612G239074B062893A022413b554172D934228r41777c578776D337048g52733B195227
602h61919o42112C898476a224498B501956C43028b082884n84404A089153H9291
592a355187j223957A561377B68782c340161B488223a183968n83997C615415h98362
582F18605J927292a086048A515659K433739h8349C989272d244860J712512i36431
572b051706p31040D799351d44565o270368a751069D170014j360171d756412E736034
562B729103f195061E2860J391548b647071L9848a227849C319867J64738f453246
552c35798C87817b354406h60904E41312L72868m14598K563924d3673A783828a34418
541a565284E696489f403177D98953K503579o94738a946233j665797h4187B405446
$$ y = [7239074, 2062893, 1022413, -2554172, 4934228, 3992451, -3578776, 4337048, -752733, 2195227, -861919, -1504031, 3898476, -1224498, 2501956, 343028, -2082884, -2667288, 1089153, 89291, -1355187, -2579144, 1561377, 268782, -3340161, 2488223, -1183968, -1767965, 3615415, -898362, 618605, 2545897, -1086048, 1515659, 3949398, -88349, 3989272, -4244860, -2532348, -936431, -2051706, -2782746, 4799351, -444565, -6714933, -1751069, 4170014, 2809843, -4756412, 5736034, 2729103, -6195061, 52860, 1444408, -2647071, -2607223, -1227849, 3319867, 3484605, -6453246, -335798, 387817, -2354406, -860904, 541312, 914180, 499582, 3063506, -43673, 1783828, -134418, -1565284, 5696489, -6403177, 498953, 3002532, 2307794, -1946233, -3612030, -84187, 2405446]
531B37402b776378A511457P93918l74777c95403B144840n95945c385135E39661
521a621347A135739a338325j973986D214712b964616B849994c303292A585561
512A137004e607476D227434C72644a99323C0258a342625G13560i76675F873353
502a077897A096828J58413c333090A941797f46589k01481j977613B560677H89059
492a545454C881307d436479C522996A712885d013149a63550G15600k35978N16391
483I96013d1505q030759E84014d082736C067162j032667a28268k16852m66139
474h11259J85666e0609m413922D606055a843109o63211C95934O308217a634446
464C327237c564423C461241D93373K535403b995609i90425C241268b589051j381553
$$ y = [237402, -2776378, 1511457, 2305375, 1930598, -395403, 2144840, 1548895, -3385135, 539661, -1621347, 1135739, -1338325, -3312311, 4214712, -2964616, 2849994, -3303292, 1585561, 1137004, -5607476, 4227434, 372644, -199323, 30258, -1342625, 713560, -976675, 6873353, -1077897, 1096828, 1255241, -3333090, 1941797, -646589, -848070, -2825683, 2560677, 889059, -1545454, 3881307, -4436479, 3522996, 1712885, -4013149, -163550, 715600, 479622, 996013, -41505, -8072264, 584014, -4082736, 3067162, 2034495, -128268, -345120, -811259, -625593, -50609, -4464531, 4606055, -1843109, -2506320, 395934, 6704151, -1634446, 3327237, -3564423, 3461241, 493373, 3028776, -2995609, -990425, 3241268, -2589051, -3970604]
455c970604D725534g02069L13315B310944d28496k600735O88576j796507C002764
445A458413H758i07266J80894B128842g982056E629913j354518A028360K02620
436A230980a198650k660577B23086a054857j886188J311739l84803A858134M5350
427A903484b981669D196934j160837L63603d959331C854244b219377j476828j716452
418e412657I55934j16511c39355I506e52432A059405a632269g00158A104460m43726
408F60734b42863A790439f246318B169769a924421A167501a138922n21320j885292
399c545534J384138R96021A62043d758191B672881a496810B135071D82302Q84620
390A366922g86288A196690a695029k404289O06664a215319C503500a041274A440050
$$ y = [-3970604, 4725534, -702069, -388754, 2310944, -428496, -3029231, -2340655, -4137162, 3002764, 1458413, 8758, -907266, -726372, 2128842, -7982056, 5629913, 4275395, 1028360, 1230980, -1198650, -3859227, 223086, -1054857, -2941045, -1629306, -2014109, 1858134, 1903484, -2981669, 4196934, 3036097, 3399700, -4959331, 3854244, -2219377, -3696205, -5412657, 955934, 839423, -339355, 9506, -552432, 1059405, -1632269, -700158, 1104460, 660734, -242863, 1790439, -6246318, 2169769, -1924421, 1167501, -1138922, -1660242, -3545534, -2161396, -1165375, 162043, -4758191, 2672881, -1496810, 2135071, 482302, 1366922, -786288, 1196690, -1695029, -4099318, -3492654, -1215319, 3503500, -1041274, 1440050]
380a9827j672835P59980m430j515436F00195i41019k254713B48219b404156A075642
369a648644B46135f21079J98757A221354C85398J889356b670591H95371l58798
360E36573b700471A50751b644739P99502O16680m655940C500352I90060k88021
351G02039J663463a750209F06333e55100m85828l339286C772943A823691O83147
342B506838e693906A660500q03583i11073C180915K67124c746690A19749a763960
332E876286G70395c848491a870178a55254O6469D017922d43366j884485I78953
322A585339f170382B835281b047416B087881b69970F5372L661299a35052B299537
312a392028p002188D361559h43104J46843A376212d91846j837621b66229I65736
$$ y = [-19827, -1692662, -932682, -937112, -2452548, 600195, -941019, -3195732, 248219, -2404156, 1075642, -1648644, 246135, -621079, -422322, 1221354, 385398, 2274754, -2670591, 895371, 536573, -2700471, 150751, -2644739, -1845237, -1228557, -5884497, 3500352, 990060, 702039, 2365502, -1750209, 606333, -555100, -1040928, -4380214, 3772943, 1823691, 2506838, -5693906, 1660500, 856917, -911073, 3180915, 3448039, -3746690, 119749, -1763960, 5876286, 770395, -3848491, -1870178, -155254, -88785, 4017922, -443366, -2327851, 978953, 1585339, -6170382, 2835281, -2047416, 2087881, -269970, 65372, 3726671, -135052, 2299537, -1392028, -8394216, 4361559, -843104, -696261, 1376212, -491846, -2329467, -266229, 965736]
302B817867E035f518279C649378b854652E603505B512414d95439B265908b280038
292B264202c710230C813558b741742f37515l938572A803279a98029k360324A99689
282a250099C225523a463037A232012b102412Q51790j061706B05641M740000b221128
272b451879C88053O27740A46117c120438J520836k316725a138915k293323B675106
262f1091B809085h94406j29137j039324F009592b009367B799701b496967D240839
252A793507b085515B494283a467174r50795I92999L08235A02909i66321j91141
243a157462C817143a982607l906333A069885f71157l52788B377764o56964f139478
233E598433b902462n89923C582788d43983l09366C123815h83368l95890A711839
$$ y = [2817867, 5035, -6518279, 3649378, -2854652, 5603505, 2512414, -495439, 2265908, -2280038, 2264202, -3710230, 3813558, -2741742, -637515, -4576087, 1803279, -198029, -2558353, 199689, -1250099, 3225523, -1463037, 1232012, -2102412, -1250622, -2312328, 205641, 4945641, -2221128, -2451879, 388053, 1015793, 146117, -3120438, -1599602, -3916327, -1138915, -3432238, 2675106, -61091, 2809085, -894406, -1023543, -2062867, 6009592, -2009367, 2799701, -2496967, 4240839, 1793507, -2085515, 2494283, -1467174, -2417969, 992999, 1301234, 102909, -966321, -1157462, 3817143, -1982607, -5888940, 1069885, -671157, -1023945, 2377764, 1720800, -6139478, 5598433, -2902462, -3492385, 3582788, -443983, -753349, 3123815, -883368, -1279258, 1711839]
223c60509B035031L553610c539999F38449c097641J96399d24418a25752j694657
214a820409k70856i28007m69263d46230A145323N85196N307152A11713c049054
204A817763a064034C328422c550337J137388D682686a772982J32515B419933b65389
194C139902P880534O839983g4728562j13144598c8193944h990290A58552947p5307711
186H3245236J21176816D2161596A6800866a95476300b1995765e156714j094720
179f251434J405881h32162A554911m31384P11285J592626i45782k732697J412214
170b266265D619345b714274a95203A109375n05806J91632L172143g08091n369418
161f077509F125263A677625p41180L002808c115283C05533K658240b719142F20239
$$ y = [-360509, 2035031, 5588641, -3539999, 638449, -3097641, -2901242, -424418, -125752, -1820409, -2091265, -928007, -1397270, -446230, 1145323, 1730519, 7037671, 111713, -3049054, 1817763, -1064034, 3328422, -3550337, -2412949, 4682686, -1772982, -1640467, 2419933, -265389, 3139902, 11020436, 17860419, -74728562, -187873160, -38193944, -8990290, 158552947, 83245236, 204422052, 42161596, 16800866, -195476300, -21995765, -5156714, -6251434, -4845553, -832162, 1554911, 1123527, 1834812, 3427438, -945782, -3678479, -2266265, 4619345, -2714274, -195203, 1109375, 603569, 795201, 3967344, -708091, -6077509, 6125263, 1677625, 936445, 3939253, -3115283, 305533, 2963773, -2719142, 620239]
151A204666c484689G93852L907657a011517C408149e448324C129836H7976a730055
141A391227d880194d20C15076H8481K164843a926943k026520C00785J16222J201058
131A618065c680455A3335b696264C130617a451942k005021A224466b449260M48610
122b000650B100949Q55414e204420D54983J288537d13895D7617K300459n77340
113A770736a111798B381178c239544C775898i53084D74871b311757a89530q18862
104a008392B708465c795331B328800J802328d363582A841629d245698G25427j6716
95G08711a949874B926187A167042K500695c9368m008553A694188m62889d30758
85C337981A358833K70298d652074g14108j072764b75505A653018J839544A225552
$$ y = [1204666, -3484689, 793852, 4701509, -1011517, 3408149, -5448324, 3129836, 87976, -1730055, 1391227, -4880194, -420, 315076, 88481, 2253324, -1926943, -3953463, 300785, 417007, 1618065, -3680455, 13335, -2696264, 3130617, -1451942, -3456963, 1224466, -2449260, -2000650, 2100949, 2956363, -5204420, 454983, 1743520, -413895, 47617, 2348076, 1770736, -1111798, 2381178, -3239544, 3775898, -953084, 474871, -2311757, -189530, -1008392, 2708465, -3795331, 2328800, 4131128, -4363582, 1841629, -4245698, 725427, 708711, -1949874, 2926187, 1167042, 3667737, -39368, -4047921, 1694188, 1231299, -430758, 3337981, 1358833, 1629131, -4652074, -714108, -1786872, -275505, 1653018, 3492562, 1225552]
75c114431A055799K49503K14885c738256B746656J173281n01479E6210c06956
65b10148A350728d331530E375832c327306J16612H94400J807582b572783g02953
55A275359J325814P59194B83030a752805A407834f89613J65583E858942a779228
45B345753p49040C79553Q03466J203799b013009E64264J407991c382174H75725
35c223174E438905e609370B058361c01707l286055E72413R59915J753051c771528
25B66534a135308B732602b543135h81677l450504A697398O00602g61332j557039
16b318371A266864k73175a795259q73310D225475A268352a083885b98103j816704
7b114807A454207a023755I31162c53317m32699j836809K91848
$$ y = [-3114431, 1055799, 1305302, 1520187, -3738256, 2746656, 3919937, 3418458, 56210, -306956, -210148, 1350728, -4331530, 5375832, -3327306, -3210694, 894400, 2701982, -2572783, -702953, 1275359, 2601173, 3360367, 283030, -1752805, 1407834, -689613, -524030, 5858942, -1779228, 2345753, 1596713, 379553, 1183019, 2386818, -2013009, 564264, 1972255, -3382174, 875725, -3223174, 5438905, -5609370, 2058361, -301707, -3587762, 572413, 1532328, 3285379, -3771528, 266534, -1135308, 2732602, -2543135, -881677, -4332181, 1697398, 2298000, -761332, -2318371, 1266864, 993689, -1795259, -2668569, 4225475, 1268352, -1083885, -298103, -2114807, 1454207, -1023755, 931162, -353317, -786016, -2622825, -2330977]
0b330977
$$ y = [-2330977]
##PAGE= F1=5705.973409302
##FIRST=     21204.543296753, 2686.85945900537, -1440590
##DATA TABLE= (F2++(Y..Y)), PROFILE
2047a440590C156438a651152B547508a269664k84513m81981A628840N87290c620823
2037B081110c99214B93754J276932f93551C81848J661504m69096j44311a200234
2027B378075a315959d83771C168613m68090b569787B3159g83559l850958P69559
2018c864958D903566k25491A873300i0734o82491a3559j88751j790422A683414
2008C785665c212564B223740G93814b622284Q63267F021052H72985a555922A086995
1998h96833A360276d615517A485108b384049J038034j289891l432121H16612a578040
1988B875512b38515k389323O25378C81620L017113f82480E584181O69704b425804
1978b023105E237285f05226o01593e30124C200866a013691A59943R71054d92283
$$ y = [-1440590, 3156438, -1651152, 2547508, -1269664, -1554177, -2036158, 1628840, 2216130, -3620823, 2081110, -399214, 293754, 1570686, -693551, 381848, 2043352, 1574256, 1429945, -1200234, 2378075, -1315959, -483771, 3168613, 2700523, -2569787, 23159, -783559, -4634517, -3864958, 4903566, 4678075, 1873300, -90734, -773225, -13559, -202310, -1992732, 1683414, 3785665, -3212564, 2223740, 793814, -2622284, -1759017, 6021052, 872985, -1555922, 1086995, -896833, 1360276, -4615517, 1485108, -2384049, -1346015, -2635906, -6068027, 816612, -1578040, 2875512, -238515, -2627838, -2002460, 381620, 3398733, -682480, 5584181, 6253885, -2425804, -2023105, 5237285, -605226, -1206819, -530124, 3200866, -1013691, 159943, 1130997, -492283]
1968a750204C024084a300761C145766j313981e74047k211734k40875D81414M006045
1959D487459e87919R9138a4297j779426C473540a954857k35075R64148N21873
1950g03911B204465K23253j094357b036571A683965a856597g53722B695329n81027
1941B114302M42523e306764a155143I11167L765537d514947A14048c445207C797081
1931A518447c267227A085311c283067a101645p03625G270274a793955A125442
1922a022186b4829C104025b177053B220323e68996n22625G07206a137617P3461
1913a064156A028725K322038a740054j502489N11245e64928l89863B729088b732941
1903d38029G18171N898699B275249h017281F934640i177427C529278b161507E5582
$$ y = [-1750204, 3024084, -1300761, 3145766, 1831785, -574047, -2785781, -3026656, 481414, 4487459, -587919, -488781, -14297, -1793723, 3473540, -1954857, -2189932, -1225784, -703911, 2204465, 2427718, 1333361, -2036571, 1683965, -1856597, -753722, 2695329, 2114302, 2556825, -5306764, -1155143, 911167, 4676704, -4514947, 114048, -3445207, 3797081, 1518447, -3267227, 1085311, -3283067, -1101645, -1805270, 7270274, -1793955, 1125442, -1022186, -24829, 3104025, -2177053, 2220323, -568996, -1091621, 707206, -1137617, -1064156, 1028725, 3350763, -1740054, -3242543, -2731298, -564928, -954791, 2729088, -2732941, -438029, 718171, 6616870, 2275249, -8017281, 6934640, -9177427, 3529278, -2161507, 55582]
1893b677939B072009f769255A030801O69565a039781j562392j346291C06132c200482
1883B216199a478508j691656D107411a204141c48475k55258B664257E14286a709104
1873G919803A412732b092400n936804C614058p76561f655475b723561j216272
1865c939833A789411O09630d239044C002082J558400A385474d960164B995014
1856b369084D98652c874343b168C127262c17728p80409A90095J855270b836129
1846c484876B32605g30781D560532a854604j996681a911349C145730a387524A791149
1836A642278c101041M57879A397910d372213E231817f49079j354941B100182c749009
1826A049597J912429f85693D962500c004704a66643B594713A170656p781K080329
$$ y = [-2677939, 2072009, -6769255, 1030801, 1700366, -1039781, -2602173, -3948464, 306132, -3200482, 2216199, -1478508, -3170164, 4107411, -1204141, -348475, -603733, 2664257, 514286, -1709104, 7919803, 1412732, -2092400, -8029204, 3614058, 2837497, -6655475, -2723561, -3939833, 1789411, 2399041, -4239044, 3002082, 4560482, 1385474, -4960164, 2995014, -2369084, 498652, -3874343, -2168, 3127262, -317728, -1098137, 190095, 2045365, -2836129, -3484876, 232605, -730781, 4560532, -1854604, -3851285, -1911349, 3145730, -1387524, 1791149, 1642278, -3101041, -2643162, 1397910, -4372213, 5231817, -649079, -2004020, 2100182, -3749009, 1049597, 2962026, -685693, 4962500, -3004704, -166643, 2594713, 1170656, 1162875, 3243204]
1817C243204b819995a26363l234784C990981n41603b367862j045284B463765d266977
1807D220344j445397d54425m899810K262248D98865O2531K783190c023633F65539
1797A887807h84327j520312n37557A322059a481517L75921B464639c598591B3910
1787A211387L209592g060094D401979A315945A62624i12394G23991K73966b989621
1777H78073K086304b547353g48629k03970k847218J5978K00446C254043b493627
1767I95746J560424c6803D163187a03478A237621g64439A888176a933180f52849
1757b000988G86650c905847G945503a301817A71354L67418L2112f12881k381331
1748b994212K02561E15953b928726D14684d194271f7105A059885N111150a036531
$$ y = [3243204, -2819995, -126363, -3361147, 3990981, 3449378, -2367862, -3413146, 2463765, -4266977, 4220344, 2774947, -454425, -5354235, -3091987, 498865, 561396, 3344586, -3023633, 665539, 1887807, -884327, -2404639, -2942196, 1322059, -1481517, -1105596, 2464639, -3598591, 23910, 1211387, 4420979, -7060094, 4401979, 1315945, 162624, -912394, 723991, 997957, -2989621, 878073, 2964377, -2547353, -748629, -952599, -3799817, -3783839, -3583393, 3254043, -2493627, 995746, 2556170, -36803, 4163187, -103478, 1237621, -764439, 1888176, -1933180, -652849, -2000988, 786650, -3905847, 7945503, -1301817, 171354, 538772, 570884, -612881, -2994212, -2791651, 515953, -2928726, 414684, -4194271, -67105, 1059885, 6171035, -1036531]
1738b119129A213191c411496j721350A524381m43641A28206d361446c26298R3750
1729b32548C166223H3211K037934b662329k294556D64224b281579O53749O41747
1720i86083C527257A440088J005910n80703b417711A781505l8145a52811j240177
1711a392988j418696B235494h4058r45253A329699l23737K123832F32798J269943
1702A902741a358434A489846e952638b023792C726264b658283E478769f038967
1693a22532A644937J340417c250170E027251h42362I74834e30920B593000f5240
1683e480286D353838a134004A34594L314639a660552A453530a929637B046463
1674a679047N62080E119244b825283J248518I16137A30879i81065k098037A541231
$$ y = [-2119129, 1213191, -3411496, -5132846, 1524381, 1080740, 128206, -4361446, -326298, -232548, 3166223, 83211, 2121145, -2662329, -4956885, 464224, -2281579, -1627830, -986083, 3527257, 1440088, 2445998, 1865295, -2417711, 1781505, 1743360, -152811, -1392988, -2811684, 2235494, -84058, -1029311, 1329699, 1005962, 3129794, 632798, 1902741, -1358434, 1489846, -5952638, -2023792, 3726264, -2658283, 5478769, -6038967, -122532, 1644937, 2985354, -3250170, 5027251, -842362, 974834, -530920, 2593000, -65240, -5480286, 4353838, -1134004, 134594, 3449233, -1660552, 1453530, -1929637, 2046463, -1679047, -1116967, 5119244, -2825283, -1576765, 916137, 130879, -981065, -3079102, 1541231]
1664a827358B553789d358739B48856M21784k69188p809e879273I350813D40839
1654A546097G72099c190927B606353a271302d77475A549831L211182D46745c487977
1644d21645A270307A29043a401104C745325a134959B80572J280062D84186M79377
1635I63563c40527k96323A786111A04073M616319c630496G15834A21104a025536
1625b087490n11936B06355a605268J79862I249263C28576A10585c555873C6601
1615A598236J275612a308331A997819M6779a396029L68088L58274o247265b252523
1605E591306a980114C907400b00064q73305G375190B585501a856773h55509A172868
1595H69350B00593e40402A364477a495941m034356C345292A418857N428848d882826
$$ y = [-1827358, 2553789, -4358739, 248856, 670640, 401452, 393643, -5879273, 9350813, 440839, 1546097, 772099, -3190927, 2606353, -1271302, -477475, 1549831, 4761013, 446745, -3487977, -421645, 1270307, 129043, -1401104, 3745325, -1134959, 280572, 1560634, 484186, 963563, -340527, -636850, 1786111, 104073, 4720392, -3630496, 715834, 121104, -1025536, -2087490, -2599426, 206355, -1605268, -1425406, 9249263, 328576, 110585, -3555873, 36601, 1598236, 2873848, -1308331, 1997819, 2044598, -1396029, -1027941, -669667, -6916932, -2252523, 5591306, -1980114, 3907400, -200064, -1073369, 7375190, 2585501, -1856773, -855509, 1172868, 869350, 200593, -540402, 1364477, -1495941, -5530297, 3345292, 1418857, 6847705, -4882826]
1585a179343j579524B537534b57095b7724D485907A589720b025359A384503D59106
1575B383945e460603A570009N03877q52681l96398b372226p16879A046625N70777
1566A617402L058341a869347j312796E98865d241221B833724b285682L80704D286111
1556B570881j015634G36553d38806F845611C48654a902661l93209B016843n97399
1547A419444h45429A373081o80543A76550J197515l02821Q78569J025561C58010
1537H05803a206296I80184P08692g00877j589181J132685D647568E25087c37402
1527A329081E98872a04015j703012I22719L73920O55779h90424A918151N49452
1518B467603a146721a38924C174783h887060B942918J887186A287169a397607
$$ y = [-1179343, -2758867, 2537534, -257095, -27724, 4485907, 1589720, -2025359, 1384503, 459106, 2383945, -5460603, 1570009, 2073886, 1221205, 824807, -2372226, -3089105, 1046625, 1617402, 4675743, -1869347, -3182143, 598865, -4241221, 2833724, -2285682, -1904978, 4286111, 2570881, 1555247, 736553, -438806, 6845611, 348654, -1902661, -2295870, 2016843, 1419444, -845429, 1373081, 692538, 176550, 1374065, 1071244, 1949813, 2975374, 358010, 805803, -1206296, 980184, 1688876, -700877, -2290058, -1157373, 4647568, 525087, -337402, 1329081, 598872, -104015, -1807027, 922719, 1296639, 1952418, -890424, 1918151, 2467603, -1146721, -138924, 3174783, -8887060, 2942918, 4830104, 1287169, -1397607]
1509E56068A50799J931007e070682C995679i47286p46584B061370K99919e669232
1499C648761A1874L660078d761842B958552j257713h78444a57108C325580p30772
1490B594808J123973G0015f043523e614A863307d274166O50294A534647L9697
1481A574344L750868f111652a959344A390362L811175a795875M26012a25574l32911
1472d58485C795085a386930l49490j97583I68725a477235j697940a319385D699364
1462G33459a522269B405006B30749c055779C34017d742864C416599j316943f042665
1452I72140a111825G64806c483811a294168H4381a965748C272582g244275B328890
1442I08793k95002L772967D8179a162026B553185c461662C378127J528036b271575
$$ y = [556068, 150799, 2081806, -5070682, 3995679, -947286, -1693870, 2061370, 2361289, -5669232, 3648761, 11874, 3671952, -4761842, 2958552, 1700839, -878444, -157108, 3325580, 2594808, 3718781, 70015, -6043523, -5614, 1863307, -4274166, -3623872, 1534647, 1574344, 5325212, -6111652, -1959344, 1390362, 5201537, -1795875, -1369863, -125574, -458485, 3795085, -1386930, -1736420, -1934003, 968725, -1477235, -3175175, -1319385, 4699364, 733459, -1522269, 2405006, 230749, -3055779, 334017, -4742864, 3416599, 2099656, -6042665, 972140, -1111825, 764806, -3483811, -1294168, 84381, -1965748, 3272582, -7244275, 2328890, 908793, 613791, 4386758, 48179, -1162026, 2553185, -3461662, 3378127, 4906163, -2271575]
1432A613287l96372K431838a459223I3129a642305A620978c235415C04138h53785
1422c15422B840743a929390o80001B306605j116333f52786A181769a513097B66196
1412e11333j749416D335558b435825A674953b106587A816596c80634B887754f24601
1402B128252b142490j552751G680377A193698d017191n14590A770972Q26893F80550
1392I06995F0797a726234A831509J315686h17416q65875F20454c12833A81137
1382h14509B118433J718799e6285B26695b256843B75557J653122b120871h31680
1372B088949b73948B892549a397874k123527A688555d347682D913352C41a806322
1362I21131b356165B5550J812888D97585L198831A499857b191772q71522e23135
$$ y = [1613287, 1216915, 3648753, -1459223, 93129, -1642305, 1620978, -3235415, 304138, -853785, -315422, 2840743, -1929390, -2609391, 2306605, 1190272, -652786, 1181769, -1513097, 266196, -511333, -2260749, 4335558, -2435825, 1674953, -2106587, 1816596, -380634, 2887754, -624601, 2128252, -2142490, -3695241, 7680377, 1193698, -4017191, -4531781, 1770972, 2597865, 680550, 906995, 60797, -1726234, 1831509, 3147195, -817416, -1683291, 620454, -312833, 181137, -814509, 2118433, 3837232, -56285, 226695, -2256843, 275557, 1928679, -2120871, -831680, 2088949, -273948, 2892549, -1397874, -3521401, 1688555, -4347682, 4913352, 341, -1806322, 921131, -2356165, 25550, 1838438, 497585, 3696416, 1499857, -2191772, -3063294, -523135]
1352b634591j63912F077230A083646h37090o84219F02680b464431q919J12562
1343b360788r0553a54991B694265c532225a059253A235916b852579C547196A159221
1333C66720c331j119886B421019q59765e215333E97326e575047A459839c39666
1323b969095C69819j4439O61032c820931C04699a868250j225804R34139o89415
1314b849330F519727b34067A993705k60100a89103o607518A465880M30799d613120
1304b671204A509258M561508A481785b132024m45876A046123K903945c752719
1295a446834N00816F226986c324325B403432C08758e730569A8036f24812C903262
1285H59919Q8228K55442e664843E60625L08705d900914a314569A940527K037379
$$ y = [-2634591, -2798503, 6077230, 1083646, -837090, -1521309, 602680, -2464431, -2473350, -2360788, -2451341, -154991, 2694265, -3532225, -1059253, 1235916, -2852579, 3547196, 1159221, 366720, -3331, -1123217, 2421019, 1561254, -5215333, 597326, -5575047, 1459839, -339666, -2969095, 369819, 355380, 1016412, -3820931, 304699, -1868250, -3094054, -2159915, -2849330, 6519727, -234067, 1993705, 1733605, -189103, -6796621, 1465880, 1896679, -4613120, -2671204, 1509258, 6070766, 1481785, -2132024, -2577900, 1046123, 3950068, -3752719, -1446834, -946018, 6226986, -3324325, 2403432, 308758, -5730569, 18036, -624812, 3903262, 859919, 948147, 1203589, -5664843, 560625, 869330, -4900914, -1314569, 1940527, 3977906]
1276C977906E04661J444684c757380A420659J5303J287805J238346g47458B611700
1266d696114D287178G32427a112860A914430i52067M49017p33915B865767J059838
1257C925605e81155o34660A310956f38901G95308a091432F0743P46129c510014
1247a189922B972520B31914c796576B979516b829200b26826j817757I45899P05670
1238A651569k16662o17732A23258g77454A404437c112080C87044d130474B070699
1228a762383j688005a51448G57375K107353h77933j676971E22407A84574O154725
1219F339299b576298p86613J016160j270449c95706n772980F88290R85028a03472
1209A268564b02020A214863a623805A98821L877657a441195j096727Q98826C120530
$$ y = [3977906, 504661, 1949345, -3757380, 1420659, 1435962, 2723767, 3962113, -747458, 2611700, -4696114, 4287178, 732427, -1112860, 1914430, -952067, -503050, -1236965, 2865767, 3925605, -581155, -1215815, 1310956, -638901, 795308, -1091432, 60743, 806872, -3510014, -1189922, 2972520, 231914, -3796576, 2979516, -2829200, -226826, -2044583, 945899, 1651569, 1434907, 817175, 123258, -777454, 1404437, -3112080, 387044, -4130474, 2070699, -1762383, -3450388, -151448, 757375, 2864728, -877933, -2554904, 522407, 184574, 6339299, -2576298, -3362911, -2346751, -3617200, -395706, -6168686, 688290, 1673318, -103472, 1268564, -202020, 1214863, -1623805, 198821, 4076478, -1441195, -2537922, -1639096, 3120530]
1199f082504b682993J23232E942401a202580B54776K148637O271130c263104K57425
1190c005679J353936F052862d137761C486351Q54706a950097A413159d329149
1181f37163A00090K921160I13934f664695C617410o86661b253260j919599D932841
1171a919921N57240k266077B610720f214357C251169j126903O4715c217665L79415
1162b838250F492084B75812a178584A981148N40941c277274B4189N48033K59625
1153H31847b666948p11438D145588c702183F05425L090278b402210a48472l000835
1144c149307a127219F50176i44023B431923c53842k511448A249448J079704R38144
1135C267296c717543g77038D503730d665233B249807a386520A880684c30682B491315
$$ y = [-6082504, -2682993, -2559761, 5942401, -1202580, 254776, 2403413, 8674543, -3263104, -3005679, -1651743, 6052862, -4137761, 3486351, 4341057, -1950097, 1413159, -4329149, -637163, 100090, 3021250, 913934, -6664695, 3617410, 2930749, -2253260, -4172859, 4932841, -1919921, -1362681, -3628758, 2610720, -6214357, 3251169, 2124266, 2188981, -3217665, -2838250, 6492084, 275812, -1178584, 1981148, 2522089, -3277274, 24189, 572222, 831847, -2666948, -3378386, 4145588, -3702183, 605425, 3695703, -2402210, -148472, -3149307, -1127219, 650176, -944023, 2431923, -353842, -2865290, 1249448, 2329152, 3267296, -3717543, -777038, 4503730, -4665233, 2249807, -1386520, 1880684, -330682, 2491315]
1125A451036a106189c98506I9269L132553d287251b129895B405741E71344P74547
1116A345891C28136M67977e586292G62919g51494j990986A135175N012365A346184
1106c703722B411006a779366m38387D198774a979603A058098L876832g151823
1097A917449f022624D88769L496564b076455B841592i41902A353287J247294J563092
1088D163673c826551c85622E786081H83948c014283A057321a14830E31132L80305
1079I11437J236045a455007A588614J480617A528664f58827B303668c857968k238563
1070f096531c35331k205205j095521J114399J078357H46555A7460P17790L843199
1061D578449g77090k456659D389554b398679D052648b297192l37047A173624e707424
$$ y = [1451036, -1106189, -398506, 99269, 3231822, -4287251, -2129895, 2405741, 571344, 1345891, 328136, 796113, -5586292, 762919, -751494, -2742480, 1135175, 6147540, 1346184, -3703722, 2411006, -1779366, -2217753, 4198774, -1979603, 1058098, 4934930, -7151823, 1917449, -6022624, 488769, 3985333, -2076455, 2841592, -941902, 1353287, 2600581, 4163673, -3826551, -385622, 5786081, 883948, -3014283, 1057321, -114830, 531132, 911437, 2147482, -1455007, 1588614, 3069231, 1528664, -658827, 2303668, -3857968, -6096531, -335331, -2540536, -3636057, -2521658, -1443301, 846555, 17460, 735250, 4578449, -777090, -3233749, 4389554, -2398679, 4052648, -2297192, -2634239, 1173624, -5707424]
1051d053084B374383b335333A658601b550928E483518I61346a324768K68792m22583
1042a478559I8779a106654G10204J441093J140978A040478e975158C361486B12718
1032A105029a407892A036071a401212k725856D51472M041322c568410D30480R70077
1023A400557d233933A473958J75433A0384J29622K805471E31461J889150a200416
1013a575022C114278r6541c577170J368150J014392M3814B118390b747818j463639
1004d211457g22197P1162A013874D56987K526608c673749A57913d73471E13970
994a518768D744971c16593j374028n756935C553936a369548m750785K562368J011993
985b545972D527375a560561C138439j090126o61434J742245a567240A12189J774228
$$ y = [-4053084, 2374383, -2335333, 1658601, -2550928, 5483518, 961346, -1324768, -1055976, -1478559, 98779, -1106654, 710204, 2151297, 3292275, 1040478, -5975158, 3361486, 212718, 1105029, -1407892, 1036071, -1401212, -4127068, 451472, 4492794, -3568410, 430480, 1400557, -4233933, 1473958, 1649391, 10384, 140006, 2945477, 531461, 2420611, -1200416, -1575022, 3114278, 3017737, -3577170, -2209020, -1194628, -1150814, 2118390, -2747818, -4211457, -722197, -651035, 1013874, 456987, 2983595, -3673749, 157913, -473471, 513970, -1518768, 4744971, -316593, -1690621, -7447556, 3553936, -1369548, -6120333, -3557965, -2545972, 4527375, -1560561, 3138439, 2048313, 1386879, 3129124, -1567240, 112189, 1886417]
976A886417a722008e35946A660479J426383j118619J912107e468165e00990B44014
966i00360A676271O12995a826732d95864A552832c511977A361937o09151c831713
956A671621m60202O322465e039445c28621B555120A209198n74458a288075n850076
947g138151D110063c82475E530022c949088i63384C14378f92798k426307J075856
938b043249A450734J719739d403939J750392G68054P2682L0537J244997a90234
928a853614j236471D604855A467425a755975B153395D44101O91081J025033b081422
918B548216a631847F81841b342571h81370b04450l005987q8439j134304B1797
908a743085h18048B235057q61208k74858J50134N39718J539047c471960i76749
$$ y = [1886417, -1722008, -535946, 1660479, 3086862, 1968243, 3880350, -5468165, -500990, 244014, -900360, 1676271, 2289266, -1826732, -495864, 1552832, -3511977, 1361937, 752786, -3831713, 1671621, 1211419, 7533884, -5039445, -328621, 2555120, 1209198, 634740, -1288075, -7138151, 4110063, -382475, 5530022, -3949088, -963384, 314378, -692798, -3119105, -2043249, 1450734, 3170473, -4403939, -2653547, 768054, 840736, 871273, 2116270, -190234, -1853614, -3090085, 4604855, 1467425, -1755975, 2153395, 444101, 1135182, 2160215, -2081422, 2548216, -1631847, 681841, -2342571, -881370, -204450, -3210437, -3298876, -4433180, 21797, -1743085, -818048, 2235057, 1373849, 1098991, 1249125, 1788843, 3327890, -3471960, -976749]
898B789258a237343j534523C060945j84118f72337k605496B152819p12561J024141
889B464399a824840A987520b051005L62056C216478a411300E27488b095915D49740
879A696645c903748c29199j04989m17260B94315K762519K087822a427258D864787
869D93159J605755b997642c57958J50089k396690B359339d95904m27816C380726
859h26765C045188i61396L55B622625c15278l808399q70319C462314A215384i35263
848c120137J32556J450585F448437b262357a0173k358190A068262b095218k09886
839b305104D151735e51692B446368P94334d386365b074853a73111A673035c358937
829g53514j046893E11962K327143a010681k653873j94169A811989f390174H06057
$$ y = [2789258, -1237343, -2771866, 3060945, 2876827, -672337, -3277833, 2152819, 1440258, 2464399, -1824840, 1987520, -2051005, -1688949, 3216478, -1411300, 527488, -2095915, 449740, 1696645, -3903748, -329199, -434188, -851448, 294315, 3056834, 5144656, -1427258, 4864787, 493159, 2098914, -2997642, -357958, -207869, -2604559, 2359339, -495904, -923720, 3380726, -826765, 3045188, -961396, -961041, 2622625, -315278, -4123677, -4993996, 3462314, 1215384, -935263, -3120137, -2987581, -1536996, 6448437, -2262357, -10173, -2368363, 1068262, -2095218, -2305104, 4151735, -551692, 2446368, 3240702, -4386365, -2074853, -173111, 1673035, -3358937, -753514, -1800407, 511962, 2839105, -1010681, -3664554, -3858723, 1811989, -6390174, 806057]
819F32195O30699L842676d027643G04734a525547k941965A060619a727805E17968
809d861856A505118b487556A603186N366259g89981q323791C276480c758664a01390
799d119776D206339i08089C23359a32176J564H53205c683738G35539K835619e381521
788D815948g39141B747619b93777C877992A36320a653942A945119E83557L001775
779C585332b916243D718091A423837b230624A15427Q76105L34471b302308i38266
769A14135J638484b383213B721661a795480A38172K583731l90455b022475H55325
759C031666n17837g446559C918024j890884K94139a476822j701868F251955e577086
749e17806k777298E995801d510683J909654F453424d21859F005179b997806G38532
$$ y = [632195, 1262894, 5105570, -4027643, 704734, -1525547, -4467512, 1060619, -1727805, 517968, -4861856, 1505118, -2487556, 1603186, 6969445, -789981, -9113772, 3276480, -3758664, -101390, -4119776, 4206339, -908089, 323359, -132176, -130612, 853205, -3683738, 735539, 3571158, -5381521, 4815948, -739141, 2747619, -293777, 3877992, 136320, -1653942, 1945119, 583557, 3585332, -2916243, 4718091, 1423837, -2230624, 115427, 991532, 1326003, -2302308, -938266, 114135, 1752619, -2383213, 2721661, -1795480, 138172, 2721903, 2331448, -2022475, 855325, 3031666, 2513829, -7446559, 3918024, 2027140, 2321279, -1476822, -3178690, 6251955, -5577086, -517806, -3295104, 5995801, -4510683, -2601029, 6453424, -421859, 6005179, -2997806, 738532]
739E61839c768526H94462K244577O96552A894435a158384B27879L348959B55025
729A155548b22885B835125e60690q81611F443892d468037c51314k477060C81177
719C154122L465451N699729E963284a9396335k447258P080512j6682580a3047212
710C9313362j8280316o803476J1107638p929481q144355b0947531o217673l847134
702c1012338k4488053P880349B7093936o444139l720694L1532176A3800894f067512
693b765426J150654k97472l619345A225203c618134D296825c495224A137931l17680
684H20251l92628b241905I59414L902102a682395N24369j302084H210058R953319
675A8163377K1872486F16828b772242k8065660J2919896O041402l3893306a0720533
$$ y = [561839, -3768526, 894462, 3139039, 3835591, 1894435, -1158384, 227879, 3576838, 255025, 1155548, -222885, 2835125, -560690, -1442301, 6443892, -4468037, -351314, -2828374, 381177, 3154122, 6619573, 12319302, 5963284, -19396335, -21843593, -14763081, -31445661, -13047212, 39313362, 21033046, 14229570, 25337208, 17407727, 9263372, -20947531, -27165204, -31012338, -55500391, -47620042, 27093936, 20649797, 16929103, 48461279, 13800894, -6067512, -2765426, -1614772, -1912244, -5531589, 1225203, -3618134, 4296825, -3495224, 1137931, 820251, 427623, -2241905, 959414, 4861516, -1682395, -1158026, -2460110, 8210058, 18163377, 40035863, 616828, -2772242, -30837902, -17918006, -11876604, -45769910, -10720533]
666a1205470B7611006J3457513j0424199F547030L60332a6656929c842622J831521
658b011101k2362286J1056488j277316C630174J0652798C697776A694298a032643
649H412224d386060B440970j002780J999913K866919b232285J082675B854033
640g43818C509399i83400H506605C136557A162279h91057j990162A567420G19759
630D327180r08755e62361B132139Q686543m897249R912941K1081427O5241848
622A02157649J38494005b99232805L5750668J1857122B15677052C9699951j4779285
615B4920666A1728603k952547J18295C340440A269778a959199E119957j253633
607C866324c211836C917207i21686A415285b51649r65764C928467a339594B632876
$$ y = [-11205470, 27611006, 41068519, 30644320, 6547030, 6907362, -16656929, -3842622, -2011101, -24373387, -13316899, -14594215, 3630174, 14282972, 3697776, 1694298, -1032643, 8412224, -4386060, 2440970, 1438190, 3438103, 6305022, -2232285, -1149610, 2854033, -743818, 3509399, -983400, 8506605, 3136557, 1162279, -891057, -2881219, 1567420, 719759, 4327180, 3418425, -562361, 2132139, 10818682, 5921433, 15834374, 36915801, 102157649, 240651654, -299232805, -263482137, -251625015, 215677052, 39699951, 24920666, 11728603, 8776056, 8894351, 3340440, 1269778, -1959199, 5119957, 3866324, -3211836, 3917207, -921686, 1415285, -251649, -1217413, 3928467, -1339594, 2632876]
597c51471k188037N01434A531129o50847a607688j419133B402105C15445c120902
587B280204a321223q83774D565142a449715G69213R81836g66669B021343J191876
578C213219c56995D273985d486331J657338i24727q77940m44865D247763I3623
568f323275a975769D154568j208950d718420E686544B479836f529673F2939R78636
559A041575b881371L38748a197730B884530K35765f380996e14749D96097a833274
549a259381D92315L17593B89319L332304i9272A681833B73986a629950E594956
539f071037a18347C145900j33057c554452p81508a08314A453926B66690b722482
529A369972J221296q21969B62087J903536j030335c533434H40279a161905F23055
$$ y = [-351471, -2539508, -2038074, 1531129, 880282, -1607688, -3026821, 2402105, 315445, -3120902, 2280204, -1321223, -2204997, 4565142, -1449715, 769213, 1751049, -766669, 2021343, 3213219, -356995, 4273985, -4486331, -2828993, -924727, -1802667, -2247532, 4247763, 93623, -6323275, -1975769, 4154568, 2945618, -4718420, 5686544, 2479836, -6529673, 62939, 1041575, -2881371, -2542623, -1197730, 2884530, 3120295, -6380996, -514749, 496097, -1833274, -1259381, 492315, 809908, 289319, 3621623, -99272, 1681833, 273986, -1629950, 5594956, -6071037, -118347, 3145900, 3012843, -3554452, -4335960, -108314, 1453926, 266690, -2722482, 1369972, 2591268, 1769299, 262087, 2165623, 1135288, -3533434, 840279, -1161905, 623055]
519a515672j804465D478394b488157B669550c361793A944511q15977e930236D245880
509B80547h85330c39735r73186D93369f25959F374361a588402F43373K15239b057576
498A780875a176859M47783k868955C146232A285657a838865C988913d554923C368364
488A592656d091352B95203J184043B84145J242415b99960p284414H78521c818696
478C178410j414394g236G68237a028872K79058c12346m789725D628458b036933
468b694510A239477N291636a314508C056967b971189C973395C12343J929317c207550
458a080110B498023b867215o85776D833513f44250m53663B881507g82934k836423
449c619357a793024k328573B242072q65238b5374n53629J980A977573g626247
$$ y = [-1515672, -3320137, 4478394, -2488157, 2669550, -3361793, 1944511, 1128534, -5930236, 4245880, 280547, -885330, -339735, -1312921, 493369, -625959, 6374361, -1588402, 643373, 858612, -2057576, 1780875, -1176859, -729076, -3598031, 3146232, 1285657, -1838865, 3988913, -4554923, 3368364, 1592656, -4091352, 295203, 1479246, 284145, 1526560, -299960, -7584374, 878521, -3818696, 3178410, 1764016, -7236, 768237, -1028872, -749814, -312346, -5102071, 4628458, -2036933, -2694510, 1239477, 6531113, -1314508, 3056967, -2971189, 3973395, 312343, 2241660, -3207550, -1080110, 2498023, -2867215, -3552991, 4833513, -644250, -1097913, 2881507, -782934, -3619357, -1793024, -4121597, 2242072, 1376834, -25374, -579003, -577023, 1977573, -7626247]
439E519400j595299H22498K5476h54127l276373F96836a027723j902670J199539
430a730854l66034B714591j186488b056219C594669L38487o15943d809053E631253
420b344879j952951r75014A283416j45346C85718a15990l26315H81607a311719
410a676036E55131J413295a79670A559328f254362B683251c623772B193092f52952
400a451124k227311J261182a169127e26969m071928C461057a739636B777241G62535
390A471069a554577F81365b718858o80051l4830d46996B910740i21505A523772
380f88415o47337c0190j148141j312608A390269b20986l125998C32998b600696
370C39083b227292c42497p89504N27587A410753o69667J713372a621555B49111
$$ y = [5519400, 3924101, 822498, 847974, -854127, -4130500, 696836, -1027723, -2930393, -1730854, -2096888, 2714591, 1528103, -2056219, 3594669, 3933156, 3317213, -4809053, 5631253, -2344879, -4297830, -5272844, 1283416, 1138070, 385718, -115990, -442305, 881607, -1311719, -1676036, 555131, 1968426, -179670, 1559328, -6254362, 2683251, -3623772, 2193092, -652952, -1451124, -3678435, -2417253, -1169127, -526969, -4598897, 3461057, -1739636, 2777241, 762535, 1471069, -1554577, 681365, -2718858, -3398909, -3433739, -446996, 2910740, -921505, 1523772, -688415, -1335752, -30190, -1178331, -2490939, 1390269, -220986, -3346984, 332998, -2600696, 339083, -2227292, -342497, -1132001, -604414, 1410753, 741086, 2454458, -1621555, 249111]
360F50633c244554h27418j527925Q09498L82085n236267D168195I56303l37401
351F18902J540184a464817A26274h32736R0423l680984D262482D91636K433770
342B925406d101730A169783n2542a697696C057312j64236c610707b56000j743995
333a999995F295197B73656c311800J281368c97731C31716L135672g4962j601996
324a676958F40849J298447e460245B687148a560904B161793a080465E03370K506468
315C009838a77950B428486a454096o046601C972562a149087M24029A599113b37402
305a749959P25573D1987L513958g35408n429940C876131c035005E969388A546486
295e5620B555715b538909A845678c817805C923462b190523h15671k205899A581945
$$ y = [650633, -3244554, -827418, -2355343, -1545845, -1163760, -6400027, 4168195, 956303, 618902, 2159086, -1464817, 126274, -832736, -742313, -4423297, 4262482, 491636, 2925406, -4101730, 1169783, 1117241, -1697696, 3057312, 2893076, -3610707, -256000, -1999995, 6295197, 273656, -3311800, -2030432, -397731, 331716, 3467388, -74962, -1676958, 640849, 1939296, -5460245, 2687148, -1560904, 2161793, -1080465, 503370, 3009838, -177950, 2428486, -1454096, -7500697, 3972562, -1149087, -725058, 1599113, -237402, -1749959, -1024386, 41987, 3555945, -735408, -6165348, 3876131, -3035005, 5969388, 1546486, -55620, 2555715, -2538909, 1845678, -3817805, 3923462, -2190523, -815671, -3021570, 1581945]
285c04248k506506I27623a076732C360021a413542A086104b562559g84624j142868
276a927492b06591E124119c269052J464741D71446N89n4627b241880r73070k91674
266c506624i00052k342840B410236c65108B562176h31003l30273j456175F126706
256a363097B592236a951445D617644A890933a624259B259713g49363k146244A355023
246A013355p5968a740261e15720C552845b830964j715164F04134i47847l11273
237a259120B452590m11072f480150E494353c197101j83174D101085a083822b72669
227C886202h88128J92752A375977B04478J556860L156907c795530A138068b396349
217d001294b44512C50114b632602m39202a000737o96090g52477I55745K498765
$$ y = [-304248, -2810754, 927623, -1076732, 3360021, -1413542, 1086104, -2562559, -784624, -1927492, -206591, 5124119, -3269052, -1804311, 471446, 472035, 417408, -2241880, -3214950, -3506624, -900052, -3242892, 2410236, -365108, 2562176, -831003, -1161276, -2617451, 6126706, -1363097, 2592236, -1951445, 4617644, 1890933, -1624259, 2259713, -749363, -2895607, 1355023, 1013355, 937387, -1740261, -515720, 3552845, -2830964, -4546128, 604134, -947847, -1259120, 2452590, 2041518, -6480150, 5494353, -3197101, -3380275, 4101085, -1083822, -272669, 3886202, -888128, -695376, 1375977, 204478, 1761338, 4918245, -3795530, 1138068, -2396349, -4001294, -244512, 350114, -2632602, -3071804, -1000737, -1696827, -752477, 955745, 3454510]
208C454510L035408A130455c767849A316329h52295C922741d471997a962579E100588
198b015912K770B439120f52017C516823J0396019M808250h9272801j33401106
190b22673907d3478911h819616A90185890r3418732J43530831D9726116A8669604
182b27528761b7152399f037318p14866J686719a823540A433823J31937f97522
173B758518a544605k388458a464269D860206b493954b26929A268309J43909l51837
164A060381K567559d98704n952479E299044B457773I69065K665350b660407i303
154C613218c345521C44889P27293b973470I87908M242590i80829B278167e567204
144B964767b75549k018091A540713e353616A36171P6905q0789J402657b637551
$$ y = [3454510, 6489918, 1130455, -3767849, 1316329, -852295, 3922741, -4471997, -1962579, 5100588, -2015912, -2013142, 2439120, -652017, 3516823, 13912842, 18721092, -89272801, -222673907, -43478911, -8819616, 190185890, 96767158, 240297989, 49726116, 18669604, -227528761, -27152399, -6037318, -6752184, -5065465, -1823540, 1433823, 1565760, -697522, 2758518, -1544605, -3933063, -1464269, 4860206, -2493954, -226929, 1268309, 1412218, 1060381, 3627940, -498704, -6451183, 5299044, 2457773, 969065, 3634415, -2660407, -9303, 3613218, -3345521, 344889, 1072182, -2973470, 987908, 5230498, -980829, 2278167, -5567204, 2964767, -275549, -2293640, 1540713, -5353616, 136171, 213076, 132287, 1534944, -2637551]
134c358788C68485A11723J091191c033938a48890j846871B985752a166559l739137
125d905696A757120a908642j47132B513906O12183e936895D32533J421043a264018
115f51787A823045J17921a384639B504179c362177D405003i17427C15532b553456
105b74998r43205B462277c808558B200932K466359d264570A860460d882815C59158
95b29560j253266C618952A430314K157801a40254n476800A636457j77702n14600
86I44155J875448q13101L00424d382886h49762p15851B79220N54153L014282H45421
75b654938A196397k30855Q42029d077846B717380J302138j134681I7397f48080
65c40959A090062c784712D809419c549755L66827b472B336369b560998a146942
$$ y = [-3358788, 368485, 111723, 1202914, -3033938, -148890, -1995761, 2985752, -1166559, -4905696, 1757120, -1908642, -2055774, 2513906, 3126089, -5936895, 432533, 1853576, -1264018, -651787, 1823045, 1940966, -1384639, 2504179, -3362177, 4405003, -917427, 315532, -2553456, -274998, -1218203, 2462277, -3808558, 2200932, 4667291, -4264570, 1860460, -4882815, 359158, -229560, -1482826, 3618952, 1430314, 3588115, -140254, -5617054, 1636457, 1458755, 944155, 2819603, 2006502, 2306926, -4382886, -849762, -1565613, 279220, 833373, 3847655, 845421, -2654938, 1196397, 965542, 1807571, -4077846, 2717380, 4019518, 2884837, 97397, -648080, -340959, 1090062, -3784712, 4809419, -3549755, -3182928, -2472, 2336369, -2560998, -1146942]
55I10304K095604J30535A048242a732161A140620g64278c30834F241954c215510
45C470336A546994b47312F46528J097525a594371A060591Q09742b246816F92925
35b996541E806079f672711A724930e66509l068309B79664J329523K600125d015256
25A084456a279020C094688b721130A319765d234975A058905J379806h38512j113886
16a952398A415981n45641b054157o65846D534090A355644a950509A61977b567547
6B262593a291695F25671f67155j211865p08402P36873
0a850549
$$ y = [910304, 3005908, 3136443, 1048242, -1732161, 1140620, -764278, -330834, 6241954, -3215510, 3470336, 1546994, -247312, 646528, 1744053, -1594371, 1060591, 1870333, -2246816, 692925, -2996541, 5806079, -6672711, 1724930, -566509, -3634818, 279664, 1609187, 4209312, -4015256, 1084456, -1279020, 3094688, -2721130, 1319765, -4234975, 1058905, 2438711, -838512, -1952398, 1415981, 870340, -2054157, -2720003, 4534090, 1355644, -1950509, 161977, -2567547, 2262593, -1291695, 625671, -667155, -1879020, -2587422, -1850549]
##PAGE= F1=5684.175139418
##FIRST=     21204.543296753, 2686.85945900537, -789976
##DATA TABLE= (F2++(Y..Y)), PROFILE
2047g89976C164880a566296B369777a622644r4416K21628A764650J80494c006470
2037B077538e72463B98789J368404h17525I22721R71825M6377n43962a337817
2027C188234a197554d99561B468069k34307b420616b40588n19356m347542K340500
2018b766986E214803j267766j689514I6956c65155n72226A8579a561293B09237
2008C500486c843312B514591H44735b536160N77776E624909D07873g77793A045888
1998a163901A573468e117789B788983b086719c77998j878561m503549C13296a131025
1988B945830C15959b891653a386572a70318C355922g16335E522773J361268a961962
1978b307013E136899a262530j0185h1787C139166g61534h3650A138267A3555b111081
$$ y = [-789976, 3164880, -1566296, 2369777, -1622644, -1717060, -1495432, 1764650, 1945144, -3006470, 2077538, -572463, 298789, 1667193, -817525, 922721, 1894546, 1940923, 1396961, -1337817, 3188234, -1197554, -499561, 2468069, 2233762, -2420616, -240588, -759944, -5107486, -2766986, 5214803, 3947037, 2257523, 96956, -365155, -937381, 18579, -1561293, 209237, 3500486, -3843312, 2514591, 844735, -2536160, -1958384, 5624909, 407873, -777793, 1045888, -1163901, 1573468, -5117789, 2788983, -2086719, -377998, -2256559, -6760108, 313296, -1131025, 2945830, 315959, -2891653, -1386572, -170318, 3355922, -716335, 5522773, 6884041, -1961962, -2307013, 5136899, -1262530, -1272715, -81787, 3139166, -761534, -83650, 1138267, 13555, -2111081]
1967C896800a328277C211967A049591a233930j957267L45485e3706D127559E2494
1957c144A02799f35557C412120b272563m75621J042661d55877A203073K822903
1948D025976A486613b333628A260469a530790e36153B934058r55038R89445e424962
1938a779018A726550K826263d760063C32967c693220C456264j120289b840550
1929D90917c196968a346348j61211G201345i27111B24805a079639A31238K596522
1920B727760a866163A363761B51364a027121D36065a417041L53548E73414K441846
1911C015260a968581j718570N35503F38750a829924B840145b822101d47721H24565
1901F786096B873175g707111F811080h885876C663697b265090d06997k302651
$$ y = [3896800, -1328277, 3211967, 1049591, -1233930, -3191197, -2845712, -53706, 4127559, 52494, -3144, 102799, -635557, 3412120, -2272563, -2748184, -1705523, -455877, 1203073, 4025976, 1486613, -2333628, 1260469, -1530790, -536153, 2934058, 1979020, 2968465, -5424962, -1779018, 1726550, 4552813, -4760063, 332967, -3693220, 3456264, 2335975, -2840550, 490917, -3196968, -1346348, -1507559, 7201345, -927111, 224805, -1079639, 131238, 2727760, -1866163, 1363761, 251364, -1027121, 436065, -1417041, -1063493, 573414, 3015260, -1968581, -3687151, -3151648, 638750, -1829924, 2840145, -2822101, -447721, 824565, 6786096, 2873175, -7707111, 6811080, -8885876, 3663697, -2265090, -406997, -2709648]
1893b709648B530890f093836G75229J113618a349086q01319j381108F01498c388858
1883A471961a411029k241045D127663i04421L99657r08951B633483D89315a553079
1873G634717A619442i50325o983995C882311A924805e562510b631737j040695
1865c672432A856524O22106d354179C246492J103969C79828d823849C297668b847464
1855C61206c002324d2535C064279f26393p72069A288919M65278c192441k78696
1846c471137C21331g28934D283458a958823k410488a684794C041839a086918A300276
1836A636727b865209L57914G10990c909300D585419D22249b257903B592884c796792
1826A293886J546501b70073E052594b223852B50886J267046j23064K79218K27914
$$ y = [-2709648, 2530890, -6093836, 775229, 1888847, -1349086, -2150405, -3531513, 601498, -3388858, 1471961, -1411029, -3652074, 4127663, -904421, -504764, -1413715, 2633483, 489315, -1553079, 7634717, 1619442, -950325, -7934320, 3882311, 1924805, -5562510, -2631737, -3672432, 1856524, 2478630, -4354179, 3246492, 4350461, 379828, -4823849, 3297668, -2847464, 361206, -3002324, -42535, 3064279, -626393, -1398462, 1288919, 1754197, -3192441, -3471137, 321331, -728934, 4283458, -1958823, -4369311, -1684794, 3041839, -1086918, 1300276, 1636727, -2865209, -2507295, 710990, -3909300, 4585419, 422249, -2257903, 2592884, -3796792, 1293886, 2840387, -270073, 5052594, -2223852, 250886, 1517932, 1394868, 1674086, 1902000]
1817A902000a825167f59641k874157D099596j78399b428739M17167B354353d824747
1807D810501j803979d5589n814599b480076D07371D9813L197973c238216A309112
1797A561630i04432j028706j122865A177016a20415j860546B821575c743032a199217
1787B465033J350886h093797D247318A342252A34826a125582A124441J016797
1779B141238c170949E27710K493785b252432g89588r17552k432964m3350L81178
1770c802276D599114c766151A178785J037946E92345L336918A22824J627932h21568
1760B035811b056216e17409q21887G21259d728624I224619a521955H3941i3929
1750B29320f82988k647959N86187A10270b339950B50427d611528I6408J361918
$$ y = [1902000, -1825167, -659641, -3533798, 4099596, 3921197, -2428739, -2011572, 2354353, -4824747, 4810501, 3006522, -45589, -5860188, -2480076, 407371, 49813, 3247786, -3238216, 1309112, 1561630, -904432, -1933138, -3056003, 1177016, -120415, -1980961, 2821575, -3743032, -1199217, 2465033, 3815919, -8093797, 4247318, 1342252, 134826, -1125582, 1124441, 2141238, -3170949, 527710, 3021495, -2252432, -789588, -1707140, -4140104, -4183454, -3802276, 4599114, -3766151, 1178785, 2216731, 592345, 3929263, 122824, 1750756, -821568, 2035811, -2056216, -517409, -1339296, 721259, -4728624, 9224619, -1521955, 83941, -93929, 229320, -682988, -3330947, -2744760, 110270, -2339950, 250427, -4611528, 96408, 1458326]
1741A458326M345602a020406j509718I08178c517296j200705A573008j51857A67662
1731c821271b82892k97920C255147f15071B087100a815755l918035A249172b309568
1721a844999Q13586C705200A143592O99792J6458b726791B406800r37951B35877
1711a256950j642625B162417D35168a677957B392378C36459L667082F07691J545307
1702B152998a963564A309025e555311b231541C951438a736376D645873g056974
1693a172568B337443j61800c303629D209763g12812A504600g54515C137703d40576
1683d146468D501131a375494e63728D700795b315385H47930a782916B602060a864970
1673a358486E196270c383671b29476A426310E6112i71476j456350A762083a556878
$$ y = [1458326, 5803928, -1020406, -2530124, 908178, -3517296, -4718001, 1573008, 1421151, 167662, -3821271, -282892, -580812, 3255147, -615071, 2087100, -1815755, -5733790, 1249172, -2309568, -1844999, -1031413, 3705200, 1143592, 1843384, 1859842, -2726791, 2406800, 1468849, 235877, -1256950, -2899575, 2162417, 435168, -1677957, 2392378, 336459, 4003541, 607691, 2152998, -1963564, 1309025, -5555311, -2231541, 3951438, -1736376, 4645873, -7056974, -1172568, 2337443, 2175643, -3303629, 4209763, -712812, 1504600, -754515, 3137703, -440576, -4146468, 4501131, -1375494, -563728, 4700795, -2315385, 847930, -1782916, 2602060, -1864970, -1358486, 5196270, -3383671, -229476, 1426310, 56112, -971476, -2427826, 1762083, -1556878]
1663B948848c606244C12024K77796r2670p6477e504572I756992D28567J408128
1654A836695o76303c177790B726891a784410b40446B916864R74434A070055c794709
1644i39323A308175i6009j006227D143106i86843G48498J160139j43913g79054
1634c54029J5604B697417D59115L202605c245611A458265I7208f90409j108493
1625a798902p66955I8385g20101j401927I139330B16651K09469c971135D08449
1615A327778O07247a207932A759795J88928a383244L85986J32202o329955a633894
1605E808961a823926B891928I4864i65328G326561B404541a010353q1994A761727
1595I20144m55531i00315H02449a455585l894681C751400A325604N685475d940827
$$ y = [2948848, -3606244, 312024, 589820, 497150, 420673, -5504572, 9756992, 428567, 1836695, 1160392, -3177790, 2726891, -1784410, -240446, 2916864, 3891298, 1070055, -3794709, -939323, 1308175, -96009, -1102236, 4143106, -986843, 748498, 1908637, 1764724, -779054, -354029, -338425, 2697417, 459115, 3661720, -3245611, 1458265, 97208, -690409, -1798902, -2565857, 98385, -720101, -2122028, 9139330, 216651, 426120, -3971135, 408449, 1327778, 1935025, -1207932, 1759795, 1948723, -1383244, -997258, -865056, -7195011, -1633894, 5808961, -1823926, 2891928, 94864, -965328, 7326561, 2404541, -1010353, -1092347, 1761727, 920144, 464613, -900315, 802449, -1455585, -5350266, 3751400, 1325604, 7011079, -4940827]
1585h14743k872077B453076B6673d09421E390278A563108a936201A321479D44680
1575I95665e230646B056190J92063q78980C58830a874659j230035A185074L82505
1566A567579J933897a742465j385792D12644c884059B850288b148092i16532D097109
1556B596493l5545C40069g47405E872228B30969a897875j76232G20706J250200
1547A970906c71648I77974m35184J33523P0187N40595N47915J074592E23937K4905
1537E48842i78944A118431Q90631a775745j125642i07892E843370G98001a49836
1527A347470L33808d87745j378889F00534N52881J008118b53320A505131J204455
1518B709586h47267a45987C637389i124867B885108J874052A442828a325355D37382
$$ y = [-814743, -3686820, 2453076, 26673, -409421, 5390278, 1563108, -1936201, 1321479, 444680, 995665, -5230646, 2056190, 2248253, 1369273, 358830, -1874659, -3104694, 1185074, 1567579, 3501476, -1742465, -3128257, 412644, -3884059, 2850288, -2148092, -916532, 4097109, 2596493, 2560948, 340069, -747405, 5872228, 230969, -1897875, -2074107, 720706, 1970906, -371648, 977974, 542790, 676313, 746500, 1287095, 1835010, 2909602, 523937, 548842, -978944, 1118431, 2009062, -1775745, -2901387, -907892, 5843370, 798001, -149836, 1347470, 1681278, -487745, -1866634, 600534, 1153415, 2161533, -253320, 1505131, 2709586, -847267, -145987, 3637389, -9124867, 2885108, 4759160, 1442828, -1325355, 437382]
1508C48028J453852f499072D385205f65889o56287A919225J415789f683850D187893
1498A3927M285391d755076B601466H93706h81927E84787J524291J376969j61449
1489C324598A067938g093407C29500J656989d824026J362545A360778q87L936189
1480E296080e584937b610633A093877M463198b116570Q13395c84205j83852D552256
1470C28441b081715L07554A433511a587918k310314a398196D598631H56388a393838
1460A772751b63313l481249D10961d590268C433048l88929f782765A043671c25310
1450B21347c417452a562320B79219b441463B645113g164851A082508k44144B02109
1440D392695D74806a155136B496571c761482B726008K588873b368347I10204M64112
$$ y = [348028, 1801880, -6499072, 4385205, -665889, -1322176, 1919225, 3335014, -6683850, 4187893, 13927, 4299318, -4755076, 2601466, 893706, -881927, 584787, 2109078, 3486047, 3324598, 1067938, -7093407, 329500, 1986489, -4824026, -3461481, 1360778, 1359891, 5296080, -5584937, -2610633, 1093877, 5557075, -2116570, -1303175, -384205, -568057, 4552256, 328441, -2081715, -1774161, 1433511, -1587918, -3898232, -1398196, 4598631, 856388, -1393838, 1772751, -263313, -3744562, 410961, -4590268, 3433048, 3044119, -6782765, 1043671, -325310, 221347, -3417452, -1562320, 279219, -2441463, 2645113, -7164851, 1082508, 838364, 202109, 4392695, 474806, -1155136, 2496571, -3761482, 2726008, 5314881, -2368347, 910204, 1374316]
1431A374316K582352g35283C94033a236637G84447b576363B57700A03287n1449
1422E1838J806472a226942j796906B312775I62872i80269F70300a951647F84216
1412g30874j985823C696037b015124B079355b315168B211878d79265B554327g13855
1402B270142b138964j283126H328550F65305d210563k78392B151723n087G24431
1392A381146d552j471585A371183R94905a477761O86154G32173G0153c01360J28797
1382a72563B370892J039091F88123j54476b110529B31429J952520b115845f88500
1372B529984a086649C099907b449566o23459A547131d435873D808390f63337q68426
1363a531763A424973b040394c82267B108448p88777J998695A296405a813168o52508
$$ y = [1374316, 3956668, -735283, 394033, -1236637, 784447, -2576363, 257700, 103287, 51838, 1858310, -1226942, -3023848, 2312775, 962872, -980269, 670300, -1951647, 684216, -730874, -2716697, 3696037, -2015124, 2079355, -2315168, 2211878, -479265, 2554327, -713855, 2270142, -2138964, -3422090, 8328550, 665305, -4210563, -4488955, 2151723, 2146636, 724431, 1381146, -4552, -1476137, 1371183, 2366088, -1477761, -791607, 732173, 70153, -301360, -172563, 2370892, 3409983, 688123, 533647, -2110529, 231429, 2183949, -2115845, -688500, 2529984, -1086649, 3099907, -2449566, -3073025, 1547131, -4435873, 4808390, -663337, -1531763, 1424973, -2040394, -382267, 2108448, 1319671, 3318366, 1296405, -1813168, -2465676]
1354b465676c27200k052885j425227E589542A853700a99462k050860A719694b531676
1344a972891o72718l0627e4587B674063d889858c47029H55258a303696C172338
1334A227257l30888a186275m8048A533047j30873e121526A191798e172514A349110
1324a214241j510573C08574N8899M67009c048187E93850b166445n98320J031914
1315a732851j322854F502498c13290A838903j80651g06166o400388A340975M65544
1306A806519d758681b124093B241174L600973A291660a905791l94679E10747M413867
1297D924614d974908a488263L03084E391883b853796C073059a04841l314263d34979
1287b297450C657005A225327m68637M21005f081502A021842m9506d189688a707408
$$ y = [-2465676, -327200, -2380085, -3805312, 5589542, 1853700, -199462, -2250322, 1719694, -2531676, -1972891, -2645609, -2676236, -54587, 2674063, -4889858, -347029, 855258, -1303696, 3172338, 1227257, 896369, -1186275, -1234323, 1533047, 1402174, -5121526, 1191798, -5172514, 1349110, -1214241, -2724814, 308574, 367473, 834482, -3048187, 593850, -2166445, -2764765, -1732851, -3055705, 6502498, -313290, 1838903, 1658252, -706166, -7106554, 1340975, 1806519, -4758681, -2124093, 2241174, 5842147, 1291660, -1905791, -2300470, 510747, 4924614, -4974908, -1488263, -1185179, 5391883, -2853796, 3073059, -104841, -3419104, -434979, -2297450, 3657005, 1225327, 756690, 1177695, -6081502, 1021842, 972336, -4189688, -1707408]
1277A950041J875333b32408B122066d083801B444760l92299n35068J692490a52929
1267B892299d030232D134090D04684a763148A769170g90725j61045K99022C270950
1257C312284c31938r98333G58354B01124M81443i84596d00153G22138c026067
1247b437946C910393A55609c417304C164081c627270a225870j245514A168031
1238A575393N71178j034854i77563a4734A399684b202828C76580d275239A162412
1228a035004l105379C78009c3469B022542d95951j335134c84085A524005M343822
1219E867827b170251j383850J537138j745721g41100m922694A549959F63284k77093
1210C86191R51738D57880N97443a914885B34178L266007a699259m45558L69065
$$ y = [1950041, 3825374, -232408, 2122066, -4083801, 2444760, 2052461, 1517393, 3209883, -152929, 2892299, -4030232, 4134090, 404684, -1763148, 1769170, -790725, -951770, -652748, 3270950, 3312284, -331938, -1330271, 758354, 201124, 682567, -984596, -400153, 722138, -3026067, -2437946, 3910393, 155609, -3417304, 3164081, -3627270, -1225870, -2471384, 1168031, 1575393, 2146571, 1111717, -977563, -14734, 1399684, -2202828, 376580, -4275239, 1162412, -1035004, -4140383, 378009, -33469, 2022542, -495951, -1831085, -384085, 1524005, 5867827, -2170251, -3554101, -2016963, -3762684, -741100, -5663794, 1549959, 663284, 386191, 1337929, 457880, 1055323, -1914885, 234178, 3500185, -1699259, -2144817, -1775752]
1201a775752C151047f126687b634054o3992E259841f97136D4399K515917M992374
1192G552690c171473k71762a515045F461346d946115C364602j168056b189717
1183A204891c999053a204184A90021L007163I32366f258983C349918l7851b588286
1173d307825E083399b032086P51157k764318B723096f005442C420050j454694
1165A965356j15745b516065q05925G186785F33288a823160B534605J20553c201230
1155A0897P49934C65791a922281j618848C715194c930691H55209L683606b179950
1145h49086k157328O83150A323419a446300A709965C36237c860406A577623J000670
1136B578293L02217c467488c57057D773428d203663B259341b149092B187952e74248
$$ y = [-1775752, 3151047, -6126687, -2634054, -2698046, 5259841, -697136, 44399, 2560316, 7552690, -3171473, -3443235, -1515045, 6461346, -4946115, 3364602, 2196546, -2189717, 1204891, -3999053, -1204184, 190021, 3197184, 932366, -6258983, 3349918, 3312067, -2588286, -4307825, 5083399, -2032086, -1280929, -4045247, 2723096, -6005442, 3420050, 1965356, 1849611, -2516065, -3321990, 7186785, 633288, -1823160, 2534605, 2655158, -3201230, 10897, 760831, 365791, -1922281, -3541129, 3715194, -3930691, 855209, 4538815, -2179950, -849086, -3006414, -2323264, 1323419, -1446300, 1709965, 336237, -3860406, 1577623, 2578293, 2880510, -3467488, -357057, 4773428, -4203663, 2259341, -2149092, 2187952, -574248]
1126C462070A387450a055856M25269A6551L326923c702954P52317B013889H02528
1116A788452H8684M41194e250556H18450g47354k109293I26587M821227A397427
1106c636051A961267a871388L15494C614319b743327G70875M146100f901747B370959
1096f355027E33391K893578a826127C452471f58272A990335M39773K260486c887930
1086G4291N574132F96665d060711A493802b37340j90318A592476Q53392a518995
1076A775006Q26241j287993i3277B433768c822062j742795b79188k224758k22677
1067b726623k02411a376736D1222M37695K0415M559151a084928k363703D246565
1057b247412C874251b920561J45158A525988e355645J874729B726863b115453
$$ y = [3462070, 1387450, -1055856, -630587, 16551, 3343474, -3702954, -2950637, 2013889, 802528, 1788452, 88684, 529878, -5250556, 818450, -747354, -2856647, 926587, 5747814, 1397427, -3636051, 1961267, -1871388, -1555894, 3614319, -2743327, 770875, 4916975, -6901747, 2370959, -6355027, 533391, 3426969, -1826127, 3452471, -658272, 1990335, 2430108, 4690594, -3887930, 74291, 5648423, 696665, -4060711, 1493802, -237340, -427658, 1592476, 2445868, -1518995, 1775006, 2601247, 1313254, -93277, 2433768, -3822062, -5564857, -279188, -2503946, -2726623, -2929034, -1376736, 41222, 478917, 499332, 5058483, -1084928, -3448631, 4246565, -2247412, 3874251, -2920561, -2775403, 1525988, -5355645, -3480916, 2726863, -2115453]
1048A706244a774016E501920H51658a116231o13464N99207H8011a637770C58121
1038C199967K8677A334662e761165C517342A95835O80518a867873A392864a042988
1028c809294D12297M156763c705746B564588C743c501294A224754K017033d01639
1018a51371B880010E52552J995884e81976n61421B889093l67340c953582J642077
1009b311505O17938Q42856C078897b552151j958191f50683a88149A087738I2458
999C256646c774455e09449K3084A029365a223374C936333f1428j079229o034772
990g175429C474941a878900m118935K706046Q24732E114468a768358C149007q27536
981B321471n70254K423111b110910D50047J335965a473139k54842B320336J323992
$$ y = [1706244, -1774016, 5501920, 851658, -1116231, -1729695, -1130488, 88011, -1637770, 358121, 3199967, 3228644, 1334662, -5761165, 3517342, 195835, 876353, -1867873, 1392864, -1042988, -3809294, 412297, 4569060, -3705746, 2564588, 3743, -3501294, 1224754, 3241787, -401639, -151371, 2880010, 552552, 2548436, -581976, -1143397, 2889093, 2521753, -3953582, -2311505, -1693567, -850711, 3078897, -2552151, -4510342, -650683, -188149, 1087738, 92458, 3256646, -3774455, -509449, -486365, 1029365, -1223374, 3936333, -61428, -1140657, -7175429, 3474941, -1878900, -5997835, -3291789, -2467057, 5114468, -1768358, 3149007, 2321471, 1751217, 4174328, -2110910, 450047, 1786012, -1473139, -1727981, 2320336, 3644328]
972C644328q49748J828458e064051i9890A3305i24819B010245O08576a518177
962i12379A288164d149985A078797C11349c580505A767224o36892O957757e460978
952d46569A082026k01126D31823g8426o395685D094894G0200N975657c669051
942d42627l114q7726l000709J401660H93816L182476d499630K120925F69409j12894
932E56515O75777p9174e79457q70935p49334C850369A430493b395269B114233
922H74599J65232L47271b332974B527792a977680A584896b652385Q24310H8604
912c313379j08361j947062B8444a315597a17798A943619o91988P7696F29155J030497
902A659652K427652c179235h67254C021524a182165j770550B316768O47273C27933
$$ y = [3644328, 2794580, 4623038, -5064051, -99890, 13305, -924819, 2010245, 2618821, -1518177, -912379, 1288164, -4149985, 1078797, 311349, -3580505, 1767224, 1130332, 8088089, -5460978, -446569, 1082026, 880900, 431823, -78426, -6474111, 4094894, 70200, 6045857, -3669051, -442627, -445741, -533467, -3534176, -2132516, 893816, 4076292, -4499630, -2378705, 669409, 556515, 1232292, 1153118, -579457, -1450392, -2199726, 3850369, 1430493, -2395269, 2114233, 874599, 1039831, 1387102, -2332974, 2527792, -1977680, 1584896, -2652385, -1828075, 88604, -3313379, -3421740, -5368802, 28444, -1315597, -117798, 1943619, 1251631, 1329327, 629155, 1659652, 4087304, -3179235, -867254, 3021524, -1182165, -2952715, 2316768, 2964041, 327933]
892c744543A867972n24887J396784b115893A723310b988249J183321C563487a392483
882I76940a547428C18886J842655c386860H27e60871q61892F34407K844742P82441
872D261590f18219C702175D76308J219547b746563c41871k65996k406837B847211
862c19175j14408C108767b028865B976326i15670P6A987492E29401d320188o28097
852d948285C418102A619039g51333l022619R23974J371947F667670b271892F93618
842c220365A025084b544091N64402D426646f34495B702873L41974d090885a416663
832a56740B143820c090086g96762j929357H55601K492421a344151j643315n12942
823c500408B133376g141617H11458o6874k43949M104582d011742G23467a712499
$$ y = [-3744543, 1867972, 1343085, 2739869, -2115893, 1723310, -2988249, -1804928, 3563487, -1392483, 976940, -1547428, 318886, 2161541, -3386860, 827, -560871, -1422763, 634407, 3479149, 4261590, -618219, 3702175, 476308, 1695855, -2746563, -341871, -607867, -3014704, 2847211, -319175, -433583, 3108767, -2028865, 2976326, -915670, -915594, 1987492, 529401, -4320188, -4948285, 3418102, 1619039, -751333, -3773952, -2849978, -1478031, 6667670, -2271892, 693618, -3220365, 1025084, -2544091, -1979689, 4426646, -634495, 2702873, 3044847, -4090885, -1416663, -156740, 2143820, -3090086, -796762, -2726119, 855601, 3348022, -1344151, -2987466, -3500408, 2133376, -7141617, 811458, 744584, 500635, 4605217, -4011742, 723467, -1712499]
813d360773A211223a594092A83704d430575A190010b372955A745174N944335a024651
803h727175C032958d229515D89963c916578E248176a529300D1180Q508q226K75790
793C17252c559999F43353L428167e589253E212513e50951B467640A91302M086381
784D277683E2461f92693I58171i0032D412518c584710D168115A678872b508048
774E6594P97336K48225a838022P97338A33074J948756b492788B205046a606186
764c61417B705772L95364a280572a90843D168941j818155g377308C215438q05872
755B409566O84026a937261j420053F621084f636097e10823j933326E754106c760937
745c754327F595176a41259F948532b331452G2150R69509d539743A350723K289274
$$ y = [-4360773, 1211223, -1594092, 183704, -4430575, 1190010, -2372955, 1745174, 7689509, -1024651, -8727175, 3032958, -4229515, 489963, -3916578, 5248176, -1529300, 41180, 49688, 41462, 317252, -3559999, 643353, 4071520, -5589253, 5212513, -550951, 2467640, 191302, 4277683, 52461, -692693, 958171, -90032, 4412518, -3584710, 4168115, 1678872, -2508048, 56594, 853930, 1102155, -1838022, -1040684, 133074, 2081830, -2492788, 2205046, -1606186, -361417, 2705772, 3101136, -1280572, -190843, 4168941, 2350786, -7377308, 3215438, 2409566, 3093592, -1937261, -3357314, 6621084, -6636097, -510823, -2444149, 5754106, -3760937, -3754327, 6595176, -141259, 6948532, -2331452, 72150, 1041659, -4539743, 1350723, 3639997]
736C639997l55506A448242a275801A59598L512222A36138O85531A90379J959103
727B149482c63623m62573G046668e036314c12207k480277c12071C413376L235114
718F648490O265387F314656b0734300k775902P408255j8881099a2026636D0811142
709B3461344p561806J0106558o984400r007677b1485754q838639j272464k8192005
701e9788862R692617B9388984o749407o094824L5568998A5817692g554867b623918
692a783706r47546j229539A179415d376329C965431c612911A449350m05992a87845
682a105418C25023M623203b097864m9937j598366H205020J0750996K3417110D15568
672b766910k9467431J2837921O708812l4176956a2153084K297375B6181830J8194240
$$ y = [3639997, 3284491, 1448242, -1275801, 159598, 3671820, 136138, 821669, 190379, 2149482, -363623, -826196, 7046668, -5036314, -312207, -2792484, -312071, 3413376, 6648490, 12913877, 6314656, -20734300, -23510202, -16101947, -34983046, -12026636, 40811142, 23461344, 15899538, 26006096, 19021696, 10014019, -21485754, -30324393, -31596857, -59788862, -50096245, 29388984, 22639577, 16544753, 52113751, 15817692, -7554867, -2623918, -1783706, -2731252, -3960791, 1179415, -4376329, 3965431, -3612911, 1449350, 1043358, -187845, -1105418, 325023, 4948226, -2097864, -2147801, -3746167, 8205020, 18956016, 42373126, 415568, -2766910, -32234341, -19396420, -12687608, -46864564, -12153084, -9855709, 26181830, 44376070]
664D4376070r853561G571379j178521a7935374c793294a892231k5015021J3448881
656a3458371j311811C641833J1646826C793864A847725d41290H215876d563915
647B278198G56723K981162J804822a644873N11650B940454e91894C460823a129153
637G870305C513246A407026a341301l86700B338144H46747K881135o05064c69246
627B273379Q179000l583271R189977K5598485O8720174J48527189c24091452M2306096
619b81785356J2781203B32348469D2775913j6965823A2631915l469781P43765
612I905899D622598A437558a351782E138586j548783b784240C163928i78135C95425
602C69307i75314C747363a449066B558385a052545k160148a534056A937953k88025
$$ y = [44376070, 34522509, 7571379, 6392858, -17935374, -3793294, -1892231, -26907252, -13458371, -14770182, 3641833, 15288659, 3793864, 1847725, -441290, 8215876, -4563915, 2278198, 756723, 3737885, 5542707, -1644873, -1133223, 2940454, -591894, 3460823, -1129153, 7870305, 3513246, 1407026, -1341301, -1728001, 2338144, 846747, 3727882, 3122818, -369246, 2273379, 10452379, 6869108, 16059085, 41657570, 110377744, 258904933, -324091452, -281785356, -269004153, 232348469, 42775913, 25810090, 12631915, 9162134, 9905899, 4622598, 1437558, -1351782, 5138586, 3589803, -2784240, 3163928, -978135, 395425, 369307, -975314, 3747363, -1449066, 2558385, -1052545, -3212693, -1534056, 1937953, 1649928]
593A649928a875945j169908C180900C57569b946680A978760a422774j245045E419269
583a824898H45035P0779d51571B472820j28030e23536D374978d621324J511915
574c109409i46934o13122j11559C455528E53021e705770b268537D050346j065476
565B984870d591019E215062B142400f530296B9352L05555c051201O70405J176046
556a204750B246172N70960e680627g76509E09431a396162k40661B43026L90421
547F33447E5329M136214c21788A535265G18123a660003E220638e799013g36475
537C302200J96763d898362J29029b25140D07569n4650b804352A316961J289895
528B606856j070499o73311R83666H05989c621017A056850e98974A71451b045407
$$ y = [1649928, -1875945, -3045853, 3180900, 357569, -2946680, 1978760, -1422774, -2667819, 5419269, -1824898, 845035, 915814, -451571, 2472820, 2344790, -523536, 4374978, -4621324, -3109409, -946934, -1560056, -1671615, 3455528, 553021, -5705770, -2268537, 4050346, 2984870, -4591019, 5215062, 2142400, -6530296, 29352, 334907, -3051201, -2380796, -1204750, 2246172, 2817132, -5680627, -776509, 509431, -1396162, -1636823, 243026, 633447, 55329, 4191543, -321788, 1535265, 718123, -1660003, 5220638, -5799013, -736475, 3302200, 3498963, -4898362, -4769333, -225140, 407569, 352919, -2804352, 1316961, 2606856, 1536357, 863046, 1846712, 805989, -3621017, 1056850, -598974, 171451, -2045407]
518c101501D590798a986740B361244c373192B233720I65415e699556C800789B50738
508a586178f97356m10511B05330b72959E493613b054369I2380M76945i74572A535034
497a743295c82744l885634C442866j708845a935729C633626d452429B988103j481939
488A506164d136444G60871J349973h7720A897856e76132o214911A236400c580946
478C178138A419348E0247J763376a264763M17010L10111n062394D521003b409327
468b770863B009830M130279a215539B748632b134602D210319A84294J107620c322562
458a018045A720447c114304m6533D992786f29719j214889C332814a085740l000170
449d085910a253754k767122A497154k88007c2130l08549L3031A643434g062702
$$ y = [-3101501, 4590798, -1986740, 2361244, -3373192, 2233720, 965415, -5699556, 3800789, 250738, -1586178, -697356, -1107867, 205330, -272959, 5493613, -2054369, 92380, 569325, -974572, 1535034, -1743295, -382744, -4268378, 3442866, 1734021, -1935729, 3633626, -4452429, 2988103, 1506164, -4136444, 760871, 2110844, -87720, 1897856, -576132, -6791043, 1236400, -3580946, 3178138, 1419348, 50247, 1813623, -1264763, -847753, -537642, -5600036, 4521003, -2409327, -2770863, 2009830, 6140109, -1215539, 2748632, -2134602, 4210319, 184294, 1291914, -3322562, -1018045, 1720447, -3114304, -3160837, 4992786, -629719, -1844608, 3332814, -1085740, -4085910, -1253754, -4020876, 1497154, 1209147, -32130, -340679, -307648, 1643434, -7062702]
439E090989j492466E55773k29786e51338l784565A044457i72690j905043J031180
430a846553l33226C547021A058288a080817C107711J431110j417645d644600G115761
420b450536k385362j62648A399049P6633n02978a56853k36150F45372i43185j783777
410b726962I0776K756463a59115A260072e627820B814407e267341C308540a30857
400a226776k428950Q43656a196820j34049l117377D090065a997533C278281A023416
390A385322b176325B64214c435586N84096n04137C44317J802046g25845A503178
380a329050K36144G65952a325900j236032B026862C71270b605545C873b602155
370b59924k575218a033237n34074P73710A460878n14984J696574e76318K57651
$$ y = [5090989, 3598523, 555773, 325987, -551338, -4335903, 1044457, -972690, -2877733, -1846553, -2179779, 3547021, 1058288, -1080817, 3107711, 4538821, 3121176, -4644600, 7115761, -2450536, -4835898, -4998546, 1399049, 1475682, 972704, -156853, -393003, 645372, -943185, -2726962, 90776, 2847239, -159115, 1260072, -5627820, 2814407, -5267341, 3308540, -130857, -1226776, -3655726, -2812070, -1196820, -1330869, -4448246, 4090065, -1997533, 3278281, 1023416, 1385322, -2176325, 264214, -3435586, -2851490, -3355627, 344317, 2146363, -725845, 1503178, -1329050, -1092906, 765952, -1325900, -2561932, 2026862, 371270, -2605545, 3873, -2602155, -259924, -2835142, -1033237, -1567311, -793601, 1460878, 945894, 2642468, -576318, -318667]
361c18667G30741c584552J726211j84359P29544L27396n674806D477487I10236
351C74544J490996a255863c47257q32370b82153l822937D533020i40386C117078
341b188450D77641P02629b396292B671665m11781b916593h25816j314287F424078
331c68801k371170N68224e52907E53675K091756C87057a074734B51179K103674
322B354853d605696B375004i51396B059245a931110H89827J348745c35723B596600
312a345163n091252C404230a502495g45642A798591a76440q65239p49157Q72869
303i17967D176618a662034l981716C871226c002868F053375C61693J5711K486324
294B863728b802781A186713c744091C912769a699266N47191k14067A280351d58454
$$ y = [-318667, 730741, -3584552, -1858341, -2042700, -1313156, -985760, -6660566, 4477487, 910236, 374544, 1865540, -1255863, -347257, -1179627, -282153, -4105090, 4533020, -940386, 3117078, -2188450, 477641, 1180270, -2396292, 2671665, 2259884, -2916593, -825816, -2140103, 6424078, -368801, -2739971, -2171747, -552907, 553675, 2645431, 387057, -1074734, 251179, 2354853, -4605696, 2375004, -951396, 2059245, -1931110, 889827, 2238572, -335723, 2596600, -1345163, -6436415, 3404230, -1502495, -745642, 1798591, -176440, -1041679, -1790836, -917967, 4176618, -1662034, -5643750, 3871226, -3002868, 6053375, 361693, 377404, 2863728, -2802781, 1186713, -3744091, 3912769, -1699266, -1152075, -1366142, 1280351, -458454]
284c024114A669277i05977C286675a401585I44235b776775d57912j172151f03111
274E169001d206650a116937A29624a04618C97832a263485l197836J603964h55522
264b952213A980017g00301B260454h10466m95642j844359E918596g93159B458634
254a289072D811195A837130h88853A816043g5538l218069A501043F94065J001761
245A695826b610362A3998L415608c529934L34209F5605a122622m22201B416038
235B277461f875739E261934c416764J61164D598991a831069C52622M157433h98144
225a13981I08972j55554N04909K899187d102867A495415a346370l599448a15045
215F62233c321720m10731i57023j048830h28187D78691M742385N28155A961966
$$ y = [-3024114, 1669277, -905977, 3286675, -1401585, 944235, -2776775, -457912, -1630063, -603111, 5169001, -4206650, -1116937, 129624, -104618, 397832, -1263485, -4461321, -2857357, -855522, -2952213, 1980017, -700301, 2260454, -810466, -1306108, -3150467, 5918596, -793159, 2458634, -1289072, 4811195, 1837130, -888853, 1816043, -75538, -3293607, 1501043, 694065, 1695826, -2610362, 13998, 3429606, -3529934, -3195725, 65605, -1122622, -1544823, 2416038, 2277461, -6875739, 5261934, -3416764, -3255600, 4598991, -1831069, 352622, 4510055, -898144, -113981, 908972, 753418, 1258327, 4157514, -4102867, 1495415, -1346370, -4945818, -115045, 662233, -3321720, -3732451, -957023, -2005853, -828187, 478691, 5221076, 5749231, 1961966]
205d234416F81540f51649D245637e132709a555677E247236b136293j95760B436381
195a026007C647092J2155887K472041i7564780j45202667d6349820h363438B09155139
186A04556914J55083335E3745373A9426486b43508368c0664635f358200o91904
179g050104J985105K345885A339057O15964c244588B088117b128225k000885e93161
169D977771b228786d69499A366829P20847j010261K192172b81247o143479D184966
159C146086A043671K145573b185669b74010C994060c774313D2075Q06934b298051
149A260661M502778h46744I58861e616325B610176f96549k056527A604430e647697
139A84102G8767j9281Q54624c412849P48641C95138b13761G41449b245968c06506
$$ y = [-4234416, 681540, -651649, 4245637, -5132709, -1555677, 5247236, -2136293, -2332053, 2436381, -1026007, 3647092, 15802979, 18275020, -97564780, -242767447, -46349820, -8363438, 209155139, 104556914, 259640249, 53745373, 19426486, -243508368, -30664635, -6358200, -7050104, -5064999, -2719114, 1339057, 1955021, -3244588, 2088117, -2128225, -4129110, -593161, 4977771, -2228786, -469499, 1366829, 2087676, 1077415, 3269587, -281247, -6424726, 4184966, 3146086, 1043671, 3189244, -2185669, -274010, 3994060, -3774313, 42075, 849009, -2298051, 1260661, 5763439, -846744, 958861, -5616325, 2610176, -696549, -2753076, 1604430, -5647697, 184102, 78767, 59486, 914110, -3412849, -2664208, 395138, -213761, 741449, -2245968, -306506]
128a172284B666882h78401n237878B145693a443097n98000B742102N21585f296928
118C46714J471606b162239Q64513A594520L85250a528841B542253c159841D827271
108i14838A40891b707800d31144j028311B169096c639656A951971L077831d290076
98A834922e449150A2547a260879L35288D276563A580581J838032a67989o642772
89f810761A292400L25651O64654m9920N27361P038c833860i54555l47313F38669
78C0491M044919C28035b085932A515389F36129J355572d356717B720403J092961
69C813364j580154A26790i70264d46146H09278c058769D046609c786306O81242
60c105064h35117A911980b485089R27981E04233K626574k99072r42849a519579
$$ y = [-1172284, 2666882, -878401, -6116279, 2145693, -1443097, -2041097, 2742102, 3263687, -6296928, 346714, 1818320, -2162239, -1297726, 1594520, 1979770, -1528841, 2542253, -3159841, 4827271, -914838, 140891, -2707800, -431144, -1459455, 2169096, -3639656, 1951971, 5029802, -4290076, 1834922, -5449150, 12547, -1260879, -925591, 4276563, 1580581, 3418613, -167989, -6810761, 1292400, 1618051, 2282705, 2232785, 2760146, 2767184, -3833860, -954555, -1301868, 638669, 30491, 4075410, 328035, -2085932, 1515389, 636129, 1991701, -4356717, 2720403, 3813364, 2233210, 126790, -970264, -446146, 809278, -3058769, 4046609, -3786306, -3105064, -835117, 1911980, -2485089, -1557108, 504233, 3130807, 2831735, 1888886, -1519579]
50G38764h65404a1F347870d844650D720003A317094h99377I7373R56634a102107
39A402261J63181i71262D38222b697390E964223g407143A402946h23839k619918
30c443757A09239J470778L243052d172140A847305a253828C251954b779692C108653
20d037775D25218K104125h55879q14442A496604F24542b190380n92942D534608
10A324602b764422E30545b899963B763780a508931C35054a093909j854711N02461
1b446159J009035
0a437124
$$ y = [738764, -865404, -11, 6347870, -4844650, 4720003, 1317094, -899377, 97373, 1054007, -1102107, 1402261, 1565442, -971262, 438222, -2697390, 5964223, -7407143, 1402946, -823839, -3443757, 109239, 1580017, 4823069, -4172140, 1847305, -1253828, 3251954, -2779692, 3108653, -4037775, 425218, 2529343, -855879, -1670321, 1496604, 624542, -2190380, -2783322, 4534608, 1324602, -2764422, 530545, -2899963, 2763780, -1508931, 335054, -1093909, -2948620, -2446159, -1437124]
##PAGE= F1=5662.376869535
##FIRST=     21204.543296753, 2686.85945900537, -468569
##DATA TABLE= (F2++(Y..Y)), PROFILE
2047d68569C061573a488722A991498b060905J10489Q48801A747062k01459b690859
2037A915910g74963G5606J568532a032078A105448L28360P19160r12273a434789
2027C859064a161632e51948A571477J9768b376619c55923n21016m655242a635399
2017E212524k149742n84275B39609a6396j701141B7523a179165p5921B924406
2007d394050B689188H95422b576660M63258D946509c2834m7877H64123a368770
1997A432617e477521C909342a965645E74093a855215n356097b37666l89907B774513
1987G88534c126036h18232M4872C103834h16901D958177J832624a528492r35204
1978b463696D825051b041974P13791B64338K576956e74678J56202A008388D81765
$$ y = [-468569, 3061573, -1488722, 1991498, -2060905, -1950416, -1101615, 1747062, 1545603, -2690859, 1915910, -774963, 75606, 1644138, -1032078, 1105448, 1433808, 2152968, 1240695, -1434789, 3859064, -1161632, -551948, 1571477, 1591245, -2376619, -355923, -876939, -5532181, -1635399, 5212524, 3062782, 2478507, 239609, -16396, -1717537, 27523, -1179165, -1255086, 2924406, -4394050, 2689188, 895422, -2576660, -2113402, 4946509, -32834, -80711, 864123, -1368770, 1432617, -5477521, 3909342, -1965645, 574093, -1855215, -7211312, -237666, -627573, 2774513, 788534, -3126036, -818232, -773360, 3103834, -816901, 4958177, 6790801, -1528492, -2463696, 4825051, -2041974, -1328183, 264338, 2841294, -574678, -418476, 1008388, 481765]
1968b550345D432145a330999C252937a8740j942510j673584J097761g15894C674193
1958D96287B37601k9892M58199K411631b686976o61219J118134b96657I4609N378390
1948E472999A385521b635708G23569a169386e71102B956218j358154J491771e350394
1938b508709B412913J504842e071616C97590c765141B956449j43605b474474a66387
1928b775763J099481L93750G116528a06037o14110n75284C33851J468838a724763
1918D62238M81253a086675H2364a698333O20358H7848K340335b231624j776936
1909d008560M84110A727395b769334B884634c021473f32956I04382N690577l057720
1900C537239g346824F225607h155740C503886b398879i83858j720963B809951
$$ y = [-2550345, 4432145, -1330999, 3252937, -18740, -1961250, -3634834, -2537073, -715894, 3674193, 496287, 237601, 207709, 665908, 3077539, -2686976, -3348195, -2230061, -296657, 94609, 5472999, 1385521, -2635708, 723569, -1169386, -571102, 2956218, 1598064, 3089835, -5350394, -2508709, 2412913, 3917755, -5071616, 397590, -3765141, 2956449, 2812844, -2474474, -166387, -2775763, -1676282, -1282532, 7116528, -106037, -720147, -1295431, 333851, 1802689, -1724763, 462238, 943491, -1086675, 82364, -1698333, -1077975, 87848, 2428183, -2231624, -4008560, -3524450, 1727395, -2769334, 2884634, -3021473, -632956, 904382, 6594959, 3537239, -7346824, 6225607, -8155740, 3503886, -2398879, -983858, -2704821, 2809951]
1891e555932F31085J307452a713541r7662j279586F46158c569340E14823a282104
1881c918598C900742g03594j20980j416698B470930C18006a431717G057632A667861
1871A03041g370268C832413F57079d220611J779411q98364A820635N51535d403074
1861C190104O49347g57923l910548C516752c374521B20700a939052h5034B820608
1851a105140n78101B690111A306487c597347P9747C02581h67832C741715a947744
1841d811826a632263B746210i78852F42325R62534b544898K21490d1449l380766
1832c422215C740867A649528b436283B977982d099503A448196J069283B12031
1823D798018a489621F22868d7736A448726M29582B49882h27786n14515k208097
$$ y = [-5555932, 631085, 1938537, -1713541, -1811203, -3090789, 646158, -3569340, 514823, -1282104, -3918598, 3900742, -703594, -824574, -2241272, 2470930, 318006, -1431717, 7057632, 1667861, 103041, -7370268, 3832413, 657079, -4220611, -2441200, -3339564, 1820635, 2372170, -4403074, 3190104, 3839451, -757923, -4668471, 3516752, -3374521, 220700, -1939052, -85034, 2820608, -1105140, -1683241, 2690111, 1306487, -3597347, -3517600, 302581, -867832, 3741715, -1947744, -4811826, -1632263, 2746210, -978852, 642325, 1604859, -2544898, -2323408, -41449, -3422215, 3740867, 1649528, -2436283, 2977982, -4099503, 1448196, 2517479, 212031, 4798018, -1489621, 622868, -47736, 1448726, 1878308, 249882, -827786, -1342301, -3550398]
1814c550398C980583L54610b500087f36158B065804e263319E038801j962450B75301
1804f087957a753756C03362d84160C146468c451999A979875q68325a086083r9783
1795a185866k044015I91555J99222b864370C027857c793501J589168C386849l08926
1786C077923h729027C856914A259150B2185a390817A455332J752746c573565A57084
1776B855274b010851h45984j791642j893985J6068N26466E761853e036720A263003
1766A903045q91804K469708B61321J906395h28768B029922b227904c69351m08853
1757g78204E06845e401609I981400a740509h1417p48032a77553n89970k780531
1748c548054Q56344b81706j433212A42400e220314A21183J428110L616946a331376
$$ y = [-3550398, 3980583, 4335193, -2500087, -636158, 2065804, -5263319, 5038801, 3076351, 275301, -6087957, -1753756, 303362, -484160, 3146468, -3451999, 1979875, 1111550, -1086083, -1185866, -3229881, 991555, 1190777, -2864370, 3027857, -3793501, -2204333, 3386849, 3077923, -8729027, 3856914, 1259150, 22185, -1390817, 1455332, 3208078, -3573565, 157084, 2855274, -2010851, -845984, -2637626, -4531611, -4515543, -3989077, 5761853, -5036720, 1263003, 1903045, 1011241, 3480949, 261321, 2167716, -828768, 2029922, -2227904, -369351, -778204, 506845, -5401609, 9981400, -1740509, -81417, -829449, -177553, -767523, -3548054, -2691710, -281706, -1714918, 142400, -5220314, 121183, 1549293, 5166239, -1331376]
1738b840932F26242c562754n85156A519332R5042B10000c272525d50384o38606
1729a088990C310798a391631A819947i27554n260573B035325b441620M40338Q97105
1720a104177C809935G47560L27136N01475c003005B810316A171599m28498a232721
1710b906103A889616F82129b260090C487935c21510D630799E09223J754913b615342
1700A163177d940308b316568C763530f28366C565239g865795b285115C044387
1691A216938c320197C287040f12043A962449i58863C357156h84978j978270D344655
1681a679033L30651E613313b922407B11176a567870B962137b002982L84127E067127
1671c955104I96453R78523a52662r13973o67731A884434a221706C150686b745331
$$ y = [-2840932, 626242, -3562754, -4147910, 1519332, 1614374, 210000, -3272525, -450384, -1088990, 3310798, -1391631, 1819947, -927554, -6188127, 2035325, -2441620, -2001282, -1104177, 3809935, 747560, 1074696, 1576171, -3003005, 2810316, 1171599, 743101, -1232721, -2906103, 1889616, 682129, -2260090, 3487935, -321510, 4630799, 509223, 2264136, -2615342, 1163177, -4940308, -2316568, 3763530, -628366, 3565239, -7865795, -2285115, 3044387, 1216938, -3320197, 3287040, -612043, 1962449, -958863, 3357156, -884978, -2863248, 4344655, -1679033, -1348382, 5613313, -2922407, 211176, -1567870, 2962137, -2002982, -1618855, 5067127, -3955104, 996453, 1974976, -152662, -1066635, -1734366, 1884434, -1221706, 3150686, -2745331]
1661C17188J98282m797k04481d867812I388792D73442J497882n43921c100905
1651B650525b322795b7407C959292j122708j201627d137516a504741A303345d85788
1641h76417D438474h84758A109122J126272M69696b293868d66974h1140C519662
1631F94233J748404b911658B076394F6076c92353j229330p13483h4082A34206
1621b746308H739821a957F90589d139900E43725M33085M7330a223391A433595
1611A652842a278146P3795R6068n900299i64276E786266a653141A851901B89236
1601h93363F867482B113654a36234j251220B361174G88019j64025a370230C53898
1591a404018l892813C995856A301532N583967d983294d03623m086312B240373
$$ y = [317188, 515470, 510673, 306192, -4867812, 9388792, 473442, 1971324, 1427403, -3100905, 2650525, -2322795, -27407, 3959292, 2836584, 1634957, -4137516, -1504741, 1303345, -485788, -876417, 4438474, -884758, 1109122, 2235394, 2705090, -2293868, -466974, -81140, 3519662, 694233, 2442637, -2911658, 2076394, 66076, -392353, -1621683, -2335166, -84082, 134206, -2746308, 8739821, -1957, 690589, -4139900, 543725, 976810, 1024140, -1223391, 1433595, 1652842, -1278146, -1204351, -1108283, -7008582, -964276, 5786266, -1653141, 1851901, 289236, -893363, 6867482, 2113654, -136234, -1387454, 2361174, 788019, 623994, -1370230, 353898, -1404018, -5296831, 3995856, 1301532, 6885499, -4983294, -403623, -4489935, 2240373]
1582B73778h77561E943443A519360a799191A119612B75812d27785m073938B408821
1572B231505q08664a11916j309594j597367A286972O7619R62453a822864j057159
1563b880023A65311c465024B918410b056347G9035L669805j369808J036951b6471
1553i86525D194831B03037a881374L6954f16931B253206H620O45165k97911O69467
1543A025341B14520J307279r7890J383264F07481B48013d95178A123382J115181
1534B238563b910249o15712e25371F394849H46935a0315A378748R68041g79660
1524a981954B51889P27742J099110C00180Q64298J519746f65545a11958C784626
1514h778564B707621J696433A465917a255034C32021J50395R15357g675456D506153
$$ y = [273778, -877561, 5943443, 1519360, -1799191, 1119612, 275812, -427785, -4501723, 2408821, 2231505, 1422841, -111916, -1421510, -3018877, 1286972, 1354591, 2317044, -1822864, -2880023, 165311, -3465024, 2918410, -2056347, 79035, 3748840, 2379032, 3415983, -26471, -986525, 4194831, 203037, -1881374, -1844420, -616931, 2253206, 8620, 653785, 355874, 1025341, 214520, 1521799, 1423909, 2807173, 607481, 248013, -495178, 1123382, 2238563, -2910249, -3525961, -525371, 6394849, 846935, -10315, 1378748, 2346789, -779660, -1981954, 251889, 979631, 2078741, 300180, 1164478, 2684224, -665545, -111958, 3784626, -8778564, 2707621, 4404054, 1465917, -1255034, 332021, 482416, 1397773, -7675456, 4506153]
1504d06355o23436A830240K428216g605845D387572g3288D575408d681842B165765
1494d6740q65296A350282n95746L458782j462602p62806g616949F44811J273338
1485A918149e155615K035318A108216r9567M000903d830224J554365G63189M807538
1476E570727b300168J116128M21373K43151E155597B030472b475317P51218B015780
1466a690572k781665a409008D117455I13048a060658A141371h98459l389285C86858
1456d477402C223695N81414f965264A195628D85081b89854l117440J630886D79456
1446b845553A869825f788320b20241G85314c15522D209450I29077a451183B293158
1436c781445B121619L211344b413027A37750J219898K789456D9332N53299i61380
$$ y = [-406355, -1029791, 1830240, 4258456, -7605845, 4387572, -73288, 4575408, -4681842, 2165765, -46740, -912036, 1350282, 754536, 4213318, 2750716, 1987910, -7616949, 644811, 1918149, -5155615, -3120297, 1108216, 1008649, 5009552, -4830224, -3275859, 763189, 5570727, -2300168, -1184040, -762667, -519516, 5155597, 2030472, -2475317, -1724099, 2015780, -1690572, -4472237, -1409008, 4117455, 913048, -1060658, 1141371, -898459, -4287744, 386858, -4477402, 3223695, 3805109, -6965264, 1195628, 485081, -289854, -3407294, -1776408, 479456, -2845553, 1869825, -6788320, -220241, 785314, -315522, 4209450, 929077, -1451183, 2293158, -3781445, 2121619, 5332963, -2413027, 137750, 1357648, 4147104, 49332, 602631, -961380]
1426b63599j495741F7343Q23005m42553L52710e80758k920838B253043G65341
1416a332504D9340b537087A156959i08759j943640C022651a710552B402980b631456
1406B569005f79128B094757g50976B292019b108229j032925H468193I2148c919447
1396d388626B325764p29797F82746J036460a63753j181712A023629M84515b080161
1386B27129M99921C59354h30274D69469J971403M65566A405604m98912a999036
1376A56338K376236b151810f25756B771372b253315C284545c536681R31823A266504
1366d323894D477855a307186M2290A671100a692698P98899B430198k60915P35414
1357B904697A079129a386449l98650a48475j829818k636609D892870k319132C97152
$$ y = [-263599, -1759340, 67343, 890348, 447795, 800505, -580758, -3501596, 2253043, 765341, -1332504, 49340, -2537087, 1156959, -908759, -2852399, 3022651, -1710552, 2402980, -2631456, 2569005, -679128, 2094757, -750976, 2292019, -2108229, -3141154, 8468193, 92148, -3919447, -4388626, 2325764, 1595967, 682746, 1719206, -163753, -1345465, 1023629, 1508144, -2080161, 227129, 727050, 359354, -830274, 469469, 2440872, 2906438, 1405604, 906692, -1999036, 156338, 2532574, -2151810, -625756, 2771372, -2253315, 3284545, -3536681, -2604858, 1266504, -4323894, 4477855, -1307186, -1264896, 1671100, -1692698, -893799, 2430198, 2169283, 2904697, 1079129, -1386449, -1785099, -148475, -1978293, -4614902, 4892870, 2573738, 397152]
1347b935962B456195b531788J089743j448458p0972a70449B562313f140916A05979
1337E69571j83007K024855j106140R1693b403969J061949E58462O76998d944603
1327A569280d705089A063396b032937l93732C16093r3145M11001b263023H94814
1317b374255J86938Q58210k087586F241222d14101A512567M8291a206397o010652
1308g217049A142244N15865d701527a560251B918033K561716A031801a639836
1299b093046A9528N774231e874981a628964J72248C967575b210262C653654d23386
1289a339219N16154k904482C069538j507016F55625L97909f215550A343172m67108
1280H76064c374593J348428A853753J536442i25159B204603d341897C443373p81991
$$ y = [-2935962, 2456195, -2531788, -1442045, -2890503, -2961475, -170449, 2562313, -6140916, 105979, 569571, 386564, 2411419, 1305279, 1396972, -2403969, -1342020, 558462, 1235460, -4944603, 1569280, -4705089, 1063396, -2032937, -2426669, 316093, 222948, 633949, -2263023, 894814, -2374255, -2187317, -1329107, -3416693, 6241222, -414101, 1512567, 1560858, -1206397, -7217049, 1142244, 1658109, -4701527, -1560251, 2918033, 5479749, 1031801, -1639836, -2093046, 19528, 5793759, -5874981, -1628964, -1456716, 3967575, -2210262, 3653654, -423386, -1339219, -823065, -3727547, 3069538, 1562522, 655625, 1053534, -6215550, 1343172, 876064, -3374593, -2026165, 1853753, 3390195, -925159, 2204603, -4341897, 3443373, 2661382]
1271B661382C42988K028261C59856K748329c200227C780839E2396b383179A458332
1261e62691j167672b9143C628019j006207a82704j257426B61106Q01223m83547
1252E78782h21563l11955E32096b557367r28127D928584d8278k875846C196966
1242d195278K080529p25730A283240R5457J371560j319120b123157F55076Q30709
1233A485785a357324D08155d254409B45445b25159m545647I85250h03784E29887
1223h5657r25828k07554B421279K779405a735883j897055a504263k326225a019930
1213d931070B256984e39102I40678K99059m0739l92523b334816B06311K846027
1204C052338a836660l8986J28008C043755e755057b630168k11894C954204b30914
$$ y = [2661382, 342988, 2371249, 359856, 3108185, -3200227, 3780839, 52396, -2383179, 1458332, -562691, -1730363, -29143, 3628019, 2621812, -182704, -1440130, 261106, 1062329, 578782, -821563, -1133518, 532096, -2557367, -3485494, 4928584, -48278, -2924124, 3196966, -4195278, -2114749, -2840479, 1283240, 1378697, 2750257, 1431137, -2123157, 655076, 1485785, -1357324, 408155, -4254409, 245445, -225159, -4770806, 985250, -803784, 529887, -85657, -1011485, -1219039, 2421279, 5200684, -1735883, -3632938, -1504263, -3830488, -1019930, -4931070, 2256984, -539102, 940678, 1239737, 1198998, 806475, -2334816, 206311, 3052338, -1836660, -1875646, -1747638, 3043755, -5755057, -2630168, -2842062, 3954204, -230914]
1194a67748B684191L515992b926732r72208a255538F476149e215106C172342D5836
1184b264007I23438c661251a721091D25699K861670I00079e738443C104016L85950
1175C489966b983822j269121E006366b111505R52054l165688B736521e624706
1166C401624A573717q9514a688428j906505G351885I78573b528375B993686j33794
1157B859892c125934a1076A098513g5285r59263k711521C141116d070039A294327
1147E073064a792613L11827j367692o36842B154764b082778H64700J33823d709119
1137A835750O65983J6071c269230A67497M913854c826539B217071b834128B446845
1127g36353D069511A229319i82581J21459c5327C324802b632352j078648A567732
$$ y = [-167748, 2684191, 6200183, -2926732, -3898940, -1255538, 6476149, -5215106, 3172342, 45836, -2264007, 923438, -3661251, -1721091, 425699, 3287369, 900079, -5738443, 3104016, 3489966, -2983822, -4252943, 5006366, -2111505, -1159451, -4325139, 2736521, -5624706, 3401624, 1573717, 1484203, -1688428, -3594933, 7351885, 978573, -2528375, 2993686, 2859892, -3125934, -11076, 1098513, -75285, -1034548, -3746069, 3141116, -4070039, 1294327, 5073064, -1792613, -1480786, -2848478, -3485320, 2154764, -2082778, 864700, 998523, -4709119, 1835750, 2501733, 2517804, -3269230, 167497, 5081351, -3826539, 2217071, -2834128, 2446845, -736353, 4069511, 1229319, -982581, -861122, -35327, 3324802, -2632352, -3711000, 1567732]
1117H80590J216685a66098B52003d885200A053495g20040k383383G12278M251231
1108D963509A614692c508139A599570b017379h63163B880384c440073D09628M396954
1099D806582f104131B515711f430242D88031K306339a512583C915508d17088B606622
1089B154836K861878c772988D22019M939480D89483e094184B012827d13879o89507
1080a103386B096589N64663a357405A716942M77883I93890m21108K083203c697806
1070d903820b27498k164657N12093j427904a253390N14546A027025C96134N040980
1061E437114a496583j946998C912279b078639C608447c433324N20374A908706
1052d925271J986773C083636a997112A778333h68796E333360H33987i11586j375256
$$ y = [880590, 2097275, -166098, 252003, -4885200, 1053495, -720040, -3103423, 712278, 4963509, 1614692, -3508139, 1599570, -2017379, -863163, 2880384, -3440073, 409628, 4806582, -6104131, 2515711, -6430242, 488031, 2794370, -1512583, 3915508, -417088, 2606622, 2154836, 5016714, -3772988, 422019, 5361499, 489483, -5094184, 2012827, -413879, -1103386, 2096589, 2661252, -1357405, 1716942, 2194825, 993890, 572782, 2655985, -3697806, -4903820, -227498, -2392155, -1880062, -3307966, -1253390, -738844, 1027025, 396134, 5437114, -1496583, -3443581, 3912279, -2078639, 3608447, -3433324, -2912950, 1908706, -4925271, -2938498, 3083636, -1997112, 1778333, -868796, 5333360, 833987, -911586, -2286842]
1043b286842f69155H4372b168168B13661L865465q50251j489711e492411C549908
1033B32975M78282b187072A639656f00077k716678C98145L871303c596148D300331
1023a308618j030998I54704L478827g49931L31455B549077E53895K040500C7776
1013f94081B790392p67334d311407J905380K23500e61297D045770b309760k298034
1004d607794f82700C73235Q80207b58121C408810c787259a263358d77641A543857
994g73415C197860A31923f85045n818514C329941b412721l105349K565878N30111
985b422081E558666a917357B815549j80952o33193L189258b600874H04158P69655
976A573813a151040j691468B911772J109902n37037J521727d544695B19830f8622
$$ y = [-2286842, -669155, 84372, -2168168, 213661, 4079126, 3228875, 1739164, -5492411, 3549908, 232975, 711257, -2187072, 1639656, -600077, -3316755, 398145, 4269448, -3596148, 4300331, -1308618, -2339616, 954704, 4433531, -749931, -418476, 2549077, 553895, 2594395, 37776, -694081, 2790392, 2023058, -4311407, -2406027, -2182527, -561297, 4045770, -2309760, -4607794, -682700, 373235, 1253442, -258121, 3408810, -3787259, -1263358, -477641, 1543857, -773415, 3197860, 131923, -685045, -6503559, 3329941, -2412721, -5518070, -2952192, -2422081, 5558666, -1917357, 2815549, 2634597, 2001404, 5190662, -2600874, 804158, 1573813, -1151040, -2842508, 2911772, 4021674, 3484637, 5006364, -4544695, 219830, -68622]
966a085360B305562N62004a116158k77095A043096d604015G91885a83913k839186
957c023099A758252o84316P507483e686329d59126N3620E51540A75906Q80334
948A056240e586234D020982E56504N745104c349328E2382a075415d74931l439938
939c914869J764562C15364M313619d407760b136261G12489l35421J166511b6496
929g03823k46241k83811B697442j338149b944927A937621n67811l45553D62186
919b469891B433590b281735B526840b891639M61701D57162c217525j23031k702971
910f043527A51206h75118F44312P36727l15272L84994A3275J559639L059031b455469
899h54020C135518a158389j792954A550773J432257A226323d102193A507521k60973
$$ y = [-1085360, 2305562, 2867566, -1116158, -1393253, 1043096, -4604015, 791885, -183913, -3023099, 1758252, 1073936, 8581419, -5686329, -459126, -405506, 551540, 175906, 1056240, -5586234, 4020982, 556504, 6301608, -3349328, 52382, -1075415, -474931, -3914869, -2150307, 315364, 4628983, -4407760, -2136261, 712489, 377068, 1543579, -26496, -703823, -950064, -1233875, 2697442, 1359293, -2944927, 1937621, 1369810, 1024257, 462186, -2469891, 2433590, -2281735, 2526840, -2891639, -2429938, 457162, -3217525, -3340556, -6043527, 151206, -875118, 644312, 1381039, 1065767, 1450761, 13275, 1572914, 4631945, -2455469, -854020, 3135518, -1158389, -2951343, 1550773, 2983030, 1226323, -4102193, 1507521, 1246548]
890A246548J626759b297503A403085c777743a832426C759992a288416A627027
881i22763A77833K413059b807890C10651e32886j527523A043669K808248q18983
872C032934B98730K261204D69893Q83423b337362b50885p75220k269165C241857
862a71569D5634K745737b964961B929296h99492M6231A393359J8248d248813l09922
852d558735C179940j194291g30832l486409J626406J201753F806035b060511A268228
842c772646I53748b846869J364580D523799i35372B876235k46492c486399e25658
832a39361B593017b863802h21850k576999A056793K723726a678949m15569j121173
823c215691B549193g520601G51745J68606b47230D159142d052815F97752a691135
$$ y = [1246548, 2873307, -2297503, 1403085, -3777743, -1832426, 3759992, -1288416, 1627027, -922763, 177833, 2590892, -2807890, 310651, -532886, -2060409, 1043669, 3851917, 3032934, 298730, 2559934, 469893, 1353316, -2337362, -250885, -1026105, -3295270, 3241857, -171569, 45634, 2791371, -2964961, 2929296, -899492, -853261, 1393359, 1411607, -4248813, -4558735, 3179940, 1985649, -730832, -4217241, -2590835, -1389082, 6806035, -2060511, 1268228, -3772646, 953748, -2846869, -1482289, 4523799, -935372, 2876235, 2629743, -3486399, -525658, -139361, 2593017, -2863802, -821850, -3398849, 1056793, 3780519, -1678949, -2094518, -3215691, 2549193, -7520601, 751745, 920351, -247230, 4159142, -4052815, 697752, -1691135]
813d129579A316340a346337e0043l774990F54527b187043A837040O029080a286882
803g938661B797243d544417A016418c650121F292887b063181b52270B51835I7823
793A3192c695849F73375L915610e511335E340625b83261B214035E74284L805431
784D379715B53550Q4293h5175m72874D978046d034907C531621j527383b618361
774A11199N13675K48979a395694K80241A95193K183733b138753A740020a430838
764i25668B630814J098859e15625n97722E339051B027350f993124B544829L39871
755B884700P22657b334917r76302F719599g385394c83014j039859E558371b953967
745d596009F442261A91714P549911a646857d52837A505106d970855A735449K366294
$$ y = [-4129579, 1316340, -1346337, -50043, -3825033, 654527, -2187043, 1837040, 7866120, -1286882, -7938661, 2797243, -4544417, 1016418, -3650121, 6292887, -2063181, -252270, 251835, 97823, 13192, -3695849, 673375, 4588985, -5511335, 5340625, -283261, 2214035, 574284, 4379715, 253550, 337843, -85175, -558049, 4978046, -4034907, 3531621, 2004238, -2618361, 111199, 624874, 873853, -1395694, -1115453, 195193, 2378926, -2138753, 1740020, -1430838, -925668, 2630814, 3729673, -515625, -1113347, 5339051, 2027350, -6993124, 2544829, 2884700, 3607357, -2334917, -3311219, 6719599, -7385394, -383014, -1422873, 5558371, -2953967, -4596009, 6442261, 191714, 7741625, -1646857, -452837, 1505106, -4970855, 1735449, 4101743]
736D101743j595140A039477a345591B1210L732297H6445L95724J35365J173372
727A790906b59727A2291P121280e518211b23146k304278i50350C645115K861013
718F506128O098226o195753b0267077l253421O984457j9284202a0895098C9379405
709B4458426p893398Q301909n303289r292942b0444345j0959939J008353k9349128
701e9745059J0884021B9451715o327238p698825L6546298A7041552h692191b431157
692a799513j521309J048005A155570d921675C430596c449763A723097k69913g30828
682A75371c30126E160866b400182n90593j749556G677200J0979563K2705822A95253
672b814088k8383693J1106270P062858l1806638a2976525N186751B3259195K0995493
$$ y = [4101743, 2506603, 1039477, -1345591, 21210, 3753507, 86445, 482169, 617534, 1790906, -259727, 12291, 7133571, -5518211, -223146, -2527424, -950350, 3645115, 6506128, 12604354, 6408601, -20267077, -23520498, -16536041, -35820243, -10895098, 39379405, 24458426, 16565028, 24866937, 19563648, 10270706, -20444345, -31404284, -30395931, -59745059, -48861038, 29451715, 23124477, 15425652, 51971950, 17041552, -8692191, -2431157, -1799513, -3320822, -2272817, 1155570, -4921675, 3430596, -3449763, 1723097, 1453184, -730828, 175371, -330126, 5160866, -2400182, -2990775, -4740331, 7677200, 18656763, 41362585, 195253, -2814088, -31197781, -20091511, -13028653, -44835291, -12976525, -7789774, 23259195, 44254688]
664D4254688q932700H504602k810259a7755992c587207a591122k6116137a2958632
655a3764753C510126J2052649C852543j915058A64202P465958d404647B160962
646b22791C915241Q08761i47886j54480B853068e01216C388454a076952G451940
636C872961A625953a711834e79283C044564I54198J966398j08639f2714B400271
626I609283k029867Q292754K7477869O6448488J46759639c22997614M5764512
619b77233102J2495904B30539338D2710344j7722228j1982601l782748J046475
612A0269242m457455A594126g14791E030246j767098b240245B232096g90500P6436
603g14064A032556g42467C451344a467176B336226a612461k362412a089160B368999
$$ y = [44254688, 35321988, 8504602, 5694343, -17755992, -3587207, -1591122, -27707259, -12958632, -13764753, 3510126, 15562775, 3852543, 1937485, 164202, 7630160, -4404647, 2160962, -222791, 3915241, 4724002, -947886, -1102366, 2853068, -501216, 3388454, -1076952, 7451940, 3872961, 1625953, -1711834, -579283, 3044564, 954198, 2920596, 2811957, -62714, 2400271, 9609283, 7579416, 15872170, 43350039, 109798527, 256558166, -322997614, -277233102, -264737198, 230539338, 42710344, 24988116, 13005515, 9222767, 10269242, 5811787, 1594126, -714791, 5030246, 3263148, -2240245, 2232096, -790500, -714064, 1032556, -742467, 3451344, -1467176, 2336226, -1612461, -3974873, -1089160, 2368999]
593B400462b072243n45520C892946D61438b727426A686754a393570j635492F179435
583a872628H49449A80801h3770B929358j456251d85463D377995d556958J326093
574c230865i22305l33219K21425B571644I71903d864281K342444C944811r29243
565C015568d282393D403697A848917f097720D1224e27509k526392J014746Q53552
556a185603A523862J190041d353012a018347D83804i78081q95830a11787D70970
546g8994D823406e79835A417721j69382a582495D720211e516166a234518C516406
536C838415e753835R81374c32450k33692E62706b901247A452215J006549j132759
527A326005J07902j40026o11756c597528A289745G4425e3308k765594K25995D616755
$$ y = [2400462, -2072243, -2617763, 3892946, 461438, -2727426, 1686754, -1393570, -3029062, 6179435, -1872628, 849449, 180801, -83770, 2929358, 1473107, -485463, 4377995, -4556958, -3230865, -922305, -1255524, -1034099, 2571644, 971903, -4864281, -2521837, 3944811, 3015568, -4282393, 4403697, 1848917, -6097720, 41224, -527509, -3053901, -2039155, -1185603, 1523862, 2713903, -4353012, -1018347, 483804, -978081, -1873911, -111787, 470970, -78994, 4823406, -579835, 1417721, 1248339, -1582495, 4720211, -5516166, -1234518, 3516406, 3838415, -5753835, -4772461, -332450, -566142, 562706, -2901247, 1452215, 2458764, 1326005, 1433907, 1293881, 682125, -3597528, 1289745, 74425, -53308, -2818902, -2592907, 4616755]
516a390529A987737c330247B538993G32756d881138C090881C34113b142850i32086
506g03796c9582A19804M331255b365727d39208D91904d9566A303520b210660B22319
495d720228C527418j215829a754625C033061d062594B498983r49820d070744A249306
485B673356e09045B186452g66388m887073A703849c259054C178717A132939A35264
475B791285a388052N73146J78450n185312D330923b808300J43786B759767K892321
466E652088a241406B525247a069407D245542B13829R5808c228564g03173A054527
456c217852N28247E274058e68042j920118C740955a241696l049776f53495l055770
447c709265I10090J60787H0779i5579A46090J099296f205274D455757j005487
$$ y = [-1390529, 1987737, -3330247, 2538993, 732756, -4881138, 3090881, 334113, -2142850, -932086, -703796, -39582, 119804, 4451059, -2365727, -439208, 491904, -49566, 1303520, -2210660, 222319, -4720228, 3527418, 2311589, -1754625, 3033061, -4062594, 2498983, 1549163, -4070744, 1249306, 2673356, -509045, 2186452, -766388, -5653461, 1703849, -3259054, 3178717, 1132939, 135264, 2791285, -1388052, -814906, -636456, -5821768, 4330923, -2808300, -2664514, 2759767, 5652088, -1241406, 2525247, -1069407, 4245542, 213829, 309637, -3228564, -703173, 1054527, -3217852, -2689605, 5274058, -568042, -2488160, 3740955, -1241696, -4291472, -653495, -3709265, 910090, 1070877, 80779, -95579, 146090, 1245386, -6205274, 4455757, 3450270]
438C450270C27858b06018M1096m201759A368130g91721j892967Q12300k65374
429b137762D418385F24326b9891B870199K057150j979508d382413H273288b419111
419e196238O72231A406285N07810m05714a6394k87817D73101d50623l200667a79992
408C398463a08836A023846d419488B654367f653703D557797E10305h99948k476133
399c376081J68340a137150r30804k162682D648806b142031C692965A381448j64744
390A216704b522904I0998c734375J354637p65120A196946J72082c56863A479058
380a783445h45659A453614a274605j261790B571703I21965i20548L00939j667923
371b287532e90454k723574J640771o9501Q68085A491646l86246J842210E22275
$$ y = [3450270, 327858, -206018, -164922, -4366681, 1368130, -791721, -2684688, -1872388, -2137762, 4418385, 624326, -29891, 2870199, 4927349, 2947841, -4382413, 8273288, -2419111, -5196238, -4524007, 1406285, 1914095, 1508381, -16394, -304211, 473101, -450623, -3651290, -179992, 3398463, -108836, 1023846, -4419488, 2654367, -6653703, 4557797, 510305, -899948, -3376081, -3207741, -1137150, -2067954, -4230636, 4648806, -2142031, 3692965, 1381448, 1216704, -2522904, 90998, -3734375, -2379738, -3144858, 1196946, 1369028, -356863, 1479058, -1783445, -845659, 1453614, -1274605, -2536395, 2571703, 921965, -920548, -619609, -2287532, -590454, -3314028, -1673257, -1742758, -874673, 1491646, 1105400, 2947610, 522275]
361f97606I11688c623178Q58098J195618M66493N22400n947315D519111I68224
351A20766J495316a029779L40723p53668D21585c340811D685098b230760C175915
341d7711k12310A130845b823906B181502m84473a633582K21303o74195F363154
331i81273j095454q5144d91746F52408J060203o94227d24230d5794B906556c538266
320B039209a39289A904710b644128A278494L05162d74225B920631i64666m205386
311e170052B758847a772608f56023B056838a72216M0334k253803O46405D718260
301b601470k269066C739735b627238E943820h32184I04638K364165b949435D10816
291c377966C884537a177043l59709C80585O36933e11907k550245B488952f27041
$$ y = [-697606, 911688, -3623178, -2765080, -1569462, -1102969, -580569, -6527884, 4519111, 968224, 120766, 1616082, -1029779, -689056, -1442724, 421585, -3340811, 4685098, -2230760, 3175915, -47711, -260021, 1130845, -2823906, 2181502, 1697029, -1633582, -1412279, -2086474, 6363154, -981273, -2076727, -2161871, -491746, 652408, 1712611, 1018384, -424230, -45794, 2906556, -3538266, 2039209, -139289, 1904710, -2644128, 1278494, 1583656, -474225, 2920631, -964666, -5170052, 2758847, -1772608, -656023, 2056838, -172216, -131882, -2385685, -1739280, 4718260, -2601470, -4870536, 3739735, -2627238, 5943820, -832184, 904638, 3268803, -2949435, 410816, -3377966, 3884537, -1177043, -1536752, 380585, 1017518, -511907, -3062152, 2488952, -627041]
281C154285a310955I24177b656004a92938j122621M85057E195248d845337c11303
271d75057q4362B60959a41323m998283a865058h62375j599793A521938i56125
261B032401f82642o45897k141360E519699b67224B539299d43847D924979A742551
251A77492J134433F34712c452350A511228E29173J946136c380218E00598L051931
242C552529c899730a815708c98825o58219o61840B382865J55506g104409E067738
232c409038L95454E132270b493470A170278L885181g86540E26970n3460Q94820
223A368330o49631K761152d309039A798964A40604e534496I9233Q29798c732485
213c902424g28970j419383f09776i5132F973654k004831k232340d278401A03973
$$ y = [3154285, -1310955, 924177, -2656004, -192938, -1315559, -830502, 5195248, -4845337, -311303, -475057, -559419, 260959, -141323, -5139606, -1865058, -862375, -2462168, 1521938, -956125, 2032401, -682642, -1328539, -3469899, 5519699, -267224, 2539299, -443847, 4924979, 1742551, 177492, 1311925, 634712, -3452350, 1511228, 529173, 2475309, -3380218, 500598, 3552529, -3899730, -1815708, -398825, -1057044, -1718884, 2382865, 2538371, -7104409, 5067738, -3409038, -3013584, 5132270, -2493470, 1170278, 5055459, -786540, 526970, 473510, 1368330, 718699, 3479851, -4309039, 1798964, 140604, -5534496, 99233, 929031, -3732485, -3902424, -728970, -2148353, -609776, -95132, 6973654, 4968823, 2736483, -4278401, 103973]
203c32106D359064e347951a069396E223692b012408m38967B536576a212406C644154
193A6543826J21951i7967276j46191425d6149428g527300B12181574A05201906
185B58520346E3441422A9125325b40078781c1811235e966921r73491K243623J393253
177c303536A395820J004556e357516A637689b522658j569441D24479M667337a815518
167g88689A532024J163116I76100K076266H2421e833549C015102P73281A296582
157B759927a563467c41620D220559c835823a27392F79316a354462A755062M649569
148F404631d68096J45767n132513B241122a007798j937719A719955e568399B82114
138A9400Q819N27312d038353a758485E22947c88409C96036a199567c29832a30677
$$ y = [-332106, 4359064, -5347951, -1069396, 5223692, -2012408, -2451375, 2536576, -1212406, 3644154, 16543826, 16665777, -97967276, -244158701, -46149428, -7527300, 212181574, 105201906, 258520346, 53441422, 19125325, -240078781, -31811235, -5966921, -6940412, -4696789, -3303536, 1395820, 2400376, -5357516, 1637689, -2522658, -4092099, 424479, 5091816, -1815518, -788689, 1532024, 2695140, 976100, 3052366, 82421, -5833549, 3015102, 3788383, 1296582, 2759927, -1563467, -341620, 4220559, -3835823, -127392, 679316, -1354462, 1755062, 6404631, -468096, -322329, -5454842, 2241122, -1007798, -2945517, 1719955, -5568399, 282114, 19400, 28219, 555531, -4038353, -1758485, 522947, -388409, 396036, -1199567, -329832, -130677]
127B302590d63024o341915B500044i53971q70777B914833N71973f090786C43082
117A789468b928643J235400A777112K85816a386581B672752b516256E134625h10522
107A16804b668557e04913j058028A995669c174640A752661L578527d254845A904364
97e744482a48101k003748a81735D963357A773937J528770D1496g389446H01216
87A850844J786343A746317J978127o25784b873676h60777r701I78757e29341D307746
76a36500j105211B044754D64662J753289d390812B875438O35146A640990B89451
66a111538c66579F69807b048202C285857c859723R91954a365143A611927b218222
56a748271B51732K899864n30986K91854i66589C69315h34270E94905N752648f439825
$$ y = [2302590, -463024, -6804939, 2500044, -953971, -1824748, 2914833, 3486806, -6090786, 343082, 1789468, -2928643, -1693243, 1777112, 2062928, -1386581, 2672752, -2516256, 5134625, -810522, 116804, -2668557, -504913, -1562941, 1995669, -3174640, 1752661, 5331188, -4254845, 1904364, -5744482, -148101, -2151849, -181735, 4963357, 1773937, 3302707, 41496, -7389446, 801216, 1850844, 3637187, 1746317, 3724444, 3098660, -2873676, -860777, -870478, 978757, -529341, 4307746, -136500, -1241711, 2044754, 464662, 2217951, -4390812, 2875438, 3510584, 1640990, 289451, -1111538, -366579, 669807, -2048202, 3285857, -3859723, -2867769, -1365143, 1611927, -2218222, -1748271, 251732, 3151596, 2620610, 2912464, -966589, 369315, -834270, 594905, 6347553, -6439825]
45F166183A109962a408445b43334E24665c98665A742637n44660D88955j63420
36C25535b209287F077850g615245A249071h96599k010217B35607J366933L608190
27E210730d065596B663516h65106C313440b567712D523396c594055A8667K688496
18B707163f83958o32767A645069D15730b049139o49585D416002A343106c283376
8I24972b934835C124945a485706B32526a447520k265586J649991i27981
$$ y = [6166183, 1109962, -1408445, -243334, 524665, -398665, 1742637, 1197977, 488955, 325535, -2209287, 6077850, -7615245, 1249071, -896599, -2906816, 235607, 1602540, 5210730, -4065596, 2663516, -865106, 3313440, -2567712, 4523396, -3594055, 18667, 2707163, -683958, -1316725, 1645069, 415730, -2049139, -2698724, 4416002, 1343106, -3283376, 924972, -2934835, 3124945, -1485706, 232526, -1447520, -3713106, -2063115, -927981]
##PAGE= F1=5640.578599651
##FIRST=     21204.543296753, 2686.85945900537, -304912
##DATA TABLE= (F2++(Y..Y)), PROFILE
2047c04912B989229a282072A598273b413172L30834g05273A720930n04818b500274
2037A756890h51123a95254A658410a188536A097090k23748J468854A122128a326275
2027D525659a041811d72387F89306K94426b293653a51259q37736m665599d08195
2017E019043B192225N13921D80216n6637b071853h691o75833j767872B230802
2007d639389B912904A091169b565466M97817D145667b39227F31424O8987a327552
1997A099011e511598D932445a860456A601501a300305n952763f49665D6726K496931
1988B543657j218555c142180a78700j074842B782972h26206D204825J960071i99345
1978b299385D486733b711515a196745F34944J865453c19986l53348I55852J9783
$$ y = [-304912, 2989229, -1282072, 1598273, -2413172, -2082338, -705273, 1720930, 1216112, -2500274, 1756890, -851123, -195254, 1658410, -1188536, 1097090, 873342, 2342196, 1122128, -1326275, 4525659, -1041811, -472387, 689306, 983732, -2293653, -151259, -988995, -5654594, -408195, 5019043, 2192225, 2706146, 480216, 423579, -2071853, -8691, -684524, -2452396, 2230802, -4639389, 2912904, 1091169, -2565466, -2067649, 4145667, -239227, 631424, 700411, -1327552, 1099011, -5511598, 4932445, -1860456, 1601501, -1300305, -7253068, -649665, 46726, 2543657, 1325102, -3142180, -178700, -1253542, 2782972, -826206, 4204825, 6164896, -999345, -2299385, 4486733, -2711515, -1196745, 634944, 2500397, -319986, -673334, 955852, 975635]
1969I75635b845580D735598a109578C387676a147341j393862j391121a932078
1960a271536C292234H05085D00567N2120J663440N33471c037316p42433J202101
1951b577648h6160q09674F857199A239021b716145B71342f19683n1619B915761
1941A151110J925324d947874J850570C076975j21080e217612D66053c580909B486137
1931C063154b013644f66393j249485K5296Q79450G190391G68847a477445k1854
1922a499299G45668j75712a591336b44060A578076a121645a57901j657462Q62481
1913i52882b34957A786889b363467j663063L83100B770632c539950C010317c154944
1903g96890A067119N100842j774286f805931E363681f949599C191190b399433
$$ y = [975635, -2845580, 4735598, -1109578, 3387676, -1147341, -2541203, -3932324, -1932078, -1271536, 3292234, 805085, 400567, 452687, 2116127, 2649598, -3037316, -3779749, -2577648, -86160, -895834, 6857199, 1239021, -2716145, 271342, -619683, -671302, 2915761, 1151110, 3076434, -4947874, -3097304, 3076975, 2955895, -5217612, 466053, -3580909, 2486137, 3063154, -2013644, -666393, -1915878, -1890582, -1011132, 7190391, 768847, -1477445, -1499299, 745668, 569956, -1591336, -244060, 1578076, -1121645, -157901, -1815363, -952882, -234957, 1786889, -2363467, -4026530, -3643430, 2770632, -3539950, 3010317, -3154944, -796890, 1067119, 6167961, 4393675, -6805931, 5363681, -6949599, 3191190, -2399433]
1894a486676j017034C057345e087065G82322J212092a951356N03571j056728E79595
1884c585377d07162n36019k874208C610959d63364o68367j778928B343082A49999
1874a205030F386533A709417n41159f306223C645222f94695j963559O89869q72636
1865b841021A849664L90173d197787B977018K77153a785483k575886C798074c739605
1855B51556f67020A5753K559928a560050k29574D427145I23836c888137M44598
1846c443539C50272i75088C125745a659851l307876a611816B434445h97142b412
1836A702915a994815L9981f52922k159421B914300J82595b379469C403068d492622
1826A664794N16826H73964L499493g16940A061087a823572A469383M90942a365393
$$ y = [-1486676, -2503710, 3057345, -5087065, 782322, 1994414, -1951356, -1447785, -2504513, 579595, -3585377, -407162, -943181, -3817389, 3610959, -463364, -1131731, -2910659, 2343082, 149999, -1205030, 6386533, 1709417, 1168258, -6306223, 3645222, -694695, -2658254, -1968385, -2841021, 1849664, 2239837, -4197787, 2977018, 3254171, -1785483, -4361369, 3798074, -3739605, 251556, -667020, 15753, 2575681, -1560050, -1789624, 4427145, 923836, -3888137, -3443539, 350272, -975088, 3125745, -1659851, -4967727, -1611816, 2434445, -897142, -2412, 1702915, -1994815, -1954834, -652922, -2812343, 2914300, 3096895, -2379469, 3403068, -4492622, 1664794, 2181620, 873964, 4373457, -716940, 1061087, -1823572, 1469383, 1960325, -1365393]
1816B25157a981968j310398C780608J037491b403553G55392J017929e367356E022732
1806C133453F56284e835944h70587C31816h79929C218923c498222B779728G09090
1796a293443e1975l255039I62402J523944c570196C241939c604914Q65664D083722
1786B403699h729260C390107A206697b2473j518255A801221K476945c988195f8062
1776B628587a729277g64085k718949j299414J19064O85495F803478f133182A449603
1766A751849m24558J675634D54145K113309f43737B032273b291401g1564j43522
1757b15086B86138e739076A0267048a798088a71528j300574d71926k36288k773260
1748c481474R93497d84740m67058B33021e767080A34401J374753K925961a716543
$$ y = [225157, -1981968, -3292366, 3780608, 4818099, -2403553, 755392, 1773321, -5367356, 5022732, 3133453, 656284, -5835944, -870587, 331816, -879929, 3218923, -3498222, 2779728, 709090, -1293443, -51975, -3307014, 962402, 2486346, -3570196, 3241939, -3604914, -2739250, 4083722, 2403699, -8729260, 3390107, 1206697, -22473, -1540728, 1801221, 4278166, -3988195, -68062, 2628587, -1729277, -764085, -3483034, -4782448, -4663384, -3977889, 6803478, -6133182, 1449603, 1751849, 1327291, 3002925, 454145, 2567454, -643737, 2032273, -2291401, -71564, -215086, 286138, -5739076, 10267048, -1798088, -171528, -1472102, -471926, -708214, -3481474, -2487977, -484740, -951798, 233021, -5767080, 134401, 1509154, 4435115, -1716543]
1738b885228E29638c417700J20072A501465K74629C94793b584830f96960q82659
1729a579619C466918b065259A464855H5870f206749B924484b516302N77769Q67584
1720a070949C940179D32501q4025Q08935c084965C103617A007491M76031a192362
1710b792990A571628G65285b594127D661217g86418E121018D88778J868421c138461
1700A176994c997915J877282C364699G17155J723602h260914c243909C844629
1691C11278c162663B433698d02402B469577i88585C329847a236518l62029C994710
1681a892190j42743F224858c299817b91878q81911C220962a947518K05333D855302
1671d354910B059861O27155c37595p66879J84661B030141f79075C272767a697519
$$ y = [-2885228, 529638, -3417700, -3297628, 1501465, 1776094, 394793, -2584830, -696960, -1579619, 3466918, -2065259, 1464855, 85870, -6206749, 2924484, -2516302, -1938533, -1070949, 3940179, 432501, 348476, 1157411, -3084965, 3103617, 1007491, 1483522, -1192362, -2792990, 1571628, 765285, -2594127, 4661217, -786418, 5121018, 488778, 2357199, -3138461, 1176994, -3997915, -2120633, 3364699, 717155, 2440757, -8260914, -3243909, 3844629, 311278, -3162663, 2433698, -402402, 2469577, -988585, 3329847, -1236518, -1598547, 3994710, -1892190, -2034933, 6224858, -3299817, -291878, -1173789, 3220962, -1947518, -1742185, 4855302, -4354910, 2059861, 2687016, -337595, -1104474, -919813, 2030141, -679075, 3272767, -1697519]
1661C92123J87275j6025A74535c953991H392290G67134J315837m15125b820640
1651B507608b698823B81112M441007A822172L91023d361275a941664A290788h35826
1641f07761D744509g32351A474040J153263P42149c269264e56098B44129M070465
1632D314594I11415L82127b531075B654704A42499c2346j382488m37708b03449
1622I84107c151874H210166a74181A003668c946230E61831J35674C18556a267357
1612A183065J29792i95028m89293K30774m968750a81090E620924a353200I61558
1602E05207g50279F147193A849210H25616a578659C009119F25299J37640a809256
1592A91580a223287m081517D192326A423843N154423d901088A24124d989140B012002
$$ y = [392123, 579398, 563373, 174535, -3953991, 8392290, 767134, 2082971, 1667846, -2820640, 2507608, -2698823, 281112, 4722119, 1822172, 2213195, -4361275, -1941664, 1290788, -835826, -607761, 4744509, -732351, 1474040, 2627303, 3369452, -3269264, -556098, 244129, 4314594, 911415, 1293542, -2531075, 2654704, 142499, -32346, -1414834, -1852542, -203449, 984107, -3151874, 8210166, -174181, 1003668, -3946230, 561831, 697505, 318556, -1267357, 1183065, 1312857, -995028, -1484321, -1253547, -6222297, -181090, 5620924, -1353200, 961558, 505207, -750279, 6147193, 1849210, 825616, -1578659, 3009119, 625299, 762939, -1809256, 191580, -1223287, -5304804, 4192326, 1423843, 6578266, -4901088, 124124, -4989140, 2012002]
1582E67555a279612F208836A579840a525645H98023E2311a617731j640763B666691
1572B146235o50953d27124n06958j797485A444835l37218J99248b022919l27754
1563b350673i304k893662C138398a920860A115740K262870j360423K132908b33904
1553a032992B231324C53007a730338J85830k09161B361620D30458M2767k20533
1544B52692J056467h2390A836695H68542J936283F97966h556C23156P56333J388481
1534B467970c909876j14636E9053O422417G80928A53988J368302J161108h70718
1524b073340a1464H92555R01284H26119K06639J459714e48672D6557L641858g761499
1513B520448J346541A429472a083354C35642L01286L53710h412223D444123i1727
$$ y = [567555, -1279612, 6208836, 1579840, -1525645, 898023, 52311, -1617731, -3258494, 2666691, 2146235, 1495282, -427124, -934082, -2731567, 1444835, 1107617, 1306865, -2022919, -2350673, -9304, -2902966, 3138398, -1920860, 1115740, 3378610, 2018187, 4151095, -233904, -1032992, 2231324, 353007, -1730338, -1544508, -1753669, 2361620, 430458, 473225, 252692, 1309159, -82390, 1836695, 868542, 2804825, 697966, -8556, 323156, 1079489, 2467970, -3909876, -4024512, 59053, 6481470, 780928, 153988, 1522290, 2683398, -870718, -2073340, -11464, 892555, 1793839, 826119, 1032758, 2492472, -548672, 46557, 3688415, -7761499, 2520448, 3866989, 1429472, -1083354, 335642, 636928, 990638, -8412223, 4444123, -91727]
1503g49097A914433L272916h276630D353159a76337D577118d462323A773517i43377
1493h94742B239576e02878D807608B103674P43214g513191A006695P31085e104739
1483b539704H83849k26032L901801c820578j5850D93101M834851b251014i17557
1473a190875b19772E613258j961452b809672J126731B776427a698727l063064
1465d761791a258062C386197I78791d91871F18199a549762k940023C82733d339248
1455B894706J488545f465268A500053j52450f50986k722254J534884G28667c053382
1445A101215f108857a395657H09584h14627C890928A458961a946055B060308c492328
1435A719116L239233b341970e79103A274923K971681H80699p3445g71102n20957
$$ y = [-749097, 1914433, 5187349, -8276630, 4353159, -176337, 4577118, -4462323, 1773517, -943377, -894742, 2239576, -502878, 4807608, 2103674, 2846888, -7513191, 1006695, 1737780, -5104739, -2539704, 883849, 657817, 4559618, -3820578, -3836428, 493101, 5327952, -2251014, -917557, -1190875, -219772, 5613258, 3651806, -2809672, -1682941, 2776427, -1698727, -4761791, -1258062, 3386197, 978791, -491871, 618199, -1549762, -4489785, 382733, -4339248, 2894706, 4383251, -6465268, 1500053, 1347603, -650986, -3373240, -1838356, 728667, -3053382, 1101215, -6108857, -1395657, 809584, -814627, 3890928, 1458961, -1946055, 2060308, -3492328, 1719116, 4958349, -2341970, -579103, 1274923, 4246604, 880699, 807254, -771102, -1292059]
1426a292059M63155a85857A557454o55619a60811D4738c939991B191268F54904
1416a603339e93877k557247A680873i92501j558830B405902a484622B726769b975364
1406B935063i11499A635525f33608B251992a998994q33078H121083d03492k764125
1397c167617j015735B343516A042591m25872J379943c50460r16887H56894j80655
1388F76239b530985A379994F67707p4618a301934A144396J267369K0480l41655
1379B090590p15105a868565A36886K887599b162631e21235B847731c631839C520000
1369d500088b081601I43543c984053D062083a839052Q83463A715441a258109j58090
1360a416199B835750K24643n56239I31276h62324j64682E6554a399363l748104
$$ y = [-1292059, -828904, -185857, 1557454, 901835, -160811, 44738, -3939991, 2191268, 654904, -1603339, -593877, -3151124, 1680873, -992501, -2551331, 2405902, -1484622, 2726769, -2975364, 2935063, -911499, 1635525, -633608, 2251992, -1998994, -2832072, 8121083, -403492, -3167617, -4183352, 2343516, 1042591, 616719, 1996662, -350460, -1267347, 856894, 676239, -2530985, 1379994, 667707, 593089, -1301934, 1144396, 2411765, 2432245, 2090590, 1375485, -1868565, 136886, 3024485, -2162631, -521235, 2847731, -3631839, 3520000, -4500088, -2081601, 943543, -3984053, 4062083, -1839052, -955589, 1715441, -1258109, -1416199, 2835750, 3060393, 2504154, 931276, -862324, -1027006, 56554, -1399363, -5147467]
1351e147467D089166q26307I71295c493017B797356b427087h43421k170681k37288
1342c251390d22120B418258g062067C33736J54431J627233p49411Q5361M47956
1333A899306c493680a391297c99630A114226d644101A777449d154256F87947b665327
1323b043953D39251c8814D85592a411359A191613b424532J009214M98428k933922
1314c850812E827550e12324A107120M00748a626609n421695I38835N63863d377668
1304i86422C523978J564150G91387a304424o13868c66343F567930f357984a811552
1294a682847B120862a375392D157038e68725C21970a103853l647927B323669m13259
1285A910410F95908J85862f027194A562452F70260b539205L16757A719643R66884
$$ y = [-5147467, 4089166, 3262859, 971295, -3493017, 2797356, -2427087, -843421, -3014102, -3251390, -422120, 2418258, -7062067, 333736, 488167, 2115400, 1365989, 1451350, 1899306, -3493680, -1391297, -399630, 1114226, -4644101, 1777449, -4154256, 687947, -2665327, -2043953, 439251, -38814, 485592, -1411359, 1191613, -2424532, -1415318, -916890, -3850812, 5827550, -512324, 1107120, 1507868, -1626609, -7048304, 938835, 1502698, -4377668, -986422, 3523978, 5088128, 791387, -1304424, -1918292, -366343, 6567930, -6357984, -1811552, -1682847, 2120862, -1375392, 4157038, -568725, 321970, -1103853, -4751780, 2323669, 1910410, 695908, 881770, -6027194, 1562452, 670260, -2539205, -2222448, 1719643, 2686527]
1276B686527a476250B260211d471743D375568j115274f99366A575641p61132K487922
1267C302431b231840C231089b58836k630942A068525b77103k460705F26328L363452
1258C989780A904108i7983j396263a26129A954686E32579e78205j464995B97883
1248b112653k111270E942193c10173j979748C123938d562490J835617l67017A323838
1238A111113K130557j450808c208983A216234M77977e96215E14826d027447e83546
1228F59352e177118A659930a442742n4422C64205a14331j746811B832611J597079
1219D429690a269631k270287h28149k947241a195755k793648B786631a790469
1210A563741n70957J032241D83833b800224A47538K722047a844894J35865J79812
$$ y = [2686527, -1476250, 2260211, -4471743, 4375568, 3260294, -699366, 1575641, 814509, 3302431, -2231840, 3231089, -258836, -2889778, 1068525, -277103, -2737808, 626328, 3989780, 1904108, -97983, -1494246, -126129, 1954686, 532579, -578205, -2043200, 297883, -2112653, -4223923, 5942193, -310173, -2289921, 3123938, -4562490, -2726873, -3093890, 1323838, 1111113, 3241670, 1790862, -3208983, 1216234, 1694211, -596215, 514826, -4027447, -583546, 659352, -5177118, 1659930, -1442742, -1497164, 364205, -114331, -1861142, 2832611, 4429690, -1269631, -3539918, -828149, -3775390, -1195755, -3989403, 2786631, -1790469, 1563741, 992784, 2025025, 483833, -2800224, 147538, 2869585, -1844894, -1709029, -1529217]
1201a529217B858871d982453K348887l25406B203521A92686c30659B771674K003603
1192D775277b511936j794718h41994F117316d930015B954693a843162k98247F30913
1182c327698J194998H67714K441443H47422e114872B908324N58143c375430n62533
1173c937963D727493b130860i97931l414763B691942e118897C167011I88220J77955
1164A166175g87805k809502F996160A319639c218880C359393k32696c047010b4447
1154A610392d24264b3531l959060B475987d083275A984113L199408a253550p18607
1145a972157o84557j860861C071077b774138a9133A621351e313484B013802Q6074
1136B099876J24363c092385G86138M636245c509187B138789c364394B675850g95425
$$ y = [-1529217, 2858871, -4982453, -2633566, -2958972, 2203521, 192686, -330659, 2771674, 4775277, -2511936, -4306654, -841994, 6117316, -4930015, 2954693, -1843162, -2141409, 630913, -3327698, -2132700, 867714, 3309157, 847422, -5114872, 2908324, 3466467, -3375430, -3937963, 4727493, -2130860, -997931, -4412694, 2691942, -5118897, 3167011, 988220, 1166175, -787805, -3597307, 6996160, 1319639, -3218880, 3359393, 3126697, -3047010, -24447, 1610392, -424264, -23531, -3982591, 2475987, -4083275, 1984113, 5183521, -1253550, -1972157, -2656714, -4517575, 3071077, -2774138, -19133, 1621351, -5313484, 2013802, 2099876, 2224239, -3092385, 786138, 5422383, -3509187, 2138789, -3364394, 2675850, -795425]
1126D324502A028359h70969j65082b0725C151030a162316l161698A123716k85696
1117H38020J444393c90285i692m487697A437278f42351k824785D83365L375278
1108C858643j888295c342024A386562b142500a47530B054908c963225b905D648713
1098d766059B318500f223034C40265J837383a170347D217653b26221C188703j367697
1089A821006L308193c440528F86062M258060B94736e956142B557811f15488p66212
1080a381700B383297M12806i63075A465944M10239F13501P18826J623005c460319
1070d245180a60487k032128J065202k477217a043630m02138A612852D37057N248023
1061E685080a965634j276231C447324a878307C264025c773574P70912B312824
$$ y = [4324502, 1028359, -870969, -1036051, -20725, 3151030, -1162316, -4324014, 1123716, 838020, 2282413, -390285, -9692, -4497389, 1437278, -642351, -3467136, 483365, 3858643, 1970348, -3342024, 1386562, -2142500, -147530, 2054908, -3963225, -2905, 4648713, -4766059, 2318500, -6223034, 340265, 2177648, -1170347, 4217653, -226221, 3188703, 1821006, 5129199, -3440528, 686062, 4944122, 294736, -5956142, 2557811, -615488, -1381700, 2383297, 2796103, -963075, 1465944, 1876183, 613501, 1332327, 2955332, -3460319, -4245180, -160487, -2192615, -1127413, -3604630, -1043630, -1445768, 1612852, 437057, 5685080, -1965634, -3241865, 3447324, -1878307, 3264025, -3773574, -3002662, 2312824]
1052d437358J989174C419733a999257A890168A08082M895226I32701g23472j964063
1043b687535a20015H8946b658085C04818M429026j433139j065700e166464C465945
1033C28841L17628b335439A760297f3079k640462D33120L219842c230451E488947
1023b417451h53295G07354M445710a004371L61970A970533E66041K011078F15408
1013a97969B823025j244850d573729K102819j36209b60004D963973b033642k425956
1004d459598g91976A001308N17819e71580C468836c746220J732278d34221B032297
994b35123B616414B61339c19166n174808C123305b927170j820687K203848J69195
985b374814E863124a985831B158702Q26347q60308L979575b994876A171354J12471
$$ y = [-4437358, -2448184, 3419733, -1999257, 1890168, 108082, 5003308, 932701, -723472, -2687535, -120015, 88946, -2658085, 304818, 4733844, 3300705, 2235005, -5166464, 3465945, 328841, 646469, -2335439, 1760297, -63079, -2703541, 433120, 3652962, -3230451, 5488947, -2417451, -853295, 707354, 5153064, -1004371, -642401, 1970533, 566041, 2577119, 615408, -197969, 2823025, 1578175, -4573729, -2470910, -2607119, -260004, 4963973, -2033642, -4459598, -791976, 1001308, 1519127, -571580, 3468836, -3746220, -2013942, -434221, 2032297, -235123, 2616414, 261339, -319166, -5493974, 3123305, -2927170, -4747857, -2544009, -2374814, 5863124, -1985831, 2158702, 2985049, 2124741, 6104316, -2994876, 1171354, 1283825]
976A283825g90661l005453C482670O85546j62329J018379c944854D77424a1018
966a359750B535391M87411f26491j298579H42076d809039E20236g17899j477965
957b195864A666744o25572P930118e702300c15088j421254B59833a10679B077347
947d593569C878918A046490N245354c014669D87377a527281e08297l716085b091035
937b01879D812283d130762a911293H80980B61341J596910a344143e52332J92100
928c60232R3195A255997K9366c360071A639311K58680q00578e46743j949096B305970
917b523778C470817c035380L86286H69253b911684j24851l369467D15824d35815
907A426221F29712J35947P04996e40638A564129L393543a348524L98650C146128
$$ y = [1283825, -790661, -3796114, 3482670, 4168216, 4005887, 5024266, -3944854, 477424, -11018, -1359750, 2535391, 3022802, -626491, -1925070, 842076, -4809039, 520236, -717899, -2195864, 1666744, 1041172, 8971290, -5702300, -315088, -1736342, 259833, -110679, 2077347, -4593569, 3878918, 1046490, 6291844, -3014669, 487377, -1527281, -508297, -4224382, -2091035, -201879, 4812283, -4130762, -1911293, 880980, 261341, 1858251, -1344143, -552332, -360232, -267037, 1255997, 1285363, -3360071, 1639311, 1897991, 1097413, -546743, -2495839, 2305970, -2523778, 3470817, -3035380, -2649094, 869253, -2911684, -3036535, -6406002, 415824, -435815, 1426221, 629712, 765659, 1470655, -540638, 1564129, 4957672, -1348524, -949874, 3146128]
897a136808j594160G96179K140950r68616d328183A073859J52254J657472b326593
887A045635d341804a775194C800809a090996B438065b41170B1440K941129b189062
877E38310c85694k335226A553092K600210A601051l72430L71979D70514O09314
868A079828a774750h9994j341988j977505C508758b2359D65231J969126c544949
858B897282h89597J47731H70122J401651c934365R2124B788449n07910h67227
848d439277K196272R81436F824649a630873A675776c956775H22602b962490h39260
838D425247a435146B985870r59946b632350E46666a00741B986460b656603h59461
828c741773A102985L000936b040023R68322j924137C041917g429942F21797N22059
$$ y = [-1136808, -2730968, 796179, 2937129, 1968513, -4328183, 1073859, 1226113, 2883585, -2326593, 1045635, -4341804, -1775194, 3800809, -1090996, 2438065, -241170, 21440, 2962569, -2189062, 538310, -385694, -2720920, 1553092, 4153302, 1601051, 1228621, 1600600, 470514, 1079828, -1774750, -89994, -1431982, -3409487, 3508758, -22359, 465231, 2434357, -3544949, 2897282, -889597, -741866, 870122, 2271773, -3934365, -3842241, 2788449, 2280539, -867227, -4439277, -2243005, -1261569, 6824649, -1630873, 1675776, -3956775, 822602, -2962490, -839260, 4425247, -1435146, 2985870, 2025924, -2632350, 546666, -100741, 2986460, -2656603, -859461, -3741773, 1102985, 4103921, -2040023, -1071701, -2995838, 3041917, -7429942, 621797, 1143856]
819A143856i38236C821306d137964F18795a392284k430611A360941a017181a81914
809c020465e6537j852527A860967N607086a556294n323160B603020d682589A456711
799c315188G272959b455867e59026D56701E0889b2551m081899H09088M247080
790E056168e146664E164475D4510J937744H33615L330681G12063O45869a116550
780g79560E236074d187979B852908m33908b553852B79329L9613L35943a000769
770a148277C05658K329086a393525A379806a250020k80132B480263J693612B18324
760a866370F469481A576176f311233A988897J424272L87232b636666m01377F546850
750g737216a30831j89921E425525b155533k888849E996752E59500P688250i48069
$$ y = [1143856, -938236, 3821306, -4137964, 618795, -1392284, -3822895, 1360941, -1017181, -181914, -3020465, -56537, -1909064, 1860967, 7468053, -1556294, -6879454, 2603020, -4682589, 1456711, -3315188, 7272959, -2455867, -559026, 456701, 50889, -22551, -4104450, 809088, 5056168, -5146664, 5164475, 44510, 1982254, 833615, 4164296, 712063, 1357932, -1116550, -779560, 5236074, -4187979, 2852908, 2419000, -2553852, 279329, 318942, 654885, -1000769, -1148277, 305658, 2634744, -1393525, 1379806, -1250020, -1530152, 2480263, 4173875, 218324, -1866370, 6469481, 1576176, -6311233, 1988897, 3413169, 3800401, -2636666, -3038043, 6546850, -7737216, -130831, -320752, 5425525, -2155533, -5044382, 5996752, 559500, 8247750, -948069]
740h20265A923583e071823B018304K500084A602380G09910a360575a72611C795908
730A16401M1739Q60865P75868b48364A003879N702555e887308a00378j962761
721b063139O01968C795520K304094N385215n251537a8135628l773930N947123
713a5962435j7774517i725167C5336338j1508553p759370O136324l316468q850724
705A0037547a8008369j2182213K428826k7771909J1553858B7319093n439142q157514
697A3722437L4324759A7294945i388121b226664N85003k004545f62289A141025
688e180526B735325c041491A943521L6473a173102A476839i49897E440255b566686
678c631877j736358F668183J0669689J9924802b7881k858521k5179307Q209758
$$ y = [-820265, 1923583, -5071823, 2018304, 4518388, 1602380, 709910, -1360575, -172611, 3795908, 116401, 158140, 1019005, 1794873, -248364, 1003879, 6706434, -5887308, -100378, -2063139, -1461171, 3795520, 6099614, 11484829, 6233292, -18135628, -21909558, -15962435, -33736952, -9725167, 35336338, 23827785, 16068415, 22204739, 18888271, 10037547, -18008369, -30190582, -27761756, -55533665, -43979807, 27319093, 21879951, 13722437, 48047196, 17294945, -9388121, -2226664, -1641661, -3646206, -662289, 1141025, -5180526, 2735325, -3041491, 1943521, 1979994, -1173102, 1476839, -949897, 5440255, -2566686, -3631877, -5368235, 6668183, 17337872, 37262674, -27881, -2886402, -28065709, -19855951]
670a9855951P030911k7254088a3032671e306196A9394160K1288573p633424I314749
661D847841a6270103c221446a148867k5467397a1914691J23803C229611J1911118
653A5140729C857748j897065G14727N987100c820060B102544a363805C917929
644C898021b06393q62964B632974d76231C304032h38877G280262l096370A842551
634a965160D49275L175833A042965R17462N35671C55532K128604N857555l76336
625G965355P321212K6389160N8849883J33576623b96290033M5489077J0722083
618b40078873B10649713C9639326j7058317r805372l813711J026152l264808A725499
609a10818D760346j851967a613717A211671c47837j486353A683475e61172C066923
$$ y = [-19855951, -12825040, -40079128, -13032671, -5306196, 19394160, 40682733, 33049309, 9314749, 4847841, -16270103, -3221446, -1148867, -26616264, -11914691, -11790888, 3229611, 15140729, 3857748, 1960683, 714727, 6701827, -3820060, 2102544, -1363805, 3917929, 3898021, -206393, -1069357, 2632974, -476231, 3304032, -838877, 7280262, 4183892, 1842551, -1965160, 449275, 3625108, 1042965, 1960427, 2496098, 355532, 2484136, 8341691, 7965355, 15286567, 41675727, 100525610, 234102233, -296290033, -250800956, -240078873, 210649713, 39639326, 22581009, 12775637, 8961926, 9988078, 6723270, 1725499, -110818, 4760346, 2908379, -1613717, 1211671, -347837, -1834190, 1683475, -561172, 3066923]
599a394446A951813a964000k797835g04883B793040K56087b196002L35642D437067
589F00241b461762A420305a235258k017821F763091a564441G04811d14972C02620
579C355697F37535b50829D289175d308014J149563h62188n0064d05318A660077
569A308381c921131J202806C824208p91514c805248C279853A639865e278133I5165
559a476176j416667J352144L72445G52540K080380b568627a233572C87105f05367
549a955385e60014C10383i6602E463402h39575A296459N13897a428854D155802
539e234475a602114C728825K92474f051626J703515d26205r82767H54055b987369
529A756893M10811j041515P75406E35131K31144c528224A532951p61557C605c794759
$$ y = [-1394446, 1951813, -1964000, -4761835, -704883, 2793040, 3049127, -2196002, -1860360, 4437067, 600241, -2461762, 1420305, -1235258, -3253079, 6763091, -1564441, 704811, -414972, 302620, 3355697, 637535, -250829, 4289175, -4308014, -3158451, -862188, -912252, -405318, 1660077, 1308381, -3921131, -2718325, 3824208, 3032694, -3805248, 3279853, 1639865, -5278133, 95165, -1476176, -2892843, -1540699, -1168254, 752540, 2832920, -2568627, -1233572, 387105, -605367, -1955385, -560014, 310383, -96602, 5463402, -839575, 1296459, 1810356, -1428854, 4155802, -5234475, -1602114, 3728825, 4021299, -6051626, -4348111, -426205, -1408972, 854055, -2987369, 1756893, 2167704, 1126189, 1901595, 535131, 766275, -3528224, 1532951, 771394, 3605, -3794759]
518a857283D525347g41238A513959c330751B837940D14346c611024B225388D59452
508b516408a052714b09253l0579D85863K889682b533195i43872F01227O5542M08610
498A075379b558331I79282d964423C392457m23927a353007B294520c452760A911605
488A688663c933993A656904J464675i60710B357373h90208l393553B203395b851669
478C165448I15168B19238L373870a396941f75928K8535n131527C991076c201216
468b435457C427516J645464a406415B374041G6241L971649C70012f94564k258854
459b953418a82278E11096c200813J037025E598982d97591k524208D056453a289569
449d253587e0711l160415D71003M72890B65556A28443N71453P7684e117107C606788
$$ y = [-1857283, 4525347, -741238, 1513959, -3330751, 2837940, 414346, -3611024, 2225388, 459452, -2516408, -1052714, -209253, -239832, 485863, 3375545, -2533195, -943872, 601227, 666769, 1075379, -2558331, 979282, -4964423, 3392457, 2968530, -1353007, 2294520, -3452760, 1911605, 1688663, -3933993, 1656904, 3121579, -960710, 2357373, -890208, -4283761, 2203395, -2851669, 3165448, 915168, 219238, 3593108, -1396941, -675928, -647393, -5778920, 3991076, -3201216, -2435457, 3427516, 5072980, -1406415, 2374041, 76241, 4047890, 370012, -694564, -2953418, -182278, 511096, -3200813, -2163788, 5598982, -497591, -3021799, 4056453, -1289569, -4253587, -50711, -3211126, 471003, 943893, 265556, 128443, 699896, 777580, -5117107, 3606788]
438C478115A03734g44413B85024d263702A634427e29792j866997N48312j38115
429a986592E245011B15017P68245J859093K210895k264690d081735H966911b282840
419e414343J480622A278388J080277m15081B42939b20770C32893I0087d403043
409b99645C606441a02443H31775b892967B187325g757574E804226A191170e39091
399b909195o90589a035669j674057j314458E078578b205339C926930A790319q60401
390I29918b644119A23394c695366J644788q01495A983517E82492A11386J281041
381A392427b063229f19830A884395a099972j354700B938524A357988P9631a541113
371a734041g07872k969725J403012O13241P52865A456136k90493K128270A560915
$$ y = [3478115, 103734, -744413, 285024, -4263702, 1634427, -529792, -2396789, -1848477, -1986592, 5245011, 215017, 983262, 2842355, 5053250, 2788560, -4081735, 8966911, -2282840, -5414343, -3933721, 1278388, 2358665, 1943584, 242939, -220770, 332893, 90087, -4403043, -299645, 3606441, -102443, 831775, -2892967, 2187325, -7757574, 5804226, 1191170, -539091, -2909195, -3599784, -1035669, -2709726, -4024184, 5078578, -2205339, 3926930, 1790319, 929918, -2644119, 123394, -3695366, -2050578, -2852073, 1983517, 582492, 111386, 1392427, -2063229, -619830, 1884395, -1099972, -2454672, 2938524, 1357988, 1437619, -1541113, -1734041, -707872, -3677597, -2274585, -1661344, -908479, 1456136, 1165643, 3293913, 1560915]
361i61541A140963c457241r2221i85544l7438b6854o049326D245743A064270a69381
350A363710h71262q9299o92093A235578b273002D649294c339093C034137j003574
341B030563a058951H84631c004381A582043m20119H516b020314Q2541F046539
331a578503J27137o14947b93314E23146J21084J039844A78220c02210C446713
321b393931A629341G47705Q85258c251689A530205n28093f64010C304020d38023
311c883431A958219b033435e64140B245509b88604H29477b854242L91885E039539
301c581340l96422C390616b019946E543683b027252A408967K220213c078127e52174
291b844449C728883g45567j326189A983341F93393e41096k474308C221470c58310
$$ y = [-961541, 1140963, -3457241, -3549462, -985544, -1022982, -26854, -6076180, 4245743, 1064270, -169381, 1363710, -871262, -960561, -1652654, 1235578, -2273002, 4649294, -3339093, 3034137, 2030563, -1058951, 884631, -3004381, 1582043, 1161924, 8516, -2020314, -1937773, 6046539, -1578503, -1451366, -2066313, -293314, 523146, 644230, 1684074, 178220, -302210, 3446713, -2393931, 1629341, 747705, 1632963, -3251689, 1530205, 1002112, -664010, 3304020, -438023, -3883431, 1958219, -2033435, -564140, 2245509, -288604, 829477, -2854242, -2462357, 5039539, -3581340, -3977762, 3390616, -2019946, 5543683, -2027252, 1408967, 3629180, -3078127, -552174, -2844449, 3728883, -745567, -2071756, 1983341, 693393, -541096, -3015404, 3221470, -358310]
281B893103a252427I11786b356535a33333r61994J19861E090536e251523D50612
271a367596L93689c1555I25422e344739f95300k99867r27409I39274a250439A762320
260e37657q08196k292036D855259A8643K691446D01181M424263A480062j38687
251A341375F59792N51729c476643A240897D44889K688953d117121G76117K971748
242C747865d058548f28629k73623J5286r93149B203140M71023g207103D809566
232c295060M75523E487857c147143A953775L381285g06588A024455c6510A854891
222G3445K708132d538124A868132n0094e870016B52709P45056d020376K68227
213c752149e42768j700298c17839n22544H364085D016077p19597d055992e18532
$$ y = [2893103, -1252427, 911786, -2356535, -133333, -1095327, -975466, 5090536, -5251523, 450612, -1367596, -973907, -31555, 925422, -5344739, -695300, -995167, -1922576, 939274, -1250439, 1762320, -537657, -1345853, -3637889, 4855259, 18643, 2710089, 401181, 4825444, 1480062, 1341375, 659792, 1211521, -3476643, 1240897, 444889, 3133842, -4117121, 776117, 3747865, -4058548, -628629, -902252, -886966, -1880115, 2203140, 2674163, -7207103, 4809566, -3295060, -2819537, 5487857, -3147143, 1953775, 5335060, -706588, 1024455, -36510, 1854891, 73445, 2781577, -4538124, 1868132, 1818038, -5870016, 252709, 997765, -4020376, -3752149, -542768, -2243066, -317839, -840383, 8364085, 4016077, 3296480, -4055992, -518532]
203f2108D057484e265062f75522D854695a836470p00026B562528a352515C336521
193A5884288j968031i0611447j36001129d3043437f546817A98640567I8271909
185B36503540D8552855A7689889b17817691c0594999e117979j454453K419462
178d152970M47893A403078J282028f981644A271331b892681j089575A329765L658677
169D988442a487200J16538A566199J411790E77490K212703C86815d915290A686727
159D103039A513394O46319a017181d22457D080718c730743c56476C58837d01993
149B244565M646545g7706j616964l610753A692705a404559j680670A662605e286418
139B10106b48230Q1574B39375d676567i11992E21149f24639d8539j26745k93005
$$ y = [-62108, 4057484, -5265062, -675522, 4854695, -1836470, -2536496, 2562528, -1352515, 3336521, 15884288, 13916257, -90611447, -226612576, -43043437, -6546817, 198640567, 98271909, 236503540, 48552855, 17689889, -217817691, -30594999, -5117979, -6572432, -4152970, -3705077, 1403078, 2685106, -6981644, 1271331, -2892681, -3982256, 1329765, 4988442, -1487200, -1370662, 1566199, 2977989, 577490, 2790193, 386815, -4915290, 1686727, 4103039, 1513394, 2159713, -1017181, -422457, 4080718, -3730743, -356476, 358837, -401993, 2244565, 6891110, -77706, -1694670, -5305423, 1692705, -1404559, -3085229, 1662605, -5286418, 210106, -248230, -166656, 239375, -4676567, -911992, 521149, -624639, -48539, -175284, -468289]
129d68289H33626Q24556a81099o940281B555573g14106r57473B784248P38191
120C522439e575507A76852J351052c780669J731041B033867o1640a211342B663159
110a763949E035438h75742A026b741779g50058j019976A684860b729776A363897
100E285229d377537A789378f009027c89834k699058D07915M912808A749034J204758
91B953792B13138g614644i2791A865864K775675A091116L460674j576260a846480
81h49962K54971A034780a081212D225569h00869L72261B354156A38161K041379
72B179540d464372B835323M2955H21247B60380a381941d18887C58902a125663
62B252146d063753J231849R76793A140334b125360R6486a44470B775711n95872
$$ y = [-468289, 833626, 1658182, -181099, -7121380, 2555573, -714106, -1671579, 2784248, 3522439, -5575507, 176852, 1527904, -3780669, -2049628, 2033867, 1972227, -1211342, 2663159, -1763949, 5035438, -875742, 1026, -2741779, -750058, -1770034, 1684860, -2729776, 1363897, 5285229, -4377537, 1789378, -6009027, -389834, -3088892, 407915, 5320723, 1749034, 2953792, 213138, -7614644, -92791, 1865864, 4641539, 1091116, 4551790, 2975530, -1846480, -849962, -594991, 1034780, -1081212, 4225569, -800869, -428608, 2354156, 138161, 2179540, -4464372, 2835323, 2878278, 821247, 260380, -1381941, -418887, 358902, -1125663, 2252146, -4063753, -2831904, -1855111, 1140334, -2125360, -2028874, -144470, 2775711, 2179839]
53B179839J551268d35077J47657p19343A066058M863898h236162G369067F28832
43b115919f71085a55545A34788J596951D08782J250538E1802a929395E801979
33g662724H94164a137274j322851B83694J026473L650040d065358C115372d76798
23B874870b485743E141150c307385d95606B563339g43409n33812A451994a39827
13b038425q24273C826258A024863c846679I08155c074650B971863a611547h4778
3b108528k367054a889943g31906
$$ y = [2179839, 3731107, -435077, -287420, -1006763, 1066058, 5929956, -8236162, 7369067, 628832, -2115919, -671085, -155545, 134788, 1731739, 408782, 1659320, 51802, -1929395, 5801979, -7662724, 894164, -1137274, -2460125, 283694, 1310167, 4960207, -4065358, 3115372, -476798, 2874870, -2485743, 5141150, -3307385, -495606, 2563339, -743409, -1277221, 1451994, -139827, -2038425, -2862698, 3826258, 1024863, -3846679, 908155, -3074650, 2971863, -1611547, -84778, -2108528, -4475582, -1889943, -731906]
##PAGE= F1=5618.780329767
##FIRST=     21204.543296753, 2686.85945900537, -206638
$$ [...]
##END NTUPLES=nD NMR SPECTRUM
##END=
