##TITLE=Analysis number 329418
Compound Code cc 14501
Project Code adrs
Chemist Name stores
##JCAMPDX= 6.0         $$ Bruker NMR JCAMP-DX V2.0
##DATA TYPE= NMR SPECTRUM
##DATA CLASS= NTUPLES
##ORIGIN= Bruker BioSpin GmbH
##OWNER= nmr
$$ XWIN-NMR		Version 3.5
$$ Thu Aug 30 13:12:57 2007 GMT Daylight Time (UT+1h)  MAYBRIDGE\nmr@NMR_250MHZ
##.OBSERVE FREQUENCY= 250.131544655141
##.OBSERVE NUCLEUS= ^1H
##.ACQUISITION MODE= SIMULTANEOUS (DQD)
##.ACQUISITION SCHEME= undefined
##.AVERAGES= 16
##.DIGITISER RES= 18
##SPECTROMETER/DATA SYSTEM= dpx250
##.PULSE SEQUENCE= zg30
##.SOLVENT NAME= DMSO
##.SHIFT REFERENCE= (INTERNAL, DMSO, 0, 16.522)
##AUDIT TRAIL= $$ (NUMBER, WHEN, WHO, WHERE, WHAT)
$$ ##TITLE= Audit trail, XWIN-NMR		Version 3.5
$$ ##JCAMPDX= 5.01
$$ ##ORIGIN= Bruker BioSpin GmbH
$$ ##OWNER= nmr
$$ C:\u/data/dgb/nmr/ADRS/1850/pdata/1/auditp.txt
$$ ##AUDIT TRAIL=  $$ (NUMBER, WHEN, WHO, WHERE, WHAT)
(   1,<2007-08-30 13:11:39.65 +100>,<MAYBRIDGE\nmr>,<NMR_250MHZ>,
      <created by zg, POWCHK disabled, PULCHK disabled
       configuration hash MD5:
       76 6E 9A 78 1E 09 19 81 EC 84 63 8F B0 6A 59 2D
       data hash MD5: 64K
       AB 42 D6 9B B1 DD 59 3B D2 34 24 75 F1 37 47 F8>)
(   2,<2007-08-30 13:12:08.27 +100>,<MAYBRIDGE\nmr>,<NMR_250MHZ>,
      <Start of raw data processing
       ef LB = 0.3 FT_mod = 6 PKNL = 1 SI = 32K 
       data hash MD5: 32K
       D8 B3 CB 79 DD 6A 63 80 4F 85 37 CE 6E 39 BD C5>)
(   3,<2007-08-30 13:12:14.49 +100>,<MAYBRIDGE\nmr>,<NMR_250MHZ>,
      <apk 
       data hash MD5: 32K
       98 A8 0B A1 AD 52 4C 82 8E E1 5D 51 1B A3 3D 3A>)
(   4,<2007-08-30 13:12:25.44 +100>,<MAYBRIDGE\nmr>,<NMR_250MHZ>,
      <abs ABSG = 5 
       data hash MD5: 32K
       B4 8A 18 79 B3 E9 F1 9E 70 49 0D FF 9D DE 4E 18>)
$$ ##END=
$$ 
$$ hash MD5
$$ 01 88 62 1E 08 5D 60 F4 1B 6A 90 A7 8B D3 C9 3D
##$RELAX= 
##$RELAX= 
##$RELAX= 
##$RELAX= 
##$RELAX= 
##$RELAX= 
##$RELAX= 
$$ Bruker specific parameters
$$ --------------------------
##$DU= <C:\u>
##$EXPNO= 1850
##$NAME= <ADRS>
##$PROCNO= 1
##$TYPE= <nmr>
##$USER= <dgb>
##$AMP= (0..31)
100 100 100 100 100 100 100 100 100 100 100 100 100 100 100 100 100 100 
100 100 100 100 100 100 100 100 100 100 100 100 100 100 
##$AQSEQ= 0
##$AQ_mod= 3
##$AUNM= <au_zg>
##$AUTOPOS= <58 >
##$BF1= 250.13
##$BF2= 250.13
##$BF3= 250.13
##$BF4= 250.13
##$BF5= 500.13
##$BF6= 500.13
##$BF7= 500.13
##$BF8= 500.13
##$BYTORDA= 1
##$CFDGTYP= 0
##$CFRGTYP= 5
##$CHEMSTR= <none>
##$CNST= (0..31)
1 1 145 1 1 1 1 1 1 1 1 1 1 1 1 1 1 1 1 1 1 1 1 1 1 1 1 1 1 1 1 1 
##$CPDPRG= <>
##$CPDPRG1= <>
##$CPDPRG2= <>
##$CPDPRG3= <>
##$CPDPRG4= <mlev>
##$CPDPRG5= <mlev>
##$CPDPRG6= <mlev>
##$CPDPRG7= <mlev>
##$CPDPRG8= <mlev>
##$CPDPRGB= <>
##$CPDPRGT= <>
##$D= (0..31)
0 1 0 0 0 0 0 0 0 0.06 0 0 0 0 0 0 0.0002 0 0 0 0 0 0 0 0 0 0 0 0 0 0 
0 
##$DATE= 1188475897
##$DBL= (0..7)
120 120 120 120 120 120 120 120 
##$DBP= (0..7)
150 150 150 150 150 150 150 150 
##$DBP07= 0
##$DBPNAM0= <>
##$DBPNAM1= <>
##$DBPNAM2= <>
##$DBPNAM3= <>
$$ [...]
##$SUBNAM7= <"">
##$SUBNAM8= <"">
##$SUBNAM9= <"">
##$SW= 20.6930455092707
##$SWIBOX= (0..15)
0 0 3 0 0 0 0 0 0 0 0 0 0 0 0 0 
##$SW_h= 5175.983436853
##$TD= 65536
##$TD0= 1
##$TE= 296.16
##$TE2= 300
##$TE3= 300
##$TEG= 300
##$TL= (0..7)
0 120 120 120 120 120 120 120 
##$TP= (0..7)
150 150 150 150 150 150 150 150 
##$TP07= 0
##$TPNAME0= <>
##$TPNAME1= <>
##$TPNAME2= <>
##$TPNAME3= <>
##$TPNAME4= <>
##$TPNAME5= <>
##$TPNAME6= <>
##$TPNAME7= <>
##$TPOAL= (0..7)
0.5 0.5 0.5 0.5 0.5 0.5 0.5 0.5 
##$TPOFFS= (0..7)
0 0 0 0 0 0 0 0 
##$TUNHIN= 0
##$TUNHOUT= 0
##$TUNXOUT= 0
##$USERA1= <user>
##$USERA2= <user>
##$USERA3= <user>
##$USERA4= <user>
##$USERA5= <user>
##$V9= 5
##$VALIST= <valist>
##$VCLIST= <CCCCCCCCCCCCCCC>
##$VD= 0
##$VDLIST= <DDDDDDDDDDDDDDD>
##$VPLIST= <PPPPPPPPPPPPPPP>
##$VTLIST= <TTTTTTTTTTTTTTT>
##$WBST= 1024
##$WBSW= 4
##$XGAIN= (0..3)
0 0 0 0 
##$XL= 0
##$YL= 0
##$YMAX_a= 329130
##$YMIN_a= -216995
##$ZGOPTNS= <>
##$ZL1= 120
##$ZL2= 120
##$ZL3= 120
##$ZL4= 120
##$ABSF1= 16.522
##$ABSF2= -4.171173
##$ABSG= 5
##$ABSL= 3
##$ALPHA= 0
##$AQORDER= 0
##$ASSFAC= 0
##$ASSFACI= 0
##$ASSFACX= 0
##$ASSWID= 0
##$AUNMP= <proc_1d>
##$AZFE= 0.1
##$AZFW= 0.1
##$BCFW= 0
##$BC_mod= 0
##$BYTORDP= 0
##$COROFFS= 0
##$CY= 12.5
##$DATMOD= 1
##$DC= 0
##$DFILT= <>
##$DTYPP= 0
##$F1P= 14.0000005364418
##$F2P= -0.99999901652339
##$FCOR= 0.5
##$FTSIZE= 32768
##$FT_mod= 6
##$GAMMA= 0
##$GB= 0
##$INTBC= 1
##$INTSCL= 1
##$ISEN= 128
##$LB= 0.3
##$LEV0= 0
##$LPBIN= 0
##$MAXI= 10000
##$MC2= 0
##$MEAN= 0
##$ME_mod= 0
##$MI= 0
##$NCOEF= 0
##$NC_proc= -4
##$NLEV= 6
##$NOISF1= 0
##$NOISF2= 0
##$NSP= 0
##$NTH_PI= 0
##$NZP= 0
##$OFFSET= 16.522
##$PC= 1
##$PHC0= -50.11475
##$PHC1= 2.042315
##$PH_mod= 1
##$PKNL= yes
##$PPARMOD= 0
##$PSCAL= 4
##$PSIGN= 0
##$REVERSE= no
##$SF= 250.13
##$SI= 32768
##$SIGF1= 0
##$SIGF2= 0
##$SINO= 400
##$SIOLD= 32768
##$SREGLST= <1H.DMSO>
##$SSB= 0
##$STSI= 32768
##$STSR= 0
##$SW_p= 5175.98343685301
##$SYMM= 0
##$S_DEV= 0
##$TDeff= 65536
##$TDoff= 0
##$TI= <Analysis number 999999
Compound Code 99
Book Reference 9
Project Code 9>
##$TILT= no
##$TM1= 0
##$TM2= 0
##$TOPLEV= 0
##$USERP1= <user>
##$USERP2= <user>
##$USERP3= <user>
##$USERP4= <user>
##$USERP5= <user>
##$WDW= 1
##$XDIM= 32768
##$YMAX_p= 353751124
##$YMIN_p= -271847
$$ End of Bruker specific parameters
$$ ---------------------------------
##NTUPLES= NMR SPECTRUM
##VAR_NAME=  FREQUENCY,     SPECTRUM/REAL,   SPECTRUM/IMAG
##SYMBOL=    X,             R,               I
##VAR_TYPE=  INDEPENDENT,   DEPENDENT,       DEPENDENT
##VAR_FORM=  AFFN,          ASDF,            ASDF
##VAR_DIM=   32768,         32768,           32768
##UNITS=     HZ,            ARBITRARY UNITS, ARBITRARY UNITS
##FACTOR=    0.157963299565203, 1,           1
##FIRST=     4132.6476996994, 0,             0
##LAST=      -1043.33573715361, 0,           0
##MIN=       -1043.33573715361, -271847,     0
##MAX=       4132.6476996994, 353751124,     0
$$ Real data points
##PAGE= N=1
##DATA TABLE= (X++(R..R)), XYDATA
$$ [...]
28736 35036 22851 2754 -7209 15529 44402 126694 159601 108378 80548 92240 84440 84901
28724 84901 115459 141591 130597 126699 155199 175108 177445 178879 125679 73066 71985 75329 83010
28711 83010 105542 110374 98464 109868 152808 140757 131235 156785 124492 55637 46550 47810
28699 47810 65165 96450 40236 15368 35867 60262 59381 46135 74922 105403 115761 139492
28687 139492 176522 171870 121546 113266 137918 125441 84590 88076 142079 174283 176454 158803
28675 158803 167562 94101 166399 194552 153963 108969 64729 53236 51627 14672 9237 22268
28663 22268 17080 35376 55772 81813 126455 100798 78030 24595 -6658 -33484 -1818 -29459
28651 -29459 38009 62847 64332 123154 144451 166845 184973 199049 210439 222918 206775 181838
28639 181838 125824 151393 167274 109734 58590 107160 170295 231343 266114 256821 178247 95041
28627 95041 72242 148688 161062 205889 194714 171539 151609 162661 136842 129147 110951 133159
28615 133159 189342 136082 131860 121580 127240 132763 128600 75293 41367 85782 141930 117727
28603 117727 76618 79674 94697 69403 81011 88930 69951 63352 123414 173708 170798 149112
28591 149112 94903 78221 80289 110569 150716 164424 154667 186074 197574 178590 142749 101327
28579 101327 25530 28869 39059 42273 77872 100182 127628 124048 100391 105297 74423 37480
28567 37480 33329 34576 52438 73008 81168 113077 159526 188241 204495 154262 143462 92378
28555 92378 29434 29367 74068 102903 150136 163293 163894 170718 145463 145567 151711 92273 116384
28542 116384 129557 137662 135068 81261 99330 123655 177393 182243 130825 85442 148005 127136
28530 127136 85286 92365 82055 135802 180769 131102 112333 133404 163942 192062 226582 223342
28518 223342 189544 135965 158718 191877 241376 223276 196970 230299 223719 212890 221091 206937
28506 206937 184757 168730 140533 136450 239792 263220 279087 231460 186473 185714 198519 202979
28494 202979 168920 130626 135788 114844 136193 149512 168480 179796 216965 210478 221286 245107
28482 245107 194016 161011 186729 246331 246931 271317 330836 329246 300650 259673 190302 209716
28470 209716 223614 251206 284659 288504 279672 278280 291516 299053 268300 283130 321681 309321
28458 309321 260708 274350 299995 258108 214934 224830 162035 133948 140503 198487 199810 184027
28446 184027 150861 110527 174054 148241 150782 167845 198472 216182 220629 160728 96468 159552
28434 159552 216842 208382 198315 215535 201772 173021 134862 97659 95367 139348 150577 169206
28422 169206 150710 154825 184502 204877 244835 165777 109024 109439 166567 225680 182326 117383
28410 117383 120724 117768 71542 53347 93654 116031 133490 155871 176076 225616 231359 211729
28398 211729 204734 229500 263079 285317 291146 258583 196732 162488 183867 218106 236542 245541
28386 245541 238729 241131 185219 217912 244179 228911 269602 306369 318113 239701 168187 144794
28374 144794 165176 157066 182039 204963 158131 108294 163544 237650 250644 200992 174172 211906
28362 211906 270571 227402 265731 242844 240235 227264 246301 211133 224760 211125 216460 245363
28350 245363 278976 236026 221736 224049 222050 231132 201505 201408 229999 221005 227870 264441 263298
28337 263298 210239 196082 176528 152136 185637 307792 333157 271955 196154 218532 218978 187257
28325 187257 231830 246999 230042 250741 295925 253002 230701 240711 168389 152371 157801 191057
28313 191057 210349 195283 182232 195685 210952 257892 323181 328809 279539 221360 233068 285267
28301 285267 309768 267517 241701 232978 194245 220416 233318 242459 258730 232272 261350 265405
28289 265405 270654 173013 160847 236354 296179 242908 276926 348274 278145 226544 157487 169678
28277 169678 172627 202475 243421 284006 270142 217290 252679 341656 323172 296066 292747 339397
28265 339397 353562 327222 314508 354895 350370 333415 357266 335211 325537 394645 397700 405918
28253 405918 397665 331515 335989 402506 395101 413195 435883 380865 363710 351809 377422 380118
28241 380118 385833 437784 414104 354737 307085 301729 257690 218258 231128 264225 283261 292158
28229 292158 291928 270287 272784 314347 337329 283148 287023 318247 284741 325122 370770 370589 352731
28216 352731 363468 373253 292454 315041 391091 386968 313935 241301 249579 264216 243175 233617
28204 233617 246146 322024 339023 280970 242070 253394 262220 303038 363713 292958 194306 172329
28192 172329 216369 309853 381172 362748 381669 389214 328349 336264 339336 373660 376626 385677
28180 385677 350570 323113 357033 372732 372596 358166 363775 362906 349764 297282 235600 250958
28168 250958 243830 237371 244599 272618 323547 329637 318588 292118 311765 329841 300975 300970 338856
28155 338856 322369 321799 342655 352320 295631 276911 295425 284420 267369 287275 329190 358810
28143 358810 373320 322494 321017 348075 409667 368910 319988 380805 420100 419619 411124 433081
28131 433081 370654 362032 302707 260837 290865 324719 339032 397457 457855 445083 409301 416311
28119 416311 414491 443706 421197 372257 325382 314511 339562 387372 385371 385804 389354 314983
28107 314983 323422 318091 322257 377575 387848 431264 420318 432598 440122 439036 441646 447045 462302
28094 462302 382269 330398 372152 344465 337978 383260 423669 398188 391564 356231 288897 295915
28082 295915 338857 326153 345205 370528 405373 345746 345825 401126 438972 487560 521694 528801
28070 528801 536354 558000 577737 497772 406160 419690 479097 502900 460461 470229 428922 401961
28058 401961 420630 418706 442795 432818 405564 373078 381902 412197 415826 413962 415356 430050 388039
28045 388039 372628 376728 413440 362109 319816 368925 417293 397132 414289 421115 404089 404148
28033 404148 422273 402529 366000 374212 425618 468488 431378 366119 371341 379216 382629 411118
28021 411118 362841 393870 419891 470079 485189 467248 490037 481497 455010 484661 491630 470870
28009 470870 455506 490073 541611 554711 525264 474239 431886 406715 403488 397639 433731 444427
27997 444427 407687 445272 484503 489224 501688 474632 488915 538835 532329 528554 545506 536363
27985 536363 527852 517710 517397 526342 555370 555019 488042 529408 504204 516677 533008 557884 551125
27972 551125 568769 548020 522828 519513 504244 526670 558794 528123 515055 521051 497314 550221
27960 550221 542091 544210 529545 504962 475285 457695 469438 432053 446460 499867 484933 422673
27948 422673 375308 461097 542466 624353 560256 454858 443265 477920 545208 582473 618077
27937 618077 661764 638944 552732 552347 612745 644904 644165 706277 711909 638940 541359 502119
27925 502119 523058 588982 598110 559517 565848 598715 614613 601835 587182 601110 583466 540826
27913 540826 526651 546849 547040 505674 536765 548394 575626 581474 536853 556819 553225 535714
27901 535714 543335 555100 614562 609450 589493 570643 520461 513107 515945 547028 512725 507434
27889 507434 499021 572854 585507 536892 510306 530674 573217 667948 613720 543444 574651 603257
27877 603257 596036 586791 577507 600103 628596 631550 584161 631386 604295 563716 552521 557901
27865 557901 586457 604990 593263 534120 517204 480820 497301 571254 607782 632361 634791 688503
27853 688503 724565 657503 592885 569954 551079 660040 688893 680561 675346 668165 668335 660230
27841 660230 658917 687293 682951 695074 744752 714404 683197 655119 651083 667284 628961 561792
27829 561792 612760 696099 709608 718360 716281 726510 723570 718320 746368 741324 774952 780048 753837
27816 753837 699691 633136 670114 699761 709701 714326 696074 722968 783282 727828 669337 666968
27804 666968 725056 717347 745613 748925 786373 724081 634426 660455 713203 718598 793955 803290
27792 803290 734226 646410 635642 651356 710538 719765 681291 659746 662550 676935 669091 751467
27780 751467 784105 749619 767654 802241 835473 812902 845631 915154 890662 837710 811079
27769 811079 755768 785134 826800 783081 780457 782082 761894 787376 817262 815250 754588 719436
27757 719436 746422 755389 717175 693966 697308 730107 810088 822303 767560 792945 800851 787773
27745 787773 813743 790511 811388 785745 815379 852193 803591 721127 726662 771922 864455 878470
27733 878470 806388 822278 863154 903874 872668 851590 792269 766981 739516 744943 766563 843226
27721 843226 884594 851019 795628 765603 776644 852687 885766 890276 876204 919724 968224 932228
27709 932228 860388 854523 807550 782888 760715 748994 753399 813628 853929 887023 829854 849413
27697 849413 863842 886041 888506 902584 858987 800536 791088 805330 821832 849348 883227 968434
27685 968434 1015082 993101 915149 917812 960859 951355 957843 1006129 953324 930977 907684 878463
27673 878463 820319 822256 848581 898189 986883 1039902 1010830 994338 953219 944003 881291 861036
27661 861036 860497 849418 856614 830299 874994 885733 883849 951809 999399 975087 931452 866782
27649 866782 826970 839563 882949 996825 972403 910721 932834 944069 935809 965851 1014337
27638 1014337 966976 955922 965088 910449 893225 887819 896693 933831 962584 963520 945589 907342
27626 907342 890851 959421 917039 853167 857105 892177 924393 902218 910792 899984 866235 852972
27614 852972 846641 922142 976721 977272 909702 910890 893686 908550 1003028 1022753 1013641 975474
27602 975474 986255 1040711 1045646 932356 863780 859970 902737 927879 971023 1021367 1032236 1006918
27590 1006918 994736 991237 1044154 1100665 1052567 1049156 1052592 1056078 1031505 996802 954020 1005363
27578 1005363 1010049 1042315 1084347 1055230 971529 916593 925716 959166 1015079 1064309 1055966 1034934
27566 1034934 1004976 1023821 1049395 1078803 1116141 1115461 1099351 1038786 973459 1001600 1082268 1127342
27554 1127342 1136181 1097713 1049517 1064770 1086317 1075325 1092397 1132486 1128713 1165049 1176160 1118883
27542 1118883 1110495 1072116 1033688 1011205 985969 957970 916127 936735 935023 932144 933623 996349
27530 996349 1019940 1034141 972432 935252 926331 968181 1022258 988296 1040147 1075584 1135257 1084159
27518 1084159 1051412 1037044 1000293 1008869 1046585 1046298 1050955 990572 1005408 1087214 1084783 1089757
27506 1089757 1099194 1092031 1098180 1111561 1154907 1147496 1075027 1007995 1061091 1129542 1091131 1067875
27494 1067875 1085945 1090733 1103153 1093804 1048601 1066122 1041837 1056052 1055313 1044582 1090710 1120553
27482 1120553 1111789 1103362 1135666 1103763 1154265 1194499 1205095 1233325 1174319 1140024 1125425 1158789
27470 1158789 1151553 1099373 1114930 1107406 1093696 1097130 1119712 1128504 1085446 1080714 1134749 1137780
27458 1137780 1153653 1166590 1121768 1090725 1132892 1132830 1050306 1029591 1053868 1125953 1160382 1141624
27446 1141624 1092910 1082504 1156785 1119672 1128617 1184326 1245171 1232084 1179942 1129979 1139257 1176575
27434 1176575 1138092 1153218 1113885 1098999 1096184 1075576 1017731 986669 1001584 1051429 1066131
27423 1066131 1074216 1127051 1103637 1105119 1114406 1029975 1027879 1038304 1038933 1070530 1099676 1088651
27411 1088651 1049627 1030848 1106858 1179866 1160694 1100728 1085490 1105558 1097020 1062414 1065306 1035243
27399 1035243 1035641 1038755 1075359 1102404 1160213 1177617 1202214 1209954 1148545 1103499 1137854 1196364
27387 1196364 1208837 1181934 1207364 1153422 1160550 1136708 1133110 1100098 1139911 1149553 1153418 1146982
27375 1146982 1121528 1108377 1129577 1177930 1201785 1228763 1222090 1187272 1210516 1227719 1259876
27364 1259876 1249393 1215677 1208512 1209808 1168195 1148326 1213311 1251350 1252782 1213509 1153989 1069080
27352 1069080 1026252 1096280 1102671 1168697 1218318 1174441 1181750 1148139 1153235 1140301 1053894 1048934
27340 1048934 1083160 1107093 1068907 1016401 1002308 1083459 1093549 1069554 1103223 1106520 1057012
27329 1057012 1053360 1072845 1136171 1124302 1057858 1107230 1114136 1149307 1185836 1138251 1105721 1053062
27317 1053062 1016004 1078476 1153202 1117873 1084493 1034887 1059507 1114722 1145928 1169119 1125882
27306 1125882 1111391 1074925 997599 993263 1058118 1079719 1119295 1126558 1078336 1051375 1131326 1138257
27294 1138257 1146693 1169654 1141129 1125301 1132466 1141277 1126975 1049968 1068487 1061606 1056447 1169555
27282 1169555 1202346 1184627 1172362 1200262 1175506 1188347 1211733 1199760 1203182 1183278 1171996
27271 1171996 1090843 1057137 1089084 1152691 1206120 1189845 1143501 1122887 1085564 1104341 1094750
27260 1094750 1058082 1028193 1061547 1133641 1160652 1143594 1073968 1051489 1077512 1091490 1074503
27249 1074503 1043148 1030666 1073215 1101780 1102475 1064823 1092459 1042099 1033211 1052635 1055870 1023093
27237 1023093 1084379 1103779 1082055 1043301 1044172 1042370 1046212 1010409 1017588 1034694 1089052 1104912
27225 1104912 1039752 1072153 1080523 1105695 1119236 1177477 1129661 1149893 1112787 1086350 1092000 1041168
27213 1041168 1061235 1157651 1187105 1126463 1069612 1087425 1061777 1052048 1032588 1086301 1082528 1051453
27201 1051453 1104698 1093088 1050691 1052429 1023830 1052187 1074207 1070424 1063136 1010576 1075067 1072139
27189 1072139 1014617 925900 903997 976496 1034766 1053024 1075761 1045933 1069564 1060096 1073396
27178 1073396 1071340 985719 993799 1014363 1004741 1028058 1088694 1112285 1137854 1134852 1036683 957861
27166 957861 925513 936904 964375 967868 947287 946880 968768 978547 993653 970908 990742 1025910
27154 1025910 1069796 1110528 1083645 1068667 1062182 1027711 1023700 1040206 1122162 1171619 1103081 1069406
27142 1069406 992870 1036028 1054451 1018463 1044102 1064434 1032568 1022330 1015312 1016249 1007881 1011741
27130 1011741 1021856 1000350 982565 981583 1002911 990952 1024906 1033841 983843 948255 976798 969263
27118 969263 962795 989787 978441 987235 965170 945960 947657 932479 956031 960818 952585 906456
27106 906456 851399 860859 864636 898449 929355 947498 916678 883296 918906 965270 971216 973156
27094 973156 974492 1021928 966747 924576 873528 896733 894219 875835 928272 940982 994051 976430
27082 976430 873139 836649 852869 938979 990642 960778 968619 974709 1003793 978096 952437 904503
27070 904503 898165 808842 834280 956971 938814 871684 891259 941701 930614 959075 1001837
27059 1001837 1022706 1008755 1016169 1003361 958051 948047 1020757 962844 969305 966624 980210 938997
27047 938997 921628 881570 820287 820693 733520 765589 802298 855163 838061 805152 836372 823570
27035 823570 847365 823081 839556 833616 838376 825043 836469 829894 792469 785531 833537 867075
27023 867075 948180 1018699 990572 875858 820956 780647 812857 819329 836147 810120 810704 808967
27011 808967 804949 805366 793407 748913 773494 821690 867418 909231 878975 855645 871727 876340
26999 876340 860563 810509 832598 834838 843719 865748 921987 923970 895116 828289 793070 784040
26987 784040 832426 870687 861549 815603 793563 719037 724424 833605 898730 916633 874463 805843
26975 805843 791298 844579 816670 796051 736379 725337 734462 792989 802721 805814 814824 833861
26963 833861 834623 888902 914509 860885 800075 805644 875564 863783 778279 719782 707593 693666
26951 693666 742143 775219 751573 760206 825451 827631 802474 811623 828293 866085 855940 856445
26939 856445 832345 775219 801432 799101 728192 758749 853775 866166 807565 760347 764236 811777
26927 811777 767042 780275 739254 691311 644889 668126 689179 716383 752197 811241 849582
26916 849582 809046 739858 679562 651517 675954 692486 732236 768826 797323 773972 753113
26905 753113 761340 715227 740875 769833 773012 781671 780692 743737 789127 804012 786629 771442
26893 771442 745965 698315 709692 743238 749524 712651 660692 644728 663039 667398 726736 794004
26881 794004 827977 780600 733048 709413 674624 643311 644120 682874 681731 696166 786812 792041
26869 792041 710049 707749 745358 733227 707223 710305 679861 656159 697530 744478 700478 617891
26857 617891 661078 695455 672810 638366 596563 589335 637431 604361 590961 577059 578330 632961
26845 632961 666564 637460 618850 578448 591946 584999 594547 613914 694314 725929 679683 686064
26833 686064 692590 709932 658180 622237 652545 664304 659733 636649 613782 631673 584268 604509
26821 604509 628128 587931 594218 601407 600784 589756 631648 658452 660040 646488 656373 671663 649663
26808 649663 566906 534033 643989 697583 659280 689288 696718 707386 698169 723543 724323 743984
26796 743984 689167 669621 646112 657781 673013 619399 585646 531647 559862 591260 630285
26785 630285 651399 614704 602999 586879 605753 617069 601813 573644 556679 592452 628444
26774 628444 621049 579049 605168 646919 673889 663244 690455 635851 600447 598852 620561 571289
26762 571289 612820 669218 648800 577107 584138 637544 620367 657056 680573 665680 678382 689228
26750 689228 735560 690142 652616 592405 603257 593696 599978 525846 558527 573693 602306 638718
26738 638718 673231 684316 637688 586206 547724 571627 616621 659652 593535 561692 579654
26727 579654 600984 621947 633672 629257 600843 551685 612954 605472 562834 547118 593814 604574
26715 604574 583896 504591 492080 442257 470957 519754 478681 411086 478416 504598 539495
26704 539495 534315 504655 459422 498194 526219 544839 546589 523267 482270 449255 402083 414600
26692 414600 444801 411614 468390 485956 475771 490926 485434 438220 473656 481261 546834 603764
26680 603764 588381 541540 468607 436018 438974 444320 476868 452741 428390 436185 495177 494289
26668 494289 482302 491207 463464 436182 454224 453408 470020 528746 573739 517928 455335 417318
26656 417318 412961 435298 520884 538615 506994 418783 389839 412793 437657 459791 498172 560950
26644 560950 514366 477315 460335 421798 373901 436069 446870 420561 349135 364377 376017
26633 376017 415948 486912 479633 458551 460415 478804 488602 441248 492799 440815 439994 448939 432548
26620 432548 442829 458610 424783 389204 407776 443682 448135 466883 448036 415342 379765 395807
26608 395807 385205 315027 355464 403967 392092 409512 378476 354535 390431 392320 384970 407817
26596 407817 391924 384329 447148 437769 413377 424574 434349 403462 366701 409413 461118 483077
26584 483077 460273 462653 396425 346272 376198 366153 358634 412995 441276 406810 423654 452181
26572 452181 445026 481791 520028 551386 526321 445783 378205 415212 436917 392813 390500 409199
26560 409199 426864 428758 299476 251023 300274 385446 460901 458054 407267 420728 411509 400967
26548 400967 433695 390378 415688 434432 425430 434534 452653 427123 416251 364341 323642 333018
26536 333018 359822 416851 410419 394140 346589 351991 383978 430030 434962 425092 435478 372740
26524 372740 390883 398857 365500 336826 334333 400325 369193 356272 354838 361002 358324 330335
26512 330335 297952 314109 278689 269335 376188 394290 388199 371071 361727 402265 383757 353102
26500 353102 370691 432461 447598 435274 390016 335457 375421 362154 357917 343156 309737 315703
26488 315703 337917 304980 282422 283914 224360 293040 316352 302571 311753 288867 298234 329452
26476 329452 345412 329780 270028 323090 400026 363038 350729 356843 298854 311187 331506 354732
26464 354732 368135 321700 291443 280979 327393 410493 494577 490457 413217 375928 361637 365253
26452 365253 329426 316625 277015 277985 331307 353274 342507 317663 291629 289811 271412 278035
26440 278035 288011 295542 309844 260411 220323 203194 189793 199229 228077 269735 229363 214145
26428 214145 239695 178941 145559 187285 220593 272272 260267 255276 254090 259165 314487 286403
26416 286403 274971 375041 367830 386996 417133 406984 376303 351511 327333 340413 333238 304530
26404 304530 303259 334735 342853 343779 394518 400999 331278 318104 316787 344326 405765 466109 443685
26391 443685 375903 345670 322058 329963 321866 267021 278169 236085 196972 220546 242339 266475
26379 266475 288369 250710 211053 185127 176390 173352 151566 153259 215677 311832 323134 274809
26367 274809 254326 230951 216462 243501 267766 283198 313301 365594 369250 396327 369966 271041
26355 271041 225132 213604 192280 188292 202657 207012 154767 148268 214645 213753 188204 183058 241069
26342 241069 215005 244889 256115 260584 296103 320300 327583 344125 359078 300340 264523 212998
26330 212998 254536 343870 331000 298014 297497 354742 383439 374481 369968 390203 396132 333836
26318 333836 273088 248695 216437 205783 233473 286190 296736 276263 252943 275052 226195
26307 226195 222473 266799 281899 267617 172814 146893 164982 204917 236008 269226 243925 197517
26295 197517 151963 155823 206567 260146 267859 238575 254933 286369 298630 314609 294280 228063
26283 228063 212275 184857 186477 178327 189841 222704 214857 215368 253894 266359 277848 309097
26271 309097 254354 197157 172105 189263 188934 167027 189675 245252 235796 250225 254276 221690
26259 221690 227447 190733 199238 233564 185559 158672 157506 150850 142830 193229 180888 157375
26247 157375 150373 134155 168661 207102 231910 163421 144068 190583 205022 212035 192791 235232
26235 235232 256842 183513 173024 161771 94882 137091 152097 192120 220974 210762 163961
26224 163961 109154 188690 212349 238551 199374 165375 194414 151992 148864 196498 168423 124363
26212 124363 123278 137823 127529 152359 154665 146319 154999 221424 255341 250269 203301 188107
26200 188107 183246 200860 200070 217921 233084 220389 173234 245400 288920 284033 281863 240630
26188 240630 222314 246126 241600 251628 211285 201654 208943 229323 181606 192296 199056 202185
26176 202185 211092 258810 249089 192229 210825 291080 263371 214867 261858 247505 279465 295927
26164 295927 249658 231792 233935 239512 229514 201586 212258 255221 255477 203091 165034 173216 138561
26151 138561 137460 160927 145449 171913 182725 179016 122282 100933 111187 97341 123420 139813
26139 139813 100646 66452 76300 108426 177887 201387 184810 248676 263742 256080 228109 169478
26127 169478 175528 207837 226912 265512 246767 191194 144110 133859 130568 117209 96676 109034
26115 109034 138875 102173 108363 136171 143134 149898 125289 127964 119886 119483 125157 115801 121602
26102 121602 134281 178516 206990 193279 240100 266959 328583 315357 256868 191904 237553
26091 237553 316573 267420 225944 204004 166473 99726 107459 103771 154128 163245 158200 150034
26079 150034 131791 172790 182431 214604 198248 195485 199917 142528 126176 166737 249541 292227
26067 292227 201375 133875 140198 115549 100493 69326 165339 166845 161093 142779 154750 154007
26055 154007 203823 188804 130283 166826 155389 147355 201387 217294 161167 151800 189848 193086
26043 193086 230399 204380 135877 115998 143419 185888 209446 189608 157749 111337 28803
26032 28803 27365 76597 110522 96714 94290 111138 183760 198081 139843 154277 209340 220453
26020 220453 200836 228034 237391 159693 178548 218958 207342 150058 155819 199379 213811 144428
26008 144428 149418 195379 237472 178736 143919 167979 168674 201392 211969 229596 227915 188569
25996 188569 126934 143922 219960 271126 273699 233913 167479 126260 129928 106196 63099 99932
25984 99932 152395 172263 189452 182548 187511 172654 176291 193251 134724 46318 95901 122532
25972 122532 139341 164675 139058 144139 176403 172396 124379 134681 176292 178243 150828 164506
25960 164506 140952 139487 132638 138783 134361 146369 127891 199613 213545 161209 156274 215783
25948 215783 254111 255246 183564 119288 97740 82305 157378 162589 114538 149385 193493 195098
25936 195098 177584 134585 148661 120069 20074 36459 109804 85305 40811 46722 84122 74946
25924 74946 49661 98029 177396 168227 121469 79324 138105 215597 232384 217822 206779 226873
25912 226873 189189 151231 170009 187027 176643 167418 116048 31103 55820 94900 155088 182043
25900 182043 156052 172718 174245 176902 163546 164865 181141 154997 157482 179698 184870 282272
25888 282272 295138 139668 54947 67017 125673 160851 135534 98611 68037 145727 162201
25877 162201 151478 141644 107533 109328 149013 155803 178865 168566 116196 81182 91019 41723
25865 41723 22393 33001 19447 47173 106604 125856 122518 117515 78586 32087 53601 102106
25853 102106 94733 126337 123686 65645 60266 61246 67031 83637 93117 116823 139647 134966 97159
25840 97159 117589 158243 179004 205572 167939 72855 77579 106916 89987 104537 81980 70583
25828 70583 66291 35066 114158 150355 117619 81874 32830 -26753 -3692 48441 96220 64988
25816 64988 48530 91039 159824 174009 99667 64212 96879 145197 164251 136361 76238 70322
25804 70322 105835 139598 171823 152844 142864 118806 167889 164387 159831 160019 142849 188122 196197
25791 196197 132102 105804 175138 216062 167631 108081 99494 39016 35938 34656 56218 85716
25779 85716 82751 160203 200382 161022 58419 65156 65899 95780 115127 74970 52365 85132
25767 85132 124392 145917 155485 132243 103469 151565 138411 145880 122086 112685 118944 108582
25755 108582 108298 115647 76942 58335 103578 189869 213887 190361 176683 180260 164617 140825
25743 140825 124951 81796 59515 53639 87480 94706 66446 66378 21387 -6573 -29647 -45337
25731 -45337 -33779 97983 150587 106435 37872 13347 92481 170117 219868 238400 163282
25720 163282 227202 211804 137000 91111 77036 88827 114541 91267 28416 70371 157993
25709 157993 181125 143133 132318 122553 139435 158200 134124 82586 46175 45158 94283 90778
25697 90778 80245 38272 67232 115309 119464 53236 18950 69855 155479 127165 183971 201837
25685 201837 162803 166490 207862 172825 138182 93487 8561 -3399 51181 104112 134824 173258
25673 173258 176557 173257 127722 17671 25873 20226 39747 59090 83914 100367 104842 89615
25661 89615 64141 131269 184873 190237 127264 86054 119654 121113 105900 116087 95919 51509
25649 51509 60561 91312 108627 100390 117712 76792 25456 51281 79297 77099 103767 77585
25637 77585 12282 10449 -12150 -45017 -82615 -67872 -29491 15756 83720 136672 104975 83857
25625 83857 95359 164625 124543 93510 82742 87400 75567 84335 106349 112797 122239 114075 126815
25612 126815 53188 25466 25913 15951 46877 60350 58592 67742 26236 48052 121134 101154
25600 101154 43005 40743 86101 99416 64347 67816 94325 87240 47535 35852 34621 55371
25588 55371 36930 51118 85512 118665 92321 95261 78629 143867 138108 96531 79554 124845
25576 124845 172189 140437 113948 101073 107900 84138 112511 76277 63040 49024 26323 54065
25564 54065 13894 32863 -13898 24638 64260 27678 33715 34219 73685 57435 -11702 17066
25552 17066 82003 61248 48053 62882 -15321 26490 87894 47618 -3366 79422 126759 120120
25540 120120 113028 132930 147198 118007 60687 19869 61332 15550 -20540 -9759 539 36940
25528 36940 36022 -13251 -14589 39037 45945 74348 99934 69609 49707 101386 100580 55163 24471
25515 24471 9613 55782 73193 66994 67433 37395 -10292 -6848 -8727 71621 110141 115622 144258
25502 144258 115775 116863 122362 97834 121264 134703 143509 140783 182310 147791 94001 69451
25490 69451 82165 115434 177454 173900 150394 165259 173214 172083 140827 101470 106696 148603
25478 148603 190623 161176 98398 41729 53189 75442 75592 54911 53674 37417 -12706 -54491
25466 -54491 -32993 -31704 -4085 16601 25554 105386 96215 42236 100580 139268 84255 18454
25454 18454 -9546 20407 85568 82316 -23751 -33392 -28460 -25627 -28673 -6303 21765 13138 -57664
25441 -57664 -106289 -56477 -9094 19315 41939 102119 136257 72901 84243 102792 138475 180873
25429 180873 61332 2832 23377 15792 44699 21083 324 24581 31828 19316 88840 133942
25417 133942 93606 83005 78650 84709 83729 58502 16721 -17637 -47904 -35042 228 49295
25405 49295 54253 9331 26427 -16609 -14845 53247 134779 141271 117013 111282 35082 49263
25393 49263 126546 91030 61802 54222 -19441 8531 29181 -9043 -36260 -26952 38451 76189
25381 76189 20673 -39634 -61668 -27851 15579 21949 11839 -11698 -6789 20691 13681 28487
25369 28487 58292 127525 134342 150445 150297 139783 133051 160857 137246 155539 141991 57608
25357 57608 1076 -26220 -15773 39035 96941 111587 172723 123552 64141 13370 -24147 2648
25345 2648 72892 56485 44922 15251 -17340 47116 54557 51276 87320 67665 99802 99018 100200
25332 100200 101510 61080 48057 65915 36554 -2885 -2150 22362 34694 58752 28190 52835
25320 52835 20368 26691 30514 43618 20690 71984 63111 67552 38443 -12752 -3582 14214 -27728
25307 -27728 -61987 -14614 -19488 -33285 -25458 -45247 -31569 -14538 -42744 -51672 -18053 -13998
25295 -13998 3435 18478 40659 29820 68001 47573 72888 82122 69210 27686 52057 82953
25283 82953 24350 -349 5295 -12520 -1205 60822 70541 68468 43570 62672 80652 46699
25271 46699 32980 33868 73150 47793 66296 89635 132945 114754 120466 126774 82265 45172
25259 45172 34702 70108 66773 65247 54244 87152 60516 42634 -21434 -60551 -66231 -90623
25247 -90623 -71358 -32000 6450 77244 135388 108394 91415 81241 73856 37813 -971 30311
25235 30311 68608 74357 75911 19605 11043 -18184 9253 57466 93552 92770 69846 78905 143973
25222 143973 151190 70321 39807 -2609 14752 13736 33525 49324 84893 87895 103852 123480
25210 123480 135456 106099 85682 80628 121810 95286 33829 -29403 -34103 19402 65056 63523
25198 63523 28892 -16504 -3504 15058 23597 35694 70637 86629 45739 40678 115065 98694
25186 98694 14922 54603 63068 -35136 -60860 -55280 -49557 -10543 -5082 -44560 -7564 -10522 1694
25173 1694 6142 -17298 -57844 -53610 2447 36465 -12983 -39135 -32987 12670 -5462 35600
25161 35600 61975 52491 46825 73393 30771 34550 45833 57033 47709 83773 23761 -22461
25149 -22461 -3261 42269 -33786 -91499 -66772 -10596 50434 81477 80369 33080 13733 6872
25137 6872 21030 -1032 -15174 -30272 -36526 18641 18856 -19992 -66103 -73985 -78959 -49790 -4537
25124 -4537 -20680 -38522 -8264 39447 112699 130305 143956 77914 41661 87144 90042 30692
25112 30692 61358 79774 75725 40929 32367 11350 35295 55364 54822 79333 103796 115237
25100 115237 105929 75900 36705 35016 39064 6812 20479 44229 68571 34351 10071 21806
25088 21806 -41127 -54058 -2421 -15588 -28911 -23527 13561 27624 11867 31874 15695 3944
25076 3944 33328 79413 86437 7308 -77271 -62871 -5401 27456 57395 88985 98500 39870
25064 39870 7128 -4565 -54440 -5124 40043 11598 43384 34681 13967 36977 67547 28984
25052 28984 -4262 -48438 -12669 -8319 -63418 -61873 2486 47392 13340 -10399 10760 109214
25040 109214 163902 142974 117540 157508 146197 97690 75588 59407 65010 37877 26490 48123
25028 48123 128166 110320 54116 6355 -13161 -15333 -32113 33876 103617 105493 44463 72574
25016 72574 95147 51108 33125 -747 -41815 -42311 -64512 -76561 -35677 4906 10664 -10696
25004 -10696 12143 -6714 -24178 8827 6971 18936 45987 79803 29113 -57138 -91347 -31580
24992 -31580 11795 15121 40879 53150 53369 79742 57709 24913 33108 9260 13272 26823 50815
24979 50815 13393 -23429 6598 2460 -39187 -4501 51391 81978 51916 52204 83329 109865
24967 109865 80141 75067 93042 108574 77553 52087 70789 82842 43595 30430 69462 23937
24955 23937 37358 104467 73700 10186 6782 7900 41563 49751 -15048 -58069 -42725 -26868
24943 -26868 -19339 20635 75781 38361 11672 -411 -41452 -56142 -19808 54662 41343 14029
24931 14029 -13414 10998 -14996 -24182 -31563 -13273 -12182 -22374 -20249 -3629 14589 19879 38270
24918 38270 50226 21465 -7517 -56212 -30341 40674 91444 78878 28431 38761 39421 22062
24906 22062 -82618 -81154 -48813 -59014 -127233 -80720 28370 31468 71393 93377 45185 -29017
24894 -29017 -37274 -45171 -51478 -52038 1143 17765 32576 39942 51133 34094 -13812 -30801 -30720
24881 -30720 -19299 1479 19524 -25933 -36936 -30076 12984 39084 8152 -15187 -39056 -6151
24869 -6151 44522 63875 51436 23652 28662 77547 62152 1117 35682 112340 56631 18402
24857 18402 58535 98093 95323 71973 68496 81943 98570 56453 -16443 -15329 -20633 1251
24845 1251 41637 54023 1799 -27727 -5060 22748 41034 91172 109971 63333 17949 24154
24833 24154 66060 39085 104996 125535 104291 85444 102142 50102 42145 16435 -11695 41335
24821 41335 81892 119594 90636 73469 107149 140490 161373 55879 63368 76405 43365 42361
24809 42361 16881 -37231 -27989 -49488 -1234 58277 52437 36613 59255 4646 -55536 -39778
24797 -39778 -13183 -31902 -66703 -100078 -84455 -1084 29873 38021 53090 75051 23789 441
24785 441 -26154 2725 33297 17465 -51250 -45925 21238 -23730 -34303 63169 24520 -45271
24773 -45271 -92816 -75132 3372 43938 -52027 -95301 -53507 2514 13953 62969 54496 16099
24761 16099 22646 20732 55892 74316 14997 -18157 -6498 -1442 -67332 -106774 -102774 -100242 -71420
24748 -71420 -96813 -123626 -71520 32844 36949 25318 55012 50493 -12070 -30106 -106020 -41795
24736 -41795 3830 30257 39478 62853 62803 69782 47908 33312 53072 73903 62717 71729 54996
24723 54996 -6445 -13722 -17383 -50398 -42411 2547 428 -33746 1634 14429 47879 74926
24711 74926 68566 80691 55847 -20978 9874 11802 -16533 -16030 -19357 17235 68835 83352 17780
24698 17780 -14513 2747 -8495 -10234 25570 23935 -1678 -49944 -24270 44581 20358 -14399
24686 -14399 -5864 31107 2860 -45479 -84511 -83923 -44886 -25664 -4771 61883 61871 10966 -42223
24673 -42223 -56834 -86562 -83748 -93148 -48772 -35981 -40749 7838 7149 10865 74864 54990 38469
24660 38469 47920 58428 17463 -55336 -52671 -47216 -51842 -76067 -36121 -648 -4526 -35471 -13539
24647 -13539 23993 57114 19105 41468 81922 54128 21281 -1521 9379 -23089 1738 72293
24635 72293 85308 90506 88695 115919 114942 63793 29385 -38905 -103759 -82686 -76067 -47567 -47763
24622 -47763 -80859 -55483 -40405 -11333 67353 63000 17230 -7681 -12295 -17654 -7441 -40219
24610 -40219 -67742 -89008 -40253 26802 -39323 -43552 -30721 -7032 9175 66696 65234 26371
24598 26371 -9016 1576 -33690 -52413 9722 76748 76116 38311 26069 -15407 9016 -16273
24586 -16273 12869 42181 -17623 -110770 -116096 -28649 -18029 -60933 -46426 -38336 16560 -1269
24574 -1269 -127106 -130571 -45148 18205 7464 41963 53029 46415 24209 -14618 -49737 -14799
24562 -14799 -29125 -69447 -87974 -65954 -37668 -82948 -96220 -82071 -59443 -14747 14706 -4940
24550 -4940 -37998 -30883 -11478 7058 12118 5269 -51729 -48306 -37824 -97543 -84095 -14009 -9013
24537 -9013 32428 39634 49517 44112 16656 12030 13799 2109 61417 95483 31911 -28526 -52545
24524 -52545 -61541 -65177 -22984 59897 76893 49164 -37159 -77403 -53569 -71781 -61591 -40134
24512 -40134 -30268 -24937 -11332 -44486 -82041 -26861 34950 65580 1123 -58713 -15556 34073
24500 34073 28474 48445 37713 19624 43450 49513 16339 20958 57849 65870 27568 10482
24488 10482 -9239 8388 11037 34352 -21317 -14244 31151 19682 20298 9183 -52767 -31458
24476 -31458 -40055 -66968 -40930 -23664 20392 47187 28485 4994 18013 26223 29404 40190
24464 40190 89972 19082 -16653 3084 15234 15494 38794 -21395 -55582 -83363 -88901 -69937
24452 -69937 -66481 -6535 34643 45120 60724 64844 80349 76823 47348 84255 90732 71716
24440 71716 22117 88984 28571 23991 48475 17831 39548 57927 17096 28584 82382 104019
24428 104019 66778 60344 57950 74315 52862 21987 59700 46493 26232 25155 24560 45251
24416 45251 21905 -18756 -51084 -23639 -7713 -35081 -48651 -53906 6973 7141 -51305 -37704
24404 -37704 -34873 -100102 -127722 -107468 -84256 -32901 41291 63451 31871 68624 49807 22942
24392 22942 19741 22719 16146 31862 44498 -282 -67022 -88235 11774 57989 -15071 -80452
24380 -80452 -128882 -96247 15164 36475 -8765 -18434 41547 54534 53029 1754 -46244 -61546
24368 -61546 -56327 -38674 -24271 -56405 -33487 -64251 -82273 -73524 -73195 -68055 -93987 -57443 -23207
24355 -23207 16552 62609 96583 128876 102937 45148 60272 31595 -54797 -72730 -76787 -125562
24343 -125562 -107726 -104356 -105628 -95178 -70466 -62885 -58772 -52548 -31080 -98353 -103405 -69096 -55952
24330 -55952 -35935 -20470 -22776 -27003 -52331 -71135 -106661 -62190 13572 32125 -44651 -97422
24318 -97422 -90215 -141514 -121714 -88311 -68229 -82464 -5512 7385 -29670 -125371 -104606 -88451
24306 -88451 -109028 -68318 -62622 -3630 42599 50230 124225 131309 79332 13108 -33922 -32557
24294 -32557 -31315 6426 1725 28389 32759 42218 7695 -19365 -67875 -84846 -17260 -29397
24282 -29397 -56231 -24337 -8988 -3797 -12830 -26785 -1637 -26401 -31064 -43589 -67547 -37764
24270 -37764 11410 17550 -12950 -37362 -9608 -12245 46816 47330 80681 71500 64962 79505 46745
24257 46745 -62861 -36136 627 30387 6986 -56193 -85659 -105640 -155546 -124463 -103633
24246 -103633 -63485 -68707 -92933 -80250 -16516 -49037 -48377 -48925 -27598 -31764 -15667 -22987 -21152
24233 -21152 10596 50384 100903 15058 -24224 -72509 -49777 185 -1916 -38413 -39322 -29023
24221 -29023 -13931 43709 25764 -6023 -37480 -58773 -55572 -29619 -56207 -77217 -55391 3343
24209 3343 -18038 -58277 -14042 14490 15935 21746 -50362 -96137 -79458 -84608 -153174 -136001
24197 -136001 -103896 -48550 -16801 9310 134 -31927 -1913 35283 -29718 -51261 -3959 2897
24185 2897 37105 30105 52300 60432 12046 2779 25592 17032 -23447 10427 39609 25604 -30865
24172 -30865 -63493 -132063 -78065 -12807 51223 80680 37283 21520 4901 -5501 7341 -29659
24160 -29659 -68820 -46622 -45756 -48778 -66878 -74446 -82561 -31601 -38497 -80333 -83303 -45174 -30063
24147 -30063 -25351 -46691 -76595 -108473 -44060 -48352 -122066 -119003 -114028 -55551 36250 53955
24135 53955 14875 -7368 -14980 4700 12875 -7539 -77405 -54965 277 -42171 -87763 -105963
24123 -105963 -74906 -53445 -57895 -54863 -40751 36245 48858 1576 -38069 -52741 -35627 -13861
24111 -13861 5029 9131 9908 -37365 34025 76350 48332 32848 -27889 -49571 -72755 -55558
24099 -55558 -69495 -84118 -62965 14256 22345 4226 -6958 -2320 -20102 -32415 -14737 -47948
24087 -47948 -69050 -62681 -52245 -97731 -116486 -101652 -112087 -110316 -82820 -60086 -24260 -136308
24075 -136308 -120540 -111805 -76674 -78458 -71998 -59160 -11322 -45433 -116474 -132902 -127025 -84014
24063 -84014 -58320 -50603 -42755 -36918 -48869 -57654 -39969 -105480 -116533 -47544 6829 -5630
24051 -5630 -26199 -9277 17480 55705 64388 13232 -13830 -54651 -18124 -39865 -65734 -15834
24039 -15834 -11117 -30512 3377 26529 -5889 -30227 -19571 -20826 -10326 -88794 -127069 -105839
24027 -105839 -102901 -124842 -103971 -66435 -71289 -70701 -117794 -121508 -86944 -33688 -30898 558 25654
24014 25654 19960 -18392 -24997 -45789 -37976 -30033 -45826 -15023 -30843 -20529 24675 -30984
24002 -30984 -105744 -87987 -82377 379 52766 45240 -37540 -60394 -36278 15925 83367 18649
23990 18649 -45892 -95434 -62891 11243 88180 112948 85771 45747 21279 36115 7857 -4689
23978 -4689 -15184 -43312 10654 52143 97893 106748 45088 13179 -912 4643 -22304 14672
23966 14672 32701 -18340 -61674 -49274 -43739 -30052 7758 -20367 -34547 -55867 -45303 9905
23954 9905 473 4805 6761 -13667 -37668 -40223 -40445 -9990 34716 49478 41614 33039 -39965
23941 -39965 -59456 -75046 -52756 -16848 -66702 -88233 -66260 -39818 -34210 -23787 -5232 42842
23929 42842 102753 120454 79543 37377 24505 50682 70662 59941 29639 -27567 -68872 -12664
23917 -12664 56443 73505 17972 -16768 -22053 -20953 -14819 -27662 -66606 -100943 -99805 -84600
23905 -84600 -96597 -57290 -44408 -33309 -36599 -21607 -17741 -16407 -308 -4559 -7387 -4841 -17207
23892 -17207 -50736 -46872 -52465 -105597 -132315 -151902 -102619 -40076 -62706 -97946 -69876 -93924
23880 -93924 -138109 -77588 -39755 -14653 35540 43054 13020 -42285 -80052 -32769 -12943 -6735
23868 -6735 -25242 -77908 -108972 -76144 -87302 -50756 -25870 -36090 -19738 -38639 -60035 -71414
23856 -71414 -90668 -86301 -67939 -55857 -126066 -148532 -149359 -106748 -76857 -50859 -29480 -74376
23844 -74376 -56948 -37461 -12969 23460 32444 18708 -34150 -36981 -48657 -71829 -57734 -68950
23832 -68950 -68471 -78969 -83892 -70039 -37679 -91473 -145505 -172979 -119017 -34269 4412 -32418
23820 -32418 -127096 -94901 -34086 -33058 -59265 -67443 -70579 -97088 -79311 -37755 -18469 -25386
23808 -25386 -29645 -45789 -25311 -90011 -106605 -85375 -68294 -26005 -26033 -56153 -54794 -45708 -28688
23795 -28688 -40151 -30458 -10258 4253 19339 73815 3871 -52414 -19647 -58334 -148175 -100007
23783 -100007 -99889 -129390 -76751 -76968 -102179 -98789 -76391 -31365 -19812 -7390 -22977 -27187 -58537
23770 -58537 -101320 -110701 -92127 -128728 -115456 -97195 -39694 -58043 -81380 -75693 -65365 -20720
23758 -20720 -6713 -58643 -163391 -128875 -113558 -74408 -77128 -56966 -87136 -84212 -53532 -56617
23746 -56617 -21007 -34301 -60100 -48095 -29698 16290 -23928 -57122 -107660 -132349 -130670 -155822
23734 -155822 -93740 -32696 16932 -8640 -1576 56947 3937 -47278 -102952 -67063 -53854 -27618
23722 -27618 -9368 -25475 -72494 -85227 -57435 -42782 -48788 -9601 -19619 -49615 -82632 -101914
23710 -101914 -106102 -71121 -89821 -129152 -85539 -104551 -91497 -65166 -39466 -79597 -155828 -172983
23698 -172983 -104483 -73174 -85424 -64109 -9317 -8771 -26427 -52257 -35816 35938 35023 39694
23686 39694 32387 44220 56852 29179 -38526 -68553 -142 73829 105862 63631 52650 35024
23674 35024 54146 37629 1278 -18039 -27117 -8062 11572 23209 92231 49410 -28956 -74480
23662 -74480 -63719 -74759 -92464 -115364 -107313 -26582 268 -8919 -20730 -33826 9766 24755
23650 24755 -30490 -25974 -24637 -42301 9785 79779 59209 17167 24256 15819 -43286 -48086 42912
23637 42912 25405 -26741 -68885 -64858 -44425 -56966 -120334 -150178 -102221 -42531 -14708 -10531
23625 -10531 -61915 -106075 -94304 -36945 -20095 -35592 -33490 -67688 -98885 -111963 -81141 -77833
23613 -77833 -34037 -16021 -86773 -85274 -51483 -72690 -117784 -79660 -59763 -40131 -25637 -10253
23601 -10253 -8305 -17413 24835 59578 62124 69941 51075 29790 -9684 -73496 -42255 -45117 -28036
23588 -28036 -11627 5202 2343 18325 8417 -31199 -70021 -51458 -46595 -22471 -36153 -58082
23576 -58082 -35590 1525 13961 14841 -10913 -16557 -25872 -5308 9048 -6958 -26127 -61010
23564 -61010 -89471 -74966 -67664 -56830 -97109 -99662 -87262 -61349 469 -3287 16347 41718
23552 41718 -23057 -45416 -107382 -106176 -83280 -46166 -42033 -76383 -82882 -77635 -92708 -101812 -117406
23539 -117406 -114240 -129913 -128649 -122968 -107642 -52036 -39497 -74684 -98632 -70352 -80510 -118850
23527 -118850 -85146 -63616 -45213 -48383 -58030 -78653 -72273 -55562 -19041 -47624 -75390 -18759
23515 -18759 6785 -1330 -50217 -60614 -64063 -57377 -49971 -36118 -43228 -63633 -53073 -39975 4564
23502 4564 37612 -4131 -30686 -59994 -59662 5818 -7746 -81258 -98106 -106785 -150082 -113685
23490 -113685 -37530 46970 -28930 -57367 -5276 5003 -18606 -49189 -72007 -82278 -162338
23479 -162338 -193116 -191154 -112255 -65241 -16676 -21725 -58969 -54169 -64219 -32351 -19159 -17938
23467 -17938 4156 -55095 -51520 16106 81245 64182 51477 49208 73094 61110 45415 18571
23455 18571 39835 -3206 -26730 -52348 -9967 14822 65675 93237 30702 -7760 11390 63646
23443 63646 70545 7160 -71904 -64237 -30181 -67622 -72999 -52832 -71111 -46299 -5610 -5187 -2108
23430 -2108 -24221 -56188 -53735 -8878 -7166 10799 -14325 -99191 -136768 -113267 -104036 -116784
23418 -116784 -120447 -105503 -64817 -64853 -38051 -20523 -42868 -56193 -93874 -132037 -139830 -103999
23406 -103999 -89208 -74467 -24601 16896 46389 76354 75916 21890 -21082 -1778 57997 95268
23394 95268 45027 41328 18254 38490 27068 -16776 936 5055 -95399 -86105 -3240 26573
23382 26573 83813 91915 63525 13382 6383 7475 18725 39713 32923 -44015 -25899 -21257 -18375
23369 -18375 28779 120106 131644 79902 42693 -5756 -58930 -96549 -81757 -26307 3676 -32857
23357 -32857 -85778 -56568 -50915 -74961 -39638 -211 64594 59717 38542 6995 -50525 -42300
23345 -42300 -76211 -115969 -151378 -175505 -140782 -98499 -135852 -137792 -110715 -132832 -164749 -52129
23333 -52129 -14485 28372 10230 -34852 817 -14968 -56588 -117620 -151614 -89205 -65225 -94348
23321 -94348 -88793 29885 26657 -23965 -25777 -19339 -14429 -23563 1439 -4477 -22988 -29941 -23947
23308 -23947 -31978 -11637 -21184 -55125 -86852 -117939 -117413 -86372 -39439 -41708 -23329 -13739 1187
23295 1187 -57080 -76536 -82321 -131217 -152036 -146173 -109664 -103389 -85649 -19780 -51211 -39211
23283 -39211 -33406 -75020 -122469 -97917 -56446 18234 -22266 -47548 -72481 -49188 -65172 -93296
23271 -93296 -53024 -85567 -127629 -141623 -139453 -153265 -90434 -107140 -138527 -97847 -40120 -64020
23259 -64020 -84557 -96749 -54711 -20326 -47572 -71176 -74242 -83003 -88355 -47788 24755 15662
23247 15662 -29154 -42314 -24869 -47948 -144194 -234231 -165356 -77037 -19430 17602 -500 26590
23235 26590 71642 45405 39437 25434 -55682 -36053 754 -55270 -140358 -125386 -70962 -62510
23223 -62510 18699 71521 67318 61672 53852 35552 42338 8851 -75464 -55075 -32101 -32412 -59392
23210 -59392 -20849 -25912 -11571 -38229 -40783 -29067 2011 24106 2820 -36096 -11435 -8137
23198 -8137 -13162 -5282 35705 42813 16252 -8711 -23877 8344 2596 -52059 -27721 559 12800
23185 12800 -19654 -58829 -99396 -57666 715 42473 47605 -38518 -72329 -84551 -55359 -51651
23173 -51651 -97484 -65173 -10760 -2457 -88500 -92519 -40208 20974 -28328 -60443 -35833 -55016
23161 -55016 -77864 -52298 -43158 -73952 -56408 -64391 -103099 -119213 -60071 51620 8514 -28630
23149 -28630 -20108 -42186 -93746 -89243 -55736 -76023 -167614 -145894 -32921 25830 -31108 -52305
23137 -52305 -61268 -50880 -60258 -23738 -67671 -96051 -93213 -113711 -33299 17573 -6588 -32300
23125 -32300 -57839 -53966 -49641 -55880 -57404 -38086 -36919 -59360 -67382 -75207 -96806 -52895 -58788
23112 -58788 -101206 -120098 -88259 -39124 -25907 -8862 -1358 29966 10213 19791 -21882 -55948
23100 -55948 -86253 -97198 -98490 -40667 -44616 -92927 -180518 -121079 -49291 -70693 -35859 43506
23088 43506 8761 -45493 -69350 -77995 -45327 -11305 7648 27970 -8045 -90137 -65915 -37315
23076 -37315 -62508 -84537 -60805 -58603 -107009 -151191 -130987 -82053 -76655 -134258 -142685 -128078
23064 -128078 -106263 -96553 -81787 -34432 -32625 -28872 -16736 -9458 24695 -629 -61744 -35926
23052 -35926 6451 6903 -364 -69806 -21485 -36891 -82146 -65342 -52369 -2907 -40088 -62025
23040 -62025 -62179 -91933 -59177 -78551 -120501 -71230 2909 -40064 -60032 -24856 -35932 -45048
23028 -45048 -43349 -47323 -129816 -84382 -35007 -70621 -109505 -90009 -71063 -58996 -45832 -22148
23016 -22148 -39151 -24808 10585 29300 63318 -18548 -87298 -104463 -42892 66044 66137 53252
23004 53252 -10487 -43722 -72193 -67135 -5840 7801 4910 -26807 -24059 -9664 -55581 -83041
22992 -83041 -36625 -45216 -80811 -96213 -18790 48759 21365 -67856 -63835 -48371 -72200 -62204
22980 -62204 -42180 -874 -36971 -113086 -128465 -71408 -72687 -137759 -160449 -124583 -85436 -43486
22968 -43486 1003 -60196 -116892 -136965 -142506 -119403 -96231 -46628 59579 77400 28913 15576
22956 15576 -59571 -56427 -25290 -32346 -28942 -53336 -36946 45433 104011 76899 -4888 -53723
22944 -53723 -113927 -116906 -72770 -78610 -87791 -101375 -72663 -71213 -75390 -143935 -171479 -151113 -127526
22931 -127526 -95664 -55921 -86491 -82153 -87893 -130598 -120995 -104098 -104794 -96762 -99836 -67702 -52872
22918 -52872 -49749 -55021 -25432 -10257 -52645 -98076 -139982 -116902 -54615 -45199 -93971 -190232
22906 -190232 -168276 -97857 -48024 -81820 -65650 21513 30348 -47249 -98958 -76767 -30470 -40088
22894 -40088 -64703 -74806 -88472 6712 86560 29888 -17529 1260 -4964 25983 85714 87777
22882 87777 123565 87888 18635 -14984 -3249 -5704 -10845 -62564 -90307 -58343 -56570 -94658
22870 -94658 -68570 -107841 -138389 -89487 -51288 -81809 -123731 -194253 -221933 -162373 -78597 -55864
22858 -55864 -113598 -107913 -67247 -49140 -112733 -114834 -106885 -172814 -176592 -179378 -134714 -125713 -89419
22845 -89419 -59468 -49751 -30917 10834 -28124 -2114 11016 7603 -34110 -56081 -120906 -111476
22833 -111476 -107258 -45939 -527 -14307 -9900 14137 -18125 -83106 -78685 -80061 -21119 -23780
22821 -23780 -49270 -56815 -46348 -45706 -25368 11427 -29646 -6611 48608 3058 -78887 -100825
22809 -100825 -71657 -38271 -26663 -37489 -54264 -47262 -83017 -132844 -79814 -18510 -26744 -111868
22797 -111868 -161373 -147880 -103228 -64595 -116052 -118403 -98623 -108388 -120023 -117870 -85893 -14923
22785 -14923 -29165 -54750 -77429 -78230 -43917 -47973 -57841 -57644 -28804 -45836 -22571 -3882 -2194
22772 -2194 -34968 -85673 -18923 7739 59537 77902 -20281 -88293 -136748 -131563 -89060 -33507
22760 -33507 -32464 -90763 -138904 -151201 -87533 -72025 -51973 -33366 9893 -15375 17294 53380
22748 53380 14539 -1689 18751 75177 47078 14559 7796 -10394 -42704 -93210 -113916 -79146
22736 -79146 -3963 10032 -6543 -60864 -90051 -77574 -62394 -22835 -22664 -53235 -89699 -103867
22724 -103867 -98600 -79203 -74274 -17665 15409 19157 17721 47002 96001 19519 -17277 -14499
22712 -14499 3721 9595 -5295 12023 45291 79954 30509 15823 38930 45906 33755 7364
22700 7364 20051 89192 62786 4222 -34925 -23534 -1478 -10027 -41379 -76134 -115060 -210156
22688 -210156 -167997 -72365 -50593 -49670 -6653 -1656 -4848 -38211 -94087 -103760 -81736 -614
22676 -614 29615 41350 20403 -22123 -77871 -88657 -115297 -80384 -49863 -54871 -37239 -32351
22664 -32351 1751 -9168 438 -20894 -49425 -72153 -28516 -43003 -77668 -46706 19262 24199
22652 24199 -17798 -54581 -115678 -61139 -83182 -128703 -55593 -30010 -11604 -19378 -31900 -22938
22640 -22938 -77516 -111400 -90358 -34870 14149 2797 1024 7899 2145 49747 144453 229070
22628 229070 265092 291432 261278 206306 159993 88071 45703 40783 14648 -36030 -68447 -28704
22616 -28704 23762 -596 -60813 -125037 -160392 -141284 -127655 -47449 -3196 18687 31088 -49717
22604 -49717 -93951 -37349 19275 -24867 -121231 -154997 -134877 -143467 -89368 -45734 -110239 -121806
22592 -121806 -64960 -47762 -86795 -114045 -70549 -98182 -147693 -130201 -103153 -60763 -56309 -71558
22580 -71558 -109499 -131227 -101603 -106096 -101471 -90866 -95421 -94372 -140765 -154354 -134430 -116502
22568 -116502 -57940 9783 30626 70532 60627 -41397 -75437 -102248 -134684 -159957 -148559
22557 -148559 -140045 -158998 -156925 -167259 -158462 -99158 -59315 -65106 -86670 5635 -16694 -51478
22545 -51478 -31624 -32907 30581 84320 30975 -25473 -10848 -962 29312 21183 -22983 -70188
22533 -70188 -61885 -36240 -59589 -127971 -106431 -76601 -103016 -31361 -2757 -12711 55418 24744
22521 24744 -53073 -32333 -55768 -43034 -29493 -30662 -6071 -18187 6682 -3067 -68412 -125653
22509 -125653 -178176 -226253 -196064 -190426 -167753 -93776 -49163 -5247 7398 10099 28100 56991
22497 56991 13398 -56275 -93573 -87090 -87891 -42447 1280 9690 -41045 -36940 -56004 -30836 -15632
22484 -15632 -32101 -112243 -132993 -55076 -31791 -66133 -81743 -74108 -90767 -139131 -130517 -104270
22472 -104270 -93033 -44683 -36104 -48933 -10471 29923 27733 41856 31483 -10574 -39111 -92682
22460 -92682 -65298 -33842 -106020 -129699 -119198 -104740 -117846 -126048 -101512 -83547 -62610 -36440
22448 -36440 -22900 33705 17472 -18308 -118998 -143592 -96743 -78390 -37173 -37507 -62473 -60262
22436 -60262 -69114 -45866 -35415 -101700 -142826 -54421 -29223 1421 -66034 -98694 -85903 -87042
22424 -87042 -71916 -81466 -41353 -4109 -56723 -56182 -101777 -127114 -59477 -16970 -43735 -39806
22412 -39806 319 44346 37237 15766 57191 28913 -14819 -18590 -20111 -74641 -41282 -70276
22400 -70276 -59451 -53593 -35053 -22458 -52448 -102489 -79898 -112353 -171088 -194173 -157855 -81435
22388 -81435 -36711 -41586 -81049 -38687 -38912 -20510 22860 35162 27354 -39515 -46350 -88150 -137998
22375 -137998 -188878 -177641 -133215 -50204 28059 23690 -1515 20086 -15221 -34810 -67609 11466
22363 11466 39466 44799 16853 54149 72286 46910 -5511 -15988 18280 -50204 -72467 -10545
22351 -10545 -23202 -66398 -35071 -2850 3371 6398 -14653 -17295 -30075 -55250 -69335 -65110
22339 -65110 -78418 -28792 7776 4405 -22469 -51311 -68195 -72907 -76602 -84618 -53762 -17239
22327 -17239 -8040 -24713 -17932 -8179 -23143 -40396 -12658 -74188 -91805 -121388 -118380 -109973 -142547
22314 -142547 -157222 -136826 -159780 -209065 -182320 -110714 -62363 -12792 -90917 -109996 -138543
22303 -138543 -170480 -170421 -153140 -123363 -59843 -32989 -122775 -122551 -105870 -82878 -94273 -82285
22291 -82285 -58230 -90806 -70320 -49078 -77877 -95703 -113961 -79233 -94257 -111215 -60156 14872
22279 14872 -59312 -89235 -56908 -633 8482 26535 43679 40687 34030 8748 11042 -32919
22267 -32919 -75141 -78027 -40934 -38628 5567 13986 4629 -33643 -3322 -23010 -36334 -1074
22255 -1074 -74267 -140028 -171819 -219040 -133267 -99910 -113953 -108594 -160895 -160587 -140640 -136394 -139289
22242 -139289 -102642 -100140 -61022 -71254 -83001 -73377 -48798 -5909 27273 16167 11454 -23059
22230 -23059 -13949 -5017 -40230 -13053 7971 26293 34143 4784 11551 -38024 -48797 -55376 -98629
22217 -98629 -87474 -92844 -92955 -55242 -32055 -39199 -67876 -90613 -96730 -72633 -39343 22781 -10004
22204 -10004 -103047 -102986 -74271 -79689 -99411 -101308 -98441 -92041 -113575 -122488 -92292 -53689 -63368
22191 -63368 -79050 -54619 -36776 -2497 27637 2116 -48812 -60860 -10941 7197 -86175 -128323
22179 -128323 -83411 -78675 -119380 -126503 -146994 -217523 -186019 -142806 -176611 -236378 -238027 -194228
22167 -194228 -168527 -151222 -117292 -95484 -167334 -169434 -124901 -53531 -89454 -136641 -74507 -51274
22155 -51274 -37218 -56770 -86458 -85707 -63840 -23165 -29010 -83292 -108261 -110599 -110551 -160071 -164390
22142 -164390 -124232 -139283 -138323 -144998 -108430 -90514 -133211 -137723 -120160 -110072 -107295 -106079 -109580
22129 -109580 -91712 -30784 -54421 -31763 -18091 -28442 20013 22160 -38875 -17258 35253 24289
22117 24289 43283 19162 991 66735 113962 108572 24607 -90927 -103223 -23167 52877 52106
22105 52106 51222 21905 -25076 -71145 -76193 -40939 -16908 -33700 -10469 -25050 -45480 -93980
22093 -93980 -121640 -89624 -27307 -23705 -42055 -77348 -86687 -67871 -54267 -111128 -144478 -86695
22081 -86695 -88896 -41648 -29204 -21015 -21447 6867 2383 -51876 -111824 -100752 -97344 -84380 -97750
22068 -97750 -49878 -15934 -46517 -24128 -2684 1513 -959 -20877 -33272 10389 10666 -27434
22056 -27434 -12387 15202 33710 20656 -59468 -48977 -76437 -128879 -200567 -226318 -213832 -212607
22044 -212607 -89260 -42493 -45420 -10611 -72402 -124026 -104453 -97877 -88176 -87699 -77328 -35984
22032 -35984 -17399 -46662 -75410 -118196 -116125 -78026 -39950 -10441 4166 -86400 -75492 -41423
22020 -41423 -79965 -127423 -84216 -106949 -117716 -82945 -106353 -104543 -84002 -88374 -136363 -126726
22008 -126726 -70535 -18184 -44652 -54088 -124533 -156471 -126272 -64597 -23663 -13055 -35660 -59273
21996 -59273 -93909 -105420 -103848 -114878 -99183 -125682 -90425 -82822 -68905 -72103 -93099 -56773
21984 -56773 2561 34922 -30627 -68109 -44679 -46212 -82667 -70286 -118968 -147353 -102377 -81689
21972 -81689 14778 22766 -12659 -24144 -70738 -110656 -73915 -55528 -112266 -134492 -126222 -76995
21960 -76995 -14600 3606 -22992 -34317 28126 22841 -29113 -14591 -33779 -80321 -71487 -82143
21948 -82143 -79115 -46080 -2795 -33112 -100277 -172274 -178400 -157586 -238913 -271847 -187400 -92345
21936 -92345 -36823 -16909 -26018 -38917 -51635 -13587 -3831 37450 -52187 -123203 -74082 10092
21924 10092 -17636 -88668 -127432 -109466 -65817 -67827 -103937 -124661 -129261 -118619 -76172 -72361
21912 -72361 -44824 -2514 -12827 -69764 -61542 -104695 -123562 -79291 -47179 -50111 -89982 -96910
21900 -96910 -38895 -62022 -86368 -137406 -137403 -90317 -19964 -46759 -128722 -129194 -106942 -48458 -43528
21887 -43528 -90908 -91745 -45058 -22710 -56799 -9782 3592 -40729 -84472 -93173 -62745 -88766
21875 -88766 -86502 -32737 -10318 -67017 -92639 -55708 -36832 -91143 -138403 -121851 -69994 -46642
21863 -46642 2561 32329 -23496 -45413 -8487 -36333 -82800 -114458 -122409 -37213 11043 -11759
21851 -11759 -134887 -185964 -114397 -119080 -109469 -101014 -96772 -51222 16162 68131 43274 1913
21839 1913 -60668 2215 20726 217 -15771 -83469 -131525 -84882 -14856 -32071 -28929 -25606
21827 -25606 -59706 -78496 -40537 -36738 -33454 -26580 -45695 -35966 -18758 -29919 -68856 -133952
21815 -133952 -146969 -168537 -145130 -120551 -89538 -101013 -113234 -114365 -90028 -104228 -93158 -76123
21803 -76123 -76715 -77988 -33678 54717 68218 -17020 -27141 -26968 3101 -12602 -14255 -36555 -20812
21790 -20812 -27235 -32842 5027 47415 34049 27145 -12686 -85481 -64731 -58360 -52735 -82641 -98226
21777 -98226 -60722 -23942 9808 -23453 -29463 -54680 -64632 -52104 -35407 -1737 -2087 9669
21765 9669 23067 48 -21730 -36192 -26407 -48280 -30840 -48471 -98539 -81224 -121927 -186114
21753 -186114 -169885 -107404 19649 53427 -42925 -111542 -105771 -80205 21206 17665 -39334
21742 -39334 -78653 -109160 -101746 -89496 -86289 -69810 -103523 -145516 -114063 -96748 -140125 -183780
21730 -183780 -202370 -140230 -83768 -69967 -70228 -80688 -63359 -57422 -77650 -14869 -43435 -77684
21718 -77684 -99563 -103748 -75600 -67626 -58393 -21614 -15265 -78252 -92491 -95879 -119105 -69986 -26032
21705 -26032 -23043 -70871 -70166 -52355 -24450 23026 6280 -26459 42405 90868 54083 -39414
21693 -39414 -87318 -89472 -80370 -116117 -159075 -125709 -117419 -129229 -100133 -56286 -17816 -22569
21681 -22569 -33375 -50038 -30693 -58235 -105968 -173243 -177077 -136345 -60262 -23130 -1235 -32440
21669 -32440 -26696 -4277 -4233 7870 -12791 -46145 -15505 -10663 -9676 -19791 -13665 -20436 3731
21656 3731 28563 -73702 -154954 -104937 -119118 -86111 -52925 -40865 -24261 -12269 -10858 -46640
21644 -46640 -48936 -74214 -91257 -74924 -94835 -132130 -124979 -130498 -99483 -85266 -45213 -7046
21632 -7046 -23603 -43330 -24115 761 -256 -75892 -47697 -94811 -158971 -129400 -77314 -26828
21620 -26828 -25057 -5140 -11954 -20815 -38020 -59435 -66290 -52497 -3814 -35417 -74220 -50333
21608 -50333 -31114 5013 -33802 -70221 -101314 -110619 -114490 -103985 -128275 -95617 -69594 -74086
21596 -74086 -116600 -138745 -132268 -109760 -62224 -79702 -85397 -45757 -78415 -64504 -115171 -167700
21584 -167700 -142786 -82109 -110484 -125446 -54472 10211 -34869 -26229 -20699 24187 6411 -47403
21572 -47403 -74577 -62315 -14722 -54405 -117767 -103392 -36115 -8722 -25711 1126 57492 58001
21560 58001 25202 -21348 -24737 -49038 -120506 -98555 -66906 -76537 -99112 -144147 -184996 -202852
21548 -202852 -159848 -151518 -145863 -121434 -31160 13777 -54649 -107921 -64991 -101039 -102895 -68517
21536 -68517 -18547 -33278 -36116 -41600 -99437 -73882 -46852 -27492 -27684 -89100 -96968 -76412 -62115
21523 -62115 -65616 -17583 -18264 -49684 -117805 -154791 -101508 -73720 -74205 -117293 -85306 -19572 21417
21510 21417 51014 52527 18742 -6616 -25953 -12974 41965 30157 -44147 -97775 -78621 -46222
21498 -46222 13778 -1581 -28968 -48733 -46053 -37418 -2527 8814 -28962 -1581 29603 -22058
21486 -22058 -49604 -55349 -65492 -102561 -49010 -18506 3776 444 -11712 -32434 -34234 -88776
21474 -88776 -117287 -83634 -33783 -42968 -43346 -8805 24635 4688 -26487 -41858 -56190 -65579
21462 -65579 -107979 -119973 -49685 -24877 35682 321 -14496 -30061 -61530 -87323 -43223 52030
21450 52030 73708 18937 -17615 -31329 -34143 -105422 -81840 -51579 -27083 -51434 -57195 -60287
21438 -60287 -61058 -52810 -57785 -47540 -18466 -24609 -48134 -50930 -76866 -66118 -37822 -18719 -43106
21425 -43106 -84727 -2396 73133 43248 -7003 12415 -22108 -22574 -815 -16577 -92818 -32132
21413 -32132 14864 36314 -78330 -59426 -25047 -38163 -56696 -43985 -12272 34617 6286
21402 6286 -27053 -7820 -12181 51281 76033 51715 9969 -13517 10012 -31764 -60487 -33722
21390 -33722 -32121 4065 51514 105288 95550 38395 7216 -58350 -102185 -85384 -36331 30901
21378 30901 -11357 -72632 -36775 -24734 -42537 -22034 -8591 20121 56267 57600 -56976 -97311
21366 -97311 -85346 -116145 -98329 -101930 -84576 -43779 -4491 -11154 -21261 -18461 22626 -55940
21354 -55940 -96486 -122439 -130190 -97103 -88007 -116965 -99940 -72753 -62935 -77125 -73374 -106778
21342 -106778 -89062 -73112 -82742 -86359 -78085 -56617 -102956 -113475 -95954 -97889 -95678 -54013
21330 -54013 -36621 -51852 -60992 -55851 -7766 -20969 -2009 -58028 -91870 -63286 -98979 -117151
21318 -117151 -113979 -92994 -58429 -81319 -40083 -24095 -11956 13932 3021 -18011 -50248 -52376
21306 -52376 -52417 -56193 -79149 -66250 -27040 -45984 -20093 27539 5818 -18058 9450 12031 -13562
21293 -13562 -77993 -99190 -73791 -48022 -26301 -35455 -116701 -155338 -94774 -47110 -42062 -3909
21281 -3909 -48511 -79771 -77942 -71197 -37213 -677 -33508 -76416 -118388 -106730 -53572 -64273
21269 -64273 -45115 -57851 -65453 -103845 -68037 1372 20952 31869 -30992 -41665 25722 45600
21257 45600 54833 3983 -114280 -108413 -56345 -110328 -103347 -799 -4161 -101419 -120079 -118878
21245 -118878 -162620 -190419 -220119 -131893 -118683 -161482 -113965 -98858 -85484 -75371 -41284
21234 -41284 -10879 -37795 -63221 -100305 -88273 -57077 -26521 -61159 -102106 -116397 -90639 -7662
21222 -7662 41071 -33080 -23433 -44924 -118803 -133911 -143674 -99047 -49545 -78771 -108039 -113229
21210 -113229 -94860 -91320 -28134 56293 44165 45221 57881 10999 9447 -761 -23295 -38929
21198 -38929 -65466 -63453 -57281 -107525 -66595 -37501 -47490 -61238 -67956 -97508 -79925 -78437 -49404
21185 -49404 -38721 -19818 -33588 -42081 -51085 -54113 -43829 -98986 -106625 -95845 -114046 -87706
21173 -87706 -37139 1420 -21473 -48614 -21171 -37336 -13931 -34314 -43436 16776 36776 24754
21161 24754 1293 35840 56536 31433 56881 19926 -67424 -64502 -111345 -89571 -103530 -139739
21149 -139739 -191104 -161601 -69490 -76734 -83899 -34009 -13076 -22709 -40090 -92688 -118186 -63318
21137 -63318 -49024 -12640 -59861 -26542 -31892 -82972 -68337 -31307 -31449 -64655 -109118 -87169
21125 -87169 -90298 -114282 -136339 -135450 -95427 -102020 -57791 -18069 -50174 -82135 -81270 -17100 45583
21112 45583 4877 -43560 -56274 -35229 12020 -22491 -63616 -59586 -41226 -78008 -54189 -45463
21100 -45463 -31042 -44878 -19630 16520 -5786 -12769 -35872 -50656 -9929 -15133 -12939 -666
21088 -666 -53347 -45718 -17521 2144 -5344 -44326 -39779 -16996 2001 -15067 -66326 -105399 -82831
21075 -82831 -27343 -41670 5261 5976 -39436 -87272 -26327 18756 6258 15307 35476 26341
21063 26341 50040 38575 1465 18096 -37114 -70742 -116890 -112322 -76012 -119981 -119479 -101037
21051 -101037 -71926 -52608 -28679 -125187 -168944 -79068 -20806 -57106 -89714 -86793 -72388 27922
21039 27922 68966 15025 8992 -34891 -66858 -145568 -169995 -129793 -51393 50058 90348 55340
21027 55340 10541 -89099 -86894 -39722 -8469 -21257 -56573 -48426 -53768 -63726 -41334 -37724 -78315
21014 -78315 -99302 -100669 -130730 -90238 -7572 86636 118639 74296 52484 27408 1434 -63417
21002 -63417 -58398 -87541 -58692 -52948 -59697 -25675 -50069 -31584 -2082 -43997 -59767 -22968
20990 -22968 19503 1705 -15569 -7441 12868 4180 -10113 -7104 -7736 -21474 15888 -42977 -69534
20977 -69534 -66430 -62981 -68276 -17794 45329 41318 -50890 -77360 -46639 23059 64910 21999
20965 21999 16478 70099 30987 -30006 -27976 -106738 -119939 -97178 -107251 -125314 -113000 -91963
20953 -91963 -115251 -109526 -83836 -80273 -91545 -62943 -58343 -103293 -102591 -119339 -148967 -99195 -13800
20940 -13800 -4218 3349 48120 21777 -5765 -41945 -30025 -97007 -127969 -79781 -40401 -13213
20928 -13213 -14943 35353 11287 12631 -10676 5660 21946 8916 2215 -61981 -44643 17451
20916 17451 -30300 -66921 -36841 -52078 -26118 53652 10301 -3089 5993 -4819 -12899 -3212
20904 -3212 26573 10799 -8246 -9880 -3698 -13930 6185 -4002 -9912 28869 46957 55854 62687
20891 62687 80193 101046 131185 170577 241668 323876 458529 650555 753491 807500 876397
20880 876397 887284 779913 627989 511863 412266 297665 202966 149226 136905 109070 117524
20869 117524 97615 104276 47235 4805 27964 40191 48835 42623 9923 25430 32532 13719
20857 13719 -5045 -28045 -28868 3548 27106 45908 28013 -21363 -325 83422 101386 76549
20845 76549 16639 -46314 -97114 -76780 -50201 -74525 -142404 -175817 -121247 -57949 -21342 -6447
20833 -6447 -41199 22763 86120 59037 33206 -37172 -3807 55997 40541 3189 553 50285
20821 50285 62438 8350 -65001 -62045 -55903 -73942 -85594 -16610 -11935 -48306 -35557 -39776
20809 -39776 -133510 -154991 -116030 -130310 -153353 -105514 -67583 -27745 25653 42621 1157 11720
20797 11720 1380 -18345 -12337 21403 6839 -26168 -32539 -16196 -126095 -91577 -5410 -23257
20785 -23257 9238 5690 4411 -25450 -78660 -106414 -75529 -29982 -36811 -23524 1340 -3917
20773 -3917 -44867 -64479 -19354 24022 34752 81288 89271 78476 23250 -61983 -65055 -28033
20761 -28033 -71825 -145843 -148649 -147179 -137866 -71997 -28067 -45718 -25241 -40498 -71303 -53001
20749 -53001 -80410 -117424 -86367 -76663 -42532 37473 13412 -20545 -52218 -79407 -86822 -92090
20737 -92090 -115761 -92861 -40755 -23757 6841 -27066 -20371 -67000 -68937 -28442 -72271 -42176
20725 -42176 20313 -9485 -11043 18184 -51599 -32127 -34012 -67017 -38022 -19433 -58537 -5936
20713 -5936 1741 -9910 22841 71390 -7934 -54327 -74452 -117866 -132871 -63613 -69889 -96563
20701 -96563 -56582 -42790 -69169 -43979 -23814 -61163 -27248 21644 -51960 -136421 -151807 -123746
20689 -123746 -77920 -38932 -53072 -60328 -89194 -91020 -27366 -21618 -37440 9000 -3203 32910
20677 32910 55800 1086 -74982 -83888 -56670 30417 23658 90413 99157 45521 7264 6940 5715
20664 5715 -11479 15044 -7110 -46836 -84260 -148386 -137221 -85008 -86379 -111050 -98345 -104506
20652 -104506 -64579 -55934 -60394 10522 36715 38097 -4251 -25054 -55919 -78389 -9150 -3818
20640 -3818 10758 -11549 -39443 54511 128615 91102 23011 -7391 5642 -28301 -14375 25586
20628 25586 52806 26663 -279 -2627 19552 9466 61132 124510 94832 44088 35148 68087
20616 68087 40398 57345 97173 95514 87070 82341 68915 71500 72291 -3474 -11944 32559 1319
20603 1319 -11171 27496 81676 100400 96133 80451 50914 15066 21881 23944 3666 -9115
20591 -9115 9915 19160 17204 2131 -40785 -123231 -174830 -48225 75821 15803 -53720 -46852
20579 -46852 -4816 11012 55909 92052 76946 -1757 7054 49205 -5154 -17594 -41129 6523
20567 6523 1755 -45719 -60381 -54018 -73126 -62229 -51073 -19435 -9551 -33520 -47439 -27238
20555 -27238 936 38233 67454 119694 71939 30614 35357 -24322 -65193 -76793 -19327 24794
20543 24794 4858 -29813 -107051 -92387 -48188 -52057 -85970 -162478 -172083 -157741 -107516 -92393
20531 -92393 -126360 -121879 -137595 -127140 -95754 -126032 -133322 -83008 9257 35301 31011 -2912
20519 -2912 16120 4793 -9260 3028 31767 39567 8527 -52258 -67488 -59210 -24897 40761
20507 40761 17415 -62487 -35133 -45201 -95171 -76604 -23708 -43679 -101355 -55756 -19764 -32230
20495 -32230 -75636 -84746 -109408 -127026 -131128 -148103 -118196 -110012 -153587 -176451 -143421 -58204
20483 -58204 33717 -21353 -95428 -70266 -43515 -31755 -37862 -71521 -53175 -12931 21534 35405
20471 35405 30484 5974 -12066 21201 24383 19255 19007 76520 94593 71766 59194 33044 30823
20458 30823 -40954 -52870 -11792 64336 98350 69242 56336 32849 -51152 -55009 -50409 -79589
20446 -79589 -12425 30737 42736 45873 22218 -9418 -33976 -82655 -36549 45484 45991 24097
20434 24097 10257 10801 -8976 15091 85517 62372 63093 119059 85647 16119 -28426 20430
20422 20430 34454 44457 26526 34444 66427 31617 10659 8163 4046 14102 50514 93289
20410 93289 54075 -31440 -2603 61856 31417 -34888 -30009 -27048 24689 26784 81477 130538
20398 130538 83184 73245 98858 100235 104039 99324 46482 55974 106641 86944 29264 60785
20386 60785 99753 66812 24422 22863 -45546 -71286 -110619 -107274 -76802 -28009 10759 73554
20374 73554 141296 93094 23651 25619 9917 -23241 -61945 -38467 -57707 -84802 -28789 6712
20362 6712 26671 -9021 -59407 -102636 -43593 -13543 -53996 -87073 -33598 -33379 -46881 -51519
20350 -51519 -57597 -79090 -80665 -7007 -29306 -26931 29358 31794 -95906 -127085 -59945 -6729
20338 -6729 21653 28561 23354 -10650 30978 26164 37485 81517 93319 109030 168986 217194
20326 217194 300887 392803 520578 555021 507532 416044 335447 291657 257146 230753 187340
20315 187340 88144 48774 43213 80035 108986 160265 172156 205125 164245 95031 44143 43171
20303 43171 105216 99184 74022 -23210 -65973 4918 49319 76825 89054 90737 92613 62712
20291 62712 79853 108866 105621 91024 31768 29713 113221 179187 144806 108343 31986 34148
20279 34148 66219 57576 90329 114504 88610 95264 149886 207712 312470 369501 382211 365137
20267 365137 297947 182266 86855 48236 -12467 -31324 -1479 49563 73191 83606 61792
20256 61792 49368 38480 43667 23551 29049 55690 66999 87395 20711 -2414 35451 73576
20244 73576 99336 114506 97687 65682 51056 25910 11288 71520 143111 182775 181156 153629
20232 153629 208691 192866 152114 126456 128118 127726 132777 152011 155030 107859 112303 131005 119855
20219 119855 79623 29097 -5273 55941 104764 122693 67825 83061 143221 295651 303863
20208 303863 274217 217033 210975 234109 273296 325177 357229 336689 367010 371441 386045 449552
20196 449552 489939 493030 477667 403336 381062 493017 595335 756710 870904 951636 1035903
20185 1035903 1080400 1113147 1122796 1144049 1118370 1144637 1224816 1230697 1260227 1388721 1562455
20174 1562455 1707616 2007469 2305007 2538097 2669321 2669099 2638369 2708168 2776141 2878784
20164 2878784 3137669 3586331 4147819 4889623 5746450 6755392 7843110 9049241 10326807
20155 10326807 11948719 14246726 17694001 22765519 30439012 42642516 62344280 93411539
20147 93411539 137014285 183365171 213635733 214843671 186120647 140698827 97168870
20140 97168870 66106801 46557075 34387727 26526742 21199260 17413768 14621507 12589181
20132 12589181 11041112 9689092 8450241 7303287 6259506 5356960 4736658 4246558
20124 4246558 3886457 3589787 3407973 3323956 3300050 3291405 3141566 2920625 2633649 2355955
20114 2355955 2029412 1817306 1628093 1501895 1417218 1318325 1203671 1194824 1231283 1199089
20104 1199089 1194298 1236565 1253893 1219792 1159832 1055398 898715 822698 735966 704794 672692
20093 672692 591205 547623 507486 456261 432093 478275 511883 531768 482912 504264 572303
20082 572303 525526 454748 527185 591315 594732 596017 654005 755677 901178 1115207 1351029
20071 1351029 1411564 1384540 1231761 1036468 868370 702000 554777 501645 469081 430586
20061 430586 338483 260867 256005 273998 300541 325205 337002 362111 355261 291721 267359 268930
20049 268930 218297 181006 152860 164284 172217 187520 214940 195990 185801 168365 167455 147894
20037 147894 146983 246983 293377 269792 179658 108515 96910 125431 129068 193016 261569 258591
20025 258591 285470 285591 225896 127291 60226 -4424 15509 84772 87716 81740 61717 90979
20013 90979 113055 59926 72004 123363 130299 109675 142982 139135 109088 134998 187313 188587
20001 188587 165791 116540 76694 75453 78708 105016 148338 159961 148540 131580 148080 117232
19989 117232 54237 36389 63208 35634 56336 95156 143734 172720 190477 159878 53340
19978 53340 43821 58044 49580 94871 89690 33528 44132 59239 52041 75167 115336 128211
19966 128211 82152 65168 43515 39373 56494 96505 134543 146665 131696 134984 84728 32307
19954 32307 297 -71596 -70273 -66218 -92141 -34565 24959 54103 129802 163788 161930 115973
19942 115973 49157 79004 101115 87886 144281 123079 120754 129135 153676 128892 107121 125181
19930 125181 123627 45096 -8862 32028 66297 26058 -11909 -78211 -81217 -36412 23862 110739
19918 110739 148349 159514 192674 180338 170576 164872 213258 239218 254819 249360 178869 111856
19906 111856 113719 178415 210942 257860 231560 191244 195946 219366 266933 307982 353346 329815
19894 329815 335724 456893 449233 412692 451296 444735 358322 280709 282015 328350 313459 299923
19882 299923 313333 414030 473379 469229 418054 482565 520933 534599 551655 484673 415947
19871 415947 357335 256377 174319 155996 182035 200603 206844 157189 163961 218758 258076 264902
19859 264902 185706 145005 172505 237824 289407 235098 243413 237183 233755 215914 192004 225036
19847 225036 208831 201711 218279 238783 219632 262154 253255 232132 314171 440535 524424 565954
19835 565954 549248 581070 559394 578187 568966 524781 494586 403860 344980 334053 409977 444494
19823 444494 452486 396502 369012 306804 252891 260415 268609 200542 156884 134657 126059 62468
19811 62468 56595 77974 76782 24434 -10929 13776 11170 9558 79782 112416 115674 101230 118869
19798 118869 128082 167394 139241 131067 103831 51308 -33925 7993 43146 70056 91551 87297
19786 87297 61041 30550 1409 -73357 -86942 -90792 -48874 35489 65850 97505 144346 160364
19774 160364 147739 104039 77963 98814 96572 109004 118248 155213 195778 183028 169522 165191
19762 165191 112634 137889 177410 212549 225745 249439 242054 220102 226382 187170 94712 74241
19750 74241 78756 51848 69907 76651 39132 -3408 58909 51081 94794 141852 127784 91459
19738 91459 95690 81879 97702 122140 114005 78251 27470 91032 161148 178558 156726 186905
19726 186905 173646 190640 201677 192083 182493 218430 223740 158047 104439 120306 151679 190587
19714 190587 189377 184093 265521 268280 275789 404041 545960 675558 757934 830345 922200 975325
19702 975325 915400 783705 611262 448709 325889 294622 301317 288127 224945 172504 176579
19691 176579 183231 228748 278263 251740 219357 234329 201517 136703 58498 63655 69861 129531
19679 129531 141088 199846 194750 104984 87953 173622 152285 104752 109219 146959 164568 50170
19667 50170 -16922 57337 104267 147063 146224 153959 139505 115103 145965 134226 109471 157428
19655 157428 171099 177910 160899 101002 76189 66295 124298 157809 200297 204957 173013 188021
19643 188021 229197 170321 154574 251394 253678 184411 181103 250718 231241 207813 155388 66779
19631 66779 95370 119266 143992 179319 211943 235597 228273 198870 186628 230164 274076 273398
19619 273398 294013 311720 326521 369703 403475 380063 408879 395647 365423 317337 346085
19608 346085 349044 347522 409794 515569 510042 505579 546755 530572 468955 427831 417098 377074
19596 377074 328964 282751 291676 321836 359285 383899 358877 423183 461539 404697 359048 355999
19584 355999 354228 326661 321626 320064 303494 334665 359669 424853 462627 401003 351736 368512
19572 368512 408684 492745 498750 550091 610682 600696 560034 543103 524715 542025 547852 544618
19560 544618 639525 730776 726876 731872 798307 815935 813299 757153 658596 607877 618493 722561
19548 722561 789240 810780 851559 849413 873001 930478 933007 943162 1019538 1332134 1759674
19537 1759674 2388155 3240390 3677929 3307097 2544324 1902559 1480231 1208915 992273
19528 992273 856582 743108 665720 643330 634467 607461 586498 563129 505723 531078 506269
19517 506269 428273 402738 395472 351195 395130 429833 421377 409409 400165 403961 430431 394909
19505 394909 373186 386080 436919 464876 438074 415972 448836 480613 518922 646835 730262
19494 730262 732356 742104 710261 673400 691910 667767 673719 666706 638577 705614 778650 832214
19482 832214 881662 954774 1062220 1049729 1038775 1116681 1086888 1047031 954509 880205 870038
19471 870038 843194 735180 668946 692882 730722 650729 581899 582166 620510 637846 641908 662465
19459 662465 697267 709000 730116 774339 760437 773609 823483 873770 959343 988431 940452
19448 940452 946341 998707 1083943 1168255 1203088 1225258 1254342 1300237 1280832 1252773 1285379 1267931
19436 1267931 1190702 1123882 1102762 1086835 1066254 1134914 1197480 1318517 1357931 1370516 1441930
19425 1441930 1572349 1680301 1812987 1897883 1958254 1997630 2008544 2019871 1954213 1899332 1887083
19414 1887083 1848953 1846308 1884171 1881543 1880223 2020410 2159416 2210284 2297279 2443369 2653536
19403 2653536 2874962 3096435 3388905 3702732 3999157 4228205 4414868 4587356 4651246 4723553
19393 4723553 4920139 5200546 5613026 6120727 6670265 7249067 7970452 9003930 10582625
19384 10582625 12680339 15199920 17716401 19592459 20575166 21174799 22158781 24245146
19376 24245146 28055896 34379952 44372377 59267977 78704327 97989089 108774657
19369 108774657 107944006 101216251 94418510 86358728 74744967 61804940 51685775 45822963
19361 45822963 43747223 44568988 46815620 48371437 47596531 44709541 41042102 36668154
19353 36668154 31158390 25409896 20633831 17250076 14959905 13485866 12525336 11949621
19345 11949621 11627180 11349541 11099642 11080446 11218282 11354180 11512046 11866455 12384440
19336 12384440 13256117 14614321 16703283 19635243 23704114 29019820 35389109 41753204
19328 41753204 46448184 48291425 47831800 46841902 47193242 50335369 57442891 69740218
19320 69740218 88181038 110920763 132449347 149182378 161031369 164104870 151584845
19313 151584845 125539833 96621575 73239805 57169186 46962203 40995246 38042501
19306 38042501 37072113 36222127 33740793 29341838 24185486 19646879 16138532 13464970
19298 13464970 11503527 10026609 8903224 8069783 7447731 6983420 6555700 6232480 5929610
19289 5929610 5568490 5128014 4679016 4302227 4071855 3794782 3519144 3247989 3042174
19280 3042174 2955259 2881591 2770063 2683675 2647701 2538516 2441386 2329479 2219377 2182780
19270 2182780 2205657 2261748 2212854 2189825 2158456 2190719 2215984 2273046 2321185 2405374 2482574
19259 2482574 2437108 2282306 2093356 1946853 1905081 1811279 1721047 1658033 1656831 1717420 1693144
19248 1693144 1656330 1635801 1583877 1554145 1508451 1442833 1411029 1448043 1466539 1418530 1429438
19237 1429438 1483520 1540582 1537573 1594606 1698031 1820011 1835262 1946274 2054166 2228932
19227 2228932 2363611 2697206 3066335 3354405 3563755 3810842 4032769 4256383 4445850
19218 4445850 4633086 4748930 4825970 4841644 4798794 4739009 4615931 4349521 3991511 3660120
19208 3660120 3302498 2920760 2581240 2332525 2161949 2052992 1984447 1862417 1769150 1634447
19198 1634447 1581432 1564299 1522335 1489969 1465559 1419634 1407304 1369196 1393486 1421014 1459583
19187 1459583 1465465 1458580 1458218 1417792 1353876 1337169 1363425 1329893 1238737 1206626 1221568 1207749
19175 1207749 1272795 1291430 1304600 1354811 1434046 1522793 1522918 1541761 1545397 1505820 1451530 1535738
19163 1535738 1574153 1589093 1663624 1715970 1713226 1768948 1806694 1905524 1919122 1882777 1847639
19152 1847639 1843013 1875413 1901212 1852994 1841056 1947919 2071672 2176197 2289665 2508746
19142 2508746 2759358 3032313 3190843 3280061 3226148 3060389 2884394 2778035 2734331 2712168
19132 2712168 2729021 2812240 2936976 3036278 3159078 3361140 3564125 3830505 4166220 4442650
19122 4442650 4773913 5055970 5354105 5556034 5675004 5898969 6128629 6405395 6821412
19113 6821412 7347080 7867623 8391207 8948933 9516199 10175468 11096089 12304362 13919789
19104 13919789 15992670 18681254 22102328 26402684 31678069 37351010 42541285 46754589
19096 46754589 50747966 56328763 65531156 80387334 103545208 138390001 187589173
19089 187589173 248789072 308526544 347087858 353751124 330146277 283384003 225442684
19082 225442684 171326583 130252666 102737243 85700921 75874858 70747796 67968681
19075 67968681 65028743 60088244 52818127 44595342 36901138 30716488 25990927 22419062
19067 22419062 19673094 17582278 16062752 14884507 13934321 13202736 12662243 12315934 11970118
19058 11970118 11756801 11742183 11947400 12259423 12652282 13300811 14378760 15956360 18197738
19049 18197738 21369147 25748524 31098736 36484228 40430600 41990288 41615470 41166844
19041 41166844 42577968 47158388 55412495 67012561 79440986 89518584 97310442 104857466
19033 104857466 109944339 106585205 92927867 74252348 57047670 44073531 35145068
19026 35145068 29286927 25760707 23933691 23097913 22326092 20821611 18404465 15632965
19018 15632965 13048698 10983024 9443519 8234351 7308373 6559054 6025154 5602826 5184899
19009 5184899 4826655 4512419 4163037 3830385 3528952 3254173 3010057 2791225 2643844
19000 2643844 2461975 2360590 2220943 2182976 2167690 2120071 2034883 1905398 1799866 1704997
18990 1704997 1657535 1641320 1551288 1427597 1439523 1450222 1411322 1359276 1282908 1191522 1149412
18979 1149412 1127129 1074707 1107885 1151619 1152256 1071302 1060677 1078806 1059360 1075313 1015504 1022794
18967 1022794 1069944 1090566 1091441 1042256 988857 974940 1078790 1255273 1458405 1708728 1923450
18956 1923450 1951187 1854047 1602758 1352999 1161172 1043037 992188 934636 867170 803641
18946 803641 729214 761144 789194 765803 697201 683585 606212 580573 622811 601715 552437
18935 552437 530491 497592 528682 552694 527233 559175 540092 583710 601250 595214 518830 423065
18923 423065 425102 463783 410581 388940 371756 386770 398202 467563 469725 461350 451615 432984
18911 432984 473616 455977 431385 377352 366992 387979 386877 434479 516398 532710 546546 595706
18899 595706 513423 422344 433061 398189 393768 373979 372239 425161 424516 355653 358305 407828
18887 407828 418679 437050 432877 387667 378283 378572 418943 411704 362871 349750 370210 360248 365355
18874 365355 399537 333491 324069 333210 321515 385350 412679 430667 409715 413956 404489 341449
18862 341449 371666 410733 443260 467238 512027 550101 612847 633888 608958 622132 684248
18851 684248 760467 768366 785894 734946 652895 665349 707555 785239 821726 854473 868195 910105
18839 910105 918191 929766 906208 813243 706987 627286 529102 509537 502248 506495 491385 480792
18827 480792 557086 564281 524407 456230 442909 443814 395241 365958 308176 329722 387378 444881
18815 444881 461681 433009 473560 427134 369084 386210 405909 428850 384921 428457 483434
18804 483434 543889 606150 621439 603289 573718 552616 591490 634575 646725 672394 727068
18793 727068 696024 659614 658705 660370 646615 662741 644732 636466 620973 591053 641642 670385
18781 670385 620475 556705 469476 452451 463345 364485 277209 245153 315869 342410 333306 318373
18769 318373 305204 317827 345232 338971 348667 353643 324904 312766 269529 239762 247820 257550
18757 257550 240410 232464 258873 269735 258258 325665 372078 429336 462132 384613 353518 337377
18745 337377 358633 302796 262360 238084 232015 248052 267470 284823 251473 229311 258836 305825
18733 305825 268675 255215 233159 178305 166730 196742 247417 253233 289177 282561 238398 208533
18721 208533 169539 118808 112921 158419 181462 144890 179044 257117 286927 315001 286455 243519
18709 243519 202574 157886 179378 235777 288190 366691 365270 350037 341696 294098 211841 151046
18697 151046 159080 232432 224438 253762 264799 277830 292786 199048 71043 161642 277978
18686 277978 325875 353585 311055 206720 255587 274863 214725 248761 256021 254460 255540 218680
18674 218680 191310 245842 251236 213697 179667 253495 265665 282215 259478 266555 288810 247618
18662 247618 169751 138047 145349 149819 193484 177711 93383 70103 83802 154084 177905 200085
18650 200085 180643 121547 119054 119121 159755 224022 214670 178980 167727 174868 180265 197069 233972
18637 233972 249141 205147 182309 201208 223083 284245 298370 307867 299990 315229 335929 347188
18625 347188 361746 301180 297640 347677 386224 344852 311170 299911 303612 336728 360997 378209
18613 378209 327485 305854 376599 377260 332666 233288 201877 222281 201854 163232 255790 250966
18601 250966 249868 260999 209915 173219 233162 219208 208987 222147 243368 266367 293218 322601
18589 322601 354564 361256 396385 416847 434744 412544 421287 331408 316335 347164 382962 498628
18577 498628 538988 559123 663012 659115 570414 572082 581802 588366 630275 622160 614641 647040
18565 647040 707783 699387 641048 579510 492738 422068 363666 380940 383844 369608 359208 351152
18553 351152 372102 371059 367522 394093 379419 275976 251223 241190 199627 196590 165436 188421
18541 188421 170545 119907 144152 218445 260643 277476 284321 276630 360147 366575 368592 361856
18529 361856 343190 399842 501804 533663 483084 460933 440806 464797 499509 510105 470334
18518 470334 460543 450161 506711 506043 379573 325717 362080 411578 530032 644519 657625
18507 657625 634051 579071 517031 462032 442031 445183 443198 430459 421143 433073 553505 678918
18495 678918 729101 766845 828599 915908 969989 901029 811255 725478 658515 568884 548775
18484 548775 580999 572997 523997 479262 462738 452769 414383 403321 383746 334176 286762 278720
18472 278720 284845 335082 348763 369511 405397 462027 590056 719925 861432 966797 1066985
18461 1066985 1119705 1067468 979275 826484 720132 654408 637866 644172 646566 626457 579581
18450 579581 547482 536629 577550 619722 694081 829049 921799 972857 1020291 1093470 1068877
18439 1068877 1061378 1007191 887270 744683 619183 523895 449491 396086 394722 449115 410983
18428 410983 381138 362178 356440 324448 293526 331073 355212 355122 281626 244688 242355 185055
18416 185055 177348 232954 246371 218757 199002 219551 203671 167140 222226 271960 229099 204844
18404 204844 202109 164634 125030 157847 166992 186558 233335 224334 230142 144371 81691 57185
18392 57185 31959 72152 83216 98036 104349 122666 86382 90958 169191 146402 132397 166889
18380 166889 219160 201400 176250 193421 187087 196582 247291 268613 253471 212279 213348 244369
18368 244369 273825 268907 240253 224890 254191 254617 277519 325340 319581 218868 172663 185295
18356 185295 199778 239740 254452 228532 201630 197748 234158 214858 191638 191125 158062 73030
18344 73030 50508 45455 109879 174230 160006 166811 203595 212679 196932 207689 178343 155191
18332 155191 168319 173912 185913 131304 164886 183045 150297 43912 -24308 -27847 -6807 83129
18320 83129 181721 195968 145714 169960 188004 199785 191640 125969 130198 155249 157900 153265
18308 153265 98615 76045 44172 120408 169720 128977 123882 190703 180205 156807 176308 173404
18296 173404 200107 216488 190114 189871 206305 217425 169509 122350 86732 104039 116142 153267
18284 153267 161475 136045 90128 113896 124796 99787 124943 164854 189786 189890 139947 123704
18272 123704 134443 153525 129505 72514 59257 61225 71005 67955 19492 48462 25862 27004
18260 27004 100711 76680 114459 173279 156248 156835 73579 28417 2988 2465 53337 93861
18248 93861 158321 157517 129997 118966 98436 73095 137876 126777 139108 176802 169190 129877
18236 129877 170322 141388 85277 76240 73494 125506 103074 93395 97278 122596 131721 114611
18224 114611 143112 106160 59240 59334 109274 96624 90604 174968 209095 156797 185354 227704
18212 227704 220391 179725 172152 204961 178035 131155 115244 99859 85557 108552 144226 199968
18200 199968 153022 98535 73008 67383 89867 114624 105202 129600 173981 182073 172508 193716
18188 193716 190780 185181 130074 111563 110308 76736 97450 103529 89912 136911 206526 167937
18176 167937 123942 98290 111065 80562 51646 99713 131463 115129 137881 96147 111395
18165 111395 113924 123943 154539 165339 136099 125689 81576 80953 120741 134505 74752 54914
18153 54914 59786 127744 144143 148367 131266 95338 95653 122269 134746 163852 132837 61488
18141 61488 52884 116975 80209 56144 138700 166511 100533 56398 51413 45289 59463 52222
18129 52222 122621 137691 113587 89835 158407 159193 143977 141421 69779 31728 12982 57765
18117 57765 94378 32701 28407 146686 142432 113125 77492 47665 44963 57975 75115 86255
18105 86255 108968 139105 127385 92580 97437 103687 56561 -12312 -41086 -35010 46174 79249
18093 79249 18119 13128 45519 32105 41629 21932 -30185 -48558 28755 112628 93330 46498
18081 46498 41706 49879 -3216 -14948 -22565 27021 61993 48397 27608 26592 9513 21229
18069 21229 14450 55982 40668 41102 96999 42648 32321 41028 77065 159866 154608 127729 130020
18056 130020 79371 111779 138053 103327 26897 6023 17410 25165 46515 75065 88025 89423
18044 89423 64241 51656 65223 10805 767 48631 54661 69635 29591 -25639 33741 96563
18032 96563 130633 153772 157670 202276 225689 190076 117804 104748 50802 -12565 859 107116
18020 107116 165415 153336 115176 47722 9832 997 46154 100115 108319 116437 111706 132518
18008 132518 116719 48418 59498 105514 106835 123228 152332 127836 66430 29176 -12354 -29587
17996 -29587 4193 52667 103871 147555 154589 165568 122647 25654 -28131 17623 2421 57962
17984 57962 107571 109009 101397 58286 30646 105927 135395 94468 42122 26903 15838 20509
17972 20509 7591 85715 164283 198050 165977 120736 101788 94162 61427 104323 121998 130604
17960 130604 93143 72121 72391 31446 25348 58365 71447 131842 105863 43269 -63343 -54466
17948 -54466 5041 71837 91696 45531 3123 65713 73110 103516 69754 29675 78636 78388
17936 78388 17196 -21233 -23596 -31840 -3884 17579 21085 23537 40728 57489 102528 118223
17924 118223 142193 88247 116515 199629 216691 245305 272589 264198 342809 512396 590478
17913 590478 582853 556274 573274 554858 518487 495927 460997 361077 311196 328135 289988 289597
17901 289597 258872 214123 170240 182836 281039 297988 263851 244991 202593 147289 163677
17890 163677 163822 190951 162846 82473 69078 48786 93189 88854 39757 24593 71363 93690
17878 93690 121658 165008 200199 130191 90252 135342 158622 175315 210659 279793 288768 311115
17866 311115 388443 360635 391766 467256 464200 469626 509891 473125 477788 464136 434456 427861
17854 427861 412881 388394 344504 250331 217951 208698 181374 121095 97303 62809 52464 121323
17842 121323 150063 129097 45550 -1600 13769 -76965 -39836 12839 72883 84081 19635
17831 19635 -40618 -90010 -65472 -59074 -43942 -2444 -32571 -71690 -80363 -73127 -83875 -52704
17819 -52704 2771 -29153 -87849 -125492 -121193 -82258 -33398 -13091 -5409 13874 24165 18672
17807 18672 52317 88761 36767 28727 3693 -60366 -50375 -18117 -50799 -67786 -49850 -88549
17795 -88549 -71344 -49390 -94239 -107665 -51794 49687 -6759 -30697 25695 54064 41845
17784 41845 69738 47409 43632 52660 30177 -24953 -64354 -53892 9634 11998 37623 35164
17772 35164 58312 29420 28089 -12322 -49720 -46622 -22266 26729 18368 18373 20520 27711 -15109
17759 -15109 8797 12997 11274 27469 82798 27048 -80609 -120734 -79404 -93409 -95332 -80330
17747 -80330 -59051 -46909 -85524 -110411 -44610 18674 19120 -34268 -27034 22786 24611 31609 -15462
17734 -15462 -34271 11455 2463 -10133 -15072 57520 50943 64878 47002 32625 78319 121062
17722 121062 105321 93360 68912 11558 23032 51135 81409 95587 111150 62097 -43234
17711 -43234 -35331 -16205 1962 890 -18561 -44716 33937 68625 74649 91703 86172 47532
17699 47532 9284 -34461 -56631 -103627 -115643 -40960 -56366 -74737 -48074 25436 31436 13298
17687 13298 -7030 28058 -2098 -42541 -52008 -14195 -28310 -75387 -135362 -134282 -101054 -55825
17675 -55825 -34460 -57670 35798 47161 28633 875 -27480 -50647 -99071 -78356 -68214 -46508
17663 -46508 -53445 -34338 -32619 -51954 -23566 -24928 -53065 -19376 -22817 -17255 17852 11621 15649
17650 15649 4415 -6937 -1466 12438 19462 6946 70266 135865 131213 127246 95005 55556
17638 55556 62798 93526 25874 -7034 18025 44269 64318 62260 49592 18249 6765 -21508
17626 -21508 -37228 3356 33633 26694 37018 17770 -22144 -30206 -8652 26259 49614 48857
17614 48857 59987 14139 -10116 -50885 -61091 19669 55797 63235 108802 170263 139277 124889
17602 124889 87278 75852 91221 59457 63583 52912 34488 25559 25339 51596 49320 25280
17590 25280 -2334 6619 -17863 -43051 -42999 -9067 -23254 -46612 22074 95743 125105 147792
17578 147792 121295 33821 -79423 -74339 -11091 3596 22062 67689 106083 57564 38550
17567 38550 63285 108323 103033 71697 27467 19598 -32120 -10517 -21579 -45660 -83374 -31934
17555 -31934 -16138 -28060 -27410 37336 61989 16799 -21956 -88317 -91742 -79299 -24057 -4699
17543 -4699 -30343 -2308 -16894 -32573 -61546 -16817 14477 28365 59942 -21167 -35586 10910
17531 10910 424 3086 5343 -41698 -14929 -3294 -95 11772 57467 67333 48113 82285
17519 82285 75908 20861 -47429 -7662 -3310 31639 26441 -27988 -43014 -24435 -1670 -20768
17507 -20768 -63125 -45010 -17607 -47392 -42706 -12237 33116 90820 47383 6142 48706 28551
17495 28551 -11201 -12526 -21754 -52238 -43572 -12244 61829 68422 -30127 -59237 -62712 -64146 -48933
17482 -48933 -7739 94005 155775 135787 55769 23487 25345 5132 -1041 -1575 -1167 -889 37028
17469 37028 104663 93596 71142 90227 105776 98354 54194 -7364 22716 -4536 -4443 50404
17457 50404 68026 28288 42874 103996 80361 -11520 -61395 -104172 -72150 -37198 -17352 4372
17445 4372 42271 36686 7255 -50706 -61285 -43216 -38593 -99547 -111592 -83133 -60274 41911
17433 41911 47782 41182 81950 48625 16051 -15555 -45923 -35965 5105 -88868 -100289 -39556
17421 -39556 -31907 -65626 -96054 -94690 -68885 -48057 -37638 -48284 -59914 -41756 -42873 -9238
17409 -9238 -6789 -37761 -23495 -34487 -61908 -87234 -91984 -54059 -77185 -88121 -100828 -78501
17397 -78501 -73721 -70490 -15554 27906 -11948 -16156 38956 59267 31134 20011 11714 -1478
17385 -1478 5531 -2155 -18781 39930 33048 16992 7719 10154 -11856 -2881 47561 16479 -4144
17372 -4144 2223 1121 14966 -60740 -76644 -63723 -24464 -48699 4046 20352 34235 3088
17360 3088 -69315 -46818 -14288 12868 11901 21458 48663 9536 -13485 -66176 -71681 -74965 -110381
17347 -110381 -88361 -70134 -88497 -77482 -72624 -80710 -43922 -53712 -67784 -17649 -27608 -25300
17335 -25300 -56235 -109060 -82874 -74005 -73678 -72589 -101450 -156737 -125112 -79412 -74577 -70547 -92491
17322 -92491 -86617 -64596 -26676 -37106 -27921 -2133 -57737 -125969 -168479 -124808 -50803 -29878
17310 -29878 -23097 1953 -37490 -49722 -68395 -19237 -16635 -26755 -18001 -65174 -50834 -67691
17298 -67691 -64854 -48979 -29554 -17337 4589 16321 60309 78042 37375 74012 13127 -54008
17286 -54008 -26676 -531 -36659 -23486 22501 18455 34775 40743 54803 33487 33214 12605
17274 12605 34975 11937 7896 -55769 -34969 16337 -9763 28888 11509 33125 71755 57513
17262 57513 763 -38772 -68220 -99172 -103838 -78536 -30295 12403 -7144 -69586 -59487 40398
17250 40398 23144 8630 30936 16354 -31844 -112521 -170823 -167478 -148970 -76929 -31123 -51925
17238 -51925 -41958 -19388 60 -5736 -37877 -42990 -7228 -2912 -63600 -28094 -1510 -23463
17226 -23463 -26143 18225 -23286 -79478 -64256 -32988 -12465 -74445 -122756 -112309 426 17574
17214 17574 -24110 -13402 -14985 -41421 -16356 15406 44852 73726 29063 -2727 -76275 -64985
17202 -64985 -10549 6734 -21277 -47257 -49742 -38962 -16688 31511 40613 -27732 -51939 18008
17190 18008 43656 78515 94318 46544 -27309 36055 72807 69961 74921 76855 98374 91080
17178 91080 66563 56453 11414 -78801 -74596 -29340 2856 -10715 -63755 -51270 -45589 -16422
17166 -16422 -62843 -54464 -52790 -98475 -140207 -101133 -33267 16815 13769 -1519 -708 -57918 -56593
17153 -56593 -29818 -24727 -40752 -2542 220 52501 77979 16831 5678 16541 -29679 6313
17141 6313 6741 -75883 -84952 -77189 -56263 -44890 -88114 -35425 -30424 -30893 -78269 -114969 -125228
17128 -125228 -83892 -11223 2108 -59333 -56919 -30755 -49640 -22697 13725 14639 54933 76856
17116 76856 57971 43927 46683 69244 102135 78031 19274 6565 34437 27556 -41016 -41689
17104 -41689 -43583 17518 79885 102261 93248 45878 -24523 -36571 53187 86572 35092 33152
17092 33152 1683 9418 37798 -17491 -45790 -88846 -92640 -112181 -93275 -37605 32956 11692
17080 11692 16398 67554 112369 62679 -17032 -49628 -20775 -15011 -32480 -97203 -70022 -57045
17068 -57045 -15103 -17244 -28337 -21888 -7182 -19164 -65761 -43184 -59996 -104173 -94234 -71031
17056 -71031 -137317 -111872 -35886 -32717 -26161 -60478 -99084 -93934 -101547 -23322 -24813 -25366 -39309
17043 -39309 -87782 -85699 -40918 -19643 -53659 -111632 -88332 15711 -5170 -70872 -71210 -64339
17031 -64339 -83526 -18007 -31721 -18956 -14455 13123 41511 34469 29078 29336 1513 -27802 -39970
17018 -39970 -46631 -35819 -31859 -40097 -29046 -20355 19672 56428 63492 86694 67591 58678 31334
17005 31334 8228 19139 69629 -23599 -32519 -17081 -20750 -37851 -54168 -74095 -99030 -140675
16993 -140675 -103757 -10263 -28436 -60313 -40628 -105575 -156560 -88835 -64312 -50664 -16473
16982 -16473 -54626 -83668 -63628 -29971 -29132 -79541 -76001 -92983 -114206 -70125 -24350 -86383
16970 -86383 -82130 -42399 -61054 -34521 -18349 -1395 61649 74500 41424 15757 -35060 -31823
16958 -31823 -44031 -85928 -84133 -51694 -41169 -13940 34697 -4334 -37954 -96004 -116136 -123636
16946 -123636 -78346 -77081 -77490 -70135 -32343 -29509 -91719 -75637 -52540 -56164 -73427 -56468 -53863
16933 -53863 -63579 -70547 -97788 -93236 -36250 -59561 -70157 -55955 -34675 8740 21380 -27399
16921 -27399 -15253 -29710 -88238 -113071 -136482 -116762 -116426 -95991 -71878 -24739 -3333 28233
16909 28233 -12828 -37322 35743 51738 -8282 -55423 -33630 -1275 5636 -25287 10557 -13416
16897 -13416 -52176 -64068 -72443 -54107 -33961 -39510 -10916 9497 5406 -10902 -12600 -30040
16885 -30040 -53408 -65651 -83053 -118240 -92411 -56279 -38729 18189 127435 162253 133277
16874 133277 112834 61241 93899 95975 85054 28649 -14505 -42703 -35009 -32526 19573 69159
16862 69159 71925 8153 -30834 -59863 -62487 -64597 -84284 -111458 -72710 -26267 -39450 -35412
16850 -35412 -19570 -5019 11490 37498 23081 -35960 -63859 -36141 30903 59708 74067 90359
16838 90359 8380 -6053 14258 -36211 -34670 -22251 -7206 -15605 -66916 -18317 29553 13868
16826 13868 -7527 11702 29383 -7038 34678 2647 54610 36286 54212 92158 178498 187814
16814 187814 81483 27348 19288 37132 47283 -31321 -75944 -80834 -44674 -28265 -16096 -12817
16802 -12817 -51435 -34335 -25603 -52177 -52978 -76345 -74809 -33048 -30387 -60108 -19388 -33138 17418
16789 17418 33763 23324 -33882 -149207 -112533 -82926 -33793 -6480 -63389 -86145 -20893
16778 -20893 58393 101807 83243 67592 48845 9690 -14124 -40006 -29215 -3668 -17880 -62976
16766 -62976 -28379 -26182 6804 67502 32334 19981 -19075 1398 -7017 26708 39224 2747
16754 2747 -14925 26266 40492 9459 16984 38663 20495 38207 32963 -32597 -19733 -3576
16742 -3576 -34937 -76960 -97782 -94823 -66923 -97936 -82675 -43680 -52636 -76281 -67872 -4619
16730 -4619 -8257 -35553 -104923 -93342 -151194 -167688 -156825 -104299 -31141 -13848 -15930 41116
16718 41116 64818 70376 56223 -34119 -43731 -19727 12883 69801 49604 -17250 -11061 22923
16706 22923 -7845 -47776 17926 38215 95978 53012 -40605 -72111 -61119 -30939 18997 65183
16694 65183 64911 48057 31033 -24763 -54871 -33029 -24133 -31752 929 46744 29439 28179 27142
16681 27142 -6280 2618 34739 15303 -7357 -28620 -71804 -25277 -23281 -84664 -111491 -122203
16669 -122203 -104583 -49552 14946 18507 -11669 -50280 -75801 -72902 -2938 77829 68973 58193
16657 58193 9355 5149 12841 -32154 -20765 -906 19797 52746 22969 -14662 7070 36100
16645 36100 -2534 -21721 -42391 -41853 2978 -32921 -52627 -50038 -96237 -107561 -41875 -42072 -34964
16632 -34964 -56255 -35347 13870 37264 -1721 -38132 -3981 57661 30434 8580 -2338 -13468
16620 -13468 -22419 -68821 -68751 -10128 -76108 -112434 -73321 -76667 -102174 -146835 -192095 -160609 -108133
16607 -108133 -85371 -100723 -80098 -114055 -145990 -143466 -150641 -114841 -59527 -25663 64236 26341
16595 26341 -64223 -101124 -110868 -60028 2855 -625 -31928 2003 1471 -16210 -7065 29117 25523
16582 25523 -33686 -42117 -68359 -34772 13463 49920 16812 -3241 -38687 -47105 -64904 -26791
16570 -26791 -7111 -3009 11785 9510 30063 38008 10924 -29281 -20248 -61096 -99221 -50388
16558 -50388 -37573 9467 10110 34423 52467 82197 107569 50023 4638 -30795 -69970 -81578
16546 -81578 -62678 -65223 -33158 -45962 -107212 -59259 -37066 2045 35807 22152 33875 20272
16534 20272 -19669 -98098 -118784 -94744 -79570 -128531 -83655 1213 18858 6397 29521 22993
16522 22993 -35439 -57021 -25755 -14113 -12745 -64941 7164 34778 11677 -22637 -37180 -55996
16510 -55996 -47480 -2265 -9711 -52802 -35479 29859 67170 64611 20364 -44765 -60236 -99593
16498 -99593 -104964 -78459 -45782 -21010 -9156 -3988 -36446 -53408 -39354 13305 -2413 -11177
16486 -11177 -61358 -104598 -45408 -33085 -70079 -63527 -36604 -25591 -34119 -103499 -139369 -173446
16474 -173446 -121987 -92459 -12647 8629 -10495 -16963 56173 4606 -27583 -16069 -16912 22521
16462 22521 12023 -44940 -35407 8110 21518 2387 -12377 14883 56861 53550 90703 57667
16450 57667 36051 53062 39497 19834 -50583 -79832 -93362 -109851 -113245 -68947 12955 -52371
16438 -52371 -121658 -126009 -118898 -60685 -47473 -17054 -3799 10977 28954 -13514 -34370 -71648
16426 -71648 -14045 -11892 -76803 -119578 -113032 -97644 -77486 -30092 22036 -36529 -62762 -62492
16414 -62492 -91766 -93077 -102512 -90585 -135362 -175583 -87015 -2595 46215 47025 52028 6488 -15220
16401 -15220 -21539 -6139 29594 -15437 17563 7741 -2779 -42350 -30784 -90911 -140202 -109025
16389 -109025 -40310 41 2180 -36950 -41302 -44512 -76848 -34870 19424 2704 41137 75920
16377 75920 7411 -20975 -80872 -131057 -61280 9215 33006 39270 -81480 -122198 -107342 -104448
16365 -104448 -112692 -160927 -185524 -126141 -104917 -129631 -146556 -127666 -67520 -38701 -19499 5673
16353 5673 -5502 -23517 -88975 -46635 -42291 -38007 -49747 -83496 -111272 -98122 -103903 -133331
16341 -133331 -207742 -151928 -93720 -99134 -77182 -90933 -105159 -68484 -2681 5182 -15088 17231
16329 17231 -9113 -41734 -30168 -40012 -113223 -99317 -84934 -42338 -11488 7992 -429 -12557
16317 -12557 -13264 -9933 26344 25345 -1910 -45656 -20172 8153 18844 -58237 -76986 -121282 -131064
16304 -131064 -68956 -33850 -19212 -49338 -41785 11829 -4549 20634 31049 16724 -17991 660
16292 660 -27887 8841 52726 23858 -67153 -91670 -20835 -37102 -70096 -77190 -77490 -52042 24884
16279 24884 -19815 -57242 -33213 14389 -4306 -60338 -38886 -19565 -33651 -55575 -51492 -41581
16267 -41581 37671 55085 6535 -40268 -70333 -117650 -78664 -53828 -62595 -87876 -111863 -108795
16255 -108795 -111361 -102441 -116716 -114171 -103402 -65460 -105635 -122888 -92012 -60874 -80795 -97812
16243 -97812 -88719 -77018 -17518 -44501 -28597 -46973 -67657 -41752 2475 26575 24572 -36626
16231 -36626 -79299 -158788 -92472 -3057 -19506 -83873 -114021 -87696 -80070 12938 57885 28375
16219 28375 -72152 -96388 -42132 65198 69436 2349 50495 46056 28897 24219 7186 -43719
16207 -43719 -59059 -3838 -4409 -20730 5134 -14996 -116055 -167874 -131270 -71427 -87417 -64120
16195 -64120 -37199 1672 29692 39455 26398 20592 -16773 29845 89204 54642 40424 67480
16183 67480 11142 -45420 -24654 -10720 23629 22472 -33860 -131656 -188805 -180106 -69595 -25662
16171 -25662 -26307 -58741 -17399 10257 21007 -26985 -1936 33612 42675 67 -27390 -61234
16159 -61234 -75886 -95071 -111411 -99742 244 54783 15555 -43453 -20847 20650 50675 82322
16147 82322 71526 25057 13441 20116 46678 106755 145676 90860 81014 96057 63801 22118
16135 22118 14919 -7244 -33342 -25500 -48671 -91184 -127758 -80810 -29158 -31632 -120334 -235731
16123 -235731 -213128 -161950 -133431 -26709 64170 70304 81760 53289 32201 43942 54746
16112 54746 48115 -10321 -44323 -74211 -36518 17935 -28955 -44761 -45910 -17884 28631 37855
16100 37855 31976 -6214 -18354 -63149 -124113 -121048 -53938 -38268 10713 28190 45630 36618
16088 36618 10210 -31948 -23221 -34214 -65455 -43380 -68344 -74319 -52903 12015 -16648 -56036
16076 -56036 -48119 -32490 47114 135385 121312 88412 91415 22588 14471 40966 -26387 -49755
16064 -49755 -9407 -11035 -7992 9332 37582 -11032 -49338 -78746 -44263 11023 -13657 -29102
16052 -29102 -26967 36234 96610 85977 31249 2391 26088 61345 40939 -1248 -33397 -4316
16040 -4316 32093 70614 61170 32601 -6094 -46011 -6524 2880 -25413 -7305 12289 20917
16028 20917 26281 -25996 -66012 -82780 11454 96019 -17401 -68582 -43950 -71860 -28750 1241
16016 1241 -39522 -73202 -100039 -36325 -16865 -14231 13910 35203 11293 13010 -17125 15894
16004 15894 56797 44521 11057 -4542 -24387 -18568 -9273 -20417 5008 19321 9715 -32281
15992 -32281 -99926 -97894 -81181 -41540 14465 57167 33839 6082 -31490 19407 62783 104875
15980 104875 122606 132027 96792 12846 -9918 6618 -23437 12634 77376 71405 32364 16200
15968 16200 -34032 -42769 -53300 -24324 -21792 -22900 -73494 -90019 -87152 -72309 -6301 9975
15956 9975 8110 -20940 -64095 -41306 59856 154873 105045 64181 85224 67049 90293 114611
15944 114611 59392 18039 16847 -14839 6222 13241 50353 50746 22923 -49247 -32681 -49930
15932 -49930 -47376 -17235 -21312 -27894 -43777 -49171 -57711 -52228 -37682 7123 59558 7797 -46740
15919 -46740 -600 25754 6830 6590 -35447 -71293 -74431 -61353 -6534 18646 47089 38249
15907 38249 25769 17148 27210 -34214 -89000 -77712 -72976 -118446 -104923 -97828 -71361 -1763
15895 -1763 28104 19922 -5164 9286 40000 38079 22774 33004 38103 35530 9839 8008 -39615
15882 -39615 -34389 -65979 9296 32067 26908 -37097 -30056 -22915 -15628 -33641 -19194 -10793 -63538
15869 -63538 -60654 -7168 -1669 13066 29453 73692 60125 48236 5172 -21792 -57477 -71739
15857 -71739 -71204 -89083 -44383 -39017 -25394 -45631 -24455 -27892 -105296 -49812 2131 39089
15845 39089 38220 -55765 -101468 -63021 -13116 -18807 -98926 -138893 -142936 -62171 -49205 -53292 -88782
15832 -88782 -74530 29254 11801 -62837 -54976 3912 33274 32206 -3387 -15836 -6509 -1308
15820 -1308 23958 -44723 -132112 -86152 -53876 -71246 -68431 -45957 -60892 -79801 -66042 -18231
15808 -18231 65002 103424 78880 90694 88606 85888 34121 -17251 -29156 -4999 -30206 -47503
15796 -47503 22700 20866 -25065 9382 90599 90840 8675 -21035 -6100 -4834 -39402 -36153 -18765
15783 -18765 -56302 -121664 -110609 -59070 -28634 -47858 -73517 -100996 -26470 21715 71103 -24517
15771 -24517 -86628 -40598 34860 83691 91038 67038 64372 53292 36785 20189 35595 31467
15759 31467 -1753 -63713 -85699 -63363 -73271 -54434 -38874 -21542 11416 39943 48515 -3134
15747 -3134 -36443 -33608 920 8611 23995 7991 53427 105011 55378 53757 81816 84646 49969
15734 49969 36845 77608 56982 -18452 -34854 -40110 -62539 -32005 -19254 -27346 69347 124764
15722 124764 96725 45110 -9802 14943 74905 115541 109306 87430 44843 24523 30455 26758
15710 26758 44655 100782 114398 72764 67769 75996 111879 37670 8933 -9995 -46808 20870
15698 20870 45561 41624 59282 51840 14283 25158 11658 1828 -12642 -1259 71715 123345
15686 123345 113056 84207 78023 60354 63875 106161 107749 47873 31873 71925 48428 4526
15674 4526 -60355 -96651 -62409 42205 127068 102237 51368 72032 91620 67626 74009 71835
15662 71835 32345 16374 85568 141070 135110 151883 131907 62070 2151 -62405 -52753 -32655
15650 -32655 -12025 60236 71622 17382 -35550 -28426 26786 59050 75882 87405 106046 105757
15638 105757 39602 16197 -13023 -82401 -53303 13203 42855 1576 -2627 -5603 -45985 -79021
15626 -79021 -58573 17462 48917 63218 50224 68323 71371 62100 4181 25010 12281 45465
15614 45465 21409 6262 -18864 -58522 -80788 -64956 -68822 -93704 -54708 -4145 11923 54530
15602 54530 100705 98305 48115 41185 27889 10973 -2867 37747 53111 42194 7414 -799
15590 -799 49686 -7538 -3025 53116 65526 19033 -18005 -12089 29658 16924 24935 27665 -6743
15577 -6743 -39946 -43622 -20076 -25146 -83 -16845 -16235 -40212 -60300 -53156 10290 12849 -17031
15564 -17031 44129 83692 70660 44146 37512 -23411 40548 75911 53622 -1942 23991 -9910
15552 -9910 -45778 6040 -24103 -50801 -69342 -184548 -193223 -157575 -46730 -16463 5143 -3806
15540 -3806 8945 72933 113089 98469 46657 37800 51202 71405 59830 2874 -4100 42953
15528 42953 31260 22954 64707 38116 15981 -42071 -87047 -92451 -60884 -39053 -21082 68653
15516 68653 141197 138525 112742 47341 -10961 12030 -29438 -59100 31518 21350 -7260 -55280
15504 -55280 -59420 -29431 -28089 39827 25060 -26209 -1266 -122 -59901 -22624 -43092 -78453
15492 -78453 -58044 -34588 -47103 -48686 11891 -1272 -139024 -215219 -145401 -46067 -26874 -32370
15480 -32370 -47149 -31070 -40985 -18058 -21084 -26232 -36529 -6423 -16566 -14379 53493 84460
15468 84460 81366 67489 14865 24867 33817 10719 -17920 -61523 -73026 -32400 11514 -6350
15456 -6350 -20879 -34120 -9697 5588 23702 49129 51273 84364 127506 107048 84959 52439
15444 52439 -5978 -29248 -52050 -28822 37729 51516 -19684 -58986 -11220 73962 90325 16588
15432 16588 14537 47776 56412 13234 10516 7705 -21817 26683 106426 131348 48592 -69622
15420 -69622 -63299 -36889 -21682 9524 -28403 -578 13294 -3287 -5415 -6438 512 1802 10658
15407 10658 26495 30399 64005 115441 119629 9330 19666 4629 3414 122 -45648 -77600
15395 -77600 -103120 -86409 -13876 -21070 -87849 -59519 -14759 33875 -5226 -27120 10848 -16842
15383 -16842 27064 68750 88491 63908 73765 135611 118636 73060 10991 10916 51837 16061
15371 16061 17716 41243 50429 56631 60843 -9200 9692 59469 73241 83985 58939 -5183
15359 -5183 28712 41793 29857 59474 47112 25297 49573 82203 44245 23245 34786 68620
15347 68620 100462 43765 38668 56324 63520 55385 8104 12675 53924 17379 54080 38581
15335 38581 -35023 288 62210 33098 -36081 -41780 1635 -1399 -19904 -10607 -11352 -5129 11574
15322 11574 34572 28485 -16669 -71084 -111448 -88709 -69297 -38403 26940 71982 15055 -46787
15310 -46787 -31473 25220 44630 -9840 3865 -19746 -87890 -43231 -38040 9653 24969 2915
15298 2915 -51228 -48130 11023 33755 18537 39457 20670 -28363 17349 12207 -34829 -92016
15286 -92016 -71085 782 32104 29897 -12107 -19511 -22355 13114 58307 160479 194915 106602
15274 106602 18849 41018 21704 58830 109915 96296 56977 24966 37131 94369 88149 21230
15262 21230 -11719 -56840 -67473 5711 70033 133537 95656 60025 27956 5351 -6998 23481
15250 23481 34325 44267 44478 43225 -32565 -41632 -5285 -9860 263 -25533 -28092 4193 -29076
15237 -29076 -74150 -69448 -62199 -83638 -61720 -65004 -84667 -102511 -80256 2569 14320 -891
15225 -891 -12738 8225 30997 13770 -35082 -78620 -69689 11144 43265 -1867 11120 22727
15213 22727 47971 -6877 -20087 -13614 -12128 -1663 -21733 -51978 -26879 66883 99486 108138
15201 108138 73766 20075 -15254 -5905 739 -23162 -5958 101224 123373 92750 117788 106830
15189 106830 51936 30459 6878 -1430 59116 66367 59704 684 -54614 -32797 -71872 -104969
15177 -104969 -42350 -17080 -14727 -29325 -55068 -62610 -5217 40769 100221 113301 118237 159417
15165 159417 139527 49769 6868 -23563 -29823 -40148 -82249 -57894 43937 22681 -5536
15154 -5536 34854 48960 78747 13032 -24375 -13629 25203 52270 77158 41468 18909 33819
15142 33819 57755 35725 52460 23666 108 -5469 -10954 -50337 -14253 20085 36866 39215
15130 39215 21721 -7596 -36226 10159 48056 34761 -42848 -32648 5544 41251 34032 50610
15118 50610 -4537 -91212 -95709 -83860 -26015 -48358 -23942 35530 70613 103563 91531 6762
15106 6762 33045 11090 -64232 -55588 -61145 -35467 23493 47818 83291 94778 37393 1458
15094 1458 -72066 -32262 -33788 -82699 -132710 -118563 -85105 -31461 -34003 -46297 -67776 -91990
15082 -91990 -125185 -44300 97625 154415 109821 102854 40230 1740 -8537 -42327 -25959 -10031
15070 -10031 25683 104341 133226 125723 111886 90166 116901 14521 -48312 2250 5636 9690
15058 9690 3275 -17224 30035 41235 13805 42133 71160 60504 84421 108737 72081 1863
15046 1863 -17579 11949 54064 47598 3264 -62504 -46868 21099 28172 -11108 -65624 -45845
15034 -45845 -4794 46897 69106 68224 88198 103446 37242 38200 74114 75090 16491 23225 -14870
15021 -14870 8156 62661 91919 111238 65776 38831 -2006 14909 4644 -22069 -16571 -32508
15009 -32508 -78122 -73233 -3690 11981 5831 30 -46741 -24200 31714 32613 53466 109678 100744
14996 100744 104480 129050 112546 56021 35731 52723 -10688 51262 42796 -33431 -61343 -16163
14984 -16163 6066 692 17253 9059 49098 81139 74820 45764 62236 39521 26733 55492
14972 55492 32782 -5512 27606 40471 72530 42202 -55016 -14000 5250 12791 -24297 6724
14960 6724 46000 55679 16821 -15046 -56479 -76514 -35115 -43213 -50332 -38172 -44334 23810 131139
14947 131139 155016 106145 49851 47975 7387 7544 48254 55340 32970 62052 105216 138633
14935 138633 106107 96791 65439 65620 41716 44168 76235 62522 56894 68462 17769 -37848
14923 -37848 -41551 9198 16200 48125 40225 41047 30373 45617 91184 126846 120966 104949 8281
14910 8281 -69640 -68180 -31854 -48455 -7744 -32612 8653 69949 59780 56684 72945 72129 15935
14897 15935 20993 31481 22351 -28452 -32071 12544 54224 91633 67794 83979 3375 -28993
14885 -28993 4009 27719 16840 81539 113537 111277 51253 7902 17816 28161 31138 65900
14873 65900 116746 121128 87211 77473 65250 48260 39426 18074 -2674 -5596 16860 73440
14861 73440 71127 57818 52466 75753 75620 71509 64860 79029 96739 102052 89591 82242 65339
14848 65339 68917 108391 131146 66614 -16414 -59654 -82126 -127885 -99110 -1840 20286 67199
14836 67199 -10470 -31887 -6296 -13075 17051 -4198 12807 8863 -16464 -21235 51693 32699
14824 32699 36770 61017 78840 51049 38164 -11173 21382 46243 44076 18181 67513 84955
14812 84955 93784 51430 78466 109759 158880 161706 135671 127217 74320 77023 69261 73902 121702
14799 121702 168248 114321 12808 13599 58028 34003 26279 66509 76745 -18883 -104050 -105787
14787 -105787 -70339 -6649 -17869 -10582 -4379 -13953 83264 122880 94186 151568 124792 84561
14775 84561 61614 99436 120797 90342 65591 53979 15011 12256 30363 13727 -33344 -54364
14763 -54364 -19373 81645 117396 46310 9505 33445 118715 96435 71595 12120 8882 43703
14751 43703 54484 8680 59160 116592 97565 83837 94368 81928 64392 38777 34068 52284
14739 52284 54543 41826 -14708 -61666 -71750 -72927 -37891 -28817 -57010 -58602 -38900 -14732
14727 -14732 -7676 -56387 -106755 -89884 -61190 -66116 -43983 -43717 -77393 -52722 17365 96186
14715 96186 123479 105684 58196 31773 -37847 -70150 -25366 25901 19507 39862 16463 -10343
14703 -10343 -3734 29614 19483 -9156 11858 86800 88537 43152 11592 -39351 -52993 33426
14691 33426 91204 49383 28990 77090 72027 60390 62436 47650 30008 39017 28051 55020
14679 55020 73068 74664 50056 624 -19194 35415 136173 182935 160895 145216 124759 55857
14667 55857 5125 -6981 83450 141277 108322 66785 45324 86531 135594 129748 108375 71002
14655 71002 86293 95135 147384 137603 103645 99009 102989 94160 86275 138775 107501 118486 148320
14642 148320 77418 5099 -19528 -29906 -28894 9084 4311 -30591 -32464 -33179 -73851 -62417
14630 -62417 -25797 -9565 12503 29853 94101 66222 48588 47938 46492 6708 36971 44979
14618 44979 36537 77665 108280 110324 46969 18254 61680 93527 94304 100306 100586 66585 82058
14605 82058 49516 38031 7978 -41173 -56203 -45003 -34479 -61329 -80456 -17280 29439 28188
14593 28188 43316 -7592 -29688 15432 80598 90847 65701 41289 98381 95438 39785 -12216
14581 -12216 38518 70371 68469 57729 17905 -16324 -3727 13141 45058 56440 89953 142148
14569 142148 155914 149211 175533 97593 92345 113169 98926 64155 639 -3706 -17817 -46046
14557 -46046 -10291 -2424 -9412 29787 52510 10904 3424 62005 137012 115871 39464 59086
14545 59086 10903 -25185 -10047 77024 92483 54021 956 20623 30328 6731 12665 51049
14533 51049 35983 16237 4129 104438 109263 63917 93235 115759 56323 66108 57503 -2614
14521 -2614 -91647 -76243 -75375 -103061 -37640 63148 60497 38027 -17365 -74758 -6191 47670
14509 47670 76322 106482 36351 -42902 -39167 28421 113334 90448 105478 66878 61476 74846
14497 74846 72621 38840 42258 93929 102140 29225 24885 20186 24298 125922 156823 159655 113655
14484 113655 82848 90139 77598 75601 34089 33161 59078 44852 39728 51028 70459 46006
14472 46006 38412 37492 62564 93413 78518 79414 55493 31204 3902 15724 24356 -4621 46786
14459 46786 95788 125473 87851 30960 31594 74222 111275 105030 65803 92883 79113 143271
14447 143271 138751 122362 98681 88978 45951 79416 87588 85556 118958 120974 136667 93364
14435 93364 94463 57707 57924 105079 81889 143109 132943 76820 101504 108279 70032 37688
14423 37688 97922 185345 138734 89527 92685 89524 88156 46423 17925 -21502 26405 14602
14411 14602 36982 20814 15705 -30615 -28239 -19730 -3666 38477 93943 119967 105790 108069
14399 108069 153057 136584 62739 114259 118659 65449 42841 75851 70985 58676 96866 124390
14387 124390 116896 141289 184902 148554 120252 78966 40653 17437 26110 49543 4881 19272
14375 19272 88231 68621 90126 124225 82367 54102 63609 44836 48897 47644 81205 103324
14363 103324 106646 95864 100416 58375 74384 72312 95422 49055 -42544 22288 86574 49681
14351 49681 2250 29417 105779 78520 -6049 -212 53431 84145 100786 137609 180759 173682
14339 173682 87414 51115 85980 75788 60332 58448 61712 122574 190461 128043 91104 85462
14327 85462 98351 154308 149168 144191 111544 42445 17526 93950 155342 116744 103351 148399
14315 148399 138538 90591 137084 164397 151444 120124 46242 62634 43829 26194 -2389 28998
14303 28998 57317 42846 14445 20307 55981 68007 121855 193967 207895 180413 188937 215199
14291 215199 191384 155895 151417 120099 135475 127332 115810 140313 183072 253875 269116 267249
14279 267249 302909 274419 282104 337983 387467 404679 453155 502382 518753 482299 415942 365009
14267 365009 318987 268964 234029 266477 293625 260236 174592 128908 181534 201828 140031
14256 140031 137423 90109 123287 150436 145784 151198 91574 81957 110209 148059 75351 44510
14244 44510 106696 110317 142851 175071 134897 102951 70569 45855 -22298 9821 26385 36959
14232 36959 15486 6325 38719 79421 72826 34457 70218 96017 132069 59300 -8256 6458
14220 6458 68860 114002 123795 114778 88857 132234 157080 113128 110325 168767 196168 128912
14208 128912 100668 108010 100031 94257 127183 188981 225112 203909 141863 140423 168950 170426
14196 170426 87062 87840 112825 86273 125547 118141 53103 31819 26364 23006 41516 48034 54774
14183 54774 47042 93114 147824 139980 119741 118530 101017 92461 57606 81172 142234 171446
14171 171446 154241 114058 26260 -14651 -4723 35459 63018 33967 -39300 -38473 -31561 -29849
14159 -29849 -46552 3110 29568 26782 46163 124385 196286 272670 212996 135231 50745 5053
14147 5053 1775 98785 193206 183326 163055 177361 156715 133291 153325 92716 98488 78575
14135 78575 70754 76822 97905 60504 -2599 8305 70491 124357 126529 142076 194212 220502
14123 220502 240851 217707 218837 165214 136558 172490 213752 156590 138139 198758 230705 201077
14111 201077 153036 110962 157319 133147 85289 109411 132911 146868 201410 234012 231384 214942
14099 214942 167961 150092 103571 103323 146198 172893 144317 162276 179713 195801 199570 163072
14087 163072 143387 127237 169676 231133 220774 244439 222166 215571 223873 174118 99012 107498
14075 107498 64598 90706 117958 141412 156655 137937 163840 179685 197124 206612 120571 25011
14063 25011 4165 -16439 23180 70547 61009 62865 85567 86789 93110 95333 103872 89081 31048
14050 31048 77144 105060 71777 50361 121979 146321 126962 102809 85742 82563 61421 24741
14038 24741 25364 11195 38665 40233 11169 -4193 25717 21533 46074 72609 20636 11248 70655
14025 70655 64658 80061 66294 72838 57421 52231 94101 157233 104343 32972 81186 123659
14013 123659 134401 142956 127441 77628 60068 95943 108385 135767 148651 108821 140883 149470
14001 149470 154112 135707 184867 225251 258145 172271 178468 159025 131496 136801 101037 90128
13989 90128 76570 121982 161254 143333 121103 69459 19168 -7721 -11577 41850 42950 77330
13977 77330 157352 153453 107614 41050 22484 79390 101888 157047 184816 126192 103396 70072
13965 70072 57553 130353 167218 153675 178999 178492 138487 147808 129217 125408 139786 107023
13953 107023 99060 98696 95296 160617 206189 220618 228344 245095 218099 186729 231256 194583
13941 194583 138350 140198 90137 76939 111656 123328 113582 89937 32120 49503 84831 135186
13929 135186 94776 110834 126762 121433 138293 183358 180145 137795 143599 142321 160283 107013
13917 107013 88752 94837 93004 121234 119126 149098 198651 170629 146863 142569 74539 120753
13905 120753 138273 117697 111829 106418 136130 150688 123686 93118 46989 114126 232616 233462
13893 233462 183868 145542 170739 140050 127938 170920 125272 94668 81564 109409 136052
13882 136052 114545 128383 166137 162802 93140 49223 79918 113273 122791 149071 169254 113855
13870 113855 106286 156675 205977 244599 289458 289231 254014 202273 197560 252332 220651 170404
13858 170404 217967 247867 267327 220918 184632 169899 193439 205712 183321 175210 196224 171056
13846 171056 102443 112002 112902 145358 126103 118739 179031 194046 140929 116213 156685 194085
13834 194085 150445 194023 173096 141813 155653 112463 60356 97856 175176 191704 177615
13823 177615 154998 98444 38837 45529 124519 95642 18759 56629 88613 110886 79341 39053
13811 39053 57909 72231 89286 98251 75348 67592 118918 157675 182994 158681 199247 182568
13799 182568 122650 143746 174822 166090 166715 208595 198908 160450 142678 97519 121862 173015
13787 173015 191105 173442 158278 137189 119908 186975 148054 57570 61637 136993 154065 161850
13775 161850 157334 139603 148666 170267 127248 90868 61899 46442 17217 16515 32451 84037
13763 84037 157699 165512 147335 149036 139205 45766 64497 93641 119353 119015 114456 102753 61355
13750 61355 66863 112977 97674 65763 40651 45115 11196 62912 84364 40968 55290 122339
13738 122339 136627 133568 127605 92795 118321 162659 189345 192789 155035 134735 127399 202408
13726 202408 238419 256180 225742 219849 280525 240580 136173 71936 66918 99600 122929 133112
13714 133112 117107 142743 190213 190796 168357 133281 88511 66794 84515 125189 164413 223399
13702 223399 221877 150154 77243 119268 150004 178595 124126 125109 159774 155475 150752 126056
13690 126056 82912 83895 125398 147636 100902 120897 148660 196169 249974 243670 208264 117746
13678 117746 32774 19350 92941 143494 185552 252867 237885 223333 187150 106732 87904
13667 87904 155453 139563 138200 150607 46139 17104 81447 124022 116404 109072 49682 32826
13655 32826 12886 63076 128552 116645 134443 171786 145043 126627 76418 95853 143210 135232
13643 135232 159206 145549 196729 224288 212402 235751 217518 183836 126347 139981 104114
13632 104114 68415 77287 121431 112898 83449 91292 115852 155999 204710 203940 213564 172017 148298
13619 148298 146747 180536 241322 271344 214480 167237 145362 107003 101865 191141 204869 191321
13607 191321 173957 140362 80362 61243 80826 138375 174605 121602 95769 103242 111809 122986
13595 122986 151627 180165 146499 128283 105297 134889 169690 196071 155851 168951 141218
13584 141218 150609 157180 158757 171034 209693 263938 255250 190137 170453 140717 120462 135078
13572 135078 170132 153804 147960 153048 142839 151063 180726 153852 119072 126150 184416 149420
13560 149420 187532 168947 156036 151061 183276 225114 295193 265902 226226 234528 194509 185757
13548 185757 188533 182899 128805 93439 124331 129916 116886 161428 148824 161510 180467 189009
13536 189009 221166 212843 248910 266609 242059 239289 221993 253644 212594 219771 228493 236639
13524 236639 225810 222564 160937 221137 199310 132912 163551 184721 168655 131392 145346 234038
13512 234038 288889 262160 231134 173143 198120 227174 190703 105146 77786 60811 69571 101540
13500 101540 162744 193901 199149 244003 265534 261321 199280 209197 187465 193055 201667 204461 244323
13487 244323 234076 232855 207683 165880 92740 61398 116802 182976 230897 250824 205910 167962
13475 167962 227121 252625 255248 238186 215600 255441 216788 246151 279800 243886 240935 249657
13463 249657 218338 196537 201599 184706 199763 245843 204059 178983 197098 225916 220429 198160
13451 198160 133656 101579 94479 140442 215378 240226 247123 237755 196877 186094 201853 209767
13439 209767 232497 263821 246479 134716 154299 185354 211911 223881 187155 171863 192396
13428 192396 217076 242766 255771 205930 194652 215906 223826 180376 225740 244693 210893 145164
13416 145164 135598 147471 172995 189805 180676 207566 166865 161511 206761 212800 196590 210871
13404 210871 231738 248112 235335 157989 132309 152595 184747 240785 258501 246540 238913 214420
13392 214420 142141 114151 172069 262367 301653 233867 252672 263090 310233 327536 285927
13381 285927 242438 172269 178492 204216 198996 207644 245017 208058 230910 232230 208213 148988
13369 148988 133038 174767 225056 238793 303632 262160 207134 220248 206511 203010 248990 243790
13357 243790 250162 222154 240247 247959 262862 239823 179757 173725 174053 189670 206550 224041
13345 224041 352252 385904 338865 261889 219264 189101 165602 219319 297897 316034 339508
13334 339508 340011 291468 240969 255594 289446 270828 292188 303887 262052 202556 243606 259523
13322 259523 315640 376344 365393 342755 335583 335342 290806 299517 266306 217009 195753 181290
13310 181290 153885 224152 249539 195144 174171 254792 296811 220031 228109 232840 217712 223072
13298 223072 219821 240757 269060 269983 303595 333713 343885 314102 189753 181569 169621 178027
13286 178027 228091 240720 232641 261646 271604 257181 266101 250050 207562 205662 199738 164386
13274 164386 187767 223209 230518 228244 227979 199201 210463 250543 287633 290513 263201 271393 225149
13261 225149 291042 287946 265465 316088 368270 326023 251275 217955 222834 250936 297617 315018
13249 315018 266315 254453 249555 286279 293728 278640 279654 295827 234473 200315 177254 309660
13237 309660 337382 325578 432339 456333 372972 359328 303345 329583 358320 380112 388510
13226 388510 374111 346252 320890 281194 293282 289567 289299 328433 397579 430527 483922 513877
13214 513877 568092 620354 587143 534041 498728 449060 451863 421974 411391 423505 424890 404683
13202 404683 399566 458203 458388 434905 445647 426413 403079 401360 414278 409371 386847 392390 348316
13189 348316 368034 382073 369446 375646 358858 347550 287284 311344 323643 298622 361381 424573
13177 424573 440582 375887 322122 254264 177437 201535 280309 341200 403435 479367 532399
13166 532399 469199 350893 316016 262386 357703 427544 470416 481060 369794 368076 415602
13155 415602 372903 315185 311077 344345 355882 388644 371436 326608 350246 295244 265795 221408
13143 221408 239252 278450 272325 282357 335334 327675 284021 273887 264843 396038 438100 399992
13131 399992 369187 398829 441653 394935 377498 410266 397310 395012 392264 364570 370205 352641
13119 352641 352025 359658 365923 410176 370326 367899 315861 281838 260421 301756 328999 342935
13107 342935 430757 452817 447880 379784 316024 284877 303205 331407 359615 362441 374857 376732
13095 376732 406436 447432 472925 509072 491390 402875 359832 372668 378744 372795 409914 454151
13083 454151 504722 532372 433496 396215 415888 462331 395021 348660 343361 303571 283894 297262
13071 297262 337417 349126 334844 343711 373526 398057 452898 506225 499655 481851 459752 392711
13059 392711 346688 321393 351289 367019 345702 348429 408972 415935 429287 442578 362674 332119
13047 332119 361295 402722 403424 416363 386907 401494 422893 449551 411227 367402 359695 374168
13035 374168 471958 405241 334984 353866 349814 395332 380161 333183 376225 431063 381809 311426
13023 311426 335494 356131 342561 406711 415740 405613 408955 406654 405810 388488 326930 335455 344909
13010 344909 373956 429770 474131 464538 466902 477436 490420 474826 480751 470638 464609 403712
12998 403712 376367 397740 419735 477057 518511 541808 536424 492217 486465 536289 524390 476398
12986 476398 502424 481143 436675 488329 465061 457017 443783 424902 371365 328034 334996 382016
12974 382016 410843 417979 453906 464437 429275 449971 464617 405401 353789 367941 393145 418637
12962 418637 485793 474940 452931 471274 474291 416606 410884 416248 408413 410663 465333 545250
12950 545250 501084 431326 477120 507534 412041 366300 376873 399326 464138 457147 409929 343051
12938 343051 341601 383277 312134 329921 385228 432779 490032 486603 499227 504363 538925 504417
12926 504417 468449 496176 494317 478243 425796 467757 515506 561904 594027 535982 428134
12915 428134 404402 461810 539548 533302 509175 550517 525762 495414 489099 502016 542633 523079
12903 523079 478326 524914 567193 543168 483339 461153 450992 485167 511108 496161 487045 515944
12891 515944 604775 624122 527973 497739 492033 461293 441660 473332 533911 569097 619172 658250
12879 658250 629320 560267 545768 561117 587076 611576 635721 614445 558402 540935 573811
12868 573811 561093 582987 590208 621134 618608 638340 630557 596667 545623 564089 592274 634456
12856 634456 627657 608805 592353 563414 546010 520962 584298 558447 508927 475074 508561 552658
12844 552658 546902 515565 559388 593931 645422 662680 651634 686169 672485 700353 704976 644125
12832 644125 615375 620755 612433 578655 577104 551418 530192 536873 615149 635427 622932 562053
12820 562053 524396 562793 543034 571971 597576 618581 587627 508164 536423 647029 669336
12809 669336 609007 594378 622751 680970 654475 676884 679300 682449 635004 619395 631223 683412
12797 683412 683220 690949 648062 664380 666180 680974 699462 721954 688466 629390 660495 743056
12785 743056 777330 829654 851948 881774 923751 1026595 1134934 1200496 1226486 1183288 1121844
12774 1121844 1040291 1012446 963773 883756 838570 826918 827399 839677 840541 784528 756735 746198
12762 746198 762861 747976 712161 725375 790634 865004 860887 818153 778700 808980 817974 787295
12750 787295 783382 797894 746135 702582 698257 738892 758624 739349 786783 748800 751814 753102
12738 753102 745350 746170 802911 839972 777376 733417 708408 712486 725624 753346 749650 717045
12726 717045 725188 703971 785569 757034 750346 788981 807270 830479 848510 875795 859484 852652
12714 852652 828904 813650 819847 800195 762345 734246 716204 763306 854555 858072 769566 773593
12702 773593 774775 755106 811113 813132 765697 802835 780565 702737 701036 767688 787190 831821
12690 831821 851153 881426 894715 899821 818030 810654 782388 752145 769299 763138 783155 817618
12678 817618 750689 741259 766693 827356 866173 921925 941828 892951 812815 811274 807694 763640
12666 763640 777402 834227 867444 857014 826791 797232 852042 900015 947527 913895 900024
12655 900024 867165 873737 896918 927650 881624 840506 831368 852387 912327 944230 959001 955750
12643 955750 889851 850748 843089 834220 865532 907169 991995 1031653 991961 945735 930302 945662
12631 945662 917486 926331 954055 937228 902132 973304 1023416 963547 940086 961536 967958 962601
12619 962601 1027865 1005621 1029850 1041488 1009300 968648 958893 989651 943383 915257 896966 931352
12607 931352 950146 966592 984703 989792 984991 1003885 1041409 1003966 1004125 974798 952325 902147
12595 902147 896276 885694 932143 996533 1030339 1077279 1099173 1119349 1132623 1093060 1098489 1127693
12583 1127693 1099300 1110048 1073002 1063285 1063393 1032788 1009865 1030975 1050870 1067516 1123973 1048695
12571 1048695 973841 985947 1007196 1016685 1042558 1076801 1069115 1117283 1161091 1136483 1138495 1165391
12559 1165391 1137517 1157854 1153047 1108559 1136187 1158018 1182770 1256053 1248320 1188671 1165736 1155484
12547 1155484 1103280 1036510 1013743 1050193 1102480 1141448 1151768 1146246 1167141 1137226 1079608
12536 1079608 1058559 1126983 1101751 1091043 1118779 1183697 1212285 1197932 1230265 1262274 1233233
12525 1233233 1246489 1260550 1231581 1255154 1348070 1357808 1371528 1358101 1337092 1257560 1150546
12514 1150546 1132426 1184467 1222547 1268113 1256275 1220542 1278714 1268097 1289872 1295473 1286627 1313753
12502 1313753 1290003 1253162 1319062 1402207 1400615 1397701 1398599 1433813 1485960 1528028 1483945 1411911
12490 1411911 1376427 1369985 1391977 1378811 1385132 1411662 1429082 1452472 1410207 1438885 1454523 1482844
12478 1482844 1512300 1459803 1423144 1519021 1538720 1527702 1504145 1495666 1539711 1549050 1475135 1471121
12466 1471121 1460894 1478187 1443019 1401538 1403806 1457904 1539668 1561368 1556713 1572904 1571344 1528817
12454 1528817 1529230 1572272 1559720 1584888 1609850 1564809 1531797 1558267 1622859 1679632 1670299 1571585
12442 1571585 1565081 1587115 1644741 1695191 1662739 1699782 1716237 1736021 1733336 1679738 1731506 1812160
12430 1812160 1842932 1793523 1729248 1672761 1655665 1680417 1673366 1703328 1654386 1635240 1628473 1640457
12418 1640457 1690143 1679037 1699217 1745493 1815000 1857736 1861486 1865834 1932569 1948082 1910556 1871169
12406 1871169 1806493 1821712 1904334 1864447 1801572 1832802 1848232 1822393 1795442 1818084 1846603
12395 1846603 1881346 1936245 1907622 1852581 1817638 1870277 1900593 1911024 1948999 1962874 1962321 2018434
12383 2018434 2037003 1971867 2025439 2019699 1967387 1925207 1893414 1955468 1975958 1957187 2001631
12372 2001631 2015734 2032752 2065310 2146435 2168098 2126792 2149762 2235456 2248494 2178508 2154057
12361 2154057 2137965 2170990 2196546 2205469 2167653 2130958 2147521 2134556 2158755 2206476 2183371
12350 2183371 2187857 2219781 2217928 2190679 2154139 2203302 2287927 2267192 2263101 2253784 2258863 2275959
12338 2275959 2357604 2399872 2383928 2330834 2324496 2361251 2407928 2454457 2414676 2429217 2526909
12327 2526909 2541359 2501149 2501792 2493630 2479720 2478048 2504492 2511952 2479374 2464221 2519304 2522931
12315 2522931 2523642 2520596 2522421 2544044 2555502 2631988 2700386 2728850 2683725 2627385 2667497 2707880
12303 2707880 2683763 2694474 2687946 2681630 2681752 2722590 2735951 2794953 2838330 2806962 2768944 2766596
12291 2766596 2743661 2719510 2802784 2857257 2837701 2815731 2869300 2882943 2842656 2890465 2950162
12280 2950162 2966013 2979511 3000941 2991338 2965821 2978182 2959978 2947724 2934851 2963977 3056539
12269 3056539 3181510 3221436 3200620 3246049 3242733 3170105 3179042 3236389 3270163 3289653 3310470
12258 3310470 3300128 3370446 3379193 3360708 3350632 3349190 3293090 3283474 3303718 3322650 3364853 3386778
12246 3386778 3339827 3355998 3438932 3500527 3547888 3479221 3392488 3417488 3462615 3488709 3538149
12235 3538149 3529015 3590913 3622857 3636651 3594201 3637949 3681551 3709520 3701927 3726764 3807337 3824563
12223 3824563 3846546 3831650 3868318 3880707 3889210 3925509 3969720 3987570 3996396 3958083 3949368 3989635
12211 3989635 4012511 3979213 3976379 4023786 4089598 4121902 4144939 4194665 4208153 4184332 4170478
12200 4170478 4189389 4234783 4287002 4299159 4371896 4387090 4383230 4411543 4430391 4437665 4416673 4450652
12188 4450652 4504647 4468824 4494909 4514129 4494683 4506218 4523470 4572413 4636346 4664482 4689929
12177 4689929 4733450 4769570 4782235 4779004 4837613 4888335 4825376 4828725 4877253 4907657 5008566
12166 5008566 5048072 4987014 4972255 5018439 5047001 5051636 5098003 5157439 5194152 5207340 5221788
12155 5221788 5273507 5314531 5319492 5347591 5406080 5409532 5433520 5473381 5550020 5550219 5520464 5477982
12143 5477982 5464054 5506284 5588330 5616847 5696064 5746277 5766851 5784734 5779483 5812849 5904606
12132 5904606 5971678 5956563 5928041 5916847 5948939 5973498 5975762 5934474 5929850 6069023 6190083
12121 6190083 6214689 6220213 6270812 6223250 6200476 6268524 6302700 6417433 6454730 6474231 6466324
12110 6466324 6456441 6466517 6497193 6519387 6558335 6622586 6749093 6814724 6794705 6757930 6716265
12099 6716265 6783992 6879270 6905105 6937519 6958729 6998608 6997317 6999657 7064240 7109528 7107820 7177190
12087 7177190 7264362 7287078 7324198 7392844 7424237 7406946 7409376 7461494 7462169 7491986 7516796 7518933
12075 7518933 7549999 7615907 7708885 7703001 7674832 7731569 7817488 7834103 7859190 7894232 7927018
12064 7927018 8003840 7992755 8047367 8059823 8077834 8103690 8159223 8276801 8356481 8344917 8322741
12053 8322741 8347967 8380072 8434294 8483853 8584712 8617179 8614823 8642507 8671723 8615922 8639047
12042 8639047 8696427 8707785 8730816 8789991 8856687 8888893 8951836 8941835 8954492 8960411 9007122
12031 9007122 9011088 9026167 9129650 9163998 9189508 9254298 9293446 9294011 9284994 9291945 9325077 9362253
12019 9362253 9399574 9451707 9504335 9508638 9545360 9611434 9639637 9648796 9692117 9695247 9769506 9817372
12007 9817372 9846747 9873003 9844971 9793515 9833735 9926686 9971984 9962050 10024849 9986903 9961010
11996 9961010 10049187 10135165 10174136 10188676 10189066 10205696 10209547 10258128 10264456 10277527 10360284 10418947
11984 10418947 10429651 10391869 10377782 10372540 10350285 10381306 10395192 10425598 10472342 10465472 10422353
11973 10422353 10435202 10503555 10598277 10578541 10563561 10552732 10536459 10542662 10564164 10569123 10561614 10613603
11961 10613603 10645822 10655124 10644645 10645414 10657088 10701333 10719225 10727335 10699675 10719641 10669415 10648347
11949 10648347 10720985 10784220 10803990 10773713 10767742 10761550 10745275 10679210 10593673 10568030 10562291 10623075
11937 10623075 10670044 10727308 10689540 10643653 10660425 10635750 10565026 10560995 10523800 10488374 10540392
11926 10540392 10575395 10535678 10611345 10562599 10530528 10520244 10475116 10435431 10413172 10402411 10397380
11915 10397380 10458344 10467840 10378706 10363518 10496390 10478873 10394564 10353275 10332996 10293210 10269000
11904 10269000 10195362 10142451 10135288 10151851 10097608 10055905 9986876 9991227 9991994 10011155 10023824 10008430
11892 10008430 9954245 9878835 9856876 9870868 9767114 9732393 9770865 9716630 9602844 9571683 9627656
11881 9627656 9675503 9640004 9593429 9547843 9546259 9521330 9499671 9500633 9397750 9371148 9354702 9337282
11869 9337282 9248473 9196994 9249148 9233286 9204185 9139578 9098623 9097827 9063534 8992872 8957914 8982712
11857 8982712 8949655 8896465 8833603 8765959 8687065 8665214 8620809 8568520 8596432 8546713 8510634
11846 8510634 8479494 8463021 8446183 8427811 8391581 8339889 8294439 8287668 8294594 8280385 8236379 8172455
11834 8172455 8093514 8054460 8078796 8093770 8082826 8036031 7930335 7888536 7826925 7755341 7753868
11823 7753868 7724543 7648942 7593194 7511173 7463787 7395073 7367773 7365857 7343813 7362929 7370021 7336455
11811 7336455 7238444 7209438 7156527 7130834 7077930 7060615 6981144 6977740 6999023 7050344 7075504
11800 7075504 7001550 6913642 6775288 6744798 6747846 6753920 6706939 6657894 6629631 6614327 6579619
11789 6579619 6600727 6568923 6493613 6459180 6429759 6419681 6361746 6274599 6212791 6172685 6139703
11778 6139703 6144122 6086299 6041494 6033363 6039878 6018452 5935633 5832898 5761825 5757410 5791662 5773966
11766 5773966 5778997 5781573 5759064 5742929 5696307 5627820 5598953 5585372 5567465 5497503 5430474 5398812
11754 5398812 5412326 5395033 5463557 5485663 5374489 5324350 5255774 5230181 5273158 5285980 5224384
11743 5224384 5225939 5235317 5177480 5078433 5005706 4955615 4941594 4958390 4962035 4954187 4900861 4839088
11731 4839088 4796803 4761188 4704417 4640457 4681871 4707323 4704338 4711779 4702167 4671434 4639585 4543205
11719 4543205 4512247 4510072 4513151 4530315 4507698 4444384 4375035 4349047 4360332 4349759 4357071 4360641
11707 4360641 4366927 4293848 4266938 4249676 4223297 4155812 4162643 4145553 4111930 4037646 3940408 4016533
11695 4016533 4084085 3985173 3927098 3934780 3941200 3964612 3907510 3898850 3943523 3919193 3820338 3788133
11683 3788133 3814036 3769694 3780854 3749260 3736730 3714646 3672981 3655541 3644943 3647856 3652309 3637016
11671 3637016 3601289 3556277 3544371 3522807 3493545 3443418 3431566 3518649 3543617 3550861 3573498
11660 3573498 3573938 3549538 3502138 3409486 3373553 3288439 3272326 3264627 3269321 3258243 3295163 3309352
11648 3309352 3347917 3356862 3384202 3441398 3477400 3533558 3533037 3443893 3344547 3310926 3254364 3210129
11636 3210129 3225116 3158266 3143155 3153275 3165565 3178208 3132048 3007926 2931759 2888080 2863113
11625 2863113 2862425 2907146 2900770 2845673 2832623 2794072 2723559 2704429 2686093 2678569 2669853 2594276
11613 2594276 2639799 2629821 2615834 2623241 2649871 2619574 2611539 2597315 2565766 2493159 2520344 2539284
11601 2539284 2593510 2621817 2548053 2503693 2471230 2490024 2464969 2369106 2363637 2357942 2318571 2260963
11589 2260963 2271860 2265534 2282842 2334843 2373475 2337194 2314269 2323718 2355895 2314054 2228201 2258183
11577 2258183 2315352 2359494 2356925 2289919 2296087 2269811 2167470 2174537 2221373 2232785 2240041 2213343
11565 2213343 2148526 2107023 2101592 2123961 2162337 2158188 2101406 2024158 1995772 2046380 2017846 1967987
11553 1967987 1910392 1955736 1953289 1961322 1932362 2006825 1999567 2013636 1992800 1980354 1991652 2051079
11541 2051079 2010202 1953138 1916029 1947542 1932786 1894517 1949681 1971831 1945053 2022133 2019823
11530 2019823 1948616 1929759 1941606 1938114 1943090 1924927 1911432 1867622 1877674 1946529 1946888 1919773
11518 1919773 1894500 1831836 1775313 1753386 1727550 1755988 1767181 1717935 1698715 1720874 1694287
11507 1694287 1716082 1681276 1644798 1627723 1701496 1697635 1636142 1632794 1634644 1605025 1607032 1655403
11495 1655403 1696094 1627773 1522139 1457713 1525220 1602332 1577583 1601005 1613546 1612969 1566830
11484 1566830 1529768 1518147 1609777 1589501 1534304 1567065 1618260 1615136 1535035 1476376 1504161
11473 1504161 1512499 1519102 1501057 1478843 1438048 1449030 1439786 1467150 1502840 1529578 1526222 1551717
11461 1551717 1467326 1373545 1394810 1398060 1430251 1456001 1483135 1495115 1505841 1499805 1535816 1534320
11449 1534320 1444376 1398119 1391936 1426305 1383747 1383872 1433905 1437982 1362799 1335665 1323493 1356924
11437 1356924 1349394 1349841 1312747 1304270 1317410 1366696 1341032 1343516 1349258 1359457 1310160 1304109 1362346
11424 1362346 1352869 1305123 1237135 1227425 1285553 1246475 1217199 1218739 1174119 1158622 1182337 1222539
11412 1222539 1242362 1234110 1260033 1208659 1172337 1111438 1057456 1073713 1104223 1105577 1110359 1139751
11400 1139751 1129327 1048367 1091025 1146683 1157961 1164372 1123742 1098075 1071860 1003257 1016648
11389 1016648 1062506 1106245 1135379 1146334 1153162 1227760 1184617 1117350 1145140 1160883 1173048
11378 1173048 1158576 1162825 1141333 1130535 1190593 1237910 1174423 1113626 1084906 1129046 1138232 1150524
11366 1150524 1116598 1112788 1149153 1173956 1108227 1065807 1053152 1065477 1031852 972058 952768
11355 952768 935609 948082 1043319 1110097 1065267 1054814 963786 918817 946691 992224 1048119
11344 1048119 1024966 1010615 984579 1022572 1013018 978297 1016817 1010291 1013764 973054 957333 959566
11332 959566 912459 873831 842354 871569 930648 990794 979482 976829 937791 879665 819032 811770
11320 811770 877276 972172 990612 1029855 1010289 994277 963674 938954 887735 802354 849366
11309 849366 874797 871686 883855 938043 926349 854782 773752 773128 820229 874386 913118 892482
11297 892482 906351 949819 885014 880090 942785 925443 970738 968614 900468 882489 921485 906355
11285 906355 857596 890933 926872 967755 1001321 974913 955878 882211 839930 830677 759975 730777
11273 730777 771490 804857 788390 764385 790538 746946 793103 783739 771280 853290 846233 791198
11261 791198 796557 755799 739812 739507 741468 778989 816603 757242 742692 744714 740430 714540 714838
11248 714838 698730 673845 692813 800713 867271 870415 815448 782978 842903 847526 784589 794448
11236 794448 823358 825252 757354 790090 890703 935039 856223 846926 887910 891643 885457 884724
11224 884724 913123 912998 969772 1007421 1007357 1099967 1154518 1114216 1210208 1357451 1540285 1702610
11212 1702610 1849474 2081178 2263897 2480186 2749331 3194860 3845271 4875784 6557397
11203 6557397 9215729 13238219 18365661 22928031 25262724 25594720 24116782 20341014
11195 20341014 15175014 10550817 7392895 5442232 4263957 3500981 2974751 2640237
11187 2640237 2367050 2149457 1931762 1783786 1617795 1427896 1324501 1179789 974239
11178 974239 919758 923235 947177 979049 960333 892984 899975 944093 901488 856186 826495 763498
11166 763498 752251 733419 766765 720678 676223 571451 572919 604418 706414 710189 687590
11155 687590 703078 701792 708686 682300 598149 612225 599767 553143 524431 538297 536814 593188
11143 593188 590620 552007 575997 619112 631114 560622 513285 482173 516780 547630 593148 583078
11131 583078 580250 534910 481772 471915 487378 471490 498651 513585 502000 557758 582065 575012
11119 575012 579284 592551 566326 481455 508871 555179 608830 586046 597744 583798 572199 576618
11107 576618 519654 518265 603086 590307 609345 599294 582018 541433 521741 457416 482108 539934
11095 539934 507740 571809 486764 475326 443682 442819 432545 448137 464981 484552 450942 423895
11083 423895 449232 480904 572697 576882 502743 501783 544483 523656 454721 392441 422992 473709
11071 473709 469850 478189 530055 525242 452725 426066 395991 365023 365528 394984 467927 481806
11059 481806 507740 531246 487468 496467 505835 531405 497012 471307 538698 571026 567301 502738
11047 502738 525356 596070 613855 625324 670213 661166 682112 652934 594819 608881 658945 668309
11035 668309 679214 719441 840903 907181 848524 785446 757676 724652 716925 718395 742859 816967
11023 816967 851743 907101 961478 935493 914070 946365 841377 727183 709726 743524 779151
11012 779151 824390 866333 889453 905684 836500 734540 695412 671796 633433 603280 587699
11001 587699 588259 641365 686161 695897 667200 721515 694900 646402 643215 634852 630795 535002 464388
10988 464388 460405 418750 463462 531270 570591 594484 590032 607920 655335 671512 665529 718631
10976 718631 781425 817148 739893 678835 661120 687714 706368 736507 768495 820322 848776
10965 848776 909386 945917 1030862 1136262 1293127 1502656 1763082 2052064 2405198 2833834
10955 2833834 3519545 4593156 6317872 9011864 13064629 17684659 20651408 21038131
10947 21038131 20635222 20956361 20527270 17572645 12988012 8958872 6316843 4732776
10939 4732776 3717178 3018026 2543802 2232316 2031854 1850597 1621816 1396610 1284406
10930 1284406 1141877 1021778 928854 862268 808143 673673 669333 658195 643094 666837 675735
10919 675735 636823 565191 536364 471377 452640 417411 439523 500897 481346 470374 458695
10908 458695 453272 422235 382290 425262 463988 426498 392405 430784 403226 391649 378333 344089
10896 344089 336784 399500 329538 293206 354321 397673 379961 352091 400444 431751 442429 439410
10884 439410 389216 387349 445930 427180 387594 407304 365410 343697 316889 291865 409559
10873 409559 529971 526308 494428 467410 421867 385434 374236 370817 400678 447695 390995 372259
10861 372259 328639 397398 442025 442951 487175 495637 451251 434378 428172 461974 468367 504000
10849 504000 469772 443853 442118 381540 402533 361009 300194 325771 388321 403105 427940 507997
10837 507997 516138 455402 406835 401204 395245 414851 423739 396290 427033 409313 309675 337425
10825 337425 341805 318100 355273 430273 465322 443539 405693 407707 377260 414860 394699 410365
10813 410365 377487 392409 350857 345771 320873 356069 407083 425550 456505 464644 444579 400259
10801 400259 444196 454632 406053 345008 375269 434442 478233 476887 443526 461054 505480 485027
10789 485027 455437 447855 496849 520405 575875 603670 580548 610827 541317 455992 444952 457033
10777 457033 495597 459708 397669 369066 373802 412647 401515 390162 380665 375068 356476 328337
10765 328337 325981 342843 427054 477885 524635 520566 519210 515855 512308 505859 417456 379777 372315
10752 372315 357970 370936 447669 497514 495337 451572 392885 477805 499630 523999 613316 665016
10740 665016 674664 667837 694509 633124 588860 549346 523152 481115 429011 489040 511697 528870
10728 528870 517421 514891 545893 551142 587781 575293 541906 501928 491689 490525 587348 706683
10716 706683 709692 670238 670537 674743 692326 679914 628339 619277 712020 801815 841840 789163
10704 789163 766101 774973 731568 726874 645096 530352 451253 458450 511212 495992 575825 658254
10692 658254 665024 639911 667858 673362 653719 645215 639650 616608 593906 635918 677041 649520
10680 649520 641624 652563 634089 720546 792605 831854 847699 882680 919522 925423 925744 974662
10668 974662 1055136 1164335 1199924 1296671 1369744 1450513 1522733 1707964 2018589 2378752 2793533
10657 2793533 3358410 4124520 5138796 6428027 7869883 8926469 9138469 8440770 7149195
10648 7149195 5831791 4790085 4050459 3511820 3078272 2731905 2539400 2391498 2256409
10639 2256409 2207258 2247489 2213707 2225270 2304525 2435598 2531429 2663839 2917754 3224460
10629 3224460 3492536 3714428 3897753 4159552 4625663 5184962 5915267 6892162 8111572
10620 8111572 9737505 11947992 14836388 18654674 23195665 27981241 31880539 33892676
10612 33892676 33881770 32617360 31300120 30879881 31809641 34412281 39045735 46017516 54906478
10603 54906478 64177693 71035582 72774470 69410093 63527207 58106020 54762903 54162766
10595 54162766 56555388 62173223 70982595 82123400 93110181 99644441 98277431 89700775
10587 89700775 78136455 67518924 59801065 55362691 54101369 55645614 59679953 65356852
10579 65356852 70605809 72445016 68849342 60807444 51280049 42923923 36852796 32996681
10571 32996681 31011366 30610605 31358459 32617874 33484425 32844891 30108270 25791000 20932325
10562 20932325 16646714 13190417 10461093 8444724 6983003 5847631 4964443 4314401
10554 4314401 3724308 3273620 2910355 2660915 2399978 2131071 1951847 1775246 1550460
10545 1550460 1378973 1300889 1224259 1129163 1050956 1056016 1045538 991934 935924 831331 794427
10534 794427 813099 750967 666946 643272 629022 634510 614858 562209 516073 479772 500120 483738
10522 483738 515196 464468 402259 381430 323490 279811 299155 305943 297868 293982 325482 354290
10510 354290 361839 362522 340629 355512 389381 414123 387623 328146 276881 233496 225759 262651
10498 262651 296423 278705 295226 292998 273417 215940 71018 49977 122888 148466 153691 108680
10486 108680 71167 115012 157486 135711 114012 143293 216946 208554 181523 216382 183095 168593
10474 168593 107553 160862 115688 133079 171895 160464 98739 111026 122114 129228 102118 109457
10462 109457 201198 213277 133289 89987 102760 105303 93799 30540 44012 27836 27807 58725
10450 58725 96298 92118 98938 107072 123505 191095 215012 177526 178812 199349 137823 111199
10438 111199 101624 163188 131656 125948 138685 148695 126198 41471 10357 9044 69481 125010
10426 125010 99585 45447 11596 -20737 574 62209 86804 48481 18370 17842 15063 11543
10414 11543 25294 99859 114711 85454 22511 35832 46062 71024 138417 161446 220843 179105
10402 179105 110508 135897 225070 188746 95388 97593 82673 21585 87184 171381 266545 262468
10390 262468 229266 224852 287302 284930 252762 219127 200409 227872 237775 241317 262094 269616
10378 269616 228160 243719 260014 307423 252000 250705 279922 329532 348982 294431 238857 258735
10366 258735 207953 185184 144481 85105 173621 214058 243576 261814 235397 125823 82158
10355 82158 96029 114417 126281 155447 194335 161999 155125 95982 73548 14839 40240 98590
10343 98590 137882 142465 160399 97570 82539 140707 183173 129614 117159 141256 115715 83287
10331 83287 108855 122461 132085 121535 140724 161824 134980 130925 148801 195862 166815 174851
10319 174851 208811 210646 184802 188254 200103 179329 154139 129026 149093 85304 76844 74936
10307 74936 78206 84469 40331 63940 63802 71960 37076 -1554 -53079 -14940 16499 10039 35415
10294 35415 61377 67824 65483 78881 86010 74096 29440 50455 116089 162948 186251 239682
10282 239682 254315 205522 197739 117094 88566 95508 100514 98548 97209 142040 89500 34594
10270 34594 119660 212065 230352 256654 269506 238901 163810 146356 127996 90102 111738 155386
10258 155386 212446 209832 267417 297364 343481 432529 569794 770020 1005357 1199563 1473195
10247 1473195 1730916 1924610 2135067 2246701 2205196 2134638 1938613 1688293 1487359 1286363
10237 1286363 1063873 871038 623477 457474 338560 292773 345348 392961 387885 368525
10227 368525 298170 286567 269862 292711 316010 199462 122225 111953 146519 149182 81234
10216 81234 78042 157038 176900 137381 135315 148705 126964 84773 91133 119618 152107 188459
10204 188459 180882 203432 172172 136966 103193 119810 121368 99364 87804 50800 859 8644
10192 8644 27412 61777 123105 49281 -36420 -17560 78849 102681 76030 107136 113240 104780
10180 104780 97577 141171 169263 224514 296117 301594 224691 185673 161930 212151 285770 298576
10168 298576 267966 289650 355143 370937 324046 312498 285805 299634 306865 332678 324238 388101
10156 388101 423895 496838 560794 582000 573698 509204 427925 388365 334523 345730 382392 415939
10144 415939 435059 426136 406604 415031 362380 268762 297859 275520 276376 288496 262712 148648
10132 148648 100499 187634 291391 268279 230290 183458 154983 165612 160018 131552 108051
10121 108051 141583 108858 80642 80420 138087 131819 111353 65072 20463 93814 136416 117170
10109 117170 33905 -13570 -56448 -50866 -30424 -33986 -30105 -6442 12405 23861 730 3198
10097 3198 -16337 21293 11594 -10500 -37282 5852 79262 95333 41838 -38239 4579 33233
10085 33233 4399 37895 8840 -62157 -51836 -45721 -27354 -2791 19655 26285 35481 22991
10073 22991 -32392 -29488 -9769 138 23626 12286 -44964 22818 72531 116551 114933 91269
10061 91269 85784 83973 46068 -4638 16358 25670 -42390 -26963 -3842 1809 32098 8808
10049 8808 34344 101775 105649 90780 45869 3598 16926 32901 -24992 -9595 14046 95435
10037 95435 127791 75012 74676 64919 73190 63041 61733 44366 28365 -8492 -68360 -39618 -55659
10024 -55659 -80121 -40293 -2086 -1785 37666 17030 -37669 -49715 -13438 24954 71182 42176
10012 42176 75834 71756 32219 11196 40797 48618 32137 21292 -1043 25227 35847 -35661
10000 -35661 -54621 -3897 16090 7722 6586 18584 15363 -4866 -8369 12905 47792 64519
9988 64519 98342 104963 106847 104263 66154 40665 24995 -6116 52084 67624 57639 124945 119674
9975 119674 44832 60413 48842 2876 5533 -35488 -11902 -18664 6455 43919 -6504 -53245
9963 -53245 -79286 -44233 -7660 72039 27606 -47405 -59070 -39494 -57879 -44030 -67100 -60602
9951 -60602 17669 31335 37450 37505 67772 29129 33448 43552 40246 38531 -16653 -6074 -4553
9938 -4553 -30359 -37014 -11427 -24192 -36391 44136 98130 108893 88858 73847 43751 77942
9926 77942 71612 34362 5739 -6126 -53356 -81651 -101916 -61737 20466 32228 28382 5046
9914 5046 -15589 -71751 -46957 -55051 -72028 -40167 -9678 -18895 -10631 -29382 -67126 -54751 -43039
9901 -43039 -14221 -70094 -14912 34605 -53169 -67392 -54583 -50143 -25110 18922 86371 85619
9889 85619 109177 105545 91356 72602 103291 128016 137151 109441 87414 86881 26033 -16983 17263
9876 17263 35486 4749 7334 41413 7309 2111 16506 35517 83344 25989 -101745 -92977
9864 -92977 -48400 376 4957 33315 18316 36568 29636 66646 80342 -2203 -32912 -69883
9852 -69883 -9781 47502 5687 -25305 -41548 -56531 -34250 -30662 -24619 -4233 14798 41175
9840 41175 19131 -27665 -129235 -78419 -24846 38297 45090 49854 60873 90778 61764 31055
9828 31055 28042 52717 52571 4133 -65548 -30537 -3024 -18291 -75460 -87431 -44417 11206
9816 11206 11144 84088 55868 -49126 -73687 -71947 -16250 18425 33431 65518 107456 96019
9804 96019 41104 47043 84172 96551 68075 48951 60032 36406 20972 44756 27014 12455
9792 12455 -22094 -47863 -24838 43609 91512 80624 64952 -3977 -2335 11629 -14577 -14463
9780 -14463 22858 45669 65892 11635 -1093 -12796 -19104 5451 53420 64835 72942 61749
9768 61749 19161 -338 3944 63346 44946 12821 -57823 -94664 -35067 -60966 -94878 -96701
9756 -96701 -53483 -17103 7118 -14946 -28594 -77076 -51698 67068 133294 141125 109472 83185
9744 83185 46479 64444 100587 33763 19051 90006 128604 96168 -8006 -33888 4898 28119
9732 28119 6902 23026 37669 58328 61947 40652 39792 32691 -42659 -53391 -4498 872 -43414
9719 -43414 -6203 -9751 -8820 5253 -4125 -40441 -71641 -55281 -37428 -44081 -20929 -63844 -49145
9706 -49145 -16465 -42181 -66209 -56065 -59383 -7085 -19126 -81171 -70316 -37943 -36491 -64457
9694 -64457 -75718 -9649 -52704 -121538 -187083 -145559 -88470 -42327 -14301 23327 90204 84228
9682 84228 15286 -58873 -122989 -158492 -85356 34882 68341 27421 37252 99840 115611 64019
9670 64019 26065 -23925 -77119 -62316 -25847 30801 66503 65480 15394 -60594 -62539 -54434
9658 -54434 -21153 -1084 -53093 -75373 -52886 -23501 4090 86992 159275 152307 135949 115709
9646 115709 81786 24250 42325 83752 77969 59564 72932 41051 -25374 -35992 19850 52539
9634 52539 50414 22270 9085 12615 -8766 -49436 -125443 -154618 -90284 -58517 -18055 -9024
9622 -9024 -48430 -52644 -37146 15631 38209 27340 12728 -10084 4582 18815 20154 21108 -28491
9609 -28491 -14438 35635 67911 20827 25281 98796 46583 45236 104230 64104 36948 86810
9597 86810 81126 48517 58220 12932 15922 -20871 -15608 6247 5560 43257 82425 95578 79055
9584 79055 46228 32566 16145 18150 -57845 -90323 -78344 -90794 -13681 46451 31577 12467
9572 12467 -13393 -13562 5401 -48852 -13464 41468 57519 5311 -38959 -20373 24759 21315
9560 21315 -51703 -87084 -52237 -55144 -54293 -15986 -30158 -30008 -51616 -25549 -29888 -23993 30112
9547 30112 -42788 -38459 -23525 -32017 54753 79712 48707 12251 -30220 -85400 -51526 66065
9535 66065 109850 112000 126204 100160 91941 64548 57443 5515 -3875 -6513 -16915 -46391 -54516
9522 -54516 -55084 -33506 -61862 -122049 -86501 -69460 -94865 -57772 -92889 -118696 -78595 14644
9510 14644 57356 -11279 -65804 -53124 46388 11249 9923 36328 22945 54837 60375 61591
9498 61591 37159 27448 14338 11256 -90491 -75792 -64663 -112812 -144246 -150812 -98757 -87372
9486 -87372 -141858 -119576 -84197 -94252 -88430 -68945 -13168 53216 27893 -2254 -6366 8479
9474 8479 -1033 -59616 -57529 -27255 -6293 23096 -27030 -103883 -18905 21282 4906 27765
$$ [...]
##END NTUPLES=NMR SPECTRUM
##END=
