##TITLE=Analysis number 329422
Compound Code cc 14601
Project Code adrs
Chemist Name stores
##JCAMPDX= 6.0         $$ Bruker NMR JCAMP-DX V2.0
##DATA TYPE= NMR SPECTRUM
##DATA CLASS= NTUPLES
##ORIGIN= Bruker BioSpin GmbH
##OWNER= nmr
$$ XWIN-NMR		Version 3.5
$$ Thu Aug 30 15:01:32 2007 GMT Daylight Time (UT+1h)  MAYBRIDGE\nmr@NMR_250MHZ
##.OBSERVE FREQUENCY= 250.131544655141
##.OBSERVE NUCLEUS= ^1H
##.ACQUISITION MODE= SIMULTANEOUS (DQD)
##.ACQUISITION SCHEME= undefined
##.AVERAGES= 16
##.DIGITISER RES= 18
##SPECTROMETER/DATA SYSTEM= dpx250
##.PULSE SEQUENCE= zg30
##.SOLVENT NAME= DMSO
##.SHIFT REFERENCE= (INTERNAL, DMSO, 0, 16.522)
##AUDIT TRAIL= $$ (NUMBER, WHEN, WHO, WHERE, WHAT)
$$ ##TITLE= Audit trail, XWIN-NMR		Version 3.5
$$ ##JCAMPDX= 5.01
$$ ##ORIGIN= Bruker BioSpin GmbH
$$ ##OWNER= nmr
$$ C:\u/data/dgb/nmr/ADRS/1890/pdata/1/auditp.txt
$$ ##AUDIT TRAIL=  $$ (NUMBER, WHEN, WHO, WHERE, WHAT)
(   1,<2007-08-30 15:00:21.73 +100>,<MAYBRIDGE\nmr>,<NMR_250MHZ>,
      <created by zg, POWCHK disabled, PULCHK disabled
       configuration hash MD5:
       76 6E 9A 78 1E 09 19 81 EC 84 63 8F B0 6A 59 2D
       data hash MD5: 64K
       B6 71 A2 55 5F 74 4D BE 49 40 5C 7D 21 5D 1A 83>)
(   2,<2007-08-30 15:00:53.52 +100>,<MAYBRIDGE\nmr>,<NMR_250MHZ>,
      <Start of raw data processing
       ef LB = 0.3 FT_mod = 6 PKNL = 1 SI = 32K 
       data hash MD5: 32K
       37 3A 18 D7 37 B6 FF A7 58 E6 24 6C 20 87 1B 57>)
(   3,<2007-08-30 15:00:59.04 +100>,<MAYBRIDGE\nmr>,<NMR_250MHZ>,
      <apk 
       data hash MD5: 32K
       27 EC AC 4F BA 08 85 85 C1 BF D2 30 07 72 A4 E9>)
(   4,<2007-08-30 15:01:03.88 +100>,<MAYBRIDGE\nmr>,<NMR_250MHZ>,
      <abs ABSG = 5 
       data hash MD5: 32K
       AC CD 36 A2 B6 7B 15 97 F9 BF 63 A6 5A 93 43 E5>)
$$ ##END=
$$ 
$$ hash MD5
$$ D0 63 57 1C D1 B2 BF 07 9C F8 6A C3 5A C2 54 2E
##$RELAX= 
##$RELAX= 
##$RELAX= 
##$RELAX= 
##$RELAX= 
##$RELAX= 
##$RELAX= 
$$ Bruker specific parameters
$$ --------------------------
##$DU= <C:\u>
##$EXPNO= 1890
##$NAME= <ADRS>
##$PROCNO= 1
##$TYPE= <nmr>
##$USER= <dgb>
##$AMP= (0..31)
100 100 100 100 100 100 100 100 100 100 100 100 100 100 100 100 100 100 
100 100 100 100 100 100 100 100 100 100 100 100 100 100 
##$AQSEQ= 0
##$AQ_mod= 3
##$AUNM= <au_zg>
##$AUTOPOS= <9 >
##$BF1= 250.13
##$BF2= 250.13
##$BF3= 250.13
##$BF4= 250.13
##$BF5= 500.13
##$BF6= 500.13
##$BF7= 500.13
##$BF8= 500.13
##$BYTORDA= 1
##$CFDGTYP= 0
##$CFRGTYP= 5
##$CHEMSTR= <none>
##$CNST= (0..31)
1 1 145 1 1 1 1 1 1 1 1 1 1 1 1 1 1 1 1 1 1 1 1 1 1 1 1 1 1 1 1 1 
##$CPDPRG= <>
##$CPDPRG1= <>
##$CPDPRG2= <>
##$CPDPRG3= <>
##$CPDPRG4= <mlev>
##$CPDPRG5= <mlev>
##$CPDPRG6= <mlev>
##$CPDPRG7= <mlev>
##$CPDPRG8= <mlev>
##$CPDPRGB= <>
##$CPDPRGT= <>
##$D= (0..31)
0 1 0 0 0 0 0 0 0 0.06 0 0 0 0 0 0 0.0002 0 0 0 0 0 0 0 0 0 0 0 0 0 0 
0 
##$DATE= 1188482419
##$DBL= (0..7)
120 120 120 120 120 120 120 120 
##$DBP= (0..7)
150 150 150 150 150 150 150 150 
##$DBP07= 0
##$DBPNAM0= <>
##$DBPNAM1= <>
##$DBPNAM2= <>
##$DBPNAM3= <>
$$ [...]
##$SUBNAM7= <"">
##$SUBNAM8= <"">
##$SUBNAM9= <"">
##$SW= 20.6930455092707
##$SWIBOX= (0..15)
0 0 3 0 0 0 0 0 0 0 0 0 0 0 0 0 
##$SW_h= 5175.983436853
##$TD= 65536
##$TD0= 1
##$TE= 296.16
##$TE2= 300
##$TE3= 300
##$TEG= 300
##$TL= (0..7)
0 120 120 120 120 120 120 120 
##$TP= (0..7)
150 150 150 150 150 150 150 150 
##$TP07= 0
##$TPNAME0= <>
##$TPNAME1= <>
##$TPNAME2= <>
##$TPNAME3= <>
##$TPNAME4= <>
##$TPNAME5= <>
##$TPNAME6= <>
##$TPNAME7= <>
##$TPOAL= (0..7)
0.5 0.5 0.5 0.5 0.5 0.5 0.5 0.5 
##$TPOFFS= (0..7)
0 0 0 0 0 0 0 0 
##$TUNHIN= 0
##$TUNHOUT= 0
##$TUNXOUT= 0
##$USERA1= <user>
##$USERA2= <user>
##$USERA3= <user>
##$USERA4= <user>
##$USERA5= <user>
##$V9= 5
##$VALIST= <valist>
##$VCLIST= <CCCCCCCCCCCCCCC>
##$VD= 0
##$VDLIST= <DDDDDDDDDDDDDDD>
##$VPLIST= <PPPPPPPPPPPPPPP>
##$VTLIST= <TTTTTTTTTTTTTTT>
##$WBST= 1024
##$WBSW= 4
##$XGAIN= (0..3)
0 0 0 0 
##$XL= 0
##$YL= 0
##$YMAX_a= 340541
##$YMIN_a= -224014
##$ZGOPTNS= <>
##$ZL1= 120
##$ZL2= 120
##$ZL3= 120
##$ZL4= 120
##$ABSF1= 16.522
##$ABSF2= -4.171173
##$ABSG= 5
##$ABSL= 3
##$ALPHA= 0
##$AQORDER= 0
##$ASSFAC= 0
##$ASSFACI= 0
##$ASSFACX= 0
##$ASSWID= 0
##$AUNMP= <proc_1d>
##$AZFE= 0.1
##$AZFW= 0.1
##$BCFW= 0
##$BC_mod= 0
##$BYTORDP= 0
##$COROFFS= 0
##$CY= 12.5
##$DATMOD= 1
##$DC= 0
##$DFILT= <>
##$DTYPP= 0
##$F1P= 14.0000005364418
##$F2P= -0.99999901652339
##$FCOR= 0.5
##$FTSIZE= 32768
##$FT_mod= 6
##$GAMMA= 0
##$GB= 0
##$INTBC= 1
##$INTSCL= 1
##$ISEN= 128
##$LB= 0.3
##$LEV0= 0
##$LPBIN= 0
##$MAXI= 10000
##$MC2= 0
##$MEAN= 0
##$ME_mod= 0
##$MI= 0
##$NCOEF= 0
##$NC_proc= -5
##$NLEV= 6
##$NOISF1= 0
##$NOISF2= 0
##$NSP= 0
##$NTH_PI= 0
##$NZP= 0
##$OFFSET= 16.522
##$PC= 1
##$PHC0= -53.32711
##$PHC1= 10.23286
##$PH_mod= 1
##$PKNL= yes
##$PPARMOD= 0
##$PSCAL= 4
##$PSIGN= 0
##$REVERSE= no
##$SF= 250.13
##$SI= 32768
##$SIGF1= 0
##$SIGF2= 0
##$SINO= 400
##$SIOLD= 32768
##$SREGLST= <1H.DMSO>
##$SSB= 0
##$STSI= 32768
##$STSR= 0
##$SW_p= 5175.98343685301
##$SYMM= 0
##$S_DEV= 0
##$TDeff= 65536
##$TDoff= 0
##$TI= <Analysis number 999999
Compound Code 99
Book Reference 9
Project Code 9>
##$TILT= no
##$TM1= 0
##$TM2= 0
##$TOPLEV= 0
##$USERP1= <user>
##$USERP2= <user>
##$USERP3= <user>
##$USERP4= <user>
##$USERP5= <user>
##$WDW= 1
##$XDIM= 32768
##$YMAX_p= 483925012
##$YMIN_p= -515454
$$ End of Bruker specific parameters
$$ ---------------------------------
##NTUPLES= NMR SPECTRUM
##VAR_NAME=  FREQUENCY,     SPECTRUM/REAL,   SPECTRUM/IMAG
##SYMBOL=    X,             R,               I
##VAR_TYPE=  INDEPENDENT,   DEPENDENT,       DEPENDENT
##VAR_FORM=  AFFN,          ASDF,            ASDF
##VAR_DIM=   32768,         32768,           32768
##UNITS=     HZ,            ARBITRARY UNITS, ARBITRARY UNITS
##FACTOR=    0.157963299565203, 1,           1
##FIRST=     4132.6476996994, 0,             0
##LAST=      -1043.33573715361, 0,           0
##MIN=       -1043.33573715361, -515454,     0
##MAX=       4132.6476996994, 483925012,     0
$$ Real data points
##PAGE= N=1
##DATA TABLE= (X++(R..R)), XYDATA
$$ [...]
28145 485502 513558 485750 541117 608277 562951 543721 633794 687129 679595 757894 634956
28134 634956 547508 713816 857232 699429 713280 794317 745331 552319 498328 674059
28124 674059 705393 781090 738924 872425 871045 796303 720431 795833 703048 662081 756331
28113 756331 773182 790352 877305 863742 845621 892842 910635 710137 595400 584571 715363
28102 715363 754772 637027 590841 658985 659492 750713 887832 888835 829608 803478 1009045
28091 1009045 1101784 1009550 860102 797920 745277 740355 638426 616634 711582 720751 791049
28080 791049 802329 930465 995136 983403 884788 816036 767764 807604 845890 729989 759144
28069 759144 781845 870338 866296 698134 688344 646652 776511 887600 774046 829496 950657
28058 950657 1035504 998187 895793 864874 821672 869756 890475 960960 936073 840368 780319
28047 780319 679495 772671 949481 1179600 1193657 1255830 1142269 1095260 1029397 1021461 1105574
28036 1105574 1162656 1090696 995383 869701 853814 951745 1053406 1108762 1125916 1099324 998596
28025 998596 912996 883396 1006064 1106598 1103694 1156633 1082798 1002830 1022267 1107148 1126173
28014 1126173 1043922 1037363 964750 892918 847249 865071 933379 923688 983759 1092373 1057862
28003 1057862 1095458 1017951 1009974 967217 1124650 1187401 1176794 1160255 1118341 1149137 1166367
27992 1166367 1329718 1267952 1227681 1246867 1115898 1132514 1034977 1029739 1060549 1047388 1169354
27981 1169354 1240524 1334130 1376500 1509047 1482952 1297189 1225433 1183085 1209839 1200354 913631
27970 913631 756613 877810 1094268 1064610 1021536 1072879 1188578 1068786 1095329 1147035
27960 1147035 1207593 1193295 1250002 1324102 1280547 1264926 1261274 1352442 1408798 1226383 1333172
27949 1333172 1319039 1386298 1484939 1389897 1314215 1373680 1482210 1523580 1607294 1510651 1479938
27938 1479938 1392155 1399313 1344580 1339757 1425080 1461104 1388593 1453053 1460603 1459436 1494859 1562690
27926 1562690 1631389 1591033 1573878 1609238 1599739 1593419 1535793 1504617 1637254 1668482 1660430 1597483
27914 1597483 1669722 1725165 1808251 1743287 1710730 1816601 1809065 1775987 1674053 1648072 1682395
27903 1682395 1863395 1925317 1773466 1774997 1831893 1776179 1741346 1809439 1816989 1757712 1713188
27892 1713188 1695780 1648538 1714750 1736405 1758096 1784653 1726992 1700571 1848351 1978784 1999415
27881 1999415 1907718 1802963 1986025 2138959 2015324 2021448 1965269 1984319 1992367 1987088 2006864
27870 2006864 1883442 1850957 1987121 1989131 1898025 1913044 1948950 2118916 2179506 2069448 1946771
27859 1946771 1928302 1893995 1911424 1977589 2013721 2089093 2137151 2039863 2032667 2100483 2184034
27848 2184034 2324244 2413391 2380941 2395069 2483386 2362015 2193860 2239940 2303230 2394878 2361919
27837 2361919 2434775 2437935 2419559 2507809 2511572 2458104 2552072 2439844 2469206 2540227 2552261
27826 2552261 2638819 2682037 2721201 2856010 2730028 2667009 2519069 2432231 2526099 2714041
27816 2714041 2732368 2771313 2641553 2474894 2365000 2381403 2485592 2664520 2689078 2693761
27806 2693761 2581980 2598286 2706578 2722050 2716974 2651793 2642943 2617498 2625983 2633433 2742207
27795 2742207 2938460 3006888 2986315 3063312 3177736 3166855 3159883 3157003 3102874 2990453 2979952
27784 2979952 3039935 3097897 3150792 3254416 3366759 3494778 3444072 3502853 3451540 3381074 3256523
27773 3256523 3212725 3242839 3272413 3378559 3545511 3707717 3572587 3448644 3499035 3558337
27763 3558337 3630130 3662375 3753633 3823452 3863754 3775906 3794369 3770741 3828586 3777678 3676575
27752 3676575 3666800 3851766 3945338 4110199 4181527 3998627 3901499 3989724 4067103 4006874 3991427
27741 3991427 4111033 4101944 4131992 4177272 4244132 4098787 4015114 4105787 4217749 4258344 4255694
27730 4255694 4255813 4264325 4396632 4483182 4490161 4575447 4577827 4696239 4673426 4702392 4762871 4807571
27718 4807571 4781665 4803867 4929567 4954470 4854444 4824855 4863855 5067450 5260842 5320292
27708 5320292 5259246 5182097 5087896 5163630 5095890 5030734 5007444 5065576 5334671 5440388 5408870
27697 5408870 5538862 5660217 5674909 5672865 5556445 5512165 5613973 5827186 5915141 5864500
27687 5864500 5966354 6001856 6047689 6167901 6119889 6063506 6152858 6256216 6182578 6109829 6197832
27676 6197832 6367275 6453609 6544620 6639572 6676461 6684030 6675482 6708760 6727329 6683631 6687697 6779784
27664 6779784 6934514 6928457 6847073 6939975 6990148 7179046 7318042 7374171 7329864 7274434 7226861
27653 7226861 7348454 7415199 7517158 7593170 7723648 7846345 7888649 7923837 7905127 7914223 7910089
27642 7910089 7989504 8033603 8078288 8193759 8317050 8396603 8421403 8381762 8317349 8337423 8447630
27631 8447630 8368217 8379242 8415578 8561988 8749941 8916079 8978226 8953905 9032935 9118797 9148667
27620 9148667 9263923 9465356 9575866 9673959 9773288 9693009 9744584 9772116 9750840 9767395 9800743
27609 9800743 9816787 9832329 10004809 10242692 10247392 10159931 10211708 10219655 10224486 10213262 10233873
27598 10233873 10306233 10445395 10474407 10543237 10651274 10776855 10899931 10937245 10975293 11021673
27588 11021673 11062855 11144042 11225323 11329432 11251778 11145060 11327402 11426752 11507592 11578521
27578 11578521 11555210 11648618 11742994 11932519 11922403 11848429 11938131 11925022 11982279 12125390 11986651
27567 11986651 12004125 12246930 12329777 12296998 12394171 12495585 12577381 12513660 12501758 12503701 12577467
27556 12577467 12704163 12769130 12745954 12805803 12847814 12931695 12893561 12786188 12843308 12901467 12878190
27545 12878190 12903039 13040496 13128296 13076231 12909555 12894387 13018565 13045186 13236004 13322202
27535 13322202 13381857 13501052 13356434 13013308 13009627 13179336 13182028 13219019 13217168 13229042 13203706
27524 13203706 13169929 13185553 13254621 13477258 13485285 13411563 13401901 13282279 13099978 13083094 13064368
27513 13064368 13117215 13073040 13010677 13011498 13000377 13001926 13034613 12979018 13004604 13057978 13116051 13059129
27501 13059129 13021924 12954346 12845150 12691455 12615459 12506821 12512602 12541883 12564166 12544156 12448356
27490 12448356 12350396 12377049 12348979 12200063 12180363 12172075 12058536 12036174 12056183 12178126 12102646
27479 12102646 12086451 12025336 11992567 11857231 11767842 11593120 11423460 11542443 11581323 11553028
27469 11553028 11488103 11492140 11574813 11574051 11469623 11388156 11248348 11188510 11099317 10995172 11016639
27458 11016639 11069711 11048589 10973487 10854748 10702923 10588919 10647188 10592104 10400387 10306520
27448 10306520 10255691 10018345 9984894 10038804 10040789 9936388 9862104 9923706 9877423 9795147 9788982
27437 9788982 9658051 9562645 9550334 9524599 9344568 9402835 9398957 9236021 9139596 9162335 9276449
27426 9276449 9291109 9075394 8804440 8858563 8785414 8655096 8665504 8731143 8825000 8709293
27416 8709293 8554550 8465805 8370196 8264784 8165351 8045815 8031701 7981197 7847010 7846171 7947761
27405 7947761 7824387 7912632 7858756 7552744 7402346 7315928 7268633 7243723 7310843 7434002
27395 7434002 7358745 7288322 7310288 7249765 7156009 7122467 7101429 7021707 6934119 6822797 6681479
27384 6681479 6609329 6644965 6648783 6618741 6678382 6717569 6660526 6546329 6485470 6331444 6282275
27373 6282275 6418287 6379683 6280588 6234174 6126382 5899577 5856625 5829344 5890261 5936678 5732300
27362 5732300 5581193 5603942 5651761 5689725 5676822 5567083 5607960 5597377 5616859 5649508 5599029
27351 5599029 5473299 5417758 5326492 5195240 5219755 5169542 5056754 4979437 4922129 4874073 4773958
27340 4773958 4780151 4845694 4774813 4805264 4826112 4776493 4656502 4624701 4651145 4665161 4605647
27329 4605647 4561806 4417638 4339527 4456523 4595691 4544702 4576534 4565886 4317447 4149152
27319 4149152 4115175 4184208 4194130 4231096 4234442 4286782 4329542 4223128 4169877 4144223 4089968
27308 4089968 3960239 3944853 3963650 3938659 3977507 3901520 3784396 3699940 3593268 3633647 3655055
27297 3655055 3678169 3636799 3613083 3573521 3634443 3638307 3589236 3635600 3533444 3537806 3657350
27286 3657350 3513795 3507287 3548001 3496811 3403276 3349753 3306819 3222380 3241307 3232155 3159847
27275 3159847 3312587 3230331 3084607 3141068 3190094 3229245 3186475 3188565 3227245 3284057 3187795
27264 3187795 3075026 2955852 2911448 3037192 3012454 2923440 2829244 2829356 2925971 2872754 2854081
27253 2854081 2887783 2940413 2887916 2787191 2708917 2747373 2782893 2734428 2726099 2696827 2707808
27242 2707808 2778335 2849849 2748778 2622249 2647952 2635260 2631922 2537524 2570828 2468344 2390000
27231 2390000 2378028 2375533 2289576 2324502 2415990 2394790 2249168 2203265 2260885 2347184 2240722
27220 2240722 2199424 2204629 2157509 2293255 2348437 2238585 2104991 2030494 1964496 2031179 2033697
27209 2033697 2070549 2099515 1995073 2064133 2180298 2188273 2260881 2316862 2229400 2174213 2033475
27198 2033475 1945608 2021585 2075489 2061294 1882614 1939936 2047713 1989445 1962382 1921450 1862127
27187 1862127 1772406 1767865 1786960 1765877 1644994 1783898 1774860 1791437 1849079 1973393 1845943
27176 1845943 1728751 1652435 1727133 1784702 1630157 1601643 1606672 1635056 1570828 1689197 1623215
27165 1623215 1560869 1596122 1580187 1616758 1609624 1596514 1634621 1689452 1727129 1726109 1634263 1630779
27153 1630779 1740848 1582087 1589907 1569581 1560041 1632386 1687211 1683279 1701381 1697566 1696551 1645824
27141 1645824 1605397 1501473 1478807 1513530 1671457 1592284 1453180 1461237 1573118 1576194 1646125
27130 1646125 1669576 1559370 1512318 1331527 1314565 1409619 1441784 1553729 1584750 1539597 1681101
27119 1681101 1597774 1405071 1370440 1335980 1433899 1402047 1473771 1487437 1396783 1323508 1283589
27108 1283589 1251883 1340404 1478735 1515928 1510400 1570741 1593864 1449258 1362512 1391611 1490377
27097 1490377 1501299 1483985 1385445 1409280 1425608 1328207 1282942 1205981 1222989 1133636 1148442
27086 1148442 1143257 1120516 1192767 1327820 1178889 1190691 1273027 1321460 1317414 1318561 1250963
27075 1250963 1227485 1200770 1091773 1079875 1051374 1026482 1123919 1174637 1156691 1070979 1115327
27064 1115327 1241245 1161557 1038430 1094585 1152365 1261690 1176698 1140470 1181338 1135026 1052109
27053 1052109 1123603 1141375 1102469 1148271 1065649 961993 961292 988196 913906 896754 970506
27042 970506 1074430 1100259 1120321 1014828 1028996 1044256 1104218 1083641 1056716 1003156 1071232
27031 1071232 1070909 1055357 1023873 1050037 1047980 961607 829643 878597 828536 769322 788300 763265
27019 763265 778102 877815 777253 754138 731068 738357 838708 903294 952712 985448 1013367
27008 1013367 1059166 1048219 1042775 991230 973953 815477 695546 624161 606746 713515 805444
26997 805444 886074 924487 1062104 1011471 953147 949351 904563 1004629 1025313 987758 1000615
26986 1000615 1012566 999621 862085 759997 821825 988376 995264 914451 870384 872871 842066
26975 842066 905129 1025391 966830 947028 1024042 978881 733217 722132 811847 837790 967584
26964 967584 897331 922877 950399 875110 778753 915858 796352 614822 651981 700486 572670
26953 572670 604998 555907 569248 592779 572357 645155 775413 801696 836731 882846 807554
26942 807554 824191 946444 1009355 945188 851639 827552 859470 742313 553826 565596 606547
26931 606547 652824 746386 768175 747193 762953 633375 560408 720548 803130 773716 847271
26920 847271 838100 707134 629804 674398 722549 686127 597199 595055 628414 674233 701515 695057
26908 695057 656872 575900 603527 588277 592665 612773 602092 642914 555644 501375 602048
26897 602048 604712 640322 701317 753943 707730 570073 509366 522114 565674 631571 612900
26886 612900 579747 581745 655524 716339 747879 861790 791637 799539 822641 706343 537211
26875 537211 540077 716285 755954 744912 619183 720066 765138 613939 489914 478678 432816
26864 432816 398478 329558 379023 394723 475929 527788 655745 606289 582944 613471 649952
26853 649952 765105 715211 585317 500161 375263 387864 490576 621290 739826 637710
26843 637710 722710 822638 793448 719734 751411 653285 658968 673721 576577 437903 500601
26832 500601 505111 411887 452796 576801 653500 606790 447268 465542 523812 375550 232072
26821 232072 270138 396837 428845 429725 417454 514912 457475 193694 141011 282292 308870
26810 308870 380649 493112 423190 378324 354316 361429 329751 327661 309884 363911 451224 534781
26798 534781 588885 557978 316713 247350 163845 263901 436739 380867 366163 332997 426213
26787 426213 435333 346655 380671 478880 544910 593459 607978 704874 786203 730182 582751
26776 582751 528857 552228 510530 506885 474255 390340 292985 202876 219961 329948 537763
26765 537763 390341 327187 331441 290701 284467 297832 253235 253510 386041 425490 402802 434123
26753 434123 474051 494758 443907 532073 590312 582679 596000 522145 451079 323439 206147
26742 206147 142528 251755 362534 338285 359346 392022 349991 274116 258833 274269 326231
26731 326231 331326 355670 444973 358508 272760 312981 368712 482613 544800 513909 379073
26720 379073 395102 531921 593077 596377 503380 317440 384029 472579 563115 494513 481519
26709 481519 403174 330362 282335 407572 483903 376953 363151 363732 366154 467644 475321 337328
26697 337328 286085 269241 220772 269507 264745 324788 287401 279222 295032 293713 279106 176595
26685 176595 114143 215805 359953 290824 278695 451524 419569 404890 324621 237086 255053
26674 255053 180237 108693 226518 275314 333378 330991 374236 329908 338637 420956 482524 429097
26662 429097 434300 212683 90188 21678 181791 306798 185457 166423 330890 359470
26652 359470 340525 388891 367922 292697 279388 463585 526447 364117 473525 512114 521675
26641 521675 537655 579007 478081 390414 356814 289050 308757 276722 221298 115965 149210
26630 149210 178028 159433 205251 253202 355467 295719 276271 336980 76860 217088 315108
26619 315108 116789 30235 125738 204299 257555 201166 234494 357710 301281 227407 160105
26608 160105 165849 297696 289422 170761 103154 132444 30954 -68270 128689 258720 326910
26597 326910 339144 310336 414447 526194 483052 404414 322275 274020 261915 290276 286577
26586 286577 282587 313096 395422 469380 386261 367298 221973 211721 367650 516978 499210
26575 499210 427777 407363 421197 388901 295807 228243 247662 326153 434489 376690 283382
26564 283382 260710 191831 56538 -121957 -7267 65119 115664 254467 299683 258357 320205
26553 320205 353093 285022 91609 -19801 53970 132424 320340 347906 453551 478871 400826
26542 400826 346124 331010 342494 283852 125636 156132 233863 135821 109966 210038 252420
26531 252420 204155 224980 210105 210081 214507 176205 73451 184058 423969 536559 480152
26520 480152 446825 287193 290970 261842 150129 76748 110562 209666 235096 144918 135981
26509 135981 104466 78645 201881 363673 388111 425968 373570 424867 355837 143754 54397
26498 54397 7322 76434 149372 209264 155146 256388 208532 114770 206416 136581 106855
26487 106855 185621 231803 233493 210975 99960 21230 140949 290328 360075 221152 259767
26476 259767 201048 -27144 40127 285450 215433 275815 385773 330447 186316 104597 161262
26465 161262 195722 199860 163758 156180 159090 268796 263397 337932 321790 200309 32895 -56602
26453 -56602 85066 199114 117525 154644 157857 219169 157908 191546 230843 102346 103049 -41723
26441 -41723 29302 61932 -65522 -39145 109867 230928 190165 290353 387899 454646 381215
26430 381215 302798 290825 308564 374891 294758 306182 291578 349814 323445 252055 239963
26419 239963 270025 445604 553908 281521 179005 187470 108445 25054 103287 103013 118595
26408 118595 271686 304280 182039 53427 68989 198188 239574 308030 316157 179563 213468
26397 213468 250543 97511 -17412 -71017 137583 202484 237856 269329 172596 122003 181574
26386 181574 30363 22175 124002 91973 43672 66235 220002 229885 187452 64340 -1581
26375 -1581 -19558 -106264 -71785 28650 24876 -50100 -24918 134554 221954 260631 307888 203113
26363 203113 220986 148826 46889 -15351 -82889 -61638 -25719 -15713 43276 78583 64945
26352 64945 73266 160801 86213 160758 220990 60441 163140 266121 241009 109563 -30396
26341 -30396 -89979 112671 310376 312292 207401 173862 224564 341359 192788 157374 221650
26330 221650 280745 315767 180653 7082 -39056 61542 60650 8546 -78092 -112231 94934
26319 94934 -53276 -128706 -82505 -7402 14419 -44932 5073 137805 244012 126956 -24783
26308 -24783 -85273 -184066 -165897 -58236 3292 30181 92755 42627 16582 101318 193565
26297 193565 219810 168194 177328 117782 154770 113356 135297 94860 105822 -59365 -162695
26286 -162695 -181259 -128027 32131 -65747 -65152 -135586 -12468 79643 72481 9772 186453
26275 186453 169206 80214 83536 107638 120707 39465 -4220 22664 -94163 -148587 -4677
26264 -4677 57441 95826 164816 193632 239985 253361 164004 24665 -61704 -45040 43932 155836
26252 155836 34696 -155644 4773 131645 42873 93299 222621 332297 360546 435520
26242 435520 278431 251233 204359 150919 122296 151059 -107222 -245734 -168729 16429 25076
26231 25076 188484 233842 148760 155699 239726 210437 249420 300631 231882 149862 51212 34655
26219 34655 61627 95092 173828 74549 77132 103602 103818 85623 74115 33299 -19454 -50042
26207 -50042 -123705 -2787 30296 -93886 -162085 -146182 -150865 -119819 -10404 29526 -34877
26196 -34877 -180270 -174224 26069 109530 123671 -12504 -32790 10754 93468 193432 270899
26185 270899 281327 165354 -24394 -8755 156731 207254 112487 59403 90364 114656 217602
26174 217602 165498 151093 163527 290545 350790 350422 243241 171058 158376 140685 56836
26163 56836 -31566 202246 287927 203412 226142 261783 264217 201856 183889 230675 218161 180503
26151 180503 187085 56688 -14801 -61136 -173939 -78937 10334 117171 179019 212221 278142
26140 278142 234371 315164 302892 140002 56861 170017 162982 -816 -13465 129196 76006
26129 76006 -12303 -125252 -120914 76480 58973 -92337 -120992 -31899 148886 231445 284535
26118 284535 364888 319844 236346 158256 159658 159567 148703 194259 68909 32661 178374 198041
26106 198041 120440 171332 309816 148936 74076 55802 41716 55737 42327 -34156 10880
26095 10880 156042 275351 340119 309895 182002 191483 257716 84280 86276 228412 285220
26084 285220 292580 202193 71545 31363 72110 -29485 39085 100382 88674 88166 218094
26073 218094 277892 272771 230308 215491 154205 84162 -8269 1079 41351 -7199 10877 61655
26061 61655 117083 20896 85358 273753 182330 50786 51971 41248 15196 -85017 -44640
26050 -44640 66753 43953 -94164 -82724 -45416 23076 133981 214289 209973 162180 31230
26039 31230 -138355 -222916 -105472 -136639 11486 78624 54980 24523 58918 145633 140765
26028 140765 77190 151117 210460 157675 7198 -25725 66128 147397 86339 190189 192026
26017 192026 213998 218137 242509 162347 126366 146163 166978 79806 -104483 -127447 7601
26006 7601 184297 261236 157962 -24269 914 -4561 -51840 -59940 -80117 -54298 -124208 -158565
25994 -158565 57065 136646 101972 96975 49880 -48461 15763 100371 78903 -106956 -46425
25983 -46425 -8070 -143154 -140116 60176 176926 204775 275231 204587 262881 249014 205088
25972 205088 149536 144219 260184 276796 251262 224167 170781 86601 121475 42037 138124
25961 138124 104655 -3504 73813 58259 26887 49813 -28895 -26281 40426 87372 48928
25950 48928 91106 183497 124315 -2811 -125892 -84579 -105969 -12704 158451 301840 175788
25939 175788 39377 -66907 -133879 -121355 -42305 -14633 -75782 -32492 -87291 -94704 -77353
25928 -77353 4661 69116 80266 9130 33128 165581 155223 158134 89548 11076 -19428 42959
25916 42959 49020 116511 28848 -60407 -147644 -213875 -110153 -2213 123456 124752 143414
25905 143414 256789 175337 119702 47346 -68228 -96079 70050 110160 62022 -27296 15299
25894 15299 -38401 -38851 57767 112995 89940 34892 77385 70456 -45860 -25054 -66476 -180770
25882 -180770 -267329 -167766 -148707 -186360 -232964 -165940 -105643 -38460 41740 -97841 -204811
25871 -204811 -140716 -125375 -59592 -21727 -58696 -3669 -54060 54709 50992 123832 146184
25860 146184 110445 -16201 -67977 -40441 33039 61904 71208 -57915 1806 164895 209766
25849 209766 73985 -43866 -127910 -131527 -122039 8509 79013 255871 243572 150782 178231
25838 178231 119233 -32749 -120859 -24336 -181 -15169 -7412 -145453 -143349 -32858 24180
25827 24180 40230 -7468 -57441 -220059 -160915 -105556 -88654 7341 3991 -90320 -142672 -6437
25815 -6437 52109 35278 -60551 -174506 -66208 -45813 68303 180893 157294 172110 99948
25804 99948 183601 99742 -58243 -127404 98961 13790 -87556 -116391 -90631 -46042 -62495
25793 -62495 -57667 -38184 -39802 -47842 100613 180796 140597 171723 275556 287037 185876 180927
25781 180927 182240 67940 45148 78931 43550 -72616 -42099 -59170 51869 21884 33973
25770 33973 24888 59798 112678 181438 173467 193808 190225 199631 235259 167656 118202 74990
25758 74990 56044 92140 49105 45891 -69959 -118155 104234 272097 141548 -23072 -104992
25747 -104992 -179965 -244432 -223132 -196705 -156246 -90148 -61183 -34310 -44001 -50206 -36697 5491
25735 5491 11258 -82740 -70945 -124560 -145404 -158027 -139654 -96551 -33708 -48596 -108177 -158053
25723 -158053 -114420 30021 113123 77801 -6142 32641 37317 26484 -25050 73968 149328
25712 149328 111176 2190 139535 131472 86510 40016 58199 62823 -44630 -50304 -140631
25701 -140631 -144029 -129429 -94814 -63112 -28167 -46377 -115284 -193092 -80913 36026 -101272
25690 -101272 -111912 38487 45773 -42458 70402 108242 41243 68086 130535 73090 138720
25679 138720 67721 28549 59402 36164 7014 11502 20619 -62586 -112144 -31526 -90003 -180891
25667 -180891 -129996 -119063 -151358 -109995 85555 293702 353246 126683 -8569 42205 42595
25656 42595 120458 175265 48151 -22989 -38202 14068 132172 221761 195990 9502 -66090
25645 -66090 -141967 -3729 128480 41000 70640 98007 155279 138882 35467 -27102 -53592
25634 -53592 -97675 942 36656 -12378 -86984 -96629 -42834 61075 66918 955 -60132 -12974
25622 -12974 58145 5898 31669 103760 37689 -49772 -14798 84101 164407 230291 222875 164856
25610 164856 45750 32859 -5428 -22727 111400 145151 90832 -86152 -70450 -118616 -235082
25599 -235082 -131757 -64616 -144957 -146637 -144054 -26748 -72072 -67309 -131199 -146143 -159212 27928
25587 27928 76490 91269 119603 113704 55108 86335 160028 171581 98703 11621 -118064 -208433
25575 -208433 -204166 -208444 -142894 -67378 -80914 -17288 -9198 33451 79138 254472 259299 163620
25563 163620 43545 -130846 -187528 -238129 -216198 -168723 -57516 48088 67921 14071 111516
25552 111516 136782 49581 -36665 -97407 -93901 -109797 -87411 1515 140376 154753 53103
25541 53103 -116550 -156344 -85401 -115194 -13904 73742 200359 196419 87674 2248 -34109
25530 -34109 -81879 -17271 146601 207410 118871 159862 223133 227056 153098 330010 342438
25519 342438 194919 92255 95817 93908 12095 146943 179736 44502 -35345 -60226 -131321
25508 -131321 -87258 3136 -11963 -25404 -60367 -42084 -48586 -39460 -86476 -119692 -78524 -46103
25496 -46103 105627 81517 30766 -6628 -42651 31459 5627 -75143 -78864 -12696 19216 -73436
25484 -73436 -107538 -126009 -127772 -224516 -124562 3440 -85385 -159467 -49784 -54687 -9836 -23849
25472 -23849 -25786 -80190 4409 3478 42605 39409 -65267 -46259 -67022 -106137 -79198 -29021
25460 -29021 -5884 -27244 -90572 -93481 -101565 -49851 32794 -596 40946 72896 56154 23943
25448 23943 -146120 -18753 59660 92090 5716 53315 188644 192098 74539 6508 121651
25437 121651 140163 108436 142762 32482 -21798 -159000 -200970 -296615 -289638 -267494 -259913
25426 -259913 -232146 -159402 -106029 -71286 -94514 -49226 -47058 -8620 55193 210531 209513 211272
25414 211272 171296 40173 60152 107900 52966 -56396 -150157 -77452 -17400 -48749 80090
25403 80090 27813 16330 70126 115777 113174 139125 205245 68518 -90833 -18917 100186
25392 100186 19119 -87033 -74684 -16197 148667 221869 131194 121796 199556 211904 178210
25381 178210 152448 192771 173769 79086 -40184 -116242 -149815 -48255 -3387 6549 24676
25370 24676 122579 -10586 58102 141638 113573 237721 201961 105230 16312 12485 -16429
25359 -16429 3855 37734 104196 106531 -7131 8126 75218 116102 28436 -20418 -33113 129778
25347 129778 120139 -13089 30548 -37535 -99658 -84811 15893 73951 1538 90154 92068
25336 92068 -11162 92939 131939 48118 26289 -147721 -207202 -209218 -146644 7067 40965
25325 40965 41369 21613 -104355 -233978 -126515 -34751 -51829 -39665 31791 148092 -36476
25314 -36476 -124387 -90935 193981 432899 317382 168462 -56926 -138448 -38113 -38229 -81258
25303 -81258 -67837 -48266 -57273 -35771 12194 -10298 -38174 139648 111842 72363 -86029
25292 -86029 -163417 -188212 -112027 -35832 31903 56053 502 15354 60144 46592 -36765 -128138
25280 -128138 -59178 152416 96020 -65821 7582 80243 -124921 -171123 -46396 -26961 18146
25269 18146 86296 -88789 -258416 -93664 136819 121872 100751 81087 59513 -23604 -133504
25258 -133504 -168358 -100526 -81250 -56183 -27470 21212 87418 163282 165649 227083 351798
25247 351798 324895 172637 134965 230367 245251 103699 -90007 -219423 -129888 33182
25237 33182 60383 212602 162101 13193 80980 215504 152269 100333 67034 143528 119816
25226 119816 -10084 -9803 64443 54558 104874 85423 103933 32265 -6090 -125530 -99972 -278012
25214 -278012 -225664 -157360 -78727 40584 137848 158249 122716 13349 -106889 -165773 -787
25203 -787 74299 14695 115495 116638 65292 65220 125981 87485 190547 223011 72942 -42702
25191 -42702 -110020 -20655 25659 -22685 -180989 -235563 -226516 -53079 85847 108256 -55535
25180 -55535 -211171 -198964 -287089 -316801 -220015 -82215 60377 114194 69355 21041 35636
25169 35636 -19404 -59294 -18632 -10612 141443 148425 105692 21865 55392 27201 -156947 -110535
25157 -110535 -70952 31061 159742 135491 20870 124902 213361 200007 55523 -140415
25147 -140415 -48954 28096 37848 -17551 6704 35969 47579 92127 175794 73088 94191
25136 94191 52187 36296 67850 158224 69425 39222 82883 86730 2599 53562 178761 238557
25124 238557 184759 137726 75248 -32275 -89748 -85502 35486 12594 68057 -65771 -151142
25113 -151142 -190796 -205996 -156699 -133110 -94422 -82561 -42262 -113589 -34203 79172 46162
25102 46162 -10132 -144729 -248270 -330082 -364917 -281340 -85891 -33818 -113777 -271196 -403112
25091 -403112 -382572 -296374 -225837 -162161 -109843 -150472 -150313 -136949 -179707 -119701 -23225 19926
25079 19926 14178 92937 137174 153539 181536 141122 -128430 -111784 1643 -3037 -87409 -5810
25067 -5810 -270 -29468 -31182 -121416 -115939 -41282 71020 8141 38567 94919 73393 37514
25055 37514 35460 -36077 -99031 -80115 -20288 -8693 -8249 -9830 -96989 -13344 -4332 -104135 -185160
25042 -185160 -247318 -195625 -205191 -37219 30085 -16525 -70042 -258651 -273039 -160010 -215476
25031 -215476 -208027 -175855 -16852 163651 80149 36326 -2612 6962 47654 95717 69423
25020 69423 -13807 13433 -39442 -77221 -84555 -74699 -134116 -70357 -8404 72284 205251 229048
25008 229048 208815 245956 156640 60361 15742 -49771 -166821 -153515 -77400 -6886 -68366
24997 -68366 -161105 -61768 22609 -18728 -111521 -96094 -130467 -120651 -56043 -573 88845 139562
24985 139562 164812 65480 -35922 -31707 50279 27267 -7869 37955 134493 226087 95559
24974 95559 -205579 -229680 -100260 -60842 -60026 22732 79592 219712 202203 -25043 -154488
24963 -154488 -163951 -113618 -77244 -12976 -105903 -140389 -273165 -273735 -32642 17672 -175460
24952 -175460 -258775 -263290 -340157 -286168 -312122 -271286 -232589 -162848 -88209 -149543 -12082
24941 -12082 41130 142403 109117 103867 -117 -114788 -20848 6250 9911 43498 148095
24930 148095 161053 139915 121292 184463 222430 230508 187511 174005 313940 439882 307294
24919 307294 227508 299127 278896 178927 134005 137123 -2704 -39580 -49761 -31063 13725
24908 13725 24504 -18970 -143828 -214370 -191483 -94776 -11161 -50438 -51463 -63205 22379 55633
24896 55633 82824 101323 136622 225474 208100 242470 228490 188676 107260 -58595 -164646
24885 -164646 -212562 -179329 8655 58586 -89411 -200356 -288344 -311191 -361487 -369327 -209194
24874 -209194 -111612 -96220 -147404 -189827 -181549 -74563 -13991 -29984 -100248 -12668 16199
24863 16199 -16325 80837 -25002 -173758 -360195 -350824 -341324 -270878 -118904 -100163 -97139
24852 -97139 -120972 -73484 -96855 -72636 21973 -106942 -165481 -93354 -115014 -118955 -143716 -91694
24840 -91694 -86712 -131905 -36639 68477 106073 167681 165030 86533 160200 173374 100261 -75463
24828 -75463 -122675 -143097 -115015 30071 56487 -95 75496 71583 60053 11371 -6059 21722
24816 21722 -4764 -10483 41089 -9545 -61024 -182629 -239321 -205287 -222715 -248676 -126346
24805 -126346 -9006 -71251 -110716 -145019 -137971 -72544 86084 11046 -37744 -1075 -68607
24794 -68607 -173257 -117285 -129421 -126865 -42888 38720 85435 -10331 20252 -23037 -101816 -187400
24782 -187400 -215212 -235515 -144180 -22872 149586 191354 87850 138735 230137 174044 18861
24771 18861 39756 202384 63101 44217 120401 167201 120847 214380 188342 113683 188211
24760 188211 241743 104638 176978 98437 15181 -54757 -32070 -156061 -151976 -154604 -197736
24749 -197736 -224324 -156083 -82916 -9693 18896 -22214 -193334 -120637 -88987 -69496 -91386
24738 -91386 -4591 50971 -35169 13597 48965 85616 137824 81024 70657 98592 117873 44276
24726 44276 -17176 -41122 -59483 19947 180017 79188 54679 -64712 -69589 -192262 -269605
24715 -269605 -200298 -88895 28269 125004 130619 235950 128176 -23119 -49303 -70011 -42890
24704 -42890 -65709 -115987 -53398 32986 153064 218386 160011 5708 -38552 -50588 92905
24693 92905 107984 -20655 -192693 -198488 -158962 -5551 -79614 -120701 -110263 17481 -10165
24682 -10165 1825 -32360 -41230 9840 36102 50304 88294 9551 -85655 -87827 -183536 -128651
24670 -128651 -59153 55832 111124 66498 -12099 68197 37362 -42650 -10210 22191 26909
24659 26909 21898 55539 203134 139695 66546 26684 56878 90917 124212 112567 106039 100070
24647 100070 69920 -5303 -26066 -35900 -104954 -122789 31462 23911 3431 140037 134676 138795
24635 138795 71638 -174074 -173749 20923 4204 14358 156974 27522 651 -1081 169172
24624 169172 248107 183670 191887 130923 40658 -15365 -89723 -133497 -148340 -4191 77274
24613 77274 -52002 -110539 -78984 -75437 -56926 9886 -508 -41794 -114568 -34513 -10489 -31560
24601 -31560 16750 88078 59534 -158953 -264081 -196728 -32095 9224 -33035 8795 133399
24590 133399 23632 45390 73542 75056 -17880 -61418 -102894 -153123 -58349 -153793 -197360
24579 -197360 -61168 -30572 -52283 -75605 -152327 -18680 -40668 -125883 -189811 -137487 -74087
24568 -74087 -25120 23210 -66713 -91957 95837 165742 36062 8996 -47867 -188900 -300756
24557 -300756 -240640 -118754 31440 97021 118451 113953 -19189 -184800 -126165 -228605 -272552
24546 -272552 -270593 -269727 -193422 -159388 -84516 51488 -42959 -195251 -269980 -118840 11229
24535 11229 25418 -135041 -177570 -173988 -160183 -139159 -251918 -449488 -353566 -239101 -274201
24524 -274201 -269576 -156706 -193100 -88626 -52450 -37339 78910 23442 119417 147537 109099
24513 109099 -14041 -9156 -63841 -86217 -58438 -180747 -53104 -48810 -88136 -88045 -46215 -43623
24501 -43623 -78931 -145131 -150867 -117344 -84346 -151438 -61634 57556 152282 132728 -16455
24490 -16455 -44587 -119202 -110907 -138548 -116302 -126032 -222838 -105874 7305 34100 19374 -4603
24478 -4603 -86725 -112611 -107645 -160679 -257875 -129452 -96803 -67887 -4571 -116928 -234139
24467 -234139 -202169 -113906 -26951 60013 75462 -16398 -90472 32844 -2500 -68366 13387
24456 13387 128669 133467 184462 150494 117451 67327 88937 173104 323194 112672 -176217
24445 -176217 -269774 -142723 -45950 -91079 -16913 -30712 -74141 -43510 93033 134967 -42
24434 -42 -106177 -6946 14143 -62295 -50475 -106881 -259831 -122469 -142992 -277854 -236033
24423 -236033 -75714 88566 59458 -25600 -121144 69958 -1565 -90831 -54453 -68038 30823
24412 30823 101257 76336 72965 -27786 -35387 72475 -85711 -174135 -46340 51929 2999
24401 2999 -76571 -205643 -281313 -212770 -170014 -64422 -23903 71915 44808 -46953 -2090
24390 -2090 -19387 -55948 -266634 -319854 -260133 -124756 -121448 -171035 -104616 -53440 -296 52704
24378 52704 94521 28224 23293 16772 12767 -6842 18086 -30406 -114892 -164575 -120645 -68506
24366 -68506 -136396 -143070 -129100 -90958 -90316 -126115 -128103 77787 178202 76388 -40701 -37778
24354 -37778 -198802 -343996 -259612 -265465 -256323 -193794 -173777 -156167 -31877 35577 121420
24343 121420 95243 70990 -2859 63581 16256 -96649 -69648 -71403 -73102 -55980 21334 109151
24331 109151 -30441 -113230 -56025 -147841 -190672 -229217 -140241 -165789 -214343 -127128 -8381
24320 -8381 -33563 -161907 -212628 -234055 -199662 -174335 -210143 -143636 -114280 -27149 66221 46598
24308 46598 14702 -18673 74542 98246 18910 -183985 -224920 -140441 25918 65049 5536
24297 5536 -45010 -110761 -121194 9533 155521 166290 15133 -11444 -4440 24634 117670
24286 117670 227644 230709 113164 41781 -37894 -113667 -13876 204528 169979 89607 59437
24275 59437 64663 81967 66719 123637 81430 -8016 87943 210025 276887 362300 307680 98993
24263 98993 -118359 -300042 -81093 157591 141408 265434 264735 229948 142975 -14073 -85071
24252 -85071 -93276 -14119 51620 -15951 -47118 104183 96346 -15155 -92328 -76397 -59788 45828
24240 45828 28635 35196 44829 4903 -83309 11675 22727 15012 -33076 -93747 -68831 -26047
24228 -26047 33414 97287 126029 -74925 -134474 -70848 -95068 40627 171778 139102 56858
24217 56858 101255 110587 129701 10026 -63240 -39191 -56884 -97941 -69068 -40887 21509 97294
24205 97294 102093 20769 -4217 86251 144106 147454 152138 166796 96060 3427 -21756 -139879
24193 -139879 -74667 160181 165957 106504 -58490 -205600 -155327 -35009 155566 127850 182145
24182 182145 294112 223491 48236 -1250 -29341 -22683 -86795 -130173 -148430 -120188 -7172
24171 -7172 67992 -2060 -17851 -76579 58026 43619 -24252 61552 117557 95684 123329 169224
24159 169224 100426 150537 146422 224039 171217 -8640 -16572 -7946 -105593 -181930 -129076 -172593
24147 -172593 -153999 -147052 -152270 -159914 -99484 75459 129374 124424 -46667 -79748 -146771 -68430
24135 -68430 -105832 -222004 -316831 -210063 -91480 -54729 -112149 -200645 -85910 -31027 -126316
24124 -126316 -117140 -109722 5830 -96085 -48075 -1688 -17117 -34153 -120137 -87764 -48338
24113 -48338 -27486 -129908 -287722 -321961 -201925 -327404 -426531 -312215 -210021 -213078 -137995
24102 -137995 -30474 13652 79848 145994 30298 12973 70470 143023 185049 153056 293692
24091 293692 274279 231575 91512 -96605 -142738 -52300 -28883 -69731 -134679 -188603 -136485
24080 -136485 -64860 -65200 8447 113191 77243 -76306 -220825 -76811 66356 78937 113881
24069 113881 67190 -92068 -320121 -347550 -224496 -90763 -24332 -10570 54516 88784 119232
24058 119232 26159 -27610 33584 -45995 -72934 -34579 -44903 -71138 -29737 5240 84068
24047 84068 28040 -105853 -274631 -267593 -218503 -174733 -227040 -137132 -34099 59605 -22674
24036 -22674 -80269 21278 74956 -73274 -145270 -176515 -297112 -333894 -311674 -111902 3250
24025 3250 -124376 -131116 -116232 -121248 -94344 -93098 -219112 -205110 -173506 -174395 -172940 -229805 -112676
24012 -112676 -33855 -82493 -15137 -54229 -93603 -156955 -97675 19486 26405 -3217 -17295
24001 -17295 9371 29445 115729 213859 80537 -43021 -91385 -166028 -195919 -171934 -20740
23990 -20740 -40194 -229408 -150128 36135 -24387 -111979 -75052 39898 43162 3488 -41884
23979 -41884 -82624 -79475 -98333 -62504 -9724 856 -16842 12549 -144703 -148953 -53060 -21405
23967 -21405 10918 76668 135698 107645 56706 51618 -32470 -70139 36319 121631 141431 184836
23955 184836 165731 3396 -118811 1218 9295 -103460 -138678 -109283 -62766 35472 145519
23944 145519 99748 138466 -1379 -71436 46119 68688 16953 -121123 -219956 -130530 -66538
23933 -66538 8892 9860 71439 61669 -13709 13547 113939 125891 84676 117155 70711 26463
23921 26463 190873 202519 141167 14440 -50265 114892 237827 122297 85444 -140024
23911 -140024 -284300 -189870 -30508 -71240 -95192 -42964 -87134 -133656 -25173 26143 -34377
23900 -34377 -82159 -96445 -120107 -126222 -83984 -101043 -116837 -179806 -135139 -305876 -346908 -231970
23888 -231970 -9047 179103 335993 215117 23708 -19850 -108517 -5234 141782 216952
23878 216952 111169 -18864 -69941 -6575 -35724 -83243 -92652 -54376 -144426 -88090 -116193
23867 -116193 -167097 -118978 -144266 -83144 -35465 -32451 -42350 -22299 -124924 -163717 -229195 -214484
23855 -214484 -207604 -284176 -283843 -152655 -90368 -107371 -160927 -56190 -40013 -108583 -104114 112442
23843 112442 87198 105946 75740 31909 -24322 -27138 -97503 -166889 -63964 22579 51826
23832 51826 -54000 1249 107613 188075 93949 -29327 -12065 -49742 -52543 170793 185119
23821 185119 64588 -25084 -32308 -162876 -226556 -103819 -61841 -143634 -133339 -73792 -48527
23810 -48527 -215527 -356329 -324619 -312692 -384732 -304451 -168106 -147962 -279996 -235700 -190932
23799 -190932 -39996 -52984 48731 85988 6075 71109 5611 -125482 -213755 -233189 -172579
23788 -172579 -217408 -90189 -105043 -76873 -77724 -72052 -77519 -30097 -26728 -81403 -115113 -158397
23776 -158397 -135808 -156824 -217843 -196612 -136849 -213570 -224899 -313391 -238908 -108049 -60080
23765 -60080 102513 57868 41772 62412 33992 -21116 26035 178817 127776 3090 -75705
23754 -75705 -199709 -193830 -204484 -172708 -142696 -179331 -152298 -175089 -139549 -106772 -67286 -53952
23742 -53952 -96357 -11636 14876 18126 13647 -47535 55013 -79586 -262020 -234631 -258863
23731 -258863 -165794 24485 -29459 -126102 -16649 132364 118879 112580 74098 158446 112354
23720 112354 109511 194869 102347 54447 -125025 -155448 130918 224769 231201 245562 218821
23709 218821 169990 137886 -3360 -53377 -43899 -114046 -144378 -49803 8040 -101398 -149083
23698 -149083 -81252 -76953 -124435 -28232 -27994 -36581 -57268 -63500 -26272 49140 30450 -16966
23686 -16966 -88657 -42334 30192 60537 -817 -57921 -118459 89440 36358 7607 140598
23675 140598 240757 163443 -50240 -166637 -160226 -49580 29584 -15549 -44929 -48174 52706
23664 52706 98496 83361 -25435 -134435 -222429 -127019 34412 98805 95597 94987 28753 64831
23652 64831 129710 99537 48236 12790 46124 96051 41420 33662 -63766 -72207 -76895 -105468
23640 -105468 -9215 -27780 -72303 -184585 -300393 -236712 -104734 -58362 -163672 -89796 47303
23629 47303 51262 118932 77226 -15071 19606 -50216 8848 82959 89289 43327 -67707 -84878
23617 -84878 -86913 -36308 -33387 -75788 -131401 -159334 25734 87746 -4755 116176 69398 -49403
23605 -49403 -30396 -133477 -129611 -27301 1832 5237 -4522 30793 -27007 -27056 40705 140025
23593 140025 166524 229166 183058 113293 9409 -4846 -48730 1945 41039 119391 23898
23582 23898 33991 -28815 -78885 -78646 17979 142343 47989 -101727 -120413 -117956 -112723 -201150
23570 -201150 -209915 -176612 -102956 -82972 -60958 -100503 -57148 -74939 -94488 -45408 -28518 -42552
23558 -42552 -113954 -118761 -51708 53607 188967 148094 16448 -153906 -177343 -58274 38624
23547 38624 -12578 126998 122621 57577 51910 -1172 90279 216670 163163 109789 48899 35414
23535 35414 -67327 -3642 127361 208576 169193 261971 281917 143656 -9712 -114491 -8250
23524 -8250 92734 61481 95879 -51682 -102561 26323 49048 -20963 -68810 -133755 -91257
23513 -91257 -163165 -280750 -392859 -322910 -159909 -188933 -315895 -244497 -245469 -178189 29820
23502 29820 26623 54680 8928 85156 97395 134987 233633 213921 222775 94333 72006 5619
23490 5619 -69514 3719 28250 -57962 -189566 -221864 -207728 -184707 -197145 -254860 -182048 35928
23478 35928 128980 74474 -74211 -44895 132828 246710 183335 237791 49753 -10626 -59216
23467 -59216 -89612 -6036 -86994 -181511 -162437 -147444 -107777 -159295 -215305 -244554 -258108 -236101
23455 -236101 -231439 -132188 -57046 13471 64169 -11573 32920 148036 181146 5007 -82353
23444 -82353 -104119 5603 40815 42875 -59378 -207547 -168837 -76936 -46372 -168304 -199756
23433 -199756 -283268 -243555 -10615 134307 41606 -70100 -117767 -13857 -43331 -45203 32633
23422 32633 121706 144883 84506 13950 58886 173545 236781 153841 71051 -68442 -121588
23411 -121588 10831 -83624 -81236 52020 120850 74699 296 -9541 -95982 -150453 -120028
23400 -120028 -114647 -89399 -60590 -797 73674 -18478 -50512 54524 126252 143797 74060
23389 74060 40247 70582 17459 -2667 18178 -20195 -23787 -33438 -42179 -71723 -19802 155438
23377 155438 126734 53385 -153459 -230266 -224540 -231016 -94731 -11326 -122379 -118148 -16871
23366 -16871 56493 -53018 -10201 126806 106717 38679 10641 55662 46048 36115 28029 69332
23354 69332 24212 84176 148045 110704 62001 114707 72194 16121 -52013 -58114 -141859 -189895
23342 -189895 -147877 -264348 -188706 43443 128458 153658 23436 98585 118128 123184 149811
23331 149811 151792 189787 119764 98634 124555 -30523 -92043 -92736 -123146 -112993 -19676 -58747
23319 -58747 -246399 -202320 -185995 -33637 118585 135185 56229 -96169 -80286 114935 207905
23308 207905 63063 128956 154666 236628 175740 33704 -109282 -25448 110446 104711 41981
23297 41981 -3003 -60204 -4225 13274 39232 42138 -21549 10414 148684 206867 294527 160719
23285 160719 -42963 -130219 -129042 -107125 -18703 26938 -35450 -193209 -192626 -248901 -231345 -221922
23273 -221922 -303228 -264692 -346440 -262029 -212735 -295217 -204068 -227230 -51353 75930 17473
23262 17473 -92208 -88817 -59014 -227946 -347880 -286994 -169617 -85342 -242355 -291691 -243113
23251 -243113 -169011 -192480 -121530 -88195 -139994 -90057 76856 89047 50861 46951 123273
23240 123273 200746 151501 13623 -212773 -239181 -135629 2970 74331 51607 -7199 29336
23229 29336 16193 -66921 -49989 -93879 -56415 159207 289306 134457 165298 93510 24511
23218 24511 85519 137481 274935 216891 39571 -49653 -157023 -4286 96421 -709 -12772
23207 -12772 -18916 -39787 -96560 -223863 -237063 -169113 -232797 -224147 -170505 -155508 -75931 143353
23195 143353 125197 41500 -34801 110336 279149 196877 133581 128205 113078 33893 -72170
23184 -72170 -110607 48803 220934 114109 -85511 -177393 -92748 111780 8884 802 43658
23173 43658 -12209 -30653 91152 12177 64313 181524 299999 218047 281545 378324 284836
23162 284836 125269 90493 55817 58575 174156 194875 100104 85382 161167 26780 -107965
23151 -107965 -25945 50030 44759 69120 47695 -72768 -128837 -75790 -182167 -138463 -107777
23140 -107777 5334 48897 52088 73257 81015 -123752 -106015 -92194 -19591 -4964 -88927
23129 -88927 -168400 -152193 -80645 -23363 46835 20604 1272 74736 127181 171437 149039 11113
23117 11113 78700 126064 158804 103623 84385 103157 -33747 -49646 -71954 87709 142986
23106 142986 -17118 -97092 -121938 -163895 -266497 -301050 -184601 -75123 -253394 -384223
23096 -384223 -300670 -215019 -120988 -139420 -72450 -90602 -38593 -61618 -109334 -49275 -147787
23085 -147787 -88976 35526 -112571 -29795 46903 7030 -26204 -61849 -249276 -378250 -259135
23074 -259135 -214182 -205202 -224063 -128296 108091 199082 197666 119901 45494 -44675 70422
23063 70422 136374 54107 22027 -44781 -97497 -72175 -97834 -117347 -159150 -143299 -175578 -71038
23051 -71038 -47081 -23042 -16261 46667 -59368 -168540 -191268 -128762 14271 19474 6847
23040 6847 -24437 -120190 -88165 -21673 -61955 -119228 -47504 -42380 -132983 -161086 -132455 -109323
23028 -109323 -67684 -51378 -137765 -130111 -136979 -158238 -170348 -249092 -309616 -204675 -51237
23017 -51237 -41060 -65867 -5268 -48871 -119297 -179296 -180001 -64466 -37689 -109864 -134229 -149250
23005 -149250 -114118 -1107 70927 149563 159767 49223 -54846 743 -12322 -126757 -217281
22994 -217281 -343126 -300183 -180501 -56040 20377 -4324 -84256 -210459 -164355 -104351 -89722
22983 -89722 -161299 -178722 -251676 -170278 -146164 -207421 -246161 -240870 -131505 -108064 -39265 15043
22971 15043 47948 117961 144512 188373 155289 79223 135936 273276 308380 285824 233655
22960 233655 52291 -66086 -134866 -154400 -57389 -77490 -92465 -34662 -99568 -133931 -137669
22949 -137669 -37359 59199 -57849 -84448 -60039 -95201 -18357 55757 186719 82771 35971
22938 35971 -23545 -7339 85251 215734 244511 72895 32114 -11243 -36746 47579 10061
22927 10061 -42748 -128682 -187246 -260228 -318438 -379126 -380974 -256045 -117945 -128774 -63467
22916 -63467 26527 -87724 -184336 -239824 -125759 -9225 -8490 -96027 -38237 -11611 24866
22905 24866 -5687 36661 147954 114865 -9263 9647 7973 -21229 83226 144786 101026
22894 101026 14122 -74186 -94151 -83018 -24807 41496 113153 87284 59847 148449 210758
22883 210758 89648 -101783 -200573 -156864 -4476 -53013 -54497 -224701 -347392 -374612 -335431
22872 -335431 -178856 -184113 -275328 -279156 -148169 -117479 -144991 -109887 -12842 -22317 -50811 -48084
22860 -48084 -101860 -84607 -64023 -190712 -197045 -108484 35589 101709 78555 -2292 -10104 47463
22848 47463 130488 146140 69440 119985 121664 37434 28775 59902 16491 12361 80473 74486
22836 74486 28304 -87162 -89409 131559 167616 11367 -172512 -150820 -54477 29102 -138120
22825 -138120 -113800 18462 -16180 -178766 -240209 -287261 -290163 -326667 -201221 -47519 -76188
22814 -76188 -163191 -83452 -129808 -32915 -21892 -13160 -124363 -23087 42074 71433 -28077
22803 -28077 43495 36729 -9241 -51852 -128326 -136353 -17887 2595 8287 75707 18496 -97815
22791 -97815 26777 18013 -59486 -13354 10678 15230 68163 215322 199321 87293 173979
22780 173979 192562 -5597 -176610 -272556 -185841 -149507 -218867 -236074 -60334 102826 150247
22769 150247 83718 26013 3961 -11570 -124726 -188462 -106998 53920 -3513 90955 124123
22758 124123 78582 -83902 -201483 -176307 -194830 -243894 -172262 -87912 -164774 -76833 4993
22747 4993 -86664 -124937 -206229 -217630 -270977 -180569 -62986 -56268 -147102 -127157 -19253 -157802
22735 -157802 -120838 -5330 33629 73420 143648 72294 66131 9312 -54537 18882 9049 -29188
22723 -29188 -17735 -2697 119113 195853 123973 101112 32395 -44716 -68672 -38146 -61712
22712 -61712 30559 101274 67373 -6155 -37440 2555 76896 143265 144958 -19359 -5121 -1712
22700 -1712 51018 142617 159945 39593 -51791 -84500 -58858 -141052 -184311 -151052 -140577 -189584
22688 -189584 -95747 8863 -2527 -65845 -14794 -74833 -45489 26812 18150 -64261 -66013 -73326
22676 -73326 -129829 -109818 50291 107671 147113 234440 234090 138356 45957 2443 90480 107504
22664 107504 70225 58993 -25939 -78382 -91336 -127170 -99192 -68734 -94311 -74247 -185625
22653 -185625 -90443 -45034 -10974 36313 127617 59244 -84949 -155431 -54983 -99341 -72134
22642 -72134 -49458 -56893 -11257 -5957 73200 102954 192604 174560 80947 108333 100591 81087
22630 81087 64885 61389 16884 -28748 -31192 12926 7255 49187 -29733 -27597 -39440 -76656
22618 -76656 -89974 -2055 17052 -69793 -181089 -266671 -235834 -222908 -229690 -122026 -141446
22607 -141446 -223810 -207009 -166787 -179294 -203904 -67988 -32615 38432 111631 -13210 -9233
22596 -9233 37454 -37950 -77098 -128165 -151737 -254693 -298783 -228531 -171726 -288080 -321458
22585 -321458 -229793 -146473 -160519 -182090 -36051 74534 60108 -63663 -178932 -209362 -8097
22574 -8097 58145 16393 102385 70355 -6153 -89432 -57689 51041 47482 135187 73820 -144529
22562 -144529 -43383 172600 76390 -69581 -1564 122477 231924 148989 127099 165648
22552 165648 115754 95235 63395 -60276 -104888 -104895 -8748 3534 42674 82140 -45819 -100203
22540 -100203 -96414 -61777 -75714 -151722 15826 209853 158383 30618 -26090 -82209 -189350
22529 -189350 -213979 -89527 67178 96458 72607 39586 116234 96505 16275 -25106 62343
22518 62343 14652 53099 69613 166060 103666 48964 87751 18805 -123789 -89836 -11730
22507 -11730 585 15837 10058 37841 106239 101164 -127 -47857 -130655 -135013 -3474 75580
22495 75580 3870 105159 230998 138916 125660 145575 51812 -75743 -89805 9787 262080
22484 262080 235014 150986 120897 43687 -101790 -205206 -119113 -47149 -97054 -103537 7248
22473 7248 69170 31821 -26194 -181228 -262257 -285437 -167145 -33880 -35252 28923 24645 -37646
22461 -37646 5878 98816 90907 150231 151472 54627 4410 -112043 -224097 -288378 -164945
22450 -164945 -35645 -34238 88289 -133942 -260098 -179024 -51676 96228 120986 43833
22440 43833 -79581 -160749 -274021 -287991 -365491 -430825 -378946 -292042 -142195 -31140 69504
22429 69504 -58791 -166098 -16886 19822 -54293 -89690 -84146 -3146 35993 -128134 -253290
22418 -253290 -149001 -45487 -28031 -12271 18924 56476 -164386 -238442 -254402 -189552 -18339
22407 -18339 3629 -40296 -21196 100472 180351 107334 -20510 -102846 -28288 -18181 -39714
22396 -39714 -23465 88254 152840 191503 123527 124119 80632 139773 103666 -38698 -102548 -99573
22384 -99573 -65354 -76079 -106839 -57530 32476 -43875 -104275 -189837 -93145 19089 26787 44272
22372 44272 12550 -95223 -43282 69638 -64228 -35119 74903 133802 60380 112038 112802
22361 112802 147881 131219 99331 141099 244318 206979 102833 -34541 -259454 -263505 -250154
22350 -250154 -201860 -149570 -92143 -36581 -4202 -37727 -178844 -79541 -99796 17675 -78902
22339 -78902 -36223 47411 118708 50167 -13255 -14862 40966 -68846 -111895 -92826 -97687 -108305
22327 -108305 -148054 -151453 -8644 70950 97451 -2519 -88386 -7854 -11398 -97200 -90130 -50586
22315 -50586 -26672 7647 -48192 -95246 -184349 -250705 -245613 -369167 -323715 -99291 -25075
22304 -25075 68711 56720 60485 -21837 -183413 -141834 -32836 51280 21438 -11746 -66527
22293 -66527 -64383 -70680 -14298 74840 87144 -80897 -47663 -79861 -74062 -100191 -184592 -111693
22281 -111693 -34627 -73217 73202 201861 108879 67532 -6419 -8746 -15229 -78293 -62781
22270 -62781 -22547 -12183 -164 -28426 -118997 -88515 -21237 -8227 69338 -116822 -157003
22259 -157003 -39843 122551 22360 12083 124311 19924 -120852 -132390 -57703 -83587
22249 -83587 -85405 -73648 82130 49247 -7026 -1165 11702 -61128 88316 81008 63190 79509
22237 79509 171926 85940 -69162 -102441 -81398 -24667 -78078 -44940 -82707 -42584 -134553
22226 -134553 -109977 12334 74706 51456 -146628 -37029 23126 50382 111736 19999 -59615
22215 -59615 1784 42561 -8174 -98576 -183653 -223774 -119351 -89320 -120035 -25392 -57468
22204 -57468 -105888 -224101 -270055 -308832 -267032 -211603 -61125 78879 116481 35543 23330
22193 23330 11513 -98147 -32694 33228 36581 -20325 53239 83840 -57194 -164102 -185787
22182 -185787 -171322 -177979 -162279 -180739 -274152 -286255 -172625 -178227 -225354 -189327 -42912
22171 -42912 93382 -28560 -124668 -117773 -35425 136853 119586 -4362 -97196 -81642 -145662
22160 -145662 -80747 -136485 -159753 -2005 -8050 -66359 -56277 -46115 -29275 77400 82832
22149 82832 96396 60741 -14722 41275 -58815 29551 155530 19686 -33061 -111893 2713
22138 2713 -15056 -99843 -67515 -45539 134870 167975 121980 -66999 -240876 -290242 -368775
22127 -368775 -399938 -334992 -198767 -144347 -33346 -3027 2623 -9363 -79114 -145035 -184656
22116 -184656 -116661 -26817 12241 -58853 -23145 144092 133100 40568 -16863 -99819 -75917
22105 -75917 -148737 -117951 56827 140956 150446 151800 178846 241301 84279 -19708 -129370
22094 -129370 -64293 -96680 -24388 -86950 15489 14541 -12239 -60069 -159010 -181668 -79408
22083 -79408 -3387 -88259 -141647 -171081 -222275 -100802 -20883 198676 181333 11483 -92094
22072 -92094 -130897 -148340 -159579 -96306 -30200 33406 51803 78559 55260 -94114 -111395
22061 -111395 -30158 -641 -83420 -186240 -155595 -99873 -90378 74595 59418 21573 -65586
22050 -65586 -141738 -164482 -214472 -92544 11144 -8636 -33869 -72293 -150272 -131484 -150080
22039 -150080 -214233 -322360 -151890 2199 -31680 -54374 -81632 -54959 -125650 -293561 -215887
22028 -215887 -103466 20340 -74944 -68027 -118255 28448 207477 146921 29055 -26567 28469
22017 28469 135017 159313 188460 203709 121793 186342 31643 -38353 10795 20491 120784
22006 120784 128489 89349 159917 96672 40414 123018 67821 -6833 -140460 -203349 -132842
21995 -132842 -126621 -75716 -63623 7058 -33464 -137630 -170192 -63590 10564 40379 19025
21984 19025 -57545 -101317 -92410 -102214 -107010 -20755 -67797 -163595 -146082 21297 28326 70234
21972 70234 51402 21500 83905 -72304 -130113 18157 86383 37221 -64291 10198 48433
21961 48433 4570 94653 132733 -21207 -169231 -182610 -197204 -231747 -232123 -255546 -193814 -114095
21949 -114095 -93855 -41955 -41684 -72488 -76854 -42830 -90068 -106664 -121573 -13838 117367 193810
21937 193810 156887 179571 203320 160770 -22437 -13616 -40502 -243227 -294427 -75947 83437
21926 83437 67226 131411 311643 188833 146709 4249 -20790 -69710 -145981 -96131 38835
21915 38835 74279 -101528 -343459 -290044 -123225 -143740 -132949 -119012 3009 76539 144756
21904 144756 56075 118698 26217 -83022 -93291 -80991 -78289 -58474 -111966 -107892 -95431 -145063
21892 -145063 -217742 -288094 -372414 -309780 -203714 -174035 -293463 -319778 -320614 -287943 -61516
21881 -61516 -103241 -152773 -162487 -121136 -156969 -43824 -29625 -28197 -26552 74185 85557 99952
21869 99952 11320 -16163 59388 79325 152624 110607 67155 36338 30798 -66471 -75471 -13026
21857 -13026 49993 17876 -93241 -150385 -221363 -149917 -75182 -94980 -179501 -189968 -193298 -72700
21845 -72700 -116620 -83337 -117823 -93265 -26550 -19422 -41083 40709 3013 -109928 -177810 -174363
21833 -174363 -161566 -178653 -89151 -79103 54203 189829 102087 441 10790 -107321 -256933
21822 -256933 -231356 -119024 -88922 -79776 -165649 -272390 -189708 -47575 -84181 -66660 -21971
21811 -21971 -116016 -176065 -95572 -20322 54584 161190 230405 171127 11121 43709 -111403
21800 -111403 -148549 -172129 -270586 -104243 -900 -35197 -24361 46903 52467 -31786 -131046
21789 -131046 -224652 -354566 -324762 -129811 -66737 63388 54344 125953 -6670 -147072 -148814
21778 -148814 -48283 -160798 -81434 54752 101144 86197 223979 234276 146721 54790 46624
21767 46624 96074 127816 40542 -137620 -273515 -213778 -181515 -111826 -90705 40784 55215
21756 55215 -23859 -71273 28036 138776 119685 17387 37980 -89787 -162487 -25100 109560
21745 109560 193776 191379 149814 18383 20146 -27323 -74521 -110130 -213131 -162566 -30524
21734 -30524 -23487 -140839 -223011 -217187 -196508 -125671 48464 88244 82228 -22540 -109939 -29592
21722 -29592 63755 -10147 -50706 -73847 84179 98633 154483 60358 -30929 -77446 -58168
21711 -58168 -46356 4445 55567 143470 101671 -10765 -186278 -335451 -324052 -203849 -134146
21700 -134146 -30798 14533 -53500 64952 70554 -27923 -110553 -167153 -89149 -108624 -111553
21689 -111553 -118184 -143775 -147109 -90528 -39707 1402 50050 41443 130089 154708 96029 -5412
21677 -5412 -94383 -25008 -80844 -72314 -31770 -64083 -55769 -32282 -23315 -105635 -165276 -61008
21665 -61008 -72915 -58308 -86651 -103134 -204091 -267610 -137808 5839 115046 60375 109630
21654 109630 150979 198005 59740 -89170 -135982 -158609 -143562 -122780 -133573 14662 -46025
21643 -46025 -28382 -7458 -71526 13889 75046 21581 -54663 -151731 -86064 -89550 43821 32101
21631 32101 58102 112999 109917 57900 -100454 -137365 -123884 -118855 -43166 61050 -9340 -70710
21619 -70710 57966 9626 3387 -96991 -40161 6609 -70615 -43925 65553 132476 39655
21608 39655 34501 67379 126099 77801 13005 -61423 -265328 -302678 -235437 -169721 -162963 -234506
21596 -234506 -249390 -233079 -293545 -260254 -152254 -99057 -223753 -190294 -39352 -3446 -25524
21585 -25524 9079 41847 33142 -24183 -90956 -61955 -105664 -224801 -250507 -34232 -20237
21574 -20237 5323 7889 -38871 -116179 -107493 -100187 59007 82617 44863 41710 44476 70823
21562 70823 -29384 -41696 -91905 -75623 -22491 82493 79326 8372 -57218 -58061 -56052 -157234
21550 -157234 -59436 -27701 -38275 -66498 -117684 -248677 -195641 -126788 -113802 -80108 -68605
21539 -68605 19565 68621 59421 90259 -30164 -172067 46224 129525 4447 -46256 -58457
21528 -58457 89038 177737 -101 -154761 -258904 -219084 -237855 -120127 37203 -5534
21518 -5534 -30421 -31961 -60409 17867 137299 239838 278812 198061 183832 -53439 -277987
21507 -277987 -364543 -245071 -107529 37755 65434 60790 44238 -71187 -131159 -164417 -141432
21496 -141432 -17356 -29546 63187 109875 -3148 33755 -25277 -58616 -76005 -40007 -52520
21485 -52520 82672 90730 -39494 -113676 -92511 -32867 -19689 -14704 36007 6717 43157 166783
21473 166783 230895 378630 279033 109100 -43413 -173877 -131436 -15861 -12426 2162 76737
21462 76737 30635 21325 101330 -45458 -114847 -64447 -91737 -55547 28421 99216 54671 -11203
21450 -11203 -93491 -126333 -191765 -241596 -94774 18741 71695 59008 147529 167845 212340
21439 212340 198927 43309 29781 55156 32242 25615 43813 -55989 -86607 -124917 -154239
21428 -154239 -164168 -240683 -141721 -74707 -84254 20127 65559 -74996 -113749 31500 24087
21417 24087 -7656 68546 49870 -99079 -189340 -174898 -52892 -48564 -62916 -167001 -213529
21406 -213529 -9809 77134 -66404 -98190 -135479 -47083 -32064 -102852 -121440 -83997 -61215
21395 -61215 -118899 -73578 8328 -5553 495 -29856 -17424 32366 -113946 -180319 -197923 -242103
21383 -242103 -250334 -79164 -58726 -32430 38103 -66830 -178973 -120063 -25824 -91539 -85862
21372 -85862 8875 22272 -34318 -75885 -120612 -61196 -48033 -25189 30971 -82162 -79146 -70862
21360 -70862 -26339 -33536 -52271 -48851 -2848 93922 5279 29259 31706 -81216 -243461 -227056
21348 -227056 -145070 -168809 -289581 -410951 -375170 -267271 -101527 35657 -14279 -54154
21338 -54154 -47170 -134906 -223424 -248393 -109594 63285 112951 167175 138110 58125 11686
21327 11686 13126 68881 -53339 -35216 22760 -66537 -88090 -43642 -178859 -174848 -232657 -207500
21315 -207500 -230953 -347329 -456733 -339210 -199598 -221033 -163225 -94019 56868 9823
21305 9823 86520 148796 148542 58995 11848 -104683 -133675 -192594 -114066 -173337 -194700 -17376
21293 -17376 25896 74880 172524 -23683 -22200 4367 -71331 -83627 -16369 78908 77711 -34257
21281 -34257 -156216 -149006 -98533 -31529 62128 6880 -7159 109036 18368 -9873 -11361 -83177
21269 -83177 -166080 -220607 -159461 26380 89086 89759 117349 107268 117346 140694 27439 -90718
21257 -90718 -37887 -100033 -105767 -47942 102842 149734 61095 60518 106849 79163 23853 -39923
21245 -39923 -26167 -2251 -2734 53424 175648 228544 185149 96575 183009 98011 13261 101377
21233 101377 57196 -61495 138456 172554 125459 76875 4762 44231 15504 93947 125255
21222 125255 14658 -85646 -101948 -21278 -62897 -44424 55357 101200 162040 54284 -117657
21211 -117657 -131866 -25712 78189 122823 -24495 -155286 -88935 -76234 -16989 -33526 -55395
21200 -55395 -114721 -78312 -27 9825 -7789 -26841 -142877 -199093 -128921 -103604 -82931 4733
21188 4733 124182 173993 58044 5205 72494 6861 -10093 -133159 -42306 43120 -96728
21177 -96728 -125887 -154998 -152246 -10786 -9104 -126892 -147181 -13617 42005 53989 53030 121194
21165 121194 81837 -27257 -1948 -31649 -11876 70315 173186 78308 25547 -25335 8682
21154 8682 2586 -47037 -20944 42254 88683 96863 -32328 -95446 -123351 -77693 -137893 -103757
21142 -103757 -123750 6728 -43922 -95532 -95782 -146957 -79536 6587 -16448 -84236 -12515 95678
21130 95678 248916 305061 188078 12236 31894 31691 72961 63678 -81293 -200898 -222680
21119 -222680 -190459 -156100 -274593 -280979 -243997 -212002 -207753 -179840 -112863 -15303 50572 -58057
21107 -58057 -76468 -24306 -23603 -45374 -81847 -194307 -209348 -165423 -107976 -41743 -51318 32949
21095 32949 75170 112680 -17596 -15905 -4122 4636 127973 128218 118190 44225 -111161 -141646
21083 -141646 -156103 -303965 -356302 -228876 -88398 -15816 82285 72796 -5160 -70499 -55061
21072 -55061 -125533 -134530 -43299 58636 161377 253905 226000 134245 -67006 -215319 -284720
21061 -284720 -238302 -63092 -12116 92320 52856 11670 -7263 -33908 35603 177808 84642
21050 84642 44948 104411 89278 123269 178974 160802 142930 98086 -11530 -128668 -94794
21039 -94794 -163690 -210491 -138189 50624 64949 102925 121996 24647 -134164 -231571 -236588
21028 -236588 -103628 -14853 -62215 -206320 -177415 -131382 -46568 -62024 -85456 -140172 -93675
21017 -93675 -93407 -130340 -169649 -74604 -71964 -52577 -109826 -189665 -150742 -186403 -159741 -8027
21005 -8027 213897 250245 80410 37564 177902 168421 142306 100230 106685 95927 183498 227541
20993 227541 252071 231695 237383 250367 -10121 -89758 -80 -79029 -21787 22281 -20164
20982 -20164 -95963 -102950 -7557 -45413 -43742 -159477 -104672 -66301 -235910 -293057 -152718
20971 -152718 -179636 2636 190112 150582 19363 -14794 56958 80454 -8080 -86553 2878
20960 2878 14978 -58274 -46932 36749 123491 145289 62238 19222 55131 110015 160881 -18744
20948 -18744 -140480 -185576 -142116 -188018 -279587 -241460 -102377 -80852 -42767 -8577 61711
20937 61711 -42370 3309 -57686 -146610 -193104 -136410 11660 25317 -101098 44779 66177
20926 66177 14787 -63473 -87005 -87641 104023 116699 45621 151094 29191 -132863 -207865
20915 -207865 -164144 -18659 26156 -2440 -77134 21237 81676 -69991 -22343 22876 89382
20904 89382 18040 -132884 -91315 -100132 -108377 -105889 -144038 -234956 -167443 -143313 -199561 -157327
20892 -157327 -134397 -110841 -38163 114211 71968 7932 -47970 -226778 -269651 -188785 -55809
20881 -55809 106956 215066 205044 52483 90920 127343 14628 52466 -83619 -126997 -207073
20870 -207073 -339281 -386221 -235574 -1941 -747 -96525 -126486 -54202 69913 77388 -53876
20859 -53876 -164334 8997 78519 117558 81652 -52385 11368 178621 244010 135777 32230
20848 32230 -88362 -81870 9889 -75212 -110311 -19523 61266 45871 -1062 34032 -11647 45404
20836 45404 68845 -1359 147399 148614 23625 -52555 -38465 27492 43333 133966 10626
20825 10626 17253 122350 54367 -100235 -108684 -3700 -56907 -42885 -67732 -156528 -224479
20814 -224479 -164324 -83547 -31057 -186149 -276796 -222711 -99154 12383 94592 116097 -75339
20803 -75339 -218577 -309437 -323397 -125807 24693 97218 216344 145010 112624 89576 108103
20792 108103 55372 -68480 -77959 -17594 -55720 -31593 16088 -37869 -31207 -29263 -268994 -341839
20780 -341839 -201781 -204223 -147286 -68544 -145805 -162289 -135517 -236835 -131080 -18585 22449
20769 22449 66555 117010 53337 82825 57959 53769 -50633 -35739 53043 -33127 -62554 -156797
20757 -156797 -117004 -218439 -169857 -146153 -177357 -221633 -183999 -154501 -172478 -130213 -30355
20746 -30355 -101031 -71151 -63821 -17307 21413 30722 16825 77643 -14715 -188603 -67029 11132
20734 11132 -54512 -65055 -62664 25811 -4906 45271 14239 -108868 -82807 -15611 55215 34131
20722 34131 -101253 -39301 84653 -34837 -155873 -14681 30694 29210 13199 118916 181243
20711 181243 251740 331719 293020 323175 202447 -122753 -160501 68420 27495 29720 -5936
20700 -5936 -104383 -198791 -211677 -174323 -183497 -44439 -16351 -31043 8193 -31575 54408 -34233
20688 -34233 -108239 -52816 1741 72558 -18799 -133985 -36991 41866 -46098 -108557 -121149
20677 -121149 102773 221545 102528 14748 -4335 49844 -33911 1231 53213 -147701 -239429
20666 -239429 -237865 -158554 -61868 25265 141133 203364 180099 131920 65401 83045 42147
20655 42147 -78518 -112620 -21413 -69522 -93394 -26298 18005 68070 21817 -58664 -138923
20644 -138923 -143474 -104747 -140842 -181881 -119092 -159624 -178383 -225166 -297900 -360536 -340412 -294873
20632 -294873 -235076 -334947 -191385 -118479 -157040 -215545 -146975 -224466 -229992 -282203 -185459
20621 -185459 -29065 -1302 -168256 -174980 -149488 -168156 -181844 -11921 8424 -76788 -339593
20610 -339593 -347343 -210013 -92543 43122 57808 -139068 -259488 -221611 -156415 -154333 -89492
20599 -89492 -188480 -261999 -282608 -293865 -379632 -246068 -184406 -156590 34047 1628 -105467
20588 -105467 -105118 -50276 -69789 -190689 -149969 -111655 -200554 -312245 -331341 -270060 -175772
20577 -175772 -155906 -174454 -157507 -92032 -123381 -139898 -157415 -70191 -4359 -17914 -1530
20566 -1530 82406 89979 94615 192138 67054 -174664 -243361 -258045 -312797 -205882 -45832
20555 -45832 -64416 -115965 -165385 -120908 -79835 105131 171599 46879 -7784 -80419 -122662
20544 -122662 -66887 -64457 -77048 22590 -73129 -200973 -101222 -38559 -102686 -108253 -50784 -67950
20532 -67950 -133939 -197707 -35737 -12164 -94968 -138284 -90435 40481 -17216 35922 126198
20521 126198 118322 152982 143177 -17085 -29961 75735 99058 139015 90228 92304 51317 -7528
20509 -7528 -68513 -181310 -46557 38880 46095 92534 190152 186063 81721 4558 -121964
20498 -121964 -27834 56524 12513 -95020 -124117 -171179 -196122 -236531 -259727 -43804 -59395
20487 -59395 -182673 -192683 -141223 115060 111689 12234 -181912 -361422 -375274 -298741 -156154
20476 -156154 -87583 -78222 -11212 80218 90225 94332 87481 -54792 -363579 -426568 -219372
20465 -219372 -158219 -97191 -63230 -133479 -253172 -197455 -161125 -76098 -107958 -162998 -166918
20454 -166918 -86846 -15932 -51620 -61277 -69030 -32860 10920 8416 -23275 -190369 -185731 -106535
20442 -106535 -83618 -57725 -12731 6514 43062 -99565 -191441 -121463 38786 136210 14389
20431 14389 -115081 -135734 -126026 -69518 -25107 -49362 -162556 -190629 -115753 -120006 -210606 -253971
20419 -253971 -233006 -270421 -193576 -137278 -186573 -88667 108701 627 -171413 -157079 -95682
20408 -95682 -57658 -35497 35688 -77536 14142 54384 -24032 -148315 -146091 -86478 -102676
20397 -102676 -26515 -170727 -118762 62332 88024 100361 31188 -41539 -18970 -30764 -55155
20386 -55155 -157610 -297890 -332910 -181112 14945 144669 153570 86716 -48100 54573
20376 54573 64431 -39772 -142231 -143252 -71998 -98829 -122108 -257335 -344084 -367197 -393330
20365 -393330 -199118 -76811 -56983 114544 208407 71721 -169696 -194916 -125889 -129469 -151812
20354 -151812 -115718 -115253 -58183 -155817 -96027 -105174 -97218 47059 1598 -18012 98156 114427
20342 114427 -10719 -25307 -91022 -130994 -209087 -319385 -376774 -370941 -297398 -152766 -197682
20331 -197682 -175426 -67676 -85407 -151920 -56842 65868 84491 -8915 -1475 -64382 -115900
20320 -115900 -126841 103581 212975 219149 214213 77619 22365 66966 73698 48676 26816
20309 26816 9585 -56516 -38571 -66235 105228 213789 212223 160866 76315 -42024 -20737
20298 -20737 34777 16707 -96720 -178956 -241047 -283894 -203496 -116650 -59085 -70306 84525
20287 84525 226466 147023 -74456 -259601 -287110 -245129 -179273 -145428 -138637 -147543 -234567
20276 -234567 -235110 -79284 3487 -4778 -22523 7898 4895 -72129 -102913 -42829 -58563 -187650
20264 -187650 -296305 -276187 -174808 -72885 2801 34928 49300 5540 -206708 -345995
20254 -345995 -327834 -297515 -220096 -73539 58565 -46673 -105515 -313269 -407884 -275566
20244 -275566 -160114 -88086 22160 138797 33790 44816 21658 -88327 -71888 -22996
20234 -22996 -32448 -133182 -195740 -152972 -178153 -201691 -182645 -175919 -193811 -197729 827 51044
20222 51044 37828 120657 53488 -51945 72687 -78588 -196882 -201758 -249769 -111214 -5408
20211 -5408 4452 2340 14336 -33526 83754 158381 115142 157927 58643 -3710 149378 149676
20199 149676 18847 -76731 -42215 43446 18547 -60748 -166440 -301683 -367021 -384165 -340345
20188 -340345 -288462 -256560 -168085 -57742 -130014 -71107 -133529 -291727 -345653 -205652 -195930
20177 -195930 -139216 -149857 -100801 -139393 -190796 -267684 -256362 -94945 41812 106160 92798
20166 92798 93042 -23037 -195490 -198618 -115882 -66719 -54434 -96528 -118408 16879 54416 119686
20154 119686 140284 87880 143841 69086 61768 -6740 -54432 -44519 18823 22160 81712 -4474
20142 -4474 -90478 -124518 -153695 -37588 -11165 -29818 -138303 -146654 -105700 -60007 79449
20131 79449 61541 -30627 -60423 -127859 -60608 -26185 -11356 -54451 52112 76697 -75354
20120 -75354 -151759 -111903 -132388 -84424 -16427 55943 76270 -141178 -109814 -50394 -5784
20109 -5784 78059 216084 338480 375360 221680 144419 71309 9114 32064 -81999 -178178
20098 -178178 -134525 -42566 -184798 -248830 -224466 -186051 -68642 -59813 -128253 -228440 -361072
20087 -361072 -334449 -219817 -254694 -213836 -298494 -294461 -235105 -27962 92930 -13596 78998
20076 78998 202608 133764 152160 34187 -197099 -227935 -223750 -186511 -155433 -202044 -182918
20065 -182918 -104455 -53367 -166144 -125757 -37097 -7901 104184 65604 -12495 -22206 92541
20054 92541 119254 -82575 -207053 -100491 47560 -27813 -85746 -114848 -57725 91621 142938
20043 142938 52400 -84705 -168666 -224345 -298954 -173709 -10994 27661 -69527 -11825 44253
20032 44253 151246 246343 120331 11608 117594 10165 -56391 81382 86716 -33471
20022 -33471 -96807 -54536 67478 33332 143910 150805 61783 61390 52165 34416 57867 5983
20010 5983 -23473 61627 238613 210612 249862 78769 75217 4877 -86506 -175642 -228948 -258531
19998 -258531 -201557 -162242 -87581 -15437 -118067 -163040 -215188 -166474 -166577 -121290 -145893 -135516
19986 -135516 -87900 -8807 -28088 -68491 -75532 -31683 -28274 -89459 -157817 -163423 -56360 21289
19974 21289 6737 14234 115537 20188 -8242 -8756 87524 409 -30335 -34199 -7511 25530
19962 25530 -17117 -123549 -134046 -96782 6126 32627 -6156 -28577 -85318 -199163 -217825
19951 -217825 -150358 -131140 -79856 -87461 48110 186575 256803 85643 -5809 -38300 -72938
19940 -72938 7430 12538 122093 194071 185347 108590 -53326 -93405 -102523 -110472 -113873 -25984
19928 -25984 -1358 -83891 -17155 132784 -45641 -144575 -163906 -137800 -100927 -46918 -104326
19917 -104326 -151106 -79026 11887 56418 60909 50480 -55469 -100038 -146348 -85266 -30359
19906 -30359 -147349 -268412 -287420 -232674 -163822 -201834 -124118 -160501 -224161 -30547 133409
19895 133409 96166 89926 7988 -88354 -229395 -114848 12210 51883 -62077 -117947 -36790
19884 -36790 -109744 -187006 -166116 -190198 -94630 -81463 -128615 -61763 90269 140567 78982
19873 78982 -93872 -207811 -260548 -195618 -33312 31368 115469 109170 24124 25167 27127 24
19861 24 56400 78329 7467 -135193 -75484 -76662 -177507 -204778 -195115 -116883 -142958 -75288
19849 -75288 -21187 -182668 -132777 -65811 -110715 -163792 -165574 -201774 -155852 -269635 -269740 -160511
19837 -160511 22082 38463 -92447 -222291 -100543 -69699 -27286 143044 203728 163089
19827 163089 93808 -59164 -64928 -65491 -117906 -167790 -125821 -114686 -151674 -159366 -106100 -64039
19815 -64039 -146470 -123862 -21842 -9710 -89406 -136111 -100608 -89992 -168843 -144924 -65243
19804 -65243 -54594 -71055 -130065 -108314 -36808 104738 98431 45080 -79246 -141953 -101423
19793 -101423 -8670 21184 944 -71477 -78670 -55034 -92723 -91679 -77120 2078 25727 54660
19781 54660 74770 72111 123904 100815 120568 171597 48277 44814 15212 -12901 -95621 -259241
19769 -259241 -279287 -140519 -24426 44363 55840 133954 202538 55396 68368 69246 -55316
19758 -55316 -71041 -69638 -131619 -176813 -230590 -26982 178446 150635 63959 131149 -50795
19747 -50795 1315 11882 -96472 -46593 51738 -2084 -29194 -27716 -19424 26402 136699 122477
19735 122477 -16258 114017 32794 -198610 -341949 -373816 -246651 -251551 -323206 -248158 -169704
19724 -169704 -148979 -154103 -238091 -168830 -95537 -238612 -290620 -354909 -400212 -240317 -136672
19713 -136672 -126726 -246140 -317324 -216093 -224527 -157351 -137743 -222611 -231952 -127659 -138871
19702 -138871 -104660 -59753 -212311 -171552 -89299 20458 126894 -8593 -55932 -134044 -154126
19691 -154126 -133314 -72171 -22906 -79447 -108878 -37121 15564 103563 128667 182410 230129
19680 230129 156826 -60385 -146999 11602 120807 109246 45930 3312 15366 -86439 -89975
19669 -89975 -63842 -31816 1934 108863 301128 255649 69188 15484 42380 84591 141022
19658 141022 86748 142803 49981 -18701 11067 59242 134954 100092 -35200 -25416 -48161
19647 -48161 8325 -130581 -126995 -77982 -13560 -63021 -7258 5962 -72763 -322076 -362322
19636 -362322 -176911 -77471 -124835 -101232 -111020 -23085 -26347 -16496 40492 16200 -10529 6134
19624 6134 40820 -46144 -17870 -545 15426 153844 276120 314617 284745 130831 -38095
19613 -38095 -44780 50740 48138 -28865 -68750 -131501 -65614 -16410 12164 24420 -69665 -171189
19601 -171189 -211989 -167574 -121391 -95929 -50456 -208785 -44664 51622 57348 37326 -66541
19590 -66541 -150148 -178436 -240929 -424132 -447623 -265307 -174153 -149701 -106351 -19515 -52519
19579 -52519 -178261 -175273 -190433 -91345 -81280 -227691 -257378 -159350 -116988 49599 24077
19568 24077 62549 11337 148266 47078 -92019 -19308 54592 68419 -23498 -142424 -186274
19557 -186274 -176457 -97537 -125405 -108931 -150489 -258491 -255111 -22754 -17553 -97540 -75720 36310
19545 36310 98037 126646 190622 183810 82357 81118 97750 37567 -26182 -61390 -125786 -99113
19533 -99113 -117796 -49613 -50656 153991 131149 16116 -15031 -2111 -7732 -25283 147096
19522 147096 333218 310900 272630 160122 112715 13714 -90604 -258240 -133273 38806
19512 38806 -12965 -44444 -95988 -125894 -169725 -86786 -98901 -107639 -82625 -31896 -8183 -80154
19500 -80154 41699 96125 115889 -8736 -70847 -51368 -28505 -23467 -110966 -15996 111875
19489 111875 125511 39036 54274 121421 63458 -12136 95686 220853 145518 1184 -31771
19478 -31771 49245 13439 -70190 31895 -45680 -54150 -36408 -49899 36213 115049 71544 26966
19466 26966 20363 38783 -17283 40923 25414 99706 225527 285124 255208 260907 128205 -41472
19454 -41472 -40376 -92888 -42823 -100970 -65484 -76230 -112235 -158490 -140173 -107236 -14604 72655
19442 72655 -95811 -275215 -30211 86304 69283 -87796 -72071 93433 114970 153173
19432 153173 247726 110895 -35916 527 50022 -2247 25974 110550 155287 177618 133554
19421 133554 -3769 -69465 -101913 -117380 -80484 -35888 -39889 -94076 -45961 36174 59268
19410 59268 68905 -484 16445 88145 128819 153368 50222 -117033 -89561 -72498 62341
19399 62341 103810 55945 56007 10188 -47454 36360 47551 -2292 -43589 -77714 -87596 -88942 -157467
19386 -157467 -74198 -76852 -10204 51409 -1442 -85975 -90673 -8874 33638 16139 -17641 46720
19374 46720 20420 116596 119478 44131 77732 98051 -141 -26856 24606 3602 -36925 2424
19362 2424 110709 80543 70537 138293 213979 305922 232469 170603 159335 146853 89475 294230
19350 294230 337335 420147 419330 298451 157101 125013 204737 230488 303058 362308 294755
19339 294755 251751 235656 217467 203029 205922 276519 401777 535479 711226 744183 766916
19328 766916 897104 865879 826740 932578 1074797 1279143 1398326 1486859 1473653 1469112 1538989
19317 1538989 1704903 1956268 2064485 2003743 1711219 1527889 1229449 972326 919115 787363
19307 787363 727482 669798 595223 519689 539897 582589 633390 733474 801150 924352 1152043
19296 1152043 1446350 1592707 1837663 2014211 2110572 2236790 2331039 2227199 2029364 1620954
19286 1620954 1269963 1206982 1234701 1195215 942176 630131 450378 356487 385915 475252
19276 475252 533127 494287 383644 363749 338724 277491 228443 274657 229103 209491 90904
19265 90904 50998 126402 56604 38459 176854 233522 173586 129636 69875 3534 -105836
19254 -105836 -73032 8675 38989 60873 168415 123567 113728 121825 178983 166991 54869
19243 54869 -140515 -108517 -50542 -38889 -21814 -39537 -83288 -2705 71832 48910 12324
19232 12324 22817 55925 132976 -18778 -54848 150738 119306 -30949 -33472 38794 -1634
19221 -1634 13311 172358 294075 157315 -61857 -86385 -16314 54250 127678 181364 158267
19210 158267 72036 85603 118881 68452 -38133 -76745 -91225 -95824 -9613 -38291 -41319 -33273
19198 -33273 -32633 -85227 100881 179925 267496 227278 122290 34683 81232 60672 -4296 -21701
19186 -21701 -90307 -99030 -14280 -57429 -84546 -47528 -17280 -13489 -7860 -91118 -76670 55100
19174 55100 100970 34781 6959 183451 166502 140312 104202 14653 79183 96446 52522
19163 52522 67301 92538 103512 17556 -156271 -166846 -42592 5447 43923 75745 76429 139612
19151 139612 134075 36016 43123 31215 241020 315697 154358 103373 64017 -52706 -28251
19140 -28251 119128 34076 76597 165923 177937 160406 14956 -18631 71778 161787 139235
19129 139235 82530 180826 173533 -160 -39877 49931 120256 218977 340290 384284 316395
19118 316395 112029 73356 29525 80333 298593 370256 320470 238137 41847 -58753 -76309
19107 -76309 -32064 -80582 -89721 12190 127559 125897 -32229 37749 93035 16811 64571
19096 64571 205751 290886 220929 219263 166769 303140 209063 209761 343329 433814 370080 210568
19084 210568 156274 32560 174393 225240 152325 18839 50971 80029 244727 384073
19074 384073 315060 305381 295997 302162 247359 150325 32340 65503 88839 228467 387344
19063 387344 394046 405107 371853 240352 113838 203417 245608 260650 265071 320814 324710 331156
19051 331156 252622 152903 119129 200780 331187 326053 235218 250006 201654 276112 421163
19040 421163 394971 463104 462505 477954 492761 366839 352133 432477 527449 495092 702769
19029 702769 1016366 1204319 1244466 1168000 1039282 921926 901053 860062 989255 1177241
19019 1177241 1159086 929065 780088 572182 336900 225805 267767 390885 483262 528987
19009 528987 653849 777490 689640 902715 1285168 1422282 1338071 1026190 995287 913836
18999 913836 869271 953289 1192544 1208030 1029475 897294 770202 636469 514859 465497
18989 465497 411945 291486 287049 434190 502043 513770 608102 503964 321635 197620 142585
18978 142585 171949 253994 397842 431142 357063 352065 459521 476651 366056 229304 216858
18967 216858 177506 260694 176075 123123 63355 -10906 109297 135214 112971 186041 164753
18956 164753 267155 383961 531101 591406 497097 222413 -21585 84638 155459 250211
18946 250211 323974 280868 265644 144978 77673 177653 291020 188538 197107 126596 167817
18935 167817 237979 225374 178212 195553 273002 233188 207315 399935 413656 242990 156076
18924 156076 165454 134025 120645 162183 185863 107382 69678 213308 306632 362258 281327
18913 281327 340555 277560 136984 86398 118017 231413 304107 405432 342580 248935 238474
18902 238474 205764 180254 261969 270053 243593 415958 573699 548059 473331 409335 498516
18891 498516 489341 508676 393445 296303 260663 180312 136189 206699 284609 416937 569724
18880 569724 470853 226485 52601 21053 187537 382844 520811 550939 523106 376831
18870 376831 300112 392382 518240 731344 824343 827144 767218 643257 666635 701883 836103
18859 836103 919216 845424 799822 738347 686840 748279 934221 1136970 1318622 1286308 1221722
18848 1221722 1149959 1272045 1505324 1806108 1996940 2233175 2788572 3878856 5565712
18839 5565712 8078810 10746009 10987799 8502644 5846059 4165828 3255458 2914043 2670119
18830 2670119 2396432 2233093 2236693 2241124 2290356 2345304 2438584 2732785 3105535 3216154 3501457
18819 3501457 3753924 4058930 4792196 6271957 8859115 12513724 15894094 15928134 12377457
18810 12377457 8872111 6706522 5515449 5007858 4840787 4760752 4801099 5043907 5498610
18801 5498610 5939875 6499268 7167202 7952379 8597163 8926862 9483687 10348207 11455076
18792 11455076 12409989 13054974 14495576 17023328 20243483 23252567 26300713 30407529
18784 30407529 35887061 44843628 60330896 87434427 135803070 219186680 341051389
18777 341051389 438102275 370473730 230464128 139043711 90663096 64412069 49439742
18770 49439742 40829532 36050718 32670717 29483059 26950586 26002243 26476369 28308253
18762 28308253 31621095 36640477 42869744 50163875 60601439 78965739 112797406 174229050
18754 174229050 277226119 415274100 483925012 368965291 224170090 138186539
18748 138186539 92417594 66713435 51811898 43264821 38081219 34378751 32218528
18741 32218528 30914788 29610248 29507528 31455135 36271690 44628618 58405930 81875978
18733 81875978 120573052 175025027 216058497 198352545 147623503 114945580 109558769
18726 109558769 129748462 175205873 227405416 227138634 163617431 102242882 67152618
18719 67152618 48949296 39342210 33907919 30015130 26305907 23483701 21654922 20434833
18711 20434833 19869614 20017899 21011143 22264340 24146218 27399437 32513700 40223867
18703 40223867 52908232 75377549 114920208 174924153 231434608 226292204 169402141
18696 169402141 125703200 113473632 129058361 170644419 225064779 240461583 186440636
18689 186440636 118121058 74200853 50383948 36995376 28499662 22749063 18882785
18682 18882785 16240359 14416261 12855067 11356602 10130096 9101329 8353769 8003404
18674 8003404 7928497 7846168 7477822 6589688 5638521 4923382 4416087 4137922 3948787 3853621
18664 3853621 3621585 3646918 3603809 3427897 3104212 2838538 2736180 2529380 2464075 2582362
18654 2582362 2525230 2358194 2437492 2452302 2334169 2090517 1928229 1849320 1788327 1641680
18644 1641680 1479605 1407177 1271161 1214704 1351654 1465182 1484916 1493591 1499248 1398173 1349827
18633 1349827 1442590 1465181 1442153 1429801 1434057 1326950 1429607 1507971 1549993 1314039 1146913
18622 1146913 1174688 1157783 1114395 1188673 1149203 1039920 884218 910613 989217 960852 1045704
18611 1045704 1018133 1060883 1013893 1004572 1035131 1143663 1262203 1250223 1114179 981355 961259
18600 961259 957125 998019 1133654 1180026 1148270 955525 802869 917463 976392 1148940 1201406
18589 1201406 1063047 1046926 1134140 1048976 846755 822664 890900 941879 940470 927072 1027325
18578 1027325 1066095 1159916 1409683 1621229 1680587 1686708 1566318 1617831 1833685 2067309
18568 2067309 2415685 2826656 3394857 4195297 5345531 7240599 9907218 12273725 12168075
18559 12168075 9408412 6515542 4648302 3637061 3025415 2517163 2145074 2078079 2087455
18550 2087455 2033810 2030319 2034703 1969811 2053410 2155537 2407131 2632085 2925986 3345214 4056456
18539 4056456 5364097 7384859 10052355 12086341 11618208 9362975 7182102 5802654
18531 5802654 4950008 4342454 4028693 3929060 4080274 4235444 4259320 4360348 4532992 4693176
18521 4693176 4835696 5069084 5527870 6250261 6726034 6803153 6866698 7177737 7741784 8578751
18511 8578751 9909386 11487999 12907714 14462380 16154855 18083893 20938821 25459067
18503 25459067 32819968 44778681 64752355 97595956 146008259 197155552 216033385
18496 216033385 187711747 141616688 115887214 116889640 142334654 185161699 214602488
18489 214602488 198558468 144774250 95921791 67619880 52559957 44182089 39760228
18482 39760228 38595525 40665819 46188218 56847970 76290652 110221910 163770436
18475 163770436 224032574 244614976 209894984 156106475 124433402 122507682 147316260
18468 147316260 191127049 221825423 204231132 149961923 97855716 65236489 46250900
18461 46250900 34874250 27943254 23407291 20084952 17719701 15748523 13781592 12147169
18453 12147169 11099677 10469782 9713050 8635288 7752317 7081537 6639787 6298826 6084880
18444 6084880 5919770 5527352 5194425 4897898 4558572 4290700 4080610 3912325 3757964
18435 3757964 3584376 3486939 3143074 2772048 2529514 2333021 2224680 2052203 1834435 1829651
18425 1829651 1841761 1700087 1600319 1640171 1578014 1551888 1398431 1298207 1198702 1088575
18415 1088575 1130329 1265912 1267402 1244455 1239212 1052219 997182 1091246 1160362 1173690 1156040
18404 1156040 1190905 1239343 1204587 1043491 1116325 1061175 933120 948937 978620 904085 778039
18393 778039 744228 652426 496205 536119 599106 648000 603557 868889 1082749 1060659 853770
18382 853770 773928 784036 727298 797924 816701 753654 769143 908455 976838 1035432 1198900
18371 1198900 1265461 1074295 1056970 1022954 907875 863867 946560 1058643 1178240 1162710
18361 1162710 953331 1096421 1105875 986029 912538 954883 919358 814308 880447 1013182
18351 1013182 974161 1021852 1140608 1259092 1160365 1139365 1209057 1267903 1351286 1394878 1517115
18340 1517115 1482784 1429632 1335812 1426546 1386366 1361781 1479550 1459149 1507147 1469456 1353705
18329 1353705 1389843 1286449 1369159 1381097 1408592 1458436 1460422 1497572 1688166 1608533 1755744
18318 1755744 2050306 2258613 2744743 3351155 4008960 4505767 4573893 4248725 4005239 3937445
18308 3937445 4050906 4029840 4326441 4746929 5230456 5767571 6744013 7787769 8701921
18299 8701921 9172747 9602717 10374327 11389325 12636365 14260260 16558997 19509638 23209431
18290 23209431 27837207 34176582 43551056 57927665 81826423 122595618 190225884
18283 190225884 287708982 383882724 413240413 345654347 233722808 146683327 96528474
18276 96528474 68705616 52336564 42264362 36217248 32742485 30518762 28754212 27462200
18268 27462200 27075853 27713011 29281545 32115268 37098642 45600433 60203122 85475909
18260 85475909 129022394 200159439 297006087 373711701 366567781 281705008 184002430
18253 184002430 116507418 78002996 56175526 42973847 34636505 29026065 24934911
18246 24934911 21769415 18930580 16267749 13788463 11776749 10284772 9228837 8481445
18238 8481445 8098174 7873459 7863085 7827823 7361691 6663284 6143634 5994325 6065667 6534950
18228 6534950 6997096 7313855 6983388 6368962 5490111 4469472 3703176 3304706 3016843
18219 3016843 2891170 2860225 2801815 2717406 2540826 2293923 2040820 1906967 1851185 1830489
18209 1830489 1751929 1652111 1731597 1849374 1925501 1980901 2114912 2134801 1910775 1646532
18199 1646532 1461785 1471164 1611081 1772008 1999025 2156760 2165091 2025028 1766832 1638579
18189 1638579 1589177 1607262 1693502 1820793 1651068 1328561 1210418 1130735 1141950 939767
18179 939767 842609 774596 835093 906825 865098 1055691 1413598 1554105 1716460 1480491
18169 1480491 1135412 928959 1015955 1115465 1261154 1428968 1445788 1317174 1109288 1032971
18159 1032971 1038602 989565 1036763 1048690 1165120 1017505 820414 778409 702969 640542 758399
18148 758399 879256 790286 711788 746818 852913 895448 782298 653042 703133 691690 608026
18137 608026 517478 511294 564238 628762 829945 964287 1211983 1362163 1415588 1427684 1352438
18126 1352438 1521741 1556330 1445095 1250015 1204068 1289999 1148124 1018971 953576 868240
18116 868240 859619 819895 729022 615398 335824 182374 254094 247018 283161 369992 423054
18105 423054 512822 464181 456141 543602 684664 820546 881879 728228 916633 1156188 1322785
18094 1322785 1303509 1085243 980785 1179086 1313001 1372711 1291173 1237116 1243080 1076181
18084 1076181 721408 512950 401037 388299 374270 362121 302873 341696 268367 275669 327529
18073 327529 445544 643200 720289 717715 617868 595911 548504 528249 505006 367980 552817
18062 552817 571320 524610 487410 399277 445850 542056 586435 469209 390917 234931 260230
18051 260230 313146 398237 522396 450039 335962 369100 534902 580761 391661 281180
18041 281180 384152 424203 203434 171540 287891 394223 469221 347908 363562 364221 349282
18030 349282 423056 505731 656119 593847 566947 698125 685877 510145 454624 455173 471649
18019 471649 483900 599936 652602 688631 532898 584879 645752 673779 572850 645780 908689
18008 908689 977647 980020 966661 952338 978602 1037029 1032968 1069908 1190408 1383681 1627585
17997 1627585 1878082 2247104 2932318 3055304 2686733 2267771 2172916 2085097 2224788 2591274
17987 2591274 2911038 3271089 3518102 3866493 4110335 4307177 4611167 4993421 5328955
17978 5328955 5464131 5598912 5984753 6648325 7541587 8945259 10831380 12991198 15466173
17969 15466173 19141025 24758067 33783320 49364456 76920945 124250442 195066060
17962 195066060 256170834 223102890 140836214 85595365 56262010 40545972 31407735
17955 31407735 25587613 22007645 19840540 18677419 17930652 17914964 18580949 19961649 22261494
17946 22261494 25795323 31299498 39685346 53556747 77655897 118596810 179187859
17939 179187859 233693738 215456106 150215781 104162905 83130914 79422377 91208006
17932 91208006 122020800 174511183 229917612 221759109 153063632 96133963 63650551
17925 63650551 45721962 34978554 27878935 23281610 20149992 18167688 17009505 16360357
17917 16360357 16322983 16928447 18214776 20770846 24736599 30939715 41265648 59903149
17909 59903149 93166945 147334113 210144380 212549192 143061942 84804274 53063957
17902 53063957 36018416 26187230 20057694 16146863 13592375 11879113 10158771 8585723
17894 8585723 7339069 6529538 5861873 5154377 4672153 4388361 4101650 4001702 3931331 3893779
17884 3893779 3824202 3641602 3462617 3256892 3170888 3081599 3053067 3004574 3153899 3389249
17874 3389249 3751315 3847069 3694594 3262737 2612990 2138429 1932684 1832770 1776343 1566388
17864 1566388 1403489 1332747 1193741 1096895 1135500 1104313 960648 856100 748978 739399
17854 739399 908645 1017918 1079922 1220647 1544177 1658226 1550786 1352252 1140111 879829
17844 879829 788752 843323 827980 1045565 1446657 1477049 1325176 1232593 1114878 1011075
17834 1011075 847383 709785 682255 550163 381358 314776 357350 380575 395618 525194
17824 525194 623965 676480 606010 580866 560921 635100 759973 1059481 1278096 1147295 1054296
17813 1054296 849173 719944 693533 657650 693400 605464 712992 785394 698688 772406 787713
17802 787713 763783 617257 487503 446148 438087 477362 546083 449675 369614 310531 154284
17791 154284 145075 183727 186096 293538 350766 414351 522001 402527 326100 386667 546424
17780 546424 533321 419419 359719 360475 312874 249115 262731 301149 307296 259031 263195 458404
17768 458404 438489 409388 435398 341590 242666 195498 165585 190482 258611 226929 43244
17757 43244 7697 130864 207504 185788 79001 123666 188689 371917 458297 607846 639479
17746 639479 750500 795309 913120 1190824 1446089 1711404 1791537 1574106 1229522 925562
17736 925562 690619 564296 359327 297832 305862 349419 412369 569219 630238 620413 556909
17725 556909 449026 386740 433769 552452 402756 332428 506738 781085 1051490 1411568
17715 1411568 1500516 1370742 1057993 676175 407011 268226 144537 193657 313356 345419
17705 345419 186365 120442 287475 367205 277005 98869 289606 432826 307650 259793
17695 259793 334503 280763 169672 94955 155872 255525 242678 149790 158955 158033 86663 92724
17683 92724 36597 22741 69862 89346 82088 112811 92106 73694 198628 158998 29880
17672 29880 -8656 -17154 68376 86099 112747 158235 240662 233517 339408 235993 173455 242030
17660 242030 187031 -8093 -109488 -78377 -3773 67940 835 3560 13610 40316 195172
17649 195172 179598 194192 47866 -95225 -44256 37252 119216 162621 132841 157758 91477
17638 91477 74012 172666 168227 71623 13858 -71633 -89125 -45688 20882 -59217 59452 178809
17626 178809 150726 179935 233035 265359 242977 319074 345376 288408 144545 120180 175539
17615 175539 152292 113808 172194 168950 180459 96618 122422 36712 -24148 -38267 -44934 35142
17603 35142 125822 144040 163398 222970 207271 -20855 -94986 23632 127781 165967 151419
17592 151419 194657 189999 142750 73097 83915 101088 126551 256559 232787 170570 171159 215558
17580 215558 253560 275993 261304 243273 213348 77815 75545 144479 349736 321595 203065
17569 203065 320291 236545 152396 31129 17899 60803 224509 92622 27795 87619 143242
17558 143242 181343 136038 184297 174128 301063 208869 40833 -34516 121984 186386 70178
17547 70178 45115 35186 -57745 -117007 -75836 -71184 -19801 36862 17387 16836 11623 20455 94411
17534 94411 131126 6845 16567 -24258 32544 -124355 -283248 -288269 -79665 107806 65666
17523 65666 82527 44918 26498 127593 125348 111391 64938 -44202 78325 75162 129648
17512 129648 88197 183172 244340 231108 29226 53183 33448 51107 117499 204754 243825
17501 243825 245855 293486 359617 230954 -47357 -61492 -18657 -85526 -72995 -108996 -49817
17490 -49817 -17766 192187 237545 91283 -60480 -93362 22945 61081 -59848 -103351 -132151
17479 -132151 -67152 55213 71891 -36356 -17115 -46210 116993 153182 57566 -37433 8315
17468 8315 40625 44784 48838 87952 81942 -76902 -129423 -66811 49637 138967 42141 -24095
17456 -24095 50143 -2661 -121922 -90313 -1778 47467 201207 335052 431869 389564 310509
17445 310509 199612 -20547 -125114 -23376 -43590 -8275 76465 74837 85730 57685 58388
17434 58388 34214 89200 332848 375875 204721 195045 291564 344170 357704 370193 555851
17423 555851 629819 752602 693215 407969 318394 400944 386275 320379 244230 116620 54706
17412 54706 118596 53976 96302 130337 66643 90922 153498 281092 213030 162195 325973
17401 325973 498786 821921 950039 941821 814878 541737 446088 380301 423609 386066 600363
17390 600363 878792 816203 679008 582142 528544 380223 313185 194543 127025 11285
17380 11285 -46089 57273 -78012 -157742 -47750 -10089 31771 132189 242097 278182 309661
17369 309661 543888 855622 854538 808084 785980 721563 581418 446917 278890 105453
17359 105453 80354 56774 161646 143384 37054 91133 268031 211751 155415 88702 32717
17348 32717 -56769 -34170 -119040 -226716 -112398 67795 65395 7877 -20803 -100437 -124761
17337 -124761 -96589 -64711 -185670 -179132 -137966 -5367 87122 35815 -160631 -250921 -94788
17326 -94788 -145006 -210630 -119921 -21809 -71237 -146848 -86401 9751 125673 65667 77723
17315 77723 230496 212726 180404 83622 -24475 -41586 113348 142715 66198 72885 27559
17304 27559 -95439 -97907 -43981 -95821 -53783 -62950 -84099 64345 213397 199318 -89769
17293 -89769 -192058 -108382 -136307 -144229 -153513 -163874 -12052 -59018 -112001 -256643 -323930
17282 -323930 -304426 -229605 -123949 -119330 -153322 10321 81631 19383 -186455 -129859 -170473
17271 -170473 -325953 -362005 -297034 -223955 -214781 -279395 -423967 -383462 -188447 -70790 -111962
17260 -111962 -163918 -144374 -180796 -81694 41181 -34615 -118861 -218407 -175307 -145012 -156657
17249 -156657 -146615 -26262 -29939 -162224 -231292 -209962 55312 167065 152526 147746 -8146
17238 -8146 143685 255276 163142 61741 -53236 -13293 13882 100154 160635 85768 38233
17227 38233 18653 73066 59268 118933 -8723 -46219 -141298 -186320 -217422 -311428 -347226
17216 -347226 -212718 -182774 -129708 -53735 135636 148175 110447 17357 -144641 -178790 -229177
17205 -229177 -83548 6880 143694 127452 68946 6812 -93610 -175658 -123276 -111216 -64183
17194 -64183 -86156 6125 133561 193848 211236 71036 14533 1332 42907 14019 3877
17183 3877 19763 -36872 36394 176941 177333 149740 139666 143093 73782 68185 134128 153596
17171 153596 160675 102676 232830 216437 131718 -99248 -220261 -192290 -92016 -30773 16081
17160 16081 20055 -25962 -155650 -105146 73418 176017 126118 121681 62855 -64469 -71315
17149 -71315 -12722 -110564 -63010 -51545 -747 6017 69841 28945 92459 268483 261935 232666
17137 232666 69857 2876 105355 11683 -44657 -15152 -7878 -129676 -26567 75031 40702
17126 40702 63613 83278 31651 -44512 -48090 -2462 81140 160514 300985 328386 178051
17115 178051 71639 44338 23808 129839 65688 -47103 -53287 -97220 -122319 -220223 -427095
17104 -427095 -475234 -354116 -137957 39498 108645 13748 -26178 -114318 -160678 -224651 -133196
17093 -133196 -14115 24927 54426 25696 -9091 149771 301674 142121 95572 127498 181382
17082 181382 96747 77850 38273 -64521 -60588 43070 176545 73809 -77968 -50725 -57424
17071 -57424 -18991 125129 80989 11280 78579 72303 832 -44485 -49473 -94003 -115572 -85703
17059 -85703 20284 -6856 -40191 19735 17343 -63073 -170528 -197725 -115873 -58792 -64086 -39360
17047 -39360 -213 -40235 -100568 -118929 -76009 24942 39719 146996 181668 47226 -50779
17036 -50779 -70046 -95025 -103292 -70489 -99890 -94180 -32406 65533 -72633 -86524 131892 116654
17024 116654 117189 94473 148141 62126 -171325 12229 199039 316068 286049 169647 99652
17013 99652 110233 144263 19979 9662 92969 68244 44531 -72769 -96164 -127967 -100283
17002 -100283 -64104 -49272 -46203 -40736 -108276 -233679 -228721 -78507 75907 -30995 -86562
16991 -86562 -32884 -35052 -26853 -87313 48828 173017 67090 -26420 -56816 -207293 -304917
16980 -304917 -321713 -92638 -71695 -26293 94384 36306 -18734 22082 -20308 20155 78727
16969 78727 171659 195717 156952 21110 44911 8515 -45573 -137385 -108095 -1878 -20157
16958 -20157 21799 30973 68925 15577 -65357 -28392 -44695 18429 33691 70310 99878 66538
16946 66538 155668 164270 72386 37095 -39452 -19374 -208402 -345506 -178044 -34524 -41754
16935 -41754 -69826 -121488 -83436 -3187 -24476 -95287 -170772 -157505 -147949 -115128 -89272 -185367
16923 -185367 -218929 -113534 -241097 -286429 -118473 30669 -115995 -146557 -153927 -47169
16913 -47169 -37202 -36254 -57365 -60986 -51120 19754 101240 177174 112664 31921 -48037 -37753 62060
16900 62060 -58481 -78575 -116887 -104833 -138832 -76182 24954 161006 126940 70879 78909
16889 78909 195194 271028 386009 491019 426277 127705 3545 129983 91569 11970
16879 11970 103721 104721 43194 -39702 -174651 -181296 -78359 -11595 -48592 76283 16395
16868 16395 24306 49614 29202 40701 -3013 -14516 -77089 -18156 42309 139857 230723 296863
16856 296863 285899 250201 69671 -84989 -103853 -44265 -100285 -149922 -151287 -35769 -11874
16845 -11874 -22455 -52693 -42963 92953 -4749 -203463 -237826 -139499 -144456 -290469 -359067
16834 -359067 -201063 -117927 -193511 -220813 -121818 6368 -64238 -91925 -49044 -21983 30913
16823 30913 -73266 -171390 -124637 -73603 -119295 42415 73984 -25593 15912 132798 102558
16812 102558 73999 80060 32334 35357 -198927 -301633 -109978 -53119 -119526 -83564 20240
16801 20240 -80380 -91430 -78484 -30813 22103 -113673 -134096 -182432 -139999 -91597 -225152
16790 -225152 -305238 -300009 -171018 -70622 43737 74099 63069 197655 260034 178030 161464
16779 161464 134285 143026 114937 -253 14613 26199 78108 -70196 -125707 -120125 -47118
16768 -47118 -42595 55051 49669 -76510 -88362 -52762 -17094 49311 -392 5183 5100 42463 18870
16755 18870 -105232 -166414 -9934 72768 112489 271684 321835 179979 32401 -96583
16745 -96583 -165745 -193563 -176453 -160277 -64634 -84406 -63915 -13810 47832 125513 169588 4478
16733 4478 68459 119636 56423 -52818 -25834 179222 70945 -96581 -232612 -202045 -141431
16722 -141431 -88189 -41998 -18976 -84736 -75444 126925 173184 194553 202508 144260 85086 15159
16710 15159 -66764 -2118 -69122 -47711 83683 261340 259129 256869 223839 219909 302172 254812
16698 254812 245943 115646 66394 -15116 120098 208574 233145 89864 148829 120031 91129
16687 91129 25145 -56379 21149 118622 43041 19654 15218 -56515 21994 68769 -61987 -134569
16675 -134569 -3829 -64030 -69422 -96538 -103542 -162861 -172013 -129928 -40358 -113702 -106099 -43726
16663 -43726 80930 100105 83043 1415 -102853 -15089 13735 -10692 60395 18215 -108194
16652 -108194 -45247 -98116 -98899 -94624 -142055 -152432 -61338 -85020 -145805 -151878 -48594 -46865
16640 -46865 -151031 -58452 81442 54870 65735 166557 258035 120731 33963 -84987 -131268
16629 -131268 -221654 -292303 -294278 -337028 -322519 -162787 -121662 -129645 28308 52137 -144736
16618 -144736 -115913 -677 -64814 -96004 -127583 -128153 -123549 -244864 -267942 -247114 -122789
16607 -122789 -113427 -184811 -46235 6396 -27062 -99203 -37199 -41342 -81575 -220774 -391622
16596 -391622 -462606 -203072 13487 26466 -69893 -181825 -162738 12272 102230 68912 -36086
16585 -36086 -90623 -148982 -91102 -93902 -27570 -60859 -175359 -78577 -109066 -124597 -105692 -102676
16573 -102676 -3298 5962 -25603 -99874 -172832 -162061 -206118 -149637 -62402 -7122 -89757 -129348
16561 -129348 -13707 3466 -87354 -126164 -76670 -57613 32163 71227 46495 191350 233261
16550 233261 180909 170940 127739 37482 19939 -94303 -226264 -82283 24997 85621 186585
16539 186585 72443 11943 8054 3526 -100271 -163346 -45057 88791 -103748 -111570 -129385
16528 -129385 -62327 -128080 -209106 -123108 -28013 1903 -17561 -69436 -5761 -19082 -25730 35690
16516 35690 137364 131501 33600 24264 41198 -63256 -103544 -40962 -54705 -115760 -17207 154462
16504 154462 121648 22941 19926 53448 -33805 49446 -62709 -132185 -79953 12082 75835
16493 75835 143397 108633 -35860 -85927 17074 -2078 -12790 26138 29111 -10895 -109913
16482 -109913 -223128 -92813 -37450 -11495 -5981 13682 31447 136486 98270 76317 -43875
16471 -43875 -113824 -173055 -156138 -167283 -126489 -160779 -224458 -263744 -142214 32573 46726
16460 46726 32923 -84770 -184475 -285100 -132800 -25840 -17055 29620 147433 136980 87220
16449 87220 -19820 -19846 96154 127212 101700 50984 -3422 37538 60331 67907 -108345 -115945
16437 -115945 33278 70930 -92954 -218577 -169140 15761 124933 47787 48887 215479
16427 215479 221660 136192 -29496 -100097 -12863 -33883 -127100 -130761 117505 203755 17144
16416 17144 -30822 -73002 3936 83314 132040 -40444 -91908 -197401 -115300 -55360 -140443
16405 -140443 -155650 -104646 -78992 -157179 -126663 -61621 -41856 -118960 -37465 -22784 -26676 -4931
16393 -4931 -5774 -62788 29545 124896 -47408 -46474 -28088 -101681 -158215 -208295 -215947 -206408 -96671
16380 -96671 -29480 -101015 -229068 -176356 -107197 -248728 -212352 -199145 -214767 -227263 -1491
16369 -1491 107981 17008 -97707 -23272 72124 175602 196452 43869 -21159 -5828 3856
16358 3856 -60706 -75044 -85460 1726 64488 168618 212972 -5128 -167317 -132393 30967
16347 30967 75663 -49916 -145472 -121374 -9050 -120772 -159419 -167188 -317084 -314207 -159377
16336 -159377 -138956 -110232 -107789 -184268 -254386 -251255 -76619 -32355 -69708 7304 46817 30211
16324 30211 -14297 115969 67761 62698 90997 74251 49206 60378 -1878 16334 53144 -38497
16312 -38497 -80281 32267 242730 160643 100382 -529 26098 155111 163756 203471 202862
16301 202862 71874 23870 25037 88727 90248 106632 7763 -55951 -7400 20508 37666 89145
16289 89145 6994 -90851 -85053 -78600 -205976 -113352 453 -97874 -172437 -188798 -47338
16278 -47338 -62871 -84839 21487 -42790 -133085 -108972 -42048 68247 92196 -116152 -238883
16267 -238883 -241261 -263162 -243386 -122160 -105507 -249216 -251338 -308580 -230216 -238377 -296039 -171467
16255 -171467 -102800 -39521 -29368 -21189 -110202 -139315 -202906 -273333 -225859 -135204 -138154 -170134
16243 -170134 -129939 -50306 -5251 -99950 -171875 -203739 -196254 -223162 -197557 -196448 -141991 67808
16231 67808 163553 152764 226625 137967 -33671 -66402 -72966 -34047 17812 -198233 -186513
16220 -186513 -79117 -160300 -219296 -118656 -108813 -129186 -84391 121645 156663 126207 10554
16209 10554 -114367 -75920 71352 242239 137095 -14529 -4508 -20141 -10781 32290 -69923
16198 -69923 -124890 -196840 -174098 -228787 -172061 -143352 -88047 -25205 -171311 -158714 -50155
16187 -50155 -1226 -9569 -100253 -109825 -100882 -76207 173 76857 -36720 -39443 -9018 104536
16175 104536 125563 62920 62141 152954 109941 67192 -32736 -184593 -70921 70442 6507
16164 6507 1427 103788 136276 144506 -2744 -17839 256773 318001 162212 -23676 -37610
16153 -37610 -3357 -83268 -85896 -30382 -65249 -11261 -95892 -120042 -86961 -130031 -137218 -125877
16141 -125877 -80631 -89262 -66080 -97532 -93603 -229805 -252621 -227905 -191907 -18245 48240
16130 48240 86762 5739 3956 -159246 -303821 -160292 -70417 -142731 -66946 -57839 -21259
16119 -21259 41356 -180 -13342 -9426 36065 -81063 -64675 -23632 -12018 -18503 -87681 -67469
16107 -67469 -32366 -104601 7193 20714 153817 206218 80266 -2518 -14809 -123383 -75784
16096 -75784 83962 -25620 -94928 -114737 -175989 -265866 -339142 -432877 -504078 -386283 -229078
16085 -229078 -168652 -217692 -230079 -208161 -147401 17988 34669 4872 -88952 -205616 -385261
16074 -385261 -359556 -239695 -199291 -23624 70694 135329 155836 25931 -55365 -59416 -1687
16063 -1687 -1394 66159 118723 170077 157738 106980 27674 -69883 -201406 -150596 24735 22838
16051 22838 -1151 -107038 -62689 -33836 15805 128453 127763 -25519 -49634 -98863 -81355
16040 -81355 -13134 -115835 -130298 -254423 -355606 -177254 -70919 -17473 -14386 21349 233879
16029 233879 126002 1386 -38051 -76347 -179311 -108806 60679 81958 117319 132259 109805
16018 109805 -18491 -105448 -89484 -158174 -75474 71410 83760 45073 78229 82514 24696
16007 24696 19648 123146 179118 194454 149019 76224 -49277 -117414 -113031 -111091 -177348 -214080
15995 -214080 -191169 -154953 -82468 -34399 53464 -89956 -122628 -143204 -128072 -36446 -15059
15984 -15059 -21093 -23037 -18155 74615 113511 61868 43613 -8613 68471 63617 -23841 45754
15972 45754 -82302 -77120 -73440 -100584 -187099 -139787 131 -82980 -54757 69758 98723
15961 98723 82725 80798 119266 102215 -47870 -174276 -2538 129921 -20729 -125857 -203968
15950 -203968 -174229 -192340 -143413 -162075 -31684 38635 -13279 -130745 -28412 30503 80137
15939 80137 106793 123841 -4163 -86753 -30585 -44517 13381 115171 240453 202397 38835
15928 38835 126908 148213 59243 2643 -113213 -86394 -89971 -239532 -329132 -149191 42906
15917 42906 110486 19551 -99288 -106381 -144864 -102699 -19604 -26 -54786 -128377 -141425 -129871
15905 -129871 -81897 -30472 -14263 -79518 -211902 -55126 16534 -49828 -57438 -108426 -130857
15894 -130857 -155163 -287015 -267104 -47343 -79661 -208283 -164807 -133970 -63371 -76737 -132968
15883 -132968 -208956 -204515 -168984 -111410 -181168 -205924 -86545 -84266 -105825 -47941 3377 -80489
15871 -80489 -67017 -132296 -176162 -241803 -261949 -189761 -81540 -79978 -42436 -83624 -109354 -173192
15859 -173192 -166562 -190318 -26312 -34588 -29070 23997 -34039 -69775 -126095 -87134 -40812 -88400
15847 -88400 -220704 -186780 -13793 -20742 -54961 69249 135324 181592 -27581 -106169 -104176
15836 -104176 32307 64436 -106482 -213389 -134075 -153103 -110939 -29318 53950 180785 288196
15825 288196 73791 38825 109138 68677 100459 109034 134032 122725 -13233 -75584 -140131
15814 -140131 -158112 30304 164827 5935 -158035 -118597 36561 -16008 -11099 112538
15804 112538 37248 -30686 -83822 -127184 -122416 -128703 -59385 21871 26212 2629 2645 -84082 -146607
15791 -146607 -236161 -137892 -34804 8365 99718 35264 21182 -107030 -67542 196996 202737
15780 202737 94494 107388 122607 27312 -124714 -26561 88163 1189 -112933 -32824 53465
15769 53465 4589 -19273 -87065 -81232 -108806 -131297 -65889 -117790 -19330 38543 1799 -98813
15757 -98813 -176862 -118532 -135686 -179962 -36228 -3092 -59543 16763 99919 73384 49547
15746 49547 20219 -26613 -81106 -110147 -102820 69508 228089 221203 200897 160133 34927
15735 34927 -163995 -196309 -161717 -215376 -179401 -44111 -10056 -102823 -135782 -93276 25979
15724 25979 79920 108800 98972 99642 111745 -988 -126655 -178189 -297866 -308155 -258904 -235041
15712 -235041 -148656 50828 126310 52452 -43562 -9196 18695 42097 92943 -30962 -76897
15701 -76897 -52689 -17547 1048 43922 32095 -37449 -20309 -65977 -146694 -100893 55931
15690 55931 64033 77570 -64664 -84420 -167860 -234185 -180586 -106980 -113474 -120270 -26395 -73826
15678 -73826 -72679 -9193 2191 -8191 -26485 -41673 -62138 -73249 15169 -40785 144872 248520
15666 248520 111899 82988 75440 11055 -29517 -102384 -101377 -52446 -72986 -74665 -106238 -118433
15654 -118433 -240217 -206101 -218004 -97050 -17074 -108761 -114359 382 36076 -7582 -51207
15643 -51207 -94925 -22984 67067 38819 78388 10060 77946 10815 -108519 -38405 20584
15632 20584 64378 159814 -13095 -168623 -271091 -241438 -230079 -172078 5629 47801 14079
15621 14079 -37572 -80005 60264 165456 -30964 -137474 -95109 92103 207334 75566
15611 75566 13043 130886 109019 -78797 -73123 -47478 -101028 -156409 -176137 -80581 -19192
15600 -19192 -12256 32332 13728 81663 38744 59648 222823 230842 213440 133687 -938 -28983
15588 -28983 120300 217254 93637 160342 227961 91275 60204 76658 6907 17626 108946
15577 108946 81067 -69901 -115878 -113933 -140648 -184215 -189600 -120535 -15219 -75539 -178561
15566 -178561 -131959 -129378 -97526 -166235 -138024 -195577 -209610 -28415 -124509 -179292 -95893
15555 -95893 15570 -9845 -88604 53486 39821 24033 162432 152503 179071 54024 -78561
15544 -78561 -52513 -78195 -59448 -143946 -188677 -176741 -157336 -124875 -115497 -110392 -117509 -98190
15532 -98190 -181536 -271898 -162766 -128531 -100405 12580 -80219 -95189 -78368 -171730 -196071
15521 -196071 -45475 5128 -104050 -44273 -34942 -53447 -101214 -125784 -75947 -75202 -35310 -160382
15509 -160382 -234110 -319441 -133817 -40539 -25863 -127006 -129831 -218945 -161013 -132251 -82093
15498 -82093 -56555 -56661 -172434 -267472 -223204 -180635 -130676 -165280 -36178 -13915 -91703 -209544
15486 -209544 -282176 -144113 -48060 15275 -3528 -70622 -65020 39060 99897 141630 7544
15475 7544 -60100 -94288 -137924 -82170 -8553 29015 43209 47209 60405 16303 -60241 -158969
15463 -158969 -159961 -204711 -157122 -90524 -82988 -17940 61396 91949 -117427 -199808 -220594 61201
15451 61201 118682 -210 -132075 -121253 -58003 -103124 -83541 -147294 -244260 -155675 -150488
15440 -150488 -267885 -254749 -251567 -171981 -153177 -102912 -78721 -82741 -107794 -126987 36572
15429 36572 23108 52339 92772 160144 227276 287390 265796 127196 100157 -16043 -34040
15418 -34040 71864 141154 133464 48590 82085 106238 33425 -55622 -155242 -120425 24966
15407 24966 206322 175861 196629 128492 81636 -43630 -69770 -76492 -86210 -10406 -16251 -109115
15395 -109115 -77765 -39641 25756 141637 -40325 -46523 76037 92882 104182 147807 178714
15384 178714 128402 65763 -73627 -173605 -282347 -385312 -198792 -87999 -30203 67954
15374 67954 155589 127595 135119 99947 66274 -42969 -88686 -27637 -103164 -94399 82968 115262
15362 115262 147154 196368 -20486 -178818 -143918 -122992 -129155 -9807 -6180 82697 65995
15351 65995 -43475 -43380 1932 7642 25949 -80292 -193001 -223360 -168334 -73553 -82143 -91523
15339 -91523 -86353 -39812 45739 -20999 -27651 90227 184422 130205 22489 -132608 -100040
15328 -100040 -70257 -91190 -31431 -16617 -57607 -61339 52170 13336 42376 134747 43162
15317 43162 49878 -77282 -134602 -133585 -98187 -5247 -3955 -8312 -31511 -30434 -22795 -88330 -174759
15304 -174759 -89031 1788 -56217 -214678 -171012 -194545 -118876 -84830 -63002 -44661 -76138
15293 -76138 141389 170291 167493 209630 135760 -48666 -99508 -58884 103879 130418 128601
15282 128601 43790 63546 56971 83307 48190 -112274 -215175 -257160 -143591 40278 55629
15271 55629 -67369 -120155 -81226 23088 89452 47970 -36738 -165555 -162379 -143470 3636
15260 3636 -12941 -71615 -50205 27898 100413 -98041 -260919 -207922 8856 -67674 -69925
15249 -69925 35794 -17148 -109655 -105017 -50435 -26100 -102311 -238334 -234839 -189751 -187597 -242992
15237 -242992 -230753 -66654 17338 52630 50838 115397 105994 89985 -211735 -348211 -222511
15226 -222511 -6645 34941 9440 23982 58939 -5698 -2042 -103637 -116422 -80083 -113109
15215 -113109 -17675 -100803 -27196 -20476 -205307 -191244 -172118 -90585 42161 57428 125504
15204 125504 34401 -134503 -226472 -131999 -83817 -89221 -197173 -186863 -93443 -134704 -195797
15193 -195797 -236659 -196388 -149514 -78129 -11819 46699 58484 -39814 -157676 -60454 48385
15182 48385 191119 102944 64082 116402 124807 135248 115476 42228 68663 21713 -89800
15171 -89800 -154182 -8876 96816 -6195 -7337 94048 -27523 19569 111418 101872 23203
15160 23203 -82151 -139964 -141345 -34226 59721 88687 96625 39966 -62940 39191 128981
15149 128981 73772 -81234 -53259 -61396 -33369 -60804 -136655 -29595 -77791 -150404 -115008
15138 -115008 -50543 20716 96939 -4821 17915 86510 68183 93265 125153 131561 105768
15127 105768 -112097 -151631 -27356 -19048 65988 -29390 -46181 -51857 -51460 -15338 28007 46858
15115 46858 -129644 -174016 -95646 59934 48543 -134575 -248760 -94440 59940 28875
15105 28875 -4243 -52782 -80846 -120200 -213418 -184878 -59342 15971 11185 -68307 -64757 18937
15093 18937 64660 -39954 -74729 -57217 8908 -9832 -178488 -302779 -246947 -138308 -132789
15082 -132789 -140682 -93464 -84662 16730 133235 158665 85940 -51296 -63647 -15742 24978
15071 24978 -96451 -173992 -188392 -183719 -222558 -251139 -201151 6879 96135 50562 48169 113211
15059 113211 -65872 -133058 -49771 41788 90763 17608 6436 42579 61165 -2028 109717
15048 109717 167612 136375 80885 34739 105703 109110 1907 80357 236999 311995 292313
15037 292313 94057 -11043 162002 278073 177610 -16349 -77137 -108349 -193127 -87776
15027 -87776 82218 56944 -38499 -136490 -205624 -114550 -87410 -9733 30843 25660 -123144
15016 -123144 -100977 -155125 -158921 7918 86413 70248 221330 284782 179784 1761 23086
15005 23086 92502 111695 70189 10610 19019 -10224 -66385 -71569 -147490 -139794 -128751 -141718
14993 -141718 -159316 -33507 24074 43334 134243 272214 201524 91116 24440 -26327 62529
14982 62529 58564 71538 111538 224915 284599 153345 118462 51299 51755 -22752 -181239 -112174
14970 -112174 -137375 -64126 -10497 -19560 -102045 -82886 -136709 -30385 -34855 -96558 -132733 -99626
14958 -99626 -146659 -92415 -74899 23910 50600 101707 -18947 -61950 -19732 -5446 -16240
14947 -16240 84016 249162 281361 220542 116014 153149 109115 -26353 43406 104769 166646
14936 166646 128096 -40182 -99327 -68670 -9954 41205 104079 164211 228703 36397 -70053
14925 -70053 -49644 -85703 -135657 -163176 -157520 21094 29382 -90006 -75714 -18477 56654 145470
14913 145470 184967 85794 -16946 -199279 -113523 92963 106324 84635 98850 136108 117163
14902 117163 285898 341289 262909 111273 16350 24713 99286 59778 -56687 -64290 -65248 -81163
14890 -81163 -206827 -210860 -19515 -54945 6451 -9796 80241 212268 299329 279326 221681
14879 221681 144922 132452 -15505 -167168 -185694 -185704 -145185 -71874 -94386 -167734 -186617 -79410
14867 -79410 -76075 -75234 -55047 -32519 87497 197129 113047 171064 159430 209799 257737 275632
14855 275632 300358 264970 90560 15526 36000 129149 125864 216648 158107 206666 105690
14844 105690 -24244 -154378 -189274 -147027 78807 83417 40 66759 128877 82693 -72316
14833 -72316 -165498 -93305 2195 -53953 -90932 -163994 -203209 -207437 -186215 -159160 -54341 -102763
14821 -102763 -227815 -116232 -26525 -30514 -23041 70260 178407 266722 152794 60575 91148
14810 91148 54330 -3064 -86669 -119549 -135349 -78966 14639 -32069 -67678 3950 42237 110896
14798 110896 176478 82441 57972 -42271 -51494 -113505 51881 132991 122015 88129 -13991
14787 -13991 -198006 -269406 -185042 -118663 -116443 25068 71309 39637 -1066 -109223 -226750
14776 -226750 -202903 -32783 -45052 -51960 4797 -26429 -77035 -63366 -66426 -9719 71541 -78475
14764 -78475 -21266 67453 59539 111942 133248 191535 241645 122339 -9313 26122 -95479
14753 -95479 -33922 52892 118605 59855 -8914 36606 132219 84165 41281 63692 109985 235030
14741 235030 175839 166452 110918 19448 -4618 -87048 -37493 -87757 -99840 -270588 -221095
14730 -221095 -97169 -6674 -58897 -101030 -37082 -122601 -54761 -41443 -73312 -216564 -329103
14719 -329103 -289331 -179126 -127782 -279678 -217776 -94911 8106 -114367 -37935 110000
14709 110000 86948 34767 42229 -49885 -105541 -130711 -299425 -296863 -220755 -100881 7226
14698 7226 45583 -92764 -154151 -35138 -22525 -15567 -19547 -56215 -182099 -104194 -3633
14687 -3633 -31397 -32885 48942 -4446 -3408 -34295 -93170 45747 108424 55933 -98233 -59116
14675 -59116 -128944 77615 213897 31868 -161643 -127634 47931 111511 92180 111602 257239
14664 257239 268529 190264 33230 43217 87729 22558 21919 11024 11117 -26445 -137904 -114562
14652 -114562 -57606 -1461 -13148 -64332 -95056 46423 53545 213830 296760 93518 23699
14641 23699 -23941 84820 62842 -23114 -24493 30837 -85793 -96040 -113266 -82321 -87102 -117412
14629 -117412 -7358 -74590 43452 91188 -28099 -47377 -103620 2807 194581 258404
14619 258404 345709 357519 141178 31844 83167 277432 272050 249224 240922 180156 55965
14608 55965 -119722 -112913 8306 139634 244320 168208 135701 153997 162236 156555 6723
14597 6723 -133836 -88751 30603 145074 233758 332564 182995 23775 136011 57015 -20907
14586 -20907 -59056 -25643 -52896 -98604 -64783 -112266 -79382 -95602 -57139 -67962 2755 -4155
14574 -4155 63834 76176 -11647 39256 19823 -80878 -151501 -63887 29524 130546 119716
14563 119716 139744 25798 -2355 71396 119915 -119886 -94281 86592 183175 210512 209084
14552 209084 305332 234948 127389 252690 231279 102204 -14411 -15549 -55946 -64624 -56761
14541 -56761 -32275 -51437 39118 122481 88700 197339 345490 371907 160884 65829 107749
14530 107749 70562 89532 51047 58665 107150 157291 80700 -14658 -46323 -77317 -142446 -91077
14518 -91077 18684 28157 219705 246342 145502 88872 217984 311385 310653 315798 264063 71077
14506 71077 7618 53909 57320 75329 138160 188342 52983 -99493 -188608 -190617 -63065
14495 -63065 -149594 -330846 -371732 -284332 -137077 48098 155800 161501 142157 166426 161752
14484 161752 100787 -38749 -103280 -32770 -22873 -8817 53605 72881 126077 -44 29715
14473 29715 80522 -32213 -135998 73975 152102 -8503 -33217 -19783 -24305 -95348 -31976
14462 -31976 37292 -40785 -153471 -88629 -56478 -9971 118699 111486 183084 65183 52381
14451 52381 53668 -53863 -70488 -54045 -68571 -7198 150013 201583 58520 17921 -63307
14440 -63307 -15635 114853 142470 151533 107434 52747 -51792 27341 90008 145611 92215
14429 92215 -5475 17423 53376 64980 160695 212547 71548 87843 38279 -37402 -89861
14418 -89861 -104828 -304 64797 14622 36152 96986 173465 96143 9720 -25295 -20645 1548
14406 1548 54327 127106 233019 170763 125250 74600 -12450 -80872 -131379 -74954 2977 -39220
14394 -39220 -283059 -210079 -137241 -173223 -252711 -233623 -105443 -147997 -181487 -73654 -96498
14383 -96498 -271169 -289479 -229965 -78608 -105012 -178966 -60362 49400 88999 125632 21332
14372 21332 -15407 316 11778 55524 103355 231060 217361 158412 33983 -38206 4884
14361 4884 27961 37552 53156 101418 163733 168981 136646 82413 179985 144115 133763 134314 245734
14348 245734 181792 25352 38468 13096 14189 95486 127897 160149 110095 -22965 -89813
14337 -89813 -112010 -30605 90734 75981 -135523 -269956 -250563 -148763 -164090 -69951 -32312
14326 -32312 -81043 -122591 22041 71783 -97607 -111976 -32472 -40440 12251 70477 94223
14315 94223 106156 108517 106245 76031 60575 61253 12928 204798 366146 307186 219322 86405
14303 86405 -44062 -155806 -73050 -3954 22346 -35740 -82011 51760 164407 158458 214947
14292 214947 221166 118417 85307 71581 132252 81401 -139461 -204579 -6543 14650 -135434
14281 -135434 -89901 119058 155609 110493 74354 35460 53715 53734 107074 135469 106579 168999
14269 168999 33867 35483 12896 -32130 -21629 -53588 12056 181127 163710 236237 140568
14258 140568 88943 153689 144475 44159 53706 56733 8733 116773 269834 201410 57413
14247 57413 21611 159537 97654 58037 99071 81557 -112648 -45364 176581 335741 237249
14236 237249 49074 -7555 -138820 -236839 -106722 15395 74784 90013 70453 153506 120125
14225 120125 182570 215799 327135 312569 152692 40795 50258 6348 -153891 -42312 -5352
14214 -5352 -16536 28084 116896 -10421 -20884 5927 -71768 -32847 -33886 -73213 -82655 -44424
14202 -44424 179386 184782 70849 18938 115003 99939 132513 159664 117378 118590 -4476
14191 -4476 8755 -2995 26164 92903 70571 107872 166970 123339 55371 203133 203376 167222
14179 167222 145565 63829 -125438 -15747 25620 -3006 -33676 35082 79868 94571 141497
14168 141497 31052 53181 42794 -5465 154445 244229 184220 93862 -58391 -138691 -113614
14157 -113614 -33247 40702 91206 66717 -81697 -206352 -162911 29233 88836 44794 217918
14146 217918 156447 76013 51166 39853 76566 183837 215814 130380 85189 77057 21267
14135 21267 107748 176478 71282 -28143 8990 -23021 83322 176712 172236 78680 24312
14124 24312 61137 -736 22306 41164 61801 -36035 -99316 -123503 -22508 75139 117026
14113 117026 79013 6889 -41871 39348 25006 50491 114108 125950 93061 17059 36259
14102 36259 -95953 -145245 -150106 -248074 -246856 -160010 31063 21068 -70692 5237 145320 147233
14090 147233 121181 126544 234003 315964 253037 225677 182463 -45038 -9159 173967 -41594
14079 -41594 -321053 -398695 -303869 -282248 -289451 -270775 -156355 -32732 -10469 -7435 3510
14068 3510 55074 17799 60806 78475 64782 5090 -150607 -122074 10997 37035 175132
14057 175132 275974 297547 275519 158625 250921 254496 260809 319532 331015 290277 161026
14046 161026 22279 20173 7398 77870 152510 163743 286198 349637 238349 192297 146023
14035 146023 65275 72204 119780 96664 -60470 -105412 -51392 -44389 -42386 -36718 -29233 5300
14023 5300 65504 230480 252041 212760 132106 31147 139494 244324 171888 178172 26562
14012 26562 -81300 -113664 -96860 -46112 353 32599 39803 19889 82211 23462 -49199 -170704
14000 -170704 -170976 -20404 -122656 -114524 -104253 -47213 -9254 -30747 85415 86910 89709 57329
13988 57329 171702 222020 91791 -1668 22413 -39988 -48951 -46068 -27517 53482 88668 101313
13976 101313 35644 -36746 -31291 151995 231177 98569 48494 -63645 -64924 -21549 106865
13965 106865 252636 159869 -21911 -10363 -31353 -196584 -224198 -84667 -85904 -97272 -22654
13954 -22654 -5388 -82193 -17644 12459 -28665 -31564 -115858 46617 37420 2777 99410 121170
13942 121170 36468 143639 223575 193232 234364 174656 53771 -51426 5423 15508 46439
13931 46439 7145 82424 127575 148547 124579 115783 197271 109849 155274 130974 63676 -97093
13919 -97093 -61931 6928 -85025 -149781 -217567 -154420 -120054 -159481 -92048 -55016 -86526 -85463
13907 -85463 -89987 51568 90197 19002 77594 75581 -32554 -208662 -60459 49378 176166
13896 176166 57593 -73479 -159172 -236277 -206634 -98486 79462 136852 172998 134953 76939
13885 76939 -2672 -53657 17219 -50545 37108 103856 -3919 -5853 44446 9552 -99000
13874 -99000 -77186 -392 186330 247402 166197 124530 175397 91047 130177 111012 26978
13863 26978 117220 215171 303951 245367 164271 68554 129009 83912 42474 80628 152167 160241
13851 160241 15202 -57152 -20235 67689 124523 136818 124610 79744 -3613 15432 34618
13840 34618 183709 271170 70601 -41954 114343 -15154 -146715 -106293 -114172 -196163 -197664
13829 -197664 -19523 74869 86857 -40241 -31286 1260 -47986 -66339 -109502 23193 161831
13818 161831 146072 78619 36835 18727 9025 -1854 -12566 -89307 -167257 -207176 -234008 -150456
13806 -150456 -256996 -253521 -203459 -87385 36897 -2044 43309 75662 117105 82173 -49632
13795 -49632 -70539 -216643 -310038 -268470 -123025 -122002 -95986 -62139 -68269 -129601 -119337 -12980
13783 -12980 26359 76201 99924 148112 112654 95364 200079 210525 182170 65367 32030
13772 32030 -6751 -110508 -131243 -108687 -4968 238129 162094 98773 -65590 -125801 -56141
13761 -56141 127927 206189 25263 -92239 -73425 -6330 37525 44327 62612 243543 328235
13750 328235 219985 107814 29752 69710 112710 159655 215877 242145 215418 260692 176098
13739 176098 159989 104767 96576 74709 93430 138192 126641 7835 -82941 -208163 -146410
13728 -146410 -197889 -168438 -157227 -117368 19208 8544 39796 85870 68657 9134 191783
13717 191783 308458 233011 150542 209510 139805 -47223 -128239 -204734 -153693 -31590 -42684
13706 -42684 -31037 18342 105027 126228 153066 69312 -48228 -232220 -138017 -6236 -39647
13695 -39647 24066 145695 266535 273776 215937 229118 91563 -16126 60151 -81456 -186445
13684 -186445 -136340 -217089 -253655 -143610 -26918 17030 27983 42841 123237 9591 -134636
13673 -134636 -172222 -96473 -199087 -134335 1225 161028 185988 149057 53124 -100270 -132085
13662 -132085 -90104 -101041 -23514 100670 -22052 -65660 -16755 -56906 -122346 -163177 -27764
13651 -27764 22670 -14622 2759 -4491 -63602 43634 40043 -20301 66213 156651 263364 228954
13639 228954 164473 -20870 -34985 36359 24972 89998 53772 31557 60021 15570 90619
13628 90619 650 -62720 -16802 134483 248979 248447 200879 195482 234675 213501 74144 36707
13616 36707 -45880 -29019 17236 -18408 -139128 -26587 -54278 -47042 -157543 63702 180281
13605 180281 127714 -13422 46823 46924 -15860 54160 -57958 8809 2588 -54223 -43142 -91688
13593 -91688 -100786 -39755 115298 231129 269687 70277 21594 90068 90043 29205 -18730 77379
13581 77379 117029 -97872 -212512 -250021 -219031 -91529 -80774 -24366 -127371 -159643 -80462
13570 -80462 80402 165477 94404 -47420 -44332 -97352 -142131 -5990 103633 207079 217882
13559 217882 140603 -4082 -52531 -41177 70806 169689 44908 261418 327144 218311
13549 218311 130666 97774 137219 230706 234140 204613 221000 195832 30572 -297 -161082
13538 -161082 -234975 -224852 -123893 10435 118239 85540 48799 82898 94059 30806 33373
13527 33373 173082 176023 115849 64562 61539 -24356 -71986 -10964 -80624 -121624 -154940 -187583
13515 -187583 -200690 -143650 18136 98697 57916 7307 88510 152264 -28723 -111094 -86213
13504 -86213 -39719 -2981 -87146 1393 59815 -27216 -95171 -48141 -117586 -177678 -41580
13493 -41580 -56350 -186351 -167695 -56773 -23467 -99961 -80681 -41255 6758 174042 148795
13482 148795 194777 189830 98442 33760 -31678 109765 53410 97149 97798 146981 115757 89014
13470 89014 87900 145877 132936 148830 178308 240543 228997 359634 332538 182221 75057
13459 75057 60835 -29754 -67651 -65577 -168982 -191687 -165501 -59395 186883 116409 95368
13448 95368 27592 107902 279832 450292 369257 282458 267511 198102 71164 11578 83513
13437 83513 141680 161503 180130 36807 -44269 -162444 -221571 -148600 20016 5702 -49392
13426 -49392 -37885 -126133 -88377 127453 217464 14948 -54619 141989 156399 89117 -13991
13415 -13991 -7766 -27759 -42091 -109207 -173457 -147840 -98688 28314 -25927 -114571 -9716
13404 -9716 220366 170706 155322 191620 257113 266230 141905 13552 86153 197636 154149
13393 154149 101601 23107 69241 35137 -118831 -100104 78073 58236 115847 143679 63855
13382 63855 62873 123190 3663 4594 16335 3561 -107737 -93321 97870 237719 198728 221351
13370 221351 230400 115111 114154 93289 100836 141693 298917 237876 141363 52984 -71356 -54258
13358 -54258 32820 -118312 -137678 -53282 -46566 -78643 77905 147819 173064 187099 101989
13347 101989 46764 -31868 -26253 -67063 -54865 9033 84947 -42336 -86974 -129908 -71612
13336 -71612 54686 165815 230342 177289 158584 84132 137026 171062 29868 -39895 67134
13325 67134 118968 81517 123846 179804 300947 214780 71648 78064 124523 42842 5051
13314 5051 97384 185430 229146 155114 97041 119834 47577 -49324 -70977 18436 81472 5028
13302 5028 -27778 7383 105646 110043 163293 138612 128195 142361 182715 292417 270960 148588
13290 148588 109597 277075 319756 346971 310107 115305 62668 118777 223037 258125 217343
13279 217343 192324 165303 45916 37428 183528 259407 310355 247371 145777 64649 214628
13268 214628 263295 114160 -29161 -107018 -96167 -107109 -98780 -53434 58888 87644 83891
13257 83891 161692 10076 -24639 47572 84840 65780 22968 22863 -31858 6420 226623 362213
13245 362213 312187 275119 240801 213192 201819 140984 253089 251819 235572 136236 51935
13234 51935 82508 52602 -4539 -30280 73141 137204 -4389 -52626 -78431 -31593 32964
13223 32964 33977 95835 59508 5439 70622 108289 151613 110375 20525 -117244 -141303 -59454
13211 -59454 92035 126253 2912 -197395 -318690 -209546 -11527 -41766 -111731 57064
13201 57064 66667 42074 139668 147639 142616 36587 1758 25087 49829 63802 -24516 39959
13189 39959 168907 199035 219502 135824 124597 -37635 85424 191275 147225 65766 129816
13178 129816 161941 204571 245237 179325 93445 263076 393636 362992 368825 188183 68887
13167 68887 51809 -9809 26773 19751 75441 121642 99980 149835 326851 322823 259759 287138
13155 287138 211137 182868 111818 137971 181025 118528 105547 134101 168442 153063 62295
13144 62295 10866 54228 160550 209735 186500 256526 347661 236995 68537 153726 293863
13133 293863 310052 265317 338375 236668 233506 181657 145312 114531 15686 -64053 -92511
13122 -92511 -28159 30374 20509 44761 77799 41155 52142 108845 164054 123206 182154 65333
13110 65333 40343 -66389 -64478 7618 -149868 -145667 35100 95475 71843 131406 47383
13099 47383 -53597 -17565 95384 94747 -34636 -69876 -27392 -4278 -2676 -55589 -78645 63961
13087 63961 83625 56072 133009 185398 183999 93222 77781 76106 95985 132487 223947 295879
13075 295879 154422 16004 -45071 -45094 -95190 -19285 5792 55422 55580 85920 37051 -23074
13063 -23074 15181 88541 38246 21792 127574 180590 157897 105361 67338 41646 70320
13052 70320 68212 -38628 44350 108386 -9682 89655 247632 185087 88339 64799 208087
13041 208087 237568 139012 157134 144285 36913 -28444 58815 119326 220671 222766 255580
13030 255580 298455 314371 238178 164536 286690 293115 246002 193693 135888 270191 283633
13019 283633 288658 282612 265976 284951 126901 93295 104982 104177 173354 243214 382916 213934
13007 213934 9483 -25894 -6778 91888 136224 61133 86378 100649 153050 179170 202193
12996 202193 325138 319583 309623 335269 274651 171693 186149 175490 236861 383311 303137
12985 303137 193671 83216 -74844 -94008 61527 97277 177278 144980 146521 261334 327751
12974 327751 523127 493468 411897 352812 181102 260071 195693 17203 79063 104894 274742
12963 274742 322792 235685 183582 199548 194600 221956 291611 286682 290741 236022 109336 131033
12951 131033 143130 199981 118287 123601 94035 96477 155966 232748 263762 319575 361650 343028
12939 343028 247189 50632 29677 149586 299484 335126 269330 250826 218703 298954 299872
12928 299872 187134 295828 371421 231292 72485 147678 162005 269962 390346 497328
12918 497328 452998 323807 165087 152220 272269 336266 162392 256208 459436 484012
12908 484012 362215 312100 162029 93074 327826 369202 233661 222005 229966 119290 135510
12897 135510 197116 201136 293292 264682 186525 158386 258728 274366 136462 156472 266772
12886 266772 91178 13899 199439 289693 235169 113372 13768 243171 436793 353135
12876 353135 204544 70109 45262 40927 247521 285058 252544 205572 44221 121958 270956
12865 270956 250018 284358 327370 441854 451548 367783 342815 188616 295126 369913 226556
12854 226556 162314 235371 254905 287523 284200 325250 497781 625321 530764 404044 297624
12843 297624 317224 349721 321047 264523 250400 291588 221520 38747 44698 82462 174725
12832 174725 315888 368207 429466 341931 146406 112673 97334 152913 230804 298480 228646
12821 228646 280057 174966 173987 130087 111830 -16555 17098 135039 236344 285769 268307
12810 268307 219901 372911 448928 361138 369349 304430 261302 261150 180282 141773 211347 99703
12798 99703 159919 270861 306965 425671 419216 354414 406586 389960 290156 381730 430228
12787 430228 466914 395073 277819 238215 365025 394418 330462 313312 280189 272689 248581
12776 248581 210519 136096 247915 352880 459154 531871 373404 291968 365902 500382
12766 500382 568438 485855 371381 440205 410198 337942 375402 489224 546067 445645 364085
12755 364085 340001 407935 343264 417199 363750 371487 366088 418067 557959 603045 615384 501281
12743 501281 368704 355434 346644 374715 400837 225520 338332 469673 517343 413265 222733
12732 222733 399115 505550 379582 299339 353558 490124 511515 490671 562643 462261
12722 462261 324314 341596 407170 362584 474383 504045 348428 190107 146886 231538 380490
12711 380490 299128 186453 345465 232571 204152 378751 528242 463418 475959 578517
12701 578517 596189 612206 550827 448760 364519 484385 508602 482128 424005 399508 384848
12690 384848 400190 373910 329118 324937 352735 274472 270235 362312 444864 530980 555449 469698
12678 469698 362240 284517 267057 195404 260520 365950 450651 607818 677822 522713 455336
12667 455336 406074 434493 404906 445867 471181 496936 446108 491880 600639 721614 730781
12656 730781 798647 772021 536416 459311 511936 537290 379547 391254 472724 597389 503242
12645 503242 465533 467571 491431 487983 383236 230882 424174 482126 478561 570087 646470
12634 646470 597587 686051 645645 679751 688377 574973 591194 704360 761768 614102 505282
12623 505282 511579 525262 499146 441384 502324 589035 640516 397123 284138 283309 330043 407449
12611 407449 443593 455865 422357 269598 281436 205287 209322 290977 525365 649514 623449
12600 623449 581028 587216 496638 471517 535654 501914 392396 502571 670572 575078 503064
12589 503064 570255 521677 458618 678375 768078 776038 675902 493254 432079 492333 518140
12578 518140 559013 759625 733153 588222 602809 662181 633287 607910 614622 560398 501121
12567 501121 619374 649193 672533 679140 468674 498029 552250 498551 585449 762845 785086
12556 785086 714235 781880 911142 961438 928965 811258 685963 659515 750241 789219 742553
12545 742553 690241 702185 765833 705985 757368 872117 903392 833655 740713 768814 741661
12534 741661 583913 530723 511143 527298 516622 525649 564344 588372 663300 687611 693460 674567
12522 674567 717818 799580 831060 734887 619652 559585 617265 491958 418102 676608 957378
12511 957378 911156 774874 644135 648977 696073 686760 711315 629272 601315 690812 777045
12500 777045 755654 825814 916334 908343 901179 849883 756941 775535 905023 916148 872191 925351
12488 925351 862738 791230 794348 874869 834244 814300 794425 883867 958083 1031403 1061879 936471
12476 936471 838497 852593 868109 746621 743199 755221 790835 885145 987930 896672 839443
12465 839443 857191 869859 909447 829461 689080 618129 680814 763501 844804 875594 863045
12454 863045 843848 965183 986178 886131 760648 875594 965871 938061 856520 841621 803465
12443 803465 769513 713463 798702 921905 971092 1083142 1134376 1106442 1062896 950494 946799
12432 946799 966478 958689 900555 796159 913949 1138024 1316980 1314384 1145365 1076545 1052887
12421 1052887 1083160 1028068 1078905 1045758 1003376 1057906 1026023 1097649 1077491 1004284 993210
12410 993210 920963 1030349 1124366 1246609 1179986 1205564 1224399 1216854 1126471 1091818 1175775
12399 1175775 1355525 1370962 1393926 1283734 1309327 1333853 1256211 1280001 1355135 1313255 1285445
12388 1285445 1345902 1373719 1407061 1329718 1313616 1386885 1484001 1546918 1507208 1487375 1520078
12377 1520078 1654070 1740223 1849957 1882188 1860656 1956854 2022394 2126555 2452885 2738039
12367 2738039 3226684 3831186 3963318 3388589 3049909 2963361 3068281 3171090 3112720 2953694
12357 2953694 2870930 2706689 2495001 2465969 2489168 2538499 2701914 2939046 2979815 2898071
12347 2898071 2744317 2682576 2750150 2706619 2681956 2859099 3201384 3508472 3686905 3451165
12337 3451165 3022431 2848278 2929350 3182879 3408823 3610570 3914904 4085680 4212822 4392868
12327 4392868 4563357 5092712 6177543 7489446 7822426 6650736 5480172 4853173 4634493
12318 4634493 4615580 4492385 4223088 3896371 3548204 3295353 3287766 3580723 3916885 4099002
12308 4099002 4103925 3947239 3564564 3261853 3134253 3036930 3020409 2940784 2992549 3199188
12298 3199188 3397319 3446799 3333886 3112183 3016095 2798186 2878083 2975875 2992132 3227927
12288 3227927 3465853 3587572 3576188 3456422 3552462 4011289 4622328 4843604 4099959 3378358
12278 3378358 2969680 2674818 2444118 2410633 2576047 2712527 2719922 2734218 2691996 2649199
12268 2649199 2765096 2785137 2763766 2694076 2680794 2693463 2643164 2525064 2401730 2479336 2478271
12257 2478271 2483703 2513935 2657901 2747310 2775428 2740186 2714669 2701257 2772074 2678384 2590777
12246 2590777 2754395 2666855 2695416 2783109 2817064 2759465 2748753 2827881 2922827 2861174 2832433
12235 2832433 2771299 2695315 2698829 2808699 2843820 2838218 2909389 2985903 2986311 2923560 3017726 3065392
12223 3065392 3137877 3218761 3292883 3147897 3076083 3177035 3218802 3249061 3233795 3265880 3301025
12212 3301025 3239447 3289520 3295924 3315058 3295967 3259610 3176481 3307415 3309973 3167697 3200299
12201 3200299 3302815 3319385 3318815 3318317 3407971 3502569 3620818 3625477 3617251 3518057 3513360 3646424
12189 3646424 3750989 3879233 3866275 3768889 3773153 3866124 3934805 3931561 3997091 3946300 3980252
12178 3980252 4126038 4091883 4151663 4229172 4108545 4163312 4187798 4273900 4368998 4345122 4159678
12167 4159678 4223490 4384022 4417850 4517157 4579275 4583896 4472361 4497188 4599560 4767706 4852729
12156 4852729 4884009 4869881 4785765 4753331 4824175 4775951 4755202 4858512 5051479 5031270 5042186
12145 5042186 5175759 5242399 5180771 5175036 5222207 5357353 5489449 5419431 5457937 5502514 5568186
12134 5568186 5695708 5655899 5575949 5654010 5835637 5901400 5858032 5895447 5970461 5989600 5975438
12123 5975438 6042368 6063433 6172107 6286215 6319659 6288630 6364947 6340929 6307287 6449445 6533631
12112 6533631 6625684 6765812 6858675 6951749 7121856 7195448 7197941 7230856 7266116 7377754 7443960
12101 7443960 7436811 7558660 7703537 7648084 7561200 7649898 7850693 7941867 8029658 8057508 8072309
12090 8072309 8082893 8150896 8388166 8547714 8526621 8652321 8837078 8887782 9038385 9259509
12080 9259509 9367282 9195611 9168617 9325510 9509684 9736915 9951182 10011117 9979802 10034052
12070 10034052 10198082 10431096 10636156 10811725 10785377 10794182 10923242 10956961 11101403 11073419
12060 11073419 11137114 11426529 11694820 11690758 11815317 11884681 11974515 12111877 12262304 12347414
12050 12347414 12430665 12755705 12946792 13058837 13199335 13293862 13438566 13637082 13817253 13854442
12040 13854442 14005469 14122207 14130256 14303569 14677809 14891912 14951039 15064419 15339105 15483018
12030 15483018 15537734 15742154 16024328 16145711 16280241 16547146 16698559 17010031 17211767
12021 17211767 17317940 17502694 17817606 18032740 18162304 18352951 18599903 18910074 19293034
12012 19293034 19426756 19502229 19753898 20068638 20277302 20433262 20814998 21131231 21268468
12003 21268468 21413758 21594904 21916866 22179789 22495621 22763345 22921162 23220414 23326644
11994 23326644 23553548 23856417 24217729 24501619 24588563 24814420 25093297 25472829 25760170
11985 25760170 25914430 26109792 26338357 26557255 26961454 27181993 27312919 27679529 27937255
11976 27937255 28171601 28507257 28800590 29041278 29319471 29585977 29919299 30158831 30476016
11967 30476016 30812007 31113452 31211533 31277194 31573103 31849802 32075535 32381367 32634197 32854728
11957 32854728 33023710 33212235 33490184 33773023 33987667 34129086 34229240 34473531 34729507
11948 34729507 34885321 34859035 34929690 34998401 34988602 35105472 35329721 35361812 35427075 35456169 35657385
11937 35657385 35779682 35807945 35679977 35633589 35810539 35935003 35951391 35902595 35883420 35920383
11927 35920383 36010923 35959026 35877582 35845426 35684837 35583030 35639976 35661527 35628271 35536166 35299524
11916 35299524 35088809 35009882 34831687 34661555 34587808 34473720 34280890 33968553 33704170 33581892
11906 33581892 33497768 33463177 33262494 33011707 32806371 32666538 32461086 32053248 31696849 31400535
11896 31400535 31236951 30923800 30670047 30437240 30121020 29920343 29772379 29551559 29178066
11887 29178066 28936068 28741599 28491176 28135823 27858779 27636705 27431382 27192597 26955713
11878 26955713 26719197 26490221 26239426 25937437 25569597 25289870 25094770 24776677 24591998
11869 24591998 24311376 23963897 23587742 23343277 23078802 22786667 22659437 22502124 22240270
11860 22240270 21879012 21586062 21443489 21308842 21030488 20723329 20427783 20183605 20024819
11851 20024819 19968833 19841168 19613166 19144592 18875235 18690336 18670253 18400091 18106129 17878944
11841 17878944 17692584 17534102 17422179 17321773 17123523 17017942 16732123 16513461 16373900
11832 16373900 16220140 15998994 15917043 15737836 15553480 15343929 14989577 14731401 14672249 14429887
11822 14429887 14250656 14132002 14022218 13882915 13830750 13759649 13599668 13364505 13083736 12950971
11812 12950971 12832817 12696079 12651492 12546371 12514195 12427217 12227041 11960301 11837794 11779212
11802 11779212 11798981 11644542 11514603 11277205 11125006 11008341 10822931 10815056 10856784 10767249
11792 10767249 10589283 10356596 10213630 10117449 10018981 9785885 9581759 9581830 9576944 9442974 9301564
11781 9301564 9271112 9258160 9178049 8959334 8996593 9045360 8865973 8687111 8493999 8418482
11771 8418482 8418049 8453968 8364804 8223711 8143098 8078029 8151788 8161386 8036025 7953923 7839513
11760 7839513 7727044 7686759 7510975 7273767 7149797 7103608 6999936 7004198 7118996 7045995
11750 7045995 6951580 6964348 6974340 6890266 6695062 6672318 6680775 6644268 6370645 6267074 6328692
11739 6328692 6257567 6197599 6052238 6063436 5894395 5791734 5897868 5932990 5865527 5788096
11729 5788096 5770701 5720514 5716550 5737632 5599250 5526567 5462831 5354689 5408753 5340738 5308805
11718 5308805 5347485 5301635 5210393 5301225 5325743 5179184 5071486 5022381 5042585 4932351 4765472
11707 4765472 4773711 4655917 4751919 4915951 4958909 4831840 4682463 4726878 4696528 4570950
11697 4570950 4534154 4387147 4287347 4272263 4294061 4342886 4336863 4366014 4218390 4245619 4253964
11686 4253964 4420453 4375109 4195226 4125344 4130950 4016347 3864172 3792678 3717636 3781015 3829568
11675 3829568 3805928 3762102 3631386 3538165 3627350 3631630 3433547 3420805 3399343 3351044 3348835
11664 3348835 3399147 3401353 3433653 3502928 3493347 3409208 3368364 3449112 3464447 3415595 3542698
11653 3542698 3476109 3392116 3344387 3333477 3382677 3232225 3130386 3194592 3254351 3290954 3249423
11642 3249423 3248323 3115067 2980068 2972899 2976692 3057277 3068829 2919955 2846140 2878017 2773760
11631 2773760 2825769 2959625 3032196 2938607 2776975 2660539 2729295 2738839 2688154 2659720 2649227
11620 2649227 2600406 2591049 2363649 2319569 2444842 2352944 2171038 2216295 2352889 2349795 2340810
11609 2340810 2414017 2570559 2570499 2491880 2412602 2332432 2359476 2292502 2297277 2268015 2369072 2456959
11597 2456959 2512434 2552784 2418051 2226627 2168565 2264918 2307582 2236627 2255134 2194705 2202503
11586 2202503 2322886 2294613 2282527 2199734 2019910 2005373 1995673 1897866 1789183 1845018 1993623
11575 1993623 2040396 2058897 2105658 2008651 1872361 1969136 2075655 2167761 2186041 2152839 2028602
11564 2028602 1979119 2064445 2109716 2195104 2167321 2133979 2130662 2135125 2105163 1966573 1790207
11553 1790207 1810252 1867151 1796517 1852801 1841117 1877476 1919828 1879881 1884537 1868889 1791555
11542 1791555 1786167 1731966 1746919 1650227 1702956 1772702 1793917 1755349 1694678 1464761 1379147
11531 1379147 1311764 1396394 1401617 1342425 1236100 1206723 1163596 1208692 1352558 1475748 1471384
11520 1471384 1382781 1427349 1572653 1630150 1677034 1509297 1477341 1559378 1555503 1420971 1468556
11509 1468556 1546741 1457735 1335870 1225302 1269526 1377705 1346377 1373929 1461873 1354461
11499 1354461 1326329 1451704 1486754 1494234 1409771 1345141 1376426 1304404 1234771 1194729 1398037
11488 1398037 1478935 1323003 1230780 1216783 1204611 1230609 1337584 1325600 1331805 1385137 1272440
11477 1272440 1273716 1309407 1299302 1250192 1080352 980372 1132571 1258847 1263730 1236602 1148797
11466 1148797 1211330 1308924 1354290 1335648 1331125 1361858 1288539 1138313 1093566 1128242 1094384
11455 1094384 1044362 934814 986362 1064826 1191994 1076281 1052738 997159 943946 1039619 993059
11444 993059 911263 911601 1043940 1180154 1190820 1273101 1120792 1073660 1053395 1070752 1034910
11433 1034910 1071361 1195564 1159824 1084598 1083916 1100694 1165672 1125436 1166447 1186313 1162421
11422 1162421 1178225 1078424 865613 854085 809454 771580 896636 1044281 1076252 1032009 851861
11411 851861 853389 766659 761532 973217 1111219 991830 845700 843150 1064105 1138440 1010794
11400 1010794 829027 903161 934373 947068 885769 887934 878143 842355 891767 982909 916379
11389 916379 910932 922857 889691 894275 904750 926648 870643 867679 969176 905483 886757 952813
11377 952813 1005240 975961 874948 869355 795655 825478 746154 672625 596264 774473 940532
11366 940532 1028734 861174 814806 766453 693404 538169 523332 664735 793112 761244 754264
11355 754264 649349 641818 663769 644734 694286 733589 667949 542755 522365 578880 594559
11344 594559 589271 727450 793379 628721 485105 482264 531036 506637 525595 605370 610302
11333 610302 659710 721331 771534 809676 725462 605979 670244 785841 775586 592274 590797
11322 590797 550960 525049 606235 649059 679701 654655 621739 561980 430540 484387 684194
11311 684194 950343 986980 837084 738904 627805 545425 506448 549269 698199 681617 537682
11300 537682 564038 593345 570951 570200 659188 749861 748277 711366 604785 585507 411330 383129
11288 383129 507676 752307 792963 787832 747976 674349 611743 414404 413289 544022 656085
11277 656085 449559 367473 467685 465536 499042 599980 688324 570227 388331 196710
11267 196710 318168 462786 545899 628412 630037 616317 600398 562091 490900 473695 557334
11256 557334 595302 678377 604753 464603 413882 255457 242306 339083 342864 351084 422137
11245 422137 363168 294544 283083 311531 435206 536022 464173 443158 525692 524600 550209
11234 550209 574456 534071 558570 371612 255642 186183 192177 250255 204603 193786 309457
11223 309457 377283 423677 519980 586675 628430 697989 626712 600100 665490 644051 663871
11212 663871 602424 569816 440596 357388 404785 390152 386273 460984 456258 306123 446787
11201 446787 684115 709563 659495 669857 541777 551998 562068 478698 457029 562579 572109
11190 572109 483693 450389 416661 440698 427158 416262 402861 411408 469494 341532 331572 308984
11178 308984 301593 447592 414344 315295 325335 415446 343635 276407 380091 502509 499008
11167 499008 378649 371326 396238 499320 470650 371513 381866 398304 316831 298071 297916 207723
11155 207723 181835 169304 169244 265681 365127 300815 298812 364754 406771 352721 458767 485632
11143 485632 310367 349252 397978 457325 395645 303071 420980 500137 409694 354232 345673
11132 345673 279835 156895 109350 118880 185679 385518 383520 317681 146256 161836 74037
11121 74037 -149069 -95958 245601 277254 80983 75079 77223 160416 310469 245627 83451
11110 83451 139344 232484 214186 231012 314660 365125 351131 363947 392998 367262 289927 263442
11098 263442 212844 201041 339846 352243 102365 113174 272238 152285 72322 115883 99461
11087 99461 247292 353921 368030 247877 194920 237828 226286 165132 138115 67522 137407
11076 137407 376897 402592 431874 506794 497671 432977 370272 372936 368031 282919 271453 387382
11064 387382 400150 354391 201010 313178 397698 409636 398358 286204 221819 256013 178497
11053 178497 278251 284478 261620 297980 297665 248527 248277 327522 415278 483920 613193 741981
11041 741981 805973 646030 571582 499306 515737 704873 1014536 1158864 1194565 1355684
11031 1355684 1353126 1212645 1042402 980138 1006267 1016660 955187 1040946 1115401 1340809 1503970
11020 1503970 1528657 1582418 1562163 1385229 1223823 1004042 900270 965232 1016798 1124322
11010 1124322 1191061 1158110 1143017 1026126 835304 706049 683378 511331 405407 501555
11000 501555 535429 778073 916740 922463 833788 680144 601907 542936 453842 383544 310241
10989 310241 504822 342472 224738 120567 190989 201855 119962 -79735 -116544 8695
10979 8695 135177 209719 188808 205568 214830 114415 121880 194286 115168 95447 184783 381469
10967 381469 388176 305483 117154 123222 164139 99144 78476 16059 -62509 -56307 19698 76046
10955 76046 93975 55689 194786 374920 346736 107145 154707 211592 160843 203136 218031
10944 218031 356235 437178 295557 282365 242800 154722 190040 124804 143979 238362 287026
10933 287026 120198 62598 66073 11032 18371 -55001 150076 164663 192547 278488 228186
10922 228186 208981 129700 211047 233646 159058 68537 161403 284904 333015 302108 271163
10911 271163 324133 366494 326848 280700 57133 92500 183507 216214 217535 182965 127074
10900 127074 164703 155033 316 -18507 77441 156849 117262 132117 253667 306846 232976
10889 232976 73188 4805 58363 88594 121594 148315 152464 97380 -1412 123819 31244
10878 31244 -54150 -33354 19687 194196 186519 118572 150718 238031 282486 293617 277405 272361
10866 272361 371271 371938 300937 158009 179018 175748 175917 37028 59124 320311 483897 421488
10854 421488 386648 311347 182826 36474 50459 133655 221630 345715 349876 390073 315047
10843 315047 264602 406715 358818 248506 257374 126294 6709 -42537 -3367 105962 112748
10832 112748 100940 158579 149811 215056 142172 108945 137085 66293 129934 162004 91993 86627
10820 86627 207606 156887 108448 69893 31217 49455 157266 71573 1953 114403 79921
10809 79921 31300 102728 94651 43336 -82914 -76636 -106104 -83353 -81162 8012 277956 225632
10797 225632 124768 113357 100861 -43141 -213470 -249268 -159778 -130271 -121779 -171250 -85491
10786 -85491 79660 66848 21035 92572 79537 5100 89187 168563 62112 23894 84575
10775 84575 145656 169055 218827 249755 171178 4504 117586 216273 23424 -84601 -40932
10764 -40932 -97929 -97568 -92328 -272806 -239042 -82954 -185558 -301093 -245402 -112629 -29979
10753 -29979 -53506 29032 47051 67323 133236 7411 20258 135496 198362 110754 93923
10742 93923 91308 64256 -38689 -152731 -237500 -201544 -100398 -41142 -112255 -184825 -216495
10731 -216495 -184744 -98117 -94678 -99906 -80908 -169072 38718 -17688 -29982 -69949 49633
10720 49633 76148 65378 54633 -48228 -54114 -22059 -31182 63204 18491 -12165 -14240 177586
10708 177586 214628 9587 -132646 -62702 -33385 -52282 74671 35878 -35745 -127405 -88425
10697 -88425 -121300 -14922 152536 233107 52212 103193 197045 243251 317677 366798 239541
10686 239541 140021 177809 53074 -39953 -37273 -54630 -101407 -23374 218639 153335 52798
10675 52798 21429 -80921 -67186 32903 92913 221475 318593 408250 328106 138980 99935
10664 99935 150298 124548 196911 172690 186280 187156 375500 436004 440131 472572 446549 471239
10652 471239 546222 566482 479247 427151 322520 342892 596548 602739 628244 834127 954834
10641 954834 1018102 882255 808872 1016287 1268886 1665194 1782207 1915533 2280136 2743198
10631 2743198 3154388 3554593 3817136 4135237 4535400 5241592 6071769 7172407 8582584
10622 8582584 10463280 13071189 16560252 21574184 28382494 37531976 49212323 62558739
10614 62558739 74286464 80283201 79212233 73898125 68324220 65428188 66185896 71523721
10606 71523721 82207848 99194668 123241935 151253240 174352715 181286856 169863626
10599 169863626 149899529 132023852 120794140 117368599 122059275 135541004 158529751
10592 158529751 190324759 225730255 251453782 251362043 224979630 189078272 157912010
10585 157912010 136178484 123821290 119825773 124023209 135855970 153846531 173013581
10578 173013581 183803476 176672390 153203383 125112418 101507872 85057031 75106348
10571 75106348 70379876 70007152 72954982 78243230 83283587 84155088 77938106 65874889
10563 65874889 52427755 40651358 31449622 24849964 20164832 16856956 14206596 12317087
10555 12317087 10888935 9865350 8951324 8089331 7452755 6817859 6324418 5762267 5235262
10546 5235262 4921308 4616074 4292597 4162560 3942312 3679108 3557804 3337452 3236287
10537 3236287 3195116 3196997 2975346 2763512 2696080 2620356 2460078 2452511 2416883 2284733 2167150
10526 2167150 2077331 1967676 1899577 2066508 2064597 1825049 1691163 1644504 1565957 1442204
10516 1442204 1263460 1302264 1500270 1517394 1481813 1541587 1362401 1264526 1241720 1344890
10506 1344890 1394872 1388926 1501870 1393000 1154128 1184358 1231817 1219658 1277633 1246503 1181758
10495 1181758 1135894 1002487 955603 1028412 1128279 1158504 1244249 1142935 1070989 1157702 1164507
10484 1164507 1254758 1232775 1175882 1040731 968689 1041058 1053952 1113064 1094085 1067536 1117684
10473 1117684 1085311 1050708 1011850 944399 912860 1027795 1189528 1273481 1323956 1310382 1289612
10462 1289612 1216354 1109782 1180168 1240905 1049650 804351 803356 924854 1061485 1093541 1120930
10451 1120930 1054234 1027227 962481 1022437 1048922 1058231 932571 847085 916705 903710 818731
10440 818731 880112 940368 884719 855720 823834 598194 540640 586496 593451 671848 656456
10429 656456 667401 698214 761764 691537 437537 328201 254527 424176 552377 574945 573389
10418 573389 573214 452834 383991 358375 252049 248679 397349 523102 558217 423712 429994
10407 429994 354037 297650 359873 363418 484730 494647 460405 430907 414449 378751 335811 376738
10395 376738 357722 362926 386650 358235 292456 275173 276625 260463 230395 148990 49823 158455
10383 158455 239124 230674 238467 211988 168471 72675 75456 172973 137024 181100 313982 389784
10371 389784 365616 472503 602835 617373 570099 472464 431826 377885 362506 412509 416695
10360 416695 390302 351103 329127 168926 269698 301943 257784 214594 40625 26588 198638
10349 198638 172681 42795 -33516 -20967 177751 229296 242725 285853 287339 238655 233540
10338 233540 242093 230771 354213 245657 100259 186209 201276 281827 277573 285676 350219
10327 350219 313042 305963 298100 294764 221637 261795 393295 507824 495886 286727 202801
10316 202801 323968 423844 373267 307058 183565 84909 57642 124913 266019 372715 338416
10305 338416 239035 282609 327744 305901 282876 212925 126952 199078 341769 367389 356445
10294 356445 275517 294502 335085 314861 344118 225763 197859 356581 254375 310769 362079
10283 362079 383287 370004 271137 127572 149173 407085 485235 341131 299640 428934 393673
10272 393673 386756 423751 381388 265866 206736 252097 383522 395337 370680 390695 310290
10261 310290 299716 251737 226637 264196 282375 155150 -9269 36441 86120 107016 149915
10250 149915 117124 -21182 74748 329894 320662 304449 256493 216918 381560 349662 359395
10239 359395 298511 208355 241085 150694 71924 118694 304819 304933 273116 308098 251328 203399
10227 203399 138861 89315 141582 131867 136473 63884 240534 206116 172920 177109 318246 247583
10215 247583 123374 103067 135549 38008 1643 13640 169729 129891 65561 101819 144983
10204 144983 146863 84005 51273 22936 -12592 70078 72054 126972 141937 207464 214716 -8438
10192 -8438 -139257 -41492 97931 153792 114942 154649 279612 305025 316191 239269 204489
10181 204489 243446 194141 171450 294142 505991 589639 557584 490460 340644 302525 272309
10170 272309 408807 584784 728784 813819 934683 1103840 1107176 1036855 911354 849329
10160 849329 759464 749032 839927 1010975 1210109 1296807 1367542 1432943 1497548 1343889 1058050
10149 1058050 910303 936498 877064 817108 820050 820546 1067105 1343899 1420556 1283415 999564
10138 999564 831157 759573 719106 539683 460596 539362 607816 623908 602386 534241 516633
10127 516633 460942 507340 458807 449477 196835 104407 101170 175972 142435 190685 327067
10116 327067 269886 210848 108288 155041 133880 85832 215983 437864 452861 433917 373823
10105 373823 305346 342181 359250 289183 305501 177812 63493 110852 118450 48475 58775
10094 58775 202439 142638 40186 147861 121497 19882 4827 115943 239464 348698
10084 348698 286306 179886 159777 269820 321187 294496 242650 302887 435085 397887 257845
10073 257845 225906 332780 298555 165284 95934 144446 101235 143061 323411 277649 266373
10062 266373 216682 227891 240280 229602 190674 152159 157782 211650 129981 223017 213021 188987
10050 188987 117972 51924 1393 43287 50249 -20145 30528 174797 109476 127038 337107
10039 337107 419074 326841 68601 9069 71693 145486 177306 253854 318638 374227 327894
10028 327894 319331 377907 251346 49245 -102846 -82512 -113654 -203715 -266101 -36818 169022
10017 169022 176766 192631 133963 -9250 36676 160495 202796 189597 67790 44618 -4997
10006 -4997 -17924 8121 25325 -84136 -88107 55943 234513 264427 271385 258156 284150 206933
9994 206933 91086 208515 233569 182163 120853 65548 73513 216524 251446 79907 4905
9983 4905 60241 63644 123034 170053 136621 104050 52669 34869 103589 184729 18254 -29339
9971 -29339 -9125 34452 -57330 -21724 154340 130419 246950 249639 137236 226827 290596
9960 290596 339111 313703 307100 193047 246108 115531 24544 71325 101725 246056 135185
9949 135185 -38443 -93205 18243 98340 30305 37335 -51696 -63616 37920 106965 24005
9938 24005 34417 99462 18694 -124117 -131534 -26469 12489 -13840 -9261 -67724 -26495 58134
9926 58134 79068 70466 58019 63046 97340 86553 156287 241431 230410 100586 15261 -55901
9914 -55901 -28204 82230 83787 25692 -183656 -163468 13071 48985 106137 81087 -29457
9903 -29457 16146 52254 107819 173148 122254 16706 89421 46676 35149 59248 178945
9892 178945 202431 202985 132969 -85809 -144653 11740 55482 106903 182251 154532 126113 54570
9880 54570 186152 198424 12273 -105464 -29075 -101397 -106620 -41935 25892 75515 129682
9869 129682 144790 50511 73097 144810 74375 94843 146712 146609 91679 -40042 43786 245065
9857 245065 202399 132617 96536 53599 122803 95928 146922 196499 198298 235902 329904 142043
9845 142043 115819 33873 -32466 -117015 -106838 3179 146367 171781 21812 -4782 -34510
9834 -34510 158229 190708 -21151 -61966 -29263 36314 62784 34064 11656 11368 -50246 82403
9822 82403 88686 -50129 36988 118370 5115 -33416 32525 118119 164956 157140 144771 63464
9810 63464 51734 217596 207726 112597 -8432 -50097 14693 203925 275091 222729 146531
9799 146531 113003 62267 99370 194548 133258 17432 -113211 -233194 -306898 -333211 -324000
9788 -324000 1313 250816 160451 199592 137309 12539 44238 165927 91445 4361 -8437
9777 -8437 -51041 97321 130679 151161 118891 110346 101389 104171 137689 165648 391709 301251
9765 301251 248053 270729 304335 299833 212214 39552 70771 66468 -7624 15367 -31724 12097
9753 12097 141506 8028 34266 132191 63157 86106 212849 273025 240417 111952 11902
9742 11902 -101123 -270626 -246251 -73822 121981 162271 55618 -107267 -152337 -120439 -78474
9731 -78474 -85682 8081 50681 -51737 -97803 -105970 -21766 142848 64126 946 -30951 50445
9719 50445 -54686 -205366 -174232 -130188 -76965 -57498 -52797 -154476 -160623 -17519 -204
9708 -204 71119 64825 93852 64412 78111 17760 -51847 -35943 111619 111745 92560 32932 -11416
$$ [...]
##END NTUPLES=NMR SPECTRUM
##END=
